##TITLE=Analysis number 323011
Compound Code cc 50904
Book Reference 486/62
Project Code adrs
Chemist Name simons
##JCAMPDX= 6.0         $$ Bruker NMR JCAMP-DX V2.0
##DATA TYPE= NMR SPECTRUM
##DATA CLASS= NTUPLES
##ORIGIN= Bruker BioSpin GmbH
##OWNER= nmr
$$ XWIN-NMR		Version 3.5
$$ Mon Oct 16 20:30:35 2006 GMT Daylight Time (UT+1h)  MAYBRIDGE\nmr@NMR_250MHZ
##.OBSERVE FREQUENCY= 250.131544655141
##.OBSERVE NUCLEUS= ^1H
##.ACQUISITION MODE= SIMULTANEOUS (DQD)
##.ACQUISITION SCHEME= undefined
##.AVERAGES= 16
##.DIGITISER RES= 18
##SPECTROMETER/DATA SYSTEM= dpx250
##.PULSE SEQUENCE= zg30
##.SOLVENT NAME= CDCl3
##.SHIFT REFERENCE= (INTERNAL, CDCl3, 0, 16.4533)
##AUDIT TRAIL= $$ (NUMBER, WHEN, WHO, WHERE, WHAT)
$$ ##TITLE= Audit trail, XWIN-NMR		Version 3.5
$$ ##JCAMPDX= 5.01
$$ ##ORIGIN= Bruker BioSpin GmbH
$$ ##OWNER= nmr
$$ C:\u/data/dgb/nmr/ADRS/640/pdata/1/auditp.txt
$$ ##AUDIT TRAIL=  $$ (NUMBER, WHEN, WHO, WHERE, WHAT)
(   1,<2006-10-16 20:30:12.71 +100>,<MAYBRIDGE\nmr>,<NMR_250MHZ>,
      <created by zg, POWCHK disabled, PULCHK disabled
       configuration hash MD5:
       49 4B E0 1D 92 C2 6B 37 9F E6 65 BC 52 41 86 1D
       data hash MD5: 64K
       D1 F8 81 96 6A DC C5 33 E4 7E BB 88 29 F3 E6 39>)
(   2,<2006-10-16 20:30:25.99 +100>,<MAYBRIDGE\nmr>,<NMR_250MHZ>,
      <Start of raw data processing
       ef LB = 0.3 FT_mod = 6 PKNL = 1 SI = 32K 
       data hash MD5: 32K
       B9 35 D7 36 DA EF C9 D4 24 0E 49 15 C3 B3 6E B1>)
(   3,<2006-10-16 20:30:27.74 +100>,<MAYBRIDGE\nmr>,<NMR_250MHZ>,
      <apk 
       data hash MD5: 32K
       00 92 FF EF 06 43 8E 8F B8 92 62 BD 0A CA B5 AD>)
(   4,<2006-10-16 20:30:28.50 +100>,<MAYBRIDGE\nmr>,<NMR_250MHZ>,
      <abs ABSG = 5 
       data hash MD5: 32K
       3C 51 B7 6C 94 1A 0A 2E A5 1E 4A F4 22 C8 68 C3>)
$$ ##END=
$$ 
$$ hash MD5
$$ 9C 3F A7 21 AC 0C AF EE 19 31 33 DF 35 1D 49 8E
##$RELAX= 
##$RELAX= 
##$RELAX= 
##$RELAX= 
##$RELAX= 
##$RELAX= 
##$RELAX= 
$$ Bruker specific parameters
$$ --------------------------
##$DU= <C:\u>
##$EXPNO= 640
##$NAME= <ADRS>
##$PROCNO= 1
##$TYPE= <nmr>
##$USER= <dgb>
##$AMP= (0..31)
100 100 100 100 100 100 100 100 100 100 100 100 100 100 100 100 100 100 
100 100 100 100 100 100 100 100 100 100 100 100 100 100 
##$AQSEQ= 0
##$AQ_mod= 3
##$AUNM= <au_zg>
##$AUTOPOS= <48 >
##$BF1= 250.13
##$BF2= 250.13
##$BF3= 250.13
##$BF4= 250.13
##$BF5= 500.13
##$BF6= 500.13
##$BF7= 500.13
##$BF8= 500.13
##$BYTORDA= 1
##$CFDGTYP= 0
##$CFRGTYP= 5
##$CHEMSTR= <none>
##$CNST= (0..31)
1 1 145 1 1 1 1 1 1 1 1 1 1 1 1 1 1 1 1 1 1 1 1 1 1 1 1 1 1 1 1 1 
##$CPDPRG= <>
##$CPDPRG1= <>
##$CPDPRG2= <>
##$CPDPRG3= <>
##$CPDPRG4= <mlev>
##$CPDPRG5= <mlev>
##$CPDPRG6= <mlev>
##$CPDPRG7= <mlev>
##$CPDPRG8= <mlev>
##$CPDPRGB= <>
##$CPDPRGT= <>
##$D= (0..31)
0 1 0 0 0 0 0 0 0 0.06 0 0 0 0 0 0 0.0002 0 0 0 0 0 0 0 0 0 0 0 0 0 0 
0 
##$DATE= 1161027011
##$DBL= (0..7)
120 120 120 120 120 120 120 120 
##$DBP= (0..7)
150 150 150 150 150 150 150 150 
##$DBP07= 0
##$DBPNAM0= <>
##$DBPNAM1= <>
$$ [...]
##$SUBNAM7= <"">
##$SUBNAM8= <"">
##$SUBNAM9= <"">
##$SW= 20.6930455092707
##$SWIBOX= (0..15)
0 0 3 0 0 0 0 0 0 0 0 0 0 0 0 0 
##$SW_h= 5175.983436853
##$TD= 65536
##$TD0= 1
##$TE= 683.16
##$TE2= 300
##$TE3= 300
##$TEG= 300
##$TL= (0..7)
0 120 120 120 120 120 120 120 
##$TP= (0..7)
150 150 150 150 150 150 150 150 
##$TP07= 0
##$TPNAME0= <>
##$TPNAME1= <>
##$TPNAME2= <>
##$TPNAME3= <>
##$TPNAME4= <>
##$TPNAME5= <>
##$TPNAME6= <>
##$TPNAME7= <>
##$TPOAL= (0..7)
0.5 0.5 0.5 0.5 0.5 0.5 0.5 0.5 
##$TPOFFS= (0..7)
0 0 0 0 0 0 0 0 
##$TUNHIN= 0
##$TUNHOUT= 0
##$TUNXOUT= 0
##$USERA1= <user>
##$USERA2= <user>
##$USERA3= <user>
##$USERA4= <user>
##$USERA5= <user>
##$V9= 5
##$VALIST= <valist>
##$VCLIST= <CCCCCCCCCCCCCCC>
##$VD= 0
##$VDLIST= <DDDDDDDDDDDDDDD>
##$VPLIST= <PPPPPPPPPPPPPPP>
##$VTLIST= <TTTTTTTTTTTTTTT>
##$WBST= 1024
##$WBSW= 4
##$XGAIN= (0..3)
0 0 0 0 
##$XL= 0
##$YL= 0
##$YMAX_a= 449418
##$YMIN_a= -356495
##$ZGOPTNS= <>
##$ZL1= 120
##$ZL2= 120
##$ZL3= 120
##$ZL4= 120
##$ABSF1= 16.45331
##$ABSF2= -4.239862
##$ABSG= 5
##$ABSL= 3
##$ALPHA= 0
##$AQORDER= 0
##$ASSFAC= 0
##$ASSFACI= 0
##$ASSFACX= 0
##$ASSWID= 0
##$AUNMP= <proc_1d>
##$AZFE= 0.1
##$AZFW= 0.1
##$BCFW= 0
##$BC_mod= 0
##$BYTORDP= 0
##$COROFFS= 0
##$CY= 12.5
##$DATMOD= 1
##$DC= 0
##$DFILT= <>
##$DTYPP= 0
##$F1P= 14.0000005364418
##$F2P= -0.99999901652339
##$FCOR= 0.5
##$FTSIZE= 32768
##$FT_mod= 6
##$GAMMA= 0
##$GB= 0
##$INTBC= 1
##$INTSCL= 1
##$ISEN= 128
##$LB= 0.3
##$LEV0= 0
##$LPBIN= 0
##$MAXI= 10000
##$MC2= 0
##$MEAN= 0
##$ME_mod= 0
##$MI= 0
##$NCOEF= 0
##$NC_proc= -3
##$NLEV= 6
##$NOISF1= 0
##$NOISF2= 0
##$NSP= 0
##$NTH_PI= 0
##$NZP= 0
##$OFFSET= 16.45331
##$PC= 1
##$PHC0= -43.44058
##$PHC1= 1.999259
##$PH_mod= 1
##$PKNL= yes
##$PPARMOD= 0
##$PSCAL= 4
##$PSIGN= 0
##$REVERSE= no
##$SF= 250.130017180802
##$SI= 32768
##$SIGF1= 0
##$SIGF2= 0
##$SINO= 400
##$SIOLD= 32768
##$SREGLST= <1H.CDCl3>
##$SSB= 0
##$STSI= 32768
##$STSR= 0
##$SW_p= 5175.98343685301
##$SYMM= 0
##$S_DEV= 0
##$TDeff= 65536
##$TDoff= 0
##$TI= <Analysis number 999999
Compound Code 99
Book Reference 9
Project Code 9>
##$TILT= no
##$TM1= 0
##$TM2= 0
##$TOPLEV= 0
##$USERP1= <user>
##$USERP2= <user>
##$USERP3= <user>
##$USERP4= <user>
##$USERP5= <user>
##$WDW= 1
##$XDIM= 32768
##$YMAX_p= 582319165
##$YMIN_p= -237404
$$ End of Bruker specific parameters
$$ ---------------------------------
##NTUPLES= NMR SPECTRUM
##VAR_NAME=  FREQUENCY,     SPECTRUM/REAL,   SPECTRUM/IMAG
##SYMBOL=    X,             R,               I
##VAR_TYPE=  INDEPENDENT,   DEPENDENT,       DEPENDENT
##VAR_FORM=  AFFN,          ASDF,            ASDF
##VAR_DIM=   32768,         32768,           32768
##UNITS=     HZ,            ARBITRARY UNITS, ARBITRARY UNITS
##FACTOR=    0.157963299565203, 1,           1
##FIRST=     4115.46671618707, 0,            0
##LAST=      -1060.51672066594, 0,           0
##MIN=       -1060.51672066594, -237404,     0
##MAX=       4115.46671618707, 582319165,    0
$$ Real data points
##PAGE= N=1
##DATA TABLE= (X++(R..R)), XYDATA
$$ [...]
$$ plain form
16320 138273 123012 92165 93512 33769 18876 13853 -72451 -55851 11289 7513 -8596 -21230
16308 -21230 -15651 3015 30515 28567 12707 8098 33282 -38923 -83119 -65054 -27636 -22425
16296 -22425 24178 10586 49684 17471 13085 -57199 -71870 -64259 -69224 -63193 -35154 -24202
16284 -24202 11834 57371 20396 -35957 -57901 3398 49754 70870 31198 -16606 -17238 -12441
16272 -12441 -16704 -55272 -53620 -46532 -29661 -35741 14754 65736 23300 -55918 -70861 -33422
16260 -33422 41946 13315 -45496 -39721 -2631 7427 -12203 -80576 -87654 -39238 -66498 -102844
16248 -102844 -57613 -23484 -38038 -97969 -98370 -29269 -13179 -19147 -63414 -99127 -102864 -93320
16236 -93320 -122582 -82071 -93646 -72839 -45634 -73249 -50628 -33550 -20282 -23429 -46949 -20142
$$ packed form
16320A38273j5261l0847J347n9743j4893n023q6304J6600O7140l776j6109j2634
16308b1230N579J8666K7500j948j5860m609K5184p2205m4196J8065L7418N211
16296b2425M6603j3592L9098l2213m386p0284j4671P611m965O031K8039J0952
16284b4202L6036M5537l6975n6353k1944O1299M6356K1116l9672m7804o32M797
16272a2441m263l8568J652P088J6871o080N0495N0982m2436p9218j4943L7439
16260c3422P5368k8631n8811N775L7090J0058j9630o8373p078M8416k7260l6346
16248a02844M5231L4129j4554n9931m01O9101J6090n968m4267l5713l737R544
16236i3320k9262M0511j1575K0807K7205k7615K2621J7078J3268l147k3520K6807
$$ plain form
16224 -20142 -27415 -67024 -21192 23604 -61146 -60780 16374 -3295 -15230 -29344 15960 20627
16212 20627 -5820 -3203 -26519 -68964 -72259 -58642 -16654 23852 10987 43594 30861 58039
16200 58039 76886 30457 -5208 34730 44359 76977 23618 24673 14582 -5455 24560 68982
16188 68982 40552 -50932 -97738 -33075 46095 36496 30781 -6858 14871 41092 33005 105521
16176 105521 102408 116110 116035 81565 17992 24586 77723 100604 62674 21660 -12424 -21426 -12312
16163 -12312 -29210 1751 -5490 -9151 14043 32707 55788 55002 60454 -5535 -42802 -55575 -114064
16150 -114064 -63798 -45182 -44149 1543 14123 -1691 -44747 -72900 -72127 -59723 -47963 -52363
16138 -52363 -72183 -48778 44965 31492 30955 22208 49348 84906 67524 103509 82454 -5303
$$ packed form
16224b0142p273l9609M5832M4796q4750L66P7154j9669j1935j4114M5304M667
16212B0627k6447K617k3316m2445l295J3617M1988M0506j2865L2607j2733K7178
16200E8039J8847m6429l5665L9938R629L2618n3359J055j0091k0037L0015M4422
16188F8982k8430r1484m6806O4663P9170r599n715l7639K1729K6221q087P2516
16176A05521l113J3702p5l4470o3573O594N3137K2881l7930m1014l4084r002R114
16163a2312j6898L0961p241l661K3194J8664K3081p86N452o5989l7267j2773n8489
16150a14064N0266J8616J033M5692J2580j5814m3056k8153P73J2404J1760m400
16138e2363j9820K3405R3743j3473n37q747K7140L5558j7382L5985k1055q7757
$$ plain form
16126 -5303 -84324 -120270 -85215 17882 -47 16010 16211 32090 -31701 -92114 -124919 -94843
16114 -94843 -75200 5294 54019 59532 16308 -31549 -22954 -2072 32386 67910 71641 75813
16102 75813 47886 50995 59747 -11593 -55878 -71853 -46370 -40511 -14973 26960 14856 -22558
16090 -22558 -16526 -35032 -74949 -62220 15115 -11914 -114987 -142475 -67111 1974 -17527 -36616
16078 -36616 -83904 -67942 -70771 -13899 30165 10804 27027 53128 38958 24038 52366 -17608
16066 -17608 -54050 -30284 -4379 11371 22636 -2662 -33556 -31160 -6951 -70414 -80039 20212
16054 20212 17238 -12089 -86035 -102533 -34573 24599 58314 57501 54620 63533 50182 20556 11924
16041 11924 31308 37025 96317 98865 18478 -25291 -39006 -26025 -41732 -8775 26556 12865
$$ packed form
16126e303p9021l5946L5055J03097j7929J6057K01J5879o3791o0413l2805L0076
16114i4843J9643Q0494M8725N513m3224m7857Q595K0882L4458L5524L731M172
16102G5813k7927L109Q752p1340m4285j5975K5483N859K5538M1933j2104l7414
16090b2558O032j8506l9917J2729P7335k7029j03073k7488P5364O9085j9501j9089
16078c6616m7288J5962k829N6872M4064j9361J6223K6101j4170j4920K8328o9974
16066a7608l6442K3766K5905J5750J1265k5298l0894K396K4209o3463r625J00251
16054B0212k974k9327p3946j6498O7960N9172L3715q13k881Q913j3351k9626q632
16041A1924J9384N717N9292K548q0387m3769j3715J2981j5707L2957L5331j3691
$$ plain form
16029 12865 -43485 -101930 -67017 -20899 -33315 -41002 -24543 -32523 -48705 -34601 -42520 -44064
16017 -44064 -13398 -41694 -62025 -57894 -116563 -106013 -94471 -140282 -110498 -51289 -3068 -10271
16005 -10271 -5792 -51081 -89546 -65173 -40835 20146 28950 37489 -42262 5038 15740 18989
15993 18989 30460 7596 -16100 -42876 -74561 -45319 -42785 -79156 -104080 -73313 -3373 -18643
15981 -18643 -20578 -36946 -55053 -63363 -87058 -34639 6160 41759 -6417 -8276 4091 -29806
15969 -29806 -26535 -74970 -109312 -128380 -73957 -36209 -16483 -37244 -31462 -16835 26288 25083
15957 25083 9086 3649 -38065 -43664 -40639 -52246 -18360 -32722 -72503 -100286 -83970 -62669
15945 -62669 -89070 -84133 -64405 -58932 -74579 -40249 -19677 19595 11576 31485 -5854 11610
$$ packed form
16029A2865n6350n8445L4913M6118j2416p687J6459p980j6182J4104p919j544
16017d4064L0666k8296k0331M131n8669J0550J1542m5811K9784N9209M8221p203
16005a0271M479m5289l8465K4373K4338O0981Q804Q539p9751M7300J0702L249
15993A8989J1471k2864k3696k6776l1685K9242K534l6371k4924L0767O9940j5270
15981a8643j935j6368j8107q310k3695N2419M0799L5599m8176j859J2367l3897
15969b9806L271m8435l4342j9068N4423L7748J9726k0761N782J4627M3123j205
15957B5083j5997n437m1714n599L025j1607L3886j4362l9781k7783J6316K1301
15945f2669k6401M937J9728N473j5647L4330K0572L9272q019J9909l7339J7464
$$ plain form
15933 11610 54766 33134 -2664 3909 13538 37384 74440 79014 30705 -45785 -70505 -99086
15921 -99086 -87961 -42076 -22471 -46322 -15542 30947 57674 20018 -11167 -64126 -118668 -59674
15909 -59674 2839 68234 75706 84047 75837 22895 27078 -10675 -56738 -31171 92 13736
15897 13736 -34123 -19708 -8884 -58336 -116551 -93145 -29199 -16467 -38628 -21722 -29679 -55698
15885 -55698 -4987 832 -7066 -7420 13138 29078 7233 -21873 -28591 11969 84033 79175 92130
15872 92130 49450 17781 20021 4087 -13086 12715 63114 57358 -4614 -56407 -87604 -76376
15860 -76376 -72951 -101704 -65865 -27359 -54358 -56899 -87167 -55192 1884 8082 12435 29218
15848 29218 21210 29052 31510 -6716 -20049 -6211 28957 68147 43828 19455 17614 32512
$$ packed form
15933A1610M3156k1632l5798O573R629K3846L7056M574m8309p6490k4720k8581
15921i9086J1125M5885J9605k3851L0780M6489K6727l7656l1185n2959n4542N8994
15909e9674O2513O5395P472Q341q210n2942M183l7753m6063K5567L1263J3644
15897A3736m7859J4415J0824m9452n8215K3406O3946J2732k2161J6906p957k6019
15885e5698N0711N819p898l54K0558J5940k1845k9106o718M0560P2064m858J2955
15872I2130m2680l1669K240j5934j7173K5801N0399n756o1972n1793l1197J1228
15860g6376L425k8753L5839L8506k6999k541l0268L1975N7076O198M353J6783
15848B9218q008P842K458l8226j3333J3838L5168L9190k4319k4373j841J4898
$$ plain form
15836 32512 44418 82649 39991 -2220 12093 -49935 -82960 -92498 -93133 -17125 19629 58319
15824 58319 58598 64303 74743 90650 66257 33875 66909 34734 -56258 -90285 -42750 -64232
15812 -64232 -52787 -77763 -122801 -79293 -19735 -58360 -51666 9653 22389 11597 9496 -55785
15800 -55785 -99473 -126480 -118400 -88690 -76784 -28759 -40409 -32652 -23012 7473 -21301 -67151
15788 -67151 -44572 613 29406 51801 33655 -14539 -41971 -77085 -113147 -111758 -61177 -37734
15776 -37734 -13659 20251 57120 65179 63240 66327 67140 98975 111144 26240 -2563 22569 26073
15763 26073 -19331 -17507 -43480 -74902 -96797 -159272 -126287 -33848 -12966 -45320 33043 93096
15751 93096 110502 119895 93359 47967 33577 89833 130914 123442 102667 137379 124284 21447
$$ packed form
15836C2512J1906L8231m2658m2211J4313o2028l3025r538o35P6008L6754L8690
15824E8319K79N705J0440J5907k4393l2382L3034l2175r0992l4027M7535k1482
15812f4232J1445k4976m5038M3508N9558l8625O694O1319J2736j0792k101o5281
15800e5785m3688k7007Q080K9710J1906M8025j1650P757R640L0485k8774m5850
15788f7151K2579M5185K8793K2395j8146m8194k7432l5114l6062J389N0581K3443
15776c7734K4075L3910L6869Q059j939L087Q13L1835J2169q4904k8803K5132L504
15763B6073m5404J824k5973l1422k1895o2475L2985R2439K0882l2354P8363O0053
15751I3096J7406R393k6536m5392j4390N6256M1081p472k0775L4712j3095j02837
$$ plain form
15739 21447 -31159 -5642 -671 -45799 -71653 -45011 -8229 -30929 -61091 -11129 -19247 45607
15727 45607 157820 198791 124607 80733 34892 29578 96497 85510 35396 65714 118508 84716
15715 84716 127135 115232 65554 -2257 -36725 -28737 5293 22061 2228 4138 9228 -47074
15703 -47074 -38278 -3313 -48879 -34690 -24429 -31123 -28077 22780 37802 53248 24540 -12852
15691 -12852 -28319 -59507 -28744 19523 45217 12871 -24122 -18058 11321 38097 -15310 -40520
15679 -40520 -62568 -108513 -45442 60296 89724 26994 15873 52679 43792 -67504 -114909
15668 -114909 -64188 -36453 -2964 -5196 -35604 -42592 -60767 -5240 51033 28063 -24505 -11208
15656 -11208 64057 50352 3446 -38025 -45982 -44794 -1859 77431 112104 55837 -5482 -43783
$$ packed form
15739B1447n2606K5517M971m5128k5854K6642L6782k2700l0162M9962q118O4854
15727D5607J12213M0971p4184m3874m5841n314O6919j0987n0114L0318N2794l3792
15715H4716M2419j1903m9678o7811l4468P988L4030J6768j9833J910N090n6302
15703d7074Q796L4965m5566J4189J0261o694L046N0857J5022J5446k8708l7392
15691a2852j5467l1188L0763M8267K5694l2346l6993O064K9379K6776n3407k5210
15679d0520k2048m5945O3071J05738K9428o2730j1121L6806q887j11296m7405
15668a14909N0721K7735L3489k232l0408o988j8175N5527N6273k2970n2568J3297
15656a1208P5265j3705m6906m1471p957J188M2935P9290L4673n6267o1319l8301
$$ plain form
15644 -43783 -52664 48469 54810 51045 121911 105252 53959 25336 41943 -26709 -100165 -77202
15632 -77202 -28160 -72855 -16155 -9501 -45204 -80158 -83922 -21792 -26178 -47967 -60232 -28046
15620 -28046 10516 -22538 -53377 -59717 -59422 -59478 -61010 -94609 -89918 -43044 -9581 -13914 -81330
15607 -81330 -128490 -128254 -94080 -63165 -18103 -20138 7282 -74 -28598 -85913 -109434 -56473
15595 -56473 -62411 -27776 -46619 -92966 -93163 -47379 -101385 -114495 -37078 -22821 -80098 -67552
15583 -67552 -22602 -9416 -10169 -38929 -13971 -31506 -51510 -83122 -132671 -79386 -10925 74227
15571 74227 59412 -16494 -88341 -114081 -112355 -49336 -73834 -95176 -137104 -93465 -27284 -30123
15559 -30123 -115549 -127060 -91921 -50659 -34317 -29180 17034 1555 8469 4046 -1240 -9110 -55181
$$ packed form
15644d3783q881J01133O341l765P0866j6659n1293k8623J6607o8652p3456K2963
15632g7202M9042m4695N6700O654l5703l4954l764O2130m386k1789j2265L2186
15620b8046L8562l3054l0839o340K95n6j532l3599M691M6874L3463m333o7416
15607h1330m7160K36L4174L0915M5062k035K7420p356k8524n7315k3521N2961
15595e6473n938L4635j8843m6347j97M5784n4006j3110P7417J4257n7277J2546
15583f7552M4950J3186p53k8760K4958j7535k0004l1612m9549N3285O8461Q5152
15571G4227j4815p5906p1847k5740J726O3019k4498k1342m1928M3639O6181k839
15559c0123q5426j1511L5139M1262J6342N137M6214j5479O914m423n286p870m6071
$$ plain form
15546 -55181 -73233 -25483 18638 -4953 -49307 12412 42829 50828 19213 76752 84555 29070
15534 29070 -70130 -115717 -56815 -34245 -46914 -48711 -33616 -41623 -38071 -93164 -73528 -35629
15522 -35629 470 10904 -7199 -20528 -37028 -55824 -16012 13235 42695 44051 4316 -58976
15510 -58976 -90081 -59732 -49058 -10392 -2968 80503 98841 24389 4522 -13476 -16975 -6303
15498 -6303 12100 7047 -12378 12380 69288 64274 40239 -17732 -63929 -82278 -54446 15616
15486 15616 52953 34085 -431 -34463 -87927 -81829 -20621 -13164 -73604 -92489 -81008 -90085
15474 -90085 -82494 -116474 -114125 -86130 -71819 -86386 -79806 -77826 -62260 -67060 -74118 -55626 -4696
15461 -4696 -7077 -17227 -22529 -21689 -16341 47148 106201 90300 36555 -2125 -65816 -66328 -61804
$$ packed form
15546e5181j8052M7750M4121k3591m4354O1719L0417P999l1615N7539P803n5485
15534B9070r9200m5587N8902K2570j2669j797J5095q007L552n5093J9636L7899
15522c5629L6099J0434j8103j3329j6500j8796L9812K9247K9460J356l9735o3292
15510e8976l1105L0349J0674L8666P424Q3471J8338p4452j9867j7998l499J0672
15498f303J8403n053j9425K4758N6908n014k4035n7971m6197j8349K7832P0062
15486A5616L7337j8868l4516l4032n3464O098O1208P457o0440j8885J1481r077
15474i0085P591l3980K349K7995J4311j4567O580J980J5566m800p058J8492N0930
15461d696k381j0150n302Q40N348O3489N9053j5901n3745l8680o3691n12M524
$$ plain form
15448 -61804 -97075 -124422 -133555 -96851 -109054 -69053 826 45277 -2229 -47032 -86545 -123351
15436 -123351 -133529 -99812 -80616 -47826 -50450 -52969 -19241 -51946 -68710 -39891 -54438 -57769
15424 -57769 -69612 -56319 -62386 -15072 26255 28400 9539 -4791 -33806 -20428 -20882 -101442
15412 -101442 -89397 -49485 12959 42448 50291 43870 -12910 -35070 -44211 -61617 -114060 -57312
15400 -57312 34852 58060 -48868 -149352 -145728 -55230 -9138 -76408 -94442 -79626 -84832 -46828
15388 -46828 35193 -2115 -96740 -135885 -154241 -42919 24768 -3209 -28614 -14112 -12988 -60297
15376 -60297 -116706 -145696 -132236 -77576 -75100 -96082 -119390 -66996 -56737 -13677 54662 1841
15364 1841 -15281 29015 43669 -9756 33494 50812 57901 33348 53249 41847 -44990 -55064
$$ packed form
15448f1804l5271k7347r133L6704j2203M0001O9879M4451m7506m4803l9513l6806
15436a23351j0178L3717J9196L2790k624k519L3728l2705j6764K8819j4547l331
15424e7769j1843J3293o067M7314M1327K145j8861j4330k9015J3378m54q0560
15412a01442J2045L9912O2444K9489P843o421n6780k2160r141j7406n2443N6748
15400e7312R2164K3208j06928j00484L624R0498M6092o7270j8034J4816n206L8004
15388d6828Q2021l7308r4625l9145j8356J11322O7687k7977k5405J4502J124m7309
15376f0297n6409k8990J3460N4660K476k0982k3308N2394J0259M3060O8339n2821
15364A841j7122M4296J4654n3425M3250J7318P089k4553J9901j1402q6837j0074
$$ plain form
15352 -55064 -102009 -166488 -148551 -91829 -65487 21801 49852 2129 -63822 -69106 -7766 -28200
15340 -28200 -32188 -54546 -7143 -14531 -34462 -21265 -30566 1872 17246 14490 -32767 -43757
15328 -43757 -24215 -1237 27098 39915 -13723 -3791 29652 -7371 4056 19865 38208 45158
15316 45158 30121 11471 54124 36534 364 -49474 12107 75840 -1500 -117689 -63188
15305 -63188 2911 -44630 -24592 37318 63175 50627 43296 -8737 -12109 11974 -86884 -136433
15293 -136433 -121138 -56425 -17369 -8918 -4078 -42100 -90875 -65121 3130 21541 25639 23600
15281 23600 73618 52303 77912 84291 109096 102207 45691 34981 10986 -30300 -81190 -107568
15269 -107568 -63756 18878 -14283 -36283 -58665 -60787 24247 28430 18977 -5232 2294 20766
$$ packed form
15352e5064m6945o4479J7937N6722K6342Q7288K8051m7723o5951n284O1340k0434
15340b8200l988k2358M7403p388j9931J3197r301L2438J5374k756m7257j0990
15328d3757J9542K2978K8335J2817n3638R932L3443l7023J1427J5809J8343O950
15316D5158j5037j8650M2653j7590l6170m9838O1581O3733p7340j16189N4501
15305f3188O6099m7541K0038O1910K5857j2548p331n2033l372K4083r8858m9549
15293a36433J5295O4713L9056Q451M840l8022m8775K5754O8251J8411M098k039
15281B3600N0018k1315K5609O379K4805o889n6516j0710k3995m1286n0890k6378
15269a07568M3812Q2634l3161k2000k2382k122Q5034M183r453k4209P526J8472
$$ plain form
15257 20766 6603 -32265 -35935 -51754 -1905 -3420 -51807 -44802 -11698 -17091 -28491 -58484
15245 -58484 -125791 -178302 -134289 -75876 -51532 35490 46355 7509 -23413 9996 15643 34086
15233 34086 75007 22473 -27740 -30706 -47564 -50463 -52121 -55148 -38439 -38630 1656 24423 15574
15220 15574 59744 2306 -43884 -15017 -9667 -34783 -63485 5162 35952 9455 18574 -23039
15208 -23039 -24848 21795 28657 -16632 -133393 -112890 -80081 -61331 12349 63185 53171 23358
15196 23358 69037 101128 11982 -13270 -94920 -149003 -128636 -122069 -113573 -55636 -11017 -13971
15184 -13971 40442 59873 60594 21747 -33409 -77585 -21707 -14170 -45253 411 93648 100708
15172 100708 36180 -12212 -5682 -647 5649 54265 71912 80566 81105 90527 122431 125985 77966
$$ packed form
15257B0766j4163l8868l670j5819M9849j515m8387P005L3104n393j1400k9993
15245e8484o7307n2511M4013N8413K4344Q7022J0865l8846l0922L3409N647J8443
15233C4086M0921n2534n0213k966j6858k899j658l027J6709j91M0286K2767q849
15220A5574M4170n7438m6190K8867N350k5116k8702O8647L0790k6497R119m1613
15208b3039j809M6643O862m5289j16761K0503L2809J8750P3680N0836j0014k9813
15196B3358M5679L2091q9146k5252q1650n4083K0367O567Q496N7937M4619k954
15184a3971N4413J9431P21l8847n5156m4176N5878P537l1083M5664R3237P060
15172A00708o4528m8392O530N035O296M8616J7647Q654N39R422L1904L554m8019
$$ plain form
15159 77966 89884 47583 59864 89417 58928 53351 45350 33212 17697 1596 -46442 -75968
15147 -75968 -43593 -51549 -47452 -32911 -30158 -33071 -75049 -111220 -105096 -65810 8694 56656 713
15134 713 -23815 -9439 -37087 66 9587 -25265 -54906 -35687 -35238 -42532 -39310 -50925 -106855
15121 -106855 -75962 -8984 -4629 -25414 -5478 62927 79025 69051 94084 109287 91024 57100
15109 57100 51608 -22205 -88147 -102968 -94710 -81371 -39777 -58794 -86413 -81927 9203 55411
15097 55411 81483 66136 59017 -2112 -48286 -96826 -123836 -122495 -69452 -50769 -29309 -19785
15085 -19785 -40758 -48470 -17979 15567 1413 -370 -19587 -28473 20783 51299 54566 53815 47972
15072 47972 13624 -17480 -47265 -37730 62184 51021 12848 69014 105073 39031 -15446 5027
$$ packed form
15159G7966J1918m2301J2281K9553l0489n577q001j2138j5515j6101m8038k9526
15147g5968L2375p956M097J4541K753k913m1978l6171O124L9286P4504M7962n5943
15134G13k4528J4376k7648L7153R521l4852k9641J9219M49p294L222j1615n5930
15121a06855L0893O6978M355k0785J9936O8405J6098r974K5033J5203j8263l3924
15109E7100n492p3813o5942j4821Q258J3339M1594j9017k7619M486R1130M6208
15097E5411K6072j5347p119o1129m6174m8540k7010J341N3043J8683K1460R524
15085a9785k0973p712L0491L3546j4154j783j9217q886M9256L0516L267p51n843
15072D7972l4348l1104k9785R535R9914j1163l8173N6166L6059o6042n4477K0473
$$ plain form
15060 5027 -18064 -45867 1565 -14803 -88366 -40150 -37166 -36928 -88221 -109886 -63086 -26527
15048 -26527 -42666 -41860 -68579 -76674 -43320 -4038 23789 16160 -33653 -69474 -87680 -81281 -1624
15035 -1624 1937 -2318 -32011 -71589 1009 32251 28474 8423 14107 11056 1060 -69665 -126682
15022 -126682 -92648 12293 9418 3056 75700 52016 -39263 -34975 3894 22789 11707 51430
15010 51430 42391 41212 88473 201663 293111 357897 454218 627169 951839 1412376 1983587
14999 1983587 2543979 2802512 2530239 1725825 1046112 660694 436532 304095 261437 159051
14989 159051 119050 91352 112621 90416 80163 82315 1241 -1458 24515 64139 64134 72446 85439
14976 85439 95785 97665 57317 1874 -31191 -71897 2805 76811 25680 -38673 -26080 -7026
$$ packed form
15060E027k3091k7803M7432j6368p3563M8216K984K38n1293k1665M6800L6559
15048b6527j6139Q06k6719q095L3354L9282K7827p629m9813l5821j8206O399P9657
15035a624L561m255k9693l9578P2598L1242l777k0051N684l051r996p0725n7017
15022a26682L4034J04941k875o362P2644k3684r1279M288L8869J8895j1082L9723
15010E1430r039j179M7261J13190R1448O4786R6321J72951L24670M60537N71211
14999A983587N60392K58533k72273q04414o79713l85418k24162j32437m2658j02386
14989A59051m0001k7698K1269k2205j0253K152q1074k699K5973L9624nQ312J2993
14976H5439J0346J880m0348n5443l3065m0706P4702P4006n1131o4353J2593J9054
$$ plain form
14964 -7026 32372 54844 10267 -40325 29687 29057 10057 36085 7433 28676 85211 37838
14952 37838 757 8829 10991 41051 41627 82591 90779 29785 -39876 -89382 -34313 48245 61825
14939 61825 71233 66708 98657 70982 16094 -41869 -8450 -33297 -74996 -118713 -102026 -93942
14927 -93942 -53854 -97 19600 61131 42056 -6185 -49819 -121445 -71562 -60169 -84229 -129151
14915 -129151 -100292 5090 15710 -53889 -89235 -65156 -685 28398 22153 -8087 -4260 -27031
14903 -27031 -43801 -50252 -24518 -5822 -11750 35762 -30956 -69161 -105737 -80230 -38395 -35446
14891 -35446 -27297 -31294 -17936 -8407 -41474 -85206 -17597 23186 -23956 -15781 -23225 -67078 -37502
14878 -37502 -18378 -20369 -19595 -21158 -15266 -79673 -81664 -51986 -19748 7607 20641 -25361 -37737
$$ packed form
14964g026L9398K2472m4577n0592P0012o30j9000K6028k8652K1243N6535m7373
14952C7838l7081Q072K162L0060N76M0964Q188o0994o9661m9506N5069Q2558J3580
14939F1825R408m525L1949k7675n4888n7963L3419k4847m1699m3717J6687Q084
14927i3942M0088N3757J9697M1531j9075m8241m3634p1626M9883J1393k4060m4922
14915a29151K8859J05382J0620o9599l5346K4079O4471K9083o245l0240L827k2771
14903b7031j6770o451K5734J8696n928M7512o6718l8205l6576K5507M1835K949
14891c5446Q149l997J3358R529l3067m3732O7609M0783m7142Q175p444m3853K9576
14878c7502J9124j991P74j563N892o4407j991K9678L2238K7355J3034m6002j2376
$$ plain form
14865 -37737 -13058 -1147 -58267 -110579 -77884 -65475 -105065 -121450 -84830 -39004 -28763 -34780
14853 -34780 -18679 -28571 -69449 -94271 -134005 -113968 -86319 -31152 -21824 -44344 -72319 -68098
14841 -68098 -11665 -16985 -11282 -41595 -78812 -134939 -66356 -21916 -83373 -88573 -62790 4184
14829 4184 30382 -10027 -89863 -123872 -143056 -164368 -143137 -129476 -76477 -45983 -46352 -65473
14817 -65473 11897 102850 126033 164871 173887 212264 162618 105979 44546 8663 26385 31643
14805 31643 56382 71596 113272 51716 10703 3118 10241 -44077 -68910 -22742 -45458 -63118
14793 -63118 -60828 -52992 -41760 -46935 -95158 -91786 -40871 -19840 -85178 -77404 4285 65635 88649
14780 88649 90644 69671 38505 4604 -24456 -34229 -30593 -18219 -11135 -33043 -2523 13983
$$ packed form
14865c7737K4679J1911n7120n2312L2695J2409l9590j6385L6620M5826J0241o017
14853c4780J6101r892m0878k4822l9734K0037K7649N5167R328k2520k7975M221
14841f8098N6433n320N703l0313l7217n6127O8583M4440o1457n200K5783O6974
14829D184K6198m0409p9836l4009j9184k1312K1231J3661N2999L0494l69j9121
14817f5473P7370R0953K3183L8838R016L8377m9646n6639o1433l5883J7722N258
14805C1643K4739J5214M1676o1556m1013p585P123n4318k4833M6168k2716j7660
14793f3118K290P836J1232n175m8223L372N0915K1031o5338P774Q1689O1350K3014
14780H8649J995k0973l1166l3901k9060r773L636J2374P084k1908L0520J6506
$$ plain form
14768 13983 43792 83630 54755 -8837 -24845 -25306 -103783 -195334 -167852 -110273 -92673 -27314
14756 -27314 -13795 -29250 -31632 -44178 -93659 -105969 -46454 -23632 -9259 -21542 -27147 -3302
14744 -3302 66325 80186 46373 -11022 -23511 -99099 -148505 -96409 -49475 -59681 -31360 -34073
14732 -34073 -16514 -26190 -55967 -70412 -105351 -56639 -43634 -2543 -2833 2423 -24546 -9708
14720 -9708 3014 28049 30949 48625 14194 42147 96698 42642 -14784 -1865 -31567 -60769
14708 -60769 -7436 3611 -52008 -21608 17531 14908 -11554 -39246 -77972 -79911 -63972 -52665
14696 -52665 -23178 43604 34765 5563 360 -26855 -69816 -32830 66225 109087 137096 78257
14684 78257 12239 -2913 -2352 20189 10671 -57539 -5540 -23697 -60923 -33393 -34687 -14680
$$ packed form
14768A3983K9809L9838k8875o3592j6008m61p8477r1551K7482N7579J7600O5359
14756b7314J3519j5455k382j2546m9481j2310N9515K2822J4373j2283n605K3845
14744c302O9627J3861l3813n7395j2489p5588m9406N2096M6934j0206K8321k713
14732c4073J7559r676k9777j4445l4939M8712J3005M1091k90N256k6969J4838
14720i708J2722K5035K900J7676l4431K7953N4551n4056n7426J2919k9702k9202
14708f0769N3333J1047n5619L0400L9139k623k6462k7692l8726j939J5939J1307
14696e2665K9487O6782q839k9202n203k7215m2961L6986R9055M2862K8009n8839
14684G8257o6018j5152N61K2541r518o8210N1999j8157l7226K7530j294K0007
$$ plain form
14672 -14680 -16083 -748 -10273 -14220 10772 24215 11249 -39774 -79136 -96970 -124735 -125142 -164814
14659 -164814 -139803 -86654 -59668 -20604 -50368 -30423 41701 39662 10136 -20437 -61999 -98206
14647 -98206 -78627 -76850 -43303 23725 51724 -6265 -59537 -69674 -27379 -3990 -40584 -52022
14635 -52022 -83409 -110416 -133470 -59388 -73657 -92693 -97857 -126798 -67441 -55524 -108654 -127395
14623 -127395 -38886 7109 -13749 -39064 -51076 -40754 -42156 -36662 23962 93942 29533 325
14611 325 -52193 -111489 -80430 -55182 -53203 -32487 -15757 -45206 -120468 -119295 -121470 -131435 -132482
14598 -132482 -115954 -63793 -106708 -143265 -144860 -124743 -150221 -157395 -112333 -44619 -88217 1097
14586 1097 48350 -10922 -51578 -54591 40637 20718 -17636 -13964 34673 86049 54971 56596
$$ packed form
14672a4680j403J5335r525l947K4992J3443j2966n1023l9362j7834k7765m07l9672
14659a64814K5011N3149K6986L9064k9764J9945P2124k039k9526l0573m1562l6207
14647i8206J9579J777L3547O7028K7999n7989n3272j0137M2295K3389l6594j1438
14635e2022l1387k7007k3054P4082j4269j9036n164k8941N9357J1917n3130j8741
14623a27395Q8509M5995k0858k5315j2012J0322j402N494O0624O9980o4409k9208
14611C25n2518n9296L1059K5248J979K0716J6730k9449p5262J173k175r965j047
14598a32482J6528N2161m2915l6557j595K0117k5478p174M5062O7714m3598Q9314
14586A097M7253n9272m0656l013R5228j9919l8354L672M8637N1376l1078J625
$$ plain form
14574 56596 -4026 -83502 -81201 -47309 23893 59327 29986 37754 60463 55762 55357 3755 -30551
14561 -30551 -78884 -75315 -95763 -111358 -85164 1243 33826 15139 28944 12380 16323 -16746
14549 -16746 -57275 -113263 -105579 -93530 -104020 -71514 -78904 -55733 -38820 -75544 -113931 -107983
14537 -107983 -31331 -78201 -111741 -121697 -121303 -109670 -36002 22250 51431 26920 -20049 -76543
14525 -76543 -135069 -151642 -122928 -63371 -4846 9715 16373 18919 46799 76898 42573 68713
14513 68713 90061 41251 18841 -39530 -44829 34862 54186 62024 6747 -25034 -28171 -3771
14501 -3771 45974 128507 124680 67455 13812 31106 -3790 3885 73249 66981 -4460 -51807
14489 -51807 -36359 -20145 -36250 -72942 -74389 -82267 -22819 54120 44599 -9583 41840 52023
$$ packed form
14574E6596o0622p9476K301L3892P1202L5434k9341P768K2709m701m05n1602l4306
14561c0551m8333L569k0448j5595K6194Q6407L2583j8687J3805j6564L943l3069
14549a6746m0529n5988P684J2049j0490L2506p390K3171J6913l6724l8387N948
14537a07983P6652m6870l3540r956L94J1633P3668N8252K9181k4511m6969n6494
14525g6543n8526j6573K8714N9557N8525J4561O658K546K7880L0099l4325K6140
14513F8713K1348m8810k2410n8371n299P9691J9324P838n5277l1781l137K4400
14501c771M9745Q2533l827n7225n3643J7294l4896P675O9364o268p1441m7347
14489e1807J5448J6214j6105l6692j447p878N9448P6939r521n4182N1423J0183
$$ plain form
14477 52023 19849 -632 -61132 -60113 -10364 -16344 23743 49124 19843 32057 -4295 -23204
14465 -23204 -90457 -149056 -136551 -132085 -63375 -28078 -10900 -24199 -57131 -68703 -47168 6663
14453 6663 33793 14113 -43769 -62910 -37197 -66216 -74895 -74349 -87745 -92662 -73765 -68466 -29390
14440 -29390 106 -21652 -66549 -101388 -39217 71155 86199 49352 25811 36790 17409
14429 17409 30389 28365 65322 113579 41632 -54065 -13107 66520 54941 38769 8677 10146
14417 10146 30957 23854 -79791 -118891 -148937 -122221 -39889 33965 19458 19469 44761 1048
14405 1048 -45533 -74385 -43380 -48818 6088 -20669 -57098 -1 25983 49805 25320 -54897
14393 -54897 -113418 -66679 -42655 -45702 7018 3758 -29416 -18446 -73640 -3548 96888 74078
$$ packed form
14477E2023l2174k0481o0500J019M9749n980M0087K5381k9281J2214l6352j8909
14465b3204o7253n8599J2505M466O8710L5297J7178j3299l2932j1572K1535N3831
14453F663K7130j9680n7882j9141K5713k9019q679N46j3396m917J8897N299L9076
14440b9390K9496k1758m4897l4839O2171J10372J5044l6847k3541J0979j9381
14429A7409J2980k024L6957M8257p1947r5697M0958P9627j1579j6172l0092J469
14417A0146K0811p103j03645l9100l0046K6716Q2332P3854j4507J1K5292m3713
14405A048m6581k8852L1005n438N4906k6757l6429N7097K5984K3822k4485q0217
14393e4897n8521M6739K4024l047N2720l260l3174J0970n5194P0092J00436k2810
$$ plain form
14381 74078 18574 32995 20995 -39690 -98651 -168377 -162598 -125641 -67936 -42778 -39395 -6561
14369 -6561 2277 2894 878 -19963 -69193 -34412 473 40669 503 -36587 -104620 -129689 -166433
14356 -166433 -109068 -46359 -14717 -43677 -56606 10283 -1553 -46324 -32389 -9213 -11485 -38994
14344 -38994 23600 9233 13070 52668 50744 11130 -7907 18544 75914 71255 59514 20682
14332 20682 10975 34141 67360 60981 28076 17012 -21461 -19506 -18512 20012 -27181 -25795 13673
14319 13673 51744 54721 60696 52386 46081 90255 79659 67445 47521 111936 141761 113746
14307 113746 146892 170444 133959 37690 -32093 19057 20874 48038 98426 132010 122136 105321
14295 105321 107121 117831 124782 100097 31150 -9048 9641 79454 71565 62505 -9345 39461
$$ packed form
14381G4078n5504J4421j2000o0685n8961o9726N779L6957N7705K5158L383L2834
14369f561Q838O17k016k0841m9230L4781L4885M0196m0166l7090o8033k5069l6744
14356a66433N7365O2709L1642k8960j2929O6889j1836m4771J3935K3176k272k7509
14344c8994O2594j4367L837L9598j924l9614j9037K6451N7370m659j1741l8832
14332B0682r707K3166L3219o379l2905j1064l8473J955R94L8524m7193J386L9468
14319A3673L8071K977N975q310o305M4174j0596j2214j9924O4415K9825k8015
14307A13746L3146K3552l6485r6269o9783N1150J817K7164N0388L3584r874j6815
14295A05321J800J0710O951k4685o8947m0198J8689O9813p889r060p1850M8806
$$ plain form
14283 39461 95515 84929 105664 74306 34605 31966 77666 112230 101415 106578 46812 30748
14271 30748 23326 56241 82354 66661 19058 26559 18656 33854 23934 -2950 -9709 40057 122915
14258 122915 109012 80455 100974 132948 59153 7529 44630 6326 17453 47319 68663
14247 68663 99144 51759 -22834 -44940 7286 -22696 -21366 20878 43371 45149 -1395 -15568
14235 -15568 19281 30180 86386 86036 31110 -4216 1876 17360 49198 76751 103726 132548
14223 132548 103403 60421 34135 -23279 -45233 -47210 -32611 1044 39514 23365 9964 -49731
14211 -49731 -66307 -26334 -47936 13902 30620 -24441 3055 60736 98329 50822 -27864 13047
14199 13047 18670 -17528 -29057 42028 59539 40436 43585 -4010 9700 80880 91692 122243
$$ packed form
14283C9461N6054j0586K0735l1358l9701k639M5700L4564j0815N163n9766j6064
14271C0748p422L2915K6113j5693m7603P501p903J5198r920k6884o759M9766Q2858
14258A22915j3903k8557K0519L1974p3795n1624L7101l8304J1127K9866K1344
14247F8663L0481m7385p4593k2106N2226k9982J330M2244K2493J778m6544j4173
14235a5568L4849J0899N6206l50n4926l5326O092J5484L1838K7553K6975K8822
14223A32548k9145m2982k6286n7414k1954j977J4599L3655L8470j6149j3401n9695
14211d9731j6576L9973k1602O1838J6718n5061K7496N7681L7593m7507p8686M0911
14199A3047N623l6198j1529P1085J7511j9103L149m7595J3710P1180J0812L0551
$$ plain form
14187 122243 106101 89727 75733 74969 70729 52841 53357 77877 53990 1241 31357 56249
14175 56249 83461 121977 149123 94785 21454 25014 23960 -7261 42701 88119 55434 48823
14163 48823 42490 35942 48849 -31957 -59337 -43598 -52676 -77425 -43011 -6266 -43403 -37607
14151 -37607 45853 85753 111084 134756 83302 46381 61414 79974 67281 58124 15943 -24413
14139 -24413 -14977 -35437 -63105 -11474 21917 -29556 -12440 -50524 -32094 14250 39642 39450
14127 39450 33917 3019 23755 2455 19965 11235 35662 26434 2210 15255 13104 19048 2530
14114 2530 -61260 -84430 -47946 -27544 -24683 -22704 -58096 -37940 -10217 -4021 -695 23743 46637
14101 46637 50614 -16134 -20819 -24532 -50271 -68293 -72779 -45827 -27159 10265 61490 98542
$$ packed form
14187A22243j6142j6374j3994p64m240j7888N16K4520k3887n2749L0116K4892
14175E6249K7212L8516K7146n4338p3331L560j054l1221M9962M5418l2685o611
14163D8823o333o548J2907q0806k7380J5739r078k4749L4414L6745l7137N796
14151c7607Q3460L9900K5331K3672n1454l6921J5033J8560j2693r157m2181m0356
14139b4413R436k0460k7668N1631L3391n1473J7116l8084J8430M6344K5392j92
14127C9450n533l0898K0736k1300J7510q730K4427r228k4224J3045k151N944j6518
14114B530o3790k3170L6484K0402K861J979l5392K0156K7723O196L326K4438K2894
14101D6637L977o6748m685l713k5739j8022m486K6952J8668L7424N1225L7052
$$ plain form
14089 98542 94025 52653 40574 -39375 -15814 -14925 -55389 -30719 7691 -12224 -4663 34047
14077 34047 57920 53699 20978 -27579 15560 -15808 -45519 -2409 47629 96572 36446 15948
14065 15948 91300 55708 3870 5499 -44825 -73311 -82169 -72829 -40479 -35963 28651 -6992
14053 -6992 -50457 -34181 -42144 -55007 -2955 49988 18424 13806 150 7499 -28386 -41673
14041 -41673 -60036 -93414 -108979 -106371 -100536 -96491 -134266 -103883 -117382 -109963 -101960 -92640 -50227
14028 -50227 -43449 -55882 -41180 -41334 -51117 -38407 -45222 -58425 -37273 -30609 -71706 -78030 -49386
14015 -49386 3920 69235 29749 -16185 -37747 -28035 14504 767 -14656 2854 -45440 -89248
14003 -89248 -94911 -56169 -15114 3051 -5642 -36419 -59743 -40568 -68737 -106687 -120814 -110616
$$ packed form
14089I8542m517m1372j2079p9949K3561Q89m0464K4670L8410j9915P561L8710
14077C4047K3873m221l2721m8557M3139l1368k9711M3110N0038M8943o0126k0498
14065A5948P5352l5592n1838J629n0324k8486q858R340L2350M516O4614l5643
14053f992m3465J6276p963j2863N2052N2943l1564m618j3656P349l5885j3287
14041d1673j8363l3378j5565K608N835M045l7775L0383j3499P419Q003R320M2413
14028e0227O778j2433J4702j54r783J2710o815j3203K1152O664m1097o324K8644
14015d9386N3306O5315l9486m5934k1562R712M2539j3737j5423J7510m8294m3808
14003h9248n663L8742M1055J8165q693l0777k3324J9175k8169l7950j4127J0198
$$ plain form
13991 -110616 -64201 -9699 7827 1091 -626 3105 -29180 -27127 -5361 17439 34683 -5389
13979 -5389 1546 51055 43973 27686 -10422 26014 -41783 -94984 -88994 -72414 -57924 -63906 -61357
13966 -61357 -88008 -108940 -107638 -60395 -46575 -32633 -10549 -28991 7726 -9535 -16138 -6493
13954 -6493 -52496 -123270 -125120 -89334 -69902 -101190 -151287 -124373 -98641 -48024 -10954 9472
13942 9472 35083 14123 17243 30546 20103 -3281 -35633 -70384 -57416 -1983 43097 33982
13930 33982 76401 65007 66541 29571 -20560 -53964 -50877 -69922 -66783 -13720 3705 -25799
13918 -25799 -64138 -87097 -112100 -63005 -14076 36998 90382 56592 55122 55919 76763 133688
13906 133688 77420 -20497 -68622 -35233 -16583 12304 4520 -5098 -7681 -19709 -23698 53566
$$ packed form
13991a10616M6415N4502J7526o736j717L731l2285K053K1766K2800J7244m0072
13979e389O935M9509p082j6287l8108L6436o7797n3201N990J6580J4490n982K549
13966f1357k6651k0932J302M7243J3820J3942K2084j8442L6717j7261o603R645
13954f493m6003p0774j850L5786J9432l1288n0097K6914K5732N0617L7070K0426
13942I472K5611k0960L120J3303j0443k3384l2352l4751J2968N5433M5080r115
13930C3982M2419j1394J534l6970n0131l3404L087j9045L139N3063J7425k9504
13918b5799l8339k2959k5003M9095M8929N1074N3384l3790j470P97K0844N6925
13906A33688n6268r7917m8125L3389J8650K8887p784r618k583j2028l989P7264
$$ plain form
13894 53566 70418 35494 -25013 -17346 29758 52490 29939 3344 -12171 -16423 -41089 -26123
13882 -26123 -56954 -44035 -48714 -7308 48135 17377 -25915 -5642 -45775 -90621 -59429 -8375
13870 -8375 17692 -26552 -39991 -19725 -44190 -50039 -2639 -4644 -13543 -37946 -53671 -28696
13858 -28696 13839 42577 -3555 -16513 -21396 -41872 -10624 -25153 -12061 -20427 -46867 -8236
13846 -8236 18275 25075 -25671 -43321 -13200 9521 -19023 -17493 36681 32021 20055 60379
13834 60379 74184 78644 10349 -4165 50110 79939 81357 61163 49042 24177 33433 80252
13822 80252 48937 2812 -9017 30693 70865 54344 45784 14253 43598 38772 1803 62535
13810 62535 72953 32902 25987 -15207 -38323 -53120 -67350 -40240 -21672 -19585 17494 54075
$$ packed form
13894E3566J6852l4924o0507P667M7104K2732k2551k6595j5515m252k4666J4966
13882b6123l0831J2919m679M1406N5443l0758m3292K0273m0133m4846L1192N1054
13870h375K6067m4244j3439K0266k4465n849M7400k005q899k4403j5725K4975
13858b8696M2535K8738m6132j2958m883k0476L1248j4529J3092q366k6440L8631
13846h236K6511O800n0746j7650L0121K2721k8544J530N4174m660j1966M0324
13834F0379J3805M460o8295j4514N4275K9829J418k0194j2121k4865R256M6819
13822H0252l1315m6125j1829L9710M0172j6521q560l1531K9345m826l6969O0732
13810F2535J0418m0051o915m1194k3116j4797j4230K7110J8568K087L7079L6581
$$ plain form
13798 54075 30399 4005 2488 20768 29971 -10102 29367 4079 -60111 -85963 -73819 20984
13786 20984 37674 56738 36958 28500 8931 -1496 51 -8026 -942 -19005 -2106 -60850
13774 -60850 -44329 -33963 -30055 -61239 -83840 -62082 -45243 -9089 -11650 -18677 33793 34684 66834
13761 66834 653 -15117 -14286 -53523 27843 2626 -44026 -38775 -42848 -6893 22112 -19806
13749 -19806 -14223 -1625 -78896 -85474 -20928 1720 -23738 -36201 -5527 20086 10127 11300
13737 11300 15322 -17448 -52682 -86948 -55692 -75164 -51823 -10521 -16293 -63482 -27107 46481
13725 46481 55234 19695 -18845 -45478 9407 39119 65293 -16251 -103123 -116242 -102419 -92276
13713 -92276 -39388 -79492 -67452 21285 11056 -10356 -8105 -52257 -40464 -10257 -8722 17677
$$ packed form
13798E4075k3676k6394j517J8280R203m0073L9469k5288o4190k5852J2144R4803
13786B0984J6690J9064j9780q458j9569j0427J547q077P084j8063J6899n8744
13774f0850J6521J0366L908l1184k2601K1758J6839L6154k561p027N2470Q91L2150
13761F6834o6181j5770Q31l9237Q1366k5217m6652N251m073L5955K9005m1918
13749a9806N583J2598p7271o578O4546K2648k5458j2463L0674K5613r959J173
13737A1300M022l2770l5234l4266L1256j9472K3341M1302n772m7189L6375P3588
13725D6481Q753l5539l8540k6633N4885K9712K6174q1544q6872j3119J3823J0143
13713i2276N2888m0104J2040Q8737j0229k1412K251m4152J1793L0207J535K6399
$$ plain form
13701 17677 6974 -35157 -45431 -68331 -103324 -107746 -58254 28662 8033 -68270 -4140 51912
13689 51912 55263 50025 39242 1996 7937 -4055 5570 50809 -680 -18604 -22216 -73816 -122852
13676 -122852 -126697 -99743 -79794 -58479 -3440 -14199 -73345 -60256 -4368 -24009 -4235 -27387
13664 -27387 -65010 -40328 52582 50840 10429 -3161 -14847 2737 6326 19657 34523 73725
13652 73725 47997 -60027 -129182 -109336 -96954 -59793 -79996 -91664 -79926 -101888 -121775
13641 -121775 -88782 -97458 -86103 -95732 -91366 -30074 18890 3006 -34739 -12759 -39159 -30822
13629 -30822 1046 105246 89279 -4483 22392 32112 35422 -62 -62845 -70905 -32030 -22868
13617 -22868 -41398 -21475 9294 21939 -6304 -30948 23912 27406 -17098 -46999 -9831 -17673
$$ packed form
13701A7677j0703m2131j0274k2900l4993m422M9492Q6916k0629p6303O4130N6052
13689E1912L351n238j0783l7246N941j1992R625M5239n1489j7924l612n1600m9036
13676a22852l845K6954J9949K1315N5039j0759n9146J3089N5888j9641J9774k3152
13664b7387l7623K4682R2910j742m0411j3590j1686J7584L589J3331J4866L9202
13652G3725k5728j08024o9155J9846J2382L7161k0203j1668J1738k1962j9887
13641a21775L2993q676J1355r629M366O1292M8964j5884l7745K1980k6400Q337
13629c0822L1868J04200j5967r3762K6875R720L310l5484o2783q060L8875R162
13617b2868j8530J9923L0769J2645k8243k4644N4860L494m4504k9901L7168p842
$$ plain form
13605 -17673 -9572 -6484 -10310 -23200 -6784 64159 84572 85576 65644 43692 51454 36992 30130
13592 30130 32906 24286 31831 5463 9854 3691 11056 -30111 -26802 -2414 11906 36336 31952
13579 31952 9564 47417 41022 32609 -10506 22150 27630 9804 -33752 -85821 -79671 -52366
13567 -52366 -73040 -146407 -128507 -55846 -39681 -20755 -79136 -117449 -140542 -120431 -107231 -99533
13555 -99533 -120497 -145604 -207404 -223538 -181925 -82124 -40544 19731 16271 -14200 -24333 30176
13543 30176 95761 62672 -19714 -75652 -122970 -106535 -36663 -30925 -57425 -26591 21605 15547
13531 15547 17687 -39116 -57429 -36503 -36591 -55502 -78262 -98336 -80147 -58472 -94173 -150425
13519 -150425 -167654 -148735 -130269 -96928 -69755 -68915 -26760 -77232 -119858 -124236 -91412 9612
$$ packed form
13605a7673Q101L088l826j2890J6416P0943K0413J004j9932k1952P762j4462o862
13592C0130K776q620P545k6368M391o163P365m1167L309K4388J4320K4430m384
13579C1952k2388L7853o395q413m3115L2656N480j7826m3556n2069O150K7305
13567e2366k0674p3367J7900P2661J6165J8926n8381l8313k3093K0111J3200P698
13555i9533k0964k5107o1800j6134M1613R9801M1580O0275l460l0471j0133N4509
13543C0176O5585l3089q2386n5938m7318J6435O9872N738k6500L0834M8196o058
13531A5547K140n6803j8313K0926q8j8911k2760k0074J8189K1675l5701n6252
13519a50425j7229J8919J8466L3341K7173Q40M2155n0472m2626m378L2824J01024
$$ plain form
13507 9612 46964 86249 61597 9203 45332 35323 1661 41888 4562 34758 47316 45856
13495 45856 4504 -3184 33191 20543 -5817 -10108 -4896 15779 13344 -25732 -4992 38860
13483 38860 72681 56702 5350 27503 28754 43151 -5464 -44169 -82070 -49272 33063 34096
13471 34096 -25581 -88600 -88198 -40737 -47423 -83485 -108162 -75471 -30354 -23256 -52529 -58117 -125092
13458 -125092 -150172 -71953 -24397 5040 27267 88924 70043 -50128 -22394 27752 376
13447 376 3080 16631 69597 50898 68824 41038 -4258 -39704 -22780 -11801 -11876 -13151 24102
13434 24102 74425 737 -60951 -63473 -62885 -85113 -14660 55555 87766 79739 829 1657 75780
13421 75780 149161 91932 61877 44276 76323 31102 42766 56989 38040 -1655 -25210 -21361
$$ packed form
13507I612L7352L9285k4652n2394L6129j0009l3662M0227l7326L0196J2558j460
13495D5856m1352p688L6375j2648k6360m291N212K0675k435l9076K0740M3852
13483C8860L3821j5979n1352K2153J251J4397m8615l8705l7901L2798Q2335J033
13471C4096n9677o3019M02M7461o686l6062k4677L2691M5117P098k9273n588o6975
13458a25092k5080P8219M7556K9437K2227O1657j8881j20171K7734N0146k7376
13447C76K704J3551N2966j8699J7926k7786m5296l5446J6924J0979p5j275L7253
13434B4102N0323p3688o1688k522N88k2228P0453P0215L2211q027p8910Q28P4123
13421G5780P3381n7229l0055j7601L2047m5221J1664J4223j8949l9695k3555L849
$$ plain form
13409 -21361 -34286 -28287 14254 10061 -33433 -40506 -10990 -41885 -89130 -71777 -6986 58829
13397 58829 39851 -56151 -134117 -130653 -116216 -102979 -84326 -63962 -12169 26099 19600 -26272
13385 -26272 -17233 20887 -19335 -7806 14500 -32153 -20726 -2769 9279 13916 -35191 -57795
13373 -57795 -32458 -5023 -6377 9831 -11331 -34701 -24490 15883 86393 118069 49929 -57056
13361 -57056 -73629 -90775 -110097 -52847 -488 17476 3427 -53317 -64910 -27458 -36149 -60472
13349 -60472 -97464 -59162 -26659 -2158 2270 9970 -38642 -21444 43270 41152 47053 52490 -10873
13336 -10873 -45142 -77983 -96996 -69733 -33736 -49726 -48568 -13672 -35596 -40767 -39519 -52790
13324 -52790 -14246 3488 2747 -21432 -5903 -31067 -23749 17846 41137 -28037 -89599 -92732
$$ packed form
13409b1361j2925N999M2541m193m3494p073K9516l0895m7245J7353O4791O5815
13397E8829j8978r6002p7966L464J4437J3237J8653K0364N1793L8268o499m5872
13385b6272R039L8120m0222J1529K2306m6653J1427J7957J2048M637m9107k2604
13373e7795K5337K7435j354J6208k1162k3370J0211M0373P0510L1676o8140j06985
13361e7056j6573j7146j9322N7250N2359J7964j4049n6744j1593L7452q691k4323
13349f0472l6992L8302L2503K4501M428P700m8612J7198O4714k118N901N437o3363
13336a0873l4269l2841j9013K7263L5997j5990J158L4896k1924n171J248j3271
13324e2790L8544J7734p41k4179J5529k5164P318M1595K3291o9174o1562l133
$$ plain form
13312 -92732 -59698 -49574 36957 60278 46616 59771 52810 78998 71206 43652 16677 -59115
13300 -59115 -67742 -60231 3132 45568 41890 25750 -10520 -59449 -94948 -55680 18392 61671
13288 61671 79505 52684 17579 -65889 -83312 -63860 -49618 -28644 941 20633 4605 47384
13276 47384 104296 147440 155285 130914 130074 120347 36443 -17736 -34849 -35792 -23929 21891 5710
13263 5710 -12003 -52735 -67050 -91142 -100974 -76788 -78968 -66536 -29394 -11033 26865 -23029
13251 -23029 -53076 -55995 -44125 -53778 -51998 -53713 -92840 -69902 -33290 -28481 -37017 15279 8402
13238 8402 5995 -5768 24862 41698 15705 16211 -17371 -673 26406 21671 9427 -7213 -76646
13225 -76646 -79855 -41702 -28361 -48362 -51784 -47350 -18949 -11157 -32467 -69120 -105202 -65122
$$ packed form
13312i2732L3034J0124Q6531K3321j3662J3155o961K6188p792k7554k6975p5792
13300e9115q627P511O3363M2436l678j6140l6270m8929l5499L9268P4072M3279
13288F1671J7834k6821l5105q3468j7423J9452J4242K0974K9585J9692j6028M2779
13276D7384N6912M3144P845k4371q40r727q3904n4179j7113r43J1863M5820j6181
13263E710j7713m0732j4315k4092r832K4186k180J2432L7142J8361L7898m9894
13251b3029l0047k919J1870r653J780j715l9127K2938L6612M809q536N2296o877
13238H402k407j1763L0630J6836k5993N06l3582J6698K7079m735j2244j6640o9433
13225g6646l209L8153J3341k0001l422M434K8401P792k1310l6653l6082M0080
$$ plain form
13213 -65122 -19408 28252 65451 -1176 -38799 -51966 -24615 -44742 -27259 -5103 -63659 -140107
13201 -140107 -118970 -65452 8284 76655 37810 50985 72160 490 -62797 -97661 -78777
13190 -78777 -44704 3345 57733 58781 84917 71165 103113 130779 86982 106076 105161 67050
13178 67050 51687 -5614 37546 44378 -19745 -78238 -55075 -64753 -139314 -144032 -50359 36352
13166 36352 22951 -195 -2112 16466 13306 30620 58110 7702 -2617 18361 57852 80225
13154 80225 66300 100790 92300 90630 163092 187053 107724 9236 -63846 -25832 25221 27778
13142 27778 6509 -49343 -72006 -54848 -32140 -41588 -12984 24135 76577 79408 43446 11454
13130 11454 22302 2105 -50747 -37695 -11050 -40411 -71623 31125 77310 16819 42164
$$ packed form
13213f5122M5714M7660L7199o6627l7623j3167K7351k0127J7483K2156n8556p6448
13201a40107K1137N3518P3736O8371l8845J3175K1175p1670o3287l4864J8884
13190g8777L4073M8049N4388J048K6136j3752L1948K7666m3797J9094r15l8111
13178F7050j5363n7301M3160O832o4123n8493K3163r678p4561m718R3673Q6711
13166C6352j3401k3146j917J8578l160J7314K7490n0408j0319K0978L9491K2373
13154H0225j3925L4490q490j670P2462K3961p9329r8488p3082L8014N1053K557
13142B7778k1269n5852k2663J7158K2708r448K8604L7119N2442K831l5962l1992
13130A1454J0848k0197n2852J3052K6645k9361l1212J02748M6185o0491K5345
$$ plain form
13119 42164 27083 5650 -11883 30870 11334 -44699 -43763 -47385 -63960 -99357 -78159 -80298
13107 -80298 -44921 42221 84171 86551 154803 133154 33186 -18778 -37982 -17892 9547 -14689
13095 -14689 -7688 12150 -3742 3034 -40389 -69148 -106054 -139555 -142288 -36134 53178 2430
13083 2430 -61402 -52893 -29927 -5132 -28727 -112131 -102616 -74264 -62682 -51229 12363 45736
13071 45736 -16148 1018 10918 16982 -14897 -54637 -80129 -54234 -51606 -52311 18592 49084 70613
13058 70613 64193 11614 -18215 -29740 -20253 1628 4055 712 -24588 -48373 -52424 3576 45272
13045 45272 25590 -32550 -30815 33654 37033 -46798 -28498 15703 21985 19407 -23825 -60738
13033 -60738 -112969 -156678 -116075 -53742 -56625 -79495 -94799 14124 -19049 -51190 -73649 -99574
$$ packed form
13119D2164j5081k1433j7533M2753j9536n6033R36l622j6575l5397K1198k139
13107h0298L5377Q7142M1950K380O8252k1649r9968n1964j9204K0090K7439k4236
13095a4689P001J9838j5892O776m3423k8759l6906l3501k733J06154Q9312n0748
13083B430o3832Q509K2966K4795k3595q3404R515K8352J1582J1453O3592L3373
13071D5736o1884J7166R900O064l1879l9740k5492K5895K628p05P0903L0492K1529
13058G0613o420n2579k9829j1525R487K1881K427l343k5300k3785m051N6000M1696
13045D5272j9682n8140J735O4469L379q3831J8300M4201O282k578m3232l6913
13033f0738n2231m3709M0603O2333k883k2870j5304J08923l3173l2141k2459k5925
$$ plain form
13021 -99574 -84009 -55713 -1622 16534 6024 16282 48177 47998 75866 60064 36136 14679
13009 14679 3460 -34693 -106964 -102828 -70984 -13936 27789 52030 43439 -6622 -3410 51039
12997 51039 74381 72572 15404 -37601 -92349 -80807 -18255 57727 67160 76731 108613 31533
12985 31533 -1360 -9394 5958 54042 22804 -46921 -47203 -36959 -26752 -18526 -38057 -60983
12973 -60983 -13537 12454 -24886 -40262 -55632 -73594 -71123 24376 20895 46742 51606 33056
12961 33056 51098 28341 18896 -35074 -20802 -8375 -15637 6802 980 -23278 -46198 -97539
12949 -97539 -106978 -16590 -28572 -5828 -37429 -74805 -41835 -68968 -57789 -85061 -33255 -26229
12937 -26229 -35887 -47730 -84585 -58734 5746 70394 41207 -43499 -41700 -20415 17333 62616
$$ packed form
13021i9574J5565K8296N4091J8156j0510J0258L1895j79K7868j5802k3928k1457
13009A4679j1219l8153p2271M136L1844N7048M1725K4241q591n0061L212N4449
12997E1039K3342j809n7168n3005n4748J1542O2552P5982R433R571L1882p7080
12985C1533l2893q034J5352M8084l1238o9725k82J0244J0207Q226j9531k2926
12973f0983M7446K5991l7340j5376j5370j7962K471R5499l481K5847M864j8550
12961C3056J8042k2757r445n3970J4272J2427p262K2439n822k4258k2920n1341
12949i7539r439R0388j1982K2744l1601l7376L2970k7133J1179k7272N1806P026
12937b6229r658j1843l6855K5851O4480O4648k9187q4706J799K1285L7748M5283
$$ plain form
12925 62616 62358 89616 67105 37332 38901 54740 48498 -1866 -27919 -10239 -5496 68778 115761
12912 115761 109462 59107 55332 49378 75823 35399 -6367 3996 -30873 -15189 -20247 6388
12900 6388 13764 20231 43964 35020 16941 15871 -2051 -7111 48122 82863 67681 99253 97676
12887 97676 104433 40900 3112 31361 16286 485 42745 60114 24329 30412 88479 110666
12875 110666 51959 65621 69633 135693 92937 42515 -23780 -70137 -51058 -27778 9346 40708
12863 40708 40833 -19729 58533 117929 93154 27320 -13137 -63981 -64909 -94078 -58095 -51811 -39446
12850 -39446 -53524 -87790 -84471 -29307 -20682 -43199 -78946 -111493 -96638 -52894 -23175 3308
12838 3308 21847 6539 2215 7962 24067 13285 -38128 -60253 -41454 -34020 -18410 12624
$$ packed form
12925F2616k58K7258k2511k9773J569J5839o242n0364k6053J7680M743P4274M6983
12912A15761o299n0355l775n954K6445m0424m1766J0363l4869J5684n058K6635
12900F388P376O467K3733q944j8079j070j7922n060N5233L4741j5182L1572j577
12887I7676O757o3533l7788K8249j5075j5801M2260J7369l5785O083N8067K2187
12875A10666n8707J3662M012O6060m2756n0422o6295m6357J9079K3280L7124L1362
12863D0708J25o0562P8262N9396k4775o5834m0457n0844r28k9169L5983O284J2365
12850c9446j4078l4266L319N5164Q625k2517l5747l2547J4855M3744K9719K6483
12838C308J8539j5308m324N747J6105j0782n1413k2125J8799P434J5610L1034
$$ plain form
12826 12624 9998 -8876 18594 32238 8271 -18575 -54888 -4146 3067 8995 33493 32728 24739
12813 24739 -27525 -46717 23057 -3216 -20770 -19690 -47539 -58887 -96009 -90169 -103850 -107091
12801 -107091 -40541 21385 64785 48718 -38629 -51835 -34203 -6774 -10353 -45946 -49407 -56598
12789 -56598 -80417 -77330 -134642 -186148 -143684 -99970 -127539 -118956 -107282 -98564 -64842 11171
12777 11171 19712 5999 34705 20403 11314 -43534 -8522 -968 -666 8276 10873 7761 -53704
12764 -53704 -20602 -26681 -65937 -47691 -82626 -13140 34730 24327 32267 69195 55429 49723
12752 49723 73867 74776 76906 57117 49460 40570 23707 -35063 -3363 43487 57952 40467 -1594
12739 -1594 -22633 -29434 -3926 -8498 -35107 3178 25384 -33450 3327 120901 170534 160264
$$ packed form
12826A2624k626j8874K7470J3644k3967k6846l6313N0742P213N928K4498p65p989
12813B4739n2264j9192O9774k6273j7554J080k7849j1348l7122N840j3681l241
12801a07091O6550O1926M3400j6067q7347j3206J7632K7429l579l5593l461p191
12789e6598k3819L087n7312n1506M2464M3714k7569Q583J1674Q718L3722P6013
12777A1171Q541j3713K8706j4302r089n4848L5012P554L02Q942K597l112o1465
12764e3704L3102o079l9256J8246l4935O9486M7870j0403P940L6928j3766n706
12752D9723K4144R09K130j9789p657q890j6863n8770L1700M6850J4465j7485m2061
12739a594k1039o801K5508m572k6609L8285K2206n8834L6777J17574M9633j0270
$$ plain form
12727 160264 131160 127714 77776 54389 45368 3915 30824 6397 -16195 -26317 -48026 -47012
12715 -47012 1459 -14863 -10058 33951 17506 -38482 -76021 -67220 -29820 47963 58634 37962
12703 37962 10610 10944 9990 15985 -25477 -73843 -100227 -151588 -117154 -34428 -24724 -37234 -48962
12690 -48962 -70495 -46605 -37830 -17799 -5557 19462 66138 105501 88935 55215 40337 -27659
12678 -27659 -43914 -42248 19125 41339 81247 67423 20875 65795 23189 -20427 20321 34228
12666 34228 -12530 -57204 -26227 -42268 -48583 -15741 62377 69169 82939 92054 15584 -47138
12654 -47138 -86879 -31698 29805 32055 12579 -36429 -126522 -55501 -60464 -12370 32638 36005
12642 36005 24176 99716 69908 66323 48668 12209 12841 -13906 -15402 -38537 -35048 3688 43262
$$ packed form
12727A60264k9104l446m9938k3387r021m1453K6909k4427k2592j0122k1709J014
12715d7012M8471j6322M805M4009j6445n5988l7539Q801L7400P7783J0671k0672
12703C7962k7352L34r54N995m1462m8366k6384n1361L4434Q2726R704j2510j1728
12690d8962k1533K3890Q775K0031J2242K5019M6676L9363j6566l3720j4878o7996
12678b7659j6255J666O1373K2214L9908j3824m6548M4920m2606m3616M0748J3907
12666C4228m6758m4674L0977j6041o315L2842P8118O792J3770R115p6470o2722
12654d7138l9741N5181O1503K250j9476m9008r0093P1021m963M8094M5008L367
12642C6005j1829P5540k9808l585j7655l6459O32k6747j496k3135L489L8736L9574
$$ plain form
12629 43262 -25749 -74449 -54701 -44852 -10637 -15192 20656 61896 61119 491 -8386 -19432 -6541
12616 -6541 -23895 -9330 8612 70246 98652 41463 -1689 14626 -13740 -12025 9097 -24421
12604 -24421 -120158 -91946 -15231 2197 -35094 -89348 -49856 -33472 -39186 -37554 -13027 3701
12592 3701 8210 -16122 -37911 -26037 -42280 -37263 10778 59069 19503 -13734 40135 136299
12580 136299 104462 24175 -25442 -54081 -68611 -14015 41445 6838 -30145 -46949 -57373
12569 -57373 -18926 223 -9391 -59195 -60377 -31759 -19230 -9497 -14732 -75510 -130025 -105712
12557 -105712 29 106213 86305 20056 10912 51160 40882 -52677 -93009 -76506 -69787
12546 -69787 -10455 6062 -6704 46973 72625 4932 46241 83674 45117 24081 16146 17393
$$ packed form
12629D3262o9011m8700J9748R849L4215m555L5848M1240p77o0628q877j1046J2891
12616f541j7354J4565J7942O1634K8406n7189m3152J6315k8366J715K1122l3518
12604b4421r5737K8212P6715J7428l7291n4254L9492J6384n714J632K4527J6728
12592C701M509k4332k1789J1874j6243N017M8041M8291l9566l3237N3869R6164
12580A36299l1837q0287m9617k8639j4530N4596N5460l4607l6983j6804j0424
12569e7373L8447J9149r614m9804j182K8618J2529R733n235o0778n4515K4313
12557a05712J05741J06184j9908o6249r144M0248j0278r3559m0332J6503O719
12546f9787N9332J6517j2766N3677K5652o7693M1309L7433l8557k1036p935J247
$$ plain form
12534 17393 3287 19630 63038 116907 129231 101619 77411 97149 102942 49173 11047 10427
12522 10427 -6768 -30869 -90897 -87004 -15901 -41564 -114528 -97594 -35652 12581 40341 60122
12510 60122 33771 2152 38144 51303 66758 45063 43915 26242 14684 -13853 32402 35528
12498 35528 -29713 -43063 -60143 -21330 22502 37748 33460 61912 341 -64615 -44510 -54885
12486 -54885 -39377 -22487 26687 43934 16696 13377 -48979 -55506 -50499 -28522 -74261 -128889
12474 -128889 -126095 -62368 37268 77717 39509 47272 45378 2843 -23642 -9371 -64626 -80213
12462 -80213 -48485 -41222 -75757 -99660 -57867 59311 74333 10848 -68426 -62799 -42988 -30024
12450 -30024 -34233 -62241 -54919 -55290 -63869 -41024 -25352 904 13475 38076 -16141 33236 83729
$$ packed form
12534A7393j4106J6343M3408N3869J2324k7612k4208J9738N793n3769l8126o20
12522A0427j7195k4101o0028L893P1103k5663p2964J6934O1942M8233K7760J9781
12510F0122k6351l1619L5992J3159J5455k1695j148j7673j1558k8537M6255L126
12498C5528o5241j3350j7080L8813M3832J5246m288K8452o1571o4956K0105j0375
12486e4885J5508J6890M9174J7247k7238l319o2356o527N007K1977m5739n4628
12474a28889K794O3727R9636M0449l8208P763j894m2535k6485J4271n5255j5587
12462h0213L1728P263l4535k3903M1793J17178J5022o3485p9274N627J9811J2964
12450c0024m209k8008P322l71q579K2845J5672K6256J2571K4601n4217M9377N0493
$$ plain form
12437 83729 68309 50641 26456 -896 46034 32033 34136 64200 36023 5166 -20290 51742
12425 51742 54800 62194 108065 155862 99721 41790 -14629 -40658 -82050 -65996 -40103 -18529
12413 -18529 10593 36520 86816 133128 132447 85769 96333 170776 113977 71622 87185 23275
12401 23275 -32307 -55617 -22254 15026 30111 86898 121389 9475 -42907 57849 111658
12390 111658 61214 77594 63380 113313 83596 31206 8103 61869 154041 156477 100779 106260
12378 106260 95257 91656 97245 100444 40209 1358 13733 23069 10998 45591 65017 91627
12366 91627 99736 69269 -23104 -88087 -77909 -35442 -19211 -6325 36519 57924 64341 57002
12354 57002 54792 48891 26607 69880 68942 -29451 -52849 -10131 27297 64202 65113 70885 7947
$$ packed form
12437H3729j5420j7668k4185k7352M6930j4001K103L0064k8177l0857k5456P2032
12425E1742L058P394M5871M7797n6141n7931n6419k6029m1392J6054K5893K1574
12413a8529K9122K5927N0296M6312o81m6678J0564P4443n6799m2355J5563o3910
12401B3275n5582k3310L3363L7280J5085N6787L4491j11914n2382J00756N3809
12390A11658n0444J6380j4214M9933k9717n2390k3103N3766R2172K436n5698N481
12378A06260j1003l601N589L199o0235l8851J2375R336j2071L4593J9426K6610
12366I1627Q109l0467r2373o4983J0178M2467J6231J2886M2844K1405O417p339
12354E7002k210n901k2284M3273r38r8393k3398M2718L7428L6905R11N772o2938
$$ plain form
12341 7947 -68304 -81234 -50922 -41966 -10496 7472 -8422 2021 18451 71172 82976 -8955
12329 -8955 -48482 -6636 -1672 -39440 -44091 -21571 -12056 7376 -26098 -43997 31377 81166
12317 81166 93445 42454 29517 94035 92059 42955 -12295 -49521 -26423 46073 86425 48533
12305 48533 14084 14635 56062 103182 145879 197873 221505 191884 158862 155973 171853 163458
12293 163458 199987 216871 191992 187267 205889 135272 96882 64718 33950 3007 89706 158176
12281 158176 156594 126114 56784 57687 65316 28269 28727 75654 106024 89265 39733 96385 112038
12268 112038 113347 118781 148343 227346 274213 241270 227601 251845 328696 366825 399290 410175
12256 410175 406120 409464 414662 405157 459709 600867 618929 653950 626601 605085 535824 464379
$$ packed form
12341G947p6251j2930L0312Q956L1470J7968j5894J0443J6430N2721J1804r1931
12329h955l9527M1846M964l7768m651K2520R515J9432l3474j7899P5374M9789
12317H1166J2279n0991j2937O4518j976m9104n5250l7226K3098P2496M0352l7892
12305D8533l4449N51M1427M7120M2697N1994K3632k9621l3022k889J5880q395
12293A63458L6529J6884k4879m725J8622p0617l8390l2164l0768l0943Q6699O8470
12281A58176j582l0480o9330R03P629l7047M58M6927L0370j6759m9532N6652J5653
12268A12038J309N434K9562P9003M6867l2943j3669K4244P6851L8129L2465J0885
12256D10175m055L344N198r505N4552J41158J8062L5021k7349k1516o9261p1445
$$ plain form
12244 464379 392926 322828 274689 292085 303206 285208 276612 227329 241413 227315 137157 126609
12232 126609 69172 15434 6084 26058 56728 60659 156222 186993 230321 236756 242136 305307
12220 305307 365113 415518 442980 469866 581923 655475 699920 636394 574641 587917 567207
12209 567207 548513 548135 601754 699111 718454 692808 722255 730395 638380 521965 458498 423119
12197 423119 350084 322382 340906 281339 199305 103848 113421 117244 128243 174350 172249 150279
12185 150279 115843 74147 135620 181369 195661 213102 99213 14904 45523 96605 162114
12174 162114 243106 333077 394230 477026 543852 550965 633063 660805 599811 538767 436766
12163 436766 338661 337459 348745 357957 368217 331520 287435 288533 325698 299241 259864 207429
$$ packed form
12244D64379p1453p0098m8139J7396J1121j7998q596m9283J4084j4098r0158j0548
12232A26609n7437n3738r350J9974L0670L931R5563L0771M3328O435N380O3171
12220C05307N9806N0405K7462K6886J12057P3552M4445o3526o1753J3276k0710
12209E67207j8694l78N3619R7357J9343k5646K9447Q140r2015j16415o3467l5379
12197D23119p3035k7702J8524n9567q2034r5457R573L823J0999M6107k101k1970
12185A50279l4436m1696O1473M5749J4292J7441j13889q4309L0619N1082O5509
12174A62114Q0992Q9971O1153Q2796O6826P113Q2098K7742o0994o1044j02001
12163D36766r8105j202J1286R212J0260l6697m4085J098L7165k6457l9377n2435
$$ plain form
12151 207429 176077 129197 144814 113933 80592 80548 79262 135766 192015 169674 124541 101856
12139 101856 82933 90445 107015 66563 45734 82959 133680 151884 107505 87362 151281 178091
12127 178091 150757 125498 114008 117270 110989 121939 193398 254719 222697 229421 201906 154584
12115 154584 115728 88039 56561 56333 49321 -2777 6066 3738 -22733 -55491 -8886 72799
12103 72799 82764 45547 67830 116083 104471 106517 59844 39118 89963 80322 7860 -12812
12091 -12812 47124 49378 -37877 -92622 -13153 35023 43378 18224 -60288 -82552 -78756 -40771
12079 -40771 24475 41208 40198 -11731 -58391 -82824 -14498 -29333 -34280 15593 51935 44338
12067 44338 29383 3604 22501 37811 18607 67642 132276 182960 135713 67859 34393 64646
$$ packed form
12151B07429l1352m6880J5617l0881l3341m4j286N6504N6249k2341m5133k2685
12139A01856j8923P512J6570m0452k0829L7225N0721J8204m4379k0143O3919K6810
12127A78091k7334k5259j1490L262o281J0950P1459O1321l2022O724k7515m7322
12115A54584l8856k7689l1478k28p012n2098Q843k328k6471l2758M6605Q1685
12103G2799R965l7217K2283M8253j1612K046m6673k0726N0845r641p2462k0672
12091a2812N9936K254q7255n4745P9469M8176Q355k5154p8512k2264L796L7985
12079d0771O5246J6733j010n1929m6660k4433O8326j4835m947M9873L6342p597
12067D4338j4955k5779J8897J5310j9204M9035O4634N0684m7247o7854l3466L0253
$$ plain form
12055 64646 18676 -19104 -19568 -63920 -65713 -20762 971 -29101 -31072 27946 22127 -35776 -17547
12042 -17547 5560 -26459 -46546 -2808 -8592 -6011 26276 72327 30905 -23924 -79253 -52716
12030 -52716 -5083 11493 40414 94553 151294 139276 109576 106471 49251 -12819 -13070 -17329
12018 -17329 -41391 -66820 -117539 -144330 -119178 -125330 -103978 -100379 -53034 -28838 -15281 -8383
12006 -8383 -19230 -75028 -43372 28248 13531 15186 104 25521 7774 82212 123531 94197
11994 94197 12761 10749 25692 -17500 -29553 -46466 -19784 -27466 -90659 -89727 -38482 3638
11982 3638 58333 10203 -36295 -51096 -40520 -27773 -42754 -38447 -55899 -42044 -130264 -132270
11970 -132270 -79721 -36656 -20784 7069 16733 39366 54008 55721 38107 38142 10351 -20477
$$ packed form
12055F4646m5970l7780m64m4352j793M4951K1733l0072j971N9018n819n7903J8229
12042a7547K3107l2019k0087M3738n784K581L2287M6051m1422n4829n5329K6537
12030e2716M7633J6576K8921N4139N6741j2018k9700l105n7220o2070k51m259
12018a7329k4062k5429n0719k6791K5152o152K1352L599M7345K4196J3557O898
12006h383j0847n5798L1656P1620j4717J655j5082K5417j7747P4438M1319k9334
11994I4197q1436k012J4943m3192j2053j6913K6682p682o3193R32N1245M2120
11982C638N4695m8130m6498j4801J0576J2747j4981M307j7452J3855q8220k006
11970a32270N2549M3065J5872K7853R664K2633J4642J713j7614L5k7791l0828
$$ plain form
11958 -20477 -894 95277 111534 55750 106481 82764 89744 79117 90867 50814 26689 -11643
11946 -11643 5650 22054 -43949 -52167 -22682 -8015 -18453 -45053 -61892 -88010 -77743 -54565
11934 -54565 -51980 -82684 -92562 -87786 -94773 -92459 -40624 -54857 -89900 -76699 -100576 -81974 -75661
11921 -75661 -44641 -56497 1650 26431 50643 43221 56819 48105 7884 9323 26513 31196
11909 31196 -20101 -4785 50376 72227 128076 82799 -24062 -86465 -87396 -76975 -74987 -57281
11897 -57281 -29989 7885 -4105 -4895 -7646 -50543 -23046 -14012 -39954 -44748 -51349 -49952 -84065
11884 -84065 -23200 -5307 -34045 -23945 -26395 -16018 -30962 -40580 -34551 8744 64510 74092
11872 74092 89523 109789 102995 48928 -24635 -21269 -11591 12943 -28941 -59617 -31892 -5140
$$ packed form
11958b0477J9583R6171J6257n5784N0731k3717O980j0627J1750m0053k4125l8332
11946a1643J7293J6404o6003q218K9485J4667j0438k6600j6839k6118J0267K3178
11934e4565K585l0704r878M776o987K314N1835j4233l5043J3201k3877J8602O313
11921g5661L1020j1856N8147K4781K4212p422J3598q714m0221J439J7190M683
11909C1196n1297J5316N5161K1851N5849m5277j06861o2403r31J0421J988J7706
11897e7281K7292L7874j1990p90k751m2897K7497R034k5942m794o601J397l4113
11884h4065O0865J7893k8738J0100k450J0377j4944r618O029M3295N5766R582
11872G4092J5431K0266o794n4067p3563L366R678K4534m1884l0676K7725K6752
$$ plain form
11860 -5140 -16990 11435 27203 24290 51744 29566 37771 -3317 -8660 -11169 -48051 -57239 -11501
11847 -11501 64122 72910 116793 85077 -23932 -3232 30435 -18541 -57271 -61420 -22936 24823
11835 24823 39569 48194 61533 14981 7778 3557 -33966 -28066 -8989 15467 43894 65950
11823 65950 99493 49992 40530 40995 39101 12801 -28364 17562 21142 -10235 1893 59147 73714
11810 73714 123172 139508 152022 118161 60687 37366 27108 30301 3596 -16490 21788 84840
11798 84840 106268 93421 128811 129344 29210 6747 51397 93240 107384 54258 69369 71118
11786 71118 48530 -17218 -56300 -44255 16017 39880 46708 113085 117957 37194 41714 3081
11774 3081 15896 46083 91685 68396 47564 65370 111048 142994 179034 171408 119688 58688
$$ packed form
11860e140j1850K8425J5768k913K7454k2178Q205m1088n343k509l6882r188M5738
11847a1501P5623Q788M3883l1716j09009K0700L3667m8976l8730m149L8484M7759
11835B4823J4746Q625J3339m6552p203m221l7523N900J9077K4456K8427K2056
11823F5950L3543m9501r462M65j894k6300m1165M5926L580l1377J2128N7254J4567
11810G3714M9458J6336J2514l3861n7474k3321j0258L193k6705k0086L8278O3052
11798H4840K1428j2847L5390N33j00134k2463M4650M1843J4144n3126J5111J749
11786G1118k2588o5748l9082J2045O0272K3863O828O6377M872q0763M520l8633
11774C081J2815L0187M5602k3289k0832J7806M5678L1946L6040p626n1720o1000
$$ plain form
11762 58688 11436 -48765 -4444 34762 -24535 -52279 32053 88784 84870 100962 122927 83941
11750 83941 70083 91045 131892 110872 86324 124855 149743 110107 49462 -397 2657 26891
11738 26891 33635 49035 54633 62434 104255 82980 56716 49716 60058 82564 35383 19679
11726 19679 86672 125241 153251 157099 86251 71434 85902 103292 52750 63980 36617 4686
11714 4686 18910 84409 119011 116069 44239 29351 51356 55790 55163 37613 47191 16068 34912
11701 34912 24990 -2479 -15802 33915 69931 87235 73098 51341 93255 56363 32966 23061
11689 23061 40705 63642 32864 13225 77068 133926 94650 59112 31567 27662 11600 38398
11677 38398 64961 67980 49265 41803 77787 90393 47079 36392 54384 49539 35557 21946
$$ packed form
11762E8688m7252o0201M4321L9206n9297k7744Q4332N6731l914J6092K1965l8986
11750H3941j3858K0962M0847k1020k4548L8531K4888l9636o0645m9859L054K4234
11738B6891O744J5400N598P801M1821k1275k6264p000J0342K2506m7181j5704
11726A9679O6993L8569K8010L848p0848j4817J4468J7390n0542J1230k7363l1931
11714D686J4224O5499L4602k942p1830j4888K2005M434o27j7550R578l1123J8844
11701C4912r922k7469j3323M9717L6016J7304j4137k1757M1914l6892k3397r905
11689B3061J7644K2937l0778j9639O3843N6858l9276l5538k7545l905j6062K6798
11677C8398K6563L019j8715p462L5984J2606m3314j0687J7992m845j3982j3611
$$ plain form
11665 21946 14897 -13124 -73433 -71653 -20284 -8475 17874 1884 -49070 -55488 -10361 67050
11653 67050 112130 76495 63479 69570 16462 51042 76278 56455 18620 31282 32727 -23592
11641 -23592 -24127 36499 21049 57730 70229 35139 43492 46981 73958 113642 96332 31989
11629 31989 -46572 -7165 13641 88397 82344 58822 -7411 1326 22160 82971 53730 -1813
11617 -1813 16398 66869 59735 75883 79751 76550 52415 58572 55772 66871 111783 158376 138645
11604 138645 156090 197119 216926 230914 181754 114128 106480 112108 179680 229171 269177 300850
11592 300850 368286 399313 457088 542356 574855 612085 599700 576291 597154 640535 585657
11581 585657 578446 588053 668806 707628 635921 611390 548345 429238 373722 357707 349794 272276
$$ packed form
11665B1946p049k8021o0309J780N1369J1809K6349j5990n0954o418M5127P7411
11653F7050M5080l5635j3016O091n3108L4580K5236j9823l7835J2662J445n6319
11641b3592n35O0626j5450L6681J2499l5090Q353L489K6977L9684j7310o4343
11629C1989p8561L9407K0806P4756o053k3522o6233Q737K0834O0811k9241n5543
11617a813J8211N0471p134J6148L868l201k4135O157k800J1099M4912M6593j9731
11604A38645J7445M1029J9807J3988m9160o7626p648N628O7572M9491M0006L1673
11592C00850O7436L1027N7775Q5268L2499L7230j2385k3409K0863M3381n4878
11581E85657p211R607Q0753L8822p1707k4531o3045j19107n5516j6015p913p7518
$$ plain form
11569 272276 251293 237680 198852 234674 216466 156130 175436 183444 118293 91301 106504 151719
11557 151719 196573 185002 201507 222555 211383 149112 147763 191768 160597 139820 194890 182412
11545 182412 52498 -39243 -38811 23128 80873 73811 78935 88051 108840 77259 20299 82127
11533 82127 158281 172426 167338 119312 57779 21671 94941 149796 163845 155984 125569 125969
11521 125969 88056 54511 60035 25930 23584 37743 14612 40025 43211 101115 119799 85801
11509 85801 48736 37113 2994 9524 61407 49969 56243 79069 26599 26032 12346 39130
11497 39130 106733 56686 28781 101281 97862 118758 66075 3695 5717 -7268 7139 19537
11485 19537 42567 44167 -3774 -21504 16572 67137 75553 82922 131785 97891 94607 37028
$$ packed form
11569B72276k0983j3613l8828L5822j8208o0336J9306Q008o5151k6992J5203M5215
11557A51719M4854j1571J6505K1048j1172o2271j349M4005l1171k0777N5070j2478
11545A82412j29914r1741M32O1939N7745p062N124R116K0789l1581n6960O1828
11533H2127P6154J4145n088m8026o1533l6108P3270N4855J4049p861l0415M00
11521A25969l7913l3545N524l4105k346J4159k3131K5413L186N7904J8684l3998
11509H5801l7065j1623l4119O530N1883j1438O274K2826n2470n67j3686K6784
11497C9130O7603n0047k7905P2500l419K0896n2683o2380K022j2985J4407J2398
11485A9537K3030J600m7941j7730L8076N0565Q416P369M8863l3894l284n7579
$$ plain form
11473 37028 13824 30067 -16032 -61113 1088 3000 45548 115561 141663 126368 112719 82601
11461 82601 32014 4064 74274 108155 113579 104201 77141 4904 20918 69858 84391 50724
11449 50724 13346 18971 86008 158866 91550 83710 83898 5922 -26506 32134 38360 64552 60357
11436 60357 97181 138069 136633 189101 206455 229950 230411 221101 206480 195508 157292 177218
11424 177218 116195 60623 -3192 -22568 -2991 40510 39176 25375 56988 59738 66873 90709
11412 90709 92756 132723 144773 77735 19347 53169 81758 91279 138729 109432 128906 127534
11400 127534 120069 102330 78252 153940 178002 119159 79686 28408 38108 61023 74604 31825
11388 31825 54520 22364 24009 100593 111276 69756 48839 81619 23654 64133 130038 150609
$$ packed form
11473C7028k3204J6243m6099m5081O2201J912M2548P0013K6102j5295j3649l0118
11461H2601n0587k7950P0210L3881N424r378k7060p2237J6014M8940J4533l3667
11449E0724l7378N625O7037P2858o7316p840J88p7976l2428N8640O226K6192m195
11436F0357L6824M0888j436N2468J7354K3495M61r310j4621j0972l8216J9926
11424A77218o1023n5572o3815j9376J9577M3501j334j3801L1613K750P135K3836
11412I0709K047L9967J2050o7038n8388L3822K8589R521M7450k9297J9474j372
11400A27534p465j7739k4078P5688K4062n8843l9473n1278R700K2915J3581m2779
11388C1825K2695l2156J645P6584J0683m1520k0917L2780n7965M0479O5905K0571
$$ plain form
11376 150609 194977 209945 180794 118034 97295 133988 167236 157913 165557 162430 142187 195703
11364 195703 188970 227089 289903 330044 360427 370406 369684 396996 424790 452630 519704 543881
11352 543881 581559 579183 553991 641726 604561 551854 619251 643205 648292 639891 571337 467709
11340 467709 433944 452592 410594 372777 347419 322755 340054 290321 285047 251221 199595 209644
11328 209644 193203 138326 142258 183933 179596 196232 189150 199106 236195 182016 90258 107013
11316 107013 115112 116137 55261 32708 72329 107051 144257 114077 92831 109214 88291 82227
11304 82227 119538 160966 136467 115657 139903 97256 107571 170237 219838 241805 201449 173550
11292 173550 163684 113284 92404 150221 80184 5878 13269 6039 41786 75104 122594 118120
$$ packed form
11376A50609M4368J4968k9151o2760k0739L6693L3248r323P644l127k0243N3516
11364A95703o733L8119O2814M0141L0383R979p22K7312K7794K7840O7074K4177
11352E43881L7678k376k5192Q7735l7165n2707O7397K3954N087q401o8554j03628
11340D67709l3765J8648m1998l7817k5358k4664J7299m9733n274l3826n1626J0049
11328B09644j6441n4877L932M1675m337J6636p082R956L7089n4179r1758J6755
11316A07013Q099J025o0876k2553L9621L4722L7206l0180k1246J6383k0923o064
11304H2227L7311M1428k4499k0810K4246m2647J0315O2666M9601K1967m0356k7899
11292A73550r866n0400k0880N7817p0037p4306P391p230L5747L3318M7490m474
$$ plain form
11280 118120 61562 62145 11035 10266 61296 99343 128661 102275 32752 -7402 28233 76234
11268 76234 113444 62474 3653 30511 66864 44316 47608 38110 16830 25151 40281 42820
11256 42820 79190 95685 95539 56472 107230 103382 78978 99572 128429 133789 107452 106763 74932
11243 74932 -193 21204 7154 1043 24278 86075 88178 125888 163307 117429 78521 75084
11231 75084 77782 124401 141354 115887 57027 40418 63756 127684 170333 120404 49341 70664
11219 70664 106382 143419 163193 111581 99697 67031 77944 134314 138807 70441 69086 87729
11207 87729 84212 51188 32237 6292 -37195 -32625 -20611 39985 70915 60813 71312 61210
11195 61210 31254 33370 58607 52954 -30601 -40700 14304 59797 33003 42069 137676 152875
$$ packed form
11280A18120n6558N83n1110p69N1030L8047K9318k6386o9523m0154L5635M8001
11268G6234L7210n0970n8821K6858L6353k2548L292r498k1280Q321J5130K539
11256D2820L6370J6495j46l9067N0758l848k4404K0594K8857N360k6337o89l1831
11243G4932p5125K1397j4050o111K3235O1797K103L7710L7419m5878l8908l437
11231G5084K698M6619J6953k5467n8860j6609K3338O3928M2649m9929p1063K1323
11219G0664L5718L7037J9774n1612j1884l2666J0913N6370M493o8366j355J8643
11207H7729l517l3024j8951k5945m3487M570J2014O0596L0930j0102J0499j0102
11195F1210k9956K116K5237n653q3555j0099N5004M5493k6794R066R5607J5199
$$ plain form
11183 152875 135465 93186 99964 87784 15432 -55737 -52839 -45561 -39696 -58423 -49956 -33274
11171 -33274 13519 21194 55424 94018 98964 16534 -7058 -17998 -21211 6299 72058 30596
11159 30596 -2082 -8685 57630 68602 88542 102182 102213 122319 153371 120429 73473 44610
11147 44610 19116 22213 25949 190 12973 70469 49330 83070 91273 27426 37628 76611
11135 76611 111616 93641 65796 99534 130362 94713 92650 26368 35712 54298 26559 48030
11123 48030 73890 44738 28481 81690 106435 95708 44740 65259 93379 100062 79953 103337
11111 103337 39286 -1979 14414 24861 -24445 25154 116076 134513 107190 11721 6559 10955
11099 10955 16865 36594 79649 60484 39500 40704 55693 35675 37162 24577 -13202 74436
$$ packed form
11183A52875j7410m2279O778j2180p2352p1169K898P278N865j8727Q467J6682
11171c3274M6793P675L4230L8594M946q2430k3592j0940l213K7510O5759m1462
11159C0596l2678o603O6315J0972J9940J3640L1K0106L1052l2942m6956k8863
11147D4610k5494L097L736k5759J2783N7496k1139L3740Q203o3847J0202L8983
11135G6611L5005j7975k7845L3738L0828l5649k063o6282R344J8586k7739K1471
11123D8030K5860k9152j6257N3209K4745j0727n0968K0519K8120O683k0109K3384
11111A03337o4051m1265J6393J0447m9306M9599R0922J8437k7323r5469n162M396
11099A0955N910J9729M3055j9165k0984J204J4989k0018J487j2585l7779Q7638
$$ plain form
11087 74436 120797 80340 16225 26336 38188 67575 100677 102314 67086 86034 104303 52387
11075 52387 87252 99493 87654 22637 -62156 -11881 58180 68525 48775 53549 77431 54924
11063 54924 97968 130684 80454 32283 7395 71061 110988 108396 153270 114957 128132 79541
11051 79541 7657 8942 24466 -27385 -32387 55910 95175 78304 62583 138723 146307 98955
11039 98955 46026 57585 131432 186341 205929 224293 253990 205218 194751 200718 177414 167367
11027 167367 111752 93416 92678 83499 43926 -9391 -22265 8685 64665 56911 122696 221340
11015 221340 243591 152912 76758 56689 81281 104396 119877 130893 55942 40741 102112
11004 102112 144079 188317 192985 182249 164883 190139 214867 290649 287173 314071 379439 471605
$$ packed form
11087G4436M6361m0457o4115J0111J1852K9387L3102J637l5228J8948J8269n1916
11075E2387L4865J2241j1839o5017q4793N0275P0061J0345j9750M774K3882k2507
11063E4924M3044L2716n0230m8171k4888O3666L9927k592M4874l8313J3175m8591
11051G9541p1884J285J5524n1851n002Q8297L9265j6871j5721P6140P584m7352
11039I8955n2929J1559P3847N4909J9588J8364K9697m8772j0467N967k3304j0047
11027A67367n5615j8336p38r179l9573n3317j2874L0950N5980p754O5785R8644
11015B21340K2251r0679p6154k0069K4592K3115J5481J1016p4951j5201O1371
11004A02112M1967M4238M668j0736j7366K5256K4728P5782l476K6898O5368R2166
$$ plain form
10992 471605 593069 798360 1040223 1417148 1913320 2515257 3050703 3181175 2825818 2101491
10982 2101491 1476136 1097843 846735 727517 632982 524125 441365 344448 314594 325488
10972 325488 262263 261059 231858 253580 216276 153360 128587 183093 242427 251497 272290 294010
10960 294010 322028 358267 293130 246637 237816 162616 111410 86052 111220 156398 161526 137812
10948 137812 86994 62508 123552 147206 134269 126210 90848 159875 238508 215912 201273 189381
10936 189381 149090 119154 106139 106157 73993 40164 74547 123128 193805 216989 164575 152363
10924 152363 107766 113682 170932 165922 143017 169467 190751 253545 225462 169068 111258 176240
10912 176240 205762 192146 174191 180455 170189 163161 156071 117910 145043 153907 183987 176358
$$ packed form
10992D71605J21464K05291K41863L76925M96172O01937N35446J30472l55357p24327
10982B101491o25355l78293k51108j19218r4535j08857q2760r6917k9854J0894
10972C25488o3225j204k9201K1722l7304o2916k4773N4506N9334R070K0793K1720
10960B94010K8018L6239o5137m6493q821p5200n1206k5358K5168M5178N128k3714
10948A37812n0818k4486O1044K3654j2937q059l5362O9027P8633k2596j4639j1892
10936A89381m0291k9936j3015J8l2164l3829L4383M8581P0677K3184n2414j2212
10924A52363m4597N916N7250n010k2905K6450K1284O2794k8083n6394n7810O4982
10912A76240K9522j3616j7955O264j0266p028p090l8161K7133Q864L0080p629
$$ plain form
10900 176358 93136 125745 121761 69173 113073 108101 70166 38066 31577 69742 18611 3686
10888 3686 48792 101731 71995 28797 11372 20147 21394 18734 21894 72794 105796 165428 213278
10875 213278 267224 263101 198419 166203 222683 221936 172420 191827 203835 240837 253379 251615
10863 251615 286139 322912 298505 229391 189626 216037 161820 84840 85582 131544 132765 91899
10851 91899 96068 71403 47575 65302 127596 151040 160344 142209 108528 119158 124588 170236
10839 170236 172906 180907 204866 179238 233768 384391 467138 570652 650825 699164 772069
10828 772069 824650 730640 572142 459295 391591 373602 335148 280112 272779 253614 200953
10817 200953 205758 263938 309448 354154 352730 335304 298392 219888 245421 324735 352975 358085
$$ packed form
10900A76358q3222L2609l984n2588M3900m972l7935l2100o489L8165n1131j4925
10888C686M5106N2939k9736m3198j7425Q775J247k660L160N0900L3002N9632M7850
10875B13278N3946m123o4682l2216N6480p47m9516J9407J2008L7002J2542j764
10863B51615L4524L6773k4407o9114l9765K6411n4217p6980P42M5962J221m0866
10851I1899M169k4665k3828J7727O2294K3444R304j8135l3681J0630N430M5648
10839A70236K670Q001K3959k5628N4530J50623Q2747J03514Q0173M8339P2905
10828G72069N2581r4010j58498j12847o7704j7989l8454n5036p333j9165n2661
10817B00953M805N8180M5510M4706j424j7426l6912p8504K5533P9314K8240N110
$$ plain form
10805 358085 283288 254387 288773 316816 328750 322681 298721 305844 351746 270610 239961 240123
10793 240123 251044 268530 293597 286151 235121 206472 258001 274748 317594 377341 399902 401388
10781 401388 385042 386004 429040 444843 452192 437786 371703 325345 297944 310006 330808 330977
10769 330977 351230 368136 359643 398466 356103 284762 263443 203989 186956 196386 254512 329447
10757 329447 292181 282728 303815 343034 373174 386882 379656 283171 250918 230810 232689 301269
10745 301269 397566 441865 442472 451226 425837 358977 321715 278152 314930 357940 371033 420404
10733 420404 449505 423813 387494 397961 409136 393491 364019 348150 325101 365301 407161
10722 407161 458372 475941 452891 427149 386215 403022 433077 439687 495546 530921 534039 480755
$$ packed form
10805C58085p4797k8901L4386K8043J1934o069k3960P123M5902q1136l0649J62
10793B40123J0921J7486K5067p446n1030k8649N1529J6747M2846N9747K2561J486
10781D01388j6346R62M3036J5803P349j4406o6083m6358k7401J2062K0802J69
10769C30977K0253J6906q493L8823m2363p1341k1319n9454j7033R430N8126P4935
10757C29447l7266r453K1087L9219L0140J3708p226r6485l2253k0108J879O8580
10745C01269R6297M4299O07Q754k5389o6860l7262m3563L6778M3010J3093M9371
10733D20404K9101k5692l6319J0467J1175j5645k9472j5869k3049M0200M1860
10722D07161N1211J7569k3050k5742m0934J6807L0055O610N5859L5375L118n3284
$$ plain form
10710 480755 508939 537759 510562 530256 628048 730442 781533 851390 936276 972719 921077
10699 921077 762325 730625 683937 608054 589130 571043 537775 498524 549663 622827 622795 571104
10687 571104 562223 557733 656539 649293 632157 631086 585440 537812 597209 694615 748893 787621
10675 787621 796818 770396 811431 874901 890883 929342 896546 863928 870879 915188 886799 881494
10663 881494 869504 869619 850389 848226 848717 850964 849325 878276 903543 891055 933095 975085 1025294
10650 1025294 1022898 1030302 1077866 1066763 1092930 1173436 1242211 1296344 1346301 1378170 1431987 1482509
10638 1482509 1514103 1589982 1592440 1568885 1620321 1684117 1696265 1707935 1749087 1821943 1929894
10627 1929894 2013133 2019904 2159223 2270480 2283549 2307887 2390369 2519472 2694312 2793793 2927498
$$ packed form
10710D80755K8184K8820k7197J9694R7792J02394N1091O9857Q4886L6443n1642
10699I21077j58752l1700m6688p5883j8924j8087l3268l9251N1139P3164l2n1691
10687E71104q881m490R8806p246j7136j071m5646m7628N9397R7406N4278L8728
10675G87621R197k6422M1035O3470J5982L8459l2796l2618O951M4309k8389n305
10663H81494j1990J15j9230k163M91K247j639K8951K5267j2488M2040M1990N0209
10650A025294k396P404M7564j1103K6167Q0506O8775N4133M9957L1869N3817N0522
10638A482509L1594P5879K458k3555N1436O3796J2148J1670M1152P2856J07951
10627A929894Q3239O771J39319J11257J3069K4338Q2482J29103J74840R9481J33705
$$ plain form
10616 2927498 3058392 3153604 3287631 3433996 3652105 3957254 4176605 4449876 4788431 5176342
10606 5176342 5455901 5777285 6198656 6855739 7682610 8640520 9762634 10809434 11616143
10597 11616143 12065391 12177284 12460227 13109627 14187623 15621892 17390778 19585682 22272603
10588 22272603 25574941 29906254 35550568 43064552 53463491 68457695 91361647 128440370
10580 128440370 188166499 277362819 393069992 508354734 582319165 576099191 467061233
10573 467061233 315690065 208385201 145278224 107871390 84597470 68898713 57465765
10566 57465765 48878596 42156902 36475868 31711269 27973127 25206657 23136302 21533376
10558 21533376 20278740 19267070 18675002 18510847 18740870 19340083 20133830 20833207 21179025
$$ packed form
10616B927498J30894R5212J34027J46365K18109L05149K19351K73271L38555L87911
10606E176342K79559L21384M21371O57083Q26871R57910J122114J046800Q06709
10597A1616143M49248J11893K82943O49400J077996J434269J768886K194904K686921
10588B2272603L302338M331313N644314P513984J0398939J4994204K2903952L7078723
10580A28440370N9726129Q9196320J15707173J15284742P3964431o219974j09037958
10573D67061233j51371168j07304864o3106977l7406834k3273920j5698757j1432948
10566E7465765q587169o721694n681034m764599l738142k766470k070355j602926
10558B1533376j254636j011670n92068j64155K30023N99213P93747O99377L45818
$$ plain form
10549 21179025 20897666 19934059 18146506 16078055 14554624 13519426 12831042 12161363 11361131
10540 11361131 10437264 9645731 9047125 8466825 7956628 7527945 7145392 6884314 6713602
10531 6713602 6621156 6505544 6261562 5971703 5655441 5403301 5140497 4815229 4573025 4388276
10521 4388276 4238501 4040201 3899948 3829800 3695290 3505812 3310636 3151913 2996696 2848152
10511 2848152 2766886 2704001 2624070 2513047 2466387 2445439 2442996 2353975 2246599 2162560 2084784
10500 2084784 2062396 2023295 1946799 1855853 1788793 1800479 1776276 1684449 1630955 1524733 1480144
10489 1480144 1411286 1390259 1411588 1379107 1285508 1278998 1300751 1187811 1090620 1000979 1000362 1026329
10477 1026329 988116 932040 917181 942760 997042 1007725 972917 978597 955339 866362 855586
$$ packed form
10549B1179025k81359r63607j787553k068451j523431j035198o88384o69679q00232
10540A1361131r23867p91533n98606n80300n10197m28683l82553k61078j70712
10531F713602r2446j15612k43982k89859l16262k52140k62804l25268k42204j84749
10521D388276j49775j98300j40253p0148j34510j89478j95176j58723j55217j48544
10511B848152q1266o2885p9931j11023m6660k0948k443q9021j07376q4039p7776
10500B084784k2388l9101p6496r0946o7060J1686k4203r1827n3494j06222m4589
10489A480144o8858k1027K1329l2481r3599o510K1753j12940r7191q9641o17K5967
10477A026329l8213n6076j4859K5579N4282J0683l4808N680k3258q8977j0776
$$ plain form
10466 855586 877234 854599 834561 823407 731235 647830 636374 596491 577866 536252 565336
10455 565336 597821 549553 579620 663127 842966 901755 895492 832918 733531 601826 586210
10444 586210 623641 597775 530635 454400 409112 405808 386993 329206 320362 264279 245289 155329
10432 155329 130153 202328 261947 313003 284256 231823 199116 244806 266126 300094 239113
10421 239113 154410 120710 127986 121722 135593 114294 95227 103265 112829 171122 166507 141341
10409 141341 117813 102656 136769 152168 132908 113749 79026 79706 35688 33776 86910 136022
10397 136022 183457 178420 95309 51867 36884 75857 72714 96377 80203 44563 11298 15915
10385 15915 44372 50275 64275 59988 72545 74448 74643 59107 12131 -36138 2599 17119 23504
$$ packed form
10466H55586K1648k2635k0038j1154r2172q3405j1456l9883j8625m1614K9084
10455E65336L2485m8268L0067Q3507J79839N8789o263o2574r9387j31705j5616
10444E86210L7431k5866o7140p6235m5288l304j8815n7787q844n6083j8990q9960
10432A55329k5176P2175N9619N1056k8747n2433l2707M5690K1320L3968o0981
10421B39113q4703l3700P276o264J3871k1299j9067Q038R564N8293m615k5166
10409A41341k3528j5157L4113J5399j9260j9159l4723O80m4018j912N3134M9112
10397A36022M7435n037q3111m3442j4983L8973l143K3663j6174l5640l3265M617
10385A5915K8457N903J4000m287J2557J903J95j5536m6976m8269L8737J4520O385
$$ plain form
10372 23504 37060 71233 -14176 -48274 -25202 7369 -35855 -23840 2766 2326 25571 29410
10360 29410 -27127 -51298 -59632 -90307 -64444 -35975 -100878 -179125 -195816 -158503 -122158 -121336
10348 -121336 -112092 -77332 -78824 -42251 -30589 -66309 -97263 -130489 -50474 10478 60146 66088
10336 66088 45795 -937 -43011 -20492 -47840 -26521 15973 17458 28959 -26752 -34749 -53334
10324 -53334 -24541 5986 44910 69476 38325 -52820 -105957 -111252 -95937 -112433 -91905 -46609
10312 -46609 -38422 -35429 5811 -15795 -55559 -44536 13331 10736 -39182 7239 30624 32416
10300 32416 72451 76461 50711 26893 -22169 -26996 -25832 -15805 -17664 -52530 -50566 -61336 -77424
10287 -77424 -77702 -118716 -99888 -120528 -82721 -69228 -108427 -102716 -40738 6122 -11450 -50381
$$ packed form
10372B3504J3556L4173q5409l4098K3072L2571m3224J2015K6606m40K3245L839
10360B9410n6537k4171q334l0675K5863K8469o4903p8247j6691L7313L6345Q22
10348a21336R244L4760j492L6573J1662l5720l0954l3226Q0015O0952M9668N942
10336F6088k0293m6732m2074K2519k7348K1319M2494J485J1501n5711p997j8585
10324e3334K8793L0527L8924K4566l1151r1145n3137n295J5315j6496K0528M5296
10312d6609Q187K993M1240k1606l9764J1023N7867k595m9918M6421K3385J792
10300C2416M0035M010k5750k3818m9062m827J164J0027j859l4866J964j0770j6088
10287g7424k78m1014J8828k0640L7807J3493l9199N711O1978M6860j7572l8931
$$ plain form
10275 -50381 -115233 -87634 -44224 -5560 31751 72882 117369 143294 146474 150447 117758 101606
10263 101606 49426 12338 66189 105850 79067 25339 36149 6325 19490 45086 77523
10252 77523 110535 73208 -5742 -22856 -12733 55146 37851 58 11209 21734 -30893 -74794
10240 -74794 -109214 -26383 57023 24877 -42575 -58613 -36772 42559 77269 49552 68820 2064
10228 2064 -51812 -86197 -81749 -64927 -78096 -76575 -74800 -60212 -30836 -42179 -58396 -77883
10216 -77883 -145203 -133294 -129837 -135511 -125468 -130491 -87855 -77004 -40748 -59699 -35524 -22070
10204 -22070 -1594 18442 16002 -11645 -18468 -24752 30186 29763 -27623 23386 30733 42343 48308
10191 48308 42428 11922 -25384 8512 10102 -6376 -21376 24634 72287 109424 56902 -16738
$$ packed form
10275e0381o4852K7599M3410L8664L7311M1131M4487K5925L180L973l2689j6152
10263A01606n2180l7088N3851L9661k6783n3728J0810k9824J3165K5596L2437
10252G7523L3012l7327p8950j7114J0123O7879j7295l7793J1151J0525n2627m3901
10240g4794l4420Q2831Q3406l2146o7452j6038K1841P9331L4710k7717J9268o6756
10228B064n3876l4385M448J6822j3169J521J775J4588K9376j1343j6217j9487
10216g7883o7320J1909L457n674J0043n023M2636J0851L6256j8951K4175J3454
10204b2070K0476K0036k440k7647o823o284N4938m23n7386N1009P347J1610N965
10191D8308n880l0506l7306L3896J590j6478j5000M6010M7653L7137n2522p3640
$$ plain form
10179 -16738 -32451 -26118 12716 75518 22034 -10003 25545 46456 110887 183168 217351 248387
10167 248387 380522 537887 860482 1349203 1897479 2440506 2871881 3007981 2733477 2021692
10157 2021692 1341442 931245 634459 454050 343473 278779 232493 239537 189477 96818
10147 96818 37622 76907 97076 98953 69507 56684 43570 14680 65168 89361 60032 40932
10135 40932 26183 53577 47034 31034 22439 25002 69068 53054 33364 19405 24034 40771
10123 40771 78474 69037 21343 17333 -21379 -9004 40155 60720 35272 36400 103643 119301
10111 119301 122488 101986 52543 4434 -26105 -89567 -68902 -67346 -125983 -116889 -107707 -124710
10099 -124710 -92926 -47589 -85576 -97353 -51610 -42049 -26454 -19987 -24119 -47762 -81339 -125771
$$ packed form
10179a6738j5713O333L8834O2802n3484l2037L5548K0911O4431P2281L4183L1036
10167B48387J32135J57365L22595M88721N48276N43027M31375J36100k74504p11785
10157B021692o80250m10197k96786j80409j10577o4694m6286P044n0060r2659
10147I6818n9196L9285K0169J877k9446j2823j3114k8890N0488K4193k9329j9100
10135D0932j4749K7394o543j6000q595K563M4066j6014j9690j3959M629J6737
10123D0771L7703r437m7694m010l8712J2375M9159K0565k5448J128O7243J5658
10111A19301L187k0502m9443m8109l0539o3462K0665J556n8637R094R182j7003
10099a24710L1784M5337l7987j1777M5743R561J5595O467m132k3643l3577m4432
$$ plain form
10087 -125771 -92488 6007 24646 68543 135665 173398 145555 142297 80582 -28290 -77097
10076 -77097 -47099 -14992 -50076 51 68613 47707 24777 36518 -30047 -10561 -28702 -86490
10064 -86490 -107087 -60197 -25702 33178 70914 67058 13773 2792 88982 107150 110847 117990
10052 117990 46000 -14508 -25414 -24977 -37003 7757 25048 9458 -5876 -7612 -1844 8217
10040 8217 49409 78116 52557 17814 -5056 -48954 -36858 -43484 7777 12360 31971 43190
10028 43190 46735 18583 32187 33931 1513 -48820 10227 49733 44562 48926 26158 17098 15181
10015 15181 -8152 -50607 -53442 -55608 13632 86458 152201 243002 353881 452301 469042 409536
10003 409536 337959 248397 176558 115266 88555 26434 27091 45227 28420 12688 -18090 -15374
$$ packed form
10087a25771L3283R8495J8639M3897O7122L7733k7843l258o1715j08872m8807
10076g7097K9998L2107l5084N0127O8562k0906k2930J1741o6565J9486j8141n7788
10064h6490k0597M6890L4495N8880L7736l856n3285j0981Q6190J8168L697P143
10052A17990p1990o0508j0906M37j2026M4760J7291j5590j5334j736N768J0061
10040H217M1192K8707k5559l4743k2870m3898J2096o626N1261M583J9611J1219
10028D3190L545k8152J3604J744l2418n0333N9047L9506n171M364k2768r060j917
10015A5181k3333m2455k835k166O9240P2826O5743R0801J10879R8420J6741n9506
10003D09536p1577q9562p1839o1292k6711o2121O57J8136j6807j5732l0778K716
$$ plain form
9991 -15374 36729 -3695 -34142 -23935 -4620 -35478 -90528 -108402 -63507 5924 14738 87507
9979 87507 92008 76284 78989 -9578 -85851 -80480 -60521 -43362 -12 -29897 347 -197 -7705
9966 -7705 13003 53375 137343 97410 57911 46611 -27491 -35613 15545 68366 122314 130087
9954 130087 173146 110998 120033 157165 135067 192600 372473 674671 933153 1124837 1272366
9943 1272366 1263327 1011743 712695 502758 421264 353704 229551 168607 134803 108124 44592
9932 44592 31535 19142 34625 38607 22789 17688 24746 74154 84836 84741 41806 12121 26734
9919 26734 46326 74536 101050 103006 29167 -81417 -62134 -10602 130 56587 58410 11981
9907 11981 -13818 -26857 2000 15495 -18860 -6389 76012 84707 105665 102833 85631 71305
$$ packed form
9991a5374N2103m0424l0447J0207J9315l0858n5050j7874M4895O9431Q814P2769
9979H7507M501j5724K705q8567p6273N371J9959J7159M3350k9885L0244n44p508
9966g705K0708M0372Q3968l9933l9499j1300p4102q122N1158N2821N3948P773
9954A30087M3059o2148R035L7132k2098N7533J79873L02198K58482J91684J47529
9943A272366r039k51584k99048k09937q1494o7560j24153o0944l3804k6679o3532
9932D4592j3057j2393J5483L982j5818n101P058M9408J0682r5m2935k9685J4613
9919B6734J9592K8210K6514J956p3839j10584J9283N1532J0732N6457J823m6429
9907A1981k5799j3039K8857J3495l4355J2471Q2401Q695K0958k832j7202j4326
$$ plain form
9895 71305 46620 50111 100245 137182 90762 112937 94498 -13591 -66508 -36841 -6535 -45724
9883 -45724 -44780 65976 94564 37069 15205 -3676 2841 24507 -71060 -97646 -56280 -42379
9871 -42379 -67300 -52066 47558 99027 56841 -5751 -53896 -51341 -23582 -32542 -7097 -12335
9859 -12335 -25064 -27583 17562 46021 38660 83441 75179 77250 110992 162263 201416 179771 232680
9846 232680 291001 387897 504200 602417 635247 508867 416663 363163 266232 233436 195765
9835 195765 163757 189471 228234 155988 147719 113178 137122 99987 114881 159675 202878 259092
9823 259092 284003 265633 253601 216634 159873 103162 90005 38465 41787 27905 13440 35987
9811 35987 81983 99359 102890 115983 66094 26618 -2940 -93280 -89824 -21455 34297 37681
$$ packed form
9895G1305k4685L491N0134L6937m6420K2175j8439j08089n2917K9667L0306l9189
9883d5724R44J10756K8588n7495k1864j8881O517K1666r5567k6586M1366J3901
9871d2379k4921J5234R9624N1469m2186o2592m8145K555K7759q960K5445n238
9859a2335j2729k519M5145K8459p361M4781q262K071L3742N1271L9153k1645N2909
9846B32680N8321R6896J16303R8217L2830j26380r2204n3500r6931l2796l7671
9835A95765l2008K5714L8763p2246q269l4541K3944l7135J4894M4794M3203N6214
9823B59092K4911j8370j2032l6967n6761n6711j3157n1540L322j3882j4465K2547
9811C5987M5996J7376L531J3093m9889l9476k9558r0340L456O8369N5752L384
$$ plain form
9799 37681 15080 52585 50083 -1148 6444 -9832 53527 49084 47599 58720 -1511 4596 56486
9786 56486 -2729 28826 86060 160042 156457 132591 109040 124916 94145 88214 130026 135895
9774 135895 44493 -15936 -11129 80249 58187 -5626 -53320 -63246 -105501 -88531 -16436 54999
9762 54999 101168 150357 195172 197356 229960 197185 182490 130159 49151 51151 79870 102867
9750 102867 71355 38819 -397 -25082 -5119 22773 -4694 -52002 3143 14687 20481 62303
9738 62303 93565 56990 47462 23608 16515 77098 101635 107838 75124 34522 39460 78503 138876
9725 138876 168220 141869 140792 137169 87701 77821 120289 114880 84600 51430 52062 56529 30497
9712 30497 -26311 -17814 25373 16760 40487 91312 91013 67297 -23752 -11971 65758 127651 164739
$$ packed form
9799C7681k2601L7505k502n1231P592j6276O3359m443j485J1121o0231O107N1890
9786E6486n9215L1555N7234P3982l585k3866k3551J5876l0771n931M1812N869
9774A35895r1402o0429M807R1378k2062o3813m7694r926m2255J6970P2095P1435
9762E4999M6169M9189M4815K184L2604l2775j4695n2331q1008K000K8719K2997
9750A02867l1512l2536l9216k4685J9963K7892k7467m7308N5145J1544N794M1822
9738F2303L1262l6575r528k3854p093O0583K4537O203l2714m0602M938L9043O0373
9725A38876K9344k6351j077l623m9468r880M2468n409l0280l3170O32M467k6032
9712C0497n6808Q497M3187q613K3727N0825k99k3716r1049J1781P7729O1893L7088
$$ plain form
9699 164739 106417 99540 37544 41893 97412 66078 -2567 -39787 23028 37334 50917 35338
9687 35338 -4619 29867 19265 27365 3247 -11484 -9789 70365 135523 128154 104564 97474 51986
9674 51986 58469 67792 23777 -23157 -25334 37773 15060 7524 33708 99282 59813 10053 -33570
9661 -33570 -7181 5441 -10499 -42646 -32004 3167 8418 42908 62462 36452 62636 51390
9649 51390 80314 51668 49821 71968 92359 114851 169022 121790 106502 92739 148175 132292
9637 132292 111592 111372 69238 67679 117990 174487 142543 140155 139711 181006 200377 202805 181104
9624 181104 145258 154156 137892 143684 144457 183691 170113 186709 187167 166809 132139 116157 97662
9611 97662 155159 197142 185137 169175 181988 181692 179387 129739 41193 10718 49356 98043
$$ packed form
9699A64739n8322o877o1996M349N5519l1334o8645l7220O2815J4306J3583j5579
9687C5338l9957L4486j0602Q100k4118j4731J695Q0154O5158p369k3590p090m5488
9674E1986O483R323m4015m6934k177O3107k2713p536K6184O5574l9469m9760m3623
9661c3570K6389J2622j5940l2147J0642L5171N251L4490J9554k6010K6184j1246
9649E1390K8924k8646j847K2147K0391K2492N4171m7232j5288j3763N5436j5883
9637A32292k0700k20m2134j559N0311N6497l1944k388m44M1295J9371K428k1701
9624A81104l5846Q898j6264N792P73L9234j3578J6596M58k0358l4670j5982j8495
9611I7662N7497M1983j2005j5962J2813k96k305m9648q8546l0475L8638M8687
$$ plain form
9599 98043 133037 130776 144821 173050 150617 126332 107943 111562 187224 201244 205200 197773 159299
9586 159299 163575 172070 154397 145366 174675 185613 191413 241284 260477 231920 227300 228421 243909
9573 243909 264402 325670 360583 383708 423825 496186 515016 545309 514607 380463 310524
9562 310524 280567 230312 253166 386478 444230 348263 293071 293030 295719 282254 256933 205023
9550 205023 226068 285501 269763 262850 233955 218991 209692 239905 231390 271997 278374 370552
9538 370552 484948 498658 460230 393901 408385 466020 398345 371524 417130 475087 513198
9527 513198 517232 518635 498362 486785 481347 463488 466391 458436 438079 420662 337738 304591 256456
9514 256456 279569 315391 345069 316086 257562 265902 264166 261206 292493 326712 292598 318633
$$ packed form
9599I8043L4994k261J4045K8229k2433k4285j8389L619P5662J4020L956p427l8474
9586A59299M276Q495j7673r031K9309J0938N800M9871J9193k8557m620J121J5488
9573B43909K0493O1268L4913K3125M0117P2361J8830L0293l0702j34144o9939
9562C10524k9957n0255K2854J33312N7752r5967n5192m1K689j3465k5321n1910
9550B05023K1045N9433j5738o913k8895j4964r299L0213q515M0607O377R2178
9538C70552J14396J3710l8428o6329J4484N7635o7675k6821M5606N7957L8111
9527E13198M034J403k0273j1577n438j7859K903p955k0357j7417q2924l3147m8135
9514B56456K3113L5822K9678k8983n8524Q340j736k960L1287L4219l4114K6035
$$ plain form
9502 318633 297147 248435 279770 313774 315313 308040 282057 265453 285926 312055 320093 311283
9490 311283 263390 308588 290465 278825 291481 249477 243870 235173 251927 333513 376572 345636
9478 345636 295190 229107 262204 273533 308034 366461 381946 358304 390010 348509 372690 363297
9466 363297 349944 361523 358534 354237 363577 366559 325180 309912 348943 342221 317742 304443 341098
9453 341098 376362 364764 347450 357418 384947 361726 298042 287726 298274 358916 359422 332680
9441 332680 362819 385861 406445 440492 466821 444761 433522 393522 367031 444321 396738 374292
9429 374292 402986 413395 472946 442422 410649 422688 450958 476442 472319 486935 477042 394846
9417 394846 357468 416036 456423 476935 472495 488781 524846 547214 527394 508568 482895 463205
$$ packed form
9502C18633k1486m8712L1335L4004J539p273k5983j6604K0473K6129Q038q810
9490C11283m7893M5198j8123j1640J2656m2004n607q697J6754Q1586M3059l0936
9478C45636n0446o6083L3097J1329L4501N8427J5485k3642L1706m1501K4181r393
9466C63297j3353J1579k989m297R340K982m1379j5268L9031o722k4479j3299L6655
9453C41098L5264j1598j7314R968K7529k3221o3684j0316J0548O0642N06k6742
9441C32680L0139K3042K0584L4047K6329k2060j1239m0000k6491P7290m7583k2446
9429C74292K8694J0409N9551l0524l1773J2039K8270K5484m123J4616r893q2196
9417C94846l7378N8568M0387K0512m440J6286L6065K2368j9820j8826k5673j9690
$$ plain form
9405 463205 461976 486534 526940 558041 537121 553842 533871 574405 635805 616924 649906 628553
9393 628553 571925 541691 538548 541031 539925 510800 460998 444340 507079 569380 578607 635937
9381 635937 660863 707829 796319 781163 702808 699678 707201 723802 727464 709023 735078 692490
9369 692490 623578 641572 674822 715962 764317 782702 780047 784269 828133 855125 825819 852511
9357 852511 850532 885297 873547 884841 887907 908248 904711 913451 979826 952356 881142 896013
9345 896013 901100 825014 915546 1028533 1058463 1062655 1080400 1048064 1014759 1037814 1019658 1051984
9333 1051984 1106622 1117431 1101129 1106775 1174892 1235257 1167234 1189520 1215524 1259638 1284325 1272933
9321 1272933 1270197 1274872 1315659 1294516 1194343 1274507 1396149 1441761 1424713 1390208 1356952
$$ packed form
9405D63205j229K4558M0406L1101k0920J6721j9971M0534O1400j8881L2982k1353
9393F28553n6628l0234l143K483j106k9125m9802j6658O2739O2301R227N7330
9381F35937K4926M6966Q8490j5156p8355l130P523J6601L662j8441K6055m2588
9369F92490o8912J7994L3250M1140M8355J8385k655M222M3864K6992k9306K6692
9357H52511j979L4765j1750J1294L066K0341l537Q740O6375k7470p1214J4871
9345H96013N087p6086R0532J12987K9930M192J7745l2336l3305K3055j8156L2326
9333A051984N4638J0809j6302N646O8117O0365o8023K2286K6004M4114K4687j1392
9321A272933k736M675M0787k1143j00173Q0164J21642M5612j7048l4505l3256
$$ plain form
9310 1356952 1377251 1394864 1469558 1484686 1486833 1477332 1478583 1467827 1510328 1541563 1542833 1590991
9298 1590991 1660735 1710849 1764408 1830854 1824933 1813259 1802615 1803404 1774276 1793369 1866691 1896591
9286 1896591 1962237 2036489 2078706 2125683 2170660 2171557 2251164 2306310 2330488 2316923 2285650 2326771
9274 2326771 2412731 2468878 2515714 2551941 2527696 2554503 2522122 2579506 2636219 2654729 2688860
9263 2688860 2738467 2798398 2897109 3001622 2998098 3064540 3085411 3170120 3251396 3280053 3213086
9252 3213086 3180125 3221104 3227011 3330862 3387348 3480730 3546924 3614735 3675863 3663561 3687436
9241 3687436 3738490 3784471 3878281 4034161 4071649 4096330 4139952 4177852 4207797 4272079 4324236
9230 4324236 4339531 4423690 4482748 4498691 4567180 4653156 4742857 4795467 4848314 4916716 4920900 4914409
$$ packed form
9310A356952K0299J7613P4694J5128K147r501J251j0756M2501L1235J270M8158
9298A590991O9744N0114N3559O6446n921j1674j0644P89k9128J9093P3322K9900
9286A896591O5646P4252M2217M6977M4977Q97P9607N5146K4178j3565l1273M1121
9274B326771Q5960N6147M6836L6227k4245K6807l2381N7384N6713J8510L4131
9263B688860M9607N9931R8711J04513l524O6442K0871Q4709Q1276K8657o6967
9252C213086l2961M0979N907J03851N6486R3382O6194O7811O1128j2302K3875
9241C687436N1054M5981R3810J55880L7488K4681M3622L7900K9945O4282N2157
9230D324236J5295Q4159N9058J5943O8489Q5976Q9701N2610N2847O8402M184o491
$$ plain form
9218 4914409 4916789 4997393 5027307 5052117 5098819 5131326 5214155 5251977 5260103 5349209 5381558 5374092
9206 5374092 5381893 5381929 5366318 5362706 5335897 5368613 5373143 5338106 5373504 5427067 5416849 5442586 5434187
9193 5434187 5384927 5394898 5410650 5393644 5357433 5306783 5305692 5308921 5272895 5256134 5193740 5136348
9181 5136348 5130988 5129380 5128349 5052918 4946029 4930879 4937202 4852836 4845912 4880405 4874763 4826046
9169 4826046 4762047 4716516 4580361 4445112 4370340 4306171 4234946 4197192 4148475 4059380 4020397
9158 4020397 3985373 3952398 3901377 3863646 3873632 3851158 3772509 3748420 3736362 3759696 3712607 3615468
9146 3615468 3502942 3486399 3421407 3327561 3258133 3256568 3216157 3143626 3081282 3026010 2944108
9135 2944108 2891223 2851245 2833360 2792056 2770044 2739227 2707952 2645521 2614961 2570049 2520599
$$ packed form
9218D914409K380Q0604K9914K4810M6702L2507Q2829L7822Q126Q9106L2349p466
9206E374092P801L6j5611l612k6809L2716M530l5037L5398N3563j0218K5737q399
9193E434187m9260R971J5752j7006l6211n0650j091L229l6026j6761o2394n7392
9181E136348n360j608j031p5431j06889j5150O323q4366o924L4493n642m8717
9169D826046o3999m5531j36155j35249p4772o4169p1225l7754m8717q9095l8983
9158D020397l5024l2975n1021l7731R986k2474p8649k4089j2058K3334m7089r7139
9146C615468j12526j6543o4992r3846o9428j565m0411p2531o2344n5272q1902
9135B944108n2885l9978j7885m1304k2012l0817l1275o2431l0560m4912m9450
$$ plain form
9124 2520599 2543825 2495305 2435124 2393785 2379126 2351545 2288575 2230061 2228911 2198581 2116127 2060393
9112 2060393 2023528 2038643 2033622 1992378 1974189 1932508 1904474 1840897 1809208 1731843 1733117 1759691
9100 1759691 1845301 1782879 1687870 1680983 1649687 1654969 1655235 1674221 1645758 1580328 1515912 1522164
9088 1522164 1520308 1569000 1586406 1534351 1467002 1403197 1402820 1388738 1356220 1274830 1291841 1252648
9076 1252648 1217800 1252518 1233843 1221341 1222367 1241855 1252849 1245408 1205439 1204636 1170809 1113247
9064 1113247 1076601 1079594 1124609 1138138 1074111 1048157 1038387 1036473 1011151 993309 993486 958468
9052 958468 957519 971228 944825 935600 928314 962119 923268 896073 941097 926766 850233 798274
9040 798274 793007 745220 717888 734465 722356 683906 728050 731873 776680 747702 780115 813008
$$ packed form
9124B520599K3226m8520o0181m1339j4659k7581o2970n8514j150l0330q2454n5734
9112B060393l6865J5115n021m1244j8189m1681k8034o3577l1689p7365J274K6574
9100A759691Q5610o2422r5009o887l1296N282K66J8986k8463o5430o4416O252
9088A522164j856M8692J7406n2055o7349o3805l77j4082l2518q1390J7011l9193
9076A252648l4848L4718j8675j2502J026J9488J0994p441l9969q03l3827n7562
9064A113247l6646K993M5015J3529o4027k5954r770j914k5322j7842J77l5018
9052I58468r49J3709k6403r225p286L3805l8851k7195M5024j4331p6533n1959
9040G98274n267m7787k7332J6577j2109l8450M4144L823M4807k8978L2413L2893
$$ plain form
9028 813008 756147 656071 674657 711335 712485 681920 666574 619111 644925 663471 653272 655165
9016 655165 639466 626016 600301 626327 702417 728144 695722 681349 657696 585516 550835 619342
9004 619342 665697 650366 605789 544881 518089 559817 547240 541088 497936 494668 510452 504901
8992 504901 465378 436793 466178 498300 521072 522630 523903 506303 527838 546316 478586 425451
8980 425451 394165 419603 471623 468020 477191 442836 349919 332120 298342 295638 341649 374888
8968 374888 436224 511095 503950 435494 415984 412089 371569 406611 459343 436776 410750 347313
8956 347313 311734 289367 267731 268503 263695 250540 253429 288011 311993 349349 427001 372371
8944 372371 334032 327012 347929 392106 367611 349058 312945 292330 304788 321494 290960 301279
$$ packed form
9028H13008n6861j00076J8586L6678J150l0565j5346m7463K5814J8546j0199J893
9016F55165j5699j3450k5715K6026P6090K5727l2422j4373k3653p2180l4681O8507
9004F19342M6355j5331m4577o0908k6792M1728j2577o152m3152l268J5784n551
8992E04901l9523k8585K9385L2122K2772J558J273j7600K1535J8478o7730n3135
8980D25451l1286K5438N2020l603R171l4355r2917j7799l3778k704M6011L3239
8968C74888O1336P4871p145o8456j9510l895m0520L5042N2732k2567k6026o3437
8956C47313l5579k2367k1636P72m808j3155K889L4582K3982L7356P7652n4630
8944C72371l8339p020K0917M4177k4495j8553l6113k0615J2458J6706l0534J0319
$$ plain form
8932 301279 275453 261717 273415 278682 355604 366414 352803 289946 275381 284530 214927 264520
8920 264520 321194 332441 298951 210834 250017 271162 314716 303625 288493 307117 336347 302443
8908 302443 251639 207862 231298 219539 187276 160871 188857 214184 260665 244475 278470 273477
8896 273477 250829 250194 271639 301887 243392 188125 183538 202366 195752 215677 189333 156949
8884 156949 146164 137932 188588 259170 262390 290058 302738 249668 287651 287623 213007 191167 205816
8871 205816 196596 191420 156102 161869 157055 153973 149979 146523 179277 244243 256883 240682 240485
8858 240485 230402 218472 192037 184060 179140 111904 71715 117446 161104 167797 110050 170108
8846 170108 156159 110577 173214 197723 227375 241531 300278 285122 203914 175183 206115 246867
$$ packed form
8932C01279k5826j3736J1698N267P6922J0810j3611o2857j4565R149o9603M9593
8920B64520N6674J1247l3490q8117L9183K1145M3554j1091j5132J8624K9230l3904
8908C02443n0804m3777K3436j1759l2263k6405K7986K5327M6481j6190L3995m993
8896B73477k2648o35K1445L0248n8495n5267m587J8828o614J9925k6344l2384
8884A56949j0785q232N0656P0582L220K7668J2680n3070L7983k8p4616k1840J4649
8871B05816r220n176l5318N767m814l082l994l456L2754O4966J2640j6201j97
8858B40485j0083j1930k6435p977m920o7236m0189M5731M3658O693n7747O0058
8846A70108j3949m5582O2637K4509K9652J4156N8747j5156q1208k8731L0932M0752
$$ plain form
8834 246867 244582 218030 175814 154364 190420 185079 84573 94903 139862 154941 143544 128428
8822 128428 130688 181404 205718 165926 106241 125625 126637 125208 119812 175441 171348 172436 177380
8809 177380 207168 208054 211517 218294 203663 248711 241492 185010 169648 92232 102161 85285 134492
8796 134492 215158 196702 251706 248193 208654 189663 129718 130338 193441 257124 330632 319105
8784 319105 235073 193061 174861 192142 213331 236764 241557 205928 210192 237962 248934 207964
8772 207964 110034 80539 73863 112620 109580 153729 197684 221474 252883 267832 199662 160454
8760 160454 138065 137776 138794 140053 190068 191147 151566 116798 97382 148839 183311 162353 112083
8747 112083 113397 162352 130959 108221 133449 233335 282068 276732 233967 225447 207824 144093
$$ packed form
8834B46867k285k6552m2216k1450L6056n341j00506J0330M4959J5079j1397j5116
8822A28428K260N0716K4314l9792n9685J9384J012j429n396N5629m093J088M944
8809A77380K9788Q86L463O777j4631M5048p219n6482j5362p7416R929j6876M9207
8796A34492Q0666j8456N5004l513l9539j8991n9945O20O3103O3683P3508j1527
8784C19105q4032m2012j8200J7281K1189K3433M793l5629M264K7770J0972m0970
8772B07964r7930k9495o676L8757l040M4149M3955K3790L1409J4949o8170l9208
8760A60454k2389k89J018J259N0015J079l9581l4768j9416N1457L4472k0958n0270
8747A12083J314M8955l1393k2738K5228R9886M8733n336m2765q520j7623o3731
$$ plain form
8735 144093 103841 69704 132243 228231 197174 146308 184465 180447 210627 222443 207114 194916
8723 194916 232596 234217 194076 152837 155380 169221 127315 146375 153523 199427 216171 207311
8711 207311 199474 190991 208664 243182 222313 225232 248264 296365 307714 284974 314879 308916
8699 308916 280039 304137 356398 460521 589404 672307 819716 1057909 1292841 1462579
8689 1462579 1574757 1565812 1369624 1185632 1061548 972146 931723 814391 733750 699615 613255
8678 613255 585645 648153 633588 605386 588960 595664 631517 747858 781026 860720 945653 1049398
8666 1049398 1217515 1434352 1506088 1553224 1451951 1213165 952257 758812 702054 672813
8656 672813 662723 619010 601457 675342 758814 810662 913230 1109891 1305758 1567072 1968830
$$ packed form
8735A44093m0252l4137O2539R5988l1057n0866L8157m018L0180J1816j5329j2198
8723A94916L7680J621m0141m1239K543J3841m1906J9060P148M5904J6744q860
8711B07311p837q483J7673L4518k0869K919K3032M8101J1349k2740K9905n963
8699C08916k8877K4098N2261J04123J28883Q2903J47409K38193K34932J69738
8689A462579J12178q945j96188j83992j24084q9402m0423j17332q0641l4135q6360
8678F13255k7610O2508j4565k8202j6426O704L5853J16341L3168P9694Q4933J03745
8666A049398J68117K16837P1736M7136j01273k38786k60908j93445n6758k9241
8656F72813j0090m3713j7553P3885Q3472N1848J02568J96661J95867K61314M01758
$$ plain form
8645 1968830 2482842 2912853 3161844 3136161 2803692 2366515 1988480 1669245 1484598 1301470
8635 1301470 1008158 769976 652543 637570 639807 623084 636533 647548 600957 492153 458357
8624 458357 541715 559305 474838 515473 542780 510476 497311 521269 549658 554854 558403 606176
8612 606176 523991 514447 568150 588649 589628 619932 676184 692721 746944 858498 986675 1142406
8600 1142406 1392664 1674192 1987961 2124430 2176459 2105000 1908051 1679871 1547221 1431691
8590 1431691 1297958 1183468 1145587 1102714 1124370 1072689 1010839 936179 841710 750932 693727
8579 693727 642016 594351 537643 500895 464015 437072 391186 363621 394715 388522 304446 252697
8567 252697 281829 269952 241157 260044 297322 308785 331010 223348 210441 241899 241401 242167
$$ packed form
8645A968830N14012M30011K48991k5683l32469m37177l78035l19235j84647j83128
8635A301470k93312k38182j17433j4973K237j6723J3449J1015m6591j08804l3796
8624D58357Q3358J7590q4467M0635K7307l2304j3165K3958K8389N196L549M7773
8612F06176q2185r544N3703K0499R79L0304N6252J6537N4223J11554J28177J55731
8600A142406K50258K81528L13769J36469N2029p1459j96949k28180j32650j15530
8590A431691j33733j14490l7881m2873K1656n1681o1850p4660r4469r0778n7205
8579F93727n1711m7665n6708l6748l6880k6943m5886k7565L1094o193q4076n1749
8567B52697K9132j1877k8795J8887L7278J1463K2225j07662j2907L1458m98P66
$$ plain form
8555 242167 251854 242865 236058 299027 340339 323707 333521 314005 219950 185586 164654 153587
8543 153587 196377 197729 155229 110930 126346 98874 124724 150304 183610 218596 217403 222063
8531 222063 239972 279816 311160 367343 361022 310671 312942 314846 278484 300598 344778 332681
8519 332681 289523 239372 239097 251764 209679 174033 151989 185054 231898 225329 208776 218122
8507 218122 247673 246783 193925 154506 147961 147436 147268 172150 187700 123602 103041 108206 95016
8494 95016 95162 162154 197015 161853 132577 152419 100010 79092 154465 206627 238226 237696 255015
8481 255015 290095 278499 280147 277655 299990 320213 309428 279434 266682 270063 193621 176173
8469 176173 199804 215805 181211 100688 102912 134227 150573 179751 190537 181589 170575 152419
$$ packed form
8555B42167R687q989o807O2969M1312j6632R814j9516r4055l4364k0932j1067
8543A53587M2790J352m2500m4299J5416k7472K5850K5580L3306L4986j193M660
8531B22063J7909L9844L1344N6183o321n0351K271J904l6362K2114M4180j2097
8519C32681m3158n0151k75J2667m2085l5646k2044L3065M6844o569j6553R346
8507B18122K9551q90n2858l9419o545n25j68K4882J5550o4098k0561N165j3190
8494I5016J46O6992L4861l5162k9276J9842n2409k0918P5373N2162L1599n30J7319
8481B55015L5080j1596J648k492K2335K0223j0785k9994j2752L381p6442j7448
8469A76173K3631J6001l4594q0523K224L1315J6346K9178J0786q948j1014j8156
$$ plain form
8457 152419 160966 213081 198837 168217 110627 87126 90165 153418 152765 192745 271252 244445
8445 244445 211469 134839 79489 40364 97081 134774 140053 187120 158952 120234 24541 27419
8433 27419 78229 119776 205050 200335 167086 160154 121745 199329 262798 184279 155738 191277
8421 191277 209029 234212 274851 259240 214154 190005 193471 218216 239166 223704 206099 184827
8409 184827 167918 181946 166125 199696 224489 194434 154936 119295 98477 109845 156248 176841
8397 176841 156412 159927 174719 225675 238340 228731 214842 200247 194887 205433 186055 187816
8385 187816 159656 143097 163012 204164 211071 205594 214295 245141 254606 189848 134983 137755 104157
8372 104157 130151 119037 156429 147229 158283 144059 138825 157377 233427 247915 240429 218317
$$ packed form
8457A52419Q547N2115j4244l0620n7590k3501L039O3253o53L9980P8507k6807
8445B44445l2976p6630n5350l9125N6717L7693N279M7067k8168l8718r5693K878
8433B7419N0810M1547Q5274m715l3249o932l8409P7584O3469p8519k8541L5539
8421A91277J7752K5183M0639j5611m5086k4149L466K4745K0950j5462j7605k1272
8409A84827j6909J4028j5821L3571K4793l0055l9498l5641k0818J1368M6403K0593
8397A76841k0429L515J4792N0956J2665r609j3889j4595n360J0546j9378J761
8385A87816k8160j6559J9915M1152O907n477Q701L0846R465o4758n4865K772l3598
8372A04157K5994j1114L7392r200J1054j4224n234J8552P6050J4488p486k2112
$$ plain form
8360 218317 207760 152151 119308 136101 152562 169980 171651 153071 143576 139454 156014 197028
8348 197028 206008 151494 139407 118549 110375 106364 106275 105443 106725 118888 132468 135533 77634 92754
8334 92754 125670 135322 68486 35359 69587 89527 72853 69581 37209 58787 86307 91642
8322 91642 122347 165821 117125 125509 141057 136462 116001 140111 145855 156942 120137 112040 89005
8309 89005 69481 38099 20761 44118 19227 46476 32098 37885 74461 47201 1088 45521
8297 45521 62889 80273 99347 84657 121683 109127 43985 65718 119764 130555 69850 48662
8285 48662 75038 46971 80159 87714 59089 65422 60771 50414 34018 16354 34478 24728 68384
8272 68384 43994 35505 73750 113419 106334 87529 76113 58071 26853 8572 3556 -38644
$$ packed form
8360B18317j0557n5609l2843J6793J6461J7418J671j8580r495m122J6560M1014
8348A97028Q980n4514j2087k0858q174m011q9q32J282J2163J3580L065n7899J5120
8334I2754L2916R652o6836l3127L4228J9940j6674l272l2372K1578K7520N335
8322I1642L0705M3474m8696Q384J5548m595k0461K4110N744J1087l6805q097k3035
8309H9005j9524l1382j7338K3357k4891K7249j4378N787L6576k7260m6113M4433
8297D5521J7368J7384J9074j4690L7026j2556o5142K1733N4046J0791o0705k1188
8285D8662K6376k8067L3188P555k8625O333m651j0357j6396j7664J8124r750M3656
8272F8384k4390q489L8245L9669p085j8805j1416j8042l1218j8281n016m2200
$$ plain form
8260 -38644 -15866 5447 -2640 53924 73166 65273 49052 41091 78936 79994 42555 50968 47378
8247 47378 20388 -40514 -61243 -82770 20345 72070 61571 68725 80467 66858 11857 -27000
8235 -27000 7691 67120 60915 36698 -6601 -81048 -91954 -65908 -32181 27584 61679 22196
8223 22196 -55615 -75128 -72565 -13359 30346 24739 -15785 50221 91525 52952 23530 10239
8211 10239 -8077 -34370 -22604 -2355 85462 94349 36878 7179 23122 75597 83584 47995
8199 47995 160 -36294 -47581 21035 46555 33169 37258 -13495 -66958 -24344 30968 -4506
8187 -4506 34898 40806 13005 -12761 19787 63394 74155 60055 14798 -12337 -23370 -8791
8175 -8791 583 -39698 -18173 5320 15753 47276 53760 18785 40127 62853 68281 3763 -15469
$$ packed form
8260c8644K2778K1313q087N6564J9242p893j6221p961L7845J058l7439Q413l590
8247D7378k6990o0902k0729k1527J03115N1725j0499P154J1742j3609n5001l8857
8235b7000L4691N9429o205k4217m3299p4447j0906K6046L3727N9765L4095l9483
8223B2196p7811j9513K563N9206M3705n607m0524O6006M1304l8573k9422j3291
8211A0239j8316k6293J1766K0249Q7817Q887n7471k9699J5943N2475P987l5589
8199D7995m7835l6454j1287O8616K5520j3386M089n0753n3463M2614N5312l5474
8187d506L9404N908k7801k5766L2548M3607J0761j4100m5257k7135j1033J4579
8175h791R374m0281K1525K3493J0433L1523O484l4975K1342K2726N428o4518j9232
$$ plain form
8162 -15469 -18799 -2664 -20974 -103581 -96085 -44791 4255 -8306 -48368 -40679 -25144 -16596 -3663
8149 -3663 66220 57933 36186 75306 115452 157441 110241 55269 22639 19733 48463 70087
8137 70087 39965 -6077 -32601 -87932 -65129 -20529 2978 -5391 -13837 30627 76728 33262
8125 33262 27376 3343 4388 50464 46672 88352 50629 26022 38847 31469 -326 -4373 -15986
8112 -15986 29068 23676 -23446 78414 152472 100414 57142 -21769 -34020 -44176 -20613 -30486
8100 -30486 -2608 -26007 1383 3789 -943 22388 1810 11221 32299 55637 71235 154853
8088 154853 200783 182388 102758 52553 27973 -1437 -4667 23106 50326 50508 96831 160846
8076 160846 105083 49055 14397 2576 38481 57376 36927 34281 22299 43046 32768 77427
$$ packed form
8162a5469l330J6135j8310q2607P496N1294M9046j2561m0062P689J5535Q548J2933
8149c663O9883q287k1747L9120M0146M1989m7200n4972l2630k906K8730K1624
8137G0087l0122m6042k6524n5331K2803M4600K3507q369q446M4464M6101m3466
8125C3262n886k4033J045M6076l792M1680l7723k4607J2825p378l1795m047j1613
8112a5986M5054n392m7122J01860P4058n2058m3272p8911j2251j0156K3563r873
8100c0486K7878k3399K7390K406m732K3331k0578R411K1078K3338J5598Q3618
8088A54853M5930j8395p9630n0205k4580k9410l230K7773K7220J82M6323O4015
8076A60846n5763n6028l4658j1821L5905J8895k0449k646j1982K0747j0278M4659
$$ plain form
8064 77427 43217 -1800 56999 41924 -2183 -42020 -39110 9766 38204 79709 91538 86009
8052 86009 53801 93395 136839 109035 103545 91607 93502 126235 162860 100620 39004 -3607
8040 -3607 43599 90648 86755 63379 76883 82243 72088 56250 65687 -1387 -54366 -73642 -72141
8027 -72141 13122 106018 64747 25079 18436 50174 37966 56006 96626 61407 58921 93666
8015 93666 88979 132694 112060 89541 86690 118199 93669 114185 124706 109703 74943 71151
8003 71151 84628 119808 169565 235734 178562 131202 143554 160532 167891 174012 181353 205207
7991 205207 190202 249877 346556 328010 292775 267228 172211 176974 212107 171212 119156 93969
7979 93969 41540 72784 91244 95119 111186 130412 119892 101912 104962 134818 90176 111724
$$ packed form
8064G7427l4210m5017N8799j5075m4107l9837K910M8876K8438M1505J1829n529
8052H6009l2208L9594M3444k7804n490j1938J895L2733L6625o2240o1616m2611
8040c607M7206M7049l893k3376J3504N360j0155j5838R437o7074n2979j9276J501
8027g2141Q5263R2896m1271l9668o643L1738j2208J8040M0620l5219k486L4745
8015I3666m687M3715k0634k2519k851L1509k4530K0516J0521j5003l4760l792
8003G1151J3477L5180M9757O6169n7172m7360J2352J6978P359O121P341K3854
7991B05207j5005N9675R6679j8546l5235k5547r5017M763L5133m0895n2056k5187
7979I3969n2429L1244J8460L875J6067J9226j0520j7980L050K9856m4642K1548
$$ plain form
7967 111724 173385 214750 193115 117225 88857 169936 197287 136046 111274 110630 138047 108828
7955 108828 93158 153580 174764 134591 154213 188069 158164 131843 137805 137781 163955 181859
7943 181859 151089 163656 151980 119905 67836 39839 51690 108792 101383 94060 156383 150931
7931 150931 125011 122719 96683 122244 118556 51770 5579 -40584 66552 134457 150137 133205
7919 133205 124818 114302 157238 144661 146903 185870 172046 141992 92522 61092 117179 187311
7907 187311 233626 213774 180676 202148 239047 175830 63513 42837 19127 42882 77755
7896 77755 100683 51935 22796 19006 14395 7517 -9642 -27729 32011 73002 54849 74457
7884 74457 152858 142644 83061 35956 75031 112936 182806 202510 154140 109072 57839 17321
$$ packed form
7967A11724O1661M1365k1635p5890k8368Q1079K7351o1241k4772o44K7417k9219
7955A08828j5670O0422K1184m0173J9622L3856k9905k6321N962k4K6174J7904
7943A81859l0770J2567j1676l2075n2069k7997J1851N7102p409p323O2323n452
7931A50931k5920k292k6036K5561l688o6786m6191m6163J07136O7905J5680j6932
7919A33205q387j0516M2936j2577K242L8967j3824l0054m9470l1430N6087P0132
7907A87311M6315j9852l3098K1472L6899o3217j12317k0676k3710K3755L4873
7896G7755K2928m8748k9139l790m611o878j7159j8087N9740M0991j8153J9608
7884G4457P8401j0214n9583m7105L9075L7905O9870J9704m8370m5068n1233m0518
$$ plain form
7872 17321 2661 59315 96062 15918 -20827 -58641 -63293 -24558 -8055 -17020 20289 119108
7860 119108 115950 41696 25192 33763 12407 67108 70708 86269 38615 3926 34249 53628
7848 53628 77994 109837 125196 88505 10203 40807 100139 109202 107683 32434 -10044 -3299
7836 -3299 -6765 -15057 -35553 -43360 -21336 41185 41894 87941 54254 63005 73643 72096 78495 73883
7822 73883 71834 57757 49348 21811 55697 113091 57260 20395 24503 -25597 5069 71007
7810 71007 32123 4403 27413 69320 72827 56344 32150 16768 19523 7974 5148 -31637
7798 -31637 -47639 -31148 -34222 12280 -7099 -31140 -35547 -21447 2554 19086 32692 22069
7786 22069 22872 55500 48843 19825 10867 36660 51309 43703 37754 1932 49528 18051 -22058
$$ packed form
7872A7321j4660N6654L6747q0144l6745l7814m652L8735J6503q965L7309R8819
7860A19108l158p4254j6504Q571k1356N4701L600J5561m7654l4689L0323J9379
7848E3628K4366L1843J5359l6691p8302L0604N9332R063j519p5249m2478O745
7836c299l466q292k0496p807K2024O2521P09M6047l3687Q751J0638j547O399m612
7822G3883k049j4077q409k7537L3886N7394n5831l6865M108n0100L0666O5938
7810G1007l8884k7720K3010M1907L507j6483k4194j5382K755j1549k826l6785
7798c1637j6002J6491l074M6502j9379k4041m407J4100K4001J6532J3606j0623
7786B2069Q03L2628o657k9018q958K5793J4649p606n949l5822M7596l1477m0109
$$ plain form
7773 -22058 7585 -2594 -13760 31341 69054 18780 -22718 -24802 -9942 54142 63580 71596
7761 71596 58566 -5004 -26154 -36274 -56005 -140085 -147804 -125734 -137746 -77131 -32675 -110805
7749 -110805 -124397 -47445 19832 7597 -3182 -34039 -108697 -77673 -109685 -152619 -162111 -160387
7737 -160387 -134075 -90378 -83866 -89321 -50684 -50144 -8439 57220 97461 21314 -8794 -16191 -37417
7724 -37417 -60470 -38902 17303 2493 12752 102062 56060 31641 23363 37843 31147 -4008
7712 -4008 -15497 -41437 -49342 -31740 -35379 -46300 -35426 -60839 -75575 -88655 -89830 -87628 -119430
7699 -119430 -113624 -96486 -50384 -29253 -53932 34268 67105 14642 -44127 -45998 31246 4563
7687 4563 -80658 -86688 -74013 6798 30891 25571 48945 63888 50795 37766 82354 49416
$$ packed form
7773b2058K9643j0179j1166M5101L7713n0274m1498k084J4860O4084R438Q016
7761G1596j3030o3570k1150j0120j9731q4080p719K2070j2012O0615M4456p8130
7749a10805j3592P6952O7277j2235j0779l0857p4658L1024l2012m2934r492J724
7737a60387K6312M3697O512n455L8637N40M1705O5659M0241p6147l0108p397k1226
7724c7417k3053K1568N6205j4810J0259Q9310m6002k4419q278J4480o696l5155
7712d008j1489k5940p905J7602l639j0921J0874k5413j4736j3080j175K202l1802
7699a19430N806J7138M6102K1131k4679Q8200L2837n2463n8769j871P7244k6683
7687D563q5221o030J2675Q0811K4093n320K3374J4943j3093j3029M4588l2938
$$ plain form
7675 49416 55058 42839 18976 20616 53928 42839 27562 -11242 -63511 -86523 -342 18529
7663 18529 -31993 -27400 10104 -59852 -70218 -4147 5073 -20111 -56472 -26797 -34276 -29139 40200
7650 40200 66941 -14233 -50078 -34655 9098 -7114 -7991 -10645 7296 -33342 -17777 -32557
7638 -32557 -80344 -53094 -42871 -51272 -37439 -30581 -32974 -52466 -35634 20278 53292 506
7626 506 -3772 63654 18883 -44278 -17564 101235 106644 39460 -40149 -19525 -8609 -14702 1505
7613 1505 16065 9014 -7570 -32204 -63949 -56869 -11977 11456 1831 -29060 5630 69863 105649
7600 105649 72100 44868 23287 16451 11366 42221 6383 777 -24829 -37158 -13831 -55038
7588 -55038 -59915 -97764 -115669 -120442 -174859 -120260 -15687 -43037 -63341 -85890 -101652 -86227
$$ packed form
7675D9416N642j2219k3863J640L3312j1089j5277l8804n2269k3012Q6181J8871
7663A8529n0522M593L7504o9956j0366O6071R220k5184l6361K9675p479N137O9339
7650D0200K6741q1174l5845J5423M3753j6212q77k654J7941m0638J5565j4780
7638c2557m7787K7250J0223q401J3833O858k393j9492J6832N5912L3014n2786
7626E06m278O7426m4771o3161K6714J18799N409o7184p9609K0624J0916o093J6207
7613A505J4560p051j6584k4634l1745P080M4892K3433r625l0891L4690O4233L5786
7600A05649l3549k7232k1581o836n085L0855l5838n606k5606j2329K3327m1207
7588e5038m877l7849j7905m773n4417N4599J04573k7350k0304k2549j5762J5425
$$ plain form
7576 -86227 -58254 -40700 -45989 -29612 -35841 -38803 -24530 -18597 -5848 -23528 -35296 -31661 -41246
7563 -41246 -86221 -84902 -81911 -19551 -21457 -56547 -66715 -88230 -84216 -49626 -58649 -20548 1663
7550 1663 9885 -10074 13497 -12097 -35967 -86398 -106105 -74535 -57011 -43364 -38267 -47749 -13247
7537 -13247 -8789 -281 -31754 -28097 15040 13676 -20659 -30913 -56567 -29140 -31534 -71815 -95041
7524 -95041 -24334 -42859 -76583 -84150 -28875 -29493 -48605 -57789 -62952 -83963 -74830 -78630 -81947
7511 -81947 -106981 -111412 -73722 -62819 -46580 -2957 -12620 -50875 -53188 -62309 -75486 -90769 -31766
7498 -31766 -10176 -47250 -7364 39660 28642 -34477 -11187 13242 4860 -63753 -80388 -65532
7486 -65532 -6255 46708 32504 -43057 -88185 -112691 -119973 -92293 -37962 -16414 -3074 -28201
$$ packed form
7576h6227K7973J7554n289J6377o229k962J4273N933J2749j7680j1768L635r585
7563d1246m4975J319K991O2360j906l5090j0168k1515M014L4590r023L8101K2211
7550A663Q222j9959K3571k5594k3870n0431j9707L1570J7524J3647N097r482L4502
7537a3247M458Q508l1473L657M3137j364l4335j0254k5654K7427k394m0281k3226
7524i5041P0707j8525l3724p567N5275o18j9112r184n163k1011R133l800l317
7511h1947k5034m431L7690J0903J6239M3623r663l8255k313r121j3177j5283N9003
7498c1766K1590l7074L9886M7024j1018o3119K3290K4429q382o8613j6635J4856
7486f5532N9277N2963j4204p5561m5128k4506p282K7680N4331K1548J3340k5127
$$ plain form
7474 -28201 -55133 -45056 -37691 -31366 -5579 -41519 -11061 -32162 -85463 -109159 -27654 -30402
7462 -30402 -14888 -18506 21380 60358 62782 44054 34557 81653 41254 -45947 -155873 -185659
7450 -185659 -130871 -101336 -125540 -113488 -25433 -7566 -98920 -105149 -33132 -24963 -11298 -5194
7438 -5194 -1254 -38637 -45208 -23022 -35935 -48386 -34670 -29816 -15491 -32618 -86804 -130929 -104509
7425 -104509 -47581 -12078 10460 13474 43019 44024 16731 -20645 5175 -13111 -47529 11138
7413 11138 -17251 -99259 -47505 -2836 14692 9365 -12584 -20750 -87324 -136067 -145276 -129495
7401 -129495 -108299 -113907 -73165 -7368 37060 5581 -44669 5735 33854 86403 102423 40282
7389 40282 11834 -9404 -2187 -25948 -41377 -7440 10915 27740 52455 57618 -11289 -39678
$$ packed form
7474b8201k6932J0077P365O325K5787l5940L0458k1101n3301k3696Q1505k748
7462c0402J5514l618L9886L8978K424j8728r497M7096m0399q7201j09926k9786
7450a85659N4788K9535k4204J2052Q8055J7867r1354o229P2017Q169J3665O104
7438e194L940l7383o571K2186j2913j2451J3716M854J4325j7127n4186m4125K6420
7425a04509N6928L5503K2538L014K9545J005k7293l7376K5820j8286l4418N8667
7413A1138k8389q2008N1754M4669J7528n327k1949q166o6574m8743r209J5781
7401a29495K1196n608M0742O5797M4428l1479n0250N0404K8119N2549J6020o2141
7389D0282k8448k1238P217k3761j5429L3937J8355J6825K4715N163o8907k8389
$$ plain form
7377 -39678 -55261 -87148 -40980 17157 8503 -47814 -72364 -26422 28585 70597 131838 162640
7365 162640 154234 92662 17223 6919 -6653 -27601 126 7419 -24681 -82591 -73404 3019
7353 3019 57644 19256 45496 74148 93296 78938 55298 11411 41891 22827 42923 -12584
7341 -12584 -65342 9876 44570 22501 16250 22612 25415 9202 -33507 -43418 12897 32108 799
7328 799 -19633 11856 68614 67308 -62626 -75021 -37285 3424 -29845 -66548 -65828 -11828 48703
7315 48703 95454 92768 15384 -36541 -22477 -41974 -48205 34977 22231 34364 83631 99465
7303 99465 86146 100731 72222 4116 -28419 -58568 -54767 -83600 -71994 -100191 -104802 -27239
7291 -27239 -3252 -16719 -36878 12683 57097 9323 -90308 -74305 -58167 -97629 -136856 -87472
$$ packed form
7377c9678j5583l1887M6168N8137q654n6317k4550M5942N5007M2012O1241L0802
7365A62640q406o1572p5439j0304j3572k0948K7727P293l2100n7910R187P6423
7353C019N4625l8388K6240K8652J9148j4358k3640m3887L0480j9064K0096n5507
7341a2584n2758P5218L4694k2069o251O362K803j6213m2709r911N6315J9211l1309
7328G99k0432L1489N6758j306j29934j2395L7736M0709l3269l6703P20N4000O0531
7315D8703M6751k686p7384n1925J4064j9497o231Q3182j2746J2133M9267J5834
7303I9465j3319J4585k8509o8106l2535l0149L801k8833J1606k8197m611P7563
7291b7239K3987j3467k0159M9561M4414m7774r9631J6003J6138l9462l9227M9384
$$ plain form
7279 -87472 -35313 -70709 -79124 -80656 -88247 -116449 -40153 -22946 -22284 -66 2533 -16581 -23173
7266 -23173 -20661 -25793 4366 10683 -50382 -111468 -154476 -112166 -82099 -39050 -60503 -98710
7254 -98710 29380 75897 -55085 -99852 -99526 -134886 -84332 -48398 -23911 13493 -24383 -2611
7242 -2611 -18881 -76213 -52818 -62146 -86284 -126292 -110064 -33848 5241 20185 47465 17348
7230 17348 32315 75594 60819 27852 39831 28688 89269 105181 52556 6534 -1741 -23418
7218 -23418 -51617 -99081 -72390 -41829 -44382 -87303 -93694 -84400 -75333 12219 -25109 -101689 -129401
7205 -129401 -39574 -16940 -32401 -45308 -12273 55088 -19027 -98248 -111915 -114684 -112631 -73544
7193 -73544 -27522 -36490 -899 15319 -13342 -20103 -24637 22928 55913 49851 2091 -32339 -202
$$ packed form
7279h7472N2159l5396q415j532p591k8202P6296J7207O62K2218K599j9114o592
7266b3173K512n132L0159O317o1065o1086m3008M2310L0067M3049k1453l8207
7254i8710J28090M6517j30982m4767L26l5360N0554L5934K4487L7404l7876K1772
7242b611j6270n7332K3395r328k4138m0008J6228P6216L9089J4944K7280l0117
7230A7348J4967M3279j4775l2967J1979j1143O0581J5912n2625m6022q275k1677
7218b3418k8199m7464K6691L0561k553m2921o391R294R067Q7552l7328p6580k7712
7205a29401Q9827K2634j5461j2907L3035O7361p4115p9221j3667k769K053L9087
7193g3544M6022q968L5591J6218k8661o761m534M7565L2985o062m7760l4430L2137
$$ plain form
7180 -202 11051 -25601 -80761 -87416 -52541 -40501 14313 34642 44165 6417 23650 -2847 -26439
7167 -26439 24768 45181 57489 65032 1632 -17964 -3634 -20582 -10426 18565 22199 21418 17829
7154 17829 26907 -1374 -38837 -37726 -11156 34127 46900 57418 21159 -28508 -38765 -30241
7142 -30241 -27381 -20055 23593 59352 43013 6944 12299 -4051 -37312 -3099 9764 1344 -30864
7129 -30864 21435 -14838 -46812 -80715 -40586 -23481 -9218 18950 14280 26957 -3578 21894
7117 21894 29441 -2106 5509 26930 22462 23260 7936 12967 24650 38232 -11897 -18654 -7912
7104 -7912 51556 -22026 -30674 -35272 -7195 53812 40554 55070 21031 13134 -471 -58487 -72460
7091 -72460 -10841 54115 29884 6504 24783 52520 77949 116357 122047 40385 -50688 -36413
$$ packed form
7180b02J1253l6652n5160o655L4875J2040N4814K0329R523l7748J7233k6497k3592
7167b6439N1207K0413J2308P543o3400j9596J4330j6948J0156K8991L634p81l589
7154A7829R078k8281l7463J111K6570M5283J2773J0518l6259m9667j0257Q524
7142c0241K860P326M3648L5759j6339l6069N355j6350l3261L4213J2863q420l2208
7129c0864N2299l6273l1974l3903M0129J7105J4263K8168m670J2677l0535K5472
7117B1894P547l1547P615K1421m468P98j5324N031J1683J3582n0129o757J0742
7104g912N9468p3582q648m598K8077O1007j3258J4516l4039p897j3605n8016j3973
7091g2460O1619O4956k4231k3380J8279K7737K5429L8408N690q1662r1073J4275
$$ plain form
7079 -36413 -6443 19635 12846 -29307 -46030 -64845 -80117 -75666 -71198 -32922 -76621 -108405
7067 -108405 -33295 34352 11138 41252 1920 -50344 -71996 54251 49791 18678 -10550 28828
7055 28828 84573 111712 106147 74658 -11462 37666 70076 37118 -4658 -51939 -98372 -130049
7043 -130049 -95776 -34872 -8674 2206 -4563 -27268 -42853 -41853 -17306 -52809 -89078 -111469
7031 -111469 -52867 32236 -472 -229 -10198 -68968 -107079 -83646 -65372 -58927 -34227 -11188
7019 -11188 43299 81851 57703 51498 44436 13953 11226 43907 74276 3118 -33495 -48008
7007 -48008 -24972 7890 -7263 -36654 -30176 46186 -33908 -25515 17670 -16507 -36820 -18174
6995 -18174 41524 82239 77869 70456 45689 43966 13338 -40934 -65339 -73937 -72083 -29155 6549
$$ packed form
7079c6413K9970K6078o789m2153j6723j8815j5272M451M468L8276m3699l1784
7067a08405P5110O7647k3214L0114l9332n2264k1652J26247m460l1113k9228L9378
7055B8828N5745K7139n565l1489q6120M9128L2410l2958m1776m7281m6433l1677
7043a30049L4273O0904K6198J0880o769k2705j5585J000K4547l5503l6269k2391
7031a11469N8602Q5103l2708K43r969n8770l8111K3433J8274O445K4700K3039
7019a1188N4487L8552k4148o205p062l0483k727L2681L0369p1158l6613j4513
7007d8008K3036L2862j5153k9391O478P6362q0094Q393M3185l4177k0313J8646
6995a8174N9698M0715m370p413k4767j723l0628n4272k4405q598J854M2928L5704
$$ plain form
6982 6549 -8393 -31297 1977 32414 -26938 -74045 -35951 2931 18046 -76519 -41928 -47135
6970 -47135 -83207 -89184 -31451 8203 -13012 -12156 20499 -55690 -79515 -90727 -114889 -113336 -113854
6957 -113854 -78100 -87207 -153718 -96203 -100645 -116567 -60702 -18148 47936 23268 -2027 56949
6945 56949 20494 25357 62150 78242 70789 91873 82045 16990 -16943 11839 107806 88671
6933 88671 14406 -50443 -45252 -40851 -61744 -17560 -67482 -47523 -18810 -12858 -10445 4159 35127
6920 35127 36379 74887 66536 2017 -4468 33829 44728 45796 22948 -54150 -112040 -127313 -94052
6907 -94052 -55085 43560 103447 84650 40150 42528 21867 17731 54380 54463 59472 73138 36695
6894 36695 17180 -11920 -59814 -73715 -52388 -35056 29555 -12768 -51356 -35085 -6755 -16676
$$ packed form
6982F549j4942k2904L3274L0437n9352m7107L8094L8882J5115r4565L4591n207
6970d7135l6072n977N7733L9654k1215Q56L2655p6189k3825j1212k4162J553n18
6957a13854L5754r107o6511N7515m442j5922N5865M2554O6084k4668k5295N8976
6945E6949l6455M863L6793J6092p453K1084r828o5055l3933K8782R5967j9135
6933H8671p4265o4849N191M401k0893M4184m9922J9959K8713N952K413J4604L0968
6920C5127J252L8508q351o4519o485L8297J0899J068k2848p7098n7890j5273L3261
6907i4052L8967R8645N9887j8797m4500K378k0661m136L6649Q3N009J3666l6443
6894C6695j9515k9100m7894j3901K1327J7332O4611m2323l8588J6271K8330r921
$$ plain form
6882 -16676 -20289 -82521 -67595 -29353 -2186 30782 -6330 -25295 -43428 -72336 -32023 -40542
6870 -40542 -54316 -46143 -35026 33292 13055 52160 55378 13734 -52442 14938 38762 -21368
6858 -21368 -17244 -26805 -28503 -35768 14330 21576 -3771 -60499 -2660 10901 -20103 -36045 -21270
6845 -21270 -14560 39404 19590 21044 55283 16405 -12756 22716 31982 17862 -4599 8194
6833 8194 -26835 -22828 -33004 -12744 -32574 -34675 18472 -27536 -40569 -33712 -23904 78334 89100
6820 89100 23333 -848 3808 36665 12090 41099 22558 -10651 -28460 -29387 -22199 -11539 12935
6807 12935 60198 121097 114998 63840 12515 31895 68141 60349 14859 -53 -27992 -24337
6795 -24337 -12769 -2441 -25303 -21189 28582 93558 121603 102958 26429 62873 74265 75817
$$ packed form
6882a6676l613o2232J4926L8242K7167L2968l7112j8965j8133k8908M0313q519
6870d0542j3774Q173J1117O8318k0237L9105L218m1644o6176O7380K3824o0130
6858b1368M124r561j698p265N0098P246k5347n6728N7839J3561l1004j5942J4775
6845b1270O710N3964j9814J454L4239l8878k9161L5472R266j4120k2461J2793
6833H194l5029M007j0176K0260j9830k101N3147m6008j3033O857R808J02238J0766
6820H9100o5767k4181M656L2857k4575K9009j8541l3209j7809r27P188J0660K4474
6807A2935M7263O0899o099n1158n1325J9380L6246p792m5490j4912k7939L655
6795b4337J1568J0328k2862M114M9771O4976K8045j8645p6529L6444J1392J552
$$ plain form
6783 75817 33116 27387 65913 48202 38950 52992 34361 53847 72567 75896 72194 46182 -3639
6770 -3639 39087 89134 51829 27081 48099 54942 79684 132935 160937 139329 119936 203734
6758 203734 235519 223560 178984 212688 242352 190955 130247 119573 186688 199095 160755 219041
6746 219041 300494 336470 344109 392440 464998 564016 655250 734224 683395 651206 661830 673925
6734 673925 657742 567389 531355 594873 606014 673859 785286 874922 1002879 1079812 1170636
6723 1170636 1380538 1745426 2297826 3074140 4217349 5796805 7933656 10434712 12541222
6714 12541222 13542318 12876146 10380645 7285570 4965861 3475440 2564103 2023088 1635525
6705 1635525 1351564 1168055 1030571 927057 842089 795769 742025 616096 456246 439802
$$ packed form
6783G5817m2701n729L8526j7711r252J4042j8631J9486J8720L329l702k6012m9821
6770c639M2726N0047l7305k4748K1018O843K4742N3251K8002k1608j9393Q3798
6758B03734L1785j1959m4576L3704K9664n1397o0708j0674O7115J2407l8340N8286
6746B19041Q1453L5976P639M8331P2558R9018R1234P8974n0829l2189J0624J2095
6734F73925j6183r0353l6034O3518J1141O7845J11427Q9636J27957P6933R0824
6723A170636K09902L64888N52400P76314J143209J579456K136851K501056K106510
6714A2541222J001096o66172k495501l095075k319709j490421r11337n41015l87563
6705A635525k83961j83509j37484j03514q4968m6320n3744j25929j59850j6444
$$ plain form
6695 439802 530539 564138 591605 634433 643501 683330 590097 504445 431218 364899 336599 339904
6683 339904 288565 267004 237039 243793 254997 247267 227697 202950 205778 273732 296276 258298
6671 258298 253285 183187 72520 9480 94805 128078 87500 20573 -24691 -11583 6719 19274
6659 19274 -13619 -33172 -43689 -72453 -53276 19899 61853 50348 20357 4800 11766 26472
6647 26472 43148 10167 31489 32590 37300 66059 38221 11616 -16212 -16235 -5873 -11104 -18833
6634 -18833 6270 20731 6407 29695 69067 59925 66007 58731 8427 -34583 -2352 11439
6622 11439 -57134 -46817 -18865 7201 -27844 -12529 4149 -16211 30368 23378 -52631 -83806
6610 -83806 -72071 -62946 -341 11111 45449 -7518 -87516 -45628 -10905 -25086 -12912 -51884
$$ packed form
6695D39802R0737L3599K7467M2828R068L9829r3233q5652p3227o6319k8300L305
6683C39904n1339k1561k9965O754J1204p730j9570k4747K828O7954K2544l7978
6671B58298n013p0098j10667o3040Q5325L3273m0578o6927m5264J3108J8302J2555
6659A9274l2893j9553j0517k8764J9177P3175M1954j1505k9991j5557O966J4706
6647B6472J6676l2981K1322J101M710K8759k7838k6605k7828k3J0362n231p729
6634a8833K5103J4461j4324K3288L9372r142O082p276n0304m3010L2231J3791
6622A1439o8573J0317K7952K6066l5045J5315J6678k0360M6579o990p6009l1175
6610h3806J1735R125O2605J1452L4338n2967p9998M1888L4723j4181J2174l8972
$$ plain form
6598 -51884 -6049 27216 88814 107764 102582 7092 -83856 -79504 -28608 20191 66002 29913
6586 29913 12892 10153 35301 66890 59895 -4428 -5160 -24533 26489 8757 -28935 -26040 26985
6573 26985 62701 86408 61332 48256 5713 11133 61478 63646 78000 108923 98986 14215
6561 14215 -67322 -106002 -130643 -93070 -107787 -108306 -66968 -20591 -66037 -57869 -81447 -121420
6549 -121420 -152731 -145545 -113525 -86371 -97343 -103120 -125858 -138324 -124092 -160189 -153116 -109172
6537 -109172 -113319 -115374 -46285 26768 39384 18851 22678 29761 33996 34487 -15524 -51595 -20884
6524 -20884 -48235 -32901 -23051 -203 7048 -24425 8078 37691 59346 63837 56866 46380 41203
6511 41203 14492 29219 32810 13131 14312 29558 13747 39497 11484 -26841 -52542 -60158
$$ packed form
6598e1884M5835L3265O1598J8950n182r5490r0948M352N0896M8799M5811l6089
6586B9913j7021k739K5148L1589o995o4323p32j9373N1022j7732l7692K895N3025
6573B6985L5716K3707k5076j3076m2543N420N0345K168J4354L0923r937q4771
6561A4215q1537l8680k4641L7573j4717n19M1338M6377m5446Q168k3578l9973
6549a21420l1311P186L2020K7154j0972n777k2738j2466J4232l6097P073M3944
6537a09172m147k055O9089P3053J2616k0533L827P083M235M91n0011l6071L0711
6524b0884k7351J5334R850K2848P251l1473L2503K9613K1655M491o971j0486n177
6511D1203k6711J4727L591j9679J181J5246j5811K5750k8013l8325k5701p616
$$ plain form
6499 -60158 -36730 -40436 -28804 -17795 58545 77119 46686 -23783 -14042 -7053 -17487 -1496
6487 -1496 13306 45815 57474 64101 53145 6231 -7896 8768 20947 -4919 -15006 -7989
6475 -7989 13665 25434 -3101 -37716 -43703 -52464 -25434 2800 -40780 -53299 6785 20566
6463 20566 64699 68585 69436 39017 82543 45355 -8288 -46104 -105840 -68973 -49515 -56344 -44968
6450 -44968 2786 44182 19263 33536 62531 -10139 3941 1733 6607 -16940 -63086 -49429
6438 -49429 -6315 -1320 -18464 -11534 13889 44204 17140 -675 -31666 -66537 -127687 -66486
6426 -66486 -32920 -28247 4833 29298 8627 -58802 -36908 10318 48550 113871 59917 13443
6414 13443 -19138 -23230 -19164 -20330 -12328 -5678 -4334 6175 6362 7168 8580 18482 -21994 -71904
$$ packed form
6499f0158K3428l706J1632J1009P6340J8574l0433p0469R741O989j0434J5991
6487a496J4802L2509J1659O627j0956m6914j4127J6664J2179k5866j0087P017
6475g989K1654J1769k8535l4615n987q761K7030K8234m3580j2519O0084J3781
6463B0566M4133L886Q51l0419M3526l7188n3643l7816n9736L6867J9458o829J1376
6450d4968M7754M1396k4919J4273K8995p2670J4080k208M874k3547m6146J3657
6438d9429M3114M995j7144O930K5423L0315k7064j7815l0991l4871o1150O1201
6426f6486L3566M673L3080K4465k0671o7429K1894M7226L8232O5321n3954m6474
6414A3443l2581m092M066j166Q002O650J344J0509J87Q06J412R902m0476m9910
$$ plain form
6400 -71904 -37332 18954 77368 20439 18389 -40451 -11981 28320 30407 28431 64096 70718 74473
6387 74473 74875 55212 38090 19528 -290 23209 72797 65430 43407 48120 51641 16694 48653
6374 48653 33579 12182 -6633 -28163 5350 28542 -18130 11491 59273 9298 14062 -16027
6362 -16027 -59924 -98582 -67246 -81466 -95378 -61417 -76614 -29734 7660 -53408 -66279 -82798
6350 -82798 -57072 -31425 6798 -7927 -12723 14217 -23369 -31679 -15901 -14885 -12602 -27740 -22708
6337 -22708 23529 -12832 -9785 40075 94189 40507 5115 15996 15693 -3286 -16466 -51760
6325 -51760 -42209 -27798 46184 78695 129199 143918 78570 -58218 -106946 -119357 -31767 23183
6313 23183 -14175 -15353 -26080 3412 32328 -5027 -37860 -7753 37761 48379 15415 23284
$$ packed form
6400g1904L4572N6286N8414n6929k050n8840K8470M0301K087j976L5665O622L755
6387G4473M02j9663j7122j8562j9818K3499M9588p367k2023M713L521l4947L1959
6374D8653j5074k1397j8815k1530L3513K3192m6672K9621M7782m9975M764l0089
6362a6027m3897l8658L1336j4220j3912L3961j5197M6880L7394o1068j2871j6519
6350h2798K5726K5647L8223j4725m796K6940l7586q310J5778J016K283j5138N032
6337b2708M6237l6361L047M9860N4114n3682l5392J0881l03j8979j3180l5294
6325e1760R551J4411P3982L2511N0504J4719o5348j36788m8728j2411Q7590N4950
6313B3183l7358j178j0727K9492K8916l7355l2833L0107M5514J0618l2964P869
$$ plain form
6301 23284 40528 10378 33936 14999 17771 45709 29003 -55630 -61529 18506 71124 75645
6289 75645 83842 78689 74500 3328 -29734 -37691 -71099 -74732 -73254 -56997 -48741 2671 27864
6276 27864 58738 13848 -63100 -73230 -74398 -104600 -31320 38894 31652 -20400 -46539 -32886
6264 -32886 6662 -71900 -79524 -25373 -13292 -13074 -30793 -2508 -377 -27973 -54688 -74252 -99818
6251 -99818 -64554 -11976 91301 132013 103538 71965 38652 45635 55024 62479 21168 -12434
6239 -12434 -49803 -62413 -70211 -43480 -17152 29800 20330 14272 -5954 -34262 11761 27606
6227 27606 -20900 -30402 -20215 -13708 -76243 -84131 -99548 -77058 -54098 -51812 -104348 -102143 -84088
6214 -84088 -24673 41294 76077 59150 80694 64675 55791 59485 66062 29223 -50759 -81291
$$ packed form
6301B3284J7244l0150K3558j8937K772K7938j6706q4633n899Q0035N2618M521
6289G5645Q197n153m189p1172l3062p957l3408l633J478J6257Q256N1412K5193
6276B7864L0874m4890p6948j0130j168l0202P3280P0214p242n2052k6139J3653
6264c2886L9548p8562p624N4151J2081K18j7719K8285K131k7596k6715j9564k5566
6251i9818L5264N2578J03277M0712k8475l1573l3313O983R389P455m1311l3602
6239a2434l7369j2610p798K6731K6328M6952r470o058k0226k8308M6023J5845
6227B7606m8506r502J0187O507o2535p888j5417K2490K2960K286n2536K205J8055
6214h4088N9415O5967L4783j6927K1544j6019q884L694O577l6839p9982l0532
$$ plain form
6202 -81291 -59609 -40988 -18995 40814 32253 -1789 -5301 4396 52284 62040 85703 52787 3424
6189 3424 -17177 -27037 -92324 -176144 -120138 -64426 -31232 -17358 40110 98764 61954 -31800
6177 -31800 -65708 -63883 -33294 -31239 -7503 -18905 -21209 -682 -47900 -86027 -42091 -30088
6165 -30088 -40062 6855 56185 51237 8481 -4962 28391 13776 1993 -15432 -4160 34499
6153 34499 72944 87346 133988 111500 57555 17337 13262 32486 105998 113725 53600 10934
6141 10934 -14841 15438 16761 44574 -24786 -50054 -98933 -126425 -87959 -108836 -109111 -53312
6129 -53312 -81985 -130769 -93113 -31926 -39045 -101092 -93753 -59678 -27140 -40930 -58511 -100045
6117 -100045 -71745 -80394 -69537 -78383 -52369 -27007 -61484 -55350 -45037 -43288 -22587 -15796 -7313
$$ packed form
6202h1291K1682J8621K1993N9809q561l4042l512R697M7888R756K3663l2916m9363
6189C424k0601r860o5287q3820N6006N5712L3194J3874N7468N8654l6810r3754
6177c1800l3908J825L0589K055K3736j1402k304K0527m7218l8127M3936J2003
6165c0088r974M6917M9330m948m2756j3443L3353j4615j1783j7425J1272L8659
6153C4499L8445J4402M6642k2488n3945m0218m075J9224P3512P727o0125m2666
6141A0934k5775L0279J323K7813o9360k5268m8879k7492L8466k0877k75N5799
6129e3312k8673m8784L7656O1187p119o2047P339L4075L2538j3790j7581m1534
6117a00045K8300q649J0857q846K6014K5362l4477O134J0313J749K0701O791Q483
$$ plain form
6104 -7313 48440 52668 22729 -15195 -10605 -32294 -43644 -56489 -10836 -51541 -86465 -58815
6092 -58815 -32272 -35856 4270 -26605 -1848 53034 13866 -76049 -83274 -51091 -26733 -15198
6080 -15198 -21689 -24584 -61355 -84878 -32576 -9580 -7138 -50989 -50786 -67043 -107779 -63071 11473
6067 11473 -4093 -24850 -2094 64923 89833 56928 -1301 7806 33231 37890 -31723 -36696
6055 -36696 -54930 -85620 -15793 60054 68780 43400 -32042 -63127 -21564 3158 -259 18124
6043 18124 6231 -6627 -48511 -69415 -86755 -108059 -84027 20554 59509 81100 140548 120103
6031 120103 105630 61111 15873 -43675 -76088 -74797 -51953 -48853 -85273 -92175 -96091 -42897
6019 -42897 -18068 -46289 -30454 -43902 -42641 -14253 -26001 -80780 -67606 -59279 -43097 -46583
$$ packed form
6104g313N5753M228k9939l7924M590k1689j1350j2845M5653m0705l4924K7650
6092e8815K6543l584M0126l0875K4757N4882l9168q9915p225L2183K4358J1535
6080a5198o491k895l6771k3523N2302K2996K442m3851K03j6257m0736M4708P4544
6067A1473j5566k0757K2756O7017K4910l2905n8229R107K5425M659o9613m973
6055c6696j8234l0690O9827P5847Q726k5380p5442l1085M1563K4722l417J8383
6043A8124j1893j2858m1884k0904j7340k1304K4032J04581L8955K1591N9448k0445
6031A20103j4473m4519m5238n9548l2413J291K2844L100l6420o902l916N3194
6019d2897K4829k8221J5835j3448J261K8388j1748n4779J3174Q327J6182l486
$$ plain form
6007 -46583 -26688 -38979 -20072 -3671 18715 28755 -40814 -58328 -10989 27945 -34561 -82784
5995 -82784 -50549 -37805 -26102 -15467 -59488 -30247 8604 17903 -17130 -29565 -19042 -32159
5983 -32159 -32555 51167 86985 59635 12977 -75271 -68395 -3537 24015 20487 61290 110846 101433
5970 101433 55199 -22250 -20561 -435 -41208 -36627 -52435 -71196 -7828 43980 -82264 -82778
5958 -82778 -39129 -28986 -41315 -73551 -104474 -111558 -122888 -77225 -21546 7185 -6575 -45480
5946 -45480 -54485 -12573 24737 -15504 -4799 33685 48031 46465 24772 27498 -4336 15092
5934 15092 2420 17362 74903 59211 -25561 -61989 -18819 14346 -10417 7076 32195 -19244
5922 -19244 -42800 -30868 -11231 -13275 -35960 -39630 -26630 -32788 31216 80301 30397 -3999
$$ packed form
6007d6583J9895j2291J8907J6401K2386J0040o9569j7514M7339L8934o2506m8223
5995h2784L2235J2744J1703J0635m4021K9241L8851R299l5033j2435J0523j3117
5983c2159l96Q3722L5818k7350m6658q8248O876O4858K7552l528M0803M9556r413
5970A01433m6234p7449J689K0126m0773M581j5808j8761O3368N1808j26244n14
5958h2778M3649J0143j2329l2236l0923p084j1330M5663N5679K8731j3760l8905
5946d5480r005M1912L7310m0241J0705L8484J4346j566k1693K726l1834J9428
5934A5092j2672J4942N7541j5692q4772l6428M3170L3165k4763J7493K5119n1439
5922a9244k3556J1932J9637k044k2685l670J3000o158O4004M9085m9904l4396
$$ plain form
5910 -3999 12753 13328 17729 -3637 17758 23307 64001 40224 -22781 -51458 -23153 34231 76862
5897 76862 76580 58720 18098 -48548 -13729 -9367 -29229 -17585 -48823 -82503 -91587 2850 73355
5884 73355 56761 33086 -25054 -64356 -76751 -64068 2734 -28262 -117216 -130042 -99392 -39919
5872 -39919 24577 27781 -22358 -64673 -71651 -96685 -76801 8020 45400 -14747 18092 31789
5860 31789 79531 118503 93395 45131 -45053 -27135 10241 8375 -64518 -52413 -43945 -48293
5848 -48293 -95926 -121062 -88435 -20702 31548 26857 -33649 -45732 -21242 8078 13819 59484
5836 59484 58219 12072 41770 50013 45238 59781 33472 24394 34928 -43228 -90768 -1263 17032
5823 17032 20079 -38218 31486 70013 38126 24450 28307 5695 -34209 -43345 -14840 34904
$$ packed form
5910c999J6752N75M401k1366K1395N549M0694k3777o3005k8677K8305N7384M2631
5897G6862k82j7860m0622o6646L4819M362j9862J1644l1238l3680r084R4437P0505
5884G3355j6594k3675n8140l9302j2395J2683O6802l0996q8954j2826L0650N9473
5872c9919O4496L204n0139m2315o978k5034J9884Q4821L7380o0147L2839J3697
5860C1789M7742L8972k5108m8264r0184J7918L7376j866p2893J2105Q468m348
5848d8293m7633k5136L2627O7733N2250m691o0506j2083K4490K9320N741M5665
5836E9484j265m6147K9698Q243m775J4543k6309r078J0534p8156m7540Q9505J8295
5823A7032L047n8297O9704L8527l1887j3676L857k2612l9904r136K8505M9744
$$ plain form
5811 34904 90118 66742 59073 5200 3831 25298 18794 30116 12278 37193 50768 26206
5799 26206 16252 -27673 -32531 -22092 -48390 -102556 -115838 -77728 -13065 -4364 -1450 -53205 -44309
5786 -44309 -20009 -36967 -10701 -3230 -15567 -18594 -677 25235 -1756 -47597 -77647 -19152
5774 -19152 45615 52128 19762 6072 14119 51234 36123 15339 42723 58316 35898 30614
5762 30614 23027 9347 10863 -3800 14241 53650 48344 90168 62380 77171 66864 62086 75714
5749 75714 53992 48171 36825 30822 -25618 -1693 1600 10565 -8566 -12003 -16498 -6395 -28180
5736 -28180 -70618 -96761 -112291 -69143 -52342 -110939 -60406 -17384 -46542 -35802 -36174 -40335
5724 -40335 -56497 -4626 -37107 -163646 -168260 -115465 -127266 -109003 -86189 -54291 -58846 -52603
$$ packed form
5811C4904N5214k3376p669n3873j369K1467o504J1322j7838K4915J3575k4562
5799B6206r954m3925m858J0439k6298n4166j3282L8110O4663Q701K914n1755Q896
5786d4309K4300j6958K6266P471j2337l027J7917K5912k6991m5841l0050N8495
5774a9152O4767O513l2366j3690Q047L7115j5111k0784K7384J5593k2418n284
5762C0614p587j3680J516j4663J8041L9409n306M1824k7788J4791j0307m778J3628
5749G5714k1722n821j1346o003n6440K3925L293Q965j9131l437m495J0103k1785
5736b8180m2438k6143j5530M3148J6801n8597N0533M3022k9158J0740l72m161
5724d0335j6162N1871l2481j26539m614N2795j1801J8263K2814L1898m555O243
$$ plain form
5712 -52603 -50754 -1556 19584 -46419 -12712 6810 2154 16994 44535 17193 -5635 16416
5700 16416 -53965 -9158 36276 -21960 -43216 20646 19377 -13362 7616 29442 2482 -56967
5688 -56967 -93438 -65316 -29403 -43113 -41186 -38610 -70135 -130505 -189464 -237404 -185782 -121757
5676 -121757 -130288 -181043 -152519 -96016 -48318 -56410 -54647 -64311 -87460 -58876 -1825 12311
5664 12311 47770 75241 93658 66999 37108 56859 115014 75962 21936 -15036 -33483 -32554
5652 -32554 -54762 -48155 -62607 -100023 -34068 -22224 -30319 -66582 -34068 -59159 -80140 -69566
5640 -69566 -110788 -119099 -60643 -17450 4785 5244 -16578 -33797 -28266 -54070 -586 -42872 -77807
5627 -77807 -42452 -83560 -52285 -41733 -12224 -9911 15023 8491 -12850 -18545 -42963 -75654
$$ packed form
5712e2603J849M9198K1140o6003L3707J9522m656J4840K7541k7342k2828K2051
5700A6416p0381M4807M5434n8236k1256O3862j269l2739K0978K1826k6960n9449
5688e6967l6471K8122L5913j3710J927K576l1525o0370n8959m7940N1622O4025
5676a21757q531n0755K8524N6503M7698q092J763r664k3149K8584N7051J4136
5664A2311L5459K7471J8417k6659k9891J9751N8155l9052n4026l6972j8447R29
5652c2554k2208O607j4452l7416O5955J1844q095l6263L2514k5091k0981J0574
5640f9566m1222q311N8456M3193K2235M59k1822j7219N531k5804N3484m2286l4935
5627g7807L5355m1108L1275J0552K9509K313K4934o532k1341n695k4418l2691
$$ plain form
5615 -75654 -85092 -142619 -175932 -142721 -74311 -44671 -22085 -37717 -104905 -91042 -43020 -67372
5603 -67372 -69567 -53632 -15677 48292 21795 -38432 -13717 48654 111590 48376 -23629 -31575
5591 -31575 38285 72785 46656 -2939 -54423 -99754 -89263 -6327 -24598 -16504 -66466 -75546
5579 -75546 -56542 -53821 -109509 -202656 -189895 -200191 -157082 -134030 -142020 -105415 -70763 -30296
5567 -30296 5162 -4475 -48721 -43438 -71574 -104352 -67262 -74265 -69160 -8918 9595 -2218 -18256
5554 -18256 6761 -9083 -71400 -86259 -52963 -3467 28772 28286 39723 12956 -10582 -27693
5542 -27693 -46352 -54533 -22733 -1042 12390 -25845 -77686 -72859 -16050 23697 45016 17972
5530 17972 -60266 -111553 -97278 -82664 -47745 -38013 -49749 -27342 -27740 -56699 -5323 54004
$$ packed form
5615g5654r438n7527l3313L3211O8410K9640K2586j5632o7188J3863M8022k4352
5603f7372k195J5935L7955O3969k6497o0227K4715O2371O2936o3214p2005p946
5591c1575O9860L4500k6129m9595n1484m5331J0491Q2936j8271Q094m9962r080
5579g5546J9004K721n5688r3147J2761j0296M3109K3052p990L6605L4652M0467
5567c0296L5458r637m4246N283k8136l2778L7090p003N105O0242J8513j1813j6038
5554a8256K5017j5844o2317j4859L3296M9496L2239m86J1437k6767k3538j7111
5542b7693j8659q181L1800K1691J3432l8235n1841M827N6809L9747K1319k7044
5530A7972p8238n1287J4275J4614L4919R732j1736K2407l98k8959N1376N9327
$$ plain form
5518 54004 72610 37559 -42015 -58398 -43124 -69790 -17493 33665 67273 8485 -44047 -45327
5506 -45327 20149 1904 -15115 -384 41045 38981 5572 -45052 -79458 -51794 15619 51799
5494 51799 48877 48231 42536 -3920 -36720 -37761 -8536 1552 2534 28086 73592 124357 139641
5481 139641 103602 27616 20451 22659 -34070 -21659 -16883 12809 780 9424 59767 82244
5469 82244 69456 51733 18519 -14473 -32189 -28954 -2562 65314 46151 76150 21887 -23794
5457 -23794 -33729 43090 60424 124054 151130 132584 49469 -18922 -34037 -34921 -64822 -55557 -64698
5444 -64698 -16755 -36732 -46707 -22770 52273 99064 112384 69729 55164 42504 42102 35163 12772
5431 12772 22565 15365 -28019 -45458 -15818 -3480 175 -38976 -47914 -36008 12500 71161 -9306
$$ packed form
5518E4004J8606l5051p9574j6383J5274k6666N2297N1158L3608n8788n2532j280
5506d5327O5476j8245j7019J4731M1429k064l3409n0624l4406K7664O7413L6180
5494E1799k922o46n695m6456l2800j041K9225J0088R82K5552M5506N0765J5284
5481A39641l6039p5986p165K208n6729J2411M776K9692j2029Q644N0343K2477
5469H2244j2788j7723l3214l2992j7716L235K6392O7876j9163K9999n4263m5681
5457b3794r935P6819J7334O3630K7076j8546q3115o8391j5115q84k9901R265r141
5444f4698M7943j9977r975K3937P5043M6791J3320m2655j4565j2660m02o939k2391
5431A2772R793p200m3384j7439K9640J2338L655l9151q938J1906M8508N8661q0467
$$ plain form
5418 -9306 -38761 5289 23537 29944 58331 57986 38919 34383 26351 23556 30090 7296 12026 28037
5404 28037 32107 58765 74221 53025 57089 60101 27067 -21795 -34665 -53965 -25736 60437
5392 60437 90636 65307 21207 8795 42934 60184 36162 42724 93281 108423 58986 71415
5380 71415 56294 5701 13317 46620 51588 66427 39177 19720 18880 688 -29204 -67708 -104632
5367 -104632 -119826 -128943 -62419 26774 27731 22396 -22412 -33913 -4525 19332 -6436 -42382
5355 -42382 -21240 10263 -8687 52670 95492 26177 -7064 18844 -5201 -78956 -78536 -31696
5343 -31696 -54823 23648 47753 26821 69429 84569 26707 -9179 -40075 -13823 12160 17968
5331 17968 -65945 -91860 -43834 36961 40445 66188 64968 7400 51104 79824 24186 -41077
$$ packed form
5418i306k9455M4050J8248O407K8387l45j9067m536q032k795O534k2794M730J6011
5404B8037M070K6658J5456k1196M064L012l3034m8862j2870j9300K8229Q6173
5392F0437L0199k5329m4100j2412L4139J7250k4022O562N0557J5142m9437J2429
5380G1415j5121n0593P616L3303M968J4839k7250j9457q40j8192k9892l8504l6924
5367a04632j5194r117O6524Q9193R57n335m4808j1501K9388K3857k5768l5946
5355d2382K1142L1503j8950O1357M2822o9315l3241K5908k4045p3755M20M6840
5343c1696k3127P8471K4105k0932M2608J5140n7862l5886l0896K6252K5983N808
5331A7968q3913k5915M8026Q0795L484K5743j220n7568M3704K8720n5638o5263
$$ plain form
5319 -41077 -117536 -102180 -81126 -40804 42758 35102 8909 270 -1315 -49952 -100991 -92820 -101804
5306 -101804 -103611 -67999 3251 31205 -14187 -57347 -47174 -27058 -6734 24906 33866 17848
5294 17848 2985 -15844 -9625 -30848 -591 51806 113048 104345 94336 66206 78366 45090
5282 45090 68240 102625 76755 4982 21735 18519 11878 -2996 -38100 -59040 -71668 -14589
5270 -14589 -25224 -39582 -32718 -39922 -32486 54682 26005 48622 67160 -9617 -16285 -64040 -72585
5257 -72585 -37933 -68360 1504 23272 23409 -11138 14556 48777 28245 -11808 16929 -15879
5245 -15879 -55849 -60973 -48262 -32954 -75876 -125939 -126057 -99583 -86619 -48584 -32138 -40573 -115901
5232 -115901 -144192 -113717 -79780 -7206 -14267 -22166 -55170 -47312 -31436 -27196 -56394 -73792
$$ packed form
5319d1077p6459J5356K1054M0322Q3562p656k6193q639j585m8637n1039Q171q984
5306a01804j807L5612P1250K7954m5392m3160J0173K0116K0324L1640Q960j6018
5294A7848j4863j8829O219k1223L0257N2397O1242q703j0009k8130J2160l3276
5282D5090K3150L4385k5870p1773J6753l216o641j4874l5104k0940j2628N7079
5270a4589j0635j4358O864p204P436Q7168k8677K2617J8538p6777o668m7755q545
5257g2585L4652l0427O9864K1768J37l4547K5694L4221k0532m0053K8737l2808
5245a5879l9970n124J2711J5308m2922n0063j18K6474J2964L8035J6446q435p5328
5232a15901k8291L0475L3937P2574p061p899l3004P858J5876M240k9198j7398
$$ plain form
5220 -73792 -126043 -119219 -82178 -32752 34261 51223 65634 57625 28091 50593 47488 19432
5208 19432 1035 -24907 -51021 5406 18347 45846 33317 24196 33139 34900 -2626 -26497
5196 -26497 -44806 -25273 50746 46083 26019 15832 10733 -38215 -23458 15406 40398 30416
5184 30416 6518 -2662 86903 78785 35515 -7298 -3326 4430 -16469 34977 51181 38101 23880
5171 23880 -12030 -34358 -71811 -46875 -48506 -48525 -44156 -77315 -48896 -35173 -51938 -54399 -25490
5158 -25490 2982 -63230 -78265 -57918 -90771 -102321 -56052 -19111 -22360 4513 40604 -9230
5146 -9230 -73285 -79312 -57984 -83062 -63962 -36058 -28212 -10988 16034 14753 30621 957 -26366
5133 -26366 -45984 -105472 -129934 -121118 -91340 -51568 17526 -4800 -17817 -38001 -63340 -423
$$ packed form
5220g3792n2251O824L7041M9426O7013J6962J4411q009k9534K2502l105k8056
5208A9432j8397k5942k6114N6427J2941K7499j2529r121Q943J761l7526k3871
5196b6497j8309J9533P6019m663k0064j0187n099m8948J4757L8864K4992r982
5184C0416k3898r180Q9565q118m3270m2813L972P756k0899N1446J6204j3080j4221
5171B3880l5910k2328l7453K4936j631j9M369l3159K8419J3723j6765k461K8909
5158b5490K8472o6212j5035K0347l2853j1550M6269L6941l249K6873L6091m9834
5146i230o4055o027K1328k5078J9100K7904P846J7224K7022j281J5868k9664k7323
5133b6366j9618n9488k4462Q816K9778L9772O9094k2326j3017k0184k5339O2917
$$ plain form
5121 -423 61092 56681 32898 15021 11948 23032 65762 112590 90079 57153 7796 -35130 -53705
5108 -53705 -31975 -68621 -49361 -20204 -4590 28988 15839 -46255 -57961 -24765 -11740 27829
5096 27829 17923 14163 55665 29955 -7595 31463 55774 40139 -2647 -30446 -20991 44396
5084 44396 39944 -45022 -79672 -68273 -60495 18097 45624 17565 -8128 -16985 -3124 37840
5072 37840 42603 5757 -21168 -24193 8335 -11327 -70429 -62132 -64224 -77148 -59141 -45045 -44479
5059 -44479 -53835 -72511 -60317 3103 57651 81217 38738 -13240 -4079 -24663 -34291 -20234
5047 -20234 60238 79296 127890 146509 92211 8048 -63591 -67133 -91182 -101562 -46844 30379
5035 30379 24042 -13607 -20159 -10804 -27326 -73631 -71995 -78175 -3708 -29703 -56457 -40434 -27246
$$ packed form
5121d23O1515m411k3783j7877l073J1084M2730M6828k2511l2926m9357m2926j8575
5108e3705K1730l6646J9260K9157J5614L3578j3149o2094j1706L3196J3025L9569
5096B7829r906l760M1502k5710l7550L9058K4311j5635m2786k7799R455O5387
5084D4396m452q4966l4650J1399P778P8592K7527k8059k5693q857J3861M0964
5072C7840M763l6846k6925l025L2528j9662n9102Q297k092j2924J8007J4096N66
5059d4479r356j8676J2194O3420N4548K3566m2479n1978R161k0584r628J4057
5047b0234Q0472J9058M8594J8619n4298q4163p1639l542k4049j0380N4718P7223
5035C0379o337l7649o552R355j6522m6305J636o180P4467k5995k6754J6023J3188
$$ plain form
5022 -27246 -21714 8725 -6439 -4400 -1941 -2799 -15543 -32829 -50738 -1050 75845 88612 85957
5009 85957 82043 62714 65929 99031 53616 20688 64734 79895 23329 -18023 3655 -32834
4997 -32834 -41207 -6966 -1558 -34746 -12756 8566 53942 33412 -2630 -20525 -34303 -42510
4985 -42510 -5768 -13717 32517 86825 100466 36404 -1151 6437 41502 68351 26689 -76522
4973 -76522 -118700 -58048 -13851 -7701 -40875 -65847 -22365 1314 36086 104890 69738 53738
4961 53738 10868 15640 66015 51377 -21574 -11675 31177 34139 28066 30777 11450 -30795 -38199
4948 -38199 9469 20310 -32500 -27497 20721 7559 -40811 -63570 -62564 -33460 -41690 -35499 -24932
4935 -24932 -67560 -52424 -82873 -73273 -27509 38912 74448 56039 9831 -70684 -54418 5702
$$ packed form
5022b7246N532L0439j5164K039K459q58j2744j7286j7909M9688P6895J2767k655
5009H5957l914j9329L215L3102m5415l2928M4046J5161n6566m1352K1678l6489
4997c2834q373L4241N408l3188K1990K1322M5376k0530l6042j7895j3778q207
4985d2510L6742p949M6234N4308J3641o4062l7555P588L5065K6849m1662j03211
4973g6522m2178O0652M4197O150l3174k4972M3482K3679L4772O8804l5152j6000
4961E3738m2870M772N0375j4638p2951R899M2852K962o073K711j9327m2245p404
4948c8199M7668J0841n2810N003M8218j3162m8370k2759J006K9104q230O191J0567
4935b4932m2628J5136l0449R600M5764O6421L5536j8409m6208q0515J6266O0120
$$ plain form
4923 5702 -20080 -39538 -102379 -125259 -101241 -77888 -77290 -37314 -92328 -135554 -102410 -56637
4911 -56637 -15192 -51326 -2956 -16448 -20209 -22372 -100731 -108083 -53671 20811 -23437 -22819 62844
4898 62844 141328 101094 15606 15697 27046 63434 67313 59211 47937 3922 -52481 -19442 -37052
4885 -37052 -79916 -8643 47863 36339 -595 -4580 -6682 6835 -10926 -34244 -15234 19661
4873 19661 11043 74864 66573 16955 20169 6442 3513 -13650 -4102 71514 106759 76246 -39772
4860 -39772 -43468 25182 -44 -60330 -49021 -7866 -5347 -33758 -59264 -62563 -43858 -68953
4848 -68953 -63755 -44418 -1063 55872 59647 -2609 -46058 -41646 5318 48225 26127 -5287
4836 -5287 -53571 -98072 -94635 -59162 -58639 -95698 -93347 -51567 27025 28588 10723 36812 -8159
$$ packed form
4923E702k5782j9458o2841k2880K4018K3353N98L9976n5014m3226L3144M5773
4911e6637M1445l6134M8370j3492l761k163p8359p352N4412P4482m4248O18Q5663
4898F2844P8484m0234q5488R1J1349L6388L879q102j1274m4015n6403L3039j7610
4885c7052m2864P1273N6506j1524l6934l985k102J3517j7761k3318J9010L4895
4873A9661q618O3821q291m9618L214j3727k929j7163R548P5616L5245l0513j16018
4860c9772l696O8650k5226o0286J1309M1155K519k8411k5506l299J8705k5095
4848f8953N198J9337M3355N6935L775o2256m3449M412M6964M2907k2098l1414
4836e287m8284m4501L437L5473N23l7059K351M1780P8592J563j7865K6089m4971
$$ plain form
4823 -8159 -36762 -69962 -118806 -134006 -153487 -150438 -67487 -27267 1537 -5506 -41554 30924
4811 30924 76080 62855 59524 62314 6347 -25440 -52472 -65470 -14119 12867 34451 5510
4799 5510 -36679 -49398 -49830 -79522 -106900 -62174 -33647 -75353 -115702 -101130 -82782 -21728
$$ packed form
4823h159k8603l3200m8844j5200j9481L049Q2951M0220K8804p043l6048P2478
4811C0924M5156j3225l331K790n5967l1787k7032j2998N1351K6986K1584k8941
4799E510m2189j2719m32k9692k7378M4726K8527m1706m0349J4572J8348O1054
$$ [...]
##END NTUPLES=NMR SPECTRUM
##END=
