##TITLE=Analysis number 323203
Compound Code cc 50946
Book Reference 486/68
Project Code adrs
Chemist Name simons
##JCAMPDX= 6.0         $$ Bruker NMR JCAMP-DX V2.0
##DATA TYPE= NMR SPECTRUM
##DATA CLASS= NTUPLES
##ORIGIN= Bruker BioSpin GmbH
##OWNER= nmr
$$ XWIN-NMR		Version 3.5
$$ Wed Oct 18 15:36:07 2006 GMT Daylight Time (UT+1h)  MAYBRIDGE\nmr@NMR_250MHZ
##.OBSERVE FREQUENCY= 250.131544655141
##.OBSERVE NUCLEUS= ^1H
##.ACQUISITION MODE= SIMULTANEOUS (DQD)
##.ACQUISITION SCHEME= undefined
##.AVERAGES= 16
##.DIGITISER RES= 18
##SPECTROMETER/DATA SYSTEM= dpx250
##.PULSE SEQUENCE= zg30
##.SOLVENT NAME= CDCl3
##.SHIFT REFERENCE= (INTERNAL, CDCl3, 0, 16.4885)
##AUDIT TRAIL= $$ (NUMBER, WHEN, WHO, WHERE, WHAT)
$$ ##TITLE= Audit trail, XWIN-NMR		Version 3.5
$$ ##JCAMPDX= 5.01
$$ ##ORIGIN= Bruker BioSpin GmbH
$$ ##OWNER= nmr
$$ C:\u/data/dgb/nmr/ADRS/920/pdata/1/auditp.txt
$$ ##AUDIT TRAIL=  $$ (NUMBER, WHEN, WHO, WHERE, WHAT)
(   1,<2006-10-18 15:35:47.39 +100>,<MAYBRIDGE\nmr>,<NMR_250MHZ>,
      <created by zg, POWCHK disabled, PULCHK disabled
       configuration hash MD5:
       49 4B E0 1D 92 C2 6B 37 9F E6 65 BC 52 41 86 1D
       data hash MD5: 64K
       23 BB 89 1A DE 89 B5 3F E0 1A B9 7F ED 0A 02 BF>)
(   2,<2006-10-18 15:35:58.98 +100>,<MAYBRIDGE\nmr>,<NMR_250MHZ>,
      <Start of raw data processing
       ef LB = 0.3 FT_mod = 6 PKNL = 1 SI = 32K 
       data hash MD5: 32K
       BB AF A2 51 3D A4 16 4E AA 6B 5F 34 30 5C EF E2>)
(   3,<2006-10-18 15:36:00.61 +100>,<MAYBRIDGE\nmr>,<NMR_250MHZ>,
      <apk 
       data hash MD5: 32K
       F4 07 1C 1A C1 EA D9 67 78 95 78 B6 AC 60 E0 4E>)
(   4,<2006-10-18 15:36:01.36 +100>,<MAYBRIDGE\nmr>,<NMR_250MHZ>,
      <abs ABSG = 5 
       data hash MD5: 32K
       73 0F CD 5B 5D 89 0F AB AB 29 99 47 52 41 2C F5>)
$$ ##END=
$$ 
$$ hash MD5
$$ C7 3D A8 E0 A4 8A AE CB 0C F7 65 0E EA 59 6A 64
##$RELAX= 
##$RELAX= 
##$RELAX= 
##$RELAX= 
##$RELAX= 
##$RELAX= 
##$RELAX= 
$$ Bruker specific parameters
$$ --------------------------
##$DU= <C:\u>
##$EXPNO= 920
##$NAME= <ADRS>
##$PROCNO= 1
##$TYPE= <nmr>
##$USER= <dgb>
##$AMP= (0..31)
100 100 100 100 100 100 100 100 100 100 100 100 100 100 100 100 100 100 
100 100 100 100 100 100 100 100 100 100 100 100 100 100 
##$AQSEQ= 0
##$AQ_mod= 3
##$AUNM= <au_zg>
##$AUTOPOS= <42 >
##$BF1= 250.13
##$BF2= 250.13
##$BF3= 250.13
##$BF4= 250.13
##$BF5= 500.13
##$BF6= 500.13
##$BF7= 500.13
##$BF8= 500.13
##$BYTORDA= 1
##$CFDGTYP= 0
##$CFRGTYP= 5
##$CHEMSTR= <none>
##$CNST= (0..31)
1 1 145 1 1 1 1 1 1 1 1 1 1 1 1 1 1 1 1 1 1 1 1 1 1 1 1 1 1 1 1 1 
##$CPDPRG= <>
##$CPDPRG1= <>
##$CPDPRG2= <>
##$CPDPRG3= <>
##$CPDPRG4= <mlev>
##$CPDPRG5= <mlev>
##$CPDPRG6= <mlev>
##$CPDPRG7= <mlev>
##$CPDPRG8= <mlev>
##$CPDPRGB= <>
##$CPDPRGT= <>
##$D= (0..31)
0 1 0 0 0 0 0 0 0 0.06 0 0 0 0 0 0 0.0002 0 0 0 0 0 0 0 0 0 0 0 0 0 0 
0 
##$DATE= 1161182146
##$DBL= (0..7)
120 120 120 120 120 120 120 120 
##$DBP= (0..7)
150 150 150 150 150 150 150 150 
##$DBP07= 0
##$DBPNAM0= <>
##$DBPNAM1= <>
$$ [...]
##$SUBNAM7= <"">
##$SUBNAM8= <"">
##$SUBNAM9= <"">
##$SW= 20.6930455092707
##$SWIBOX= (0..15)
0 0 3 0 0 0 0 0 0 0 0 0 0 0 0 0 
##$SW_h= 5175.983436853
##$TD= 65536
##$TD0= 1
##$TE= 683.16
##$TE2= 300
##$TE3= 300
##$TEG= 300
##$TL= (0..7)
0 120 120 120 120 120 120 120 
##$TP= (0..7)
150 150 150 150 150 150 150 150 
##$TP07= 0
##$TPNAME0= <>
##$TPNAME1= <>
##$TPNAME2= <>
##$TPNAME3= <>
##$TPNAME4= <>
##$TPNAME5= <>
##$TPNAME6= <>
##$TPNAME7= <>
##$TPOAL= (0..7)
0.5 0.5 0.5 0.5 0.5 0.5 0.5 0.5 
##$TPOFFS= (0..7)
0 0 0 0 0 0 0 0 
##$TUNHIN= 0
##$TUNHOUT= 0
##$TUNXOUT= 0
##$USERA1= <user>
##$USERA2= <user>
##$USERA3= <user>
##$USERA4= <user>
##$USERA5= <user>
##$V9= 5
##$VALIST= <valist>
##$VCLIST= <CCCCCCCCCCCCCCC>
##$VD= 0
##$VDLIST= <DDDDDDDDDDDDDDD>
##$VPLIST= <PPPPPPPPPPPPPPP>
##$VTLIST= <TTTTTTTTTTTTTTT>
##$WBST= 1024
##$WBSW= 4
##$XGAIN= (0..3)
0 0 0 0 
##$XL= 0
##$YL= 0
##$YMAX_a= 419276
##$YMIN_a= -463560
##$ZGOPTNS= <>
##$ZL1= 120
##$ZL2= 120
##$ZL3= 120
##$ZL4= 120
##$ABSF1= 16.48847
##$ABSF2= -4.204702
##$ABSG= 5
##$ABSL= 3
##$ALPHA= 0
##$AQORDER= 0
##$ASSFAC= 0
##$ASSFACI= 0
##$ASSFACX= 0
##$ASSWID= 0
##$AUNMP= <proc_1d>
##$AZFE= 0.1
##$AZFW= 0.1
##$BCFW= 0
##$BC_mod= 0
##$BYTORDP= 0
##$COROFFS= 0
##$CY= 12.5
##$DATMOD= 1
##$DC= 0
##$DFILT= <>
##$DTYPP= 0
##$F1P= 14.0000005364418
##$F2P= -0.99999901652339
##$FCOR= 0.5
##$FTSIZE= 32768
##$FT_mod= 6
##$GAMMA= 0
##$GB= 0
##$INTBC= 1
##$INTSCL= 1
##$ISEN= 128
##$LB= 0.3
##$LEV0= 0
##$LPBIN= 0
##$MAXI= 10000
##$MC2= 0
##$MEAN= 0
##$ME_mod= 0
##$MI= 0
##$NCOEF= 0
##$NC_proc= -3
##$NLEV= 6
##$NOISF1= 0
##$NOISF2= 0
##$NSP= 0
##$NTH_PI= 0
##$NZP= 0
##$OFFSET= 16.48847
##$PC= 1
##$PHC0= 152.7224
##$PHC1= 7.730349
##$PH_mod= 1
##$PKNL= yes
##$PPARMOD= 0
##$PSCAL= 4
##$PSIGN= 0
##$REVERSE= no
##$SF= 250.130008384798
##$SI= 32768
##$SIGF1= 0
##$SIGF2= 0
##$SINO= 400
##$SIOLD= 32768
##$SREGLST= <1H.CDCl3>
##$SSB= 0
##$STSI= 32768
##$STSR= 0
##$SW_p= 5175.98343685301
##$SYMM= 0
##$S_DEV= 0
##$TDeff= 65536
##$TDoff= 0
##$TI= <Analysis number 999999
Compound Code 99
Book Reference 9
Project Code 9>
##$TILT= no
##$TM1= 0
##$TM2= 0
##$TOPLEV= 0
##$USERP1= <user>
##$USERP2= <user>
##$USERP3= <user>
##$USERP4= <user>
##$USERP5= <user>
##$WDW= 1
##$XDIM= 32768
##$YMAX_p= 421019187
##$YMIN_p= -73065
$$ End of Bruker specific parameters
$$ ---------------------------------
##NTUPLES= NMR SPECTRUM
##VAR_NAME=  FREQUENCY,     SPECTRUM/REAL,   SPECTRUM/IMAG
##SYMBOL=    X,             R,               I
##VAR_TYPE=  INDEPENDENT,   DEPENDENT,       DEPENDENT
##VAR_FORM=  AFFN,          ASDF,            ASDF
##VAR_DIM=   32768,         32768,           32768
##UNITS=     HZ,            ARBITRARY UNITS, ARBITRARY UNITS
##FACTOR=    0.157963299565203, 1,           1
##FIRST=     4124.26115874123, 0,            0
##LAST=      -1051.72227811178, 0,           0
##MIN=       -1051.72227811178, -73065,      0
##MAX=       4124.26115874123, 421019187,    0
$$ Real data points
##PAGE= N=1
##DATA TABLE= (X++(R..R)), XYDATA
$$ [...]
16770C8725j775l092n078m215L713J222K715L734m40m946k092K146M597J525J920
16755C8659p579k566j781J07J314K727J272J58j539m152j773K495J595K062L242
16740C4241K48l619j668R6K99q12j015n7l798J514M78l99k81k136p11J352j84
16723B3548J464J059j057K64j603j821K570N450l197l498J678j646n041k738K427
16708A7859J375K632L87J084M161J83q80k42K418K359m936k578j061k023l573
16693A7165Q09N818O26j724k067j998k66P81J692j198M416l616m17K552k119P09
16677B1163M318J267L57N795p22o592k648l229K803L493Q47j283J414P62m78n803
16661B1464r03J35n84P85K302m30j853k762N05p89q27N995L094K675K599k703
$$ y = [38725, 36950, 33858, 28780, 24565, 28278, 29500, 32215, 35949, 35509, 30563, 28471, 30617, 35214, 36739, 38659, 31080, 28514, 26733, 26840, 28154, 30881, 32153, 32311, 30772, 26620, 24847, 27342, 28937, 30999, 34241, 34489, 30870, 29202, 29298, 29597, 28785, 27770, 27713, 23915, 25429, 25907, 25508, 25227, 23091, 22380, 23732, 23548, 25012, 26071, 25014, 25278, 23675, 21854, 24424, 29874, 26677, 23179, 24857, 23211, 18170, 15432, 17859, 19234, 21866, 22253, 23337, 27498, 27681, 26801, 26559, 28977, 31336, 26400, 23822, 22761, 20738, 17165, 17974, 23792, 24418, 22694, 20627, 18629, 18363, 19144, 20836, 19638, 24054, 20438, 20021, 22573, 20454, 21163, 25481, 26748, 27105, 32900, 32178, 25586, 22938, 19709, 22512, 26005, 26852, 25569, 26983, 27745, 27267, 21464, 20561, 20696, 20112, 20897, 23199, 22769, 20916, 18154, 18659, 17870, 17043, 23038, 26132, 28807, 31406, 28703]
16645B8703m702m967M14j086P47m427L518L181n844K77p48K800M466N49p079n101
16629A0701J669j102O416Q050P301N295n42J231k675K941K402O128M368O522O117
16614F4822N001N230k29o057q927n608j1314j0801m653Q02P71m032j608k975o582
16599A3840k864N467o54m562l027q18r96j003k984o54L066j378j359j664l78O266
16583F298O756j036m881m0l444k496N76O1J050J430p7p35n37l233j088K444j468
16566d20l783J278j377Q74N149M081Q44J124m837l625L63j48j492K54K735L689
16550D709k292n478J467L706j101K307q72m372J535N084J187p68n189l172j209
16535d458K42L932q5L238J949J80n413m632N7N096J556l794K127J958j370k334
$$ y = [28703, 24001, 19034, 19448, 18362, 19109, 14682, 18200, 21381, 15537, 15814, 15066, 17866, 22332, 22881, 15802, 10701, 12370, 11268, 17684, 25734, 33035, 38330, 37788, 39019, 36344, 39285, 41687, 47815, 52183, 58705, 64822, 69823, 75053, 74824, 68767, 59840, 54232, 42918, 32117, 27464, 28266, 29037, 25005, 23397, 20422, 13840, 10976, 16443, 15789, 11227, 8200, 7382, 6386, 5383, 2399, 1745, 4811, 3433, 2074, 410, 32, 6298, 13054, 12018, 7137, 7097, 3653, 1157, 1733, 1794, 2844, 4274, 4197, 3462, 2925, -308, -1396, 1048, -420, -4203, -2925, -4302, -3428, 1721, 5802, 6646, 7770, 2933, -692, -329, -477, -1969, -1715, 1020, 4709, 2417, -3061, -1594, 2112, 1011, 3318, 2446, -1926, -391, 4693, 5880, 5112, -77, -3249, -4458, -4216, -284, -369, 2869, 4818, 4998, -415, -5047, -4990, 106, 1662, -2132, -5, 1953, 583, -1751]
16519a751J621J755J380r15R32K392m980m876O661M661J8l58j592J123k538r07
16503B626l863o137M50K407j896R19l35l83L526M357r76o868k670j26j21r31K355
16486g666K503m832p367k712Q819N223P04j72p09J759Q074N543M01l852m074k661
16470a019K225J019n93j58n68m168j231N91N048L885l483n091O4oO806n04J945
16453D762J267k159k452k068l840j499R41L490k821j026P82j225K109k477K198
16438d018M50k510L818N22j119k867K455M889K771l609M76J001l399L675J33k728
16422f0n932J851j016r44n51J311M618O395Q38j935n744r44K46l764p85n72L80
16405f608L51l535l984j14O227K348j390k111K06O593l22m852k568R23J138k3
$$ y = [-1751, -130, 1625, 3005, 2090, 3022, 5414, 434, -4442, 2219, 6880, 6898, 6540, 4948, 6071, 3533, 2626, -1237, -7374, -6924, -4517, -6413, -5494, -5829, -6212, -2686, 1671, 695, -6173, -8843, -8969, -9090, -10021, -7666, -5163, -9995, -17362, -20074, -11255, -6032, -5328, -5500, -6209, -4450, 3624, 9167, 9568, 5716, 1642, -1019, 1206, 2225, 1632, 1474, 906, -3262, -4493, -3902, 1146, 5031, 1548, -3543, -3479, -3485, 3321, 2817, 4762, 6029, 3870, 1418, -650, -4490, -5989, -5048, -1558, -4379, -5405, -4623, -5848, -3739, -6216, -4018, -3568, -6078, -2260, -1738, -2857, -5724, -3269, 1620, 4391, 782, 1258, 2259, -1140, 2535, 2668, -60, -5992, -4141, -5157, -6101, -6652, -5341, -723, 5672, 6510, 4575, -1169, -2113, -1867, -5631, -6416, -6988, -6608, -6257, -9792, -13776, -13890, -7663, -5315, -6705, -8816, -8610, -2017, -2339, -7191, -9759, -8836, -7698, -7721]
16389g721j708o76k522P89O513N944L519o53l862k562l368L576L359L43n740o291
16373a1060k604J616J0409R45M45J560p62J563N17J989j904o59J982L398j274
16358F161l776m495j994k324l852M428L279L912J723m647J14K72l041k96J042
16343c494K263j57l603J983m43L78m53q50j129j855K975J044n269m847J460o47
16327a2644L169j818k744J062l08J179K772J125k050m006Q07L494O482p89K422
16312a847Q24N17q18J570j37L005k247j133k941o474j272K748O693K502k175L28
16296h57q33k043j288k424j496M24O26n267K866J513R23L810L445K576l528J936
16280C83J919k394l779J94M260m284m54K616l023k615N809K960J643J66j206m302
$$ y = [-7721, -9429, -10105, -12627, -11838, -5325, 619, 4138, 3485, -377, -2939, -6307, -2731, 628, 971, -4769, -11060, -13664, -12048, -1639, -694, -249, 1311, 549, 2112, 2629, 4618, 2714, 2055, 4037, 7435, 6161, 2385, -2110, -4104, -6428, -10280, -5852, -2573, 1339, 3062, -1585, -1471, -1199, -4240, -4536, -3494, -1231, -1388, -4991, -3008, -3451, -3073, -3526, -4376, -5505, -7360, -4385, -3341, -8610, -13457, -11997, -12644, -9475, -11293, -14037, -12975, -13283, -12104, -9332, -8207, -10257, -14263, -13456, -9962, -3480, -4269, -1847, -1023, -506, -1324, 246, 109, 3114, 867, -266, -3207, -9681, -10953, -8205, -1512, 990, -1185, -857, -1690, -3733, -5021, -7445, -8941, -8517, -7891, -13158, -10292, -8779, -7856, -4046, -601, 1975, -1553, 383, 2302, -92, -3871, -3677, 583, -3701, -4155, -1539, -4562, -7177, -1368, 1592, 3235, 3401, 2195, -2107]
16264b107m974J285K224R151L331m782n51m595o261L0K810M439J25L50L110J912
16248E497n358l335k799k559j27N519J451O43k272J047r10J48K657N169L161o56
16232G276l568j447P52n685m363l48K894Q810L576l366m207m683k195J148K269
16217c137k640n744j693J745P709L365j921J533K213l214N57J035O726N391m305
16202G620l936q91m345k698J592N164j655j904n5J844r65L27J038Q09j766k082
16186a903K413l223l85q21K943j371N39K905J153j162j616P38J519K309p56l508
16170b26k879q97J511J825K162l630L812L251M242k887L299L757j710J319j454
16155A1495j702l0J290j570p871l629m90P75j063K972K199j860j446J318O3L168
$$ y = [-2107, -7081, -5796, -3572, 5579, 8910, 4128, 3577, -1018, -7279, -7249, -4439, 0, 125, 475, 3585, 5497, 139, -3196, -5995, -8554, -8681, -3162, -1711, -1068, -3340, -2293, -3203, -3055, -398, 4771, 7932, 7276, 3708, 2261, 3013, -2672, -7035, -7383, -4489, 4321, 7897, 4531, 324, -4359, -6554, -5406, -3137, -5777, -11521, -13214, -11469, -3760, -395, -2316, -783, 1430, -1784, -1227, -192, 6534, 11925, 7620, 3684, 2793, -1552, -4250, -2658, 2506, 851, -1053, -1108, 736, -229, 98, 1136, 1945, 179, -1903, 510, -2713, -3098, -3919, -976, -2347, -1808, 1097, 2250, 1088, -528, 210, 1729, 4038, 3282, -226, -3105, -4002, -2491, -666, 1496, -2134, 1678, 4929, 9171, 6284, 9583, 13340, 11630, 12949, 11495, 9793, 9763, 11053, 9483, 1612, -2017, -2507, -1732, -2795, 177, 2376, 516, -930, 388, 451, 3619]
16139C619O774J954K435l936l709R69O312j965k992J825l09k463P61n31j690O165
16123A3219M644K409o245k824l82K023m735N255L681k037n247j004K813J521j728
16108A1363k932J342L254P366j589p769j268L999J655K379R02o532j094J077K56
16093A2409k379L593M827m032p105J791N969M118K508N086m889n377j868K24K545
16078A7420j722n64L945J004o70L566K724K959n157k335m221l421L79O133M669
16063B4709J420l141J546l63M417K528k08n453o657N83l001n191K657J097m17
16048A4526J111M415N117L060k768k833K940N022K259l229j334J043m14O62k94
16033B9283j21j6j452m19r39J416J119j108k136K997N197N1M84M51k706n831K362
$$ y = [3619, 10393, 12347, 14782, 10846, 7137, 8106, 14418, 12453, 9461, 11286, 10977, 8514, 9275, 8744, 7054, 13219, 17863, 20272, 14027, 11203, 10821, 12844, 8109, 13364, 17045, 15008, 9761, 8757, 11570, 13091, 11363, 8431, 9773, 13027, 20393, 18804, 11035, 9767, 13766, 15421, 17800, 18702, 12170, 11076, 12153, 12409, 10030, 13623, 18450, 14418, 7313, 9104, 15073, 19191, 21699, 26785, 21896, 16519, 14651, 14875, 17420, 15698, 15134, 19079, 20083, 19413, 22979, 25703, 28662, 23505, 21170, 16949, 13528, 13907, 20040, 24709, 26129, 22988, 24534, 24171, 28588, 31116, 30908, 25455, 18798, 19381, 16380, 11189, 13846, 14943, 14526, 15637, 20052, 25169, 28229, 25461, 22628, 25568, 30590, 32849, 29620, 28286, 29329, 28915, 29577, 29283, 29162, 29146, 27694, 27275, 26336, 27752, 28871, 27763, 25627, 28624, 33821, 33872, 34356, 34807, 32101, 26270, 28632]
16016B8632J917j280j277j882Q83O92j261P298L398J440j795j850l56l094m273
16001B7192K480j252k175l07L022J857O954L757j610o785j690o98L474J073q303
15986B6989j647m302K199M506M246k057n717m768K555N580K491L031m328m26K576
15971C0928L725m541l341j92k14J217J151J09o719l589M767L85J210M04l120J171
15955B3351K837k717P67K743K28l40N97K575J205K614j589q103o304J988J826
15940B1678m108P67l41L842P3K33k430K24l655j060L434L218l017l002j552L436
15924A7740K477q90m88M122J063N66P78m326k067J133J536k460O7l806L360N029
15908B3834l468k547m033L421K641k418j425J504K278J926k531j307k113j419
$$ y = [28632, 30549, 29269, 27992, 26110, 26993, 27685, 26424, 33722, 37120, 38560, 36765, 34915, 34559, 31465, 27192, 29672, 28420, 26245, 25938, 28960, 30817, 37771, 41528, 39918, 33133, 31443, 30745, 34219, 35292, 26989, 25342, 21040, 23239, 27745, 31991, 29934, 24217, 19449, 22004, 27584, 30075, 33106, 28778, 28352, 30928, 34653, 30112, 26771, 26579, 26365, 27582, 28733, 28842, 22123, 18534, 23301, 23686, 24896, 25300, 22180, 23351, 26188, 23471, 24238, 26981, 27209, 26869, 27466, 30041, 31246, 33860, 32271, 24168, 17864, 19852, 21678, 17570, 18337, 17996, 21838, 21911, 22144, 19714, 19938, 16283, 15223, 18657, 21875, 18858, 15856, 14304, 17740, 20217, 19327, 18839, 22961, 24024, 24590, 25368, 21042, 18975, 20108, 21644, 19184, 19251, 15445, 18805, 23834, 20366, 17819, 13786, 17207, 19848, 17430, 16005, 17509, 19787, 21713, 19182, 17875, 15762, 14343]
15894A4343J200k733J135M909Q48M86J64m644q349j602q4k52L895K061m734j574
15878E069Q50P17L304M566P40L977l428r399R95N40l688K485N143K784j920J092
15862A3827j073o792p599L956J662j860O941K068k935m626K003K488K00n50R7
15847G807k658M67L878J791k405k517r225l852M311K497K727J574n933j261K004
15832g95o699j010O134k485J876K372l021P40k344J985M569K450n690o302j47
15817h367L309L873K235l083J212N082J751m773m823K119N730p15m026n13n790
15802f779r19J212J989K152J43M60J335O8l35k420l380r79K863Jl450M22k879
15785a0496l44K173O109J787k404L16l82k055Q47p29k626K821K941q289l448M470
$$ y = [14343, 15543, 12810, 13945, 18854, 19702, 20188, 20352, 15708, 7359, 5757, 5673, 5421, 9316, 11377, 6643, 5069, 5919, 6636, 9940, 14506, 15246, 19223, 15795, 6396, 7391, 7931, 4243, 6728, 11871, 14655, 12735, 13827, 12754, 5962, -1637, 2319, 3981, 2121, 9062, 11130, 8195, 3569, 5572, 8060, 8260, 7710, 7807, 5149, 5616, 9494, 11285, 8880, 6363, -2862, -6714, -2403, 94, 2821, 4395, -1538, -2799, -795, -7494, -8504, -2370, -4855, -2979, -607, -3628, -2888, -5232, -3247, 1322, 3772, -1918, -8220, -8367, -5058, -1185, 1050, -2033, -821, 4261, 6012, 1239, -3584, -1465, 4265, 3550, -476, -989, -6779, -7698, -6486, -4497, -2345, -2202, -1742, -407, -339, -674, -3094, -6474, -7453, -4590, -4589, -8039, -7617, -10496, -10840, -8667, -2558, -771, -3175, -2859, -3241, -5296, -4449, -5178, -7804, -4983, -2042, -10331, -13779, -9309]
15769i309L349q72l980J206K046J340L15K551m97n682L04O86L701r58n406k256
15753a3462j928R93R96J443L7p62N57J505k150j014M94l568K235J962L15k879
15737a5226j063K475r02P07L252n08M986k602K547j932m526l738l138L286P872
15722h510O133L06j16n767j707p40l754j84J648M387l125J210j413J789J179k136
15706a0800m273k339K8K781M651J080n02J978j007O82K75k173m476L057J348n26
15690a0216L987M889o074n714j684K249L91j764J87N413j943k450M566O23l748
15675a1288k398j155L330Q783J439q13j268O25M795q29K89K712J957P54o597k845
15659b509L398L998j857n697P92M86j471J577p59l308l465k830J129M138L14k414
$$ y = [-9309, -5960, -6832, -10812, -9606, -7560, -6220, -5905, -3354, -3851, -9533, -9229, -8543, -4842, -5800, -11206, -13462, -15390, -14397, -13401, -11958, -11921, -12683, -12126, -10621, -12771, -13785, -13291, -16859, -14624, -12662, -12347, -15226, -16289, -13814, -14716, -14009, -10757, -11265, -6279, -8881, -6334, -8266, -12792, -16530, -19668, -16382, -8510, -2377, -2071, -2187, -7954, -9661, -10401, -14155, -14339, -12691, -8304, -11429, -10219, -11632, -9843, -8664, -10800, -15073, -17412, -17384, -14603, -9952, -8872, -9374, -7396, -8403, -7721, -7446, -9619, -14095, -11038, -9690, -10216, -6229, -1340, -7414, -13128, -14812, -12563, -12172, -13936, -13749, -8336, -10279, -12729, -8163, -7540, -11288, -13686, -14841, -11511, -2728, -1289, -2102, -3370, -2745, 2050, 1221, 1510, 4222, 6179, 6933, 336, -2509, 889, 4887, 3030, -2667, -1875, -1389, -2860, -1283, -2042, -5350, -8815, -11645, -10516, -6378, -6064, -8478]
15643h478m42k110j736q44K703K61J056n20J470J3k278O33j147L502M60J0339
15627B882K133j542L677J185L71k780m65J081J242K437j362j606K930j618j1194
15612b629l823l70J103L667J303m715j200l717l62J400k480J132k737j925N970
15597i383P361j940j995j935K477K002J646q17K880J281K025o453p1p5k780L904
15581a873K506L746K320n916J653K167K848k653J496J520L80m703r59O30l883
15566g21m13j303l670K133k216j169k288M591J032l324j556j417k987N37L084
15551i687K24k180K7P92J061k058l571j266L336M978M497J429K6l792J394M432
15535c58j173p303n628K275L951K303L390j709n472M869l331k984L46m847J288
$$ y = [-8478, -8920, -11030, -12766, -13610, -10907, -10646, -9590, -10110, -8640, -8627, -10905, -10272, -11419, -7917, -7457, 2882, 5015, 3473, 7150, 8335, 8706, 5926, 5461, 6542, 7784, 10221, 8859, 7253, 10183, 8565, -2629, -6452, -6822, -5719, -2052, -749, -5464, -6664, -10381, -10743, -9343, -11823, -10691, -13428, -15353, -9383, -2022, -3962, -5957, -7892, -5415, -3413, -1767, -2584, 296, 1577, 3602, -2851, -2922, -2997, -5777, -1873, 633, 4379, 6699, 783, 2436, 4603, 7451, 4798, 6294, 7814, 8194, 3491, 2532, 3162, -721, -1134, -2437, -6107, -3974, -6190, -7359, -9647, -5056, -4024, -7348, -8904, -10321, -13308, -12771, -9687, -9463, -11643, -11616, -10824, -9763, -11821, -15392, -16658, -13322, -8344, -3847, -2418, -2392, -6184, -4790, -358, -1531, -8834, -14462, -12187, -8236, -5933, -2543, -4252, -9724, -4855, -8186, -11170, -10824, -15671, -14383]
15520a4383L073J7J944l024m084J979J609p67O368j772l796m105J696j990m635
15505b1870J21J440K254N173K209m169l409J873k496j694J701L98J710J198k568
15490a8129j403l443O28j59l145L36J674J022k146N596L719j450k304m940N03
15475b3641K149j180M51J440L914J013k350j986L201k60k74J744k882n897m583
15460b9141K085M995J793j237k324n08N743k290j409P64Q27K60k53k613k666L44
15444b5630L511j928j156Q47O347l866m814K636N951K099k595q8j597j149J653
15429a9779m132m257P41K374k063k392M068M15q66Q6j135O322K938K692j007k460
15413a8455j77q565J993K920K531j070K231j93K259l788k463j723K209J004J954
$$ y = [-14383, -11310, -11293, -9349, -12373, -16457, -14478, -12869, -13636, -7268, -9040, -12836, -16941, -15245, -17235, -21870, -21749, -20309, -18055, -12882, -10673, -14842, -18251, -16378, -18874, -20568, -18867, -18469, -16759, -15561, -18129, -19532, -22975, -22347, -22506, -25651, -25315, -23641, -22619, -24765, -19169, -15450, -16900, -19204, -24144, -23641, -21492, -22672, -22221, -20781, -16867, -15854, -18204, -20190, -16989, -17249, -17523, -15779, -18661, -24558, -29141, -27056, -22061, -20268, -21505, -23829, -24337, -18594, -20884, -22293, -21529, -20702, -20442, -20695, -23308, -25974, -25630, -22119, -24047, -25203, -24356, -18009, -21875, -26689, -24053, -18102, -16003, -18598, -18686, -20283, -21432, -19779, -23911, -28168, -27427, -25053, -27116, -29508, -25440, -25025, -25891, -25805, -26940, -20618, -17680, -14988, -15995, -18455, -18632, -27197, -25204, -22284, -19753, -20823, -18592, -18785, -16526, -20314, -22777, -24500, -22291, -21287, -19333]
15398a9333l843M317L8k398k977J830L152k114l196j044J375M085k199k201m57
15383b4965N2m116j37N955K299q99j424J419m766k410k93K430O033j312j319R05
15367b2548L392K955L5n829K6M8j708k78j585J416J783K448J184k018J655k56
15351a9280L733K342m37p69j103k164o950o440J776K601r64j235k719K655O260
15336b2694O87L673p27L927K705L3o813l593n030m415L232N844n74j359j052l35
15320b6491L506O344j618n645l852L3J603K076k144l952L358K935m386k39M282
15305b4190q54k453J573n33K366J020j558K363J368ML555M384m548j941j806k770
15289b4020j546mm417J547J412m935j646J257N034L973p565l664L310N327J255
$$ y = [-19333, -23176, -18859, -18821, -21219, -24196, -22366, -19214, -21328, -24524, -25568, -24193, -20108, -22307, -24508, -24965, -24913, -29029, -29166, -23211, -20912, -21811, -23235, -21816, -26582, -28992, -29285, -26855, -20822, -22134, -23453, -22548, -19156, -16201, -16166, -21995, -21969, -21921, -23629, -23907, -25492, -24076, -22293, -19845, -18661, -20679, -19024, -19280, -15547, -13205, -13642, -14411, -15514, -17678, -24628, -31068, -29292, -26691, -27655, -28890, -31609, -28954, -22694, -22007, -18334, -19061, -15134, -12429, -12396, -19209, -22802, -27832, -32247, -29015, -23171, -23745, -25104, -26156, -26491, -22985, -16641, -18259, -23904, -27756, -27723, -26120, -24044, -26188, -30140, -26782, -23847, -28233, -28472, -24190, -25044, -27497, -25924, -26457, -24091, -23071, -24629, -22266, -20898, -20894, -17339, -12955, -17503, -19444, -21250, -24020, -25566, -25570, -29987, -28440, -27028, -31963, -33609, -32352, -27318, -23345, -30910, -34574, -31264, -25937, -24682]
15274b4682k292j183r11L783L627j291m184L190K191k075m236J759j548k691j386
15259c1929J482O8J018L117R07l319j638L02j098K411o65k104J072L214l91k467
15243c0020k010p68Q64J572L868J663L505K457n037J243K207l206m630O074N030
15228a7188j889j610j979n018J35K301q48p84r06K047P38l57k838J344N70L100
15212b3182J584m5K245j40j601o65m103M78l039K4L388k272j112L167M723O51
15196a9899M378j50r508o594J560N489j662L963J458k066l009r3K602l997l100
15181c0628K306L218j128J26J348K539l147K739N538O792K018M262L443J2887
15167A2313P375P135J0080O148O072P247L196j716k166m424q255j0948o947r031
$$ y = [-24682, -26974, -28157, -29068, -25285, -21658, -22949, -27133, -23943, -21752, -23827, -28063, -26304, -27852, -30543, -31929, -30447, -30379, -29361, -26244, -25337, -28656, -30294, -29992, -31090, -28679, -29344, -31448, -30376, -27162, -27553, -30020, -32030, -32798, -31934, -30362, -26494, -24831, -21326, -18869, -23906, -22663, -20456, -23662, -28292, -22218, -17188, -19077, -20687, -22666, -27684, -27549, -25248, -26096, -26880, -27786, -25739, -25001, -25358, -28196, -26852, -26282, -23182, -21598, -21643, -19398, -19538, -21139, -21804, -25907, -25429, -28468, -28444, -25056, -27328, -28440, -25273, -20550, -19899, -15521, -15671, -25179, -31773, -30213, -24724, -26386, -22423, -20965, -23031, -26040, -26133, -23531, -27528, -30628, -28322, -25104, -26232, -26106, -24758, -22219, -25366, -22627, -17089, -10297, -8279, -4017, -574, 12313, 19688, 26823, 36903, 43051, 49123, 56370, 59566, 57850, 55684, 51260, 43005, 32057, 25110, 16079]
15153A6079o323n669j241k571l642l410m78l849k610l254k446j891m039M027N457
15138a5860p32l841l607l247P32N756L008j590o37J977n56K286r416j528O587
15123b0668L979l098P18P44m72Q14L216K020n27J309q73n591l328J302K021O080
15107a2354J150Q01L641j16m723P96J539K038L108j012j396l696r06O92l351m104
15091a7893J821j043k9l925m427Q317P339J341O7l700k092k95J625J437j40J98
15075a1399O204O891P305N554P834l02n15R280L956l225r69L340L580j591m110
15060C1833k561l765K723j307J389L922k862j281q71m38O633M332R721N677Q589
15045F1734J4167J9288K2907K1508K1331K6162J9559J1921J1519J291o016j7545
$$ y = [16079, 9756, 4087, 2846, 275, -3367, -6777, -7255, -11104, -13714, -16968, -19414, -21305, -25344, -21317, -15860, -16592, -20433, -24040, -27287, -26555, -20799, -17791, -19381, -20018, -18041, -18597, -16311, -25727, -27255, -20668, -16689, -19787, -19069, -18325, -18797, -17983, -14767, -12747, -13274, -11965, -12838, -18429, -21757, -20455, -18434, -12354, -11204, -10403, -6762, -6878, -11601, -10805, -9266, -7228, -4120, -5132, -6528, -10224, -11130, -10438, -13789, -17893, -16072, -17115, -17144, -21069, -25496, -17179, -9840, -8499, -8432, -12132, -14224, -14519, -12894, -11457, -11597, -11399, -5195, 1696, 9001, 14555, 22389, 22087, 21572, 30852, 34808, 31583, 30614, 33954, 37534, 35943, 31833, 29272, 25507, 28230, 26923, 28312, 32234, 29372, 28091, 27220, 26782, 33415, 37747, 47468, 53145, 61734, 75901, 95189, 118096, 139604, 160935, 187097, 206656, 218577, 230096, 231387, 225371, 207826]
15033B07826k1968k2101l0388k7136k1284k8032k4080j0366q085r980j803k811
15021b08n706L109J199L670l48Lk806q099n64K210J881k645m261m109l727m515
15005b4916k849N939O724O40J064L49J94r97n24m73k545J327P79o06j711k031
14989a9636K829k87k839K97M615K622J516K683K936n503j0446m99O137o309n315
14974b7199M82N44M016K87j759J419J040L91J91J919p06k520m72k35O344L113
14958a3145K463m097n174j869k49K301l093j053L283m630j500j385K561P97K603
14943b2187J602j077j138jn25K826L780j615j435k973P14Q35L285M211K142L456
14927h100J547j908l95K29j347J41K338J357O777R126J2958J7158L3270N3301
$$ y = [207826, 185858, 163757, 133369, 106233, 84949, 56917, 32837, 22471, 14386, 4406, 2603, -208, -5914, -2805, -1606, 2064, 1716, 1719, -1087, -9186, -9750, -7540, -5659, -8304, -12565, -16674, -20401, -24916, -27765, -21826, -15102, -14462, -13398, -13049, -12855, -13852, -14376, -14849, -17394, -16067, -15288, -15894, -17605, -19636, -16807, -17094, -19933, -19636, -15021, -12399, -10883, -8200, -5264, -10767, -21213, -21712, -15575, -21884, -27199, -26717, -26173, -22157, -21870, -23629, -22210, -21170, -20779, -20588, -18669, -19375, -21895, -22367, -22602, -16258, -13145, -10682, -14779, -19953, -21822, -22071, -19770, -22863, -23916, -20633, -25263, -26763, -28148, -25587, -24790, -22187, -20585, -21662, -22800, -22801, -23326, -20500, -16720, -18335, -19770, -22743, -22029, -21194, -17909, -13698, -11556, -8100, -6553, -8461, -8856, -8627, -9974, -9833, -7495, -6138, 639, 9765, 22723, 39881, 73151, 126452]
14913A26452O5350M7942K7498J8729K3269L0445K5399n0285j08567q8055m8614
14902F9563k3697j4452r523q849n970l909J265l026n743o613n214l025J065K964
14888a5164n429K827M027L683K695l691n35m473m098m99K80K235j370O6m09j430
14872b1285J37j909k677J801K795J35o51P01J166k290j212L068M823k022R37J051
14856a5432k16K243k568l296j860o46m90p23k540K022j710J497M461J162p02K779
14840a6019p29j615J63J599K893k446o861p35J3p86M872K64l44m095l892k404
14824c0122k01O252O151k153j817j1013k152K190O515M671J919p53K29k823k964
14809b6071J394K353N565J736m873l668O122K596n99l402l601k665L229M686N19
$$ y = [126452, 191802, 239744, 267242, 285971, 309240, 339685, 365084, 314799, 206232, 118177, 69563, 45866, 31414, 21891, 13042, 7072, 3163, 4428, 1402, -4341, -10954, -16168, -19193, -18128, -15164, -20593, -17766, -13739, -10056, -7361, -11052, -11587, -16060, -20158, -20657, -20377, -18142, -19512, -19446, -19855, -21285, -21148, -23057, -25734, -23933, -21138, -21003, -21654, -20953, -19787, -22077, -23289, -20221, -15398, -17420, -16483, -15432, -15648, -13405, -15973, -19269, -21129, -21775, -22265, -22988, -25528, -23506, -25216, -23719, -19258, -18096, -18798, -16019, -16748, -18363, -18200, -16601, -13708, -16154, -23015, -23750, -23737, -24523, -19651, -19387, -19731, -23826, -27718, -30122, -30323, -24071, -17920, -20073, -21890, -32903, -35055, -32865, -26350, -21679, -19760, -20513, -20284, -23107, -26071, -24677, -22324, -16759, -15023, -19896, -23564, -17442, -14846, -15445, -18847, -22448, -25113, -21884, -17198, -16679]
14794a6679o334m399k242O1K109q9k929K158Q43K576M428k602O59p88M390J271
14778a7567M322J848J979O35l970l862k430n576K75K049p68j03O91R60K301o27
14762a9843j301L31J896j332l751K38L173j979K372k154J960K499j385j797k848
14747b3921J128K542N397L011k879l782j118J160j883l433J577J656J466M62K37
14732a8380J09m95l548Q77J799K393J967O38k829m262J566p64j488L410j169m541
14716b4717l872p27p344l56N172J568R68L576j270J273j22m859k970P534K709
14701b3437o529K559K930M898o52m807n251K5m98q60J33L82Q23N507M504l334
14685b3607j220K13J027J253q0k014o57j722j618k112m97N311P371l546m747q66
$$ y = [-16679, -23013, -27412, -29654, -29593, -27484, -27573, -30502, -28344, -27501, -24925, -20497, -23099, -22440, -23228, -18838, -17567, -13245, -11397, -9418, -8783, -12753, -16615, -19045, -24621, -24346, -22297, -23065, -23168, -22477, -21517, -19216, -19843, -21144, -20813, -18917, -20249, -24000, -23762, -20589, -22568, -20196, -22350, -20390, -17891, -19276, -21073, -23921, -22793, -20251, -14854, -11843, -14722, -18504, -19622, -18462, -20345, -23778, -22201, -20545, -19079, -18617, -18380, -18271, -18766, -22314, -21437, -19638, -17245, -15278, -14640, -17469, -21731, -20165, -20929, -22417, -19007, -20176, -24717, -28589, -29316, -36660, -37016, -31844, -30276, -29308, -25732, -27002, -25729, -25851, -30710, -33680, -26146, -23437, -29966, -27407, -24477, -19579, -20231, -25038, -30289, -30264, -30762, -31622, -31489, -31107, -30284, -24777, -20273, -23607, -24827, -24614, -23587, -22334, -22414, -24428, -25085, -26807, -28425, -30537, -31034, -25723, -18352, -21898, -26645, -27511]
14669b7511k914N97n514L74K758O188K677j086k610o99n30j006L566M32J400J938
14653b1940j296j968J184K470j025j060J310l73K503K89m793K04L20M29L212J202
14637a9332j248J400q92k421Q31n792k849P808j73m379p67N773J805J407R21K29
14621a7679j483r61k208n503L023L58j086j471R72J266l645k422K614J622L972
14606b2631J32N53R99L701K387l206o899J4m083j928J32M250L823K1N09P70m498
14589b5954K242P03M544k291m290m21K270j514q17J898J504P00k79Q74K14n295
14573b5912n618J42N926N029r91k11K503J500K4N59o620K626O285L457j608k611
14557a5520k386M77l214J803j220q053j527M723K822J379L522L81mm052q8m170
$$ y = [-27511, -30425, -29828, -35342, -34968, -32210, -26022, -23345, -24431, -27041, -27740, -28270, -29276, -25710, -25278, -23878, -21940, -23236, -25204, -24020, -21550, -22575, -23635, -22325, -22698, -20195, -19906, -24699, -24495, -24175, -23746, -20534, -19332, -20580, -19180, -20072, -22493, -21662, -27454, -30303, -22495, -22668, -27047, -27814, -22041, -20236, -18829, -17908, -17679, -19162, -20123, -22331, -27834, -24811, -24453, -25539, -27010, -26038, -24772, -28417, -30839, -28225, -26603, -22631, -22499, -21946, -20947, -17246, -14859, -18065, -24964, -24950, -29033, -30961, -30829, -26579, -22756, -22735, -22226, -21456, -25954, -23712, -23009, -18465, -20756, -25046, -25467, -23197, -24711, -25528, -23630, -22126, -21426, -21705, -20831, -20617, -25912, -31530, -31388, -25462, -20433, -21424, -21635, -19132, -17632, -17608, -17049, -23669, -21043, -14758, -11301, -12909, -15520, -17906, -17429, -20643, -18840, -20060, -28113, -29640, -24917, -22095, -20716, -17194, -16813, -16817, -20869, -20957, -25127]
14541b5127J002J562j340J849k26K254J204O79K958J662m539n811l722J706M849
14526b1040L395O05o107m518M424M188J40K077J330k333m303j745K902O58J879
14511a8448j87M383o76J187m569l826M186R47L143m490j285K463J817M160K060
14496i135K624l042m225o310n21K43l206J712J612P19K427l788l43L98K873J292
14480a6670J030p78k253K25M337k331l15k006j379L266J049n937J949J492m122
14465b2443J871J752m800M197O247J0004L809m058k787L819O62l04K379K069j226
14450A191n54L351k924k531j893k852k081k3O3J190J772q40j88O52j764J703N207
14433e21M876R69q83m141N104L110L063M082O12n185J66K347K622J59k072j436
$$ y = [-25127, -24125, -22563, -23903, -22054, -22280, -20026, -18822, -18143, -15185, -13523, -18062, -23873, -27595, -25889, -21040, -17645, -17040, -23147, -27665, -23241, -19053, -18913, -16836, -15506, -17839, -22142, -23887, -20985, -20327, -18448, -18635, -14252, -14928, -13741, -18310, -22136, -17950, -17003, -13860, -18350, -19635, -17172, -15355, -11195, -9135, -6511, -9553, -13778, -20088, -20609, -20366, -23572, -21860, -20248, -19529, -17102, -20890, -21233, -20835, -17962, -16670, -15640, -16418, -18671, -18446, -14109, -16440, -16755, -18761, -20140, -16874, -15825, -21762, -19813, -18321, -22443, -20572, -18820, -23620, -19423, -13176, -3172, 637, -3421, -6208, -2389, -1727, -2031, 348, 2417, 1191, 637, 3988, 1064, -1467, -3360, -6212, -8293, -8316, -8253, -7063, -5291, -6131, -6319, -5667, -7431, -5728, -521, 4355, 5324, 4441, 300, 5404, 8514, 11577, 15659, 16271, 11086, 11252, 13599, 16221, 16380, 14308, 12872]
14417A2872J243J034l542K178L394L251M024k384n436N582O32M876n76k671o33
14402B3844K782k51K364j300k72L784k52K238M232m639L010R95J108j877M41O323
14386D2530O58j295R84J48K148M166k936R09L694J006J258K171J134J831q19J148
14370E8735J743N468p75p818J084L396M466l031L268J141k938J264N543M298j947
14355G3897L545K600o128L496K190M936K296l030l15J146J020Q70J968J535L380
14340I3406j862L329m125j961R88m23j345J374J92N472M8k308l83l033K518K211
14324I4098l492j382J357j558J598J442l2Q17n82l054n625J790N68k943J505k891
14308H1616k972O12j81m39k079n83K325J973J342R04J046j059o084j452j509k172
$$ y = [12872, 14115, 15149, 11607, 13785, 17179, 20430, 24454, 22070, 16634, 22216, 22848, 27724, 27148, 24477, 23844, 26626, 26375, 28739, 27439, 27167, 30951, 30699, 32937, 37169, 32530, 35540, 36535, 37643, 35766, 36207, 42530, 43188, 41893, 42877, 43025, 45173, 49339, 46403, 47312, 51006, 52012, 53270, 55441, 56575, 58406, 57587, 58735, 60478, 65946, 65171, 57353, 58437, 61833, 66299, 63268, 66536, 67677, 64739, 66003, 71546, 75844, 73897, 77442, 80042, 73914, 77410, 79600, 84536, 86832, 83802, 83487, 84633, 85653, 86523, 88491, 90026, 93406, 91544, 94873, 90748, 88787, 89775, 89352, 88007, 89381, 89573, 95045, 95093, 92785, 92402, 89369, 91887, 94098, 90606, 89224, 90581, 89023, 90621, 92063, 92031, 92848, 92266, 89212, 83587, 85377, 85945, 83002, 84507, 81616, 78644, 79256, 79075, 78636, 76557, 75974, 78299, 80272, 81614, 82518, 83564, 82505, 76421, 74969, 73460, 71288]
14292G1288J952r4l420J610j937J594p50M706M86n542n676L726J166l102n714
14277F0293j801m568K193j29J600r34J025K331j514l670o622k718k555K866K133
14262D7930J841l954r635m100K819q79J276l755J985K237n861m174k282K857K357
14247B8662L849l666k926j313k617o240k680k196R47j307M316N971j529l77k443
14232A6451l648L365K666P21l974q77j456q80L063L023m293j535j568K167j89
14217A3036m083l800j561J731J566J525K664J682q75l810k818j417k766r22J393
14202A545j604m514L29o26l804k609K773K4N093M079p76O29J187K310l033j716
14186g13m459l350J33K56j07M67L955L305k028o42j062k988j670J279r63k125
$$ y = [71288, 73240, 73146, 69726, 71336, 69399, 70993, 70243, 74949, 75435, 69893, 64217, 67943, 69109, 66007, 60293, 58492, 53924, 56117, 55988, 57588, 56654, 57679, 60010, 58496, 54826, 48204, 45486, 42931, 45797, 47930, 49771, 45817, 36182, 32082, 34901, 34022, 35298, 31543, 33528, 35765, 29904, 25730, 23448, 26305, 28662, 32511, 28845, 25919, 24606, 21989, 15749, 13069, 10873, 11820, 10513, 14829, 20800, 19271, 18894, 16451, 12803, 16168, 18834, 19555, 15581, 14704, 13248, 12368, 15431, 18454, 14161, 12626, 11058, 13225, 13036, 8953, 5153, 3592, 5323, 6889, 8414, 11078, 12760, 11885, 8075, 5257, 3840, 1074, 152, 1545, -59, -4573, -4244, -4870, -8674, -11283, -8510, -8486, -3393, 686, -90, 539, 1726, 4036, 1003, -713, -5172, -8522, -8389, -8133, -8240, -7773, -3818, -513, -2541, -3183, -4245, -7233, -8903, -7624, -8587, -10712]
14170a0712m51K734M076N529n382j426J70n0j943m545j400m3K309K736L93N820
14154b185N189lj712n885r91K298m206l670O279R519P28J685j129m35l820l432
14138a770N881k542m81J425J512m335l91k12J726K093L289K798n638n310k392
14123d347N71K292j900L968K128O682L238O66o05N574K956m712l601K566m499
14108A0977l679L136K515K807L503j875j193j331M700r50R49k61L19l587Q72L363
14092B0265P81K58L364P277N359k271j098p20K343J758J878m940n19K217N190
14077D1142J006J87L273L127l018j478K529N053L896L94m183q466l071o05M10
14062D0196k514o27l552j404j12L688K9p246m124l14Q66L435J720l162l139K97
$$ y = [-10712, -11163, -8429, -4353, 1176, -4206, -5632, -5462, -5512, -7455, -12000, -13400, -13443, -11134, -8398, -8005, -2185, 3004, 3001, 1289, -4596, -5587, -3289, -7495, -11165, -4886, 4633, 5361, 7046, 5917, 5482, 1662, -1770, 4111, 1569, 1088, 2513, 4025, -310, -701, -913, 813, 2906, 6195, 8993, 3355, -1955, -4347, -3776, -1484, -3384, 584, 2712, 9394, 12632, 13298, 12693, 18267, 21223, 16511, 12910, 15476, 10977, 7298, 10434, 12949, 15756, 19259, 17384, 16191, 14860, 19560, 18610, 19559, 19298, 19617, 16030, 16902, 20265, 21046, 21304, 24668, 31945, 37304, 35033, 33935, 33215, 35558, 37316, 39194, 34254, 33735, 35952, 41142, 42148, 42335, 45608, 48735, 45717, 44239, 46768, 51821, 55717, 56111, 51928, 43462, 40391, 39786, 40196, 37682, 37055, 33503, 32099, 31987, 35675, 35704, 28458, 24334, 24020, 24886, 28321, 30041, 26879, 23740, 24037]
14046B4037k883K493O431j827n204j103J660J389L57l434k091J098M549N005l078
14031B7399o78l171K050P083K450J202L392J361k83Q131J1490Q086O228J3246
14017H7986K2213K7765L5595M0558M9410N0808N3074O1270N9547N7472M4204L4016
14005F23918J2820K224j2379k9313m6255n4600n3457n9769n8955n5678n1461m1975
13993A75120l2462k0771j7869j5486j0716j1850r417r648o433J278k917l472n032
13980C0325m192m980j356l988m189L81j947m828R87J936k317K107K880j692k935
13965F192j013J177k194k843J024M257p91n687n29J744L507Q82K984k234p966
13950a490m323O415M020l207j014L939k434j893J218L662J157l7J995k428j159
$$ y = [24037, 21154, 23647, 30078, 28251, 23047, 21944, 23604, 24993, 25350, 21916, 19825, 20923, 25472, 30477, 27399, 26721, 23550, 25600, 32683, 35133, 36335, 39727, 41088, 40805, 48936, 60426, 68512, 74740, 87986, 110199, 137964, 173559, 214117, 263527, 314335, 367409, 428679, 488226, 545698, 589902, 623918, 636738, 638962, 626583, 597270, 551015, 496415, 442958, 383189, 324234, 268556, 217095, 175120, 142658, 121887, 104018, 88532, 77816, 65966, 56549, 46901, 40468, 41746, 38829, 35357, 30325, 26133, 21153, 19797, 15809, 11620, 12001, 10054, 5226, 6213, 8149, 5832, 7939, 10819, 9127, 6192, 5179, 6356, 4162, 1319, 2343, 6600, 5809, 122, -407, 1337, 4844, 5726, 8710, 6476, -1490, -5813, 602, 4622, 1415, 401, 4340, 1906, 13, 1231, 4893, 6050, 6013, 8008, 5580, 4421]
13935D421J84L28j074M080L222j170o460L22j990J868l255j350Q21m543N79N04
13919c513l65L747Q059K069L554L820O9M191M790P39k037K112K149l729K815Q410
13903C6880Q250J0262K504M01L611K652M177P415J855l223k028N52m051n105l99
13888F3753l359m395Q16L194N392L871P559J1416J0258J4930J1059R591O268O356
13874A46709m241p865p808j0853j0491j7232j4168j1398r848m831o641J520K811
13861D5664N018j241m02l878K22m638q816k929R07J506j802l869m572m781j135
13846A5254k848j311l099o509j719j478K747M926K327K083P571N408L621M698
13832C1671O817L104R340K8388L3706K0768J0015N682J3168J0802O321j2468l1874
$$ y = [4421, 4605, 4933, 3859, 7939, 11161, 9991, 3531, 3853, 1863, 3731, 476, -874, -53, -4596, -4017, -3513, -3878, -131, 7928, 9997, 13551, 17371, 17440, 21631, 26421, 27160, 25123, 27235, 29384, 25655, 28470, 36880, 45130, 55392, 57896, 58297, 61908, 64560, 68737, 76152, 78007, 74784, 72756, 73308, 69257, 64152, 63753, 60394, 55999, 56815, 60009, 65401, 69272, 76831, 88247, 98505, 113435, 124494, 134085, 140353, 146709, 142468, 134603, 126795, 115942, 105451, 88219, 74051, 62653, 52805, 47974, 41333, 42853, 45664, 50682, 49441, 49039, 45161, 45383, 40745, 31929, 29000, 29907, 31413, 29611, 25742, 21170, 16389, 15254, 12406, 11095, 7996, 1487, -232, -1710, 1037, 5963, 8290, 10373, 17944, 23352, 26973, 31671, 38488, 41592, 50932, 79320, 113026, 133794, 143809, 149491, 162659, 173461, 179782, 167314, 135440]
13819A35440l7423k8463j8184j0411n870n696R75J252Q63n23K400L664L144k928
13805C8240m745l451N135O650J776K422K833j877K821O749R860j33l51J962k644
13790F5247k297M655j820K59k296o075o690L231N938K058K313N117l42R91L817
13775G4106N035O90O931O835o48l859o11J662M760jj104l252m44N52p805k513
13759H0334l615p055l077m850J962l479l942j315P74o333l764l498j610Q27m260
13744C7099l088k815m412p724l920l0L888n66l546n6k156M49L155k668l372J69
13728A0407j674k308J913K355l245P39K079l940l564L558L223L212l366j911j934
13713E544R08L761N70k539j579M950N66l275l634k296L996q17l093L599n450m498
$$ y = [135440, 98017, 69554, 51370, 40959, 35089, 29393, 30368, 31620, 32483, 31960, 34360, 38024, 41168, 38240, 33495, 30044, 35179, 41829, 43605, 46027, 48860, 46983, 49804, 56553, 66413, 66280, 65929, 67891, 65247, 62950, 67605, 65785, 66044, 63748, 57673, 50983, 54214, 60152, 62210, 64523, 69640, 69298, 70289, 74106, 79141, 79831, 86762, 93597, 92949, 89090, 88479, 90141, 94901, 94900, 93796, 90544, 90100, 90652, 82847, 80334, 76719, 69664, 66587, 61737, 63699, 60220, 56278, 54963, 55737, 49404, 45640, 42142, 40532, 41359, 37099, 34011, 31196, 26784, 19060, 15140, 15110, 18998, 18432, 14886, 14830, 12674, 13123, 16278, 13610, 10238, 10407, 8733, 6425, 8338, 10693, 7448, 8187, 10266, 6326, 2762, 6320, 9543, 12755, 9389, 7478, 5544, 6452, 10213, 10783, 8244, 6665, 11615, 12181, 8906, 5272, 2976, 6972, 6155, 3062, 6661, 1211, -3287]
13697c287p80J350M967R68P11j640m451n136J883M928L49j910J481L785q63j521
13681H34o21L190M637J489l950m934M499M699P88k1P52M01m69K943L296L312l435
13664A7410J828O367L719L532O56k049j53P726O499Q132R310P481R388J0986J2736
13649A03568J5485J2325R144J3295J9293K3815J3688J3415P615J2757K713m991
13637B42122o359j1163j2852k1868j6800j6494j5238j0804j2422q182r115j2525
13625H8300p956K92k21l596L671K337L925J83N756R814K243M189J533J071K455
13610A13996L046m893o726k793j612m671p82o11k482o185m87l987j1155q003k598
13595F0057p15k013k254l634R09o545k064L830J638l948p44O470J271p064o751
$$ y = [-3287, -4067, -2717, 2250, 3218, 3929, 2289, -2162, -7298, -5415, -487, -138, -2048, -567, 3218, 2355, 834, 213, 3403, 8040, 9529, 5579, 645, 5144, 9843, 10631, 10610, 11362, 11763, 11294, 14237, 17533, 20845, 17410, 19238, 25605, 29324, 32856, 33512, 31463, 31310, 39036, 45535, 53667, 62977, 70458, 79846, 90832, 103568, 119053, 131378, 140522, 153817, 173110, 196925, 210613, 224028, 231643, 244400, 247113, 242122, 235763, 224600, 211748, 189880, 173080, 156586, 141348, 130544, 118122, 109940, 100825, 88300, 80344, 80636, 80415, 76819, 80490, 82827, 86752, 86935, 92691, 102505, 104748, 108937, 110470, 111541, 113996, 117042, 112149, 105423, 102630, 101018, 96347, 95565, 94954, 92472, 86287, 85800, 81813, 70658, 62655, 60057, 59342, 57329, 55075, 51441, 52350, 45805, 43741, 47571, 49209, 45261, 44517, 50987, 52258, 45194, 38443]
13580C8443k126m894j978J458J365m332j038K017r13k581j210n13M12K340L855
13565C0305M606l61l294p28M7k92J925L111J096K296M355J01j557K769l186l585
13549C7608j923K185J75k698j72J810K45J791K855P14j156l096n052j046p18l226
13533B8296k724l31K410P760m79j299l615j487K368J202m578k523m79n92O556
13518C0485N192J734n058J52L653J203N663K281M369O755M626K493K881j303Q64
13503F5990J222k365j336R65m674j615o382p41m063q169n248K699K434R34k802
13488C6849Q11L456J14m502p836o869r35M718M873J973m797L090J130m763o77
13473B6635L699l395n3j881m801j128K403J914j639L052nk493K51M08l49k620
$$ y = [38443, 36317, 31423, 29445, 30903, 32268, 27936, 26898, 28915, 28002, 25421, 24211, 23698, 24110, 26450, 30305, 34911, 34550, 31256, 30528, 30575, 30283, 32208, 35319, 36415, 38711, 43066, 43167, 41610, 44379, 41193, 37608, 35685, 37870, 38045, 35347, 35175, 36985, 37230, 39021, 41876, 42590, 41434, 38338, 33286, 32240, 31522, 28296, 25572, 25241, 27651, 35411, 34932, 33633, 30018, 28531, 30899, 32101, 27523, 25000, 24521, 23929, 30485, 35677, 37411, 32353, 32505, 36158, 37361, 43024, 45305, 49674, 56429, 61055, 63548, 66429, 65126, 65990, 67212, 64847, 63511, 64476, 59802, 58187, 51805, 51064, 47001, 38832, 33584, 36283, 38717, 39651, 36849, 37660, 41116, 41230, 36728, 28892, 22023, 21088, 25806, 30679, 32652, 27855, 30945, 32075, 27312, 26635, 30334, 26939, 26886, 25005, 20204, 19076, 21479, 23393, 21754, 24806, 24801, 22308, 22559, 22967, 22618, 19998]
13457A9998l236k197j681j251N279L21Q34J506L996m318n71N73m681n54j687k888
13441I443J194k60O20M442k986o023J73K004R82r20N66M499n58k087o71j207l165
13424F046k366M877M487p416m608J265N32J012J248K263k962l300j941K598K458
13409D193q96n787k288L309K673K145L437M164l954n739n38R40m504p094l801
13394a3740Q302O019L144K42P99o33m860J044m85j020l830J195K480l46P75r82
13378a896K407J670l282q0l708j820M682O54p76j420K128p90r89k30j143L623
13362i70K321k597n764K099K820K310J13J688j547j738K882l105L23K032P41L473
13346E081M659k465k690K702k690j503J483N444N127j140j625o263n165O467N588
$$ y = [19998, 16762, 14565, 12884, 11633, 16912, 17233, 18067, 19573, 23569, 19251, 18680, 19253, 14572, 14018, 12331, 9443, 10637, 10377, 10997, 15439, 12453, 6430, 6603, 8607, 9589, 8669, 9235, 13734, 13176, 11089, 10418, 9211, 6046, 3680, 8557, 13044, 5628, 1020, 2285, 2817, 3829, 5077, 7340, 4378, 1078, -863, 1735, 4193, 3297, -2490, -4778, -1469, 1204, 3349, 6786, 10950, 6996, 1257, 719, 1659, -2845, -9939, -13740, -5438, 581, 3725, 3967, 4766, 4133, -727, 317, -168, -1188, -5018, -3823, -1343, -1689, -914, -1896, 511, 2181, -1101, -1181, -4889, -6709, -2027, -1373, -2149, -3569, -1441, -2231, -3220, -3450, -4593, -970, 1351, -1246, -7010, -4911, -2091, 219, 332, 2020, 473, -1265, 1617, -1488, -1165, 867, 1608, 5081, 9740, 7275, 4585, 7287, 4597, 3094, 4577, 10021, 15148, 14008, 12383, 6120, 955, 7422, 13010]
13331A3010J077j360k20J0355J0787J763o55J803N786P230J1299J2104R876J6902
13317I9757J8132J7712K5956J9056J5491J1726J2526J5265J482k775j3277j4482
13305B06569j7194k1995j3822j0496p104l840q805r15O994J2904J4899J2639J1794
13292A81628J2016J0579J1008N840K237M211k315j0399j3558j7082k0703j7598
13280A45864j2588j6173j5501j2657j2331l927j349M179j736l002q11R28m222
13267F6674J0882Q966L363M847K971L852k66L65J189K34q690q307J417l782k29
13252H3486l216k208o00J531N450Q792K028M562Q389K45J841J362m49L94l522
13237A08085O86O79Q538Q784Q476O568J5728J5937J4478J9407K3153J9279J6407
$$ y = [13010, 14087, 12727, 12507, 22862, 33649, 35412, 34757, 36560, 42346, 49576, 60875, 72979, 82855, 99757, 117889, 135601, 161557, 180613, 196104, 207830, 220356, 235621, 237103, 234328, 221051, 206569, 189375, 167380, 153558, 143062, 135958, 132118, 123313, 122398, 129392, 142296, 157195, 169834, 181628, 193644, 204223, 215231, 221071, 223308, 227519, 225204, 214805, 201247, 184165, 163462, 145864, 133276, 117103, 101602, 88945, 76614, 72687, 71338, 75517, 73781, 70779, 69968, 70896, 66674, 77556, 86522, 89885, 94732, 97703, 101555, 101289, 101654, 102843, 103077, 94387, 86080, 87497, 83715, 83486, 80270, 78062, 77462, 78993, 84443, 93235, 95263, 99825, 108214, 108459, 110300, 111662, 111213, 111607, 108085, 108771, 109450, 117988, 126772, 135248, 141816, 157544, 173481, 187959, 207366, 230519, 249798, 266205]
13224B66205J2794N827P118K009n344j0391j7062j8558j5885j5113j4873j0669
13212A86058q403l666K638N563Q631J3762J9653J8811J6490J5160J2017P098K136
13199B95948p427j1410j3956j7359j9553k3089k7178k3771j9432j7102q745q312
13187I8614p153p576L492P823p47J631L976N818O024K656Q58P263N572j899k030
13172A24322k539m115n025n649o117q333q174M71M388K096P153M513J24J269O378
13157A10762N110n647m023n716k152j016n895r350o226o004n228n577l080l892
13143E2066n409l239l146R11l736q463j190l001o066M12K611n77J443J034k50
13128B3400M479L237m317q140n60L996K682O4N5n01k314k64L129p723j524J599
$$ y = [266205, 278999, 284826, 291944, 293953, 288609, 278218, 261156, 242598, 226713, 211600, 196727, 186058, 177655, 173989, 176627, 182190, 190821, 204583, 224236, 243047, 259537, 274697, 286714, 293812, 295948, 288521, 277111, 263155, 245796, 226243, 203154, 175976, 152205, 132773, 115671, 106926, 98614, 91461, 83885, 87377, 95200, 94453, 96084, 100060, 105878, 111902, 114558, 115416, 122679, 128251, 126352, 124322, 121783, 117668, 112643, 106994, 100877, 92544, 84370, 84841, 89229, 91325, 98478, 102991, 103115, 104384, 110762, 115872, 110225, 106202, 100486, 98334, 97318, 91423, 82073, 75847, 69843, 64615, 59038, 55958, 52066, 46657, 43418, 40272, 41183, 37447, 28984, 27794, 24793, 18727, 19139, 21750, 21173, 22616, 23650, 23400, 27879, 31116, 26799, 18659, 18099, 22095, 24777, 24841, 24896, 24395, 22081, 21817, 24946, 17223, 15699, 17298]
13112A7298J2L335L64o67J052J513q10L38j232l539k003m82p72L558K734l127
13096A7572l087j17l79k144R1l178l065l63L738M047M071N134n471p595n10L781
13080A2525L19p8r45J066K892j946j541M2L215K16K801l8k563K73J71J620J669
13063A9698j988l449l527o20n69n80L95k736k562m922K134N662j214M73J54j684
13047D665n128n32K899K701M508K661M072L69N03k502m26k490j624M099L197K89
13031A7261J229P40L130J920k982j299n72M58L390L671K862r49k217j674Q93N021
13015C0882P326R39M54R620L118N208J2817J2344J1916P518J7686K9469L6370
13002A85667L4298M6048N2124N7212N8057N9596O0837M9934M1018K3626P763j2625
$$ y = [17298, 17310, 20645, 21009, 20342, 21394, 22907, 22097, 22435, 21203, 17664, 15661, 15179, 14407, 17965, 20699, 17572, 14485, 14368, 13989, 11845, 11936, 8758, 5693, 5330, 9068, 13115, 17186, 22320, 16849, 9254, 8744, 12525, 12844, 12766, 11821, 12887, 15779, 13833, 12292, 12334, 15549, 15765, 18566, 18528, 15965, 16238, 16409, 18029, 19698, 17710, 14261, 10734, 10114, 9545, 8965, 9360, 6624, 4062, -860, 1274, 6936, 5722, 6195, 6349, 4665, -463, -995, 1904, 4605, 9113, 11774, 15846, 16215, 16718, 14216, 13790, 11300, 9676, 13775, 16972, 17261, 18490, 19230, 22360, 24280, 21298, 19999, 19427, 19885, 23275, 26946, 29808, 28859, 26642, 24968, 25861, 30882, 38208, 39147, 39601, 49221, 52339, 57547, 70364, 82708, 94624, 102142, 119828, 149297, 185667, 219965, 266013, 318137, 375349, 433406, 493002, 553839, 603773, 644791, 668417, 676180, 663555]
12990F63555l3829m6702o4595o1897n8333o0112n2475m4537m1764l1628k5264
12979A42419k2218j6740j1375q440r900j1454n969j981j183n967m214K149n103
12966D0024m099j861l708j545J924N504j117p763q799m573L794Q57J971k296o179
12951A2134R56j631P27K703j422k709J603L646k40n91k307k822q8P984K35L262
12935B1440M026M678J021j20K97k025n00k103K146m458l656m484L958K903q749
12920A4374m161q80J366J925P1j603j526k677k158l237M84L851m54L04K687M298
12904A2664l762r92p24L759O636J839N562P793M363k82J343M49j940j024l980
12889C1704r083q235k672p661m109Q47k436l411k335N923L245M470P030K587M129
$$ y = [663555, 629726, 583024, 518429, 456532, 398199, 338087, 285612, 241075, 199311, 167683, 142419, 120201, 103461, 92086, 83646, 73746, 62292, 56323, 54342, 53159, 47192, 42978, 45127, 40024, 35925, 34064, 30356, 28811, 30735, 36239, 35122, 27359, 18560, 13987, 17781, 18638, 20609, 18313, 12134, 13090, 11459, 12186, 14889, 13467, 10758, 12361, 16007, 15767, 15176, 12869, 10047, 9959, 17943, 18178, 21440, 25466, 30144, 31165, 31045, 31342, 29317, 28817, 26714, 28860, 24402, 20746, 16262, 20220, 23123, 14374, 10213, 9333, 10699, 12624, 12695, 11092, 9566, 6889, 4731, 1494, 1978, 5829, 5375, 5679, 8366, 12664, 8902, 7910, 7186, 10945, 17581, 19420, 24982, 32775, 37138, 36856, 38199, 38648, 36708, 35684, 31704, 22621, 14386, 11714, 4053, -56, 791, -1645, -5056, -7391, -1468, 1777, 6247, 13277, 15864, 19993]
12874A9993N380P052M783J165k527o081j329l14k647k325P472P423l428K850P875
12859D5342J0851O436N371M305J053L65K288m247q477k557n357M99J555L829J289
12844F2545O620J2288R107M259O288P873k410q66k06M576M997L153O222L485O512
12829A34443P306L157M483N332O115M194K721n798n767k95r606j5350j3180p055
12815A10700p951j1107j8258j5543j1788o996l455j184k399M243M989P29n853
12802C6127m011k611Q08M154J954k045j288J086L12J732K627M267P07j089J350
12787D4080j553o39j277j10O563L686L846m500l232K610J621k161L467n018l148
12772D4235j294m299m234n193J1m167Q37P86m712q838l361k880l643J983R659
$$ y = [19993, 25373, 32425, 37208, 38373, 35846, 29765, 28436, 28122, 25475, 23150, 30622, 38045, 34617, 37467, 45342, 56193, 62629, 68000, 72305, 73358, 73723, 76011, 71764, 63287, 60730, 55373, 55872, 57427, 61256, 62545, 69165, 81453, 90560, 94819, 101107, 108980, 106570, 105704, 105498, 110074, 115071, 118224, 124446, 127931, 134443, 141749, 144906, 149389, 154721, 160836, 165030, 167751, 161953, 156186, 155891, 146285, 130935, 117755, 110700, 102749, 91642, 73384, 57841, 46053, 39057, 35602, 34418, 32019, 36262, 41251, 41980, 36127, 32116, 29505, 30313, 34467, 36421, 34376, 33088, 34174, 34486, 36218, 38845, 43112, 43819, 42730, 44080, 42527, 41888, 40611, 40501, 47064, 50750, 54596, 50096, 46864, 49474, 51095, 48934, 52401, 47383, 44235, 42941, 38642, 34408, 29215, 29226, 25059, 25896, 26682, 21970, 13132, 9771, 6891, 3248, 5231, 14890]
12757A4890Q857J3135J7808J6947J4514J1408J6704J2314J0177O266J520N363
12745A49903O295J2481J5925R332R215J2521R713N971k266m693p908j3043k2499
12732A80947k3647k0470j2535j4481q942k245J351M618M254N690J1230O750M920
12719A37440M622R313K999m69K325J0208N041K338P628M554N85N300Q130R467
12705B09481R314J2654J1429K1782K2155K6714K1890J6125J2323J1434Q609J847
12693C85757j9059k7823l0625k5614j5668j0378n676j1731q075o57L772o1p90
12680B33372N81L685K424K771J209O519M949J519O82L419L021L043R091M222J984
12665B82491N85K303M309P713Q882O264N713P664P628P376M781K242P029J0318
$$ y = [14890, 23747, 36882, 54690, 71637, 86151, 97559, 114263, 126577, 136754, 143020, 144540, 149903, 156198, 168679, 184604, 193936, 203151, 215672, 225385, 231356, 229090, 224397, 216489, 203446, 180947, 157300, 136830, 124295, 109814, 100872, 98627, 99978, 104596, 108850, 114540, 125770, 132520, 137440, 142062, 151375, 154374, 153905, 156230, 166438, 171479, 173817, 181445, 185999, 186584, 191884, 200014, 209481, 218795, 231449, 242878, 264660, 286815, 313529, 335419, 351544, 363867, 375301, 383910, 385757, 366698, 338875, 308250, 282636, 266968, 256590, 250914, 239183, 231108, 230451, 234223, 234162, 233372, 233953, 237638, 240062, 242833, 244042, 250561, 255510, 257029, 257711, 261130, 264151, 267194, 276285, 280507, 282491, 283076, 285379, 289688, 297401, 306283, 312547, 318260, 325924, 333552, 340928, 345709, 347951, 354980, 365298]
12651C65298Q355M663O998J0117O121P889J4532J8598J1643J0290J2673J9415
12639D96592J4990J5310K4644K3871K1826K4104J7920K1789K5152K4083K1643
12628G31924K6785K4620K3465K2970K7630K8575K9252L0149L8286M8140M3779
12617A075575M1852M6426M9095N1406N8715O5657O4781O3485P8862Q7757R6508
12606A780119J06545J20266J35285J65471J83328K06678K41934K80894L25240
12597C545760L79233M42781N19223O01142O94863Q01877R16919J052608J215293
12588A0169699J426380J723088K147900K766443L623391M734350O051720P458512
12580D0101483Q873061J0196039J1288208J1907997J1765500J0695814Q793302
$$ y = [365298, 373653, 378316, 385314, 395431, 401552, 409441, 423973, 442571, 454214, 464504, 477177, 496592, 511582, 526892, 551536, 575407, 597233, 621337, 639257, 661046, 686198, 710281, 731924, 758709, 783329, 806794, 829764, 857394, 885969, 915221, 945370, 983656, 1031796, 1075575, 1117427, 1163853, 1212948, 1264354, 1323069, 1388726, 1453507, 1516992, 1595854, 1683611, 1780119, 1886664, 2006930, 2142215, 2307686, 2491014, 2697692, 2939626, 3220520, 3545760, 3924993, 4367774, 4886997, 5488139, 6183002, 6984879, 7901798, 8954406, 10169699, 11596079, 13319167, 15467067, 18233510, 21856901, 26591251, 32642971, 40101483, 48974544, 59170583, 70458791, 82366788, 94132288, 104828102, 113621404]
12573A13621404O262566L323188J07986l234727o468280r197175j1032711j1900538
12565H1481713j1926719j1308965j0219740q777323p134418n498732m117660l097947
12557A9400209k396398j930961j611222j394511j227834j093348r72969q54593
12549G918373p52481o51687n60724m74748m00261l41910k99459k59941k32627
12540C944535k14825j87064j72959j56585j44496j32426j20446j08744r8945q6976
12530B521069p5211o4117n4255l9951q182J2915L0872O0593R1964J11191J30443
12519B717331J33550J28668J15005Q1939L6046j1331n6898j09418j46865j88067
12509B699960k00815k06307j93797j73073j47459j18706r2943p5103o1033m2456
$$ y = [113621404, 119883970, 123207158, 123315144, 120080417, 113612137, 104414962, 93382251, 81481713, 69554994, 58246029, 48026289, 39248966, 32114548, 26615816, 22498156, 19400209, 17003811, 15072850, 13461628, 12067117, 10839283, 9745935, 8772966, 7918373, 7165892, 6514205, 5953481, 5478733, 5078472, 4736562, 4437103, 4177162, 3944535, 3729710, 3542646, 3369687, 3213102, 3068606, 2936180, 2815734, 2706990, 2608045, 2521069, 2445858, 2381741, 2327486, 2287535, 2279353, 2292268, 2323140, 2383733, 2475697, 2586888, 2717331, 2850881, 2979549, 3094554, 3176493, 3212539, 3201208, 3144310, 3034892, 2888027, 2699960, 2499145, 2292838, 2099041, 1925968, 1778509, 1659803, 1566860, 1491757, 1430724, 1388268]
12499A388268l4503l6825l3694l5983l8731m6540m7786m6475n2027n1960m7748
12488I15996m5064l7993l0887k8337k4622k1409k3811j7628j1253j4965j4351
12477F45676j4387j0073r559r991o961l599J20m884J878J0874J6239J8719K4852
12464F58904L5461N1865N8226O7906P8117R5412J10851J19601J16248J07739J01055
12453A601385Q3728N4194K1536j0272l7812o3356q4047r3767r2276q7040o8790
12442A223483n3680l8529j8371n204J2415K3037L7664N1386P1024Q9786J18943
12431A511954J52441J99717K66304L49133M61409O02610P38367Q48912Q82979
12422F013826Q23444O84150N12266L14251O4605k62746o15571r02098j023694
$$ y = [1388268, 1353765, 1316940, 1283246, 1247263, 1208532, 1161992, 1114206, 1067731, 1015704, 963744, 915996, 870932, 832939, 802052, 773715, 749093, 727684, 703873, 686245, 674992, 660027, 645676, 631289, 621216, 611657, 601666, 594705, 591106, 591226, 586342, 588220, 599094, 615333, 634052, 658904, 694365, 746230, 804456, 872362, 950479, 1045891, 1156742, 1276343, 1392591, 1500330, 1601385, 1685113, 1739307, 1760843, 1750571, 1712759, 1649403, 1565356, 1471589, 1379313, 1292273, 1223483, 1169803, 1131274, 1112903, 1107699, 1120114, 1143151, 1180815, 1232201, 1303225, 1393011, 1511954, 1664395, 1864112, 2130416, 2479549, 2940958, 3543568, 4281935, 5130847, 6013826, 6837270, 7521420, 8033686, 8347937, 8412542, 8149796, 7534225, 6632127, 5608433]
12413E608433r81083q37911o68909n14638l89422l02871k30405j79997j42466
12404A360731j20488j09233r6864q7209q0916p4379o7152n0314m0169l4045k2367
12393E77595j5282k927O649J3685J3260J2918J8681O517p880j4066q889j1268
12381E88993j7750k6940l0619k8902l3194k8535k8184k5868k2167j6861j8411
12370C11562j5306j4259j2451j3371m989n975j0293o052q365r558p579o400m131
12357A92833k720m496k713m311r300m670m402o401N241j141j3186q107k340j35
12343A34152q7m82K329l010j859k626P06J693L299K756L953L843O824K237N361
12328A59089J0749J5724J8124K3674K9916L0013K4749K6104K8394J7448J816p011
$$ y = [5608433, 4627350, 3789439, 3120530, 2605892, 2216470, 1913599, 1683194, 1503197, 1360731, 1240243, 1131010, 1034146, 946937, 866021, 791642, 724490, 674176, 634007, 599962, 577595, 562313, 559386, 566035, 579720, 592980, 605898, 624579, 631096, 623216, 609150, 600261, 588993, 571243, 544303, 513684, 484782, 451588, 423053, 394869, 369001, 346834, 329973, 311562, 296256, 281997, 269546, 256175, 251186, 245211, 234918, 228866, 220501, 210943, 203364, 196964, 192833, 190113, 185617, 182904, 178593, 169293, 164623, 160221, 153820, 159061, 157920, 144734, 136627, 134287, 134152, 134065, 133583, 135912, 132902, 131043, 128417, 129123, 130816, 134115, 136871, 140824, 144667, 151491, 153728, 159089, 169838, 185562, 203686, 227360, 257276, 287289, 312038, 338142, 366536, 383984, 385800, 378789]
12316C78789j6509k4660l0265l2781l6040l0240k7159k1751j7219j6240r717r422
12304A06786p755k27l709L1n232j750M610k731l613k304L036L372m625n703j771
12289G8415l110M76K946J386m059q833o327J680l045L689r11J023K518M81j642
12274F4687N363O659L228N830J1424J2094J6614K4048K2584K9321L1418K8227
12262B61497L2039L0946J5892P438M491j1071k2567k6194k5824k4416k7002k4477
12250A90752j5121p734o762n575j70j208K386M519Q230J7168J7714K0904L6862
12237B61965L9007L7322L5908L4902L0039J9237J1275n24j6602l4057m5473m9790
12225C23209m6751l9196k8130k1193k1777j8295j5097j1662r169p231l411J0j338
$$ y = [378789, 362280, 337620, 307355, 274574, 238534, 208294, 181135, 159384, 142165, 125925, 116208, 106786, 99031, 98804, 95095, 95126, 89894, 88144, 92754, 90023, 86410, 84106, 87142, 90514, 85889, 80186, 78415, 75305, 75781, 78727, 80113, 76054, 67221, 60894, 62574, 59529, 63218, 62307, 63330, 65848, 66329, 64687, 70050, 76709, 79937, 85767, 97191, 109285, 125899, 149947, 172531, 201852, 233270, 261497, 293536, 324482, 340374, 347812, 352303, 341232, 318665, 292471, 266647, 242231, 215229, 190752, 175631, 167897, 161135, 155560, 155390, 154182, 156568, 161087, 169317, 186485, 204199, 225103, 261965, 300972, 338294, 374202, 409104, 439143, 458380, 469655, 469131, 452529, 418472, 372999, 323209, 276458, 237262, 209132, 187939, 166162, 147867, 132770, 121108, 111939, 104708, 101297, 101307, 99969]
12212I9969m193o358K44M12k178j795M578M434M65m374l576J488l97j156L058
12197I0621K252K267J53L204J404J11J05K268O089J1238J1836J4941J1984J6634
12183A75107J2687J5750K2384J4831J3311J6068J0333J0622J8046K0651J9581
12172C49371J7533J6680J0440J0578N951K466o733j4183p376o644p471r048p169
12159C54395j644O471K3580L3705L8029N1961N7194N8143N6039M9720M7631M4840
12147H20064M2560L4774K1461N319j2781k9660l6149l9403m3006m3095l5446k7251
12135F57387k0185j4088j6648k4901l4230l3155k8272r923j104R826Q927P318
12123E00952j596l119m696j9618l0401l4350l5095l4633k8186k2656j8905j0190
$$ y = [99969, 95776, 89418, 89662, 90074, 87896, 86101, 90679, 95113, 95578, 91204, 87628, 89116, 88719, 87563, 90621, 92873, 95140, 95293, 98497, 99901, 100012, 100117, 102385, 108474, 119712, 131548, 146489, 158473, 175107, 187794, 203544, 225928, 240759, 254070, 270138, 280471, 291093, 309139, 329790, 349371, 366904, 383584, 394024, 404602, 410553, 413019, 406286, 392103, 384727, 378083, 370612, 361564, 354395, 352751, 359222, 382802, 416507, 454536, 506497, 563691, 621834, 677873, 727593, 775224, 820064, 862624, 897398, 918859, 924178, 911397, 881737, 845588, 806185, 763179, 720084, 684638, 657387, 637202, 623114, 606466, 581565, 547335, 514180, 485908, 475985, 474881, 484707, 493634, 500952, 499356, 496237, 491541, 471923, 441522, 407172, 372077, 337444, 309258, 286602, 267697, 257507]
12111B57507r535j1879q240N450R037J5248K4318K1612L4508L4440L2208L5134
12099D39808L2005K4473J5074K099r491j8725j0317Q77L851K61m58l407j1857
12086D64193k6211m1144n0696n3058m2495l2622k7575j5094j1113n891p837j1644
12074A38813q498m428k77k484J005L213L299L241l045K874J0580J0998J3934J7764
12060A86989J8489J6998K5032M3312L7607K4801K1785K2922J5315O089j5631l5462
12048C68246m2216l0301j9027j2011q446K098L653L812R215J473k141N209j547
12035B78017k642o19J024q287j3609j1882j6982j7026k0477j8029j6240j4612
12023A38636j4390r931l956k921q3L249J668O527J0380N816J6158K3018K2378
$$ y = [257507, 247972, 236093, 227853, 233303, 242340, 257588, 281906, 303518, 338026, 372466, 404674, 439808, 471813, 496286, 511360, 513459, 503968, 485243, 474926, 475803, 479654, 479915, 479457, 476050, 464193, 437982, 396838, 346142, 293084, 250589, 217967, 190392, 175298, 164185, 158294, 150457, 138813, 130315, 125887, 125610, 123126, 124131, 127344, 130643, 133884, 130839, 133713, 144293, 155291, 169225, 186989, 205478, 222476, 247508, 290820, 328427, 353228, 375013, 397935, 413250, 419339, 403708, 368246, 326030, 295729, 276702, 264691, 256245, 258343, 261996, 265808, 275023, 276496, 274355, 279564, 278017, 275375, 274756, 275780, 267493, 253884, 242002, 225020, 207994, 187517, 169488, 153248, 138636, 124246, 114315, 110359, 107438, 107355, 110604, 112272, 118799, 129179, 134995, 151153, 174171, 196549]
12010A96549K1374J4712R346R238N567j854j9655k3636k5771j1459j2584j1769
11998A50058j2029k211m597M607N85o272n578j834l98N78n041n841o224n162j915
11983I8726k176M68m749K128L746j168L514N346O827J0750J0605Q775R120P109
11969A59021J1851J1538J4500K2167K2053K4091L5981L9238N0756O4161Q7308
11958E42665J23611J69304K53373L83736N82846Q84617J200250J247068R06500
11949F293970N65131N11658N79639M96374k22866j520521j960346j482133r36044
11940B324862n90306l90662k72131j96302j41297j04327q0439o3341n1777m7268
11930C87012m1259k9486k5240k0347k0834k1300j9076j3686j0496o664m979n626
$$ y = [196549, 217923, 232635, 241981, 251219, 256786, 254932, 235277, 211641, 185870, 174411, 161827, 150058, 138029, 135818, 131221, 135828, 136413, 130141, 124563, 122729, 122331, 122909, 117868, 112027, 105803, 100641, 98726, 96550, 97018, 92269, 94397, 98143, 96975, 100489, 105835, 112662, 123412, 134017, 142792, 151912, 159021, 170872, 182410, 196910, 219077, 241130, 265221, 301202, 340440, 391196, 455357, 542665, 666276, 835580, 1088953, 1472689, 2055535, 2940152, 4140402, 5387470, 6293970, 6859101, 7370759, 7950398, 8446772, 8223906, 6703385, 4743039, 3260906, 2324862, 1734556, 1343894, 1071763, 875461, 734164, 629837, 549398, 486057, 434280, 387012, 345753, 316267, 291027, 270680, 249846, 228546, 209470, 195784, 185288, 178624, 173645, 168019]
11918A68019r107q014r002r052n122l767k916o920p548m435k580M671L186P96
11904A08209k767n474j076k557j792J597l218j296n209l969l433q416k226k585
11890F5788P30k266p014m545J486k109k031l192j955l033l126k59N50k79J781
11875D0526K233K83M817L85j261j236m678j173L095J964M027L790L06J8016K2150
11860I3244J6802M293L935N306R102J2275j0654k8840k5309j7659q179m765j1308
11847C8243q878j101k29K748J125P32m544k36K45P20l484K309K772J190N491j289
11831C5814L883L017J958L126J483M180L611R822K0884J8538K8907M1610O2095
11818B38928R0569J07656Q7434N0310L9164M6067O1032K5870p7544j40395j17515
$$ y = [168019, 158912, 150898, 141896, 132844, 127722, 123955, 121039, 114119, 106571, 102136, 99556, 104227, 107413, 108209, 105442, 99968, 98892, 96335, 94543, 96140, 92922, 91626, 86417, 82448, 79015, 70599, 68373, 65788, 66518, 64252, 57238, 52693, 54179, 52070, 50039, 46847, 44892, 41859, 38733, 38474, 39024, 38745, 40526, 42759, 43042, 47859, 48244, 46983, 45747, 41069, 39896, 42991, 44955, 48982, 52772, 53078, 71094, 93244, 110046, 114339, 118274, 123580, 132682, 144957, 134303, 105463, 80154, 62495, 54316, 49551, 38243, 29365, 28264, 28035, 30783, 31908, 32640, 28096, 27860, 28105, 28825, 25341, 27650, 30422, 31612, 37103, 35814, 39697, 42714, 44672, 47798, 49281, 53461, 57072, 66894, 87778, 106316, 135223, 176833, 238928, 329497, 437153, 524587, 574897, 614061, 660128, 721160, 747030, 669486, 529091, 411576]
11807D11576p4362m1804k5130j4935r300p240j1944n632r595j0815l96%N540N310
11793B11273O979K0966K6641L0016L1217L9800N9095R6218J49572K09229K76047
11782A157053L06402K39665J58561J39015J52111J24303l4992l38382n03857m13937
11772I85942k68780j71239j16644p9111n1845l3111k4968k4740j8278j8508j3663
11761A65055j5192j7248j3912j2108j1167j7634j0930Ok717k43l537k531J3k563
11747E5292l708n677o903k727J109o16r07j271L326k078j124J355j992l455r0
11732C0534j690o282j321K788k755j189L84k284m670K139J555k986N059J753n06
11717B0529L656n31m446k854K14m685k259M204k277l83K850l514k843L39q54N75
$$ y = [411576, 337214, 295410, 270280, 255345, 246045, 238805, 226861, 221229, 211634, 200819, 200423, 200423, 205963, 211273, 218252, 239218, 265859, 295875, 327092, 366892, 425987, 522205, 671777, 881006, 1157053, 1463455, 1703120, 1861681, 2000696, 2152807, 2277110, 2242118, 1903736, 1399879, 985942, 717162, 545923, 429279, 350168, 298323, 265212, 240244, 215504, 197226, 178718, 165055, 149863, 132615, 118703, 106595, 95428, 77794, 66864, 66870, 64153, 63910, 60373, 57842, 57855, 55292, 51584, 45907, 39004, 36277, 37386, 36770, 35863, 34592, 37918, 35840, 34716, 36071, 34079, 30624, 30534, 28844, 22562, 21241, 24029, 21274, 20085, 20469, 18185, 13515, 15654, 17209, 14223, 19282, 21035, 20529, 24185, 23654, 19208, 16354, 16568, 11883, 9624, 13828, 11551, 11168, 14018, 10504, 7661, 8000, 7146, 7721]
11701G721j833k402k681N950Q512M880l419R29L185j955k909J335O41K089P83
11686B0826q44m466l565P184O181m32n550q0O344L468l765n403m824n65L198K317
11670B0024k649k515L55J026j998j604M65L336M897P332J035K140J873J985m38
11655C5264l181j531Q71P52p97k025m23q63K15j814q6l366K621J828K67J183O36
11638B9551J403k163J64K939j81m616l172n43L327K666n65j504O376J168p51j859
11622C2240j735k882L624k288l534l92K494N403L863k680R66M332j36J520K657
11607D3452j804j553q19k93j155M80j031p09K923r70M10Q73K181J741j782k903
11591C9041j860k061n088J228N298j589l418k734J98R17L682K007l63j826k214
$$ y = [7721, 5888, 3486, 805, 6755, 15267, 20147, 16728, 17657, 20842, 18887, 15978, 17313, 17954, 20043, 20826, 19982, 15516, 11951, 19135, 25316, 24884, 19334, 19254, 25598, 29066, 25301, 19898, 15074, 14509, 17707, 20024, 17375, 14860, 15215, 16241, 14243, 12639, 13104, 16440, 21337, 28669, 29704, 31844, 33717, 35702, 35264, 32083, 30552, 31423, 32175, 31378, 29353, 28930, 28067, 28282, 26468, 26382, 23016, 25637, 27465, 27732, 28915, 29551, 30954, 28791, 28955, 31894, 31713, 27097, 23925, 23382, 26709, 29375, 28810, 27306, 33682, 34850, 34099, 32240, 30505, 27623, 31247, 28959, 25425, 25033, 27527, 32930, 36793, 34113, 35079, 39411, 39275, 40795, 43452, 41648, 40095, 39276, 38983, 37828, 38308, 37277, 36568, 39491, 38521, 38931, 39804, 41985, 43726, 41944, 39041, 37181, 35120, 30032, 31260, 36558, 34969, 31551, 28817, 29015, 29932, 33614, 35621, 35258, 33432, 31218]
11576C1218n968J115j45K178j213L18M309J283j491J030K905J399k480j641j631
11561C1186J213r43M209K723n279K55M696j233n949J466J546j170M461M100K82
11546D1563j410J605j390P54J678k445m436M616O87k660J993J244k331k540p79
11531C6149L997l407J582P14j927L532M304O37p19m43J145l231n52K21K929M793
11515D9724L304L926L539j863K33N810M506Q363J3931O539R412J7450J9097J0494
11501A54465J1086J6536J6915J6101J3025j960j895Q318P534Q286J2208J5193
11489B75812J6297J1309P767K860j091l593n763r983j7623j4917j4815j4949q375
11476B22936j0265j5515j3603j2807r816j3200q889m668n703j1016r836o819n538
$$ y = [31218, 25250, 26365, 26220, 28398, 27185, 27503, 31812, 33095, 31604, 32634, 35539, 36938, 34458, 32817, 31186, 32399, 31456, 35665, 38388, 33109, 33364, 38060, 36827, 30878, 32344, 33890, 32720, 37181, 41281, 41563, 40153, 41758, 40368, 41122, 42800, 40355, 35919, 40535, 41222, 38562, 40555, 41799, 39468, 36928, 36149, 40146, 36739, 38321, 39035, 37108, 40640, 44944, 45581, 44862, 44419, 45564, 42333, 41781, 42002, 44931, 49724, 53028, 56954, 60493, 58630, 58863, 64673, 69179, 77542, 91473, 98012, 107424, 124874, 143971, 154465, 165551, 182087, 199002, 215103, 228128, 226168, 224273, 232591, 240125, 248411, 260619, 275812, 292109, 303418, 311185, 314045, 312954, 309361, 303598, 293615, 275992, 261075, 246260, 231311, 222936, 212671, 197156, 183553, 170746, 160930, 147730, 138841, 134173, 128470, 117454, 107618, 100799, 95261]
11463I5261K032o427q874l229J529j21Q69J452q418p79M019r43L64K821n013l806
11447G0737J072J649K044j454L302J316l423O30j180m597K909k08N041j388q006
11432F8444m010m758m953L091L95M5k084k427p4J921o75n159J264l379J532P90
11416D9963K52L061l791l229l213r93j846l147Q45L353O65o90L070o40N76l45
11400D3891L66k732M094N515O194N633N605J0805J0690J0135R087J0047R721P792
11386A36843Q201J496n23j1303j2624j7300j7754j2062j3832j0638m033K127p19
11373D7879m894m493j883q1p94l856O41K750K825o306N64O173n206j496O82j418
11357C1087P72k134K903O077K746q85R84J693J007p150k781l24K209P720K752
$$ y = [95261, 97293, 90866, 81992, 78763, 80292, 80171, 81040, 82492, 74074, 73295, 77314, 76371, 76735, 79556, 74543, 70737, 71809, 73458, 75502, 74048, 77350, 78666, 75243, 75873, 74693, 70096, 73005, 72797, 77838, 76450, 68444, 64434, 59676, 54723, 57814, 58209, 58254, 56170, 53743, 53669, 55590, 54915, 49756, 51020, 47641, 49173, 49963, 50215, 53276, 49485, 46256, 43043, 42050, 40204, 37057, 37902, 41255, 41920, 41230, 44300, 43660, 44236, 43891, 44257, 41525, 45619, 51134, 57328, 62961, 68566, 79371, 90061, 100196, 109283, 119330, 129051, 136843, 145044, 146540, 146017, 134714, 122090, 104790, 87036, 74974, 61142, 50504, 46471, 48598, 47879, 42985, 38492, 36609, 36528, 35734, 31878, 32519, 35269, 38094, 31788, 32352, 38525, 33319, 31823, 32505, 31087, 31859, 29725, 32628, 38705, 41451, 40566, 41550, 43243, 44250, 37100, 34319, 33995, 36204, 43924, 46676]
11342D6676m38r84j043K52j31j332M868K333Q733Q251l942R152J4176J1031J4210
11327A11812J2543J3385J2618P260N567P151J532j1833k3296k2704j4560j0305
11315H9170q589r541o691m512L282P604L156p02J027L565k946M059P235R267J0492
11300A05876J3469K0620K4375L1276K8763L3819L6686L6168L4802K6405J1544
11289D03803o436k0840k4966k2716k5438l1515k6086k1951j8021q456L743J70
11277B01291O14Q85O716O778O862M554K591J0954L808M501J0250Q695R761J7658
11263B95918J4043J5092K0177J8419J8542K2042J7442J2799J4664J3631L679k590
11251D63858l822j827o030l988j1255o884q708j0698j4065j2999j4214r853j7040
$$ y = [46676, 46238, 45254, 44211, 44463, 44332, 43000, 47868, 50201, 58934, 67185, 63243, 72395, 86571, 97602, 111812, 124355, 137740, 150358, 157618, 163185, 170336, 171868, 160035, 136739, 114035, 99475, 89170, 80581, 71040, 64349, 59837, 63119, 70723, 73879, 73177, 74204, 77769, 74823, 78882, 86117, 95384, 105876, 119345, 139965, 164340, 195616, 224379, 258198, 294884, 331052, 365854, 392259, 403803, 397367, 376527, 351561, 328845, 303407, 271892, 245806, 223855, 205834, 197378, 201121, 201291, 201905, 202790, 209506, 216284, 223146, 227700, 230291, 241245, 245053, 249554, 259804, 268499, 278260, 295918, 309961, 325053, 345230, 363649, 382191, 404233, 421675, 434474, 449138, 462769, 466448, 463858, 460036, 458209, 452179, 448191, 436936, 430052, 421344, 410646, 396581, 383582, 369368, 359515, 342475]
11238C42475j7679j9849j6375j6449j6748j1703j3684j2493j2896j5157l575j1012
11226A74855r594m562p738q971q599l470j012m136j0085n480l811l126j216j278
11212A01777k155o051k273k846n657J333K34m385j153k218Q55M33k752P35l327
11197G2550L326O032J060N502K665M51L455J080K404O943N871O506O788J0314
11183A34947J2908J2959J6863K2496K0833K1634K3314J9697J8016J3636M926o620
11171C15609j0453j6787k1860k3074k3098k2146j6861j5732j6720j1446p174j1786
11159A18472p015m134o374j856L37K761J711j718j981M025l125q32k872n805p05
11144I0889o394q980n571k874M370j886k446M421N079j377k903l181m338j517
$$ y = [342475, 324796, 304947, 288572, 272123, 255375, 243672, 229988, 217495, 204599, 189442, 185867, 174855, 165261, 160699, 152961, 143990, 135391, 131921, 130909, 126773, 116688, 111208, 107397, 104271, 103055, 101777, 99622, 93571, 91298, 88452, 82795, 84128, 84362, 79977, 78824, 76606, 77461, 77894, 75142, 75877, 72550, 75876, 81908, 82968, 88470, 91135, 91586, 95041, 96121, 98525, 105468, 111339, 117845, 124633, 134947, 147855, 160814, 177677, 200173, 221006, 242640, 265954, 285651, 303667, 317303, 322229, 315609, 305156, 288369, 266509, 243435, 220337, 198191, 181330, 165598, 148878, 137432, 130258, 118472, 111457, 107323, 100949, 99093, 99430, 102191, 103902, 102184, 100203, 104228, 101103, 100271, 97399, 91594, 90889, 84495, 75515, 69944, 67070, 71440, 69554, 67108, 71529, 76608, 75231, 72328, 69147, 64809, 63292]
11130F3292m139K420O344P458O422p45R68L691L468L842O074R83J2975J5237R726
11115A38016J4695J3252P767O159O761p26N550R888O766J897k839n106j0029j1620
11101A80431j2170r895p859q986j0165n017p508q151m233r180n424q57k541n546
11087H2899n246n173N44N76j809k666k803l779j632J523j804N89q79j45n713l600
11071E0882lK918L698m90K200J863k319k467k445n604q61n18R29j340l075J411
11055D4779K114q67l895k901k848L050L156M191j038k321L181J700J0532N686
11041F4519p88N824R412J1609J6875J3350K4255L5072M4204M8694N4119N9845
11029C86990N3043L5567K3408K1560N761k3711o0534p3002o9236n7344m5739l8075
$$ y = [63292, 59153, 61573, 67917, 75375, 81797, 81052, 82020, 85711, 89179, 93021, 99095, 100078, 113053, 128290, 138016, 152711, 165963, 173730, 179889, 186650, 185924, 191474, 201362, 208128, 210025, 207186, 202080, 192051, 180431, 168261, 158366, 150507, 141521, 131356, 126339, 118831, 110680, 106447, 97267, 91843, 90986, 88445, 82899, 77653, 72480, 73024, 73600, 71791, 69125, 66322, 62543, 60911, 62434, 60630, 61219, 60340, 60195, 54482, 50882, 50879, 53797, 57495, 57005, 59205, 61068, 58749, 56282, 53837, 48233, 47372, 46854, 47783, 46443, 43368, 44779, 46893, 46026, 42131, 39230, 36382, 39432, 42588, 46779, 45741, 43420, 46601, 48301, 58833, 64519, 63731, 69555, 78967, 90576, 107451, 120801, 145056, 180128, 224332, 273026, 327145, 386990, 440033, 475600, 499008, 520568, 526329, 502618, 442084, 369082, 299846, 242502, 196763, 158688]
11017A58688k2958k2079k1739j3117o667j111j574k036m465l724m874J26L107
11004E7577N31n173j390K249l417M003K253O79J054k502n85j015j408J595K134
10989E6585L33L283M023j309L120J2232J5069J6678J2728Q906J4448J3912Q003
10976A68011L946l478p034j0489j7401j7382j7039j0809n608q772m919j700O27
10963F7953J922o040m210k907k159J676K515O855O607m098M27R9n753L697J4030
10948H0614O928L964Q785J3845J7447K2212K1570K3715K1415J3028O848m725j2932
10935B22714j7773j8660j8120j2829j9494j4559j0358l652n09l313q642p028N365
10922I3142j574n369o740K266N326M56q960p287l633J432Q069J7391J4032R419
$$ y = [158688, 135730, 113651, 91912, 78795, 72128, 71017, 69443, 67407, 62942, 59218, 54344, 54470, 57577, 58108, 52935, 51545, 53794, 50377, 54380, 56633, 57312, 58366, 55864, 55279, 54264, 52856, 54451, 56585, 56918, 60201, 64224, 62915, 66035, 78267, 93336, 110014, 122742, 131648, 146096, 160008, 168011, 171957, 168479, 161445, 150956, 133555, 116173, 99134, 88325, 82717, 73945, 69026, 67326, 67953, 69875, 63835, 59625, 56718, 54559, 56235, 58750, 65605, 72212, 68114, 68541, 68640, 62887, 66584, 80614, 87542, 91506, 100291, 114136, 131583, 153795, 175365, 199080, 220495, 233523, 240371, 235646, 222714, 204941, 186281, 168161, 155332, 135838, 121279, 110921, 107269, 106760, 103447, 94805, 87777, 93142, 91568, 86199, 79459, 81725, 87051, 87507, 78547, 71260, 67627, 69059, 77128, 94519, 108551, 117970]
10908A17970J3383P226Q673M033l059j434q107q478j3425j0331q904k246k128
10895I3173k868k81M50j12J554j04k531j91j690m687j979m010k869L409k193K376
10879G7447K970N93K958M155m31M064l289l497j604K996l06J627L596M068N081
10864A00428M677O724O414N055O913J3248L953N635J4837J0835J1116J0251J7999
10851B18085L3345M2481O2017P9207R7368J30736J61620J68353J45716J09462
10841A248390Q6254P6463L8705m3095j43566k01594j83142j19029n0558J4275
10831G23103Q7510J49504J89860J58346J01007Q0312Q1400P2201j0214k11597
10821A421432l36360k92332k00584j22356p9168n5369m6698k7056j8019j3188
$$ y = [117970, 131353, 138579, 147252, 151285, 148226, 146792, 138685, 130207, 116782, 106451, 97547, 95301, 93173, 90305, 90024, 90474, 90362, 91916, 91812, 89281, 89090, 87400, 82713, 80734, 76724, 73855, 77264, 75071, 77447, 80417, 81010, 83968, 88123, 87692, 91756, 88467, 84970, 83366, 86362, 86056, 87683, 91279, 95347, 100428, 105105, 111829, 118243, 123298, 130211, 143459, 147412, 153047, 167884, 178719, 189835, 200086, 218085, 251430, 293911, 355928, 435135, 532503, 663239, 824859, 993212, 1138928, 1248390, 1334644, 1411107, 1449812, 1406717, 1263151, 1061557, 878415, 759386, 708828, 723103, 810613, 960117, 1149977, 1308323, 1409330, 1489642, 1571042, 1643243, 1633029, 1421432, 1085072, 792740, 592156, 469800, 390632, 335263, 288565, 261509, 243490, 230302]
10811B30302j1857m233k816n166Q1j885O00K502m428m281o944m978n436j5526
10797A65935j5324j7800j3202l605l991p000p066r307p288k766k449J729ok900
10783G4960P05K830M22O33l755p705L030L176J635J149q11j621K193l659q996
10768F4186o654k097k156q017j809P086k109k005j523J403J860K370L26L180m364
10753D9677j311j365j457n92p17J875J117K956M269j368M91j75k885Kn042m641
10737D0834N325j607o744r029o108j2797j0849M76j778j943J803J2285J3582J0157
10723C3607J5212K1327K0999J5198Q062K663m809J540J461m998j0631K005L992
10710A05628p073o911l042J638N114m52K081K538M902R402N779k361K867O299
$$ y = [230302, 218445, 214212, 211396, 206230, 206311, 204426, 205026, 207528, 203100, 198819, 191875, 186897, 181461, 165935, 150611, 132811, 119609, 116004, 112013, 105013, 97947, 88640, 81352, 78586, 76137, 77866, 77860, 74960, 75665, 78495, 78917, 79550, 75795, 68090, 71120, 74296, 75931, 77080, 76269, 74648, 76841, 73182, 64186, 57532, 55435, 53279, 45262, 43453, 50539, 48430, 46425, 44902, 46305, 48165, 50535, 50861, 54041, 49677, 48366, 47001, 45544, 44952, 44235, 46110, 47227, 50183, 54452, 53084, 53575, 53400, 50515, 50517, 45475, 40834, 46159, 44552, 37808, 28779, 22671, 9874, -975, -499, -2277, -4220, -2417, 9868, 23450, 33607, 48819, 70146, 91145, 106343, 114405, 117068, 112259, 113799, 115260, 110262, 99631, 101636, 105628, 98555, 91644, 88602, 90240, 95354, 94902, 96983, 99521, 104423, 113825, 119604, 117243, 120110, 126409]
10696A26409L243O648M428O401K800L757J0916P256Q733J3408J0937N694R457
10683B20087J6201J1633J7396L0374L1365K1981K6367L5122M9809L9129J7035
10672E16499J1312J4065o700l3716m7220k3881M639m8502q6154p5569m7222k4899
10660A52652j6231j2991q792m996k912k162N943N637L465M584L08q53k325j886
10646A19441m229l127l671l864Q27J712R55k993o295m196J710l59J924L520m702
10631I6653n016l376m53J911j818l877m248O71L034j919p160K828J096n746n812
10616F6768q907j0458r845k0700k2669j9904j4990j5840j1761m759R328K8221
10604c5516K7739L1699M8355O5402Q0932P1633N7994L8249K0832J1294j0j3446
$$ y = [126409, 129652, 136300, 140728, 147129, 149929, 153686, 164602, 171858, 180591, 193999, 204936, 210630, 220087, 236288, 247921, 265317, 295691, 327056, 349037, 375404, 410526, 460335, 499464, 516499, 527811, 541876, 535176, 501460, 454240, 430359, 434998, 386496, 300342, 224773, 177551, 152652, 136421, 123430, 114638, 109642, 106730, 104568, 110511, 116148, 119613, 124197, 124505, 123652, 121327, 119441, 115212, 112085, 108414, 104550, 105377, 107089, 108044, 105051, 98756, 94560, 96270, 95911, 97835, 101355, 96653, 91637, 88261, 87808, 89719, 87901, 84024, 79776, 80447, 83481, 81562, 74402, 77230, 78326, 72580, 66768, 57861, 47403, 37558, 16858, -5811, -25715, -40705, -56545, -68306, -73065, -63737, -35516, -7777, 23922, 72277, 137679, 218611, 290244, 348238, 386487, 407319, 418613, 418603, 405157]
10592D05157k0574k0212j9323j3620j9239k1586j4721p820n670j0641j3876j2877
10580B24998n324m932j638o943j0619p953M454K0899L1478L1240K1733J4375L2833
10567C44601M9138M0912K7383J5826J5094J4794J0481P226J0805P394P938P646
10555E59238M930J0522J5903J8716J7504K1832L6959N0565N1253N2693N8208L8693
10543I37016K6832J1910M380K064n347l9374o0942n6425m0989l4698j5932j2143
10531G16352j0562n484O843R802J3298J9920J6897J6992J5136K2872K0270K6110
10519H68446K0780K1130K8768K5271K5537K6410K4290K7040J9765J5818P168J459
10507A111882M239J1378J0730L157M843R899J6071J0874J3244J7605J8252J0838
$$ y = [405157, 384583, 364371, 345048, 331428, 312189, 290603, 275882, 268062, 262392, 251751, 237875, 224998, 219674, 214742, 213104, 206161, 195542, 187589, 192043, 212942, 244420, 275660, 297393, 311768, 344601, 393739, 434651, 462034, 477860, 492954, 507748, 518229, 525455, 536260, 543654, 551592, 559238, 564168, 574690, 590593, 609309, 626813, 648645, 685604, 736169, 787422, 840115, 898323, 937016, 963848, 975758, 980138, 982202, 976855, 937481, 876539, 820114, 779125, 744427, 728495, 716352, 705790, 700306, 707149, 716951, 730249, 750169, 767066, 784058, 799194, 822066, 842336, 868446, 889226, 910356, 939124, 964395, 989932, 1016342, 1040632, 1067672, 1087437, 1103255, 1110423, 1111882, 1116121, 1127499, 1138229, 1141386, 1146229, 1156128, 1172199, 1183073, 1196317, 1213922, 1232174, 1243012]
10495A243012K716J8142L6851L9745L9261M1092M9395O1056O9684P9238P6977
10484A757169O4983P8758R3913R4393Q6695Q5829R5860J08452J15412J06231R9644
10473B787339R1959Q5814Q5408Q3922Q4122J03933J15584J21309J43268J60593
10463C863251J72702J73312J72279J59690J54168J82789K17108K39111K67895
10454E602305L08199L66388M37671N16764O21656P62174R45234J198400J476313
10445A2235104J679938J813759J995185K247190K458818K506929K173816J709943
10437B8820682J738184K079715K436670K849351L328634M595653P024685J0452065
10429F3325639J5040722K1166436K8696491L5882529L9296812L7638676L5642416
$$ y = [1243012, 1245728, 1263870, 1300721, 1340466, 1379727, 1420819, 1470214, 1531270, 1600954, 1680192, 1757169, 1822152, 1900910, 1994823, 2089216, 2175911, 2261740, 2357600, 2466052, 2581464, 2687695, 2787339, 2879298, 2965112, 3050520, 3134442, 3218564, 3322497, 3438081, 3559390, 3702658, 3863251, 4035953, 4209265, 4381544, 4541234, 4695402, 4878191, 5095299, 5334410, 5602305, 5910504, 6276892, 6714563, 7231327, 7852983, 8615157, 9560391, 10758791, 12235104, 13915042, 15728801, 17723986, 19971176, 22429994, 24936923, 27110739, 28820682, 30558866, 32638581, 35075251, 37924602, 41253236, 45848889, 52873574, 63325639, 78366361, 99532797, 128229288, 164111817, 203408629, 241047305, 276689721]
10422B76689721L8720216M4314444M1080513K0214293p651616k2634435k0325167
10415C70407969j2353819j8081108m9017702o8504982n8316904m0197278k6752289
10408I7183887j8337571j3101603r694851p363787n748822m564321l698312l105126
10400C1569494k702628k306141j842839j374632r78382p00354m62585j69710J65655
10391B1197878M96410P38329P82267Q33781R85267J033065Q66109N25467Q6319
10382B7544892l68413q61972j476723k139718k535353k487367k159580j763058
10374A3752708j410243j137784r23470p53387o06047m83358l91851l35593k94444
10365G416531k65003k67110k73258k77693k83983k86942k87988k95238k75024
$$ y = [276689721, 315409937, 359724381, 400804894, 421019187, 413367571, 390733136, 370407969, 358054150, 339973042, 290955340, 222450358, 164133454, 123936176, 97183887, 78846316, 65744713, 56049862, 48686075, 42937253, 38372932, 34674620, 31569494, 28866866, 26560725, 24717886, 23343254, 22364872, 21664518, 21201933, 21032223, 21197878, 21694288, 22432617, 23214884, 24048665, 25033932, 26066997, 26933106, 27458573, 27544892, 27176479, 26314507, 24837784, 22698066, 20162713, 17675346, 15515766, 13752708, 12342465, 11204681, 10281211, 9527824, 8921777, 8438419, 8046568, 7710975, 7416531, 7151528, 6884418, 6611160, 6333467, 6049484, 5762542, 5474554, 5179316, 4904292]
10356D904292k27684j73198j32471r0180m7220N64L0196L9011L9904L4814K1221
10345D399249m719m1428r6637j48010j97300k31047k44629k43429k34883k05553
10335B751614j76779j46585j27587j10380r5500q4805p7447o1716m6688m8187
10325A775940n3757m9962m5717m1805l7219l7633k9307k4399k5402k7871k1051
10314A381817j6346o338J498O131J2925J8635K5765K8636K3461J3307O33p418
10302A482706j0104k5892n0962n9743o5863n3634l7470k2374p533O761Q157j0390
10290A153659j8402o975M276j7663m1774n7420p2160p0090n4051m1055k7294k2788
10278G28263j9355p087l23N254K1099K7060L6147N2054N0983M2041L7424K7652
$$ y = [4904292, 4676608, 4503410, 4370939, 4280759, 4233539, 4234103, 4264299, 4303310, 4343214, 4378028, 4399249, 4394530, 4353102, 4256465, 4108455, 3911155, 3680108, 3435479, 3192050, 2957167, 2751614, 2574835, 2428250, 2300663, 2190283, 2094783, 2009978, 1932531, 1870815, 1824127, 1775940, 1722183, 1672221, 1626504, 1584699, 1547480, 1509847, 1480540, 1456141, 1430739, 1402868, 1381817, 1365471, 1359133, 1360631, 1366762, 1379687, 1398322, 1424087, 1452723, 1476184, 1489491, 1490124, 1482706, 1472602, 1446710, 1395748, 1336005, 1270142, 1216508, 1179038, 1156664, 1149131, 1155892, 1164049, 1153659, 1135257, 1128282, 1132558, 1114895, 1073121, 1015701, 943541, 873451, 819400, 778345, 751051, 728263, 708908, 701821, 701498, 706752, 727851, 754911, 791058, 843112, 894095, 936136, 973560, 1001212]
10266A001212J4059L059j3806m3803n7873n4698l5115m0168n2479m7281m5798
10255F27309l8373k0396j3375j8199l3066l3021l4010k8867k6857l6897l4779
10244C09469k6475j7017j0209l293J3045K6772L9033M1020L9298M1477N5009N5619
10232E63748M7201K9296O063k257K179n680l5095m2393l8507l3771k3263j1136
10220D56385n106m653q590p218j4167k0119r333m882j732o685r162n215k996q022
10206C48505K151k064j955k833k381l704j867j517n36l86K048l166o398n945o364
10191C13588j0163q037q704o706Q51K774Q03m001J99N251K973J179N725N209N17
10176C01458k781n792L945l70k983l809Q18N666K217k611n489J769n207o980q785
$$ y = [1001212, 1015271, 1018330, 1004524, 960721, 902848, 848150, 813035, 772867, 720388, 673107, 627309, 588936, 568540, 555165, 536966, 503900, 470879, 436869, 408002, 381145, 344248, 309469, 282994, 265977, 255768, 252475, 265520, 292292, 331325, 372345, 411643, 453120, 508129, 563748, 610949, 640245, 646308, 644051, 646230, 640550, 605455, 563062, 524555, 490784, 467521, 456385, 451279, 446626, 438036, 430818, 416651, 396532, 387199, 382317, 380585, 373900, 364738, 359523, 356527, 348505, 350656, 348592, 346637, 343804, 341423, 337719, 335852, 334335, 333799, 333413, 335461, 332295, 325897, 319952, 313588, 303425, 295388, 286684, 279978, 280829, 283603, 284406, 280405, 280604, 285855, 288828, 290007, 295732, 300941, 301458, 298677, 292885, 296830, 296460, 293477, 289668, 290486, 296152, 298369, 295758, 290269, 292038, 286831, 279851, 271066]
10161B71066n019m289r784j5955q672p103r907o317q548k017n772m583K659P072
10147A92831O919K425p14K37O629J2162J0266P336P488P437P740J8107K3233K7900
10133C29996L8705N5474O0442N2553M2210K8461K1203J7444J456l0293o7258p9966
10121D70427o9729m8648l2958k2884p968K246K087K151J5841J9787K2314J4796
10109C67462Q823P449J7376R830N724J1920J4348K9354M0670M4418M5745M2082
10097F45201M5111M6534M7762L8926J5661j0405k3532k5989k4276l1563n2977
10086F70453p5653p9358o9824m9981l3455j8050j2130n829m930o853o451p525
10074C00414o915m013r48n337j350M942l864k743m247k413N38j937K245L047R992
$$ y = [271066, 266047, 261758, 251974, 236019, 227347, 220244, 210337, 204020, 195472, 193455, 187683, 183100, 185759, 192831, 199750, 202175, 201461, 201698, 208327, 220489, 230755, 238091, 245579, 253016, 260756, 278863, 302096, 329996, 368701, 424175, 484617, 537170, 579380, 607841, 629044, 646488, 647944, 617651, 550393, 470427, 400698, 352050, 319092, 296208, 288240, 290486, 292573, 294724, 310565, 330352, 352666, 367462, 376285, 383734, 401110, 410940, 416664, 428584, 442932, 472286, 512956, 557374, 603119, 645201, 690312, 736846, 784608, 823534, 839195, 828790, 805258, 779269, 754993, 723430, 670453, 594800, 515442, 445618, 395637, 362182, 344132, 332002, 326173, 321243, 314390, 307939, 300414, 293499, 289486, 288538, 283201, 281851, 286793, 282929, 280186, 275939, 273526, 274064, 272127, 274372, 277419, 287411]
10059B87411O771J48l813m39M72L868R234K698l420K160J877j672L703J0320J0895
10044C30213O867J4607J7828J2891J2734Q136Q82j0714j5454k0053j4991j5608
10032C27338j0284k111m986n763j099O346Q179J1314J1243R991P836J8156K3239
10019C99399J6632K1523L9270N3017O3591P9181Q4071Q8474Q5099R5284J15415
10008A140956J48650J80021J91032J70353J24070J19264J61543K12407K07664
9999B655960M1428j88310k35094j63684j03764r2746j48836k39222k73177k45702
9989A006853j87148j25866r3598o9531m9324l7757k3762k3089j9680j1504r917
9978C55677p968j1895o086r405j7044k2264o086J528J988l148q001M847m90K491
$$ y = [287411, 294182, 294330, 290517, 290078, 290550, 294418, 303652, 306350, 302930, 305090, 306967, 305295, 308998, 319318, 330213, 337080, 351687, 369515, 382406, 395140, 403276, 404158, 393444, 377990, 357937, 342946, 327338, 317054, 314943, 309957, 304194, 303095, 309441, 317620, 328934, 340177, 350168, 358004, 376160, 399399, 416031, 437554, 476824, 529841, 593432, 672613, 756684, 845158, 930257, 1025541, 1140956, 1289606, 1469627, 1660659, 1831012, 1955082, 2074346, 2235889, 2448296, 2655960, 2697388, 2509078, 2273984, 2110300, 2006536, 1913790, 1764954, 1525732, 1252555, 1006853, 819705, 693839, 600241, 530710, 481386, 443629, 419867, 396778, 377098, 365594, 355677, 347709, 335814, 329728, 320323, 303279, 281015, 274929, 276457, 278445, 275297, 267296, 272143, 271653, 274144]
9964B74144J3802J0145K360R280P490N696J369J338L788n464q988r704j0846p131
9950B87279K562J3614J6244J4774J1400L500N516O620N365j6552l9901l7616k2068
9937B50737q920j0618r361N37m805O60m83l50k569O066N866K897j943k095j865
9922B23754K05p45m596n048k442m088q746l69R32R44K007k191K40J494K315K511
9906B06177N870N115O137L31K873O492K02j033J428J046L178n165l032k931n09
9891B26179L245J181o43J865J924l513l138l639n929n064M94j181J467K434p94
9876B14888k732r72J519J544n71L44j415J322J736r93n869k788O88Q16l091l583
9860B00843l971o72p364l63k604k505j094J010P09R46n422o61N22j256j3L030
$$ y = [274144, 287946, 298091, 300451, 309731, 317221, 322917, 324286, 325624, 329412, 323948, 314960, 305256, 294410, 287279, 289841, 303455, 319699, 334473, 345873, 349373, 354889, 361509, 366874, 350322, 310421, 272805, 250737, 241817, 231199, 221838, 222375, 217570, 218230, 217747, 217397, 214828, 220894, 226760, 229657, 227714, 225619, 223754, 223959, 223214, 218618, 213570, 211128, 207040, 198294, 197925, 198857, 199801, 201808, 199617, 199857, 201351, 203666, 206177, 212047, 217162, 223299, 223630, 226503, 232995, 233197, 232164, 233592, 234638, 237816, 232651, 229619, 226688, 226179, 229424, 230605, 229962, 231827, 233751, 230238, 227100, 223461, 217532, 212468, 212962, 211781, 213248, 215682, 214888, 212156, 211184, 212703, 214247, 213676, 214020, 212605, 213927, 215663, 214670, 208801, 206013, 206701, 207517, 204426, 200843, 196872, 196200, 188836, 188473, 185869, 183364, 182270, 183280, 183989, 184935, 179513, 178852, 179374, 178118, 178105, 181135]
9844A81135L331L199l458K71K6J274K414K541M232j061j096o240l967k093K751
9829A83259j941k993K739L444l33k137N29L5j982j195p93L958K681j57l33J062
9813A85843N14L845M680L5k640l630J424l419p91k214M273L425K733k032n64M959
9797A96441L291M042K462N862J548p83L985L164j333m040j589k243M128j780l389
9782B09766Q44J699r79J609l169o109l258k220M185M109k213k096J621L40q30
9767B03299J624M050J146K740M908J056l339l491J076J437l671K732Q49J661j670
9752B14407k902r34J875N782K396j73L21o16j262j409L141L401L998K36m62j095
9736B26704m391Q67N224J950L500J159l211K827K610L334j0M576q6k484M012O232
$$ y = [181135, 184466, 187665, 184207, 184478, 184504, 185778, 188192, 190733, 194965, 193904, 192808, 186568, 182601, 180508, 183259, 181318, 178325, 181064, 184508, 184175, 182038, 182567, 182602, 180620, 179425, 178632, 182590, 185271, 185114, 184781, 185843, 186357, 190202, 194882, 194917, 192277, 188647, 190071, 186652, 185861, 183647, 187920, 191345, 194078, 192046, 191482, 196441, 199732, 203774, 206236, 212098, 213646, 212863, 216848, 220012, 218679, 214639, 213050, 210807, 214935, 213155, 209766, 210610, 212309, 211330, 212939, 209770, 203661, 200403, 198183, 202368, 206477, 204264, 202168, 203789, 204129, 203299, 204923, 208973, 210119, 212859, 217767, 218823, 215484, 211993, 213069, 214506, 210835, 213567, 214416, 216077, 214407, 211505, 210571, 212446, 218228, 220624, 220451, 220772, 220156, 218894, 217485, 220626, 224027, 228025, 228261, 227799, 226704, 222313, 223180, 228404, 230354, 233854, 235013, 231802, 234629, 237239, 240573, 240563, 245139, 245053, 242569, 246581, 252813]
9720B52813l33k223L009L353L238J701L595M35J680l600K648K047R70P46K089
9705B72168Q01k85M246R371M325j347M146N354N925J3193J4445K3927L5862M0891
9691D33022M1898L6272K7468K7124L2925K6888r635m8783o1984n3913l5477k7137
9679C88668k8243j9695j1122q045R38L893k954R7n145l129m263j424M867l72K218
9664C16289L340k520j071O452L879L587k623m80N763L66j961K796l74L503N616
9649C42562Q435L612k208n235L82L556M734N275k06M352M058K715O756O045K272
9634C87105L563J1480J4133K3861K7790K5585K5916K0342J7185J9893J3963J867
9622E92683r094m582j7786k3882k4825k3214j6604j3599j0887j529K21J738J216
$$ y = [252813, 252480, 250257, 253266, 256619, 259857, 261558, 265153, 265588, 267268, 263668, 266316, 268363, 269333, 270079, 272168, 272969, 272684, 276930, 286301, 290626, 289279, 293425, 298779, 304704, 317897, 332342, 356269, 392131, 433022, 474920, 511192, 538660, 565784, 598709, 625597, 615962, 567179, 505195, 451282, 415805, 388668, 360425, 340730, 329608, 321563, 322501, 326394, 323440, 323537, 318392, 315263, 311000, 309576, 314443, 314071, 316289, 319629, 317109, 316038, 322490, 326369, 329956, 327333, 326853, 332616, 332982, 331021, 333817, 333443, 336946, 342562, 350997, 354609, 352401, 347166, 347548, 351104, 355838, 361113, 360907, 365259, 369317, 372032, 378788, 384833, 387105, 390668, 402148, 416281, 440142, 467932, 493517, 519433, 539775, 556960, 576853, 590816, 592683, 583589, 579007, 561221, 537339, 512514, 489300, 472696, 459097, 448210, 446681, 446902, 448640, 449856]
9609D49856K178J139k78J792m6P959N15k803J603K324J654J436L580L823j819
9594D72913M584R42k763O141Q194K020K521N587P18j937L919J1074J0337N268
9580E29518L139K815K569Q092P85O321O944L420J975K654M659RO066J2689Q701
9565F00356Q92O795P018N342M580K659L688L024O495O179R486P058J804L827R380
9550F78583L152M365J0364N809N018Q209J2248J3147J0553N059M070L068P998
9537G71643P459R669J4251J5926P267Q834J0369O735M142N324J0191J0061P213
9524H89084O771J2631J1033Q710J6253J3114R856J2061J3688J1880J0077J4806
9512A029964J4913J0741Q803R348Q010J3592K1672K4977J4657J1274J4493J2286
$$ y = [449856, 452034, 453173, 452895, 454687, 454641, 462600, 463115, 460312, 461915, 464239, 465893, 467329, 470909, 474732, 472913, 477497, 478439, 475676, 481817, 490011, 492031, 494552, 500139, 500857, 498920, 502839, 513913, 524250, 529518, 532657, 535472, 538041, 546133, 546918, 553239, 560183, 563603, 565578, 568232, 572891, 572900, 578966, 591655, 600356, 601248, 608043, 615061, 620403, 624983, 627642, 631330, 634354, 640849, 647028, 656514, 663572, 665376, 669203, 678583, 681735, 686100, 696464, 702273, 707291, 715500, 727748, 740895, 751448, 756507, 760577, 763645, 771643, 779102, 788771, 803022, 818948, 826215, 835049, 845418, 852153, 856295, 861619, 871810, 881871, 889084, 895855, 908486, 919519, 928229, 944482, 957596, 967452, 979513, 993201, 1005081, 1015158, 1029964, 1044877, 1055618, 1064421, 1073769, 1081779, 1095371, 1117043, 1142020, 1156677, 1167951, 1182444, 1194730]
9500A194730J3630J9332J5225K0065K0795K1071J5670J6711J8681J8003K2328
9489A396241K1994J6768J6967J6810K1379K3287K1098K6206K4039K3017K2123
9478A629929K7809K6389K4671K4112K8929L1567K7799K7324L1114L3877K7100
9467A940620K7562L1628L1816L3086L6916L9999L9419M6051M0560M0146M5481
9456B353284M0222M3190M6745N2224M8346M7428N1364N3239N8825N6313O1185
9445B912365O7818O9238P4951P4927Q2141P8295P9519P7399P9193P2052O7466
9434C735364P0310P2130P8233Q3447Q4244R6034R6524R3983J03182J09201J15326
9423D737978J10656J15973J20703J26720J34679J33760J37578J39640J47117J51371
$$ y = [1194730, 1208360, 1227692, 1242917, 1262982, 1283777, 1304848, 1320518, 1337229, 1355910, 1373913, 1396241, 1418235, 1435003, 1451970, 1468780, 1490159, 1513446, 1534544, 1560750, 1584789, 1607806, 1629929, 1657738, 1684127, 1708798, 1732910, 1761839, 1793406, 1821205, 1848529, 1879643, 1913520, 1940620, 1968182, 1999810, 2031626, 2064712, 2101628, 2141627, 2181046, 2227097, 2267657, 2307803, 2353284, 2393506, 2436696, 2483441, 2535665, 2584011, 2631439, 2682803, 2736042, 2794867, 2851180, 2912365, 2980183, 3049421, 3124372, 3199299, 3281440, 3359735, 3439254, 3516653, 3595846, 3667898, 3735364, 3805674, 3877804, 3956037, 4039484, 4123728, 4219762, 4316286, 4410269, 4513451, 4622652, 4737978, 4848634, 4964607, 5085310, 5212030, 5346709, 5480469, 5618047, 5757687, 5904804, 6056175]
9413F056175J60865J67929J73854J76922J79303J91959K01291K11330K12435K17660
9403G949723K28530K26151K25723K28108K32566K33711K25508K15781K21353K24804
9393A0211958K25940K31930K42841K43000K40727K41329K43137K43726K38521
9384A2363109K32765K31559K25219K11546J99551J92140J82748J69913J56052
9375A4164602J44149J25869J11748R1953P4563N8205L4666J6313N640j3610l6749
9364A4777349n0497o2881p8519r6905j06839j32963j50012j73881j85276j97494
9354A3542082k10402k31744k41521k39746k44929k44774k41815k51271k49286
9345A1386594k46569k44807k41064k46522k44329k40619k34861k29180k26924
$$ y = [6056175, 6217040, 6384969, 6558823, 6735745, 6915048, 7107007, 7308298, 7519628, 7732063, 7949723, 8178253, 8404404, 8630127, 8858235, 9090801, 9324512, 9550020, 9765801, 9987154, 10211958, 10437898, 10669828, 10912669, 11155669, 11396396, 11637725, 11880862, 12124588, 12363109, 12595874, 12827433, 13052652, 13264198, 13463749, 13655889, 13838637, 14008550, 14164602, 14308751, 14434620, 14546368, 14638321, 14712884, 14771089, 14805755, 14822068, 14827708, 14814098, 14777349, 14726852, 14663971, 14585452, 14488547, 14381708, 14248745, 14098733, 13924852, 13739576, 13542082, 13331680, 13099936, 12858415, 12618669, 12373740, 12128966, 11887151, 11635880, 11386594, 11140025, 10895218, 10654154, 10407632, 10163303, 9922684, 9687823, 9458643, 9231719]
9336I231719k22023k15261k12445k08052k05952j99686j93245j88612j85897j83362
9326G217184j77546j70269j68857j62970j55420j59674j53149j47360j43161j37115
9316E641663j37775j30341j26326j23656j16785j16565j12632j09063j05978r9884
9306D462658j00851r3985r1519q7206q8412q6758q3945p6297q3139p5458p3261
9295C521827p3315p4255p1837o5456o5402o2466n8008n7614o0924n9945n3303
9284B819302m7359m8652m7388n3218m9224n0290m8745m2636m2593m6484m2079
9273B300634l3038l7224m0907l9872l7551l3537l7626l0558l0485l2480l0685
9262A916671k9672l1160l1699k9694k4380k6067l0093k7163k7561k6350k4075
$$ y = [9231719, 9009696, 8794435, 8581990, 8373938, 8167986, 7968300, 7775055, 7586443, 7400546, 7217184, 7039638, 6869369, 6700512, 6537542, 6382122, 6222448, 6069299, 5921939, 5778778, 5641663, 5503888, 5373547, 5247221, 5123565, 5006780, 4890215, 4777583, 4668520, 4562542, 4462658, 4361807, 4267822, 4176303, 4089097, 4000685, 3913927, 3829982, 3753685, 3670546, 3595088, 3521827, 3448512, 3374257, 3302420, 3236964, 3171562, 3109096, 3051088, 2993474, 2932550, 2872605, 2819302, 2771943, 2723291, 2675903, 2622685, 2573461, 2523171, 2474426, 2431790, 2389197, 2342713, 2300634, 2267596, 2230372, 2189465, 2149593, 2112042, 2078505, 2040879, 2010321, 1979836, 1947356, 1916671, 1886999, 1855839, 1824140, 1794446, 1770066, 1743999, 1713906, 1686743, 1659182, 1632832, 1608757]
9251A608757k1312k2718k6661k1733j8850j9443k1274j7579j7016j6381j8258
9240A387532k2149k1383k3684j6602j1873j4801j7171j4980j7382j7029j2521
9229A197957j3111j6260j5589k0042j3130j0981r635j2616j1456k1681j1634j1513
9217A030309j4010j0993r914j2332j5867j0644j1097r430m931p710r159j0610
9205I03612j2673j2887j1271r520p857q576r146n276o463p672l986p511o485j0519
9191G83770p115n754p819n217m173l936p514p260q673j0996m237o399p795p850
9177F89032k965p737q642k604m725n597p463o574l276o623o927l182m940q396
9163F09381l310K957j738q249r741p861n022n659p475l851Q48j219n723p083k289
$$ y = [1608757, 1587445, 1564727, 1538066, 1516333, 1497483, 1478040, 1456766, 1439187, 1422171, 1405790, 1387532, 1365383, 1344000, 1320316, 1303714, 1291841, 1277040, 1259869, 1244889, 1227507, 1210478, 1197957, 1184846, 1168586, 1152997, 1132955, 1119825, 1108844, 1099209, 1086593, 1075137, 1053456, 1041822, 1030309, 1016299, 1005306, 995392, 983060, 967193, 956549, 945452, 936022, 931091, 923381, 914222, 903612, 890939, 878052, 866781, 857261, 849404, 840828, 831682, 826406, 819943, 812271, 808285, 800774, 794289, 783770, 776655, 770901, 763082, 757865, 753692, 749756, 742242, 734982, 726309, 715313, 711076, 704677, 696882, 689032, 686067, 678330, 669688, 667084, 662359, 656762, 649299, 642725, 639449, 632826, 625899, 622717, 617777, 609381, 606071, 609028, 607290, 599041, 589300, 581439, 576417, 570758, 563283, 559432, 560280, 559061, 553338, 546255, 543966]
9148E43966j0550m399m516k341m29l721k676j447J292j980o337o169o011l040
9134D91642l528n954p935o574j148o400O38n49j816k618m80k448m930m642L92
9119D43650o920K427L516j339k956l793o211o023N21l44n642o154Q37N92J522
9104D13683m650o117k954k334k963m409o795j639K537J371l875q140r334k599
9090C61782L324m455p461J122J911L911r25l441n686k967p53j332K016J247o608
9075C41685j478j297K264k10K607n289m009K180p383l177l266j261Q54r61j019
9060C20240m171m341P96J190J356J164k681o242r54K370l384l659q16n622j051
9045B94195J318l998l801j066q26m003l604k087L370N092%p986q02j701j964n332
$$ y = [543966, 533416, 529017, 524501, 522160, 521731, 518010, 515334, 513887, 515179, 513199, 506862, 500693, 494682, 491642, 488114, 482160, 474225, 467651, 466503, 460103, 460741, 460192, 458376, 455758, 455278, 452830, 447900, 443258, 443650, 436730, 439157, 442673, 441334, 438378, 434585, 428374, 422351, 422872, 422528, 416886, 410732, 411569, 412161, 413683, 409033, 402916, 399962, 397628, 394665, 390256, 383461, 381822, 384359, 385730, 381855, 373715, 364381, 361782, 365106, 360651, 353190, 354312, 356223, 360134, 359209, 355768, 350082, 347115, 346362, 345030, 347046, 348293, 341685, 340207, 338910, 341174, 340964, 343571, 338282, 334273, 336453, 329070, 325893, 322627, 321366, 322220, 321259, 320240, 316069, 311728, 312524, 313714, 315070, 316234, 313553, 307311, 306357, 308727, 305343, 301684, 300868, 295246, 294195, 295513, 291515, 287714, 286648, 285822, 281819, 278215, 276128, 279498, 284590, 284590, 276604, 275802, 274101, 272137, 266805]
9029B66805l033k961M807M932Q24k401k535k612n043K392J671K045k703o091m794
9014B51303m854m753M64K208J668q37N31K619k24j807j649k096k28l523N663L443
8998B47928m624n32N69m130m627l292j021j146l05M045L842r08n342J57J833k078
8982B30369j080l692l314J828r34J444L708q7n048R08o16P03m29M640k086j776
8966B24538q367j376K204n832k292j004M78M755K304L266p00m620N90L692K52
8951B17888j625k599m051m544q096k918M170M784M183K326m258M30K067j166l239
8936B03352j564q80O32k076q397J337M013o36l40j925l062j037K554K806P83j434
8920A94126L062j260j971L766M413k034k208n596k992J464l050J417j216o270
$$ y = [266805, 263772, 260811, 265618, 270550, 271374, 268973, 266438, 263826, 258783, 261175, 262846, 264891, 262188, 256097, 251303, 246449, 241696, 242160, 244368, 246036, 245199, 245730, 248349, 248125, 246318, 244669, 242573, 242345, 238822, 244485, 247928, 243304, 242772, 243341, 239211, 234584, 231292, 230271, 229125, 228820, 232865, 236707, 235799, 230457, 230614, 232447, 230369, 229289, 225597, 222283, 224111, 223177, 224621, 228329, 228242, 223194, 224102, 223486, 224189, 223760, 228400, 226314, 224538, 216171, 214795, 216999, 211167, 208875, 207871, 208349, 213104, 215408, 218674, 217974, 213354, 213944, 217636, 217888, 216263, 213664, 209613, 205069, 196973, 194055, 198225, 203009, 207192, 209518, 205260, 205690, 207757, 206591, 203352, 201788, 200908, 201540, 199464, 191067, 192404, 196417, 195781, 195441, 193516, 190454, 189417, 191971, 194777, 195560, 194126, 197188, 195928, 193957, 197723, 202136, 200102, 197894, 192298, 189306, 190770, 187720, 189137, 187921, 181651]
8906A81651L629p497j246P510N590j509m296j262K574N98n67o75J638J003J0437
8891A97578P453J211k410J328M958Q501Q312Q950M840J2284J9822K5902L6322
8878C35051M9288N9376N6248M0371L0025L1627L2632J1293k2775n7572q1850o5338
8866D18376m1075l6514k5813j3995j1776j3161j4818j3723q837r134o625l039
8854B19866o376j0683o682o306o708l33m51j146k327J079n61L29l619l80M202
8839A79904M656J2270q4J4K135L06L084o160p659L56j549K482k734J910l366J649
8823A87214M078K599p280q469m576R48j552j31j433k266p89q04j136m235L97L218
8807A65783k995m356k809k164K146K742M258J789l410k965o137n376l051L72L617
$$ y = [181651, 185280, 177783, 176537, 184047, 189637, 188128, 183832, 182570, 185144, 185742, 185175, 184500, 186138, 187141, 197578, 205031, 206242, 203832, 205160, 210118, 218619, 226931, 235881, 240721, 253005, 272827, 298729, 335051, 384339, 443715, 499963, 540334, 570359, 601986, 634618, 645911, 623136, 565564, 483714, 418376, 377301, 340787, 314974, 300979, 289203, 276042, 261224, 247501, 238664, 229530, 222905, 219866, 213490, 202807, 196125, 189819, 183111, 182778, 182327, 181181, 178854, 179933, 179372, 179701, 176082, 175702, 179904, 184560, 196830, 196746, 196760, 198895, 199201, 202285, 196125, 188466, 188822, 187273, 189755, 187021, 188931, 185565, 187214, 191292, 193891, 186611, 178142, 173566, 174514, 172962, 172831, 171398, 169132, 168343, 167539, 166403, 162168, 162565, 165783, 162788, 158432, 155623, 153459, 155605, 158347, 162605, 164394, 160984, 158019, 151882, 146506, 143455, 143827, 147444]
8792A47444N131J440n418q63L876O463J714j754O335K495J314O47o87p407l137
8777A57593k330q96K83k642k662k485l396o45J161K980J786K881K383Km385m706
8761A44922k306K629J508l049l374k416K3R3K489K815M452k680k288o320L69j701
8745A35166L84L097M794K221n368j196M71L68K355L148r29l390j608p85K68M09
8729A39405J197j009l3j532K17K906j787o331p087k294M765N851L134p78j11P93
8713A37306L337J572k864P91j464k258J860J997M295q76l620m639K059J770J243
8698A40509J654K794O36q3M601j741o504l236J118k072l62J596j868M210O465
8683A47717j953J799K508k739k419M30j923J117K668L309p34k963K166K778L015
$$ y = [147444, 152575, 154015, 148597, 147734, 151610, 158073, 159787, 158033, 164368, 166863, 168177, 168824, 168137, 160730, 157593, 155263, 154367, 154650, 152008, 149346, 146861, 143465, 142820, 143981, 146961, 148747, 151628, 154011, 154013, 149628, 144922, 142616, 145245, 146753, 143704, 140330, 137914, 137937, 138030, 140519, 143334, 147786, 145106, 142818, 136498, 136867, 135166, 135550, 138647, 143441, 145662, 140294, 139098, 139569, 139937, 142292, 145440, 144511, 141121, 139513, 138728, 138996, 139405, 140602, 139593, 139560, 138028, 138245, 141151, 139364, 133033, 125946, 123652, 128417, 134268, 137402, 136624, 136513, 137306, 140643, 142215, 139351, 140142, 138678, 136420, 138280, 140277, 144572, 143696, 140076, 135437, 137496, 139266, 140509, 142163, 144957, 145593, 145510, 150111, 148370, 141866, 138630, 139748, 137676, 137314, 138910, 137042, 141252, 147717, 145764, 147563, 150071, 147332, 144913, 145343, 143420, 144537, 147205, 150514, 149780, 146817, 148983, 151761, 154776]
8668A54776l295J203m7j347l284k552m754K311J973J489j278k3M347K968J643
8653A54130J18q23N89L373N567M309L283k068n194k345j674q886l658L036M225
8638A53982k071l729J400J692Q02J435J361M796M572J943o288k484j546M42k483
8623A53824L965M362K624N135m91k422q35M5O39N65R90N772J231M022q29J992
8607A80589N139N154M182Q68M56L347K017J397M601j05K065P309Q144P999J1203
8592B44365J6715K0114K3168L1903M2532N3891O5153O7877Q4919J00574J01153
8581H52364Q6187N8073K4596L445j3561n0597r6878j27610j22375r4555o4127
8570D54962m8900l9445k6959k1265j7236j2549j1048m390l797o511J969K680J332
$$ y = [154776, 151481, 152684, 152637, 151290, 148006, 145454, 140700, 143011, 144984, 146473, 145195, 145172, 149519, 152487, 154130, 154248, 153425, 154014, 157387, 162954, 167263, 170546, 168478, 163284, 160939, 159265, 150379, 146721, 149757, 153982, 151911, 148182, 149582, 151274, 152076, 153511, 154872, 159668, 164240, 166183, 159895, 157411, 155865, 156307, 153824, 157789, 162151, 164775, 169910, 169419, 166997, 166162, 166207, 166846, 167411, 168401, 174173, 175404, 179426, 178597, 180589, 185728, 190882, 195064, 195932, 196388, 199735, 201752, 203149, 207750, 207645, 209710, 217019, 225163, 233162, 244365, 261080, 281194, 304362, 336265, 378797, 432688, 497841, 565718, 650637, 751211, 852364, 938551, 996624, 1021220, 1024665, 1011104, 960507, 863629, 736019, 613644, 519089, 454962, 406062, 366617, 339658, 318393, 301157, 288608, 277560, 273170, 269373, 262862, 264831, 267511, 268843]
8557B68843J596k816R5M194J119O084O539M721M602O306N087J0625J6603K4857
8543C58455L4963L9657N1745Q1164J15680J44363J80235J63920J24593R4666P9050
8532A468491O6911J5541r3718k02597k39977j97582j32212q8788o3397m1241k7201
8521D64230j4289q792L26L08R76M779J1811J1493J3824J7001J9692K1656K3484
8508E66499K1613J9710K6539K2204K2741J9799Q113r17m300j0211j3775j6083
8496F61932k5589j7086R781K6477M8083O0959N8752N5319M1539K9855K3284p316
8484I65990n9402j07402j29594j09263q0756o3060m3703k6398k0113j5588j3486
8473B97225m773j335j345q766n577j410P69j851k516n228p627m246p832q859l629
$$ y = [268843, 270439, 267623, 267718, 271912, 273031, 279115, 285654, 290375, 294977, 301283, 306370, 316995, 333598, 358455, 393418, 433075, 484820, 565984, 681664, 826027, 1006262, 1170182, 1294775, 1389441, 1468491, 1535402, 1550943, 1457225, 1254628, 1014651, 817069, 684857, 596069, 532672, 491431, 464230, 449941, 441149, 441475, 441783, 442759, 447538, 459349, 470842, 484666, 501667, 521359, 543015, 566499, 588112, 607822, 634361, 656565, 679306, 699105, 707218, 706301, 702001, 691790, 678015, 661932, 636343, 619257, 629038, 655515, 703598, 764557, 823309, 878628, 920167, 950022, 973306, 965990, 906588, 799186, 669592, 560329, 479573, 416513, 372810, 346412, 326299, 310711, 297225, 292452, 291117, 289772, 281006, 275429, 274019, 274788, 272937, 270421, 265193, 257566, 253320, 245488, 236629, 233000]
8458B33000o095k032J66k322j819l614l920m988j793J09l716J885P652P407N744
8443B25664P002n22J409L940j802n01r343p760o87j177R28J1420J7383K9100M4784
8428C19838O9242Q1162N4680K8917L2712M2181L7790l312j03045j32925r1448
8417C35792n7282k9820j9193j7441j0682q846j2128q011J352l162p465K732O373
8404A72219m831k813l425O15L680K905J681l872L481O542Q933J6502K0156K9207
8390B50980M9054P6755P6245M9464K7883L0030L7658L1665l2065j17542j22799
8379C57328p9171m6908l0993k2527j1841l912k116p841o487j115m71k555j117
8366A40274k869p573n146J144K914n808j618L003O046K557J246k413J651M266
$$ y = [233000, 226905, 224873, 225039, 222717, 220898, 217284, 213364, 208376, 206583, 206692, 202976, 204861, 212513, 219920, 225664, 232666, 232144, 233553, 237493, 235691, 235190, 225847, 218087, 217400, 216223, 217151, 228571, 245954, 275054, 319838, 389080, 470242, 524922, 553839, 586551, 628732, 666522, 663210, 560165, 427240, 335792, 278510, 248690, 229497, 212056, 201374, 192528, 180400, 172389, 173741, 170579, 163114, 165846, 172219, 167388, 164575, 161150, 161765, 165445, 168350, 170031, 166159, 169640, 176182, 185115, 201617, 221773, 250980, 300034, 376789, 453034, 502498, 530381, 560411, 598069, 629734, 597669, 480127, 357328, 278157, 231249, 200256, 177729, 165888, 161976, 159860, 152019, 145532, 144417, 143946, 141391, 140274, 137405, 129832, 124686, 125830, 128744, 122936, 121318, 124321, 130367, 132924, 134170, 131757, 133408, 137674]
8352A37674O997N216L443N943J2530J845k976O347L855m73j4006j5694q299R42
8338A43344k763l055j858q990o120M78O120M917J084L007j313l335m132o98p42
8323A25944l073k669K021O444K926L071j059L850J681J399L115Q092N765P671
8309A65178N710J259k541L512N619L570o97j2902j4700q297m924j703l6j579J431
8294A38900m645k066J318J946n476l941j284K317K244l220o939J337N897M472
8280A30860J292m847n527j599K768O395J0538J0127Q229J2091J3147P554M417
8267A95445O633L649n769r266q129p667j0547j0548q973o578l388o154J757r96
8253A29469k576n308k636N001N833R579P683J569l933K558L159j163l190m322
$$ y = [137674, 144671, 149887, 153330, 159273, 171803, 173648, 170672, 177019, 180874, 180401, 166395, 150701, 142402, 143344, 140581, 137526, 135668, 126678, 120558, 121036, 127156, 132073, 133157, 136164, 134851, 131516, 127384, 126686, 125944, 122871, 120202, 122223, 128667, 131593, 134664, 133605, 137455, 139136, 140535, 143650, 151742, 157507, 165178, 170888, 172147, 169606, 173118, 178737, 182307, 181610, 168708, 154008, 145711, 140787, 139084, 139048, 137469, 138900, 134255, 132189, 133507, 135453, 129977, 126036, 124752, 127069, 129313, 126093, 119154, 120491, 126388, 130860, 132152, 127305, 121778, 120179, 122947, 129342, 139880, 150007, 158236, 170327, 183474, 191028, 195445, 202078, 205727, 199958, 190692, 182563, 174896, 164349, 153801, 144828, 138250, 134862, 128708, 130465, 129469, 126893, 121585, 118949, 123950, 129783, 139362, 147045, 148614, 144681, 147239, 150398, 149235, 146045, 141723]
8239A41723j882n43n61M86L600Q44L711j872n581k958K651M385N82M004Q689J71
8223A57449j558j601k474j928j224o605o785n949m640o449N27n79m326l480N287
8208A15665O645j52L999N651l205J833j871m365k785o713m660k51l934j417K596
8193A07036l211l140j959j873J306j661L341J601j349L283J635j395j74K88J79
8178A03907k093j242j499k714k234p09r69n492j034q314l314K114P89J024j753
8163G6467k063o44j759M80n198n562L667L525K055l15r64m14n20k037q07n68N40
8146F5883q93J764q30J833K38m100k472j053K217M321k628k814N549n27O533m71
8130G2550l885k241J061j679N334K315J05n259L38n355n309m361L634K562p43
$$ y = [141723, 139841, 139298, 138737, 139223, 142823, 143667, 147378, 145506, 139925, 136967, 139618, 144003, 144585, 148589, 157278, 157449, 155891, 154290, 151816, 149888, 148664, 142059, 135274, 129325, 124685, 118236, 118763, 118184, 113858, 110378, 115665, 122310, 122158, 126157, 131808, 128603, 130436, 128565, 124200, 121415, 114702, 110042, 109791, 105857, 104440, 107036, 103825, 100685, 98726, 96853, 98159, 96498, 99839, 101440, 100091, 103374, 105009, 103614, 103440, 103728, 103907, 101814, 100572, 99073, 96359, 94125, 93416, 92447, 86955, 85921, 77607, 74293, 76407, 77196, 78220, 76467, 74404, 73760, 72001, 72481, 67283, 61721, 65388, 68913, 70968, 70653, 69689, 69275, 68755, 66718, 65911, 65343, 65883, 64990, 66754, 65924, 67757, 67995, 63895, 61423, 60370, 62587, 66908, 64280, 61466, 67015, 66488, 73021, 72550, 68665, 66424, 67485, 65806, 71140, 73455, 73560, 68301, 68639, 63284, 57975, 53614, 57248, 59810, 59067]
8115E9067J353j196K16J967k992J302k720J449O662M27l894k408J48p109J78K269
8099E4719N190r87j810J068Q59M393N22o269p234k172J107K089K786j531n82p18
8083E1430L218J206O303J975l333m349L02p84p9M43J806p330k592J034r49R22
8067D9223M661N215l731k8k145O91k365N540J123K941K499l127j515k81m502j210
8051E2989k834M477K285m932k95L911j655K348J398j80k425O978P281l516p229
8036E8601l382k77l986O027O706L914k35r05K028J181M20K637l571l825k706K508
8020F5135L657k983k607j304n959l391o08J864N763j634j547K219l890k671m940
8005D7104k802M464J783K068N153l505j024M446N624K145j188K243P161P0p150
$$ y = [59067, 60420, 59224, 59440, 61407, 58415, 59717, 56997, 58446, 65108, 65535, 61641, 59233, 59381, 52272, 52450, 54719, 59909, 58922, 57112, 58180, 59039, 63432, 63954, 57685, 50451, 48279, 49386, 51475, 54261, 52730, 52148, 51430, 54648, 55854, 62157, 64132, 60799, 56450, 56752, 55968, 55889, 56332, 58138, 50808, 48216, 49250, 48301, 49223, 53884, 59099, 55368, 55340, 53195, 53886, 51521, 57061, 58184, 61125, 63624, 60497, 58982, 58701, 54199, 52989, 50155, 54632, 56917, 51985, 51690, 55601, 53946, 56294, 57692, 57512, 55087, 62065, 69346, 65830, 58601, 55219, 54942, 50956, 56983, 63689, 67603, 67368, 66463, 68491, 69672, 70092, 72729, 69158, 65333, 62627, 65135, 68792, 65809, 63202, 61898, 55939, 52548, 51940, 53804, 59567, 57933, 56386, 58605, 54715, 52044, 47104, 44302, 48766, 50549, 52617, 57770, 54265, 53241, 57687, 63311, 65456, 64268, 66511, 73672, 73742, 66592]
7990F6592l588L095M925K52k557K969Q163N257L540J196L928J430N199O415L586
7975A10402k038n811p622q66q713p742m349k983J745K909k516O98O902N475N784
7960I1275J632K314j797L33J70M458J968m751J578J00L276J891j900k421r30N687
7944A02883L837k057k730l92J0121Q637M987M338K998k404J050k461l904m984
7930A19919k558j997k817k200k392J398M988K090K93K37k756J372Q503P694M974
7915A36748J533L114L99K346N532j654N159M631O74J573J919J62l767l440o771
7900A48158j842J288o290p073q152j0875q821P00K270N0k735m216M180N951O40
7885A13233j009n944m372K874N906n0l22K09N75m186K149P436O092J078p11N332
$$ y = [66592, 63004, 66099, 71024, 71276, 68719, 71688, 79851, 85108, 88648, 89844, 93772, 95202, 100401, 106816, 110402, 108364, 102553, 94931, 94065, 85352, 77610, 73261, 70278, 72023, 74932, 72416, 73114, 80016, 85491, 91275, 92907, 95221, 93424, 93757, 93927, 98385, 100353, 95602, 97180, 97280, 100556, 102447, 100547, 98126, 97196, 102883, 106720, 104663, 101933, 101541, 111662, 120299, 125286, 129624, 132622, 130218, 131268, 128807, 124903, 119919, 117361, 115364, 112547, 110347, 107955, 109353, 114341, 116431, 116724, 116961, 114205, 115577, 124080, 131774, 136748, 138281, 141395, 141794, 144140, 149672, 148018, 153177, 157808, 158482, 160055, 161974, 162136, 158369, 154929, 148158, 146316, 147604, 141314, 134241, 126089, 115214, 106393, 107093, 109363, 109413, 106678, 102462, 106642, 112593, 113233, 112224, 106280, 101908, 104782, 110688, 110638, 110316, 110525, 111100, 106914, 109063, 116499, 122591, 123669, 122958, 128290]
7869A28290n59K513P42j314J41M023J834K119K903o242k860l140k273l551j0732
7854A11894n245J980n305q773q230m088k749N136k174k945L654j536Q20L527M951
7839I0917k90j710n798m702j499k22l288J185O280J088j131J03j536j948Q00K810
7823H1059j102l771L35n065J664M56j134m126m794o530k078l214l99j786k888
7808D6627k547L220M129J654L87R76m990l708j554l457L848k58n196j490K373
7793D0014n9M015j97N101K772j925k109n459n836N16j128Q56o4n507J75L564K362
7776C7091l565l819R84L31o207k54P853M702l351o867l566l374R64n44m20r20
7760A9038K083J679R16J722K871K963m34J958k526n025J26k897l565o75j545l079
$$ y = [128290, 127731, 130244, 130986, 129672, 129813, 133836, 135670, 137789, 140692, 134450, 131590, 128450, 126177, 122626, 111894, 106649, 108629, 103324, 94551, 86321, 82233, 79484, 84620, 82446, 79501, 83155, 81619, 82439, 85966, 90917, 90627, 88917, 83119, 78417, 76918, 76696, 73408, 74593, 80873, 81961, 80830, 80933, 79397, 77449, 78249, 81059, 79957, 76186, 76521, 71456, 73120, 73576, 72442, 68316, 63522, 56992, 54914, 51700, 51301, 49515, 46627, 44080, 47300, 51429, 53083, 53470, 54446, 49456, 45748, 44194, 40737, 44585, 44327, 39131, 37641, 40014, 39955, 43970, 43773, 48874, 51646, 49721, 47612, 42153, 36317, 36833, 35705, 36561, 36497, 30990, 31165, 34729, 37091, 33526, 29707, 30691, 31022, 24815, 24561, 32414, 37116, 33765, 26898, 23332, 19958, 20922, 20378, 19958, 19038, 21121, 22800, 23716, 25438, 28309, 31272, 30838, 32796, 30270, 25245, 25371, 22474, 18909, 18234, 16689, 13610]
7744A3610j659p54K091K460n149j265K270K943M381P87m245J964j802j966P1n17
7728A3220j41K846M42K823J240K480M523m431o143j935Q36Q56J613Q51K365r32
7712B0513l074q37J7J128L99J63K790Q06k932Q27K656l823J462l355m057J84J196
7695A4063r31l975K46L24K494L90l052n80O29K971r74k133j111M65j017m761L026
7678F074R80l029q35Q2J679M379L487k898k510o47L146L932J894Q3j102l821j499
7661I395J438k027j70N675q03o412j076O84J94o32J395O971J289m324k946J254
7645I905j137P62L378n11j864m266m300K70M061j326K941j729k549l341J122M127
7629E543J673m290K093P408N29l753k915J014P90J064M516J33n523k336K80J039
$$ y = [13610, 11951, 11197, 13288, 15748, 10599, 9334, 11604, 14547, 18928, 19715, 15470, 17434, 15632, 13666, 13737, 13220, 13079, 15925, 16367, 19190, 20430, 22910, 27433, 23002, 16859, 14924, 15760, 16616, 18229, 19080, 21445, 20513, 17439, 16602, 16619, 17747, 18146, 18309, 21099, 21905, 18973, 19800, 22456, 18633, 20095, 16740, 12683, 12867, 14063, 13132, 9157, 9403, 9727, 12221, 12611, 9559, 8979, 9608, 12579, 11605, 9472, 8361, 8826, 7809, 3048, 6074, 7054, 4025, 3190, 3272, 4951, 9330, 12817, 9919, 7409, 6762, 9908, 13840, 15734, 15817, 14715, 10894, 9395, 10833, 8806, 8636, 14311, 13508, 7096, 6020, 6704, 6898, 6266, 7661, 14632, 15921, 11597, 8651, 9905, 8768, 9530, 12908, 12397, 10533, 6267, 1967, 2237, 6298, 4972, 7913, 6184, 3635, 294, 1416, 5543, 7216, 2926, 5019, 12427, 12956, 9203, 6288, 7302, 8092, 9156, 13672, 13805, 8282, 5946, 6226, 7265]
7613G265J012J419J006O352o402n541M98l808k507j400K299L359k839m241M676
7598A148L036p272k871k133N231O391l363l688O174N492J816o713k402M053L659
7583H558j441m95k222M228m23k105l076O85k963j02O372L020L29j629n016j216
7567B504M648O55J951J638o603m222J484K343N981k171L405n223P25L283P61k057
7551I102j942M023k74n866m719l071K621j789k001R52N858J123K730m64p650O13
7535g54K301Q982J429l087K048l327R49j234k265M59l273j283j437J102l47j453
7519a190m54K603N630l138l086m585M244L085K963J321k156l663j815J818o00
7504I77k516j24J176l474k962K896M625j310L283M102j58j339k743k620L663M47
$$ y = [7265, 8277, 9696, 10702, 17054, 10652, 5111, 5609, 1801, -706, -2106, 193, 3552, 713, -3528, 1148, 4184, -3088, -5959, -8092, -2861, 3530, 167, -3521, 2653, 8145, 9961, 3248, 846, 4899, 8558, 7117, 6622, 4400, 8628, 8205, 6100, 3024, 3709, 746, 644, 7016, 10036, 10365, 8736, 3720, 2504, 7152, 7807, 9758, 11396, 4793, 571, 2055, 4398, 10379, 8208, 11613, 6390, 7115, 10398, 11159, 9102, 7160, 11183, 10909, 5043, 324, -2747, -126, -1915, -3916, -2964, 2894, 4017, 6747, 6283, -1367, -754, 1547, 10529, 11958, 8871, 10919, 7592, 8541, 7307, 5042, 5501, 2228, 945, -492, 610, 263, -1190, -1644, 959, 6589, 3451, 365, -4220, 24, 3109, 6072, 7393, 5237, 1574, -241, 1577, 977, -1539, -1663, -487, -3961, -6923, -4027, 598, -712, 2571, 6673, 6515, 5176, 2433, -187, 3476, 3923]
7488C923m379j199R55M822l836q32p2j181L339M499K587l914k752L334K496J25
7472G915K40N56k303j293o86l206m216J02j207J35M384O15P45K973k15j557m331
7455a349k709j943k821J417R69L698p58j071j569k42J222r37kJ448Q114L907J976
7438I350K566p69k104l302L097K655k612k987j069k268j59M710O37k571P14l42
7422E546k419M6l762J49n37k648L167O047m407k922N629N297l597m615p53M640
7406D861k477j077L92J526l662k392q28m318n217L58L673O395M663J500m566M50
7390g19J436l163j277k233k963j582J256M333m427N255K294L152k97l816m592
7375g343K90N790P36q83K570L24k111l247P1J093k10k828L949K503J447J128L032
$$ y = [3923, -456, -1655, -700, 4122, 286, -546, -618, -1799, 1540, 6039, 8626, 4712, 1960, 5294, 7790, 7915, 8155, 8711, 6408, 5115, 4429, 1223, -2993, -2891, -4098, -3963, 421, 1036, 1781, 4754, 4539, 2982, -1349, -4058, -6001, -8822, -7405, -6436, -2738, -3496, -4567, -6136, -6378, -5156, -6093, -6095, -4647, 3467, 7374, 9350, 11916, 11147, 9043, 5741, 8838, 11493, 8881, 5894, 4825, 2557, 2398, 7108, 7745, 5174, 5888, 5546, 3127, 3173, -589, -440, -977, -3625, -458, 5589, 1182, -1740, 3889, 9186, 5589, 974, 221, 4861, 2384, 1307, 1699, 3225, -437, -2829, -3657, -7975, -13192, -12834, -9161, -2766, 1897, 3397, -1169, -719, 717, -2446, -3723, -5956, -8919, -10501, -9245, -4912, -9339, -4084, -1790, 1362, 1065, -2751, -7343, -7053, -1263, -527, -1410, 1160, 1484, -627, -3874, -3803, -2710, -2920, -5748, -1799, 704, 2151, 3279, 6311]
7358F311N76j136n464l457N986j43k717M62K280L141P64n30j479l292k682n50
7342a930K347l725l059J914Q091J130j742k805n308m768K046L661L956P2L218
7327C098J336m852n891K480k072j174K668P930M240O51j646l769N755l704l185
7312A865j614m036j333J961J0425N445q89o663o456N93K614R36M277J73l942n350
7296a994J60J099l225n98L034j648K28l35j208o082K100N865N322L363j152l688
7280A241p21l12L261j818O23M47J774O969o610k160o6o27M69j360l75m51n386
7263e102k092K596K967J868J636l302J388L247j03k761N25n40N653N008L83p388
7247C983q682j301n30M310L19L49O417m221k700R06j761J753P61L013J312k854
$$ y = [6311, 6887, 5751, 287, -3170, 2816, 2673, -44, 418, 2698, 5839, 6603, 6073, 4594, 1302, -1380, -1930, 417, -3308, -6367, -4453, 3638, 4768, 3026, 221, -5087, -9855, -7809, -4148, -192, -120, 3098, 4434, -418, -6309, -3829, -5901, -7075, -4407, 3523, 7763, 8414, 6768, 2999, 8754, 5050, 1865, 251, -3785, -5118, -3157, 7268, 12713, 11824, 5161, -1295, -702, 1912, 2848, 7125, 7298, 3356, -1994, -1834, -735, -3960, -4558, -1524, -3172, -2944, -3279, -4487, -10569, -8469, -2604, 2718, 6081, 4929, 1241, 520, 208, 3469, 1651, 2274, 2721, 4495, 11464, 4854, 2694, 2628, 2001, 2470, 1110, 735, 284, -5102, -7194, -4598, -1631, 237, 1873, -1429, -41, 3206, 3103, 342, 867, 327, 5980, 10988, 11371, 3983, -4699, -6000, -6530, -2220, -1901, -1552, 4865, 644, -2056, -1150, -2911, -1158, -397, 2616, 3928, 1074]
7231A074p997N99K524j23j917k149J419J27R06N397J403J500l203R32N308j134
7215D666k064j128j958k58O2J297L682J213L60n901p850m85M59M182L355O72k617
7198b313l338l864N011M057J385K497j057P67K278K17k264j993m503m096K493
7183d723M11l65K808k908n948K78L698K721k504j965J700l51J163N787O63J435
7167A900j041o09m495k566L45R95k876j356N840K846k464j886N817K391o774l516
7151g449n3m30r32M745L9P17J719L700K22K348M556n993n666J328O13M94L842
7134C800o359k505J977P44Q95M942K626j626l516L083m985n315J822k409J348
7119e478M491K058k685j581L277J026l706n971K997K580n88N879J07j20j467p752
$$ y = [1074, -6923, -6324, -3800, -3923, -5840, -7989, -6570, -6443, -5537, -140, 1263, 2763, -440, 492, 5800, 4666, 2602, 1474, -484, -742, -680, 617, 4299, 5512, 5872, -29, -7879, -8364, -7905, -3723, -368, 304, -2313, -5651, -9515, -4504, -447, 938, 3435, 2378, 3145, 5423, 5640, 3376, 1383, -3120, -7216, -4723, -4312, -4677, -1869, -4777, -10725, -10447, -6749, -4028, -6532, -8497, -6797, -7148, -5985, -198, 465, 1900, 859, 250, -4245, -6811, -6466, -5471, -8347, -9703, -3863, -1017, -3481, -5367, 450, 2841, -3933, -7449, -7502, -7932, -8864, -4119, -4080, -3363, -1644, 2056, 2278, 4626, 9182, 3189, -2477, -1149, -536, -42, 3800, -2559, -5064, -3087, -2343, -1448, 3494, 6120, 4494, 978, 4061, -924, -6239, -4417, -6826, -5478, -987, 1071, -1614, -3195, 82, 1108, -2598, -8569, -5572, -2992, -3580, 2299, 2406, 2286, 819, -6933]
7103f933J330Q304N908P05k429j78m507q530o738k378N58J918N394j062k153K422
7087h369N81J124N809L025l429m726R31J135J753l78k376J633Q72K46R90M053
7071B874Kj921q91k10j199n993J598J880L221J047K799M902j252m137J406k518
7055A608j616r69k438J82o23N801P86n166n711k716k88P469M225L90k837P77K047
7038I21k864j87J526R98k585j941M521M272j383J908j877o405j331k194j19L074
7022c666K30J75p73l744R12L18P089N742m862n709J342j208j341K001j414J800
7006c108L97l14m5l59J19L55q01j760j439O385K527J94k120l025N99q77n514j689
6988a0475M999o80q84N068J63k311j657J633L134r19m375k976K487K861l932j317
$$ y = [-6933, -5603, 2701, 8609, 9314, 6885, 6707, 2200, -6330, -13068, -15446, -14888, -12970, -7576, -8638, -10791, -8369, -7788, -6664, -855, 2170, -1259, -5985, -5054, -3919, -2166, -2544, -4920, -3287, -2415, -2169, -1179, 2874, 2876, 955, 64, -146, -1345, -7338, -5740, -3860, -639, 408, 3207, 8109, 6857, 2720, 4126, 1608, -8, -977, -3415, -3233, -3856, 1945, 2731, -2435, -8146, -10862, -11150, -3681, 544, 934, -1903, -1126, 921, -1943, -2130, -604, 394, -2191, -4132, 389, 4661, 3278, 5186, 3309, -3096, -4427, -6621, -6740, -3666, -3436, -3261, -4034, -7778, -6866, -6548, 541, 6283, 1421, -4288, -2946, -4154, -5495, -3494, -4908, -3108, -2711, -3025, -3070, -3429, -3310, -2955, -3756, -5516, -6955, -570, 1957, 2151, 31, -2994, -2395, -3272, -8786, -10475, -5476, -6156, -7040, -1972, -1809, -4120, -5777, -4144, -1010, -1929, -6304, -9280, -6793, -3932, -7864, -9181]
6972i181L097O62L443L391K202k293j905l7J350L132K504N62L45n996o689m285
6956i698K253P754j862p140p427j054K916L223M010J772P46j297m20j473j904
6941i601P86M600l604k355J406L764J978r93M810K337m678o793p076K359P232
6926e828K092n77J014J119L636L837k807k966J127m102J167o633l65K914N101
6911a271J365j148J209K16m439J288M92K430M973k307l590J732K418O226k043
6896G551n080j370q55M425N95m486p484j364K288n75j733Q2j878k03K664N146
6880b277K448n942n883K107J307J339k834m8N095K311J971j620k127L448N127
6865D422K051o34m481R6j94M60J926j583k089J505L621p848r33L242p440n670
$$ y = [-9181, -6084, -5422, -1979, 1412, 3614, 1321, -584, -621, 729, 3861, 6365, 6927, 7272, 1276, -5413, -9698, -7445, 309, -1553, -8693, -16120, -17174, -14258, -11035, -7025, -5253, -4507, -5804, -6224, -7697, -9601, -8815, -4215, -7819, -10174, -8768, -5004, -3026, -4019, 791, 3128, -1550, -8343, -15419, -13060, -5828, -3736, -4313, -3299, -2180, 1456, 5293, 2486, -480, 647, -3455, -2288, -8921, -9286, -6372, -1271, 94, -1054, 155, 371, -4068, -2780, -2288, 142, 5115, 2808, -782, 950, 3368, 9594, 7551, 2471, 1101, 246, 4671, 5266, 780, -6704, -8068, -5780, -6355, -8088, -8006, -9884, -10087, -7423, -2277, 171, -5771, -11654, -9547, -8240, -6901, -9735, -9783, -4688, -2377, -406, -2026, -4153, -705, 4422, 6473, 5839, 1358, 1454, 1260, 1720, 3646, 2063, -26, 1479, 5100, -2748, -3681, -439, -7879, -13549]
6849a3549L732j081l093K781N431L532j678J917r78q30m65l492k922J254N285
6834d156n08k12k915P28K739K919j275M42q17Q39O99K876L673k767l254k671L318
6817c42M821R42m236n815j60L405L039k776l137J15O225P96n390l59k305M92L785
6800i00k99j605M274k085j2152j562J0355P532j458k573j599J111o25K366l339
6785b559P37K580J739j372L661J49l065J671l526o310M48Q43j274r01R208J522
6769C551k869m408m385N690L392l113j483M022J869j316k589p23J802L71K641
6754B452N321m656o794m068L158K358J054l07L75K354j758l877m43R63K562J660
6738C54L630N940L52J284n66K119Q816l56J045k162m571n842k440l557l076K745
$$ y = [-13549, -9817, -10898, -13991, -11210, -5779, -2247, -3925, -2008, -2986, -3816, -4281, -7773, -10695, -9441, -4156, -4664, -4876, -7791, -7063, -4324, -1405, -2680, -2238, -3055, -2216, -1517, 1359, 5032, 2265, -989, -3660, -342, 4479, 5421, 1185, -4630, -4790, -1385, 1654, -1122, -4259, -4144, 2081, 2877, -2513, -2872, -5177, -4685, -900, -1199, -2804, 1470, -615, -12767, -14329, -3974, 3558, 2100, -473, -2072, -961, -1586, 780, -2559, -1822, 758, 2497, 1125, 4786, 4935, 1870, 3541, 15, -6295, -5847, -5004, -6278, -7179, 2029, 3551, 682, -3726, -8111, -2421, 971, -2142, -3625, 397, 2266, 950, -1639, -2362, -560, -189, 2452, 7773, 3117, -3677, -7745, -4587, -2229, -1175, -1482, -1107, 1247, -511, -4388, -4831, -3868, -1306, 354, 3984, 9924, 10276, 11560, 10994, 13113, 21929, 21573, 22618, 20456, 15885, 10043, 7603, 4046, 970, 3715]
6722C715N43Q6J269J091O02J749j658l364N818N209j661P61N667k91m139n445
6706I952j886N541k079l637j13J595K848J944K708K793k372M879O676k465K258
6691B8642L616M78M377L391O630R120N917N289N474K383P790K719j797k813J964
6676H3180j54N078N795Q858K1142J8403K7957M1444N5870R0299J42289K07526
6664G07687K57698K28789J50936J08202J05116J14661N8084j45514l59641l65492
6654H60526k55879j56524j01465p2899n3627m0528l0679k3288j5383n496r169
6643I5589p773n567R4J625Q47K95k04j231l73k472n407j2611j2398n626o424m026
6627C4338n37r69n271k633l348k889K987m13K717j904N22p92L068K958p18o4J852
$$ y = [3715, 4258, 4344, 5613, 6704, 7306, 9055, 7397, 4033, 9851, 15060, 13399, 14160, 19827, 19536, 15397, 9952, 8066, 13607, 11528, 7891, 7778, 9373, 12221, 14165, 16873, 19666, 17294, 22173, 28849, 26384, 28642, 32258, 32736, 37113, 40504, 47134, 56254, 62171, 67460, 72934, 75317, 83107, 85826, 84029, 81216, 83180, 83026, 88104, 93899, 102757, 123899, 142302, 170259, 211703, 267573, 357872, 500161, 707687, 965385, 1194174, 1345110, 1453312, 1558428, 1673089, 1731173, 1585659, 1226018, 860526, 604647, 448123, 346658, 273759, 220132, 179604, 148925, 125637, 110254, 104758, 95589, 87816, 82249, 82343, 83968, 84815, 85110, 84906, 83675, 83302, 80830, 75423, 62812, 50414, 44788, 38364, 34338, 33801, 32832, 27561, 24928, 21580, 18691, 21678, 21265, 23982, 22078, 22600, 21808, 24876, 27834, 27116, 27052, 28904]
6610B8904j341k277j005m115p372r772j123j832L988M351j5j666n188k852R6K10
6594a009k93M597L298j435O12J748q208l098m607J834J870K815L111K811K364
6579F410K371l997l122J126k178N66o36m811P52L408J532m827m574j171j895K445
6563h601J841L497K918L504j01k617k095K72p51n38p41L923L635j949j38K106
6547D165o56k47K079L586n936k901J220J23j820n590m577K524K198L106J829L143
6531B246j168n532k97J811L409l565k972o18J176K475O62m105L963j210J619l70
6515b476M00K450R94o333l346OO885K039k654k274m483J357K529L803L002l721
6499a822k547K47K215j105k86M33M498J674L503j37q865l011L369l953j934J164
$$ y = [28904, 27563, 25286, 24281, 20166, 12794, 3022, 1899, 67, 4055, 8406, 8391, 6725, 1537, -1315, -1219, -1009, -1302, 3295, 6593, 5158, 5770, 7518, -690, -3788, -8395, -6561, -4691, -1876, 1235, 4046, 6410, 8781, 4784, 1662, 2788, 610, 1176, 540, -4271, -3519, -111, 1421, -3406, -7980, -9151, -11046, -8601, -6760, -3263, -345, 3159, 3058, 441, -1654, -1382, -2133, -2671, -3412, 511, 4146, 2197, 2059, 4165, 3509, 3262, 5341, 8927, 2991, 90, 1310, 1433, -387, -5977, -10554, -8030, -5832, -2726, -897, 2246, 1078, -4454, -4751, -2940, 469, -3096, -6068, -6686, -5510, -3035, -2373, -6478, -2515, -3725, -2106, -2476, -2076, 374, 1368, -4965, -8311, -8305, -1420, 619, -2035, -4309, -8792, -7435, -4906, -1103, 1899, -1822, -4369, -4122, -1907, -3012, -3298, -2865, 1633, 3307, 6810, 6673, -2192, -5203, -1834, -5787, -7721, -6557]
6483f557l872R22K905N039m37J146K157J965P21j006m244K600L280k717k124j064
6467a286j009k728K79J477P55o54j047N70j531k566m673L827M182N387J649m878
6451b246k541K183j817j991M005K142K638K253j456p608K05M013O25k198l520
6436e313J301M739j715p224m37Q22j732q8L479J04j723l784J63M518l44K077k245
6419g402k7J098l394J252m191R9L774M07L858m5M88q68J163P24M75L069K671K54
6401C405k992P21k361l39k76J909P75l400k373j615l432j51L651J596O090K838
6385D046j930K6K17j755k602j589j956k482k31J398K525M206J547o25j701P21
6369a85m56R7Q08n196k577J05L158J464K220j813K53K354O267m811o228l148k777
$$ y = [-6557, -10429, -9507, -6602, -1563, -2000, -854, 1303, 3268, 3989, 2983, -1261, 1339, 4619, 1902, -222, -1286, -2295, -5023, -4744, -3267, -2512, -3166, -4213, -3643, -5174, -7740, -12413, -8586, -4404, 983, 2632, -2246, -4787, -2604, -4421, -6412, -2407, -265, 2373, 4626, 3170, -4438, -4233, -220, 405, -1793, -5313, -4012, 727, -988, -8212, -8649, -7827, -9559, -9647, -6168, -6064, -7787, -11571, -11408, -6890, -7234, -5157, -7402, -7429, -6331, -9725, -8473, -12664, -12565, -8791, -8384, -4526, -4571, -4083, -4951, -3788, -3064, -2589, 480, 3151, 3405, 413, 1134, -1227, -1566, -1842, 67, 842, -2558, -4931, -6546, -9978, -10129, -6478, -4882, 1208, 4046, 2116, 2142, 2359, 604, -1998, -3587, -5543, -8025, -8256, -6858, -4333, -127, 1420, 795, -906, -185, -641, -544, 264, -4932, -7509, -7404, -4246, -2782, -562, -2375, -2122, 232, 6499, 1688, -4540, -7688, -10465]
6352a0465m20L242p11K081M074J672q44M360J256l239k521J507l810l295L773
6337c340r5l903M59N908J242J860M155l756k804O93m224J236r33k623K349M216
6321D40O63O24J780q06l136P82m015l883N86N265J724l130l069M38l335j258j28
6304a0458K741N124J040k210j5K854L771k391m522k423N061M521m8k626q2k856
6288b519l948L549P10K66L704j195j740K944J537M335J936n171m935j307j909
6273c743q39K910M28r22J682L347M488j950m446m127J592N2Q73P93J436j262n369
6256e057J273M04K007N40l149n31O55R33J20N77j376k189N011k730m357L070M52
6239d347K947L825m384l905o738J89J505J415J55k381m114P277N410k79K209j542
$$ y = [-10465, -10885, -7643, -8354, -6273, -2199, -527, -1371, 2989, 4245, 1006, -1515, -8, -3818, -7113, -3340, -3435, -7338, -6879, -971, 271, 2131, 6286, 2530, -274, 419, -3805, -2569, -3502, -6125, -3776, 440, 1103, 1727, 3507, 2701, -435, 347, -3668, -7551, -6965, -1700, 24, -3106, -6175, -5737, -9072, -10330, -10458, -7717, -2593, -1553, -3763, -3778, -924, 2847, 456, -4066, -6489, -1428, 3093, 3045, 419, 337, -2519, -6467, -2918, -2208, -1942, 1762, 567, -1173, 1771, 3308, 7643, 9579, 4408, -527, -1834, -3743, -4582, -1672, -1244, -2166, -484, 2863, 7351, 5401, 955, -3172, -1580, -1528, -655, 138, 1574, 312, -5057, -3784, -3380, -1373, -833, -3982, -4513, -3858, -2925, -2805, -2228, -3604, -5793, -782, -3512, -7869, -4799, -4347, -1400, 2425, -1959, -5864, -12602, -12413, -10908, -9493, -9338, -11719, -15833, -8556, -3146, -3425, -1216, -2758]
6223b758k894K09m908j86L365k672M069O671j269p32P93R4Q50m528l803J052L708
6206b939P296k891q12l192K952K043J610K960K81O06K27J023m889k689m34n51
6190F01n019n501o412j325M806l49L951O480L62M21M73l201l349l74K838j730
6174g328K35n80J308J179J614M028K863j882m413M662O738k607Q77L509j421l578
6158E204q516k783j76j162J312J518K231p61K374M975m144N17P60l218j072L12
6142b629j485P08k526m60K433k638R16N80P14k832j890l157N35N27L766M383M664
6125A609L233R73l352n716k461q87j757j408o07J040K245L184p07o219j849L535
6109i144j051j620J520K414L241j764k491M782K219k468L438N21N078j572o028
$$ y = [-2758, -5652, -5443, -10351, -10537, -7172, -9844, -5775, 896, -373, -1105, -312, -218, 632, -3896, -7699, -6647, -2939, 4357, 1466, 654, -2538, 414, 2457, 4067, 7027, 7308, 7914, 8141, 9164, 4275, 1586, 1152, 601, -4418, -9919, -16331, -17656, -12850, -13199, -9248, -2768, -2406, -1985, -1512, -4713, -8062, -8436, -5598, -7328, -7093, -7673, -6365, -5186, -3572, 456, 3319, 1437, -2976, 1686, 8424, 5817, 6694, 10203, 8782, 5204, -3312, -6095, -6271, -7433, -6121, -4603, -2372, -3133, -759, 4216, 72, 589, 1349, -1869, -2941, -2629, -4114, -3406, -5932, -6392, -3959, -6597, -5681, -5101, -4387, -7219, -9109, -12266, -11731, -11204, -7438, -3055, 1609, 4842, 5815, 2463, -3253, -5714, -6601, -8358, -9766, -10373, -9333, -7088, -3904, -4611, -10830, -12679, -9144, -10195, -11815, -10295, -7881, -4640, -6404, -8895, -4113, -1894, -4362, -924, -403, 4675, 3103, -2925]
6094b925R83N747k426l619k46M104M514J982q865m928l48m600K415L123M86j227
6078e830L735J465r78l877N23j184o73L962N041p89k051l347P98k361o075M204
6062g437O698k413k314j127J900J037m515l274j83m02K789j140K267L763K172
6047b179n8l05k553l099k659j140q82J718l737J519J448N448M774K382j177j869
6031b369K506k730l397k220l329L832N614J370r90L720l23j296K357M43O23l72
6015C439k979p178M43K678J293M017l676n226k950K362J201L337N527P35n146
6000b123l048k99K642L042n447l095J032J65J329p19j717M13N49M359L077q5k25
5983a50j459k494j522k315K124N174M922k935l116L053L86n227J517J9j628O99
$$ y = [-2925, -1942, 3805, 1379, -2240, -2486, 1618, 6132, 8114, -751, -5679, -6027, -10627, -8212, -5089, -4603, -5830, -2095, -630, -1608, -5485, -4962, -6146, -6819, -2857, 2184, 1395, -656, -4003, -3205, -5566, -11641, -7437, -739, -3152, -5466, -6593, -4693, -3656, -8171, -11445, -11628, -12030, -9241, -10381, -8114, -4351, -2179, -2237, -2542, -5095, -8194, -10853, -11993, -12875, -11157, -14894, -13375, -11927, -6479, -1705, 677, -500, -2369, 137, -2593, -5990, -8210, -11539, -7707, -2093, -723, -1713, 2007, 1684, 388, 2745, 3188, 3811, 3439, 460, -6718, -6275, -3597, -2304, 1713, -1963, -7189, -10139, -7777, -6576, -3239, 2288, 3023, -2123, -5171, -5470, -2828, 214, -5233, -8328, -7296, -7131, -5802, -6521, -8238, -7825, -7276, -2917, 160, 75, -150, -1609, -4103, -5625, -7940, -5816, -642, 4280, 1345, -1771, 1282, 1668, -3559, -2042, -2023, -3651, -2952]
5967b952M493Q42q67J68K452j064K61J338l263p88m071m270J03J896K968M268
5951A514R88j71l296k89l674m227R03L733O39R40K680k493j358j481j635K360
5935d867Q712K157l592k310J823K192k292J588n265o121O51K373q18l408k130
5920a1307L060P229K36n840r51K244L543O13L481O106m287m806j228r84k551L521
5904a921M040l302J921J271r52j301j445o65L432n81j945J593K059k59R07n175
5888b323l031O69q96j585M267K734r61J091J162l275m761Q69j650J514J979Q20
5872c377N02q18J663L05J367p44m06p13K514J714L895O99k144j682j389l055L135
5855A466j260k049J530l211k592O57l435k16J144K431P982N205o027l481k584
$$ y = [-2952, 1541, 2383, 1516, 1684, 4136, 3072, 3333, 4671, 1408, 620, -3451, -7721, -7618, -5722, -2754, 1514, 2502, 2331, -965, -1254, -4928, -9155, -8252, -4519, -3880, -2940, -260, -2753, -4111, -5592, -7227, -4867, 3845, 6002, 2410, 100, 1923, 4115, 1823, 3411, -1854, -7975, -7324, -4951, -5769, -9177, -11307, -8247, -1018, -782, -6622, -7573, -5329, -1786, -1173, 2308, 8414, 4127, -679, -1907, -2891, -5442, -1921, 2119, -1183, 738, 2009, 1057, -244, -1689, -2354, 1078, 497, -1448, 145, 2204, 1945, 2852, -2323, -5354, -4685, -5581, -7166, -2899, -165, -1126, -35, 1127, -2148, -6909, -6040, -7690, -6176, -4197, -3377, -2875, -3693, -2030, -1725, -358, -1102, -1508, -2221, 293, 2007, 5902, 6601, 4457, 2775, 1386, -1669, 1466, 206, -1843, -313, -3524, -6116, -5459, -8894, -9110, -7966, -5535, 2447, 7652, 1625, -1856, -4440]
5840d440j09L937j742n147k324m376K172K598J442N574M904J255j216l448p79
5825a699L503J001N57K79q451m093N857K81j788k118Pj265J787N702N59n649l428
5808h958K297k860m877L389J779J797L207J185o18j84m88q36Q241r91q433l219
5792i569K930j249J475n94J619K594j788L110K39J58j650l490k769j783K001J647
5776g119L17o8M865J669k25l139L92p62K295L811L76m461Q16L520k206l102J859
5759a162l5K589K533m39L308K827k613p630k64j928r99K981J832K540j137k551
5743a48P52m807L834L490n887k226L240l021l799N611O553n910j428J554l5k624
5727d851M842k148k68K701J330j310K67K46l760n158L19L711k371k707J488O797
$$ y = [-4440, -4549, -612, -2354, -7501, -9825, -14201, -12029, -9431, -7989, -2415, 2489, 3744, 2528, -920, -1699, 1804, 2805, 3362, 3641, -4810, -8903, -3046, -2765, -4553, -6671, -6664, -7929, -6142, -440, 119, -5530, -8958, -6661, -9521, -14398, -11009, -9230, -7433, -4226, -3041, -3659, -3843, -4331, -5167, 3074, 2083, -6350, -9569, -6639, -7888, -6413, -7007, -5388, -2794, -4582, -1472, -1233, -1075, -2725, -6215, -8984, -10767, -8766, -7119, -6802, -6870, -2005, -336, -561, -3700, -3308, -4070, -1775, 2036, 2412, -2049, -1233, 2287, 81, -3021, -1162, -1197, 1392, 3925, 3486, 6794, 9621, 7008, -622, -886, -2814, -3813, -832, 1000, 3540, 2403, -148, 604, -4203, -369, 3121, -2766, -4992, -1752, -4773, -8572, -2961, 3592, -2318, -3746, -2192, -2227, -4851, -9, -2157, -2425, 276, 1606, 296, 563, 809, -2951, -8109, -7790, -4079, -6450, -9157, -7669, -872]
5711h72j906k852p11J288J464K246J51m439l990N535r85o935o54K336M21j193
5695a1096r83K53J64L492M102J743p91j617j268k456j11J912N06j987n83L626
5679e094O475k863k048j157k903l802j234P675M269J016m840o83K564r93R51L527
5663H60M309O56m09l038k417M580M605l123j691k777k380k756k932k075N216R051
5647E679n243j0322p88L164O268l43l520q60l412J034j772N852l81K557k247l131
5631g465o831L340P714M476j143J005n430k517J962K218K024l603j12K710L255
5616A603k921p327j997J551K062N620O836k268k5J651m975k547n881k888K37M832
5600f437J301K324J376j194p53O82K049k921Q44k551l151l076p83P90P77O254
$$ y = [-872, -2778, -5630, -6341, -5053, -3589, -1343, -1192, -5631, -9621, -4086, -5071, -12006, -12660, -10324, -9903, -11096, -12079, -11826, -11662, -8170, -4068, -2325, -3116, -4733, -6001, -8457, -8568, -6656, -6150, -8137, -8720, -5094, 1381, -1482, -3530, -4687, -7590, -11392, -12626, -4951, -682, 334, -4506, -5189, -2625, -3618, -2667, 860, 5169, 5825, 5416, 2378, -39, 4541, 9146, 6023, 4332, 1555, -825, -3581, -6513, -8588, -3372, 5679, 436, -9886, -10674, -7510, -1242, -1585, -5105, -5965, -9377, -8343, -10115, -4263, -4644, -2087, -4334, -7465, -14296, -10956, -3242, 1234, 91, 1096, -4334, -6851, -4889, -2671, -647, -4250, -4362, -1652, 1603, -1318, -8645, -10642, -9091, -7029, -1409, 5427, 3159, 3134, 4785, -190, -2737, -8618, -11506, -11269, -6437, -5136, -2812, -1436, -2630, -3383, -2701, -652, -3573, -2729, -5280, -8431, -11507, -12290, -11500, -10723, -4469]
5584d469N473m9m76j737o141j801Q288M770K102j195k255j548J473q99J314j111
5568A739J149N684J525N00o697n733J308K757J586m581j372N11K96m523k080M714
5552c217k681j067J499j198J90K44m231J782O308K087n03L419Ql60m349m237K966
5535c340K08J623j2j430m312N2n163J720L294m31N72N448J677J512r7p131k512
5518h322R88J922M334P51k05K001l84l94J598l984O06P74j464M239J295L40P89
5501D884L528j833k893j533J238p06k862k747J302l134k512J124p09p64L701j334
5485e250p076K274Q343J643j643k340n83q59M63n92L23K716M786N366j204n437
5469I30M072l510m244L932R68K286k253n45j582Q24M438j05n86k163j118N5l346
$$ y = [-4469, 1004, 955, 479, -1258, -7399, -9200, -912, 3858, 5960, 4765, 2510, 962, 2435, 1536, 2850, 1739, 2888, 8572, 10097, 10597, 3900, -1833, -525, 2232, 3818, -763, -2135, -1624, -1328, -5851, -7931, -3217, -5898, -6965, -5466, -6664, -6474, -6230, -10461, -8679, -2371, -284, -787, 2632, 2640, 2280, -2069, -6306, -3340, -3132, -1509, -1521, -2951, -7263, -7211, -12374, -10654, -7360, -7791, -7219, -1771, -94, 1418, 1321, -5810, -8322, -7334, -5412, -1078, -327, -532, 1469, 1085, 691, 2289, -1695, -1089, -315, -1779, 2460, 3755, 4095, 4884, 8412, 6579, 3686, 2153, 3391, 2685, -177, -2924, -1622, -4756, -7268, -6144, -6853, -7617, -3916, -5250, -12326, -10052, -1709, -66, -1709, -4049, -4632, -5491, -5028, -5620, -5297, -2581, 2205, 7571, 6367, 930, 5002, 1492, -2752, 1180, 2148, 4434, 2181, 1636, 54, 878, 5316, 5211, 4625, 2462, 1344, 1399, -1947]
5452a947l535j265N217N443q30l312j710M174m160p155k690L772M750J093j328
5437c483j1O78O270K687m962J688M90l396j192k798q75K197k044j592p32J469
5421e606L504k133j723p162L079N165j319m488J24L745J177j179J022K789K578
5406d27O159K063m171n399m912j920J882M156J369j370J776m859l664k29j460
5391a1006j202M261L878j809K743L441j597l82j053K724J817J13j646L227K073
5376E582k78K211O63n259l116P15J786k968j191N29j147k213n157P75N424J193
5360b451r9j692j62N3L505o00J407L612n247l435R31L447R752Q88k339n530J58
5343B198p4k053j038J337l527o8O89m717L656L767N124j37N65j352n378j656K586
$$ y = [-1947, -5482, -6747, -1530, 3913, 3083, -229, -1939, 2235, -1925, -9080, -11770, -7998, -3248, -2155, -3483, -3494, -2816, 3454, 6141, 1179, 2867, 3357, -39, -1231, -4029, -4904, -2707, -4751, -6343, -7075, -5606, -2102, -4235, -5958, -13120, -10041, -4876, -6195, -10683, -10559, -6814, -5637, -6816, -5794, -3005, -427, 5732, 7795, 3624, -1775, -6687, -8607, -6725, -2569, -1200, -2570, -794, -5653, -9317, -9546, -11006, -12208, -7947, -4069, -5878, -3135, 306, -1291, -1673, -2726, -2, 1815, 1928, 282, 3509, 5582, 5304, 7515, 8178, 2919, -197, 518, 2304, -664, -1855, -1326, -2473, -4686, -9843, -9068, -3644, -2451, -2550, -4242, -4404, -4351, -846, -1446, -39, 3573, -1674, -5109, -4178, -731, 9021, 9909, 7570, 2040, 2198, 2124, 71, -967, 370, -3157, -3225, -2536, -7253, -3597, 170, 5294, 5157, 5722, 4370, -1008, -2664, -78]
5326g8J765l375K551k447k635k049j164K683K425k812k392M54N272M175m257j478
5310c362J745J830n462j543N072P27J094N538K558m790o899k379l520q94j05J632
5294h758L942J043J003j064k988l656M419J122n04J584M810l311k509J160j655
5279e362k455R41M8n750M073J951M708R37n603j290J208P07Q78R3L51o01K036
5262c130l74k123K331N640P32o654m430J948N38j728j836p39K17O09r23N806L651
5245d65k247n825L947L024J295L091j279J67l607R58k864n32j80L875P12N68j448
5228h10j08n74L805J594n118j279k700j594j774j510K902m57j312K879L570J712
5212g74K065j946j531J391J733O47O92j245m504J503R66R18K728j891l227p3l431
$$ y = [-78, 1687, -1688, 863, -1584, -4219, -6268, -7432, -4749, -2324, -5136, -7528, -7074, -1802, 2373, -1884, -3362, -1617, 213, -5249, -6792, -1720, -993, 101, 5639, 8197, 3407, -3492, -5871, -9391, -10285, -10390, -8758, -4816, -3773, -2770, -3834, -6822, -10478, -6059, -4937, -5441, -3857, 953, -2358, -4867, -3707, -5362, -7817, -6876, -6828, -12578, -8505, -6554, -1846, -909, -6512, -7802, -6594, -5887, -5009, -4916, -4565, -5166, -3130, -3504, -5627, -3296, 2344, 3076, -3578, -8008, -6060, -5522, -7250, -9086, -9825, -9608, -8999, -9922, -4116, -465, -2712, -8537, -4590, -1566, -271, 2820, 1541, 1708, -1899, -941, -3805, -4337, -4517, -642, 70, 638, -810, -918, -1492, 2313, 3907, -1211, -2490, -5190, -6784, -8558, -10068, -7166, -7623, -8935, -6056, -2486, -774, 1291, -655, -2186, -795, 938, 1585, 2277, 1032, -3472, -1969, -1003, -85, 2643, 752, -2475, -2548, -5979]
5195e979J697L309J353j038m960l013l037J240M365K770r26k985j409j330O03
5180i340L613J395J260l834Q20M428J263j463j782Q88K105j616J534L010m252
5165a971m558o20N703L952n96P04j94j100r51j920K023j52J60L463m84n565n76
5148b682K314J603j923J324K061Q03j587j51k647L469P79m379J149l103j560l08
5132d838K311L381K533J438P61m537j590k206k923J734K635J198j223J221q310
5117h415j410L608K341K179k880r57J909J943N163l182j048J54J498k988k311
5102d396L539j121j652l198K88O097m14k568K617K934K339l9l699k149q64j454
5086c740j518j167L692P98J932K037l948l028K14j24J042K019K030M934M255m004
$$ y = [-5979, -4282, -973, 380, -658, -5618, -8631, -11668, -10428, -6063, -3293, -4219, -7204, -8613, -9943, -9340, -5727, -4332, -3072, -6906, -6086, -1658, -395, -1858, -3640, -2752, -647, -2263, -729, 2281, -1971, -6529, -7149, -1446, 2506, 1910, 2614, 2420, 1320, 369, -1551, 472, 320, 480, 3943, 3459, -2106, -2682, -368, 1235, -688, 636, 2697, 3500, 1913, 1762, -885, 2584, 3363, -1016, 133, -2970, -4530, -4838, -2527, 854, 3387, 4825, 5586, 1049, -541, -2747, -5670, -3936, -1301, -103, -1326, -105, -8415, -9825, -6217, -3876, -1697, -4577, -5534, -3625, -1682, 3481, 299, -749, -595, 903, -2085, -4396, -857, -1978, -3630, -6828, -6540, -443, -857, -3425, -808, 2126, 4465, 4426, 727, -1422, -2286, -3740, -5258, -6425, -2733, -1935, -3, 2034, -1914, -4942, -4728, -4852, -3810, -1791, 239, 5173, 9428, 5424]
5070E424o910J331j125p05M691M31j885J158j764m621k890o76M15L070P450J968
5054E362j220m36L579l758n286R9J59K914K506k191q351j92O210K887j683L343
5038C942K234k999n236j322K400J547K648k438K25J913n96k575n595l674r58N632
5022d852J854n53p267j361N464O796j6j413j203L52K303P03j713j520k099j064
5006e589K336R04j419q21J93K169K406K276m060k458M426L250m98Q13O80r8J7
4989D527j840k736j333j549J343o04l336M959k27m439K654k500L656O729K563
4974G867k244m603l844p64P12J202L110M359l127o660j913O595O910o033j388
4959A79L017k584J058k161j844K663j662Q16l054R6l188m881N7J379L378P344
$$ y = [5424, -1486, -155, -1280, -1985, 2706, 3137, 1252, 2410, 646, -3975, -6865, -7541, -7126, -4056, 3394, 5362, 4142, 3706, 7285, 3527, -1759, -1660, -1501, 1413, 3919, 1728, -6623, -6815, -605, 2282, 599, 3942, 6176, 3177, -2059, -3381, -981, 566, 3214, 776, 1001, 2914, 2318, -257, -5852, -9526, -10484, -4852, -2998, -3551, -10818, -12179, -6715, 81, 65, -1348, -2551, -2199, 104, 807, -906, -2426, -4525, -5589, -3253, -2349, -3768, -4589, -4396, -2227, 179, 2455, -1605, -4063, 363, 3613, 3115, 3928, 4608, 4510, 4527, 2687, -49, -1382, -2931, -1588, -2192, -5528, -569, -796, -5235, -2581, -5081, -1425, 5304, 7867, 5623, 1020, -2824, -3588, -2876, -1674, 1436, 5795, 2668, -3992, -5905, 690, 7600, 1567, 179, 3196, 612, 1670, -491, -2335, 328, -1334, -518, -3572, -3476, -6664, -11545, -11488, -10109, -6731, 613]
4943F13L735N27l292k027l584J142K70K942k813J567L228J410j261k91L324o74
4927D816p743j206K405k9k92j201q21o07K380M784l699J044K244l647m188L03
4911e457L369j64K810L459j827k281j120l930O27j819P118J699r77m467k853J151
4895d662L490O508k116r40o54J699j971l815n326J414K897L707n544P86Q746J71
4879D390k066L665k312J869M49o206r479k904P139M903k008k676K262J008l438
4864e404l85L013K206M239J178j505l97K612j643o187k771K318q77J814m054K519
4848c324O099N234j462l906k777m946k191L949L701K43k38j749P1K801J414j414
4832A505n301j829O197k31j782k84M032J222l06N262R98r888k116K75M41P70J521
$$ y = [613, 4348, 4875, 1583, -444, -4028, -2886, -2616, 326, -2487, -920, 2308, 3718, 2457, 2166, 5490, 4816, -2927, -4133, -1728, -1757, -2049, -3250, -4071, -4678, -2298, 2486, -1213, -169, 2075, -1572, -5760, -5457, -2088, -2252, 558, 4017, 2190, -91, -1211, -5141, -4514, -6333, 785, 2484, 1507, -2960, -5813, -4662, -1172, 5336, 3220, 2280, 1626, 3325, 1354, -2461, -7787, -6373, -3476, 231, -5313, -4527, 4219, 4390, 2324, 5989, 3677, 5546, 5995, -211, -9690, -12594, -5455, -552, -2560, -5236, -2974, -1966, -5404, -5789, -2776, -570, 3669, 4847, 3342, 2945, 5557, 3914, -2273, -5044, -2726, -3603, -1789, -5843, -3324, 2775, 8009, 6547, 2641, -136, -5082, -7273, -3324, 377, 620, 382, -1367, -1296, 1505, 2919, 1505, -3796, -5625, 572, 341, -1441, -1725, 2307, 3529, 3223, 8485, 9483, -405, -2521, -2246, -1805, -1035, 486]
4815D86p11J537J018J481k478p231k095J973M991P138k91m172L104K850k099m032
4799A469m241j856K334n044j170L833K89J851L908O59n196n234M173K955N40q53
4783a583l300M520L070k804n03m694M352K632n28K244k278m683k925k22M020m01
4767c083m41M962J139k145J312J603K001J484m67j860p63l016p48j155M280K227
4751E330L81k633m766l601L250L428K642n194m889J600L317k06N00K212M83J51
4735B005m558k603l553K4J036k681oK368K780L089N554K752n136n940N00K018
4719b351p13L504N1j104p01L452O804O56k147l507o36M614J9l452l895k427J217
4702f16j512k425J0J864N865L312k586j998j502j197m221m05P92J273j693L06
$$ y = [486, -225, 1312, 2330, 3811, 1333, -5898, -7993, -6020, -1029, 6109, 5818, 1646, 4750, 7600, 5501, 1469, -2772, -4628, -2294, -7338, -8508, -4675, -4386, -2535, 1373, 2032, -3164, -8398, -4225, -1270, -730, -1583, -4883, -363, 2707, -97, -600, -5294, -942, 1690, 1162, 3406, 1128, -3555, -6480, -6702, -2682, -3083, -3524, 1438, 2577, 432, 1744, 3347, 5348, 6832, 6365, 4505, 3742, 726, -22, -1177, 3103, 5330, 5711, 3078, -1688, -5289, -2039, 1389, 4031, -1163, -6052, -4452, -1135, -1341, -841, 1371, 1854, 2005, -2553, -5156, -8709, -8685, -7649, -10330, -10336, -7968, -5188, -2099, 3455, 6207, 1071, -4869, -4369, -2351, -3064, 440, 491, -613, -1314, 2138, 8942, 9598, 7451, 3944, 3308, 7922, 7941, 4489, 594, -1833, -616, -2128, -4553, -4543, -2679, 3186, 6498, 3912, 1914, 412, -785, -5006, -5411, -4619, -3346, -5039, -4733]
4686d733J599K694L524m475l300j28L855R55m940q51j570J157Q585L789N85l258
4670C488j789J519l82k342l258J276L38j67L53n071J188Q269M362j523m240J304
4654C325j820o115K928n68j942j486J458N38k863J406P20K054j59j505j381m73
4638e883J069j4J571J274l57r73J548K491N28k807j491P08J495j323K542O782
4622G160j301Nk677l462m634k835N310M605j843k032o2L848m073J0M067L67J176
4605C629l582o693J241J36K726k96k218M70R031K824m339l70m41N13l53m400j263
4588c385K494K905M29j414j233L35j281J255j438r2K86j997l74N829k679j763
4572b123K845J086K59k985L386k513L81m840J143J003J215K573K486J283n770
$$ y = [-4733, -3134, -440, 3084, -1391, -4691, -4819, -964, -9, -4949, -5800, -7370, -6213, 2372, 6161, 6746, 3488, 1699, 3218, 2836, 494, -2764, -1488, -1150, -1317, -964, -6035, -4847, 3422, 7784, 6261, 2021, 3325, 1505, -4610, -1682, -2250, -4192, -5678, -4220, -3682, -6545, -5139, -4419, -2365, -2524, -4029, -5410, -5883, -4814, -4828, -3257, -1983, -2340, -3313, -1765, 726, 1254, -1553, -3044, -2336, -841, -2164, 378, 7160, 5859, 5864, 3187, -275, -4909, -7744, -2434, 2171, 328, -1704, -1766, 2082, -1991, -1981, 2086, 2453, 3629, 47, -6646, -5405, -5269, -2543, -2839, -5057, -4587, 4444, 7268, 2929, 2559, 2118, 2631, 2278, -2122, -3385, -891, 2014, 2443, 1029, -204, 131, -1150, 105, -1333, -1425, -1139, -3136, -3510, 2319, -360, -2123, 722, 1808, 2067, -918, 2468, -45, 336, -4504, -3361, -2358, -1143, 1430, 3916, 5199, -571]
4557e71o703l9M52o24P82r37k6J174n82j981L807k432L72N178N699l012k819O8
4539b194M177j731m095K315K517k354k514l796q88k058J251N123N764K815j574
4524B758m168J909J720l108k424l863P02L921R92j408q09K000o45J064P70N09
4508h0k139N18j479R477J663p651L734M424l95k612J341Q40q96n436m813O79Q52
4491a973j490O348m11m59j858L290J205N02M401k63m216O70k793M548L918l609
4475G810q64m41j719k038m390j870M490k343l965L053L494J698m99k899j562K338
4459B93l344k414j93P56J497n49O53r42p89J524L920K69K2j552j545m723m697
4442a1814M594L999q82L36j64O36m285j383N192L623j40J434n254n741P1L133
$$ y = [-571, -7274, -7313, -6861, -7485, -6703, -7640, -7666, -6492, -7074, -9055, -5248, -7680, -7308, -2130, 3569, 557, -2262, -2194, 1983, 252, -3843, -1528, 989, -1365, -3879, -7675, -8563, -10621, -9370, -4247, 1517, 4332, 2758, -1410, 499, 2219, -889, -3313, -7176, -6474, -2553, -1561, -2969, -3778, -1778, -2423, -1359, -589, -80, -2219, -1701, -3180, 6297, 7960, 309, 4043, 8467, 8072, 5460, 6801, 7641, 6745, 1309, -3504, -2825, -1973, -3463, 2885, 2474, 2015, 157, 3447, 4652, 5154, 9555, 9292, 5076, 5746, 2953, 7501, 11419, 7810, 6946, 6505, 4786, 2748, -1642, -3512, 978, -1365, -5330, -2277, 1217, 2915, 2416, -483, -2045, 293, -3051, -5465, -5658, -4902, -3405, -3954, -3301, -4243, -5032, -3508, 412, 681, 703, -849, -2394, -7117, -11814, -7220, -3221, -4103, -3767, -3931, -3295, -7580, -8963, -3771, -148, -288, 1146, -4108, -9849, -9778, -6645]
4426f645K817M906J363n227n98L275R82n88J893M444k549k673j598k503J338k229
4410c592K89J322J448q89J898k777O135M657m518n252O74j411J080Q782M31n126
4394C151n297n282J829M572k823q9o07j413Q41K184o42J342j03m815L162N051
4378A061k125K4n4L506J596k575m851l93j615O487j022m052j019m05M335O842
4362E740L248k750m74k029l205l577J624J031K455J846j19l631l621r28o03P85
4346d208j405k067K413K979L800j046p73j646l254k602R33L382l633m058j225
4331a2410M325l35K485q31M230K090J604n40k294J377O157k621l121r24n16L2
4315a292K715M359J161n82J80N32m691n144n625q09L763J825M95K831K695K94
$$ y = [-6645, -3828, 1078, 2441, -2786, -3384, -109, 873, 285, 2178, 6622, 4073, 1400, -198, -2701, -1363, -3592, -3303, -1981, -533, -1422, 476, -2301, 3834, 8491, 3973, -1279, -605, -2016, -936, 7846, 8277, 3151, -2146, -7428, -5599, -1027, -3850, -3939, -4546, -5959, -5118, -2934, -3576, -2234, -2337, -7152, -3990, 1061, -1064, -1040, -1094, 2412, 4008, 1433, -3418, -3811, -5426, 1061, 39, -4013, -5032, -5437, -1102, 5740, 8988, 6238, 5764, 3735, 530, -3047, -1423, -392, 2063, 3909, 3790, 159, -3462, -4390, -4993, -4208, -5613, -7680, -5267, -2288, 1512, 466, -307, -1953, -5207, -7809, -6876, -3494, -7127, -11185, -12410, -8085, -8420, -5935, -6766, -2536, -446, 1158, 618, -1676, -299, 5858, 3237, 116, -808, -1324, -1292, 1423, 5782, 6943, 6361, 6541, 7073, 2382, -2762, -8387, -9196, -5433, -3608, -3113, -282, 2413, 2707]
4299B707l205M10L842K273m633n759K5L187K228K304M36k810K278o00l107j215
4283a639J997M121l124j903N80J828l171j397Q55l140J121j793M881K783P77N655
4267H431J571m321J10p45n871p95K373k417K286j803m95L765J857P49k577k566
4251d48m207o82p07j659K789L059N11j924J597j415J182Q8L73L947K205m968k650
4234b909O6K267j017o697k804l18K726K063J103J056J831K212n75L99J729K378
4218C510o76k014l855j615j324K570j967J863O22k715j618L54M439K037j484J603
4202b70L251P38K88j163j203k75l765q07j559j373K11J741R36K240m543j897O704
4185g46K104K8J825M191j377q57O19n79J657J58l356p388J058L752J305K700K798
$$ y = [2707, -498, -88, 3754, 6027, 1394, -4365, -4340, -1153, 1075, 3379, 3815, 1005, 3283, 2683, -424, -1639, 358, 4479, 1355, -548, 32, 1860, -1311, -2708, -1853, -4993, -3872, -5665, -784, 1999, 2776, 8431, 10002, 5681, 5791, 5046, -825, -1620, 753, -1664, 622, -1181, -1676, 2089, 3946, 4695, 2118, -448, -4655, -5337, -6044, -7703, -4914, -1855, -1344, -3268, -1671, -3086, -1904, -1816, -1443, 2504, 4709, -259, -2909, -2843, -576, -1593, -8290, -11094, -11412, -8686, -6623, -5520, -4464, -2633, -421, -996, -597, 1132, 3510, 2834, 820, -3035, -4650, -5974, -3404, -5371, -3508, -2886, -5601, -7219, -6865, -2426, -389, -1873, -270, 2981, 3719, 4007, 2844, 1641, 1366, -2399, -3206, -4765, -6138, -5927, -4186, -3250, -1010, -5553, -7450, -746, 1358, 1386, 3211, 7402, 6025, 5168, 5787, 5208, 6865, 7023, 3667, -3721, -2663, 1089, 2394, 5094, 7892]
4168G892m559j183J132l595j191R99K871L851j339m943l4O90k1K53k209k009J73
4151c222l202k289p10n31M421L668L750K136o646o41P563J143l846j010k522N758
4135C820M002j440l709j403l879j945M319K131K203L430j543j216m325J59M049
4120D653j741l845k554k640l823J169N355N84k96L627K120j582J24j553O89J912
4104B199p16j665l120K557K485j829o091R47O987k632l311k20K940J967j690L958
4088B766j41m130j719o61m015O99J333K72M121K207R75k805q56j870L67Q632K447
4071G622m541j689K133L211J03L241J205l673m725l69R81j267k482R65J420Q98
4055C033K73K563J231k085j947k94k753l189k909L257O14m420O25L42j347p63
$$ y = [7892, 3333, 2150, 3282, -313, -1504, -505, 2366, 6217, 4878, -65, -99, 591, 570, 823, -1386, -3395, -3222, -6424, -8713, -9423, -9954, -5533, -1865, 1885, 4021, -2625, -3266, 4297, 5440, 1594, 584, -1938, 3820, 7822, 6382, 2673, 1270, -2609, -4554, -235, 1896, 4099, 7529, 5986, 4770, 445, 604, 4653, 2912, -933, -3487, -6127, -9950, -8781, -3426, -2842, -3138, 489, 2609, 1027, 1151, -402, 287, 2199, 1483, -182, -3302, -745, 1740, -89, -6180, -5233, 1754, -878, -4189, -4409, -1469, 498, -1192, 2766, 2625, -1505, -3224, -3885, -7900, -7201, -5868, -5596, -1475, 732, 1707, -1098, -1954, -3824, -3457, 5175, 7622, 3081, 1392, 3525, 6736, 6839, 10080, 11285, 7612, 2887, 2518, 3499, 2232, -250, 715, 2135, 3033, 3306, 5869, 7100, 5015, 3068, 2774, 21, -3168, -6077, -2820, -2206, -6626, -6001, -5659, -7006, -7769]
4039g769M387Q083k587j567L136K643K726l933K47j476n229j778L474J496j6Q2
4023A919K521Q18K311M49l186k661j505j921J522M530p57l189j809p65N577j92
4007C662k553l015L234M189m608K8N78l26n14L233m395p284j000L106j851k739
3991a0255O260O475Q6l501j17j343J087n68R86j74K199q13J93L450k327q77l272
3974b511J883J377l661k9l00O92j31k748J02L026O78J322J204K584m456m431l356
3957h755J536K242K935J634k423R4o00k078L108N62k549K370K993o36O123J849
3941H405k588j232m848l409P3k897j451K070J16R211M704j925j841l204k074l57
3925a247O811K286j567k481k423k269j447R28K671J485j196K106K78J9l876J764
$$ y = [-7769, -3382, 4701, 2114, 547, 3683, 6326, 9052, 5119, 5366, 3890, -1339, -3117, 357, 1853, 1837, 1919, 4440, 5258, 7569, 8018, 4832, 2171, 666, -1255, 267, 4797, 4040, 851, -958, -1723, 3854, 3662, 1109, -1906, 1328, 5517, 909, 937, 1515, 1189, 675, 3908, -487, -7771, -8771, -5665, -7516, -10255, -3995, 2480, 2566, -935, -1052, -2395, -1308, -1876, -890, -1064, 1135, 322, 515, 3965, 1638, 761, -2511, -628, 749, -2912, -2941, -3241, -2549, -2680, -5428, -5326, -2300, -1622, -300, 904, 3488, -968, -5399, -8755, -7219, -4977, -2042, -408, -2831, -2737, -3337, -5415, -2307, -1745, -4294, -1924, 1069, 433, 6556, 8405, 5817, 4585, -263, -3672, -3599, -6496, -7947, -5877, -5761, 3450, 8154, 6229, 4388, 1184, -890, -1247, 5564, 7850, 6283, 3802, 1379, -890, -2337, -1409, 1262, 2747, 1551, 3657, 3935, 3954, 78, 1842]
3909A842mk995m794q23n62j441m25J281L094k101O67N997p88n892P41L435o58
3892c426j374Q153J321l857j694K685o44p37R80J611o576k145L560r3m793J872
3876e157N715L644k479l118l999Q78K322l43M044Q52K363j71Q20m123j460J934
3860A722j642m356k554j515N227M66K461Q22j515L22m18j107K768K280K187l233
3844A915j312L401k008k250K220O23J856l480m691R63K608k059K460O014J524
3829G784o374o736K8Q946N070k478j618J88N41J766l343m303K506M870k332n097
3813e82K22J856R71M181P73l308R22O08k407j104L736o292j410N362M987p36l656
3796D123J763J27m116p466M99k603J208K033Q27k817K025K322Q79j831J510N889
$$ y = [1842, 1838, -1157, -5951, -6774, -7336, -8777, -9202, -7921, -4827, -6928, -6261, -264, -1052, -6944, -6203, -2768, -3426, -4800, 3353, 4674, 817, -877, 1808, 1164, 427, 1407, 3018, -3558, -5703, -2143, -2236, -7029, -5157, 558, 4202, 1723, -1395, -5394, -4516, -2194, -2537, 1507, 2359, 4722, 4551, 5371, 1248, -212, 1722, 80, -4276, -6830, -8345, -3118, -2652, -191, 631, -884, -562, -980, -2087, 681, 2961, 5148, 1915, 603, 4004, 1996, -254, 1966, 2589, 4445, 965, -3726, -2763, -155, -2214, 246, 6260, 7784, 1410, -5326, -5298, 3648, 8718, 6240, 4622, 4810, 5351, 7117, 3774, -529, 1977, 6847, 4515, -582, -360, 1496, 2467, 6648, 7421, 4113, 5035, 5643, 3236, 2132, 5868, -424, -1834, 3528, 8515, 7779, 4123, 5886, 6013, 1897, -5569, -5070, -7673, -6465, -4432, -3605, -6422, -4397, -2075, -1196, -3027, -1517, 4372]
3780D372J818j583K170k704j748k802k243l066m076M14N185Q64k376l51M438P542
3764E854J620o949p87J679m145J075Q22J97l428j083J662K587j12n014l91L464
3748b949n84K792o26K331k052J643M34Q73J442K492M111k225n044n18L43j698
$$ y = [4372, 6190, 4607, 6777, 4073, 2325, -477, -2720, -5786, -9862, -9448, -4263, -3399, -5775, -6126, -1688, 5854, 7474, 525, -262, 1417, -2728, -1653, -831, -634, -4062, -5145, -3483, -896, -1008, -6022, -6413, -2949, -3533, -741, -1367, 964, -1088, 555, 989, 1862, 3304, 5796, 9907, 7682, 2638, 2120, 2463, 765]
$$ [...]
##END NTUPLES=NMR SPECTRUM
##END=
