##TITLE=Analysis number 323270
Compound Code cc 53446
Book Reference 503/66/7
Project Code adrs
Chemist Name victoriam
##JCAMPDX= 6.0         $$ Bruker NMR JCAMP-DX V2.0
##DATA TYPE= NMR SPECTRUM
##DATA CLASS= NTUPLES
##ORIGIN= Bruker BioSpin GmbH
##OWNER= nmr
$$ XWIN-NMR		Version 3.5
$$ Fri Oct 20 09:48:38 2006 GMT Daylight Time (UT+1h)  MAYBRIDGE\nmr@NMR_250MHZ
##.OBSERVE FREQUENCY= 250.131544655141
##.OBSERVE NUCLEUS= ^1H
##.ACQUISITION MODE= SIMULTANEOUS (DQD)
##.ACQUISITION SCHEME= undefined
##.AVERAGES= 16
##.DIGITISER RES= 18
##SPECTROMETER/DATA SYSTEM= dpx250
##.PULSE SEQUENCE= zg30
##.SOLVENT NAME= CDCl3
##.SHIFT REFERENCE= (INTERNAL, CDCl3, 0, 16.522)
##AUDIT TRAIL= $$ (NUMBER, WHEN, WHO, WHERE, WHAT)
$$ ##TITLE= Audit trail, XWIN-NMR		Version 3.5
$$ ##JCAMPDX= 5.01
$$ ##ORIGIN= Bruker BioSpin GmbH
$$ ##OWNER= nmr
$$ C:\u/data/dgb/nmr/ADRS/1010/pdata/1/auditp.txt
$$ ##AUDIT TRAIL=  $$ (NUMBER, WHEN, WHO, WHERE, WHAT)
(   1,<2006-10-20 09:48:12.04 +100>,<MAYBRIDGE\nmr>,<NMR_250MHZ>,
      <created by zg, POWCHK disabled, PULCHK disabled
       configuration hash MD5:
       49 4B E0 1D 92 C2 6B 37 9F E6 65 BC 52 41 86 1D
       data hash MD5: 64K
       66 B8 7E ED 3E 69 C1 2C A2 B1 44 E9 A8 AE 78 26>)
(   2,<2006-10-20 09:48:27.51 +100>,<MAYBRIDGE\nmr>,<NMR_250MHZ>,
      <Start of raw data processing
       ef LB = 0.3 FT_mod = 6 PKNL = 1 SI = 32K 
       data hash MD5: 32K
       06 64 FE 2E EE C8 77 FA B3 E8 43 9B 9D 79 21 72>)
(   3,<2006-10-20 09:48:29.31 +100>,<MAYBRIDGE\nmr>,<NMR_250MHZ>,
      <apk 
       data hash MD5: 32K
       5D 0A A2 EC 65 AE BD 13 80 4C B7 09 5C E5 98 02>)
(   4,<2006-10-20 09:48:30.06 +100>,<MAYBRIDGE\nmr>,<NMR_250MHZ>,
      <abs ABSG = 5 
       data hash MD5: 32K
       F7 51 BC 7B 5A E7 61 B6 A7 02 E0 2C 35 6F 7F 07>)
$$ ##END=
$$ 
$$ hash MD5
$$ D7 6B EF 28 A6 7E EA E4 9E F3 51 85 62 8B 85 C3
##$RELAX= 
##$RELAX= 
##$RELAX= 
##$RELAX= 
##$RELAX= 
##$RELAX= 
##$RELAX= 
$$ Bruker specific parameters
$$ --------------------------
##$DU= <C:\u>
##$EXPNO= 1010
##$NAME= <ADRS>
##$PROCNO= 1
##$TYPE= <nmr>
##$USER= <dgb>
##$AMP= (0..31)
100 100 100 100 100 100 100 100 100 100 100 100 100 100 100 100 100 100 
100 100 100 100 100 100 100 100 100 100 100 100 100 100 
##$AQSEQ= 0
##$AQ_mod= 3
##$AUNM= <au_zg>
##$AUTOPOS= <51 >
##$BF1= 250.13
##$BF2= 250.13
##$BF3= 250.13
##$BF4= 250.13
##$BF5= 500.13
##$BF6= 500.13
##$BF7= 500.13
##$BF8= 500.13
##$BYTORDA= 1
##$CFDGTYP= 0
##$CFRGTYP= 5
##$CHEMSTR= <none>
##$CNST= (0..31)
1 1 145 1 1 1 1 1 1 1 1 1 1 1 1 1 1 1 1 1 1 1 1 1 1 1 1 1 1 1 1 1 
##$CPDPRG= <>
##$CPDPRG1= <>
##$CPDPRG2= <>
##$CPDPRG3= <>
##$CPDPRG4= <mlev>
##$CPDPRG5= <mlev>
##$CPDPRG6= <mlev>
##$CPDPRG7= <mlev>
##$CPDPRG8= <mlev>
##$CPDPRGB= <>
##$CPDPRGT= <>
##$D= (0..31)
0 1 0 0 0 0 0 0 0 0.06 0 0 0 0 0 0 0.0002 0 0 0 0 0 0 0 0 0 0 0 0 0 0 
0 
##$DATE= 1161334091
##$DBL= (0..7)
120 120 120 120 120 120 120 120 
##$DBP= (0..7)
150 150 150 150 150 150 150 150 
##$DBP07= 0
##$DBPNAM0= <>
##$DBPNAM1= <>
$$ [...]
##$SUBNAM7= <"">
##$SUBNAM8= <"">
##$SUBNAM9= <"">
##$SW= 20.6930455092707
##$SWIBOX= (0..15)
0 0 3 0 0 0 0 0 0 0 0 0 0 0 0 0 
##$SW_h= 5175.983436853
##$TD= 65536
##$TD0= 1
##$TE= 683.16
##$TE2= 300
##$TE3= 300
##$TEG= 300
##$TL= (0..7)
0 120 120 120 120 120 120 120 
##$TP= (0..7)
150 150 150 150 150 150 150 150 
##$TP07= 0
##$TPNAME0= <>
##$TPNAME1= <>
##$TPNAME2= <>
##$TPNAME3= <>
##$TPNAME4= <>
##$TPNAME5= <>
##$TPNAME6= <>
##$TPNAME7= <>
##$TPOAL= (0..7)
0.5 0.5 0.5 0.5 0.5 0.5 0.5 0.5 
##$TPOFFS= (0..7)
0 0 0 0 0 0 0 0 
##$TUNHIN= 0
##$TUNHOUT= 0
##$TUNXOUT= 0
##$USERA1= <user>
##$USERA2= <user>
##$USERA3= <user>
##$USERA4= <user>
##$USERA5= <user>
##$V9= 5
##$VALIST= <valist>
##$VCLIST= <CCCCCCCCCCCCCCC>
##$VD= 0
##$VDLIST= <DDDDDDDDDDDDDDD>
##$VPLIST= <PPPPPPPPPPPPPPP>
##$VTLIST= <TTTTTTTTTTTTTTT>
##$WBST= 1024
##$WBSW= 4
##$XGAIN= (0..3)
0 0 0 0 
##$XL= 0
##$YL= 0
##$YMAX_a= 429302
##$YMIN_a= -410393
##$ZGOPTNS= <>
##$ZL1= 120
##$ZL2= 120
##$ZL3= 120
##$ZL4= 120
##$ABSF1= 16.522
##$ABSF2= -4.171173
##$ABSG= 5
##$ABSL= 3
##$ALPHA= 0
##$AQORDER= 0
##$ASSFAC= 0
##$ASSFACI= 0
##$ASSFACX= 0
##$ASSWID= 0
##$AUNMP= <proc_1d>
##$AZFE= 0.1
##$AZFW= 0.1
##$BCFW= 0
##$BC_mod= 0
##$BYTORDP= 0
##$COROFFS= 0
##$CY= 12.5
##$DATMOD= 1
##$DC= 0
##$DFILT= <>
##$DTYPP= 0
##$F1P= 14.0000005364418
##$F2P= -0.99999901652339
##$FCOR= 0.5
##$FTSIZE= 32768
##$FT_mod= 6
##$GAMMA= 0
##$GB= 0
##$INTBC= 1
##$INTSCL= 1
##$ISEN= 128
##$LB= 0.3
##$LEV0= 0
##$LPBIN= 0
##$MAXI= 10000
##$MC2= 0
##$MEAN= 0
##$ME_mod= 0
##$MI= 0
##$NCOEF= 0
##$NC_proc= -3
##$NLEV= 6
##$NOISF1= 0
##$NOISF2= 0
##$NSP= 0
##$NTH_PI= 0
##$NZP= 0
##$OFFSET= 16.522
##$PC= 1
##$PHC0= -46.126
##$PHC1= 8.871914
##$PH_mod= 1
##$PKNL= yes
##$PPARMOD= 0
##$PSCAL= 4
##$PSIGN= 0
##$REVERSE= no
##$SF= 250.13
##$SI= 32768
##$SIGF1= 0
##$SIGF2= 0
##$SINO= 400
##$SIOLD= 32768
##$SREGLST= <1H.CDCl3>
##$SSB= 0
##$STSI= 32768
##$STSR= 0
##$SW_p= 5175.98343685301
##$SYMM= 0
##$S_DEV= 0
##$TDeff= 65536
##$TDoff= 0
##$TI= <Analysis number 999999
Compound Code 99
Book Reference 9
Project Code 9>
##$TILT= no
##$TM1= 0
##$TM2= 0
##$TOPLEV= 0
##$USERP1= <user>
##$USERP2= <user>
##$USERP3= <user>
##$USERP4= <user>
##$USERP5= <user>
##$WDW= 1
##$XDIM= 32768
##$YMAX_p= 298169206
##$YMIN_p= -257257
$$ End of Bruker specific parameters
$$ ---------------------------------
##NTUPLES= NMR SPECTRUM
##VAR_NAME=  FREQUENCY,     SPECTRUM/REAL,   SPECTRUM/IMAG
##SYMBOL=    X,             R,               I
##VAR_TYPE=  INDEPENDENT,   DEPENDENT,       DEPENDENT
##VAR_FORM=  AFFN,          ASDF,            ASDF
##VAR_DIM=   32768,         32768,           32768
##UNITS=     HZ,            ARBITRARY UNITS, ARBITRARY UNITS
##FACTOR=    0.157963299565203, 1,           1
##FIRST=     4132.6476996994, 0,             0
##LAST=      -1043.33573715361, 0,           0
##MIN=       -1043.33573715361, -257257,     0
##MAX=       4132.6476996994, 298169206,     0
$$ Real data points
##PAGE= N=1
##DATA TABLE= (X++(R..R)), XYDATA
$$ [...]
$$ plain form
16062 45875313 49898365 47965639 39861019 29545988 20876441 15002205 11403733 9199422
16054 9199422 7880895 7154022 6830280 6809069 6978230 7357706 7909499 8806791 10142685
16045 10142685 12174642 15389891 20211457 26736497 34348447 41720619 46926020 47314697
16037 47314697 41430687 31599838 22181986 15396509 11096974 8388456 6623153 5390210
16029 5390210 4500959 3826367 3263476 2829747 2547819 2359675 2115373 1880060 1653700
16020 1653700 1440219 1270942 1212636 1104812 956977 931674 883761 915124 1014622 1053377
16010 1053377 1100888 1166906 1139046 1084634 936177 799960 697297 640138 527894 443739
16000 443739 388880 357114 385839 359362 278872 232478 184765 187092 220295 224341 249303 264066
$$ packed form
16062D5875313M023052j932726q104620j0315031q669547n874236l598472k204311
16054I199422j318527p26873l23742k1211J69161L79476N51793Q97292J335894
16045A0142685K031957L215249M821566O525040P611950P372172N205401L88677
16037D7314697n884010r830849r417852o785477m299535k708518j765303j232943
16029E390210q89251o74592n62891m33729k81928j88144k44302k35313k26360
16020A653700k13481j69277n8306j07824j47835k5303m7913L1363R9498L8755
16010A053377M7511O6018k7860n4412j48457j36217j02663n7159j12244q4155
16000D43739n4859l1766K8725k6477q0490m6394m7713K327L3203M046K4962J4763
$$ plain form
15988 264066 254022 221782 215653 195724 190899 193360 209544 202261 140770 75260 31509 26392
15976 26392 44942 62836 74290 95483 134744 116608 101565 101836 112662 84582 118177 126625
15964 126625 115809 104437 62946 46317 8427 12360 15544 20102 78203 21286 -16524 30717
15952 30717 72188 94665 100965 53194 55408 -3102 121 10708 21524 43094 -22139 -2951
15940 -2951 62553 109162 69407 17086 76640 86446 31600 -8264 -17031 22767 82228 58501
15928 58501 -12255 -12976 37697 71189 66281 10050 21418 28038 22200 -50442 -75606 -34449 30126
15915 30126 67945 30307 -25207 9776 21153 68002 51416 33361 81600 105099 26588 3089
15903 3089 31505 19982 -56539 -112366 -89844 -4690 -4579 -49948 -41141 -19594 23135 -3697
$$ packed form
15988B64066j0044l2240o129j9929m825K461J6184p283o1491o5510m3751n117
15976B6392J8550J7894J1454K1193L9261j8136j5043K71J0826k8080L3595Q448
15964A26625j0816j1372m1491j6629l7890L933L184M558N8101n6917l7810M7241
15952C0717M1471K2477O300m7771K214n8510L223J0587J0816K1570o5233J9188
15940b951O5504M6609l9755n2321N9554R806n4846l9864q767L9798N9461k3727
15928E8501p0756p21N0673L3492m908n6231J1368O620n838p2642k5164M1157O4575
15915C0126L7819l7638n5514L4983J1377M6849j6586j8055M8239K3499p8511k3499
15903C089K8416j1523p6521n5827K2522Q5154J11m5369Q807K1547M2729k6832
$$ plain form
15891 -3697 -58113 -58893 -72039 -124068 -76866 -58547 4352 30318 43709 -2870 -78574 -88148
15879 -88148 -86384 -121055 -111689 -87318 -33653 -35594 -47787 -52140 -68718 -17807 34807 29693 -2655
15866 -2655 -25145 -19276 16604 22700 27972 7591 -16112 -18742 -2822 -8488 46709 30392 29034
15853 29034 68310 78455 35471 -46343 -105042 -104119 -88270 -76446 -71350 -24597 25199 35097
15841 35097 89063 137395 75214 -16801 -120447 -63768 5742 34578 -9745 -96577 -121249
15830 -121249 -129590 -150433 -138553 -115530 -91144 -140106 -153587 -126229 -108317 -112155 -98808 -78021
15818 -78021 -75432 -84311 -107126 -109452 -97986 -86014 -60841 -51411 -86098 -17305 4644 23376
15806 23376 35522 43821 60318 25436 8893 38004 25915 35696 4684 -30630 -7495 59867
$$ packed form
15891c697n4416p80j3146n2029M7202J8319O2899K5966J3391m6579p5704r574
15879h8148J764l4671R366K4371N3665j941j2193m353j6578N0911N2614n114l2348
15866b655k2490N869L5880O096N272k0381k3703k630J5920n666N5197j6317j358
15853B9034L9276J0145m2984q1814n8699R23J5849J1824N096M6753M9796R898
15841C5097N3966M8332o2181r2015j03646N6679O9510K8836m4323q6832k4672
15830a21249q341k0843J1880K3023K4386m8962j3481K7358J7912l838J3347K0787
15818g8021K589q879k2815k326J1466J1972K5173R430l4687O8793K1949J8732
15806B3376J2146Q299J6497l4882j6543K9111j2089R781l1012l5314K3135O7362
$$ plain form
15794 59867 56160 58802 18360 -31032 -7691 4117 -31893 23098 55577 74058 57146 38355
15782 38355 13847 -2693 6513 -2630 -60994 -96751 -104444 -155221 -152399 -131052 -58978 -19318
15770 -19318 4255 13401 -39546 -45666 -26381 -17450 -40832 -31980 11618 10562 7008 -8784 -22939
15757 -22939 -59226 -101394 -113934 -119235 -93543 -68818 -77653 -29177 -2384 -802 -5985 -24357
15745 -24357 -38757 -12022 -11217 -35025 -50943 4540 -31709 -6722 26208 35424 -50815 -53464
15733 -53464 -12650 -23952 -30230 7155 -19735 -61988 -103539 -129807 -77360 -60732 -104168 -121877
15721 -121877 -75522 -35833 20468 1616 -56687 -85900 -54691 -114363 -100562 -85030 -73331
15710 -73331 -92906 -89744 -100599 -86445 -111954 -57295 -13155 -80343 -124544 -98225 -37025 5041
$$ packed form
15794E9867l707K642m0442m9392K3341J1808l6010N4991L2479J8481j6912j8791
15782C8355k4508j6540R206r143n8364l5757p693n0777K822K1347P2074L9660
15770a9318K3573R146n2947o120J9285Q931k3382Q852M3598j056l554j5792j4155
15757b2939l6287m2168j2540n301K5692K4725q835M8476K6793J582n183j8372
15745b4357j4400K6735Q05k3808j5918N5483l6249K4987L2930R216q6239k649
15733e3464M0814j1302o278L7385k6890m2253m1551k6268N2447J6628m3436j7709
15721a21877M6355L9689N6301j8852n8303k9213L1209n9672J3801J5532J1699
15710g3331j9575L162j0855J4154k5509N4659M4140o7188m4201K6319O1200M2066
$$ plain form
15698 5041 15817 41719 35981 41956 24841 -44071 -65362 -79174 -108716 -105294 -103105 -67934 -24721
15685 -24721 -23896 13335 47650 44587 -6175 -50534 -51617 5928 30993 -9918 32838 77614
15673 77614 76738 45781 37928 67902 54956 1909 -29239 -94351 -98082 -59165 -37617 4058
15661 4058 58830 34173 -20144 -10557 -21635 -22261 -36107 -21004 13414 12482 -10357 -31706 -74459
15648 -74459 -63367 -52014 -7913 -15487 -28926 -53358 -109169 -107252 -128627 -129047 -97626 -56318
15636 -56318 -61196 -23987 -22286 -31789 -18990 29278 56080 45666 -31816 -78020 -62080 -42423
15624 -42423 -47826 -29552 -3680 -10601 -55659 -100678 -107867 -89357 -54321 -62024 -39877 9583
15612 9583 -18447 -26772 23463 23032 10792 3277 -43241 -46602 -10276 -40363 -93409 -44992 -37791
$$ packed form
15698E041J0776K5902n738N975j7115o8912k1291j3812k9542L422K189L5171M3213
15685b4721Q25L7231L4315l063n0762m4359j083N7545K5065m0911M2756M4776
15673G7614q76l0957p853K9974j2946n3047l1148o5112l731L8917K1548M1675
15661D058N4772k4657n4317R587j1078o26j3846J5103L4418r32k2839k1349m2753
15648g4459J1092J1353M4101p574j3439k4432n5811J917k1375m20L1421M1308
15636e6318m878L7209J701r503J2799M8268K6802j0414p7482m6204J5940J9657
15624d2423n403J8274K5872o921m5058m5019p189J8510L5036p703K2147M9460
15612I583k8030q325N0235m31j2240p515m6518l361L6326l0087n3046M8417P201
$$ plain form
15599 -37791 -69013 -25494 -29066 -108429 -151441 -151581 -174530 -164148 -119491 -79305 -32954 -39502
15587 -39502 -64992 -69330 -22605 -26351 -64976 -89843 29853 60125 7740 -26200 -2816 12
15575 12 -37932 5546 -24094 -112066 -147260 -114098 -73216 -60326 -87003 -26523 10355 5418
15563 5418 5129 -12776 -1214 13331 -15669 -77508 -72310 -57183 -24594 -11293 -49246 -70433
15551 -70433 -80726 -24146 51855 81874 28062 8248 76140 96754 129332 101701 89245 143200
15539 143200 186056 283290 288392 263012 218287 180300 150845 68053 26495 -5838 9933 -16432
15527 -16432 -22601 -79645 -44738 -22207 3224 52671 52914 40436 -3626 -2007 23478 82016
15515 82016 130009 192982 204412 203469 117665 62328 11896 -34936 -20956 -22105 -116098 -105656
$$ packed form
15599c7791l1222M3519l572p9363m3012j40k2949J0382M4657M0186M6351o548
15587c9502k5490m338M6725l746l8625k4867J19696L0272n2385l3940K3384K828
15575A2l7944M3478k9640q7972l5194L3162M0882J2890k6677O0480L6878m937
15563E418k89j7905J1562J4545k9000o1839N198J5127L2589J3301l7953k1187
15551g0433j0293N6580P6001L0019n3812j9814O7892K0614L2578k7631j2456N3955
15539A43200M2856R7234N102k5380m4725l7987k9455q2792m1558l2333J5771k6365
15527a6432o169n7044L4907K2531K5431M9447K43j2478m4062J619K5485N8538
15515H2016M7993O2973J1430r43q5804n5337n0432m6832J3980j149r3993J0442
$$ plain form
15503 -105656 -68120 6539 -28432 -56926 -49538 -60396 -131334 -162131 -138860 -93666 -58412 -52175
15491 -52175 -78132 -91271 -84686 -111000 -120561 -80519 -65183 -64781 -23960 -22098 -77199 -87590 -87367
15478 -87367 -72230 -27156 10032 -22283 -15230 -18861 -50779 -35276 -45005 -20192 -57488 -85340
15466 -85340 1090 82185 12911 -41930 -23815 34123 23040 9411 9568 -25672 -43097 -47556
15454 -47556 -12602 15294 1170 -53114 -38073 -33291 -3079 58025 25631 52348 65245 33635
15442 33635 3879 -4072 -77555 -119543 -32003 12881 15435 41720 9035 -41623 -44547 6663
15430 6663 55981 93536 88041 30182 -45398 -53222 -30907 -1613 -7654 -72017 -29440 97724
15418 97724 140518 103281 16322 35857 43645 4843 -2231 -26858 -65986 -89932 -102642 -50942
$$ packed form
15503a05656L7536P4659l4971k8494P388j0858p0938l0797K3271M5194L5254O237
15491e2175k5957j3139O585k6314r561M0042J5336M02M0821J862n5101j0391K23
15478h7367J5137M5074L7188l2315P053l631l1918J5503r729K4813l7296k7852
15466h5340Q6430Q1095o9274n4841J8115N7938j1083j3629J57l5240j7425m459
15454d7556L4954K7896j4124n4284J5041M782L0212O1104l2394K6717J2897l1610
15442C3635k9756p951p3483m1988Q7540M4884K554K6285l2685n0658k924N1210
15430F663M9318L7555n495n7859p5580p824K2315K9294o041o4363M2577J27164
15418I7724M2794l7237q6959J9535P788l8802p074k4627l9128k3946j2710N1700
$$ plain form
15406 -50942 10104 -24485 -64663 -44299 -42383 -61667 -110534 -106585 -59469 -7485 980 -33319
15394 -33319 -38127 -65798 -108519 -97009 -61676 -68481 -118287 -146105 -158479 -128642 -101714 -65552
15382 -65552 -1199 -12469 -17068 -6446 15215 -15913 -19329 -32216 -11770 -38037 -5473 35978
15370 35978 -26270 -89267 -66718 -43849 -62569 -60661 -76730 -56640 -55539 -42132 10746 87928
15358 87928 120693 84878 46713 -15735 25134 39630 -15573 -1265 6938 -35494 -19090 -52467
15346 -52467 -56224 -60122 -79317 -78492 -40021 -49828 -63072 -27384 -15304 24768 17847 -79151 -139208
15333 -139208 -86015 -54904 -78673 -117834 -133476 -110898 -62296 13359 10211 -17207 -33001 31575
15321 31575 64021 42842 22227 37754 44614 24017 -11329 -6611 -2825 -42615 -43767 -17068
$$ packed form
15406e0942O1046l4589m0178K0364J916j9284m8867L949M7116N1984Q465l4299
15394c3319m808k7671m2721J1510L5333o805m9806k7818j2374K9837K6928L6162
15382f5552O4353j1270m599J0622K1661l1128l416j2887K0446k6267L2564M1451
15370C5978o2248o2997K2549K2869j8720J908j6069K0090J101J3407N2878P7182
15358H7928L2765l5815l8165o2448M0869J4496n5203J4308Q203m2432J6404l3377
15346e2467l757l898j9195Q25L8471r807j3244L5688J2080M0072o921r6998o0057
15333a39208N3193L1111k3769l9161j5642K2578M8602P5655l148k7418j5794O4576
15321C1575L2446k1179k0615J5527O860k0597l5346M718L786l9790j152K6699
$$ plain form
15309 -17068 -37091 -36974 -58823 -29191 -6012 -2313 -31530 8697 42345 1176 -19194 18448
15297 18448 -8751 -6611 -16244 -31050 -4737 6778 -10759 -12232 7865 7021 18908 24743 58379
15284 58379 33821 28321 12444 -86393 -107789 -42211 -40087 13723 38499 30646 -35974 -46916
15272 -46916 -5651 -11466 -8955 -36064 -56578 21122 115880 86856 56816 59618 14898 -9225
15260 -9225 -51716 -78592 -120441 -114490 -121030 -49793 -130 14861 7971 -56136 -67951 -26648
15248 -26648 -52486 -20534 15279 -14352 -48635 -79506 -67631 -95587 -48353 1071 -3629 -34146
15236 -34146 -98267 -110940 -15243 6873 -12253 -27615 -76535 -111742 -47995 18908 75491 88469
15224 88469 88963 62587 6902 -66144 -87853 -36491 -38144 -8008 -44091 -62647 -56572 -28105
$$ packed form
15309a7068k0023J17k1849K9632K3179L699k9217M0227L3648m1169k0370L7642
15297A8448k7199K140r633j4806K6313J1515j7537j473K0097q44J1887N835L3636
15284E8379k4558n500j5877r8837k1396O5578K124N3810K4776p853o6620j0942
15272d6916M1265n815K511k7109k0514P7700R4758k9024l0040K802m4720k4123
15260i225m2491k6876m1849N951o540P1237M9663J4991o890o4107j1815M1303
15248b6648k5838L1952L5813k9631l4283l0871J1875k7956M7234M9424m700l0517
15236c4146o4121j2673R5697K2116j9126j5362m8920l5207O3747O6903N6583J2978
15224H8469M94k6376n5685p3046k1709N1362j653L0136l6083j8556O075K8467
$$ plain form
15212 -28105 -46541 -68532 -47999 -9641 56375 84064 47410 42963 75563 50062 5944 -14491
15200 -14491 24351 121926 149455 92449 11978 4207 67024 51792 22695 -17770 26008 7571
15188 7571 -42279 -95555 -167199 -125183 -150428 -114122 -100558 -97028 -82194 -58403 -49600 -74952
15176 -74952 -93839 -104423 -102212 -75492 -65510 -70488 -91890 -45101 -14132 -30879 -35300 13089
15164 13089 6540 -8811 2257 30973 28625 50891 16224 -42910 -48425 57768 35554 -81574
15152 -81574 -38152 -15137 -14540 -1893 5865 -20252 17115 43621 70541 -3234 -103406 -110767
15140 -110767 -49705 -65073 -63388 -18600 33835 25287 -28683 -54742 -91947 -113319 -54933 -70924
15128 -70924 -81842 -64320 -55627 -66033 -71310 -63080 -85966 -110841 -111149 -52608 17621 22716 -8241
$$ packed form
15212b8105j8436k1991K0533L8358O6016K7689l6654m447L2600k5501m4118k0435
15200a4491L8842R7575K7529n7006q0471p771O2817j5232k9097m0465M3778j8437
15188G571m9850n3276p1644M2016k5245L6306J3564L530J4834K3791Q803k5352
15176g4952j8887j0584K211K6720R982m978k1402M6789L0969j6747m421M8389
15164A3089o549j5351J1068K8716k348K2266l4667n9134n515J06193k2214j17128
15152h1574M3422K3015N97J2647P758k6117L7367K6506K6920p3775j00172p361
15140a10767O1062j5368J685M4788N2435q548n3970k6059l7205k1372N8386j5991
15128g0924j0918J7522Q693j0406n277Q230k2886k4875l08N8541P0229N095l0957
$$ plain form
15115 -8241 6894 31929 15059 -65571 -68268 -38869 -39352 -92322 -74769 -66465 -34614 -40355 -61197
15102 -61197 -44871 4961 40063 -1959 -61553 -81117 -46727 26425 75579 70292 51236 -5886
15090 -5886 5628 29106 63033 69820 68425 38202 4870 -52807 -56849 14442 -9508 -81535
15078 -81535 -82927 -25431 25268 14183 -10414 -5112 32054 48526 -17893 -34736 16988 9596
15066 9596 -39775 -43234 -15649 -12170 -16325 -62020 -99384 -51716 41387 63690 27916 4612
15054 4612 42901 73700 -3509 -43069 -46447 -54045 -69491 -41570 10338 -7817 27046 23524
15042 23524 36017 18600 31913 -2553 -46991 -54811 3725 -18577 -59257 -84040 -74667 -94159
15030 -94159 -113680 -96643 -34883 10055 -22017 -70499 -60742 -68572 -105104 -40473 -39709 -85137
$$ packed form
15115h241J5135K5035j6870q0630k697K9399m83n2970J7553Q304L1851n741k0842
15102f1197J6326M9832L5102m2022n9594j9564L4390P3152M9154n287j9056n7122
15090e886J1514K3478L3927O787j395l0223l3332n7677m042P1291k3950p2027
15078h1535j392N7496N0699j1085k4597N302L7166J6472o6419j6843N1724p392
15066I596m9371l459K7585L479m155m5695l7364M7668R3103K2303l5774k3304
15054D612L8289L0799p7209l9560l378p598j5446K7921N1908j8155L4863l522
15042B3524J2493j7417J3313l4466m4438p820N8536k2302m0680k4783R373j9492
15030i4159j9521J7037O1760M4938l2072m8482R757p830l6532O4631P64m5428
$$ plain form
15018 -85137 -88446 -87891 -47708 -47702 4836 64647 76097 10962 -68882 -92011 -26155 14186 14684
15005 14684 60724 23358 -16722 -43818 -21295 29022 52401 -488 -29038 -26913 -59633 -78101
14993 -78101 -97408 -33039 -8449 9294 -20481 -20031 -24040 25565 -15023 -10382 -24901 -13501
14981 -13501 -7213 -37789 -54185 -85005 -80004 -71013 -34668 1841 -33325 -67034 -105151 -97175
14969 -97175 -71048 -47138 -15360 -18410 -84627 -85376 -85243 -61590 -79861 -73258 -45812 -4267 -34375
14956 -34375 -25962 4326 36468 16880 -9876 -15403 35731 57161 70831 43077 60567 35746
14944 35746 3635 8978 59900 61862 39534 -7483 -39635 -24190 -31363 -19149 -52524 -43703
14932 -43703 33726 24572 13376 -23804 26364 21660 -22977 -29039 -41750 -132507 -182053 -197496
$$ packed form
15018h5137l309N55M0183ON2538N9811J1450o5135p9844k3129O5856M0341M98
15005A4684M6040l7366m0080k7096K2523N0317K3379n2889k8550K125l2720j8468
14993g8101j9307O4369K4590J7743k9775M50m009M9605m0588M641j4519J1400
14981a3501O288l0576j6396l0820N001Q991L6345L6509l5166l3709l8117P976
14969i7175K6127K3910L1778l050o6217p49J33K3653j8271O603K7446M1545l0108
14956c4375Q413L0288L2142j9588k6756n527N1134K1430J3670k7754J7490k4821
14944C5746l2111N343N0922J962k2328m7017l2152J5445p173J2214l3375Q821
14932d3703P7429r154j1196l7180N0168m704m4637o062j2711r0757m9546j5443
$$ plain form
14920 -197496 -143500 -110237 -41937 30215 77332 52033 50202 27828 1679 -35422 -11449 20510
14908 20510 22849 32713 49625 33825 -24196 -65790 -76454 -7209 36902 -2450 -4602 33028
14896 33028 89046 39027 1174 -15676 -27703 -32562 -38955 -25987 14233 -8624 27715 70345
14884 70345 43895 9014 -37003 -86097 -67985 -50866 -27421 -32918 -68613 -7508 -44287 -134613
14872 -134613 -146722 -64661 -75796 -123510 -88283 -85357 -102115 -36091 -32211 -34631 21483 65406
14860 65406 51980 -23568 -19589 48516 45915 -2780 -43965 2797 9494 15890 10748 -4290 -45191
14847 -45191 -28883 20536 -5745 -22853 -23163 10335 3542 -3651 -18373 -79 3968 43317 42246
14834 42246 69550 20089 59265 72395 37363 -8902 5598 11930 58328 4124 -114711 -126213
$$ packed form
14920a97496N3996L3263O8300P2152M7117k5299j831k2374k6149l7101K3973L1959
14908B0510K339R864J6912j5800n8021m1594j0664O9245M4111l9352k152L7630
14896C3028N6018n0019l7853j6850j2027m859o393J2968M0220k2857L6339M2630
14884G0345k6450l4881m6017m9094J8112J7119K3445n497l5695O1105l6779r0326
14872a34613j2109Q2061j1135m7714L5227K926j6758O6024L880k420N6114M3923
14860F5406j3426p5548L979O8105k601m8695m1185M6762O697O396n142j5038m0901
14847d5191J6308M9419k6281j7108l10L3498o793p193j4722J8294M047L9349j071
14834D2246K7304m9461L9176J3130l5032m6265J4500O332M6398n4204j18835j1502
$$ plain form
14822 -126213 -91933 13492 65186 39777 -31021 -140833 -105076 -51488 -41258 -85359 -45823
14811 -45823 6091 14370 913 -15348 -50469 -153975 -168494 -168647 -147917 -92350 -104222 -79903
14799 -79903 -21621 38364 34255 21909 -28136 -22494 -12103 14232 -38721 -69672 -56753 -47528
14787 -47528 -723 18486 74388 100024 62785 50127 58846 36885 35239 48449 45016 -8831
14775 -8831 -68040 -66261 -2725 6078 -27610 -67890 -121501 -73978 10171 16087 -44268 -35986 10124
14762 10124 -24524 26353 70430 16868 -68092 -92037 -18935 32100 28179 21276 70869 106541
14750 106541 44554 -19656 -87270 -62507 -15333 3718 -27061 -27448 53313 96933 42170 57145
14738 57145 45296 37132 -6884 -64887 -84054 -120848 -153642 -105018 -82594 -51849 -64889 -80082
$$ packed form
14822a26213L4280J05425N1694k5409p0798j09812L5757N3588J0230m4101L9536
14811d5823N1914Q279j3457j6261l5121j03506j4519j53K0730N5567j1872K4319
14799g9903N8282N9985m109j2346n0045N642J0391K6335n2953l0951J2919R225
14787d7528M6805J9209N5902K5636l7239j2658Q719k1961j646J3210l433n3847
14775h831n9209J779O3536Q803l3688m0280n3611M7523Q4149N916o0355Q282M6110
14762A0124l4648N0877M4077n3562q4960k3945P3102N1035l921o903M9593L5672
14750A06541o1987o4210o7614K4763M7174J9051l0779l87Q0761M3620n4763J4975
14738E7145j1849q164m4016n8003j9167l6794l2794M8624K2424L0745j3040j5193
$$ plain form
14726 -80082 -115707 -166418 -103257 -43160 -5748 38588 23665 -20614 -30805 -44084 -90188 -13807
14714 -13807 23220 9909 41179 28076 17791 -29736 -38310 15908 51893 47508 35767 23510
14702 23510 -37844 -58869 -56858 -20404 -15520 -58200 -77816 -71204 -49805 -59050 -82890 -143425
14690 -143425 -119680 -68666 -91845 -120932 -81250 26634 -17946 -41413 -75003 -48153 -79103
14679 -79103 -100635 -124105 -70791 -2703 -3548 10554 44235 -13140 -29406 -72483 -95311 -66710
14667 -66710 -40191 -34179 -18899 68301 7329 12026 43868 40833 -38941 -116570 -116708 -106640 -131991
14654 -131991 -99103 -92321 -76571 -100964 -116275 -47338 15047 -21165 -66472 -108804 -27260 -28212
14642 -28212 -73563 -68595 -55678 -20945 -17900 -12128 -49020 -10376 10782 -25826 -39683 -76224
$$ packed form
14726h0082l5625n0711O3161O0097L7412M4336j4923m4279j0191j3279m6104P6381
14714a3807L7027j3311L1270j3103j0285m7527q574N4218L5985m385j1741j2257
14702B3510o1354k1025K011L6454M884m2680j9616O612K1399r245k3840o0535
14690a43425K3745N1014k3179k9087L9682J07884m4580k3467l3590K6850l0950
14679g9103k1532k3470N3314O8088q45J4102L3681n7375j6266m3077k2828K8601
14667f6710K6519O012J5280Q7200o0972M697L1842l035p9774p7629j38J0068k5351
14654a31991L2888O782J5750k4393j5311O8937O2385l6212m5307m2332Q1544r52
14642b8212m5351M968J2917L4733L045N772l6892L8644K1158l6608j3857l6541
$$ plain form
14630 -76224 -75047 -85410 -46964 -35647 -103133 -122574 -85204 -19261 4179 -6987 -16333 -32104
14618 -32104 -75419 -103479 -115355 -92707 -79230 -60221 9657 29756 -35399 -70265 -94787 -71878
14606 -71878 -37152 -64270 -93095 -92490 -85958 -113968 -40121 28857 20721 -44279 -53124 -13185 -23866
14593 -23866 -81832 -98546 -73736 -11338 -43893 -42288 28490 36989 52770 55009 31433 25534
14581 25534 7283 -43424 -56930 -24882 -38615 -44773 -27187 -45054 -88310 -95527 -16497 -14215
14569 -14215 -8945 -71854 -77092 -65778 -56820 -73561 -100828 -120438 -96013 -36570 -21863 -55835
14557 -55835 -75278 -16401 28780 39525 31406 47014 50626 45621 62598 12904 -51155 -44654
14545 -44654 36378 6712 17955 -16802 -62772 -29376 -50529 -38385 3013 16529 34893 -13851
$$ packed form
14630g6224J177j0363L8446J1317o7486j9441L7370O5943K3440j1166r346j5771
14618c2104m3315k8060j1876K2648J3477J9009O9878K0099o5155l4866k4522K2909
14606g1878L4726k7118k8825O05O532k8010P3847O8978q136o5000q845L9939j0681
14593b3866n7966j6714K4810O2398l2555J605P0778Q499J5781K239k3576n899
14581B5534j8251n0707j3506L2048j3733o158J7586j7867m3256p217P9030K282
14569a4215N270o2909n238J1314Q958j6741k7267j9610K4425N9443J4707l3972
14557e5835j9443N8877M5181J0745q119J5608L612n005J6977m9694o4059O501
14545d4654Q1032k9666J1243l4757m5970L3396k1153J2144M1398J3516J8364m8744
$$ plain form
14533 -13851 2780 -17656 -25295 -42458 -35500 12087 61951 128728 137412 125619 98994 16631
14521 16631 -92234 -69430 6125 -576 10968 8086 -26380 -94734 -106942 -68003 10420 6116
14509 6116 24658 10805 -17294 -66738 -63464 -386 10571 -24791 -78477 -37058 -14115 -26301
14497 -26301 -3919 -9859 -66415 -67797 852 -1642 26659 19625 4453 -3247 25592 11564 -10366
14484 -10366 8538 -49217 -49589 -2296 44192 49909 69189 56878 48927 58282 52369 -17715 -103374
14471 -103374 -104150 -36629 -41489 -41144 -51471 -13947 56728 45863 -5911 -54343 -115738 -125634 -64634
14458 -64634 -7807 28549 55916 41973 16028 -19509 -50515 -68735 -49254 -42527 -42906 32
14446 32 35972 17717 -39947 -41918 -36404 46925 37311 9853 48676 48539 -10804 -62756 -6002
$$ packed form
14533a3851J6631k0436p639j7163O958M7587M9864O6777Q684j1793k6625q2363
14521A6631j08865K2804P5555o701J1544k882l4466o8354j2208L8939P8423m304
14509F116J8542j3853k8099m9444L274O3078J0957l5362n3686M1419K2943j2186
14497b6301K2382n940n6556j382O8649k494K8301p034j5172p700K8839j4028k1930
14484a0366J8904n7755l72M7293M6488N717J9280j2311p951R355n913p0084q5659
14471a03374p76O7521m860L45j0327L7524P0675j0865n1774m8432o1395r896O1000
14458f4634N6827L6356K7367j3943k5945l5537l1006j8220J9481O727l79M2938
14446C2L5940j8255n7664j971N514Q3329r614k7458L8823j37n9343n1952N6754
$$ plain form
14433 -6002 26745 49756 56799 36963 34448 4428 -25272 23012 27794 -989 2837 27840 22992
14420 22992 -1466 -27509 -6951 -7762 5895 -4042 -60873 -77082 -43100 -19790 6988 24591
14408 24591 43127 1111 765 27489 14717 -25974 -47641 -52987 -7328 -20498 -72596 -107577
14396 -107577 -105831 -71639 -46187 -243 10258 18619 -3264 -31915 -57276 -125527 -129098 -72325
14384 -72325 -34326 -5650 -9314 28908 20193 -23896 -60385 -63533 -77855 -30184 -15013 -2746
14372 -2746 59691 96954 54438 9470 14478 -7755 -24501 -50915 -40484 -2946 62213 41190
14360 41190 10922 -6034 -37744 6580 -3232 -91020 -125977 -112833 -56922 -36825 -40118 -59468
14348 -59468 -82018 -106715 -140717 -85656 -59308 -79274 -93598 -80425 -125401 -109052 -132602 -120193
$$ packed form
14433f002L2747K3011P043j9836k515l0020k9700M8284M782k8783L826K5003m848
14420B2992k4458k6043K0558q11J3657r937n6831j6209L3982K3310K6778J7603
14408B4591J8536m2016l46K6724j2772m0691k1667n346M5659j3170n2098l4981
14396a07577J746L4192K5452M5944J0501Q361k1883k8651k5361o8251l571N6773
14384g2325L7999K8676l664L8222q715m4089l6489l148j4322M7671J5171J2267
14372b746O2437L7263m2516m4968N008k2233j6746k6414J0431L7538O5159k1023
14360D1190l0268j6956l1710M4324r812q7788l4957J3144N5911K0097l293j9350
14348e9468k2550k4697l4002N5061K6348j9966j4324J3173m4976J6349k3550J2409
$$ plain form
14336 -120193 -108099 -88950 -27612 -67125 -105583 -110982 -113005 -114380 -152577 -92105 -14939 1458
14324 1458 -18452 -22417 -19898 7104 -11535 -6649 34377 50787 83766 87965 98717 57218 62633
14311 62633 38363 14315 -42016 -20182 -62713 -66477 -82603 -38264 33548 55002 32972 18663
14299 18663 65492 68244 31207 -18134 11892 65020 42749 -46970 -83407 -58792 21053 40899
14287 40899 -9391 -3019 -6026 -34224 -34064 23644 9805 4731 -18050 -18207 -43343 -49097 -77254
14274 -77254 -169013 -184145 -154378 -129601 -159351 -96203 -67362 -43189 46710 78794 77093 94675
14262 94675 26245 -45296 -53641 -24965 -17850 -71834 -97791 1826 -33126 -79391 -54999 -14442
14250 -14442 -56208 -39886 -61414 -65876 -75237 -72924 -49709 -93506 -103696 -122455 -83113 -66942
$$ packed form
14336a20193J2094J9149O1338l9513l8458n399k023j375l8197O0472P7166J6397
14324A458j9910l965K519K7002j8639M886M1026J6410L2979M199J0752m1499N415
14311F2633k4270k4048n6331K1834m2531l764j6126M4339P1812K1454k2030j4309
14299A8663M6829K752l7037m9341L0026N3128k2271q9719l6437K4615P9845J9846
14287D0899n0290O372l007k8198J60N7708j3839n074k2781j57k5136n754k8157
14274g7254r1759j5132K9767K4777k9750O3148K8841K4173Q9899L2084j701J7582
14262I4675o8430p1541q345K8676P115n3984k5957R9617l4952m6265K4392M0557
14250a4442m1766J6322k1528m462r361K313K3215m3797j0190j8759L9342J6171
$$ plain form
14238 -66942 -53168 -13739 -30453 -59772 -34650 -26565 25031 63570 64128 44164 94317 70059
14226 70059 35220 -32897 -77642 -42352 25749 59419 34928 23847 89870 63842 70231 37224
14214 37224 -7399 -82465 -38518 49235 43881 -8974 -58502 -38889 -28587 3191 -42960 -35949
14202 -35949 -37998 -45538 -19317 -24195 -15272 -20024 -16371 -24036 -86031 -33767 -11282 -20736 -16310
14189 -16310 -44095 -40614 -2610 36857 65077 -26269 -5464 10360 -64089 -85207 -67043 -29327
14177 -29327 -36081 -89793 -74533 -21941 6812 53811 77868 -5424 -43500 -55489 -123580 -117418
14165 -117418 -84232 -17933 21912 19617 34314 98241 126577 127778 68739 33962 43591 33611
14153 33611 29503 2055 -73404 -106729 -83529 -105828 -94826 -39350 -27513 1148 44429 -15552
$$ packed form
14238f6942J3774L9429j6714k9319K5122Q085N1596L8539N58j9964N0153k4258
14226G0059l4839o8117m4745L5290O8101L3670k4491j1081O6023k6028O389l3007
14214C7224m4623p5066M3947Q7753n354n2855m9528J9613J0302L1778m6151P011
14202c5949k049p540K6221m878Q923m752L653p665o1995N2264K2485r454M426
14189a6310k7785L481L8004L9467K8220r1346K0805J5824p4449k1118J8164L7716
14177b9327o754n3712J5260N2592K8753M6999K4057q3292l8076j1989o8091O162
14165a17418L3186O6299L9845k295J4697O3927K8336J201n9039l4777R629r980
14153C3611m108k7448p5459l3325K3200k2299J1002N5476J1837K8661M3281n9981
$$ plain form
14141 -15552 -91007 -87913 -99172 -89541 19457 15662 38332 84591 46504 7418 23189 61589
14129 61589 36379 -28818 -30642 -12245 -27568 -41908 -15408 -27596 -27034 -42970 -55359 -17503
14117 -17503 64871 67134 27462 34835 58069 72377 56179 54031 57757 73166 68697 71316 95751
14104 95751 74026 58676 70314 68358 91119 90958 32731 16211 51627 71802 -14789 -22208
14092 -22208 22195 97851 171007 166927 193784 146454 104509 111591 56668 50568 115719 126540
14080 126540 133493 125951 138623 136553 144295 117247 53767 79778 95324 84276 91927 132219
14068 132219 115948 120871 120808 125495 69066 48468 45708 42138 57471 77176 76912 121589 72966
14055 72966 -9381 -9265 -7033 49730 95883 83125 84150 98951 114968 80544 83246 115521 112051
$$ packed form
14141a5552p5455L094j1259R631J08998l795K2670M6259l8087l9086J5771L8400
14129F1589k5210o5197j824J8397j5323j4340K6500j2188N62j5936j2389L7856
14117a7503Q2374K263l9672P373K3234J4308j6198k148L726J5409m469K619K4435
14104I5751k1725j5350J1638j956K2761j61n8227j6520L5416K0175q6591p419
14092b2208M4403P5656P3156m080K6857m7330m1945P082n4923o100O5151J0821
14080A26540O953p542J2672k070P742k7048o3480K6011J5546j1048P651M0292
14068A32219j6271M923o3M687n6429k0598k760l570J5333J9705k64M4677m8623
14055G2966q2347J16K232N6763M6153j2758J025J4801J6017l4424K702L2275l470
$$ plain form
14042 112051 95163 17824 10218 5851 -14784 18965 74517 86928 -34644 -86189 -88694 -105002
14030 -105002 -28148 19660 -21109 -20236 -23051 -49485 -46225 1450 54218 8774 -34553 -28784
14018 -28784 -11992 -27209 -26002 -2361 139 44735 80035 23705 33273 31089 18465 52135
14006 52135 5024 9739 1006 2640 15502 28488 33884 91376 99376 86285 40159 2496 31308
13993 31308 34969 -4135 41895 21301 14941 18901 41052 65953 65684 109317 44164 -2700 -25065
13980 -25065 -40675 -64428 -67689 -41496 17963 30927 -28582 -3345 10358 9188 26688 -39591
13968 -39591 -72220 -20403 78254 29789 -30282 -29395 -32115 -44005 -13697 -17201 -70919 -58204
13956 -58204 -64408 -55332 -48877 -18717 34487 41365 20421 -53291 -74126 -38979 13555 69451
$$ packed form
14042A12051j6888p7339p606m367k0635L3749N5552J2411j21572n1545k505j6308
14030a05002P6854M7808m0769Q73k815k6434L260M7675N2768m5444m3327N769
14018b8784J6792j5217J207K3641K500M4596L5300n6330R568k184j2624L3670
14006E2135m7111M715q733J634J2862J2986N396N7492Q000j3091m6126l7663K8812
13993C1308L661l9104M6030k0594o360L960K2151K4901k69M3633o5153m6864k2365
13980b5065j5610k3753l261K6193N9459J2964n9509K5237J3703j170J7500o6279
13968c9591l2629N1817R8657m8465o0071Q87k720j1890L0308l504n3718J2715
13956e8204o204R076O455L0160N3204O878k0944p3712k0835L5147N2534N5896
$$ plain form
13944 69451 64633 55073 72078 86619 23432 25500 35475 63279 69073 56264 79064 93346 41817
13931 41817 384 -20892 5362 65 -39320 -58017 -91382 -54267 -28495 -23124 -28132 -18986
13919 -18986 -32815 -37013 -24713 -77717 -97923 -55487 -60428 -76184 -83749 -68553 -79649 -68615
13907 -68615 10745 74763 76509 59803 23133 78876 40999 -7443 -19373 18069 58647 102401
13895 102401 124245 95604 1328 8829 43951 -18935 -87787 -97209 -100188 -81591 -82716 -25773
13883 -25773 15743 33448 15425 40818 36721 37663 9643 27373 20705 335 -37989 -102085
13871 -102085 -109370 -93217 -103091 -107350 -42940 -8673 8043 16164 15337 25378 43407 64649 61184
13858 61184 55804 66501 52822 76363 74190 105223 53053 -26772 -16288 18114 4531 11117
$$ packed form
13944F9451m818r560J7005J4541o3187K068R975K7804N794j2809K2800J4282n1529
13931D1817m1433k1276K6254n297l9385j8697l3365L7115K5772N371n008R146
13919a8986j3829m198J2300n3004k0206M2436m941j5756p565J5196j1096J1034
13907f8615P9360O4018J746j6706l6670N5743l7877m8442j1930L7442M0578M3754
13895A02401K1844k8641r4276P501L5122o2886o8852r422k979J8597j125N6943
13883b5773M1516J7705j8023K5393m097R42k8020J7730o668k0370l8324o4096
13871a02085p285J6153r874m259O4410L4267J6716Q121q27J0041J8029K1242l465
13858F1184n380J0697j3679K3541k173L1033n2170p9825J0484L4402j3583O586
$$ plain form
13846 11117 1240 860 -30774 -55699 -72817 -24081 27895 58378 78435 53141 80108 69548
13834 69548 16048 3242 15380 32602 13394 -4325 53987 84450 56809 -28496 -94255 -66621
13822 -66621 -11149 -27205 -58219 -41048 12901 56556 50915 -3078 -6733 35052 128494 146415
13810 146415 130791 26663 -25558 17276 -25389 -29481 -2122 4950 -8486 257 -6825 27989
13798 27989 22591 17231 31440 37204 56797 22160 -36092 -32205 23824 51077 5707 12233 9122
13785 9122 34591 54708 34905 31391 -3972 -63921 -96239 -77686 13714 33308 18899 -21314
13773 -21314 -84759 -96420 -38349 18538 38455 -16842 -1970 -21139 -90680 -93242 -87808 14671
13761 14671 6672 -83289 -127573 -93150 -69194 -47614 -42439 -81692 -66653 -106049 -86642 -2965
$$ packed form
13846A1117r877l80l1634k4925j7118M8736N1976L0483K0057k5294K6967j0560
13834F9548n3500j2806J2138J7222j9208j7719N8312L0463k7641q5305o5759K7634
13822f6621N5472j6056l1014J7171N3949M3655n641n3993l655M1785R3442J7921
13810A46415j5624j04128n2221M2834m2665m092K7359P072j3436Q743p082L4814
13798B7989n398n360J4209N764J9593l4637n8252L887N6029K7253m5370O526l111
13785I122K5469K0117j9803l514l5363n9949l2318J8553R1400J9594j4409m0213
13773b1314o3445j1661N8071N6887J9917n5297J4872j9169o9541k562N434J02479
13761A4671p999q9961m4284L4423K3956K1580N175l9253J5039l9396J9407Q3677
$$ plain form
13749 -2965 17304 36520 11139 12161 72922 108202 115122 137273 110394 126005 131943 98546
13737 98546 42502 -28190 -53864 -35189 12682 36149 5651 -47039 -84184 -57004 -54696 -32196
13725 -32196 15217 57793 48104 54063 65451 15168 33299 29620 -24457 -24006 -69835 -71164 -42533
13712 -42533 -51645 -14299 8651 5608 3273 39117 83967 114863 125671 89419 26616 32056
13700 32056 -15929 -39195 -10489 -46873 -38227 -35419 19139 14932 13526 -14573 -64476 -69007 -76426
13687 -76426 -12639 -7290 -15256 -14379 33708 75826 106657 93568 55068 62171 76397 53671 17923
13674 17923 -42077 3896 97381 54224 17027 3956 5995 -23253 -20878 -17918 16657 98027
13662 98027 130651 89880 82776 83662 39364 -12105 -44387 -80699 -23775 -28765 37654 86517
$$ packed form
13749b965K0269J9216k5381J022O0761L5280O920K2151k6879J5611N938l3397
13737I8546n6044p0692k5674J8675M7871K3467l0498n2690l7145K7180K308K2500
13725c2196M7413M2576r689N959J1388n0283J8131l679n4077M51m5829j329K8631
13712d2533r112L7346K2950l043k335L5844M4850L0896J0808l6252o2803N440
13700C2056m7985k3266K8706l6384Q646K808N4558m207j406k8099m9903m531p419
13687g6426O3787N349p966Q77M8087M2118L0831j3089l8500P103J4226k2726l5748
13674A7923o0000M5973R3485m3157l7197j3071K039k9248K375K960L4575Q1370
13662I8027L2624m0771p104Q86m4298n1469l2282l6312N6924m990O6419M8863
$$ plain form
13650 86517 119107 162535 138125 88597 32565 79628 62548 48723 30020 43443 59136 41307
13638 41307 59898 87737 22549 2710 15286 -45897 -61009 -46994 -70959 -114564 -123010 -157017
13626 -157017 -98770 -58402 -19509 34423 16600 -11191 27936 -1172 -8487 -10957 21199 43560
13614 43560 89402 86811 49944 27702 15351 -23760 109 4918 16666 8529 28981 13400
13602 13400 25594 14744 -67866 -86678 -22883 -20679 -30699 -34149 -26103 -26611 -43268 -123886 -172972
13589 -172972 -133420 -100090 -81312 -42135 -129011 -158048 -130347 -79698 -84240 -39022 -40889 -25275
13577 -25275 -4590 22555 10491 31041 83705 106041 18675 3559 41034 -27075 -40807 -101234
13565 -101234 -147964 -138814 -113000 -63726 -50292 -26271 10821 55311 56463 86467 142949 143506
$$ packed form
13650H6517L2590M3428k4410m9528n6032M7063j7080j3825j8703J3423J5693j7829
13638D1307J8591K7839o5188j9839J2576o1183j5112J4015k3965m3605q446l4007
13626a57017N8247M0368L8893N3932j7823k7791L9127k9108p315k470L2156K2361
13614D3560M5842k591l6867k2242j2351l9111K3869M809J1748q137K0452j5581
13602A3400J2194j0850q2610j8812O3795K204j0020l450Q046n08j6657q0618m9086
13589a72972L9552L3330J8778L9177q6876k9037K7701N0649m542M5218j867J5614
13577b5275K0685K7145j2064K0550N2664K2336q7366j5116L7475o8109j3732o0427
13565a01234m6730R150K5814M9274J3434K4021L7092M4490J152L0004N6482N57
$$ plain form
13553 143506 139554 95070 46598 80436 45702 56092 33836 27699 -24744 -72031 -77396 -31283
13541 -31283 -20417 -89215 -90302 -71257 -37371 -19179 -5558 5116 7456 5693 16830 10459
13529 10459 4531 14350 28490 27662 -25760 -62854 -68857 -64954 -40850 -33616 -33089 -19266 -26105 14391
13515 14391 925 -15076 -22909 -23525 577 12676 -16227 7610 18229 4942 667 -43081
13503 -43081 -23900 -35810 -44977 -4629 11658 7122 42749 89399 58091 40998 60754 76133
13491 76133 51371 -50581 -77457 -67662 -30071 -16076 -21501 26319 -9746 -8942 -3408 1310 51761
13478 51761 96836 117474 87263 115465 151577 165837 159042 149508 65457 -20339 -3373 -332
13466 -332 19749 20362 -52335 -71846 -59261 -67747 -50689 -6324 44023 10930 -7202 -26882 -25137
$$ packed form
13553A43506l952m4484m8472L3838l4734J0390k2256o137n2443m7287n365M6113
13541c1283J0866o8798j087J9045L3886J8192J3621J0674K340j763J1137o371
13529A0459n928R819J4140q28n3422l7094o003L903K4104P234N27J3823o839M0496
13515A4391j3466j6001p833o16K4102J2099k8903K3837J0619j3287m275m3748
13503d3081J9181j1910r167M0348J6287m536L5627M6650l1308j7093J9756J5379
13491G6133k4762j01952k6876R795L7591J3995n425M7820l6065Q04N534M718N0451
13478E1761M5075K0638l0211K8202L6112J4260o795r534q4051q5796J6966L041
13466c32K0081O13p2697j9511J2585q486J7058M4365N0347l3093j8132j9680J745
$$ plain form
13453 -25137 4364 22000 6575 -13094 20618 -22359 -106074 -73708 -16302 4260 -34359 -81015
13441 -81015 -35346 53924 56589 -17423 2874 -7515 25435 32714 -26068 -33962 -50591 40939
13429 40939 64648 -35024 -84023 -117034 -129093 -83712 -10414 5820 32096 67229 102218 103759
13417 103759 35456 49403 63179 60889 50489 77478 110991 75283 62701 75847 3143 -78914
13405 -78914 -72294 -45878 -7086 49875 71036 49630 41147 123526 88406 200 -39586 -35543
13393 -35543 -15487 -60307 -37196 -45572 30196 73141 75459 27735 -17502 29843 39922 89147
13381 89147 133536 127043 88704 110350 112560 53994 24247 32986 -37557 -118218 -58244 23262
13369 23262 4902 -9775 -14419 -51764 -100067 -127908 -115980 -61174 -40956 -6906 27761 77471
$$ packed form
13453b5137K9501J7636j5425j9669L3712m2977q3715L2366N7406K0562l8619m6656
13441h1015M5669Q9270K665p4012K0297j0389L2950P279n8782p894j6629R1530
13429D0939K3709r9672m8999l3011j2059M5381P3298J6234K6276L5133L4989J541
13417A03759o8303J3947J3776k290j0400K6989L3513l5708j2582J3146p2704q2057
13405g8914O620K6416L8792N6961K1161k1406q483Q2379l5120q8206l9786M043
13393c5543K0056m4820K3111q376P5768M2945K318m7724m5237M7345J0079M9225
13381H9147M4389o493l8339K1646K210n8566k9747Q739p0543q0661N9974Q1506
13369B3262j8360j4677m644l7345m8303k7841J1928N4806K0218L4050L4667M9710
$$ plain form
13357 77471 89655 121395 82756 -2529 -44213 -11241 17818 37102 62546 68176 67468 84784
13345 84784 82848 47069 13890 11455 42430 83549 79088 49568 82963 97208 64636 44181
13333 44181 70056 76276 83530 77213 96687 96908 73052 60887 58375 40981 5108 -14457 34005
13320 34005 79037 121351 93332 57182 21301 -7135 30692 45116 -24451 -12939 7719 -14059
13308 -14059 -9643 22473 44456 23953 10692 30927 53788 14817 11118 22125 19116 -71695
13296 -71695 -44635 -39337 1513 -8904 16076 50252 93533 120562 159714 187784 178463 144300
13284 144300 81831 87930 71039 32652 29771 28277 68489 61719 66902 25879 39539 46561 64811
13271 64811 34243 22444 32457 64857 67788 12500 -20969 -57503 -56720 -41632 66326 131067
$$ packed form
13357G7471J2184L1740l8639q5285m1684L2972K9059J9284K5444N630p08J7316
13345H4784j936l5779l3179k435L0975M1119m461k9520L3395J4245l2572k0455
13333D4181K5875O220P254o317J9474K21k3856j2165k512j7394l5873j9565M8462
13320C4005M5032M2314k8019l6150l5881k8436L7827J4424o9567J1512K0658k1778
13308a4059M416L2116K1983k0503j3261K0235K2861l8971l699J1007l009r0811
13296g1695K7060N298M0850j0417K4980L4176M3281K7029L9152K8070r321l4163
13284A44300o2469O099j6891l8387k881j494M0212o770N183m1023J3660P022J8250
13271F4811l0568j1799J0013L2400K931n5288l3469l6534P83J5088J07958O4741
$$ plain form
13259 131067 112704 131471 145688 90965 96290 99463 80976 80543 80132 46724 -12280 14500 78590
13246 78590 68384 17052 -8054 28802 109412 95791 85314 111301 103346 52508 22744 14747
13234 14747 3335 22127 51320 -11407 -14257 30116 121448 120133 93815 65950 11773 -6935
13222 -6935 23932 62218 89601 98834 100277 50917 47337 58910 47475 78141 32557 10846
13210 10846 12406 35392 96507 144621 175730 75684 -7717 47076 52047 43111 46029 52087
13198 52087 44510 34716 74789 103844 14951 -24209 29973 102028 73738 46037 39902 118942
13186 118942 117982 47100 44642 75862 112202 72154 -15 20165 40833 116399 123911 124255 162888
13173 162888 215402 249881 202673 141403 124836 104456 109289 116203 139523 218856 162283 49737
$$ packed form
13259A31067j8363J8767J4217n4723N325L173j8487m33m11l3408n9004K6780O4090
13246G8590j0206n1332k5106L6856Q0610j3621j0477K5987p955n0838k9764p997
13234A4747j1412J8792K9193o2727k850M4373R1332j315k6318k7865n4177j8708
13222f935L0867L8286K7383R233J443m9360l580J1573j1435L0666m5584k1711
13210A0846J560K2986O1115M8114L1109j00046q3401N4793M971q936K918O058
13198E2087p577r794M0073K9055q8893l9160N4182P2055k8290k7701o135P9040
13186A18942r60p0882k458L1220L6340m0048p2169K0180K0668P5566P512L44L8633
13173A62888N2514L4479m7208o1270j6567k0380M833O914K3320P9333n6573j12546
$$ plain form
13161 49737 92787 125630 214327 270427 330539 360619 423993 438603 429869 410789 401695 384938
13149 384938 327855 302372 302786 306436 245396 222571 269966 224687 178732 205007 246033 246615
13137 246615 234362 320486 362931 398624 469008 446434 388091 342084 380292 435553 435455 427791
13125 427791 488436 544860 567134 514420 447310 402911 378514 346637 317577 315977 330941 394672
13113 394672 399597 426708 487995 508502 434310 369239 346679 300758 243135 198918 189338 209703
13101 209703 227590 269328 280916 291506 299873 328298 338147 409406 503768 562228 587282 553306
13089 553306 458949 391482 371461 346578 269381 223997 239630 245942 240890 266431 255313 244690
13077 244690 232084 163471 140910 167952 207382 208328 226770 235137 255162 367735 470972 569898
$$ packed form
13161D9737M3050L2843Q8697N6100O0112L0080O3374J4610q734j9080r094j6757
13149C84938n7083k5483M14L650o1040k2825M7395m5279m5955K6275M1026N82
13137B46615j2253Q6124M2445L5693P0384k2574n8343m6007L8208N5261r8p664
13125D27791O0645N6424K2274n2714o7110m4399k4397l1877k9060j600J4964O3731
13113C94672M925K7111O1287K0507p4192o5071k2560m5921n7623m4217r580K0365
13101B09703J7887M1738J1588J0590Q367K8425R849P1259R4362N8460K5054l3976
13089E53306r4357o7467k0021k4883p7197m5384J5633O312n052K5541j1118j0623
13077B44690j2606o8613k2561K7042L9430R46J8442Q367K0025J12573J03237R8926
$$ plain form
13065 569898 656868 762480 783565 843066 837588 786364 698226 657201 651947 601818 448045
13054 448045 389668 318104 198958 163018 170381 201866 203345 158308 133406 124002 151748 161197
13042 161197 146686 45436 47150 96334 107825 118996 135266 137240 134313 79693 49224 36718
13030 36718 101184 66866 50985 94524 123979 104683 124735 131117 121967 51385 29841 5213
13018 5213 36477 57213 89674 74027 58269 82819 59446 64486 77496 99144 103538 70519
13006 70519 44608 30885 74089 106184 143702 199863 176628 133963 146682 145306 134887 132880
12994 132880 175336 206745 202576 147200 112975 52825 88271 89994 84351 153136 176719 140842
12982 140842 98946 94793 72068 79292 196083 197006 146478 154545 116745 69856 79239 127764
$$ packed form
13065E69898Q6970J05612K1085N9501n478n1224q8138m1025n254n0129j53773
13054D48045n8377p1564j19146l5940P363L1485J479m5037k4902r404K7746R449
13042A61197j4511j01250J714M9184J1491J1171J6270J974k927n4620l0469j2506
13030C6718O4466l4318j5881M3539K9455j9296K0052O382r150p0582k1544k4628
13018E213L1264K0736L2461j5647j5758K4550k3373N040J3010K1648M394l3019
13006G0519k5911j3723M3204L2095L7518N6161k3235m2665J2719j376j0419k007
12994A32880M2456L1409m169n5376l4225o0150L5446J723n643O8785K3583l5877
12982A40842m1896m153k2725P224J16791R23n0528Q067l7800m6889R383M8525
$$ plain form
12970 127764 143995 150801 111693 59859 44021 95588 127331 119061 125593 190336 208669 187008
12958 187008 236706 313533 246341 191439 132735 143614 145956 121721 68622 61770 54595 131208
12946 131208 191708 185196 130672 101837 96396 69157 71842 106411 98012 126708 136625 120563
12934 120563 53195 51419 136965 196832 173859 158411 202261 239421 253172 264990 234039 276227
12922 276227 296888 214119 148823 130303 169966 157072 165598 174337 209009 237016 191481 137791
12910 137791 156545 231691 333763 319823 312701 367167 343409 333304 324037 263880 272809 347157
12898 347157 371745 411632 473414 483763 546979 547474 528337 513589 501869 438404 422244 499188
12886 499188 476953 404490 408674 406751 398167 370869 385230 460107 412572 395601 416640 435632
$$ packed form
12970A27764J6231O806l9108n1834j5838N1567L1743q270O532O4743J8333k1661
12958A87008M9698P6827o7192n4902n8704J0879K342k4235n3099o852p175P6613
12946A31208O0500o512n4524k8835n441k7239K685L4569q399K8696R917j6062
12934A20563o7368j776Q5546N9867k2973j5448M3850L7160J3751J1818l0951M2188
12922B76227K0661q2769o5296j8520L9663j2894Q526Q739L4672K8007m5535n3690
12910A37791J8754P5146J02072j3940p122N4466k3758j0105r267o0157Q929P4348
12898C47157K4588L9887O1782J0349O3216M95j9137j4748j1720o3465j6160P6944
12886D99188k2235p2463M184j923q584k7298J4361P4877m7535j6971K1039J8992
$$ plain form
12874 435632 435261 400200 386935 406261 422619 468274 413975 299038 255969 277607 249617 291683
12862 291683 342771 459535 504320 422220 401555 469373 412323 343173 317628 295336 273947
12851 273947 329749 372846 348236 316858 356861 404292 434537 419907 393017 391078 373692 358480
12839 358480 374107 406044 466640 457223 469948 468134 435764 425647 487313 542703 573791 601569
12827 601569 602457 533757 454340 493425 549971 602119 669859 594164 576913 604717 584445 566092
12815 566092 557870 572438 554928 543601 527065 452236 398868 428456 497835 524633 548342 569315
12803 569315 598721 578645 558356 583111 632317 674928 565743 477288 516396 569454 611090
12792 611090 646024 613205 594135 599997 603490 586677 596671 644378 625237 599785 650153 656706
$$ packed form
12874D35632l71l5061j3265J9326J6358M5655n4299j14937m3069K1638k7990M2066
12862B91683N1088J16764M4785q2100k0665O7818n7050o9150k5545k2292k1389
12851B73947N5802M3097k4610l1378M0003M7431L0245j4630k6890j939j7386j5212
12839C58480J5627L1937O0596r417J2725j814l2370j0117O1666N5390L1088K7778
12827F01569Q88o8700p9417L9085N6546N2148O7740p5695j7251K7804k0272j8353
12815E66092q222J4568j7510j1327j6536p4829n3368K9588O9379K6798K3709K0973
12803E69315K9406k0076k0289K4755M9206M2611j09185q8455L9108N3058M1636
12792F11090L4934l2819j9070N862L493j6813R994M7707j9141k5452N0368O553
$$ plain form
12780 656706 675271 665670 717667 749682 731691 683883 660744 624624 606877 625776 669844 702808
12768 702808 746173 798984 813800 911916 939224 923818 923309 978565 916191 886684 881536 953482
12756 953482 1015228 1020331 1073815 1038048 990076 998534 995269 1013183 1020066 1069875 1044004 1099196
12744 1099196 1117698 1173760 1193724 1225098 1359169 1412649 1397706 1481362 1501211 1503977 1564630
12733 1564630 1645658 1658621 1713953 1807270 1925994 2103146 2222952 2395562 2587392 2806337
12723 2806337 3108265 3450863 3835323 4238941 4699091 5263520 5832022 6464827 7263719
12714 7263719 8203504 9303636 10645086 12412691 14689548 17620917 21638693 27073165
12706 27073165 34237284 43343529 53954833 64593121 73252631 77807126 75649846 67000312
$$ packed form
12780F56706J8565r601N1997L2015j7991m7808k3139l6120j7747J8899M4068L2964
12768G02808M3365N2811J4816R8116K7308j5406n09N5256o2374k9507n148P1946
12756I53482O1746N103N3484l5767m7972Q458l265J7914O883M9809k5871N5192
12744A099196J8502N6062J9964L1374J34071N3480j4943Q3656J9849K766O0653
12733A564630Q1028J2963N5332R3317J18724J77152J19806J72610J91830K18945
12723B806337L01928L42598L84460M03618M60150N64429N68502O32805P98892
12714G263719R39785J100132J341450J767605K276857K931369M017776N434472
12706B7073165P164119R106245J0611304J0638288Q659510M554495k157280q649534
$$ plain form
12698 67000312 55637171 44992571 36491922 30337455 26103741 23414625 21998130 21555468
12690 21555468 21875735 23071073 25119711 28055530 31906305 36572742 41698734 46582855
12682 46582855 50612082 53044868 53797057 53739798 54010347 55502408 58621264 63680311 70468224
12673 70468224 77936761 84392975 87951883 86968493 81192885 72555273 63817862 56724100
12665 56724100 52128652 49757590 49201937 49978627 51543344 53137946 54168399 54033573
12657 54033573 52308844 48952176 45058044 41709000 39437427 38314644 38220768 39382594
12649 39382594 41894160 45910894 51752028 59933346 71344909 87109859 107801441 132589677
12641 132589677 158467950 181061562 195508933 196570807 183760212 165587142 151264582
$$ packed form
12698F7000312j1363141j0644600q500649o154467m233714k689116j416495m42662
12690B1555468L20267J195338K048638K935819L850775M666437N125992M884121
12682D6582855M029227K432786P52189n7259K70549J492061L118856N059047O787913
12673G0468224P468537O456214L558908r83390n775608q637612q737411p093762
12665E6724100m595448k371062n55653P76690J564717J594602J030453j34826
12657E4033573j724729l356668l894132l349044k271573j122783r3876J161826
12649C9382594K511566M016734N841134Q181318J1411563J5764950K0691582K4788236
12641A32589677K5878273K2593612J4447371J061874j2810595j8173070j4322560
$$ plain form
12634 151264582 142876107 136674231 126274796 107500619 84048417 63113966 47711186
12627 47711186 37259644 30225041 25381068 21850636 19197097 17058991 15359719 14026152
12619 14026152 12978363 12107386 11201014 10190921 9200334 8261773 7362114 6613921 6010780
12610 6010780 5511724 4996682 4562771 4228815 4019760 3797670 3583603 3375634 3200011
12601 3200011 3014209 2901111 2773091 2590428 2444512 2397859 2314216 2218704 2085546 1992404
12591 1992404 1934154 1912756 1832757 1692756 1557820 1581412 1576534 1520958 1455191 1386164 1344563
12580 1344563 1374436 1342541 1283629 1241509 1221481 1190722 1141867 1103382 1111273 1071620 995542
12569 995542 912678 856561 878913 895006 895632 831116 795466 810097 796664 779457 756442 789689
$$ packed form
12634A51264582q388475o201876j0399435j8774177k3452202k0934451j5402780
12627D7711186j0451542p034603m843973l530432k653539k138106j699272j333567
12619A4026152j047789q70977r06372j010093r90587r38561q99659p48193o03141
12610F010780m99056n15042m33911l33956k09055k22090k14067k07969j75623
12601C200011j85802j13098j28020j82663j45916m6653q3643r5512j33158r3142
12591A992404n8250k1398p9999j40001j34936K3592m878n5576o5767o9027m1601
12580A344563K9873l1895n8912m2120k0028l0759m8855l8485P891l9653p6078
12569I95542q2864n6117K2352J6093O26o4516l5650J4631j3433j7207k3015L3247
$$ plain form
12557 789689 782036 721411 701046 675225 692425 656481 645172 653319 564629 529146 499482 479680
12545 479680 505678 535111 570510 558758 578058 549542 474471 387027 397437 439248 446332 452774
12533 452774 436393 400297 337027 389534 441625 497252 573103 563018 579847 615372 605289
12522 605289 632179 608870 550245 525105 462853 460567 493016 480408 480045 476969 527320 499119
12510 499119 444282 386495 400761 387772 310204 326490 349610 307976 268408 248530 192538
12499 192538 236577 230359 217580 205578 217264 210736 130290 64996 141559 203257 143721 107306
12487 107306 97175 109285 152649 123913 74076 89054 75318 70046 55868 70708 147978 229146
12475 229146 235382 209694 222922 189876 156773 131794 99902 127901 158330 140824 111701 115011
$$ packed form
12557G89689p653o0625k0365k5821J7200l5944j1309Q147q8690l5483k9664j9802
12545D79680K5998K9433L5399j1752J9300k8516p5071q7444J0410M1811P084O442
12533D52774j6381l6096o3270N2507N2091N5627P5851j0085J6829L5525j0083
12522F05289K6890k3309n8625k5140o2252k286L2449j2608l63l076N0351k8201
12510D99119n4837n7787J4266j2989p7568J6286K3120m1634l9568j9878n5992
12499A92538M4039o218j2779j2002J1686o528q0446o5294P6563O1698n9536l6415
12487A07306j0131J2110M3364k8736m9837J4978j3736n272j4178J4840P7270Q1168
12475B29146O236k5688J3228l3046l3103k4979l1892K7999L0429j7506k9123L310
$$ plain form
12463 115011 149079 132161 104178 163419 218055 241182 207887 164621 102100 60748 74475
12452 74475 52107 74621 112311 106225 66473 122203 136591 148355 174212 204873 219107 281879
12440 281879 276025 238455 211108 233038 228990 187300 226822 251599 234239 231639 184828 138159
12428 138159 147045 164050 145766 125891 178266 220864 209423 223640 241571 211199 157865 114573
12416 114573 163873 203837 156424 155230 202427 196622 169868 151384 135288 191554 235475 264238
12404 264238 314272 250801 225299 245926 293578 288258 262105 324871 379313 386799 353349 306664
12392 306664 257857 198243 138482 81384 44491 39675 66909 85474 77261 54698 87438 121555
12380 121555 152707 115240 139617 186564 166226 162067 198143 183326 166471 166824 235266 356167
$$ packed form
12463A15011L4068j6918k7983N9241N4636K3127l3295m3266o2521m1352J3727
12452G4475k2368K2514L7690o086l9752N5730J4388J1764K5857L0661J4234O2772
12440B81879n854l7570k7347K1930m048m1690L9522K4777j7360k600m6811m6669
12428A38159Q886J7005j8284j9875N2375M2598j1441J4217J7931l0372n3334m3292
12416A14573M9300L9964m7413j194M7197n805k6754j8484j6096N6266M3921K8763
12404B64238N0034o3471k5502K0627M7652n320k6153O2766N4442P486l3450m6685
12392C06664m8807n9614n9761n7098l6893m816K7234J8565q213k2563L2740L4117
12380A21555L1152l7467K4377M6947k0338m159L6076j4817j6855L53O8442J20901
$$ plain form
12368 356167 421561 452195 473645 502293 535501 503569 540062 663874 770243 913035 1239149
12357 1239149 1639001 2008947 2425075 2823045 3036041 2927034 2529295 2024780 1564903
12348 1564903 1147130 876932 711817 535606 449308 445857 399588 336219 334010 326165 319855
12337 319855 285841 242102 196334 180388 207999 171573 173434 189685 237283 227338 159405 147756
12325 147756 182331 183782 144681 150310 102138 51898 40206 5189 38663 62445 106128 149421
12313 149421 149872 53012 442 -7492 12442 33816 84025 74079 62892 43607 51803 -12894
12301 -12894 -31012 -65555 -55559 -57402 -23226 28325 45263 42598 16978 33265 71363 45344
12289 45344 18423 98638 104670 49781 37830 27757 484 49200 99800 67908 33381 51864
$$ packed form
12368C56167O5394L0634K1450K8648L3208l1932L6493J23812J06369J42792L26114
12357A239149L99852L69946M16128L97970K12996j09007l97739n04515m59877
12348A564903m17773k70198j65115j76211q6298l451m6269o3369k209p845o310
12337C19855l4014m3739m5768j5946K7611l6426J861J6251M7598r945o7933j1649
12325A47756L4575J451l9101N629m8172n0240j1692l5017L3474K3782M3683M3293
12313A49421M51r6860n2570p934J9934K1374N0209r946j1187j9285Q196o4697
12301a2894j8118l4543R996j843L4176N1551J6938k665k5620J6287L8098k6019
12289D5344k6921Q0215O032n4889j1951j0073k7273M8716N0600l1892l4527J8483
$$ plain form
12277 51864 45203 3825 14918 77955 57328 7457 10695 45877 69316 108296 167114 95806
12265 95806 61312 22988 4922 18499 560 2604 52676 102807 68795 45309 42513 75921
12253 75921 129520 136990 102558 106898 104565 125353 163398 225311 337247 441249 462558 445621
12241 445621 449361 390186 299959 293534 244665 275827 288524 257856 191147 193883 167893 158800
12229 158800 174342 221273 254285 250216 248160 286087 334669 328621 266535 252806 247924 306956
12217 306956 392027 451290 519126 611327 654216 707436 750254 744606 694495 734695 811524 859228
12205 859228 893307 913548 863071 813232 794165 760021 687280 570372 489682 398388 336877
12194 336877 342420 334903 353233 342894 330135 278327 257014 276478 293230 321757 326887 430784
$$ packed form
12277E1864o661m1378J1093O3037k0627m9871L238L5182K3439L8980N8818p1308
12265I5806l4494l8324j8066J3577j7939K044N0072N0131l4012k3486k796L3408
12253G5921N3599P470l4432M340k333K0788L8045O1913J11936J04002K1309j6937
12241D45621L740n9175r0227o425m8869L1162J2697l0668o6709K736k5990r093
12229A58800J5542M6931L3012m069k056L7927M8582o048o2086j3729m882N9032
12217C06956Q5071N9263O7836R2201M2889N3220M2818n648n0111M0200P6829M7704
12205H59228L4079K0241n0477m9839j9067l4144p2741j16908q0690r1294o1511
12194C36877N543p517J8330j0339j2759n1808k1313J9464J6752K8527N130J03897
$$ plain form
12182 430784 529000 565945 479763 385989 345601 300631 210927 143366 114835 91688 113886
12171 113886 68753 55744 67137 109568 21570 4013 71206 174697 125164 144061 228288
12160 228288 202526 168221 190016 173801 163167 217510 280244 272477 248386 273112 302527 368052
12148 368052 409705 444759 499605 610208 713783 802364 913070 998182 1033757 1042721 1102511
12137 1102511 1061753 979461 908045 775826 704691 628707 529944 435811 346646 238644 127728
12126 127728 88898 137550 213169 188186 166234 134957 135355 162296 141727 123932 97887 83298
12114 83298 144965 150514 96471 68624 93954 124793 119784 100537 122799 122415 70680 54648
12102 54648 63854 108251 187497 183372 130782 87216 76875 59700 46749 51228 103669 160088
$$ packed form
12182D30784R8216L6945q6182r3774m0388m4970q9704o7561k8531k3147K2198
12171A13886m5133j3009J1393M2431q7998j7557O7193J03491m9533J8897Q4227
12160B28288k5762l4305K1795j6215j0634N4343O2734p767k4091K4726K9415O5525
12148C68052M1653L5054N4846J10603J03575Q8581J10706Q5112L5575Q964N9790
12137A102511m0758q2292p1416j32219p1135p5984r8763r4133q9165j08002j10916
12126A27728l8830M8652P5619k4983k1952l1277L98K6941k0569j7795k6045j4589
12114H3298O1667N549n4043k7847K5330L0839n009j9247K2262l84n1735j6032
12102E4648R206M4397P9246m125n2590m3566j0341j7175j2951M479N2441N6419
$$ plain form
12090 160088 178746 175644 115710 56382 24693 51141 55086 92752 84848 56637 66333 111062
12078 111062 91070 49999 -5521 31939 1349 -11541 -23247 6086 57968 49944 27168 71151
12066 71151 119672 126209 122882 163160 168364 100279 77631 81242 35614 10384 2611 38497 70026
12053 70026 44734 -11940 -25616 -18323 -28456 -25987 -9821 -17686 -31709 11136 3470 -10139
12041 -10139 -38543 -33153 -54336 -66979 -89441 -60892 -68749 -106143 -186883 -194905 -140943 -82425
12029 -82425 1283 80903 98281 102625 124821 116920 66595 29993 7538 -24264 -54155 -33388
12017 -33388 12117 82034 112809 110131 128237 105546 67510 56373 46809 27412 13196 79916
12005 79916 101160 79978 67044 59314 23464 8645 43893 41630 46409 40539 -8601 -52124
$$ packed form
12090A60088J8658l102n9934n9328l1689K6448L945L7666p904k8211R696M4729
12078A11062j9992m1071n5520L7460l0590j2890j1706K9333N1882q024k2776M3983
12066G1151M8521O537l327M0278N204o8085k2648L611m5628k5230p773L5886L1529
12053G0026k5292n6674j3676P293j0133K469J6166p865j4023M2845p666j3609
12041a0139k8404N390k1183j2643k2462K8549p857l7394q0740q022N3962N8518
12029h2425Q3708P9620J7378M344K2196p901n0325l6602k2455l1802k9891K0767
12017c3388M5505O9917L0775k678J8106k2691l8036j1137r564j9397j4216O6720
12005G9916K1244k1182j2934p730l5850j4819L5248k263M779n870m9140m3523
$$ plain form
11993 -52124 -88990 -39253 -37156 -50325 7164 5401 -15044 -38547 -51757 -3321 63626 63595 71154
11980 71154 13123 -29973 -5813 17570 110243 103536 77529 101541 119966 155177 176118 158152
11968 158152 157802 204347 213397 335011 389550 384993 399897 405797 424567 390376 312343 257918
11956 257918 258108 238752 168174 163324 161104 119730 94268 134153 136773 179124 239357 264249
11944 264249 291134 256604 270510 256066 255969 215024 181804 236098 261905 281477 260154 299052
11932 299052 347974 435087 499556 538867 484511 467252 447195 403586 338356 283543 272001
11921 272001 320086 354486 338755 301444 288838 253771 156128 112363 110802 97334 98348 47223
11909 47223 38238 144157 163604 144365 190709 239810 267716 287290 302761 279094 268765 232387
$$ packed form
11993e2124l6866M9737K097j3169N7489j763k0445k3503j3210M8436O6947l1P559
11980G1154n8031m3096K4160K3383R2673o707k6007K4012J8425L5211K0941j7966
11968A58152l50M6545R050J21614N4539m557J4904N900J8770l4191p8033n4425
11956B57918J90j9356p0578m850k220m1374k5462L9885K620M2351O0233K4892
11944B64249K6885l4530J3906j4444r7m0945l3220N4294K5807J9572k1323L8898
11932B99052M8922Q7113O4469L9311n4356j7259k0057m3609o5230n4813j1542
11921B72001M8085L4400j5731l7311j2606l5067r7643m3765j561j3468J014n1125
11909D7223q985J05919J9447j9239M6344M9101K7906J9574J5471k3667j0329l6378
$$ plain form
11897 232387 215243 180979 181804 177332 121879 59790 10081 27231 4011 -56002 -46818 -38812
11885 -38812 3976 13556 20631 -21932 -50626 -25357 -10527 82846 142810 97158 90605 120784
11873 120784 59992 15195 -21836 -16802 6373 49722 84464 107105 123597 84252 78827 147867
11861 147867 139366 94268 48035 27875 -5409 4474 22354 58898 78987 134904 139464 109071
11849 109071 90040 63448 25050 21874 69382 41758 17608 -20944 -7223 -2563 30650 31943
11837 31943 -9281 -22407 3613 -2926 -18591 -23352 -17049 25984 51979 71461 88421 87679 96877
11824 96877 59983 23531 -15884 -35982 -72522 -64699 -3071 44364 81744 49752 20723 35539
11812 35539 44608 29591 43075 94357 109437 75550 113921 127618 126732 105256 22415 7073
$$ packed form
11897B32387j7144l4264Q25m472n5453o2089m9709J7150k3220o0013R184Q006
11885c8812M2788R580P075m2563k8694K5269J4830R3373N9964m5652o553L0179
11873A20784o0792m4797l7031N034K3175M3349L4742K2641J6492l9345n425O9040
11861A47867q501m5098m6233k0160l3284R883J7880L6544K0089N5917M560l0393
11849A09071j9031k6592l8398l176M7508k7624k4150l8552J3721M660L3213J293
11837C1943m1224j3126K6020o539j5665m761O303M3033K5995J9482J6960p42R198
11824I6877l6894l6452l9415k0098l6540P823O1628M7435L7380l1992k9029J4816
11812C5539R069j5017J3484N1282J5080l3887L8371J3697q86k1476q2841j5342
$$ plain form
11800 7073 72917 44962 -381 76128 77101 74782 134344 131788 168577 200527 194773 190951 185618
11787 185618 212490 161344 156849 154903 154392 120434 40649 -21461 -28816 76838 146472 163364
11775 163364 128427 59128 -2885 35534 145230 203800 164771 156919 204949 198358 142325 130558
11763 130558 205612 207188 201095 200591 209180 248737 249742 212859 214420 182775 196723 211805 176246
11750 176246 191338 185244 203833 182391 186189 130464 182506 208791 162141 108994 115557 108527
11738 108527 99314 119711 140732 100543 159742 224896 204512 147963 172758 213707 258652 293231
11726 293231 293594 291718 313243 311708 319546 289643 237168 187176 180426 206905 218589 184203 226218
11713 226218 255085 237508 260416 209380 149920 116506 88759 113449 142964 151487 125470 81226
$$ packed form
11800G073O5844k7955m5343P6509R73k319N9562k556L6789L1950n754l822n333
11787A85618K6872n1146m495j946n11l3958p9785o2110p355J05654O9634J6892
11775A63364l4937o9299o2013L8419J09696N8570l9029p852M8030o591n6033j1767
11763A30558P5054J576o093n04Q589L9557J005l6883J561l1645J3948J5082l5559
11750A76246J5092o094J8589k1442L798n5725N2042K6285m6650n3147O563p030
11738A08527r213K0397K1021m0189N9199O5154k0384n6549K4795M0949M4945L4579
11726B93231L63j876K1525j535P838k9903n2475m9992o750K6479J1684l4386M2015
11713B26218K8867j7577K2908n1036n9460l3414k7747K4690K9515Q523k6017m4244
$$ plain form
11701 81226 135077 200884 135166 99046 130649 167299 214190 244444 260719 266198 317176 277729
11689 277729 270887 236671 167826 139943 144627 170189 179029 202513 147606 166840 252917 270935
11677 270935 277256 248928 183088 231740 306946 387202 389230 342245 342699 332431 358466 352237
11665 352237 359100 380308 379981 384571 407319 384219 415048 413300 447732 458105 491569 527768
11653 527768 524669 567271 580219 555838 580183 605156 591991 543433 505695 430575 436572 428114
11641 428114 443190 434818 408790 416512 469719 491334 485028 491900 450924 455969 456549 505236 534655
11628 534655 472991 436029 456572 415064 385788 393310 419660 477722 541202 527227 513030 511898
11616 511898 514382 515263 467579 462433 463557 468739 489430 482381 405671 448959 492790 483615 519318
$$ packed form
11701H1226N3851O5807o5718l6120L1603L6650M6891L0254J6275N479N0978l9447
11689B77729o842l4216o8845k7883M684K5562Q840K3484n4907J9234Q6077J8018
11677B70935O321k8328o5840M8652P5206Q0256K028m6985M54j0268K6035o229
11665C52237O863K1208l27M590K2748k3100L0829j748L4432J0373L3464L6199
11653E27768l099M2602J2948k4381K4345K4973j3165m8558l7738p5120N997q458
11641D28114J5076q372k6028P722N3207K1615o306O872m0976N045N80M8687K9419
11628E34655o1664l6962K0543m1508k9276P522K6350N8062O3480j3975j4197j132
11616E11898K484Q81m7684n146J124N182K0691p049p6710M3288M3831r175L5703
$$ plain form
11603 519318 558731 557211 549432 582836 627144 609046 628222 738839 727742 789460 841241 771691
11591 771691 734619 744686 778930 784289 699089 637835 666247 715821 698991 679683 695601 761675
11579 761675 834883 903393 944204 1003612 987664 1006482 1033943 1112968 1152015 1221891 1267463
11568 1267463 1390160 1456437 1522061 1656437 1694318 1758499 1937371 2052599 2139204 2301365
11558 2301365 2518961 2691481 2895254 3219803 3561029 4064343 4594005 5222478 5931421
11549 5931421 6736812 7714289 8818433 10212846 11879514 13929453 16523111 19892173
11541 19892173 24366541 30376863 38286411 48076993 59284253 70471731 79650764 84104576
11533 84104576 81391369 72121516 60010706 48558618 39476174 32772052 28127442 25212958
$$ packed form
11603E19318L9413j520p779L3404M4308j8098J9176J10617j1097O1718N1781o9550
11591G71691l7072J0067L4244N359q5200o1254K8412M9574j6830j9308J5918O6074
11579G61675P3208O8510M0811N9408j5948J8818K7461P9025L9047O9876M5572
11568A267463J22697O6277O5624J34376L7881O4181J78872J15228Q6605J62161
11558B301365K17596J72520K03773L24549L41226N03314N29662O28473P08943
11549E931421Q05391R77477J104144J394413J666668K049939K593658L369062
11541A9892173M474368O010322P909548R790582J1207260J1187478R179033M453812
11533H4104576k713207r269853j2110810j1452088r082444o704122m644610k914484
$$ plain form
11525 25212958 23645369 23281111 23812915 25209684 27643238 31067382 35384120 40398653
11517 40398653 45395713 49361510 51476078 51498986 50114359 48271836 46753353 46504369
11509 46504369 48398924 52921920 59855233 68398279 77049121 83934022 87081346 85199411
11501 85199411 78533965 69358185 60534588 54034713 50434835 49332589 49800685 50633904
11493 50633904 50724776 49471644 46660326 42328790 37034812 31804342 27509950 24512571
11485 24512571 22733421 21952747 21998800 22785296 24459578 27162845 31140715 36605330 43713499
11476 43713499 52300218 61457250 69580476 74792038 74753774 68090685 56568729 44378262
11468 44378262 34215202 26545030 20800590 16635837 13641900 11516417 9900438 8616870
$$ packed form
11525B5212958j567589l64258N31804J396769K433554L424144M316738N014533
11517D0398653M997060L965797K114568K2908j384627j842523j518483k48984
11509D6504369J894555M522996O933313Q543046Q650842O884901L147324j881935
11501H5199411o665446r175780q823597o499875l599878j102246M68096Q33219
11493E0633904R0872j253132k811318m331536n293978n230470m294392k997379
11485B4512571j779150p80674M6053P86496J674282K703267L977870N464615P108169
11476D3713499Q586719R157032Q123226N211562l8264o663089j1521956j2190467
11468D4378262j0163060p670172n744440m164753k993937k125483j615979j283568
$$ plain form
11460 8616870 7599101 6719578 5940228 5163909 4585577 4168053 3819874 3515237 3264423
11451 3264423 3068168 2832356 2661354 2483422 2322810 2268797 2199560 2001888 1845469 1704053
11441 1704053 1622137 1504854 1448594 1431267 1408091 1324747 1302651 1304472 1221224 1148621 1138443
11430 1138443 1058697 1096021 1096306 986390 921758 923034 962513 903881 896001 870882 796142 782148
11418 782148 769881 746673 673725 641155 567530 546777 567488 571134 579341 546281 561545 555448
11406 555448 554544 485793 463752 441105 469292 456406 450864 440148 467731 445915 390669 372895
11394 372895 326282 293126 376023 373134 342468 349708 345820 309883 301393 282823 331754 388714
11382 388714 384724 360447 321874 346483 355182 381052 441288 444847 417633 411128 390555 332787
$$ packed form
11460H616870j017769q79523p79350p76319n78332m17524l48179l04637k50814
11451C264423j96255k35812j71002j77932j60612n4013o9237j97672j56419j41416
11441A704053q1916j17283n6260j7327k3176q3344k2096J821q3248p2603j0178
11430A138443p9746L7324K85j09916o4632J276L9479n8632p880k5119p4740j3994
11418G82148j2267k3208p2948l2570p3625k0753K0711L646Q207l3060J5264o097
11406E55448r04o8751k2041k2647K8187j2886n542j0716K7583k1816n5246j7774
11394C72895m6613l3156Q2897k889l0666P240l888l5937q490j8570M8931N6960
11382C88714l990k4277l8573K4609Q699K5870O0236L559k7214o505k0573n7768
$$ plain form
11370 332787 306971 257407 240973 220174 188121 255087 337279 354292 323696 266068 245494
11359 245494 208894 169076 204212 224926 267887 214451 178103 216934 225284 146180 88192 87185
11347 87185 77613 88713 64203 58241 92635 83661 39648 34653 44103 40590 29951 109820 99474
11334 99474 34000 -30499 -34126 -70593 -96088 -36852 -17029 28819 50524 36748 43780 -2768
11322 -2768 -63372 -24404 -48471 -57817 -13589 28247 52916 3 -19804 27163 36914 13286
11310 13286 39957 91528 128397 149128 157235 181419 196805 145238 74162 67650 59812 2544
11298 2544 -32058 12010 48812 46052 -3908 -39764 -21124 -642 -37438 -64956 -18575 38893
11286 38893 6188 -45696 -92371 -66712 -37417 -29879 55883 116540 110184 50637 16013 40090
$$ packed form
11370C32787k5816m9564j6434k0799l2053O6966Q2192J7013l0596n7628k0574
11359B45494l6600l9818L5136K0714M2961n3436l6348L8831Q350p9104n7988j007
11347H7185r572J1100k4510n962L4394q974m4013m995R450l513j0639P9869j0346
11334I9474o5474o4499l627l6467k5495N9236J9823M5848K1705j3776P032m6548
11322b768o0604L8968k4067r346M4228M1836K4669n2913j9807M6967R751k3628
11310A3286K6671N1571L6869K0731Q107K4184J5386n1567p1076o512p838n7268
11298B544l4602M4068L6802k760m9960l5856J8640K0482l6796k7518M6381N7468
11286C8893l2705n1884m6675K5659K9295P538Q5762O0657o356n9547l4624K4077
$$ plain form
11274 40090 59433 57311 84798 39939 58870 155411 232591 234918 268911 365933 405333 379779
11262 379779 377002 413477 475748 443156 398601 366074 374961 372891 313612 245731 186322 165477
11250 165477 151527 132180 151612 179397 174101 160693 137212 177941 134597 93912 148319 229412
11238 229412 275552 280845 330170 381328 345957 352598 398480 432230 537712 667570 773503
11227 773503 878073 1007032 1178435 1335378 1383005 1372289 1251326 1110975 942828 807117
11217 807117 775769 741281 711761 642518 651721 630209 652097 722805 844265 949994 990121
11206 990121 1018565 985758 954557 998026 1019685 1038799 1058916 1094391 1214914 1285523 1374755
11195 1374755 1417265 1503501 1566700 1537670 1423524 1340610 1292410 1238283 1183032 1174225 1181788
$$ packed form
11274D0090J9343k122K7487m4859J8931R6541P7180K327L3993R7022L9400k5554
11262C79779k777L6475O2271l2592m4555l2527Q887k070n9279o7881n9409k0845
11250A65477j3950j9347J9432K7785n296j3408k3481M0729m3344m0685N4407Q1093
11238B29412M6140N293M9325N1158l5371O641M5882L3750J05482J29858J05933
11227G73503J04570J28959J71403J56943M7627j0716j20963j40351j68147j35711
11217H07117l1348l4488k9520o9243R203k1512K1888P0708J21460J05729M0127
11206I90121K8444l2807l1201M3469K1659J9114K0117L5475J20523P0609Q9232
11195A374755M2510Q6236O3199k9030j14146q2914m8200n4127n5251q807P563
$$ plain form
11184 1181788 1134631 1080527 1077046 1014682 924657 853590 783489 670495 613319 628578 642893
11173 642893 632283 711795 772796 795508 843529 945979 1121849 1257535 1380657 1427198 1412740
11162 1412740 1341607 1136969 904213 739737 608147 489892 386021 339908 323481 284729
11152 284729 315918 273325 222637 174730 166922 204358 171810 180196 182628 165941 163898 154284
11140 154284 179693 214951 202550 113842 36629 15511 44251 37189 51360 52226 113605 104615
11128 104615 61368 69560 107315 137861 112976 72847 84479 74263 68269 50451 30673 5641
11116 5641 11694 72385 86769 123334 123507 146221 191792 218171 231412 215417 219745 264532 282475
11103 282475 330696 318152 359324 359977 365317 381240 365048 345945 280505 226769 194821 145208
$$ packed form
11184A181788m7157n4104l481o2364r0025p1067p0101j12994n7176J5259J4315
11173F42893j0610P9512O1001K2712M8021J02450J75870J35686J23122M6541j4458
11162A412740p1133k04638k32756j64476j31590j18255j03871m6113j6427l8752
11152B84729L1189m2593n0688m7907p808L7436l2548Q386K432j6687k043r614
11140A54284K5409L5258j2401q8708p7213k1118K8740p062J4171Q66O1379q990
11128A04615m3247Q192L7755L0546k4885m0129J1632j0216n994j7818j9778k5032
11116E641O053O0691J4384L6565J73K2714M5571K6379J3241j5995M328M4787J7943
11103B82475M8221j2544M1172O53N340J5923j6192j9103o5440n3736l1948m9613
$$ plain form
11091 145208 126853 184920 186068 129055 103816 141575 205071 220437 244609 321226 362272 336350
11079 336350 330665 352309 314772 359579 395268 503935 643360 809939 949809 1039048 1111267
11068 1111267 1102913 1026233 840388 674325 631566 575637 542320 561386 480788 393924 390092
11057 390092 382858 335704 258724 150617 131427 110287 110624 117303 126525 134619 127729 247405
11045 247405 370250 418829 518028 666934 836060 943697 1021803 1087858 1062453 965260 847315
11034 847315 710247 574809 440632 333302 244243 154817 112567 129288 125536 87732 76716
11023 76716 54154 71755 37498 -19191 -20191 63213 71785 52937 64757 38538 30137 56515
11011 56515 37262 12774 33832 48683 93681 164669 201515 145402 119791 106322 131885 111454
$$ packed form
11091A45208j8355N8067J148n7013k5239L7759O3496J5366K4172P6617M1046k5922
11079C36350n685K1644l7537M4807L5689J08667J39425J66579J39870Q9239P2219
11068A111267q354p6680j85845j66063m2759n5929l3317J9066q0598q6864l832
11057C90092p234m7154p6980j08107j9190k1140L37O679R222Q094o890J19676
11045B47405J22845M8579R9199J48906J69126J07637P8106O6055k5405r7193j17945
11034H47315j37068j35438j34177j07330q9059q9426m2250J6721l752l7804j1016
11023G6716k2562J7601l4257n6689j000Q3404Q572j8848J1820k6219q401K6378
11011E6515j9253k4488K1058J4851M4998P0988L6846n6113k5611j3469K5563k0431
$$ plain form
10999 111454 40537 22044 15732 50068 64363 65182 99879 67355 75744 -8588 -15004 15687
10987 15687 14387 4445 64831 79129 57080 71637 69436 93061 99562 66586 915 10731 69777
10974 69777 113569 105866 76675 57113 72664 76695 25505 25581 29911 -635 -8054 24774 -6735
10961 -6735 18792 5610 1907 47797 88450 40337 -9988 2748 5667 -3462 -15875 -4459
10949 -4459 -34155 42447 66657 94798 43267 2295 -20637 -24220 1094 50705 61718 31268
10937 31268 12788 32264 100457 163875 169153 57950 57874 66424 41216 48231 116270 136343 132202
10924 132202 149052 135827 106648 108267 207479 360368 432193 511197 608859 794998 1057161
10913 1057161 1325765 1497903 1531761 1349064 1035509 707159 529988 403383 291311 186604
$$ packed form
10999A11454p0917j8493o312L4336J4295Q19L4697l2524Q389q4332o416L0691
10987A5687j300r942O0386J4298k2049J4557k201K3625O501l2976o5671R816N9046
10974F9777M3792p703k9191j9562J5551M031n1190P6M330l0546p419L2828l1509
10961f735K5527j3182l703M5890M0653m8113n0325J2736K919r129j2413J1416
10949d459k9696P6602K4210K8141n1531m0972k2932l583K5314M9611J1013l0450
10937C1268j8480J9476O8193O3418N278j11203p6Q550k5208P015O8039K0073m141
10924A32202J6850j3225k9179J619R9212J52889P1825P9004R7662J86139K62163
10913A057161K68604J72138L3858j82697l13555l28350j77171j26605j12072j04707
$$ plain form
10903 186604 170525 166058 97154 101996 114533 129478 155269 119319 129325 158844 159627 155816
10891 155816 138608 136217 126822 117214 120020 151938 141985 206287 233045 254598 182822 123427
10879 123427 99298 80904 104595 113871 124782 164881 98151 84720 111447 58891 50829 39489
10867 39489 27531 66841 73991 126926 146120 121995 91067 46405 13400 58471 114285 141892
10855 141892 162867 186149 202755 205085 156893 66860 17741 -19126 -16060 47407 91730 73760
10843 73760 91265 42962 21412 84187 168254 176415 87905 99806 115036 63117 29275 4730
10831 4730 45400 58461 24302 25461 70838 84250 46645 91601 154801 202883 220223 186189
10819 186189 121583 109205 79203 57476 103806 90175 64629 112516 67969 56128 14871
$$ packed form
10903A86604j6079m467o8904M842J2537J4945K5791l5950J0006K9519P83l811
10891A55816j7208k391r395r608K806L1918r953O4302K6758K1553p1776n9395
10879A23427k4129j8394K3691R276J0911M0099o6730j3431K6727n2556q062j1340
10867C9489j1958L9310P150N2935J9194k4125l0928m4662l3005M5071N5814K7607
10855A41892K0975K3282J6606K330m8192r0033m9119l6867L066O3467M4323j7970
10843G3760J7505m8303k1550O2775Q4067Q161q8510J1901J5230n1919l3842k4545
10831D730M0670J3061l4159J159M5377J3412l7605M4956O3200M8082J7340l4034
10819A86189o4606j2378l0002k1727M6330j3631k5546M7887m4547j1841m1257
$$ plain form
10808 14871 5005 -37037 -20875 35925 71994 75462 78580 69968 68142 41400 41006 95274 118615
10795 118615 101119 42528 -26334 -59448 -34437 -19818 13500 52647 43036 34956 83052 97220
10783 97220 22778 -11631 45431 75201 82677 39581 61923 36927 -6161 -9080 23551 -6159
10771 -6159 -19593 -49557 -19508 26734 98965 143147 76009 48259 -6892 -53197 -17632 75419
10759 75419 80694 72682 91050 105558 125178 192591 146377 94784 106650 169942 271489 301590
10747 301590 316724 405663 471965 429517 351863 315921 241826 181511 152692 123764 89777
10736 89777 173771 201694 153438 140658 167082 197525 167873 190052 186855 161458 140989 142498
10724 142498 125745 61447 61682 87548 105965 141774 149885 184295 152643 164909 150419 139850
$$ packed form
10808A4871r866m2042J6162N6800L6069L468L118q612j826k6742l94N4268K3341
10795A18615j7496n8591o8862l3114K5011J4619L3318L9147r611q080M8096J4168
10783I7220p4442l4409N7062K9770P476m3096K2342k4996m3088k919L2631k9710
10771f159j3434k9964L0049M6242P2231M4182o7138k7750n5151m6305L5565R3051
10759G5419N275q012J8368J4508J9620O7413m6214n1593J1866O3292J01547L0101
10747C01590J5134Q8939O6302m2448p7654l5942p4095o0315k8819k8928l3987
10736H9777Q3994K7923m8256j2780K6424L0443k9652K2179l197k5397k0469J509
10724A42498j6753o4298K35K5866J8417L5809Q111L4410l1652J2266j4490j0569
$$ plain form
10712 139850 131547 147362 164909 180601 199863 213622 224216 217879 210173 175087 61714 65277
10700 65277 130035 128809 157484 138277 150122 134966 110514 78931 77175 131965 205379 241980
10688 241980 189996 216642 215427 236443 263817 288587 300638 300221 295866 282419 195206 174140
10676 174140 122140 102176 81158 128781 156372 201478 192378 190449 152096 105059 91786 84142
10664 84142 118874 148946 123150 93116 89800 119300 141137 201099 218543 208185 219053 265411
10652 265411 264282 262897 237833 143989 178421 222394 201483 165277 152265 196307 202462 225000
10640 225000 203807 179178 156508 138371 113283 133854 135942 165776 218269 209036 173161 165276
10628 165276 209931 209532 261358 312760 307872 386576 435440 483491 523552 557403 623448 611029
$$ packed form
10712A39850q303J5815J7547J5692J9262J3759J0594o337p706l5086j13373L563
10700F5277O4758j226K8675j9207J1845j5156k4452l1583j756N4790P3414L6601
10688B41980n1984K6646j215K1016K7374K4770J2051m17m355j3447q7213k1066
10676A74140n2000j9964k1018M7623K7591M5106r100j929l8353m7037j3273p644
10664H4142L4732L0072k5796l0034l316K9500K1837N9962J7444j0358J0868M6358
10652B65411j129j385k5064r3844L4432M3973k0911l6206j3012M4042O155K2538
10640B25000k1193k4629k2670j8137k5088K0571K088K9834N2493r233l5875p885
10628A65276M4655l99N1826N1402m888P8704M8864M8051M0061L3851O6045j2419
$$ plain form
10616 611029 551866 478816 415706 422519 406335 405356 397723 404679 316292 286813 300247 255111
10604 255111 230167 226757 258555 273448 338266 363991 285488 291883 348457 411648 410059 343967
10592 343967 322128 319818 340991 329882 316002 311414 359649 363391 339444 315719 292032 266542
10580 266542 302067 329681 324662 344200 369122 351457 366206 430963 455919 467185 492093 493077
10568 493077 476853 449162 449174 411618 377503 416861 435672 425301 489227 518109 563204 609229
10556 609229 642452 649897 698956 688305 663499 670847 730231 701388 654927 726475 750219 780561
10544 780561 848349 834174 838721 855412 844092 884350 930235 1024551 1125610 1205376 1257158
10533 1257158 1368922 1544947 1672365 1787292 1888587 2027616 2136024 2271368 2461223
$$ packed form
10616F11029n9163p3050o3110O813j6184r79p633O956q8387k9479J3434m5136
10604B55111k4944l410L1798J4893O4818K5725p8503O395N6574O3191j589o6092
10592C43967k1839k310K1173j1109j3880m588M8235L742k3947k3725k3687k5490
10580B66542L5525K7614n019J9538K4922j7665J4749O4757K4956J1266K4908R84
10568D93077j6224k7691J2l7556l4115L9358J8811j0371O3926K8882M5095M6025
10556F09229L3223P445M9059j0651k4806P348N9384k8843m6461P1548K3744L0342
10544G80561O7788j4175M547J6691j1320M0258M5885R4316J01059P9766N1782
10533A257158J11764J76025J27418J14927J01295J39029J08408J35344J89855
$$ plain form
10524 2461223 2640297 2852123 3043900 3275907 3602020 3906362 4239078 4754435 5407477
10515 5407477 6230662 7351926 8715734 10485242 12650392 14845844 16831713 18532675
10507 18532675 19786568 20726615 22123097 24416888 27767465 32459303 39011030 48129274
10499 48129274 61135405 80212192 108612490 148735999 197197535 244705369 283563485
10492 283563485 298169206 262983140 194762792 134270938 93382490 67311910 50467391
10485 50467391 39173088 31248855 25527949 21330729 18183076 15817396 14033521 12714685
10477 12714685 11732975 11040423 10539047 10047652 9594968 9169743 8815035 8752155 8943216
10468 8943216 9205467 9432131 9329038 8454115 7006568 5712887 4811962 4187520 3810019
$$ packed form
10524B461223J79074K11826J91777K32007L26113L04342L32716N15357O53042
10515E407477Q23185J121264J363808J769508K165150K195452J985869J700962
10507A8532675J253893R40047J396482K293791L350577M691838O551727R118244
10499D8129274J3006131J9076787K8400298M0123509M8461536M7507834L8858116
10492B83563485J4605721l5186066o8220348o0491854m0888448k6070580j6844519
10485E0467391j1294303p924233n720906m197220l147653k365680j783875j318836
10477A2714685r81710o92552n01376m91395m52684m25225l54708o2880J91061
10468H943216K62251K26664j03093q74923j447547j293681r00925o24442l77501
$$ plain form
10459 3810019 3492964 3210536 3042053 2852969 2688747 2565413 2409513 2285052 2219530 2126377
10449 2126377 2033782 1899378 1808741 1698857 1635454 1602503 1592717 1587460 1484228 1452005 1423001
10438 1423001 1348037 1300097 1176001 1096163 1106824 1026730 972251 966340 977696 962660 876808
10427 876808 882177 870122 822954 803469 796266 732483 716449 659278 674442 633564 667494 677161
10415 677161 607242 583710 583995 587226 617181 642024 644423 638830 633957 631452 573049 454589 422088
10402 422088 454561 469720 491365 447665 429698 417918 411518 374761 311551 239954 234100 331533
10390 331533 377589 342031 376686 407422 400801 359062 362111 344977 341625 340984 322992 296619
10378 296619 244954 188923 223041 229932 288068 326908 348175 348149 356488 419817 503759 547753
$$ packed form
10459C810019l17055k82428j68483j89084j64222j23334j55900j24461o5522r3153
10449B126377r2595j34404r0637j09884o3403l2951r786n257j03232l2223k9004
10438A423001p4964m7940j24096p9838J0661q0094n4479n911J1356j5036q5852
10427H76808N369j2055m7168j9485p203o3783j6034n7171J5164m0878L3930R667
10415F77161o9919k3532K85L231K9955K4843K399n593m873k505n8403j18460l2501
10402D22088L2473J5159K1645m3700j7967j1780o400l6757o3210p1597n854R7433
10390C31533M6056l5558L4655L0736o621m1739L049j7134l352o41j7992k6373
10378B96619n1665n6031L4118O891N8136L8840K1267k6Q339O3329Q3942M3994
$$ plain form
10366 547753 542687 557146 529569 549903 571841 596709 595621 587207 514387 398574 320287 335698
10354 335698 372372 379389 389519 357253 351600 377369 275868 201784 163137 209000 238422 196798
10342 196798 195325 259443 255044 215698 175291 191233 199007 195169 231642 231820 215176 240491 277489
10329 277489 274106 225828 213501 190989 176247 216159 252686 311294 302744 246311 267283 287115
10317 287115 267883 272515 283996 262947 287207 370698 417866 410584 447491 487925 461031 460434
10305 460434 532406 651978 836951 1109548 1375546 1539159 1527447 1298388 930675 693385
10295 693385 612279 539430 451430 354094 309948 301316 257572 251460 210379 175590 188059 226766
10283 226766 214783 122735 80344 166015 185284 148919 154824 162543 155085 139393 173618 117626
$$ packed form
10366E47753n066J4459k7577K0334K1938K4868j088q414p2820j15813p8287J5411
10354C35698L6674P017J0130l2266n653K5769j01501p4084l8647M5863K9422m1624
10342A96798j473O4118m399l9346m0407J5942P774l838L6473J78j6644K5315L6998
10329B77489l383m8278j2327k2512j4742L9912L6527N8608q550n6433K0972J9832
10317B87115j9232M632J1481k1049K4260Q3491M7168p282L6907M0434k6894n97
10305D60434P1972J19572J84973K72597K65998J63613j1712k29059l67713k37290
10295F93385q1106p2849q8000r7336m4146q632m3744o112m1081l4789J2469L8707
10283B26766j1983r2048m2391Q5671J9269l6365N905P719p458j5692L4225n5992
$$ plain form
10271 117626 63896 17431 7395 74545 77175 60266 105552 151712 177868 183913 184249 114945
10259 114945 92159 89515 156938 187172 103191 60687 101764 136209 197156 185330 106582 69051
10247 69051 90354 125055 153741 104983 76329 93460 107917 77649 35720 55413 40235 59989
10235 59989 19760 25869 53771 34659 27840 115619 106981 64286 64788 58950 71683 131267 148429
10222 148429 113064 179829 231120 200773 178381 175319 241468 247960 295369 315194 340278 376528
10210 376528 433557 483260 522079 506113 479616 421892 369612 364037 409511 379834 348826 357499
10198 357499 433434 496393 574231 749455 938301 1107767 1310669 1492528 1501859 1405598 1349623
10187 1349623 1390574 1518158 1755978 2151112 2711025 3272683 3887570 4360784 4387374 3989413
$$ packed form
10271A17626n3730m6465j0036O7150K630j6909M5286M6160K6156O045L36o9304
10259A14945k2786k644O7423L0234q3981m2504M1077L4445O0947j1826p8748l7531
10247F9051K1303L4701K8686m8758k8654J7131J4457l0268m1929J9693j5178J9754
10235E9989m0229O109K7902j9112o819Q7779q638m2695N02n838J2733N9584J7162
10222A48429l5365O6765N1291l0347k2392l062O6149O492M7409J9825K5084L6250
10210C76528N7029M9703L8819j5966k6497n7724n2280n575M5474k9677l1008Q673
10198C57499P5935O2959P7838J75224J88846J69466K02902J81859R331r6261n5975
10187A349623M0951J27584K37820L95134N59913N61658O14887M73214K6590l97961
$$ plain form
10177 3989413 3281194 2452283 1782521 1318182 1017670 872834 716965 568114 493504 401279
10167 401279 323409 313428 290269 298977 276736 305539 320318 333570 372034 304568 246026 178154
10155 178154 48770 25585 38555 13922 2216 64988 125038 119733 139428 176982 202463
10144 202463 174174 113131 117517 106318 116454 126325 85663 43725 29188 46600 115124 110895
10132 110895 83752 65120 96917 162652 190322 141145 135635 128179 160882 230380 266412 262561
10120 262561 269388 241189 190649 197336 165551 106325 73317 93931 83793 79729 93015 80872
10108 80872 39374 5308 10178 31109 25107 54782 122370 78568 -12241 -844 81930 165233
10096 165233 150571 135798 80139 40397 55450 32105 47084 112521 139592 85248 101071
$$ packed form
10177C989413p08219q28911o69762m64339l00512j44836j55869j48851p4610r2225
10167D01279p7870r981k3159Q708k2241K8803J4779J3252L8464o7466n8542o7872
10155A78154j29384k3185J2970k4633j1706O2772O0050n305J9695L7554K5481
10144B02463k8289o1043M386j1199J0136R871m0662m1938j4537J7412O8524m229
10132A10895k7143j8632L1797O5735K7670m9177n510p456L2703O9498L6032l851
10120B62561O827k8199n0540O687l1785n9226l3008K0614j0138m064J3286j2143
10108H0872m1498l4066M870K0931o002K9675O7588m3802r0809J1397Q2774Q3303
10096A65233j4662j4773n5659l9742J5053k3345J4979O5437K7071n4344J5823
$$ plain form
10085 101071 73690 50609 53492 63015 87066 93318 70861 88291 137259 173444 179643 308851
10073 308851 442803 598937 801733 1026641 1244780 1502543 1606129 1568901 1288814 946698
10063 946698 720410 542613 402120 348099 314994 283252 215427 142379 95782 80119 70536
10052 70536 79519 77769 84340 27307 -6203 4673 30096 64570 58661 63909 144357 183774 210472
10039 210472 158734 95799 30280 18544 6788 -28833 -17668 -36811 -11974 -11379 -44885 -72404
10027 -72404 -70790 -18617 -36296 -56431 -16483 -30764 -51597 -70342 -84453 -94040 -30964 7440
10015 7440 -8586 4092 53048 29800 24769 21611 29411 78799 67774 40451 36202 67104 62785
10002 62785 45289 16829 3874 -22472 47216 61148 56736 71455 132182 108803 43174 45207
$$ packed form
10085A01071k7381k3081K883R523K4051O252k2457J7430M8968L6185O199J29208
10073C08851J33952J56134K02796K24908K18139K57763J03586l7228k80087l42116
10063I46698k26288j77797j40493n4021l3105l1742o7825p3048m6597j5663r583
10052G0536Q983j750O571n7033l3510J0876K5423L4474n909N248Q0448L9417K6698
10039B10472n1738o2935o5519j1736j1756l5621J1165j9143K4837N95l3506k7519
10027g2404J614N2173j7679k0135L9948j4281k0833j8745j4111r587O3076L8404
10015G440j6026J2678M8956k3248n031l158P800M9388j1025k7323m249L0902m319
10002F2785j7496k8460j2955k6346O9688J3932m412J4719O0727k3379o5629K033
$$ plain form
9990 45207 90417 30946 -3303 15124 2792 -8403 -39366 -35148 9940 13552 28513 41242
9978 41242 39055 48211 78352 5211 -51705 -53466 -37600 -18064 7700 37351 16541 -60384
9966 -60384 -65885 -12297 10029 -30614 -49451 -2852 -33429 -31543 -69386 -36470 61886 99491
9954 99491 53545 39102 47568 28888 21579 11118 19525 46159 22759 -22566 5360 79473
9942 79473 135800 141426 130520 135837 69947 46646 30425 98592 169440 197614 287033 431108
9930 431108 569289 697968 809454 850025 774251 644432 492408 344527 215179 132828
9920 132828 109482 87808 57743 80768 100136 98907 48126 43704 62075 59199 69527 66626
9908 66626 73325 71582 102640 72682 60373 103769 58566 34634 59746 95222 75047 127046
$$ packed form
9990D5207M5210n9471l4249J8427j2332j1195l0963M218M5088L612J4961J2729
9978D1242k187R156L0141p3141n6916j761J5866J9536K5764K9651k0810p6925
9966f0384n501N3588K2326m0643j8837M6599l0577J886l7843L2916R8356L7605
9954I9491m5946j4443Q466j8680p309j0461Q407K6634k3400m5325K7926P4113
9942G9473N6327N626j0906N317o5890k3301j6221O8167P0848K8174Q9419J44075
9930D31108J38181J28679J11486M0571p5774j29819j52024j47881j29348q2351
9920A32828k3346k1674l0065K3025J9368j229n0781m422J8371k876J0328k901
9908F6626O699j743L1058k9958j2309M3396m5203k3932K5112L5476k0175N1999
$$ plain form
9896 127046 135886 154902 112024 108129 96687 115093 122285 94828 88126 2516 -106635 -84578
9884 -84578 -35904 51605 96377 94037 88115 111705 40470 29092 47049 101547 78149 75638
9872 75638 56739 64451 59202 52243 96619 88078 65696 76399 78680 129575 156460 144769 127943
9859 127943 147428 107821 116219 173962 156597 127825 135761 65075 33461 68843 92588 107710
9847 107710 95201 91726 86159 99813 93501 106632 91182 100394 87439 63666 39776 -12808
9835 -12808 24142 43147 118673 130439 72960 13384 23849 92728 116867 101455 187894 170443
9823 170443 171990 135681 107245 126569 105665 119137 93904 107438 183999 273288 281576 311140
9811 311140 432418 524224 563293 450738 311642 234686 230543 245771 203429 178586 173314
$$ packed form
9896A27046Q840J9016m2878l895j1442J8406P192k7457o702q5610j09151K2057
9884h4578M8674Q7509M4772k340n922K3590p1235j1378J7957N4498k3398k511
9872G5638j8899P712n249o959M4376q541k2382J0703K281N0895K6885j1691j6826
9859A27943J9485l9607Q398N7743j7365k8772P936p0686l1614L5382K3745J5122
9847A07710j2509l475n567J3654o312J3131j5450R212j2955k3773k3890n2584
9835a2808L6950J9005P5526J1766n7479n9576J0465O8879K4139j5412Q6439j7451
9823A70443J547l6309k8436J9324k0904J3472k5233J3534P6561Q9289Q288K9564
9811C11140J21278R1806L9069j12555j39096p6956m143J5228m2342k4843n272
$$ plain form
9800 173314 108544 134460 154252 137451 111741 103460 119787 125897 109846 121051 95055 101235
9788 101235 108702 152022 174648 165801 97889 98367 110846 86010 63244 57274 3090 67096 143505
9775 143505 127669 101863 106657 89369 33170 105255 147355 176759 199563 150832 146391 134139
9763 134139 139882 163562 184671 218960 290351 255469 225665 208749 200214 280818 371150 410251
9751 410251 554107 752833 985767 1155505 1294298 1448651 1446655 1373009 1266937 1085434
9741 1085434 857898 677055 441824 281676 194016 186359 256709 260934 253268 248396 236425
9730 236425 169028 132462 166089 181406 130728 80356 119275 140468 147465 184765 148926 103372
9718 103372 94590 103452 107060 77175 63963 82760 105234 112098 119183 135184 157324 142946 91593
$$ packed form
9800A73314o4770K5916J9792j6801k5710q281J6327O110j6051J1205k5996O180
9788A01235P467M3320K2626q847o7912M78J2479k4836k2766n970n4184O4006P6409
9775A43505j5836k5806M794j7288n6199P2085M2100K9404K2804m8731m441j2252
9763A34139N743K3680K1109L4289P1391l4882k9804j6916q535Q0604R0332L9101
9751D10251J43856J98726K32934J69738J38793J54353j996p3646j06072j81503
9741A085434k27536j80843k35231j60148q7660p657P0350M225p666m872j1971
9730B36425o7397l6566L3627J5317n0678n0372L8919K1193O997L7300l5839m5554
9718A03372q782Q862L608k9885j3212J8797K2474O864P085J6001K2140j4378n1353
$$ plain form
9705 91593 84566 67181 43908 87914 107888 112447 136171 79114 -12396 -13615 5813 9966 43907
9692 43907 82684 103084 122041 120357 131489 87250 44330 18697 5630 3883 42381 91485
9680 91485 52966 17393 16341 61645 66795 74851 64266 117068 101145 27818 -11798 26693
9668 26693 77091 81968 129076 83751 65357 64249 101602 123247 145186 216766 201815 192712
9656 192712 124252 65850 37677 73374 66683 69249 84853 126778 109270 126009 107305 75926
9644 75926 78025 68567 92841 144477 149504 132812 118502 61619 7458 71256 72697 55912 47646
9631 47646 65950 70213 110409 183939 141578 82152 65520 70021 60252 67169 105257 131790 137948
9618 137948 129238 119027 123021 150592 119112 62994 25609 31151 68363 78700 106998 109462
$$ packed form
9705I1593p027j7385k3273M4006J9974M559K3724n7057r1510j219J9428M153L3941
9692D3907L8777K0400J8957j684J1132m4239m2920k5633j3067j747L8498M9104
9680I1485l8519l5573j052M5304N150Q056j0585N2802j5923p3327l9616L8491
9668B6693N0398M877M7108m5325j8394j108L7353K1645K1939P1580j4951r103
9656A92712o8460n8402k8173L5697o691K566J5604M1925j7508J6739j8704l1379
9644G5926K099r458K4274N1636N027j6692j4310n6883n4161O3798J441j6785q266
9631D7646J8304M263M0196P3530m2361n9426j6632M501r769O917L8088K6533O158
9618A37948q710j0211L994K7571l1480n6118l7385N542L7212J0337K8298K464
$$ plain form
9606 109462 119157 126244 111199 83482 51298 24056 85554 113060 92232 81103 114459 120176
9594 120176 138027 85724 86332 142081 137250 119249 108263 150252 175025 207726 186181 135286
9582 135286 148964 144861 171320 172601 121355 119673 139098 155548 194959 293269 313146 321990
9570 321990 266780 161317 149123 156079 149627 154728 176490 178856 67441 39703 33359 60839
9558 60839 37024 50368 65504 73051 35490 -13920 26006 38184 409 -36062 -45855 -39145
9546 -39145 -29469 -11148 5024 13357 22930 -37314 -77683 -35938 -32850 -9600 -19790 -55197 -60361
9533 -60361 -57535 -14360 -27274 -41388 -25744 43796 147462 120348 45827 -4293 23059 52120
9521 52120 49764 92093 41933 31057 27225 -16252 -54451 -90855 -58807 34854 76448 62404
$$ packed form
9606A09462R695P087j5045k7717l2184k7242O1498K7506k0828j1129L3356N717
9594A20176J7851n2303O08N5749m831j8001j0986M1989K4773L2701k1545n0895
9582A35286J3678m103K6459J281n1246j682J9425J6450L9411R8310J9877Q844
9570C21990n5210j05463j2194O956o452N101K1762K366j11415k7738o344K7480
9558F0839k3815J3344J5136P547l7561m9410L9926J2178l7775l6471r793O710
9546c9145R676J8321J6172Q333R573o0244m0369M1745L088K3250j0190l5407n164
9533f0361K826M3175j2914j4114J5644O9540J03666k7114p4521n0120K7352K9061
9521E2120k356M2329n0160j0876l832m3477l8199l6404L2048R3661M1594j4044
$$ plain form
9509 62404 1095 -9021 -3391 -6227 -19437 26585 4500 -2728 20955 39155 83676 97531
9497 97531 91252 92392 73238 3184 -46348 -57756 -91976 -50956 21678 16755 55691 64453 70658
9484 70658 89987 107546 135388 79368 34386 31007 18696 -22995 -21090 -39351 3173 40781
9472 40781 24327 33424 84243 89096 39354 14985 26167 11124 -10348 -40061 -64277 -46531
9460 -46531 -37631 -38897 -46667 -67223 -36168 17937 32055 10686 -12981 18662 38287 30973 1974
9447 1974 5212 -43475 -128598 -122096 -82529 -14091 31075 -19492 -44851 -109030 -101598 -70584 -33534
9434 -33534 18111 103823 97682 61304 48474 62555 65726 67980 87849 86572 122641 93173 55024
9421 55024 17283 -11123 2479 -38127 -82030 -73729 -65144 -61692 9599 71326 72655 33127 18007
$$ packed form
9509F2404o1309j0116N630k836j3210M6022k2085p228K3683J8200M4521J3855
9497I7531o279J140j9154p0054m9532j1408l4220M1020P2634m923L8936Q762O205
9484G0658J9329J7559K7842n6020m4982l379j2311m1691J905j8261M2524L7608
9472D0781j6454R097N0819M853m9742k4369J1182j5043k1472k9713k4216J7746
9460d6531Q900j266p770k0556L1055N4105J4118k1369k3667L1643J9625p314k8999
9447A974L238m8687q5123O502L9567O8438M5166n0567k5359o4179P432L1014L7050
9434c3534N1645Q5712o141l6378j2830J4081L171K254J9869j277L6069k9468l8149
9421E5024l7741k8406J3602m0606m3903Q301Q585L452P1291O1727J329l9528j5120
$$ plain form
9408 18007 36952 54827 37851 45245 85042 70288 3802 33015 123523 152037 156698 150286
9396 150286 170421 189360 203522 163250 125882 59478 87392 77636 10172 40805 100095 102672
9384 102672 110027 103680 30493 32090 42864 67276 88963 122596 128603 150263 111908 61365
9372 61365 25373 -27537 -76639 -4489 4633 -37352 -86800 -116592 -76984 -78710 -96188 -35228
9360 -35228 -4474 24812 33971 61181 61423 82628 61507 25782 27590 82312 98849 120094 87395
9347 87395 66614 36702 -25308 -32476 -48535 -22166 43649 100448 132694 137392 163567 58018
9335 58018 937 41531 128000 208567 219207 190921 116129 59195 74726 92584 100738 80527
9323 80527 71893 61263 73119 73822 77203 49856 67307 124391 147083 140722 129156 136698 160102
$$ packed form
9408A8007J8945J7875j6976P394L9797j4754o6486K9213R0508K8514M661o412
9396A50286K0135J8939J4162m0272l7368o6404K7914r756o7464L0633N9290K577
9384A02672P355o347p3187J597J0774K4412K1687L3633O007K1660l8355n0543
9372F1365l5992n2910m9102P2150R122m1985m9448k9792L9608j726j7478O0960
9360c5228L0754K9286R159K7210K42K1205k1121l5725J808N4722J6537K1245l2699
9347H7395k0781k9912o2010p168j6059K6369O5815N6799L2246M698K6175j05549
9335E8018n7081M0594Q6469Q0567J0640k8286p4792n6934J5531J7858Q154k0211
9323H0527q634j0630J1856P03L381k7347J7451N7084K2692o361j1566P542K3404
$$ plain form
9310 160102 126822 67979 75085 46521 10842 16075 31081 -4154 41480 96456 143192 161729
9298 161729 169630 96125 40677 71177 25845 15604 77419 107850 98405 100289 52758 4198
9286 4198 75136 154996 126467 85387 69001 107694 122725 102360 63147 31544 10444 13224
9274 13224 5318 40797 30027 -12233 13118 77533 66373 15183 9116 58890 152774 164399
9262 164399 108481 56409 67403 122623 134538 126284 42581 32587 84398 115386 65007 70683
9250 70683 88990 26448 -5455 39077 30818 111302 193644 116697 85394 148490 126890 55303
9238 55303 61135 32533 1521 50430 85054 100638 104143 112550 91675 122592 145785 122088
9226 122088 105596 41880 53371 111847 64667 23631 36788 30985 -5474 10766 -10390 -9079
$$ packed form
9310A60102l3280n8843P106k8564l5679N233J5006l5235M5634N4976M6736J8537
9298A61729P901p3505n5448L0500m5332j0241O1815L0431r445J884m7531m8560
9286D198P0938P9860k8529m1080j6386L8693J5031k0365l9213l1603k1100K780
9274A3224p906L5479j0770m2260K5351O4415j1160n1190o067M9774R3884J1625
9262A64399n5918n2072J0994N5220J1915q254q3703r994N1811L0988n0379N676
9250G0683J8307o2542l1903M4532q259Q0484Q2342p6947l1303O3096k1600p1587
9238E5303N832k8602l1012M8909L4624J5584L505Q407k0875L0917K3193k3697
9226A22088j6492o3716J1491N8476m7180m1036J3157n803l6459J6240k1156J311
$$ plain form
9214 -9079 70843 119810 102983 54863 77081 136646 146692 91757 72335 48194 18490 -14471
9202 -14471 3671 6210 49705 69994 81367 137470 91206 28547 15058 33209 37279 70537
9190 70537 92739 117444 127732 106509 39221 3149 27040 24900 7420 79279 110780 156630
9178 156630 196088 182126 180082 224372 240433 163100 132757 91006 62753 90528 90628 62804
9166 62804 108124 205265 197619 72571 16656 -8497 14581 71332 80324 30507 48553 106936
9154 106936 106278 108093 136158 116619 55644 67932 57108 58166 54301 78399 166839 175444 146329
9141 146329 132610 165961 159627 119958 62589 108528 182417 201014 153070 103785 116184 152898
9129 152898 146550 116899 46688 80116 105312 181695 190370 153801 173859 152527 138870 171802
$$ packed form
9214i079P9922M8967j6827m8120K2218N9565J0046n4935j9422k4141k9704l2961
9202a4471J8142K539M3495K0289J1373N6103m6264o2659j3489J8151M070L3258
9190G0537K2202K4705J0288k1223o7288l6072K3891k140j7480P1859L1501M5850
9178A56630L9458j3962k044M4290J6061p7333l0343m1751k8253K7775J00k7824
9166F2804M5320R7141p646j25048n5915k5153K3078N6751Q992m9817J8046N8383
9154A06936o58J815K8065j9539o0975J2288j0824J058l865K4098Q8440Q605k9115
9141A46329j3719L3351o334l9669n7369M5939P3889J8597m7944m9285J2399L6714
9129A52898o348k9651p0211L3428K5196P6383Q675l6569K0058k1332j3657L2932
$$ plain form
9117 171802 193696 162720 116738 130656 129752 131644 120366 82440 67186 73019 82620 71214 113780
9104 113780 204948 194323 145881 141406 133995 182996 187635 176949 180294 192878 213353 154331
9092 154331 103739 99817 111582 125063 129085 108649 85418 130710 161778 212888 229518 203823
9080 203823 137084 105514 136233 167057 183327 171719 158520 146960 152929 179138 179486 144227
9068 144227 103850 63366 154412 205138 107758 68593 113235 68297 122536 186915 243930 285275
9056 285275 283122 219682 236010 194160 159400 128912 121591 164173 208848 235978 248369 211012
9044 211012 195503 208185 171788 159349 139950 152318 144836 118644 121127 153413 156204 149448
9032 149448 156170 84814 36868 69573 149850 163313 170501 181731 197032 231642 215965 155021
$$ packed form
9117A71802K1894l0976m5982J3918r04J892j1278l7926j5254N833R601j1406M2566
9104A13780R1168j0625m8442m475p411M9001M639j0686L345J2584K0475n9022
9092A54331n0592l922J1765J3481M022k0436k3231M5292L1068N1110J6630k5695
9080B03823o6739l1570L0719L0824J6270j1608j3199j1560N969K6209L48l5259
9068A44227m0377m0484R1046N0726r7380l9165M4642m4938N4239O4379N7015M1345
9056B85275k153o3440J6328m1850l4760l0488p321M2582M4675K7130J2391l7357
9044B11012j5509J2682l6397j2439j9399J2368p482k6192K483L2286K791o756
9032A49448O722p1356m7946L2705Q0277J3463P188J1230J5301L4610j5677o0944
$$ plain form
9020 155021 115605 124512 150352 150601 149434 190797 226017 243194 228948 198600 198458 219253 287256
9007 287256 266680 198736 205672 165695 162436 218309 257957 285140 295204 296513 281340 269439
8995 269439 268123 204329 182788 282334 330883 364831 354068 357075 349596 321353 264835 209166
8983 209166 219205 266183 211952 186689 228057 282622 247605 206749 190279 247613 249475 264694
8971 264694 256492 304937 324824 335403 310010 269772 245985 218505 178540 133358 130587 168968
8959 168968 201107 258297 258951 221865 229163 241600 229028 183790 199429 215171 244297 214793
8947 214793 188187 221558 235618 284852 337278 325606 270599 256002 279066 288821 337546 349973
8935 349973 301881 311987 321686 313869 366873 311449 307697 350495 364078 390914 407291 401939
$$ packed form
9020A55021l9416Q907K5840K49j167M1363L5220J7177j4246l0348j42K0795O8003
9007B87256k0576o7944O936l9977l259N5873L9648K7183J0064J309j5173j1901
8995B69439j316o3794k1541R9546M8549L3948j0763L007p479k8243n6518n5669
8983B09166J0039M6978n4231k5263M1368N4565l5017m0856j6470N7334J862J5219
8971B64694q202M8445J9887J0579k5393m0238k3787k7480l9965m5182k771L8381
8959A68968L2139N7190O54l7086P298J2437j2572m5238J5639J5742K9126k9504
8947B14793k6606L3371J4060M9234N2426j1672n5007j4597K3064R755M8725J2427
8935C49973m8092J0106R699p817N3004n5424l752M2798J3583K6836J6377n352
$$ plain form
8923 401939 398784 454222 468781 440949 401448 380642 372727 371661 378121 362173 357334 370933 329310
8910 329310 348815 375967 435406 469536 496197 540506 570688 539034 482729 515194 543273 565704
8898 565704 560192 478626 452089 500729 546562 586930 626856 623414 596626 625711 703829 679011
8886 679011 614986 571140 588019 579484 605661 600892 639693 683568 624776 594990 582094 600784
8874 600784 649882 653965 670935 700905 746880 795713 799584 832507 873554 848346 824782 859509
8862 859509 882674 897130 933427 884036 950611 925132 864530 898118 998590 1013681 966565
8851 966565 981459 1009889 995596 985556 1002621 996805 1033294 1050594 1070723 1147224 1161752 1202227
8839 1202227 1253419 1235771 1227983 1307199 1336624 1361616 1377496 1394500 1376049 1398321 1449137 1506039
$$ packed form
8923D01939l155N5438J4559k7832l9501k0806p915j066O460j5948m839J3599m1623
8910C29310J9505K7152N9439L4130K6661M4309L0182l1654n6305L2465K8079K2431
8898E65704n512q1566k6537M8640M5833M0368L9926l442k6788K9085P8118k4818
8886F79011o4025m3846J6879q535K6177m769L8801M3875n8792k9786j2896J8690
8874F00784M9098M083J6970K9970M5975M8833L871L2923M1047k5208k3564L4727
8862H59509K3165J4456L6297m9391O6575k5479o0602L3588J00472J5091m7116
8851I66565J4894K8430j4293j0040J7065n816L6489J7300K0129P6501J4528M0475
8839A202227N1192j7648p788P9216K9425K4992J5880J7004j8451K2272N0816N6902
$$ plain form
8827 1506039 1528425 1639425 1701908 1729127 1733127 1749611 1798277 1893125 1947985 1997266 2069376
8816 2069376 2083590 2101564 2140968 2225219 2283386 2339062 2409117 2449093 2483955 2582371 2699970
8805 2699970 2750004 2826474 2870376 2914160 2973768 3080993 3160386 3248986 3364264 3522805 3691496
8794 3691496 3788778 3927163 4037870 4119249 4233520 4332659 4509352 4714831 4906066 5070113
8784 5070113 5280250 5493291 5658760 5867125 6158170 6408310 6661635 6921016 7201118 7448066
8774 7448066 7713700 8018932 8333890 8645840 8959234 9282673 9624499 10022378 10467668 10897740
8764 10897740 11298573 11778086 12267176 12695572 13087241 13497874 13895441 14359741 14785403
8755 14785403 15163398 15580405 15981109 16355331 16740609 17053823 17295360 17558711 17757813
$$ packed form
8827A506039K2386J11000O2483K7219M000J6484M8666R4848N4860M9281P2110
8816B069376J4214J7974L9404Q4251N8167N5676P0055L9976L4862R8416J17599
8805B699970N0034P6470M3902M3784N9608J07225P9393Q8600J15278J58541J68691
8794C691496R7282J38385J10707Q1379J14271R9139J76693K05479J91235J64047
8784E070113K10137K13041J65469K08365K91045K50140K53325K59381K80102K46948
8774G448066K65634L05232L14958L11950L13394L23439L41826L97879M45290M30072
8764A0897740M00833M79513M89090M28396L91669M10633L97567M64300M25662
8755A4785403L77995M17007M00704L74222L85278L13214K41537K63351J99102
$$ plain form
8746 17757813 17930505 17954926 17996195 17980857 17934395 17881668 17712625 17442751 17183171 16878895
8736 16878895 16474129 15992378 15592837 15217236 14827868 14386771 13936012 13443112 12959468
8727 12959468 12479863 12050158 11649794 11276048 10900257 10522257 10074329 9655796 9341812
8718 9341812 8971149 8585536 8240374 7920905 7687137 7450985 7156492 6891020 6575254 6302855
8708 6302855 6061695 5884997 5697081 5473140 5261599 5090378 4971194 4837003 4654354 4499262
8698 4499262 4336704 4145245 3965890 3846273 3765574 3610583 3486578 3409926 3325268 3226702
8688 3226702 3135677 3123383 3026212 2955815 2869695 2799876 2736672 2671026 2625029 2510335 2413382
8677 2413382 2347284 2256584 2207829 2209037 2123024 2035036 1974546 1948240 1954257 1891689 1829506 1799881
$$ packed form
8746A7757813J72692K4421M1269j5338m6462n2727j69043k69874k59580l04276
8736A6878895m04766m81751l99541l75601l89368m41097m50759m92900m83644
8727A2959468m79605m29705m00364l73746l75791l78000m47928m18533l13984
8718I341812l70663l85613l45162l19469k33768k36152k94493k65472l15766k72399
8708F302855k41160j76698j87916k23941k11541j71221j19184j34191j82649j55092
8698D499262j62558j91459j79355j19617q0699j54991j24005p6652q4658r8566
8688C226702r1025j2294r7171p0397q6120o9819o3204o5646m5997j14694r6953
8677B413382o6098r0700m8755J208q6013q7988o0490k6306O017o2568o2183k9625
$$ plain form
8665 1799881 1786802 1788374 1783678 1686561 1681324 1707461 1647820 1573153 1503434 1448374 1369912 1362479
8653 1362479 1370763 1340391 1283346 1278002 1231874 1181058 1172384 1228613 1203033 1144190 1114793 1118539
8641 1118539 1143411 1135940 1125482 1086182 1043559 1048337 943118 886238 867078 895273 898143 891146
8629 891146 911580 854655 844985 838459 853198 904145 840183 830738 827873 839539 843735 803009 744474
8616 744474 709123 722026 740555 765185 725218 687343 675936 682016 699664 645789 580933 573738
8604 573738 517340 483513 538660 614415 653194 662246 633547 618896 593355 576752 547349 516881
8592 516881 519946 500954 467619 474703 479271 469697 457193 406578 397289 452544 403108 326963 341943
8579 341943 386599 405840 440631 438419 459453 425898 379971 394032 390568 351002 331993 343520
$$ packed form
8665A799881j3079J572m696r7117n237K6137n9641p4667o9719n5060p8462p433
8653A362479Q284l0372n7045n344m6128n0816q674N6229k5580n8843k9397L746
8641A118539K4872p471j0458l9300m2623M778j05219n6880j9160K8195K870o997
8629H91146K0434n6925r670o526J4739N0947o3962r445k865J1666M196m0726n8535
8616G44474l5351J2903J8529K4630l9967l7875j1407O080J7648n3875o4856p195
8604E73738n6398l3827N5147P5755L8779R052k8699j4651k5541j6603k9403l0468
8592E16881L065j8992l3335P084M568r574j2504n0615r289N5255m9436p6145J4980
8579C41943M4656J9241L4791k212K1034l3555m5927J4061l464l9566j9009J1527
$$ plain form
8567 343520 326404 320484 316661 313339 284492 387556 434936 481120 473482 378134 307751 234110
8555 234110 202727 219264 289649 372941 379859 318951 315498 336615 323171 301609 277013 286227
8543 286227 296479 250465 206440 182221 193191 194606 158868 137381 133726 157431 163897 203889
8531 203889 306396 331055 306913 277329 271193 269875 300091 301056 356343 350181 295266 255207
8519 255207 255614 321684 329522 291722 253364 208022 173422 216489 270337 266826 265130 170044 195077
8506 195077 238092 180982 127544 96190 181501 243860 230077 260187 185853 144486 181472 167604
8494 167604 161798 187043 172286 175123 157675 156591 158533 203934 180221 149660 150927 116344 108361
8481 108361 146275 191708 222263 247408 230081 168126 96729 36867 25603 38532 -6793 48200
$$ packed form
8567C43520j7116n920l823l322k8847J03064M7380M6184p638r5348p0383p3641
8555B34110l1383J6537P0385Q3292O918o0908l453K1117j3444k1562k4596R214
8543B86227J0252m6014m4025k4219J0970J415l5738k1487l655K3705O466L9992
8531B03889J02507K4659k4142k9584o136j318L0216R65N5287o162n4915m0059
8519B55207M07O6070P838l7800l8358m5342l4600M3067N3848l511j696r5086K5033
8506A95077M3015n7110n3438l1354Q5311O2359j3783L0110p4334m1367L6986j3868
8494A67604n806K5245j4757K837j7448j084J942M5401k3713l0561J267l4583p983
8481A08361L7914M5433L0555K5145j7327o1955p1397n9862j1264J2929m5325N4993
$$ plain form
8469 48200 142378 162763 94805 71037 155537 182069 106357 105413 113139 102510 130230 112656
8457 112656 113597 171391 198314 210408 183406 135862 132485 121898 114122 114339 75100 55821 20941
8444 20941 -8090 -22315 29522 107850 131009 64996 72675 73942 49053 103178 172571 187703
8432 187703 172612 126472 128576 149066 181704 153645 156286 184097 134298 145022 124501 55003
8420 55003 -17625 14311 58923 45913 59449 130746 78963 61331 29304 35723 84181 136613
8408 136613 148359 142295 117298 85261 55580 35494 92973 123433 73115 54514 39424 47359
8396 47359 23678 20091 56885 62612 86888 78138 79350 109404 114788 118955 98108 26799 -8707
8383 -8707 -44627 -71253 -21770 71852 48000 35019 31687 59020 117410 108114 110948 123510 109650
$$ packed form
8469D8200R4178K0385o7958k3768Q4500K6532p5712r44P726j0629K7720j7574
8457A12656R41N7794K6923J2094k7002m7544l377j0587p776K17l9239j9279l4880
8444B0941k9031j4225N1837P8328K3159o6013P679J267k4889N4125O9393J5132
8432A87703j5091m6140K104K0490L2638k8059K641K7811m9799J0724k0521o9498
8420E5003p2628L1936M4612j3010J3536P1297n1783j7632l2027O419M8458N2432
8408A36613J1746o064k4997l2037k9681k0086N7479L0460n0318j8601j5090P935
8396D7359k3681l587L6794N727K4276q750J212L0054N384M167k0847p1309l5506
8383h707l5920k6626M9483R3622k3852j2981l332K7333N8390r296K834J2562j3860
$$ plain form
8370 109650 25547 6060 62564 8136 2874 56105 100500 68893 57014 69116 45328 41883
8358 41883 9536 56669 132998 207346 207951 123719 15531 26755 38754 49890 52591 12801
8346 12801 7025 68228 131295 97854 76602 57845 37882 31789 29460 44204 18330 45339
8334 45339 6756 7821 49008 89174 76447 46867 69941 124249 60517 24310 23169 34785
8322 34785 11559 23652 3618 -38167 15948 45736 76168 96497 56441 -40170 -61391 12599
8310 12599 60329 93904 80593 46629 45073 33941 24149 14781 -7719 -20734 -70568 21749
8298 21749 120704 96831 46931 13116 95415 65900 30823 31708 58429 73062 73926 47811 55478
8285 55478 48693 19243 42379 15198 44837 27834 33287 3196 -3933 12253 25400 -1254
$$ packed form
8370A09650q4103j9487N6504n4428n262N3231M4395l1607j1879J2102k3788l445
8358D1883l2347M7133P6329P4348O05q4232j08188J1224J1999J1136K701l9790
8346A2801n776O1203O3067l3441k1252j8757j9963o093k329J4744k5874K7009
8334D5339l8583J065M1187M0166j2727k9580K3074N4308o3732l6207j141J1616
8322C4785k3226J2093k0034m1785N4115K9788L0432K0329m0056r6611k1221P3990
8310A2599M7730L3575j3311l3964j556j1132r792r368k2500j3015m9834R2317
8298B1749R8955k3873m9900l3815Q2299k9515l5077Q85K6721J4633Q64k6115P667
8285E5478o785k9450K3136k7181K9639j7003N453l0091p129J6186J3147k6654
$$ plain form
8273 -1254 -6377 1066 -18467 -76461 -104566 -49913 -17829 24935 21129 -15198 -7123 78289 134729
8260 134729 148346 158869 150199 127253 158463 168953 90595 8190 -67109 -76226 -89978 -36434
8248 -36434 27839 77498 108280 95362 50017 6838 4058 -74529 -136485 -108963 -37366 9675
8236 9675 35038 -13333 -50452 -41908 10017 37280 -2157 -29221 -23813 -9634 20616 -33829
8224 -33829 -8976 7862 11116 -39027 -20020 33245 53490 3617 57307 66275 64444 60597 72400
8211 72400 35625 4827 -25083 -5274 6514 -8049 -32735 -76529 -82996 -72973 -18695 42176
8199 42176 50924 42302 53660 20729 22804 8789 -3540 -16570 -19435 6658 7266 5154 -45703
8186 -45703 -14936 44653 37206 -24760 -16353 9566 -25434 -39397 -44240 -92953 -120644 -64401
$$ packed form
8273a254n123P443j9533n7994k8105N4653L2084M2764l806l6327Q075Q5412N6440
8260A34729J3617J0523q670k2946L1210J0490p8358q2405p5299r117j3752N3544
8248c6434O4273M9659L0782j2918m5345m3179k780p8587o1956K7522P1597M7041
8236I675K5363m8371l7119Q544N1925K7263l9437k7064N408J4179L0250n4445
8224c3829K4853J6838L254n0143J9007N3265K0245m9873N3690Q968j831l847J1803
8211G2400l6775l0798k9910J9809J1788j4563k4686m3794o467J0023N4278O0871
8199D2176Q748q622J1358l2931K075j4015j2329j3030k865K6093O08k112n0857
8186d5703L0767N9589p447o1966Q407K5919l5000j3963m843m8713k7691N6243
$$ plain form
8174 -64401 22445 6602 -3849 -33177 -51706 -30940 -49868 -57806 -52944 -3248 -20910 38365
8162 38365 119510 113273 92026 88841 77707 11588 -10792 11136 21577 3050 42414 61486
8150 61486 42474 16945 52350 58693 108723 93840 112791 73204 13295 -33793 -38328 -94168
8138 -94168 -121830 -79776 -53327 -27437 -17188 -41714 -35857 -54182 -24280 -10663 -18045 -90769
8126 -90769 -66238 -57258 -3398 18409 16273 9028 29036 19074 13980 54600 34732 75900 80380
8113 80380 49046 -31059 -430 47683 95700 95700 52947 44720 -45690 -113327 -86024 -100881 -161502
8100 -161502 -125718 -64436 -54984 -121309 -77394 -15828 -41584 -2101 41017 -11743 -82528 -125581
8088 -125581 -170207 -115626 -87031 -91635 -41203 -7893 30873 -18744 -78015 -73336 19590 86718
$$ packed form
8174f4401Q6846j5843j0451k9328j8529K0766j8928p938M862M9696j7662N9275
8162C8365Q1145o237k1247l185j1134o6119k2380K1928J0441j8527L9364J9072
8150F1486j9012k5529L5405O343N0030j4883J8951l9587n9909m7088m535n5840
8138i4168k7662M2054K6449K5890J0249k4526N857j8325K9902J3617p382p2724
8126i0769K4531Q980N3860K1807k136p245K0008r962n094M0620j9868M1168M480
8113H0380l1334q0105L0629M8113M8017%m2753q227r0410o7637K7303j4857o0621
8100a61502L5784O1282R452o6325M3915O1566k5756L9483M3118n2760p0785m3053
8088a25581m4626N4581K8595m604N0432L3310L8766m9617n9271M679R2926O7128
$$ plain form
8076 86718 94772 48442 -15163 21278 58447 47758 -1657 -16463 -72915 -127173 -110703 -17010
8064 -17010 10194 2188 29918 14178 -25587 -57042 -11978 10661 -13372 -46221 -71668 -38303
8052 -38303 5085 17550 23096 42929 21659 13212 47073 101457 93414 93926 69336 48287 6125
8039 6125 -33034 -19527 -5581 -7624 -11975 -5982 -10387 -20074 -27128 -32939 -29528 27906 27243 8858
8025 8858 -36153 -33666 -16890 -21054 -67112 -68213 -99528 -56036 -34058 -40286 -42257 -127768 -75044
8012 -75044 -20619 -35808 -70019 -64544 -18533 -71328 -120544 -97826 -86922 -42478 -68215 -56272
8000 -56272 -44619 -8051 12527 6276 31061 61794 10924 -23103 27610 18233 -26636 -6965
7988 -6965 16270 -47525 -60074 -35076 -40386 -6770 2041 -31173 -36201 3247 -15507 42704 63535
$$ packed form
8076H6718Q054m6330o3605L6441L7169j0689m9415j4806n6452n4258J6470R3693
8064a7010K7204q006K7730j5740l9765l1455M5064K2639k4033l2849k5447L3365
8052c8303M3388J2465N546J9833k1270q447L3861N4384q043N12k4590k1049m2162
8039F125l9159J3507J3946k043m351N993m405r687p054n811L411N7434o63j8385
8025H858m5011K487J6776m164m6058j101l1315M3492K1978o228j971q5511N2724
8012g5044N4425j5189l4211N475M6011n2795m9216K2718J0904M4444k5737J1943
8000e6272J1653L6568K0578o251K4785L0733n0870l4027N0713r377m4869J9671
7988f965K3235o3795j2549K4998n310L3616Q811l3214n028L9448j8754N8211K0831
$$ plain form
7975 63535 66175 79349 22820 -4392 32213 23571 113087 169454 124473 68249 72875 45231
7963 45231 -20324 -31501 -47232 -30263 -9697 7041 19204 6891 -60199 -35947 -43844 -84860
7951 -84860 -142791 -162259 -108608 -132990 -101319 -59799 -30243 -5076 -28966 -87172 -102311 -99908
7939 -99908 -117162 -109432 -126568 -132003 -124250 -118604 -102550 -91193 -95685 -98238 -30762 34280 1180
7926 1180 15747 16380 -64203 -25988 -6754 3025 24827 98946 126178 58937 30807 42637 41814
7913 41814 37879 41655 73149 42368 18224 -11074 -30487 -11620 51257 79650 27385 -4886
7901 -4886 -73613 -112389 -66743 -272 -30882 -27189 6945 -12093 -37405 -46566 -25506 -53827
7889 -53827 -104387 -58446 -30046 -6571 -26735 -24203 -1842 -11650 -5601 -5393 -4259 -41468 -76883
$$ packed form
7975F3535K640J3174n6529k7212L6605q642Q9516N6367m4981n6224M626k7644
7963D5231o5555j1177j5731J6969K0566J6738J2163j2313o7090K4252p897m1016
7951h4860n7931j9468N3651k4382L1671M1520K9556K5167k3890n8206j5139K403
7939i9908j7254P730j7136n435P753N646J6054J1357m492k553O7476O5042l3100
7926A180J4567O33q0583L8215J9234R779K1802P4119K7232o7241k8130J1830q23
7913D1814l935L776L1494l0781k4144k9298j9413J8867O2877K8393n2265l2271
7901d886o8727l8776M5646O6471l0610L693L4134j9038k5312r161K1060k8321
7889e3827n0560M5941K8400K3475k0164K532K2361r808O049K08J134l7209l5415
$$ plain form
7876 -76883 -47386 -57632 -28774 -15385 13869 15121 33047 5499 -40343 -23807 -38379 -21220
7864 -21220 -41084 -50158 -44502 -26137 -34479 13859 54746 -4771 -60396 -14720 -13698 -35200 -6608
7851 -6608 86311 67345 45083 64006 42346 30280 -14496 -58844 -90282 -84637 -79665 -85147 -45782
7838 -45782 307 55931 39397 -2586 -17134 -32444 -16632 17186 28173 96303 128403 91219
7826 91219 19504 -68916 -171165 -133757 -120759 -96166 -90231 -111547 -128378 -73947 -35589 -58876
7814 -58876 -14901 35214 14667 -67247 -108294 -57256 -2447 -19586 -66108 -79122 -62214 -39834
7802 -39834 -81411 -70978 -18908 -25496 -42070 -33766 27508 43013 -4378 -33080 -49251 -51385
7790 -51385 -63248 -87837 -107763 -62628 -101187 -150518 -108765 -39361 -18774 -18682 -5732 -35647
$$ packed form
7876g6883K9497j0246K8858J3389K9254J252J7926k7548m5842J6536j4572J7159
7864b1220j9864r074N656J8365q342M8338M0887n9517n5625M5676J022k1502K8592
7851f608R2919j8966k2262J8923k1660j2066m4776m4348l1438N645M972n482L9365
7838d5782M6089N5624j6534m1983j4548j5310J5812L3818J0987O8130L2100l7184
7826I1219p1715q8420j02249L7408J2998K4593N935k1316j6831N4431L8358k3287
7814e8876M3975N0115k0547q1914m1047N1038N4809j7139m6522j3014J6908K2380
7802c9834m1577J0433N2070o588j6574Q304O1274J5505m7391k8702j6171k134
7790e1385j1863k4589j9926M5135l8559m9331M1753O9404K0587R2J2950k9915
$$ plain form
7778 -35647 -60188 -67542 -76658 -89135 -93603 -75259 -68995 -69408 -62262 -78324 -74195 -101657 -64303
7765 -64303 -7444 11010 4258 28914 100122 125649 78713 15018 -62081 -63165 -40324 15158
7753 15158 60625 40530 -22088 -60091 -25760 8510 28410 21751 17623 45887 55525 75201
7741 75201 93295 73085 -36282 -27393 -42140 -142374 -150195 -118373 -72641 -97684 -83685 -46545
7729 -46545 -6060 -27942 -78402 -77686 -79272 -102508 -94026 -38051 14321 5516 28812 17237 13772
7716 13772 -3181 -59689 -28288 7537 -21820 -13552 -17443 -42911 -49961 -32826 24485 26366 6565
7703 6565 -13076 -85948 -76374 -44363 -22368 -25485 -12892 -28709 -16344 -28279 -62495 -125042
7691 -125042 -83614 -59967 -85240 -47633 -33923 25438 19629 7406 -25430 -22718 -30685 -89027
$$ packed form
7778c5647k4541p354r116j2477m468J8344O264m13P146j6062M129k7462L7354
7765f4303N6859J8454o752K4656P1208K5527m6936o3695p7099j084K2841N5482
7753A5158M5467k0095o2618l8003L4331L4270J9900o659m128K8264R638J9676
7741G5201J8094k0210j09367Q889j4747j00234p821L1822M5732k5043J3999L7140
7729d6545M0485k1882n0460P16j586k3236Q482N5975N2372q805K3296j1575l465
7716A3772j6953n6508L1401L5825k9357Q268l891k5468p050J7135N7311J881j9801
7703F565j9641p2872R574L2011K1995l117J2593j5817J2365j1935l4216o2547
7691a25042M1428K3647k5273L7607J3710N9361n809j2223l2836K712p967n8342
$$ plain form
7679 -89027 -79114 -66426 -21362 33919 56833 20489 20674 59448 84208 17190 -85053 -71774
7667 -71774 -13858 10525 6918 -32114 -52779 -61209 -67478 -65497 -12186 46502 7968 -14493 -26870
7654 -26870 9885 -18721 -30314 -7667 -36787 -97290 -101257 -90762 -57313 -54922 -22544 51576
7642 51576 61357 98 -43836 -26054 11854 29686 12958 -22678 9260 -22549 -68306 -75722
7630 -75722 -30032 12897 -9634 -141374 -191760 -136065 -92125 -65933 -46455 12085 15960 15148
7618 15148 25212 32687 -3986 -2066 -19321 -33172 10994 -4893 -29946 -34368 16403 -16795
7606 -16795 -63860 -66130 -24202 -80123 -110533 -69466 2972 34339 47937 -56583 -67414 -60851
7594 -60851 -34639 44895 -2379 18571 -21666 -106031 -117360 -70824 -71637 -87445 -68493 -51955
$$ packed form
7679h9027R913J2688M5064N5281K2914l6344J85L8774K4760o7018j02243J3279
7667g1774N7916K4383l607l9032k0665q430o269J981N3311N8688l8534k2461j2377
7654b6870L6755k8606j1593K2647k9120o0503l967J0495L3449K391L2378P4120
7642E1576R781o1259m3934J7782L7908J7832j6728l5636L1938l1809m5757p416
7630g5722M5690M2929k2531j31740n0386N5695M3940K6192J9478N8540L875q12
7618A5148J0064P475l6673J920j7255j3851M4166j5887k5053m422N0771l3198
7606a6795m7065k270M1928n5921l0410M1067P2438L1367J3598j04520j0831O563
7594f0851K6212P9534m7274K0950m0237q4365j1329M6536q13j5808J8952J6538
$$ plain form
7582 -51955 -18429 -33664 -42702 8152 25102 -10235 -36550 -31015 -14881 -3667 -33581 -82431
7570 -82431 -72812 -42861 -51066 -60389 -28409 -11547 15373 63874 51173 -6742 -49127 -52284 -1016
7557 -1016 -8830 -47965 -113018 -56729 -45339 -71514 -39788 -5601 -33628 -43041 -47842 -98634 -110510
7544 -110510 -75271 -54879 -84658 -77130 -97666 -77121 -41603 -5142 -20754 479 -15191 -7818
7532 -7818 -44116 -61149 -76299 -90549 -11879 42411 103990 94987 66394 29135 70010 73449
7520 73449 66461 46902 1467 -61508 -74578 -78967 -82971 -45481 -52828 -76013 -51942 -20903 -70409
7507 -70409 -71833 -28965 -17987 -46075 -87537 -64060 -62898 -28889 -2344 -12202 -71801 -101983
7495 -101983 -60327 -64165 -6220 19436 46500 7365 -12548 22206 44377 51392 70250 42941
$$ packed form
7582e1955L3526j5235r038N0854J6950l5337k6315N535J6134J1214k9914m8850
7570h2431R619K9951q205r323L1980J6862K6920M8501j2701n7915m2385l157N1268
7557a016p814l9135o5053N6289J1390k6175L1726L4187k8027r413m801n0792j1876
7544a10510L5239K0392k9779P528k0536K0545L5518L6461j5612K1233j5670P373
7532g818l6298j7033j5150j4250P8670N4290O1579r003k8593l7259M0875L439
7520G3449o988j9559m5435o2975j3070m389m004L7490p347k3185K4071L1039m9506
7507g0409j424M2868J0978k8088m1462K3477J162L4009K6545r858n9599l0182
7495a01983M1656l838N7945K5656K7064l9135j9913L4754K2171P015J8858k7309
$$ plain form
7483 42941 15091 -8298 -72240 -79354 -17146 42945 1689 -21793 4926 -29309 -45408 -54762
7471 -54762 -59011 -119687 -175809 -122184 -85597 -87796 -25944 68808 56442 67274 72516 63483 76988
7458 76988 85794 118643 81717 12263 37956 43383 41966 38486 8090 -5486 -18853 -60798 -30153
7445 -30153 11488 -13963 -37240 -29269 6727 12246 -31239 -36469 -10735 26791 46560 45804 41532
7432 41532 11511 -19165 -29891 -72616 -33597 21170 7049 -60168 -64389 -14760 -51493 -60928
7420 -60928 -24340 -19933 34293 34065 -16934 -56843 -136932 -105696 -78369 -87079 -57893 -54066 -86106
7407 -86106 -64520 -14134 -59937 -41354 -9377 32065 2607 20395 44976 23714 -7202 -40515
7395 -40515 -35748 -46272 -132498 -146716 -37985 4201 -1883 36557 70816 25583 -12320 -17207
$$ packed form
7483D2941k7850k3389o3942p114O2208O0091m1256k3482K6719l4235j6099r354
7471e4762m249o0676n6122N3625L6587k199O1852R4752j2366J0832N242r033J3505
7458G6988Q806L2849l6926o9454K5693N427j417l480l0396j3576j3367m1945L0645
7445c0153M1641k5451k3277P971L5996N519m3485n230K5734L7526J9769p56m272
7432D1532l0021l0676j0726m2725L9019N4767j4121o7217m221M9629l6733r435
7420f0928L6588M407N4226k28n0999l9909q0089L1236K7327q710K9186L827l2040
7407h6106K1586N0386m5803J8583L1977M1442k9458J7788K4581k1262l0916l3313
7395d0515M767j0524q6226j4218J08731M2186o084L8440L4259m5233l7903m887
$$ plain form
7383 -17207 -43314 13395 39455 -18918 -11786 1420 -4421 33906 39904 2950 -33084 -29693 -16106
7370 -16106 -20636 -79831 -122314 -104592 -11159 20375 -44171 -41720 -18006 90 -13998 -97062
7358 -97062 -93270 -30465 -13214 45604 6613 -1961 24868 66650 82216 93727 99311 82507
7346 82507 41020 14512 848 32023 15038 -32587 -51232 -51816 -15511 -9880 -29964 13086
7334 13086 48675 90635 45123 -37635 -90913 -140995 -152733 -140355 -66465 -47026 -13894 -20740
7322 -20740 -15758 -39638 -57764 3455 40925 46258 44599 -8582 -14181 24033 11860 12386 -16755
7309 -16755 -42686 -31227 5232 42345 61298 51663 3594 -62665 -96924 -125996 -121907 -81880
7297 -81880 3982 32492 57644 66465 48993 73130 82131 55350 37354 31790 17549 28667
$$ packed form
7383a7207k6107N6709K6060n8373P132J3206n841L8327N998l6954l6034L391J3587
7370a6106m530n9195m2483J7722R3433L1534o4546K451K3714J8096j4088q3064
7358i7062L792O2805J7251N8818l8991q574K6829M1782J5566J1511N584j6804
7346H2507m1487k6508j3664L1175j6985m7625j8645n84L6305N631k0084M3050
7334A3086L5589M1960m5512q2758n3278n0082j1738J2378P3890J9439L3132o846
7322b0740M982k3880j8126O1219L7470N333j659n3181n599L8214j2173N26k9141
7309a6755k5931J1459L6459L7113J8953r635m8069o6259l4259k9072M089M0027
7297h1880Q5862K8510K5152Q821j7472K4137R001k6781j7996n564j4241J1118
$$ plain form
7285 28667 20311 22734 10660 -45998 -7602 1570 -6101 11204 -11708 -42511 -66581 -40535 -16656
7272 -16656 -54369 -22084 44032 11068 -12027 -19835 -40905 -50015 -76887 -112081 -125820 -143598
7260 -143598 -72652 -4046 5963 -51639 -14991 -32917 -111591 -134184 -69254 -24251 22611 44391
7248 44391 52898 20517 8000 41096 19524 -33686 -51547 -85821 -76065 -57687 -5592 -23140
7236 -23140 -49449 -18208 9082 66204 64048 26145 -49300 -50881 -51680 -33205 -37327 -37061 -10379
7223 -10379 -21899 -61588 -69145 -93746 -70113 -47876 -19662 -12451 3496 13322 14766 -67442 -79260
7210 -79260 -26547 -9330 -557 -29651 -75189 -107136 -60725 19020 54062 44520 1536 17200
7198 17200 65577 35456 -3688 24759 77204 60420 -5573 -11725 52793 25421 -36882 -68905
$$ packed form
7285B8667q356K423j2074n6658L8396R172p671J7305k2912l0803k4070K6046K3879
7272a6656l7713L2285O6116l2964k3095p808k1070r110k6872l5194j3739j7778
7260a43598P0946O8606J0009n7602L6648j7926p8674k2593O4930M5003M6862K1780
7248D4391Q507l2381j2517L3096k1572n3210j7861l4274R756J8378N2095j7548
7236b3140k6309L1241K7290N7122k156l7903p5445j581p99J8475m122K66K6682
7223a0379j1520l9689p557k4601K3633K2237K8214P211J5947R826J444q2208j1818
7210g9260N2713J7217Q773k9094m5538l1947M6411P9745L5042r542m2984J5664
7198A7200M8377l0121l9144K8447N2445j6784o5993o152O4518k7372o2303l2023
$$ plain form
7186 -68905 -129689 -109819 -107404 -168840 -146267 -77228 -66055 -59087 -10216 41434 16657 -2657
7174 -2657 30171 14244 -34044 -48247 -80060 -91377 -34906 -43812 -49842 -68934 -103378 -91457
7162 -91457 -30685 -41568 -67429 -115391 -62264 -74504 -94690 -78197 -52895 -50090 -37361 -23361
7150 -23361 -43464 19228 38409 53234 42492 46399 33359 28626 10798 -42229 -70161 -44627
7138 -44627 -15542 -52921 -96828 -116461 -127144 -99045 -88513 -55716 -17655 -103153 -148913 -114324
7126 -114324 -101945 -96049 -30207 -73745 -142380 -187934 -104386 -80309 -125051 -101392 -25610 -74829
7114 -74829 -84934 -46539 -35093 17542 38188 15299 -2930 11638 63981 54667 45221 88067
7102 88067 25112 -55224 -51364 -29463 -3938 -31639 -55842 -53366 -17322 -73213 -116051 -90544
$$ packed form
7186f8905o0784J9870K415o1436K2573O9039J1173O968M8871N1650k4777j9314
7174b657L2828j5927m8288j4203l1813j1317N6471q906o030j9092l4444J1921
7162i1457O0772j0883k5861m7962N3127j2240k0186J6493K5302K805J2729J4000
7150b3361k0103O2692J9181J4825j0742L907j3040m733j7828n3027k7932K5534
7138d4627K9085l7379m3907j9633j0683K8099J0532L2797L8061q5498m5760L4589
7126a14324J2379N896O5842m3538o8635m5554Q3548K4077m4742K3659P5782m9219
7114g4829j0105L8395J1446N2635K0646k2889j8229J4568N2343r314r446M2846
7102H8067o2955q0336L860K1901K5525k7701k4203K476L6044n5891m2838K5507
$$ plain form
7090 -90544 -53997 -90909 -100090 -114993 -113564 -57550 -31033 -62167 -58020 31953 63106 17476
7078 17476 -9722 -28111 -10886 -13653 -40161 -107082 -119127 -66725 45248 90131 46099 57114
7066 57114 73620 90837 117816 108804 80889 55564 38393 71328 59514 15968 -12360 -38144
7054 -38144 -45244 -34383 -64414 -88665 -106251 -120322 -75375 -47193 -21155 -23077 -17468 -49621
7042 -49621 -67762 -90183 -86963 -64051 -27999 -79984 -89960 -24573 29735 32289 20734 -2001
7030 -2001 -76572 -113237 -125307 -81472 -84381 -115448 -125872 -46804 -14985 -68204 -143188 -124983
7018 -124983 -49398 -4081 -78064 -54932 -73710 -64613 -100525 -114249 -119433 -9625 24218 36230
7006 36230 54968 3821 -12275 -9843 7049 5509 885 -12137 -85409 -68773 -34519 -16251
$$ packed form
7090i0544L6547l6912r181j4903J429N6014K6517l1134M147Q9973L1153m5630
7078A7476k7198j8389J7225k767k6508o6921j2045N2402J11973M4883m4032J1015
7066E7114J6506J7217K6979r012k7915k5325j7171L2935j1814m3546k8328k5784
7054c8144p100J0861l0031k4251j7586j4071M4947K8182K6038j922N609l2153
7042d9621j8141k2421L220K2912L6052n1985r976O5387N4308K554j1555k2735
7030b001p4571l6665j2070M3835k909l1067j0424P9068L1819n3219p4984J8205
7018a24983P5585M5317p3983K3132j8778R097l5912j3724n184J09808L3843J2012
7006C6230J8738n1147j6096K432J6892j540m624j3022p3272J6636L4254J8268
$$ plain form
6994 -16251 14393 13771 52053 53910 72638 94745 70479 38950 16636 -32866 -37680 4216 17213
6981 17213 63756 92833 81666 35130 7245 -23311 -37978 -48195 -39352 3272 69794 71064
6969 71064 63980 53423 40644 16876 33622 36651 -6449 35256 25712 50593 125729 72632
6957 72632 -18843 -28039 -20777 -62912 -101619 -82145 -53766 -61407 -51786 -51438 -32804 -13019 52748
6944 52748 28737 -2422 19469 -19098 -6728 41904 16067 -62764 -91081 -90607 -91074 -40402 -21575
6931 -21575 -5020 13283 34992 26821 -24088 -10093 -3470 -22763 24309 48632 44113 -3396
6919 -3396 -41275 -34342 -46138 -59078 -28611 -35661 14702 -9968 -55131 -68353 -30505 24426
6907 24426 25380 -27461 -53414 4714 30725 -2603 -19781 43495 57757 6781 9566 28594
$$ packed form
6994a6251L0644o22L8282J857J8728K2107k4266l1529k2314m9502m814M1896J2997
6981A7213M6543K9077j1167m6536k7885l0556j4667j0217Q843M2624O6522J270
6969G1064p084j0557j2779k3768J6746L029m3100M1705r544K4881P5136n3097
6957G2632r1475r196P262m2135l8707J9474K8379p641R621L48J8634J9785O5767
6944E2748k4011l1159K1891l8567J2370M8632k5837p8831k8317M74m67N0672J8827
6931b1575J6555J8303K1709q171n0909J3995O623j9293M7072K4323m519m7509
6919c396l7879O933j1796j2940L0467p050N0363k4670m5163j3222L7848N4931
6907B4426R54n2841k5953N8128K6011l3328j7178O3276J4262n0976K785J9028
$$ plain form
6895 28594 25178 -12296 -83062 -105513 -60024 -24891 -33774 -51073 -88496 -140230 -117280 -79190
6883 -79190 -83043 -49191 -25128 -18125 42862 33149 -22890 -37797 12286 10366 -28420 -60922 -95337
6870 -95337 -59005 -5205 -3935 -35500 -68471 -4629 3993 -44713 -70053 -13663 24066 -7957
6858 -7957 16075 -17837 -64459 -63366 16922 9154 -53264 -96516 -92111 -100612 -69732 -66560 -46227
6845 -46227 -14769 -25817 -4854 24146 24146 17060 -16665 -43214 -9384 56873 77033 52606 17202
6832 17202 13129 23902 30520 12540 -53083 -58461 -48831 -33871 -45607 -4560 28155 40018 26412
6819 26412 -43321 -576 387 -43035 -47366 -137478 -199175 -148973 -102357 -55195 -23885 -10546
6807 -10546 -16050 -57325 -45031 9756 33687 -33439 -81605 -37207 -62585 -79568 -116419 -175730
$$ packed form
6895B8594l416l7474p0766k2451M5489L5133q883j7299l7423n1734K2950L8090
6883g9190l853L3852K4063P003O0987r713n6039j4907N0083j920l8786l2502l4415
6870i5337L6332N3800J270l1565l2971O3842Q622m8706k5340N6390L7729l2023
6858g957K4032l3912m6622J093Q0288p768o2418m3252M405q501L0880L172K0333
6845d6227L1458j1048K0963K9000%p086l3725k6549L3830O6257K0160k4427l5404
6832A7202m073J0773O618j7980o5623n378R630J4960j1736M1047L2715J1863j3606
6819B6412o9733M2745R63m3422m331r0112o1697N0202M6616M7162L1310J3339
6807a0546n504m1275J2294N4787K3931o7126m8166M4398k5378j6983l6851n9311
$$ plain form
6795 -175730 -150192 -113785 -119654 -82519 -76232 -33538 -18055 -32535 -37255 -123383 -85818 -69228
6783 -69228 -115888 -95422 -53022 -14224 6779 -11516 -20489 -2664 -64471 -114838 -81040 -105327
6771 -105327 -90290 -59611 -28414 -24778 -23266 -80649 -93450 -40203 -12718 -40589 -47132 -62034
6759 -62034 -27568 -9017 -56427 -94380 -120560 -141865 -68909 18176 8460 -6856 -23026 31844
6747 31844 66320 68198 63753 66445 51710 17230 5349 6892 31380 -349 -13547 10406 15422
6734 15422 -9514 8783 56652 62842 67593 33576 -9085 -22515 -44600 -78825 -120370 -61124
6722 -61124 18348 42181 40118 17634 -6666 26297 48756 19915 47917 100544 112324 101489
6710 101489 88995 83224 54440 23998 33631 55354 75529 131314 62266 -6566 -55293 -69390
$$ packed form
6795a75730K5538L6407n869L7135O287M2694J5483j4480m720q6128L7565J6590
6783f9228m6660K0466M2400L8798K1003j8295q973J7825o1807n0367L3798k4287
6771a05327J5037L0679L1197L636J512n7383j2801N3247K7485k7871o543j4902
6759f2034L4466J8551m7410l7953k6180k1305P2956Q7085r716j5316j6170N4870
6747C1844L4476J878m445K692j4735l4480j1881J543K4488l1729j3198K3953N016
6734A5422k4936J8297M7869O190M751l4017m2661j3430k2085l4225m1545N9246
6722f1124P9472K3833k063k2484k4300L2963K2459k8841K8002N2627J1780j0835
6710A01489j2494n771k8784l0442R633K1723K0175N5785o9048o8832m8727j4097
$$ plain form
6698 -69390 -43116 16246 43844 33037 -22222 -58712 -36980 26591 73190 74488 24964 44725
6686 44725 60890 930 -2081 -44964 -63757 -52508 -12527 110 -3866 4040 27100 10478
6674 10478 -46707 -52799 -68815 -36635 -7933 -70364 -46360 -36670 -86519 -99292 -55874 -14927
6662 -14927 -15694 -38010 41321 29456 3011 11566 7086 63504 100449 73275 9780 -39088 -64122
6649 -64122 -55356 -49247 -35449 -47955 -27716 6920 -25987 -42474 -43680 -27608 -7209 -53694
6637 -53694 -68886 -22282 -30990 -28572 6513 -4925 2306 -9572 -64364 -44667 -25728 8850
6625 8850 17050 -21785 -48548 -42495 -48178 -101071 -142985 -62746 3289 6749 22510 4370 -43068
6612 -43068 8055 -2268 -59480 -41543 -18115 -18794 -6969 12142 -6595 -15445 -15799 17678 -6415
$$ packed form
6698f9390K6274N9362K7598j0807n5259l6490K1732O3571M6599J298m9524J9761
6686D4725J6165n9960l011m2883j8793J1249L9981J2637l976P906K3060j6622
6674A0478n7185o092j6016L2180K8702o2431K4004R690m9849j2773M3418M0947
6662a4927p67k2316P9331j1865k6445Q555m480N6418L6945k7174o3495m8868k5034
6649f4122Q766O109J3798j2506K0239L4636l2907j6487j206J6072K0399m6485
6637e3694j5192M6604q708K418L5085j1438P231j1878n4792J9697J8939L4578
6625H850Q200l8835k6763O053n683n2893m1914Q0239O6035L460J5761j8140m7438
6612d3068N1123j0323n7212J7937K3428o79J1825J9111j8737q850l54L3477k4093
$$ plain form
6599 -6415 -17492 -31615 -10662 39644 57394 3304 9557 46121 4023 3800 63158 44016 -6798
6586 -6798 -29836 -21733 19836 66204 40898 11527 -41563 -52874 -49741 -9677 27696 53789
6574 53789 79876 41149 -21068 10393 26478 25648 -23588 -29824 -32480 -52938 -89773 -86844 -53368
6561 -53368 -49217 -30127 -41449 -7877 -14537 -27616 7918 -49757 -67612 -6466 -3749 2329 9906
6548 9906 11038 -20241 -56314 -55237 -50871 -62296 -41890 -75726 -40851 9810 56975 80295 46600
6535 46600 18963 8838 15464 5989 -56904 -39563 22451 28625 7847 -40583 -2704 -20052
6523 -20052 12797 15893 -10226 -7820 -12415 -24667 -45116 -44405 -21132 6311 -13729 -14174 -25143
6510 -25143 31486 91686 64572 61616 47662 11850 286 47961 58240 -10675 2662 20005
$$ packed form
6599f415j1077j4123K0953N0306J7750n4090O253L6564m2098k23N9358j9142n0814
6586f798k3038Q103M1569M6368k5306k9371n3090j1311L133M0064L7373K6093
6574E3789K6087l8727o2217L1461J6085q30m9236o236k656k0458l6835K929L3476
6561e3368M151J9090j1322L3572o660j3079L5534n7675j7855O1146K717O078P577
6548I906J132l1279l6073J077M366j1425K0406l3836L4875N0661M7165K3320l3695
6535D6600k7637j0125O626r475o2893J7341O2014O174k0778m8430L7879j7348
6523b0052L2849L096k6119K406m595j2252k0449P11K3273K7443k0040m45j0969
6510b5143N6629O0200k7114k956j3954l5812j1564M7675J0279o8915J3337J7343
$$ plain form
6498 20005 42192 55906 28985 44724 78499 12750 -15974 -42198 -33099 -22297 -6111 71973
6486 71973 73237 39336 50399 27241 14645 19164 12284 -28358 -29951 -36380 8784 23384 -22339
6473 -22339 -46109 -87650 -56612 13232 11979 -25304 -24220 -23825 70787 101559 44849 -31573 -23662
6460 -23662 -23468 22002 30338 14541 -54445 -84618 -88099 -57841 -657 23910 -459 7440 -56451
6447 -56451 -87395 -41361 11149 31497 42360 71120 33568 -13867 -18024 37390 86861 99152
6435 99152 79527 21863 24394 1896 -6211 -1260 56756 71505 69774 44740 34435 17939 -571
6422 -571 1716 -24341 -43704 -20213 -12229 -6890 -4470 -16710 15849 5171 -17472 -7720 29853
6409 29853 64163 85477 63220 71514 70358 56906 44432 5474 -18399 -4513 -26857 -25215
$$ packed form
6498B0005K2187J3714k6921J5739L3775o5749k8724k6224R099J0802J6186P8084
6486G1973J264l3901J1063k3158j2596M519o880m0642j593o429M5164J4600m5723
6473b2339k3770m1541L1038O9844j253l7283J084L95R4612L0772n6710p6422P911
6460b3662J94M5470Q336j5797o8986l0173l481L0258N7184K4567k4369P899o3891
6447e6451l0944M6034N2510K0348J0863K8760l7552m7435m157N5414M9471J2291
6435I9152j9625n7664K531k2498q107M951N8016J4749j731k5034j0305j6496j8510
6422e71K287k6057j9363K3491P984N339K420j2240L2559j0678k2643R752L7573
6409B9853L4310K1314k2257Q294j156j3452j2474l8958k3873J3886k2344J642
$$ plain form
6397 -25215 -16970 25719 18946 -56821 -88119 -90537 -20313 50854 73782 7125 -57291 -96149
6385 -96149 -55917 -46556 -111355 -131904 -118318 -57590 -17232 -48108 -57522 -27693 6982 -12187
6373 -12187 -22555 -21984 -32748 -39544 -65878 -6096 46553 9462 -2636 38942 23556 22676 47940
6360 47940 51238 16773 16493 12322 33666 64117 87283 42764 208 34747 79588 37167 -51084
6347 -51084 -66612 -46740 -14015 -17192 -33621 -15889 -8493 -40617 -35365 -21512 -63721 -41037
6335 -41037 -39363 -12265 45960 7586 19583 26705 25839 -28056 -1218 20539 -1675 -89173 -130983
6322 -130983 -85885 -72424 -59069 -47596 -47270 -63116 -60583 -25065 20484 13425 -12063 -23897
6310 -23897 -33684 -60264 -50541 -26372 -31873 -97353 -126028 -125285 -35596 -20151 -38566 -26759 17847
$$ packed form
6397b5215Q245M2689o773p5767l1298k418P0224P1167K2928o6657o4416l8858
6385i6149M0232R361o4799k0549J3586O0728M0358l0876r414K9829L4675j9169
6373a2187j0368N71j0764o796k6334N9782N2649l7091j2098M1578j5386q80K5264
6360D7940L298l4465k80m171K1344L0451K3166m4519m2556L4539M4841m2421q8251
6347e1084j5528J9872L2725l177j6429J7732P396l2124N252J3853m2209K2684
6335d1037J674K7098N8225l8374J1997P122q66n3895K6838K1757k2214q7498m1810
6322a30983M5098J3461J3355J1473L26j5846K533L5518M5549p059k5488j1834
6310b3897r787k6580R723K4169n501o5480k8675P43Q9689J5445j8415J1807M4606
$$ plain form
6297 17847 8355 2150 -20390 -23138 -20177 -18570 -48454 -106654 -71706 -65257 -81930 -68380 26499
6284 26499 64034 81505 74001 57126 73692 81915 71659 69393 107797 94220 150147 180448
6272 180448 137618 67727 -21173 -48763 -38288 -10769 -9324 7694 -28570 -79206 -78773 -44482
6260 -44482 -67483 -105308 -31526 61441 46399 17522 53345 26627 -6922 -820 -32678 -47805
6248 -47805 -40107 -22998 -76680 -48080 -28912 -16341 2426 -15232 -70637 -65400 -15325 -23032
6236 -23032 18239 -27268 -65211 -43408 -28558 16617 55991 107760 82444 78995 14141 -4006
6224 -4006 25025 13072 54273 82754 92596 83562 108988 26943 47524 13975 -20711 -35494
6212 -35494 -21337 -2367 -12617 3441 -2234 -15419 1727 19176 -848 -47614 -59945 -75414
$$ packed form
6297A7847r492o205k2540k748K961J607k9884n8200L4948O449j6673J3550R4879
6284B6499L7535J7471p504j6875J6566Q223j0256k266L8404j3577N5927L0301
6272A80448m2830o9891q8900k7590J0475K7519J445J7018l6264n0636M33L4291
6260d4482k3001l7825P3782R2967j5042k8877L5823k6718l3549O102l1858j5127
6248d7805P698J7109n3682K8600J9168J2571J8767j7658n5405N237N0075p707
6236b3032M1271m5507l7943K1803J4850M5175L9374N1769k5316l449o4854j8147
6224d006K9031j1953M1201K8481R842r034K5426q2045K0581l3549l4686j4783
6212c5494J4157J8970j0250J6058n675j3185J7146J7449k0024m6766j2331j5469
$$ plain form
6200 -75414 -67071 -327 36807 -3153 -33115 -15518 -35556 -73832 -38238 -10062 -12719 -16849
6188 -16849 2276 4963 21072 -4330 -14344 34884 28826 -2611 21325 -50492 -56362 -51493 -26684
6175 -26684 -7066 -17920 31140 21128 -14309 -76274 -115666 -73423 -61681 -58314 -26368 -15121
6163 -15121 29611 33781 -71286 -134895 -110132 -109269 -43386 54129 92984 62337 44258 86185
6151 86185 73695 22205 -42890 -52984 -63715 -20582 16201 -30126 -53385 -100587 -113718 -137598
6139 -137598 -93133 -17736 17610 4028 18061 6703 1144 -13095 -34406 -10765 38 -13238
6127 -13238 16832 44399 63859 46389 32749 39771 77861 118568 142825 50409 1418 29337
6115 29337 8788 -8644 -27124 -49420 -14587 -23473 12753 46000 38779 56275 110635 111931
$$ packed form
6200g5414Q343O6744L7134l9960k9962J7597k0038l8276L5594K8176k657m130
6188a6849J9125K687J6109k5402j0014M9228o058l1437K3936p1817n870M869K4809
6175b6684J9618j0854M9060j0012l5437o1965l9392M2243J1742L367L1946J1247
6163a5121M4732M170j05067o3609K4763Q63O5883R7515L8855l0647j8079M1927
6151H6185j2490n1490o5095j0094j0731M3133L6783m6327k3259m7202j3131k3880
6139a37598M4465P5397L5346j3582J4033j1358n559j4239k1311K3641J0803j3276
6127a3238L0070K7567J9460j7470j3640P022L8090M0707K4257r2416m8991K7919
6115B9337k0549j7432j8480k2296L4833q886L6226L3247p221J7496N4360J296
$$ plain form
6103 111931 80366 35377 -23484 -14771 -49248 -99888 -154556 -158950 -147939 -75151 12435 21039
6091 21039 -5537 -30312 -43759 -25970 -11129 -1795 16824 53423 60063 75951 64914 48362
6079 48362 38469 58465 43786 22177 -95223 -93966 -42251 -63963 -61847 -111645 -105828 -49645
6067 -49645 -12850 32706 32759 74269 34287 -44541 -7938 40510 14838 43031 43930 64615 66467
6054 66467 53436 11090 17772 38210 23833 32451 52548 8331 -22318 -55666 -103248 -114714
6042 -114714 -58302 -16225 47036 83618 89628 110301 105636 35646 53434 31632 33159 56580
6030 56580 41391 20905 3295 -5469 -36934 -32180 -13258 6706 -38817 -59648 -68443 -17465
6018 -17465 -18193 -15337 41190 46403 40485 19236 -30892 -53438 -27035 -3069 52552 52807 18630
$$ packed form
6103A11931l1565m4989n8861Q713l4477n0640n4668m394J1011P2788Q7586Q604
6091B1039k6576k4775j3447J7789J4841R334J8619L6599O640J5888j1037j6552
6079D8362r893J9996j4679k1609j17400J257N1715k1712K116m9798N817N6183
6067d9645L6795M5556N3M1510l9982p8828L6603M8448k5672K8193Q99K0685J852
6054F6467j3031m2346O682K0438j4377Q618K0097m4217l0649l3348m7582j1466
6042a14714N6412M2077O3261L6582O010K0673m665o9990J7788k1802J527K3421
6030E6580j5189k0486j7610q764l1465M754J8922J9964m5523k0831q795N0978
6018a7465p28K856N6527N213n918k1249n0128k2546K6403K3966N5621K55l4177
$$ plain form
6005 18630 15123 -39923 -76954 -44878 -36430 -57138 -20611 7845 6935 -9449 -28113 -7031 -18653
5992 -18653 -56398 -36901 25196 2923 -9964 9987 39279 41361 -9790 -61332 -39951 -3247
5980 -3247 13686 4531 -58539 -85122 -31276 -21174 -41769 -43279 -8886 -29558 -71791 -76479 -33230
5967 -33230 -82737 -100973 -67147 -19265 -42553 -28792 -73552 -78332 -44994 -40913 -46938 -36372
5955 -36372 -66395 -103207 -87534 44266 70850 15032 -13528 -24939 35325 35440 5086 -23949
5943 -23949 -17806 -18795 -27028 -54425 -95561 -143216 -150870 -155913 -118892 -95758 -97594 -76653 -94827
5930 -94827 -112378 14957 38497 -13766 -76780 -48873 -63938 -33441 -19245 34877 -18324 2172
5918 2172 47767 27857 55940 55642 -6143 -52216 -13929 -5602 -15385 -33430 16438 26794 -3277
$$ packed form
6005A8630l507n5046l7031L2076Q448k0708L6527K8456r10j6384j8664K1082j1622
5992a8653l7745J9497O2097k2273j2887J9951K9292K082n1151n1542K1381L6704
5980c247J6933r155o3070k6583N3846J0102k0595j510L4393k0672m2233m688M3249
5967c3230m9507j8236L3826M7882k3288J3761m4760m780L3338M081o025J0566
5955c6372l0023l6812J5673J31800K6584n5818k8560j1411O0264J15l0354k9035
5943b3949O143r89q233k7397m1136m7655p654n043L7021K3134j836K0941j8174
5930i4827j7551J27335K3540n2263o3014K7907j5065L0497J4196N4122n3201K0496
5918B172M5595j9910K8083k98o1785m6073L8287Q327r783j8045M9868J0356l0071
$$ plain form
5905 -3277 2672 -3977 -19309 13728 27986 18470 31646 7989 -41847 -85897 -34433 -26624 -31763
5892 -31763 -58867 -68512 -79341 -66706 -59605 -34095 -69508 -94854 -88017 -56069 -2280 18147
5880 18147 35813 27409 -36908 -61108 -87065 -71595 -21651 16369 52375 22575 -3315 -8460
5868 -8460 12037 58520 33817 -64247 -101098 -94244 -37806 44371 16908 13790 43868 39075 8819
5855 8819 8082 48543 74567 59248 45448 96376 86536 68828 9384 20820 68034 99760 111246
5842 111246 38845 -68695 -100512 -74434 -92221 -52588 -58485 -33969 -112790 -171273 -152289 -133387
5830 -133387 -133658 -120831 -107649 -47585 22263 90505 31042 30322 19797 -5407 -57228 -50688 -42121
5817 -42121 -47249 -99779 -46145 -17143 -39540 -46022 -22620 26144 27612 22096 -7131 -19044 -9752
$$ packed form
5905c277N949o649j5332L3037J4258r516J3176k3657m9836m4050N1464P809n139
5892c1763k7104r645j0829J2635P101K5510l5413k5346O837L1948N3789K0427
5880A8147J7666q404o4317k4200k5957J5470M9944L8020L6006k9800k5890n145
5868h460K0497M6483k4703r8064l6851O854N6438Q2177k7463l118L0078m793l0256
5855H819p37M0461K6024j5319j3800N0928r840j7708n9444J1436M7214L1726J1486
5842A11246p2401j07540l1817K6078j7787L9633n897K4516p8821n8483J8984J8902
5830a33387k71J2827J3182O0064O9848O8242n9463p20j0525k5204n1821O540Q567
5817d2121n128n2530N3634K9002k2397o482K3402M8764J468n516k9227j1913R292
$$ plain form
5804 -9752 -18043 -48409 -65128 -46620 -43127 -21373 16412 20539 -20659 -34933 -47860 -75263 -29083
5791 -29083 6378 -47055 -54800 2639 29218 44425 42486 18854 -27526 7479 40975 10095
5779 10095 -39016 -14689 -48325 -100006 -60736 -30773 20065 20478 21781 50649 72653 25764
5767 25764 11230 -13232 -27494 -48992 -101212 -103395 -77923 -85094 -92580 -53203 -11789 -38409
5755 -38409 -61451 -21468 -3808 48026 58927 52962 16041 -26635 -28482 -40464 -56635 -33403
5743 -33403 38395 20971 12628 -26534 22732 52407 5167 -76679 -95174 -50493 4015 -14661
5731 -14661 -32049 12884 15356 65005 33506 -25668 24959 50563 59921 90044 9903 -2487
5719 -2487 1139 -16822 -59034 -45849 -41372 -106284 -106899 -93260 -79887 -94968 -121522 -109086 -98300
$$ packed form
5804i752q291l0366j6719J8508L493K1754L7785M127m1198j4274j2927k7403M6180
5791b9083L5461n3433p745N7439K6579J5207j939k3632m6380L5005L3496l0880
5779A0095m9111K4327l3636n1681L9270K9963N0838M13J303K8868K2004m6889
5767B5764j4534k4462j4262k1498n2220k183K5472p171p486L9377M1414k6620
5755c8409k3042L9983J7660N1834J0901n965l6921m2676j847j1982j6171K3232
5743c3403P1798j7424q343l9162M9266K9675m7240q1846j8495M4681N4508j8676
5731a4661j7388M4933K472M9649l1499n9174N0627K5604R358L0123q0141j2390
5719b487L626j7961m2212J3185M477o4912o15J3639J3373j5081k6554J2436J0786
$$ plain form
5706 -98300 -90238 -65802 -33082 -4266 13298 20247 2630 -29508 -43416 -10775 -20760 3569
5694 3569 41467 36742 18072 67655 80492 116857 88188 41895 -688 -12143 -32533 -55624
5682 -55624 -50931 -27542 6365 1619 6120 6184 20301 47732 48723 -11433 -49474 -1303 -123 -8333
5668 -8333 -10898 10781 37421 49105 87037 24232 -49544 -78882 -36876 2221 -10614 -73056
5656 -73056 -111681 -88470 -77137 -36644 -20368 4122 25996 40593 83224 67351 38750 3770
5644 3770 11216 -22850 -71544 -77025 -79956 -56526 -30209 1979 -33514 -78563 -98075 -94386 -25341
5631 -25341 44774 58240 73469 69027 58877 68205 34335 24999 23603 10659 -13054 22811 27924
5618 27924 -26165 -21839 -18399 -47580 -24929 11684 -30766 -38949 -754 53296 67239 19568
$$ packed form
5706i8300Q062K4436L2720K8816J7564O949j7617l2138j3908L2641r985K4329
5694C569L7898m725j8670M9583J2837L6365k8669m6293m2583j1455k0390k3091
5682e5624M693K3389L3907m746M501O4J4117K7431R91o0156l8041M8171J180q210
5668h333k565K1679K6640J1684L7932o2805p3776k9338M2006L9097j2835o2442
5656g3056l8625K3211J1333M0493J6276K4490K1874J4597M2631j5873k8601l4980
5644C770P446l4066m8694n481k931K3430K6317L2188l5493m5049j9512L689O9045
5631b5341P0115J3466J5229m442j0150R328l3870r336j396j2944k3713L5865N113
5618B7924n4089M326L440k9181K2651L6613m2450q183L8195N4050J3943m7671
$$ plain form
5606 19568 11077 -24492 -74349 -73521 -72477 -13235 16118 -57728 -51740 -23277 -18169 -13030 -67701
5593 -67701 -50142 7474 29550 -26077 -48418 -16073 28705 16054 15518 -23363 -57972 15358
5581 15358 37953 -3966 -29570 -36912 -60980 -54710 -94953 -118975 -180151 -179872 -102234 1328
5569 1328 5416 -32346 -49581 -71107 -96005 -117971 -122775 -95816 -72014 -89093 -51227 24364
5557 24364 -7489 -71925 -78744 -7307 -3826 8613 -1904 -19550 8312 23915 -43081 -75181
5545 -75181 -29573 -23082 -64542 -46512 -4744 60513 42467 -67706 -68169 -43449 -4759 -9884
5533 -9884 -2862 27867 -25307 -56151 -38898 1684 31339 -33516 -86872 -51777 -31746 27667
5521 27667 34421 74105 51892 25657 -17096 -2311 -30586 -69751 -79507 -113744 -92669 -78684
$$ packed form
5606A9568q491l5569m9857Q28J044N9242K9353p3846N988K8463N108N139n4671
5593f7701J7559N7616K2076n5627k2341L2345M4778j2651n36l8881l4609P3330
5581A5358K2595m1919k5604p342k4068O270m0243k4022o1176K79P7638J03562
5569A328M088l7762j7235k1526k4898k1966m804K6959K3802j7079L7866P5591
5557B4364l1853o4436o819P1437L481J2439j0517j7646K7862J5603o6996l2100
5545g5181M5608O491m1460J8030M1768O5257j8046j10173m63K4720L8690n125
5533i884P022L0729n3174l0844J7253M0582K9655o4855n3356L5095K0031N9413
5521B7667O754L9684k2213k6235m2753J4785k8275l9165r756l4237K1075J3985
$$ plain form
5509 -78684 -58667 -101930 -141771 -137552 -145257 -150059 -119097 -26818 7262 -5672 -15341 -50572 -86166
5496 -86166 -109167 -40631 -25948 2283 16354 2226 4642 14238 23943 53115 2827 -30431
5484 -30431 -31530 -11246 5340 -2900 21713 80112 51140 3576 -21143 -34752 -52459 -51715 -67343
5471 -67343 -39327 -17035 -34357 -17872 22015 57830 72893 22756 -48226 -90603 -121337 -142020
5459 -142020 -183286 -183726 -123660 -48171 -37544 5634 11245 15858 7601 23415 2802 -9430 25580
5446 25580 62416 34972 73129 54217 -60481 -93044 -87943 -45469 -38582 -56514 -58160 -51765
5434 -51765 -66547 -56304 -6295 -19711 -19811 -32916 -66774 -92449 -89348 -96169 -59379 -11524 -14107
5421 -14107 -88338 -69401 -16561 -11672 22124 -45629 -52798 -10433 25973 42380 24385 2564
$$ packed form
5509g8684K0017m3263l9841M219p705m802L0962R2279L4080j2934r669l5231l5594
5496h6166k3001O8536J4683K8231J4071j4128K416R596R705K9172n0288l3258
5484c0431j099K0284J6586q240K4613N8399k8972m7564k4719j3609j7707P44j5628
5471f7343K8016K2292j7322J6485L9887L5815J5063n0137p0982m2377l0734k0683
5459a42020m1266m40O0066P5489J0627M3178N611M613q257J5814k0613j2232L5010
5446B5580L6836k7444L8157j8912j14698l2563N101M2474O887j7932j646O395
5434e1765j4782J0243N0009j3416j00j3105l3858k5675L101o821L6790M7855k583
5421a4107p4231J8937N2840M889L3796o7753p169M2365L6406J6407j7995k1821
$$ plain form
5409 2564 -5617 -14422 -1719 -23709 -36608 -33122 -15488 49257 110463 113312 56842 11682 2316
5396 2316 -46306 -50341 -44625 -51497 -20101 -18891 -30800 -71216 -81014 -72362 -119681 -102546 -26330
5383 -26330 14657 6864 -23139 -14531 3254 -5354 39949 4973 -15182 -80339 -72047 -11339 -2032
5370 -2032 30103 132837 158254 90811 59352 7466 16843 18642 468 16909 19673 -72623
5358 -72623 -62963 -73317 -126101 -85136 22859 111271 81812 20356 28659 36076 4113 3187 -3158
5345 -3158 6538 -21094 8179 36400 43616 -2221 5106 20911 -39359 -89024 -157160 -120230 -60601
5332 -60601 -92035 -110449 -82689 -37272 -80388 -122946 -137345 -181141 -192372 -109618 -38689 -99517
5320 -99517 -118437 -56500 -39148 -63213 -80615 -89939 -23528 54043 53423 9953 63886 91905
$$ packed form
5409B564q181q805J2703k1990j2899L486J7634O4745O1206K849n6470m5160r366
5396B316m8622m035N716o872L1396J210j1909m0416r798Q652m7319J7135P6216
5383b6330M0987p793l0003Q608J7785q608M5303l4976k0155o5157Q292O0708R307
5370b032L2135J02734K5417o7443l1459n1886R377J799j8174J6441K764r2296
5358g2623R660j0354n2784M0965J07995Q8412k9459o1456Q303P417l1963r26o345
5345c158R696k7632K9273K8221P216m5837P327J5805o0270m9665o8136L6930N9629
5332f0601l1434j8414K7760M5417m3116m2558j4399m3796j1231Q2754P0929o0828
5320i9517j8920O1937J7352k4065j7402r324O6411P7571o20m3470N3933K8019
$$ plain form
5308 91905 79420 90716 102807 62937 25922 8857 17288 -55002 -52830 -2968 17520 2487
5296 2487 34867 89210 44193 32343 22608 3000 -19201 -4090 29108 24939 22256 53744 60697
5283 60697 19020 62258 116017 74965 32379 -35506 -47266 9841 -167 -33209 -62689 -14274
5271 -14274 1801 20063 32005 -54373 -124180 -165223 -133305 -106499 -93648 -72183 -33723 -59969
5259 -59969 -49769 -31793 -76391 -123500 -131723 -98856 -20862 -4538 -24890 -12831 -15230 -13854
5247 -13854 4285 -14392 -8622 5587 64537 114899 135020 107711 113990 98885 60998 27928
5235 27928 18172 -917 -73991 -111432 -53458 -55906 -77268 -24838 16521 20722 -21113 -60578
5223 -60578 -67359 14609 24559 -17257 -79604 -99059 -79074 -90113 -99742 -114408 -119107 -105949 -42135
$$ packed form
5308I1905j2485J1296J2091l9870l7015j7065Q431p2290K172M9862K0488j5033
5296B487L2380N4343m5017j1850r735j9608k2201J5111L3198m169k683L1488O953
5283F0697m1677M3238N3759m1052m2586o7885j1760N7107j0008l3042k9480M8415
5271a4274J6075J8262J1942q6378o9807m1043L1918K6806J2851K1465L8460k6246
5259e9969J0200J7976m4598m7109q223L2867P7994J6324k0352J2059k399J376
5247a3854J8139j8677N770J4209N8950N0362K0121k7309O279j5105l7887l3070
5235B7928r756j9089p3074l7441N7974k448k1362N2430M1359M201m1835l9465
5223f0578o781Q1968R950m1816o2347j9455J9985j1039r629j4666m699J3158O3814
$$ plain form
5210 -42135 -55443 -65031 -92657 -87259 -73964 -73986 -65582 -27654 21722 47115 3761 -23655 19748
5197 19748 24946 -7346 -19638 -19704 13522 37629 7360 -49134 -65526 -88779 -50584 50489
5185 50489 -14188 -63912 -17669 7360 13860 62634 115186 82499 54048 32753 31000 44398
5173 44398 80963 32068 -1179 -39275 -124391 -89881 -81457 -55598 -18011 6475 10897 27362
5161 27362 3631 -36955 -37691 -22518 -37631 -74102 -77184 -89282 -116511 -31213 -41008 -25861 19387
5148 19387 4035 21605 39837 34698 14189 583 -27352 7665 2658 47271 89227 84387
5136 84387 25556 42806 62659 109910 87683 -23982 12739 6643 -25298 -70721 -36870 25989
5124 25989 76106 44023 -23058 -117846 -137233 -112825 -119619 -18107 -16430 -34025 -43978 22864
$$ packed form
5210d2135j3308r588k7626N398J3295k2Q404L7928M9376K5393m3354k7416M3403
5197A9748N198l2292j2292o6L3226K4107l0269n6494j6392k3253L8195J01073
5185E0489o4677m9724M6243K5029O500M8774N2552l2687k8451k1295j753J3398
5173D4398L6565m8895l3247l8096q5116L4510Q424K5859L7587K4486M422J6465
5161B7362k3731m0586p36J5173j5113l6471l082j2098k7229Q5298r795J5147M5248
5148A9387j5352J7570J8232n139k0509j3606k7935L5017n007M4613M1956m840
5136H4387n8831J7250J9853M7251k2227j11665L6721o096l1941m5423L3851O2859
5124B5989N0117l2083o7081r4788j9387K4408o794J01512J677j7595r953O6842
$$ plain form
5112 22864 40612 -21906 -14477 16383 42700 24881 -4800 12069 23717 17916 13038 9717 8035
5099 8035 -9730 -15392 39440 73489 58986 100418 118044 115787 9048 -41248 -62841 -63336 -27627
5086 -27627 -6333 -19235 -26775 738 28109 5174 17498 24815 6363 -14395 15429 -30371
5074 -30371 -63205 -78769 -75390 110 12421 6832 34604 -14504 -20222 48306 97315 110839
5062 110839 85372 24864 -16504 -36002 23790 64958 68911 38066 8047 20587 41061 47324
5050 47324 64230 -2670 -24653 -32612 -7181 -1181 13500 31809 45354 70294 5728 -16365
5038 -16365 -19141 23203 16720 6484 38547 83524 35231 -16079 -1197 14487 -46244 -77598
5026 -77598 -23909 -54077 -50972 -14085 27883 47315 -1010 -19740 -31221 -82220 -81178 -117738
$$ packed form
5112B2864J7748o2518P429L0860K6317j7819k9681J6869J1648n801m878l321j682
5099H035j7765n662N4832L4049j4503M1432J7626k257j06739n0296k1593m95L5709
5086b7627K1294j2902p540K7513K7371k2935J2324P317j8452k0758K9824m5800
5074c0371l2834j5564L379P5500J2311n589K7772m9108n718O8528M9009J3524
5062A10839k5467o0508m1368j9498N9792M1168L953l0845l0019J2540K0474O263
5050D7324J6906o6900k1983p959K5431O000J4681J8309J3545K4940o4566k2093
5038a6365k776M2344o483j0236L2063M4977m8293n1310J4882J5684o0731l1354
5026g7598N3689l0168L105L6887M1968J9432m8325j8730j1481n0999J042l6560
$$ plain form
5014 -117738 -59905 9385 10903 -41696 -47292 -30547 -9407 12346 5093 -14642 -28934 -41285
5002 -41285 -6997 -23468 -17382 47886 49536 50057 18249 36941 8095 -7028 11736 -43630 -52001
4989 -52001 -10027 -40321 -7115 22672 16539 -12221 -30489 -29156 -37302 -106013 -81455 -60087
4977 -60087 -23728 -54572 -76240 -121567 -109022 -110327 -85868 -69447 -41967 -66189 -103970 -129308
4965 -129308 -93037 -7923 51905 55213 39088 -14500 9696 40851 47053 -10541 -27652 -10413
4953 -10413 -20594 -21592 -60970 -51017 -20052 -19074 -13821 -12098 28142 32883 -62858 -79311 -72003 -17109
4939 -17109 -15785 24941 18088 -7815 -61462 -46138 -51248 -62179 -71507 -12351 7444 -24419 -2185
4926 -2185 -2099 -30853 7721 25018 34013 44640 20084 4930 -203 -23573 -32334 -17543 -27698
$$ packed form
5014a17738N7833O9290J518n2599n596J6745K1140K1753p253j9735j4292j2351
5002d1285L4288j6471O086O5268J650N21l1808J8692k8846j5123J8764n5366q371
4989e2001M1974l0294L3206K9787o133k8760j8268J333q146o8711K4558K1368
4977f0087L6359l0844k1668m5327J2545j305K4459J6421K7480k4222l7781k5338
4965a29308L6271Q5114N9828L308j6125n3588K4196L1155O202n7594j7111J7239
4953a0413j0181r98l9378R953L0965R78N253J723M0240M741r5741j6453P308N4894
4939a7109J324M0726o853k5903n3647J5324n110j0931r328N9156J9795l1863K2234
4926b185Q6k8754L8574J7297Q995J0627k4556j5154n133k3370q761J4791j0155
$$ plain form
4913 -27698 -68017 -75802 -40834 -47949 -6214 14805 28868 67238 94655 12497 -16621 -15517
4901 -15517 316 32811 -446 -60317 -59093 -39629 20194 13334 -24023 -23697 3803 18279 -12565
4888 -12565 -65377 -17769 2931 27369 40388 -42017 -60233 -61738 -41657 -64337 -53983 -47586
4876 -47586 -28625 -19611 -61815 -55355 -121378 -150966 -96333 -93629 -98979 -74979 -120649 -112844 -96275
4863 -96275 -69864 -70739 -9678 -17926 -17782 -24150 -48731 -35391 -48632 -51525 -43214 1955 9380 3592
4849 3592 -6377 -5585 -32446 -14682 -18237 22923 101759 105533 54606 -6722 -6361 5636 9545 35584
4835 35584 -42936 -81034 -94343 -33591 -52964 -62502 -39005 -66863 -52953 -52059 3679 59889
4823 59889 76076 80766 71814 -8559 -71751 -42817 9991 76172 83871 65807 86536 137189
$$ packed form
4913b7698m0319p785L4968p115M1735K1019J4063L8370K7417q2158k9118J104
4901a5517J5833L2495l3257n9871J224J9464N9823o860l7357L26K7500J4476l0844
4888a2565n2812M7608K0700K4438J3019q2405j8216j505K0081k2680J0354O397
4876d7586J8961R014m2204O460o6023k9588N4633K704n350K4000m5670P805J6569
4863i6275K6411q75O1061q248J44o368k4581J3340j3241k893Q311M5169P425n788
4849C592r969P92k6861J7764l555M1160P8836L774n0927o1328L61J1997L909K6039
4835C5584p8520l8098j3309O0752j9373r538K3497k7858J3910Q94N5738N6210
4823E9889J6187M690q952q0373o3192K8934N2808O6181P699j8064K0729N0653
$$ plain form
4811 137189 84970 35460 27202 42185 5969 -19797 -9725 -3296 -24729 -20099 -49067 -75078
4799 -75078 -96442 -92612 -60457 -16328 -12233 21792 78891 44483 44921 35947 -27436 -53139 -60089
4786 -60089 -73377 -79836 -88998 -110135 -52089 -50384 -35417 -26972 -32156 -24781 -62935 -49594 -29004
4773 -29004 -19299 11035 -3875 19772 32875 -27910 -24242 -26227 -54821 -72841 -13522 58580
4761 58580 56428 74881 19737 918 10706 -34563 -64919 -60111 -44313 -25562 -10402 32162
4749 32162 4831 -4353 22688 -28145 -17913 -51019 -71753 -10744 39544 72573 48329 76515
4737 76515 95725 58090 15633 -49794 -36079 -11985 42053 94273 127565 77687 55002 26668
4725 26668 -6705 -70257 -116815 -66794 -48039 -84843 -54226 -67374 -27485 -765 28678 24611
$$ packed form
4811A37189n2219m9510q258J4983l6216k5766J0072O429k1433M630k8968k6011
4799g5078k1364L830L2155M4129M095L4025N7099l4408M38q974o3383k5703o950
4786f0089j3288o459r162k1137N8046J705J4967Q445n184P375l8154J3341K0590
4773b9004R705L0334j4910K3647J3103o0785L668j985k8594j8020N9319P2102
4761E8580k152J8453n5144j8819R788m5269l0356M808J5798J8751J5160M2564
4749C2162k7331r184K7041n0833J0232l3106k0734O1009N0288L3029k4244K8186
4737G6515J9210l7635m2457o5427J3715K4094N4038N2220L3292m9878k2685k8334
4725B6668l3373o3552m6558N0021J8755l6804L0617j3148L9889K6720K9443m067
$$ plain form
4713 24611 -38731 1232 25245 -5649 -22137 -31099 -40167 -14727 431 -27618 -18437 -24680 -18034
4700 -18034 -26557 -62813 -21052 -2820 -57774 -78929 -53166 -41015 -20699 1615 66510 69827
$$ packed form
4713B4611o3342L9963K4013l0894j6488q962r068K5440J5158k8049R181o243O646
4700a8034q523l6256M1761J8232n4954k1155K5763J2151K0316K2314O4895L317
$$ [...]
##END NTUPLES=NMR SPECTRUM
##END=
