##TITLE=Analysis number 323256
Compound Code cc 54809
Book Reference 511/2/1
Project Code adrs
Chemist Name stevem
##JCAMPDX= 6.0         $$ Bruker NMR JCAMP-DX V2.0
##DATA TYPE= NMR SPECTRUM
##DATA CLASS= NTUPLES
##ORIGIN= Bruker BioSpin GmbH
##OWNER= nmr
$$ XWIN-NMR		Version 3.5
$$ Fri Oct 20 08:55:10 2006 GMT Daylight Time (UT+1h)  MAYBRIDGE\nmr@NMR_250MHZ
##.OBSERVE FREQUENCY= 250.131544655141
##.OBSERVE NUCLEUS= ^1H
##.ACQUISITION MODE= SIMULTANEOUS (DQD)
##.ACQUISITION SCHEME= undefined
##.AVERAGES= 16
##.DIGITISER RES= 18
##SPECTROMETER/DATA SYSTEM= dpx250
##.PULSE SEQUENCE= zg30
##.SOLVENT NAME= CDCl3
##.SHIFT REFERENCE= (INTERNAL, CDCl3, 0, 16.522)
##AUDIT TRAIL= $$ (NUMBER, WHEN, WHO, WHERE, WHAT)
$$ ##TITLE= Audit trail, XWIN-NMR		Version 3.5
$$ ##JCAMPDX= 5.01
$$ ##ORIGIN= Bruker BioSpin GmbH
$$ ##OWNER= nmr
$$ C:\u/data/dgb/nmr/ADRS/970/pdata/1/auditp.txt
$$ ##AUDIT TRAIL=  $$ (NUMBER, WHEN, WHO, WHERE, WHAT)
(   1,<2006-10-20 08:54:51.34 +100>,<MAYBRIDGE\nmr>,<NMR_250MHZ>,
      <created by zg, POWCHK disabled, PULCHK disabled
       configuration hash MD5:
       49 4B E0 1D 92 C2 6B 37 9F E6 65 BC 52 41 86 1D
       data hash MD5: 64K
       92 4C 6C 84 F3 70 EF 7D 49 08 69 08 C9 0B 89 D6>)
(   2,<2006-10-20 08:55:02.37 +100>,<MAYBRIDGE\nmr>,<NMR_250MHZ>,
      <Start of raw data processing
       ef LB = 0.3 FT_mod = 6 PKNL = 1 SI = 32K 
       data hash MD5: 32K
       56 8F FF AB 3D 6A 9C 88 3F EC 3B F9 B0 F8 F5 82>)
(   3,<2006-10-20 08:55:03.97 +100>,<MAYBRIDGE\nmr>,<NMR_250MHZ>,
      <apk 
       data hash MD5: 32K
       3E 8D 7B C1 57 7B CC 7D 89 58 C4 90 3B A4 7F BE>)
(   4,<2006-10-20 08:55:04.72 +100>,<MAYBRIDGE\nmr>,<NMR_250MHZ>,
      <abs ABSG = 5 
       data hash MD5: 32K
       E9 B7 C6 74 05 E9 43 1E 7B EA 03 B4 4F B7 A7 FF>)
$$ ##END=
$$ 
$$ hash MD5
$$ 1B 03 8F CF 79 24 85 DD A9 A5 92 AA 2E 17 52 BA
##$RELAX= 
##$RELAX= 
##$RELAX= 
##$RELAX= 
##$RELAX= 
##$RELAX= 
##$RELAX= 
$$ Bruker specific parameters
$$ --------------------------
##$DU= <C:\u>
##$EXPNO= 970
##$NAME= <ADRS>
##$PROCNO= 1
##$TYPE= <nmr>
##$USER= <dgb>
##$AMP= (0..31)
100 100 100 100 100 100 100 100 100 100 100 100 100 100 100 100 100 100 
100 100 100 100 100 100 100 100 100 100 100 100 100 100 
##$AQSEQ= 0
##$AQ_mod= 3
##$AUNM= <au_zg>
##$AUTOPOS= <44 >
##$BF1= 250.13
##$BF2= 250.13
##$BF3= 250.13
##$BF4= 250.13
##$BF5= 500.13
##$BF6= 500.13
##$BF7= 500.13
##$BF8= 500.13
##$BYTORDA= 1
##$CFDGTYP= 0
##$CFRGTYP= 5
##$CHEMSTR= <none>
##$CNST= (0..31)
1 1 145 1 1 1 1 1 1 1 1 1 1 1 1 1 1 1 1 1 1 1 1 1 1 1 1 1 1 1 1 1 
##$CPDPRG= <>
##$CPDPRG1= <>
##$CPDPRG2= <>
##$CPDPRG3= <>
##$CPDPRG4= <mlev>
##$CPDPRG5= <mlev>
##$CPDPRG6= <mlev>
##$CPDPRG7= <mlev>
##$CPDPRG8= <mlev>
##$CPDPRGB= <>
##$CPDPRGT= <>
##$D= (0..31)
0 1 0 0 0 0 0 0 0 0.06 0 0 0 0 0 0 0.0002 0 0 0 0 0 0 0 0 0 0 0 0 0 0 
0 
##$DATE= 1161330890
##$DBL= (0..7)
120 120 120 120 120 120 120 120 
##$DBP= (0..7)
150 150 150 150 150 150 150 150 
##$DBP07= 0
##$DBPNAM0= <>
##$DBPNAM1= <>
$$ [...]
##$SUBNAM7= <"">
##$SUBNAM8= <"">
##$SUBNAM9= <"">
##$SW= 20.6930455092707
##$SWIBOX= (0..15)
0 0 3 0 0 0 0 0 0 0 0 0 0 0 0 0 
##$SW_h= 5175.983436853
##$TD= 65536
##$TD0= 1
##$TE= 683.16
##$TE2= 300
##$TE3= 300
##$TEG= 300
##$TL= (0..7)
0 120 120 120 120 120 120 120 
##$TP= (0..7)
150 150 150 150 150 150 150 150 
##$TP07= 0
##$TPNAME0= <>
##$TPNAME1= <>
##$TPNAME2= <>
##$TPNAME3= <>
##$TPNAME4= <>
##$TPNAME5= <>
##$TPNAME6= <>
##$TPNAME7= <>
##$TPOAL= (0..7)
0.5 0.5 0.5 0.5 0.5 0.5 0.5 0.5 
##$TPOFFS= (0..7)
0 0 0 0 0 0 0 0 
##$TUNHIN= 0
##$TUNHOUT= 0
##$TUNXOUT= 0
##$USERA1= <user>
##$USERA2= <user>
##$USERA3= <user>
##$USERA4= <user>
##$USERA5= <user>
##$V9= 5
##$VALIST= <valist>
##$VCLIST= <CCCCCCCCCCCCCCC>
##$VD= 0
##$VDLIST= <DDDDDDDDDDDDDDD>
##$VPLIST= <PPPPPPPPPPPPPPP>
##$VTLIST= <TTTTTTTTTTTTTTT>
##$WBST= 1024
##$WBSW= 4
##$XGAIN= (0..3)
0 0 0 0 
##$XL= 0
##$YL= 0
##$YMAX_a= 351188
##$YMIN_a= -516331
##$ZGOPTNS= <>
##$ZL1= 120
##$ZL2= 120
##$ZL3= 120
##$ZL4= 120
##$ABSF1= 16.522
##$ABSF2= -4.171173
##$ABSG= 5
##$ABSL= 3
##$ALPHA= 0
##$AQORDER= 0
##$ASSFAC= 0
##$ASSFACI= 0
##$ASSFACX= 0
##$ASSWID= 0
##$AUNMP= <proc_1d>
##$AZFE= 0.1
##$AZFW= 0.1
##$BCFW= 0
##$BC_mod= 0
##$BYTORDP= 0
##$COROFFS= 0
##$CY= 12.5
##$DATMOD= 1
##$DC= 0
##$DFILT= <>
##$DTYPP= 0
##$F1P= 14.0000005364418
##$F2P= -0.99999901652339
##$FCOR= 0.5
##$FTSIZE= 32768
##$FT_mod= 6
##$GAMMA= 0
##$GB= 0
##$INTBC= 1
##$INTSCL= 1
##$ISEN= 128
##$LB= 0.3
##$LEV0= 0
##$LPBIN= 0
##$MAXI= 10000
##$MC2= 0
##$MEAN= 0
##$ME_mod= 0
##$MI= 0
##$NCOEF= 0
##$NC_proc= -4
##$NLEV= 6
##$NOISF1= 0
##$NOISF2= 0
##$NSP= 0
##$NTH_PI= 0
##$NZP= 0
##$OFFSET= 16.522
##$PC= 1
##$PHC0= 136.7507
##$PHC1= 10.78622
##$PH_mod= 1
##$PKNL= yes
##$PPARMOD= 0
##$PSCAL= 4
##$PSIGN= 0
##$REVERSE= no
##$SF= 250.13
##$SI= 32768
##$SIGF1= 0
##$SIGF2= 0
##$SINO= 400
##$SIOLD= 32768
##$SREGLST= <1H.CDCl3>
##$SSB= 0
##$STSI= 32768
##$STSR= 0
##$SW_p= 5175.98343685301
##$SYMM= 0
##$S_DEV= 0
##$TDeff= 65536
##$TDoff= 0
##$TI= <Analysis number 999999
Compound Code 99
Book Reference 9
Project Code 9>
##$TILT= no
##$TM1= 0
##$TM2= 0
##$TOPLEV= 0
##$USERP1= <user>
##$USERP2= <user>
##$USERP3= <user>
##$USERP4= <user>
##$USERP5= <user>
##$WDW= 1
##$XDIM= 32768
##$YMAX_p= 454027427
##$YMIN_p= -1441717
$$ End of Bruker specific parameters
$$ ---------------------------------
##NTUPLES= NMR SPECTRUM
##VAR_NAME=  FREQUENCY,     SPECTRUM/REAL,   SPECTRUM/IMAG
##SYMBOL=    X,             R,               I
##VAR_TYPE=  INDEPENDENT,   DEPENDENT,       DEPENDENT
##VAR_FORM=  AFFN,          ASDF,            ASDF
##VAR_DIM=   32768,         32768,           32768
##UNITS=     HZ,            ARBITRARY UNITS, ARBITRARY UNITS
##FACTOR=    0.157963299565203, 1,           1
##FIRST=     4132.6476996994, 0,             0
##LAST=      -1043.33573715361, 0,           0
##MIN=       -1043.33573715361, -1441717,    0
##MAX=       4132.6476996994, 454027427,     0
$$ Real data points
##PAGE= N=1
##DATA TABLE= (X++(R..R)), XYDATA
$$ [...]
26985 -346082 -232448 -236404 -239080 -258588 -545712 -312816 171421 424084 615994 225690
26975 225690 -513248 -533962 -165223 126729 110780 -154380 30793 96157 102620 206302
26965 206302 227035 382449 684293 848825 733390 407609 134040 322355 416817 259695
26955 259695 17341 -202546 -238367 -284061 84131 -11166 24454 228664 503144 156253
26945 156253 -349710 -593601 -424857 -118659 -188946 65138 113560 -222666 -420515 -658157
26935 -658157 -1021522 -1069934 -943596 -848421 -458202 -255783 -422768 -550092 -294608 -297965
26925 -297965 -239138 -191119 -364925 -431348 -164368 29694 225692 -50593 -73556 323347
26915 323347 105637 -207709 -210453 -96555 127373 -19593 458 -199734 -490621 19829
26905 19829 -107810 -445501 -559061 -651121 -731604 -579002 -770927 -531712 -159427 135553
26895 135553 484735 430570 -5475 -141831 117124 33673 -125359 -306819 -162854 -265866
26885 -265866 153183 164628 276839 308375 340437 102152 -164876 -132400 -380673 -223583
26875 -223583 -30176 269861 157976 -11711 343198 162848 65670 50174 4475 155795
26865 155795 134537 85453 24122 -149650 -53204 259290 237867 367184 73417 -10980 394234
26854 394234 621832 320277 353624 -93440 -98935 81509 433449 345617 277666 406664
26844 406664 175092 304630 323468 82109 -299910 -70074 241047 363418 94019 -319786
26834 -319786 -239260 -360324 -489481 -390195 -134586 -190686 -234327 -337893 -126042 -173357
26824 -173357 42789 273526 407168 57059 -166986 117047 406641 220426 -88537 105613
26814 105613 761333 823769 502684 277974 193692 158774 300886 -107204 -153592 -118128
26804 -118128 -160522 250608 470924 379393 279119 -118454 -332481 68731 312605 266623
26794 266623 211507 101220 331296 343450 261929 462683 166524 243769 355488 283339
26784 283339 61756 -31308 19017 87179 32856 -187018 89813 381751 376983 105167 86690
26773 86690 215269 373809 577410 753471 280804 -795 -379179 -488233 -299971 -497530
26763 -497530 -490415 -330930 -248519 -93794 -85808 19117 -153944 -325249 -673034 -534164
26753 -534164 -397872 -260188 105271 527732 674868 503667 700289 284563 7141 188690
26743 188690 399100 70704 149096 221328 72171 358957 534051 593880 293011 -80425
26733 -80425 99319 399668 648716 268446 9244 -96687 262510 8485 -508661 -457707
26723 -457707 -171471 -235050 -320856 -334411 -293900 -431373 -501156 -408943 -384531 -139555 114005
26712 114005 178099 269014 38225 81777 436087 399786 428171 245774 165132 122064 140010
26701 140010 430338 527900 351055 98670 -21953 -312703 -4275 152767 -344913 -436725
26691 -436725 -123486 128588 -59705 -84741 -111715 -37606 -15391 -242081 -96140 -110826
26681 -110826 -151198 149831 244241 152185 270261 -134114 -189706 -2105 -20543 -378890
26671 -378890 -686846 -709247 -263003 -156710 -257346 -337529 -451934 -309420 -2027 166878
26661 166878 -221769 -591567 -542515 -331576 -58470 78490 410063 182334 30568 186207
26651 186207 -108837 -80513 -220471 -392893 -418541 -220018 194099 366828 142181 121122
26641 121122 198681 254597 486589 579994 178200 -190834 -157461 -257851 -504754 -541119
26631 -541119 -84552 -90316 -256134 -165936 18571 74575 -181181 -396689 -550379 -562016
26621 -562016 -272459 420559 591753 416266 333550 470853 480409 580264 308472 307415 75521
26610 75521 -270438 -23014 496490 527379 410313 469245 644936 604388 805975 755061
26600 755061 493059 162196 -15584 -351327 -333406 16560 -136021 -10465 110422 318600
26590 318600 188778 107852 -9127 71852 -245073 -789637 -630805 -270665 289931 620420
26580 620420 433579 350304 -49898 -259936 -288622 -44037 170402 510609 810660 383354
26570 383354 126831 -17855 -86778 -215928 -207807 -81702 116243 -25010 -328419 -253824
26560 -253824 -196946 -5490 604183 819760 647933 62933 44495 249574 338237 416246
26550 416246 54564 -73997 -106497 31060 517810 524008 180628 204043 290612 -52
26540 -52 -27178 33783 -105234 -428804 -529309 -520218 -444544 -89805 -222118 -337487 49810
26529 49810 168643 83687 199074 495204 390932 155126 16654 259911 148806 -59488
26519 -59488 -135595 -109608 85563 27553 -166151 -128522 51013 40609 93304 -37753 -492286
26508 -492286 -536262 -708467 -617871 -579107 -593602 -546192 -197132 -99045 -52871 130708 229717
26497 229717 278889 179801 27399 97481 286435 284585 177377 80722 -185350 -653382 -720262
26486 -720262 -539861 -245867 -157897 31520 -27276 -178083 33143 -111434 -220500 -13672
26476 -13672 196092 82505 -25730 162689 60898 -140562 -311269 -367249 -195820 96501
26466 96501 311476 64674 -106364 69214 264029 146529 -85423 -302661 -46211 262944
26456 262944 387341 643098 815802 625738 386827 48269 -181352 -95263 -9063 206429
26446 206429 291289 1946 303655 515121 517636 105414 -405095 -416864 -420516 -396363 -419849
26435 -419849 -528329 -556059 -567807 -364394 -365709 -258295 -188818 -224434 -239713 244578 303361
26424 303361 379133 483033 517037 327221 146033 57980 134412 -245467 -297830 -122422
26414 -122422 11204 203916 374125 645615 428380 263454 85317 -115121 -326392 -357495
26404 -357495 -122677 55884 -343650 -569952 -689677 -728321 -506393 -363793 -118533 -144431
26394 -144431 98870 385344 309240 490980 636455 63850 -608429 -882718 -549192 -109964
26384 -109964 126824 152722 -166155 -421539 -571773 -59330 696685 958848 640647 189049
26374 189049 66930 169202 120697 194932 286395 103725 199443 372319 671539 784619
26364 784619 425828 146976 -105581 -69029 -63056 -236687 -151020 73725 78010 76625 485719
26353 485719 632711 453883 242917 450402 373783 290520 230704 318473 405309 297591
26343 297591 177145 -57121 176295 362696 90669 34040 -39834 -9273 96764 -93225
26333 -93225 -120365 -120020 -353760 -740972 -692356 -750680 -894594 -918353 -479284 -387198 -177054
26322 -177054 -33154 114925 106816 217987 352400 -6743 -64419 -130434 111442 177597
26312 177597 391937 700579 276100 187897 274846 18727 191036 536664 259207 148978
26302 148978 -141660 -241670 119699 78880 -188492 -505816 -518794 -352851 4347 361594
26292 361594 183500 75757 293607 847746 988229 1052549 646245 -137226 -333969 -162009
26282 -162009 16347 -231041 -2244 96910 63496 347828 708554 549118 285348 361666
26272 361666 463142 370210 190902 60163 70534 197336 289872 404572 620804 567002
26262 567002 159397 61801 235006 188222 -118318 -514817 -797219 -481095 -566164 -421196
26252 -421196 -444356 -614918 -814413 -364504 -117605 -184825 -541736 -269286 -51952 -16265
26242 -16265 -28256 172575 277295 29153 -154385 -32928 218788 398538 581585 594660
26232 594660 385452 206728 75071 100811 159168 264538 63356 -130699 -231445 3258
26222 3258 473575 697889 390109 366110 292869 342228 -14370 -10374 268649 165444 354242
26211 354242 466895 346343 553407 900631 528701 285395 103057 195634 413105 355580
26201 355580 317890 576376 755335 514667 502104 250836 88216 69389 -56727 208267
26191 208267 561568 326336 211203 26906 -393731 -765873 -746316 -320397 156366 322818
26181 322818 126113 -270029 -175710 -211105 -83323 146646 -239154 -387474 -352105 -467532
26171 -467532 -679612 -846182 -484307 -253395 -97099 -269943 -314609 -449670 -195629 34200
26161 34200 157473 207048 151769 219324 -54697 -406249 -381554 -347164 -207565 -83005 -172558
26150 -172558 -175253 -198255 -293123 -36698 225253 354763 357172 343194 281836 381018 445366
26139 445366 207290 163661 212713 211760 715365 411251 -21447 -289625 -139936 116187
26129 116187 83769 60239 98077 401066 538733 -89272 -383242 -315111 -189244 294761
26119 294761 63294 -174834 -208960 -259233 -63492 537998 899208 730270 465115 281904
26109 281904 366826 268385 49532 112998 46960 102158 480860 429413 -52071 -42830 34043
26098 34043 182672 512584 802019 620952 254512 234504 63230 -165140 -213618 -12724
26088 -12724 188705 396473 402387 149824 -225486 -132692 -49097 36634 -88712 169427 343056
26077 343056 572794 719680 563827 542778 628081 180730 -60920 121140 331993 133102
26067 133102 50116 88175 102157 25615 267308 571064 555142 342976 520628 634517
26057 634517 272358 -421859 -944344 -643415 -133955 101973 -96952 -352452 -20551 -7879
26047 -7879 24132 112509 -168444 -181236 -150037 -131542 315867 610370 694648 376889 -11863
26036 -11863 -501661 -58667 -63591 -193718 -4824 -38210 -130996 -213133 -550251 -429220 50642
26025 50642 516069 548944 802148 608251 239904 26011 -71280 6686 -66096 -336618
26015 -336618 -408090 -308336 -309956 -270679 38146 -171332 -350071 -191271 -75867 -116752 -21199
26004 -21199 -6158 -167648 -145538 -130850 -97473 -399920 -415975 -337492 -505798 -698382 -439827
25993 -439827 -630704 -813745 -958501 -815216 -757498 -721579 -428114 -196456 -283782 -304128
25983 -304128 -399515 -364795 -44986 96242 170684 183627 -164507 -167392 144598 322010 273012
25972 273012 341836 328767 336191 728104 679646 112051 -168046 92897 2647 77106 359057
25961 359057 709765 603720 356927 105136 161865 340779 432249 214981 -56848 -3029
25951 -3029 -173691 -180758 -629116 -560593 22105 352093 453383 353931 455979 361117 59337
25940 59337 20317 3436 -321341 -344972 -175294 -193148 18265 -111958 -369010 -619452
25930 -619452 -698614 -641188 -79055 165736 274538 295373 268401 319538 363066 313162 -102254
25919 -102254 -330414 -241886 9104 528681 885644 1234874 958679 446727 117582 -128010
25909 -128010 33754 -279829 -337630 -126890 225553 288943 -244701 -564227 -402151 -523680
25899 -523680 -439323 -170610 114988 296816 59403 -331508 -144730 25489 22797 -117808
25889 -117808 -81431 -97968 52254 146717 279566 285392 57033 56099 74028 2334 148820
25878 148820 -197767 -299397 -198126 -214810 -365795 -54737 218513 -63938 -132817 -239860
25868 -239860 -327212 -246927 24057 429116 656452 480096 427932 266582 456271 793378
25858 793378 771813 907775 536741 208241 -92480 -56590 137465 209813 140034 316500
25848 316500 481649 553927 647876 278921 395801 495810 683486 729203 541696 437369
25838 437369 445487 279685 206817 352244 81089 -37411 -202299 -233628 -549652 -647453
25828 -647453 -177849 -106849 70644 119167 130936 -82155 -9864 -9671 7309 -61656 -137357
25817 -137357 -100287 61759 146355 -85798 -258206 84350 105558 -18708 -262297 -537634
25807 -537634 -379013 -253243 -206229 -317269 -368766 -104384 -170834 -15954 -132104 -299423
25797 -299423 -462045 -611076 -540926 -384130 47182 430659 385874 237082 284858 296657
25787 296657 277200 193619 257494 101700 369395 -11907 40115 66749 221213 430386
25777 430386 102232 -72980 15810 324818 101304 -22882 -272253 30465 157707 873
25767 873 -216738 -285784 -299445 -159827 -100575 -266960 -410682 -426487 -436461 -441612 -416232 -335875
25755 -335875 -63766 93748 462698 459181 194909 -153274 -418673 -707921 -716731 -640588
25745 -640588 -709365 -645342 -661209 -444359 -189901 -66534 1065 -65906 -54886 -235193 -332897
25734 -332897 -213337 -98448 159493 309125 58494 -400461 -438725 -105076 29034 169149
25724 169149 293676 298156 562354 711837 40549 -245373 -334430 -405179 -437294 -452249 -161613
25713 -161613 -209682 -71048 -40875 147877 326545 17906 -49956 163436 473861 358371
25703 358371 372353 -17004 -273293 -419872 -286991 -377158 -281828 -298156 -448952 64301
25693 64301 290971 134123 274066 150441 301704 526828 370323 -120460 -194232 -405974
25683 -405974 -392337 -355798 -276635 49177 -59608 318529 352718 46012 103995 73394 72864
25672 72864 240757 242807 127721 265229 268234 -91315 -1515 187013 54785 -192090 -110757
25661 -110757 -10163 136236 98368 -15249 263189 382560 440224 396481 768493 972223
25651 972223 765840 430993 86173 91704 20455 -604208 -663764 -23893 246988 128329
25641 128329 411584 536675 202443 -241344 -446126 -274604 39182 304712 433945 444428
25631 444428 298558 207755 154895 395660 479566 268740 288684 362021 205328 -67472
25621 -67472 -101103 -198514 -224794 -230685 -72702 7544 7361 248668 157149 441480 537471 538470
25609 538470 356774 378037 300781 400114 667558 673082 373864 -24093 -291609 -63057
25599 -63057 -27149 -91076 64095 489555 385268 69042 32622 229075 36793 317729
25589 317729 591920 202770 -352046 -143417 73225 183240 226066 337786 318511 51202
25579 51202 -42619 -120028 -217185 -146005 -180131 -357660 -310174 -206034 -28335 -362792 -671771
25568 -671771 -637144 -345594 -94400 -66011 -322823 -166341 -437930 -470562 -227586 -238318
25558 -238318 -304565 160975 325824 30838 -80683 66607 322687 624224 400051 -241707
25548 -241707 -588502 -973000 -1182100 -719179 -433089 -504572 -538362 -211238 -76137 129501
25538 129501 313586 68233 -194631 45494 106825 -108827 35718 319995 561727 310099
25528 310099 -331460 -161844 28744 -159806 -24399 -47677 177512 209993 584550 322581
25518 322581 -99645 -67435 -175315 -277415 -217039 -234678 -532736 -536027 -604066 -176278 -59366
25507 -59366 -65066 -168275 -216759 -571037 -442736 -267177 -248234 -245136 -335531 -419752 -377762
25496 -377762 -616033 -408316 -47836 118876 74946 -131902 141032 80467 -463113 -383787
25486 -383787 -24037 176278 -9558 -407696 -347181 20796 213273 -107830 -4649 -32386
25476 -32386 37308 -108948 29429 58344 107883 18215 -121211 -202870 -75169 -407613 -336157
25465 -336157 -187694 -320918 -466031 -402892 -498078 -578356 -177369 -171014 -48713 207648
25455 207648 122434 183721 117888 -275016 -527223 -400896 -259401 -375555 -616402 -355912
25445 -355912 -167710 23670 56380 155260 -7164 -281365 -274607 -137338 5911 -64059
25435 -64059 -303440 -181407 76654 -245424 -87811 142732 246155 165105 68983 -72403
25425 -72403 73629 21051 -494161 -726325 -343570 -171573 -127766 -190238 -70336 -253046
25415 -253046 -117211 -18398 100138 -22744 206607 405062 351008 88839 -43113 -66305
25405 -66305 85522 87435 385999 295721 482854 474963 433470 327933 144925 -187435 -290253
25394 -290253 -295847 -238917 -254519 -6639 76514 -90961 -33793 -54607 34389 53343 175045
25383 175045 151384 125586 156030 220141 251721 240754 144644 -15930 92258 248252 566624
25372 566624 511799 415808 166127 126166 201281 184171 135353 71315 -99537 95538 76591
25361 76591 242643 201693 -348227 -345270 119324 489153 684244 409777 335534 254022 51229
25350 51229 156681 232550 -5746 -99763 250479 483517 433126 149658 30045 -158310
25340 -158310 111687 268969 423985 421750 187770 248339 328756 150778 70271 233961
25330 233961 -89457 7530 159096 -257322 -751321 -305902 -354722 -343694 448896 780340
25320 780340 599743 155826 -113975 -168867 -107923 -232033 -78852 316928 293669 34616
25310 34616 -111137 -328151 -111190 56177 21108 -44176 54365 237934 192453 -349491
25300 -349491 -276870 -129225 -193202 -215130 -433349 -464932 -89395 122976 101431 -16871
25290 -16871 179762 -71599 188012 228048 -78669 -149904 -203466 -241263 -125183 -177638 -489444
25279 -489444 -506124 -282099 93188 123322 356896 118846 343906 962274 943740 879268
25269 879268 752179 124154 -131505 -337950 -254795 110092 -137173 -372425 628 134677
25259 134677 166594 13916 -161134 -154804 409871 669437 362100 123022 238659 -224583
25249 -224583 -151339 59870 -61010 -27904 -11274 155024 169190 110117 -32927 -207542
25239 -207542 -71650 263739 466611 419918 -143916 -137103 73434 580927 502257 19828
25229 19828 -228411 -538090 -485210 -292033 -317813 -171908 57716 47978 -81948 -232997
25219 -232997 -680975 -765884 -595777 -415700 -334579 -216770 -307745 -216320 -464279 -785551
25209 -785551 -617445 -673103 -546171 -267818 -211912 18173 -1054 -212821 -138034 240718
25199 240718 253384 -225402 -464534 -555258 -530719 -415939 -394306 -329615 -301373 -259105 -294112
25188 -294112 -186892 160765 376344 323443 455972 430162 179424 165201 253435 95895
25178 95895 60813 -7084 -80046 -195432 -282214 -336034 -426443 -67136 455845 273432 122173
25167 122173 170762 -36654 -295628 -280545 -338787 -7904 -195847 -134912 -246370 -322174
25157 -322174 -28029 91945 152740 197598 22096 -288855 -410629 -223699 -272113 -297659
25147 -297659 -460876 -58576 162745 89639 85132 55788 71381 -73760 109265 43303 -90222
25136 -90222 -22601 406430 363734 -161742 -203347 -325530 -171040 -27983 8625 130377
25126 130377 158726 83220 120963 -61727 -352942 -178183 -190031 -79223 433047 597876
25116 597876 624592 596682 555987 553857 385105 258953 -122263 -205929 91883 401872 487028
25105 487028 509385 326395 222708 53008 -316995 -502973 -176908 29093 270817 301372
25095 301372 281053 -142151 -53089 122365 -43939 -228735 214246 234733 -186946 -539035
25085 -539035 -582479 -349171 -13132 -86394 -30167 -59675 -201056 -237355 -324422 109542 492678
25074 492678 590296 241111 74902 52772 177996 -325015 -385514 -129494 -328570 -228946
25064 -228946 396707 612105 572520 579790 186284 -56034 349326 322589 238078 323609 268809
25053 268809 209980 181641 129402 156991 233557 319287 326127 343349 567133 596513 434613
25042 434613 -33724 -355706 -239351 -354470 -638529 -631870 -525722 -133391 8983 240496
25032 240496 194133 -79874 -309007 -439703 -733004 -779044 -663964 -338532 -63744 13031
25022 13031 127422 354243 419745 182709 -53710 44834 137350 12288 -87892 114502
25012 114502 -49705 95589 124713 299649 -26698 3008 -19713 -318926 -370026 -410459
25002 -410459 -304435 -69014 -68607 -44163 -86470 -559068 -442266 -569670 -561884 -209438 -75315
24991 -75315 -48024 -189139 -210689 -376770 -338880 -224836 -52118 62996 413030 348498
24981 348498 284159 55972 110779 293365 593472 434773 160351 116685 85049 280425
24971 280425 253254 83776 116834 224779 -7831 16315 7239 -317049 -479719 -150730
24961 -150730 -106317 -320932 -576360 -278276 -250096 -526128 -721790 -328470 -179352 -60020
24951 -60020 -23497 44996 -59370 66638 -73610 -325770 -87919 -167617 43789 -93014
24941 -93014 -206174 -285190 -465746 -419955 -568645 -268005 -313849 -500698 -384304 -420453
24931 -420453 -366723 -266197 -257673 -149290 201230 320576 721917 732175 625267 587883
24921 587883 1003399 1046008 516131 340855 83801 134901 -112987 -338438 -8163 158011
24911 158011 -439078 -555838 -362078 -94861 178265 275746 456604 311662 59341 78606
24901 78606 -25834 202771 529620 518614 277406 180867 66361 -180876 -234332 -522415
24891 -522415 -850582 -573303 -757922 -981725 -616313 -147041 -161350 -109960 182444 217474
24881 217474 292817 273015 453023 172068 93284 208989 358210 165244 -319685 -343369
24871 -343369 -343463 -527678 -455655 -308305 -23004 -62780 -466153 -421574 -327317 64638 207822
24860 207822 -105620 -425255 -264976 -58193 -118005 -225161 -225093 125946 -112968 -485757
24850 -485757 -590653 -454668 94250 -25637 -250125 -89097 126208 -54543 -103069 -159912
24840 -159912 -314896 -244136 135101 -37097 129808 119831 43420 -21195 -92123 -313595 -434002
24829 -434002 -492954 -656164 -186006 274589 444882 372877 -114335 -684320 -948757 -702956
24819 -702956 -719217 -559650 -305583 51534 85935 360288 508836 157710 44803 463606
24809 463606 415622 109191 3707 225452 194083 10056 -71327 -235874 -73906 19193
24799 19193 190904 41202 -292058 -353124 -651566 -254528 -21857 -41249 130672 -249096
24789 -249096 -243722 -207851 -307252 -500762 -361738 -266724 -347437 -442454 -493256 -619962 -486518
24778 -486518 42860 166678 -206019 -211611 -210825 -309322 -449360 -275995 -297549 -129452 -13513
24767 -13513 -154749 -109456 58239 258715 198344 493907 395709 -73854 -145108 29335
24757 29335 -74128 -205567 -426482 -421483 -421477 -397958 -22451 267908 427838 203889 -168990
24746 -168990 86954 71148 -435766 -226388 105245 356064 228609 245006 644795 443565
24736 443565 207940 184678 133591 -138772 -377892 -532161 -600323 -460025 179120 222047
24726 222047 50016 -181968 -108255 -234101 -233409 -348561 -371868 -165827 -202535 28141 404147
24715 404147 411338 -440860 -533646 -281491 -626683 -457939 -39550 178199 284147 194883
24705 194883 505892 280280 -48899 -74397 96232 249110 533471 348442 -228204 16822
24695 16822 409952 343044 220568 400085 224137 -85948 -480488 -260611 5567 -53284
24685 -53284 -246264 -397751 -154347 -269924 -127192 283039 353582 40775 -562418 -609470
24675 -609470 -332294 -405282 1435 114966 -335036 -508844 -352532 184993 212910 194937
24665 194937 283129 226028 -19360 57234 -18778 -278 96633 231545 194368 190616 101767
24654 101767 386623 564740 376401 467346 471618 200594 40519 34544 16103 -320374 -556664
24643 -556664 -808737 -564618 -498417 -721903 -501937 -281479 -188528 70990 246232 782925
24633 782925 767335 368733 346022 520878 554404 359441 99632 -188022 -492426 33107
24623 33107 53576 8804 -402560 -373790 -422504 -375216 39204 263182 264385 46736 318715
24612 318715 392915 106713 -325165 -562252 -341010 -234947 -153201 175768 376672 176672
24602 176672 -323449 -108902 -357844 -609832 -494031 -415128 -66298 174438 394502 695202
24592 695202 543526 65829 -372765 -512508 -257288 -43287 411988 678964 236957 20943
24582 20943 294657 335257 214167 74095 188810 68109 227365 590526 622402 428179
24572 428179 181656 219906 235316 299507 404407 328675 387294 291374 63276 -174807 -88168
24561 -88168 57687 -252775 -316460 259359 304449 51216 -126434 35350 355667 435549
24551 435549 304716 38690 -167727 -269796 -337593 -74605 22984 -70369 136034 105278
24541 105278 -101331 -194086 19908 -97237 -222521 -589220 -411393 -330646 -549092 -295306
24531 -295306 -101659 -421599 -364833 -330879 -159221 -6455 270607 291339 445014 350783
24521 350783 181959 172938 175287 139531 69662 -18365 -195343 -553293 -668841 -489654 -442813
24510 -442813 -311268 -193892 -149616 -32855 68384 173156 204642 374510 64708 128193
24500 128193 192233 116960 -181848 -184011 -166453 -46887 -129051 386459 651318 222323 29230
24489 29230 183570 583472 781514 606521 386022 352447 359409 655698 786486 847851
24479 847851 448773 247645 147755 53490 29714 -168170 -39130 -6348 -70035 -248214
24469 -248214 10225 -86205 -265427 -146869 59744 123651 8013 125343 -12791 253496
24459 253496 367288 80224 -44507 -148480 -139164 -340741 -218615 214355 212748 234815
24449 234815 255327 286177 341478 257125 720134 790767 465992 -4362 -371461 -303365 -113859
24438 -113859 101172 28476 30852 53409 171407 231326 145456 -153851 -198362 -124208 -179013
24427 -179013 20037 67844 -401656 -622577 -368180 202676 518436 387584 187079 288659
24417 288659 234624 340335 623517 289695 329963 385439 76308 88980 53074 149925 109175
24406 109175 -233373 -247266 178833 241078 56930 171121 90814 319817 80214 -39064
24396 -39064 110505 233146 -95543 -65156 293441 488660 210772 -19682 17898 -321359
24386 -321359 -597911 -714414 -1163357 -1034075 -468799 51846 -152915 -333250 -259316 -339294
24376 -339294 -542673 -448518 -166952 -179524 31928 329044 239492 13090 -163609 -288024
24366 -288024 -19169 -23810 216428 359165 415155 65478 -48944 -353543 -450637 -179207
24356 -179207 46998 -79607 42187 94072 131985 292763 453325 647209 140351 -286290
24346 -286290 -148454 -8414 37818 157133 31449 -309821 -276882 98262 166589 313011
24336 313011 235147 116841 1410 -210633 7893 -4266 -187152 196538 475255 518250
24326 518250 209325 -39061 -51076 -31068 -272651 -103942 -213415 -44788 175134 260226
24316 260226 247898 86182 -7329 -34006 333134 236905 -48668 -280236 -11855 102957
24306 102957 315325 554575 199102 -329731 -529407 -462753 -432609 -440459 -678723 -356795
24296 -356795 -346432 -432535 -286583 -476994 -280020 -244960 -192605 47630 -61490 -120642
24286 -120642 275370 259614 298772 485256 620933 714887 271996 -281232 -452691 -577721
24276 -577721 -653489 -316543 15915 113365 -55430 16646 46392 -171013 -112893 250464
24266 250464 388251 68476 -282583 -381957 -227708 -29219 173286 512243 683017 681579
24256 681579 761801 952132 920581 811803 518204 815966 956985 800471 741888 958986
24246 958986 1124202 855971 652457 57492 -269902 153010 125807 348545 487805 495247
24236 495247 139414 -71208 206842 642489 528933 384300 567731 964825 992294 762933
24226 762933 658276 501695 380864 353538 37139 -249103 -368431 -250935 -315525 -352726
24216 -352726 -132049 258854 412625 448036 77793 333114 597792 223461 135700 -284066
24206 -284066 -489215 -221504 -311121 -323933 -374349 -637936 -554811 -531000 -369987 -160633
24196 -160633 -348416 -601746 -575328 -214732 37115 220535 355333 347682 455887 298687
24186 298687 662282 619493 422905 279765 14538 173664 224268 -56988 -317403 -240399
24176 -240399 86420 183267 -142028 -68068 38078 196342 96765 -148897 -64492 -194075
24166 -194075 -456086 -329351 -257768 -84355 113136 84633 5828 123864 -22590 -82474
24156 -82474 -26195 -68354 -267979 -647917 -689529 -335909 -441073 -934583 -827457 -505044
24146 -505044 -104329 -186016 -339380 -487286 -335010 -389420 -554099 -534636 -331809 30278
24136 30278 308878 343750 225196 151265 48102 -196054 -29142 -163720 -198629 -132074
24126 -132074 50986 216870 297501 285864 261071 334449 227254 235951 136123 -1938 -225743
24115 -225743 169127 -39227 192399 93867 164478 374784 512116 489845 584246 210694
24105 210694 -4888 43884 199331 364894 272975 23997 42178 173564 166497 221695 139554
24094 139554 266166 76756 157452 127246 70844 -35999 -318594 -144849 1387 282172
24084 282172 133647 -75368 39864 -266258 -529209 -207283 -228573 -340826 -212361 93676
24074 93676 310815 144157 -27640 -355045 -613647 -463598 -232710 -202040 42458 -42684
24064 -42684 -93754 306941 465494 474661 254059 432723 478717 301050 6363 -243257
24054 -243257 -234117 -350868 -240385 9131 -31883 -210573 -141699 -80620 -137953 137210 212973
24043 212973 403912 383413 41063 -92517 203221 97979 -138870 -340843 -526570 -548837
24033 -548837 -579380 -437493 -315170 -196662 273940 370193 284600 158201 10626 -111253
24023 -111253 -197802 -48571 147280 43008 184340 289071 36971 -321815 -333489 150178
24013 150178 37721 -354367 -622185 -473057 -19761 32640 -181949 -265228 -91663 346057
24003 346057 757431 485379 183378 44063 -51589 -59988 -78077 183043 -23519 -47050
23993 -47050 -271844 -426155 -790001 -693127 -518436 -494224 -440400 -21340 190372 -28033
23983 -28033 -202979 -143926 236385 718153 547353 -153960 -382473 -79576 -78456 -225997
23973 -225997 -137342 241351 238632 355492 553268 362604 -27986 -102718 48422 -150227
23963 -150227 -199794 -34021 56527 -175187 41069 -91142 -236990 -303064 -51379 -4570
23953 -4570 131967 -154034 -181050 241619 289728 -80464 -124107 149854 241416 242456 -103128
23942 -103128 -339711 -184172 -130176 120245 26511 100663 35032 -250164 -806778 -569798
23932 -569798 -324912 -365578 -170170 -109706 -234468 -258456 312675 120456 -231309 -304738
23922 -304738 -163203 -4052 -223330 -288322 -2155 40230 -114853 -156553 -201972 -373203
23912 -373203 171338 94210 20423 -243673 -24475 -215405 -346206 -107117 -19100 -295871
23902 -295871 -298369 -519532 -361136 -382830 -339121 -245552 208121 477034 443162 619328 628239
23891 628239 828055 327213 -100244 89764 198156 211542 19783 -120328 32681 78402
23881 78402 346089 422245 357711 -108262 -271667 29993 208594 49175 -145832 104936
23871 104936 161004 316401 484596 404212 550710 374309 69658 -3662 14140 139225
23861 139225 -26534 -111921 -29892 206137 404263 497751 -58946 -414211 -208934 71094
23851 71094 256636 355526 239553 -87602 -184742 -297551 -247534 -113806 -235919 -377464
23841 -377464 -24565 108012 155064 -133060 -114979 -206641 -134761 317080 370174 64227
23831 64227 -220718 -386791 -447016 -380519 -13581 85743 -20848 202858 440827 528902
23821 528902 152342 -383612 -360162 -80658 79580 -48615 180465 376764 330572 195561
23811 195561 71592 -124747 -31847 -25216 -240755 -449477 -283357 -245708 -187779 2383
23801 2383 208093 214532 -29220 -64335 -239095 -352217 -344861 285404 149248 -145685 -201193
23790 -201193 -280786 -247571 -268937 -254730 124030 -45529 -279553 -246403 -153750 -64816 -178357
23779 -178357 -535861 -542141 -187237 67321 66681 50991 -134928 -281884 -241840 -167313 96913
23768 96913 192303 162960 184183 10870 -130928 -170334 -182507 -127319 -154501 -395404 -227290
23757 -227290 -35843 -80204 -211698 -161858 -262189 -130727 262617 -5476 -500855 -441665
23747 -441665 -204339 170410 269494 143830 -158816 -105225 181173 597598 667711 444833
23737 444833 207239 -270226 -524659 -233150 -49407 -291467 -257010 -81057 20323 -65690
23727 -65690 -271970 -297411 -141980 151777 539788 551628 333137 157721 158587 258433 -63595
23716 -63595 -188423 -227523 -194795 -22765 -31199 -45867 -40703 -249139 -544744 -519544 -221034
23705 -221034 -10868 49954 346156 181405 -82703 -25162 155591 92981 -31889 115566
23695 115566 23848 -73057 34390 -99488 171515 378953 465825 703852 675676 261992
23685 261992 -345778 -255590 288555 478287 368702 -96101 -234942 -91204 2513 -9602
23675 -9602 -313489 -728508 -914954 -474616 -360400 -159987 97852 206897 -136397 -324929
23665 -324929 73361 322008 66679 -446345 -735274 -580429 -397874 -609817 -477273 -366465
23655 -366465 -544297 -379222 -98958 -197803 -181603 -33630 110883 -316108 -596646 -388004
23645 -388004 -230951 1213 217193 -353306 -325074 30917 89498 -174786 -296079 -83865
23635 -83865 257426 411081 145394 -23376 489498 741478 675241 216395 -181874 -373125
23625 -373125 -457857 -431444 -187525 80943 -242401 -394136 5545 156799 250123 169850
23615 169850 8785 224279 183570 283572 306152 140299 61777 228753 -27470 -418591
23605 -418591 -707515 -310515 54320 131610 55752 -174488 -68167 124515 -44757 -457699
23595 -457699 -405275 -145975 128506 273222 -179607 -521497 -309224 -162376 -17014 73281
23585 73281 -30743 -37159 133328 130545 120006 253137 234327 259799 664362 825716 519673
23574 519673 -204278 -387561 -218446 34742 -137574 -305128 -219062 -37270 -107805 -22336
23564 -22336 -232964 -141774 -203155 -107904 -224730 -365560 -364513 -135904 78970 150942 82964
23553 82964 2545 -207111 -193859 -286155 -545435 -171986 -199067 7268 -179522 -119559 -48768
23542 -48768 53314 -292174 -207406 -12520 176434 113044 -52112 -318214 -345386 -55547
23532 -55547 -199996 -592094 -542867 -58462 100153 103836 211758 258107 81542 191084
23522 191084 87557 -214501 -78649 -96517 -35362 -220456 -636432 -355212 -94668 -41445
23512 -41445 11868 177907 134475 88257 282371 245671 288166 318886 204188 -47694 -372286
23501 -372286 -466533 -515775 -525585 -215402 154796 62568 -112543 5538 -172377 -274959
23491 -274959 -2784 -68344 -428168 -506542 -190105 -78044 -318891 -252994 -226380 -158432
23481 -158432 226781 -229456 -489571 58095 298650 -138462 -297461 -110643 83192 296442
23471 296442 95818 -119592 -50788 -31779 13970 -28771 221953 299073 230516 396419 454096
23460 454096 152221 10323 -91326 -260763 -258713 272553 346007 250794 41951 33554 115238
23449 115238 -16271 -89766 246425 -32346 -133680 -16363 -38218 -241114 -617630 -772033
23439 -772033 -601503 -432197 101167 53989 -75425 99185 519652 325570 -309137 -523335
23429 -523335 -82811 -26204 -338944 -496992 -364490 -115874 197251 200584 40061 196975
23419 196975 492106 529887 617440 583838 285440 259238 370404 477404 779129 587472
23409 587472 271375 162092 -151150 -619968 -596068 -133157 321381 27929 -363488 -321443
23399 -321443 -381530 -215877 -203861 -316187 -182667 92478 257366 594991 486562 324770
23389 324770 96947 227063 395103 223222 49672 -134611 -50506 95999 -210910 -128201
23379 -128201 -279151 -269519 -398257 -371959 -363886 -337047 -303928 -106975 50011 -129124 -265081
23368 -265081 -259919 277306 511451 208964 -405197 -527276 -306793 5749 217433 233055
23358 233055 218768 424406 581655 417522 -24911 -276659 -351356 -503856 -602986 -421598
23348 -421598 -243133 -194485 -401594 -227170 -433444 -598816 -768189 -384967 -218486 -37747
23338 -37747 -330660 -332244 41621 460818 543164 676131 560429 362250 326102 329492 -38362
23327 -38362 205835 648014 489121 -72241 -246631 -486149 -448026 -390982 -83116 178280
23317 178280 -179627 -507584 -930165 -949006 -395100 -105829 -351871 -186793 3752 -385160
23307 -385160 -300957 -199830 -267687 -423851 -483783 -478772 -349528 298226 528468 510570 503615
23296 503615 400939 522579 523991 262375 422660 129790 -190536 -545374 -84783 277359
23286 277359 634687 761022 388015 221721 169964 -165982 -475450 -47742 4016 -175253
23276 -175253 -95354 45873 330040 424031 -70107 -420790 -566716 -118168 -6238 234529
23266 234529 413517 514003 197077 -96207 -139210 327753 419681 440395 522118 604616
23256 604616 777395 723689 646500 418418 133266 -16987 -87916 -218513 35271 220733
23246 220733 509687 117976 26110 13385 -13571 103733 209285 412145 294592 318196
23236 318196 -90085 -306566 -10704 217350 441840 121306 -100115 -153845 -3049 209684
23226 209684 183068 68821 113413 172510 -19014 179689 40228 327438 434844 440161
23216 440161 107651 -312561 -40582 276431 318806 199746 278668 193437 -205121 -466955
23206 -466955 -306294 -191312 -85285 131322 350095 303645 201065 285638 219621 46178
23196 46178 -167121 -126129 484572 701306 572504 541075 605586 661188 435955 79337
23186 79337 119936 186543 286447 -44025 -368983 -132515 191325 10468 -506228 -240502
23176 -240502 -64250 185092 425792 18110 -86412 -99175 -122264 -196878 -323518 -451128
23166 -451128 -268726 275064 585459 206167 -139095 -103175 41561 283855 373886 379568
23156 379568 128711 77127 18106 -73064 -157605 -179965 127765 362391 287067 130020 -129069
23145 -129069 -195032 -145941 176251 532624 379365 -98917 -28265 -55419 18124 6561 149450
23134 149450 376503 636965 442230 -229042 -367737 -353993 -464483 -618867 -443670 -280250
23124 -280250 -230417 -218188 115601 204036 122195 -103419 -255104 -359700 334347 331753 193106
23113 193106 34248 -14532 -226477 -251278 -189759 263357 15339 -410606 -597255 -585032
23103 -585032 -434149 -486050 -568535 -434761 60642 47945 -333331 -151392 172865 -71554
23093 -71554 -454001 -521862 -111282 12110 -309198 -182148 -117715 -35827 -244383 -491963
23083 -491963 -371273 -62694 -280686 -338397 -349429 -440007 -213689 -65360 51759 70169
23073 70169 -222607 13818 325571 99630 162412 -93297 -27522 -5139 -197145 -360745
23063 -360745 -310923 74749 176568 -33264 -12010 155907 -20540 -278921 -131194 211140
23053 211140 335586 701319 500042 135145 1019 125664 -4364 138840 318405 234115
23043 234115 -114436 -341580 -318359 -309066 -31116 -263377 -437747 -379055 -3453 86762
23033 86762 -340089 -525421 -502908 -627639 -613164 -507778 -343036 -441376 -356556 -310224 -557647
23022 -557647 -516639 -535150 -306167 -11006 -313038 -370793 -136279 -36101 -123534 -348633
23012 -348633 -448031 -322918 -93379 -10717 -81872 -439020 -751319 -725371 -713422 -680245 -435153
23001 -435153 -190446 -13963 -5028 -117139 -26814 115070 262624 124803 221882 358999
22991 358999 -52844 -197089 -271804 -250838 -322736 -336054 -298652 -325322 -261110 -346238 -275252
22980 -275252 -173215 -107431 -91997 241035 336225 -33954 -221148 10378 145928 157535
22970 157535 19600 49277 -74335 201636 746572 633703 666062 583917 49598 132991
22960 132991 416657 634498 540155 466862 108349 48365 248931 271459 73034 -124514
22950 -124514 -149806 -41200 45581 529502 442986 141214 165961 51064 141673 38000
22940 38000 -203380 -629967 -534710 39033 369426 256148 397202 603925 389237 -134821
22930 -134821 -194836 136870 462119 745184 1237477 1141908 944268 746837 374406 43934
22920 43934 -128391 -101485 -5072 304602 429147 514973 829463 901696 630350 448290
22910 448290 174046 -62611 182875 186237 -136059 -830479 -947653 -424388 256902 537181
22900 537181 407763 334741 391447 328996 -144461 -55302 -102817 52527 -3471 -132974 -63376
22889 -63376 -186025 -151688 -64936 -418667 -879728 -970315 -634113 -239654 -103777 53518
22879 53518 19906 -439316 -504707 -524102 -563912 -481284 -273648 -177252 154912 42220 -102573
22868 -102573 -139214 -28776 338638 414522 186649 127163 -94903 -18237 98695 -23333
22858 -23333 -471809 -522049 -428976 -174463 -128198 -68604 78745 192391 217168 216092 88717
22847 88717 -137710 -271666 -379859 -452208 -241611 -76947 -232371 -675434 -370926 -48118
22837 -48118 104711 269962 18791 -408490 -425840 -330792 -245626 -411738 -762033 -579979
22827 -579979 -306665 -287332 -165456 60181 231146 123613 15794 32656 183541 229910
22817 229910 170924 458668 436845 234059 190764 407287 76782 223555 603071 416011
22807 416011 19332 17434 123326 -22526 -243248 46354 444877 650876 560530 335792
22797 335792 271296 403869 267552 211443 200053 107810 44418 -267539 -568633 -400549
22787 -400549 -489137 -524655 -253382 -265260 -468092 125766 763397 1058372 760723 233416
22777 233416 95280 -123876 19530 45453 -230114 -490197 -603070 -647865 -323964 147067
22767 147067 154697 -137092 -344627 -511901 -178115 75858 215642 333957 5023 -173125
22757 -173125 -210261 -146333 64405 -25939 -477028 -403387 -206169 61830 102304 83881 284649
22746 284649 308931 56714 -128742 -36882 107499 479955 585118 60309 -170761 -243444
22736 -243444 -115968 -169448 -265109 -169117 61621 166934 -328871 -381189 -148066 36032
22726 36032 -157177 44249 106663 -19683 10153 -187892 -470596 -505386 -1123167 -1033072
22716 -1033072 -661922 -229697 49333 150264 202891 219491 84555 289217 234429 224886
22706 224886 681280 924947 665946 619959 515683 415966 362687 53487 -457276 -710263
22696 -710263 -429133 36240 119688 44296 -66121 -414587 -424271 -231618 80544 110440
22686 110440 158525 -124252 -757765 -789443 -250730 318459 346417 -5025 -122869 -58960
22676 -58960 8650 18188 98730 353791 -2139 -164935 -180491 -198990 -50232 83481 119871
22665 119871 409529 -67670 -307473 -83152 -32384 -261758 -447572 -534199 -143950 225929
22655 225929 121787 -169558 -98319 123038 404151 211188 365221 326322 -191542 -879401
22645 -879401 -761116 -506430 -348578 -209218 181778 138867 36320 -125153 -271359 -349197
22635 -349197 95724 354143 489752 411450 468666 827633 719557 212922 -143363 -345239
22625 -345239 -415774 -213730 -115722 345571 610972 725763 412840 137411 221750 461505
22615 461505 447866 263603 -50481 -362382 -368129 -259309 -264224 -260628 -380091 -610700 -115404
22604 -115404 561969 162478 -197083 -171415 -346862 -439500 -425426 -23980 219981 377946
22594 377946 378883 139151 -332682 -720631 -1020229 -782890 -558105 -570214 -679843 -785635
22584 -785635 -361115 81076 14423 248438 396848 431545 431030 60904 155631 42449 -140306
22573 -140306 49310 479875 616140 343293 197451 156646 280145 278884 140355 61650
22563 61650 180624 573814 451058 125484 310236 793145 1154945 1027220 507031 244125
22553 244125 773 -123530 -239689 -181820 -33376 -21858 -183147 -170677 -165021 -288972
22543 -288972 -293578 -25597 -203089 -213157 12628 -278510 -548785 -465713 -416021 -94923
22533 -94923 56394 1014 130471 255766 330372 365760 113849 92856 149031 -44594 -456393
22522 -456393 -606726 -602534 -288709 81049 118969 226043 442108 392048 104522 130088
22512 130088 149344 -37933 -239671 -75830 90184 155413 -225456 -256719 -243192 -278248
22502 -278248 -252842 -378376 -183646 -515386 -795595 -401228 281 53033 -117223 -80858
22492 -80858 -311360 -350450 -374890 -751856 -464055 -889163 -971203 -210884 311441 73913
22482 73913 210785 449549 575523 570227 559293 215253 -37259 -135085 24806 38579 -136508
22471 -136508 -56167 350146 323354 51602 -7218 100381 -30123 -89871 -291107 -84612
22461 -84612 221526 386666 521827 288811 -162946 -213802 -828 106646 19238 -204541
22451 -204541 -183972 152594 297666 246401 -6710 -3971 222293 359746 175662 232616
22441 232616 285359 570763 715914 665765 514164 557153 361251 209968 418077 178339
22431 178339 27893 14568 -262381 -563349 -816262 -698624 -353875 84079 96099 137989
22421 137989 62597 83753 -34811 97130 39034 63205 6866 -242230 -207749 -176473 -308170
22410 -308170 42389 340620 434375 213315 -104027 79229 275590 283950 181526 220662
22400 220662 190641 256252 198786 -263898 -38887 51759 -432362 -219053 -199695 -17699
22390 -17699 285796 134905 -45400 -122614 -140875 278661 572699 521606 281129 236376
22380 236376 236617 166300 -145384 -62800 -126858 -272529 -193003 -39670 391122 252664 61407
22369 61407 46331 178501 238249 54057 -142806 34764 -227155 -248535 -260808 -67809
22359 -67809 -87063 -162756 -80040 -86252 -25752 -322436 -71949 166026 226915 145407 73850
22348 73850 162602 103942 237652 233980 -144156 -310605 298972 726216 493337 165996
22338 165996 139902 170263 38464 -54320 -105885 -158845 -77275 -303335 -149932 20147 84900
22327 84900 413952 394035 204184 176875 327008 86491 -106256 91825 17053 -89979
22317 -89979 232344 474817 351125 28631 192795 66350 392572 630697 310157 -400273
22307 -400273 -413703 -116402 268602 61097 248745 537163 264585 -94353 -560294 -586765
22297 -586765 -634846 -624336 -508052 -196218 -502707 -536365 -446945 -131980 107877 382972
22287 382972 395756 186198 252335 549041 499060 495753 493343 528395 326898 -359595 -203740
22276 -203740 62633 110933 61874 25478 -16150 20370 12959 -102698 -2606 -76067 -182375
22265 -182375 272125 915376 927906 769489 706463 500333 481750 160441 -218684 -209922
22255 -209922 -259992 -305633 -208967 162867 136654 -38450 59671 184029 348189 282190 134748
22244 134748 61794 1121 -17211 97560 347127 167732 -303633 -442074 -181059 -6358
22234 -6358 106298 148310 86037 301481 350118 -33205 -207639 -365761 -366069 -457464 -462699
22223 -462699 -548060 -642568 -845320 -918641 -1087025 -618185 -172375 -184599 -281857 -378966 -475023
22212 -475023 -569550 -624290 -765435 -604041 -591689 -427993 -71894 -88835 -370125 -634116
22202 -634116 -931713 -1084033 -702830 -582491 -355726 -510257 -772584 -233454 188039 132254
22192 132254 31495 7628 71296 -10941 136211 -230690 -661414 -421371 -109540 447956
22182 447956 566299 111452 -22928 348281 642832 847116 665509 140485 26892 67894
22172 67894 246654 496428 412866 94074 -164153 -259967 -228183 -162536 -66687 78039 -133472
22161 -133472 -362956 -253785 -118519 69311 149440 -285687 -430716 -332032 -212645 -222067
22151 -222067 -247020 -394666 -533319 -272215 -12255 410335 594352 595876 388857 -7803
22141 -7803 -71117 373178 906265 600726 45355 -199003 -390038 -578260 -512127 -93375
22131 -93375 143618 175054 211026 55497 105890 -4096 -183926 -231613 16858 269049
22121 269049 241360 54313 -343381 -494321 -490941 -581392 -227710 12990 -117450 -565395
22111 -565395 -829084 -759828 -480461 -359555 -266324 30602 100442 -211720 -362645 -291806
22101 -291806 -144053 129425 220485 144414 -51865 -79470 -202621 -278576 -271474 -246941 -227381
22090 -227381 -305864 -247776 -6727 -303143 -360074 -244499 193454 414334 240075 13519
22080 13519 -122789 -549563 -176241 -29448 -93521 -30244 472 -166337 -266548 88210
22070 88210 236830 192534 335789 322420 -50965 -274861 -172355 -73708 80438 -38100
22060 -38100 -267317 -285257 -59177 2337 117556 307446 369710 380568 555594 434751
22050 434751 413644 917130 685278 189675 -117598 120158 603771 558514 378791 231783
22040 231783 461233 541500 556531 640044 484879 365526 236819 306924 611385 663571
22030 663571 462153 758553 345080 -208649 26743 278711 317815 416479 528299 171071
22020 171071 -15940 -93021 -3140 49939 -214634 -390934 -377360 -286909 -282890 -98878 120225
22009 120225 -131175 247705 484794 737596 686162 407455 154120 -183147 -280667 -339127
21999 -339127 -229599 42377 -116930 -524812 -284898 -74227 -156737 -491802 -632451 -529645
21989 -529645 50973 141504 -69644 -220841 -370208 -388372 -248315 -3201 -27197 -222130
21979 -222130 -336521 -245564 -134631 -65177 49595 -219635 -207213 15676 162495 -21685
21969 -21685 -100864 14418 -80752 -376082 -503515 -222208 -52861 -226703 -46022 -52937
21959 -52937 -382211 -258446 -247147 -240744 -658466 -460684 -123629 -70953 -177493 -478048
21949 -478048 -419511 -157903 103640 113684 246150 12798 -185120 -296799 -339890 -380089
21939 -380089 -202481 247377 447428 375693 261873 -122044 -782280 -695069 -574007 -476370
21929 -476370 -513533 -682528 -711463 -809827 -805607 -762587 -897288 -745170 -367082 185020 -9504
21918 -9504 -429897 -473976 -386197 -221563 -76733 -275690 -263307 -161796 -8407 73055 251481
21907 251481 258524 224058 -22913 140987 133028 180660 360651 392537 396160 314769 95157
21896 95157 -115495 211881 7811 -34516 156429 105517 125155 662783 517926 125132
21886 125132 -336169 -370070 -489922 -366497 -364206 -176817 60085 -75275 -286982 -490342
21876 -490342 -677977 -581181 -731898 -812422 -564029 -476105 -646726 -837222 -448292 136057
21866 136057 -53213 -360621 -311162 -170373 -100889 53132 23898 -135814 207799 29402
21856 29402 -218138 2414 150093 173010 160691 312711 450628 280880 106745 224470
21846 224470 107250 13866 29595 -11288 -185267 -194358 -315208 -268226 -422189 -687059 -510128
21835 -510128 -402674 -711747 -505888 -100526 78963 437340 483026 150538 230883 257090
21825 257090 94519 75040 348041 137924 -16242 -192192 -527735 -369253 -262407 -139096
21815 -139096 -84564 -87385 169968 384885 83628 -167664 -83327 98540 91321 67479 164932
21804 164932 170759 -93742 -81818 92413 172535 176224 64588 -172455 -237267 -425841 -286382
21793 -286382 -272122 -420790 -136676 -152640 -393514 -590512 -547452 -304525 -357843 -112474
21783 -112474 -260360 -286809 -142242 260563 175931 -22237 24716 60972 18052 -174116
21773 -174116 -131871 -171811 -204225 -116678 -159019 -265733 3807 274765 334930 309797 91643
21762 91643 -149079 -365528 -427159 -341315 -308761 -322872 -156620 -153884 -202702 -116832 -54507
21751 -54507 -175434 -552250 -478242 -351196 -229532 102663 355175 488156 319991 -189408
21741 -189408 -186264 -412124 -459279 -476014 -338093 -434727 -507618 -635029 -881013 -1003723 -814263
21730 -814263 -539082 -460234 -407262 -347435 -190234 -187731 -51223 -9831 27187 150949 54058
21719 54058 119502 104973 -61630 -69262 76185 168330 -57021 -77486 -361241 -360139 -436169
21708 -436169 -472165 -136414 35958 -49527 -17814 147365 311144 197990 -296774 -361064
21698 -361064 -231877 -349056 -546932 -617862 -385316 -94097 -97816 86265 4704 -229155
21688 -229155 -127601 -41451 -53834 -30329 161734 306392 305836 43988 -95825 238399 297091
21677 297091 -100683 -201559 -121541 -238534 -217505 -356237 -527951 -412168 -204338 -57505
21667 -57505 489929 594658 563344 183235 318826 552426 371606 181754 194315 522551
21657 522551 445183 129740 -323289 -137513 -56360 -370353 -555307 -281266 -308624 -241023
21647 -241023 1963 -212747 -89899 289245 140668 -5375 13640 118003 262263 128881
21637 128881 115331 118543 134886 -133869 -389993 -88350 -210706 -371238 32346 99877
21627 99877 -7368 -63145 48456 137887 127984 -13980 -120593 -40894 61345 63064 -25743
21616 -25743 -526845 -589729 -109071 -116204 -211617 -278894 88516 -55823 -183276 -87436 -94235
21605 -94235 -70945 -137306 114424 -23293 -317119 -186440 -153660 -317103 -26114 242522
21595 242522 43724 241873 231484 237856 105631 199132 -89322 -11647 477528 1178826
21585 1178826 1156066 618076 461505 374963 449265 400660 -16359 99417 14767 -37216
21575 -37216 -53512 -386418 -694517 -487323 -524231 -795082 -680171 -246793 -232625 -151154
21565 -151154 115474 409235 264715 104938 -90886 -194961 -181416 -282193 -74634 29852
21555 29852 -135189 -99192 -104507 -332924 -894177 -1021179 -815993 -354376 -175697 -482473
21545 -482473 -614826 -519794 -180768 217536 371502 21496 -230894 -241111 -570580 -944608
21535 -944608 -484197 -30624 137366 128104 374487 113874 -208071 -249953 -56063 56454
21525 56454 261068 -248069 -349781 138066 361109 -105837 -406872 -543622 -412656 -321522
21515 -321522 -510359 -192631 -47217 56760 -37967 -48116 -4997 -198086 -104194 253245
21505 253245 416753 156005 -56113 186878 338716 635450 284887 -35735 -162923 -189539
21495 -189539 -155254 -270259 -121635 -9431 -98777 -283919 -390852 -246379 -295499 -208168
21485 -208168 -293822 -80886 88145 273201 518836 774910 777510 187592 -349464 -309955
21475 -309955 -189673 -134816 -376137 -255667 -309457 -232578 -381642 -376431 -93754 3821 -385131
21464 -385131 -426838 -275507 -414079 -627616 -634487 -292921 -39953 -153476 -199682 -282030
21454 -282030 148056 -163404 -386935 -441907 -76428 49720 -380616 -608710 -663543 -548114
21444 -548114 -288934 105328 51397 209704 43525 75415 248880 444858 342724 322117
21434 322117 251834 -66464 -224828 -170956 -270253 -245285 -130705 -15847 117574 -553362
21424 -553362 -836922 -416963 -158890 -247928 -98522 -93449 -309297 -401172 -65271 -338222
21414 -338222 -526119 -576520 -281898 4191 -57487 -519012 -549495 -74801 262698 175432
21404 175432 -51081 240581 343265 91098 -123142 -200600 75281 602219 787098 550979
21394 550979 352785 334153 173658 292020 236146 202651 148283 23857 194809 178285
21384 178285 466296 524977 90113 19174 6991 336857 585977 277219 -150517 -538291
21374 -538291 -361951 -35669 -33120 -312167 -65128 53319 -39841 -40574 -421759 -589543 -311106
21363 -311106 -23129 46414 -195339 -574682 -506238 -134185 32071 230901 139340 -50550
21353 -50550 -57482 -458529 -433152 -235823 -90628 11583 -145003 -189744 -288612 -651943 -561408
21342 -561408 -475093 -204066 98871 162347 332097 343943 591106 73244 -565967 -773064
21332 -773064 -940864 -755976 -717160 -791306 -772383 -400788 6393 8182 -238739 -116968
21322 -116968 -68983 -73051 183493 4627 -115346 63532 79849 -231028 -111126 -155738
21312 -155738 -270267 -104929 49057 87354 260281 470912 366186 229539 259650 -111819
21302 -111819 -261450 226635 188733 120433 119857 70080 130979 405435 561560 274239 -284369
21291 -284369 -621319 -427572 -62001 401920 577280 139282 -304077 -42448 133558 5113
21281 5113 -318 125999 27298 -48036 -165983 -381486 139168 317623 505232 349015 329297
21270 329297 136972 -297791 -204122 117401 117482 244026 217638 11864 -419505 -920293 -616379
21259 -616379 -198348 -683811 -504448 57397 189968 75695 -242023 -418870 -59341 83943
21249 83943 67876 -49592 -267775 -118671 -101924 -241372 -69520 -116687 -471963 -468549 -351166
21238 -351166 -482096 -145713 16279 12541 -401846 -294980 -346304 -391363 -402148 -307427 -410055
21227 -410055 -599230 -330852 -581412 -717767 -772061 -667469 -201585 48264 -101609 -604552
21217 -604552 -577666 -521258 -216749 149845 127771 -288231 -306137 -288847 -261019 -71230 65714
21206 65714 -339734 -248372 122415 -157592 -480796 -98128 248066 493676 326480 527731
21196 527731 481162 625093 654913 467525 270173 162552 200713 209445 231051 95086 271838
21185 271838 138289 -265238 -544245 -562836 -398275 -538687 -399348 -531250 -811558 -991469
21175 -991469 -922284 -524171 -402175 -389070 -239092 -106106 88696 174600 567286 443780
21165 443780 257130 314088 94589 -1795 96321 114375 106355 6164 -24592 22542 -176149
21154 -176149 -179991 -31770 190927 138898 -207471 -308066 -463586 -291305 -100449 72871
21144 72871 172141 58128 30395 -177378 -308860 -454802 -574054 -581225 -400025 -335170 -489725
21133 -489725 -423727 -204641 -183682 39476 -25989 -179860 45248 285617 141493 226480
21123 226480 407350 157432 -62846 -137288 128368 461622 415312 295175 -8914 -110061
21113 -110061 -41376 220266 14730 -237824 -86094 -107956 -230129 205328 227756 170754
21103 170754 -98493 -65347 153201 -97353 -300246 6500 169553 322582 179842 1272
21093 1272 -2989 -45198 -386734 -628072 -586653 -298260 -259938 -116135 -317679 -608395 -517764
21082 -517764 -698586 -511841 -162786 -200318 -244863 -276727 -507632 -454112 -155896 -264017
21072 -264017 -810878 -933547 -644107 -1239450 -1255366 -756750 -318029 -135004 204798 467488
21062 467488 140052 -216646 -180531 -72070 -106463 -134975 -299061 -430324 -312834 -200797
21052 -200797 -11160 17068 -165520 -612361 -832169 -546639 -479918 -560064 -652164 -561416
21042 -561416 -283107 -150673 -388567 -546305 -146056 -313517 -596786 -743474 -700333 -484690
21032 -484690 -211778 283408 319036 3933 -77653 11892 251525 392745 434043 151187
21022 151187 -164670 -20535 160000 218469 45212 -321720 -999421 -797489 -619083 -340865
21012 -340865 66712 437892 532642 100044 -87637 103686 450047 238918 203421 271205
21002 271205 228444 212964 431687 188186 233910 96425 -14984 -67984 -37666 153985
20992 153985 68361 2187 323323 -106604 -619869 -578661 -83348 237740 109400 -222763
20982 -222763 -20000 80372 -4994 -257653 -293718 -339447 -290580 -180423 -386307 -751168
20972 -751168 -836243 -423762 -191442 -441738 -384302 115108 43467 -58466 -179748 -217352
20962 -217352 -114775 -484506 -572655 -293382 26690 166788 -108985 -223142 -481794 -657602
20952 -657602 -316327 -535494 -759959 -776825 -658244 -437684 -77647 -55430 10392 79388
20942 79388 139866 192791 566604 679901 756802 719809 255191 62821 424359 721342
20932 721342 515535 324511 145339 -351810 -510925 -730252 -664564 -420661 -229898 -465451
20922 -465451 -765984 -674882 -311315 -18176 173573 -204196 -388628 -381323 -248819 -656819
20912 -656819 -1020044 -842387 -320087 106398 -83317 -132836 -77545 -68165 27212 128488
20902 128488 224296 -85364 -112981 -50581 -156163 61647 386178 368252 -331105 -780091
20892 -780091 -450140 -410963 -472047 -600522 -327608 196952 480767 315161 360451 619541
20882 619541 597338 339288 334031 449930 250016 -4673 109743 -66913 -200523 -150843
20872 -150843 -91644 -209141 -221298 133146 186920 336011 557253 855024 875747 274238
20862 274238 -210972 -255519 338714 698073 661137 291309 -407412 -519277 -655484 -727397
20852 -727397 -546145 -311184 -2252 209213 28614 75666 -19399 126157 180647 -126163
20842 -126163 -321708 -579740 -524621 -241955 84773 397462 629547 356507 179601 147639
20832 147639 205664 -126603 -486659 -875748 -721136 -599541 -26268 255656 368427 297362
20822 297362 139357 78453 -106405 -415315 -324706 -162382 -401516 -70648 34032 59205
20812 59205 -1150 -41790 -149018 82647 358515 349614 201790 49923 -81854 -106728 -95157
20801 -95157 -11186 300037 286969 296342 410598 208497 28764 -258235 -474451 -230920
20791 -230920 -66100 -190119 50899 156005 152179 67112 92752 -74439 -440778 -72409
20781 -72409 204403 180314 18359 -440006 -652653 -520689 -113781 47127 751360 800161
20771 800161 725159 753970 682588 637480 307885 330600 329158 151826 66552 -102613 105197
20760 105197 -233613 -408975 -346171 -333649 -370729 -391805 -382472 -245213 131732 290288 398617
20749 398617 333165 344220 234917 290272 363320 465090 140101 -172869 -656039 -441520
20739 -441520 23539 204030 -5069 72608 -97461 -311756 -396494 -48343 275253 -196973
20729 -196973 -398477 -42215 56716 122074 -7642 -285344 267989 354885 -2061 -283296
20719 -283296 -298969 -376759 -347719 -87103 238601 336777 278440 -72529 -571050 -589481 -275034
20708 -275034 -59247 -7299 -315736 -575835 -569789 -526301 -413026 -248945 -191519 -169536 93994
20697 93994 237718 470479 229988 375861 706770 618812 511942 145503 246515 540318
20687 540318 560838 451510 930373 803430 715002 870399 623857 194789 171922 332598
20677 332598 133485 -219341 206775 565213 188813 -469569 -451267 -330947 -122722 186166
20667 186166 302704 317228 -53016 -247184 -249200 197256 172398 71022 -7703 96918
20657 96918 229346 184284 365454 73900 -146140 -269346 45651 278002 313841 139838
20647 139838 -270518 -355071 -269490 262197 321032 210856 37468 -205759 -317040 -247649
20637 -247649 -128508 -190694 35278 -290 -121488 207223 412351 483741 354630 376207
20627 376207 265293 169948 -63012 -619441 -766740 -439671 -293609 -513838 -683988 -394059
20617 -394059 -120492 128615 140442 462731 483616 -79210 -466124 -574367 -194514 126687
20607 126687 62060 -212375 -272801 -382289 -128478 66272 147123 98703 -152765 -279519
20597 -279519 -277380 -684563 -660986 -408019 -252251 -192266 -81944 64480 110371 195043 70151
20586 70151 73536 251731 285238 210885 34733 -251168 -453761 -237423 60749 237135
20576 237135 -32434 -459460 -376091 -236685 -428661 -569442 -35570 173849 322563 141476
20566 141476 -37502 116509 158719 203260 90145 40701 -139468 -159124 -3016 -54756
20556 -54756 -277256 -47106 34457 1115 -214238 -421828 -307347 -119560 2319 385179
20546 385179 20287 -270853 -503486 -84419 233425 122719 -66804 -22172 -339677 -413808
20536 -413808 -333248 30684 363060 607430 579387 234339 151113 522897 467014 482421
20526 482421 592119 15483 -316040 -246731 -151997 -186481 -409337 -82456 425577 512867
20516 512867 271918 211421 239655 301483 183364 43929 90741 191474 131247 100726 237000
20505 237000 241020 -309780 -424534 -171109 68351 66119 -6629 93437 100107 124950 119361
20494 119361 249136 690174 299197 -101613 -269752 -204543 -136537 -143350 -146059 -156898 -401362
20483 -401362 -244018 -60716 82447 192082 -8162 136966 426335 407795 284455 254490
20473 254490 116027 68824 55026 -49892 -78412 802 -118948 221063 44860 -214878
20463 -214878 122890 141610 384109 393546 -47815 -217055 -16678 44326 119512 532457
20453 532457 534853 167297 -28560 -37137 199420 225570 119775 -115879 -80008 -101781 -123727
20442 -123727 45569 222314 191469 6311 -275539 -323930 -111279 -139530 -158778 138
20432 138 -249292 -239731 106858 443677 158083 215786 429171 381934 237996 393295 51312
20421 51312 -78114 -337225 -301771 -170464 41678 243661 365412 465014 133916 114542
20411 114542 348006 248537 41024 248298 567516 535476 80721 -15442 291710 356523
20401 356523 265077 401477 449232 625244 363017 -145357 -197655 150822 164989 236660
20391 236660 78311 143364 309174 475223 680555 746454 157903 49376 -239736 -282150
20381 -282150 9191 -82011 -462255 -436065 -234228 -187199 136227 263975 310918 -71842
20371 -71842 -10543 152826 159864 -69170 -260634 -37273 44252 129375 301273 322283 -62108
20360 -62108 -240064 68857 59952 -134116 -126754 -254559 -158760 -63677 234131 167127 -139857
20349 -139857 -37978 49655 1846 26657 -185423 -46609 292297 536761 446043 92734
20339 92734 -219 -85887 75220 30481 -84550 -27961 -174394 -149673 -96682 -98165 -195506
20328 -195506 -272174 -241968 -283773 -269062 14560 95587 244755 208878 325504 590399 551050
20317 551050 619701 451144 744774 1037483 454395 -111029 -190500 -42714 248418 87055
20307 87055 -305317 -664139 -527491 -697267 -790411 -555139 -251723 -199918 -45680 -166153
20297 -166153 -301595 -93685 232940 167938 159519 82977 183837 242828 99647 -6451
20287 -6451 200329 229840 69618 196457 248202 60498 123549 26173 -240734 -722052 -789508
20276 -789508 -795627 -358386 137140 145825 181970 173515 339146 541744 594412 481664 381136
20265 381136 277821 311272 594662 916264 421503 116250 445511 559801 424349 609138
20255 609138 303985 187613 325106 679697 732341 326631 155441 19292 103752 100685
20245 100685 243205 583052 631206 467690 234005 29581 95060 231255 74972 195777
20235 195777 482289 330694 472448 540026 604565 579924 386841 588871 484173 564275
20225 564275 544736 524100 549210 610433 719156 715138 594715 312374 217596 -47465 -171068
20214 -171068 128800 265455 325608 417099 632338 1157166 1208118 1042043 1036810 791287
20204 791287 495809 597248 155128 19551 534287 932499 933607 567399 392160 672138
20194 672138 958163 580788 509206 909284 801015 707799 762068 901949 1086795 1000130
20184 1000130 836723 718167 1314408 1741313 2325635 2446071 2180499 1686420 1589198 1694699
20174 1694699 2033416 2317049 2745921 2817663 2551632 2877484 3297822 3575263 4104865 4329893
20164 4329893 4340750 4812482 5602355 5629981 5889703 6419731 6846510 7698742 8754777 10013453
20154 10013453 11836976 14033086 16589616 20175832 24949037 30268547 36301299 42995917
20146 42995917 50227826 57323267 63491888 68461737 72974483 76456430 78358152 79158990
20138 79158990 79583493 79768836 79570754 79001491 78390660 78601023 79941969 81045704 81513032
20129 81513032 81866099 81777209 80619037 78290499 75056837 70552338 65443424 59197463
20121 59197463 52170451 44662296 37722457 31357227 25856168 21339819 17253687 14189342
20113 14189342 12059854 10387281 9144234 8367496 7580662 6835032 6235553 5848199 5576438
20104 5576438 5274940 4632180 4240115 3702788 3571519 3407546 3368359 3656848 3421981 2790486
20094 2790486 2022260 1868371 2226731 2095860 2066206 1925435 1863296 1597617 1528958 1446442
20084 1446442 1378274 1224054 1174523 938587 928122 933416 714171 715359 802512 1079432 1165798
20073 1165798 831783 823193 801731 926920 1318273 1317495 1104506 822244 757633 601452 648042
20062 648042 807733 1073808 671161 251335 55675 123970 626751 813874 507405 484254
20052 484254 541095 661855 529570 416910 375155 632903 613733 663713 853741 797046
20042 797046 463347 454916 584798 319014 -198850 -113419 -29567 -15198 260010 277683 243926
20031 243926 -34565 -173455 -174873 -213334 -233914 46323 32462 -43173 28090 182192 184567
20020 184567 54938 481202 644628 623600 919335 1491361 1694884 1331622 451584 65407
20010 65407 69890 -40829 -301803 -113792 12381 259636 275099 233319 450724 569195
20000 569195 732852 188483 -354535 -807324 -460641 -382454 -401181 -450923 -405224 290730
19990 290730 535979 671930 727886 813154 998721 925192 910623 725680 749124 616541
19980 616541 546705 525249 568112 447057 333208 211980 128228 66497 -67616 24241 308382
19969 308382 201061 39752 23107 359 -152798 4703 -105187 -98744 151872 -26199
19959 -26199 90631 342590 694607 969441 727233 637571 656305 406435 300495 333196
19949 333196 360893 330948 455546 204050 -198039 -339860 -153833 324880 410914 338550
19939 338550 516350 169025 272504 357381 519835 735609 431391 515672 491623 244140
19929 244140 138951 156657 467453 199249 164687 269514 33589 -328062 -473287 -396648
19919 -396648 -257477 -206819 -149696 -29411 -38686 -36042 -160610 -268090 -84111 114365 116238
19908 116238 250957 221339 344947 545341 668401 652529 772352 680751 535507 756173
19898 756173 781920 712081 600505 1028113 718323 581243 924152 1095476 932067 715750
19888 715750 481439 168435 329568 498086 664745 534838 333521 457486 367227 375695
19878 375695 583850 827708 664074 635205 669336 914333 1577899 1622767 1592602 1552705
19868 1552705 1602909 1598051 1266277 1100774 1133514 1040601 1102178 1324511 1368425 1020954 665298
19857 665298 738645 1059017 1177722 1173300 1313908 1196698 1569548 1548298 1266064 1057260
19847 1057260 974669 1045439 986324 467656 226030 209732 124242 375330 760021 866929
19837 866929 453571 414790 385832 82019 153385 148408 39693 -212014 -656576 -532125
19827 -532125 -23278 256522 255592 373434 359137 167806 -42567 58865 227157 264316
19817 264316 649997 680461 496255 427252 352271 376911 483029 492351 90845 460579 343102
19806 343102 74912 1245 57772 323888 284848 -8726 -236388 -105617 -86622 -49212
19796 -49212 7231 -138497 534355 754206 797212 995479 499538 54033 302427 447638
19786 447638 717 -450219 -506889 -615786 -213581 137789 322904 541061 335606 226516
19776 226516 -96882 -280667 -98139 6823 -81666 -44569 -67197 -226069 -105834 -76737
19766 -76737 -75726 2586 164474 271501 214465 18235 -123197 -19090 97065 205592
19756 205592 -68350 -416347 -431247 -241791 -318104 -550530 -533244 -232787 -204548 -282407
19746 -282407 -181096 241985 -201367 -378254 -47582 139349 13543 54400 328271 341236
19736 341236 230104 211155 6375 208372 679921 579043 246255 454456 202587 150306
19726 150306 529723 900999 1040895 914457 965665 936446 603097 37206 -333767 -334170
19716 -334170 268821 409714 572699 296958 194733 136169 437256 361089 156492 158448
19706 158448 294494 161951 39104 -57901 27497 43700 -326015 -503136 -440744 26838
19696 26838 219600 352255 15527 -97318 -55631 200065 202888 463434 521449 181324
19686 181324 36705 233972 309347 7643 -273972 -634472 -395650 -210026 -333326 -446482
19676 -446482 -564077 -359153 -73278 149930 87201 73822 -269095 -191393 133376 401750
19666 401750 514198 781065 602630 423730 504773 693551 654621 648170 524713 360597
19656 360597 -121701 -360022 -285594 -242227 -267553 135600 485627 -10099 -90825 195861
19646 195861 -220089 -337607 -438836 -422045 -295686 -167624 -177580 366702 790195 407825
19636 407825 -78799 -203363 48999 30437 -212938 22467 -144789 -57578 68973 107092
19626 107092 -74502 -422009 -412704 -249197 160212 408599 392401 -3186 43842 193034
19616 193034 -147381 -263313 -179021 -45288 211335 332463 279205 343668 170045 76066
19606 76066 80027 468039 441902 -77546 -596453 -888994 -769770 -535091 -482873 -395104 -427344
19595 -427344 -157549 452966 523698 163212 48415 -343997 -410799 -6803 121383 323264
19585 323264 493847 564729 508968 370005 572608 686098 680311 420494 509277 1066333
19575 1066333 1071003 955070 743967 695164 865877 918225 686494 686741 887013 973454 983179
19564 983179 928998 825114 300327 231551 433995 433665 93150 -132239 -376602 -485361
19554 -485361 -289714 -137638 -131912 -152390 276496 225694 277797 599411 642353 224620 49086
19543 49086 -296915 -101200 395519 718458 669551 744087 362833 91944 -8900 197067
19533 197067 542219 604792 303689 132309 330484 354891 414732 238475 214411 437703
19523 437703 430951 297230 381567 292841 304716 280048 -215021 -320511 129121 105810 -158495
19512 -158495 -100928 110869 13020 -152946 -293000 -530337 -288547 12192 -49530 -158936
19502 -158936 -303232 -74219 -158141 -228626 -72599 69413 -30618 39075 26596 111849
19492 111849 216200 69564 35621 -149496 36883 -50788 -305942 -220393 -423653 -203833
19482 -203833 265478 419107 676046 688091 539892 719202 555216 -247536 -482810 -647630
19472 -647630 -510270 -331089 -336980 -350662 -264269 243928 417571 452865 494631 199342 -338647
19461 -338647 -200208 48419 -26576 -296932 -69284 198679 396217 630419 954471 638774
19451 638774 102345 -351044 -339369 5064 397286 460025 608345 597750 548311 147179
19441 147179 65299 297899 377312 -165273 -160320 150975 -22407 -133728 428058 784459
19431 784459 527980 249778 162417 255277 380463 613710 337070 216260 270857 166038
19421 166038 620600 501840 323363 290474 264014 352588 596443 471781 154550 -1158
19411 -1158 -70880 -147858 -405569 17855 463700 472012 797813 640636 467232 435510 665715
19400 665715 947886 656362 248897 107092 146839 603203 970152 583214 392727 444569
19390 444569 366922 224703 226432 251672 505198 448092 163024 -103375 -56035 89899 -102055
19379 -102055 131564 85465 178519 316134 417758 514196 407409 432240 368313 215612
19369 215612 568231 889339 718122 206976 104503 70208 -46215 227572 397410 56604
19359 56604 -146297 35634 281814 252235 460303 317742 72759 -45927 75701 84199
19349 84199 278105 370726 422288 293916 153017 256316 300630 345425 348853 135902 392979
19338 392979 527649 373178 -173260 -419884 75469 419338 641220 634627 566693 399150
19328 399150 73002 34977 44903 96152 292157 490216 231525 324634 469859 -200328
19318 -200328 -549955 -348201 -326001 -318227 -173907 -142428 -80515 6701 -4977 225213 192351
19307 192351 82722 145034 303589 463148 53925 -409816 -412318 -17180 168767 439341
19297 439341 713416 228145 244587 187455 219261 180910 37068 173365 182383 53891 -121714
19286 -121714 -557858 -483217 -51508 138796 95265 253269 161615 287273 332944 -3564
19276 -3564 -244092 -369377 -277163 -443330 -393800 -177972 -224505 -451039 -370555 -415879 -202508
19265 -202508 -132743 -177492 -302692 -384934 95503 -142693 -272712 -258421 -331106 -587196
19255 -587196 -384734 -435353 -442434 -502585 -567153 -385604 -93276 8087 -183015 50770
19245 50770 42822 84351 249350 612475 1005600 984303 1109554 1112273 789162 525786 506310
19234 506310 466399 175490 -10909 40864 296394 612257 713547 624097 581319 325011
19224 325011 157275 -83641 -55198 -116848 168212 204014 -128277 -292184 -198090 -242487
19214 -242487 -287106 -121983 -46655 227865 401070 436631 220151 9964 173163 277270
19204 277270 164199 -92687 7512 83609 -267351 -683417 -628561 -422085 -641833 -824284
19194 -824284 -551610 -223466 1493 -64938 -366349 -397486 -285240 58032 -48963 -288103
19184 -288103 -15645 217576 543897 638405 341316 -308616 -326667 81554 293743 451780
19174 451780 176361 24072 134067 167318 301342 155709 94175 -208974 -389725 -158278
19164 -158278 260113 442039 465479 74116 56494 238860 117769 363993 403914 478840
19154 478840 470459 138917 167780 252636 253894 172446 224109 405030 478404 609235 633159
19143 633159 135334 123229 69822 366818 348994 157221 350267 544293 672342 602755
19133 602755 498343 606917 642966 646032 690353 698298 478125 205938 34962 -94708 -199069
19122 -199069 -130962 212838 193975 94157 -135649 16993 -135727 17757 422496 192160
19112 192160 177887 392369 352871 -169772 -229840 -28900 367995 627185 301863 -108799
19102 -108799 18809 243267 257234 225286 524472 484317 285624 17362 46473 166202
19092 166202 242298 -159883 -405769 -65430 243028 25338 186361 -86761 -63792 80790
19082 80790 16708 -115750 55472 460809 642540 360162 189423 472982 549254 444403
19072 444403 246677 400384 387559 163561 -91027 -362820 -385388 41310 346689 205139
19062 205139 -61932 -411253 64872 466353 323485 190017 -61506 -253722 7627 247888
19052 247888 385641 305172 217714 294524 396117 343535 409571 913184 1045031 745544
19042 745544 539528 309906 -43310 31961 278014 -23841 -10528 -298218 -416740 -278837
19032 -278837 -678129 -513999 -167124 -390922 -264565 19365 66511 181625 156837 213073
19022 213073 225454 414697 198046 113435 415320 491263 612349 590052 486763 399914
19012 399914 364469 448641 158712 149836 299068 577459 901287 973309 810910 514292
19002 514292 389505 496528 318307 417538 557219 264123 376175 255972 -51510 -339772
18992 -339772 -323033 -335655 -176414 74445 615646 288332 -105364 237675 617167 439947
18982 439947 15221 164153 398791 292010 157519 20247 -239167 -116816 -37143 62574
18972 62574 275319 357763 462545 375750 263220 -4761 -26134 13108 40319 199081 393005
18961 393005 673109 712092 722072 866987 601293 575806 547436 482742 483703 479666 206779
18950 206779 557520 1131071 773464 310564 184712 134231 301064 631294 683216 822059
18940 822059 853411 985967 1329025 1173837 760276 904110 1162257 944367 906361 1262814
18930 1262814 1677852 1722088 1515787 1371025 1500151 1237467 1209851 1431520 1326367 1448701
18920 1448701 1222829 912740 1012435 1001558 954570 1387832 1846612 1974973 1636079 1292306
18910 1292306 1592449 1630141 1948727 2582118 3250741 3586865 3895878 4278313 4735855 5783263
18900 5783263 7589664 10186808 13008188 15950441 19287556 23010257 26373101 28859245
18892 28859245 30027946 29964136 29212226 27235685 24361209 21721742 20122710 19347738 19394211
18883 19394211 19880102 21850462 24677631 27201325 28248538 28072066 26953247 25329648
18875 25329648 22645184 19112200 16042356 13330108 10596702 8623880 7174168 6297767
18867 6297767 5922085 5868715 5575900 5444204 5429914 5403612 5455358 5448826 5690741 6003693
18857 6003693 6464365 6490972 6722134 7446309 8469226 9875480 11108387 12665244 15093689
18848 15093689 19146001 25112334 32472131 40226009 48838032 58184650 67086346 72791690
18840 72791690 74788931 74650304 72846640 67526645 60151436 54116879 50610590 49082949
18832 49082949 49827442 53018144 58914379 65857666 71973194 74732449 74845193 73333958
18824 73333958 68827276 60005859 49519138 41018184 33236790 25462504 19425451 15317571
18816 15317571 12856675 10969713 9916907 8878775 7831084 7198023 6460695 6056305
18808 6056305 5849950 5786784 5562765 5677042 5387584 5144816 4827722 4708912 4562414 4592230
18798 4592230 5181340 5155867 5479379 5566915 5859114 6427455 7236694 8024812 8877214 10110168
18788 10110168 10915406 12372493 14440961 16639518 19747745 24490013 31857537 41567961
18780 41567961 54235889 69409682 84862230 98231947 108144121 114891214 118666349
18773 118666349 120371210 119855809 117433175 112823640 104594596 92518470 77659497 61427042
18765 61427042 46840585 35136325 26495205 20367147 16289900 13802282 12130653 10613298
18757 10613298 9578993 8581090 8125468 7854576 7592949 7042147 6364193 5894487 5595893
18748 5595893 5076924 4262678 4164065 4228899 4091266 4188383 4457582 4542459 4571997 4898309
18738 4898309 5199341 5378388 5629124 6079460 6823865 7519087 8843961 10688910 13467597
18729 13467597 17990219 23259816 28781961 34554138 39603166 43287147 45059443 45643457
18721 45643457 45796142 45320152 43660022 41388882 37803507 33302270 27580908 21448685
18713 21448685 16546166 12419038 9463753 7656103 6614564 6273457 5487052 4906855
18705 4906855 4349419 3962262 3594248 3470301 3216823 3330220 3108333 2923024 2744053
18696 2744053 2577426 2438860 2350649 2035847 1823609 1893424 1711092 1607398 1521750 1182421
18686 1182421 1283870 1459518 1380637 1195197 1337024 1491946 1293513 1272258 1293008 1388030
18676 1388030 1290118 1424443 1770257 2224891 2431675 2184158 2018529 2403556 2532806 2412669
18666 2412669 2456631 2391692 2659343 2771178 2774457 3018661 2978445 3109199 3283161 3602902
18656 3602902 3974684 4198279 4380145 4800173 5097732 5793427 6612811 7491424 8502522
18647 8502522 9862074 11100057 12914294 15603146 19826468 26137246 35716592 47983884
18639 47983884 59466760 67372581 71845351 72975860 71745995 69389081 69498387 73324322
18631 73324322 76643874 76539792 72640564 65505630 54243401 41972316 32772663 27343028
18623 27343028 24826115 24477375 25294388 27364138 31879954 40002771 51499554 63823340
18615 63823340 73159360 78494937 80096966 78799454 75767112 73906148 75908023 78975611
18607 78975611 79400192 76032396 69138270 57791984 44189367 32086059 23672924 18561258
18599 18561258 15214381 12667920 10964440 9713717 8814021 8123032 7555300 6692306 6188178
18590 6188178 5842182 5580448 5267582 4825427 4432115 4285639 4559758 5039335 4891336
18581 4891336 4556174 4769151 4726951 4053374 3787241 3552712 3409644 3372785 3593432 3580188
18571 3580188 4113272 4372358 4493089 4504381 4667586 5026837 5062622 4656104 4591610 4635513
18561 4635513 4504879 3942320 3885060 3764740 3844366 3868816 3597771 3238156 2828559 2588267
18551 2588267 2604598 2406460 2253229 2366673 2545070 2797873 2705931 2548453 2351634 2410308
18541 2410308 2574580 3124333 2797124 2460916 2380482 2532176 2365307 2263974 2650548 2813901
18531 2813901 2563257 2629255 2679182 2256468 1868184 1670798 1818216 1894589 1696854 1464207
18521 1464207 1517142 1602855 1656411 1530268 1525772 1580319 1602039 1927197 1884937 1678400 1741787
18510 1741787 1496852 1076324 389746 586120 905290 1021513 1145169 1173386 1524217 1460377
18500 1460377 1464501 1173410 1126118 1030810 940488 853530 850107 758222 745964 991547 978068
18489 978068 794867 847685 1228911 1471899 1602063 1370821 1004911 1102492 1393286 1316744
18479 1316744 1435262 1181071 1342971 1198219 763436 615343 768499 528189 511411 257535
18469 257535 45287 673596 1302466 1593966 1585250 1241899 757880 834654 914273 802670
18459 802670 699860 470910 625237 718919 791488 872485 982502 812086 482784 939536
18449 939536 1100319 874471 502450 325034 626631 883302 947628 1005018 1350409 1028410
18439 1028410 1188500 1236815 1104337 1366847 1413740 1312472 1295999 1249406 1031021 1033944
18429 1033944 963166 795804 861156 793360 857488 855090 955458 917820 901477 1020141 987431
18418 987431 803558 1087885 1602759 1874394 1958481 1772159 1965788 2017987 2091716 2224696
18408 2224696 1882149 1901993 1637378 1325888 842214 986538 1118188 1072335 845458 855619
18398 855619 1221388 1541234 1483369 1358921 1205467 1220334 1156300 1398455 1401018 2038198
18388 2038198 2534932 2583169 2716008 2827633 2825074 2382029 2415977 2493189 2486857 2583367 2936691
18377 2936691 3021186 2833755 2989372 3251846 3759411 4343614 4748440 4627044 4113137 4184271
18367 4184271 3961812 3900251 4512872 5115409 5528741 5850641 6260402 6697364 6988518 7761647
18357 7761647 8909532 10044258 11851802 13843158 17140837 22235723 29696972 40225675
18349 40225675 52180834 61751551 67672399 70243078 69695947 67018311 64683031 65528399
18341 65528399 67778604 68582908 66357383 60752912 51622492 40435894 30309462 23516556
18333 23516556 18868272 16001773 14288114 13084372 12665936 12411144 12289854 12588240 13556789
18324 13556789 15066652 16650271 18790735 22614956 28265886 36957361 48998747 62345329
18316 62345329 73573484 79971940 82688094 82216994 79123544 76287682 76642622 78195889
18308 78195889 78508701 75760522 69431943 59550142 46082075 33683180 24892562 19429476
18300 19429476 15707394 13486411 12057619 10986095 10010147 8957172 8528540 7978994
18292 7978994 7042882 6422577 5986953 5667891 5399683 5282584 5315133 5214745 4866064 4398340
18282 4398340 4009879 3905278 3852754 3500807 3423553 3606227 3814864 4360616 4433725 4227382
18272 4227382 4014448 3777093 3294133 3289588 3780156 4031915 4243594 3761803 3496710 3570549
18262 3570549 3171195 2404112 2106683 2191694 2029324 1946668 1992378 2155512 1953858 1886971
18252 1886971 1741975 1426707 1134776 1255341 1610991 1617126 1596315 1378913 1629283 1605511
18242 1605511 1195381 1023505 1610670 2326777 2268033 2084796 2230588 2403772 2462852 2216587
18232 2216587 1796476 1618189 1625515 1426041 1162604 1506808 1588479 1655842 1583424 1520481
18222 1520481 1387697 901589 535642 526526 497764 552127 469345 549162 573834 598404 946885
18211 946885 925407 1098720 1018117 901074 1046053 1259636 1455288 1748314 1984851 1888615
18201 1888615 1451699 1320650 1533642 1308579 973268 838415 749885 760188 864905 1195633
18191 1195633 1277618 1076302 845569 742866 779904 797438 704007 904703 1107103 917647
18181 917647 1051108 1340772 1291470 1048066 1185528 958778 1074358 1106822 1145824 889155
18171 889155 511965 642183 882631 706950 618541 863490 1243515 1131645 1203919 1144510
18161 1144510 1367970 1777536 1861193 1601969 1760860 1766940 1324823 1321330 1383551 1411306 1949197
18150 1949197 2353930 2378663 2363392 2221209 2471182 2693184 2624645 2643497 2686680 2725173
18140 2725173 3102677 3291013 3764114 4146697 4672220 5101370 5519555 6110950 6934771
18131 6934771 7754076 8814077 9975674 10827174 11797922 13298684 15174919 16911389 19316984
18122 19316984 21935109 25436912 30105983 35836991 43760991 54303634 69551086 93172714
18114 93172714 132146714 196403048 288672363 379745907 436727439 454027427 437461392
18107 437461392 388457068 297986152 198386288 129814694 90128091 66292586 50878425
18100 50878425 40537092 33007933 27184363 23087739 20167766 17777779 15859922 14452968
18092 14452968 12989104 11570054 10509152 9815745 9381026 8902783 8333988 7448068 6582884
18083 6582884 6260745 6138339 5758747 5301706 5115477 4976893 4846268 4795204 4740364 4574292
18073 4574292 3929345 3468994 3021660 3156563 3123187 3111391 3152795 3258814 3315337 2890590
18063 2890590 2747082 2618975 2922839 2917191 2819776 2789247 2506232 2517238 1920461 1558023
18053 1558023 1572346 1578328 1425539 1761304 2009723 1589738 1626455 1881368 1750704 1438707
18043 1438707 1325686 1412423 1401113 1181312 1334569 1799691 1829204 1713598 1389884 1290271
18033 1290271 1563820 1717027 1609119 1220634 1246607 1221652 1618264 1118954 1244524 1444284
18023 1444284 1438133 1344218 1200730 835416 576514 909019 817544 782510 520719 679042
18013 679042 926745 1108422 1329980 1017239 496860 707091 999440 1492236 1608369 1543667
18003 1543667 1565141 1638031 1720946 1390955 1220259 1263502 1118860 936863 1372258 1588464
17993 1588464 1351371 908333 1074640 1149224 1037297 943289 857028 893228 870195 802953
17983 802953 778827 1430328 1834389 1616695 1283348 1250740 1353950 1023938 989947 1268648
17973 1268648 1264855 1017524 965204 1141650 1174393 1218860 1277203 1125582 1144642 727553 874228
17962 874228 1033152 877518 762096 803647 1011576 1193827 1109536 1079318 710137 456362
17952 456362 417673 493176 761653 899054 1028159 1061492 874916 793979 1166946 1156716
17942 1156716 1093703 1074573 1199349 1179226 1343407 1154154 1149023 1594191 2061144 1931232
17932 1931232 2044383 2558917 2950018 2854933 2980035 3057434 3181162 3651727 4058994 4229527
17922 4229527 4715460 5484072 6622049 8184610 9901461 12148344 15349438 20934248
17914 20934248 29902992 42802649 56686048 66842505 71414263 70914036 65364735 54136414
17906 54136414 39847854 28506076 21603509 17374402 14777440 13476389 12338391 11980194
17898 11980194 11930028 12049146 12805213 14502268 16843001 19993387 24150131 31184193 41964198
17889 41964198 55660848 67351282 74416974 76753906 74591866 68368223 59618541 54703186
17881 54703186 57251568 63830543 68829109 70428316 68341597 62528548 52257279 38973725
17873 38973725 28530528 21962420 18001014 15466610 14202761 13094463 12177220 11902179
17865 11902179 11750403 12068530 13201650 14860946 17124776 20664759 26455675 35214067
17857 35214067 45987883 55407098 60459325 61256867 57882712 50580768 38956858 27689583
17849 27689583 19974014 14918561 11519635 9655537 8218385 7344978 6795043 5787492
17841 5787492 4745029 4574888 4449031 4483769 4671311 4532821 4296942 4091785 4365777
17832 4365777 4044292 3649919 3433014 3504977 3441306 3600797 3460155 3470979 3305649 3019852
17822 3019852 2593649 2210047 2238593 2474926 2238793 1783868 1348868 1243910 1819796 2223779
17812 2223779 2232086 2103909 2106385 1895050 1675155 1516055 1158505 911033 905169 1126770
17802 1126770 1350821 1025260 420285 548387 550292 472368 895439 875043 935031 937040 1118362
17791 1118362 1262154 1449711 1847330 1638474 1137874 1219414 1443318 1433142 1021350 686043
17781 686043 641873 847968 897594 725465 369172 241856 229547 652057 1037602 645976
17771 645976 240319 778419 1010813 998193 1140288 1033336 1080861 1047899 1286602 1429785
17761 1429785 1376233 1308144 970080 959657 1165152 1202831 873551 943327 970610 1101033
17751 1101033 1240547 1145898 767444 710840 964567 1169203 1396232 1621370 1378043 1141392
17741 1141392 1180288 792664 558819 363462 292573 242104 428743 574449 835447 531803
17731 531803 667285 977060 1030563 901803 443448 536891 786479 771500 677788 536702
17721 536702 623635 704346 575523 135202 56293 10493 351997 464174 320171 283462
17711 283462 343385 144507 123161 239623 -390458 -500042 -86854 258060 746938 839422
17701 839422 899100 946823 1024254 1039926 903375 584949 327558 208002 -72286 22743
17691 22743 323057 662024 645870 628673 519517 397218 375413 478834 176219 122095
17681 122095 576263 1084061 774909 792640 1164063 1194489 430552 -239806 -52445 -187226
17671 -187226 -99732 245187 545887 690072 906906 673797 700552 547579 699341 909800
17661 909800 626606 396006 641984 717284 609171 492474 132575 -364450 -387906 -549238
17651 -549238 -461067 -536105 -308840 -220680 166647 269033 250952 470774 423078 495414 416842
17640 416842 291599 156637 482258 567068 453945 331129 100639 137183 49828 -226058
17630 -226058 90344 -38614 -205971 -286591 115489 731648 641280 588040 708898 446611
17620 446611 595649 884104 1083485 1224325 1442551 1030253 589409 383969 572067 841894
17610 841894 790575 667941 483172 493577 519570 243243 142147 -218043 -134720 116733
17600 116733 419078 504710 458501 592464 236625 -114086 197922 88489 -85668 52795
17590 52795 351414 480714 448563 160562 -250973 328 81997 595018 598508 480114
17580 480114 409757 30514 -36115 192523 29575 -400258 -371476 -254829 129304 424132
17570 424132 221731 -87031 41720 268730 134659 175809 445269 522326 623597 543153
17560 543153 18006 -267613 -78966 80681 -314495 -123981 74375 524082 460770 321674
17550 321674 224521 6311 -285099 -350824 -247140 -41177 250315 52068 -336808 -724218
17540 -724218 -297345 -77165 54334 297660 369592 294097 253564 199359 582703 694787
17530 694787 550275 217293 -204051 -684251 -371335 -125748 -72105 -64161 118267 528891
17520 528891 733393 783599 546956 506524 379992 141926 -30179 337881 574704 211795
17510 211795 86549 232037 376638 272367 450400 401442 427741 362848 452635 469150
17500 469150 29884 -31885 45388 181604 82290 23856 -27031 106067 89763 -67141 -87316
17489 -87316 316673 273679 -59856 -107291 -257604 -267243 -169361 -113556 -275051 -33221 331519
17478 331519 466983 -96094 -282686 -142314 -59760 -119907 35221 433885 755674 289647
17468 289647 93974 334255 385222 587867 454425 388682 472289 418514 670603 582083
17458 582083 525073 106564 361084 529891 719329 722838 332001 243756 694684 899138
17448 899138 1027053 1149005 1521716 2203835 2400907 2448764 2608990 2533067 1984416 1123865
17438 1123865 421589 111354 184914 59884 174155 383127 367181 518593 297966 326570
17428 326570 228398 102831 -153981 -310107 -121811 56989 32628 -82605 -16152 292567
17418 292567 636611 684242 133897 8544 -58374 -615579 -941874 -1120446 -834754 -345177
17408 -345177 -437079 -376160 -373341 -9126 169994 220308 -13666 23430 -154825 -445317 -263359
17397 -263359 -131095 188506 344826 203610 176076 240966 -28471 -108704 220692 356841
17387 356841 22805 216464 117931 20459 173334 177865 -118661 -15586 431485 402751
17377 402751 290594 103132 426665 463852 398820 44135 -382430 -639410 -624267 -307197
17367 -307197 -67559 -222408 176182 625023 624185 433081 130216 49944 301860 122647
17357 122647 -10471 -3764 -115213 -95566 -144973 162361 270555 144479 128304 173569 296197
17346 296197 190910 148528 422802 326518 227242 273390 417291 555237 543138 297866
17336 297866 186886 8324 16852 85416 341381 236332 -164826 -524600 -879184 -768102
17326 -768102 -661314 -634660 -586977 -477536 -497163 -371514 -231014 10385 355721 235560
17316 235560 -46671 1932 -268002 -458014 -212579 127457 280973 668681 459890 -264553
17306 -264553 -322579 -207627 -18240 -23566 -51941 77443 -43015 -29156 3527 389722 819806
17295 819806 984299 987737 588449 195478 601351 734646 241726 435129 384683 366318
17285 366318 143763 281096 393022 298543 239469 66729 167576 201681 281566 -19226
17275 -19226 -418286 -364938 54012 514845 781771 742266 428189 506258 117429 -359296
17265 -359296 -6849 324326 347127 13397 -193692 -190429 -321322 -387420 -369842 -440947 -260499
17254 -260499 -147339 197269 328935 -88296 -200428 -379137 -564470 -830421 -835296 -380398
17244 -380398 -539458 -613556 -914945 -1147732 -653604 -332757 -235834 -138685 -151537 -31026
17234 -31026 82314 -78096 -49948 17688 283425 402801 453100 366023 260229 308653 564190
17223 564190 51071 65862 -305700 -672328 -510046 -523194 -951604 -1385850 -1297704 -778752
17213 -778752 -593608 -728746 -737604 -529930 -413982 -355763 -573778 -372136 166915 -212991
17203 -212991 -385484 -361742 -325682 -278822 -3047 -157525 -242833 -67988 -94256 263942
17193 263942 23543 -198963 -77336 288738 189129 105894 -188264 -427883 -213775 -33454
17183 -33454 3431 -200850 -140013 -6127 -260284 10056 -36931 -231406 49147 -80893
17173 -80893 -423650 -136326 -133511 -126321 -284557 -118021 58592 98147 -164793 -16628 303798
17162 303798 501325 699601 505779 78614 30226 -214317 -12872 232515 444853 217583
17152 217583 -3376 31742 45017 99813 278106 144717 185026 553438 530414 119292
17142 119292 -226382 -373746 -150545 603486 918258 716700 342750 5770 15853 146254
17132 146254 2045 170638 198948 -317651 -724400 -501186 -227668 -241485 -17013 -69387
17122 -69387 -165809 -442151 -374722 -431221 -435765 -50692 -171653 -323559 -445558 -118827 -128613
17111 -128613 -231560 -240835 -58298 -126328 -48361 163878 23279 -90923 -148600 -223288 -475529
17100 -475529 -146422 200480 15270 -217911 -273092 -335792 -294557 -58136 26978 270506
17090 270506 352709 155908 158025 549935 231674 -133739 -59579 -189944 -324520 -120762
17080 -120762 -243329 -281924 -253856 266321 415520 326978 -85617 -340492 -506801 -266878
17070 -266878 -33348 371644 504532 176671 215182 192891 105585 71764 -88182 -171854
17060 -171854 129708 121124 -393285 -527577 -194978 -119652 -5662 146605 -287153 -359471
17050 -359471 -483245 -266853 47218 57751 119013 992 -259626 -350184 -340688 -251985 -431970
17039 -431970 -108330 -29746 -149381 -44117 257784 67617 -261849 -411108 -402304 -498336
17029 -498336 -621286 -1074685 -1007271 -813586 -479974 -294198 -313953 -102611 -41063 226813
17019 226813 346878 301463 131451 203360 423771 516708 421835 258797 62409 -201853
17009 -201853 -190778 -120030 42159 76083 -34810 106522 67817 349238 -13753 -204559
16999 -204559 -71502 48546 269451 427221 129710 -19196 144703 397746 403296 203270
16989 203270 46027 87621 394405 716435 851144 841104 795360 781838 330338 38680
16979 38680 33975 28404 65365 21491 -66643 29013 165636 129859 -209598 -436822 -687822
16968 -687822 -632015 -815044 -803994 -516190 -607018 -414994 278427 388086 216822 227244
16958 227244 -9091 295377 295502 27452 244471 -65493 -631807 -835719 -744061 -536922
16948 -536922 -178861 77168 177823 -25470 -131832 -91039 -348159 -319563 -512012 -408043
16938 -408043 -101718 -177805 47845 385640 246972 -230273 -354821 -326331 -156431 -98732
16928 -98732 84665 264714 343625 226306 -130435 72122 185322 287070 360501 352266
16918 352266 252194 224909 66453 -29033 109547 241594 473420 446984 118410 94763
16908 94763 99231 127207 332499 290006 94645 -30646 -389471 -172190 26107 169029
16898 169029 159362 3917 -237324 -125851 381964 198589 377253 762108 793512 459907
16888 459907 25237 -70901 191179 189961 144511 146539 114917 -192568 -221926 -111092 -112886
16877 -112886 -310746 -562344 37386 366413 19463 -102225 -142056 -121132 43554 74791
16867 74791 -121087 -233288 -330622 -180612 -31087 55606 -166599 -170589 60051 236667
16857 236667 468724 344181 306922 64367 -146120 9958 38940 -46023 -153262 2899
16847 2899 -73158 32086 289763 118528 274243 245366 -3984 231956 -48609 -217232
16837 -217232 -176016 -197117 28973 178264 294910 336147 332528 554463 399155 214005
16827 214005 219103 212172 116110 -48159 -282670 -459457 -468053 -476992 -602642 -447885 -310954
16816 -310954 -314735 30115 -16842 -285571 -479892 -438308 -150891 108821 356293 132217
16806 132217 22346 -7727 -24067 -88725 293530 356504 312277 529019 640330 19572
16796 19572 -397569 -321739 -500899 -497355 -28293 199060 96607 -189197 -193861 -427790 -760283
16785 -760283 -630567 -230519 -162958 -377257 -162918 -263541 -12294 243501 262414 44836
16775 44836 113045 -253271 -606716 -545440 -51807 -48148 -302652 -169437 91076 -47796
16765 -47796 -350502 -458523 -365520 -24599 125683 269328 177289 7245 17504 -445870
16755 -445870 -699128 -236509 -268205 -375122 -79422 -141868 83241 389109 577177 348318
16745 348318 405018 435846 456259 331796 36727 142338 491491 72580 141922 -4080
16735 -4080 -31921 -36432 -30577 -11942 60523 400007 445090 129895 -10134 27139 -45019 -29315
16723 -29315 385940 162369 -7601 62384 52191 -58126 -196063 20652 98359 -26001
16713 -26001 34585 249698 467312 340687 206839 158135 -370869 -696668 -527478 -21589
16703 -21589 336169 579252 85484 -197706 -305548 -371273 -100952 275048 495362 565455
16693 565455 485080 461649 481546 531220 417231 323457 70117 112710 204271 190752 -99471
16682 -99471 -167039 -293102 -491206 -213475 -38883 -262856 -455795 -245708 135978 19148
16672 19148 -371868 -479944 -702340 -818575 -403303 -248419 -190957 303471 714521 459078
16662 459078 356814 612417 633778 339344 239108 227132 9536 20214 -45037 -230518
16652 -230518 -446373 -286328 -41509 81404 125133 376679 165765 -17995 7054 15978
16642 15978 -302073 -56391 111662 -124070 -90677 39258 -22316 149798 10813 -40368
16632 -40368 123038 -128758 -603490 -690174 -584693 -386382 235154 219635 344926 361058
16622 361058 -88827 -224036 10692 242421 255889 -109046 -157878 -148706 -214085 -188975 -376577
16611 -376577 -477935 -300944 -55082 110901 247970 356783 300739 327179 295908 -43883
16601 -43883 -326172 -637664 -981295 -1116428 -1107101 -1110964 -1044255 -967618 -889546 -507268 -398512
16590 -398512 -207559 -86158 -40145 191002 133028 183270 232644 168709 300135 469127
16580 469127 301123 93714 -111479 366018 345732 329427 126981 10993 -157342 -143774
16570 -143774 292931 279319 -310389 -563718 -504476 -357322 -450622 -277356 -407177 -521975
16560 -521975 -610568 -131559 17865 156264 329378 416307 467031 416188 585543 313335
16550 313335 448024 199415 79050 31171 -345293 -476782 -512142 -438421 -230315 -216919
16540 -216919 -257553 103898 -244373 -345319 -166304 -81508 -224808 -226481 -313892 -335044 -339917
16529 -339917 -41154 103900 -122871 -70283 -90054 -251741 -136013 -152444 -47436 -62450
16519 -62450 -89200 -465484 -761494 -567181 -148431 253677 303884 415839 233388 -75504
16509 -75504 -99855 26429 79507 221059 523382 357708 56022 -190182 12853 -59563
16499 -59563 -470405 -198234 62203 137439 140138 77425 -5582 -53854 -89313 -207076 -289103
16488 -289103 -261380 -121758 -155368 -210313 190217 312532 86674 -12958 209044 517515
16478 517515 42279 -21780 1244 -367068 -411373 -468952 -437399 7901 290951 391921
16468 391921 66281 -408465 -619901 -404769 116046 58017 -179414 -453587 -324549 -375090
16458 -375090 -17374 98082 -421954 -564900 -738760 -141411 319315 201281 -88654 -190107
16448 -190107 -87123 37763 -5614 -8823 -36601 194243 403738 222255 -147701 -18469
16438 -18469 206266 224993 -269441 -264044 -181983 -262029 -586056 -415290 -82355 -140880 -286356
16427 -286356 -115294 214890 542014 274566 332215 386830 175369 -164062 -249687 -711203
16417 -711203 -802720 -375350 -248877 -164311 -282293 -167135 -177409 -244494 -340857 -556008
16407 -556008 -583993 62005 146641 49424 40473 89309 94738 128736 -440109 -553181 -301629
16396 -301629 119342 426333 108489 -239439 -164635 -45676 -125535 -251840 -87282 5176
16386 5176 -106958 -279883 -232627 -161571 -211207 -27807 -151209 69838 20935 56356 292812
16375 292812 320433 235078 -156573 -384079 14695 2954 -125342 -169541 -10067 -30498
16365 -30498 -64713 23530 -87315 -86399 119075 281975 -17703 -503153 -670438 -675875 -620625
16354 -620625 -597638 -365801 -245238 -17651 58267 186022 75902 -137126 -545448 -473663
16344 -473663 -240943 -40072 -164862 -309554 -188005 -155628 350130 422827 89319 213166
16334 213166 289896 161442 -79778 -126483 -56076 -138349 93235 120375 168572 341863 165509
16323 165509 156301 29531 -1915 124886 53301 -79691 -336665 -360502 -539206 -587213 -435376
16312 -435376 -615834 -724842 -813780 -1025630 -636175 -126742 263403 332983 -144547 -380023
16302 -380023 -107827 -94360 -224674 -386775 -402771 -372881 -49751 -282304 -505945 -419665
16292 -419665 -221552 -205578 146266 125871 157266 -1372 -38865 -193864 -484736 -620794
16282 -620794 -772682 -609053 -682980 -344518 -167309 -266376 1149 -207816 -514476 -85568
16272 -85568 221862 151465 65502 330728 133347 -103679 -208176 -195061 -303931 -152916
16262 -152916 -219980 -44558 10378 -51932 -85983 397021 251201 35449 -52533 129741
16252 129741 272007 -184880 -396296 -554554 -827988 -733039 -236026 245179 319854 158246
16242 158246 -235676 -489978 -575429 -621977 -624304 -537349 32956 -20687 -115192 -303864 -470187
16231 -470187 -75073 -46032 -43916 -229187 -309599 -508740 -382660 -82977 115400 -35159
16221 -35159 -480257 -343961 -441436 -561652 -140185 211746 89409 -227307 -369877 -252008
16211 -252008 -128474 -53664 251982 123112 -406426 -376891 -65539 45238 189882 86911
16201 86911 -253163 -510111 -423776 -479841 -200136 -104649 44893 -20412 83088 -168964
16191 -168964 -405760 -521857 -401025 -701624 -678735 -641449 -401986 -923 354694 355555
16181 355555 -50777 -230030 -369689 -248214 -408057 -549088 -343808 -53000 13227 -283567
16171 -283567 -143863 -171846 -251213 -407101 -437893 -740978 -584328 -52551 -29126 -425349
16161 -425349 -661983 -485091 -6992 58503 -244748 -392293 -301526 -318681 -235310 -262465
16151 -262465 -739575 -531293 -125792 -40513 -85202 -96223 17761 51154 116936 -166762
16141 -166762 -322132 148509 790732 954267 1060285 745500 345500 268953 389754 492251
16131 492251 502262 613929 389737 152510 -234957 -535946 -878902 -926163 -566380 -450841
16121 -450841 -435977 -173116 -72674 -321048 -412821 -196519 317298 289023 -1632 -13182
16111 -13182 19081 -222334 -371911 -349686 -282605 -93194 -87894 -129816 -217795 -440629 -564155
16100 -564155 -681985 -765464 -584543 -449698 -437724 -184732 -383756 -584547 -478810 -58638
16090 -58638 376099 431629 -14435 10893 339403 366682 558259 614448 908602 914183 432997
16079 432997 27020 -136496 -295238 -292481 -210919 -169046 -354270 -100196 271019 448025
16069 448025 215759 61240 126595 652488 1263161 665305 381867 588279 614221 374665
16059 374665 95766 379672 123596 -110201 -287379 -245245 185349 460548 700231 835775
16049 835775 734514 439139 73040 -124799 -96625 -131594 211046 205817 -67033 -27532
16039 -27532 107025 507431 583884 391690 260004 100802 -256771 -56685 154804 263265
16029 263265 107470 -152918 -185329 -169033 -251988 -235205 -183314 -335462 -406441 38872 157219
16018 157219 160575 248230 254074 308291 591304 671058 242835 164189 196898 -124921 -357692
16007 -357692 -654593 -833832 -779373 -521645 -197096 -56775 140425 280629 93223 -161246
15997 -161246 -326022 -140121 -133128 -115888 -178546 -56233 -71820 -213852 -156528 -259994 -384320
15986 -384320 -337081 -319403 -388841 -454863 -300131 -68216 224417 209714 124954 -22238 -28101
15975 -28101 199279 427441 430545 -52165 -344065 -466875 -380380 -365159 -485521 -228173
15965 -228173 -269462 -113088 4427 -165888 52401 -79221 154533 543870 441494 365247
15955 365247 70741 116721 166073 171981 25865 79014 25140 107182 -212217 -135248 -48873
15944 -48873 357559 285804 68267 184972 68003 -239668 -380323 -573304 -726828 -508053
15934 -508053 -370562 -421350 -366825 -7537 272953 84824 -109053 -310679 -262890 -268359
15924 -268359 -531513 -86047 45091 26815 -348956 -234037 -71912 -61855 -223822 -403375
15914 -403375 -416205 -717521 -684737 -208044 -115620 127905 210835 165235 156948 128713 -95740
15903 -95740 -283877 -456130 -522870 -280900 -123034 227444 284485 -23370 -451604 -443820
15893 -443820 -361170 56858 186213 137130 342158 140266 31129 -128519 -55565 186899
15883 186899 13214 -444957 -544254 -181063 -156163 -448679 -757886 -655327 -600125 -770783
15873 -770783 -869750 -690463 -280605 -49393 13928 -4696 178941 -20282 296589 197744
15863 197744 -188892 -446304 -474205 -374780 -261846 -138398 -53450 -73759 -38076 -41986 125159
15852 125159 38504 -120245 97073 -70883 -127263 -84978 85740 325774 339172 143484
15842 143484 31013 -33951 295741 -1333 -198882 -379046 -374924 -418594 -378570 -212544
15832 -212544 -112445 70652 289680 407564 553609 357295 -18432 -1640 9771 -18678
15822 -18678 -39883 -1180 33360 17272 -296032 -99357 -11649 -206495 -81019 28308 65087
15811 65087 -140360 143332 426029 140145 -454484 -597312 -542788 -318662 -140727 -127778
15801 -127778 -151580 -177564 87565 265061 540217 335974 148049 339302 284291 292077
15791 292077 5287 -17660 -88976 -371761 -432455 -213903 -53342 264542 599490 763096
15781 763096 685126 496474 174571 -212772 -51237 218832 314665 329446 208647 -281793
15771 -281793 -70563 49798 382129 794315 780586 834405 1121509 495723 -71797 -453819
15761 -453819 -551352 7265 286394 264972 575279 428208 223870 38656 -101865 -434105
15751 -434105 -408119 -341335 -584239 -585382 -291922 -241658 -388211 -400778 -320774 -224060 -233474
15740 -233474 -376691 -441309 -368362 -685200 -468366 -132348 106721 -500466 -629725 -191036
15730 -191036 -117465 -267892 -89778 -159261 -173801 -325838 -133898 35808 16478 -4471
15720 -4471 -101253 -194770 -360724 -337152 -279092 -59070 73514 104787 45849 -110210 -97261
15709 -97261 133011 -11375 -35111 7086 -286067 -456089 -481639 -532272 -597377 -406659 -143488
15698 -143488 -81917 -201021 -414819 -116579 -68504 -368707 -302570 -214836 117422 158110
15688 158110 48066 -354786 -362169 -144594 -157188 -284194 -180244 91138 297550 136841
15678 136841 -68039 -116342 -185047 -574581 -537406 -413004 -156789 -186042 -199035 -246451 -58043
15667 -58043 -300829 -830535 -381546 58762 -28992 -97771 -264863 -484437 -631521 -534674
15657 -534674 -141824 47048 -24076 -180988 -131028 -231296 -264159 -197066 389818 501313
15647 501313 347538 117552 251517 379327 419211 242112 25922 -161096 -205115 -265926
15637 -265926 -323888 -420259 -481350 -221404 -299573 -462847 -423645 -507570 -754408 -1022798 -688111
15626 -688111 -371058 -251826 -172690 -276445 -256451 -412870 -320983 -145004 -96071 -250586
15616 -250586 -704518 -445689 -339700 -326476 -538236 -692472 -552618 -479505 -439921 -219783
15606 -219783 -208224 49624 -148645 -551672 -968736 -684441 -326838 -289682 -148904 -334393
15596 -334393 -205111 -259408 -200971 -131617 -28059 -561730 -733602 -753305 -529573 -368975
15586 -368975 -447404 -402888 -198187 21786 53888 -305471 -554624 -369545 -154824 -95472
15576 -95472 -165377 -266151 -505308 -639734 -394312 -149067 -187457 7899 -86770 -90312 43719
15565 43719 46267 -306046 -228151 -31968 295486 164754 -321649 -214189 -1878 3631 -291923
15554 -291923 -216204 139557 168110 -141592 -310619 -292310 55220 131606 118571 -57279
15544 -57279 -444932 -220636 -453221 -759175 -880061 -456970 -293997 -3614 130751 167327
15534 167327 6644 -207296 -397696 -101873 -283879 -374701 -137730 -242561 104416 543728
15524 543728 705892 327128 296657 259948 192008 212503 152332 115754 -118846 -302913 7381
15513 7381 353339 310829 385045 568867 455760 409300 333579 105419 669 -139396 -243045
15502 -243045 -164114 -37627 -173356 -462682 -830361 -642661 -480183 -364279 -105088 248282
15492 248282 266056 30222 -142089 -27536 44833 -128485 -276427 -503438 -377647 -416738
15482 -416738 -331468 -91946 333238 88795 -263843 -564718 -729060 -491793 -561476 -540393
15472 -540393 -366439 244074 197452 252231 168189 -249748 -495398 -468729 -526979 -706895
15462 -706895 -769025 -866551 -843923 -726159 -694195 -459059 -581893 -811871 -374058 145367
15452 145367 349924 -79469 -406889 -156661 -77266 351141 125672 -307650 -657854 -816399
15442 -816399 -617480 -466524 -404098 13347 -266087 -242261 -104947 192037 123744 124561 46468
15431 46468 119622 241763 235661 184015 253187 -114100 -173773 -219997 -111429 106151 77455
15420 77455 43978 437571 508815 216158 -210193 -41413 340512 476148 327655 374550
15410 374550 548286 633982 301298 197060 215419 -347263 -127598 -159767 -220197 -36868
15400 -36868 -92424 141725 132094 -106669 -361002 -175019 5067 45674 233142 231394 280577
15389 280577 341830 -87235 -360827 -205105 -134267 -156871 172886 440216 241020 371163
15379 371163 -77754 -512064 -506211 -358319 -24888 232760 213983 74267 65280 -35351
15369 -35351 -234985 -399096 -599987 -615693 -680466 -837476 -763576 -558119 -519899 -614196 -738268
15358 -738268 -921988 -911303 -860854 -418211 -355746 -260112 -295904 -163886 -80071 2141 -16648
15347 -16648 -280321 -128860 -224200 -18976 227996 134965 94772 -29380 -206723 -322989
15337 -322989 -393119 -244137 -308293 48217 66686 -251042 -333031 -244094 189987 302484
15327 302484 33856 -221776 -348202 85131 244651 215681 133210 -387315 -452675 -450386
15317 -450386 -573669 -487403 -718981 -898019 -678762 -483510 -396405 -232625 -227198 -425911
15307 -425911 -509478 -389093 -275915 -319309 -342840 -383507 -509000 -526813 -59535 347901
15297 347901 101090 -48369 100188 -201503 43003 150765 -2959 -37790 45609 -21377
15287 -21377 -354444 -99935 106937 -18793 -98728 -18784 48941 -185700 -542227 -652161
15277 -652161 -496218 -257248 50823 152089 -19418 -232403 -573780 -225127 287714 247852
15267 247852 145865 -88245 -168350 86877 300229 366180 243615 177760 36292 -376940
15257 -376940 -241214 -155500 45181 323404 73688 -3781 129056 -28969 -469096 -530749
15247 -530749 8334 301843 -252996 -655897 -597820 -727751 -413110 -85957 184604 197408
15237 197408 -151584 -344507 -573062 -589608 -603461 -215992 -164442 -512546 -448814 -96784
15227 -96784 23170 -201104 -494551 -521949 -237774 -237204 -40187 496406 552181 89490 -77840
15216 -77840 -132831 110037 58923 153497 51828 -44747 -129671 -77535 -208699 -168624 199239
15205 199239 -147602 -470667 -212995 -182425 -169624 27653 -162797 -304209 -91014 -137443
15195 -137443 129785 339230 334195 245646 -234549 -208456 -303983 -243783 -426854 -268922 54383
15184 54383 -118159 -403180 -278072 133128 457041 485534 262306 491744 273210 23811
15174 23811 -90940 -159512 -423380 -856792 -872061 -521456 62147 22150 100073 143239 273118
15163 273118 473416 375974 277098 315689 24652 222590 447578 15511 -31261 44376
15153 44376 42653 161351 616168 330062 -138801 28852 13864 -52954 -207260 2045
15143 2045 50651 -380943 -342001 -457679 -509930 -563933 -444506 -306479 -875604 -1005431 -736940
15132 -736940 -449937 -77556 -49051 -324723 -224841 -204329 -96778 94842 248568 152117
15122 152117 -53401 -162466 -232509 -560031 -710933 -559934 -551926 -575629 -366525 -163761
15112 -163761 -62749 -266747 -631453 -591912 -410917 -415144 -513120 -568806 -515456 -272004 29334
15101 29334 78664 -165634 -242039 -143714 229698 232998 -285216 -629179 -685232 -408988 -386351
15090 -386351 -479303 -481327 -631315 -697741 -422917 -166094 -209265 -170547 -26347 183657 289993
15079 289993 139498 53500 -20171 -321990 -684011 -638483 -560385 -329263 41637 569147
15069 569147 760003 827147 591968 331752 -264910 -740379 -622827 -679234 -633646 -316236
15059 -316236 -240924 -520992 -913035 -1178604 -1059975 -797810 -578785 -453159 -253293 -231917
15049 -231917 -485312 -378586 -272548 28283 74684 -136602 -110833 -280821 -249532 -498959
15039 -498959 -437455 -374852 -161030 11254 -612746 -859840 -755710 -703474 -602992 -414170
15029 -414170 -121729 -201014 -350154 -729988 -470865 -304430 -168477 -212031 -216211 -279459
15019 -279459 -278099 96529 331421 450891 265376 -104575 -34169 -143017 -164335 -155613 -7893
15008 -7893 -62021 53981 354504 431517 108541 -28394 -54382 113953 116970 126999 -36889
14997 -36889 -201008 -109651 -173543 -110129 -496870 -385593 -298774 31166 -124902 -424235
14987 -424235 -422777 -431977 -805249 -1103832 -648701 -556042 -442591 -335411 21256 59434 -94874
14976 -94874 393022 465883 330047 111561 -107678 -147938 109209 311437 253175 245745 231753
14965 231753 49827 85702 52771 202171 338610 381952 153315 164196 -324378 -363508
14955 -363508 -162743 -215178 -249380 53094 -109263 -262588 97715 189305 -250538 -695585
14945 -695585 -446661 -425666 -383213 -404277 -370258 -183018 130110 277910 -16454 -159910
14935 -159910 -217389 -535071 -595084 -175246 92129 -207629 -225093 -149606 -300921 -337835
14925 -337835 -245549 56604 343772 161999 113288 291115 330927 352452 408139 124910
14915 124910 -100270 -410618 -271988 -553345 -313930 -125152 152327 34666 -39811 -361280
14905 -361280 -456111 -312879 -444960 -472516 -670892 -597136 -436208 -144325 -194106 -357229
14895 -357229 -344331 -116232 -313057 -302533 -66875 -3885 -1816 -515401 -370561 49662
14885 49662 51930 136151 -36009 -164867 90541 134142 21438 -250403 -39612 49597 70886
14874 70886 273616 118958 133346 148477 31187 -60895 -258150 -658542 -674906 -701069 -546263
14863 -546263 -349235 -508533 -928712 -749687 -470696 -747987 -754154 -399439 25235 -213648
14853 -213648 -357479 -83531 128756 100388 89356 -92768 -333192 -559140 -379637 -341513
14843 -341513 -375143 -305764 -212607 120293 174801 2183 -47178 -308760 2291 40150 -31628
14832 -31628 73996 19711 112628 250320 35707 -139839 127982 294633 177739 -38801
14822 -38801 -219013 -307314 -400092 -406075 -61706 -109107 -128218 -34412 -416847 -258735 -146115
14811 -146115 -79539 1513 13143 -382544 -429279 -270361 -182810 -372498 -624753 -439505
14801 -439505 -196109 -90782 -49314 252665 649430 792838 365356 -171727 -219706 59047
14791 59047 60003 -107094 -202686 -133511 -130461 82433 79538 164337 -63460 4057 -238657 -400774
14779 -400774 -482213 -298335 -318286 -216164 -36185 -7324 -28669 -35648 -70145 61432 -151973
14768 -151973 -448612 -599253 -334058 -193047 -368699 -659852 -586015 -465338 -288300 314363
14758 314363 148979 -49472 -51170 -194667 -506063 -547490 -544189 -493063 -178300 -389210 -750331
14747 -750331 -830604 -913563 -580879 -205469 -19296 80474 -263741 -784130 -624618 -315921
14737 -315921 -237196 -416203 -493710 -271577 205032 347939 -86552 -85246 32323 -186511
14727 -186511 -59033 272244 201577 200950 -50198 -52008 -44609 -87881 -24234 -156086 19042
14716 19042 118378 189124 109597 255632 222852 116963 295544 206515 -300271 -273025 266902
14705 266902 21765 -154579 -170732 -419741 -451890 -585040 -603476 -541553 -44649 196282
14695 196282 131819 -57664 176693 111498 9795 -228137 -274188 -84873 -211578 -455135
14685 -455135 -220690 -70268 -22215 430264 398531 106308 41802 -179486 -318800 -204000
14675 -204000 -200209 -476789 -587512 -452147 -507886 -441579 -318355 24778 208394 -1660
14665 -1660 -91919 359655 8024 333851 346896 94262 -160396 -70507 24093 72016 76890
14654 76890 40073 -86341 -281000 -243879 -524174 -723622 -667905 -491858 -122138 53986
14644 53986 103120 15458 149182 205483 133018 312609 424074 232855 296424 244696 -77820
14633 -77820 -309169 -200030 306486 483058 606024 702193 379773 262252 354922 420898
14623 420898 76388 -306415 -50269 242555 37284 -177887 -190075 -368541 -29307 57608
14613 57608 -48302 -203482 45945 628968 405639 -209972 -306086 -46416 166406 -197595
14603 -197595 -259515 -138304 210224 261943 43301 160639 369922 64232 -349181 -315054
14593 -315054 -846 39448 240890 332605 100131 -28231 -162488 -88651 69733 283983
14583 283983 783268 745732 884263 835071 711091 1067141 701049 757766 889716 876444
14573 876444 1071224 1092837 1137368 657995 329173 251362 117384 103519 -105439 -13542
14563 -13542 140263 426017 290970 -83241 57456 238724 77917 230964 293390 385606
14553 385606 680440 890728 809740 710257 384346 589738 846513 837296 718064 666561
14543 666561 663887 737403 666032 376479 81300 42662 132249 112118 282818 410419 354166
14532 354166 271314 423050 720459 458788 490141 304179 -107766 -253505 -257915 -140237
14522 -140237 -93307 -96808 -17427 -18369 209341 146868 412771 441708 461514 347991 508904
14511 508904 383248 8074 -84765 -270674 -491370 -695617 -501916 -185929 -206482 -101423
14501 -101423 -96106 -294666 -393677 -446079 -380933 -206170 -80861 25344 -469167 -706466
14491 -706466 -796175 -280076 -210484 -371803 -421407 -241384 -241513 -52890 -182153 -248811 -104354
14480 -104354 162088 239522 -108213 -81362 222856 430704 380193 466693 389340 235979
14470 235979 -251312 -588878 -252107 70164 177211 223823 209963 353892 318968 511261
14460 511261 226830 -15904 -93411 -126185 -321161 -137871 -116344 -74511 -166583 -249123 -179010
14449 -179010 -77994 -33405 -134345 -346071 -394690 -299661 127202 275050 258424 61674
14439 61674 1889 -81530 -284482 -143024 33971 251062 -32233 -376737 -18224 309567
14429 309567 363110 293869 612491 569188 399709 185446 -141076 -355613 -149519 237033
14419 237033 257881 41961 23999 -2082 155589 -114129 -250564 -392848 -527469 -574355
14409 -574355 -470939 -178185 315413 281134 -137375 -397783 -271544 -395711 -759568 -910886
14399 -910886 -524428 -342957 -315368 -534535 -804088 -979156 -902864 -480317 -558147 -724852
14389 -724852 -556810 -240284 -162451 -185649 -233787 -302122 -50003 -11383 33783 -242021 -589979
14378 -589979 -390330 -340305 -174738 -254662 -694484 -802790 -589828 -466578 -458252 -93170
14368 -93170 130807 303981 338266 328411 402836 87381 -12648 -133946 16087 134066
14358 134066 98858 150175 -49361 -108031 -415734 -769700 -681822 -131035 300231 461672
14348 461672 391207 183842 -190258 -317935 -207809 235780 369545 593946 510490 218824
14338 218824 103999 -41882 -355416 -571264 -397180 -241829 -99103 353641 292004 -85883
14328 -85883 -174118 -496240 -937318 -945799 -545011 -145814 23696 -301961 -947423 -1441717
14318 -1441717 -1012865 -578126 -279546 -304395 35017 307866 323613 -55734 -128516 -278442
14308 -278442 -350043 2796 -1963 82812 318190 680618 673983 657314 516625 139451 -23583
14297 -23583 92229 -19600 -85790 -30138 194794 347470 61015 160522 605443 656115
14287 656115 388963 162780 -310969 -473609 -471186 -417202 -281107 -206117 -192863 66297
14277 66297 122595 26282 122970 -34727 197763 421505 560775 281971 -176236 -266990
14267 -266990 -265695 28414 469350 285052 -145208 -629836 -592266 -397590 -604095 -312424
14257 -312424 -114225 -123028 105351 119886 264248 642966 693326 565796 163999 -207700
14247 -207700 -376564 -289192 -162724 94236 -81844 -74996 -17901 -36168 -383365 -562239
14237 -562239 -72358 55483 -36143 -177498 -44338 75887 226233 299957 320733 715806
14227 715806 524344 336045 417462 136706 -87593 186842 150635 70188 -143312 -174999
14217 -174999 401782 563311 312053 130465 82206 363062 552637 622972 704501 665292
14207 665292 522794 610198 832595 868675 871820 753207 731552 726439 740913 953318 1158670
14196 1158670 1038026 996071 1285271 1087340 577852 594006 707131 657289 760328 809363
14186 809363 1020289 1308320 1071817 983835 1140674 948679 1093694 778538 900514 1164122
14176 1164122 1285956 1629995 1888247 1735062 1594119 1686233 2016174 2212371 2198170 1895963
14166 1895963 1956605 2003913 2145768 2178914 2357883 2819344 3079197 3743976 4265163 5114208
14156 5114208 5798739 6414280 7093850 7460135 8228553 9207102 10371004 11300514 12407844
14147 12407844 14113784 16088311 18662738 21514589 24698461 28089124 32233408 37181401
14139 37181401 43260680 49936196 57388231 65488136 74227696 83088228 91174708 98611908
14131 98611908 104895246 109515628 112068392 113172561 112286085 109428418 105213803 100122860
14123 100122860 94361437 88551746 83061848 78319067 73891435 70145927 66918778 64777802
14115 64777802 63087227 61567278 60687276 60464632 60648739 61661176 63025614 65207401
14107 65207401 67766439 70970141 74894770 79266701 84100213 89368139 95159740 100959228
14099 100959228 106231497 110307166 113516856 115160382 115164210 113100455 109206730 103876710
14091 103876710 96496376 87869552 79127256 70316235 62003327 54350423 47397844 40806236
14083 40806236 35597894 31062321 27273992 24034195 21610240 19335237 17125338 15244058
14075 15244058 13354123 12194489 11263889 10398291 9431864 8763951 7895710 7043997 6381109
14066 6381109 5821514 5228421 4847335 4598940 4338663 4023706 3779696 3655961 3627789 3059207
14056 3059207 2944677 3153319 3276591 3366736 3115034 2804978 2656096 2819330 2878124 2458489
14046 2458489 1999082 1877450 2104148 2119321 2031597 2122397 1941821 1811950 2125019 2235608
14036 2235608 2134743 1791420 1608306 1256319 1226721 1007859 532338 649718 865839 690038
14026 690038 296636 578539 753935 1030781 990515 1296168 1948062 1955750 1469919 873368
14016 873368 184901 167903 504374 954806 1101866 1207851 1293205 975643 742021 708936
14006 708936 762898 841506 864154 933548 845113 700945 1047090 1316651 1181024 1247927 1491370
13995 1491370 1018571 362007 127455 -134828 -123918 -53623 79553 364754 693617 817318
13985 817318 566138 482930 612399 929814 833810 565088 462453 275724 196671 133798
13975 133798 46525 115264 -94415 -348197 -146064 57834 -10451 211552 715225 822662
13965 822662 753019 494499 593454 127043 115118 8420 125545 465201 710699 685104
13955 685104 530564 497055 329271 -192893 -58605 129454 -12241 54510 207020 -174425
13945 -174425 -166793 201822 217393 245646 159161 568961 852714 691030 456740 302558
13935 302558 520320 734400 577643 371974 232108 29788 -2601 360959 -58731 -469754
13925 -469754 -603186 -379792 131252 189999 -52695 -158287 85409 320444 74472 -147156
13915 -147156 -335149 -529523 -614022 -316652 -68008 -158968 -156339 -238464 82391 72126 -82272
13904 -82272 -125805 -168944 -228675 96839 264259 345204 111887 -44475 86674 -64337
13894 -64337 36584 230648 11846 64727 247796 10731 -23197 39126 -223766 -124906
13884 -124906 190794 130446 -231295 216239 392621 314003 180772 -18109 60782 -141979
13874 -141979 -164750 55234 79585 97857 -40386 -213322 -253946 291006 254951 237241 -14689
13863 -14689 -79266 -85380 112393 380057 598048 661559 489400 -402 -151709 -251138 -484695
13852 -484695 -663205 -653435 -251489 -76813 -252144 -192944 -71714 -64562 142722 317610
13842 317610 267484 125240 -174071 -388776 -337339 -160644 -35968 -192416 -147931 417616
13832 417616 548913 484801 166563 -12370 -94186 -286237 -200891 -227891 -151347 -114452 -399016
13821 -399016 -234618 -393234 -240537 -78244 -164662 263352 250720 186142 29707 -180237
13811 -180237 -300665 -194820 -204797 -208537 -133247 -349546 -289225 76993 -327907 -94706 -203230
13800 -203230 -76932 58434 155188 74925 49318 -318043 -807986 -553621 -592395 -416549
13790 -416549 -70317 -61378 363576 417544 114237 1716 -147099 -500440 -181134 -50685
13780 -50685 -69841 53249 11518 364402 432291 289067 143299 74537 42635 459501 401640
13769 401640 342942 353204 290382 14160 -37103 61998 -168026 -155917 272088 214388 -133964
13758 -133964 -20219 72797 6598 92896 335355 312433 234722 -114628 -199075 -63500 -380433
13747 -380433 -306361 -195373 -187706 27019 127356 246512 69962 -134517 -153876 -8605
13737 -8605 174547 -186280 -245901 -171624 -20321 112933 -38834 -271600 -260489 -209301 55837
13726 55837 616477 434390 185968 159037 219434 -32512 220928 262461 99951 26656
13716 26656 -405269 -555962 -491576 -134432 -427173 -551973 -350565 -284350 -70356 97872
13706 97872 182860 15614 -179026 -294653 -159815 4898 304656 84525 443847 398896
13696 398896 -156161 -371762 -386104 -166379 -105144 -270335 -359113 -124513 -20942 141154
13686 141154 225482 192477 377677 294661 -17519 181783 219431 144816 -138236 -485331
13676 -485331 -19683 487548 632139 634404 516425 489579 468047 544270 733715 884501
13666 884501 469193 381227 571644 685546 823792 677329 743082 767389 715092 262448
13656 262448 348142 387054 -19586 -140417 -17310 -45778 99923 187169 153339 126900 76688
13645 76688 98898 -128987 -200011 229242 474427 614481 879757 870997 1058520 1085658 1074060
13634 1074060 934805 491371 426823 524242 452670 520372 594876 492593 249783 234520
13624 234520 233949 102928 346955 454043 220484 210198 194455 -94957 -324132 -310954 -135570
13613 -135570 107798 73233 -173325 -138064 19243 211149 103425 300837 261479 395906
13603 395906 230731 209632 118431 16759 239324 283752 207682 345590 97219 -198885
13593 -198885 -31196 183036 -74030 -69729 -36618 356603 224651 -2291 -231051 1508
13583 1508 522600 396658 222947 104743 172780 327717 47197 -56455 320752 198556
13573 198556 182971 68876 -259456 -181876 173134 -127364 271546 416509 251861 43907
13563 43907 -255453 -609089 -603945 -544297 -494269 -367132 -366569 -327605 -188815 -84976 75584
13552 75584 13589 -246289 -149839 -86235 -1688 88350 9275 -59914 533 45309 202497
13541 202497 200620 -350009 -438772 -221999 56149 45018 -37006 35107 -81722 -382578 -469123
13530 -469123 -339787 -98337 -22364 -275086 -480971 -864527 -795193 -182527 17286 67471
13520 67471 -471627 -794090 -411285 -382071 -244870 -326458 -318872 169055 575281 825485
13510 825485 766000 422210 -56111 -144603 -313972 -119126 133980 134734 -163119 -92075 -33193
13499 -33193 -172582 -349052 -363729 26069 154410 30070 -323664 -461693 -269954 -80891
13489 -80891 -2892 2383 -157779 -421471 -230259 -441546 -613105 -675296 -593368 -409089 -401472
13478 -401472 -454201 -387065 -218629 -85819 -81904 -63266 -260677 -380937 -302398 -31331 -125966
13467 -125966 -146053 -3865 211409 632910 699438 703266 269443 -4687 256705 346212
13457 346212 519331 819666 842906 454872 405846 477090 634552 629841 317178 89113
13447 89113 325417 392326 160565 27883 80294 87927 88128 100925 -71878 -99033 -100331 -4764
13435 -4764 111111 32532 -172403 -41191 -112785 3953 78608 68331 179244 85630 21955
13424 21955 123103 -9716 39872 64579 124799 294251 691358 791526 430512 19449
13414 19449 -231941 -538953 -682838 -697813 -128315 111554 -57141 39683 -286589 -329346
13404 -329346 -298850 -476514 -203773 -277116 -232820 409704 527714 435171 465415 222932
13394 222932 167326 338062 333064 395374 372604 670342 838515 677337 216457 229455 457899
13383 457899 361320 185727 231369 286080 158998 -289839 42321 -46057 -205460 34043
13373 34043 447190 487231 -6267 -34928 253853 455004 71137 -240991 -315053 -417051
13363 -417051 -496090 -223325 187766 95955 -146939 -64858 201683 51251 -323331 10022
13353 10022 129810 309158 428862 264724 116247 214121 -10865 -188848 -309491 -227092
13343 -227092 -12342 9848 222703 576103 635009 258675 -342727 -527789 -845178 -762363
13333 -762363 -784881 -772876 -562196 -471693 -53121 -58158 -103730 -390467 -395613 19260 70681
13322 70681 25839 -131968 52087 251285 36011 -60986 -218012 -172133 -212634 -595066
13312 -595066 -318096 6034 68773 71915 432419 440569 -95919 -141504 197793 133212 33063
13301 33063 3561 -115755 -194056 -1729 168445 57122 -302264 -312667 -186023 -240964
13291 -240964 -350719 -277958 -642800 -563768 -239298 -19016 -147465 -208253 45247 250345
13281 250345 -16139 310972 377624 139282 318965 83473 -358480 -379483 52233 234467
13271 234467 267582 387852 538616 969673 996415 916094 925278 892852 660925 395944 311212
13260 311212 602065 974242 864911 777448 325574 2448 140058 238711 54231 -44694
13250 -44694 281274 559474 670112 462976 183231 207755 -40672 85532 101785 353138
13240 353138 659026 517635 398529 108461 8761 -64625 -152028 -136603 -53637 -199627
13230 -199627 -71181 -144279 -192078 60732 -180678 -147873 182833 57667 -139251 -25025
13220 -25025 178938 82600 -338806 -460840 -23237 359960 201337 -21589 -316548 -355190
13210 -355190 -241815 -267348 -337044 -304206 -326265 -342247 -360867 -220292 -70239 -148202 -164067
13199 -164067 -273030 -350458 -439828 -225714 -98920 -136612 24857 71436 -215790 -660240
13189 -660240 -380125 -156907 -484670 -494090 -181088 -8713 -219317 -184338 -664696 -845551
13179 -845551 -624151 -429321 -526269 -595736 -573495 -383412 -264946 -79922 -239795 -148486
13169 -148486 340991 547756 328571 118454 182181 206151 369911 532740 293713 168453
13159 168453 -141328 -243938 93525 157866 120743 -11155 393329 151997 153960 457003
13149 457003 652029 462226 176947 -39113 -214690 -312202 -416409 -844288 -611068 -298228
13139 -298228 -323449 -292063 219970 176034 -43322 -191910 -268871 -205924 131926 277022
13129 277022 44429 -326884 -144246 -209531 -817080 -1041431 -1162184 -883119 -545399 -374246
13119 -374246 -401934 -595890 -340963 -244241 -425020 -261144 102695 52322 91874 279240
13109 279240 -246350 -407287 -386491 6352 131450 293561 238249 167720 -87289 222058
13099 222058 312955 332406 482347 380690 216951 112174 193769 376087 435719 81265
13089 81265 -53227 -25649 61716 253566 518080 428259 -166519 -370350 -459203 -667211
13079 -667211 -326788 -349354 -520619 -528829 -301093 -381148 -290990 -297432 -614362 -371961 -262912
13068 -262912 -114159 92635 225292 -16274 -197634 -355890 -420338 -436568 -148058 69992
13058 69992 -86116 119164 276548 -78102 -164372 -57418 56855 -373219 -576195 -192625
13048 -192625 -274748 -458363 -356681 -232327 -294484 -91535 332884 481603 232812 -123584
13038 -123584 -359669 -511900 -204926 232069 289743 360618 -35047 230727 192019 167685
13028 167685 237469 -63825 23842 -21183 -159474 -507357 -723621 -625733 -390409 -568279
13018 -568279 -473554 -150774 127387 47478 27122 5297 76074 -85991 197479 600442
13008 600442 682480 430370 346240 -75628 -164314 -16576 245642 -30091 -63817 -111228
12998 -111228 -3010 7489 -63011 -330692 -415543 -118029 265966 370448 37247 36059
12988 36059 -59253 -209665 -348647 -60747 97738 -6729 -59301 63649 203022 212398
12978 212398 19834 -181464 -338487 -364438 -122419 28582 -68152 -528643 -439566 -379909
12968 -379909 -297726 63586 -131883 -210694 17825 -394647 -617921 52813 355052 75478
12958 75478 -222367 -201580 -451883 -391752 87776 295728 255650 566950 671262 378848
12948 378848 245456 186951 45249 -13334 63793 314999 57806 -235847 -230673 -356853
12938 -356853 -143962 -34787 244566 384151 397738 -147669 -526240 -319526 -148487 -81207
12928 -81207 -233089 -356767 -120835 148327 -365833 -763234 -512479 -11162 -302891 -93799
12918 -93799 -45313 84566 113748 4640 78393 37981 189996 -41675 -432234 -748572
12908 -748572 -686504 -72074 323867 -20420 -36745 -97549 -301746 191442 269979 -97886
12898 -97886 105987 364099 559210 237356 -157132 -153032 -234243 -185295 -177285 -261879 -258656
12887 -258656 -549078 -438701 -2686 43121 -401568 -484361 -81157 417199 374074 245578
12877 245578 -85749 -229125 28577 -27744 -176260 211771 364943 307260 213140 -72719
12867 -72719 -187917 -177046 -25974 -21858 -77615 233443 644001 428453 -127373 -469032
12857 -469032 -492665 -683166 -661195 -486502 -726484 -708164 -238309 164551 346051 130753
12847 130753 -128037 -144468 -210630 95732 143900 35640 72954 43050 -286997 -579334
12837 -579334 -342711 -312719 -327053 23328 436597 150951 64490 261457 254778 -98939
12827 -98939 -319656 -448930 -546934 -320864 -51677 13928 266488 307730 -106530 -183748
12817 -183748 -345158 -203543 -202601 -247310 -496835 -219221 -83078 197440 150187 -63443
12807 -63443 -121121 -51318 438034 430904 364187 290884 6775 -153811 -59587 95523 259036
12796 259036 184799 174978 -336900 -354807 -262774 -259958 -180534 -114874 -222732 -396781 -358652
12785 -358652 -385903 -640479 -515310 -620817 -274663 -137601 102569 -31817 -129317 155144
12775 155144 612190 620281 62614 60689 339409 311369 222532 458360 186974 -285467 -485883
12764 -485883 -344122 -166432 -479667 -295467 -96859 123938 21034 -173340 159181 -46867
12754 -46867 -252563 -96283 263080 235572 -80987 -173583 -46106 101928 144664 -275261
12744 -275261 -221205 -562658 -595720 -318534 -124825 -104442 59448 -324230 -615244 -673538
12734 -673538 -270699 -179867 -561220 -568219 -438036 -585840 -991862 -1022200 -546357 8400
12724 8400 181471 279269 436255 404672 204521 398077 280922 -143846 -114444 144971
12714 144971 -113013 -41041 -217421 -326359 -170260 253210 163421 -17324 9047 146743
12704 146743 16188 64626 53665 -201801 148679 495611 307421 62315 69969 213292
12694 213292 268853 332271 272917 18483 -109998 236688 556459 705802 262897 188473
12684 188473 405116 402243 668305 712268 645518 414208 186773 156820 358359 35136
12674 35136 -170491 73740 -46681 -97096 251608 503858 362976 56378 27438 72067
12664 72067 150287 -50290 -391911 -872832 -629026 -243265 -74035 -119877 79101 363806
12654 363806 -5130 14985 -160691 -394459 -259621 -330477 -337233 -254093 -322716 -470864 -226679
12643 -226679 -179666 -141542 -280464 -364938 -260217 -297251 -472146 -487672 -324850 -434805
12633 -434805 -573564 -332904 -323127 -466231 -543512 -694419 -559092 -403722 -462748 -499331
12623 -499331 -327092 -92544 -269512 -210517 162585 201277 -64399 -267546 -336104 -181730
12613 -181730 -207251 -535162 -306629 -105256 42098 153571 273588 220608 -120261 -170398
12603 -170398 163728 149189 -276660 -557124 -32393 284782 312775 244099 149307 320509
12593 320509 -25700 62565 229121 581230 622201 343453 181338 35098 134517 163629
12583 163629 116819 253575 538010 411234 205813 177549 -105151 46803 215985 383237
12573 383237 177724 -254522 -73650 55675 291434 415397 389656 -363513 -1035934 -1086775
12563 -1086775 -731398 23359 34287 -98584 141498 118141 -36931 -345024 -74654 -10964
12553 -10964 -214106 -165085 -36904 -98652 -142800 -47613 330411 844746 492650 233323
12543 233323 -132042 17331 306523 574726 795020 379169 54210 -98230 43149 142480
12533 142480 -109722 30855 106085 190098 65812 -185674 -125519 455335 509601 295398
12523 295398 412504 710690 621235 276585 344189 421009 256032 229275 72561 -143976
12513 -143976 -130131 88417 -78803 -84981 193484 34592 -53721 -303314 -333534 -190560
12503 -190560 -76190 289604 166331 -171982 -327261 -366779 -114285 364350 525779 429925
12493 429925 114630 -93779 -126005 -249339 -345929 -273387 189512 372098 330048 228903
12483 228903 327330 364320 758664 924862 425455 161381 287636 -85494 -259340 -155528
12473 -155528 -92780 218675 360843 138261 -333763 -687434 -585696 -280694 -319746 -85397
12463 -85397 209575 466186 276015 363047 516297 786840 267067 -318319 -225087 236909
12453 236909 382528 14419 -91583 -106587 -346555 -155665 301941 409471 201247 260395
12443 260395 344014 634813 385682 194290 258888 339418 461567 407791 76347 112802
12433 112802 502102 534062 430790 229539 150633 258640 63657 -381315 -291898 -27778
12423 -27778 92547 87907 86070 -221132 -523074 -320858 -194821 -60331 270479 305016 435665
12412 435665 592996 124467 -97789 -134905 -59760 93451 -316111 -444784 -244945 -479177
12402 -479177 -380940 -482695 -301304 -129560 -73481 -28524 6894 129038 -353 -250457
12392 -250457 -218430 80183 -98313 47781 405330 611444 556902 323750 472506 572361
12382 572361 573372 507460 435019 436538 436991 119836 -98561 65152 92979 -26305 -8130
12371 -8130 -321481 -270792 188597 233447 491900 489411 427595 485899 539377 690951 521716
12360 521716 401247 39728 -35448 27139 -1554 180441 450011 243662 138962 166102
12350 166102 79518 -225029 -554447 -462166 -131930 141874 183665 212418 -13927 -52758
12340 -52758 324157 412059 222743 10401 169687 452687 775024 699470 302015 35512
12330 35512 -137686 -418048 -466767 -501769 -219530 51333 -197838 -252204 -251600 90105 403449
12319 403449 426346 483885 376954 468338 352655 496890 217420 -62132 -337552 -267962
12309 -267962 36685 -26456 -91671 -221637 -191944 -313218 -537566 -473733 -580795 -742131
12299 -742131 -714623 -323655 -321993 -498953 -506886 -297702 -250499 47779 145608 375206 60279
12288 60279 -22721 167249 327666 510889 321174 5308 -137254 53598 375080 338429
12278 338429 336585 567139 419393 202303 35988 374538 441538 91196 -148257 -390672
12268 -390672 48896 493036 212026 780890 1156234 954905 481909 -173607 -376067 -305544
12258 -305544 -179567 -49082 -21852 19241 113660 282141 606875 700105 962846 967692 696123
12247 696123 785718 536919 -62988 -495435 -236012 24391 152639 41541 64176 40749
12237 40749 234741 224946 381079 392465 483271 405908 464760 361956 311810 -37503 -149201
12226 -149201 28746 431094 335405 328021 359500 461268 481963 240207 167787 198846 61873
12215 61873 -68999 -315012 -387263 -205722 113346 -79440 -231223 -354275 -492562 -804780
12205 -804780 -368165 -36578 296075 262962 6516 109603 315534 583066 72797 -110290
12195 -110290 -213892 67904 516456 723089 597368 325718 409153 331672 282251 39344
12185 39344 -263005 -676179 -439219 -182336 -64534 -269789 -119672 143135 333302 619000
12175 619000 768940 605280 260834 50569 -29636 -52702 -353379 -353203 -15962 249881
12165 249881 176965 79255 304916 191879 -117014 -156411 -37555 -264011 -477371 -507902
12155 -507902 -237446 -213873 -290339 -37538 553959 367713 -143872 -389041 -345638 -125137
12145 -125137 54766 25510 100439 26132 103731 207676 179762 -195341 -202540 109717 42471
12134 42471 -212688 -115432 345824 159033 -266437 -663365 -512657 -271425 -418374 -337055
12124 -337055 -133808 257784 436761 353810 66846 13682 -218279 -281402 -269460 -110092
12114 -110092 111320 301537 255706 -98859 -317481 -445940 -84202 334235 73702 118942
12104 118942 -98862 -165103 -126902 235048 27546 -142306 -8929 -98788 32307 223000
12094 223000 106833 85864 211572 80688 183581 31657 -212838 -130961 -37214 18263
12084 18263 123076 -271165 -150614 146917 133241 -90396 46486 176052 590089 1031235
12074 1031235 929805 583322 753499 885406 751388 557478 632949 741448 823559 691141
12064 691141 369374 -298225 -585313 -364044 -113701 82541 -167918 -289623 25393 251206
12054 251206 338280 42961 -190608 -143934 17858 -16049 -12757 -147637 -311362 -370571 -249470
12043 -249470 -224993 -467478 -121866 -46610 -261072 -11200 237151 -70565 185268 468946
12033 468946 429204 151894 353050 -53317 153714 451510 670803 31928 52669 268070
12023 268070 80609 -116716 214992 427138 557890 342023 -120413 -301559 -218168 -98014
12013 -98014 -421503 -313839 -38457 242109 376987 426840 616981 698952 646384 308306
12003 308306 622412 955627 1129473 981386 1071139 606582 441985 441047 242687 533334
11993 533334 612189 601659 770677 573581 618367 250900 -11879 256592 490429 626841
11983 626841 534034 548929 567691 823201 569079 331093 121851 387566 380629 -53157
11973 -53157 165612 440485 447755 223362 413801 547921 176468 -330427 -216397 507248
11963 507248 437145 353683 45297 167160 150649 145456 148945 -251923 -284040 213668 544014
11952 544014 271109 -142405 258816 366345 820773 943573 320761 -67727 -335148 -288573
11942 -288573 53878 265755 132887 -184205 -88031 57283 4202 -124536 255163 408135
11932 408135 194774 376538 697619 552356 278927 -92274 -144047 -116234 -233189 -59837
11922 -59837 107807 -62445 199436 356028 249537 -175432 -191109 -33374 151697 111402
11912 111402 66633 273061 321331 199566 -35209 -278752 -6926 238662 292562 455712
11902 455712 706427 465220 -102436 -118708 10564 114105 303592 361052 379934 72160
11892 72160 -17222 220859 11137 -349148 -271593 -286790 -272264 -48982 -270831 -2348
11882 -2348 7294 -131280 -628183 -664678 -410130 -367605 -27837 -77134 -200346 -12331 -334165
11871 -334165 -483377 -433848 -115603 -21237 284997 1318 -209699 -440100 -185174 -61677
11861 -61677 -199582 -331330 -404301 -88472 154317 378089 483679 85290 -529894 -454453
11851 -454453 182337 364044 354924 48228 409229 621117 198609 -185585 -273565 -338692
11841 -338692 -257032 316534 454240 310742 129022 261669 99599 -117789 -147255 -181150
11831 -181150 -33200 201741 261793 302883 230317 383976 386105 531062 350615 96391
11821 96391 -168245 11227 92750 8914 273292 257555 207163 338110 174932 -62987
11811 -62987 -118782 -546418 -589606 -372342 -95893 11616 -312936 91596 -15347 -316293
11801 -316293 -129471 233768 432105 394462 493757 336308 293948 494644 318770 302138
11791 302138 548644 688840 606477 179018 -185459 -201390 -437954 -501710 -683043 -597956
11781 -597956 -626381 -234109 115289 -184764 -415872 -376974 -338593 -326056 -395558 -663681
11771 -663681 -627897 -594407 -507547 -486216 -178693 -28893 42395 61729 223310 535030 809316
11760 809316 676070 390979 292722 201447 431496 170874 -164328 48023 232525 -18072
11750 -18072 289127 266412 88046 269295 508677 330870 502264 588067 852934 590824
11740 590824 359784 292764 719368 737743 815889 568841 441355 142149 -58939 -262514
11730 -262514 -380300 -559598 -366240 -403233 -485463 -605264 -398617 -82315 -256366 -146300
11720 -146300 74561 307546 66496 -271573 -448316 -379933 -354155 -452457 -308179 -233688
11710 -233688 -242835 28788 132595 69080 -71343 -63580 -4705 56459 225524 146947 230264
11699 230264 224698 301971 298740 70070 -30330 -90497 -2884 -337385 -319562 30662 -143120
11688 -143120 -460094 -752827 -798818 -469613 -501313 -380228 -458854 -395853 -293034 -271057
11678 -271057 -160427 -213273 -232773 -226296 -248122 -103530 -444385 -39278 622430 325513
11668 325513 187538 115095 25466 -271714 -53889 385370 14770 -220348 -346389 -277455
11658 -277455 -172461 -331817 -488866 -365887 -295324 -233796 -59070 -59109 -14409 146736 52470
11647 52470 -238532 -212653 -189345 -171085 -52035 26383 274417 727805 556727 463789 204174
11636 204174 105016 193213 -109316 -144621 132900 235030 -162724 -402235 -299418 -483604
11626 -483604 -371897 -67917 21111 -451027 -456361 -257702 -501364 -386203 -427772 -515848
11616 -515848 -561266 -513061 115550 114400 -92876 105330 219579 137785 -94511 -45285 -187097
11605 -187097 -247635 -181375 -91390 -92616 -145817 -325229 -372691 -139445 41729 -146425 -133793
11594 -133793 395716 531625 262693 53870 87329 268060 333530 514011 475418 187290
11584 187290 -256760 -259770 -351856 -191198 -327246 -207973 -155303 19524 69605 -77518
11574 -77518 -8634 177462 -4373 -166747 -238242 -180071 58395 -102245 -150249 -275731
11564 -275731 -575066 -733301 -291329 -243361 -364444 -318888 -257193 -308044 -258447 64369
11554 64369 -260953 -548902 -525935 -642835 -758639 -924103 -402818 -20680 456510 484627
11544 484627 394479 269669 -127074 -63892 -50086 31503 502316 732918 699308 453551
11534 453551 403725 566749 84793 38390 173846 314363 279035 298150 -23670 -155012
11524 -155012 42602 344608 339387 557692 482025 133463 225688 556816 334798 182509
11514 182509 491426 694142 782893 474542 -24321 63598 90819 -193744 -202374 -180856 -104834
11503 -104834 -166858 -90500 131511 288771 285059 188466 411149 387282 517700 259410 -74111
11492 -74111 -200881 -252482 -297724 -279967 -538538 -197161 259093 310787 102598 234400
11482 234400 350689 424926 442884 485639 500507 177700 314784 296635 360698 246254 -11784
11471 -11784 -286125 -287623 -258303 -250590 -508126 -422229 -182893 -231246 -79092 -59234 -184631
11460 -184631 -273786 -348506 -379298 -223060 -59920 377499 725960 828063 682439 616936
11450 616936 274681 289577 15409 -60811 227160 481008 111292 20574 195324 113064
11440 113064 64131 -88470 155198 281700 359560 233817 -187921 -192308 -175281 -256057 -496630
11429 -496630 -764415 -637163 -662492 -495051 -325820 -161194 -254316 -36838 188903 64742
11419 64742 -302267 -455780 -500977 -487127 -523800 -292546 -246202 133102 172107 358031 202323
11408 202323 173614 -111370 -372532 -287820 -139229 254643 490949 530603 348684 90718
11398 90718 123206 300316 261540 335498 275599 3884 -151977 -61167 -6042 162918 -54408
11387 -54408 -211646 -222323 201993 328372 -70410 -119880 -289379 -431571 -40938 333246
11377 333246 304072 186156 239176 202541 198850 194169 265852 190747 -318551 -639114 -548933
11366 -548933 -509547 -546973 -499960 -78617 266850 533170 439981 -143018 -313794 -239709
11356 -239709 2784 526 -82598 -82470 -138464 19351 62967 -208762 46221 350215 405381
11345 405381 339595 361213 593059 711494 541169 141680 345525 456196 376572 138215
11335 138215 -32407 -114424 151966 366547 446111 572186 253507 -56559 -171351 73811
11325 73811 336144 114417 52079 -147653 32569 725816 612188 323734 369552 569451
11315 569451 648224 633588 470247 609384 472732 44146 167305 606754 574440 453812
11305 453812 437883 64332 192011 377986 450751 503802 658907 661615 787534 1279081
11295 1279081 1419184 1224658 860963 719441 846828 1033359 1425925 1927195 2190007
11286 2190007 2797050 3501694 4135609 4780086 5062347 5107499 4935766 4522793 4013771 3449959
11276 3449959 2713319 2182600 1570624 916412 740862 815261 721226 611036 740919 794035
11266 794035 343128 25492 -11185 327895 310679 42668 -173473 -450102 -136854 220612
11256 220612 430740 724958 634930 322782 -124274 52277 251529 548477 814084 770722
11246 770722 669524 1060731 1127118 1080897 864059 651323 456317 74377 -280365 -146705
11236 -146705 100876 7505 -135872 -37685 23822 418435 677071 766011 1114627 966672
11226 966672 919835 704406 440679 60653 355672 287397 236141 370461 451569 652209
11216 652209 587478 520884 366275 359797 560908 481883 655493 780687 762645 766127 804924
11205 804924 657177 257747 63862 86367 477806 670755 102285 -27411 264350 279872
11195 279872 151081 29836 479132 459361 631781 672036 292586 -46909 35876 57990
11185 57990 -13751 71054 252819 348524 527025 721647 651337 377917 208005 -271097
11175 -271097 -264170 36447 234453 591255 526110 436017 282473 135397 -187529 -278847
11165 -278847 -261415 31630 160326 226987 278537 -12909 -153126 -135687 -142727 196789 361725
11154 361725 221773 129894 7134 30245 131056 555230 700634 138127 -348725 -233332
11144 -233332 -190989 -39979 191427 117362 -154628 -420547 -190159 42832 303586 55900
11134 55900 -270437 -206469 -131756 -41456 -156135 -246876 -216770 -105276 -255401 -255471 -191484
11123 -191484 -162158 49642 498286 405430 8659 -172016 -93765 -48339 -106682 391347
11113 391347 634342 699759 432897 726168 528639 323542 310087 543246 525915 259474
11103 259474 -410236 -743829 -913322 -623301 -137587 154681 42535 -345746 -381262 -154811
11093 -154811 -415417 -583120 -524829 -202010 171026 286693 563917 771745 762135 584157
11083 584157 592868 706659 513539 128982 43422 164757 213823 20823 46418 70149 28156
11072 28156 -167851 -95894 28987 72532 42445 -161783 -30222 187918 -263885 -219890
11062 -219890 -108258 162906 270906 160349 318217 796395 1029635 510494 226471 396829
11052 396829 359650 368786 470569 784465 536759 209831 -49938 19525 -25922 -146974
11042 -146974 -293405 -371280 -232563 -29843 -2712 286044 455756 193090 42886 -169616
11032 -169616 -179830 -429497 -758899 -290069 323363 303290 193687 -192961 -286260 -202963
11022 -202963 246257 269082 37781 185519 58991 -159238 -477645 -238908 -54430 -211680
11012 -211680 -132764 159599 379016 202594 150759 367119 160705 423099 582413 333218
11002 333218 15325 -126607 88885 105630 19151 111880 554035 671166 916364 1018618
10992 1018618 726979 508463 105011 60904 28036 33622 47792 65861 27358 -298735 -189190
10981 -189190 427260 615572 458279 378771 570083 423273 399389 306171 246983 357649
10971 357649 504842 158747 -170800 -165781 43015 -95222 86895 235584 120642 -177543
10961 -177543 -44775 138769 48393 112941 112527 160880 210149 542605 847880 473095 300462
10950 300462 101765 -295072 -329770 -145385 217951 106357 -300788 -447499 -276739 -103941
10940 -103941 -364049 -368054 246748 428905 629966 535787 52137 251826 306515 143512
10930 143512 265800 438686 58740 -25391 234938 504392 263250 233599 37429 -201681
10920 -201681 -892233 -777164 -243582 93631 130018 190533 -13520 -86250 62044 -13703
10910 -13703 -105415 -32727 82113 349542 106747 -46791 408309 279088 121562 113243
10900 113243 77620 146735 507381 554228 315427 365219 621491 339759 101006 191863
10890 191863 289725 52128 128345 -5556 -312570 -326612 -135963 -219719 -334351 189928
10880 189928 820532 553250 226633 -117855 -95618 62576 -87814 -83473 257300 401823
10870 401823 463132 714669 787300 708076 296128 140673 394189 357013 238282 286856
10860 286856 357497 322722 221203 221220 329179 29458 310876 513886 459320 37946 -318993
10849 -318993 -389567 -112569 217370 261128 423812 427917 275233 -14832 88694 306105
10839 306105 185732 -95166 -314757 -59892 185472 334157 293295 225436 341461 487674
10829 487674 339574 281569 245367 448768 1098440 1043213 757313 660411 739485 720891 793442
10818 793442 586460 226596 258713 506494 285361 281604 887134 713265 399827 705327
10808 705327 844307 553720 350285 135893 200965 405709 525221 352098 346556 547537
10798 547537 644567 277988 -268074 -125797 95535 5231 98182 51845 66878 -35539
10788 -35539 80658 89164 165253 -198881 -536295 -672310 -159720 223472 163790 181937 -157046
10777 -157046 -3223 253761 195146 54382 17404 -243074 -583989 -531317 -130266 208237
10767 208237 621564 482582 358071 303795 349621 712986 573232 398863 201006 -249608
10757 -249608 -500829 -48048 297777 228495 461984 342105 710520 746767 502222 666705
10747 666705 738867 736357 632692 832836 780704 833912 511204 270567 625351 807187
10737 807187 399442 127937 -8555 -96652 -436796 -560465 -435488 -344668 -234080 -110196
10727 -110196 171837 136568 116374 80373 142244 29134 397886 431509 162095 408706
10717 408706 589976 701797 491697 432926 334284 143688 241096 362227 280573 151872
10707 151872 224926 67551 -363650 -287549 -60399 -128239 -276256 -310231 -29484 104030
10697 104030 98437 530206 397260 348328 219052 228100 446617 392024 604749 625276 322519
10686 322519 140549 22934 11423 -352804 -172340 91130 61784 -307918 -357052 -306640
10676 -306640 -558574 -314465 -103716 67472 239195 -250433 -417043 47897 545039 648245
10666 648245 574331 3988 -483714 -459165 -224738 106611 254581 103406 10882 -215129
10656 -215129 -403457 -74098 78336 19947 76275 210811 295842 352503 417943 805424
10646 805424 414680 71812 -177668 -351323 52557 383720 313258 255238 175977 -34016
10636 -34016 -345499 -231925 37543 98962 146019 -48021 -264468 -223724 -586785 -612664
10626 -612664 -330910 53716 264032 117186 -288840 -157816 179091 331270 69290 -425646
10616 -425646 -212793 65694 279885 274250 253094 269613 -26218 -142392 64852 256851
10606 256851 449824 369982 -123297 -280049 -107073 -202593 -53836 -18873 8437 -352499
10596 -352499 -510929 -418627 76726 81014 -368661 -301666 -40902 99641 154845 106505 220352
10585 220352 -20910 -606845 -396372 -96784 -142970 -468131 -408978 -319096 -318188 -74842 112752
10574 112752 72989 -113972 -407642 -567001 -337577 -209494 -18362 -261921 -223254 -261800
10564 -261800 -380381 -13259 207155 -86767 -271546 -145885 -304216 -404067 -215534 -29474
10554 -29474 -53842 -60405 -99931 7682 261685 371634 298139 178607 351652 200705 197338
10543 197338 224034 149803 -234610 -304518 -129086 -47985 -130121 -11734 -159402 -357060
10533 -357060 -252886 -90961 80015 -19482 421914 812709 880199 719654 298703 286270
10523 286270 63092 -148612 -170072 -574668 -624218 -125584 74598 185074 249113 269806
10513 269806 256063 601500 750512 985785 835175 735352 243739 -587 334895 458879
10503 458879 246903 -79159 152469 151154 -209161 -144845 89628 -149340 -340388 -35038
10493 -35038 505219 522324 339308 345862 96418 -97198 15133 207321 127048 -224581
10483 -224581 -199108 -204110 -377770 -109705 179007 293767 -107505 -623964 -503485 -359203
10473 -359203 -80260 130362 -311611 -505417 -286147 -246726 -127735 -557412 -962827 -946130
10463 -946130 -757057 -61300 350492 97817 -141965 -254258 -107348 83677 151685 336040
10453 336040 230961 122834 -50996 110797 -190426 -15444 109682 -59942 -94304 -102798
10443 -102798 -64426 -248621 -344702 -60378 405584 532728 364550 -12398 108376 -41210
10433 -41210 -182340 -357873 -413879 -11458 58087 471329 423356 92316 357750 170392
10423 170392 -33536 -97874 -113209 -103453 -203168 98002 107676 251240 549408 703209 481851
10412 481851 256466 422904 194465 56181 -41144 -31823 77716 314487 616914 393882
10402 393882 158707 203012 77932 -59916 -98316 177180 299753 -12977 -191022 -487372
10392 -487372 -628392 -372493 37674 323998 169477 -2787 193624 215341 65171 5800
10382 5800 267375 406843 669801 488452 345519 620806 548570 862158 719164 305148
10372 305148 229466 97140 193972 344021 7831 -63323 -251234 -161923 17660 -51592
10362 -51592 253728 241242 -302189 -372854 -397046 -163956 1531 -79735 -90359 -272432 124540
10351 124540 148721 -55312 -76491 -293421 -478867 -189464 152494 353579 603414 452240
10341 452240 409572 338183 191335 -237470 -214832 -29242 -202373 -252830 -161492 -492085
10331 -492085 -371282 -191716 345652 549770 333126 -375478 -540710 -283106 -262083 -538066
10321 -538066 -165238 244161 385873 78289 134717 530465 345429 147401 235808 539098
10311 539098 302386 214360 218103 82174 -149584 -111336 -300330 -188058 -264289 -342315 -521934
10300 -521934 -497046 -496518 -108515 152980 -119952 -497381 -374550 -316446 -385641 -462420 -713552
10289 -713552 -517639 -131423 131658 -154542 -222609 -179718 -217671 -296994 -458516 -260997
10279 -260997 39920 -199146 -381853 -161587 154104 502143 464312 441617 283171 129264
10269 129264 -272926 -373705 -164226 16120 124515 262931 559421 614969 458518 20042
10259 20042 132755 267300 416834 448224 245584 121634 -162371 -369594 -30920 -48307
10249 -48307 -191572 -46363 27585 371480 410349 351399 127979 157549 465975 159079
10239 159079 185142 304254 366589 260672 237377 359582 51881 -508362 -397253 -157745
10229 -157745 -161766 16274 381278 379437 87813 197933 268651 236539 171699 81720 247314
10218 247314 -47798 -146440 -525133 -465835 -111889 -138566 -342812 -332784 -22180 -53902
10208 -53902 -210561 -233947 -232224 -118960 -324498 -407137 -415195 -293544 -20671 20372 -96044
10197 -96044 -361506 -161005 95179 215378 303502 230844 171467 117875 -85777 -148781 -172147
10186 -172147 -17115 97976 257086 384391 569045 554630 382499 162871 2681 151381
10176 151381 97238 255072 249984 -117014 -62091 40209 -92778 -169102 -176765 137603 149795
10165 149795 130336 -171059 -317114 -221904 -206766 -21281 -323420 -717607 -868250 -626276
10155 -626276 -260260 -44995 258836 103565 -60567 -27447 -143231 -413002 -407903 -350929
10145 -350929 -50984 193877 308599 723090 616617 572672 762872 599039 315290 283845
10135 283845 245679 349233 251881 -226165 -63414 -2898 88651 154691 7160 -290601
10125 -290601 -432105 -764030 -474332 -447483 -365116 -263249 -129231 -280839 -438330 -103592
10115 -103592 85988 -62263 -150107 -9193 115896 121309 -167285 -278664 -232238 -106303
10105 -106303 -263362 -269390 -149827 54391 20577 651 21212 302701 -146438 -58913 156119
10094 156119 -84433 -300744 -259952 -563819 -123141 226617 17774 -236146 -281167 -549839
10084 -549839 -247211 86828 -121330 24781 -117050 -97087 306192 33763 -157607 113343
10074 113343 -124038 -496726 -346303 -88199 177038 448494 298611 480422 229822 -161026
10064 -161026 -215327 -12771 -159753 -43533 342922 494621 551461 307144 284015 609297
10054 609297 727970 806028 832557 892378 765156 732589 594541 143394 174500 302356
10044 302356 133374 -112908 55637 302804 659480 461416 236541 -223494 -242782 -30876
10034 -30876 -158021 -92251 -151421 -635683 -341041 -2886 77134 452018 455840 278975 93455
10023 93455 27476 38135 101111 332038 149147 45318 -265363 -89316 105350 173574
10013 173574 -275220 -105388 153204 -82727 -191031 350021 546586 334494 218770 233855
10003 233855 450520 568691 611477 413751 137117 154 42901 159077 119436 78042
9993 78042 63051 108102 31318 316985 182826 -251288 -375790 -356238 -258300 -103109 -44115
9982 -44115 -47730 114701 306014 134230 -24746 -453038 -287546 -497625 -342072 -224316
9972 -224316 27181 424481 8214 -205589 -77091 315917 167228 -364117 -264380 -163033
9962 -163033 -43184 -421698 -555768 21393 273827 401630 324906 177562 481320 567950
9952 567950 535511 555353 550192 402806 -133885 -166827 128665 535724 606639 175535 -116163
9941 -116163 -154594 102843 165376 155676 159444 -31894 -92405 85839 284731 209447 308617
9930 308617 326876 316828 -255749 -704092 -354900 -91075 -171306 -316093 -234652 -288387 -372718
9919 -372718 -240810 -468483 -688835 -772117 -737333 -390868 -24612 -151448 -175974 -728640
9909 -728640 -872870 -303479 130755 354515 528483 488059 303995 344369 505417 460927
9899 460927 561195 1097722 918158 681814 577158 261350 19463 15397 168737 293342
9889 293342 460239 346649 67353 -252328 -237318 -99738 -151881 -152575 90475 321154 373713
9878 373713 309175 553946 669040 460413 287531 287287 363462 317588 301194 58091 82646
9867 82646 11199 -150631 -122021 -12410 299271 147139 103197 475320 618341 181864
9857 181864 -145924 -36954 39274 57000 194701 476482 695423 495146 561275 606548
9847 606548 570746 285021 -82169 -376293 -176969 55898 13813 -85195 218028 644694
9837 644694 737559 397823 412546 480104 762892 762658 488738 420544 389057 381611 318359 203729
9825 203729 439657 599726 514167 617785 624962 352038 -380116 -274561 105946 -67631
9815 -67631 -249032 -323251 -498924 -747500 -827864 -559873 -125123 276605 57784 339009
9805 339009 596312 478298 766601 905948 900964 793886 478481 179656 -308954 -384575
9795 -384575 97671 283973 386390 167186 278598 662638 161627 -573033 -641063 -270994
9785 -270994 -73691 -34465 -117705 -95702 -101645 -133929 81153 -64099 64282 -154530 -215101
9774 -215101 225502 110218 31307 12113 -124389 -132022 -238718 -126987 34257 197588
9764 197588 -3421 -387641 -352396 -419262 -444379 -201049 -116890 -128818 -135353 -121408 -113061
9753 -113061 -185076 117168 205829 221069 117948 -27112 251488 81424 154369 263503
9743 263503 422029 116441 -209414 -247749 -295956 -151105 190492 409147 282423 202782
9733 202782 91272 -78108 -122478 -162003 -135663 -152275 -247267 4906 24210 121213 47162
9722 47162 -206091 -191202 -132211 -192726 -88535 -225871 -374833 -177396 194426 368779
9712 368779 336228 471837 570940 457410 685568 663411 486950 312048 479109 570248
9702 570248 627812 662543 581106 517580 182786 178062 215784 544198 776087 523556 170266
9691 170266 486877 618743 373832 46357 -10567 -402998 -579911 -83082 418031 620041
9681 620041 572955 961809 1035222 740899 67602 -106167 32327 262206 425132 565807
9671 565807 533791 265948 198266 544438 796780 921877 468336 -164483 -97988 11370
9661 11370 908 -69255 60554 428584 193010 -202276 -467411 -677927 -535056 -189189
9651 -189189 13366 110072 262974 413303 72694 77119 181252 25012 -4188 -260743
9641 -260743 -296119 301012 765790 378298 191916 261555 203717 368376 642520 543884
9631 543884 666485 443212 239525 285173 540189 506471 461418 197575 276907 362998 299816
9620 299816 -42731 -212288 -2020 45930 -92857 -278794 -318705 -242838 -493082 -493064 -491520
9609 -491520 -324189 -120069 306289 170265 277748 804046 604450 339213 217162 321932
9599 321932 565085 863108 1156187 1150097 842705 374002 73888 139526 455518 253993
9589 253993 59968 7862 298331 301153 60731 77937 -50508 117198 242897 119573
9579 119573 121349 95111 105303 -4221 -69037 141000 361230 295543 241283 136110 129726
9568 129726 -50603 -181008 388739 386890 279703 444951 508384 515133 536120 656547 560131
9557 560131 412489 467696 433848 334695 425461 -40187 -341694 -41721 238280 290512 168628
9546 168628 198612 395273 494868 310062 -128705 -12472 268612 473494 630092 489297
9536 489297 212107 566539 481643 280064 426587 327667 433662 311006 276946 603729
9526 603729 459218 275980 99157 191334 665183 762371 527318 725938 961157 937052
9516 937052 1516444 1417846 1377384 945994 565024 636239 956241 1311821 1373286 1377401 1558347
9505 1558347 1633145 1685280 1634810 1752720 2250399 2421343 2199265 2143464 2100781 2043154 2186626
9494 2186626 2549455 2799080 2893483 3128862 3331997 3548988 3823995 4105597 4234186 4730733
9484 4730733 5364652 5615847 6208288 6862176 7667145 8193797 8912080 9867654 10804311 11752798
9474 11752798 13068102 14473921 16041610 17566827 19181831 20615626 21913845 22820082
9466 22820082 23835797 24351971 24706780 24469805 24223731 23563551 22679417 21971732 21235731
9457 21235731 20308904 19484993 18839070 18361500 17691459 18009320 18061903 18004909 17933332 17853316
9447 17853316 17823024 18434388 19711021 20478305 21262306 22623634 23882572 25107848 26941492
9438 26941492 29234496 31607225 34395338 37209777 40130661 42828312 45217096 47195707
9430 47195707 48517926 49157715 49251554 48392253 46690574 44337949 41743393 39229090 36698210
9421 36698210 33756770 30737869 28418756 26698114 24972959 23341139 21596255 19960722
9413 19960722 18670717 17984118 17389637 17145361 17129977 17008696 16891694 17056180 17347599
9404 17347599 17340849 17405595 17982167 18621849 18900037 19483172 20212536 20831730 21464882 22003875
9394 22003875 22180476 22393910 22242591 22009939 21267346 20299242 19152830 17792039 16829235
9385 16829235 15821072 14364964 13177515 12335217 11437627 10534022 10153079 9445636 8565128
9376 8565128 7831645 7180022 6664549 5930982 5600794 5058923 4797058 4906597 5018481 4768676
9366 4768676 4206301 4219595 4368120 3924826 3790425 3603663 3381412 3550244 3823799 3700371
9356 3700371 3565309 3271213 2594252 2184386 2402183 2139521 2074685 1939573 1761282 1734131
9346 1734131 1519673 1578053 1670331 1903069 2103444 2124918 2274219 1990804 1770680 1604082
9336 1604082 1673213 1433186 1615244 1696439 1723464 1644045 1241027 1159205 1089797 999602 1181252
9325 1181252 1107802 534650 277830 546702 900491 1102961 901117 898428 1155892 1262989
9315 1262989 888610 965128 1096728 809147 693023 791184 822841 1007957 773422 435911
9305 435911 730160 774738 709161 583618 397106 255281 113687 209885 305766 554285
9295 554285 848073 763900 447644 -29538 -189771 172303 603467 810541 1013389 1055694
9285 1055694 1042146 889961 718728 644351 700271 801151 742193 601205 633197 849709
9275 849709 975790 996271 920214 942693 762110 685844 680455 777955 891796 855384 889150
9264 889150 908151 1103209 1147396 897576 697102 921052 1104574 910052 426542 904576
9254 904576 1373584 1230640 1280888 1481574 1253238 1246570 901860 686630 778930 730929 316090
9243 316090 130388 139189 -110432 262345 433147 264235 183085 356430 265468 316362 385065
9232 385065 595328 907673 1054511 727423 197128 151763 391411 545751 228962 284280
9222 284280 432944 42748 37846 367483 817635 1174453 1281186 954716 809440 1083070
9212 1083070 1027742 1166752 1061092 1069502 1279663 1213643 964641 825284 937660 1029421
9202 1029421 631426 131670 174339 474051 676441 445922 496486 482221 410739 455723
9192 455723 232379 517006 1017765 1172286 986617 808512 496713 518168 867419 1006211
$$ [...]
##END NTUPLES=NMR SPECTRUM
##END=
