##TITLE=Analysis number 323268
Compound Code cc 54814
Book Reference 486/60
Project Code adrs
Chemist Name simons
##JCAMPDX= 6.0         $$ Bruker NMR JCAMP-DX V2.0
##DATA TYPE= NMR SPECTRUM
##DATA CLASS= NTUPLES
##ORIGIN= Bruker BioSpin GmbH
##OWNER= nmr
$$ XWIN-NMR		Version 3.5
$$ Fri Oct 20 09:18:02 2006 GMT Daylight Time (UT+1h)  MAYBRIDGE\nmr@NMR_250MHZ
##.OBSERVE FREQUENCY= 250.131544655141
##.OBSERVE NUCLEUS= ^1H
##.ACQUISITION MODE= SIMULTANEOUS (DQD)
##.ACQUISITION SCHEME= undefined
##.AVERAGES= 16
##.DIGITISER RES= 18
##SPECTROMETER/DATA SYSTEM= dpx250
##.PULSE SEQUENCE= zg30
##.SOLVENT NAME= CDCl3
##.SHIFT REFERENCE= (INTERNAL, CDCl3, 0, 16.522)
##AUDIT TRAIL= $$ (NUMBER, WHEN, WHO, WHERE, WHAT)
$$ ##TITLE= Audit trail, XWIN-NMR		Version 3.5
$$ ##JCAMPDX= 5.01
$$ ##ORIGIN= Bruker BioSpin GmbH
$$ ##OWNER= nmr
$$ C:\u/data/dgb/nmr/ADRS/1000/pdata/1/auditp.txt
$$ ##AUDIT TRAIL=  $$ (NUMBER, WHEN, WHO, WHERE, WHAT)
(   1,<2006-10-20 09:17:39.15 +100>,<MAYBRIDGE\nmr>,<NMR_250MHZ>,
      <created by zg, POWCHK disabled, PULCHK disabled
       configuration hash MD5:
       49 4B E0 1D 92 C2 6B 37 9F E6 65 BC 52 41 86 1D
       data hash MD5: 64K
       DB 21 0F 40 FA 7F 20 D2 DD 62 E0 DF AD 9B 90 E2>)
(   2,<2006-10-20 09:17:52.58 +100>,<MAYBRIDGE\nmr>,<NMR_250MHZ>,
      <Start of raw data processing
       ef LB = 0.3 FT_mod = 6 PKNL = 1 SI = 32K 
       data hash MD5: 32K
       5D 4D 92 3D 38 FD D4 1B 09 BE 75 E7 2E FF 42 55>)
(   3,<2006-10-20 09:17:54.23 +100>,<MAYBRIDGE\nmr>,<NMR_250MHZ>,
      <apk 
       data hash MD5: 32K
       AC 8E 22 25 FA B9 F5 D5 C0 C3 F2 4D 93 AC 33 9D>)
(   4,<2006-10-20 09:17:55.04 +100>,<MAYBRIDGE\nmr>,<NMR_250MHZ>,
      <abs ABSG = 5 
       data hash MD5: 32K
       F1 1D 4A 66 A6 27 8F 69 7A 7A AC 65 A9 E1 09 15>)
$$ ##END=
$$ 
$$ hash MD5
$$ 90 E0 3D 9B B8 EB 0F 0B F0 1E C7 9B 8F 32 00 D1
##$RELAX= 
##$RELAX= 
##$RELAX= 
##$RELAX= 
##$RELAX= 
##$RELAX= 
##$RELAX= 
$$ Bruker specific parameters
$$ --------------------------
##$DU= <C:\u>
##$EXPNO= 1000
##$NAME= <ADRS>
##$PROCNO= 1
##$TYPE= <nmr>
##$USER= <dgb>
##$AMP= (0..31)
100 100 100 100 100 100 100 100 100 100 100 100 100 100 100 100 100 100 
100 100 100 100 100 100 100 100 100 100 100 100 100 100 
##$AQSEQ= 0
##$AQ_mod= 3
##$AUNM= <au_zg>
##$AUTOPOS= <47 >
##$BF1= 250.13
##$BF2= 250.13
##$BF3= 250.13
##$BF4= 250.13
##$BF5= 500.13
##$BF6= 500.13
##$BF7= 500.13
##$BF8= 500.13
##$BYTORDA= 1
##$CFDGTYP= 0
##$CFRGTYP= 5
##$CHEMSTR= <none>
##$CNST= (0..31)
1 1 145 1 1 1 1 1 1 1 1 1 1 1 1 1 1 1 1 1 1 1 1 1 1 1 1 1 1 1 1 1 
##$CPDPRG= <>
##$CPDPRG1= <>
##$CPDPRG2= <>
##$CPDPRG3= <>
##$CPDPRG4= <mlev>
##$CPDPRG5= <mlev>
##$CPDPRG6= <mlev>
##$CPDPRG7= <mlev>
##$CPDPRG8= <mlev>
##$CPDPRGB= <>
##$CPDPRGT= <>
##$D= (0..31)
0 1 0 0 0 0 0 0 0 0.06 0 0 0 0 0 0 0.0002 0 0 0 0 0 0 0 0 0 0 0 0 0 0 
0 
##$DATE= 1161332257
##$DBL= (0..7)
120 120 120 120 120 120 120 120 
##$DBP= (0..7)
150 150 150 150 150 150 150 150 
##$DBP07= 0
##$DBPNAM0= <>
##$DBPNAM1= <>
$$ [...]
##$SUBNAM7= <"">
##$SUBNAM8= <"">
##$SUBNAM9= <"">
##$SW= 20.6930455092707
##$SWIBOX= (0..15)
0 0 3 0 0 0 0 0 0 0 0 0 0 0 0 0 
##$SW_h= 5175.983436853
##$TD= 65536
##$TD0= 1
##$TE= 683.16
##$TE2= 300
##$TE3= 300
##$TEG= 300
##$TL= (0..7)
0 120 120 120 120 120 120 120 
##$TP= (0..7)
150 150 150 150 150 150 150 150 
##$TP07= 0
##$TPNAME0= <>
##$TPNAME1= <>
##$TPNAME2= <>
##$TPNAME3= <>
##$TPNAME4= <>
##$TPNAME5= <>
##$TPNAME6= <>
##$TPNAME7= <>
##$TPOAL= (0..7)
0.5 0.5 0.5 0.5 0.5 0.5 0.5 0.5 
##$TPOFFS= (0..7)
0 0 0 0 0 0 0 0 
##$TUNHIN= 0
##$TUNHOUT= 0
##$TUNXOUT= 0
##$USERA1= <user>
##$USERA2= <user>
##$USERA3= <user>
##$USERA4= <user>
##$USERA5= <user>
##$V9= 5
##$VALIST= <valist>
##$VCLIST= <CCCCCCCCCCCCCCC>
##$VD= 0
##$VDLIST= <DDDDDDDDDDDDDDD>
##$VPLIST= <PPPPPPPPPPPPPPP>
##$VTLIST= <TTTTTTTTTTTTTTT>
##$WBST= 1024
##$WBSW= 4
##$XGAIN= (0..3)
0 0 0 0 
##$XL= 0
##$YL= 0
##$YMAX_a= 504355
##$YMIN_a= -264439
##$ZGOPTNS= <>
##$ZL1= 120
##$ZL2= 120
##$ZL3= 120
##$ZL4= 120
##$ABSF1= 16.522
##$ABSF2= -4.171173
##$ABSG= 5
##$ABSL= 3
##$ALPHA= 0
##$AQORDER= 0
##$ASSFAC= 0
##$ASSFACI= 0
##$ASSFACX= 0
##$ASSWID= 0
##$AUNMP= <proc_1d>
##$AZFE= 0.1
##$AZFW= 0.1
##$BCFW= 0
##$BC_mod= 0
##$BYTORDP= 0
##$COROFFS= 0
##$CY= 12.5
##$DATMOD= 1
##$DC= 0
##$DFILT= <>
##$DTYPP= 0
##$F1P= 14.0000005364418
##$F2P= -0.99999901652339
##$FCOR= 0.5
##$FTSIZE= 32768
##$FT_mod= 6
##$GAMMA= 0
##$GB= 0
##$INTBC= 1
##$INTSCL= 1
##$ISEN= 128
##$LB= 0.3
##$LEV0= 0
##$LPBIN= 0
##$MAXI= 10000
##$MC2= 0
##$MEAN= 0
##$ME_mod= 0
##$MI= 0
##$NCOEF= 0
##$NC_proc= -5
##$NLEV= 6
##$NOISF1= 0
##$NOISF2= 0
##$NSP= 0
##$NTH_PI= 0
##$NZP= 0
##$OFFSET= 16.522
##$PC= 1
##$PHC0= -33.90882
##$PHC1= -17.20756
##$PH_mod= 1
##$PKNL= yes
##$PPARMOD= 0
##$PSCAL= 4
##$PSIGN= 0
##$REVERSE= no
##$SF= 250.13
##$SI= 32768
##$SIGF1= 0
##$SIGF2= 0
##$SINO= 400
##$SIOLD= 32768
##$SREGLST= <1H.CDCl3>
##$SSB= 0
##$STSI= 32768
##$STSR= 0
##$SW_p= 5175.98343685301
##$SYMM= 0
##$S_DEV= 0
##$TDeff= 65536
##$TDoff= 0
##$TI= <Analysis number 999999
Compound Code 99
Book Reference 9
Project Code 9>
##$TILT= no
##$TM1= 0
##$TM2= 0
##$TOPLEV= 0
##$USERP1= <user>
##$USERP2= <user>
##$USERP3= <user>
##$USERP4= <user>
##$USERP5= <user>
##$WDW= 1
##$XDIM= 32768
##$YMAX_p= 481814548
##$YMIN_p= -1080228
$$ End of Bruker specific parameters
$$ ---------------------------------
##NTUPLES= NMR SPECTRUM
##VAR_NAME=  FREQUENCY,     SPECTRUM/REAL,   SPECTRUM/IMAG
##SYMBOL=    X,             R,               I
##VAR_TYPE=  INDEPENDENT,   DEPENDENT,       DEPENDENT
##VAR_FORM=  AFFN,          ASDF,            ASDF
##VAR_DIM=   32768,         32768,           32768
##UNITS=     HZ,            ARBITRARY UNITS, ARBITRARY UNITS
##FACTOR=    0.157963299565203, 1,           1
##FIRST=     4132.6476996994, 0,             0
##LAST=      -1043.33573715361, 0,           0
##MIN=       -1043.33573715361, -1080228,    0
##MAX=       4132.6476996994, 481814548,     0
$$ Real data points
##PAGE= N=1
##DATA TABLE= (X++(R..R)), XYDATA
$$ [...]
23080a07330p6931K647J88243N2643j10629K0478K43252m4859k0130o1706M3574
23069A29252j5475L3722J81425p7229l04342l94980m0946l8498P9901L24877J95468
23058G3175P7087m9387K57301Q2172p401m9454k12117l762l144o5517O5099n297
23046A58755K1986J7662j32746L2107L8732k38145j17979K77150J95p9220J08267
23035H6764q1042P8368r6129q8555J41764O1150J3547k70280k89707J65009J58945
23024a20166l5384j08017l2565R0920K02093Q0135J920J75124q1195k45994J008
23013g2121P59j95139j05606J57746L09419J80307J10048j8385l47307l73724
23003c54003J09061R8518k8290r3846n0538M0454J19574M3208J95614L122M3662
$$ y = [-107330, -184261, -181614, 6629, 59272, -51357, -30879, 212373, 167514, 147384, 85678, 129252, 113777, 147499, 328924, 251695, -52647, -447627, -488573, -527071, -447170, -122293, 73175, 150262, 100875, 358176, 440348, 432947, 383493, 171376, 167614, 164470, 98953, 164052, 158755, 180741, 198403, 65657, 97764, 136496, -101649, -219628, 57522, 57717, -21503, 86764, 5722, 84090, -12039, -100594, 41170, 102320, 115867, -154413, -444120, -279111, -120166, -155550, -263567, -296132, -205212, -3119, 77016, 78936, 254060, 172865, -73129, -72121, -71362, -266501, -372107, -214361, 95058, 275365, 385413, 367028, 19721, -354003, -244942, -146424, -174714, -268560, -319098, -278644, -159070, -115862, 79752, 82874, 126536]
22992A26536J06024j41472q4504K3090L9501P4106q0842j73124P8171N0371K18863
22981B36720Q7655k41829r5150J40750N2513K07542n0533k49203M58o4359O0120
22970H4684N8433K17535j02303k88842k16396K8204L26426R2224k67706o6962
22960a34703n1830l05994q1000J70694m4925j53075M7689J67380P1291N1340j5411
22949b78544L36452K17636k47744m3703J9907N4222j89793l4560J07127o1946
22939a20946m6919R2828j64755q9177L0475K51892J55434j35659O0412j918k32054
22928b00387o8171k55325J37804P1671J5835O6653J10780o3570k5721K3117P1035
22917a16279L31478k1219j01130J7901Q2627j19899R7727K6349j7065n4343p2900
$$ y = [126536, 232560, 91088, 6584, 29674, 69175, 143281, 62439, -110685, -32514, 17857, 236720, 324375, 82546, -12604, 128146, 180659, 388201, 337668, 88465, 88923, 24564, 84684, 143117, 360652, 258349, -30493, -246889, -218685, 107741, 199965, -67741, -134703, -186533, -492527, -573527, -402833, -447758, -600833, -553144, -385764, -314473, -263133, -278544, 57908, 275544, 27800, -15903, 4004, 58226, -131567, -166127, -59000, -120946, -167865, -75037, -239792, -328969, -298494, -46602, 108832, -26827, 33585, 31667, -200387, -268558, -523883, -386079, -314408, -298573, -231920, -121140, -184710, -210431, -187314, -116279, 215199, 193980, 92850, 110751, 193378, 73479, 171206, 197555, 180490, 126147, 53247]
22906E3247J5453L9027j0360j60994P0591r2743j50084J16028L00699Q7610p2992
22895A95482l0657J21184O7456j73214j92941j59970k39346n0680M11995L03351
22885B52660j18910N6351J18967j8877l60986r6524J22904J20505R6477p5792
22875I6775M0951M3212P6161K4031J99313j76076j40978M4905N1743M5754j44439
22864A61352j77251j37560k00957L6827J09238J41117J08006l02231j35602J25063
22854b71998k34287J10451K21696j836k239j14609R3355J68073K2903J98779p347
22843A82941m5391m6027J14869n8875j02521p8099j39356k63549K28304K12076
22833D372j9863R4944J83707r678r6691m558r9755j59573l7579J8678k3709o9778
$$ y = [53247, 68700, 107727, 97367, -63627, 6964, -85779, -235863, -119835, 180864, 268474, 195482, 164825, 286009, 353465, 180251, -12690, -172660, -412006, -462686, -50691, 252660, 133750, 190101, 309068, 290191, -70795, -167319, -44415, 76090, 172567, 96775, 137726, 180938, 257099, 281130, 480443, 304367, 163389, 208294, 260037, 305791, 161352, -15899, -153459, -354416, -317589, -208351, -67234, 40772, -261459, -397061, -271998, -506285, -395834, -174138, -175974, -178213, -292822, -199467, -31394, -8491, 190288, 182941, 137550, 91523, 206392, 147517, 44996, -33103, -172459, -436008, -207704, 4372, -15491, 79453, 263160, 253482, 156791, 152233, 52478, -107095, -144674, -125996, -149705, -219483]
22821b19483Q1363J00155O8744J11943M5360p0161j43826r603L0043j74824k7037
22810b07326k1807J05607Q4440j18550j67739J22899J46946N268J84647J83023
22800C17408o0095J6581p2181j10964k12124J67973L7169j95832L1602k09522
22790b89985J5011J47078N0221J45515l26573r2544R2314K00784M67685j23869
22780B85637r7735O7805M8306k34603q2322K14997M1561k35503k93143k6297L6513
22769b74784J40332R1953j1414k69350k09269n344M07814L04129J4456o6101P4120
22758A96542J24378k55925n5655Q7589j0661J02939J41055r1200j78117l6346
22748B4599j52231k41578P0625R4132J49711l4588n3087P5576o4423J6966K3451
$$ y = [-219483, -138120, -37965, 30779, 142722, 188082, 117921, -25905, -35508, -5465, -180289, -207326, -229133, -123526, -39086, -157636, -325375, -202476, -55530, -50262, 134385, 317408, 257313, 273894, 201713, 90749, -121375, 46598, 83767, -112065, -80463, -289985, -274974, -127896, -77675, 67840, -258733, -351277, -258963, -58179, 409506, 285637, 187902, 255707, 304013, 69410, -12912, 202085, 243646, 8143, -285000, -311297, -274784, -134452, -42499, -53913, -323263, -532532, -537876, -130062, 174067, 188523, 122422, 196542, 320920, 64995, 9340, 96929, 86268, 189207, 330262, 239062, 60945, 24599, -127632, -369210, -298585, -204453, -54742, -89330, -142417, -66841, -131264, -114298, -90847]
22737i0847K85660O8619k95162j49142J03768J78802L11318K81546M5590l41939
22727C98213r5226O5562J15946r831j77145j0339o632j15424j58680m6123J84733
22716A45054J27750j92799k56945o0687j9043J96247Q5271j36329j25966J75107
22706f2340L675j52766K41214J23251q1055j35258L7070Q1140M9420r0170J38554
22695A52735J67238r3991o7603n9851Q7969O1348j84374K5820m1115j66462q3068
22684b01354l8080j733l5312J06137N7396K67869J06608k26671j48328j32994
22674b46462l32459j4401J97247l1686K84377K21879J68789j42503k54139j43009
22664b92367P8605K92996k4182r2689n5673J00882J55093n3075j31512k56778
$$ y = [-90847, 194813, 263432, -31730, -180872, -77104, 101698, 413016, 694562, 740152, 398213, 302987, 368549, 484495, 474664, 297519, 287180, 280548, 165124, 6444, -39679, 145054, 272804, 80005, -176940, -237627, -256670, -60423, 24848, -111481, -237447, -62340, -58665, -211431, 29783, 153034, 71979, -63279, -26209, 54931, 104351, 14181, 152735, 319973, 225982, 158379, 98528, 186497, 247845, 63471, 89291, 48176, -118286, -201354, -239434, -241167, -276479, -170342, -112946, 154923, 261531, 34860, -113468, -246462, -578921, -593322, -396075, -427761, -143384, 78495, 247284, 104781, -149358, -292367, -213762, 79234, 55052, -37637, -93310, 7572, 162665, 109590, -21922, -278700]
22654b78700J01697L90344N9084j93412j44521J43342K21799j98949q2257J17893
22644A36320n4928n6887k04521N2053M0819M2966r5519k31373J08707J26234j43955
22633b80084Q7217K25356l4251k99865j17183J01420Q0827n4642r0602r4709j14290
22622e90806J75194Q4579j39442k8507K38299K58277j43875K7287J32349j32967
22612a19612j15900m9440J87408j91796l28486J68553L04603J20539j25795l22738
22602d72664r3160J80889J50324Q4147N1021q6878j78759j07564l6303k05660
22592g14607M8090K14441J91299J89466J01743L3846J691o4519P7001J51335Q3117
22581C12903j73392k83650K03068k08621J9859K48201p774j52651L705M234j49557
$$ y = [-278700, -177003, 213341, 272425, 79013, -65508, 77834, 299633, 100684, 18427, 136320, 81392, 24505, -180016, -127963, -87144, -44178, -139697, -371070, -262363, -136129, -280084, -192867, 32489, -1762, -301627, -418810, -317390, -236563, -291205, -381807, -476516, -590806, -415612, -331033, -470475, -498982, -260683, -2406, -146281, -118994, 13355, -119612, -235512, -284952, -97544, -289340, -617826, -449273, -144670, -24131, -149926, -472664, -565824, -384935, -234611, -150464, -99443, -186321, -365080, -472644, -508947, -714607, -666517, -452076, -260777, -71311, 30432, 64278, 65969, 1450, 78451, 229786, 312903, 139511, -144139, 58929, -149692, -129833, 118368, 110594, -42057, -38352, -34118, -183675]
22570a83675l541j28921J97143J83391r992k5249n7911m4439j58224L5786P9312
22559a16320n0426J25157K56688J89947j54985O3172M3773j73869j33666j25258
22549g5787J12975j601J80718M21035R3470l15863j93902L9964k51024j52744
22539a42759j61642P0546J70824L96750O0379J5717P7289p1353j26837j89303
22529I9611r6562j5313j11481L5833N7426j14504J5259j3861k42494k0735J43099
22518b63722j71722L5785J32656K133J49112Q2090j4770j09830r0546m8515M0513
22507b56816K02029l0944N1480J56702k01279k28941M3913J58611J33830J13249
22497A41834K2060j66140j88278J71061L65761j28611m0145j629q4010k80358
$$ y = [-183675, -187216, -316137, -118994, 64397, 54405, 29156, -28755, -73194, -231418, -195632, -116320, -166746, -41589, 215099, 405046, 250061, 313233, 357006, 183137, 49471, -75787, 37188, 35587, 216305, 637340, 730810, 414947, 221045, 261009, 9985, -142759, -304401, -233855, -63031, 333719, 394098, 409815, 487104, 415751, 288914, 99611, 3049, -12264, -123745, -87912, -30486, -144990, -129731, -143592, -386086, -406821, -263722, -435444, -399659, -267003, -264870, -115758, -33668, -48438, -158268, -248814, -297329, -256816, -54787, -85731, -34251, 122451, -78828, -307769, -263856, -105245, 28585, 141834, 163894, -2246, -190524, -19463, 346298, 217687, 177542, 175913, 91903, -188455]
22487a88455k10414o952L7816P4843J82041K74401p1981M1518M7681j47879j2514
22476B0105R8267P1371k07137l4427j24727q1828K42460K28465k9209K68257k2094
22465D29503j11530k65296J49880j5837j89632J09619J41339Q2421m4184N9933
22455C46216j79880k53593K3418P5108J11175J06919J05036M7887j14335j76536
22445I1415k05481M986O024K31031j85133j63846l4721l5550L0845J3075N656
22434b41699j34248j49797q8063j32793p9796K98975K67091j96064j39433P89
22424e95038K05258K74702K01856P6564n3328k5121j0694q1280J6370J49213O8613
22413B27115J88406L0345m0235Q0792p7108Q450q8131j84152k35350j07048K57986
$$ y = [-188455, -398869, -405821, -368005, -293162, -111121, 163280, 91299, 132817, 180498, 32619, 20105, 118372, 189743, -17394, -51821, -176548, -258376, -15916, 212549, 183340, 451597, 429503, 317973, 52677, 202557, 186720, -2912, 106707, 248046, 330467, 286283, 346216, 166336, -87257, -63839, 11269, 122444, 229363, 334399, 382286, 267951, 91415, -114066, -109080, -103056, 127975, -57158, -221004, -255725, -291275, -260430, -247355, -241699, -375947, -525744, -613807, -746600, -826396, -527421, -260330, -456394, -595827, -595038, -389780, -115078, 86778, 163342, 110014, 84893, 74199, -7081, 9289, 158502, 227115, 415521, 445866, 405631, 486423, 409315, 417765, 329634, 145482, -89868, -196916, 61070]
22402F1070J68079J0895k37002j02708m6295j4462L5357J05038J02654J1554k61602
22391a67422q6731L0299n1982M4999j26892J65790J65868q8812p3733N7841n7893
22380a88668K9797p2918k4551J27260o476J35873m7696m3251k4208J32448j29184
22369a11574m0255n2919K03754j8234j7893j60133o7370J24595m8553k1668k4477
22358b34727P4657J0509j29166j01347j8597K26498K35670J70149o4360j30929
22348C8357j15520j43643J24674K51056j28028q0018m8249j26615M1474J52752
22338c3760q6429j67176O9430J60029j03760j09037n188K21096J34386K2540J17903
22327B20034l56249j90100K33452J87758K13254L0499k08108J73535N4271n6139
$$ y = [61070, 229149, 240044, 3042, -99666, -145961, -160423, -125066, -20028, 82626, 94180, -167422, -254153, -223854, -275836, -230837, -357729, -191939, -26071, -114883, -188616, -130775, -188668, -158871, -231789, -256340, -129080, -135556, 317, -47379, -90630, -114838, 17610, -111574, -151829, -204748, -994, -19228, -37121, -197254, -264624, -140029, -188582, -210250, -234727, -160070, -149561, -278727, -380074, -398671, -172173, 63497, 233646, 169286, 38357, -77163, -220806, -96132, 154924, 26896, -53122, -101371, -227986, -186512, -33760, -120189, -287365, -217935, -57906, -161666, -270703, -275891, -54795, 79591, 102131, 220034, -136215, -326315, -92863, 94895, 308149, 338648, 130540, 304075, 358346, 302207]
22317C02207j56590j37705j06099j0267O5582n0374j50425J50558j74759k10154
22307d78026q0460K8158J39943K79652K04601J34992M4334r4341r875O8896l08388
22296g0514l13608R2734J62060J08146n4965j18316R7373K0995m3419M63766O3680
22285D07932o9027k6745j458k4273j01277j32799r4536O8556p5029L01780J18373
22274C71497k37425j23747k2972l5143l5793K7631j09533N61n8611L7614j32451
22263c18372J408K86369N4027j9995j29784N4515j72179J30601J92110J31753
22253B10453l15044k14326L9999N8069J86439m7137j47857j52070Q4387P3457
22243b23630Q4106J37857j4082P5718J56077N7209L0757J6353n7284j31029j58660
$$ y = [302207, 145617, 7912, -98187, -108454, -42872, -93246, -243671, -93113, -267872, -478026, -558486, -530328, -390385, -110733, 93868, 228860, 273194, 178853, 168978, 237874, -70514, -384122, -291388, -129328, -21182, -76147, -194463, -97090, -76095, -119514, 344252, 407932, 338905, 312160, 310702, 286429, 185152, 52353, -42183, 26373, -48656, 253124, 371497, 134072, 10325, -12647, -47790, -83583, -55952, -165485, -164924, -223535, -185921, -318372, -316964, -30595, 23432, 3437, -126347, -71832, -244011, -113410, 78700, 210453, -104591, -318917, -278918, -220849, -34410, -81547, -229404, -381474, -297087, -223630, -139524, -1667, -15749, 59969, 216046, 273255, 304012, 320365, 263081, 132052, -26608]
22232b6608L7194n4073N0506J91585J33266j73624L5113J76708r376k30142j16923
22221A3626j9833J70454J58362k11004l54138J29269K35364O4944j49772p9754
22211d2482J4767J39874K5998l58984N1206K76459n1487j18726k8041J41026J60006
22200B09616P2749k72455j85346l681M0581J68739J27479l80203j53964J52741
22190b23744J53518l4045j02763O0120J79242N2824M3902m5146q4024L5747q7124
22179e1493r7054K5853J21086J29896q237J4449Q3914k068m205J39080K02396
22168E53617j32176j5374j1186k47487l6242j08981j81416k57591J78888J92688
22158f5260K77189j58405j23300P2975K14696N5856J38586j59900k43916j69473
$$ y = [-26608, 10586, -43487, 7019, 198604, 331870, 158246, 193359, 370067, 360691, 130549, 13626, -6207, 164247, 322609, 111605, -242533, -113264, 122100, 187044, 37272, -42482, -27715, 112159, 138157, -220827, -169621, 106838, 55351, -63375, -91416, 49610, 209616, 282365, 9910, -175436, -179117, -138536, 30203, 157682, -222521, -376485, -223744, -70226, -104271, -207034, -146914, 32328, 85152, 129054, 83908, -116, 35631, -51493, -148547, -122694, -1608, 128288, 120051, 134500, 218414, 216346, 212141, 351221, 553617, 421441, 406067, 394881, 147394, 111152, 2171, -179245, -436836, -257948, -65260, 211929, 53524, -69776, 3199, 217895, 273751, 412337, 252437, 8521, -160952]
22148a60952k6796L0148r5916m1961J5580J39603p9341J31074J37861R5904r049
22137A36155q2623k44555L46596J42649q0256P568j97573j70075k29268j58744
22127e30126K12293J50608K3725j4904J20618J48893k7210j25979j66254n112
22117b13448L28945O9846k62126K2303j9637p0078J5273M7776J49992k653P0722
22106A36915r5641r3420R0221k24551J5570K5944r9524L29018L11027k52812k840
22095A39907J64087j07928j84856j27717O7789r5891j19745K13368J05012J66815
22085B20841J64190k82219k08792Q7633K75578k63180j76099p3758j51434J86407
22075b20833k6957O2976m5864j81884N7908n252J95710M3381R4044K29986j60800
$$ y = [-160952, -187748, -157600, -253516, -295477, -279897, -140294, -219635, -88561, 49300, 145204, 136155, 53532, -191023, 155573, 298222, 217966, 225534, 27961, -142114, -371382, -530126, -317833, -167225, -143500, -158404, -37786, 111107, 83897, -42082, -208336, -213448, 115497, 185343, -76783, -54480, -74117, -144195, -128922, -81146, 68846, 66193, 136915, 41274, -52146, 38075, -186476, -170906, -144962, -244486, 84532, 395559, 142747, 139907, 303994, 196066, 11210, -116507, -48718, -144609, -264354, -50986, 54026, 220841, 385031, 102812, -105980, -18347, 257231, -5949, -182048, -255806, -407240, -220833, -247790, -184814, -230678, -412562, -354654, -359906, -164196, -120815, -26771, 203215, 42415]
22064D2415J44353P0661k80924p1655P8582j50741K12358J46374n6362o3090q5028
22053a3057m9282M6733j6115N0720J47886J98476j18556j58615k39531k9264Q1836
22042i8769j86937p4701p8450P1656J18332J79340K4055q0697j09883M1885j4318
22031b08487j46608m8252L9312P0430O7900J51864n1356l3300P6274J94831k71969
22020a59361J91024J87068J15869k8502j71876j93173L4269l9991p1132m6350
22010a82155J17505M6379q4326j43850M3511N8152K9582j98932q9993j39009Q5275
21999d57861J66614J03909J2485k3645n4282j02505J41124L79297j20360k88530
21989b43754o92J20657m7886k30847J54891K80909R9854j41068j46060q9684q7718
$$ y = [42415, 186768, 257429, -23495, -95150, -16568, -167309, 45049, 191423, 135061, 71971, -13057, -62339, -15606, -31721, 18999, 166885, 365361, 246805, 88190, -151341, -180605, -98769, -285706, -360407, -438857, -367201, -248869, -69529, -45474, -126171, -236054, -194169, -208487, -355095, -403347, -364035, -293605, -225705, -73841, -125197, -158497, -82223, 112608, -159361, 31663, 218731, 334600, 306098, 134222, -58951, -24682, -64673, -135805, -182155, -64650, -18271, -102597, -246447, -202936, -144784, -115202, -314134, -404127, -543136, -457861, -291247, -187338, -174853, -198498, -252780, -355285, -214161, 165136, 44776, -243754, -244446, -123789, -171675, -402522, -247631, 33278, 133132, -7936, -153996, -243680, -331398]
21978c31398Q9326m7614m7438p9688N1025k6075m2409J69314K34226p7445J79243
21967G1067K10766R2014k10071r1844j22547o4993J3346l5158k1819K20796O9408
21956A30965r2431J27380J03989q5547j03296K2252m945L06598J76118k75621
21946C05462k17324l3349o392j66287j64035k07434j6520N9278j89764L10151
21936c26214K83385P8045N0740k69074j89958K4620J36779J967K0588j4261J66865
21925c6518L72718J10114j76586j01900j19342r4695n4466N1273j13859N2308
21915a10953L795J13306J19647N716p8303k6540j4393l0178K2028R3115l7215
21904F0025K1611r1290j43805o2250R3687J92735K36291j34769j59183J205J40934
$$ y = [-331398, -242072, -289686, -337124, -416812, -365787, -391862, -434271, -264957, -30731, -108176, 71067, 281833, 373847, 163776, 71932, -50615, -115608, -102262, -137420, -159239, 61557, 130965, 38534, 165914, 269903, 184356, 81060, 103312, 98367, 404965, 581083, 305462, 88138, 54789, 48397, -117890, -281925, -489359, -505879, -446601, -636365, -326214, -42829, 35216, 85956, -183118, -373076, -348456, -211677, -209710, -189122, -203383, -36518, 336200, 446314, 269728, 167828, 48486, -46209, -100675, -49402, -163261, -110953, -107158, 6148, 125795, 131511, 53208, 26668, 12275, -17903, 4125, 97240, 60025, 81636, -9654, -153459, -215709, -122022, 70713, 307004, 172235, 13052, 14257, 155191]
21893A55191N7957L7350l00195j66600r5651Q0950L24178n0364j32321L3661l6595
21882i2439K57742m61j4732j21121j16718m7228K37536J11327k9254K76436J76159
21871F37247j17908l96214k01426R8107k7839J4086l9546j45979J83850j05987
21861a01609j38413N8333R430P6580j30177r8671N6718p1956o3060N1978K12383
21850a38464K10902M1074l7175q852n4403n7259n5558j02255K17050J96648R591
21839B21299p9427p8119N963P4603Q9380J2433j80391j51609L5833m5433R009
21828h6459j27343K1788J96763J1703N5992R1243k11440j25365J74620O1542J45647
21817B08691J01328m5020J33549j49407k72657j20830p6677O9129R878n6243r4976
$$ y = [155191, 213148, 250498, -49697, -216297, -311948, -230998, 93180, 42816, -89505, -55844, -92439, 165303, 164842, 150110, 28989, -87729, -134957, 102579, 213906, 184652, 461088, 637247, 519339, 123125, -78301, 19806, -8033, 6053, -33493, -179472, 4378, -101609, -240022, -181689, -172259, -95679, -225856, -324527, -267809, -339765, -402825, -350847, -138464, 72438, 113512, 76337, 67485, 13082, -44177, -99735, -201990, 15060, 211708, 221299, 141872, 63753, 69716, 144319, 233699, 246132, 65741, -85868, -50035, -95468, -86459, -213802, -192014, 4749, 16452, 72444, 163687, -47753, -173118, 1502, 63044, 208691, 310019, 264999, 398548, 249141, -23516, -144346, -221023, -151894, -142016, -198259, -293235]
21806b93235o3010n2202N1714P4762M2288J82718P495P1750N877j15582P1052
21795a6373m0493K48138l9513n6720k76545l20064k0168J69888Q4873j03901J3849
21784c57029K35067k8220q3212m6303J16783J1421L4715r84r6725n989L07626
21773H7150j44800k12076j3544J13273J00732j72256l19391R3467K60191R4470
21763a12784L84309j15352k38573n9446L8487O7205n9854j34021j07173L11849
21753b5353L06782k9935o2513M3469j87299k44916k21148M6283J65618L46059
21743A37047J83344j04925k69330j21264l2881r0698m3908J60860J08809p6468
21733a49414k61705L52783N9804m4412j90945J8379j14463k23168p6176O4328
$$ y = [-293235, -356245, -408447, -356733, -281971, -239683, -56965, -49470, 22280, 28157, -87425, -16373, -56866, 191272, 151759, 95039, -181506, -501570, -521738, -351850, -266977, -370878, -357029, -121962, -150182, -233394, -279697, -162914, -151493, -116778, -117762, -214487, -220476, 87150, -57650, -269726, -283270, -169997, -69265, -241521, -560912, -467445, -207254, -112784, 271525, 156173, -82400, -141846, -103359, -36154, -96008, -230029, -337202, -25353, 281429, 251494, 188981, 232450, 45151, -199765, -420913, -374630, -209012, 137047, 320391, 215466, -53864, -175128, -208009, -298707, -342615, -181755, -72946, -149414, -411119, -58336, 1468, -42944, -233889, -215510, -329973, -553141, -629317, -564989]
21723e64989n797K60031L06184J94542p0497k08990o2136Q8547j31447o2335o2930
21712c19817L4619j4626N2754J67754L19816j65040k91212q486n5954n007K11277
21701g3922k2111m932r9900n381q4834r2943o785K15862M7371n8422l01152j83095
21689f70244j46334J20525K62499K05124m5070k9253J31947N8802m1726l9751
21679a93481K72558P2570l5363K07234O76l50555j39138j90592O1978J7179J10536
21668a66398m9498k07417K45919J73870j28538p155N6813J83012j83985J8450
21658f4927J024K17640n7784J30789K40585J09885M5643k70540k35062m9003l7821
21647C0429J34038k62439l75770r6185M1572J10951J41839Q5527K524N2182m329
$$ y = [-564989, -570786, -310755, -4571, 189971, 119474, -89516, -151652, -63105, -194552, -256887, -319817, -285198, -299824, -247070, -79316, 240500, 75460, -215752, -224238, -280192, -285199, -73922, -96033, -100965, -200865, -206246, -291080, -384023, -390808, -174946, -127575, -185997, -487149, -670244, -816578, -696053, -433554, -228430, -273500, -302753, -170806, -112004, -153730, -193481, 79077, 151647, 116284, 323518, 324194, -26361, -165499, -356091, -294113, -276934, -166398, -215896, -423313, -177394, -3524, -132062, -139217, -82404, 100608, -83377, -64927, -63903, 153737, 95953, 226742, 467327, 577212, 622855, 352315, 117253, 68250, 30429, 164467, -97972, -473742, -569927, -528355, -417404, -275565, -190038, -187514, -135332, -139661]
21636a39661m9604J10611O6718j190j9744l2502j73306j10757O8796K51777N6142
21625B7280J0467j23779j09739j44428k22604Q8867J83242n7879N1704J52069
21615a44800K79450q3073j42747O9833J20922j8280j01603R6442J6828J67455
21605B60427l08660k04582n7943M9601j1272j28701J62851K94563N732n9636m6659
21594d4279L45017l8399l09118j82083j25607k6934q0505J22160K5020L24257
21584I529o6308j39110j9761K16785O6515k80461j54511J11325K06393R1375j03056
21573f1285O9479m3952j74739j78622j67497K90720J55485j49825m29422j72270
21563h61928M0102O1969p031K38045j96308m8514J84090K04234K03194J52271
$$ y = [-139661, -189265, -78654, -11936, -13126, -32870, -65372, -238678, -349435, -280639, -28862, 27280, 37747, -86032, -195771, -340199, -562803, -473936, -290694, -348573, -296869, -144800, 134650, 51577, -91170, -21337, 99585, 81305, -20298, 76144, 92972, 260427, -48233, -252815, -310758, -261157, -272429, -401130, -238279, 56284, 62016, 2380, -44279, 300738, 262339, -46779, -228862, -354469, -381403, -461908, -339748, -314728, 9529, -56779, -195889, -215650, 1135, 67650, -212811, -367322, -255997, -49604, 41771, -61285, 8194, -35758, -210497, -389119, -556616, -265896, -110411, -260236, -689658, -861928, -821826, -759857, -766888, -528843, -725151, -773665, -589575, -385341, -182147, -29876]
21553b9876k9884o7413o9618k3473k2078j30273j26762M8876L6049J57546J59401
21542i7505m6809l1744j975K13630j69836L3452n0537K8683j07610J77255K80153
21531B27157j06592m50728k50015J74094K43731k05955o9597J00480J09649J88074
21521c9702N6133j10512j21415L8976j3471J28155J31225q382J10321J00218K9106
21510C00652J7900K5217j12773k37755j80546o8654K4141j35128o4538P6605L5217
21499c19662L9227K2432L11084R6426J8325J7351k26549N7090P7142j52952j08537
21488a68623n2553j03223J4411p3606K14124L5547q7106k1032K55538K15229L1240
21477B59946Q9588k26075l70263M6819K87019R2687j7836p2491l40884O6938Q0766
$$ y = [-29876, -59760, -127173, -196791, -220264, -242342, -372615, -499377, -450501, -414452, -256906, -97505, -144314, -176058, -178033, 35597, -134239, -100787, -151324, -122641, -230251, -52996, 227157, 120565, -330163, -580178, -406084, -162353, -368308, -437905, -337425, -227776, -39702, 16431, -94081, -215496, -176520, -189991, -61836, 69389, 61007, 171328, 271546, 300652, 318552, 343769, 230996, -6759, -187305, -255959, -231818, -366946, -431484, -354879, -319662, -280435, -258003, 53081, 149507, 167832, 185183, -41366, 15724, 92866, -60086, -168623, -221176, -324399, -309988, -383594, -169470, -133923, -221029, -242061, 13477, 228706, 259946, 349534, 123459, -246804, -199985, 87034, 179721, 161885, 89394, -251490, -184552, -103786]
21466a03786j7890j89593q6416k38311J17947K59378K28363j00125J8584J91717
21456G9868k41980l04222L02005K30184j62853k72621m4665L03253J80826j10303
21446d0508j53527L5046L7641J04463J37399J32440J08025K2625l28437J6986
21436G2153q0655j14264l53390P8581Q1815m0486p5804n7846L26301J41273R145
21425a3177j53434m2879p4748j03523n9792K13021K01624k24480m6139q6859p6951
21414d67337J19381K1138Q3488j38811n5770K27360K39103J02999k78875k37638
21404c84962m275M0510J5074j2424k8201R8039J81222R8326n2264j41431q0614
21393b71000k3912P315L2305O1758j54213j46560r362J70168Q1855l5939L8967
$$ y = [-103786, -121676, -311269, -397685, -635996, -518049, -258671, -30308, -130433, -111849, 79868, -162112, -466334, -164329, 65855, -96998, -369619, -414284, -111031, 69795, -40508, -194035, -158989, -121348, -16885, 120514, 252954, 360979, 383604, 55167, 72153, -8502, -122766, -476156, -397575, -315760, -356246, -432050, -489896, -163595, -22322, -13177, -166611, -209490, -284238, -387761, -447553, -234532, -32908, -257388, -303527, -390386, -467337, -347956, -326818, -243330, -382141, -437911, -210551, 28552, 131551, -147324, -384962, -389237, -348727, -333653, -346077, -374278, -276239, -95017, 3309, -48955, -190386, -271000, -294912, -287597, -255292, -193534, -347747, -494307, -503669, -333501, -251646, -287585, -248618]
21382b48618n9483j03795M8770N7586j46025o4410K08341Q8357l855j6034j54897
21371c94063j12846m6396r6902L2617K49436J41733p7241O2989r046K9191K18664
21360a864L8301k70800j65732j42912Q9244j6872j87113J56708J20238K42528
21350a38274K85340j6224l09429k29515J77659K00043J32780j80676L8371l7897
21340g7822j09305P9547K1823K4233j66557j86323j03744O5337J23507J98663
21330a30641J46464L8073N3149r4131j86051k4316J95598M3727p9786j43673L4321
21319a47266J30808j67391p6884k0327K10934R8049j53961k61113Q052K15298
21309a63801j92390j36565K90658n5028J24108j8052J48838J72466Q8256k40583
$$ y = [-248618, -308101, -411896, -363126, -305540, -451565, -515975, -307634, -219277, -223132, -239166, -394063, -506909, -553305, -650207, -617590, -368154, -226421, -303662, -240673, -249719, -220528, -1864, 36437, -234363, -400095, -543007, -453763, -470635, -657748, -501040, -380802, -138274, 147066, 130842, -178587, -408102, -230443, -30400, 102380, -78296, -39925, -77822, -187127, -107580, -85757, -61524, -228081, -414404, -518148, -452811, -329304, -130641, 15823, 53896, 107045, 12914, -173137, -197453, -1855, 41872, -37914, -181587, -147266, -16458, -183849, -260733, -281060, -70126, 27923, -126038, -387151, -379099, -163801, -356191, -492756, -202098, -257126, -133018, -151070, -2232, 170234, 258490, 17907]
21299A7907K0371k84347o7144O7594L9877L2025J49504J23301R2420J49712J17617
21288D58837j6456o1992k74047l02849j91890N703q7258K7826J02406J2885K84129
21277d2706k1700k96401p5135J59352K66698L4631j70510M7898P611p4711J38141
21266b6832M5506j38960l481j18773J1059J83844K10233j2295j80180O7816Q1564
21255A19501k04482r8232l23579k04227K01562L26006K93915j2809n6168J15916
21245A57403K3326N976M9272L08271j46337K7264k6451l40912n0026J29360P0732
21234B07878M7518j15760j22535m0644j60540j23833k02963j67358K34718J20338
21224c23181m7964J83365R0128R3559k54004M1877k32436q7202p4178O8056K61778
$$ y = [17907, 38278, -246069, -313213, -245619, -205742, -173717, -24213, 99088, 191508, 341220, 458837, 442381, 380389, 106342, -196507, -388397, -382694, -469952, -442126, -339720, -326835, -42706, -64406, -360807, -435942, -276590, -9892, 24739, -145771, -97873, -90262, -164973, -26832, 18674, -120286, -123767, -242540, -231481, -47637, 162596, 150301, -29879, 37937, 119501, -84981, -183213, -506792, -711019, -509457, -183451, 110464, 97655, 41487, 157403, 180729, 186705, 235977, 544248, 397911, 425175, 398724, 57812, 7786, 137146, 207878, 255396, 139636, 17101, -23543, -184083, -307916, -510879, -678237, -443519, -323181, -371145, -187780, -97652, -4093, -258097, -216220, -448656, -535858, -610036, -541980, -280202]
21213b80202n635P857j03691l1934L51634J3230p5102K1866p7653M7454n8178
21202a90354J2168J03245j19465j46753J22827q077N5732O518j18621J73814J31662
21191B2696J47311J17183j47424K8303J45051l38697P9145J59547k1157j77417
21181A4541r3092j40321r0052j17292m9025k2717R0067N5113M6234P94J41189
21170a64561K62322m8195l27839Q9622L7901Q787M5973q9373m3080j38090j30682
21159d97215k5685K9549Q5115J53984P1617q7636l0602P653n1084J7879K04535
21148a21890J04362j71147J87799l6075K8991P9777K1072J60943j37380j85145
21138f8693m0439L2880J00575j19496l6942Q9797Q8554j66910n6871M4955k24884
$$ y = [-280202, -285837, -277980, -381671, -413605, -61971, -48741, -123843, -101977, -179630, -132176, -190354, -178186, -74941, -194406, -341159, -218332, -226409, -170677, -164159, -282780, -108966, 22696, 170007, 287190, 139766, 168069, 313120, -25577, 53568, 213115, 191958, 14541, -78551, -218872, -308924, -426216, -475241, -497958, -407891, -352778, -306544, -305750, -164561, 97761, 49566, -278273, -188651, -150750, -141963, -95990, -185363, -228443, -366533, -497215, -522900, -493351, -408236, -254252, -182635, -270271, -300873, -293220, -344304, -326425, -121890, -17528, -188675, -876, -36951, -7960, 71817, 92889, 253832, 116452, -68693, -109132, -76252, 24323, -95173, -132115, -42318, 46236, -120674, -177545, -132590, -357474]
21127c57474K590J82993j2421n1862p7478k61972J48859K36067J9072L5629j20756
21116b56753p4077J81035L05964j36314J75891J98380n8470k51626P3380N0110
21106B07520m2790k29631j28658O2551J82186J73508K9406j10927L1025j05013
21096F9177L9743L8775j25203r50N7319j38813m1674j04843J12783J03928J3238
21085B3480j04744j2561K7764m8102L59221j18044p3682K6816M0551j05455j7052
21074a808j1017k10686j27267l987o7015K78921J29158r4134j65902Q5131J0214
21063a78392j37874K70811o588N1869J41090J16083j43618l25561P1698k17594
21053c58076J30P8432N6317J8702k7188r178J4622J32243K23469O9189k33813
$$ y = [-357474, -354884, -171891, -184312, -236174, -313652, -575624, -426765, -190698, -171626, -135997, -256753, -330830, -149795, 156169, 19855, 195746, 394126, 335656, 84030, 157410, 207520, 164730, -64901, -193559, -131008, 51178, 224686, 254092, 143165, 174190, 69177, 108920, 147695, 22492, 21542, 78861, -59952, -101626, -206469, -93686, 10242, 23480, -81264, -93825, -66061, -114163, 245058, 127014, 53332, 80148, 120699, 15244, -1808, -12825, -223511, -350778, -354765, -421780, -142859, -13701, -107835, -273737, -188606, -178392, -316266, -45455, -52043, -174, 140916, 256999, 113381, -212180, -140482, -358076, -357946, -279514, -223197, -204495, -231683, -240861, -226239, -93996, 129473, 198662, -35151]
21042c5151j26018j78061L4093q4117Q7420N6036L49772k58378l3222n5768J22261
21031a21133o0076M8101j83776j12358p6859q0709J71507j5246L0918k28578N7843
21020e70366J60612J83571J48027n2603Q0875r4357k82228M2640J847J88899J38115
21009e4968k4991j20401J11197k2669k29512j43422L31190J86546j80502j26115
20999b73647j24531M6334J20972J14729M04060q6909k5087p2267j62462j90009
20989b48817k14594J79012K1063J05618P7880P2120K627L92996Q568j78073q0872
20978A37528j85448P4958n8271j8892m1837K94468J4542k18780j63603j61715
20968c27050K2177R498K44943J45941k36687j34782j15934J43410J29342n7780
$$ y = [-35151, -161169, -339230, -305137, -389254, -301834, -245798, 103974, -154404, -187626, -243394, -121133, -181209, -133108, -316884, -429242, -506101, -586810, -415303, -430549, -399631, -628209, -570366, -409754, -226183, -78156, -130759, -49884, -144241, -426469, -383829, -381982, -193083, -54968, -79959, -200360, -89163, -111832, -341344, -484766, -153576, 32970, -147532, -273647, -398178, -351844, -230872, -116143, 287917, 201008, 175921, 103654, -58808, -248817, -463411, -284399, -263336, -157718, -79838, -7718, -5091, 387905, 396473, 218400, 137528, -47920, 27038, -31233, -50125, -91962, 202506, 217048, -1732, -165335, -327050, -304873, -295375, -50432, 95509, -141178, -275960, -391894, -248484, -119142, -176922]
20958a76922l3115J08020p8533j65688J14229K94709K17940k9818l48266j85729
20948b83173J74520K49909N1723q8669k28398k85410J38659L60992k45046j72504
20938c27397p3313l22182J11792L73574k2196j76972k8228N8091R7497k28694
20928e38028j01838L06947K12416r0270M7561K7900k20239l97140j23368M37972
20918d38087K53262j46302p2171J51558J04936J22324J2512k31260p300j2007
20908b62535J38566q8525J99115L360k8601Q0734M226j96540j24182Q6084J29416
20897e8882J77023J67063j96921n4537j52038n1312k95339j36384J82842J94243
20887b24242J28563J11808k08778k56209M4949J07495L71714K38442l39106k10581
$$ y = [-176922, -210037, -102017, -180550, -346238, -232009, 62700, 280640, 250822, -97444, -283173, -108653, 141256, 192979, 104310, -124088, -409498, -270839, 90153, -154893, -327397, -400710, -722892, -611100, -237526, -259722, -436694, -464922, -406831, -309334, -538028, -639866, -332919, -120503, -210773, -163212, -135312, -355551, -752691, -876059, -438087, -184825, -331127, -403298, -251740, -146804, -24480, -11968, -243228, -250528, -262535, -123969, -212494, -13379, -10019, -38620, 42114, 46340, -150200, -274382, -188298, -58882, 118141, 285204, 88283, 33746, -118292, -169604, -464943, -601327, -418485, -224242, -95679, 16129, -192649, -448858, -403909, -296414, 75300, 313742, -25364, -235945]
20877b35945q4908l5844j63752P2091J68475n9207K13097R4630j48357J26056
20867e3664O6172J64227R3718j79933j18499J2605J06838j57307M5249P9458k75767
20856b16903l7175L59104K60247j01101q2030j39524r0428n5058p8697o3920K1318
20845b24167J62372J68144j15571q4754J75205r5954J41161o2372o4435O6182
20835F5811J01090j804K25346j74292J36673j44159k94620Q9317j66827j34897
20825b98362J79699M1554k88402j7353R0320N8137R5387J9542m7477O5865r0809
20814a91899l02187k5790K38133q360j09527L42259Q1315L494J446j59846J6492
20803a14470K36967J3568l01840j62835K19195l2988j15449J16868j38066j47328
$$ y = [-235945, -320853, -356697, -520449, -448358, -279883, -339090, -125993, -31363, -179720, -53664, 12508, 176735, 270453, 90520, -27979, -15374, 91464, -65843, -20594, 58864, -216903, -254078, 105026, 365273, 264172, 182142, 42618, -47810, -102868, -181565, -245485, -224167, -61795, 106349, -9222, -93976, 81229, -14725, 126436, 64064, -371, 65811, 166901, 165097, 390443, 216151, 352824, 208665, -85955, 3362, -163465, -298362, -118663, -77109, -365511, -382864, -292544, -234407, -139020, -119478, -166955, -101090, -191899, -494086, -519876, -281743, -290103, -399630, -57371, 23944, 27438, 28884, -130962, -114470, 122497, 136065, -165775, -328610, -109415, -142403, -257852, -140984, -279050, -426378]
20793d26378k9079q821J77781K35635J63302O1398j79562j41036P1080J61612
20783H5932L33948j11353k43109m595p3494k15310k7762n6878J00405J30997K4832
20772e6387L9621N0728k01850p9396m4181N6244K39396o3935J19598j23752m1803
20761a05717j42667j44542m0308j16166K89532J00935j72219k03678M9565j25010
20751f10275J69896M39443M1085M6865k9308q6743m074j55866j12461J79724J16058
20740e656j85321l4666K57537n4851j44059J5202K89286q1238P1152m910j49083
20729b6607k03176j6338j56990j02240J75646K67691K3836l8653j56173k33400
20719d66404J22226J76389L2418l3983J04477l14051k17214m2562N4751R3868
$$ y = [-426378, -455457, -464278, -286497, -50862, 112440, 173838, -5724, -146760, -75680, 85932, 419880, 308527, 65418, 60823, -12671, -227981, -255743, -312621, -212216, -81219, -56387, -16766, 33962, -167888, -247284, -291465, -235221, 4175, -59760, 59838, -63914, -105717, -248384, -392926, -433234, -549400, -259868, -158933, -331152, -534830, -485265, -610275, -440379, -936, 40149, 87014, 57706, -29037, -33111, -188977, -301438, -121714, -5656, -190977, -225643, 31894, -22957, -167016, -151814, 137472, 56234, 127386, 122476, -26607, -229783, -246121, -403111, -505351, -329705, -62014, -38178, -76831, -233004, -466404, -344178, -167789, -135371, -169354, -64877, -378928, -596142, -638704, -583953, -490085]
20709d90085J24431J84920j6975j70930j49296L24898j0042J00094J556j15183
20699b16612n5587m0487P2264L11151Q4658K4779o2822n6544M9724P8810j62541
20688B6793Q3949j43847J4110R3624M0007J67190k03288n9117J92841Q2093k02200
20677I2155j28142p5479r5388L9746Q9931j68584k53117P205J20291K49197J03911
20666a8274j84999j43789j18358R2614j3969J85633R3508K46260L1380j04193
20656F5813J06169j7979j25800j00530R1459K28748r4908J4180j06422n2072k42087
20645b33429L6656m2592J28437j23185j36227R9758N4039k0774P8015K77083J06439
20634B24220P6826N0142j03864k22583j59840N0678K59473j97830j30589K07701
$$ y = [-490085, -365654, -180734, -197709, -368639, -517935, -193037, -203079, -102985, -101429, -216612, -272199, -312686, -240422, 70729, 155387, 180166, 117344, 60800, 110524, 189334, 26793, 110742, -33105, -18995, 74629, 114636, 281826, 78538, 19421, 212262, 294355, 92155, -35987, -111466, -206854, -167108, -77177, -245761, -498878, -491673, -371382, -122185, -18274, -203273, -347062, -465420, -372806, -386775, -201142, -107634, 138626, 170006, 65813, 171982, 154003, 28203, -72327, 19132, 247880, 152972, 167152, 60730, 8658, -233429, -196773, -239365, -110928, -234113, -370340, -270582, -216543, -237317, -159302, 117781, 224220, 301046, 351188, 247324, 24741, -135099, -84421, 175052, -22778, -153367, 54334]
20624E4334J2427Q5206J59164m2442l08141j46003n5604o8731J82628J9493J61926
20613E4257o0521M5822j1740j76835o4993M6466K7654k66569J95417J84984J77310
20602A51252R2224m7528j19180j28241n8157k23845K3421K30220j50109k12967
20592d42910k592J01182J08603k451o8658q537J49376J61230j5186j64024q2415
20581b66382m4334J5486o7858j86714K01265L38405j06596k51986j56099j08599
20571f33412R2499J60252J41333p730L1562J53596J23671o3084P8219P5241l1562
20560A20585j83225O511J41828j74465k99730q0753N3249R111R686J70469K28957
20549B223n7867O5950J23690j27556l38911k19742J71455J19988m919j05693N0641
$$ y = [54334, 66761, 151967, 311131, 268689, -39452, -185455, -241059, -309790, -127162, -107669, 54257, -6264, 39558, 27818, -149017, -214010, -167544, -139890, -406459, -211042, -26058, 151252, 243476, 195948, 76768, -51473, -109630, -333475, -310054, -79834, -229943, -442910, -445502, -344320, -235717, -238168, -306826, -315363, -165987, -4757, -19943, -183967, -266382, -310716, -295230, -363088, -549802, -348537, -10132, -116728, -368714, -524813, -633412, -540913, -380661, -239328, -247058, -215496, -61900, 61771, -1313, 76906, 152147, 120585, -62640, -56129, 85699, -88766, -388496, -469249, -416000, -406889, -397203, -226734, 2223, -55644, 10306, 133996, 6440, -332471, -552213, -380758, -260770, -265689, -371382, -320741]
20538c20741J16406j8882j60534k4316K50591Q970j60715q8861j2183L13211R2934
20527d120p9205p6464j52317j42776k01303P3267J23583J04753P2680J59722J08953
20516a3227k9760Q2968N3406j24770P1502n3429j19503K06825R9597K1402j12797
20505H2214j94422k27688J8914J7656J75279N4648p1639j21273j95028Q2572K02654
20494a76113n8480M7678J69217J32259n8263j32692k27840j83354m4959K19492
20484c13055J23158J64198k88549k14477n7279j32538K51673k3922L5252Q8211
20474c67328L03513J80168j8183j66340q8596p0569J35508J9560k00228J1589
20464b60906O3291j18916l21324j88383K10170L13079J89680R4325j34995k38401
$$ y = [-320741, -204335, -223217, -383751, -408067, -157476, -148506, -309221, -398082, -410265, -97054, -4120, -83325, -159789, -312106, -454882, -656185, -582918, -459335, -354582, -281902, -122180, -13227, -42987, 39981, 93387, -31383, 40119, -13310, -132813, 74012, 173609, 195011, 82214, -112208, -339896, -320982, -303326, -128047, -73399, -145038, -266311, -461339, -378767, -176113, -234593, -186915, -17698, 114561, 56298, -76394, -304234, -487588, -532547, -313055, -189897, -25699, -314248, -528725, -586004, -718542, -466869, -490791, -455539, -367328, -63815, 116353, 98170, -68170, -156766, -227335, -91827, -72267, -272495, -260906, -197615, -316531, -637855, -826238, -616068, -302989, -113309, -18984, -153979, -392380]
20454c92380J9741q719J02206K66875R2610L236p5559J00135o1634M694o0375
20443i170L2215l0388k50034j3477J52703L9823j81863q2607J23077P8145Q9451
20432e2125j01347R3023J4903k76559j70886J03115n352R6170J150o6949j1167
20421c76024K42016J30471j02378n6125j5303j44463k1246j42271J46271L7220
20411c01832m2527N3111J66680M3427J70562J5483k34173K2464R8909R739j21468
20400a19625p9403j00000m9286J80265k9331M3634M5544N8319j26669k87553R0003
20389c74102M80516m5936k86697j50177j09664J48357P4062j77605J28156J10947
20379b02143J10629m8272L8501N6313k6930j02522N9454R7544j2364j2115M3215
$$ y = [-392380, -372639, -381358, -279152, -12277, 80333, 83569, 8010, 108145, 46511, 51205, -9170, 23045, -7343, -257377, -270854, -118151, -78328, -260191, -342798, -219721, -141576, -52125, -153472, -60449, -45546, -322105, -492991, -389876, -395228, -299058, -297908, -364857, -376024, -134008, -3537, -105915, -162040, -177343, -321806, -343052, -485323, -339052, -301832, -344359, -291248, -124568, -81141, 89421, 104904, -129269, -106805, -7896, 1843, -119625, -199028, -299028, -348314, -168049, -197380, -153746, -108202, -49883, -176552, -464105, -374102, 106414, 60478, -226219, -376396, -486060, -337703, -263641, -441246, -313090, -202143, -91514, -139786, -101285, -44972, -71902, -174424, -114970, -17426, -29790, -41905, 1310]
20368A310m4765k07992O565Q3095J7611j27893J89032J02264j35180m7668k04234
20357c67855Q36K42930r4262k82208k0698q7892J73485J21630R354m4972J28537
20346b21115K52536j02088P5015R47q006k16861R3944K83718J24471k57822j54469
20335a29730K2534o8967J07382k095r4978k0279k3165M9542k40135J8457K04354
20324a77080K9679j64434Q2352R8653N6224L1364j04561Q7164k7097j61126m497
20313b53359p5664K2153J0819J22208K0179O018j79409L2871l6299o1997K14364
20302a78116J89113o3317k02884j24058M9861J32345Q712K311J4360q1370q9360
20291c42403J86017q5549k14329o4533R2483K51428J05256J97855J19635o6036
$$ y = [1310, -43455, -251447, -244882, -161787, -144176, -272069, -83037, 19227, -115953, -163621, -367855, -367019, -124089, -218351, -500559, -521257, -609149, -435664, -314034, -304680, -349652, -221115, 31421, -70667, 4348, 5295, -2711, -219572, -125628, 158090, 282561, 24739, -129730, -107196, -176163, -68781, -70876, -165854, -186133, -209298, -159756, -399891, -381434, -177080, -147401, -311835, -229483, -130830, -74606, -43242, -147803, -60639, -87736, -248862, -253359, -329023, -306870, -296051, -173843, -153664, -147646, -327055, -294184, -330483, -392480, -178116, 10997, -52320, -255204, -379262, -329401, -197056, -188344, -186033, -171673, -253043, -342403, -156386, -241935, -456264, -520797, -428314, -176886, -71630, 126225, 245860, 179824]
20281A79824k810J89796J12926j41368p5336j736l01736k89582n1349N6074L42124
20270A6827J13917p8297R519j0471J05154j4247J62304J49593J8365j31289k30177
20259A11198l39683k52706K6268j9355k87021q0260J35710J02818J14489J91907
20249b96635J24103N8388q6155M0658J69030M6402o4435J10603N2885j09958O6068
20238A10954O5313k1538m0060j71551l416Q4683L7605K06945M1304k73179k03405
20227a66345j86247J8845K6371K06204J05264p1807k14550J02412J76427K12194
20217B08768k0220k34489j2410j1735k677j07232q1266l5210J15087l2858J01522
20206a12720J34316k3090j12000l5582j75435n1479o4512K5439M91J72336L13147
$$ y = [179824, 177014, 366810, 479736, 338368, 263032, 261296, -40440, -330022, -381371, -325297, 16827, 130744, 52447, 61966, 51495, 156649, 142402, 304706, 454299, 472664, 341375, 111198, -228485, -481191, -454923, -474278, -761299, -841559, -705849, -603031, -488542, -296635, -172532, -114144, -200299, -159641, 9389, 55791, -8644, 101959, 154844, 44886, 110954, 176267, 154729, 114669, -56882, -60298, 24385, 61990, 268935, 310239, 37060, -166345, -352592, -333747, -307376, -101172, 4092, -67715, -282265, -179853, -3426, 208768, 188548, -45941, -58351, -70086, -72763, -179995, -261261, -296471, -181384, -214242, -112720, 21596, -1494, -113494, -149076, -324511, -375990, -440502, -415063, -414572, -242236, 70911]
20195G0911q34Q091J71847o5230m58741j99570O1754l9545K0678J02336J87298
20184a41005J92664j30096k94862P2262J67722J52629L0242r4969k0481Q0048
20174A4154J37586P9700r0534j16389J41998r4753j76888M0506m7940m9200O8269
20163i3491p6166K05700J78148o4149j7763p8741j44850N2255K35411n0827j71671
20152b6144J39943j96832q0544Q7708m7006r0116O5051J12363j78974J50818J85649
20141A21916J03719l8272j06453n8389N6234k64753J13164J84698R5997j66531
20131D1330j68463l7702O421K0714j86712j4516n8836j39561j97099K21184J80288
20120c32952J03198J62427J62578k20409J8885q4021J78270J48569l7282k93146
$$ y = [70911, 70077, 78168, 250015, 184785, -273956, -473526, -411772, -451317, -430639, -328303, -141005, 51659, -78437, -373299, -301037, -133315, 19314, 49556, -45413, -65894, 14154, 151740, 231440, 140906, 24517, 166515, 71762, -105126, -64620, -112560, -161760, -93491, -169657, 36043, 214191, 150042, 132279, 53538, -91312, -39057, 196354, 145527, -26144, 113799, -83033, -163577, -75869, -122875, -212991, -147940, -35577, -214551, -63733, 121916, 225635, 187363, 80910, 22521, 78755, -185998, -72834, 111864, 207861, 41330, -127133, -164835, -158414, -137700, -324412, -338928, -397764, -537325, -734424, -513240, -332952, -229754, -67327, 95251, -125158, -106273, -190294, -12024, 136545, 99263, -193883]
20110a93883j46511K56576n471o8631n8173J0403n9681J77443M3910m040k481
20099e0539L9893K1052J02609q7280J40886R2144K5386j4732O7864R5527j49309
20088B83501k95193j4185J73244N8455N158k64743k75634J59562Q0991J27011
20078C8167J02291L9427k02631n463R4840n5270K6009p538J1068j61215Q7368
20067c2947M5062k44514J52101J56732Q5797k56741j50347Q8709J50845Q7988
20057H2685K18233k19024o9358j38466l8248j8007J45411N5023j59888r5253J05845
20046a31047L7743j69592j3986Q7748O4723K7208K25954J03893k1694l13255j90644
20035b92949N4236M3399N185J09442J73036j18237k89321q4273O6529J4455J27449
$$ y = [-193883, -340394, -83818, -89289, -157920, -216093, -205690, -265371, -87928, -44018, -48058, -50539, -10646, 10406, 113015, 25735, 166621, 258765, 284151, 269419, 337283, 432810, 283501, -11692, -25877, 147367, 205822, 210980, -53763, -329397, -169835, -88844, 38167, 140458, 179885, -22746, -28209, 66631, 11361, 37370, 29832, 40900, -120315, -32947, 12115, -232399, -80298, 76434, 162231, -94510, -244857, -156148, -5303, 82685, 300918, 81894, 12536, -125930, -164178, -182185, -36774, 18249, -141639, -236892, -131047, -93304, -262896, -276882, -189134, -124411, -97203, 128751, 232644, 210950, -102305, -292949, -238713, -195314, -190129, -80687, 92349, -25888, -315209, -399482, -332953, -318498, -191049]
20024a91049L14360j01676j0415J37663j86378j01245L31897K21089j42296k43643
20014B8307q6404J5617R4723m7499J41398J62322N0559k66895j250m9024q9223
20003d7369R7819k95130O3243J64546j26358k58579k9778j37566o1963Q5101J63046
19992c82988J37896K8439k4539O911p3123J11340L05538K7822k05543j93930p103
19981b69280n8920K34381j9270K0128q9304J67102K60231J66912j27454j04396
19971A80130k10830r9593K06055P62j22099j57828J79152K28197L5677k03487
19961C6136q5591k16180j82058K03597K21529N7026l6311j59444m3714P3055m3100
19950a75055J39865J79858J23963L39584M18821R8724J01313j1026j47083j81529
$$ y = [-191049, 123311, 21635, 11220, 148883, -37495, -138740, 193157, 414246, 271950, 28307, -58097, -42480, 52243, 4744, 146142, 308464, 359023, 92128, 90878, 41854, -47369, 50450, -244680, -181437, -16891, -143249, -401828, -431606, -569172, -631135, -546034, -382988, -245092, -216653, -241192, -234281, -307404, -196064, 109474, 137296, -68247, -262177, -269280, -328200, -93819, -113089, -92961, -182265, -15163, 245068, 411980, 284526, 180130, -30700, -130293, 75762, 76524, -45575, -203403, -24251, 203946, 239623, 36136, -49455, -265635, -447693, -244096, -22567, 34459, -1852, -161296, -205010, -131955, -175055, -35190, 144668, 268631, 608215, 1027036, 1125760, 1227073, 1216047, 1068964, 887435]
19940H87435j16098J83775j51850k94124K0351j92083j06096K12700K09266J02908
19930G56184R8811J04585L66517J07210K8639q4664j10603l58771l15651j1196
19920E81061m0639O6862j45716k01004j44681k63762M483J20800k36252J23135
19910a35713K37483j52482j06131R1144m3930j36220j37563m0820j2138j73643
19900f10013l5573J22995J75967J21592j14607q0625n6216j11981O6069J79786
19890c42606K49019p0668J1604K23826r788L5212J59531M838p6617j503J4574
19879A97422p8440j66410j05698k05623m1535j74659J23733J26706O2426K27470
19869c4608L07693N7371l15563j21289l5699j03922j49097K8729m9011O079L03481
$$ y = [887435, 771337, 955112, 803262, 509138, 529489, 337406, 231310, 444010, 653276, 756184, 854995, 959580, 1326097, 1433307, 1461946, 1377282, 1266679, 907908, 592257, 581061, 540422, 607284, 461568, 260564, 115883, -147879, -143396, -22596, -258848, -135713, 101770, -50712, -156843, -65699, -109629, -245849, -383412, -424232, -436370, -610013, -645586, -522591, -346624, -225032, -339639, -420264, -476480, -588461, -522392, -342606, -93587, -164255, -152651, 71175, 61387, 96599, 256130, 260968, 184351, 182848, 197422, 118982, -47428, -153126, -358749, -400284, -574943, -451210, -324504, -262078, -34608, 273085, 330456, 14893, -106396, -142095, -246017, -395114, -366385, -415396, -409317, -105836]
19858a05836J82355O4553o8313k868j86217j48669L0396l1864l8918J15240j1585
19847b01726Q8748J78627m8189m2103j59698k00656P313K87145K65108j47935
19837B6634k35085K09120K79463J58118l51308j12743R4042j17520r391N0202
19827h468k9436k27865k38478J54197L39549Q6297k85931j77138j39993l1648
19817e58914J55892P5779J33230J70140J56068m0607Q6205k70389q5317R888L10675
19806A42650r5006l89124j07004j05520L22017J89681k2021j55132j65174J27314
19796b57319J84405j58375M0690q3139P7279J21946k2004l39323K40055q11k39319
19785d35915j63354n0108K56608k4544P3644O7775L1614O4412K61765J53906j88577
$$ y = [-105836, 76519, 141072, 72759, 69891, -116326, -264995, -234599, -266463, -305381, -190141, -201726, -112978, 65649, 17460, -24643, -184341, -384997, -377684, -90539, 174569, 26634, -208451, 669, 280132, 438250, 86942, -25801, 68241, -49279, -58670, -8468, -37904, -265769, -504247, -350050, -10501, 75796, -210135, -387273, -527266, -558914, -403022, -327243, -194013, -23873, 132195, 91588, 177793, -92596, -177913, -168025, 142650, 47644, -341480, -448484, -554004, -231987, -42306, -64327, -219459, -384633, -257319, -72914, -231289, -190599, -273738, -196459, -74513, -96517, -435840, -195785, -196596, -435915, -599269, -649377, -392769, -417313, -343669, -275894, -244280, -179868, 81897, 235803, 47226]
19774D7226m09912j05845P6114N2111J91985J32552j86690j55001j01678L14532
19764a44606J36368o6867r9675m1035j86437k43677K64222N9556r1827J36283
19754b77695o7786j25397J43950K19257o1016j8100J58131P8146n8065Q1589j7397
19743E5617N3505p353k76240M694J75545r5456J28447k14324j64063j07990K51576
19732a96042N0544O6667J09498K13986q5543k61438M2556q806p3132r4915q8328
19721c24953j46944K77037J08768J72158O1833l93598p1983K95638J62726j74840
19711c4158k67879p3117K63084n7416r079K683L0780K37746K55365L979O6883
19700D18871j95958j43550j70151J6051m0242j68507j9915J31276K74052K78839
$$ y = [47226, -362686, -468531, -392417, -340306, -148321, -15769, -202459, -357460, -459138, -144606, -8238, -75105, -174780, -215815, -402252, -645929, -381707, -322151, -413978, -277695, -345481, -470878, -326928, -107671, -168687, -186787, -28656, 49490, -8575, 73014, 55617, 109122, 101769, -174471, -169777, 5768, -89688, 38759, -175565, -339628, -447618, -196042, -145498, -78831, 30667, 244653, 159110, -102328, -59772, -68578, -141710, -236625, -324953, -471897, -194860, -86092, 86066, 147899, -245699, -317682, -22044, 140682, -34158, -302037, -375154, -112070, -169486, -178565, -175882, -145102, 92644, 348009, 351988, 418871, 222913, 79363, -90788, -74737, -114979, -283486, -303401, -172125, 101927, 380766]
19690C80766j18500p5689j1689K09589J13656j23022j64147k57793l6589J38368
19680E4950M4201j68761R1786Q5654j64987k1948J97715k06618m55810j943K51078
19669b94683K90973J37035j03857j60787J30641P1595j11367J4892O7505R548
19659E1495j73029J10460R2277K127m6554J82300J84595L0660m8977J16455m9168
19648D52641j06156j92107l47592K5782J51980K0518j39218J78508K69648K1717
19638C35721j9045l9516J0719j0306r6647k33132R0804J3885k34639J77084K14830
19627B09758k37182O8442J41752J28579n8207j2846K77196j40932k37049k42221
19617a02710k36468k5508j7668K66025K24996L7927j35399J0447J34941p6237
$$ y = [380766, 262266, 186577, 174888, 384477, 498133, 375111, 210964, -46829, -83418, 54950, 99151, -69610, 22176, 107830, -57157, -79105, 118610, -88008, -543818, -545761, -294683, -3710, 133325, 29468, -131319, -678, 70917, -40450, -25558, 41947, 51495, -121534, -11074, 81203, 83330, 36776, 219076, 403671, 434331, 385354, 501809, 452641, 346485, 154378, -193214, -167432, -15452, 5066, -134152, 44356, 314004, 335721, 316676, 277160, 287879, 277573, 180926, -52206, 38598, 52483, -182156, -5072, 209758, -27424, 41018, 182770, 311349, 253142, 240296, 517492, 376560, 139511, -102710, -339178, -364686, -382354, -116329, 108667, 146594, 11195, 21642, 156583, 80346]
19607H0346l29034j66298j18158m0950L8510J27128P7695j92432j0906O1621J64083
19596c08395J91579J52272j72770k87703j19774j32752J01487J86248J49310J25472
19586a15026J18342O0797k92379k9228J86969j4443Q1893K43091R4534K78059
19576F12609K8026m19657p5901K2716j04509j3594j29271M9681K81352J18411
19566C69863n8732r6213m4348j36080J56294J44701M0273j9012j73968j94135
19556a1357k6546p577O9139J50465K58090l2358j88944j65650j35247p3351q0394
19545b43730K53544K75800M5783j42590k35788O7091K74800p9364m5670Q42n2144
19534A18574q698j94231j16590M9157p6084J88477J32500J2139N5273K30929Q1598
$$ y = [80346, -248688, -414986, -533144, -574094, -535584, -408456, -330761, -523193, -534099, -472478, -308395, -116816, 35456, -137314, -425017, -544791, -677543, -576056, -389808, -240498, -115026, 3316, 64113, -228266, -257494, -70525, -84968, -3075, 240016, 334550, 612609, 640635, 220978, 145077, 167793, 63284, 49690, -79581, -29900, 251452, 369863, 311131, 214918, 170570, 34490, 190784, 335485, 375758, 356746, 182778, -11357, -37903, -45480, 23659, 174124, 432214, 399856, 210912, 45262, -89985, -163336, -243730, 9814, 285614, 331397, 188807, -46981, 20110, 294910, 215546, 169876, 170718, 118574, 109876, -84355, -200945, -151788, -227872, -39395, 93105, 105244, 160517, 391446, 473044]
19523D73044j93496k4535K3460n7841o7430L9178R1766J51524J05835p937j44502
19512C89066J63321J74370K1036j32835Q4322J931N2842k31322k4499J85332J64273
19501H47837N4613O6726j17419j22777J7436p7576K33661m7066n1768K2630Q3520
19490I09817j56155m4003j83907l2039Q8369J15763j3562Q0294K7307j70859j16845
19479E04180R834M5775Q1569K4417L8150j38959j51372j04636N3912N3549L1787
19468D48206J49390J88252k38989j59743Q4088J88561j04434r042j38475R0385
19458D98199K06409M8430l8687P0506J44370P7737P3964P4252q9568N3669J25556
19447A244837J32194J15737J56248K93694K35125j39423k3093J44910J31716l650
$$ y = [473044, 279548, 255013, 278473, 220632, 153202, 192380, 284146, 435670, 541505, 533568, 389066, 552387, 726757, 747793, 614958, 699280, 701211, 754053, 522731, 498232, 683564, 847837, 902450, 969176, 851757, 728980, 746416, 668840, 902501, 855435, 803667, 826297, 909817, 753662, 709659, 525752, 493713, 582082, 697845, 684283, 764577, 791884, 621025, 504180, 514014, 559789, 641358, 665775, 703925, 564966, 413594, 308958, 362870, 416419, 448206, 597596, 785848, 546859, 387116, 471204, 659765, 555331, 546289, 407814, 498199, 704608, 753038, 714351, 784857, 929227, 1006964, 1080928, 1155180, 1065612, 1119281, 1244837, 1377031, 1492768, 1649016, 1942710, 2177835, 2038412, 2015319, 2160229, 2291945, 2288295]
19437B288295K00457J19985N7465J75508K12406L13407M08507K02555K18775J87032
19427D384392K90720K75024M51063M90845K99458L20649J78200J48005K95059
19418G133415K19549N30262N34774M45858N06917Q55730J483863J481793J624024
19409A4816185J663411J888112K036506K458644K983835L446540L614587M399777
19401C7307597N839553P477378R701900J3176237J7726801K3116092K6980562
19394A41326120K8317652K7041515K2039327J1792190J790070k579957m253333
19387B25473584j0262059k1451814k7669991k4187167j6651266r008163k244823
19380A13998301M360748J1115034J7990354K3149307K4988196K2961767J6805895
$$ y = [2288295, 2488752, 2608737, 2666202, 2841710, 3054116, 3367523, 3776030, 3978585, 4197360, 4384392, 4675112, 4950136, 5401199, 5892044, 6191502, 6512151, 6690351, 6838356, 7133415, 7352964, 7883226, 8418000, 8863858, 9370775, 10226505, 11710368, 13192161, 14816185, 16479596, 18367708, 20404214, 22862858, 25846693, 29293233, 32907820, 37307597, 43147150, 50624528, 60326428, 73502665, 91229466, 114345558, 141326120, 169643772, 196685287, 218724614, 230516804, 232306874, 229726917, 225473584, 215211525, 193759711, 166089720, 141902553, 125251287, 116243124, 113998301, 118359049, 129474083, 147464437, 170613744, 195601940, 218563707, 235369602]
19373B35369602N513255l626873p335600r645695j6078084k7342308l2857430
19366A43996867k9692369k3194606j7123476j2621411r303580o860761n481981
19359C9718683m080519l421171k762965k507937k126773j812475k072565j554954
19351A9379324j508096j366311j143907j154870j102655q55224q83825p26885
19343A0637551o65483m78621m3261J18812r343m61700m16751m91126l42422o54676
19333G192980m36751l84730m47652n18360k46147j77802j00218k53545l52755
19324D275020l09792P9858n5220o6258j40842j35709j07013l26401k75085l3473
19314B905085q050p7705j69940j34238J23763j55441p5485j91366J0308J0489
$$ y = [235369602, 240882857, 237255984, 229920384, 220274689, 204196605, 176854297, 143996867, 114304498, 91109892, 73986416, 61365005, 52061425, 45200664, 39718683, 35638164, 32216993, 29454028, 26946091, 24819318, 23006843, 20934278, 19379324, 17871228, 16504917, 15361010, 14206140, 13103485, 12248261, 11364436, 10637551, 9972068, 9493447, 9450186, 9568998, 9559655, 9097955, 8681204, 8190078, 7847656, 7192980, 6756229, 6371499, 5923847, 5405487, 5159340, 4981538, 4881320, 4627775, 4275020, 3965228, 4045086, 3989866, 3923608, 3782766, 3647057, 3540044, 3213643, 2938558, 2905085, 2897035, 2819330, 2649390, 2515152, 2638915, 2483474, 2407989, 2216623, 2226931, 2237420]
19304B237420J41424n1633j15373M4637K46061M0182l75352j12644K7708J42398
19294B224828N7830p6314k195m1543j29740L7817N4038n3290k14470p7736j90364
19283A588861R9220O281N2339k76142k71508K29514J6055k84111O9869O6491q5915
19272A210954M7472j02471k29515J52188K31575P4783k0002r7253j52378l4018
19262A081335L38517J47485N5469k7850j00247k97871l58337p668m446L867p5968
19251G54286k5597O8117K46543M8872J02351L3642k25183l3167J62549l13200
19241H19213m44532n2811Q5646j40683j39675J88475J66830m7750j27555P7683
19231C84841j41314l07750J0909K05381J15443K01809K33425J20124j28619j59075
$$ y = [2237420, 2378844, 2327211, 2211838, 2256475, 2502536, 2542718, 2167366, 2054722, 2082430, 2224828, 2282658, 2206344, 2204149, 2162606, 2032866, 2070683, 2124721, 2071431, 1856961, 1779225, 1588861, 1688081, 1694362, 1746701, 1470559, 1199051, 1428565, 1444620, 1160509, 1230378, 1296869, 1210954, 1258426, 1155955, 926440, 1078628, 1310203, 1384986, 1364984, 1267731, 1115353, 1081335, 1419852, 1567337, 1622806, 1594956, 1494709, 1196838, 838501, 830833, 826387, 830254, 754286, 728689, 796806, 1043349, 1092221, 1194572, 1228214, 1003031, 969864, 1132413, 819213, 374681, 321870, 407516, 266833, 127158, 315633, 482463, 434713, 307158, 384841, 243527, -64223, -53314, 152067, 267510, 469319, 702744, 822868, 694249, 535174]
19221E35174l8528K39858L62587k5162l23852j75076O3124J1665k21498j29259
19211B99033J35440L1473l6291N9930M2184k49486n5100J44986J65729R1532j58963
19200D70467k45516N8293L63431J37801k28796j24466q0431J1520Q2250J92711
19190F37264q6590j66837L2935j43038k16022p1385J0063J94214j7222J24499
19180B97881L64954J36340j23442j75486r9333j17010M3311J22724J3432k80328
19170A83043m3818J38668K38040J01134p574j50021j67440j12887k62992J34803
19160E0956L83582J36177j28374j70519j31516J81292J1422q2536j33867j89275
19150g2658P7519p3713n8136J24068K36508K39818J43780n0657j86664l47249
$$ y = [535174, 496646, 736504, 1099091, 1073929, 750077, 575001, 638125, 649790, 428292, 299033, 434473, 465946, 429655, 489585, 531769, 282283, 227183, 372169, 537898, 629430, 470467, 224951, 283244, 646675, 784476, 555680, 431214, 350783, 362303, 444553, 637264, 550674, 383837, 416772, 273734, 57712, -13673, -3610, 190604, 173382, 297881, 662835, 799175, 675733, 500247, 400914, 283904, 327215, 449939, 463371, 183043, 139225, 277893, 515933, 617067, 609493, 459472, 292032, 179145, -83847, 50956, 434538, 570715, 442341, 271822, 140306, 321598, 333020, 250484, 116617, -72658, 4861, -68852, -126988, -2920, 233588, 473406, 617186, 566529, 379865, 32616]
19140C2616j6742J10652o972N4222j2742J8965J06281L5468n2833L0850o557k5760
19128B67448j38996J20099j4452J40749j07631J07319q8213O2611J19386K6160
19118D94480o7057Q6354L8228j13577J29598p0345j4747o059o5560J33886j42082
19107D03119n4651k5909j6604j55187q2913N9739q3789k06778N2219J57145j64782
19096a18391q3797J22793K88405j6082k12316j6366J96947j54966k81312n5173
19086c30258M12630M18930j82439k83931o7035O4859n8930K15666M869R5702K17121
19075E07184j55391j03988k4727o1961n9298J63255K04060J19544K0002p0392
19065E38288k23861k94817j72347J06130K829o8570J66249K95335L34784M6952
$$ y = [32616, 15874, 126526, 119554, 173776, 161034, 179999, 286280, 321748, 268915, 299765, 293208, 267448, 128452, 248551, 234099, 374848, 267217, 374536, 286323, 348934, 468320, 494480, 427423, 513777, 552005, 438428, 568026, 497681, 482934, 476875, 411315, 545201, 403119, 348468, 322559, 305955, 150768, 67855, 127594, 43805, -162973, -110754, 46391, -118391, -202188, -79395, 209010, 192928, -19388, -35754, 161193, 6227, -275085, -330258, 82372, 501302, 318863, 34932, -32103, 32756, -26174, 189492, 194361, 290063, 507184, 351793, 247805, 223078, 161117, 101819, 265074, 469134, 588678, 608680, 538288, 314427, 19610, -152737, -46607, -43778, -112348, 53901, 349236, 684020, 730972]
19055G30972r3674j39242r6502J58307O8107j85429j76967J17926k1951k09741
19045A51806K78966J19493k65072n5934J27391k9433j58254j31884J0961L9859
19035H7899Q3400K66112K23044k691j02771k24669L185j63987m213K37386O4807
19024D67502j15252q5969n8520j41167j7927O68l8196k8458l04938L1828Q7251
19013b03178L1337M9389J41546J97579K13941J30635r6733l308k15097k12001
19003C4110J55013J9038k11275j33840J56038K34287R5981l20461k21383J60626
18993c1866J08647L6716J85123m4508k43368O159J41806J57632j06904J14753
18983C24190J92568L9092m4586M3543m2567K87301K66367J27322J70469N0086
$$ y = [730972, 637298, 498056, 401554, 559861, 627968, 442539, 265572, 383498, 361547, 151806, 430772, 550265, 285193, 229259, 356650, 327217, 168963, 37079, 48040, 87899, 171299, 437411, 660455, 657764, 554993, 330324, 333509, 169522, 165309, 402695, 467502, 352250, 266281, 207761, 66594, 48667, 49335, 11139, -17319, -322257, -290429, -203178, -171841, -122452, 19094, 216673, 430614, 561249, 464516, 461208, 246111, 34110, 189123, 208161, -3114, -136954, 19084, 253371, 349352, 28891, -192492, -31866, 76781, 113497, 298620, 254112, 10744, 16903, 158709, 316341, 209437, 324190, 516758, 555850, 511264, 554807, 512240, 799541, 1065908, 1193230, 1363699, 1413785]
18973A413785k57814j89683L9020j90387j45889J1195J36475j65760q4151j06724
18963D60067q0336J08341j61115r3245K29747m0729o5727O3224L4531N788l03469
18952A57077l05216K95118J01871j26841J04434R8009K742j0556k28021M9556
18942A38173K87028r1649J93908j43700o6685l6933J27163J53307Q9918q7398
18932E63132n8696J27312J08160r4326o7783R8085O4152J26455O7561Q8613J02757
18921A125422K12646k0730K3075R047k19322j39365M7049l87714j34116j52481
18911C63511O3356o9195j25293K14062R6827L1197k11279k32829k7886k05823
18901a03352k24449k31066J51585K39831K81254M2413J20405l81012j98604R5934
$$ y = [1413785, 1155971, 966288, 1005308, 814921, 669032, 680227, 816702, 650942, 566791, 460067, 379731, 488072, 326957, 233712, 463459, 422730, 357003, 420227, 454758, 460546, 157077, -148139, 146979, 248850, 122009, 226443, 324452, 327194, 316638, 88617, 138173, 425201, 333552, 527460, 383760, 317075, 280142, 407305, 560612, 650530, 563132, 504436, 631748, 739908, 645582, 577799, 675884, 740036, 866491, 934052, 1022665, 1125422, 1338068, 1317338, 1340413, 1349460, 1130138, 990773, 1037822, 650108, 515992, 363511, 426867, 357672, 232379, 446441, 543268, 574465, 363186, 130357, 102471, -103352, -327801, -558867, -407282, -167451, 113803, 156216, 276621, -104391, -302995, -207061]
18891b07061R1829J72855J98516K7925K1201J22861j7901o7888j47320K78003
18881D73020j44873j9379m7586j89129J55188L3508q4114J73289K0859N6758j23988
18870C03553K6631M2614j52556m1350p8733J31440J8856j10959j9143m9659r4155
18859b3461K3243K12937K44983N5264R6078j97161j42382o2797o1848J45974J34404
18848D25234j23434q5300J19469l9696J79182K05246n9366J59187M46562M08769
18838A635853L22620k4374j40458L66267K69470J14331R1750k50753j94172k15287
18828A975247r3792l04834k24908p8662r6244k9244K00729J19806j45985J97968
18818A520081L32058K41886O456J05710m4644K1535L08359J59955R5968k43280
$$ y = [-207061, -115232, 57623, 256139, 284064, 305265, 428126, 410225, 342337, 195017, 473020, 328147, 308768, 261182, 72053, 227241, 260749, 176635, 349924, 370783, 427541, 303553, 330184, 372798, 220242, 178892, 100159, 231599, 250455, 139496, 120353, 70694, -23461, -218, 212719, 457702, 512966, 609044, 411883, 269501, 206704, 144856, 290830, 425234, 301800, 216500, 335969, 296273, 475455, 680701, 621335, 780522, 1227084, 1635853, 1958473, 1934099, 1793641, 2159908, 2429378, 2543709, 2635459, 2384706, 2190534, 1975247, 1881455, 1576621, 1351713, 1273051, 1176807, 1147563, 1348292, 1468098, 1322113, 1520081, 1852139, 2094025, 2100481, 2206191, 2161547, 2183082, 2491441, 2651396, 2747364, 2504084]
18808B504084n90529n33626k47918j67770P3376k50615j90672N5074r8239j23119
18798D30046J06890j65232l0364Q3950j23221K38738P085k65392k1199J64368
18788D25669J91333j31363r1524R9568j46755l4678K4148j6712J34343j04058
18778C49971j48173j57400J68955M22380J92198O3914J76841R8948J52875K08615
18768A529124K30227L62040J54320k87536n28496l55571n79637k93442r404q8401
18758A33224j32305P0779q5531O4169K52149Q6229P187j30597k21704k9362K53564
18747B67802K46491J19623j21963j19832r7057K909k28639M7141L20288N4151
18737D90914j1793Q9235O0575J55727J3323n8307N7677K2452K20061K26527J77943
$$ y = [2504084, 1913555, 1379929, 1132011, 964241, 1037617, 787002, 596330, 651404, 553165, 430046, 536936, 371704, 341340, 425290, 302069, 540807, 547892, 282500, 261301, 425669, 617002, 485639, 394115, 493683, 346928, 312250, 336398, 319686, 454029, 349971, 201798, 44398, 213353, 635733, 827931, 891845, 1068686, 1167634, 1320509, 1529124, 1759351, 2121391, 2275711, 1988175, 1459679, 1104108, 524471, 231029, 221625, 133224, 919, 71698, -13833, 50336, 302485, 388714, 395901, 265304, 43600, 14238, 267802, 514293, 633916, 511953, 392121, 295064, 297973, 69334, 116475, 436763, 490914, 479121, 568356, 628931, 784658, 797981, 739674, 797351, 819803, 1039864, 1266391, 1444334]
18726A444334K37915r3733k07944P8749K1513r2565j13031j740J20838j87424
18716A206912k31663M5494k22852j59550M7560k15866k46932K04018R9052J1425
18706E37598J03002o9436l20443k19699p152M10157K07472m3531J77875K31928
18696A007771J69150L2525K58700j0769m26251k21661J58283L8711j25448J17247
18686I98258K09753j56862j89898l89754k25863M0221K2122j7131J38487j96704
18676B32629r1052K50383K51189K2993j97147k46688K86047L75969j54632j0370
18666G19321o892o2115r9963j79098J94472J34519j83618j08022R9915O3685R427
18655E81631N3082o3573p5536K15088j25489k63892j36058R4268J25294j29279
$$ y = [1444334, 1682249, 1588516, 1380572, 1459321, 1480834, 1388269, 1275238, 1273498, 1394336, 1206912, 975249, 1020743, 797891, 638341, 685901, 470035, 223103, 427121, 526173, 537598, 640600, 571164, 250721, 31022, 23870, 434027, 641499, 597968, 775843, 1007771, 1176921, 1209446, 1468146, 1457377, 1031126, 809465, 967748, 1006459, 881011, 998258, 1208011, 1051149, 861251, 471497, 245634, 285855, 307977, 290846, 429333, 232629, 141577, 391960, 643149, 666142, 468995, 222307, 508354, 884323, 729691, 719321, 712429, 650314, 550351, 371253, 565725, 700244, 516626, 408604, 508519, 572204, 581631, 634713, 571140, 495604, 710692, 585203, 321311, 185253, 279521, 404815, 275536]
18645B75536J0121m018m0900K67481J8622o012r729j65638L4987M2502K612N1632
18633D77196j24779N0714O3301J15700K7039j2645J16756r7412K2703J13603K6701
18622G78877q1040K17879j90515j58486K848q1946j09376P7904J07961p9723l7798
18611D46585q3013J29986l9909n8580M2664J53118L69829J27631j9789j96088
18601H72434J975K32016N7432j25531p0059j4889K29417J87004j65743j9624Q1577
18590A266009J04903k16184j69145j59600k80431P4378K4144o6630O1588J66467
18580H05499J60774L0310j7042R7932J3136r4012p7280k177q1543j4510J05390
18569I26477q9638l121j22535m699N9322O9700p2058J91611p9159k496J75033
$$ y = [275536, 285657, 281639, 240739, 508220, 526842, 520830, 511101, 345463, 380450, 422952, 425564, 477196, 352417, 403131, 466432, 582132, 609171, 596526, 713282, 615870, 638573, 752176, 778877, 697837, 915716, 725201, 566715, 569563, 487617, 378241, 456145, 564106, 484383, 446585, 363572, 493558, 453649, 395069, 437733, 590851, 960680, 1088311, 1068522, 872434, 874409, 1106425, 1163857, 1038326, 968267, 953378, 1182795, 1369799, 1204056, 1184432, 1266009, 1370912, 1154728, 985583, 825983, 545552, 619930, 644074, 577444, 639032, 805499, 966273, 996583, 979541, 1077473, 1090609, 996597, 919317, 917140, 835597, 821087, 926477, 836839, 833718, 711183, 706484, 765806, 835506, 763448, 955059, 875900, 873404, 1048437]
18558A048437j04758p8693L8583r2236J90905R4557J17635K06947Q9730L3508
18548A544615m0745k40974l2023L27866K24128J13551j15192P9914Q7594M3945
18538A992679J2362k24059j16400J55846L38307j22768j96590k39613M6323m6604
18528A599483K667p1898j70152J64110J93691K43810l0635m1170N5587n366L4225
18517A974352J7697J06299J7142J18167J87328q9782K4662J3709M6716J01570
18507B517860N2296J49107K82312L43307M23656R0417J67644J84728K29297L50049
18497D790673N52286K74920N97165N35509L02046L06620O34299O71478P64119
18488I429115R74219J033712J508263J535876J760799K283465L005202L662553
$$ y = [1048437, 943679, 864986, 903569, 811333, 1002238, 1096795, 1214430, 1421377, 1511107, 1544615, 1503870, 1262896, 1230873, 1558739, 1782867, 1896418, 1781226, 1861140, 1948734, 1992679, 2005041, 1780982, 1664582, 1820428, 2158735, 2035967, 1839377, 1599764, 1646087, 1599483, 1602150, 1530252, 1360100, 1524210, 1717901, 1961711, 1931076, 1889906, 1945493, 1940127, 1974352, 1992049, 2098348, 2115490, 2233657, 2420985, 2331203, 2355865, 2369574, 2416290, 2517860, 2570156, 2719263, 3001575, 3344882, 3768538, 3858955, 4026599, 4211327, 4440624, 4790673, 5342959, 5617879, 6215044, 6750553, 7052599, 7359219, 7993518, 8664996, 9429115, 10403334, 11437046, 12945309, 14481185, 16241984, 18525449, 21530651, 25193204]
18480B5193204M568189N654287P661136R898337J3719710J9325467K5078167K9749613
18472A40848110L0580876K8608851K1319243O144681m903869o752983p349793
18465B08495116j5653028l0220659l6271008l0468913k2100887j5497295j0844213
18458D7439113q047051o118232m682375l499226k757385k248588j370027j052520
18450A7663709j047450o62377q09233n31151j81578l01967q8390j4055O9453J02413
18440A4199374K62138K24194R760M31856N98325M06691P79654J087111J207685
18431A9206788J612069K240145K530910L550262M622648N776246P370375R408376
18423E6317819J2657437J7524642K4049187L0961603L5084375L4318622L0721176
$$ y = [25193204, 29761393, 35415680, 43076816, 52975153, 66694863, 86020330, 111098497, 140848110, 171428986, 200037837, 221357080, 227501761, 222597892, 215844909, 208495116, 192842088, 162621429, 126350421, 95881508, 73780621, 58283326, 47439113, 39392062, 33273830, 28591455, 25092229, 22334844, 20086256, 18716229, 17663709, 16616259, 15953882, 15144649, 14613498, 14431920, 14129953, 14041563, 14027508, 14096961, 14199374, 14461512, 14685706, 14695466, 15127322, 15725647, 16132338, 16911992, 17999103, 19206788, 20818857, 23059002, 25589912, 29140174, 33762822, 39539068, 46909443, 56317819, 68975256, 86499898, 110549085, 141510688, 176595063, 210913685, 241634861]
18416B41634861J9135274J357796p612969q035517j0692349k3815782l9138742
18409A72832572m0546067l1772859k2746794j6269322j1492853q210212o322737
18402C5471728n164717m002271k865526k312506j900115j496894j329466r50463
18394A5449770r43433q28363o80785o37697p17311o81629m96955p19740q38457
18385H905400o93831k07158k77998l34999k26963k29274q8623k34639k94145j22674
18375F195096j15877p3379j52253j39364j3823M2899j50707j86504k36684K3735
18365E193139K19378K39509k0509J57174P9956k3231N2450K79604o8492J04178
18355F213156J81994J25684L43975K13164K05644K30109Q4043L1317K54016K48652
$$ y = [241634861, 260770135, 262127931, 254514962, 246479445, 235787096, 211971314, 172832572, 132286505, 100513646, 77766852, 61497530, 50004677, 41794465, 35471728, 30307011, 26304740, 23439214, 21126708, 19226593, 17729699, 16400233, 15449770, 14506337, 13677974, 12997189, 12359492, 11642181, 10960552, 10463597, 9743857, 8905400, 8211569, 8004411, 7726413, 7391414, 7164451, 6935177, 6846554, 6611915, 6317770, 6195096, 6079219, 6005840, 5853587, 5714223, 5700400, 5743299, 5592592, 5406088, 5169404, 5193139, 5412517, 5652026, 5631517, 5788691, 5868647, 5845416, 5897866, 6177470, 6108978, 6213156, 6395150, 6520834, 6864809, 7077973, 7283617, 7513726, 7597769, 7629086, 7883102, 8131754]
18345H131754L07975K18046L67026L26930M98055P92312Q56474R79774R10399
18336A3388745R59704J275018J811397K449977K500125L107294L663329M326534
18328C3482123N164073O534571Q663773J1738108J6978669K3586963K7739389
18321A33887669K6685624K2853092J2857290p920445j6243103n506894P804554
18314A74417787J3679145J2528455O117932j4955730l4880409l3342794k3225742
18307A00338644j4084039p843440l632132M57235M506774Q831346J5235918K2951705
18299A26762011K8217826K7491226K3295247J3587898q981915j9791483r131397
18292A81449413N724795J2669745J1103252M378087j6786533l9663880l9483632
$$ y = [8131754, 8439729, 8657775, 9024801, 9351731, 9849786, 10642098, 11498572, 12478346, 13388745, 14348449, 15623467, 17434864, 19884841, 22384966, 25492260, 29155589, 33482123, 38646196, 45180767, 53844540, 65582648, 82561317, 106148280, 133887669, 160573293, 183426385, 196283675, 188363230, 172120127, 166613233, 174417787, 188096932, 200625387, 206743319, 191787589, 156907180, 123564386, 100338644, 86254605, 78411165, 74779033, 75236268, 79743042, 88574388, 103810306, 126762011, 154979837, 182471063, 205766310, 219354208, 210372293, 190580810, 181449413, 187174208, 199843953, 210947205, 215325292, 198538759, 158874879, 119391247]
18285A19391247k9085749k0046752j3820266r619337o779089n052988l936889
18278C1050177l327438l041579k486913j610413j536244j521900j479859j140944
18270A4904887p16750n64043m32114r09198q68429n92580m75536m34585l12160
18261I599492o20895n14754m58567j38802j74383j52848k48954m67362n05373
18252F317554l79565j08646q4492j31807j47043l22982k01505j44271j74804K1287
18242D643726O6227K07903r0448k95231m5340o569n5000J40784m1282k07724j36200
18231D180846O4325K09905O6246k27495k06556K00560K67908j14469j12671Q4543
18221D413142J85934j75413k44179l26515n2416o435l08882k43365n7894P6435
$$ y = [119391247, 90305498, 70258746, 56438480, 46819143, 40040054, 34987066, 31050177, 27722739, 24681160, 22194247, 20583834, 19047590, 17525690, 16045831, 14904887, 14188137, 13624094, 13191980, 12282782, 11414353, 10821773, 10346237, 9911652, 9599492, 8978597, 8463843, 8005276, 7866474, 7692091, 7539243, 7290289, 6822927, 6317554, 5937989, 5829343, 5744851, 5613044, 5466001, 5143019, 4941514, 4797243, 4622439, 4643726, 4709953, 4917856, 4827408, 4532177, 4486837, 4480268, 4425268, 4566052, 4524770, 4317046, 4180846, 4245171, 4455076, 4521322, 4293827, 4087271, 4287831, 4555739, 4441270, 4328599, 4413142, 4599076, 4423663, 4179484, 3852969, 3800553, 3794118, 3485236, 3241871, 3183977, 3260412]
18211C260412J23016r870J35675J811Q7495J80298O2859J09965K16845J39533
18201D308039j40217k06275j84060K1320J59755O060j30029l4866J30430K8035
18191C958192j99680k49877Q30J00571K28472J99068P3923m3956J5117L91989
18181D474649L14616K80017l6794J19987J06964M25644N35819K26249L13034K32091
18171F992276M05994N55053N01428N87847P15636N96537N29427K92397Q25494
18162A2002089R76765R64552J164922J120461J345476K202705K663377L169630
18154B5609977L569463M629306N890026P765094J0746162J5535798K1792994K6731335
18146A22270155K6943935K3258060J5298906k115157j6178567j2304499j45729
$$ y = [3260412, 3383428, 3373558, 3509233, 3511044, 3598539, 3778837, 3841696, 3951661, 4168506, 4308039, 4167822, 3961547, 3777487, 3798807, 3958562, 3964622, 3834593, 3799727, 3930157, 3958192, 3758512, 3508635, 3509465, 3610036, 3838508, 4037576, 4111499, 4067543, 4082660, 4474649, 4789265, 5069282, 5032488, 5152475, 5259439, 5685083, 6220902, 6447151, 6760185, 6992276, 7398270, 7953323, 8454751, 9042598, 9758234, 10354771, 10884198, 11176595, 12002089, 12978854, 13943406, 15108328, 16228789, 17574265, 19776970, 22440347, 25609977, 29179440, 33808746, 39698772, 47463866, 58210028, 73745826, 95538820, 122270155, 149214090, 172472150, 187771056, 185655899, 169477332, 157172833, 157027104]
18139A57027104Q050429Q905563N069287q924899k7183649l1651633k4418272
18132H6873930j6127767j0565100o943671m398491k414454r80901K80982J387975
18124D7112503K678801M034876N666418P371000R609438J2783923J7545498K5114220
18116A31916677L5233618M5942258N4588562O2212078O5861002M9917248K2278177
18109D67949620J3864928m050043n0013123n9762850m4799719m1723117n2533130
18102B28932566n3406130m1639465k9579644k0714840j4841264j0929492q132834
18095D9688897o438100m852590l921484l477318k770023k319692k110654j929699
18087B1869337j897746j778455j452564j135073j107578r44152n91403m54896
$$ y = [157027104, 165077533, 173983096, 179052383, 170127484, 142943835, 111292202, 86873930, 70746163, 60181063, 53237392, 48838901, 46424447, 45443546, 45724528, 47112503, 49791304, 53826180, 59492598, 66863598, 76473036, 89256959, 106802457, 131916677, 167150295, 213092553, 267681115, 329893193, 395754195, 445671443, 467949620, 481814548, 477764505, 427751382, 367988532, 323188813, 281465696, 228932566, 175526436, 133886971, 104307327, 83592487, 68751223, 57821731, 49688897, 43250797, 38398207, 34476723, 30999405, 28229382, 25909690, 23799036, 21869337, 19971591, 18193136, 16740572, 15605499, 14497921, 13553769, 12962366, 12507470]
18079A2507470l89706k54204k40234m84676o24461o42821m79459l02655m11082
18070H678172l75316j95474n73695m85724j68564k69365j31831m03308l63148
18061E711747k37579l92928m43659k84830l5531j53413j54399J98120O34j07870
18051D100292r7911k5512j62466j38087o3600J15527J59967P4898o5791j46123
18041C751194k83468m2862j73898j5058k3423n4898K26902P6114l2436j00511
18031C327656l66875n7084j02021j08808j76355l20910k41252J95610P7512o7102
18021B160371K70327N8973r5420p9602l1650J18386P7190K5948j23874q3046j54368
18010B143235j42648K20j14528L6654J20561p1017j84756J90884l06116K8546
$$ y = [12507470, 12117764, 11863560, 11623326, 11138650, 10514189, 9871368, 9391909, 9089254, 8678172, 8302856, 8107382, 7533687, 7047963, 6879399, 6610034, 6478203, 6074895, 5711747, 5474168, 5081240, 4637581, 4352751, 4317220, 4163807, 4009408, 4207528, 4208162, 4100292, 4002381, 3976869, 3814403, 3676316, 3612716, 3728243, 3888210, 3963108, 3897317, 3751194, 3467726, 3424864, 3250966, 3235908, 3212485, 3157587, 3384489, 3460603, 3428167, 3327656, 2960781, 2903697, 2801676, 2692868, 2516513, 2195603, 1954351, 2149961, 2227473, 2160371, 2430698, 2489671, 2394251, 2314649, 2282999, 2401385, 2478575, 2504523, 2380649, 2297603, 2143235, 2000587, 2000807, 1886279, 1922933, 2043494, 1972477, 1787721, 1978605, 1672489, 1701035]
18000A701035J8499R8384R8127l21024j96801m7851J85502O3354J4195J03472
17990A716892q312K0863K11608K04076p490k49607j29172P990J2573p3847J72777
17979A878351j10234K52940J26850j08973j46754j89795l021k8855J65320J63115
17969A998944j865J48670P9389J15060P3041J99822J41088j73767q808O3855J81442
17958B816871j87639k0435K71225R9657l06129m45467q7028R1945O4156j36102
17948B161054l40663K9362J00866J36142l81472k21278J99863J42092K71262q7996
17938B009232m6185j83625k69935k40978n5553L72652k5380k04700J19417J99211
17928A674156J30751K47878j1089j9443q5825n9725q3234p1222O8914Q6535K03024
$$ y = [1701035, 1719534, 1817918, 1916045, 1595021, 1398220, 1350369, 1535871, 1599225, 1613420, 1716892, 1708580, 1729443, 1941051, 2145127, 2137637, 1888030, 1758858, 1766848, 1779421, 1705574, 1878351, 1768117, 2021057, 2147907, 2038934, 1892180, 1702385, 1699364, 1670509, 1835829, 1998944, 1997079, 2145749, 2225138, 2340198, 2413239, 2613061, 2754149, 2580382, 2571574, 2635429, 2816871, 2629232, 2608797, 2880022, 2979679, 2673550, 2228083, 2141055, 2233000, 2297156, 2161054, 1820391, 1849753, 1950619, 2086761, 1705289, 1484011, 1683874, 1825966, 2097228, 2009232, 1963047, 1779422, 1509487, 1268509, 1212956, 1585608, 1560228, 1355528, 1474945, 1674156, 1804907, 2052785, 2041696, 2022253, 1936428, 1876703, 1793469, 1722247, 1791161, 1877696, 2080720]
17917B080720J65681K3713J28081m04593p6671L14794J65131M05950K35311J56590
17907C194707J47264P886K49905K61712k08685l08804j33957k95042k01994k68844
17897B444148l09685M9681K33939K15185M4228l75768l08193J47976K14196j18622
17887B237085j27508j33960L4097L05322j27222j90130K64436J47200K7399j83132
17877B253587p6109q9644j02973J777J36597j53816r3231q7554J94913L61505
17867B345052J10072K08719K53723l8322l72346n5848K19456K12561K01110M8508
17857C132685j01661j24088O7907J49821J14174J86410K20261K44913M83251K34443
17847D608116K04473K05595L12337K11124l488J78936M45388N4315J38283K58638
$$ y = [2080720, 2246401, 2270114, 2398195, 1993602, 1916931, 2231725, 2396856, 2802806, 3038117, 3194707, 3341971, 3349857, 3599762, 3861474, 3652789, 3343985, 3210028, 2914986, 2712992, 2444148, 2134463, 2184144, 2418083, 2633268, 2677496, 2301728, 1993535, 2141511, 2355707, 2237085, 2109577, 1975617, 2009714, 2315036, 2187814, 1997684, 2262120, 2409320, 2436719, 2253587, 2177478, 2087834, 1984861, 1986638, 2123235, 1969419, 1876188, 1788634, 1983547, 2345052, 2455124, 2663843, 2917566, 2879244, 2506898, 2451050, 2670506, 2883067, 3084177, 3132685, 3031024, 2906936, 2974843, 3124664, 3238838, 3425248, 3645509, 3890422, 4373673, 4608116, 4812589, 5018184, 5330521, 5541645, 5538157, 5717093, 6162481, 6216796, 6355079, 6613717]
17837F613717O23334O36633K95746N39910P54363Q55743O28563J070855J232542
17828A3251406J310362J310709J732161K317228L054879L683569M721894O267822
17820C7650030Q788123J1905303J7202886K4477849L0934143L0058752K3996637
17813A85013723J3946899j2690184l7819808l7241068k6558147j8100539j1840862
17806E4710014p770627n193118k886483j175236j51703R85312K168404L220191
17798D3906754N232075P406583J0861979J6000948K2909190K8793100K9142475
17791A64253104K4158726J5786275o768615k8624555k5708864j1753308K378549
17784A33721312J3215853J7240038J4936081Q493971j0497089l2755219l4309960
$$ y = [6613717, 7237051, 7873684, 8169430, 8709340, 9463703, 10319446, 10948009, 12018864, 13251406, 14561768, 15872477, 17604638, 19921866, 22976745, 26660314, 31382208, 37650030, 46438153, 58343456, 75546342, 100024191, 130958334, 161017086, 185013723, 198960622, 186270438, 148450630, 111209562, 84651415, 66550876, 54710014, 46939387, 41746269, 38859786, 37684550, 37532847, 38518159, 40686563, 43906754, 49138829, 56545412, 67407391, 83408339, 106317529, 135110629, 164253104, 188411830, 204198105, 197429490, 168804935, 143096071, 131342763, 133721312, 146937165, 164177203, 179113284, 187607255, 177110166, 144354947, 110044987]
17777A10044987k5610231j7511067j1848497p900223n373844l438642k085090
17770C6277393q73144L04433J003096J933549L050704M597864P148783J1263794
17762F4706472J6905297K2234643K2753709J8584329J1896646o024699k8266920
17755A22789477l1011201k3070287j5869479j0810410p367895n145667l987829
17748B5526709k909659k209291j355608n85019q23065n35192l78100k4570J59357
17739A6865562O51112O70716Q64964R68414Q73611J158703J955738K398644K931387
17730B9338851M034948N830009P395289J0037938J4231899K0132609K5674196
17723A16675739K7344335K3441338J5889582j783479k5333433l2688347k6197639
$$ y = [110044987, 84434756, 66923689, 55075192, 47174969, 41801125, 38362483, 36277393, 35404249, 35708682, 36711778, 38645327, 41696031, 46293895, 53442678, 64706472, 81611769, 103846412, 126600121, 145184450, 157081096, 151056397, 122789477, 91778276, 68707989, 52838510, 42028100, 34660205, 29514538, 25526709, 22617050, 20407759, 19052151, 18467132, 17644067, 17108875, 16730775, 16706205, 16865562, 17516674, 18187390, 19052354, 20020768, 20894379, 22053082, 24008820, 26407464, 29338851, 33373799, 39203808, 46599097, 56637035, 70868934, 91001543, 116675739, 144020074, 167461412, 183350994, 181567515, 156234082, 123545735, 97348096]
17716I7348096j8171205j2060711p575059m081715j192192J298205M585466Q242250
17708F8393135J2602137J8353636K3732461K4729267J9971748J1757077o696303
17701A72843158k8576297l3170801k6237603j8735474j3467574r731015o922949
17694C6001445m735783l315573k708019j740792j354219j059542r07827j016890
17686A9162800n05855J42096L41213L34790L26525P23535J069105J643907K239438
17677B5477554K753222L699527M910379O738797R749526J3895250J9103010K3274355
17669A09601620K2662884J8249936R637329q923981k6206245k7303333k0362756
17662G7355454j3876206r003382n510696k421410r8008K103745M685210Q181650
$$ y = [97348096, 79176891, 67116180, 59541121, 55459406, 54267214, 55565419, 60150885, 68393135, 80995272, 99348908, 123081369, 147810636, 167782384, 179539461, 172843158, 144266861, 111096060, 84858457, 66122983, 52655409, 42924394, 36001445, 31265662, 27950089, 25242070, 23501278, 22147059, 21087517, 20179690, 19162800, 18656945, 18799041, 19140254, 19475044, 19801569, 20525104, 21594209, 23238116, 25477554, 28230776, 31930303, 36840682, 43579479, 53329005, 67224255, 86327265, 109601620, 132264504, 150514440, 160151769, 151227788, 125021543, 97718210, 77355454, 63479248, 54475866, 48965170, 46543760, 46445752, 48549497, 53234707, 61416357]
17654F1416357J2687917J7628466K1625043K0528216J5465217O383183j3207875
17647A42526524k8888988k7969009k0919580j4519236j0478762p911658n738933
17640B6100358l895635l054997k317745j822829j588204j293404q23617j148929
17632A0154998q21438o22474l97794l51514l84515l63679m17925k97547k98257
17623F199855m98802n06185j69818j95922l21619j45379k66047l54846k48111
17614C493126J2477m36038k95947N1361K5995J03912r6520k31457k38431j14788
17604B273690N434J55198P6986j17836J76161l24089m64506k47230j6224N4381
17594A571965j19875J69246K304o8230O6253M5792j6121O7223J27095p9194j17070
$$ y = [61416357, 74104274, 91732740, 113357783, 133885999, 149351216, 155734399, 142526524, 113637536, 85668527, 64748947, 50229711, 39750949, 31839291, 26100358, 22204723, 19149726, 16831981, 15009152, 13420948, 12127544, 11303927, 10154998, 9333560, 8711086, 8313292, 7961778, 7577263, 7213584, 6795659, 6498112, 6199855, 5701053, 5194868, 5025050, 4829128, 4507509, 4362130, 4096083, 3741237, 3493126, 3505603, 3069565, 2773618, 2824979, 2850974, 2954886, 2858366, 2626909, 2388478, 2273690, 2279124, 2434322, 2511308, 2393472, 2569633, 2245544, 1781038, 1533808, 1517584, 1571965, 1452090, 1621336, 1623640, 1555410, 1621663, 1667455, 1651334, 1718557, 1845652, 1766458, 1649388]
17583A649388p9215N4608k34252j47856J01328O9143p4345R4090j34048q2166
17573A216675J50041k26246M1708j06523M4046L10214j05769j81454j21363J25384
17563A146713j1510P977L15071Q6326l00950j74378j4265K47280M65793J26810
17553A894867J02980N2920j47632j27679K2981N4465J02550l1383J84220J83493
17543B291782q1979n95946l98384j83907p8210q7806N825L4176j88858P7991j46208
17532F48476j44186K01464K62112J14654k25885j69412J33748Q5352j6156L09715
17522A199882J66677m8602o7563j19330j27030m5822R5932J19660R9996r6517
17512A177283j60011J12123O6190j86049k28497j33879J22106J8577J07793q1773
$$ y = [1649388, 1570173, 1624781, 1390529, 1242673, 1344001, 1413144, 1338799, 1432889, 1298841, 1216675, 1366716, 1140470, 1182178, 1075655, 1119701, 1429915, 1324146, 1142692, 1021329, 1146713, 1135203, 1143180, 1458251, 1544577, 1243627, 1069249, 1054984, 1302264, 1768057, 1894867, 1997847, 2050767, 1903135, 1775456, 1798437, 1852902, 1955452, 1924069, 2108289, 2291782, 2209803, 1613857, 1215473, 1031566, 953356, 865550, 871375, 905551, 716693, 794684, 648476, 504290, 705754, 967866, 1082520, 856635, 687223, 820971, 906323, 890167, 1199882, 1366559, 1317957, 1250394, 1131064, 1004034, 958212, 1054144, 1173804, 1273800, 1177283, 1017272, 1129395, 1195585, 1009536, 781039, 647160, 769266, 787843, 895636, 813863]
17502H13863J06655m467l67660l24451l57537r9452K34848L27797P4259J3546
17492D17401L28998L46598j43371k44493k22727j27385K9760O7609J16727n4911
17482E14206m0970l9770k7287j24091k11672O6593J42059l12892o999Q0110o9198
17471b9911J10562L00823J17154j18236r6349L7683k7869N9124K27477J12932
17461F93390j78838r1368J75978M1082q8825K5890n0147r8539j84918P70J10091
17450C54566L9169m9213J72416K07977K33290K76787J61327L73736o297j24035
17440A639723p1971l92885j33425j53088p0228J22272j64814m51629l01221N8274
17430H1008J59328J11412n9379m8800M9601J66327R0657l6305j9019K7374k63807
$$ y = [813863, 920518, 916051, 548391, 223940, -133597, -233049, 1799, 329596, 403855, 417401, 746399, 1092997, 949626, 705133, 482406, 355021, 384781, 452390, 569117, 514206, 473236, 433466, 406179, 282088, 70416, 137009, 279068, -33824, -40823, 39287, -29911, 80651, 381474, 498628, 380392, 284043, 321726, 293857, 352981, 580458, 693390, 514552, 423184, 599162, 640244, 551419, 577309, 527162, 428623, 243705, 244475, 354566, 393735, 344522, 516938, 724915, 958205, 1234992, 1396319, 1770055, 1763758, 1639723, 1567752, 1174867, 1041442, 888354, 818126, 940398, 775584, 323955, 22734, 81008, 240336, 351748, 292369, 243569, 293170, 459497, 550154, 513849, 494830, 522204, 258397]
17419B58397j98167J85870o66Q5280n2220j50973j04461J29523K74306j71443
17409B55446J3087K05138P0839j97497k41434q4405l7646n6049p8258P2682P9186
17398A089J21277J1353j06163J78946K11726K38570o3159R0343k59717k56511
17388A67754K6879J46810j55032k10349K02322j6418k18632K2722l7989K42682
17378A70749J53036P791j93640k69387l51100Q0628L61683K16749j4551o0694
17368A01264J66862j7999j86767j72391N8321m6555N8053J63157R0181o2445k13975
17357f2294j58279J26855J72038j36461K89331K02261J4352n1668k26702j67057
17347B376O9364K02792k97390j70872K00252L1673j31397K34377L11632K34136
$$ y = [258397, 60230, 246100, 245434, 330714, 278494, 127521, 23060, 152583, 426889, 255446, 268533, 473671, 544510, 347013, 105579, 21174, -16472, -72521, -150779, -78097, 1089, 122366, 133719, 27556, 206502, 418228, 656798, 593639, 683982, 424265, 167754, 194633, 341443, 186411, -23938, 178384, 161966, -56666, -33944, -71933, 170749, 323785, 331576, 137936, -131451, -482551, -401923, -40240, 176509, 161958, 101264, 268126, 250127, 63360, -109031, -50710, -97265, -39212, 123945, 214126, 151681, -62294, -220573, -93718, 78320, -58141, 231190, 433451, 447803, 396135, 169433, 2376, 71740, 274532, -22858, -193730, 6522, 38195, -93202, 141175, 452807, 686943]
17337F86943o7896r9489j59341m9109P2271k70371j83858J18897l5697Q7387M080
17326A03817o9952K1425K91752J12325j89267j33169L31081J30551k137K4456
17316F20882p0141k2610l19968m84L00602j8180m10171j92531l1899j49203J33799
17305a59904j40652P2063J45624k0177o6739L24508J98270m3326j33952K9951
17295B05666J2187O5346J07141j89570k4446k20122Q6842O0183L7524P4415N9108
17284B74274K14763L79228K92706J29334l44206r9965m2741j17028j59683m34018
17274I2664k54221Q0406M21357L09434Q6124k11651k50452J18666J42110J24684
17264F59121J5466M6980K66870Q3320J72651J05338q2132r1673l13485p6344j17989
$$ y = [686943, 619047, 519558, 360217, 311108, 383379, 113008, -70850, 48047, 12350, 99737, 103817, 33865, 55290, 347042, 459367, 270100, 136931, 468012, 598563, 596426, 620882, 550741, 528131, 208163, 207679, 508281, 490101, 79930, -112601, -144500, -293703, -159904, -300556, -228493, -82869, -103046, -169785, 154723, 352993, 309667, 175715, 205666, 217853, 283199, 390340, 200770, 176324, -43798, 43044, 103227, 140751, 215166, 274274, 489037, 868265, 1160971, 1290305, 946099, 846134, 803393, 686365, 526682, 92664, -161557, -81151, 340206, 649640, 735764, 524113, 273661, 392327, 534437, 659121, 674587, 721567, 988437, 1071757, 1244408, 1349746, 1267614, 1175941, 862456, 786112, 668123]
17253F68123L3577K41945L72970J19859j7708r0495j27351k04917m75088j34914
17243C86001j28430n9145o6340J01561J53877k58090K0602k0688k20548Q6189
17233e011J40520P1936K16356J49400j3280L33066L16242Q7245k80617k19209
17223G96648o9561l2736p2039P5865k21067l1474J50718J87438M1985J9672j45282
17212G00167J5645K0946r9190N9175j6080k39568q0407j46042J70798K09812O6751
17201F62007N5246J4057J32148J82526J91044J49548q6507j41474n9523m0448
17191A058624o7400j45670j84097k11860j15859k07431P2740J15989L3912k41774
17181A07174J61575J26141j32802k42705o8479J61338o8108J79956J26390k3363
$$ y = [668123, 701700, 943645, 1316615, 1436474, 1418766, 1328271, 1200920, 996003, 520915, 386001, 257571, 198426, 132086, 233647, 387524, 129434, 150036, 129348, -91200, -5011, 135509, 207445, 423801, 573201, 559921, 892987, 1209229, 1296474, 1015857, 796648, 727087, 694351, 622312, 698177, 477110, 445636, 596354, 783792, 825777, 845449, 700167, 715812, 736758, 637568, 696743, 680663, 441095, 360688, 214646, 385444, 595256, 662007, 717253, 731310, 863458, 1045984, 1237028, 1386576, 1300069, 1158595, 1099072, 1058624, 991224, 845554, 661457, 449597, 333738, 126307, 199047, 315036, 348948, 107174, 268749, 394890, 262088, 19383, -49096, 112242, 44134, 224090, 350480, 327117]
17171C27117j51828j61510p671J65977j46785J0832K28758K21483K51419J29073
17161H66865j76584q7423l7512j22396n1613k00844k05489K7588j38176q7846
17151b13430K74150J39384R3223J32725P1526n0531j05189M6995K24679J93996
17141H07528k47801j95668q1993L377K0156j79705j02536K27108O5302k18711
17131I7057j98067Q5417j8941J27471K06342J479J35039J04832o3050k00960n3742
17120B22877j45594k4745j45017j64721K6846O1497O351M680k15502k09329L4528
17109e48129L35102J25029q2802j98092k7198K02335n6092J24077K8075j10665
17099b08360k5944k9227k30732r715K36974L28368J89638j98676k26601j21070
$$ y = [327117, 175289, 13779, 6108, 172085, 25300, 36132, 264890, 486373, 737792, 866865, 690281, 602858, 565346, 442950, 391337, 190493, -14996, 12592, -125584, -213430, 60720, 200104, 293327, 426052, 497578, 447047, 341858, 388853, 613532, 807528, 559727, 364059, 282066, 285443, 305599, 125894, 23358, 250466, 315768, 97057, -101010, -15593, -34534, 92937, 299279, 300758, 435797, 540629, 477579, 276619, 222877, 77283, 52538, -92479, -257200, -230354, -168857, -162506, -157826, -373328, -582657, -548129, -213027, -87998, -170800, -368892, -396090, -193755, -249847, -125770, -97695, -208360, -234304, -263531, -494263, -503978, -267004, 61364, 251002, 52326, -174275, -295345]
17089b95345K53224L9340l2458m5205J6776N5859j2575p2965L746P9749k13236
17078b23090j24873R8697Q4405j70656J06300k3655J59439J63640N6153r9950
17068B6410j89874m08945K2501M14227J00413J32375l26p4888J14413L5458R7744
17057B69508N2774m13561l06257J50430L8996J47125K50060J00046j15257J8920
17047A92784j23497j04032J21123O4586p751j69362K555K55817j06627P8644K434
17036B06674O0815o4591k136r5680O5499N7572k5949k4620P5918p8844j93541
17025a8883j48787K41986K12299j25803m8694P1018L9448j52538j88721j32933
17015b51608j37696j32941J32225K78680R4592j97429J14898L27148P879n536
$$ y = [-295345, -42121, -2781, -35239, -80444, -63668, -7809, -20384, -93349, -89603, -9854, -223090, -347963, -249266, -164861, -335517, -229217, -252872, -93433, 70207, 126360, 26410, -163464, -572409, -549908, -135681, -35268, 97107, 96781, 21893, 136306, 171764, 269508, 322282, -91279, -397536, -247106, -208110, -60985, 189075, 289121, 173864, 192784, 69287, -34745, 86378, 150964, 143213, -26149, -23594, 232223, 125596, 204240, 206674, 267489, 202898, 200762, 105082, 170581, 228153, 202204, 177584, 253502, 174658, -18883, -167670, 74316, 286615, 160812, 112118, 183136, 222584, 70046, -118675, -251608, -389304, -522245, -390020, -111340, -16748, -214177, -99279, 227869, 235748, 230212]
17005B30212k07676j51502J8533Q103Q5247K67314n6283l2277o5849J10003n2318
16994A53507j73845l0630M307J64520J8879K0937J73020L48l96153m1511P8061
16983b8560l812k5717K6755n302J9238l6014l3176M2124K4593P4827K4651l8027
16971D1580r7342k65336J60885J72793N8028J67146j97981j05066J39344n9737
16961A4314j72064j06372K71856k81092j98991K91114M9235N1084N7000k72937
16951b96853k96141K10284J08220j80630J05623K4325j44335J11184n4743P8201
16941c34865r9508n4975k7157K22702j0236K24847K07903O7877j35255O9127J02691
16930B33151k33637k7236L7396k33706J22103P5234Q1770J87254r7130P7435p6432
$$ y = [230212, 22536, -128966, -110433, -102330, -17083, 250231, 193948, 161671, 95822, 205825, 153507, -20338, -50968, -46661, 117859, 136738, 157675, 330695, 331043, -65110, -106621, -28560, -32372, -58089, -31334, -36636, -17398, -53412, -86588, -44464, -19871, 54956, 79607, 41580, -55762, -321098, -160213, 12580, 70608, 237754, 39773, -65293, 74051, 14314, -157750, -264122, 7734, -273358, -472349, -181235, -132000, -80916, -23916, -296853, -592994, -382710, -274490, -455120, -349497, -325172, -469507, -358323, -413066, -334865, -434373, -489348, -516505, -293803, -304039, -79192, 128711, 196588, 61333, 130460, 233151, -486, -27722, 9674, -224032, -101929, -26695, 55075, 242329, 145199, 222634, 146202]
16919A46202p6847M089k18006J04605J01385J02182K6830m9071p6455j77445m1451
16908a53982R0724j78740J7414K14390J20655j16728l20307j4881K92111L0000
16898a9344j75755J67176j79345l12274M3744j8745L92191J6079k92936l9915
16888d19124L25982o5726r5169O0465J53113j6628M1649J71693M8481n0966j94516
16877d0746j95165j13331j14617R7185l9493K06301k896l5400R2625J18568k5725
16866e2694R3858k0434L7005L5628J1897j6868l15696q7898J14063M4062K37667
16855H0590J24892j91530q426j10958M9392m7623j1411K470j10411n7095m8664
16844c28774J92428Q3557J22828O7163k6524j88857q4100J49862k8385l6502J75798
$$ y = [146202, 69355, 73444, -144562, -39957, 61428, 163610, 190440, 141369, 64914, -112531, -153982, -63258, -241998, -224584, -10194, 110461, -6267, -326574, -341455, -49344, -19344, -195099, -27923, -207268, -519542, -475798, -494543, -102352, -86273, -379209, -419124, -93142, -158868, -254037, -193572, -40459, -57087, -15438, 156255, 204736, 153770, -40746, -235911, -349242, -463859, -366674, -406167, -199866, -202762, -238162, -145537, -26969, -52694, 41164, 20730, 57735, 93363, 105260, 88392, -227304, -315202, -201139, -157077, 80590, 205482, 13952, 5526, -105432, -56040, -103663, -115074, -112604, -223015, -280110, -328774, -136346, -52789, 70039, 137202, 110678, -78179, -162279, -12417, -40802, -77304, 98494]
16833I8494J81817p062j43628l4722L4547l6459J94361M2091k73359k08045k67440
16822d19405R8396L52611J7498r6942k42786j27722M07234J32325L4800N0064
16812B06073k53109j20263J30091K46245q8875J68307r7431j70002L1850K6109
16802G8995R9879p1307n7841m8092k1923O4774o1856j73984n3343J15953r1628
16791b20373j0601R6289K38286M104j05751K07658K26189j98703N4309m810l78964
16780i2367n3708K30527j58409k00235r6253J03607J73402K23419P7921l849J44192
16769C48247J05623j01899r0834p471m9766k65413k36966K13617K64238q8657
16759I0719O79J79532J4669k76388j89180O0052o8256K9583M2042j30055k22701
$$ y = [98494, 280311, 273249, 129621, 94899, 129446, 92987, 287348, 329439, 56080, -151965, -419405, -321009, 31602, 49100, -47842, -290628, -418350, -11116, 121209, 156009, 206073, -47036, -167299, -37208, 209037, 120162, 288469, 191038, 21036, 52886, 78995, 178874, 107567, 49726, 1634, -20289, 44485, -17371, -191355, -244698, -128745, -220373, -230974, -134685, 103601, 107705, 1954, 209612, 435801, 237098, 291407, 286597, -92367, -146075, 84452, -73957, -274192, -370445, -266838, -93436, 129983, 207904, 204055, 348247, 453870, 351971, 261137, 253666, 203900, -61513, -298479, -84862, 179376, 90719, 91398, 270930, 285599, 9211, -179969, -119917, -188173, -158590, -116548, -246603, -469304]
16748d69304J04536J10357j38841j35074L51083O5771O8085J83669J16510k9634
16738B27158k42338j14794J34036K5309j15685j21608n1079L8640Q8079J73417
16728D1135L2500J20915J57907j50677k76953K8077l7666k29811P0851J84923
16718e8799Q1554j00626M364q9872l655K12740j4262k52092j75310m1386K08569
16707b28775K17517L1567j22941J5530J1257K19482J57259j52330l11729q7055
16697b50218J70733o1757Q9140L35593j9583M3853p6159r8164j34361r6654K1861
16686g5716J54450J27304j70045q9343Q8664j24855j20026N6142J52918N3390
16676E2883p8518j55744k31547k56159K92366K47098K71822j16996L5370K9598
$$ y = [-469304, -364768, -254411, -393252, -528326, -177243, -111472, -43387, 140282, 256792, 227158, -15180, -129974, 4062, 29371, -86314, -207922, -259001, -220361, -132282, 41135, 73635, 194550, 352457, 201780, -75173, -47096, -84762, -314573, -243722, -58799, 22755, -77871, -73507, -163379, -167034, 45706, 31444, -220648, -395958, -437344, -228775, -11258, 20309, -102632, -87102, -75845, 143637, 300896, 148566, -163163, -250218, -79485, -141242, -52102, 283491, 263908, 307761, 231602, 133438, -923, -97577, -75716, 78734, 206038, 35993, -53350, 35314, -89541, -209567, -153425, -507, 52883, -25635, -181379, -412926, -669085, -376719, -129621, 142201, 25205, 60575, 90173]
16666I0173j59769j97246n1671J3810r5477J19339k9502k8966r55K10083J51353
16655B1172j65736Q2612O2881Q4224J10180R6622j5624N229k24978P4405K16185
16644C47172o3112m5527l9830l66976j50186j15008J7290K65624M5830O6537O7107
16633B8921o7180j51871M0335l61631r6334J42329N3909M0832J55986R6421m6456
16622a64739O565Q8808R7493Q8431J59231k0822m822K25347j16100k00310j96698
16611c7616P3162k7763j03001j11187k8059O1283J36708K693j35880j196K0528
16600a50328r570M7181P1768J11102J90241J26153j79496L5877j07168J7398R8101
16589B51259j20854q2078l3314L5450J41169j04922Q0408j84052Q0731K22870
$$ y = [90173, -69596, -266842, -318513, -304703, -400180, -280841, -310343, -339309, -340264, -130181, 21172, -144564, -61952, 929, 85153, 195333, 291955, 276331, 281560, 56582, 130987, 347172, 284060, 238533, 198703, -168273, -318459, -433467, -416177, -150553, -104723, -38186, 28921, -38259, -190130, -149795, -511426, -607760, -465431, -411522, -370690, -214704, -118283, -164739, -158174, -69366, 28127, 116558, 275789, 254967, 250145, 475492, 359392, 159082, -37616, 35546, 7783, -95218, -206405, -234464, -173181, -36473, -33780, -169660, -170856, -150328, -159898, -112717, -40949, 70153, 260394, 386547, 207051, 242928, 135760, 153158, 251259, 130405, 48327, 15013, 50463, 191632, 86710, 167118, -16934, 63797, 286667]
16579B86667j59170o9371J81217K58153j23625k33444k74730m0161k4659K77291
16569G8168j83169j13736O8488j79367N3518P2635k292M3007K9765q067j48442
16558b89492o8615Q3070K7574Q9012J51608L7919j36140O688j99381M473N4133
16547b39151P5685L8707m9431J09200K93927j91322j0568J24715j40821J571K5858
16536C8370R4437n6900k10168K8037J53854K45486M364J93997j63562n12660j78035
16525c62780o4460N0254n254P6921L26589J160k3586N6701o9379J31982J22192
16514B40340j26358k4870M6188r5979J3696j38131q3580R7975l7837k5294N1000
16503h2850l0934m8038R445m3463J7657p4989K17969K2900j96046J70785l840
$$ y = [286667, 127497, 58126, 239343, 497496, 373871, 140427, -134303, -174464, -199123, 78168, -105001, -218737, -150249, -329616, -276098, -203463, -205755, -162748, -132983, -141050, -289492, -358107, -275037, -247463, -158451, -6843, 31076, -105064, -98376, -297757, -293284, -239151, -163466, -124759, -174190, -64990, 228937, 37615, 27047, 151762, 10941, 12512, 38370, 132807, 75907, -134261, -106224, 47630, 293116, 297480, 491477, 327915, -184745, -362780, -427240, -376986, -382240, -305319, 21270, 22430, -1156, 55545, -13834, 118148, 240340, 113982, 89112, 135300, 39321, 53017, -85114, -168694, -70719, -108556, -133850, -82850, -113784, -161822, -152377, -195840, -178183, -253172, -35203, -12303, -208349, -37564, -41404]
16492d1404J12911m2592k10171J11817J32603j32473q7016J31662k8943l78350
16482d31956J76258J18812j77638j80906J43864j5721J97913K81375j22803j10742
16472a21544J608R5663K4599m103q5037J86382J6971j03098N4645m5933J48401
16461A68554L7337j72872j17496j91617r6798K04237L29932Q5484l7446j66586
16451D2729j02270j4830j49905r8846L00183R5309j22048O5826K5163k08572j94553
16440c61814j71531J13394K30320J22891j5933k1845J74884J34347J16220q5187
16430B35746J6899J49244k35907k58673k20777K26491L15229P956k04760l60828
16420c29380m8700L77088J24789J12159n3058j13317N4220J1827R8323J10765
$$ y = [-41404, 71507, 28915, -181256, -69439, 63164, -69309, -156325, -24663, -53606, -431956, -255698, -136886, -314524, -495430, -351566, -367287, -169374, 112001, -10802, -121544, -119936, -24273, 326, -3777, -88814, 97568, 114539, 11441, 66086, 20153, 168554, 205891, 33019, -84477, -276094, -372892, -168655, 161277, 246761, 209315, 42729, -59541, -74371, -224276, -323122, -22939, 72370, -49678, 16148, 41311, -167261, -361814, -533345, -419951, -189631, -66740, -82673, -104518, 70366, 204713, 320933, 235746, 252645, 401889, 165982, -92691, -313468, -86977, 228252, 236208, 31448, -329380, -378080, -992, 123797, 235956, 182898, 69581, 123801, 135628, 233951, 344716]
16410C44716j72561j61541Q2929n9678k71863j53561J19849K14719q4952j09288
16400b51231J66725N9634p4948o6681Q3728k09158J24313J45383n2884K2627J07151
16389E4659k5740N0488j30495j99906L0442j44798J47228J24691K4213J11261
16379D2043O0204J93214r6178l82053n3034J65502J25117q8616J57967J92010
16369C16176j22448k3306j34961k35759J01098J2428j79539M0756L1496Q9634
16359a04425j22258P3778K71561j19209l4351O5612R1524m14742j95751M15K51652
16348b36194L04938K29869L0839m5793p126q3560r1906n2191p9674o5804j57003
16337b53605M4746k8059J19155m5138J06503j11794j423O5429J22105J31235j68552
$$ y = [344716, 172155, 10614, 93543, 33865, -237998, -391559, -271710, -56991, -141943, -251231, -84506, -24872, -99820, -166501, -82773, -291931, -167618, -22235, -75119, -52492, 54659, 28919, 79407, -51088, -250994, -220552, -365350, -218122, -93431, -69218, 42043, 102247, 295461, 199283, -182770, -235804, -70302, 54815, -33801, 124166, 316176, 193728, 170422, 35461, -200298, -99200, -86772, -266311, -225555, -194059, -104425, -226683, -152905, 118656, -553, -34904, 30708, 122232, -292510, -488261, -487846, -236194, 68744, 298613, 329452, 283659, 276533, 192973, 101067, 48876, -30798, -96602, -253605, -208859, -236918, -117763, -162901, -56398, -168192, -169615, -104186, 17919, 149154, -19398]
16326a9398o8213Q800M0393J49974k4742j19372j76431K7813p0997Q9383J04840
16315e7950J60314J80524r0292Q2149k16187l17120j28065j53482P4007O1360
16305d04742m3270J11708K01998K70434L2299J8500J55771L2557J4753k42331
16295A47677l42340j18803L23690m0189j31754M5304J8241J46745K78673p6602
16285B50642o0687j53487k80846k29443J88034r1920J12307K80737l9386J64881
16275A40832p9915j68612p0021j18821n7011m6729K76869L38006j59536j66789
16265a11727K8324P5558K5001J04721Q5985k6595M6472j85824o7533J64189P0924
16254B09495j53978j42623q4713J30465m9183j83758M9393M7938p986J05252k49968
$$ y = [-19398, -87611, -78811, -38418, 111556, 86814, -32558, -208989, -181176, -252173, -162790, -57950, 102364, 282888, 192596, 274745, 58558, -258562, -386627, -540109, -466102, -404742, -448012, -336304, -134306, 136128, 168427, 186927, 342698, 375255, 390008, 147677, -194663, -313466, 10224, -29965, -161719, -116415, -98174, 48571, 327244, 250642, 189955, 36468, -244378, -473821, -285787, -377707, -265400, 15337, -24049, 140832, 60917, -107695, -177716, -296537, -353548, -400277, -123408, 214598, 55062, -111727, -83403, -7845, 17156, 121877, 207862, 181267, 227739, 41915, -25618, 138571, 209495, 55517, -87106, -171819, -41354, -90537, -274295, -224902, -176964, -184950, -79698, -329666]
16243c29666j08484J87248J93070j51510R2675K49931n7373m5502Q9061J5940
16233A35390P9999k5002m6110k9504k29931K41742J50295J34417j29358j59761
16223A22177O2871J54545j83363j95859j0189M8283M3231k25059P1496K04305
16213I2438j35253j47266o7807Q4757L31505N928l41340k7302M69K6258P0446
16202a07167J38487O4051j17531j31008Q4855M17590J02370j85961k03532j10433
16192d8279J2996J50485J88879j17454L7947k88588m7955r282q8179J10662j9822
16181a18590N0373j5707J96149O7400k23477j00884l862l05085J04996L71101
16171B2414J04799p7743O654j8466L00990L6071k84210j41050m5131K1453K26395
$$ y = [-329666, -438150, -250902, -57832, -209342, -116667, 133264, 75891, 30389, 119450, 135390, 215389, 190387, 144277, 114773, -115158, 126584, 276879, 411296, 281938, 122177, 185048, 339593, 156230, -39629, -49818, -1535, 41696, -183363, -111867, 92438, -42815, -190081, -257888, -173131, 158374, 164302, -177038, -204340, -203871, -177613, -107167, 31320, 95371, -22160, -153168, -68313, 349277, 451647, 265686, 62154, -48279, -35283, 115202, 304081, 186627, 224574, -64014, -111969, -121251, -209430, -98768, -118590, -68217, -83924, 112225, 179625, -43852, -144736, -148598, -453683, -348687, 22414, 127213, 49470, 56124, 37658, 338648, 374719, 90509, -50541, -95672, -74219, 152176]
16160A52176J06163k83621l17807K1560n9j42132R1649K20963L14246k7283k92223
16149a56368m51196M5919K57508J67808L4465R53m8302K1537P3393M748n2944
16138a02479n3291k52898J9589K16454n2097j60378J26269K59124J72039n744
16128A66588k34256n6027K07336K58640P9701Q4759l9373l75134l26610J55203
16118g9173J80114k04l4273M0406L4367l27627J05114j52703j62030J9238j21221
16107d97992j8216j10489K43656P6403j05657q1666N4092R560O0200N0701p1747
16096c91155J13084j68632j85945L20483P7166O3485m5636M7729K40274J00100
16086A70953q886k71860j10841j23393k41380n6121k237J26209L3294J13404J96666
$$ y = [152176, 258339, -25282, -343089, -321529, -321588, -463720, -372071, -151108, 163138, 135855, -156368, -607564, -561645, -304137, -136329, -101864, -100911, -149213, -127676, -54283, -49535, -102479, -155770, -408668, -389079, -172625, -224722, -385100, -258831, 293, 172332, 166588, -67668, -123695, 83641, 342281, 421982, 506741, 467368, 92234, -234376, -79173, 100941, 100737, 66464, 106870, 141237, -186390, -81276, -233979, -396009, -376771, -497992, -516208, -626697, -383041, -306638, -412295, -493961, -439869, -430309, -370109, -319408, -391155, -278071, -446703, -632648, -312165, -234999, -171514, -217150, -169421, 70853, 170953, 162067, -109793, -220634, -344027, -585407, -641528, -643765, -517556, -484262, -370858, -174192]
16075a74192J92214j7768J82273J26788j38881k78812Q9813M242K4668k01544
16065a91199k15722O7758J16912J53994K16162j18187O7541K06013n1198r3479
16055A58595k06080J72727p7162k22829k63141J8959p7926Q3211R286M2703P1718
16044b89939R8970L20611P7841M5897l19685j44620l3496R2354j67J70062N9127
16033G6955J37292l3853o7219j09233l6281j2079K7862k24211j53427R5264o6424
16022c65354J03522K14205N8261J09009p7757l41020j10691J26504m9540K41284
16012i1577p0662K36061K31661K3662m8628l054j49272j8483l772L4798j08697
16001C2037m174o2410J20971Q4322Q2125j40333O2041j11086O776k42005N4801
$$ y = [-174192, 18022, 254, 182527, 309315, 170434, -108378, -18565, -14323, 10345, -191199, -406921, -339163, -222251, -68257, 147905, 29718, 97259, 303272, 252074, 158595, -47485, 125242, 48080, -174749, -437890, -418931, -496857, -413646, -404360, -361657, -289939, -190969, 129642, 207483, 253380, -66305, -210925, -244421, -152067, -152234, 17828, 76955, 214247, 180394, 113175, 3942, -32339, -44418, -16556, -240767, -394194, -298930, -365354, -261832, -47627, 10634, 119643, 41886, -299134, -409825, -283321, -332861, -91577, -162239, 73822, 305483, 329145, 280517, 277463, 128191, 109708, 105936, 140734, 32037, 27863, -34547, 86424, 170746, 252871, 112538, 174579, 63493, 70269, -171736, -116935]
15990a16935k9212j18732k63290J57327p3769O7737o7365J49652J14882k05676
15980c85381k8734J29545J6946J2217J80363J55604j65749r1066J95798N888j45858
15969a20427j19096k7691J16539J0963Q0810n8925O135j2361M9350J49285R566
15958H4148O1541k0913k73518o7185o1517J34543R2987r4773R32O3232q6494p4765
15946b41782k8922P4427q9922o5764n8406n8374N7793L1337J72067J59595J23760
15935G5809K64541k2815j61254M1557j15992q3668j19286j23491J38771k7442
15925a33270M70191L8014k56067J05185p0565P98O8419n5422j25525n1654J6750
15914F854O9078J39945j22311m1587K8410k38855R8994l5038j40738k1776J46971
$$ y = [-116935, -146147, -264879, -528169, -370842, -444611, -376874, -444239, -294587, -179705, -385381, -414115, -284570, -267624, -255407, -75044, 80560, -85189, -176255, 19543, 25431, -120427, -239523, -267214, -150675, -139712, -58902, -117827, -111692, -124053, -74703, 74582, 84148, 145689, 124776, -148742, -215927, -277444, -142901, -49914, -144687, -143755, -80523, -167017, -241782, -270704, -196277, -286199, -351963, -410369, -468743, -410950, -379613, -207546, -47951, 75809, 340350, 317535, 156281, 197838, 81846, -1822, -121108, -244599, -105828, -133270, 336921, 374935, 118868, 224053, 153488, 154286, 222705, 167283, 41758, -9896, 6854, 75932, 215877, 93566, 51979, 80389, -158466, -59472, -94510, -235248, -257024, -110053]
15903a10053J11045N1170m7975k12082j22020j8203J0653J58821J21106J90274
15893A32736n9868J060j28720j2700j66930J62218J15209P0642k66666k62627
15883d15646J4258K60864J01625P6632J2911P6122P3993j83030j92399r4851o2391
15872c31912l2982R2105Q5460J26746p7635J14419M1495J10317j8087N496m91511
15861c76089j91497L82208M1556k64969J49782K95464K09309j17652k01646l6049
15851a09583K32572J94067J81329p8926m2890j9075k78029k87137m9528l4668
15841b91868j88070j04792J77503P8391J0811R3563J50208N1695j22107k61630
15831d06296P211K34137R2000J06096l3804j24035J38725K10668J76419j43010
$$ y = [-110053, 992, 52162, 4187, -207895, -329915, -348118, -337465, -178644, -57538, 132736, 72868, 73928, -54792, -67492, -234422, -72204, 43005, 113647, -153019, -415646, -401388, -140524, -38899, 37733, 50644, 126766, 200759, 17729, -174670, -269521, -331912, -364894, -272789, -187329, -60583, -138218, -23799, 17696, 128013, 109926, 115422, -376089, -567586, -185378, -143822, -408791, -259009, 36455, 245764, 128112, -73534, -109583, 122989, 317056, 498385, 419459, 376569, 357494, 79465, -207672, -257200, -291868, -479938, -584730, -407227, -328836, -318025, -224462, -74254, -22559, -144666, -406296, -399085, -164948, -72948, 33148, -656, -124691, 14034, 224702, 401121, 258111]
15821B58111p5190j70658k99917J7285L59747P8083J10009k0643m31993j55079
15811c30245j48349l2766K24531L06084k1162o3120r433J26081n6739q0182j23052
15800b08352L9314J17579j2620j24134P1035J57966j54487l8846N3585K63261
15790A64301M883k32271j82776J41748j3754r2456J2289J51224R6752J05779k41929
15779h6210n6077k77910L1249K58258K3457K26060K14563m6317K2878j81791q2502
15768D5658j53672Q5382l1187J27296j02878k34031j19196k02364k5032J35205
15758d74819J73565K96840P1261J36258m4761k00655Q84J80995l93541k28040
15748d82013K41446j74906R700J36886j875J68557J72520R3936k45336j04937
$$ y = [258111, 182921, 12263, -287654, -270369, 89378, 167461, 277470, 256827, -175166, -330245, -478594, -511360, -286829, 19255, -1907, -65027, -74460, 51621, -5118, -85300, -208352, -169038, -51459, -64079, -188213, -117178, 40788, -113699, -152545, -98960, 164301, 169184, -63087, -245863, -104115, -117869, -210325, -198036, -46812, 49940, 155719, -86210, -142287, -420197, -388948, -130690, -107233, 118827, 333390, 287073, 309951, 128160, 45658, -108014, -22632, -53819, 73477, -29401, -263432, -382628, -584992, -610024, -474819, -301254, -4414, 66847, 203105, 158344, -42311, -41427, 139568, -253973, -482013, -240567, -415473, -405773, -268887, -270762, -102205, 70315, 164251, -81085, -186022]
15738a86022J10661L02j79728J20338K08614L1278m45J8916Q1033j99110k53559
15727b47722o2550j528r4030M803Q9687L7861R1451j00751l0552k0356J10456
15716b23231L6673J43414J73388J09115n1328k30468M1317j41906m7254J017k39455
15705d28718r0726j28449J90045L14477R1694J42345J9944o7686k4864L0691j54772
15694a06019j41463J4580P3755K27595n1196j52618o5628J39326p9584K34210
15684I2958J91111j21264j00590j08729n2758J07126K1373O1079J09743P2620
15674B72669j49079J03937J11956P4608j62177J0725J21141j11452J63096j26387
15664C09037l79387k04502J54149L0034j57439N9806q9939p60J86709j63026j43098
$$ y = [-186022, -75361, -75059, -254787, -134449, 74165, 105443, 104998, 123914, 204947, 5837, -247722, -310272, -311800, -405830, -401027, -311340, -273479, -182028, -282779, -313331, -333687, -223231, -186558, -43144, 130244, 239359, 188031, -42437, -1120, -143026, -190280, -189263, -428718, -519444, -647893, -457848, -143371, -51677, 90668, 110612, 42926, 18062, 48753, -106019, -247482, -232902, -159147, 68448, 17252, -135366, -200994, -61668, -141252, 92958, 284069, 162805, 62215, -46514, -99272, 7854, 29227, 90306, 200049, 272669, 123590, 227527, 339483, 414091, 251914, 262639, 383780, 272328, 435424, 309037, -70350, -274852, -120703, -90669, -248108, -188302, -278241, -279001, -92292, -255318, -398416]
15653c98416l4997Q0212K24976Q3969J01694O7902j8860r4546J94767j17032l0407
15642E9262Q4411l8139M8314j80758k97578J59118Q8474M0162M8437M4118j90256
15631a34435q3676J9876j36448o7263K84907J67380J04932J61649l02558k79851
15621b65487R5488J18438K16967L4209j35002M9765q7452k56048J57125J44822
15611G2825j17954l74476n276N0177k4687L09324J26681j25837K99131j8031j00763
15600I1114j43480j2978J68314P0830j21791j9723K4010J8059K91970J97037j06420
15589D56942m70918j83411K08874P8095L1036p7896l09795j18381J92063K18966
15579B5575J29591K8327q2151n8356K0074n7437k8747R1414K8151l0483Q6958
$$ y = [-398416, -433413, -353201, -128225, -44256, 57438, 125340, 106480, 11934, 206701, 89669, 59262, 143673, 105534, 153848, -26910, -324488, -165370, -76896, -36734, 11703, 55821, -134435, -218111, -198235, -334683, -401946, -117039, 50341, 155273, 316922, 14364, -265487, -169999, -51561, 165406, 199615, 64613, 114378, 26926, -229122, -71997, 72825, -45129, -419605, -424881, -374704, -399391, -90067, 36614, -89223, 209908, 191877, 91114, -52366, -65344, 102970, 173800, 52009, 32286, 56296, 74355, 366325, 563362, 456942, -13976, -197387, 11487, 89582, 120618, 42722, -267073, -385454, -193391, 25575, 155166, 183493, 101342, 42986, 63060, 5623, -23124, 68290, 96441, 65958, 152916]
15568A52916j84096k93625j40712K60j4227J93750L1810J16845J45927p0156l1882
15557i3190o3659O4037k2562o5532K28469L65356j12315j55481M4428L0185o6805
15546A52931j3630j95485l9463o471J12637J65748J8263k07104p4212L9093j66708
15535b14401k62135j83409J25640J3870J18612k339Q7038j70752M1389p3883o2674
15524e83044L16481J8500j31094J64688J02983j54175l23472j03037M0306L04389
15514c47475p7993j9673K4493J9017N5668M2238q4622J35361J83630M934j87433
15503b51855p5976k3767K07209N9240J63739J27831j75439K268j49390Q459J70775
15492F3094j5269J4031j9514M7844j55445j99466j61432J61380p869O1148K04161
$$ y = [152916, -31180, -324805, -465517, -465257, -479484, -285734, -253924, -137079, 8848, -61308, -93190, -156849, -92812, -115374, -180906, 47563, 412919, 300604, 145123, 189551, 219736, 152931, 139301, -56184, -95647, -102118, 10519, 176267, 194530, -12574, -86786, -47693, -214401, -476536, -659945, -534305, -520435, -401823, -404162, -317124, -487876, -446487, -520370, -583044, -266563, -248063, -379157, -214469, -111486, -265661, -589133, -692170, -651864, -347475, -425468, -445141, -420648, -401631, -345963, -303725, -388347, -252986, -69356, -64422, -251855, -327831, -351598, -144389, -85149, 78590, 206421, 30982, 33250, -116140, -107681, 63094, 47825, 61856, 42342, 90186, -65259, -264725, -426157, -264777, -272646, -211498, -7337]
15481g337j43227j02649N9040j64200Q1754J70681j45369M1796j08363M3904L62169
15470H8199R2396j51712j2978j54602L064J54275R1710N1786K02901J13904j51293
15459C27650j07262k1738N2649M3318j43658n7128q9778J8798j54031k15048k6291
15448c72519k29995l86J00264l8461j78643K51544J97826J01647j14513J57698
15438a25538K9344j86934J50296N552o4219O3180L0584n9916o1411k32433J57510
15427b93985K53022L7385p157J00076q2063k01568o1698q7814m8848L6220J67168
15416a89262J5235m3175J33385J57968J52802Q2122J17930j78437j29468k85711
15406a66611l3520L60702m6919k32107M2241m8676N4268Q3573J2664L4108J21879
$$ y = [-7337, -150564, -253213, -194173, -358373, -276619, -105938, -251307, -209511, -317874, -273970, 88199, 180595, 28883, 15905, -138697, -135633, 18642, 110352, 162138, 365039, 478943, 327650, 220388, 198650, 251299, 294617, 150959, 93831, 4053, 22851, -131180, -346228, -372519, -602514, -602900, -502636, -541097, -719740, -468196, -270370, -168723, -283236, -125538, -96194, -283128, -132832, -127280, -191499, -128319, -97735, -157651, -219062, -451495, -293985, -40963, -3578, -10735, 89341, 7278, -194290, -255988, -343802, -392650, -356430, -189262, -174027, -217202, -83817, 74151, 226953, 309075, 427005, 248568, 119100, -166611, -200131, 160571, 113652, -118455, -76214, -124890, -70622, 12951, 25615, 59723, 181602]
15395A81602k56385j81392M3092O5386Q9811L5199o0724j31656K41432K56656
15385B83021J7369J99315j44049l1353o225J7175n7437O923j44066j07629j67778
15374a34734Q7384j11059J14576J23187j5003o3086Q8818K4745m8149Q9934K7080
15363A83693j02193K5674J1240j67918o2642J22394K26192k27754O0277m0079
15353B8884q797J41761J04998N1393r3046J8263J1798m4389k24128L578k5928
15342c5613j05341r2761n9562p8578p124R7813m68m4734K75240k5534k01600j18301
15330c96563K9299K00281K32958r0658l8027q0207j39668j10255n1742r1792J00820
15319d35554K85039J63296j74085O8865K9880M0383J65538k03769j05723k11332
$$ y = [181602, -74783, -256175, -213083, -147697, -57886, -22687, -83411, -215067, 26365, 283021, 300390, 499705, 355656, 324303, 318078, 335253, 277816, 284739, 140673, 33044, -134734, -47350, -158409, -43833, 79354, 64351, 1265, 90083, 114828, 66679, 156613, 183693, 81500, 107174, 118414, -49504, -112146, 10248, 236440, 8686, 68963, 28884, 20087, 161848, 266846, 318239, 225193, 243456, 255254, 210865, -13263, -9685, -35613, -140954, -233715, -293277, -371855, -378979, -281166, -281634, -326368, -51128, -76662, -278262, -396563, -367264, -166983, 65975, -24683, -62710, -142917, -282585, -392840, -444582, -536374, -435554, -150515, 12781, -161304, -92439, -62559, -22176, 143362, -60407, -166130, -377462]
15309c77462K699L42712K54287Q7248j84198k01594j5745m5980j19948L4750J20188
15298a03043J38548K0048q2353j33681n4875l12722j1699J07248J47694J30396
15288a54439q0030n8973L8827J05009L08978q3022k24356j58391o6833J30483
15278b42747K55712K30884K41303J79785p6486n26604n3885j24493m5994Q9612
15268g2913K48122O2863j54770L7459r7708K4507J59141n5372j62618J94676J10066
15257B93453o3894J18867j51530j77718N7248j94437o1054J2472J02928K1019
15247d2646J65110L3354p2061j2039P2640l4224k23730j07095J32534j09463k14667
15236d12287k06300k7948K77110K68412J23139k29732m6899L912O5440J0569j44943
$$ y = [-377462, -374763, -32051, 222236, 309484, 125286, -76308, -92053, -138033, -257981, -223231, -103043, 35505, 55553, -26800, -160481, -215356, -528078, -539777, -432529, -284835, -154439, -234469, -293442, -254615, -149606, 159372, 76350, -148006, -306397, -373230, -242747, 12965, 243849, 485152, 664937, 588451, 61847, 7962, -116531, -162525, -72913, 175209, 238072, 83302, 120761, 23053, 47560, 206701, 151329, -11289, 183387, 293453, 229559, 348426, 196896, 19178, 76426, -118011, -179065, -166593, -63665, -42646, 122464, 155818, 83757, 71718, 144358, 110134, -113596, -220691, -88157, -197620, -412287, -618587, -646535, -369425, -101013, 22126, -207606, -254505, -250593, -185153, -174584, -319527]
15225c19527M1167j05909R6178L00664J40251K06259K32211N1528o2950j73889
15215D05983j59975k1839K25225J26551k82472m01793k01612j65051J68672j45415
15205d51726Q1107P8121r8750j90155R4503L08105M1887j8581J53305N7057j29043
15194g4170j30823r6546k8297J25240J06371J6988k12817k25604j31769J47134
15184e04293J48926j7482J80489K40621Q0554k2013j37560J73546M7454j37215
15174E3027L5035o7221k24557j29835j5554M5110J03810J09537r9123j24490o9182
15163c83443K27971k89681R0141L56781J9783l3924K07607j0423J5834j56753
15153D3893o7072r5906N9913P6480j69425j33147J8172k30840k5511J25600L79574
$$ y = [-319527, -278360, -384269, -288091, 12573, 152824, 359083, 591294, 642822, 579872, 405983, 246008, 224169, 449394, 575945, 293473, -108320, -309932, -474983, -306311, -451726, -370619, -292498, -391248, -581403, -486900, -178795, -136908, -155489, -2184, 54873, -74170, -204993, -301539, -329836, -204596, -98225, -81237, -294054, -519658, -651427, -504293, -355367, -372849, -192360, 48261, 128815, 106802, -30758, 142788, 190242, 53027, 88062, 20841, -203716, -333551, -349105, -303995, -200185, -90648, -189771, -314261, -383443, -155472, -445153, -355012, 1769, 21552, -12372, 195235, 184812, 200646, 43893, -23179, -119085, -59172, 17308, -152117, -285264, -267092, -497932, -523443, -397843, -18269]
15142a8269J82271J52485k79296j15022J22076j09555Q9721L1424j47046j23809
15132b15020l9101J97087k9263j45753o8999K06824q0281k0036n6736n4047p5999
15121c81324K6118L2982P9223P1849J13806K18578J29321k31623j91084J02563
15111b9591j3902n1672j5422m461J87177m8079k15120r3956R4594J50725Q4480
15100D4773m0483m869n5584p5542m7893J66061R0897R088q6960J965J6417Q4070
15088A01940J2401l35218k20595Q2757J57692N5156J27670R3167k94265L1475
15078a87820l0818K7899J20290Q3813K4067M3957o2036O0415j47416j17905N1521
15067a34033q9873J90200K33936j91111l41130k78301J9505L0395N0770J51146
$$ y = [-18269, 164002, 316487, 37191, -77831, 44245, -65310, 24411, 55835, -91211, -215020, -254121, -57034, -86297, -232050, -301049, -94225, -174506, -194542, -251278, -305325, -381324, -355206, -322224, -243001, -171152, -57346, 161232, 290553, 58930, -132154, -29591, -43493, -95165, -110587, -115048, 72129, 24050, -191070, -285026, -190432, -39707, 44773, 4290, -579, -56163, -131705, -179598, -13537, 77360, 86448, -512, 1453, 17870, 101940, 114341, -220877, -441472, -358715, -201023, -145867, -18197, 74970, -219295, -187820, -218638, -190739, -70449, 13364, 37431, 81388, 19352, 79767, -67649, -185554, -134033, -223906, -33706, 200230, 9119, -332011, -610312, -590807, -560412, -509642, -358496]
15057c58496J44168M7864J7116J92548q4383J66532o8345k28440j3530R8174k1830
15046a08622Q451J35214q3979N9938J56052L3113q4434K23588p3022k73982N820
15035a863j99194K28996J55505M7403K91971M5845j66542j02319j41188k85838
15025a27224j98928K24807J93540L07165L6480k00120j69081m6672j06951j16915
15015b03899k51326j979O1086K10406P7423J24819J56215j90528n6846L3419L0219
15004a0991L8789j10500J0401J82346j88169p6949O8592P7791Q7219J5337P3497
14993A67363j51231Q1223j0592J81264j95655j86481l63861N7494M82585J83092
14983B45201j39591k08323N9210r530j73353q6787j13399J89299p9763N6253K39820
$$ y = [-358496, -214328, -166464, -149348, 43200, -41183, 125349, 57004, -171436, -184966, -86792, -108622, -100171, 35043, -48936, 11002, 167054, 200167, 115733, 339321, 266299, -7683, -1863, -201057, 27939, 183444, 230847, 522818, 568663, 402121, 299802, 158614, -127224, -326152, -101345, 92195, 399360, 435840, 235720, 66639, 19967, -86984, -203899, -455225, -457204, -396118, -185712, -108289, 16530, 172745, -17783, -74629, -41210, -10991, 27798, -82702, -72301, 110045, -78124, -155073, -86481, -8690, 78529, 93866, 167363, 16132, 97355, 86763, 268027, 72372, -114109, -477970, -420476, 62109, 245201, 105610, -102713, -43503, -53033, -226386, -313173, -426572, -237273, -317036, -260783, -20963]
14972b0963R6002j60852Q8339K57627K4775q1856m5776l54162j60394R3681j06151
14961c69730J44229n8956k2981k7478p287k6889p0738P8800L5989O6250J46294
14950a12497J56066j72206k35502J09295k2905O1398o5768M0866J32010L68729
14940B59486o1509q0685R3152Q4633j65808r4272J55673q2315j89637r4542J74878
14929i46j90803j45020J44010p9265M921K21065J13468L6418q3015P0612m6036
14918D5409r2561Q7566k83066j49455J07376R8366r5670J24659j73864N3309J10046
14907a67885j06050L8644J53836J25141J03658J68953q4424k37168q4263m370
14897i3928K27944q1645j87402J37087m9181J1230j51996J25631J18740j78158
$$ y = [-20963, 75039, -85813, 2526, 260153, 284928, 203072, 157296, -196866, -357260, -263579, -369730, -225501, -284457, -307438, -334916, -342203, -369092, -439830, -361030, -325041, -258791, -112497, 43569, -128637, -364139, -254844, -277749, -216351, -282119, -241253, -109243, 259486, 197977, 117292, 210444, 295077, 129269, 34997, 190670, 108355, -81282, -175824, -946, -191749, -336769, -192759, -272024, -267103, -46038, 67430, 103848, 20833, 91445, 45409, -47152, 40414, -242652, -392107, -284731, -186365, -282035, -157376, -331240, -277931, -167885, -273935, -235291, -81455, 43686, 147344, 316297, 231873, -5295, -89558, -93928, 134016, 52371, -135031, 2056, -47125, -35895, -187891, -62260, 56480, -121678]
14887a21678K67944j8993O4477o662K6279j25168j71043j51542j9492j0627Q5050
14876a81455M29900n708l69387k26004M6291K7675q9060N8399N9169o9832k10202
14865e30214P6905K2935J07597J76970p5056j73386J57054Q1657j39600R3396
14855b01742K0666r019O3809J87639J50930l71136k67287J98643K48221K21083
14845B41807j22486j14499j90575p263O147M629J43172J83795k6488R5956k90140
14834g5945j36755r8053n1088K5637l5162R7114K05540R8913K99723k1388p5873
14823B32663j85597k78558m7191k3618J15214J18464j9657k0770N1531q5353O7959
14812g4913J66782j01747r350r6997o1265N2768J22907J09514k03662J98567L3132
$$ y = [-121678, 146266, 127273, 191750, 185088, 211367, 86199, -84844, -236386, -255878, -266505, -181455, 248445, 242737, -126650, -352654, -306363, -278688, -367748, -309349, -250180, -320012, -530214, -453309, -430374, -322777, -145807, -220863, -394249, -237195, -155538, -295138, -201742, -181076, -190095, -126286, 61353, 212283, -158853, -426140, -227497, 20724, 241807, 119321, 4822, -185753, -193016, -186869, -182240, -39068, 144727, 118239, 214195, -75945, -212700, -310753, -361841, -336204, -371366, -274252, -68712, 30201, 329924, 308536, 232663, 47066, -231492, -278683, -302301, -187087, -68623, -88280, -109050, -57519, -142872, -74913, 91869, -9878, -19228, -116225, -177490, -124722, -1815, 107699, -95963, 102604, 135736]
14801A35736J38224N5765j61319j12689J1095k1413J65190J21991j74739q862
14791A48979R0669j4410k78568o5244J41333J30233j35958l4178r4679K2624Q7105
14780b094j45252n7091p3199J06622J26532Q0427k08170K8011k3912r3793m5359
14769c07278M1016J32969R9574k7150j38098Q4775J40362k6786L2249o6018r9573
14758a33958J95037Q5561J01057n5491k44668k03357O9817J05888j33871K95537
14748H1552J49035J1042j35637m8469M1591n2606p3324L1604j70412o3360n0486
14737b79470N9186K29977J54044J60631j3321j01357k15922j08366j34133j53186
14727d01917J15309K21298J03636n3061o163k09905j83953j31487n0043j8761
$$ y = [135736, 273960, 329725, 168406, 55717, 66812, 45399, 210589, 332580, 157841, 148979, 239648, 225238, -53330, -118574, 22759, 152992, 17034, -17144, -111823, -89199, -2094, -147346, -204437, -277636, -171014, -44482, 35945, -172225, -144214, -168126, -261919, -307278, -266262, -133293, -33719, -60869, -198967, -114192, 26170, -616, 31633, -34385, -133958, 61079, 146640, 247697, 192206, -52462, -255819, -186002, -80114, -213985, 81552, 230587, 241629, 105992, 57523, 99114, 46508, -26816, 4788, -165624, -228984, -279470, -220284, 9693, 163737, 324368, 311047, 209690, -6232, -114598, -248731, -401917, -286608, -65310, 38326, -14735, -20898, -230803, -414756, -546243, -596286, -615047]
14717f15047J95303J25932K33165J0126O184j8679N5920r0864J52095m0339j2988
14706H08Q1188L3255j91211n789J63701j10220N825j11666k01446J29223L14899
14695A08567J34736j06495j84796j17948J26558J17108M710j12191o4419k54462
14685c48632M1922K23326K38758K02537k11627j96005J13946K88895r9956K4620
14675B77784p5120j43926q8631K92929J5507K2895J43735j66208k11584j1857
14665E5524l3196m5128J69982K15698j75696l27529l5246P0754j76382J63437
14655a17782J51844J51288m0449j05085k01470J39993J11929l5933L8554o525
14645H6364j59610j18961K07176l3809j11430j6315K7464o1248j6962n9485p4595
$$ y = [-615047, -419744, -293812, -60647, -50521, -44337, -63016, -7096, -97960, 54135, 13796, 808, 81996, 115251, -75960, -81749, 81952, -28268, -22443, -134109, -335555, -206332, 108567, 243303, 136808, -47988, -165936, -39378, 77730, 82440, -29751, -94170, -348632, -306710, -83384, 155374, 357911, 146284, -49721, 64225, 353120, 253164, 277784, 202664, 58738, -29893, 263036, 278543, 301438, 445173, 278965, 67381, 55524, 22328, -22800, 147182, 362880, 187184, -140345, -175591, -104837, -281219, -117782, 34062, 185350, 144901, 39816, -161654, -21661, 90268, 54335, 92889, 86364, -73246, -192207, 14969, -18840, -130270, -146585, -119121, -180369, -197331, -256816, -331411]
14634c31411l9021R4186o6210K103P8555J03272j8082K29983j85789j77659M6162
14623b63911K35297J18197K5794j56588K825m5425j33365m5058J52812J8527n2303
14612a43198l03891p7607P5466J89851R438K43955J03167k52321m1427k02894
14602c99461K09162j722J35298J27394O8622n5126j33240O4464j07610n4201J97168
14591E0748j29144k07012R9929L4976J89247Q4382K2520j41763k30761j4352j65907
14580d07137J25318o4589K2212J28276n2042K43753n4431k14545j08229K246P1983
14569c07185K13270Q1426P2389j00985j38046j4036j68147j32313K04739L5919
14559b52969P410K54552J55953m6695j40564p3664k971j73904j02629j80955n247
$$ y = [-331411, -370432, -276246, -342456, -340353, -261798, -158526, -176608, 53375, -132414, -310073, -263911, -28614, 89583, 115377, -41211, -38386, -83811, -217176, -262234, -109422, -90895, -143198, -447089, -524696, -449230, -259379, -249941, -5986, 97181, -155140, -196567, -399461, -190299, -192021, -56723, 70671, 139293, 84167, -49073, 15391, -92219, -146420, 50748, -78396, -285408, -185479, -150503, 38744, 123126, 145646, 3883, -226878, -241230, -407137, -281819, -346408, -324196, -195920, -247962, -4209, -58640, -273185, -381414, -379168, -307185, -93915, -12489, 59900, -41085, -179131, -193167, -361314, -493627, -288888, -252969, -245559, 8993, 164946, 118251, -22313, -95977, -98948, -272852, -375481, -556436, -561683]
14548e61683J94960L10148K46373k17771k50344K2665j04479j449J99139J29943
14538c2498N4882r8935q1989N8212J22958J05796N8091l65855j90578J29831J21883
14527a18202J72121k9696j14158n9729J9870k47824M0683K69311J11280L2522
14517G6178q4154n8694J37165K862P4233K3370Q1754l3994J559k58816n5988K12616
14505A18091o253o1057L6941J47707K09810j06599k40932j73307J00612K0735
14495D5748j83281j27762L8538J06241Q8329O0702J33355R3405J16862R6392j28477
14484C40052j5629K06124k71894l84687P4594l5890o9048N7089N0677L9182J26747
14473A17317J3519R3490K53362J4442q9487j08913Q344o845n0373q051j3430j35986
$$ y = [-561683, -366723, -56575, 189798, -27973, -278317, -255652, -360131, -361580, -162441, -32498, 22384, -76551, -158540, -100328, 22630, 128426, 186517, -179338, -369916, -240085, -118202, 53919, 24223, -89935, -149664, -129794, -377618, -336935, -67624, 43656, 76178, -7976, -66670, 70495, 73357, 147590, 170960, 252714, 218720, 220279, -38537, -94525, 118091, 111838, 50781, 87722, 235429, 445239, 338640, 97708, -75599, 25013, 45748, -137533, -265295, -226757, -120516, -32187, 28515, 161870, 255275, 372137, 468529, 340052, 324423, 530547, 258653, -126034, -51440, -87330, -156378, -99289, -48612, -9430, 117317, 130836, 224326, 477688, 492130, 402643, 293730, 302074, 295229, 244856, 236805, 223375, 87389]
14461H7389P949j01596j4254J45905o1821p4051K0111j7533j61834J71401K00535
14450B02201J34208J12988r2519j08556Q9416M7237k33820j3143J43660R0427
14440C72099n3092j94379k20242K07151K02086m21629j67744J04897Q4830L04432
14430B18409K11606k92755k58197M6725Q2630j53421j6892j94971k0169N4340
14420c22695N8214K7156j07375L7774J42266J33235k7444n0155L7464K67725M6684
14409B42849r3284J09733j35321n6090k4831l26174j57682K55268K29097R3157
14399A36722K67168R8477K9169m5283k23904k74139k22218R811j59704j14723
14389d98624J28407j27931K69700R5672j19714R1984m7369J17963J11970k14555
$$ y = [87389, 95338, -6258, -20512, 125393, 63572, -10479, 9632, -7901, -169735, 1666, 202201, 336409, 449397, 356878, 248322, 337738, 384975, 151155, 138012, 281672, 372099, 319007, 124628, -95614, 111537, 313623, -108006, -275750, -170853, -86023, 218409, 430015, 137260, -120937, -74212, 8418, -145003, -161895, -356866, -377035, -322695, -264481, -237325, -344700, -306926, -164660, -31425, -58869, -109024, -71560, 196165, 242849, 149565, 259298, 123977, 67887, 43056, -283118, -440800, -185532, 43565, 136722, 403890, 502367, 531536, 486253, 262349, -11790, -234008, -224197, -383901, -498624, -370217, -498148, -228448, -132776, -252490, -160506, -207875, -89912, 22058, -192497]
14379a92497P3928J79443J85047l1319k85143j13115Q110r5956J16135P4310J02725
14368B1668m233l9848j51478p7926K6609J62051K78415k68458j41254j15954p8678
14357c89086k05513L19154L20234J30995J9757j06898k13764j49080J61502J04755
14347g944n1114L239J10970k4335j84264L890q2496J00951r0017J44803K03840
14336A27523J7292J29299k03785j94770n9553K54196j02629o5036j25022j32534
14326c55019k8619J92534J43723K32949j2225L1057j2261l853J42622J55210j42262
14315C43856K9797j93765P6590o7348l5633p4274L3487J06628N8676J71032j13804
14304C35242q1263J26708j77770j52913M4429O1054q2785o7296P9110q3281k12939
$$ y = [-192497, -118569, 60874, 245921, 214602, -70541, -183656, -175546, -271502, -155367, -81057, 21668, 17435, -22413, -173891, -251817, -225208, -63157, 215258, -53200, -194454, -310408, -389086, -594599, -275445, 44789, 175784, 195541, 88643, -125121, -274201, -112699, -7944, -59058, -55819, 55151, 30816, -153448, -149558, -232054, -131103, -221120, -76317, 127523, 144815, 274114, 70329, -124441, -183994, 70202, -32427, -97463, -222485, -355019, -383638, -191104, -47381, 185568, 173343, 204400, 192139, 188286, 330908, 486118, 343856, 373653, 179888, 256478, 189130, 153497, 79223, 112710, 219338, 278014, 449046, 335242, 253979, 380687, 202917, 50004, 94433, 155487, 72702, 5406, 84516, 1235, -211704]
14293b11704j72839N5320J98175L2937m638j53036J38413j6700l15004J62702
14283b86374J9721k656J05902R4262K9879r1375J21065k17400l8440M74210n5365
14272A53429l2851R5640J78051K22988k05312p0036J97347n1541k43767q8449
14262A55499O0239k40264j1679K33735q7134J5661J43111j09604n6516N4959J02203
14251B60210o8344R0769j15892N3222M7521p2279j32905q3657j7422J1679j55177
14240a82275p615K67767J29515O0498l66964K9734K70894J97005p0354r5508L26169
14229E58866J41240l91391k82999j08483j21717K56546L01634k8590j06277n1318
14219A67511J21162J26629j24222j9871q7033m8575J06153n7171j32748j73969
$$ y = [-211704, -384543, -329223, -131048, -98111, -102749, -255785, -117372, -134072, -449076, -286374, -266653, -269309, -163407, -69145, -39266, -130641, -9576, -226976, -265416, 208794, 153429, 120578, 216218, 394269, 617257, 411945, 341909, 539256, 487715, 243948, 155499, 215738, -24526, -36205, 197530, 110396, 126057, 269168, 159564, 103048, 158007, 260210, 191866, 282635, 166743, 219965, 267486, 195207, 62302, -21355, -38777, -27098, -182275, -189890, 77877, 207392, 267890, -99074, -69340, 201554, 398559, 328205, 232697, 558866, 700106, 308715, 25716, -82767, -204484, 52062, 353696, 325106, 218829, 167511, 288673, 415302, 291080, 271209, 184176, 135601, 241754, 184583, 51835, -122134]
14209a22134N9299r9169L3356J95097o9560J5218j97670j79983J7663K12763L66612
14198B31492o3387j14412q8969M7804L0246j01258M9031K36747P1728p3110j94601
14187C1311L927L8377k63771N0802O9687m8191j59110J00252o8105O8617j58954
14176c35158q0162n47J16433L6658J94180J82985L5077j27294J5166L58654n5374
14165C40618k54658j45744K9060K04114q7655J78094J76160j01038M9362J4260
14155D02573j0886K10663n9954l35255J8802q9069k1330O6248K06749j01754j41774
14144A45013J09351Q7600J5816P2645j04279j00315j12021j69905n3444J3188
14134i6351L2658K06535k69238J33774J00573j8449j0464j04363k4129N5935J96677
$$ y = [-122134, -62835, -162004, -128648, 66449, -3111, 12107, -185563, -365546, -347883, -135120, 231492, 168105, 53693, -35276, 12528, 42774, -58484, -9453, 227294, 299022, 225912, 31311, 35238, 73615, -190156, -139354, -69667, -117858, -276968, -176716, -244821, -176204, -335158, -415320, -415867, -299434, -262776, -68596, 114389, 149466, 22172, 37338, 395992, 340618, 85960, -59784, -30724, 173390, 85735, 263829, 439989, 338951, 388313, 402573, 391687, 602350, 542396, 207141, 225943, 136874, 115544, 181792, 388541, 286787, 145013, 254364, 341964, 357780, 430425, 326146, 225831, 113810, -56095, -109539, -96351, -63693, 142842, -126396, 7378, 107951, 89502, 79038, -25325, -49454, 6481, 203158]
14123B03158L0224K11267J56844l0880k9649m9872l43217k94306J00437m8359
14113i4353l3195r412N1147M8737k54719n1869J80145Q1170j718R0779j21274
14102a14562m7203N1708l3499J37692K79656n1671n4896r3835j17588o2083n3598
14091a59879j24733J34224J89774j30414k13844M9527K36418P8255n1446j29815
14081a21933j6747M2691j24507j29215q4992m67P8353J07224K89947K19297j8025
14070B41626L4958j11692J12415J59677j59060k20703L8568O3059J19143r7836
14060A80155j9170N9710L0482j09653j09035O9452J68451P2441j09234k21387
14050A2212j44408Q9687J93087l0949j15618Q2341L28533K65066j47978l83476
$$ y = [203158, 233382, 444649, 601493, 570613, 540964, 491092, 147875, -146431, -45994, -94353, -127548, -136960, -85813, -37076, -291795, -343664, -163519, -82349, -84067, 6712, -114562, -161765, -110057, -143556, -5864, 273792, 222121, 167225, 73390, -44198, -106281, -159879, -284612, -150388, 39386, -91028, -304872, -255345, -18927, 59328, 7882, -121933, -138680, -95989, -220496, -349711, -434703, -435170, -356817, -249593, 40354, 259651, 241626, 276584, 164892, 277307, 436984, 277924, 57221, 95789, 158848, 277991, 180155, 160985, 220695, 251177, 141524, 32489, 101941, 270392, 342833, 233599, 12212, -132196, -42509, 150578, 119629, 4011, 86352, 414885, 679951, 531973, 148497]
14040A48497j52190L6175K43288P8757l61655n8678J67032L0077J83270J42528
14030D57101j76745r5530k46451L6231J1129p5431L4938k51175O0010q3038j43377
14019d72338j53101K33929L20283J16756J76045l5856J39884N0161q1349P1927
14009C66341m028k87934j0254J75248J84283k11567l979R1900j00310J61055k9901
13998C30854k84844j53046L94388K59935o3663j81709k35064O9349L2295O8952
13988B37447j02264j75275O5762J1771j2463J28965J6275N1982j23380j8222J72174
13977B52772j6723j58233P1316j29215n3867K80170J87540q6446l04052j1118
13967C2144P2343K1468K30883J23381p8254l1066J66396j34112m2310k228K6634
$$ y = [148497, -3693, 32482, 275770, 354527, -7128, -65806, 101226, 131303, 314573, 457101, 280356, 184826, -61625, -25394, -14265, -89696, -54758, -305933, -245923, -328961, -472338, -625439, -391510, -71227, 45529, 221574, 185718, 325602, 375763, 294414, 366341, 362313, 74379, 64125, 239373, 423656, 212089, 208110, 300010, 199700, 360755, 330854, 46010, -107036, 287352, 547287, 483624, 301915, 66851, 136200, 168495, 237447, 135183, -40092, 25670, 37441, 24978, 153943, 170218, 222200, 98820, 80598, 252772, 236049, 77816, 149132, 19917, -33950, 246220, 433760, 347314, 43262, 32144, 104487, 125955, 356838, 480219, 401965, 370899, 537295, 403183, 360873, 358645, 385279]
13956C85279O5141k64726j7756o7844M6946m7246j13892N3741k4466p1801J60223
13945A03599J07750N3615K5523r4109k8103o2558K7737q1301K6790r6955J66507
13934A48495M3980j21792L95604j558k18092j82549m9779j33177L2820K4815L7137
13923b4096K48259R4025r3027R4791j7117R886J40145M0796j03510n2545J11124
13912D48731R8167k97749m66444R1336J30755m1530m0730j1218K29569l5218j68701
13901f3032k1804L9779J45337J65381Q5190M8781m07346j26398L04758J41489
13891C12135l2143o7289j98646L2227K02770j62293j00737L166J03285j763M2019
13880A32731L4855k83373n6191K58619K44108L1069q7382j97886J24312J04745
$$ y = [385279, 450420, 185694, 167938, 100094, 147040, 99794, -14098, 39643, 15177, -56624, 103599, 211349, 264964, 290487, 196378, 168275, 105717, 133454, 52153, 78943, -18012, 148495, 192475, 70683, 466287, 464729, 246637, 64088, 14309, -118868, -86048, -61233, -24096, 224163, 318188, 225161, 319952, 302835, 312721, 452866, 493662, 390152, 337607, 448731, 546898, 249149, -217295, -125959, 4796, -36734, -77464, -88682, 140887, 105669, -63032, -84836, -45057, 100280, 265661, 350851, 399632, -7714, -134112, 170646, 312135, 279992, 212703, 14057, 46284, 249054, 86761, -13976, -10810, 92475, 90712, 132731, 167586, -115787, -171978, 86641, 330749, 361818, 274436, 76550, 200862, 305607]
13870C05607J4890j03467q7999k09904m1120J95170K42363K948j16340j52687
13860D9461n3996O6317j33802R4252N8058k10855j85857j08298J72402N1452J85451
13849a5415K17685J00654K5554j35800n6375J80958K25671J28922j71569k21045
13839B79240k59646l7318J04363L19654r4444j42753J48357J73704l01391q0908
13829A08858J81450Q7299m9740Q8091k40304p8261j45621o0222J74490k17649
13819a51609n4817J36805J19653k75724K24170J36449j67553J1351j60388q4281
13809b65944k371Q0302J36346J28951o258J07291j4948M0053J01325Q860Q0983
13798C94590J0746j19776O6729P9051J13067m774j72804l13050k63022L1401J48765
$$ y = [305607, 320497, 217030, 129031, -80873, -121993, 73177, 315540, 318488, 202148, 49461, -4535, 61782, -72020, 22232, 80290, -130565, -316422, -424720, -252318, -200866, -15415, 202270, 302924, 328478, 192678, 136303, 317261, 542932, 671854, 500285, 279240, 19594, -17724, 86639, 406293, 311849, 169096, 317453, 491157, 189766, 108858, 290308, 377607, 327867, 415958, 175654, 97393, -48228, -108450, 66040, -151609, -206426, -69621, 50032, -225692, -1522, 134927, -32626, -21275, -181663, -265944, -268315, -188013, -51667, 77284, 71026, 178317, 163369, 203422, 304747, 313607, 394590, 405336, 285560, 352289, 431340, 544407, 539633, 366829, 53779, -209243, -177842, -29077]
13787b9077K16012K12857j30732j77719k85259j51188j1602K65518K12407K31895
13777C53112K29092J34116l0509m8732p9669k57248l48613j477R8457M9527N995
13766A04051J72399P7983p6272k48121J31263J88357J57141Q6157j11136j98527
13756B83295j39933K13797p2966r8729J3786m6039J4877K33168o9089j33055m1812
13745A57300J71076o902J28758J01254p8647j74989j06739j11571q1207j63204
13735a64871J44119J14313q5924j89434o3044J53009M63930J28290p5005j79960
13725B45423j30579r9226K10681J37710R2834J79484K75101J49123j63158k45120
13715F52273L303K150j59973m4802j46714K437l5755K56233O5466j3704J30663
$$ y = [-29077, 186935, 399792, 269060, 91341, -193918, -345106, -356708, -91190, 121217, 353112, 582204, 716320, 685811, 637079, 557410, 300162, -48451, -49928, 48529, 98056, 104051, 276450, 354433, 278161, 30040, 161303, 349660, 506801, 592958, 481822, 283295, 143362, 357159, 284193, 185464, 199250, 153211, 168088, 401256, 332167, 199112, 157300, 328376, 321474, 450232, 551486, 472839, 297850, 191111, 79540, -1667, -164871, -20752, 93561, 7637, -181797, -244841, -91832, 372098, 500388, 425383, 245423, 114844, 15618, 226299, 364009, 456843, 636327, 911428, 1060551, 897393, 652273, 655576, 657726, 497753, 452951, 306237, 308674, 272919, 529152, 594618, 580914, 711577]
13704G11577P0486j32884l10447j73911N2878M5237Q7388K95020j21259m4644
13694D79441J13739j15471j89849K4870J81388N4168r9268q208J07574m2705j42600
13683C63079Q2286j55094Q077M8985n151L04284J03049j06689q9458p4322l21882
13672A57164j70873J87743Q2388R6028o7735l09989L854j8195j17285j46000J17377
13661a85523L31634k21976k06444R7702J21246O1667J6724j0633L25128J13679
13651D43204M8567j6799K4483j0357j62260j89133Q9624J96945P6123j48105J79771
13640E32063J79736j34555m9383o4744q9036R274K07474R210p7735j05547l1111
13629C85646J1410m0740J56261R606o633J3301k68856k97093o0485J47874L0620
$$ y = [711577, 782063, 649179, 338732, 164821, 217699, 262936, 350324, 645344, 524085, 479441, 593180, 477709, 287860, 312730, 494118, 548286, 449018, 440810, 548384, 505679, 363079, 445365, 290271, 298348, 347333, 342182, 646466, 749515, 642826, 553368, 479046, 157164, -13709, 174034, 256422, 352450, 284715, -25274, -21420, -39615, -156900, -302900, -185523, 146111, -75865, -282309, -184607, -63361, -1694, 15030, 4397, 329525, 443204, 491771, 474972, 499455, 489098, 326838, 137705, 227329, 424274, 500397, 352292, 532063, 711799, 577244, 527861, 463117, 374081, 383355, 590829, 600039, 522304, 416757, 385646, 397056, 356316, 512577, 522183, 515550, 528851, 259995, -37098, -97583, 50291, 80911]
13618H0911P232J16468J31072m1049l1788L023j67924j23045p2273P62Q2102K77783
13606B63274K9194J18K18582L8251J09801J15691q4921l26759j82566O8145P5862
13595C24672P3463J83578j92087Q6840K73904k8009r0318J7457j05278q1999j08714
13584C53509j94880J80255J072p7079q8833l0095j4763L05782O8181J85912k0279
13573F68782k56592k48150j62166J6246R8061J29604j21301j99396n9017P1403
13563f2526j16207K62126K03809p7784k93726k03326R7542J79400J44510J54281
13553B88099P5287O6748q9080j2331J11882m0661p5874K63194O0249K8257r272
13542F66498j27746k86098q4332J14643k22946j16128L07644J36944J9847R9823
$$ y = [80911, 88143, 204611, 335683, 294634, 262846, 265869, 97945, -25100, -97373, -96611, -14509, 263274, 292468, 292586, 511168, 549419, 659220, 774911, 689990, 363231, 180665, 248810, 324672, 398135, 581713, 389626, 476466, 750370, 722361, 632043, 649500, 544222, 462223, 353509, 158629, 338884, 339956, 262877, 174044, 143949, 129186, 434968, 503149, 689061, 668782, 412190, 164040, 1874, 18120, 116181, 245785, 124484, -74912, -133929, -62526, -178733, 83393, 287202, 209418, -84308, -287634, -190092, -10692, 133818, 288099, 363386, 430134, 341054, 328723, 440605, 399944, 324070, 587264, 647513, 675770, 666498, 538752, 252654, 168322, 282965, 60019, -56109, 251535, 388479, 408326, 508149]
13532E08149j30430j75945o6758n7268K12744k4307P7193M5247N0792K22750k01372
13521D60795m62076J69530P1239j57304R8969K5195j12131p5054j14729K26214
13511A30648j0090k90669Q2801J04122J4927p337J45580M4800P7579O093L04198
13500F02652O1163p7953n3373j11751j36595M0300L79397J1410p38j39181j95864
13489C79467j02943j42913N6440O2131j5092r589L35661L700q0550R261j01093
13478C94480K1757q7996r1338P8850k1006K9035J60801L790k42225M5032M7044
13467C38224n4831O020N6285P038n7655J06024P3205K70560N1063j96133k65475
13456C34325j69391J31641m6749J40045J86923j21748l85071n0546J28384M1291
$$ y = [508149, 377719, 201774, 135016, 77748, 290492, 266185, 343378, 388625, 439417, 662167, 460795, -1281, 168249, 239488, 82184, 181153, 206348, 94217, 19163, -95566, 130648, 120558, -170111, -87310, 16812, 31739, 24402, 169982, 214782, 292361, 298454, 602652, 663815, 585862, 532489, 420738, 284143, 324443, 703840, 715250, 714512, 575331, 379467, 276524, 133611, 190051, 252182, 237090, 227501, 563162, 566862, 486312, 495573, 394480, 416237, 328241, 236903, 315753, 294747, 323782, 484583, 488373, 246148, 291180, 338224, 283393, 289413, 345698, 352736, 295081, 401105, 474310, 744870, 795933, 599800, 334325, 164934, 296575, 249826, 389871, 576794, 455046, 69975, 19429, 147813, 189104]
13446A89104K29173J67402O3836J54611j90273j78074N4833J03760L58459K97426
13436A250257r0620l37632k23754L7735O3282j8964J14790O845k07800k96283
13426B97856Q8431l5597N5904J9718J55217j6727J1965J16053m99k40704k71398
13415A80219K07504l1532p5239K3049L7343j3750j79940m463L52454J86709J43126
13404H25480k5386k85042k85025J75055N1958j13025P4941K13205K40568r8020
13394G74709k34388p2237J13538K27638n9393O7129J06959p8504p6520l7457J25940
13383H57414M4271l26662Q3300J17205K09575o2078n2678l10683J14073J98515
13373H72252j11129l87456l20650N5022J55837k08999M6246J24818J62865J53704
$$ y = [189104, 418277, 585679, 649515, 804126, 613853, 435779, 490612, 594372, 952831, 1250257, 1159637, 822005, 598251, 635986, 699268, 680304, 795094, 801939, 594139, 297856, 386287, 350690, 406594, 426312, 581529, 564802, 576767, 692820, 692321, 451617, 180219, 387723, 356191, 280952, 304001, 341344, 327594, 147654, 143191, 495645, 682354, 825480, 800094, 515052, 230027, 405082, 457040, 344015, 418956, 632161, 872729, 774709, 540321, 468084, 581622, 809260, 749867, 816996, 923955, 845451, 768931, 731474, 857414, 901685, 575023, 658323, 775528, 985103, 923025, 870347, 559664, 673737, 872252, 761123, 373667, 53017, 108039, 263876, 54877, 101123, 225941, 388806, 542510]
13363E42510L3314k48138M6593j76299R6279J37069j18948o4160J76469O25J71646
13352E96960J80566q4726j62300r0650L5153L5123m8808O4766L94359J13843k56782
13341G77504j21775j27845P6443J65876l1377j06047R7591Q6553m4889j42305
13331F29729J4464N149q4518O2923P9356N6394k2002j08354j11453m1156j70165
13320C10367R5317K74610P1060N3841L879k4673J92893J25018n7353q3876j92764
13309G68319K6325N0891r2242k5839J71801j03663j20353o5691J81715j1679k5603
13298G53981J89309J4480j45288J63926l8628k34864K78554N5526j02434j07485
13288H27077l1621K8316p66L9939J15933o9757j99123N9204p7021J18970M5003
$$ y = [542510, 575824, 327686, 374279, 197980, 294259, 431328, 312380, 248220, 424689, 425314, 596960, 777526, 692800, 530500, 439850, 475003, 510126, 461318, 526084, 920443, 1034286, 777504, 655729, 527884, 604327, 770203, 738826, 632779, 730370, 816923, 772034, 629729, 644193, 649342, 564824, 627747, 707103, 763497, 741495, 633141, 521688, 480532, 310367, 405684, 680294, 751354, 805195, 809074, 784401, 977294, 1102312, 1044959, 961083, 768319, 794644, 845535, 753293, 727454, 899255, 795592, 675239, 609548, 791263, 779584, 753981, 943290, 957770, 812482, 976408, 937780, 702916, 981470, 1036996, 934562, 827077, 795456, 823772, 823006, 862945, 978878, 909121, 709998, 769202, 692181, 811151, 856154]
13277H56154L4664j31700n812N0119j84008J64543L572l4920p0234q2011K8383
13266F28750Q4461L69466j7153j77890l16505o1751K17089n237o6173M6228K34555
13255I35840N6446q3868j67741j37812J93717J76347n3070j54592q6446L33770
13245A012591J04356k76793j76160l31348J46195K96434k590J74263P3012J10707
13235A130667l0034p3537o4511J28534J73691j39368j70573k23045K49652J59019
13225A140495K94547l4216j93989k03325j28666K45265L36650N92j64006j27971
13215A165376j99999R582K65968J87553Q088J93386K12767J41284O752k0616o12
13204A969529j01761R1012k42985k68364l89157L0586o1682j59438m6739L575
$$ y = [856154, 890818, 759118, 753306, 803425, 619417, 783960, 787532, 752612, 682378, 600367, 628750, 713211, 1082677, 1065524, 887634, 571129, 509378, 726467, 721230, 655057, 701285, 935840, 992286, 908418, 740677, 602865, 796582, 972929, 919859, 765267, 678821, 1012591, 1116947, 840154, 663994, 332646, 478841, 775275, 772685, 946948, 1019960, 1130667, 1100633, 1027096, 962585, 1091119, 1264810, 1125442, 954869, 731824, 981476, 1140495, 1435042, 1400826, 1206837, 1003512, 874846, 1120111, 1456761, 1457353, 1293347, 1165376, 965377, 974959, 1240927, 1428480, 1436568, 1629954, 1842721, 1984005, 1990757, 1970141, 1969529, 1867768, 1958780, 1715795, 1447431, 1058274, 1088860, 1027178, 867740, 821001, 824576]
13194H24576K3613L11333J5200l305L5355k17884j2324j9410Q3035J29686J66060
13183A335935O9397k55851k46593q9910L5310K5809K44110L69684O133j2763P1285
13172A552546k036k0560p463K79420O4795p8061P6892K27421L77201N08306M04504
13161C382965K60529J72502J23043n9793n36192o83901n37206l68126k61100m19991
13151A072730j89484J10638L25091L36448J20505L3164k99039l0548M8577j10299
13141A417783R9074M033p55J21935l9695k82060p2777J97628J03561l2862J03166
13130A619031l8410k65246j54377J72131J95926q8289P5344N00633J47527k690
13120B161580l8429K93219M76743L29817M38905N04299P2183l39831l94984m48905
$$ y = [824576, 848189, 1159522, 1174722, 1171417, 1206772, 988888, 976564, 957154, 1040189, 1169875, 1335935, 1405332, 1149481, 902888, 812978, 848288, 874097, 1118207, 1487891, 1494024, 1481261, 1552546, 1550510, 1529950, 1522487, 1801907, 1866702, 1788641, 1865533, 2092954, 2470155, 2978461, 3382965, 3643494, 3815996, 3939039, 3879246, 3343054, 2659153, 2121947, 1753821, 1492721, 1072730, 883246, 993884, 1318975, 1655423, 1775928, 1809092, 1510053, 1479505, 1528082, 1417783, 1516857, 1520890, 1520135, 1642070, 1602375, 1320315, 1247538, 1445166, 1548727, 1515865, 1619031, 1580621, 1315375, 1160998, 1333129, 1529055, 1440766, 1516110, 2016743, 2164270, 2161580, 2123151, 2416370, 2893113, 3222930, 3661835, 4166134, 4238317, 3898486, 3503502, 3054597]
13110C054597m09302j94293k66750k30256k66920j60606j04953M5922J26738K73673
13100A867850j39454m14855R2173r9808j14941m5760J58762J72467Q7755j7145
$$ y = [3054597, 2645295, 2451002, 2184252, 1953996, 1687076, 1526470, 1421517, 1467439, 1594177, 1867850, 1728396, 1313541, 1405714, 1305906, 1190965, 1145205, 1303967, 1476434, 1564189, 1547044]
$$ [...]
##END NTUPLES=NMR SPECTRUM
##END=
