##TITLE=Analysis number 322757
Compound Code cc 57810
Book Reference 449/152/3
Project Code adrs
Chemist Name davee
##JCAMPDX= 6.0         $$ Bruker NMR JCAMP-DX V2.0
##DATA TYPE= NMR SPECTRUM
##DATA CLASS= NTUPLES
##ORIGIN= Bruker BioSpin GmbH
##OWNER= nmr
$$ XWIN-NMR		Version 3.5
$$ Mon Oct 16 08:39:55 2006 GMT Daylight Time (UT+1h)  MAYBRIDGE\nmr@NMR_250MHZ
##.OBSERVE FREQUENCY= 250.131544655141
##.OBSERVE NUCLEUS= ^1H
##.ACQUISITION MODE= SIMULTANEOUS (DQD)
##.ACQUISITION SCHEME= undefined
##.AVERAGES= 16
##.DIGITISER RES= 18
##SPECTROMETER/DATA SYSTEM= dpx250
##.PULSE SEQUENCE= zg30
##.SOLVENT NAME= CDCl3
##.SHIFT REFERENCE= (INTERNAL, CDCl3, 0, 16.522)
##AUDIT TRAIL= $$ (NUMBER, WHEN, WHO, WHERE, WHAT)
$$ ##TITLE= Audit trail, XWIN-NMR		Version 3.5
$$ ##JCAMPDX= 5.01
$$ ##ORIGIN= Bruker BioSpin GmbH
$$ ##OWNER= nmr
$$ C:\u/data/dgb/nmr/ADRS/370/pdata/1/auditp.txt
$$ ##AUDIT TRAIL=  $$ (NUMBER, WHEN, WHO, WHERE, WHAT)
(   1,<2006-10-16 08:39:29.96 +100>,<MAYBRIDGE\nmr>,<NMR_250MHZ>,
      <created by zg, POWCHK disabled, PULCHK disabled
       configuration hash MD5:
       49 4B E0 1D 92 C2 6B 37 9F E6 65 BC 52 41 86 1D
       data hash MD5: 64K
       F3 C9 4A E4 F6 14 62 A7 47 4A 46 E6 82 07 2A B2>)
(   2,<2006-10-16 08:39:46.53 +100>,<MAYBRIDGE\nmr>,<NMR_250MHZ>,
      <Start of raw data processing
       ef LB = 0.3 FT_mod = 6 PKNL = 1 SI = 32K 
       data hash MD5: 32K
       31 1C 7A 37 50 80 0A D0 A7 BF AF 22 06 AF 43 EE>)
(   3,<2006-10-16 08:39:48.42 +100>,<MAYBRIDGE\nmr>,<NMR_250MHZ>,
      <apk 
       data hash MD5: 32K
       9C A9 3D DB FA 28 9D 91 03 44 BD EA 30 B0 9C 27>)
(   4,<2006-10-16 08:39:49.88 +100>,<MAYBRIDGE\nmr>,<NMR_250MHZ>,
      <abs ABSG = 5 
       data hash MD5: 32K
       27 F9 94 A4 74 A7 7B BF 2D 24 22 EE 11 4B 48 4F>)
$$ ##END=
$$ 
$$ hash MD5
$$ 54 60 5E 9D 98 60 32 3D C9 E9 A6 FF A3 B8 A3 7F
##$RELAX= 
##$RELAX= 
##$RELAX= 
##$RELAX= 
##$RELAX= 
##$RELAX= 
##$RELAX= 
$$ Bruker specific parameters
$$ --------------------------
##$DU= <C:\u>
##$EXPNO= 370
##$NAME= <ADRS>
##$PROCNO= 1
##$TYPE= <nmr>
##$USER= <dgb>
##$AMP= (0..31)
100 100 100 100 100 100 100 100 100 100 100 100 100 100 100 100 100 100 
100 100 100 100 100 100 100 100 100 100 100 100 100 100 
##$AQSEQ= 0
##$AQ_mod= 3
##$AUNM= <au_zg>
##$AUTOPOS= <23 >
##$BF1= 250.13
##$BF2= 250.13
##$BF3= 250.13
##$BF4= 250.13
##$BF5= 500.13
##$BF6= 500.13
##$BF7= 500.13
##$BF8= 500.13
##$BYTORDA= 1
##$CFDGTYP= 0
##$CFRGTYP= 5
##$CHEMSTR= <none>
##$CNST= (0..31)
1 1 145 1 1 1 1 1 1 1 1 1 1 1 1 1 1 1 1 1 1 1 1 1 1 1 1 1 1 1 1 1 
##$CPDPRG= <>
##$CPDPRG1= <>
##$CPDPRG2= <>
##$CPDPRG3= <>
##$CPDPRG4= <mlev>
##$CPDPRG5= <mlev>
##$CPDPRG6= <mlev>
##$CPDPRG7= <mlev>
##$CPDPRG8= <mlev>
##$CPDPRGB= <>
##$CPDPRGT= <>
##$D= (0..31)
0 1 0 0 0 0 0 0 0 0.06 0 0 0 0 0 0 0.0002 0 0 0 0 0 0 0 0 0 0 0 0 0 0 
0 
##$DATE= 1160984369
##$DBL= (0..7)
120 120 120 120 120 120 120 120 
##$DBP= (0..7)
150 150 150 150 150 150 150 150 
##$DBP07= 0
##$DBPNAM0= <>
##$DBPNAM1= <>
$$ [...]
##$SUBNAM7= <"">
##$SUBNAM8= <"">
##$SUBNAM9= <"">
##$SW= 20.6930455092707
##$SWIBOX= (0..15)
0 0 3 0 0 0 0 0 0 0 0 0 0 0 0 0 
##$SW_h= 5175.983436853
##$TD= 65536
##$TD0= 1
##$TE= 683.16
##$TE2= 300
##$TE3= 300
##$TEG= 300
##$TL= (0..7)
0 120 120 120 120 120 120 120 
##$TP= (0..7)
150 150 150 150 150 150 150 150 
##$TP07= 0
##$TPNAME0= <>
##$TPNAME1= <>
##$TPNAME2= <>
##$TPNAME3= <>
##$TPNAME4= <>
##$TPNAME5= <>
##$TPNAME6= <>
##$TPNAME7= <>
##$TPOAL= (0..7)
0.5 0.5 0.5 0.5 0.5 0.5 0.5 0.5 
##$TPOFFS= (0..7)
0 0 0 0 0 0 0 0 
##$TUNHIN= 0
##$TUNHOUT= 0
##$TUNXOUT= 0
##$USERA1= <user>
##$USERA2= <user>
##$USERA3= <user>
##$USERA4= <user>
##$USERA5= <user>
##$V9= 5
##$VALIST= <valist>
##$VCLIST= <CCCCCCCCCCCCCCC>
##$VD= 0
##$VDLIST= <DDDDDDDDDDDDDDD>
##$VPLIST= <PPPPPPPPPPPPPPP>
##$VTLIST= <TTTTTTTTTTTTTTT>
##$WBST= 1024
##$WBSW= 4
##$XGAIN= (0..3)
0 0 0 0 
##$XL= 0
##$YL= 0
##$YMAX_a= 531534
##$YMIN_a= -431968
##$ZGOPTNS= <>
##$ZL1= 120
##$ZL2= 120
##$ZL3= 120
##$ZL4= 120
##$ABSF1= 16.522
##$ABSF2= -4.171173
##$ABSG= 5
##$ABSL= 3
##$ALPHA= 0
##$AQORDER= 0
##$ASSFAC= 0
##$ASSFACI= 0
##$ASSFACX= 0
##$ASSWID= 0
##$AUNMP= <proc_1d>
##$AZFE= 0.1
##$AZFW= 0.1
##$BCFW= 0
##$BC_mod= 0
##$BYTORDP= 0
##$COROFFS= 0
##$CY= 12.5
##$DATMOD= 1
##$DC= 0
##$DFILT= <>
##$DTYPP= 0
##$F1P= 14.0000005364418
##$F2P= -0.99999901652339
##$FCOR= 0.5
##$FTSIZE= 32768
##$FT_mod= 6
##$GAMMA= 0
##$GB= 0
##$INTBC= 1
##$INTSCL= 1
##$ISEN= 128
##$LB= 0.3
##$LEV0= 0
##$LPBIN= 0
##$MAXI= 10000
##$MC2= 0
##$MEAN= 0
##$ME_mod= 0
##$MI= 0
##$NCOEF= 0
##$NC_proc= -4
##$NLEV= 6
##$NOISF1= 0
##$NOISF2= 0
##$NSP= 0
##$NTH_PI= 0
##$NZP= 0
##$OFFSET= 16.522
##$PC= 1
##$PHC0= -48.32469
##$PHC1= 5.579127
##$PH_mod= 1
##$PKNL= yes
##$PPARMOD= 0
##$PSCAL= 4
##$PSIGN= 0
##$REVERSE= no
##$SF= 250.13
##$SI= 32768
##$SIGF1= 0
##$SIGF2= 0
##$SINO= 400
##$SIOLD= 32768
##$SREGLST= <1H.CDCl3>
##$SSB= 0
##$STSI= 32768
##$STSR= 0
##$SW_p= 5175.98343685301
##$SYMM= 0
##$S_DEV= 0
##$TDeff= 65536
##$TDoff= 0
##$TI= <Analysis number 999999
Compound Code 99
Book Reference 9
Project Code 9>
##$TILT= no
##$TM1= 0
##$TM2= 0
##$TOPLEV= 0
##$USERP1= <user>
##$USERP2= <user>
##$USERP3= <user>
##$USERP4= <user>
##$USERP5= <user>
##$WDW= 1
##$XDIM= 32768
##$YMAX_p= 304564001
##$YMIN_p= -188360
$$ End of Bruker specific parameters
$$ ---------------------------------
##NTUPLES= NMR SPECTRUM
##VAR_NAME=  FREQUENCY,     SPECTRUM/REAL,   SPECTRUM/IMAG
##SYMBOL=    X,             R,               I
##VAR_TYPE=  INDEPENDENT,   DEPENDENT,       DEPENDENT
##VAR_FORM=  AFFN,          ASDF,            ASDF
##VAR_DIM=   32768,         32768,           32768
##UNITS=     HZ,            ARBITRARY UNITS, ARBITRARY UNITS
##FACTOR=    0.157963299565203, 1,           1
##FIRST=     4132.6476996994, 0,             0
##LAST=      -1043.33573715361, 0,           0
##MIN=       -1043.33573715361, -188360,     0
##MAX=       4132.6476996994, 304564001,     0
$$ Real data points
##PAGE= N=1
##DATA TABLE= (X++(R..R)), XYDATA
$$ [...]
17196a9964j5659k8594O828N2552O1484O9043L355p7766K795k8920j4814K0779
17184C1119k0570R295r846J0448R789m8722k6770K6773k7118j7099K6152J4128
17172b2421M570J7424O1099k1685k9301l33J9031O7732N8416N161L8577K4927
17160B23197Q542l8310L9194R346l7974m2029k3258n487k0585m4528M7562l941
17148A11729m7573j3645o064l372J6846j0975P305J2989j467m694l7907m2029
17136a8857K6299J5469n6161K259J3962J2611m8957N7774J1969n309p752J2456
17124A5763n050k8417L934k1600j8476J9856M3839q60k359J9648L8246j046k4681
17111C8797J2305j9479p6759k2674M3645M474M9432L007j1743k2841k5359J6623
$$ y = [-19964, -35623, -64217, -57389, -4837, 56647, 125690, 129045, 51279, 54074, 25154, 10340, 31119, 10549, 19844, 9998, 20446, 30235, -18487, -45257, -18484, -45602, -62701, -36549, -22421, -17851, -427, 60672, 38987, 9686, 9353, 28384, 96116, 154532, 159693, 198270, 223197, 231739, 193429, 232623, 241969, 203995, 161966, 138708, 133221, 112636, 68108, 115670, 111729, 64156, 50511, 44447, 41075, 57921, 46946, 54251, 67240, 65773, 61079, 23172, -18857, 7442, 22911, -33250, -30991, -17029, -4418, -53375, 4399, 16368, 11059, 3307, 15763, 10713, -17704, -13770, -35370, -53846, -33990, 9849, 8989, 6630, 26278, 64524, 63478, 38797, 51102, 31623, -45136, -67810, -24165, -19691, 29741, 32748, 21005, -1836, -27195, -10572]
17099a0572l9999k0427J7618J4429K1134J4498Q240k442j7020o3928O551L4063
17087c7855P7816R090k0645R777l424l1415K2898K093o2991J801q110J1616k4997
17074e4346K5968l6099K015J7022J2982N018J0996K2143k3287J3165l308P63j6277
17061b3245L611J3258K7423K290J429K6175m2139j8409N191j0308j158r252L2351
17048G217j8400p1784k182j0626j9042M2423O4010J3750J7064Q9J645j8926J1
17035E249m051P303k9516l5014J8041l562J4436j4319j046Q448m590L6355J5281
17022A3015J7823j3673m0335K662R641K6274Q730j6316l0942K4967J4854m5533
17010b8833m873l176L2331m275q163N0216K1205k2417J7593k9228l4922j3814
$$ y = [-10572, -50571, -70998, -53380, -38951, -17817, -3319, 4921, 2479, -14541, -78469, -71918, -37855, 39961, 49051, 28406, 38183, 34759, 3344, 26242, 28335, -34656, -32855, -40965, -29349, -54346, -28378, -64477, -62462, -45440, -32458, -27440, -16444, 5699, -17588, -4423, -7731, -6968, -23245, -19634, -6376, 21047, 23337, 24766, 50941, 8802, -9607, -4416, -14724, -15882, -25134, 7217, -11183, -82967, -85149, -95775, -114817, -72394, -8384, 5366, 22430, 22519, 24164, 5238, 5249, 1198, 8501, -21015, -56029, -37988, -41550, -27114, -41433, -42479, -34031, -38621, -2266, 13015, 30838, 17165, -23170, -20508, -10867, 15407, 24137, 7821, -23121, 1846, 16700, -28833, -33706, -36882, -4551, -8826, -16989, 33227, 54432, 32015, 49608, 20380, -14542, -28356]
16998b8356j0412J8899l2467l1023L9860K5368n2422J548K7910j7616L0619N0011
16986B1919J7690m0075m7420M8056J0573L0849J996J2175n253N323m7693m4994
16974c6854J3562M7753J4771k173j3523p1586m9439K0819K7714J9139J608K4457
16962c752L0588J6585l8561j080K4243j3078n2006N2302l292j9205j2135j1923
16950c1314J1318M6997l24J1273M766l1379m7931k0469J09k5574K6420R1731M3317
16937G8940n9645k2237j4236K4983j0645m3046o890j9122N803J4384l6649M759
16925h3601K6733Q491K9817k7817J4650P3728n2658n4263k1211K8666l025K145
16913e8345K44p29J5172J5809J9141M200O4772l9854r7912K2816Q619j0561J7995
$$ y = [-28356, -38768, -19869, -52336, -83359, -43499, -18131, -70553, -69005, -41095, -58711, -28092, 21919, 39609, -466, -47886, 170, 10743, 41592, 43588, 55763, 50510, 55833, 8140, -36854, -23292, 24461, 39232, 37059, 23536, -48050, -97489, -76670, -48956, -29817, -28209, -3752, 26836, 43421, 4860, 3780, 28023, 14945, -37061, 15241, 11949, -7256, -19391, -31314, -19996, 27001, 26677, 37950, 42716, 11337, -36594, -57063, -56954, -82528, -56108, 35623, 78940, 19295, -2942, -17178, 7805, -2840, -45886, -52776, -71898, -66095, -51711, -88360, -83601, -56868, -48377, -18560, -46377, -31727, 42001, -10657, -64920, -86131, -57465, -60490, -58345, -58101, -58830, -43658, -27849, -8708, -4508, 60264, 20410, -77502, -54686, -46067, -56628, -38633]
16900c8633K620l2401J1014K4591Q1908K5713r06q4649l3487K5390K8990K744
16888A2894j3940J5548L8331O747p303k3925k4210J5307k5615p679n5985K5401
16876d4429q536N493R436R640K7203m4798m161J0340Q386o672M9741k8155k4850
16863d1362K7837K1681j341n749j7225K5282L7139o3543o1122j8391N7636L7670
16851a488l374l0320J1651K332m821j7420M1962r612m1589K798J9359L1534j7634
16838a6622l4818L7877J2933J3035j5508L2894k288k9209o8209J561J1928k4495
16826h0921j7340K6685R079k037O7280J7182l4104l1637J4492k2600J804L4115
16814a8002n999l2347J6149J7563j5111L626n416K2136L9358j0546l30N949K374
$$ y = [-38633, -36013, -68414, -57400, -32809, 49099, 74812, 73906, -10743, -44230, -18840, 10150, 12894, -1046, 14502, 52833, 59580, 52277, 28352, 4142, 19449, -6166, -13845, -69830, -44429, -52965, -47472, -38036, -28396, -1193, -45991, -50152, -39812, -31426, -38098, 11643, -16512, -41362, -13525, 8156, 6815, 1066, -16159, 9123, 46262, -17281, -78403, -96794, -39158, -1488, -4862, -35182, -23531, -21199, -26020, -43440, -1478, -11090, -52679, -49881, -30522, 1012, -16622, -51440, -13563, -630, 12405, -3103, 29791, 27503, -1706, -69915, -68354, -56426, -80921, -98261, -71576, -62497, -64534, 2746, 19928, -14176, -45813, -31321, -53921, -52117, -18002, -24001, -56348, -40199, -22636, -37747, -34121, -39537, -17401, 21957, 11411, 11081, 17030, 19404]
16801A9404p207m8877j2969j5689K9708J7855k0692J1450j1709R828j650M168
16789b6380J0222j2550r767M5409J5926l3467r817L4876o232k116j1665n470j4712
16776b5743J9141O0368R80l2899K020m0124r666k9565r438j6115n425R809j8313
16763i4970K9330J9494j9762L1177K4886N007J2180p008k2715Q800q883J1511
16751a0953Q394m3592m1654k0998P816R1162L5497n8836k0792K8627j4226m1393
16739h0948J4971M7380L9113q696l1974k4677j3164l2780K0119M5781J2941L779
16727h155J8094k6987j6907k730K07k2542P6K8145o249j3215J5693m8688O936
16714g6322O4520K5546J2576j8934k3825j9340k3179l1297k0127N997M6194R681
$$ y = [19404, 12197, -36680, -49649, -65338, -35630, -17775, -38467, -27017, -38726, -28898, -30548, -26380, -16158, -28708, -38475, 6934, 22860, -10607, -20424, 14452, 8220, 6104, -5561, -11031, -25743, -6602, 53766, 54746, 21847, 23867, -16257, -25923, -55488, -64926, -81041, -86466, -76657, -94970, -65640, -46146, -65908, -34731, -9845, -4838, 7342, 334, -22381, -13581, -22464, -10953, -2559, -46151, -87805, -108803, -100987, -9825, 25672, -33164, -53956, -25329, -39555, -80948, -65977, -18597, 20516, 11820, -20154, -44831, -57995, -90775, -70656, -24875, -11934, -8155, 9939, -17048, -33955, -36685, -36478, -59020, -58944, -30799, -37048, -50263, -34570, -83258, -76322, -11802, 13744, 26320, 7386, -16439, -35779, -58958, -90255, -110382, -104385, -58191, -48510]
16702d8510K0666J2739M1961Q141l5095N620L8309N0162m3157o394m8648k2219
16690b6425m5334q771N805K0019R569L0574j8829l7580j8010K2298P1249L2499
16678C7064k9731r389K4474j680j211j5927n4916q0541j5784L8234K0073K9012
16666f0322K1887p212j1970K5391j1246q924Q079K061K1935R536M962l6051k2610
16653f4484K7620L432J4243L869L7154k4487J1882k552M564J3455k0625m0505
16641c6434j671Q734o297L94r902L4648J7280n921k8239Q484N4899p237o2903
16628c4165k9180M8786K1374J4775n1842j2231J1947R919n2689K0208N0815L7024
16616C4741M7743l2512k1382n5891j2079K544j9306J4620L8787N6496l2923l6846
$$ y = [-48510, -27844, -15105, 26856, 34997, -98, 5522, 43831, 93993, 50836, 44442, -4206, -26425, -71759, -80530, -74725, -54706, -45137, -14563, -33392, -70972, -88982, -66684, 4565, 37064, 7333, -2056, 22418, 20738, 19527, 3600, -51316, -131857, -147641, -109407, -89334, -60322, -38435, -45647, -57617, -32226, -43472, -52396, -44317, -42256, -20321, -10785, -5823, -41874, -64484, -36864, -33432, -19189, -15320, 21834, -2653, 9229, 6677, 11241, 24696, 4071, -36434, -38105, -29371, -35668, -35274, -45176, -10528, 6752, 831, -27408, -18924, 35975, 28738, -34165, -63345, -14559, 6815, 21590, -30252, -42483, -30536, -20617, -73306, -53098, -2283, 34741, 82484, 49972, 28590, -27301, -39380, -36836, -56142, -41522, -2735, 53761, 20838, -16008]
16604a6008K7468J5851j8006k7250n477J3369k418j0r646k6945L1087L7799K3620
16591D3434J2169j8235l1721N3287k9017k3384n915J2711m9354l1202K2159K1166
16579b3902m141J8226N5677l2926j6843K7908j4859j9381N6199J4884k7545k1732
16567A1565p681m9169J0342K4479m539J5901N307q680m3846J3759M7958k696O14
16554A3314k815J1792M1753m262l5171r956j4771k5464l2686k822M1296P2170
16542E2378K7883m605m2399l3112j6034l6635J540P1572K9882k1045n3030p815
16530c1420M0183m2640n3389N203M8652L1613j6908k083L65K1064N411k0138n819
16517a9906o7558r181L1521K7748O1625j4167m3943L1874L3647m2127J4863R696
$$ y = [-16008, 11460, 27311, 9305, -17945, -23422, -10053, -12471, -12481, -22127, -49072, -17985, 19814, 43434, 55603, 37368, 5647, 58934, 29917, 6533, 618, 13329, -36025, -67227, -45068, -23902, -28043, -9817, 45860, 12934, -3909, 23999, 9140, -10241, 45958, 60842, 33297, 11565, 3884, -45285, -34943, -10464, -15003, 898, 6205, -2475, -46321, -32562, 15396, 12700, 13314, 10499, 22291, 64044, 59782, 24611, 14655, -116, -25580, -58266, -61088, -19792, 52378, 80261, 75656, 33257, 145, -15889, -52524, -50984, 20588, 50470, 29425, -23605, -31420, 8763, -33877, -87266, -82063, -33411, -1798, -18706, -20789, -20424, 640, 6051, -14087, -19906, -87464, -96645, -65124, -37376, 24249, 10082, -33861, -1987, 31660, -10467, 4396, 14092]
16505A4092m3521J2451m8535Q369k4864j9844M3915L3688m367L6655O513l4847
16493b0295n24j0202L0245J5080l2866l4383J6164o826o342n6831L2677j5474
16481h9577k32P073J3537M2820J1875k0913q325j4906K9169M1079O960J5141l5673
16468a972J9274L6137l3429J9951L4782L875j6007j9926n9124m0440L56R718n354
16455e2159K8069l809K9110j7560m5406j1672m334L4397K0176l088L6356J104
16443A1184K1979M3676k0403j8244j7444k5050j0186P256j241k1687L6453n19
16431E774N543K5222O316o9638k5359K50J4985M1464L9703J9146K1023J0333m7649
16418D7113l3116K539M1026m2422j099m979k6705k2360M7330K439n697M713l237
$$ y = [14092, -29429, -16978, -65513, -57144, -82008, -101852, -57937, -24249, -28616, 8039, 14552, -20295, -20819, -31021, -776, 14304, -18562, -52945, -36781, -43607, -49949, -106780, -74103, -89577, -89809, -82736, -69199, -26379, -14504, -35417, -43742, -58648, -29479, 11600, 18560, 33701, -1972, 17302, 53439, 20010, 39961, 74743, 78618, 62611, 42685, -16439, -56879, -56523, -46805, -52159, -24090, -27899, 1211, -16349, -61755, -73427, -77761, -43364, -23188, -26276, 10080, 11184, 33163, 76839, 56436, 38192, 20748, -4302, -14488, -7232, -8473, -30160, 6293, 5774, 11317, 36539, 42855, -26783, -52142, -51892, -36907, 4557, 44260, 63406, 84429, 94762, 47113, 13997, 16536, 57562, 15140, 14041, 9062, -17643, -40003, 7327, 9766, 4069, 8782, 5545]
16405E545r678k9102k9244j2069l9994R491K9941L1396L9461N5126J493l6146
16393A6220J900L4787L29l8602j7784l7420k0057m1250J2386J6640j5925j1078
16381i9854M078Q614K5764K1146O693K9253K898k7129L513M3141K2017l1128r852
16368h46K3315k2247J917Q96j7663J0009J9603r213o5346n1406J8350J843J4279
16355g6509K5003K9048k4327k996K5430K1140K0496j8696n9678K8930L9240M2529
16343D9610J7383k6156q9869m4307j2357k182L1588M1285j8272K8301P069L1590
16331A3683L1735l9661l8326O31n058J3299j8874j8350k558O18J7992O0806N9285
16318G5222R770m5390k998J8471j8441j2178j4007k5980O635K4713j0654O326
$$ y = [5545, -4133, -33235, -62479, -74548, -114542, -105051, -75110, -43714, -4253, 50873, 52366, 16220, 18120, 52907, 53236, 14634, -3150, -40570, -60627, -101877, -89491, -72851, -88776, -99854, -95776, -87162, -61398, -40252, -33559, -4306, -1408, -28537, -25024, 18117, 40134, 9006, -846, 22469, 222, 2139, 3035, -14628, -4619, 14984, 5771, -59575, -110981, -92631, -90788, -76509, -51506, -22458, -46785, -49781, -24351, -3211, 17285, -1411, -61089, -32159, 7081, 49610, 66993, 40837, -49032, -93339, -105696, -107878, -76290, -35005, -53277, -24976, -17907, 13683, 45418, 5757, -32569, -31938, -36996, -23697, -42571, -60921, -63479, -62861, -44869, 15937, 75222, 84992, 39602, 36604, 55075, 36634, 24456, 10449, -15531, -8896, 15817, 5163, 11489]
16306A1489r967o7463j4289J7607K7797L2229j2846L131j1874k3430j0755Q504
16294d9867j6634n6586l7618K0733M6493k8480Q346J9260L2591M5914r713j5855
16282d1416J7264J1603J9353m6172k4418O6890P912J2461R506r143n2645j0008
16270c8813j2121R64J1459m5644L7360M5424j8481l8221j2857q861j9948J1818
16258h7921K2843O4970M9301j6303r813Q646k6201P428j4558o1717l0535J0219
16246h3641J8530j994l0901r11L7561k3623k7299K8886J5179L0243K990j5474
16234e0454k252k6600j968M4721N3554j5854l8524j9255M696J4828o765k7125
16222g0998J2974J6263K0923J5552O348k3052O509k9917k0267K8439J6666J2627
$$ y = [11489, 1522, -65941, -80230, -62623, -34826, -2597, -15443, -12312, -24186, -47616, -58371, -49867, -66501, -123087, -160705, -139972, -93479, -121959, -113613, -94353, -61762, -15848, -25561, -41416, -24152, -12549, 6804, -39368, -63786, 3104, 11016, 23477, 32983, 23840, -28805, -38813, -50934, -49970, -38511, -84155, -46795, -1371, -19852, -58073, -70930, -79791, -99739, -87921, -65078, -108, 49193, 32890, 23077, 31723, 5522, 12950, -1608, -63325, -93860, -83641, -65111, -67105, -98006, -98917, -61356, -84979, -112278, -83392, -68213, -37970, -34980, -50454, -52706, -79306, -81274, -36553, 17001, 1147, -37377, -56632, -51936, -37108, -43873, -70998, -58024, -41761, -20838, -5286, 1062, -21990, -15481, -45398, -65665, -37226, -20560, -7933]
16210g933l2385K4807L3459l5533k2964j5120k6680j5245L7914N8042m440J8765
16198A2687J0865J2373l5418j9273K2718O226j3394N617N5324m1494k8738j827
16186a4334k4448l329j3986M998n353M8593L0538l8849k0542l671p168K0612k0981
16173d7920k5236K529p396J4199P3558K153l7878l0406J7270L5322N119k2285
16161b0971q585l2466q847r644K7663R26K7036k8734J9806J1860K6354k5580m860
16148b6042j7956o922J2129N3840r462n8110L4634L1272J001L329j0904n7694
16136e0885n1315j348N6038N5985n9895o1549P5096J8368j8097K8142P780r086
16124a0766K4535L8731L2999k4364p5803l7121O935K0533J1907P624l0265M314
$$ y = [-7933, -40318, -15511, 17948, -17585, -40549, -55669, -82349, -97594, -59680, -1638, -6078, 12687, 23552, 35925, 507, -18766, 3952, 10178, -3216, 2401, 57725, 16231, -12507, -14334, -38782, -42111, -56097, -51099, -56452, -7859, 22679, -16170, -36712, -40383, -47551, -26939, -47920, -73156, -70627, -78023, -63824, 9734, 11887, -25991, -56397, -39127, -3805, 1314, -20971, -29556, -62022, -70869, -80513, -52850, -51924, -24888, -53622, -33816, -21956, 4398, -21182, -26042, -43998, -50920, -38791, 15049, 5587, -52523, -17889, 13383, 14384, 17713, 6809, -50885, -102200, -103548, -47510, 8475, -51420, -112969, -37873, -19505, -37602, -9460, -1680, -10766, 13769, 52500, 85499, 61135, -14668, -51789, -44854, -24321, -12414, -4790, -35055, -30741]
16112c0741K0445q044j1536j9028K6822L5616l6627l7520j8097J3670N0539L6992
16100B2491l038j09540n0334L5746P3029L8100K4746L2620k0183m5035j5103O926
16088i575O368N7560L6409p5585l117J1508j0030M67K9550m2862j4663J4002l7176
16075c7144L35O922j4330j4613K9991k4058n05J9393L6531j4361J1678M4514j8256
16062B6097k9235n4145M5559N0393k4081J8635m5566k319L0536J4285K2692k9104
16050B3747k6091J945J4355j6376o105n2626P313N1751L8966J6330l9495n7466
16038d3752k391M2592J3847k4630K7768J7832l3526k2089M411K6577k9306j4158
16026c6825J8434k6837k0231k4491J430j7859M3299M5998N1220K0187K4671P753
$$ y = [-30741, -10296, -18340, -29876, -48904, -22082, 13534, -23093, -60613, -78710, -65040, -14501, 22491, 19453, -90087, -140421, -104675, -31646, 6454, 31200, 63820, 43637, -1398, -16501, -9575, -3207, 54353, 90762, 15177, 12060, 23568, 13538, 14005, 43555, 693, -13970, 32, -37144, -36809, -29887, -44217, -58830, -28839, -52897, -53402, -34009, 2522, -11839, -161, 44353, 26097, -3138, -57283, -11724, 38669, 14588, 33223, -12343, -14662, 15874, 30159, 52851, 23747, -2344, -399, 13956, -2420, -8525, -61151, -53838, -2087, 36879, 53209, 13714, -43752, -46143, -3551, 10296, -14334, 13434, 31266, -2260, -24349, -19938, 6639, -22667, -36825, -18391, -45228, -65459, -89950, -88520, -106379, -63080, -17082, 34138, 54325, 78996, 86749]
16014H6749n8326l4462K957k8848l2463L8403j6341K82L6513j2424l410m5294
16002f6664P109M1988K4860n7944j6192j8254J1846L8722J4163O3008K6222m2882
15990B5982L2117l0813n9338m7798k0681K5880N2770J4599j3430l8151j9490j0807
15978h9160j5759L962L9190J6653l991J3885k8046K485O517p964n20K9827K4244
15965h677k6282K480L992j358m8810j7637M839L5806L0154J6914P4439L4149m1818
15952E8191o0148R389m076j1314j3345K8528K9703K429k7107K548k297Q201J6235
15939C6937J2225n0228k3535Q844q785l8761q755N2895Q656k578l0801l2460M2796
15926c3550l0220k5757L1683J7071l6798O669L7786K2614N1807J5817n8911q734
$$ y = [86749, 28423, -6039, -3082, -31930, -64393, -25990, -42331, -42049, -5536, -17960, -21370, -66664, -59555, -17567, 7293, -50651, -66843, -85097, -73251, -34529, -20366, 42642, 68864, 25982, 58099, 27286, -32052, -79850, -100531, -74651, -21881, -7282, -20712, -58863, -78353, -89160, -104919, -100957, -61767, -45114, -49105, -35220, -63266, -60781, -54264, -62228, -62748, -32921, -8677, -34959, -32479, -28487, -29845, -78655, -96292, -91453, -55647, -25493, -8579, 65860, 100009, 58191, -1957, 7432, 3356, -7958, -21303, 7225, 36928, 39357, 12250, 14798, 12501, 20702, 36937, 49162, -1066, -24601, -15757, -24542, -63303, -72058, -19163, -10507, -13085, -43886, -76346, -33550, -63770, -89527, -57844, -40773, -77571, -70902, -33116, -10502, 41305, 57122, -1789, -10523]
15914a0523k22k7602M481j3899j8088j4452m0407o834L0900O5909K5065k1686
15902b7358m3907M641r938J2307J2459r559J9619J1725j4422k6661q33M1493L7329
15889F895o963J3697j4631l7633L2246k282J0648Q422j8497m7513j3627J2491
15877e6747J4286o647l96K9774m5181J862R67J2160K0252L0538P6464M4088n9189
15864F2231m1110K0494M8462n2250n6394K7479J8598j4762o2008j6024M6665k2349
15852d0968j2875j4699j4388o180L0660J4485N77k913k7802Q21L6741l2969j5879
15839h5389N5812K0866j3502n4573k0535L4044O754j3828J6294k2141N0886K2435
15827b877J6277M3229k5277l967k1259n3431J949J1870J8606J5851J7475L1714
$$ y = [-10523, -10745, -38347, -33866, -47765, -65853, -80305, -120712, -127546, -96646, -30737, -5672, -27358, -71265, -66624, -76562, -64255, -51796, -61355, -41736, -30011, -44433, -71094, -71927, -30434, 6895, -68, 13629, -1002, -38635, -6389, -8671, 1977, 10399, -8098, -55611, -69238, -56747, -42461, -49108, -49504, -19730, -64911, -63049, -62082, -49922, -29670, 868, 77332, 121420, 62231, 21121, 41615, 90077, 37827, -18567, 8912, 27510, 12748, -49260, -65284, -18619, -40968, -53843, -68542, -82930, -89110, -58450, -43965, -43388, -46301, -74103, -73282, -36541, -69510, -85389, -29577, -8711, -22213, -76786, -97321, -63277, -56523, -70351, -54057, -76198, -25312, -2877, 13400, 56629, 31352, 27385, 6126, -47305, -45356, -33486, -14880, 971, 18446, 50160]
15815E0160j9457j9784l8182K3624P3620j0717M127m2030l2004k2794L6765K5903
15803B9231k6517m7016j06107J0185L9639J1216J858L8120K8512K188N2J0199
15791h440k5421l7506K6564K8812p922n0640k7399J9665M8356M2390L0980J0170
15779D9609m064m146J1294K0940o1993J1385N574j8894R226J3550k0938m1837
15767c0294N030L8422J2234j6436J7999J817j1187j375m917k6321j0540j0838
15755c6406j6614l0997J6266J9463j7453J8420j8216q757r427N6402m663K6772
15743e210k3762k8567J9420K4214P296j6588Q20j1918l1411k1359J2661N4472
15731a9932M150J0865L8626J1783r463r9640k9647N2995J1776R676L1162K6682
$$ y = [50160, 30703, 10919, -27263, -3639, 69981, 59264, 63391, 21361, -10643, -33437, 3328, 29231, 2714, -44302, -150409, -140224, -100585, -89369, -87511, -49391, -20879, -18691, -18639, -8440, -33861, -71367, -44803, -15991, -23913, -74553, -101952, -82287, -33931, 8459, 39439, 49609, 45545, 41399, 52693, 73633, 11640, 23025, 28599, 9705, 18931, 32481, 11543, -30294, -25264, 13158, 25392, 8956, 26955, 28772, 17585, 16210, 11293, -15028, -25568, -36406, -53020, -84017, -67751, -48288, -65741, -47321, -65537, -74294, -83721, -27319, -31982, -5210, -28972, -57539, -38119, -13905, -6609, -23197, -22377, -34295, -65706, -87065, -74404, -19932, -15782, -4917, 33709, 45492, 36029, -63611, -93258, -40263, -28487, -18811, 12351, 39033]
15719C9033k8775M4070K9696j3809k6452n6123o3383n8348J1810R4461J1062n339
15707b2097m1K335L848l1515K7858J6504O497J769n3658n878M630l278K4612k413
15693c0827j615j5732p261O630j1815o934M1410M5683O1297m9119l2201j095Q52
15680g27n1704n379M9600k8113o6655k320Q9189k9584m6697L5719N1178L8887
15668C3394J6122l119n685N4776k80m4841j4850J165L0135K0994k1043k8634m645
15655C3489K9248m613k941l3885k3125n3023L2291P3761n5579K2699J1872k4597
15643E597j5903n6290J9208J3078m3957J8199m635j035l0252M467O6828K0378
15631d317n000K0849J6210m0487k1266J6133j7934l3407k6226l9730n714N5336
$$ y = [39033, 10258, 54328, 84024, 70215, 43763, -12360, -75743, -134091, -122281, -27820, -16758, -22097, -22138, -19803, -15955, -47470, -19612, -3108, 3389, 5158, -48500, -54378, -49748, -53026, -28414, -30827, -32442, -48174, -55435, -48805, -60620, -67554, -26144, 19539, 80836, 31717, -484, -1579, -727, -52431, -57810, -8210, -36323, -102978, -105298, -16109, -45693, -92390, -56671, -5493, 33394, 49516, 46397, 40712, 95488, 95208, 50367, 35517, 36682, 66817, 87811, 66768, 38134, 33489, 62737, 58124, 55183, 21298, -1827, -54850, -22559, 51202, -4377, 18322, 30194, 5597, -10306, -66596, -47388, -34310, -78267, -60068, -64703, -65738, -95990, -91523, -24695, -4317, -9317, 11532, 27742, -12745, -34011, -17878, -35812, -69219, -95445, -135175, -140889, -85553]
15619h5553O3717L553m4355l3084K422K1469N2612K5823m9885l0100k8827o263
15607a08471J0312L7106O0227L8328m2715l8182J0298l7532k7090K122L1861Q276
15595e5460o285J2952N8843K9547l4006l2346p2498J8623L3965k7182P160N8756
15583g931L5314l3866j8422P154J9471J8234k9458m8217q8369P595Q1803L5503
15571b1189K0183n514K7915J7791m5135P031n0794o9703J6430J5792J2993K2117
15559e2083J1752l6542j7922J8768j4770M3847K0636M7388k748m0474L3353J7404
15547B8609l7177k3055O455j018K3959m177o0338n90O693k2649M8585J4249k8978
15534d9432j75J2157m889R009J7690N794K233J6370L4411o1983j7538J015K3837
$$ y = [-85553, -21836, -18283, -62638, -95722, -93300, -71831, -19219, 6604, -43281, -73381, -102208, -108471, -98159, -61053, -826, 37502, -5213, -43395, -33097, -70629, -97719, -95597, -63736, -55460, -61745, -48793, 10050, 39597, 5591, -26755, -99253, -80630, -46665, -73847, -66687, -7931, 27383, -6483, -24905, -17751, 1720, 19954, -9504, -57721, -146090, -138495, -56692, -21189, -1006, -6520, 21395, 39186, -5949, 1082, -49712, -119415, -102985, -87193, -74200, -52083, -40331, -76873, -94795, -76027, -90797, -46950, -26314, 21074, 18326, -22148, 11205, 28609, -8568, -31623, -25168, -26186, -2227, -6404, -66742, -67332, -60639, -83288, -34703, -20454, -49432, -49607, -37450, -42339, -33330, -15640, -9846, -7613, 8757, 43168, -18815, -36353, -35338, -11501]
15521a1501P443k7123j6323L9023k3954M527J0196l3733l3146M0558L6105j1911
15509a9839m6110k482J1432J663k9104j0076O492K4102M2969J3043M170r377j3041
15496b6158k6274K1059m636o641K4469R989r765N577j9724L0832K8027j6179K3164
15483C3740l7980j0077J9849l3491J9562p607m2864m1014L1095j0611L2244j5674
15471f2828J0820J6082L5712L0361k8225K3981N522P44l3670k9411l3123K183
15459f1852K3390J3507J7184m515j6700p825p115J6804M4611K2858m1631k5401
15447b6685P486L8143L7434m8615l1015K3669l8852k9620Q487j8301j3771O5590
15435b6050O6554O945r342k2009k8533o0583m8018M3981L7885J16o010j2177L3046
$$ y = [-11501, -4058, -31181, -47504, -8481, -32435, -27908, -17712, -51445, -84591, -44033, -7928, -19839, -65949, -68431, -56999, -55336, -84440, -94516, -88024, -63922, -20953, -7910, -3740, -13117, -26158, -52432, -31373, -36009, -42650, -18181, -8192, -17957, -12380, -32104, -1272, 26755, 10576, 33740, -4240, -14317, 5532, -27959, -8397, -16004, -58868, -99882, -68787, -79398, -47154, -62828, -52008, -35926, -214, 30147, 1922, 25903, 31425, 32169, -1501, -30912, -64035, -61852, -38462, -24955, -7771, -12286, -28986, -36811, -43926, -27122, 17489, 40347, -1284, -26685, -19199, 18944, 56378, 7763, -23252, 417, -38435, -68055, -59568, -77869, -91640, -26050, 40504, 47449, 38107, 16098, -12435, -73018, -121036, -77055, -39170, -39054, -45064, -57241, -24195]
15422b4195L8832K5106l095J3183j7424k0806P620m3897m7978l6927N67K3085
15410h5929M6258m3011m7789N4378L7743J8622J9505K5453o1739l836R834j8632
15398d9143K4492L5405n572o0933L802J2651J3401q625M8696l7834n7066K7584
15386e3142j0041M9643l146o3549l8207J0098j720K1472O4027L5933J2535k5593
15374a690M791L895n738K6912J6643p186p6776p7M19K645L8395j6981k5801m0291
15360h0840j5304j9095K0032j0566N5874L8020j5905K0349l2342J8862K1910r045
15348h050j6682J6876o243j8333J943n7258l962J7069m893l2160p568N5361K8339
15335c5561j679m7158L106N2437K2963k2932L1159P318M146J4712k1707k3025
$$ y = [-24195, 14637, 39743, 36648, 49831, 32407, 11601, 19221, -24676, -72654, -109581, -109014, -85929, -39671, -82682, -130471, -76093, -38350, -19728, -223, 25230, -36509, -40345, -30511, -49143, -24651, 10754, 5182, -55751, -51949, -39298, -25897, -34522, 14174, -23660, -80726, -53142, -63183, -13540, -16686, -80235, -118442, -108344, -110064, -88592, -24565, 11368, 23903, -1690, 3101, 6996, 1258, 28170, 44813, 37627, -39149, -39226, -38807, -36162, 2233, -14748, -40549, -80840, -96144, -115239, -95207, -105773, -49899, -11879, -27784, -7435, -39777, -20915, 995, -8050, -24732, -7856, -14099, -32432, -30489, -87747, -91709, -74640, -79533, -111693, -119261, -63900, -35561, -37240, -84398, -81292, -28855, -5892, -28824, 2335, 9653, 13799, 28511, 6804, -16221]
15323a6221J0742P157k3227L6320N644l1698K5598q661k4202j0221J1506l9857
15311e7120R614K1294j736M644k5706j2473L1866k42j518R781O76o733k4120l267
15297e5040n812m4994j460K8532l853L1519L8126N41j2316p2899L0070N9803L1660
15284B3877J989o147n7450K4358l3796n0069K6133K1838N919j1564J1804K7464
15272a5644j0752j6288J7036L362L3876M1766K3460l4767l4509j2596l81p320
15260a2757k1839L9741L9423j9435n3264j8532L1334J2130J6795J0681P022J9024
15248E0323q1682K810M3066k084m1502R106J5350m7016L5947J9285j3925L0811
15236B0489O364j3956m0144l6414K9668O5842Q574j1330l4464k2219j907J6468
$$ y = [-16221, -5479, 1678, -21549, 14771, 20415, -11283, 14315, 5654, -18548, -28769, -17263, -57120, -47506, -26212, -27948, -23304, -49010, -61483, -29617, -29859, -31377, -21596, -20920, -27653, -51773, -55040, -60852, -105846, -107306, -78774, -82627, -51108, -12982, -12441, -24757, -97656, -67586, -7783, 23877, 25866, 19719, -37731, -13373, -47169, -97238, -71105, -49267, -43348, -54912, -43108, -15644, -26396, -42684, -25648, -22286, 11590, 53356, 76816, 42049, 7540, -5056, -5437, -12757, -34596, 5145, 44568, 25133, -28131, -46663, -15329, -3199, 13596, 24277, 31299, 50323, -31359, -28549, 14517, 12433, -29069, -19963, -4613, -51629, -15682, 3603, -10322, 20489, 26853, 12897, -27247, -63661, -33993, 31849, 40423, 29093, -5371, -27590, -29497, -13029]
15224a3029N4694L2320k1806o3315k6004K2774l1492N941K8274j9365n778J9791
15212a6995k7231R227L2462K1699K9864J0633l3301k3452j4094K9161K2800j8036
15200B2737k7326q573j101k557j2885m152j8627L5098K4012k1115m3042j3455
15188g0986J3655J6779L8261o016M0597j9430j0876j2328L234J003k8488k2651
15176e7246o493J3499J6131Q221N018k7193J56P809M5613l46j8272j3380M6473
15163A9990N0941j1337J2184k00m8261l8274k5302l5821P907L6732K4862j9275
15151b5854p953K2353L5080l8232P670L8904O383m496K8908m8860p0011l58Q15
15138e5651K1588K1147l3106j4171L5943M227j1565M4164L0733K3707l3192n5947
$$ y = [-13029, 41665, 73985, 52179, -11136, -37140, -14366, -45858, -39917, -11643, -31008, -36786, -16995, -44226, -34999, -2537, 19162, 49026, 59659, 26358, 2906, -11188, 17973, 40773, 22737, -4589, -13162, -14263, -16820, -29705, -33857, -52484, -17386, 6626, -14489, -57531, -70986, -57331, -40552, -2291, -8307, 32290, 12860, 1984, -10344, -7110, -6107, -34595, -57246, -63739, -50240, -34109, -25888, -20870, -48063, -47907, -40098, 5515, 5169, -13103, -26483, 19990, 70931, 59594, 71778, 71578, 23317, -14957, -40259, -76080, -68173, -31441, -6579, -25854, -33807, -11454, 23626, -14606, -6936, 31968, 38351, 33855, 62763, 13903, -56108, -56466, -55651, -34063, -12916, -46022, -60193, -24250, -20023, -31588, 12576, 43309, 67016, 33824, -22123]
15126b2123n1419k4981K448L9908m4137l2571O0458N7498L1107J2922p034J839
15114B3915j0529k0711l3341l9463p682L7553K3628J2986J1338k7996j9448K239
15102d7511m0444P047L5456Q5113O873n0758n891j8742r703J0975L2412L265m5176
15089c7084l3453R790N9671K8910K069n697Q069K1867j1382n7378l920K7270M158
15076A2890j4173o2849K4012L1326k0244J948J5214K6428l6381n1676j1882L1592
15064e3795K6350m527l1725L010K5015L3095P162O941N3026l664k7008k5041n7947
15051d9108M553O8893J5332l9124l5647j5432R337k6416j7492r831R153P8028
15039g754M7011n104n7541l7141q548P859L5214K0987K0093o438l9475l3127r498
$$ y = [-22123, -73542, -98523, -96075, -56167, -100304, -132875, -72417, -14919, 16188, 29110, 22076, 23915, 13386, -7325, -40666, -80129, -87811, -50258, -26630, -13644, -2306, -30302, -49750, -47511, -87955, -80908, -45452, 39661, 46534, -4224, -10115, -28857, -38560, -27585, 4827, 8092, -37084, -70537, -60747, -1076, 27834, 29903, 24206, 32275, 54142, 42760, -14618, -18538, 8732, 12890, -1283, -64132, -40120, -8794, -29038, -27090, -11876, 14552, -21829, -73505, -85387, -53795, -27445, -31972, -63697, -60687, -35672, -2577, 4585, 11526, 64552, 60888, 33880, 8839, -49108, -44555, 24338, 39670, 546, -35101, -50533, -41196, -67612, -85104, -94935, -85782, -7754, 39257, 34153, -23388, -60529, -69077, -61218, -26004, -5017, 15076, 8638, -30837, -63964, -73462]
15026g3462j727J8976m4945L2950P4303m025k9032k8151n9507n699N1043N0693
15014a8583k2779j7991K0981J9493J242k8350L4360l659l6856k1914j654J0963
15002f4747N8802K1100j7131l5351j8965R733P2701Q334n6096j9769j8386N0426
14990i349l1275j8946J5531M457J3784K3419j7906l8343L1669J4137L7864l9130
14978a4088m3487K465J4654L3757j5293q0873l8382K1624K4243L0418N3725J9701
14966H464k2404k367L2486o271m1716l6200L2239J1784n2827l7279l6033N5586
14954i4538L0850k0055J6451N0455N08L33Q316o992l6491q000L9866o0113J4898
14941f4512r204l0183j4503M1256K0180K4445K8020K1742k4215m2623k5124j2706
$$ y = [-73462, -75189, -56213, -101158, -68208, 6095, 2070, -26962, -55113, -114620, -120319, -69276, -18583, -41362, -59353, -38372, -18879, -17637, -45987, -11627, -15286, -52142, -74056, -75710, -64747, -5945, 15155, -1976, -37327, -56292, -46559, 26142, 34476, -21620, -41389, -59775, -9349, -40624, -59570, -44039, -39582, -25798, -2379, -20285, -58628, -26959, -12822, 25042, -14088, -57575, -55110, -40456, -6699, -21992, -102865, -141247, -119623, -95380, -64962, -11237, 8464, -13940, -16307, 16179, 9908, -31808, -68008, -35769, -23985, -76812, -114091, -150124, -94538, -63688, -83743, -67292, -16837, -16329, -15996, -7680, -14672, -51163, -59163, -19297, -79410, -64512, -73716, -103899, -118402, -77146, -56966, -32521, -4501, 17241, -6974, -49597, -74721, -87427]
14929h7427J6381J4929J1285k7087k9346N2392K5668l4393n679M8377J0771q169
14917a2298n075N351L4909j5207n6472M0344K0361j5925l3652k1473J7394J9499
14905b2244J5768J7795m130O316J333m9709k5552j658O7565M5274p005n1561k1855
14892b9663k1093n0916j2371O5454L4115n510r863k5176M3872N6181k2432J9964
14880D2562J448j7058p482m3671N439J8701l5688k5219j0076L4023k22k0134l4954
14867i2331J1915L6749M0692L0047n6478o433O413j1938j9205J8184N6850N8662
14855G3127J7654m139l1589j8173j965r461m3280m3062N066k3246j4581N8201
14843c5448K8690K2230K4911q0433l2209j911N6874J9674k902N6316m6943m5912
$$ y = [-87427, -71046, -56117, -44832, -71919, -101265, -48873, -23205, -57598, -63277, -14900, -4129, -12298, -17373, -12022, 22887, 7680, -48792, -8448, 11913, -4012, -37664, -59137, -41743, -22244, -6476, 11319, 7189, 13505, 14838, -34871, -60423, -62081, 5484, 50758, 43753, -7808, -29663, -50756, -101672, -114043, -48589, -14474, -19984, -29847, -55023, -11151, 45030, 22598, 42562, 44010, 26952, 19470, -24201, -18762, -61, -35749, -60968, -71044, -37021, -37243, -57377, -92331, -80416, -43667, -2975, 27072, -29406, -35839, -29426, -41364, -60569, -42385, 14465, 73127, 90781, 86642, 55053, 36880, 34915, 25454, -17826, -60888, -55822, -79068, -93649, -35448, -6758, 15472, 40383, -40050, -72259, -74170, -17296, 2378, -524, 55792, 8849, -37063]
14831c7063k5455K5690P3330M4324J571j11822K191K5065k387l7859k7025L9887
14819b9553M0543m734n2874k6164L9922j2187k8768l5150L1149M639k2182n534
14807a00893k6589L5653O5587j1333m9085j8729j0356R962j2886Q570J2377O9207
14795b8515K9074J3455n611Q843M922Q697k9456N9028j7038k6437j3154m3622
14783c9814n3967k2109M5389L1904L8297J075p910p3215m7179J9608J9823M7576
14771d0522M0789L304L4842k1555o7598l916K3122o789n463o729m130k0895J1476
14758f4064L9794j5774Q910J9965k8225K4062m3740m3876J5179j418m393j1675
14746a05255R5914m296n685Q732J1449l8033j5527K9710K3041J1862n229j1073
$$ y = [-37063, -62518, -36828, 36502, 80826, 82397, -29425, -27234, -2169, -4556, -42415, -69440, -29553, 10990, 6256, -46618, -72782, -32860, -45047, -73815, -108965, -77816, -73177, -95359, -100893, -127482, -91829, -26242, -37575, -86660, -105389, -115745, -105783, -118669, -110099, -97722, -28515, 559, 14014, 8403, 17246, 22168, 30865, 1409, 60437, 43399, 16962, 3808, -39814, -93781, -115890, -70501, -38597, -300, 775, -7135, -80350, -127529, -107921, -88098, -40522, 267, 3571, 38413, 16858, -50740, -54656, -31534, -38323, -43786, -50515, -54645, -75540, -64064, -24270, -40044, -31134, -11169, -39394, -15332, -59072, -102948, -87769, -89187, -93580, -105255, -9341, -13637, -19322, -10590, 859, -37174, -52701, -22991, 50, 11912, 6683, -4390]
14734d390L969O4219K5281j1425k2641m1523r708j6575M837m983n48q335K1582
14721b40l4864m0117J94O2227K7020j5525J3832M4405j2878K1931M02n0777k565
14708A3045k4337p580k5823P239L4273K3804p2301m2032k5731J9134J0294j6107
14696a06122K6337r654o548N1875O2685J6583j8119l2519n4207J2915M8016J9463
14684A0705n602L6638K478Q207j6821l6701J097r911J5494j0765l7042Q49P622
14671c3752J9865J7402m7817j2730M750O0390m5061m1872n880J139L3962R450
14659d0154K1077K5843L1689l4538l2454M3186M0705j7518n1209M2781l9440n3194
14647f3226J6592N527j5808L5672L2505j3870n364N3863M9951q172m4659l1553
$$ y = [-4390, -421, 63798, 89079, 77654, 55013, 13490, 3782, -12793, -7956, -12939, -13487, -21822, -240, -35104, -75221, -75027, -12800, 14220, -1305, 12527, 56932, 44054, 65985, 66387, 15610, 13045, -11292, -18872, -44695, -37456, -3183, 20621, -51680, -93712, -119443, -100309, -90015, -106122, -79785, -89439, -95987, -44112, 18573, 35156, 17037, -15482, -69689, -56774, -8758, 10705, 5103, 41741, 44219, 52426, 35605, -1096, 1, -9910, 5584, -5181, -42223, -41374, -33752, -13887, 3515, -44302, -57032, -52282, 8108, -36953, -78825, -84705, -83566, -49604, -40154, -19077, 6766, 38455, 3917, -28537, 14649, 55354, 37836, -13373, 29408, -10032, -63226, -46634, -41107, -56915, -21243, 11262, -2608, -7972, 45891, 95842, 87670, 43011, 11458]
14635A1458m794p489N899L6776K8105k3230k0062j7218k0391j9891K0719J5033
14623D915k6470o0497K6927k5077M7983P2514L4872K2723n3298j9164k5040k8213
14611b7825k356j5381O584J1479k4652j4399n869J242M1316p267k2106j285J3078
14598d7441l577n0251K6207J0687k2016M6043P7725L320r016m228l8679j4440
14586b5666k9350K493j326L1245L313o247L1377J1471K9140R30o7509M2226r13
14573B1184L281L8561j0042j8631q7l6603L3031J980J2050R541K722m075j2391
14560D0521k6213K0153K6231J5187j2047o4969l8330R0065P3906m4513k7896M7393
14548I9488J2720k195J8896L7997o2453p6551m4245J2476K2297p12m956m733J2167
$$ y = [11458, 6664, -825, 5074, 41850, 69955, 46725, 26663, 9445, -10946, -30837, -10118, 4915, -21555, -82052, -55125, -80202, -32219, 40295, 75167, 97890, 44592, 25428, 388, -27825, -30181, -45562, -38978, -27499, -52151, -66550, -72419, -71177, -29861, -37128, -59234, -60519, -47441, -51018, -101269, -75062, -64375, -86391, -40348, 37377, 40697, 31681, 27453, -11226, -25666, -55016, -52523, -53849, -22604, -19291, -25538, 5839, 17310, 46450, 47380, -20129, 22097, 21184, 24465, 63026, 52984, 34353, 34266, -2337, 30694, 32674, 44724, 54265, 56987, 52912, 40521, 14308, 34461, 60692, 75879, 63832, -1137, -39467, 50598, 124504, 79991, 52095, 99488, 112208, 110013, 128909, 166906, 104453, 27902, -16343, -3867, 18430, 17718, 12762, 8029, 20196]
14535B0196m5314n380P5612N1305m2722l2488Q791L963O034j3531k7793K2461
14523B1134K3916m7875k5712R359M3813L6364k0391J964L120k6994P668K5252
14511E1618N5316j8216k9045n9025k9548P65K9080J7498P607K1834l2418k3485
14499h019L5431k2509N949K5825J7423k029J301k1377j0043K9104K7193j2438
14487F5811k2363j7331l1K302n306Q618l0391m3266N1803K1515j9370M1363J5984
14474F9338l7229n1083j4849L548P67J0946O710l1094K1862r534K9063M0602j1112
14461B7935J9577K3853j9297J1166K8340M1850P088o4800n6320N251K1851K2287
14449F8781q721m2568K6674N5821R331j00506m5359j3634M5614L3099r231m6160
$$ y = [20196, -25118, -30498, 45114, 96419, 53697, 21209, 30000, 33963, 39997, 26466, -1327, 21134, 45050, -2825, -28537, -19178, 24635, 60999, 40608, 42572, 45692, 18698, 26366, 51618, 106934, 88718, 59673, 648, -28900, -28135, 945, 18443, 26050, 47884, 15466, -8019, 27412, 4903, 10852, 36677, 54100, 52071, 53372, 31995, 21952, 51056, 78249, 65811, 43448, 26117, 26086, 28388, 23082, 31700, 1309, -41957, 9846, 31361, 11991, 53354, 69338, 32109, -18974, -33823, -30275, -29508, -18562, -11852, -42946, -21084, -30618, -1555, 39047, 27935, 47512, 71365, 52068, 63234, 91574, 133424, 140512, 75712, 19392, 24643, 46494, 68781, 60060, 17492, 44166, 99987, 109318, 8812, -36547, -50181, -4567, 28532, 19301, -26859]
14437b6859j3512j0124K0932J8625k5315k8421l5923L4529L0686m0550k8552o083
14425a10567j7381M9611N5623J3591k5540J6619O5102j4993n0421k7521P656M0436
14413B215M15m7159J088J6215n415J992M5432k6248m0850q91J9248J4347o383
14400b5994l9446O342J9572J9612L0876l0669M796K1639m2988j1148L6255j1709
14388b2862J6213K2971L1848J1284l8204p5112j7869J5524l4479j4656N1131L3407
14376b0804n666L6583k1128J3668J1550j5381p1400n2141M2063O1770K2202n375
14364d059J3945K7577l4094J1259L1329k8067L4722L975j6594M04m091l9453l5150
14351c8297r016K5445K7662p160k6453l0089n6643N691j1718l901O3460M7391
$$ y = [-26859, -40371, -50495, -29563, -10938, -36253, -64674, -100597, -66068, -35382, -75932, -104484, -110567, -127948, -78337, -22714, -9123, -34663, -18044, 47058, 32065, -18356, -45877, -38221, 2215, 2630, -44529, -43441, -27226, -32641, -30649, 14783, -11465, -52315, -53206, -33958, -19611, -25994, -65440, -59098, -39526, -19914, 10962, -19707, -14911, 6728, -36260, -47408, -11153, -22862, -6649, 16322, 48170, 59454, 21250, -53862, -71731, -56207, -90686, -105342, -54211, -20804, -26470, 10113, -11015, 2653, 14203, -1178, -72578, -124719, -82656, -20886, 1316, -4059, 9886, 37463, 3369, 14628, 45957, 17890, 52612, 56587, 39993, 40397, 36306, -3147, -38297, -47313, -21868, 5794, -1366, -27819, -57908, -114551, -108860, -120578, -124479, -61019, -13628]
14339a3628k1602j5248N190M6630R886O20j0532j4285J0744j909L328k8619m2646
14326g2071J2535K0277K6740j7779m867K3393M1994M78j1528K1201l1988k9173
14314b0788k3028j9865j3769J5911J1041N2738J2404P294K2684P109o6251j7045
14302c1565P591P24J1543L2987l4966l8767j8182K5522K1218l8333P535L0317
14290b4376K4080O5143J8343Q91o2524j7982o405P487L9361o361l0347K6645K7256
14277F1211J4560m3405j4131M9121l0108m3779m5610l1304K1465R429L034J3122
14265c6395J149K7055k159m4671J7768L3322j1279M6425J1005j8164j121r833
14253A3102M3475L8452l1441l2985L4441J5464l3623l8051l0538L0775j0155k1010
$$ y = [-13628, -35230, -50478, -45288, 1342, 11228, 11848, 1316, -12969, -2225, -4134, -806, -29425, -72071, -59536, -39259, -12519, -30298, -35165, -11772, 30222, 30700, 19172, 40373, 8385, -20788, -43816, -63681, -77450, -61539, -50498, 2240, 14644, 21938, 44622, 51731, -14520, -31565, -23974, -23250, -11707, 21280, -13686, -52453, -70635, -45113, -23895, -62228, -54693, -24376, -296, 64847, 83190, 84081, 21557, 3575, -2830, 4657, 44018, 37657, 7310, 33955, 61211, 75771, 32366, 18235, 67356, 37248, -6531, -52141, -83445, -61980, -52551, -49517, -36395, -35246, -8191, -10350, -55021, -37253, -3931, -15210, 31215, 42220, 24056, 22935, 13102, 56577, 95029, 63588, 30603, 65044, 80508, 46885, 8834, -21704, 9071, -1084, -22094]
14241b2094q936m3137k1127j626L2676N3748L9784K3831k1402l4937j7063l2026
14229e2309o335r941j5243L5118L5641K325n4106m9079K5007L3310l727L9827
14217a9512M8807K4019l8286n0454o366M8593L8481k5645l9079k1007j6595Q432
14205d8612K9749m26L8832N0860j9476J1783n0166j12675m5982M6068O6005L4824
14193G84m740K4173L4259O734n1817j8560o2495L844M0477K8016k272K418K776
14180C597K8232l3133j0945k1366J3479q094m2334J6209J5699J6371K0427l4179
14168c6037j8146L2924L1538m139q6874k6939Q622K6683J5640K3158j806Q155
14156b7221J6510J1729J9106k238l6649l2445l7069j8660M5353O6002P4152R248
$$ y = [-22094, -31030, -74167, -95294, -96920, -64244, -10496, 29288, 53119, 31717, -3220, -20283, -52309, -58644, -68585, -83828, -48710, -13069, -10744, -64850, -113929, -88922, -55612, -59339, -19512, 29295, 53314, 15028, -35426, -41792, 6801, 45282, 19637, -19442, -40449, -57044, -48612, -18863, -19289, 19543, 70403, 50927, 62710, 12544, -100131, -146113, -100045, -34040, 784, -3956, 20217, 54476, 61210, 9393, -9167, -71662, -67818, -27341, 675, -1597, 821, 3597, 31829, -1304, -12249, -33615, -20136, -28230, -70564, -54355, -38656, -22285, -1858, -36037, -54183, -21259, 10279, 6140, -80734, -107673, -99051, -72368, -56728, -33570, -35376, -27221, -10711, 1018, 20124, 17886, -18763, -51208, -88277, -106937, -61584, 4418, 78570, 87818]
14144H7818j8729n0214l4205l2414L551K0510j4703j7474K5897K5577j0827J2173
14132c040k567k119p424j7952j825m310j7053O377O4435L1422j8740k4300J7161
14119B0065P71Q758k0108N268J0983m4157l4173N8023k0756n6830o196K2837K8294
14106b7221j2486K6160L077O688P518q200r068k7373l4128Q5628j724m2140J6489
14093a6780p31J6002l061j2239j5389j3552l4761l9451P641N5724j1354J2048
14081e5903K9225M3405R921k1779l7942R981J5696K2253m4938p0025K4985N7536
14069a7585J2375j2018L4647k12N2093l0925M145M313j7399j3811l881J3812L317
14056B8871n6551j0640J7626M9206L6472j6792J9397J9734j956o1850m6574l2612
$$ y = [87818, 69089, 18875, -15330, -47744, -44193, -23683, -38386, -55860, -29963, -4386, -15213, -3040, -5607, -7726, -15150, -33102, -34927, -39237, -56290, -49913, 14522, 45944, 27204, 2904, 20065, 20836, 29594, 9486, 14754, 25737, -18420, -52593, 5430, -15326, -72156, -78352, -55515, -27221, -39707, -13547, -10470, -3782, 3736, -4464, -13532, -40905, -75033, 10595, 8871, -33269, -16780, -17511, -1509, -4570, -16809, -32198, -45750, -80511, -119962, -112321, -56597, -67951, -55903, -26678, 16727, 26648, 4869, -33073, -23092, -7396, 14857, -30081, -100106, -75121, -17585, -5210, -17228, 17419, 17207, 69300, 38375, 42520, 46833, 29434, 15623, 11742, 25554, 28871, -27680, -38320, -20694, 28512, 64984, 48192, 67589, 87323, 85367, 23517, -23057, -55669]
14044e5669J6256O9555l2422o7433p65n3N1972L1005j6924l4493j7504K0306J1784
14031b4385l9007M3649K0172l1189O038K0909L565Q730j8936k7301j6487J9476
14019c4766j7137j5459q893K2447L9320K9662M8797o687n8186j6394J5516j9759
14007b1539J4024k217j3106J5572j1719l8549j5322m615N6107L2802O0650M0867
13995A12955q469m6899j8689o9531j7929K3614L6991j1935m4687K2666K0235m978
13983f656Q028o5358J7159J8396R075k1339j4989k524K7251J3634j6708k4278
13971e8309J9489J2771k3406j206k6089j6253m480r182J1409O2091K2769j5823
13959b6219p6612k0175O0830M6716J2369j5009l2200n9075K4k1935J8886K3854
$$ y = [-55669, -39413, 30142, -2280, -69713, -70478, -70531, -18559, 12446, -4478, -38971, -56475, -36169, -24385, -63392, -19743, 429, -30760, -24722, -3813, -248, 8482, -10454, -37755, -54242, -34766, -51903, -67362, -76255, -53808, -14488, 15174, 63971, 57284, -902, -17296, -1780, -21539, -7515, -9732, -22838, -7266, -18985, -57534, -72856, -77471, -21364, 11438, 72088, 112955, 104486, 57587, 38898, -30633, -48562, -24948, 12043, 108, -44579, -21913, -1678, -6656, 1372, -63986, -46827, -28431, -19356, -40695, -55684, -58208, -30957, -17323, -34031, -58309, -38820, -26049, -49455, -50661, -76750, -93003, -97483, -106665, -95256, -33165, -10396, -26219, -102831, -123006, -62176, -15460, -3091, -18100, -50300, -109375, -109351, -131286, -112400, -88546]
13947h8546Q1403J8541m3290N864K7707K1792l77j2650Q565k9245J452o618l3106
13934d8508k0092M3872l83M017N474k4231j0164Q072J8527k4449l0441K8367n763
13921e5702O4040M2539k7778j3256r612L6007L1519m8256M374p04m6246N935K0655
13908C515o851r048J6122O264o386j811J1749O102J6397J0580k7888j3650L5518
13895D0613l781k0872J5076L7657J0592l4022R96N058j8795j5450j2308l0529
13883b5765J7566k976L5443o432J1469l2017k3788l506P44J9162M6066K713J4184
13870E2863j2558n4381l8954p427K5999j3135p0941j9027L554M5743O5796J2880
13858i588n0437k7357K2999M1463l898J1516o315K0365L048k1720l0383m563M9866
$$ y = [-88546, -7143, 11398, -31892, -26028, 1679, 23471, 23094, 10444, 19009, -10236, -8784, -15402, -48508, -68600, -24728, -25111, -21094, -15620, -39851, -50015, -41943, -23416, -47865, -78306, -49939, -55702, 8338, 50877, 23099, 9843, 231, 36238, 67757, 19501, 23875, 23171, -23075, -17140, 3515, -3336, -12384, 3738, 10002, 3616, 1805, 13554, 19656, 36053, 46633, 18745, 5095, 40613, 36832, 15960, 31036, 68693, 79285, 45263, 46259, 51317, 32522, 17072, 4764, -25765, -8199, -11175, 24268, 17836, 29305, -2712, -26500, -30006, -29262, -10100, 35966, 38679, 52863, 40305, -14076, -53030, -60457, -34458, -47593, -118534, -137561, -134007, -88264, -22468, -9588, -60025, -87382, -64383, -22920, -26818, -15302, -21617, -1252, 1796, -19924, -50307, -54870, -5004]
13845e004l052l3395P925R240O2477k6166l9013N415L4447L4063L87N062K3827
13832G6213l6905j5620q175J0065J8515j5238m7650j1128L4688N5006K9812j9421
13820G0162q3582M0J9636N2412m6123j041J2489l7449j9254o739m0836q015Q443
13807g9857J7342L1397m3642j5839J0430J6771R662R513K1760N34K0443j782N645
13794B377l7183Q053J3662j1496J5829P937L7433m214k7845L1235j792L82k7945
13781F433k8547j329m547J3714O393j0572K2730j2640K0819p566m5451l1841R472
13768f2932M8076K4027k338Q462K1314j8673j1595J8954K6586R259n5038p5078
13756f8976l2851M0504M9229J6904k0950k753L0871j1183k2837J1459O4827j9810
$$ y = [-5004, -8056, -41451, -33526, -24286, 38191, 12025, -26988, -21573, 12874, 46937, 47324, 52386, 76213, 39308, 23688, 15513, 25578, 44093, 28855, -18795, -29923, 4765, 59771, 89583, 70162, -13420, -13380, 6256, 58668, 12545, 11504, 23993, -13456, -32710, -39449, -80285, -88300, -79857, -62515, -31118, -74760, -90599, -80169, -63398, -53736, -44223, -22463, -21929, -1486, -3268, 2377, -34806, -26753, -13091, -24587, -8758, -821, 36612, 32398, 4553, 35788, 33996, 34378, 6433, -22114, -23443, -27990, -14276, -7883, -18455, 4275, -8365, 12454, 4888, -40563, -72404, -62932, -14856, 9171, 6833, 15295, 36609, 17936, 6341, 25295, 51881, 61140, 6102, -68976, -101827, -61323, -12094, 4810, -16140, -18893, 11978, 795, -22042, -10583, 54244, 34434]
13744C4434J147J1495k4624k6887j5530L6931j191j9407J5669N1308n0921o2698
13732e0274K1135O666K2055l1435l500L9091Q646Q522m166o978n1887k1974O0137
13719c962j741n3013n0191P2871P2776j6218j9407k0787j025J3568k3139J154
13707b9114L2359L4206R577j2496l1286K4023J7557J1998m2142j7037J2979m8980
13695c8356J3804p546m765j3461K2939N1252j2826p6135j0489Q0213O8867R667
13683H3164m3022J7896m8658k8616O2869j98l415l4856m9766J3567Q177k6868
13671d9726k0061M6448O9306J2724j1652k2614k8785j6297N5905J05570m0947
13660I9871k9064N9914Q689J1548l8700m4184l6125m8243L2498k448O259j3982
$$ y = [34434, 35581, 47076, 22452, -4435, -19965, 16966, 15775, -3632, 12037, 63345, 12424, -50274, -29139, -22473, -418, -31853, -35353, 3738, 12384, 20906, 16740, 9762, -42125, -64099, -3962, -5703, -58716, -108907, -36036, 36740, 20522, 1115, -19672, -20697, -7129, -30268, -29114, 3245, 37451, 47028, 34532, 3246, 27269, 44826, 56824, 14682, -2355, 10624, -38356, -24552, -32098, -36863, -50324, -27385, 23867, 11041, -65094, -75583, 4630, 73497, 83164, 40142, 58038, 9380, -19236, 43633, 43435, 40020, 5164, -44602, -31035, -22858, -49726, -69787, -23339, 45967, 58691, 47039, 24425, -4360, -20657, 35248, 140818, 99871, 70807, 130721, 139410, 150958, 112258, 68074, 31949, -16294, 16204, 13756, 20015, 6033]
13648F033l7948o281L1179N4066K5944l5288m4614K3049L2755l2856j0772L7907
13636D3174K8131l3568o5748j5295L6008J8767l785l2440j456L4145J1524M381
13624B3838l4201q116K3454L1447n2069l3756K7839M0949j2824o483j7690j4811
13612c2423L5932K7085m1016n350k293j295N711J0256j9435J3943j459J5659O9104
13599G4419J3712k7638j3986k3266l4638K4855K6284m5816n4983k7888L5670K0298
13587c2977M2725M5003j5084M1733m575m0678j7144J3464K0358K8047J0959K2301
13575A14132l3762j4906k7082j2376r521L0364J4970l4675J566K7207n774j6398
13563C3745N857k535k672K9362N1565O9868K5496Q1076N5953J23264K44516J75211
$$ y = [6033, -31915, -38196, -7017, 47049, 72993, 37705, -6909, 16140, 48895, 16039, 5267, 43174, 71305, 37737, -28011, -43306, -7298, 11469, 7684, -24756, -26212, 7933, 19457, 23838, -10363, -18479, 4975, 36422, -15647, -49403, -21564, 19385, 6561, 78, -17612, -32423, 3509, 30594, -10422, -15772, -18065, -19360, -13649, -3393, -22828, -8885, -10344, 5315, 74419, 88131, 60493, 46507, 23241, -11397, 13458, 39742, -6074, -61057, -88945, -53275, -32977, 9748, 54751, 39667, 81400, 76825, 36147, 19003, 32467, 52825, 80872, 91831, 114132, 80370, 65464, 38382, 26006, 16485, 46849, 61819, 27144, 28710, 55917, 50143, 33745, 39602, 37067, 34395, 63757, 115322, 185190, 210686, 291762, 347715, 470979, 715495, 890706]
13551H90706J30101K2189n6169j48994j96844k02365j30944l2548p1700n85j7627
13540A85220p6678o9097l0766K7326K6728J0888K4636K1914n48K8211l5306l3351
13528G9177J38P9408l5978m1588k0533l2850L3056N4137P14k5655l1309m2688
13516A6029j8454l5473n162L9899M8159j2620n3299l3852J8693J0153l094P402
13504b1619Q034k6086K400j9237K1983j5898k29K6234J9283O8699M7592n1777
13492E9379l8509K839m483r19J5485j0810L6837j207j5635l2279j7225j0520m1129
13479e8176J1516M7551r924M753L601K8619L4890K5757j0479O482j4935j2301
13467E7354R178m4289n7897j2728Q873R07K5423L1369K0100J6763l7399J4246
$$ y = [890706, 1020807, 1042996, 986827, 837833, 640989, 438624, 307680, 275132, 203432, 202847, 185220, 108542, 39445, 8679, 36005, 62733, 73621, 98257, 120171, 119623, 147834, 112528, 79177, 79315, 158723, 122745, 81157, 60624, 27774, 60830, 114967, 115681, 90026, 58717, 16029, -2425, -37898, -43060, -3161, 44998, 32378, -20921, -54773, -36080, -25927, -29021, -21619, -13585, -39671, -37271, -56508, -34525, -50423, -50652, -24418, -5135, 63564, 111156, 59379, 20870, 23709, 19226, 18307, 33792, 22982, 59819, 58612, 42977, 10698, -6527, -17047, -58176, -46660, 891, -9033, -4280, -679, 27940, 62830, 88587, 78108, 84590, 69655, 57354, 66532, 22243, -35654, -48382, -39509, -38602, -13179, 18190, 38290, 55053, 17654, 31900]
13455C1900M823k9788k9472m820j1597P271N0845J8097o531q2679K7487K3094
13443a370J1971j8266l0757k1956K1359J7919O444L836L3045K699o0838j2094
13431d8008J815K3628J925k0540j4992K9525L3319L0329R033k3810n6636J6841
13419a7571q643j4177K4053P793j2168J4798J9971O004J183j8527J2379J546k1996
13406e355r883J9045M7239L949n4135K7853p408m2165p28L0166l1755l0777N4146
13393A92Q588q759N2383J1109L6499o5468j9935K6225J0738l8820j7521J5542
13381A0773K2833N200J772K287l7776R613Q6662j6567l6313j199J2990j4524K1726
13368F7477J8289k8427k4091m8142j9210K8835L3340k7183R957K9684l3558N831
$$ y = [31900, 36723, 6935, -22537, -27357, -38954, -31683, 19162, 37259, 30728, -51951, -24464, -1370, 10601, -7665, -38422, -60378, -39019, -21100, -14656, -10820, 22225, 24924, -35914, -48008, -46193, -22565, -20640, -41180, -56172, -26647, 6672, 37001, 46034, 22224, -34412, -17571, -26214, -40391, -16338, -8545, -20713, -5915, 14056, 20060, 21243, 2716, 15095, 16641, -5355, -15238, 3807, 51046, 54995, 860, 28713, 21305, -20860, -21588, 8578, -23177, -53954, 192, 8780, 21, 52404, 63513, 100012, 34544, 14609, 40834, 51572, 12752, -4769, 10773, 33606, 38806, 40578, 42865, 5089, 14702, 101364, 84797, 48484, 47285, 60275, 45751, 67477, 85766, 57339, 33248, -14894, -34104, -5269, 28071, 888, 10845, 40529, 6971, 12802]
13356A2802K42k7950L4126J4211N9276k6936m5897m7128L1004L2654J8231L6878
13344I1513m7777l0380l7221j4213N4612J2498L4110J2028n3545k2079K6761q075
13332A8232l328L0237j9233J9343L0171j2154l9788o866O980j7172j6533J8939
13320H828K81k0836L8697P300R699j3700k8514K3193N627K987K9971K6186J5781
13307A05500K734l4095j5234N979J3013O358j7200n5422L7408K6652m7643p645
13295B0405L5173j2734N5608J7j4523l3359m952k948j5426J2866M8990K5070L2159
13282A46346o336j7615n539l6529j2837m7403k2608M9509M9585j2014M682K3303
13270A12544k9342L7700M4215M9325O7849j123L830J5402O0138J24872P0106P9620
$$ y = [12802, 13044, -14906, 19220, 33431, 92707, 65771, 19874, -27254, 3750, 36404, 54635, 91513, 43736, 13356, -23865, -38078, 16534, 29032, 63142, 75170, 21625, -454, 26307, 18232, 14904, 45141, 25908, 45251, 75422, 63268, 23480, 16614, 23594, 6422, -10111, 8828, 9109, -11727, 26970, 34270, 43969, 30269, 1755, 24948, 30575, 33562, 63533, 89719, 105500, 108234, 74139, 58905, 64884, 77897, 84255, 67055, 11633, 49041, 75693, 28050, 20405, 55578, 42844, 98452, 98469, 83946, 50587, 45635, 42687, 27261, 40127, 89117, 114187, 146346, 140010, 122395, 116856, 80327, 67490, 20087, -2521, 46988, 96573, 84559, 89241, 112544, 83202, 120902, 165117, 214442, 282291, 281168, 284998, 300400, 360538, 485410, 555516, 635136]
13258F35136J94676K69741K10110J40441K4418r5189j71779k11890j95581j69667
13248F30416m3714r291L953K5426L605J5080j1970Q1051R1056P6648K5649j509
13236H86400k9880K1636L3049L6621P0092J03046J19431O9636O8241M5595j413
13225A422454j6208q230o1381j08582j30915l6391q224j7500n7696L157N2022
13214A032506l4865o1923p8247k2806k7822p7341m0349k4939j5267J3191m340
13203F57798J2621N6563R7571J73973K18171K18967J05256L161j32461j71916
13193A239704j27055k04582j67103j89662j21865j0293j9923k1560n4962q1268
13183B41431l6146L3225m1845m2970J4919l9492l4169j1065o956k0375L2894N8266
$$ y = [635136, 829812, 1099553, 1309663, 1450104, 1474522, 1379333, 1207554, 995664, 800083, 630416, 586702, 577411, 581364, 606790, 610395, 625475, 613505, 694556, 785612, 862260, 887909, 886400, 856520, 878156, 911205, 947826, 1017918, 1120964, 1240395, 1310031, 1378272, 1423867, 1422454, 1406246, 1398016, 1336635, 1228053, 1097138, 1060747, 1052523, 1035023, 977327, 980484, 1032506, 997641, 935718, 857471, 834665, 806843, 729502, 689153, 664214, 648947, 662138, 657798, 670419, 726982, 824553, 998526, 1216697, 1435664, 1540920, 1544081, 1411620, 1239704, 1112649, 908067, 740964, 551302, 429437, 419144, 399221, 377661, 322699, 241431, 205285, 238510, 196665, 153695, 168614, 129122, 94953, 83888, 76932, 56557, 89451, 147717]
13171A47717K9459j9884L9186K6581J3897l6010j5957j0437j7613M3235K3827
13160B24001L2425m6347j1629k1975m3074m7497Q657J3138n1767k0232P7602J9424
13148A32726P26j4188P173l5180j8730R424K1724P698K6540j1438n6734N170L4002
13135A08913m7953M3793K7107l8648l6283L5599K7170K9164N6471L5872m4206
13124A96999m9767O626O9378J4649K3589O6167n924p7581l9397M0157K2811p887
13112B59820l5299j3604j1724j5410J9352p117j4271n5441l0553k2810k242J2258
13100H2959M0187N7521K6318Q247N070L2380J380M1955L0321j5853J0673M7371
13088C68529k422l9447r05L2862K0839M4665J450l1152m9399l1849m253n791J4400
$$ y = [147717, 177176, 157292, 196478, 223059, 236956, 200946, 184989, 174552, 156939, 200174, 224001, 256426, 210079, 198450, 176475, 133401, 85904, 94561, 107699, 55932, 35700, 113302, 132726, 133452, 119264, 126437, 91257, 72527, 81951, 103675, 111373, 137913, 126475, 69741, 74911, 108913, 60960, 104753, 131860, 93212, 56929, 92528, 119698, 148862, 205333, 241205, 196999, 147232, 153858, 223236, 237885, 261474, 327641, 321717, 244136, 204739, 244896, 267707, 259820, 224521, 210917, 199193, 183783, 203135, 196018, 181747, 126306, 95753, 72943, 70701, 82959, 123146, 180667, 206985, 215232, 220302, 252682, 254062, 296017, 326338, 310485, 321158, 368529, 366107, 326660, 325755, 358617, 379456, 424121, 425571, 394419, 345020, 313171, 308918, 303127, 317527]
13075C17527l4735k0980K4562k0300o458n594L2844L4998L0008j2089j9949N558
13063C25392j4309K2784N3355N7194L485O8404R6135j4899q319n8456q1571n2912
13051C96283l3347k1530n194L5256q526l8216L2898L9391J4838J3904J1309M5210
13039D82276k3835n7282J142K193k8354J0524K3458L2030j1205j0533J5383M2623
13027D78420J6580K0906j1523j6272L298k1813l3999n2339o3041n476K9876P894
13015C52511o679O2484K3696j0055o1637J7952q295q775J5365J5963J5956L8504
13003D46990O8401N7966M8810K2702m1840k1738n7013j057J1800l9211m7455l0292
12991D18063l2371J3100k6657p3652n4263q769L7739L8016N323N340n5429M724
$$ y = [317527, 282792, 261812, 286374, 266074, 259616, 254022, 286866, 321864, 351872, 339783, 319834, 325392, 311083, 333867, 387222, 444416, 447901, 516305, 612440, 597541, 589222, 530766, 449195, 396283, 362936, 341406, 336212, 371468, 362942, 324726, 357624, 397015, 411853, 425757, 437066, 482276, 458441, 401159, 402301, 404494, 376140, 386664, 410122, 442152, 430947, 420414, 435797, 478420, 495000, 515906, 504383, 488111, 491409, 469596, 435597, 383258, 320217, 314741, 344617, 352511, 345832, 408316, 432012, 421957, 360320, 378272, 369977, 361202, 376567, 392530, 408486, 446990, 515391, 573357, 622167, 644869, 603029, 581291, 524278, 523221, 535021, 495810, 448355, 418063, 385692, 398792, 372135, 298483, 244220, 235451, 273190, 311206, 316529, 321869, 266440, 271164]
12979B71164J4284l0943J8940O6031k829j4453N9218J523m5129j2917l4351J595
12967B92133J2220J1234p266K0778N6706k7818k4508l177j2889m1091K2509J3846
12955C12677L4923L5861K8905n8108m6260L3806L2208J913Q662q569M6246O9185
12943D91449l0213n9660m4084M261j1463N1743J09896O9307M9719P5118L7886
12932G43959R285n833J0512O7960J6520n2781p354o142K0306M197J9131M8764
12920H68524P6222K5505P491k4851k9231j3225k0365j9410j3392j2062l0461N3568
12908H68313K3229K8411R282j5959l6121J7368j6002o338O2713N617l8601o453
12896H95459L3626r123J0581J4356K2025J0013p555p535J304L2421L5980N100
$$ y = [271164, 285448, 254505, 273445, 339476, 336647, 322194, 381412, 382935, 337806, 324889, 290538, 292133, 304353, 315587, 308321, 329099, 385805, 357987, 333479, 330302, 317413, 276322, 298831, 312677, 347600, 383461, 412366, 354258, 307998, 341804, 374012, 375925, 384587, 376018, 422264, 491449, 461236, 401576, 357492, 361753, 350290, 402033, 511929, 581236, 630955, 706073, 743959, 753244, 747411, 757923, 825883, 842403, 789622, 782268, 776126, 796432, 800629, 819760, 868524, 944746, 970251, 977742, 952891, 923660, 910435, 890070, 870660, 857268, 845206, 814745, 868313, 891542, 919953, 929235, 913276, 877155, 894523, 878521, 872183, 934896, 940513, 901912, 895459, 929085, 919962, 930543, 944899, 966924, 976937, 969382, 961847, 963151, 995572, 1031552, 1036652]
12884A036652r800o64J3016K8099J9009N8063R628R825N8156O1058N2216L0969
12872A366227M9562K8166l6503k5016L0372O050J7904P0787N0190M2656N2974
12861A653369k0320L2663Q5943O6282J09361P6173O6886M5238N8894N2017J02025
12850B328531Q6168O8930K6466R0116Q6086R0749J23171J46326J16534J08649
12840C271726J33698J92679K59772K61651K51272K40681K59495K57979L13640
12831E442593L47750L84385L47524M13012M65237N31907O17065P01020Q51808
12822A0102301J018942J190781J366239J573509J735736J991909K300534K780455
12814B4060406L441760M481203O103936Q488206J1847345J6316271K2135436K9047286
$$ y = [1036652, 1026852, 1026188, 1039204, 1067303, 1086312, 1144375, 1154003, 1163828, 1221984, 1283042, 1335258, 1366227, 1415789, 1443955, 1407452, 1382436, 1412808, 1418858, 1436762, 1507549, 1557739, 1600395, 1653369, 1633049, 1665712, 1751655, 1817937, 1927298, 2003471, 2070357, 2115595, 2174489, 2226506, 2328531, 2414699, 2483629, 2510095, 2600211, 2686297, 2777046, 2900217, 3046543, 3163077, 3271726, 3405424, 3598103, 3857875, 4119526, 4370798, 4611479, 4870974, 5128953, 5442593, 5790343, 6174728, 6522252, 6935264, 7400501, 7932408, 8549473, 9250493, 10102301, 11121243, 12312024, 13678263, 15251772, 16987508, 18979417, 21279951, 24060406, 27502166, 31983369, 38087305, 46575511, 58422856, 74739127, 96874563, 125921849]
12806A25921849L5665773L9604564L7469130K6879919Q028318j4419538l1208897
12799B27941118l6553468l3098644k6084767j8583553j1897460o265144j582977
12792I3875105K454247N898373Q744487J0686709J1649882J1403471J0161175
12785A54873449Q512969O966346O242929O571921P950547J0107545J2532459J4505690
12777B28263855J5034816J3574382R817741M369542j939824p923682j2487413
12770B48709417j4725999j4764383j3278321j0831458p975270n400200l524347
12763A78209439k868278l322214m618008o370311q395005j0029574j0674238r953280
12755A21978531p731322m423770k97071M733968J0948193J8206953K6195217L3465331
$$ y = [125921849, 161587622, 201192186, 238661316, 265541235, 273569553, 259150015, 227941118, 191387650, 158289006, 132204239, 113620686, 101723226, 95458082, 93875105, 96329352, 102227725, 110972212, 121658921, 133308803, 144712274, 154873449, 163386418, 170352764, 176595693, 183167614, 191118161, 201225706, 213758165, 228263855, 243298671, 256873053, 266690794, 271060336, 269120512, 261196830, 248709417, 233983418, 219219035, 205940714, 195109256, 187133986, 181733786, 178209439, 175341161, 172018947, 167400939, 161030628, 152635623, 142606049, 131931811, 121978531, 114247209, 109823439, 109526368, 114260336, 125208529, 143415482, 169610699, 203076030]
12747B03076030L7560675L5255197K3999762M672337j8306542l7011002m4313491
12740B04932966m0977150l3451348k5799671j9471282j4487706j0788506p987902
12733E1969401o018313m724197l809547l037052k530469k263438k121311j972880
12725B5492194j774002j573938j373621j252972j123076r97917q59717q06967
12717A5729984p77836p08492o43313n39346m83240m74572m97026m58837m18706
12708A0728616k94264l02116k82019l58811l19249l00773l36572l10951k92196
12699G931665k85619k47665k01129k11313k33153j82810j40795j61517j83297
12690F084367j99107j56267j65638r1446j15584r7709j76882j18605j30331q8004
$$ y = [203076030, 240636705, 275891902, 299891664, 304564001, 286257459, 249246457, 204932966, 163955816, 130504468, 104704797, 85233515, 70745809, 59957303, 51969401, 45951088, 41226891, 37417344, 34380292, 31849823, 29586385, 27465074, 25492194, 23718192, 22144254, 20770633, 19517661, 18394585, 17396668, 16536951, 15729984, 14952148, 14243656, 13600343, 13060997, 12577757, 12103185, 11606159, 11147322, 10728616, 10434352, 10132236, 9850217, 9491406, 9172157, 8871384, 8534812, 8223861, 7931665, 7646046, 7398381, 7197252, 6985939, 6752786, 6569976, 6429181, 6267664, 6084367, 5885260, 5728993, 5563355, 5471909, 5356325, 5258616, 5081734, 4963129, 4832798, 4744794]
12680D744794j11933p8433q5345j3513o2860q6345j12233j42701j43157j15560
12670C792714q0927j27997r5890p1811r6527n4555r0249j16564o8161q5097k709
12659B902227j2295L396l817l3344n7941m1758o2639j7225l2843n3954n3211n4862
12647B481734l1914n4910q0787p7322j2098k2396j7003n339k2396k449l104J9239
12635B171255j7059N391N6883P1424M1559K3131o140K0454M603m1388n7569j55789
12623B116755q5768q6481p1984m1721l1965J0430n6528j21729j19388j13522j46010
12612A252089m4103j1376n4891q07j875o911n300p5966p7375p5659k8245L3338
12600I02919L38k4490l0313p45j2651l3195r211M8787K5896p2980n1812k5469
$$ y = [4744794, 4632861, 4554428, 4469083, 4455570, 4392710, 4306365, 4194132, 4051431, 3908274, 3792714, 3711787, 3583790, 3487900, 3416089, 3319562, 3265007, 3174758, 3058194, 2990033, 2904936, 2902227, 2889932, 2893328, 2889511, 2856167, 2798226, 2756468, 2693829, 2676604, 2643761, 2589807, 2536596, 2481734, 2449820, 2394910, 2314123, 2236801, 2224703, 2202307, 2185304, 2179965, 2157569, 2155120, 2152016, 2171255, 2154196, 2159587, 2216470, 2287894, 2329453, 2352584, 2346444, 2366898, 2371501, 2330113, 2272544, 2116755, 2030987, 1944506, 1872522, 1830801, 1798836, 1809266, 1752738, 1631009, 1511621, 1398099, 1252089, 1207986, 1196610, 1141719, 1140912, 1139037, 1132126, 1126826, 1050860, 973485, 897826, 869581, 902919, 903257, 878767, 848454, 847709, 835058, 801863, 792652, 841439, 867335, 794355, 742543, 717074]
12588G17074m6511j755J22J1453j2126l7951l3108p120K3142j4433K3955L3494
12576F56236m8427k5254k6624K0830j7056n2672l3538k66m0074k4754M9202O7115
12564E24718K4724j1599m1027k1434j8016l6136m090j1198N692J9204K1508k5613
12552D26733J435K0120K3749j1732k1459l2495p0259p5874K1421k6135J5437R47
12540B71888n7432J4387K8843J7360K6347O202Q586J3184l5644J1593j9346m2686
12528B43282J0241R548M784J2967k0520J2427P076p065j7129M8670K0235j3995
12516C10521m6320l2084K7319n339k3630l007l4555J591K547r406N103j3691N699
12503A84748L2329K1879L9287R724J2549Q665l9380l2325L7693L7547k4706n314
$$ y = [717074, 670563, 668808, 668930, 680383, 668257, 630306, 597198, 590078, 613220, 598787, 622742, 656236, 607809, 582555, 555931, 576761, 559705, 507033, 473495, 473229, 433155, 408401, 457603, 524718, 549442, 537843, 496816, 475382, 457366, 421230, 417140, 405942, 411634, 430838, 452346, 426733, 428168, 448288, 472037, 460305, 438846, 406351, 336092, 260218, 281639, 255504, 270941, 271888, 214456, 228843, 257686, 275046, 301393, 307595, 316181, 329365, 293721, 305314, 285968, 243282, 253523, 263071, 267855, 280822, 260302, 272729, 279805, 272740, 255611, 304281, 324516, 310521, 264201, 232117, 259436, 254097, 230467, 227460, 192905, 194496, 197043, 187637, 192740, 179049, 184748, 217077, 238956, 278243, 287967, 300516, 309181, 269801, 237476, 275169, 312716, 288010, 282696]
12491B82696N217m2034J614n758J8666Q830p299p70M5333M1893M5890L964K3729
12478D21971j7271j3171n0355n2824m3551l2657l414j5381r581Q505k9125j3491
12466A49655K5114J4381K8936N8664M6492q14m4126n6949m3323k1794N6059J9226
12454B31521M6694J7729K1867N8952Q3347J3857M1510O857j9605m2160j15856
12443C44713n9503m4550n3649J3085M0293k0617n032J7318r444J5089K4502p639
12431B54566j4042n4339m7283k8387k5182K4376L2824L5542M1647O5869n1512
12420B34079j2548J5636J9248O3077m770n8075k3498n4319N694k7145J1795L2515
12408B01689k5107l4101l2164Q446M2222j6570L3234k1322l6246j9354k1018L64
$$ y = [282696, 287913, 245879, 247493, 241735, 260401, 269231, 261932, 261162, 306495, 348388, 394278, 398242, 421971, 404700, 391529, 341174, 288350, 244799, 212142, 208728, 193347, 183766, 192271, 163146, 149655, 174769, 189150, 218086, 276750, 323242, 322428, 278302, 221353, 178030, 156236, 212295, 231521, 278215, 295944, 317811, 376763, 460110, 473967, 515477, 522334, 502729, 460569, 344713, 285210, 240660, 187011, 200096, 240389, 219772, 214740, 232058, 222614, 237703, 262205, 254566, 240524, 186185, 138902, 110515, 85333, 109709, 142533, 178075, 219722, 285591, 234079, 221531, 237167, 256415, 319492, 314722, 256647, 233149, 178830, 184524, 157379, 169174, 201689, 176582, 142481, 110317, 118763, 160985, 144415, 177649, 156327, 120081, 100727, 79709, 80073]
12396H0073O6498L2025K142j3337P809n8156k5473K7913M6466K5546k18j4269
12384A77019o2094j3466L0342L3090R624K4777k6660m5002q60J9906K564K2309
12372A71549J0798r961j9795k4324M4180M565k0346j9590K0872Q527L8161M1967
12360B46603j1046o2885n38O0774n829l9886Q468o641P3899J10288J30703J42831
12348F46741J44090J55388J56000J58342R3086q872m6162q9643j08823j48497
12338I51650j71938j04092l1031k1748k0755j4385M1372J4308O1946J09230O9105
12327H83662M0221N6812P5680O2475K1318K5745N0564M4616L2012O4316Q8936
12316A446357R4288L753l7086m9817j14710q7597k6001p4823k3205K0972k8788
$$ y = [80073, 146571, 178596, 180738, 167401, 175210, 117054, 91581, 119494, 165960, 191506, 191288, 177019, 114925, 101459, 131801, 164891, 174515, 199292, 172632, 127630, 126770, 146676, 149240, 171549, 182347, 172386, 152591, 128267, 172447, 177012, 156666, 137076, 157948, 166475, 204636, 246603, 235557, 172672, 172134, 232908, 227079, 187193, 195661, 189020, 262919, 373207, 503910, 646741, 790831, 946219, 1102219, 1260561, 1353647, 1344775, 1298613, 1208970, 1100147, 951650, 779712, 675620, 644589, 622841, 602086, 587701, 629073, 643381, 705327, 814557, 883662, 923883, 980695, 1056375, 1118850, 1140168, 1165913, 1216477, 1261093, 1293105, 1357421, 1446357, 1540645, 1544398, 1507312, 1457495, 1342785, 1255188, 1229187, 1154364, 1131159, 1152131, 1123343]
12305A123343n0084n8704j9284M092q458r7745o5327o4009p5905K384L0013l1949
12293F88367J2226J00625Q6942J75717J60522J81473J45030J38343N0965q1139
12283A659071k40484k63568j81019j60128j40439j39202j26465k9116k2413r564
12273C46673n6534k837l7235k7538l5959k6438k9347L6035K5829K2015m3490m4751
12261A26423l3152j1089O005j824j4597K2806L5146K4411K9568J153N139n804
12249A84185o7754k1711L9185R615J1784L5487L6638j7500l978Q475j9454k0879
12237A74093M005J6499K2109k3699j5498m2024l0879l4311j3015K6573K4990J8931
12225A27774M349L6575k36j750J9399l0849m1024p731K6608l5656Q763j0210m5958
$$ y = [1123343, 1073259, 1014555, 995271, 999363, 990905, 893160, 827833, 763824, 687919, 690303, 720316, 688367, 700593, 801218, 888160, 1063877, 1224399, 1405872, 1550902, 1689245, 1740210, 1659071, 1418587, 1155019, 974000, 813872, 673433, 534231, 407766, 378650, 356237, 346673, 290139, 287302, 250067, 222529, 186570, 160132, 130785, 166820, 192649, 214664, 171174, 126423, 93271, 82182, 88187, 86363, 71766, 94572, 129718, 154129, 183697, 184850, 189989, 184185, 116431, 94720, 133905, 143520, 155304, 190791, 227429, 209929, 205951, 214426, 194972, 174093, 178098, 194597, 216706, 193007, 177509, 135485, 104606, 70295, 57280, 83853, 108843, 127774, 132123, 168698, 168462, 166712, 186111, 155262, 114238, 106507, 133115, 97459, 106222, 96012, 50054]
12212E0054K5200L5534K5416m2775m281j331q729L4380N3997n14l8661k2444k5085
12199H0761J4324J8530P090n2070k2816K4913o36N0022R78k6823L4216L5617l8883
12186A25223k2687n2392n801L9035k1194m1277R540J7190k1758J6716P3529N1874
12174A67998l1834p6369k1600j5373L2049M9274K2928J9443j8222m8433n2742
12163B7119k0187O3385N5402P162n9273N063k1554j8492Q695j8272j6131K0821
12151C3738L310J2362j1346j5444J3043M5182O6290N804n1336l6978L6471M973
12139A06069p6733j8366M0312K8676j1577m9759M699Q836J0926j5795M8839K0753
12127I6880p7894K1907L0314K9304j6702m6407k2252K7856J0099J8663K3901j4673
$$ y = [50054, 75254, 110788, 136204, 93429, 89148, 87817, 79088, 113468, 167465, 166951, 128290, 105846, 80761, 95085, 113615, 120705, 68635, 45819, 70732, 70096, 120118, 121096, 94273, 128489, 164106, 125223, 102536, 50144, 44343, 83378, 62184, 20907, 30447, 47637, 25879, 42595, 116124, 167998, 136164, 59795, 38195, 22822, 54871, 104145, 127073, 146516, 128294, 79861, 27119, 6932, 70317, 125719, 132881, 73608, 78671, 57117, 38625, 47320, 29048, 12917, 33738, 37048, 49410, 38064, 22620, 35663, 80845, 147135, 152939, 101603, 64625, 101096, 106069, 29336, 10970, 51282, 79958, 68381, 18622, 23321, 32157, 43083, 27288, 76127, 96880, 18986, 40893, 71207, 100511, 83809, 37402, 15150, 43006, 53105, 71768, 95669, 80996]
12115H0996l803l1270J0718M8694K8418M9452r6791m0639K0576M0209K763k4062
12103H5261m4519l4992N1478M8871n1189M8892Q389k2490l8638m232K373k2223
12091B6981k1421j1145L3128J6576K8822K9886L9170k2543k0349k7788m6182k8070
12079b935N2345K5502R898p813J8969M1563J865j7481L7902K1088K282J413J8590
12066B03188j7720j5929j0066J7045M663l5622l1851K5718L8110k243k8643k2729
12054A23921L6813J2809L96j8734r281M5208R719k476L0114J4145J4627K3023
12042B80284N287m391k4079q3533l5056L2724P113K3549J0454p828k3812L2117
12030B12829l597J6306P64j4623j4773j0523j8188r795m010L6567K5537K1918
$$ y = [80996, 77193, 45923, 56641, 105335, 133753, 183205, 86414, 45775, 66351, 106560, 109323, 85261, 40742, 5750, 57228, 106099, 54910, 103802, 112191, 89701, 51063, 46831, 49204, 26981, 5560, -5585, 27543, 44119, 72941, 102827, 141997, 119454, 99105, 71317, 25135, -2935, 49410, 74912, 84810, 76997, 95966, 137529, 139394, 121913, 159815, 180903, 183185, 184598, 203188, 185468, 169539, 159473, 176518, 181181, 145559, 113708, 139426, 177536, 175293, 146650, 123921, 160734, 173543, 173939, 155205, 145924, 191132, 200851, 198375, 228489, 242634, 257261, 280284, 285571, 281180, 257101, 173568, 138512, 171236, 178349, 201898, 212352, 204524, 180712, 212829, 209232, 225538, 226302, 211679, 196906, 186383, 168195, 158400, 154390, 190957, 216494, 238412]
12018B38412O0850J2731J107O7472L6645K2092J1639O0075O2175k802n7843o2747
12006D49806j05404l4983l8486n5669m0404M4608J1458L4063Q255p287L3910K4286
11994C24153l170J5013J746N3094Q831O9428L3395J20292J20240J42465K16906
11983A102393J94579J64328J51481J22092K8497l3980o3020j41708j93791p7347
11973A253524j19881j38069n0653o8116l7751L4160O1326N4110J6132N2851J2120
11962A069753l3841k1287k3672k2360n638P5527O7657O8480R7840J18124P2632
11951A463215L1335M941K963O045o8581p8750k3315l9172l4560l2770n3584k7175
11939A150592k0802o0538o9684m1409l4916o7057n0499l7530l9242J6484P8789
$$ y = [238412, 299262, 311993, 313100, 380572, 417217, 439309, 450948, 511023, 573198, 570396, 512553, 449806, 344402, 309419, 270933, 215264, 174860, 219468, 230926, 264989, 273244, 265957, 299867, 324153, 320983, 335996, 337742, 390836, 399667, 469095, 502490, 622782, 743022, 885487, 1102393, 1296972, 1461300, 1612781, 1734873, 1763370, 1729390, 1666370, 1524662, 1330871, 1253524, 1133643, 995574, 944921, 876805, 839054, 873214, 934540, 988650, 1004782, 1057633, 1069753, 1035912, 1014625, 990953, 968593, 962955, 1038482, 1106139, 1174619, 1272459, 1390583, 1463215, 1494550, 1499491, 1502454, 1508499, 1439918, 1361168, 1337853, 1298681, 1264121, 1231351, 1177767, 1150592, 1129790, 1069252, 999568, 958159, 923243, 856186, 805687, 768157, 728915, 745399, 824188]
11928H24188M55O9004R8842J33605R7178L7902J0786K8356k4361p1904j37038
11917A067013q9455m5895j11338j35677j17736n6351K587l1461r0550l3576K1407
11906C78968m6429m1802k075K7734J3482N5919p184l6307p3362p321k2082J3498
11894B53039m791l9277l805N9919L4901K664l7545m6153P43j550j0429m918J970
11881B04768l6567K5502j7955j0587m3416k8626l3178m355J9947M4759K6776J6264
11869A63332R870j9477R617K1720k5216o2270L134M9145L3597k5053K8655j8069
11857A68985j2126j9890J6196R139L3828l3234m0267l0050J5191M9980K9438J1846
11845A99036K4642L4267n1717l0445J1448J3847N142l3619j7092J1488k2562K8620
$$ y = [824188, 824643, 893647, 992489, 1126094, 1223272, 1261174, 1271960, 1300316, 1275955, 1204051, 1067013, 977558, 931663, 820325, 684648, 566912, 510561, 513148, 481687, 391137, 357561, 378968, 332539, 290737, 288662, 316396, 329878, 385797, 378613, 342306, 268944, 261623, 239541, 253039, 248248, 208971, 205166, 265085, 299986, 302650, 265105, 218952, 219695, 218145, 207716, 202798, 204768, 168201, 193703, 175748, 165161, 121745, 93119, 59941, 55586, 75533, 120292, 147068, 163332, 173202, 153725, 163342, 185062, 159846, 97576, 100710, 149855, 183452, 158399, 187054, 168985, 156859, 136969, 153165, 162304, 196132, 162898, 122631, 92581, 107772, 157752, 187190, 199036, 223678, 257945, 206228, 175783, 187231, 201078, 206220, 172601, 155509, 166997, 144435, 173055]
11833A73055J4770k3798n6865j8388l0594j4264Q7492O3761k5242k6375L4730
11822A78282L4466J3219K5931Q064M6170j9314m4076K5002O3357j7769K8378O6401
11810D08111L6526N9272K2630j4450k1707j9162m497l4788n8100m9551m8296k1560
11798B54428N0860L2387M4600Q126M2041M7239J4418k4362j7537M6264J4883n4579
11786D58768k1045q236k0994N333P6141P4400K7499L1038K2688O737k4699j1502
11774F16128m6666j4424p75k6183r927k6860k1577J419j2898j8803L4927K3633
11762D97994L5921k355N95l6012r401M0196O12O313N7173k107k8641M2705N7877
11749F60870k7003j5089k7920o4525k927J3770n9064n2640l6069K2097J683K4897
$$ y = [173055, 187825, 164027, 107162, 88774, 58180, 43916, 131408, 195169, 169927, 143552, 178282, 212748, 225967, 251898, 259962, 306132, 286818, 242742, 267744, 331101, 313332, 341710, 408111, 444637, 503909, 526539, 512089, 490382, 471220, 466723, 431935, 373835, 324284, 275988, 254428, 305288, 337675, 382275, 390401, 432442, 479681, 494099, 469737, 452200, 498464, 513347, 458768, 437723, 429487, 408493, 413826, 489967, 564367, 591866, 622904, 645592, 652329, 627630, 616128, 569462, 555038, 554263, 528080, 518153, 491293, 469716, 471135, 458237, 439434, 474361, 497994, 533915, 531560, 532155, 496143, 486742, 526938, 527550, 533863, 591036, 588929, 560288, 602993, 660870, 633867, 618778, 590858, 526333, 523406, 537176, 478112, 425472, 389403, 411500, 413183, 438080]
11737D38080q433l5329j9602K4118K5813k5130K769K7893N492j3390L1736K6324
11725D80341p164q3400k2280j926l482j0551J3110K0176J0825L8967q288M75J8902
11712D45705L0944j9568k0024n562m2712k9013K7771M7589J9343J1677J6032K1180
11700E03362O980M6698J9950K303l7522n2809l8103J3706K4289J2143L4471O7480
11688F02948P1909L7579O6416o991L7196P6107M6381L7727M1707J6539n5779j6306
11676I55433P9051R9138J12124J01531R5896J09055L6228k3128j0746r3805n9772
11665A401005n7901m9936o8700n4094m1721Q36L6523o213n1223j027Q465L3872
11653A149886O9246m6667k7936R197j5327K1680Q716J1512j6711P852M109L8982
$$ y = [438080, 429647, 394318, 374716, 398834, 424647, 399517, 402286, 430179, 435671, 422281, 454017, 480341, 473177, 389777, 367497, 365571, 362089, 351538, 364648, 384824, 395649, 434616, 426328, 426803, 445705, 476649, 457081, 437057, 431495, 388783, 359770, 387541, 435130, 454473, 466150, 482182, 503362, 510342, 557040, 576990, 579293, 541771, 488962, 450859, 464565, 488854, 500997, 535468, 602948, 674857, 712436, 778852, 771861, 809057, 885164, 931545, 969272, 1010979, 1027518, 971739, 955433, 1034484, 1133622, 1245746, 1347277, 1443173, 1552228, 1588456, 1565328, 1554582, 1460777, 1401005, 1343104, 1293168, 1224468, 1170374, 1128653, 1129489, 1166012, 1159799, 1108576, 1107549, 1116014, 1149886, 1219132, 1172465, 1144529, 1153726, 1138399, 1160079, 1168795, 1180307, 1163596, 1171448, 1175557, 1214539]
11641A214539L694J2466J9448J4617O6685P6240n449r948j6564l9862j5416j9503
11629A300947K7130J22903J08216M6413K8721L4831k6370K2759J2647R695M1030
11618A728922J9710Q0922P5062M7689K8505N2827Q1323P6864N8960N9573M0622
11607B350979M5517L7912P2104Q9156Q4530J20522J30311J28029R6928R0604P1657
11596C318249R2663J10963J58901J76358J90045J73497K29388K46018K74110L00560
11586E270752L22686L34103L51155L49933L39655M39282M96480N42409N45254
11577H991709O73397P86890Q51642R48657J196060J344687J609022J957968K167611
11568B0527643K572947L072585L789080M663120N907336P657421J0139178J3544169
$$ y = [1214539, 1218233, 1230699, 1250147, 1264764, 1331449, 1407689, 1402240, 1392292, 1375728, 1335866, 1320450, 1300947, 1328077, 1450980, 1559196, 1605609, 1634330, 1669161, 1642791, 1665550, 1678197, 1687892, 1728922, 1748632, 1829554, 1904616, 1952305, 1980810, 2033637, 2114960, 2191824, 2250784, 2310357, 2350979, 2396496, 2434408, 2506512, 2595668, 2680198, 2800720, 2931031, 3059060, 3155988, 3246592, 3318249, 3410912, 3521875, 3680776, 3857134, 4047179, 4220676, 4450064, 4696082, 4970192, 5270752, 5593438, 5927541, 6278696, 6628629, 6968284, 7407566, 7904046, 8446455, 8991709, 9665106, 10451996, 11303638, 12252295, 13448355, 14793042, 16402064, 18360032, 20527643, 23100590, 26173175, 29962255, 34625375, 40532711, 48190132, 58329310, 71873479]
11560G1873479J7913622K3063582K8497391L2715537L3786752K9641278J9636880
11553B57128521N283920r762673k1149287k6628525k6950871k3987068j9143011
11546A34791006j3552672p854110k490460K306404O348275R523112J1297966J1325487
11538A51695008R642323O610052K933928l83075k435971k504244m15972L665259
11530A68807308R187814J5206832K0452294K3461279K2438172J6766797O994687
11523B83315183m685383j4726328k0706582k1739189j8722555j3654329q236761
11516A80844056l712601q72096o7134j237287l795094o968747r821774j1571563
11508A42797760j1779069j0394747p622276l979758J31114M716032R552714J4333215
$$ y = [71873479, 89787101, 112850683, 141348074, 174063611, 207850363, 237491641, 257128521, 262412441, 252649768, 231500481, 204871956, 177921085, 153934017, 134791006, 121238334, 113384224, 110893764, 113200168, 119548443, 129071555, 140369521, 151695008, 161337331, 167947383, 170881311, 170498236, 168062265, 165558021, 165142049, 168807308, 177995122, 193201954, 213654248, 237115527, 259553699, 276320496, 283315183, 278629800, 263903472, 243196890, 221457701, 202735146, 189080817, 180844056, 177131455, 176259359, 176192225, 174954938, 171159844, 164191097, 154369323, 142797760, 131018691, 120623944, 113001668, 109021910, 109153024, 113869056, 123421770, 137754985]
11500A37754985J8843889K2293625K3431229K1130954J4744718M405995q149566
11493B34455829j9854894k7437896k9562759k7360509k2964858j8211544j4094188
11486G4969181j0844706q345179o528186n258992m233311l549625l080441k663308
11478C0465433k298830k041414j772898j618944j417607j222128j051280r77720
11470A8064612r55970q74711p57040p09260o49609n32623n44771n22055m81827
11461A2036746l80792l92141m22921l48262l30876l82578l27328l27789l00027
11452H824032k93601l19648l23758k51585j90734k07038j68049j55013k02144
11443F712462j39359j95608j68428j15283j96431j94920r6367j22031r9353r1261
$$ y = [137754985, 156598874, 178892499, 202323728, 223454682, 238199400, 242605395, 234455829, 214600935, 187163039, 157600280, 130239771, 107274913, 89063369, 74969181, 64124475, 55779296, 49251110, 43992118, 39758807, 36209182, 33128741, 30465433, 28166603, 26125189, 24352291, 22733347, 21315740, 20093612, 19042332, 18064612, 17108642, 16233931, 15476891, 14767631, 14118022, 13585399, 13040628, 12518573, 12036746, 11655954, 11263813, 10840892, 10492630, 10161754, 9779176, 9451848, 9124059, 8824032, 8530431, 8210783, 7887025, 7635440, 7444706, 7237668, 7069619, 6914606, 6712462, 6573103, 6377495, 6209067, 6093784, 5897353, 5702433, 5606066, 5484035, 5384682, 5293421]
11433E293421j39868j33745r9330m4081l5072j17362j03021j65864j31907r6839
11423D226332o7321q9669j68782j12123j15368p2485p3997p0406r7980p6104m4340
11412C237757m7183o9823q8385r0484o3865j3142k2136q0076o0457k6130O250
11401B682326k7916q3688o1895j6949J0720l9049o7798q4879l0372k1432m5368
11390B213700k3728m5928o7848r8J7174n175N8200N5420K9728K0373K9801k8677
11378B252942j02245q7824o7915k5605l7740k2337o5272k9444m1244p6067n6484
11367A640765p0806q7575r4517p9239n8604m2769O424j2800Q061j2990m0578o9545
11355A085827n6686n1623K2614R420r8356n664l7148k1698m257k486P410L3592
$$ y = [5293421, 5153553, 5019808, 4920478, 4876397, 4841325, 4723963, 4620942, 4455078, 4323171, 4226332, 4159011, 4069342, 3900560, 3788437, 3673069, 3600584, 3526587, 3456181, 3358201, 3282097, 3237757, 3190574, 3120751, 3032366, 2941882, 2878017, 2864875, 2842739, 2762663, 2702206, 2676076, 2682326, 2654410, 2570722, 2508827, 2491878, 2502598, 2463549, 2395751, 2310872, 2280500, 2259068, 2213700, 2189972, 2144044, 2076196, 2076098, 2093272, 2088097, 2146297, 2201717, 2231445, 2251818, 2281619, 2252942, 2150697, 2062873, 1994958, 1969353, 1931613, 1909276, 1844004, 1814560, 1773316, 1697249, 1640765, 1569959, 1482384, 1387867, 1308628, 1250024, 1207255, 1213679, 1200879, 1208940, 1195950, 1155372, 1085827, 1029141, 977518, 1000132, 1009552, 911196, 905532, 868384, 846686, 842429, 839943, 847353, 880945]
11343H80945N6870J2760p290n3626n1749n2272m0430l6759n8434r144J3700l2911
11331F21660J9816o654K7773M9738m6180p941R793k6361Q891R145n6170p8056
11319E25454j1708m882J7586J7942O266p0709J2399J7653K4172n1785j5948L4136
11307E00576o754J1320O673o84m0893j9629k7432J8409j0951n6248M0937l8903
11295C76421n8280J693J3251N8389o108m2759j1058Q927K1990L2820l4198j1307
11283C49781j7675l4726r022K7351N9887O102l8437n8249k3147j8285l779L3722
11271B73523j3666K4328j9617J5319L8441P747j9866k8331N0362J8570n8988l3089
11259B54733N201K6992l3936n6380L4788K764L164j5665M377j1909k1987j8722
$$ y = [880945, 937815, 950575, 943285, 889659, 837910, 785638, 745208, 708449, 650015, 640871, 654571, 621660, 641476, 634822, 662595, 712333, 666153, 658212, 668005, 641644, 650535, 659680, 603510, 525454, 513746, 508864, 526450, 544392, 550658, 479949, 492348, 510001, 534173, 482388, 466440, 500576, 493822, 505142, 511815, 511131, 470238, 450609, 423177, 441586, 430635, 374387, 415324, 376421, 318141, 319834, 333085, 391474, 385366, 342607, 331549, 340476, 362466, 395286, 361088, 349781, 332106, 297380, 288358, 315709, 375596, 381698, 343261, 285012, 261865, 243580, 239801, 273523, 259857, 284185, 264568, 279887, 318328, 326075, 306209, 277878, 328240, 346810, 287822, 254733, 259934, 286926, 252990, 196610, 231398, 234162, 237326, 221661, 226038, 214129, 192142, 173420]
11247A73420J9686N3677r615j7039K2865l315M431q738m3637K5582K5392n8351
11235A84358j9879R295n1388K3165Q5134l3193m8911K7548J9162j3913J9847K3682
11223B24907R909m1287n642k7042o3077K157J8328N7833O2581J4812j7962l4734
11211B00783l1475r695o5553l2813j8265J4446M0574r080K4623N4382K0583M2136
11199B30646P112k7358q0718k7235J4531K222N491j3611j3817q83K2563L5262
11187A54205k367n132J553J14m9318k3180K517O8684L9439J2517o806O352r429
11174A89149p499j7740l057P030o284J5382p2106n060j3115k3910K0826M982K2316
11161A10914L5092K2692r47l7653j0275J9315M819J6007M8497Q575O7531J8230
$$ y = [173420, 193106, 246783, 237168, 220129, 242994, 239679, 244110, 235372, 191735, 217317, 242709, 184358, 164479, 173774, 122386, 145551, 230685, 197492, 148581, 176129, 195291, 181378, 201225, 224907, 234816, 193529, 187887, 160845, 97768, 99925, 118253, 176086, 238667, 253479, 235517, 200783, 169308, 159613, 94060, 61247, 42982, 57428, 98002, 88922, 113545, 167927, 188510, 230646, 237758, 210400, 129682, 102447, 116978, 119200, 124691, 111080, 97263, 96380, 118943, 154205, 151838, 146706, 148259, 148373, 99055, 75875, 78392, 147076, 186515, 199032, 192226, 198578, 189149, 181650, 163910, 160853, 167883, 161599, 176981, 104875, 99815, 86700, 62790, 83616, 88598, 110914, 146006, 168698, 167751, 130098, 119823, 139138, 143957, 159964, 208461, 217036, 284567, 302797]
11149C02797K4045K7167m436o4002l5177j7797k4321m194k1392J2374O4550J3892
11137B73506j3533J4566J703k2081J5623N7786N1897M3777J10565Q9186N7416
11126F80411R4303J38259J59417J45405R7759M0733J2054m8859n0033j28107j52262
11115I89080j52158p0399n6930l4245l1144m658L5865O6228J01692L7790J5251
11104H96372N7989L6542k1454R215K9896J7536N2458J8782N2574P5368J06122
11093A331400J14726O4054m4221m3011p3635q9958n6078n0063j8693O407k5972
11082A114956k7472n1623l3945L1057j326r2551r3349m1555n4872m7231n3698
11071F48391K6547L8498K6396O0333J11863J70189J38454J02855O5658L5799p5657
$$ y = [302797, 326842, 354009, 349573, 285571, 250394, 232597, 208276, 204082, 182690, 195064, 259614, 273506, 259973, 274539, 276242, 254161, 269784, 327570, 379467, 423244, 533809, 622995, 680411, 774714, 912973, 1072390, 1217795, 1315554, 1356287, 1368341, 1319482, 1269449, 1141342, 989080, 836922, 766523, 709593, 675348, 644204, 639546, 675411, 741639, 843331, 881121, 896372, 954361, 990903, 969449, 978664, 1008560, 1026096, 1078554, 1097336, 1149910, 1225278, 1331400, 1446126, 1510180, 1465959, 1422948, 1349313, 1259355, 1203277, 1153214, 1134521, 1140928, 1114956, 1087484, 1035861, 1001916, 1032973, 1031647, 939096, 845747, 804192, 749320, 702089, 648391, 674938, 713436, 739832, 800165, 912028, 1082217, 1220671, 1323526, 1389184, 1424983, 1349326]
11060A349326j33513j85487j35655r9638q6428o7740m9993q3333m0133k3356q5788
11049C58262p2916K7139j0250p7294p6462J337J6171M3413K472k245l3670L758
11037A79715O6525j9827k2470J054K0350l1337J8762J2380J2646q1644m8955R984
11025A17183J2418R613k9046m0631R669J6809l1320n4347J8033M4229K3722L51
11013I6683j5406j3337j8173L3856K2094L9499L0793q624o1019l3589L2364K8480
11001A33621M5936J43886J71483K24145K18485J10939J2726k46978l07022j88061
10991C19160j22957l2956K0736j0098n585P428k2744q832J2600k2584o4965j0463
10979E8740O3111J5897j0403K827M9666q141l5964n260j4411l7404j6003O969
$$ y = [1349326, 1215813, 1030326, 894671, 795033, 708605, 640865, 590872, 507539, 467406, 444050, 358262, 285346, 312485, 302235, 224941, 148479, 149816, 165987, 209400, 211872, 209627, 175957, 179715, 246240, 226413, 203943, 204997, 225347, 194010, 212772, 225152, 237798, 156154, 107199, 117183, 129601, 139214, 110168, 69537, 79206, 96015, 64695, 10348, 28381, 72610, 96332, 96683, 81277, 67940, 49767, 83623, 105717, 145216, 176009, 167385, 106366, 72777, 105141, 133621, 179557, 323443, 494926, 719071, 937556, 1048495, 1061221, 814243, 507221, 319160, 196203, 163247, 183983, 173885, 168300, 175728, 152984, 144152, 156752, 134168, 69203, 58740, 121851, 137748, 127345, 130172, 179838, 171697, 135733, 130473, 116062, 78658, 62655, 69624]
10967F9624J635j574J3179K5624J0964q620J3282l1716K2373K4386k8559j9636
10955I0962j4970K7090J9799J7462l136j1890k3095m99m8059k5157k2147J3726
10943B0086L6922n849j7246k2453n2447M013P9405M86k8032k2059M708L3691L0607
10930F1832L502j7502j4301J9926P489q727n312N2264M3034p0535m9941M287L026
10917B9042L742K3949k5311Q304J1854K3264K9985l785J3047J6999j6782j1226
10905A03082m9748l6525J5533K8150n246J2443k331j5898k50N892P973k6601M2377
10892G8851j1952m943K6592j8252j9658L863Q586J1125L085k0829J5492m0667
10880C1293Q941k2013q663J6218M0899K1200j3898k9231j6868n5292K3166J4321
$$ y = [69624, 71259, 69685, 82864, 108488, 119452, 110832, 124114, 92398, 114771, 139157, 110598, 90962, 75992, 103082, 122881, 140343, 137207, 125317, 102222, 101723, 53664, 28507, 6360, 20086, 57008, 51159, 33913, 11460, -40987, -36974, 42431, 42917, 14885, -7174, -2466, 31225, 61832, 65334, 47832, 33531, 53457, 60946, 52219, 46907, 99171, 142205, 71670, 21729, 26016, 29042, 32784, 56733, 31422, 39726, 51580, 74844, 104829, 101044, 114091, 131090, 114308, 103082, 53334, 16809, 32342, 60492, 55246, 67689, 65358, 49460, 49210, 55102, 63075, 36474, 78851, 66899, 61956, 88548, 70296, 50638, 54501, 63087, 74212, 77297, 56468, 71960, 31293, 40234, 18221, 9558, 25776, 66675, 87875, 73977, 44746, 27878, -27414, -4248, 10073]
10868A0073l4460J4763j9865K5615L5170K5710j9879M9476J3384l166K8064j0738
10856A14147j8396J4576j7183k0490p1146n0023K3j0245J9809j9770m2865R1601
10844i962M1390J2025j7705k2425j2480j826j6371o356L046o85j7798O7448M6615
10831F4916j1957m3537L9437J3982L153n6831k0800j1511K8535J9338m1683K7479
10819A0521L2504l936n4630k5855N6425N0263O453r558k6422m7235N943n4574
10807f0101J3873M8644O711Q308L2490k6421n972l8964j7600M9016K7961k4265
10795A3680N342J8548m579K8295n5668l3815M9730j2315m6358l1363N6012L9285
10783B6794o145Q767K1215K872m7458J3418j1748m8679R297J4917k542M7406M867
$$ y = [10073, -24387, -9624, -29489, -3874, 31296, 57006, 37127, 86603, 99987, 96821, 124885, 114147, 95751, 110327, 93144, 72654, 1508, -48515, -48492, -58737, -38928, -58698, -101563, -9962, 31428, 43453, 25748, 3323, -9157, -10983, -27354, -33710, -30664, -31349, -49147, 18301, 64916, 52959, 9422, 48859, 62841, 65994, 9163, -11637, -23148, 5387, 24725, -16958, 10521, 43025, 39089, -15541, -41396, 15029, 65292, 71745, 62187, 35765, -11470, -5527, -60101, -46228, 2416, 9127, 17435, 49925, 23504, 17532, -21432, -39032, 9984, 37945, 13680, 19022, 37570, 32991, 61286, 5618, -28197, 21533, 9218, -37140, -68503, -12491, 26794, 20649, 29416, 50631, 53503, 6045, 19463, 7715, -40964, -31667, -16750, -19292, 28114, 32981]
10770C2981p697M942M190K5944m9348L8014M2257k6022q3387M5350j5226k4975
10758a2977O221k7817J9883K2610J2144L5339n1246k4487j769N5029K3504r271
10746D7163J189j6450J2229M5757o2971m079J8043k8217j9508K8924L6274l610
10734E4744k8221k4157k5328K74L4568j9858l4353K4496P0600j0424k9559K760
10722A5542J1273m5099K8576M0266J4778j741k6029l2777M0380L6765R657L0059
10710A21650J200n0075m1474M852K081K2010j2500k2943j5131J8708M4232r623
10698F2987l1757k7423M8101j056j8563k382J1205J199l550k5636q772m0348O898
10685b9097N1496O926j5117j1407j4939M4534K0403j7219l5002j8281k4648K4583
$$ y = [32981, 25284, 30226, 34416, 60360, 11012, 49026, 91283, 65261, -18126, 27224, 11998, -12977, -6756, -34573, -14690, 7920, 20064, 55403, 4157, -20330, -22099, 32930, 56434, 47163, 48352, 31902, 44131, 89888, 26917, 22838, 40881, 12664, -6844, 22080, 58354, 54744, 26523, 2366, -22962, -22688, 11880, -7978, -42331, -17835, 52765, 42341, 12782, 15542, 26815, -18284, 10292, 50558, 65336, 63595, 37566, 4789, 45169, 81934, 91591, 121650, 122850, 72775, 31301, 36153, 38234, 60244, 47744, 24801, 9670, 28378, 72610, 62987, 31230, 3807, 51908, 50852, 32289, 29907, 41112, 42311, 38761, 13125, 4353, -35995, -29097, 22399, 29325, 14208, 2801, -12138, 32396, 52799, 35580, 578, -17703, -42351, -17768]
10673a7768K7861L7765M2337L2669j8125m4735J3562n4471j0430k7712j3369L9151
10661F735K3180J2568j8506j5673L0173k0993K9506O8841J1657q1847o8984L0457
10649G114q479J0474R227K835L0640K9074k6339l0023N27R167j5617j658r462
10636G480K8883M4583k6661k9804J6890p135L8178J4404r1918k8427L3603k4286
10624b4210k211M2503J8594n5107j5203L1972K7099l1075m2038K246J7731J3235
10612a6464L8871P625k7353Q288r758J990O591K3410k7913L0297l4701j9045K5915
10599G753P451j2708l6761l305K5218K4830K0513M1128k3323l4818k5749j2937
10587b2708k6385m8752L7520O0675M1602k9361k345K9491j0553j2089J0421q202
$$ y = [-17768, 10093, 47858, 90195, 122864, 104739, 60004, 73566, 19095, 8665, -19047, -32416, 6735, 29915, 42483, 23977, 8304, 38477, 17484, 46990, 115831, 127488, 45641, -23343, 7114, -1365, 9109, 18336, 21171, 51811, 80885, 54546, 24523, 25050, 34217, 18600, 16942, 7480, 36363, 80946, 54285, 24481, 41371, 34236, 72414, 86818, -5100, -33527, 76, -24210, -26421, 16082, 34676, -20431, -35634, -3662, 23437, -7638, -49676, -47430, -29699, -16464, 22407, 30032, 2679, 10967, 1209, 3199, 9790, 33200, 5287, 35584, 883, -18162, 7753, 15204, 2496, -34265, -37570, -12352, 12478, 32991, 74119, 50796, 15978, -9771, -22708, -49093, -97845, -60325, 350, 41952, 12591, 10246, 39737, 29184, 17095, 27516, 19314]
10575A9314n123J3469L4917J3757J6546j8279L6047J8178n034l7217l7040j403
10563D8132o4536n6130m849L5547J5404Q1938m5531k7923J0560o457O924L6253
10551B9332N27J0920M0575m4467Q7L0887n408J915K154J3687L4783k4894k4487
10538F5611l620k2994k382J4202r264k7705K2858j7688k8151J9569k9715K6303
10526G024L4280k2535o5022P193N9887J7038L8711k4285o537q5965J4007M0272
10514A4068l3001j7545L2712j254O415k8204l4096o3387k3401P0167L1855O245
10502c9426j1522L5419q256K0694M1218q123N274N5160N2827q853n2144k1800
10490F0468j6777L9631k4708p0246j2942M8331P3219j699p0196j1526J14327M8241
$$ y = [19314, 14191, 27660, 62577, 76334, 92880, 74601, 110648, 128826, 123792, 86575, 49535, 48132, -16404, -72534, -77383, -41836, -26432, 55506, 9975, -17948, -7388, -13845, -6921, 29332, 29859, 40779, 81354, 36887, 36974, 67861, 62453, 64368, 66522, 80209, 114992, 90098, 65611, 61991, 38997, 36615, 50817, 41553, 13848, 36706, 19018, -9133, 10436, -19279, 7024, 41304, 18769, -46253, -39060, 20827, 37865, 76576, 52291, 45754, -40211, -26204, 14068, -18933, -36478, -3766, -5020, 1395, -26809, -60905, -124292, -147693, -77526, -45671, -39426, -50948, -15529, -23785, -3091, 38127, 30004, 35278, 90438, 143265, 134412, 82268, 60468, 43691, 83322, 58614, -11632, -24574, 23757, 96976, 95277, 25081, 13555, 127882, 176123]
10478A76123o5142m0368m3922M2421J9899k3609o9652k2985K7763J1004j8955
10467g423k9143p075N4867N2472j7567l0914k8677L4898k4509M286K1456j4586
10455H085j7290k0382n0307K8922P5354J7340n573j1188N521l0800l9875Q055
10443c2138j2929L0277O0047J0328K4534K7633J4935K7535k6218m3449J044L9320
10431A20919N301k7301l2368l6209n460K7423R684M526k7782k9536j0239m976
10419f018l526K8483L4348P893k1415L2178j2398l2507j3726M989L205J873m250
10406A9129J6035j0129K3605K4596j5285n5849j4347L3425L1505k357P386J913
10394E9627o1417j8950o422O391M132K4692M584L8706M4989j6610o6894k4639
$$ y = [176123, 110981, 70613, 26691, 69112, 89011, 65402, -4250, -27235, 528, 11532, -7423, -36566, -43641, 11226, 63698, 46131, 15217, -13460, 21438, -3071, 1215, 22671, 8085, -9205, -29587, -79894, -50972, 24382, 41722, 36149, 24961, 30482, -318, -40193, -32138, -45067, -14790, 45257, 55585, 80119, 107752, 122687, 150222, 124004, 80555, 81599, 120919, 126220, 98919, 66551, 30342, 24882, 52305, 61989, 66515, 38733, 9197, -1042, -6018, -9544, 18939, 53287, 61180, 39765, 71943, 59545, 27038, 13312, 18301, 21506, 23379, 19129, 35164, 25035, 48640, 73236, 57951, 2102, -12245, 21180, 52685, 50328, 57714, 59627, -1790, -20740, -27162, -20771, -16639, 8053, 12637, 51343, 96332, 79722, 12828, -11811]
10382a1811J2913Q741N4478O0712r141l1504l5236J5715j7713j9906K7268m0304
10370A4212k1214L9505K5k4041J4406M5784M255j8478k7750o6258k7083M346O1340
10357i51r825k5417K7440M1276Q384m6985K554k8918N56J3770n6495K1269K4304
10344b9038K986P626J1717L8118l31k5946n2405J2613J0248j2047k538k1591O3726
10331C138K6723p1061r635J5451J6670J6130Q822k6697k1528L0173r401j2621
10319c3836J349q460M6974K081o5332k7194O2775QK980l8988O964N2306j7124
10306a5497q297J1500L62k6296J4214L3107R288o730J3113o1074o4114n489N2103
10293e3810L8451M2639J6924r157l468L332K3901l0411j7709l6160r248n33M033
$$ y = [-11811, 1102, 9843, 64321, 125033, 115892, 84388, 49152, 64867, 47154, 27248, 54516, 14212, -7002, 32503, 32528, 8487, 22893, 68677, 72932, 54454, 26704, -39554, -66637, -62291, -951, -10776, -36193, -8753, 32523, 40907, -6078, -3524, -32442, -31886, -18116, -74611, -53342, -29038, -26052, -18426, -6709, 31409, 31078, 5132, -47273, -34660, -24412, -36459, -38997, -60588, 3138, 29861, -41200, -50835, -35384, -18714, -2584, 6238, -20459, -41987, -11814, -21215, -33836, -32487, -40947, 6027, 8108, -57224, -84418, -21643, -21635, -18655, -57643, -50679, 1627, -15497, -23794, -12294, -11932, -38228, -24014, 9093, 18381, 11651, 24764, -36310, -100424, -105913, -53810, -15359, 27280, 44204, 35047, 31579, 34911, 58812, 28401, 10692, -25468, -34716, -35249, -31216]
10280c1216J6263M2468L4568K3484P939R158J1153p1795o8210j3069m45j5656
10268e5358O035o5469j1526N2310P205L857P617J4593L2452L8203k8241j8987
10256a7309N750K2854j8961k2513k2509J1509j305O6167M2858j9252l3686k9318
10244a5715k525q716j4379j3702J7816n1317j0011M7012L2698O1665M9518j3544
10232G8800l4099l1104M204Q600l708J5538k4893j5020q768K6299l3974N5172
10220C7047L2404J7696J6630j4423j8527j0640R92o601l6843m5093K2504l2898
10208c7752K4712L3260m284K6120q912n4102k4758r499l240K2156N3856L9673
10196E7230k116m2987k4707L3090r516J3205M6759P284j292K0451j2644o4320
$$ y = [-31216, -14953, 27515, 62083, 85567, 93506, 102664, 113817, 42022, -26188, -39257, -39702, -55358, -49323, -114792, -126318, -74008, -66803, -62946, -55329, -40736, -8284, 29919, 1678, -17309, -11559, 11295, -7666, -30179, -52688, -41179, -42484, 23683, 66541, 47289, 13603, -15715, -18240, -26956, -41335, -55037, -37221, -88538, -98549, -51537, -18839, 42826, 92344, 78800, 44701, 13597, 17801, 26401, 22693, 38231, 13338, -1682, -10450, 15849, -18125, 37047, 69451, 87147, 103777, 89354, 70827, 60187, 61179, 54578, 17735, -27358, -4854, -37752, -13040, 20220, 15936, 42056, 33144, -20958, -45716, -55215, -58455, -36299, 17557, 57230, 55114, 12127, -12580, 20510, 10994, 24199, 70958, 78242, 76950, 97401, 84757, 20437]
10184B0437p526J0806l2426j8518L0660L2198M8880J5271k389k3681m2746n5575
10172b4609j2461J7354L4148O4386O158n2341J3294j9587l9953k8217r6R7780
10160E5856M2628n4169k0800L375j5348M2507l4266R412j0747r503L122L5947
10148D8014j4748k7809L2903O067l7751k0166k4270J4786P253j5157J8232L7358
10136B4712K6881k1344K04l3279l6663K4901N1584J3807j9180j6344L7686K1522
10124G4487J0305n98p4131k9865L7669M0875k7169k0107k6316J2448M9051J6824
10112F3473M1451k2342l9740n3891k0731M7288K6943j1546J0173N7229J2391n435
10100A05263k5723k6974p2503k8855n01O984j4270L0524K9681K5730j254k2132
$$ y = [20437, 12911, 23717, -8709, -27227, 3433, 35631, 84511, 99782, 97393, 73712, 30966, -24609, -37070, -19716, 14432, 78818, 84976, 32635, 45929, 26342, -13611, -41828, -41924, 55856, 98484, 44315, 23515, 26890, 11542, 54049, 19783, 29195, 18448, 8945, 12067, 48014, 33266, 5457, 38360, 44427, 6676, -13490, -37760, -22974, -15721, -30878, -12646, 24712, 51593, 30249, 30453, -2826, -39489, -14588, 36996, 50803, 31623, 15279, 52965, 74487, 84792, 84194, 10063, -19802, 17867, 58742, 31573, 11466, -14850, -2402, 46649, 63473, 104924, 82582, 42842, -11049, -31780, 15508, 42451, 30905, 41078, 98307, 110698, 105263, 79540, 52566, -19937, -48792, -49293, -42309, -56579, -26055, 3626, 29356, 28102, 5970]
10088E970M91r834k9842l885m350K3672J174M1371J484l7903r626m589O097p161
10074b6931J3888k2439k7725j5277J2737K1132Q4980k2069j1002k982l3489J8868
10062a0309l0521K8954R018k8240o366Q653R417J1776j1089j3283q690J1347J3153
10049a6180J4449K5493j2613K6419l985k3651p98N1954L6607j2072l5944l9999
10037I680l0740K7389j612p661K7731l9222j3538L839J0861P7833L8757k4740
10025G8577l8098J8207O06j0695P868l130J8871k331j0674j4064L137O370k3986
10012C0658L0386l938p0909l3939j525M9859r747M190M396K8600N555K0669r168
9999D5087k6990j0289j2013q3456j5500N7141K9708N207J9920q313j6389j96M3939
$$ y = [5970, 6461, -3373, -33215, -37100, -41450, -17778, -16604, 24767, 26251, -11652, -21278, -25867, -19770, -26931, -13043, -35482, -63207, -78484, -65747, -44615, 40365, 18296, 7294, 4312, -29177, -10309, -40830, -11876, -2858, -31098, -37464, -28811, -19394, -7618, -18707, -31990, -40680, -29333, -16180, -1731, 23762, 11149, 37568, 33583, 9932, 9134, 61088, 97695, 85623, 49679, 9680, -21060, 6329, 4717, -2944, 24787, -14435, -27973, -24134, -13273, 64560, 103317, 78577, 40479, 58686, 59292, 48597, 56465, 53335, 72206, 69875, 59201, 45137, 48274, 54644, 30658, 61044, 57106, -13803, -47742, -49267, 592, -9155, -4965, -569, 28031, 33586, 54255, 45087, 18097, 7808, -4205, -87661, -103161, -46020, -16312, -11105, 8815, 502, -15887, -16083, 27856]
9986B7856M2305j1952k9714o2905o3070M408N6665J5848J7457K8196N7450J959
9974H4503m135k657l2108k1961p6250k8237L1719J4778J5635j8293k0647L3783
9962b3870M9658K4403l036m8061l3849M331M762m067K0707L5619K6314j424L4217
9949H5704k7068p669j597m3768p884Q316J4464K9387k5133l5498k2664J4062J6004
9936c344K2920N715k9187k0256r774K4256J0248j0203j0009j3982K5300l456L7752
9923B5980k071p782j3971m3579l9870J6455L6396K7772k0741L1461q937J2995
9911A4108l538k0226J7204K481K7799j98k7275k8338Q635M5356k2157m2111J6976
9898a1284K9625K2992n4041p3004k4966N7824M3088l7764K591M1131l310M7766
$$ y = [27856, 70161, 58209, 28495, -34410, -97480, -93072, -36407, -20559, -3102, 25094, 82544, 84503, 80368, 77711, 45603, 23642, -52608, -80845, -49126, -34348, -18713, -37006, -57653, -23870, 25788, 50191, 47155, -906, -34755, -30424, -25662, -29729, -9022, 26597, 52911, 51487, 85704, 58636, 50967, 49370, 5602, -2282, 6034, 20498, 49885, 24752, -10746, -33410, -19348, -3344, 19576, 25291, -3896, -24152, -33926, -9670, 578, -9625, -19634, -33616, -8316, -11772, 25980, 23909, 16127, 2156, -41423, -81293, -64838, -28442, -670, -21411, 10050, 1113, 14108, 10570, -9656, 7548, 10029, 37828, 37630, 10355, -17983, -9348, 36008, 13851, -28260, -11284, 18341, 41333, -12708, -85712, -110678, -52854, -9766, -47530, -44939, -3808, -7118, 40648]
9886D0648j4168k1059k9101j8080N8957k5604m5184J1851r407K6729K5750k6792
9874b5460N595J9174M3281J173j8083Q73J2691P555J3693j3013j9575k446q528
9861A6930R746j6813o0127M5254M0530p894K0752l9286k5945J5191M4705M2096
9849H5139m0884p6302q219K4710r792L0612L6522k2408n8115K8776L1926j0708
9837A1257J4764k2457l8086m029K2348K0188Q212K8397r5433o3905R8540N2261
9825C2057P72l9919n1449l8892K0334j0085Q369L8058J547J1647Q509M832N0965
9812C6745m1731k7145m885O274M7639j2029j9846l1266M0670Q476K0272k4334
9800a160J351n915J511j6926l0292L7054K5413l4100q654m0627l3479L4936M5553
$$ y = [40648, 26480, 5421, -23680, -41760, 17197, -8407, -53591, -41740, -51147, -24418, 1332, -25460, -19865, -691, 42590, 43763, 25680, 26553, 39244, 46799, 60492, 47479, 27904, 25458, 16930, 26676, 9863, -50264, -5010, 35520, 27626, 48378, 9092, -16853, -1662, 43043, 85139, 44255, -32047, -40266, -15556, -25348, 5264, 41786, 19378, -38737, -9961, 21965, 11257, 26021, 3564, -34522, -38551, -16203, 3985, 12197, 40594, -54839, -118744, -20204, 32057, 32829, -7090, -58539, -97431, -77097, -87182, -78813, -40755, -39208, -27561, -19052, -14220, 36745, -4986, -32131, -37016, -30742, 16897, 4868, -14978, -46244, -5574, 2902, 23174, -1160, 191, -5724, -4213, -21139, -51431, -14377, 11036, -23064, -31718, -72345, -105824, -70888, -25335]
9787b5335N5367l4442N411K1231Q234k5272J2699j6079m1276k3305K1533N1256
9775A0022l1519j5274M876l929K1994N80J4909r96J5258K8093j2810J5581o057
9762D0728j6434L9535k70o0206o4173j7396R338J8676j9109r794l927o622R587
9749h0067p871N9313L85k6077K5688j6689m4150q826K3724M8061K754J7039L3489
9736B6773Q110p23n2779O290M1563K987n154j76L880k0277m7938Q182N6408N7697
9722H4843j8887o4152k961j8340J8409l1172j0192L5307K6702l1289J9577M5724
9710E3569K5055l1694l414N829j4595l79j3254m145P474l4522k3384P1462L7782
9697G5784p7526k5060l5124K278K4606k3305J833K5223L8710j2093l8693L6440
$$ y = [-25335, 30032, -4410, 1001, 22232, 30466, 5194, 17893, 1814, -39462, -62767, -41234, 10022, -21497, -36771, -31895, -35824, -13830, -13250, 1659, 663, 15921, 44014, 31204, 46785, 40728, 24294, 63829, 63559, 3353, -60820, -78216, -68878, -50202, -69311, -79105, -83032, -89654, -80067, -87938, -28625, -28240, -54317, -28629, -45318, -89468, -98294, -74570, -26509, -23755, -6716, 26773, 34883, 34160, -18619, -12329, 29234, 32221, 27067, 26891, 30771, 10494, -37444, -29262, 27146, 84843, 65956, 1804, -1157, -19497, -1088, -32260, -42452, -7145, 19557, -11732, 7845, 53569, 78624, 46930, 43516, 49345, 34750, 34371, 21117, 16972, 24446, -10076, -33460, 38002, 75784, -1742, -26802, -61926, -59648, -35042, -58347, -56514, -31291, 7419, -4674, -43367, -6927]
9685f927r768j2003O4280k6458J9292P798K357k0640l934K7717j3273m1180j0779
9672b3518K3458L9568j503l9955J4749K2582k1488n4007m2124n562M6318K0113
9660b1369j7567j8797J8031P130L1112J5830o381l2210n691Q318k2738J5936K2972
9647e424L4030O807n134l7785J8543n147k9274J1508l546O977j2617k0893O1134
9634A9179o839l6718K3199J6025L0188n392j1645q294o8674l7441K5412R925J0942
9621d0133M2945N4406K7962j939p0074m4899l9648L54K6626O8485k7758J0209
9609F536L7516o528l2214k4649J6279M4580K4388K605m7756n9831N37N5332L8509
9596E5304J2124k1657J0738J2051k9853j9499k9042N844M5881L9862k6109m7751
$$ y = [-6927, -16695, -28698, 35582, 9124, 28416, 36214, 38571, 17931, 13997, 41714, 28441, -12739, -23518, -60, 39508, 38005, -1950, 12799, 35381, 13893, -40114, -82238, -87800, -41482, -21369, -38936, -57733, -39702, -32572, -1460, 14370, 7989, -24221, -29912, -21594, -44332, -28396, -5424, 28606, 35413, 30279, -7506, 11037, 5890, -23384, -11876, -15422, -8445, -21062, -41955, 19179, 12340, -24378, -1179, 14846, 45034, 39642, 27997, 19703, -48971, -86412, -61000, -51075, -40133, 2812, 57218, 85180, 83241, 13167, -31732, -71380, -71026, -44400, 24085, -3673, 6536, 44052, 37524, 5310, -19339, -3060, 41520, 65908, 68513, 20757, -39074, -38537, 16795, 55304, 67428, 45771, 56509, 68560, 38707, 19208, -9834, -3990, 41891, 81753, 55644, 7893]
9584G893k4721K2408L8022j254k6936o96n9278p597J3863j9736J9707j0868N659
9571d3534L0734o811m557J1329j650K4266J1918j2216p229K423J352j5333k9430
9558c8738j7759L2949J429j1752n06J3333l024o68N746L1960K5600M9460j4790
9545G3240o6472o165N6579o651j6476o0149M3408O1403J0903L6896l1524l2073
9533F2919r884M657j6825K282m1630l1896l2140P218Q657K8401K2793K0890K3760
9520D9202j5171l772K1864J3768K6840l602r452l0195q2518p9975K4794L0685
9508e7532m783J4850M102N7329Q341l8854l0033m9525n035K3287L9362N0628Q856
9495B0993j2220L4668K5998K0700L0485L619j8277M829K9383K9011N553l2868
$$ y = [7893, -16828, 5580, 43602, 42348, 15412, 14716, -44562, -52159, -38296, -58032, -38325, -49193, -43534, -12800, -19611, -24168, -12839, -14489, 9777, 21695, 9479, 2250, 4673, 6025, -9308, -38738, -56497, -23548, -22119, -33871, -34377, -21044, -24068, -24736, -18990, 12970, 38570, 88030, 73240, 6768, 603, 57182, 50531, 34055, -26094, 17314, 78717, 89620, 126516, 94992, 62919, 53035, 57692, 40867, 43149, 1519, -30377, -62517, -55299, -46642, -18241, 4552, 25442, 49202, 34031, 30259, 52123, 65891, 92731, 89129, 79677, 49482, -33036, -113011, -88217, -57532, -62315, -47465, -43363, 13966, 22307, -16547, -46580, -96105, -101140, -77853, -38491, 12137, 20993, 8773, 43441, 69439, 90139, 120624, 124243, 105966, 110795, 140178, 169189, 174742, 141874]
9483A41874k704N5974l7136m6514J1426q072o5128J5287J6423K467k1012n0191
9471A2694L0537M6228K6339J0853k6321k3005q680J3374J9576R477K0976P017
9459A39065J7430J8771m1357m3279j3471M4041N5007O916O876N747k8059O582
9447A74269R608m651R612n1287M496L8531J5157k3178J9041K3857N417P993R625
9434B38490O023k5515j7931l6316L4910k9223m3193j0326O347L637m8607N805
9422H4101J5373M0371j15m33N733N066m7968k3860J0873K6232K5375Q67l0633
9409A10982l1941p771J0039j4943j7472o985l4644P788k2196J5856M7197L9452
9397I5362K3553m5898o0790j6775J8059K8969m3589m465m52N1158K0775k5974
$$ y = [141874, 139170, 195144, 158008, 111494, 122920, 114848, 49720, 65007, 81430, 83897, 62885, 12694, 43231, 89459, 115798, 126651, 100330, 77325, 68645, 82019, 101595, 111072, 132048, 139065, 156495, 175266, 133909, 90630, 77159, 121200, 176207, 183123, 189999, 195746, 167687, 174269, 183877, 179226, 188838, 137551, 142047, 180578, 195735, 172557, 191598, 215455, 220872, 228865, 238490, 244513, 218998, 201067, 164751, 199661, 170438, 127245, 116919, 123266, 126903, 78296, 84101, 99474, 139845, 139730, 139297, 145030, 150096, 102128, 78268, 89141, 115373, 140748, 141615, 110982, 79041, 71270, 81309, 66366, 48894, 41909, 7265, 15053, -7143, 8713, 55910, 95362, 118915, 73017, 12227, -4548, 13511, 42480, -1109, -5574, -6026, 45132, 65907, 39933]
9385C9933m378L3279M1765j6083l1669j2075l7K106n559p475K5597k6107k6662
9372A2635k5857J4902M7056M5419M9658K8156l0561L706k856l9625k5722Q52K6978
9359A04741K3733l0777l3982j4120l770K0499k0936l9771L240K9747Q181O684
9347E3469K2814m7273M3200L4526J3555k7285O0007J7662q046k5101j712l1461
9335A04355o4463l1522O8699J6596j3800q292J751J92k7546q90K6864K0849K44
9322I3037n6344J7260L8315J9310m8691K043M799L9546P235o5076j6134J8720
9310E4020r808J6152N1309P1950L060n9028n6943k729k653k5565K3889j1264k7452
9297B4938M5949M0641K5261k9022j5784j7532j3676J1718j1480N3116L6826l200
$$ y = [39933, 35555, 68834, 110599, 94516, 62847, 50772, 50735, 52841, 47282, 39807, 65404, 39297, 12635, -13222, 1680, 48736, 94155, 143813, 171969, 141408, 145114, 142258, 102633, 76911, 77763, 104741, 128474, 97697, 63715, 49595, 45825, 66324, 45388, 5617, 8857, 38604, 46785, 53469, 76283, 29010, 72210, 106736, 120291, 93006, 153013, 170675, 162629, 137528, 135816, 104355, 39892, 8370, 77069, 93665, 79865, 71573, 73324, 73516, 45970, 45080, 71944, 92793, 93037, 36693, 53953, 92268, 111578, 62887, 64930, 69729, 109275, 116510, 51434, 35300, 54020, 44212, 60364, 111673, 183623, 186683, 127655, 70712, 67983, 65330, 39765, 63654, 52390, 24938, 70887, 111528, 136789, 107767, 91983, 74451, 60775, 72493, 61013, 114129, 150955, 147755]
9285A47755l4598k6940J9405r521J7114J6260K3673M8812k1812J1291l634P932
9273A95737l8239o3260j9276L0124N2181k4966p233L4324K4849O3709K5999k9065
9261B44884k2264j684m033P812J4600J8272k5315j9172n358J9895K1495l3750
9249B15382p673m1935P206K6382P7767K6094M3135K2034K6146K0648j4654L0890
9237D31422K8354M949m0154k4384N511M9639N3319k5195J9276P9006k023n5966
9225E23754K3640O4969P3994N9322L8109l6019L3055N4079M2628R1646Q7573J9865
9213A076615O4648J26612R5110J04607J15341N1825J14223J08442J24091J36317
9203B117831J47697K10514K18035K41270K76106L18604M31230L81127N21460O89815
$$ y = [147755, 113157, 86217, 105622, 96101, 113215, 129475, 153148, 201960, 180148, 191439, 187805, 195737, 157498, 94238, 74962, 105086, 157267, 132301, 125068, 159392, 184241, 247950, 273949, 244884, 222620, 220936, 216903, 224715, 239315, 257587, 232272, 213100, 207742, 227637, 249132, 215382, 207709, 165774, 172980, 199362, 277129, 303223, 346358, 368392, 394538, 415186, 400532, 431422, 459776, 464725, 424571, 400187, 405698, 455337, 508656, 483461, 502737, 581743, 579720, 523754, 547394, 612363, 686357, 745679, 783788, 747769, 780824, 834903, 877531, 969177, 1056750, 1076615, 1141263, 1267875, 1362985, 1467592, 1582933, 1634758, 1748981, 1857423, 1981514, 2117831, 2265528, 2476042, 2694077, 2935347, 3211453, 3530057, 3961287, 4342414, 4863874, 5553689]
9193E553689P74542R46813J192310J494730K068531K866950M040371N781707Q382138
9184C3101781J1976843J5891295J8524982J7083104R963009k279308j5060524
9177H9201182k0537690j7847043j2843954q795785o164093m352818l129980k337645
9169A3192174j777036j380338j135039r35744p78895o40158n27685m52553m05412
9160E159314m20805k75571k44633l01794l13136k26709j72800j47710j46375j77021
9150B732760j25079j26486j26431j19702n9437o4101j03306m4919r9408j21398
9140A742493l0940j6607k7671m2107q0647q9602r4129q9294m2594k7691m1753
9129A159458j3894l7842l4127k6042r098l9285q130J6066o4446q5779J2334j9410
$$ y = [5553689, 6328231, 7275044, 8467354, 9962084, 12030615, 14897565, 18937936, 24719643, 33101781, 45078624, 60969919, 79494901, 96578005, 106541014, 104261706, 89201182, 68663492, 50816449, 37972495, 29176710, 23012617, 18659799, 15529819, 13192174, 11415138, 10034800, 8899761, 7964017, 7185122, 6544964, 6017279, 5564726, 5159314, 4738509, 4462938, 4218305, 3916511, 3603375, 3376666, 3203866, 3056156, 2909781, 2732760, 2607681, 2481195, 2354764, 2235062, 2175625, 2111524, 2008218, 1963299, 1863891, 1742493, 1711553, 1694946, 1667275, 1625168, 1544521, 1454919, 1360790, 1271496, 1228902, 1201211, 1159458, 1145564, 1107722, 1073595, 1047553, 1038455, 999170, 991040, 1007106, 942660, 856881, 869215, 849805]
9117H49805k0237j229l2393n1884o1818k6572J2517k7328M628M4648o2745n6131
9105E71261m6325K0857J4125j5309k3155q882j2916l1084l9450l1692L6997O540
9093D40967l4045J5795L3511l3509j0209N106k6442o6682m676j3332P641J9903
9081C34028k0172K6161J5948n2118k8800J0737k2491r50J0118k7903r788j6193
9069B18577N623p3173L872O9189M8987L4482Q205J2085K4462M966n9490k9263
9057B68522m6305l2696j207M0311L6683L8170l0883n5500K2373M467k7467l9667
9045A76801n2656K3462N067J3636n0614N022Q3897O8611j2548m3539k1359Q092
9033B03872j2620l2662o9635k5516L7037J6456j3119J7635M373J6624k741k105
$$ y = [849805, 829568, 828339, 795946, 744062, 682244, 655672, 668189, 640861, 645489, 690137, 627392, 571261, 524936, 545793, 559918, 544609, 521454, 512572, 499656, 468572, 429122, 397430, 434427, 440967, 406922, 422717, 456228, 422719, 412510, 417616, 391174, 324492, 319816, 306484, 314125, 334028, 313856, 340017, 355965, 303847, 275047, 285784, 263293, 262343, 272461, 244558, 234770, 218577, 224200, 151027, 154899, 224088, 273075, 307557, 315762, 327847, 352309, 357275, 297785, 268522, 222217, 189521, 188314, 228625, 265308, 303478, 272595, 217095, 239468, 243935, 216468, 176801, 124145, 147607, 152674, 166310, 115696, 120718, 204615, 273226, 260678, 217139, 195780, 203872, 191252, 158590, 88955, 63439, 100476, 116932, 103813, 121448, 125821, 142445, 139704, 137599]
9021A37599n4980m1237j0164M6903J8324l9608M880J1348l182j2883N84N53J0877
9008F9014K9864J8390l427m1031j2805j4230M9192K1808j5127r141l8921Q600
8996F2186p068Q768J8814k6670n3741J6985J7419j7256l2674J2990L8622J9718
8984E8093M4744J885l0194k7476l402K446L818o709k6591k517j5412J5674j8500
8971d141M0947n8353m1073J8760J2987k9333O964J1894M9485L0939l4534j8344
8959a3802K5055M3622L4530J9682O993m7797m1761k9299L9669N4733J3272k6461
8947G8436m3630n3815k5831j4243K7989m751M1454O2929L1079o5226o0724k906
8935b9239n321O299M2159N3453M3252l3353n4420r384k517l683J6431M4112j8321
$$ y = [137599, 82619, 41382, 31218, 78121, 96445, 56837, 61717, 73065, 69883, 57000, 57584, 58137, 69014, 98878, 117268, 113841, 72810, 60005, 45775, 94967, 116775, 101648, 92507, 53586, 62186, 55118, 63886, 82700, 56030, 2289, 19274, 36693, 19437, -13237, -247, 38375, 58093, 102837, 104722, 74528, 47052, 43650, 46096, 49914, 43205, 16614, 14097, -1315, 14359, -4141, 36806, -21547, -62620, -43860, -30873, -60206, -53242, -41348, 8137, 39076, 4542, -13802, 11253, 54875, 89405, 109087, 116080, 68283, 26522, -2777, 36892, 91625, 104897, 78436, 34806, -19009, -44840, -59083, -31094, -35845, 5609, 68538, 99617, 34391, -26333, -29239, -34560, -28261, 13898, 67351, 110603, 77250, 22830, 13446, 10929, 7246, 23677, 67789, 49468]
8922D9468l0344l4656J8588N5048j3738k6365k0906L81M79j5086L507k5220k4146
8909f2990L5250N0861K559j4637j546m3254J4831P2206l3273J567K4571p1180
8897b5035k5536M7532O551q284j3402K0706L9702K2926n1426j7585N7947k1727
8885C2369m4584n7q68j0216l3378k2071K2240N7056L0290j3320J6526K3556l435
8872E4108j0159l5086J3702J7899l4159l6093J4663N1147K5345Q211l8806m1007
8860a0235l1298Q225K6130P636K0934K3945j6660l126K9940J708p0101p1917l87
8847h5206M5885K1237K5485J9400m0259m3551k1107K9933K7223J0214L064J3889
8835F207J5808j4768Q178K157N691k7485M9431M1553j04131n4549N9109k0697
$$ y = [49468, 19124, -15532, 3056, 58104, 44366, 18001, -2905, -2524, -2045, -17131, -13624, -38844, -62990, -27740, 23121, 25680, 11043, 9497, -33757, -18926, 53280, 20007, 21574, 46145, -25035, -50571, -3039, 3512, -4772, -18174, 2532, 42234, 65160, 13734, -3851, 54096, 32369, -12215, -12272, -13140, -23356, -56734, -78805, -56565, 491, 30781, 17461, 33987, 57543, 54108, 43949, 8863, 22565, 40464, 6305, -29788, -15125, 36022, 61367, 69578, 30772, -10235, -41533, -33308, -7178, 458, 21392, 45337, 28677, 25551, 55491, 57199, -12902, -84819, -85206, -39321, -18084, 7401, 26801, -13458, -57009, -78116, -48183, -20960, -10746, -7682, 6207, 22015, 7247, 15425, 17582, 23273, -4212, 45219, 86772, -17359, -71908, -12799, -33496]
8823c3496P383M6618R491l2712j1678o062J6825n114k7811k675l9327R714K7607
8810d1237K4517l5578j0171J5009J1481R1671K7381o4602j4753J0976k8431k9072
8798d2809l0107J809K1607N1464M0251l4546k6141k8240k8049l411M2734O3022
8786B7584k8877K1165J6721j5622k5244O783j9966l6099Q9M7519k0559j0247Q700
8773b8053j9317J47J2483M178P4116M8373l154j1673n2232j1086P482J3072j5606
8760A8730Q370k3109q2670J2519N4272J8067j0694k198K9425Q976k7753m8120
8748d4185o244k86L5152M5951K8786L3118l9514k3069K5819L0256j8695J6275
8736H3364j4539k0384P669J0862n5255k9487j9741l7535K2474N885o439M2514
$$ y = [-33496, -26113, 20505, 29996, -2716, -14394, -20456, -3631, -8745, -36556, -39231, -78558, -68844, -41237, -16720, -52298, -62469, -47460, -35979, 55692, 83073, 18471, 3718, 14694, -13737, -42809, -72916, -71107, -49500, 1964, 42215, 7669, -18472, -46712, -74761, -78172, -35438, 27584, -1293, 19872, 36593, 20971, -4273, 2510, -17456, -53555, -53466, -5947, -26506, -36753, -28053, -47370, -47223, -34740, -30562, 43554, 91927, 88773, 77100, 24868, 13782, 21264, 34336, 18730, 27100, 3991, -78679, -66160, -11888, 6179, -4515, -6713, 22712, 31688, 3935, -44185, -50429, -50715, -15563, 30388, 59174, 92292, 52778, 29709, 55528, 85784, 67089, 83364, 68825, 48441, 56110, 66972, 11717, -17770, -37511, -75046, -52572, -46687, -53126, -10612]
8724a0612l216j8170K628M051K048j3729J9283J0939n7381n5552N6088K7300j3732
8711e0055J4088N4544k8228j5031m8325M4693Q8745K9830m956N73m2847R494l976
8698D8549n0078r419L3771J9321l7022M1231k2063m7617m6280P646J075L3646
8686b7240j2932m944L641J9289L7912M7932n020j6652j9774j1147j4064J6129
8674A3130o1380j0470L7137J6855L5878J1065k3223l2096j6645l18J2030K5682
8662G645M2743k3521k9852n0417o344k3829M4013P1787K9074L231j6975l9532
8650H023n589j4665j4598R170j1772q482J0465O874n761J7306M8424M2558J8032
8637I9985m4878o3183K3912J3471K5777J4199j2850k2020k3587L024J454j6456
$$ y = [-10612, -13828, -31998, -29370, -25319, -23271, -37000, -17717, -6778, -64159, -119711, -63623, -36323, -50055, -35967, 18577, -9651, -24682, -73007, -28314, 60431, 90261, 85305, 85878, 43031, 52525, 48549, -1529, -10948, 22823, 42144, 5122, 46353, 24290, -23327, -69607, -61961, -60886, -27240, -40172, -45116, -41475, -22186, 15726, 63658, 58638, 41986, 22212, 11065, -2999, 13130, -48250, -58720, -21583, -4728, 31150, 42215, 18992, -13104, -29749, -30067, -18037, 7645, 50388, 26867, -2985, -53402, -59746, -83575, -39562, 32225, 61299, 64530, 47555, 8023, 2434, -12231, -26829, -17659, -29431, -37913, -27448, -20574, -26335, -9029, 39395, 81953, 99985, 55107, -8076, 15836, 29307, 55084, 69283, 56433, 34413, 10826, 13850, 15304, -1152]
8625a152N604J5844l1566m1667K6579M197L4598J8223l6711J6972o246j3857L9378
8612C0196O666L431J3080k0812k6156m5853q068N3369O3959m789m1303O92L3936
8599E8348J1640K99l7097J5274k1648O4898M571m8016n826K3517k1670o3853m4195
8586f3758J0748K9579K859K227j9784P87K2830n131j3545l4987j7633L5221L6865
8573a3722j51J7208K9894j8852k6861N5422M9105m1789l5171m1825J34K2721J519
8560b368j4272N0290o525k5155Q743k8243l3366Q949k898M8797K75n6460o7205
8547a19438R169O5234K4889J8875M991L4015J6544m4103q2366q564M1229M1187
8535A662J6560N7037n6214q6060j0241L0524L7348R065n453o26K2828j9919k1121
$$ y = [-1152, 4452, 20296, -11270, -52937, -26358, -22161, 12437, 30660, -6051, 10921, 4675, -9182, 30196, 36862, 40293, 53373, 32561, 6405, -39448, -47516, 5853, 69812, 65023, 23720, 24412, 58348, 69988, 70287, 33190, 48464, 26816, 91714, 96285, 48269, 42443, 65960, 44290, -19563, -63758, -53010, -23431, -20572, -18345, -38129, -37342, -14512, -19643, -33188, -68175, -85808, -50587, -13722, -13873, 3335, 33229, 14377, -12484, 42938, 92043, 50254, 15083, -26742, -26608, -3887, -2368, -16640, 33650, 27125, 1970, 10713, -17530, -50896, -41947, -44845, 3952, 4227, -52233, -119438, -110269, -45035, -20146, -1271, 3720, 37735, 54279, 10176, -72190, -80754, -39525, 1662, 18222, 75259, 19045, -67015, -77256, -46732, -9384, -319, -5772, -6398, 16430, -3489, -24610]
8522b4610m242O5484J2691J7362N0009l3626l8044J086j3928q3936k6581J6586
8510f1749K4825N123k6968L0832O0628K5092l342j2910K485l7431k4793N0269
8498C2061j818J384j6853K8526m8383o8958k8245J1777L4031J1348j873Q945L5816
8485b242J1672O035l7835K3665N5807J9848j7055j0547Q091N1344n668o2617m3422
8472b924l157r331Q494m2546P655o58m022j1839q843J5968j6699P5720N7101J3409
8458G8328k4189q850m2552n542O100m490j0827j271K2989J463k0876k4525j7007
8445e1249j2454j2456J1358O1277L0340K5336l3785l5839m4721J080j8186k7427
8433a06726J43o358K0936n118K6654K3247P1778N470J3251K5880J655k9446l6973
$$ y = [-24610, -28852, 36632, 49323, 66685, 116694, 83068, 45024, 46110, 32182, -51754, -78335, -61749, -36924, -31801, -58769, -27937, 32691, 57783, 54441, 41531, 44016, 6585, -18208, 32061, 30243, 31627, 14774, 43300, -5083, -74041, -102286, -90509, -56478, -45130, -47003, -38058, -2242, 9430, 15465, -22370, 1295, 57102, 76950, 59895, 49348, 57439, 108783, 103115, 40498, -2924, -6081, -15412, -6918, -49464, -41809, -42467, -46489, -58328, -67171, -51203, -67902, 7818, 64919, 78328, 54139, 45289, 2737, -2805, 3295, -1195, -12022, -13293, 9696, 11159, -9717, -34242, -51249, -63703, -76159, -64801, -3524, 26816, 52152, 18367, -17472, -62193, -61113, -79299, -106726, -106583, -112941, -92005, -97123, -70469, -47222, 24556, 30026, 43277, 69157, 70812, 41366, 4393]
8420D393o113J2413J9677N394K9114j1477j0457j0744l6288J2193k8069M1856
8408B1892O2279n152k1698k8680k4833n0922k997L0038K9960k798m772l8709K1327
8395a5065l351L0397p643l9026J9003k3710l0081K1721l334J1235r862l6148k684
8382h8548K3592k2494L2527N2713L815m3632R692M1757k1468L954m750q95K6496
8369A2759N7800j267l0437j6681O2143k7470l8656k0871J7325K2939n911p2406
8357d0733k4864L0295K4874J9572J1935L9421j397l663l0937J6832k121m9419
8345a0205K7946J1235K2186R086m8038m2327l6771K4057M4634J8465m4949o1491
8333h6172l704L2005J4802J9313K9053q047O684j4390K0302l2370q964M1108j0752
$$ y = [4393, -1720, 10693, 30370, 35764, 64878, 53401, 42944, 32200, -4088, 8105, -19964, 21892, 84171, 79019, 57321, 28641, 3808, -47114, -50111, -20073, 9887, 7089, 2317, -36392, -15065, -18416, 11981, 4338, -34688, -15685, -39395, -69476, -47755, -51089, -39854, -49716, -85864, -88548, -64956, -87450, -54923, -2210, 1605, -42027, -32335, 9422, -12046, -8092, -12842, -13737, 12759, 70559, 69292, 38855, 22174, 84317, 56847, 18191, -2680, 14645, 37584, 31673, -40733, -65597, -35302, -10428, 9144, 21079, 60500, 59103, 55440, 24503, 41335, 39214, -10205, 17741, 28976, 51162, 60248, 12210, -30117, -66888, -42831, 1803, 20268, -24681, -86172, -89876, -57871, -43069, -23756, 5297, -2750, 3934, -10456, 9846, -22524, -31488, 9620, -1132]
8320a132k7098j3745k094l0795K4368P7576J8847k2230k3380j1531l0194J2380
8308b9028J0847O52o748O673R133r525j2188j9554k9940M8624M2304J4303N978
8295C1531l3032n4756J4657J0968K501L1408J396j6309k165k0371m7446M2381
8283c9237M3226j5903j0360j1781N497l2986j601K0886K7104k5102l4374J4234
8271f0397M5465J6362P028O566n583N1071k7484n0234q248L7501J8413J8088o176
8258D2372R629J395q845j9045j4220j5005n2174j838L2342k4600P199P644j5372
8245e0518K143N802L3830L1364j218k3357J8683J0600k6729J6196J5451L2938
8233F5185J7664q7841m1599O3586J1277p2850K0011K5906L0868k2936L2053M2318
$$ y = [-1132, -28230, -41975, -44069, -74864, -50496, 27080, 45927, 23697, 317, -11214, -41408, -29028, -18181, -17529, -24277, -17604, -8471, -17996, -30184, -49738, -79678, -31054, 11250, 25553, 31531, -1501, -56257, -41600, -30632, -28131, 3277, 4673, -11636, -13801, -34172, -81618, -39237, 3989, -11914, -22274, -34055, -28558, -61544, -63145, -42259, -15155, -40257, -74631, -60397, -14932, 1430, 8458, 15024, 9441, 60512, 33028, -17206, -25454, 12047, 30460, 48548, 42372, 52001, 53396, 44551, 25506, 11286, -3719, -55893, -57731, -25389, -49989, -42790, -35146, -50518, -48375, -42573, -8743, 22621, 21403, -1954, 16729, 27329, 600, 16796, 32247, 65185, 82849, -4992, -46591, 16995, 28272, -44578, -24567, 1339, 32207, 9271, 41324, 83642]
8221H3642m9298l7248J6708M16O970Q979J3759l6661K7114M7565m4758n3205k7081
8208d3098L161K782Q786J1360J6501l4212k2018l724N0607L699m6064N2541P372
8195G693j4642j5972J6903K5760K5479K057p338L97O502J2247K068k5775o1785
8182b6406r1537m359P0130L6835m4863J0825L8571R644k7821k695M328K0132L5887
8169B8671j0620K7095l2862j7528J5914J6146k3058L8413l4257L1147J0021j2386
8157C6696k5876p1775l6525K4577J15618L138l3864j9652o106Q106j3606l1255
8145e0524n895J029L2979J7847p416N1823j2120m2025O537O7021P79j2536O644
8132E4143R607L264n1667n1754j9625L8533L255k4602K8985J0926j9715M643j7556
$$ y = [83642, 34344, -2904, 13804, 14220, 21190, 30169, 43928, 7267, 34381, 81946, 37188, -16017, -43098, -39937, -37155, -28369, -17009, -508, -34720, -56738, -60462, -9855, -6156, -52220, 321, 7693, -6949, -22921, -6018, 19742, 45221, 47278, 39940, 40337, 46839, 59086, 61154, 35379, -26406, -117943, -122302, -52172, -15337, -60200, -49375, -10804, -1160, -28981, -31676, -27348, -7216, 28671, 18051, 45146, 12284, -5244, 10670, 26816, 3758, 42171, 7914, 39061, 49082, 36696, 10820, -60955, -97480, -72903, 42715, 45853, 11989, -7663, -13769, -5663, -19269, -50524, -56419, -55390, -22411, -4564, -11980, 39843, 27723, -14302, -7765, 59256, 60035, 47499, 54143, 63750, 67014, 15347, -36407, -56032, -17499, -14244, -38846, -9861, 1065, -18650, -14007, -31563]
8119c1563r357L0676j8126q8238J7412O0779J7003J9015K1712k9879K7387L4229
8107E1050r52n1290p902J3189N20n723M407L2138k5683K3179J4832m212j5106
8094B8447j1092j6129k076l0012J7518j5074L2286O2689Q795L234l9399m4510
8082e323j2240M6866L746k4984J0225j1603n4900P685j1725j8501l8207J8700
8070i0261N4692N3353K7983m3427p0003N375N1825K3471j5232n877r396j1975
8058b9472n858K5610k608L8124J2939r705k6774L4763j1708l3929Q411K0263m6009
8045b5953L0223J1753q126r300k0303K6966L4420J0721L825n0475p260J374j5930
8032a8065J2360L6062n4354l9443J5709K7862K4678R353j9465k1435J2640M4201
$$ y = [-31563, -40920, -10244, -28370, -116608, -99196, -38417, -21414, -2399, 19313, -10566, 16821, 51050, 50098, -1192, -9094, 4095, 4615, -1108, 3299, 35437, 9754, 32933, 47765, 43553, 28447, 17355, 1226, -850, -30862, -13344, -28418, 3868, 66557, 75352, 78586, 39187, -5323, -17563, 29303, 33049, 8065, 18290, 6687, -48213, -40528, -52253, -70754, -108961, -90261, -35569, 17784, 45767, 2340, -67663, -62288, -10463, 13008, -2224, -8101, -17497, -29472, -35330, -9720, -12328, 25796, 38735, 29030, 2256, 37019, 25311, -8618, -207, 20056, -25953, 4270, 16023, 7897, -1403, -21706, 5260, 39680, 50401, 54226, 3751, -3509, -2135, -18065, -5705, 30357, -23997, -63440, -47731, -19869, 4809, 14162, -5303, -26738, -14098, 30103]
8020C0103Q005l32l8165j0786L990K691N0636J8013k5696n4002K4732J9353k6129
8007B413j9683R785M723l4229j4485j3644J4944K4265K0246J0719j171l3850n3601
7994h3568K7976M6405M7724J2713J2864k5646k3624j3540m3993L5458L0644l7014
7982a3601q4407l9410K5098N4263P6412M2134k6163m092k3436L2444J2237r814
7970D1665k3336J1718j2087l4005o477r115J1581J0315p63L2405k49j2955m1949
7957c3252k1674q821K3679J9183k8971R057j0652k207K4619j4018k467P5785J9916
7944E0177k4276l4200Q325r243k2331l1481K6004K1648q42j5566J1295J6096O5061
7931F0667K5356l1532j5585l0915j8781P928K1545o305o760K4517L3906j2764
$$ y = [30103, 38108, 37776, -389, -11175, -7185, -4494, 46142, 64155, 38459, -15543, 9189, 28542, 2413, -17270, -7485, -2762, -36991, -51476, -65120, -50176, -25911, -5665, 5054, 3883, -29967, -83568, -55592, -9187, 38537, 51250, 64114, 38468, 14844, 1304, -42689, -7231, 23413, -13601, -98008, -137418, -112320, -58057, 18355, 60489, 34326, 30234, 6798, 39242, 51479, 41665, 18329, 30047, 17960, -16045, -22522, -31637, -20056, -9741, -10504, 21901, 21652, 8697, -33252, -54926, -63747, -40068, -20885, -49856, -40799, -51451, -53658, -29039, -43057, -45524, 30261, 50177, 25901, -8299, 26, -9217, -31548, -63029, -37025, -15377, -16219, -31785, -20490, -4394, 60667, 86023, 54491, 38906, 7991, -10790, -2862, 18683, 12378, 5618, 30135, 64041, 51277]
7919E1277J831k4787j6464j8555J0531n806J4410O933k0055J7893L108m0476L0358
7906A0198N6081M0523p094l9234m6124m2401J2393M3606M466n478K6460L2298
7894H5694k8332L182l9457k4963J3518P76R345k3591m5032M0761J8748n7901j2006
7881e9258M4348L48l1347l3570m0457q817J0725k251J838K0075L2755K7864M6850
7868I103k8180j3645n947K8475M5660L7838K9175l303n3085j1153J5410l8965
7856A1383l8315j0660q149K3239k833O259k724r731L3068k8368P644R08K6029
7843G750k432J1487J9468m2209n2397j7392j497P546R921P5680k4658j7320K9256
7830C203o3594N742K1981k5793O6429J7865m7502L771m834K9461Q681j7538Q48
$$ y = [51277, 53108, 28321, 11857, -6698, 3833, -1973, 12437, 19370, -685, 17208, 20316, -20160, 10198, 66279, 106802, 99708, 60474, 14350, -28051, -15658, 27948, 32414, 26936, 53396, 85694, 57362, 60544, 21087, -3876, 9642, 10418, 19763, -3828, -48860, -8099, 10649, -47252, -59258, -14910, -14562, -45909, -79479, -119936, -128753, -118028, -120279, -118441, -98366, -65611, -37747, 9103, -19077, -32722, -38669, -10194, 35466, 73304, 102479, 99176, 46091, 34938, 50348, 11383, -26932, -37592, -45741, -22502, -25335, -19076, -21800, -31531, 1537, -26831, -19187, -18279, 7750, 5318, 16805, 36273, -5936, -58333, -75725, -77222, -69676, -59755, 15925, -8733, -26053, 3203, -60391, -54649, -32668, -58461, 7968, 25833, -21669, -17898, -22732, 6729, 15410, -2128, -1280]
7817a280J8954q495o1504l0137J1694L6301O1799L1745J0052k0965r374J3698
7805E2488L1269j3887k0063O543n2440q0820L6495N5222p531k1082j7282K8612
7793b476N882Q867P540j9759k9521L0600N3716L3913k3821n4811J5153R446Q292
7780D3021K682p209J5219l5587J849J1045J1014p166m2187j0721K5813K9966l677
7767C4062L442k0129j8753k982m0056j205j9164N7641J1758J1502o839n159n944
7754a826j8943K8801l2094K3866P6368l6933O889L6845J9857l2152n0718k6391
7742f431m8961k3623P2765m752j6273K409M5380O323J9387m9239k3770K0900K6726
7729B0841k1851j7985j5908K828k3363M5363O0809Q13o020l7472k2421l9794o557
$$ y = [-1280, 17674, 9179, -52325, -82462, -70768, -34467, 27332, 59077, 69129, 48164, 38790, 52488, 83757, 69870, 49807, 56350, 3910, -76910, -40415, 14807, 7276, -13806, -31088, -2476, 3406, 12273, 19813, 54, -29467, 1133, 54849, 88762, 64941, 10130, 25283, 34729, 43021, 45703, 38494, 53713, 18126, 19975, 31020, 42034, 34868, -7319, -18040, 7773, 37739, 34062, 37504, 17375, -1378, -4360, -44416, -45621, -64785, -7144, 4614, 16116, 9277, 4118, -1826, -20769, 8032, -24062, -196, 76172, 39239, 46128, 82973, 102830, 70678, 19960, -6431, -55392, -79015, -6250, -11002, -27275, -24866, 20514, 26837, 46224, -3015, -26785, -5885, 20841, -1010, -18995, -34903, -32075, -55438, -10075, 50734, 51547, 45527, 8055, -14366, -54160, -60717]
7716f0717J8773m560M8510q018K8790r31L2600m312k5109R449K650j2799R562
7703C3888P008m8178k9645k61m359p9961o629O5772N7408J4132M488Q603J6871
7690C9137K553k7613m4365k4933l3055O6647R8399P290p157J8921M0202K6831
7678A62857o1225j01028n2218M0839P0322J9179l9966m5519j6804Q3588J7978
7667G8003j1093m5468p6608j8793P763J015N2784K429j7652j5337K3459M0229
7655B0731N1019l565o5872l8587j6133j0424o078n625L9397L542l187K6201J6494
7642G913k5433Q926m488j5111O492Q409k6771J7599R879n1096j3510O0231k9130
7629d6090N7556K6320n569k7590L3161M4840k2684l6694l4445n0023J0683K0803
$$ y = [-60717, -41944, -46504, 2006, -6012, 22778, 21847, 54447, 50135, 25026, 34475, 37125, 24326, 33888, 40896, -7282, -36927, -37188, -41547, -121508, -128137, -62365, -4957, 9175, 13663, 22266, 39137, 41690, 14077, -30288, -55221, -88276, -21629, 76770, 84060, 76903, 95824, 136026, 162857, 101632, 604, -51614, -10775, 59547, 78726, 38760, -6759, -23563, 60025, 78003, 66910, 21442, -55166, -73959, -66196, -65181, -12397, -9968, -27620, -42957, -19498, 20731, 71750, 68185, 2313, -36274, -52407, -62831, -68909, -74534, -35137, -31595, -34782, -8581, 7913, -17520, -8594, -13082, -28193, -21701, -13292, -40063, -22464, -12585, -63681, -77191, -16960, -46090, 11466, 37786, 32217, 4627, 37788, 82628, 59944, 23250, -11195, -61218, -50535, -29732]
7617b9732K684J3897P2k858j599K7736l2085M403J1953k6288K242M1527J3690
7604B5642j0122L6578j0892r160J1580J7281l6999m0874L258l663k481J5060L0632
7591B5840K371r506K1412Q147n1687l1157j0632j5349L9767K5415l3579K6585
7579b373L01l377n291j9644J1106J4424M2273k3476l6837J3510K2029l196l4420
7566b4971K7490r878m3212P834q506K4030M3278J6680j3020n2457o139l3681J8236
7553e4316J076L252J7399j1494L1170L795L212J57L7090O7909j0288l3051j6416
7540C9495k3650J267j6875K0612j0155L2645K0941O337k3521n0842j7138N1520
7528C0636n771n5342R083M0596J2823J0085O6938K9558n4630m4482q375Q28l8149
$$ y = [-29732, -27048, -13151, -13079, -15937, -17536, 10200, -21885, -17482, -5529, -31817, -29575, 11952, 25642, 15520, 52098, 41206, 32046, 43626, 60907, 23908, -16966, -13708, -17371, -19852, -4792, 25840, 28211, 18705, 40117, 48264, -3423, -34580, -45212, -60561, -20794, 4621, -28958, -2373, -2072, -5449, -10740, -30384, -19278, -4854, 37419, 13943, -22894, -9384, 12645, 9449, -24971, 2519, -7359, -50571, -42737, -51243, -27213, 16065, 32745, 19725, -32732, -38871, -72552, -54316, -53240, -49988, -32589, -44083, -12913, -9118, -5906, -5749, 31341, 99250, 88962, 55911, 39495, 15845, 17112, 237, 20849, 10694, 43339, 64280, 70617, 47096, -3746, -20884, 30636, 24865, -30477, -21394, 19202, 32025, 42110, 109048, 138606, 83976, 39494, 31119, 31947, -6202]
7515f202K2799r387l9244j3473j4707M9663K3649K2142O90j2266j7598j1828j1080
7502a6842J1475N101j0925n1352m7118j898L5026M222o390k2537K8070J5969o874
7489f4073m190O9761l5455l9586O689m033K325N5364K0656k6800k0277R031K9335
7476a253r260m0855l8442j6699O3920O2940K0713L2800L74K7123m2540m4230k8127
7463a3536l3577K7596R313k9167j8776O5394O4833m7983n5321j8644k3210L0167
7451d2911L2467K7345q04j9000l4106n6995K5221L6200R696K569j1923n5279j0623
7438i8143K2730L6160N232O358K1925m767K0082q051M3959m6149n4278K2677Q643
7425b3622M5591N07o6183k6857M1504L1037J4764j9336n129k2531k1412L8224
$$ y = [-6202, 16597, 7210, -32034, -45507, -60214, -10551, 13098, 35240, 35930, 23664, 6066, -5762, -16842, -5367, -266, -11191, -62543, -109661, -111559, -76533, -72311, -78701, -101238, -73168, -57199, -64073, -68263, 1498, -33957, -73543, -66854, -70887, -68562, -13198, 7458, -19342, -39619, -30588, -1253, -10513, -51368, -89810, -106509, -42589, 20351, 41064, 73864, 74238, 101361, 58821, 14591, -13536, -47113, -19517, -10204, -39371, -58147, 7247, 72080, 24097, -31224, -49868, -73078, -42911, -10444, 16901, 16097, -2903, -37009, -94004, -68783, -32583, -22887, -20318, -32241, -87520, -98143, -75413, -39253, -34021, -27663, -5738, -10505, 9577, 1526, 45485, -664, -54942, -32265, -23622, 21969, 22476, -43707, -70564, -29060, 1977, 16741, -2595, -7724, -30255, -51667, -13443]
7413a3443L0255k1738L7692K1040K5163o521j02718l0598k1008l316M0451k9622
7401g4363k8661p535J2834M0859N01j7287L0340M925m264j7875J4943o760Q716
7388d3627O496J7032J2392j6909q693L0874L5950J9714k2399l6355m7509M1152
7376a1882j048n5942O964P942K0235J9150Q170k063J956J4400J5674Q559j4315
7363A7800n0036J8390L0386k6804l4689L9542k2167q0781o5603n055N6067L4247
7351h8703K3554K3654K8238L5057r393l0405J8386j2842j8411J3163k4270k1676
7339f3648K0792J8612K9013P1913J6785n7754m0016R359J8133J4026J0031k840
7327D4406P67L2591l2534m5550r469j1686L5182o762n4078l1144n106N4345N2552
$$ y = [-13443, 16812, -4926, 32766, 53806, 78969, 72448, -30270, -60868, -81876, -85192, -44741, -74363, -103024, -110559, -97725, -56866, -56365, -73652, -43312, -38387, -42651, -60526, -45583, -52343, -43627, -37131, -20099, -7707, -24616, -33309, -2435, 33515, 53229, 30830, -5525, -53034, -11882, -12930, -68872, -61908, -53966, -33731, -14581, -6411, -8474, -6518, 7882, 23556, 32115, 17800, -32236, -13846, 16540, -10264, -44953, -5411, -27578, -108359, -173962, -179017, -122950, -88703, -65149, -41495, -13257, 21800, 12407, -17998, 388, -12454, -30865, -17702, -41972, -63648, -42856, -24244, 4769, 76682, 93467, 35713, -4303, 5056, 23189, 37215, 47246, 44406, 45173, 77764, 45230, -320, -9789, -21475, 13707, 6945, -47133, -78277, -83383, -29038, 23514]
7314B3514O71n969o207l4525J9105K4942M3114n6424l1302M1836j8969l1413q782
7301d0409K119K1560j9172k3242M0519L083p4401j3439L1660K7414l80L6610L0342
7288B2264k6068l1843k2496k2182l4348k102Q8965K7868M2614K7714m8844l9860
7276a8318j9124l0755m3667m592n593O8279K9296j5509J4118J5396L7886k9899
7264b482k1060J714r194j9377J7705M267L7874p969j4011Q999J5527o926Q866
7251A3933n693m730j161l1145J614N043m082j2513j4299q020K3948J1759j1426
7238c6772J1310j6584K0443R042m253k7760R104K4663J2920J6385P583k8958j3881
7225a6758L4059l7167k1684L8866N0127Q517k0485O973K647K258P438l0304j4193
$$ y = [23514, 24185, 18216, 12009, -22516, -3411, 21531, 64645, 8221, -23081, 18755, -214, -31627, -40409, -38290, -16730, -35902, -59144, -18625, -15542, -89943, -103382, -71722, -44308, -44688, -8078, 22264, -3804, -35647, -58143, -80325, -114673, -116775, -27810, 58, 42672, 70386, 21542, -18318, -37442, -68197, -111864, -116456, -122049, -53770, -24474, -39983, -25865, -10469, 27417, -2482, -23542, -21828, -31022, -50399, -32694, -28427, 9447, 1478, -12533, -3534, 11993, 5067, 13933, 8240, 3510, 2349, -28796, -27182, -22139, -26221, -38734, -53033, -61053, -37105, -25346, -36772, -25462, -42046, -21603, -12561, -16814, -44574, -35470, -10807, 2113, 18498, 26081, -2877, -16758, 17301, -19866, -41550, -2684, 47443, 55960, 35475, 42448, 45095, 47353, 54791, 24487, 10294]
7212A0294m560l1092l0121m2760K4862L3517L3375q397Q025J2728k296J8706j2581
7199I700l7350K9798L4695L8353k2759l5546j5249m6478K8948J7410j015K5229
7187B5736N290m8993o3144o2033N1881J09287J5563l9341l2876L1151M3095k1080
7175A4536J47m367R92r206L6256l0069j3842J4210J299L0328j6297J9157L789
7162D6933l9134j7537J1183P283o371j7774l22j3874q286N090N205J565j853j0954
7148c8846L587K195O262l0984l8779j4985N8922Q3208j4164m0448j9532K6077
7136a7487L894l3800j2869O6683L8664m4098j2967q133n2723J7414O7071P310
7124A8959l4153j5339K597K1753j9170j2771J637P4524J0481n7736J2208N63n5227
$$ y = [10294, 5734, -25358, -55479, -98239, -73377, -39860, -6485, -14882, -6857, 5871, 3575, 22281, 9700, -27650, 2148, 36843, 75196, 52437, 16891, 1642, -44836, -15888, 1522, 507, 25736, 31026, -17967, -81111, -143144, -91263, 18024, 33587, -5754, -38630, -7479, 35616, 14536, 14683, 10316, 11308, 2102, 38358, 8289, -5553, 8657, 9956, 40284, 23987, 43144, 46933, 7799, -9738, 1445, 8728, 2357, -15417, -15739, -29613, -37899, -32809, -27604, -26039, -27892, -38846, -35259, -33064, -26802, -57786, -96565, -111550, -52628, 30580, 16416, -24032, -43564, -17487, -13593, -47393, -60262, 6421, 45085, 987, -11980, -20113, -72836, -55422, 11649, 18959, -15194, -30533, -27936, -6183, -25353, -38124, -36487, 38037, 48518, -9218, 2990, 3553, -51674]
7111e1674R400k586J5822L5491p8104l5779P4857K0981J3843J9917J5908j4120
7099B3956k9703J5707J0140J4524L7170j4123m5688j9524O736j7218L5636P260
7087B4873J993k3507o852j5349k8240K8725L1017R443o16K5391q605m7364k0769
7074b9860L0379K4834m030r0885l2855K7133K3826J8372P867K5985j1350k7335
7062c7919j0715P568j233R222J5342J9134K7712J3871J8480l1503q7417o1597
7050a19055N1654J5898J3916K9246M2495j25o392M747J2827R161q31j5735l1633
7037F173k309k0005k0115O060L6710N375j3095r383l6448m5969J2958m846j530
7024h6424K3255L0060O5174K0237l2193k5983m052j9223K6824L3745k077M3592
$$ y = [-51674, -42274, -44860, -29038, 6453, -71651, -107430, -32573, -11592, 2251, 22168, 38076, 23956, -5747, 9960, 20100, 34624, 71794, 57671, 11983, -7541, -805, -18023, 17613, 24873, 26866, 3359, -3493, -18842, -47082, -18357, 12660, 22103, 21487, 46878, 38273, -9091, -29860, 519, 25353, 21323, -69562, -102417, -75284, -51458, -33086, -25219, 766, -10584, -37919, -48634, -41066, -42299, -33077, -17735, 1399, 29111, 42982, 61462, 29959, -57458, -119055, -67401, -51503, -37587, -8341, 34154, 34029, 27637, 32384, 45211, 54372, 53541, 37806, 6173, 3864, -16141, -36256, -30196, 6514, 11889, -1206, -10589, -47037, -93006, -80048, -84894, -86424, -63169, -33109, 32065, 52302, 20109, -5874, -9926, -29149, -2325, 31420, 29343, 72935]
7012G2935k0226k6319J4030k3026k9815Q14j5699m8834k0064L7985O5743J4202
7000B1726k7949k6846K2550K5468k4782l3107r742L4199L2723J9350J7585k0004
6988C1171j6066k4357K4897M16j3891m1514P13N3K0683r501m861M7088N9537j0402
6974F3966J962l8817k0386j9366p7579o7K1294K026K1699L3081J8032J3986k2567
6961b736L4665l9261k6321k5545J0910K3749m8451k3909L5296L989K5300M4096
6949A1782M6295j0243k8827n486l6879k4019M739M0414J4922j5398m630o1985
6937f9315K0514J5048j8384K5484p079P906K7540J8310K9577L7284l0056l5904
6925B0925J0084K277k0680Q354n698l6059l5999k7143K623P1838L3774n0900k0805
$$ y = [72935, 52709, 26390, 40420, 17394, -12421, -11607, -27306, -76140, -96204, -58219, 7524, 21726, -6223, -33069, -10519, 14949, -9833, -42940, -52682, -18483, 14240, 33590, 51175, 31171, 15105, -9252, 15645, 16061, 2170, -39344, -38631, -38578, -17895, -27396, -32257, 14831, 74368, 63966, 65928, 27111, 6725, -12641, -90220, -90287, -68993, -66967, -45268, -12187, 5845, 19831, -2736, 31929, -7332, -33653, -59198, -48288, -24539, -72990, -96899, -61603, -57614, -32314, 11782, 58077, 47834, 19007, 13521, -23358, -47377, -42638, -2224, 12698, -2700, -7330, -69315, -48801, -33753, -52137, -26653, -33732, -25826, 1714, 20024, 49601, 86885, 56829, 20925, 31009, 33286, 12606, 20960, 15262, -20797, -56796, -83939, -81316, -9478, 24296, -26604, -47409]
6912d7409j375j5507k531J5214K0825N0844N7621j6080o8640l6787K9106k0926
6900c5645M524P766K931J7037l8543L320k1230k5176N1140O6211l362Q506j1211
6887B6268n7088k557L8359L3522O1326k3154n6073n4449k3361M7691l358k9361
6875d2235J5001M2157L042K6264L6683N690j3867k2552n556q157k8117j6548k8936
6862c7131p577J4575N3230K9909l7340j1610K1664m2359J1821M6465L5615K363
6850G9625o0655k9508K5756n136J1018k1502J6812Q190k5138m7906l9825K8045
6838f0224N3888k7746k0907O539m324J7303J6506M2175K4217q591m875k3165Q136
6825A8932r56q197L3797M9053Q418L2698k9617p776l2026q0029K426J0470k10
$$ y = [-47409, -48784, -64291, -66822, -51608, -30783, 20061, 77682, 61602, -7038, -43825, -14719, -35645, -31121, -23355, -20424, -3387, -41930, -38610, -59840, -85016, -33876, 32335, 28973, 37479, 26268, -30820, -33377, 4982, 38504, 99830, 76676, 20603, -33846, -57207, -9516, -12874, -42235, -27234, 14923, 17965, 44229, 80912, 86602, 72735, 50183, 44627, 36470, 8353, -8195, -37131, -44708, -30133, 23097, 53006, 15666, 4056, 25720, -16639, -4818, 41647, 77262, 79625, 18970, -10538, 15218, 10082, 21100, -402, 16410, 24600, -538, -48444, -88269, -60224, -6336, -34082, -54989, -48450, -52774, -35471, -18965, 23210, 47427, 38836, 33961, 10796, 18932, 17976, 9779, 43576, 92629, 101047, 133745, 104128, 96352, 64326, -15703, -13277, -2807, -3017]
6812c017M4743J4706l5367k0168K8344L983k1993K5897o1020m9497J8693O211
6800d8485L306J3020l093L0950K641Q786j468r449R4498L3229k4105m8900l5453
6787A5477J6781L7568J0410n9541l9636k5005k5932J4805L2609l859K0966j8726
6775b4083k2363N1779K8351j919l4692j6827m409k4398J1812O1269M2375R65j9825
6762D8035m384J9560l3318n921q321j5497M0405J8735M819o094m0872o018J4396
6749B5525j8894R404l1116r23J6277J9016l1991J6609K0819j251m5359j9416j9644
6736f0944K9764M3483L449J4272p479m5436L833Q823J4655N4929L8620l7349N454
6723F6074K6850l7432n5232l5622k0347M2033L8434N205l8320j544j8312n3453
$$ y = [-3017, 41726, 56432, 21065, 897, 29241, 33224, 11231, 37128, -23892, -73389, -54696, -48485, -45179, -32159, -35252, -4302, -1661, 7125, 5657, -3792, 90706, 123935, 99830, 50930, 15477, 32258, 69826, 80236, 20695, -18941, -43946, -69878, -55073, -22464, -26323, -5357, -24083, -46446, 5333, 33684, 31765, -2927, -19754, -24163, -48561, -36749, 24520, 66895, 67860, 48035, 43651, 63211, 29893, 23972, 15651, 154, 40559, 59294, 64113, 58019, 17147, 11129, 25525, 6631, 16035, -15081, -16004, 273, 19289, -12702, 3907, 24726, 23475, -21884, -41300, -60944, -31180, 12303, 15752, 30024, 22545, -22891, -19058, -10235, 4420, 59349, 97969, 60620, 66074, 92924, 55492, 260, -35362, -55709, -13676, 24758, 29963, -8357, -9901, -28213, -81666]
6711h1666N096L7478N6261N709j5012l1377j1536J1052o6208k4990N2711O7289
6699D807J3833j8368n439q962n050k643l6467j6970N8632L8698r038k1423j58
6686h548k2656K7342K5601q167O1208o052j9959l975k2759o0110m0595J5813N3820
6673i037Q8696j2453K50l386l8880L0381k2329m5472j6728j9951L1957K9587L64
6660A2999k0106J3351p383m7335m3995j2856M4992M7829p60K5212n351J1977j7210
6647A364R332k387L1444l7749l7961j7905M0313K0140L2136N615N071n5836k5503
6634c1926K9584L0116j8354m2436L5275K1077N7012J9271l6978k634k1356r971
6622B8680J361j9110J7789P156k753j6751k4064j8889L9632O600j1460j1161N53
$$ y = [-81666, -76570, -39092, 17169, 22878, 7866, -23511, -35047, -23995, -90203, -115193, -62482, 4807, 18640, 272, -5167, -14129, -19179, -21822, -58289, -75259, -16627, 22071, 13033, -8390, -8548, -31204, -3862, 21739, 13572, 74780, 68728, 48769, 44794, 22035, -38075, -78670, -62857, -9037, 79659, 67206, 67456, 64070, 25190, 55571, 33242, -12230, -28958, -48909, -16952, 12635, 12999, -7107, 6244, -1139, -48474, -92469, -105325, -60333, -12504, -13264, 11948, 6597, 18574, 1364, 10696, 8309, 39753, 2004, -35957, -53862, -13549, 6591, 38727, 44342, 49413, -6423, -31926, -2342, 27774, 9420, -33016, 2259, 23336, 80348, 99619, 62641, 60007, 38651, 28680, 30041, 10931, 28720, 35876, 33123, 16372, -7692, -26581, 13051, 19651, 8191, -2970, -2417]
6609b417l606K4830L9197m5155m5476K2108K568k8967J6048J3858K72L9648M633
6596C7541R958K887q356j4575R17k0821J836K8254M2818M1165R138n7649n7789
6583A5324j6704j5600J8122M9641M278J9090P101L1121m0465j6057k3150l2883
6571a82j0225k3546l2977l0776J0804L2017P8989K7868j7837k4050L4694K8046
6559G2825N180k7343n654K575m4824j5747r391L4150j1134j7373M443l4942J4811
6546c2424q342k8817l9551J2640L5859K5135j4527j9529K1889K9993J5384k4755
6534b7045o5788N263j1251k591L9713k000j692L44J0281L5438J0198J2175j2705
6521i660j2779p548n266p176l7063J5179J5516O879j0884M7419J5067k6825l182
$$ y = [-2417, -6023, 18807, 58004, 12849, -32627, -10519, -7951, -36918, -20870, -7012, -6740, 32908, 37541, 47499, 50386, 42030, 27455, 28372, 7551, 9387, 37641, 80459, 121624, 130762, 73113, 15324, -1380, -16980, 1142, 50783, 55061, 74151, 81252, 112373, 71908, 55851, 32701, -182, -10407, -33953, -66930, -97706, -86902, -54885, 24104, 51972, 34135, 10085, 44779, 72825, 78005, 50662, 45008, 47583, 2759, -12988, -22379, 11771, 637, -16736, -12293, -47235, -32424, -40766, -69583, -109134, -96494, -60635, -35500, -50027, -69556, -47667, -17674, -2290, -27045, -92833, -87570, -98821, -101412, -61699, -63699, -65391, -65047, -54766, -19328, -9130, 3045, -9660, -22439, -29987, -35253, -42429, -79492, -64313, -48797, -41918, -52802, -5383, 9684, -17141, -20323]
6508b0323k4623M2273J1617j0045J0528L6053Q031m3763n1332K4864r753K3178
6496c295O2398J5190J7895k9623q7173k7704L9245k7402q270k67M245K0602K11
6483b3948J9147M4664L0069j3347m3835L7978J8300k1131m6596k1185J1973M96
6471g415k6293O5984n65N27l6424j8224j5758L1344l511k5510L6166l5206l613
6458c8498K2919l7077o012O304M756N743l632K0164l6229K8034K2350p710L7158
6445A8270L1288l7238o735J268o2142o0988O0147Q5827j2429l4058o1638l8924
6433a17352L1412j5282L1719P5714l6438k7429O863L4526K4783k0238K3424q427
6421C275J1686J3485k3204k3494l9875J3109K0938K0925J8132J2652L8583L653
$$ y = [-20323, -44946, -2673, 8944, -1101, 9427, 45480, 53511, 9748, -41584, -16720, -26473, -3295, 59103, 74293, 92188, 62565, -24608, -52312, -13067, -40469, -48739, -49006, -44761, -24159, -23948, -4801, 39863, 69932, 56585, 12750, 50728, 69028, 47897, 1301, -19884, -7911, -7415, -33708, 32276, 31711, 32238, -4186, -22410, -38168, -6824, -10335, -35845, 321, -34885, -38498, -15579, -52656, -58668, -52364, -47608, -41865, -45497, -25333, -61562, -33528, -11178, -18888, 18270, 49558, 12320, 5585, 6853, -55289, -116277, -56130, 29697, 17268, -16790, -78428, -117352, -85940, -101222, -69503, 6211, -30227, -57656, -50793, -16267, 8516, -11722, 11702, 3275, 14961, 28446, 5242, -18252, -58127, -45018, -24080, -3155, 14977, 27629, 66212, 69865]
6409F9865m3718k1348j9727J4990N2380m2k050m491p689m586J3344o372L92k6249
6395A4699j8266j9908n226L1246K1232j9237k041J5975o97j6427l7833N471M4004
6382A2992k9997k8255j0357J430L4719j2651K8160K4719j8677j170O2440l4721
6370B8632l1508j7664k8137j1571J8636L9468j3254K0440k5229m8549m4929O5163
6358d8502L0631m5564q642K5159j3899K2192K0536J1038l75K1233J2909m281l1339
6345h904l994j6817j2451k8272K2573L4394O2235j0692l7011k1068j2835J9450
6333a3392L714K4537K4897j6151j8236l9552k3807l950J3078O4167j0269k738
6321B298m925m407l9409l6434J2192O3341R369j6560M5406m736J6061L82r116
$$ y = [69865, 26147, 4799, -14928, 62, 52442, 52400, 50350, 45859, 38170, 33584, 46928, 40556, 40948, 14699, -3567, -23475, -28701, 2545, 23777, 4540, 2499, 18474, 17777, 1350, -36483, -31012, 12992, -17005, -45260, -55617, -54187, -19468, -32119, -3959, 20760, 2083, 913, 63353, 28632, -2876, -20540, -48677, -60248, -41612, -2144, -15398, 5042, -20187, -68736, -113665, -48502, -17871, -63435, -72077, -46918, -60817, -38625, -18089, -7051, -7426, 13807, 26716, 22435, -8904, -12898, -29715, -42166, -70438, -47865, -13471, 48764, 38072, 1061, -20007, -32842, -13392, -9678, 14859, 39756, 23605, 5369, -34183, -57990, -61940, -48862, 15305, 5036, 2298, -2627, -7034, -46443, -82877, -70685, -7344, 2025, -14535, 30871, 26135, 42196, 42578, 33462]
6308C3462J7492k9954k8443K0396N279m9532m3004J0084J6065J4848J4776P469
6296a1062J0778l7704k2969P9592K3472K3420J4796l4253k3934j4860n4576l7599
6284h4899r674o032O6184N7981J5698j4520r856j8276o2848N004L0684j1674k5085
6271f7313k1240j1616j1280L1213L1527J2605j3092J0573j0084j6594L8932L8865
6259A2496N32m9184j8654J6946L1675J7368j712j0324m9678K9286K3274j2305
6247a0280j8683L2555K2979k9276K8285Q916j0191p590p819k5011M2033l662j8230
6234D026p808l0228k391J104J7139l7035j5238L2170J30m8731L2362M3782R323
6221a395L486Q1611K7986p2546m3171m5941P933O779Q774J7085p532k6904J9051
$$ y = [33462, 50954, 21000, -7443, 12953, 18232, -31300, -74304, -64220, -48155, -33307, -18531, -11062, -284, -37988, -60957, 18635, 42107, 65527, 80323, 46070, 22136, 7276, -47300, -84899, -94573, -100605, -34421, 23560, 39258, 24738, 14882, -3394, -66242, -61238, -30554, -42228, -67313, -88553, -100169, -111449, -80236, -48709, -36104, -49196, -38623, -48707, -65301, -26369, 12496, 13028, -36156, -54810, -37864, -6189, 11179, 9467, -857, -50535, -21249, 2025, -10280, -28963, 3592, 26571, -2705, 25580, 34496, 24305, 16715, 8896, -16115, 25918, 22256, 4026, -3782, -34010, -36401, -35297, -18158, -55193, -70431, -38261, -38131, -86862, -54500, -10718, -1395, 2091, 83702, 111688, 39142, -4029, -49970, -42037, -35258, -26484, -9399, -16931, -43835, -24784]
6208b4784j1759K9629j6713m487j1300J4572O3288J9571r821j4763o75J3668M294
6195E0720k3247J8500j5183o995q13m6220k7480n86N027j4074r527j7895N1631
6182c6142O5407l6667o474j2808P228k4424k149m0305J2629K4757k3956q8P5919
6169B927K2062l7688n6482M0365L6998N833l0092L810m5893n951L6743N2156K0829
6156D5617n9691q9371j8338L6183K9474M2955P878l221K2594L203k6258J6398
6144G423J3318O394k3271J934J0698n5460J8926K8210r756m6264j8673o320K8191
6131d4650M4640K6543l5601k1232L4742M694o3329n402k3140j6492K0737N1862
6119b6628K2766J6459N643P032M5897m6213n9324J542M6309K0570k673l3831o3858
$$ y = [-24784, -36543, -6914, -23627, -28114, -39414, -24842, 38446, 58017, 48196, 33433, 32758, 46426, 50720, 27473, 45973, 30790, 23795, 22982, -23238, -50718, -51304, -46277, -60351, -69878, -87773, -36142, 29265, -7402, -13876, -26684, -19456, -43880, -46029, -86334, -73705, -48948, -72904, -72992, 2927, 24989, -12699, -69181, -28816, 8182, 14015, -16077, -12267, -58160, -64111, -27368, 24788, 45617, -14074, -103445, -121783, -85600, -56126, -13171, -5293, -8514, 14080, 17283, -8975, 7423, 20741, 27135, 3864, 5798, 16496, -38964, -20038, 8172, -1584, -47848, -66521, -72841, -44650, -10, 26533, -9068, -30300, 4442, 9136, -54193, -59595, -82735, -99227, -78490, -26628, -3862, 12597, 18240, 25272, 71169, 24956, -34368, -32826, 13483, 34053, 31380, -2451, -66309]
6106f6309P933K9621J9491R503j7445K6281r177m5699N681M2154j0378j8165m47
6093b6956R287J6230N3717m9470j0319K6887j4069k1093k2536Q614j6532K9557
6081a6683o734r141O871J3976L3762J1647l0483l5193j3357k7863L2952J4276
6069b5970l5556M137K9389N34M4025N2572k8900l3417k0063k7721J4696Q864j1067
6056b8477J5441K4737n2035n2003l124L1248o903k6258l9151L5129K9831N6257
6044a5308j3834l878K2737q158m9048k5538P030L7804J5712J0381j6428l6019
6032g4547p057J1187R595R505O5913m28l8439J1524K4958n3736K2590O8521j0403
6019C9183l9432p173j0791M0821m785p521L0152k922R641n4573k9643n121l1080
$$ y = [-66309, -58376, -28755, -9264, 239, -17206, 9075, -102, -45801, -40120, 2034, -8344, -26509, -26956, -17669, -1439, 52278, 2808, -7511, 19376, 5307, -15786, -38322, -29708, -46240, -16683, -23417, -32558, -25687, -11711, 22051, 33698, 3215, -31978, -45335, -73198, -40246, -25970, -61526, -57389, -28000, -27466, 16559, 69131, 40231, 6814, -13249, -40970, -26274, -17410, -28477, -13036, 11701, -40334, -92337, -95461, -64213, -71116, -97374, -136525, -101396, -71565, -15308, -29142, -33020, -10283, -18441, -67489, -93027, -85997, -48193, -32481, -22100, -38528, -74547, -81604, -70417, -60822, -51317, 14596, 14168, -24271, -12747, 12211, -41525, -18935, 49586, 39183, -249, -7422, -18213, 22608, 17823, 10302, 40454, 37532, 47173, -7400, -37043, -42164, -73244]
6006g3244j627K714J2941R233J5484L370j1191q50l821K887M7737p278j4849J11181
5992I2687j9866p0569m579J8015k1566j5189j6848L4681L0673m160m4661M910
5980a6472j5637n4023m4045j5288L6324O8459M8577q601o56o2455j6472L0929
5968d9360L0656L4797l8385l5250j5158M4909j6095m2875J7164L8833L3847M124
5956G207n4k0289n6355K7124P923k4578m459J338K1787J2729n885L093K9808l410
5942d021j4462j2463N008L1677k5000l3545K4395M0489L4629j5770m1091L1889
5930B1735P578k2673J50J6454j6963l9205M4516J4499k1785j7063k1071n250K8494
5917a0584n529p35j499l6243j8673K2687N7802N3443M404m3158k7461k162j9395
$$ y = [-73244, -74871, -72157, -59216, -49983, -34499, -31129, -42320, -43170, -46991, -44104, 3633, -3645, -18494, 92687, 72821, 2252, -2327, 15688, -5878, -21067, -37915, -3234, 27439, 23279, -21382, -16472, -32109, -86132, -130177, -145465, -109141, -40682, 7895, -706, -1362, -63817, -80289, -49360, -18704, 16093, -22292, -57542, -72700, -27791, -43886, -86761, -69597, -30764, 3083, 7207, 7153, -13136, -69491, -42367, -34444, -59022, -63481, -62143, -40356, -27627, -33512, -30419, -611, -4021, -18483, -30946, -25938, 5739, -19261, -52806, -28411, 12078, 46707, 30937, -10154, 21735, 29313, 6640, 6790, 23244, 6281, -32924, 11592, 26091, 4306, -12757, -33828, -39078, -10584, -16113, -16848, -18347, -54590, -73263, -50576, 7226, 60669, 65073, 21915, -5546, -7708, -27103]
5904b7103j0142J1866L3861k3346j5946O9863o753l1441m005j1758J0799M0787
5892C6682K2446K5431J6726K6144m4306l4557m6991k8491N9665L4457j0046j9302
5880C7858j4451M159j8215p2831R355P5259j2150L5263P056j6908k3980l5087
5868b4672J6407O2333R499j7637P302r752l3485j5671o9760j0702O3418J6176
5856f544k4779l5330J2610j6883M5104N6712K1952k0511j3284qp5175J8548L9367
5843A779j1461m065k3400l464M84M3207k1556k1708P692L1381L7471n253K704
5830C3811K0830l8416p9257k6937L8974J5750k2888k1968q576N0389J9029j1665
5818c0924n0506J9609m352l2832l8875L5626K9288M2721O9846j1431k9407m1650
$$ y = [-27103, -37245, -25379, 8482, -14864, -30810, 39053, 32300, 859, -3146, -14904, -4105, 36682, 59128, 84559, 101285, 127429, 83123, 48566, 1575, -26916, 32749, 67206, 57160, 37858, 23407, 27566, 9351, -63480, -54125, 21134, 8984, 44247, 51303, 34395, 10415, -24672, -8265, 54068, 63567, 45930, 53232, 43480, 9995, -5676, -75436, -86138, -22720, -6544, -31323, -66653, -54043, -70926, -25822, 30890, 52842, 32331, 19047, 19039, -56136, -37588, 1779, -9682, -13747, -37147, -40611, -40127, 3080, -18476, -40184, -32492, -1111, 36360, 31107, 33811, 54641, 16225, -63032, -89969, -50995, -35245, -58133, -80101, -88677, -38288, -19259, -30924, -81430, -61821, -66173, -99005, -137880, -102254, -72966, -30245, 39601, 28170, -1237, -42887]
5806d2887j4695J4393m7853j6203P303M3977j7289M43n877O930J765j199K4901
5793d6291K9595L842L5261L0128L445n2599k9593P037J1509K0250j7632j3660
5781a8708M747k4090l3462l1072K0941j0658L6875M5927l894Q899J4847K3842
5769C4194J6360k3311j9184k1579k8499J9544R791n7594k2504N3597P634k00K300
5756b9451K4108J4682l247m1356K5286O6137O272n5043P641J9487K5527n6341
5744C702N209K3429j5125o2957k6067R826L4613Q726J4866K0441k6175m9741J2053
5731d7200M5165J6966O100j6029J222J9929l554m5363n2476K0172M5190P7794
5719F7916L5414m3683o0848O12J6226l564r46K316k4901N388J4504n838K4689
$$ y = [-42887, -57582, -43189, -91042, -107245, -99942, -55965, -73254, -72811, -78688, -71758, -69993, -71192, -46291, -16696, -12854, 22407, 52535, 55980, 3381, -26212, -19175, -7666, 12584, -5048, -18708, -13961, -38051, -71513, -102585, -81644, -92302, -55427, -9500, -13394, -4495, 10352, 34194, 50554, 27243, 8059, -13520, -42019, -22475, -12684, -70278, -92782, -39185, -31551, -31751, -29451, -5343, 9339, 6092, -35264, -9978, 56159, 62431, 7388, 15029, 34516, 60043, 3702, 8911, 32340, 17215, -45742, -71809, -61983, -27370, -18644, -3778, 16663, -9512, -59253, -47200, -2035, 14931, 21031, 5002, 6224, 26153, 22599, -22764, -75240, -55068, -9878, 67916, 103330, 59647, -1201, -589, 15637, 12073, 11127, 13443, -11458, -6070, 8434, 2596, 27285]
5706B7285j6671K423K2820M795K1413m385n7591p1921n514J5865O5717J0894m0846
5693b5716j7641L8168J6937K8621K4342m4865q491N335k4608K3123o906m4813
5681c6514K5642K5604O106j6275Q829O130K3230M8514L65n8524j2169j4862M236
$$ y = [27285, 10614, 13037, 35857, 40652, 62065, 57680, 89, -71832, -77346, -61481, 4236, 15130, -25716, -43357, -5189, 11748, 40369, 64711, 19846, 11355, 16690, -7918, 15205, 8299, -36514, -10872, 14732, 20838, 4563, 13392, 19522, 42752, 91266, 91631, 33107, 20938, 6076, 10312]
$$ [...]
##END NTUPLES=NMR SPECTRUM
##END=
