##TITLE=Analysis number 323140
Compound Code cc 58546
Book Reference 196/196
Project Code adrs
Chemist Name jimp
##JCAMPDX= 6.0         $$ Bruker NMR JCAMP-DX V2.0
##DATA TYPE= NMR SPECTRUM
##DATA CLASS= NTUPLES
##ORIGIN= Bruker BioSpin GmbH
##OWNER= nmr
$$ XWIN-NMR		Version 3.5
$$ Tue Oct 17 16:42:27 2006 GMT Daylight Time (UT+1h)  MAYBRIDGE\nmr@NMR_250MHZ
##.OBSERVE FREQUENCY= 250.131544655141
##.OBSERVE NUCLEUS= ^1H
##.ACQUISITION MODE= SIMULTANEOUS (DQD)
##.ACQUISITION SCHEME= undefined
##.AVERAGES= 16
##.DIGITISER RES= 18
##SPECTROMETER/DATA SYSTEM= dpx250
##.PULSE SEQUENCE= zg30
##.SOLVENT NAME= CDCl3
##.SHIFT REFERENCE= (INTERNAL, CDCl3, 0, 16.522)
##AUDIT TRAIL= $$ (NUMBER, WHEN, WHO, WHERE, WHAT)
$$ ##TITLE= Audit trail, XWIN-NMR		Version 3.5
$$ ##JCAMPDX= 5.01
$$ ##ORIGIN= Bruker BioSpin GmbH
$$ ##OWNER= nmr
$$ C:\u/data/dgb/nmr/ADRS/720/pdata/1/auditp.txt
$$ ##AUDIT TRAIL=  $$ (NUMBER, WHEN, WHO, WHERE, WHAT)
(   1,<2006-10-17 16:41:51.24 +100>,<MAYBRIDGE\nmr>,<NMR_250MHZ>,
      <created by zg, POWCHK disabled, PULCHK disabled
       configuration hash MD5:
       49 4B E0 1D 92 C2 6B 37 9F E6 65 BC 52 41 86 1D
       data hash MD5: 64K
       00 59 28 0F 80 67 48 F7 C4 76 75 39 B7 40 8C 7A>)
(   2,<2006-10-17 16:42:09.04 +100>,<MAYBRIDGE\nmr>,<NMR_250MHZ>,
      <Start of raw data processing
       ef LB = 0.3 FT_mod = 6 PKNL = 1 SI = 32K 
       data hash MD5: 32K
       73 72 99 C3 A5 84 65 DF 3A DC 24 03 CF 4C 2A EF>)
(   3,<2006-10-17 16:42:12.96 +100>,<MAYBRIDGE\nmr>,<NMR_250MHZ>,
      <apk 
       data hash MD5: 32K
       21 CB 1B 0C 06 D4 07 86 4B A8 95 B3 41 22 C6 EB>)
(   4,<2006-10-17 16:42:13.87 +100>,<MAYBRIDGE\nmr>,<NMR_250MHZ>,
      <abs ABSG = 5 
       data hash MD5: 32K
       C2 BF 6D 5B D0 78 BA 2C 91 84 03 D6 C1 C7 D1 4C>)
$$ ##END=
$$ 
$$ hash MD5
$$ 9A E6 2F 55 B7 18 4B 87 96 21 E4 3B E2 1E 77 81
##$RELAX= 
##$RELAX= 
##$RELAX= 
##$RELAX= 
##$RELAX= 
##$RELAX= 
##$RELAX= 
$$ Bruker specific parameters
$$ --------------------------
##$DU= <C:\u>
##$EXPNO= 720
##$NAME= <ADRS>
##$PROCNO= 1
##$TYPE= <nmr>
##$USER= <dgb>
##$AMP= (0..31)
100 100 100 100 100 100 100 100 100 100 100 100 100 100 100 100 100 100 
100 100 100 100 100 100 100 100 100 100 100 100 100 100 
##$AQSEQ= 0
##$AQ_mod= 3
##$AUNM= <au_zg>
##$AUTOPOS= <7 >
##$BF1= 250.13
##$BF2= 250.13
##$BF3= 250.13
##$BF4= 250.13
##$BF5= 500.13
##$BF6= 500.13
##$BF7= 500.13
##$BF8= 500.13
##$BYTORDA= 1
##$CFDGTYP= 0
##$CFRGTYP= 5
##$CHEMSTR= <none>
##$CNST= (0..31)
1 1 145 1 1 1 1 1 1 1 1 1 1 1 1 1 1 1 1 1 1 1 1 1 1 1 1 1 1 1 1 1 
##$CPDPRG= <>
##$CPDPRG1= <>
##$CPDPRG2= <>
##$CPDPRG3= <>
##$CPDPRG4= <mlev>
##$CPDPRG5= <mlev>
##$CPDPRG6= <mlev>
##$CPDPRG7= <mlev>
##$CPDPRG8= <mlev>
##$CPDPRGB= <>
##$CPDPRGT= <>
##$D= (0..31)
0 1 0 0 0 0 0 0 0 0.06 0 0 0 0 0 0 0.0002 0 0 0 0 0 0 0 0 0 0 0 0 0 0 
0 
##$DATE= 1161099709
##$DBL= (0..7)
120 120 120 120 120 120 120 120 
##$DBP= (0..7)
150 150 150 150 150 150 150 150 
##$DBP07= 0
##$DBPNAM0= <>
##$DBPNAM1= <>
$$ [...]
##$SUBNAM7= <"">
##$SUBNAM8= <"">
##$SUBNAM9= <"">
##$SW= 20.6930455092707
##$SWIBOX= (0..15)
0 0 3 0 0 0 0 0 0 0 0 0 0 0 0 0 
##$SW_h= 5175.983436853
##$TD= 65536
##$TD0= 1
##$TE= 683.16
##$TE2= 300
##$TE3= 300
##$TEG= 300
##$TL= (0..7)
0 120 120 120 120 120 120 120 
##$TP= (0..7)
150 150 150 150 150 150 150 150 
##$TP07= 0
##$TPNAME0= <>
##$TPNAME1= <>
##$TPNAME2= <>
##$TPNAME3= <>
##$TPNAME4= <>
##$TPNAME5= <>
##$TPNAME6= <>
##$TPNAME7= <>
##$TPOAL= (0..7)
0.5 0.5 0.5 0.5 0.5 0.5 0.5 0.5 
##$TPOFFS= (0..7)
0 0 0 0 0 0 0 0 
##$TUNHIN= 0
##$TUNHOUT= 0
##$TUNXOUT= 0
##$USERA1= <user>
##$USERA2= <user>
##$USERA3= <user>
##$USERA4= <user>
##$USERA5= <user>
##$V9= 5
##$VALIST= <valist>
##$VCLIST= <CCCCCCCCCCCCCCC>
##$VD= 0
##$VDLIST= <DDDDDDDDDDDDDDD>
##$VPLIST= <PPPPPPPPPPPPPPP>
##$VTLIST= <TTTTTTTTTTTTTTT>
##$WBST= 1024
##$WBSW= 4
##$XGAIN= (0..3)
0 0 0 0 
##$XL= 0
##$YL= 0
##$YMAX_a= 308209
##$YMIN_a= -463382
##$ZGOPTNS= <>
##$ZL1= 120
##$ZL2= 120
##$ZL3= 120
##$ZL4= 120
##$ABSF1= 16.522
##$ABSF2= -4.171173
##$ABSG= 5
##$ABSL= 3
##$ALPHA= 0
##$AQORDER= 0
##$ASSFAC= 0
##$ASSFACI= 0
##$ASSFACX= 0
##$ASSWID= 0
##$AUNMP= <proc_1d>
##$AZFE= 0.1
##$AZFW= 0.1
##$BCFW= 0
##$BC_mod= 0
##$BYTORDP= 0
##$COROFFS= 0
##$CY= 12.5
##$DATMOD= 1
##$DC= 0
##$DFILT= <>
##$DTYPP= 0
##$F1P= 14.0000005364418
##$F2P= -0.99999901652339
##$FCOR= 0.5
##$FTSIZE= 32768
##$FT_mod= 6
##$GAMMA= 0
##$GB= 0
##$INTBC= 1
##$INTSCL= 1
##$ISEN= 128
##$LB= 0.3
##$LEV0= 0
##$LPBIN= 0
##$MAXI= 10000
##$MC2= 0
##$MEAN= 0
##$ME_mod= 0
##$MI= 0
##$NCOEF= 0
##$NC_proc= -4
##$NLEV= 6
##$NOISF1= 0
##$NOISF2= 0
##$NSP= 0
##$NTH_PI= 0
##$NZP= 0
##$OFFSET= 16.522
##$PC= 1
##$PHC0= 155.5211
##$PHC1= 4.793109
##$PH_mod= 1
##$PKNL= yes
##$PPARMOD= 0
##$PSCAL= 4
##$PSIGN= 0
##$REVERSE= no
##$SF= 250.13
##$SI= 32768
##$SIGF1= 0
##$SIGF2= 0
##$SINO= 400
##$SIOLD= 32768
##$SREGLST= <1H.CDCl3>
##$SSB= 0
##$STSI= 32768
##$STSR= 0
##$SW_p= 5175.98343685301
##$SYMM= 0
##$S_DEV= 0
##$TDeff= 65536
##$TDoff= 0
##$TI= <Analysis number 999999
Compound Code 99
Book Reference 9
Project Code 9>
##$TILT= no
##$TM1= 0
##$TM2= 0
##$TOPLEV= 0
##$USERP1= <user>
##$USERP2= <user>
##$USERP3= <user>
##$USERP4= <user>
##$USERP5= <user>
##$WDW= 1
##$XDIM= 32768
##$YMAX_p= 431700527
##$YMIN_p= -62379
$$ End of Bruker specific parameters
$$ ---------------------------------
##NTUPLES= NMR SPECTRUM
##VAR_NAME=  FREQUENCY,     SPECTRUM/REAL,   SPECTRUM/IMAG
##SYMBOL=    X,             R,               I
##VAR_TYPE=  INDEPENDENT,   DEPENDENT,       DEPENDENT
##VAR_FORM=  AFFN,          ASDF,            ASDF
##VAR_DIM=   32768,         32768,           32768
##UNITS=     HZ,            ARBITRARY UNITS, ARBITRARY UNITS
##FACTOR=    0.157963299565203, 1,           1
##FIRST=     4132.6476996994, 0,             0
##LAST=      -1043.33573715361, 0,           0
##MIN=       -1043.33573715361, -62379,      0
##MAX=       4132.6476996994, 431700527,     0
$$ Real data points
##PAGE= N=1
##DATA TABLE= (X++(R..R)), XYDATA
$$ [...]
16557c078j3605r095j426M759l00K674n068j5242K477K3009J3284n728j776n705
16543a4820j0179r083k398k152J970O294j75J3130O153k270K452q584m010M734
16529a8938l585M926l590k366Q008Q238l556j4433k85J123p378J2122J3637j991
16515h068j0032p406n823p333J9099j147O517j771j5938J4450K702K841k870j0673
16501b5452q777n986Q333J6651N494p03m267q995O896J3144j2922j3617j1223
16488d1424r014P770P739R466J1525K004k490P179R255J146j4743j2352N937k087
16474b0089j4460P678J1218k367j190m636P028k459J32n790m605J416l67M074
16460b4417l119l081P194J2250P37l94o114j1776j0790M255N663O410J2721j358
$$ plain form
16557 -3078 -16683 -25778 -27204 -22445 -22745 -20071 -25139 -40381 -37904 -14895 -1611 -7339 -9115 -14820
16543 -14820 -24999 -34082 -36480 -38632 -36662 -30368 -30543 -17413 -11260 -13530 -11078 -19662 -23672 -18938
16529 -18938 -22523 -17597 -21187 -23553 -15545 -7307 -10863 -25296 -25581 -24458 -31836 -19714 -6077 -8068
16515 -8068 -18100 -25506 -31329 -38662 -19563 -20710 -14193 -15964 -31902 -17452 -14750 -11909 -14779 -25452
16501 -25452 -34229 -40215 -31882 -15231 -9737 -10440 -14707 -23702 -16806 -3662 -16584 -30201 -41424
16488 -41424 -50438 -42668 -34929 -25463 -13938 -11934 -14424 -7245 2010 3156 -11587 -23939 -18002 -20089
16474 -20089 -34549 -26871 -15653 -18020 -19210 -23846 -16818 -19277 -19145 -24935 -29540 -28124 -28491 -24417
16460 -24417 -27536 -30617 -23423 -11173 -10436 -10830 -16944 -28720 -39510 -35255 -29592 -23182 -10461 -11819
16446a1819J0182j37j2781q774J5034j371j0261L124M047J098P70j6814j9803
16433d7505n721K44L673J2327M368j343L74j6947o50R700M344O433L938j089l772
16418c1626j726J034J1440O634n213m652o779J455P000m008O454j041J31k804
16404b3701j6378L436J2170M320N621J0001n101j2230K204J9571N145n121o707
16391f770M895L334j7067j1042N594K947q667J244o81l581M040Q041M619m921
16377a8015j4116n109J3412K834k649J783n242j2294M147L979j607J1389J2345
16364i143l264J4493J2227j6610j7329K644L880k005q479O06l564K399K697m445
16350b5893J150K897l441l032N439J4145L092J324l397m170P27j803K406L3o68
$$ plain form
16446 -11819 -1637 -1774 -14555 -23329 -8295 -9666 -19927 -16803 -12756 -11658 -10888 -27702 -47505
16433 -47505 -53226 -52982 -49309 -36982 -32614 -33957 -33583 -50530 -51180 -41480 -37136 -30703 -26765 -27854 -31626
16418 -31626 -33352 -32318 -20878 -14244 -19457 -24109 -30888 -29433 -22433 -26441 -19987 -21028 -20897 -23701
16404 -23701 -40079 -36643 -24473 -20153 -14532 -4531 -9632 -21862 -19658 -87 5058 -63 -6770
16391 -6770 -1875 1459 -15608 -26650 -21056 -18109 -26776 -25532 -26213 -29794 -25754 -17713 -13094 -18015
16377 -18015 -32131 -37240 -23828 -20994 -23643 -21860 -27102 -39396 -35249 -31270 -32877 -21488 -9143
16364 -9143 -12407 2086 14313 -2297 -19626 -16982 -13102 -15107 -23586 -22980 -26544 -24145 -21448 -25893
16350 -25893 -24743 -21846 -25287 -28319 -22880 -8735 -5643 -4319 -7716 -11886 -11159 -12962 -10556 -10523 -11191
16335a1191n203O317p324j0020j008J0979K837N358j2676n06J2392M307q656L197
16321a1197k406l448j239o745J5375N828J609l930j3196M83J485P056N689J579
16307c057j3463j5642q034r82J1671K291J3029N6O152O019p702L110m260q008
16293a8820n337M486q75k405m501J4248R559n079L134P422J055l629j937m485
16279g164j2751N41P805q928N096N35r236l956O999M338l548J024O200N711p182
16264a4516o478N176o046n347o073R00P716L935K53K359R833M676j829j968r257
16249a6666m831n478q648q423J865K175P732Q936K0979Q409n292o924L31j39k763
16234h737j1945m924j402j390n194j3703J2053J3635R175M765j3265M22M21m109
$$ plain form
16335 -11191 -16394 -10077 -17401 -27421 -28429 -17450 -14613 -9255 -21931 -22437 -10045 -5738 -14394 -11197
16321 -11197 -13603 -17051 -18290 -25035 -9660 -3832 -2223 -6153 -19349 -18866 -17381 -10325 -4636 -3057
16307 -3057 -16520 -32162 -40196 -41178 -29507 -27216 -14187 -14131 -7979 -1960 -9662 -6552 -10812 -18820
16293 -18820 -24157 -19671 -20546 -22951 -27452 -13204 -3645 -8724 -5590 1832 2887 -742 -2679 -7164
16279 -7164 -19915 -19374 -11569 -20497 -15401 -14866 -24102 -28058 -21059 -16721 -20269 -19245 -13045 -7334 -14516
16264 -14516 -20994 -15818 -21864 -27211 -33284 -32384 -24668 -20733 -20480 -18121 -8288 -3612 -5441 -7409 -16666
16249 -16666 -21497 -26975 -35623 -44046 -42181 -40006 -32274 -23338 -2359 6050 758 -6166 -5835 -5974 -8737
16234 -8737 -20682 -25606 -27008 -28398 -33592 -47295 -35242 -21607 -12432 -7667 -20932 -20510 -20089 -24198
16220b4198O371J2900O579j275j7265Q533J494j1572J0124J1442j2217k3078j7465
16207d9627M711J7306J5690J8004N345j5187J635o084L232Q302o033o14m099o009
16193a3428j0834J345j1694n331J554J3843M545R405o110l319k280N48k465l585
16179b7806R418K700J2952k331q730j38O729l635l695M038l090k681K671j676
16165a5274k181P274K326J2825k83o875n097K679M784Q193j1956j7259j6505K838
16151c4511O956J243Q954o478j0222R703J605N558J0613R967j0720o904J2312
16138a924q954j797J8816J119k1833O010j4818j1845R575J6101K548j98l997n529
16124a6726j476K638P275J1735M015n959m054j7666p742J4277k19O83L142o389
$$ plain form
16220 -24198 -17827 -4927 1652 377 -16888 -8355 -6861 -18433 -8309 3133 -9084 -32162 -49627
16207 -49627 -44916 -27610 -11920 6084 11429 -3758 -2123 -8207 -4975 3327 -2706 -3320 -7419 -13428
16193 -13428 -24262 -22917 -34611 -39942 -38388 -24545 -20000 -10595 -16705 -20024 -22304 -21756 -24221 -27806
16179 -27806 -18388 -15688 -2736 -5067 -13797 -13935 -7206 -10841 -14536 -10498 -13588 -16269 -13598 -15274
16165 -15274 -17455 -10181 -7855 4970 4687 -2188 -7285 -4606 178 8371 -3585 -20844 -37349 -34511
16151 -34511 -27555 -26312 -17358 -23836 -34058 -24355 -22750 -17192 -6579 3388 -7332 -14236 -1924
16138 -1924 -10878 -12675 6141 7260 -14573 -8563 -23381 -35226 -25651 -9550 -7002 -7200 -11197 -16726
16124 -16726 -18202 -15564 -8289 3446 7461 1502 -2552 -20218 -27960 -13683 -13902 -13219 -10077 -16466
16110a6466j1310J0774K1523K052m999J260j3117r336K924o323J2839J3430p511
16097d260j0543k828q611j006Q760n372m672R011P315p18N118m46R971m262q284
16082a0827K976K0226J3273j9528r401r562L79l856j3316n353r690j1284o416
16069f2379K0910J3968L395J2343m081j1122m790J1040J1675M68j4275R311J4873
16056A336l048n737j0272J6439K253j585N65p646j5627j1820L44p44P818J314
16042b6410p331K900K3265J1687m199m780J3430k749o548n141q346l555P69K045
16028a4963m654k309J4930J2677n879o688J3627r538j3323n181k082l5J785K616
16014a9017n870j2066k823J3559J1129j822r382j6128J009N231R46N051N068L171
$$ plain form
16110 -16466 -27776 -17002 4521 6573 1574 2834 -10283 -19619 -16695 -23018 -10179 3251 -4260
16097 -4260 -14803 -17631 -26242 -27248 -18488 -23860 -28532 -19521 -12206 -12924 -7806 -8252 1719 -2543 -10827
16082 -10827 -7851 12375 25648 6120 -3281 -12843 -12464 -16320 -29636 -34989 -44679 -55963 -62379
16069 -62379 -41469 -27501 -24106 -11763 -15844 -26966 -31756 -20716 -9041 -8573 -22848 -13537 1336
16056 1336 -1712 -7449 -17721 -1282 971 -614 -49 -7695 -23322 -35142 -34798 -35542 -27724 -26410
16042 -26410 -33741 -30841 -7576 4111 -88 -4868 8562 5813 -735 -5876 -14222 -17777 -17008 -14963
16028 -14963 -19617 -21926 -6996 5681 -198 -6886 6741 -2797 -16120 -21301 -23383 -23418 -21633 -19017
16014 -19017 -24887 -36953 -39776 -26217 -15088 -16910 -26292 -42420 -41411 -36180 -35234 -30183 -25115 -21944
16000b1944P321J0042O324j1969j6721K728J0427p09p946k479J6034J479L585
15987c828N261L323q195n621o999q527n364m984J2797L402l026m678P909J7110
15973a420J4196N267O90r610o747N288j2845j1760k070M705J6721N933p443n882
15959d977K286k956j1017L493O701Q66J0319N787k708j3770j0970k868K691O194
15945a0929j231l793P475J013n468l965N083J534o806p58P989m461Q138O289j4677
15930a4567q39J216j0451j463K943N591p039J2164K887j1958j0191l935J2310
15917b3332O911O062j0336j8521K614R946R54O460R896M076o30j6239j6031r44
15903c9114J5057J3949k491N722O275M902k213M320r328j4639R915L06q71l52
$$ plain form
16000 -21944 -14623 -4581 1743 -10226 -26947 -24219 -13792 -14501 -22447 -24926 -8892 -7413 -3828
15987 -3828 1433 4756 -3439 -9060 -16059 -24586 -29950 -34934 -22137 -18735 -21761 -26439 -18530 -1420
15973 -1420 12776 18043 18733 9123 2376 7664 -5181 -16941 -19011 -14306 2415 8348 905 -4977
15959 -4977 -2691 -5647 -16664 -13171 -6470 -5604 4715 10502 7794 -5976 -16946 -19814 -17123 -10929
15945 -10929 -12160 -15953 -8478 -7465 -12933 -16898 -11815 -10281 -17087 -17845 -9856 -14317 -6179 110 -14567
15930 -14567 -15406 -14190 -24641 -26104 -23161 -17570 -24609 -12445 -9558 -21516 -31707 -35642 -23332
15917 -23332 -16421 -10359 -20695 -39216 -36602 -26656 -25702 -19242 -9346 -5270 -5900 -22139 -38170 -39114
15903 -39114 -24057 -10108 -12599 -6877 -602 4300 2087 6407 -2921 -17560 -7645 -7339 -8210 -8562
15889h562O038K984J116j982r514L168J3253J6016j7964n009n54j2387q719m690
15875b6806O268R069P498J2165p321j7958K476l306k370k671k299L582O50N069
15861a5954j8797r139J7442J5176j831j0423N549J3593m448J747J2100k624j0168
15848g777O104j3344j0570j2051k142M325O830Q507m237L657P473r644j0014P20
15834c2163J272l48L795J1485Q857P42k759q782p66J0595P087J863j649j0569
15820a1340j0854k492J2681N20q775M098R071k507J985J2329m051j2899K917M168
15806e149M3O666K805j5129l871J5727p427j5041m878k371J882L686M838M820
15792a3399P490J3635j402j3258j3172p976k68J0356l342j422J683k17j897k066
$$ plain form
15889 -8562 -2524 460 1576 -406 -9920 -6752 6501 22517 4553 -456 -1010 -13397 -22116 -26806
15875 -26806 -20538 -11469 -3971 8194 873 -17085 -14609 -17915 -20285 -22956 -25255 -21673 -21023 -15954
15861 -15954 -34751 -43890 -26448 -11272 -13103 -23526 -17977 -4384 -8832 -7085 5015 2391 -7777
15848 -7777 -1673 -15017 -25587 -37638 -39780 -35455 -28625 -20118 -24355 -20698 -13225 -22869 -32883 -32163
15834 -32163 -30891 -31239 -27444 -15959 -7102 -6360 -9119 -17901 -18667 -8072 -985 878 -771 -11340
15820 -11340 -22194 -24686 -12005 -11485 -20260 -16162 -7091 -9598 -7613 4716 665 -12234 -9317 -5149
15806 -5149 -5106 1560 4365 -10764 -14635 1092 -6335 -21376 -26254 -28625 -26743 -23057 -18219 -13399
15792 -13399 -5909 7726 6324 -6934 -20106 -28082 -28350 -17994 -21336 -22758 -21075 -21292 -23189 -25255
15778b5255L934L555o13n455L800l822N707n264m71R578M401J3062R479l561k6723
15763a7648p320R648r822M513J4224P323q181l938Q436o092j5653M9M382N875
15749a4204k043J4015O829O023p820q675r404M735n896L763N081r626q989p517
15735c3728o15L918Q106R323j789j5299M785J3975l647l810R938j095L725J231
15721d982P29r143j53J0354r113j0173K30J2064n841m630L37R672Q78k3053l572
15706c6396K2970Q442O671J024M408r740o819p190J2904l276j2125n681R53Q495
15692a5360J6572j5162j595O220K69K200O407k018j1347O62O490n34n244p691
15678b0131o367J6963K4194l504j7444j7547n911Q326j557J950O18l818N243J5397
$$ plain form
15778 -25255 -21321 -17766 -18379 -23834 -20034 -23856 -18149 -23413 -23884 -14306 -9905 3157 12636 9075 -17648
15763 -17648 -24968 -15320 -25142 -20629 -6405 918 -7263 -11201 -2765 -8857 -24510 -24461 -20079 -14204
15749 -14204 -16247 -2232 4597 10620 2800 -5875 -15279 -10544 -16440 -12677 -7596 -17222 -26211 -33728
15735 -33728 -34343 -30425 -22319 -12996 -14785 -30084 -25299 -11324 -14971 -18781 -8843 -9938 -6213 -4982
15721 -4982 -4253 -13396 -13549 -3195 -12308 -22481 -22251 -10187 -16028 -20658 -20321 -10649 -9771 -32824 -36396
15706 -36396 -13426 -4984 1687 2711 7119 -2621 -9440 -16630 -3726 -7002 -19127 -24808 -23855 -15360
15692 -15360 1212 -13950 -15545 -9325 -9056 -6856 -449 -2467 -13814 -13152 -6662 -7196 -12440 -20131
15678 -20131 -26498 -9535 14659 11155 -6289 -23836 -29747 -21421 -22978 -21028 -20410 -24228 -18985 -3588
15664c588q425j955o700O222Q467j0567m015L592R908L691O84l267r387n051m070
15649b4461j434M386N345r020N046P282K3092P630k1765p922o623p955J4331M59
15635a1609j253o275k586N050k453R193j385J40j900R374K093n106L882n427q582
15620a6844l623l020J5061Q078M865M577p600o210P776L514m358k577j109p670
15606i140j0577n38J3909N455J419m423r849n687R98L835O917n762j1184J8209
15592f418M365J368j858M648q364n362L825j523m628L85M84J0923L72P03k738
15577c818L958J4826J2320P915j2335p595J015j3732j2126j2569m323m075Q131
15564b2408J4887R820K202M62j740Q220L153j355L627l279O6l94R416k364j8702
$$ plain form
15664 -3588 -12013 -13968 -20668 -14446 -5979 -16546 -20561 -16969 -7061 -3370 -2686 -5953 -15340 -20391 -24461
15649 -24461 -25895 -21509 -16164 -25184 -20138 -12856 10236 17866 -3899 -11821 -18444 -26399 -12068 -11609
15635 -11609 -12862 -19137 -21723 -16673 -19126 -9933 -11318 -11178 -13078 -3704 -1611 -6717 -2835 -8262 -16844
15620 -16844 -20467 -23487 -8426 -348 4517 9094 1494 -4716 3060 6574 2216 -361 -1470 -9140
15606 -9140 -19717 -20255 -6346 -891 528 -3895 -13744 -19431 -18433 -14598 -7681 -13443 -24627 -6418
15592 -6418 -2053 -685 -2543 2105 -6259 -11621 -7796 -9319 -13947 -13562 -13078 -2155 -1783 -1080 -3818
15577 -3818 140 14966 27286 35201 22866 15271 16286 2554 -9572 -22141 -26464 -30539 -22408
15564 -22408 -7521 2299 4501 4963 3223 11443 14596 13241 16868 13589 13655 13261 22677 20313 1611
15549A611j1756k425N487O657K219p062q807m924R28J275j570j327J261p257j0564
15534c6254L45N513M796M204K23m154N337J1725J6304Q977k2452j0520j953L683
15520a4226P728R22J3676N960n824j3660j2648K16K1158J1160J472j5026q253
15507g345p40k706o395M890J1992l733n710n598j136j2553j0520l442L5492K0102
15493A2598p207k706o843j0610p519j755O412O134j312k040q164o893J731K032
15479b6142K058Q812P189K130N19p175P981m523o439j121n107M008R026k117j4594
15464b5495Q525k573N04O729J55r870N38J3456n049j2958K4Q140O393L861N664
15449a956K741K629M11K283K275K469j0226k1539n999Q945n317J2900N045o397
$$ plain form
15549 1611 -10145 -12570 -7083 -426 1793 -5269 -14076 -19000 -18072 -16797 -18367 -19694 -18433 -25690 -36254
15534 -36254 -35909 -30396 -25600 -21396 -21173 -25327 -19990 -8265 8039 17016 -5436 -15956 -17909 -14226
15520 -14226 -6498 -5576 8100 14060 8236 -5424 -18072 -17856 3302 14462 15934 908 -7345
15507 -7345 -8085 -10791 -17186 -12296 -304 -4037 -9747 -15345 -16481 -29034 -39554 -42996 -7504 12598
15493 12598 5391 2685 -4158 -14768 -22287 -24042 -17630 -11496 -12808 -14848 -23012 -29905 -28174 -26142
15479 -26142 -24084 -15272 -8083 -5953 -5434 -12609 -4628 -9151 -15590 -16711 -21818 -17810 -8784 -10901 -25495
15464 -25495 -16970 -19543 -19039 -12310 -12155 -22025 -21487 -8031 -13080 -26038 -26014 -17874 -11481 -7620 -1956
15449 -1956 785 3414 3825 6108 8383 10852 626 -20913 -26912 -17967 -23284 -10384 -5339 -11736
15435a1736n620r365O533Q260J0855J8016J6622o078m437p406N793o189J197M907
15421B1352k234m414j0199O295J3825j5311Q543K2682J622j9414n518L466N483
15408B6178J4807l439r107q419p216P654l663j7198M461m219N108P248J136j573
15394A1758Q649L915j4742k691k880K247l752j975M506j0758k581m186N912K0766
15380A4188J2930k18L206P978k321j2681p401J3860o487P623k875k760l141r894
15366A2007m944J693P400M235q857j047j5328K637K0193J019j0339o944r477K056
15352e696K89m159k322Q684M396j1284j1514J045L1318N145j2122q766k082J7706
15338A0638M61j1164N809q088n626Q676M100L663J1472j1892N462r186l11Q012
$$ plain form
15435 -11736 -17356 -26721 -20188 -11928 -1073 16943 33565 27487 23050 15644 21437 15248 16445 21352
15421 21352 19118 14704 4505 10800 24625 9314 17857 40539 42161 22747 17229 20695 26178
15408 26178 40985 37546 28439 20020 12804 20458 16795 -403 4058 -161 4947 12195 13331 11758
15394 11758 20407 24322 9580 6889 4009 6256 2504 529 5035 -5723 -8304 -12490 -6578 14188
15380 14188 27118 26900 30106 38084 35763 23082 15681 29541 23054 30677 27802 25042 21901 12007
15366 12007 7063 8756 16156 20391 11534 10487 -4841 -2204 17989 19008 8669 1725 -7752 -5696
15352 -5696 -5407 -9566 -11888 -3204 1192 -10092 -21606 -20561 10757 15902 3780 -4986 -7068 10638
15338 10638 11099 -65 5744 -2344 -7970 706 4806 8469 19941 8049 13511 4325 4014 12026
15324A2026j159J2209O119p487r055j872j2436j1685K702J6193M073R923L522
15311B3073p503j485L766o485J226J913J0632j869n639k3820o356J6955O637J4812
15297B5857O150M458K93o305q641q529q274Q907K3128K673j3222O299K045j1087
15283B3752N198L813O042R242P107K738k613j3095j0696M493k771K346L750J5334
15269E4640j781K313J2517O679N754O768J6685K8537O309K4188L1593N6908N2640
15256C03750P8228J09879J30042J33686J29498J35763J03499O6046J0506m9390
15246A151507r6038j31294j39207j29895j29521r5693p5559p0477n6512k5095
15236B02216j8205r123j7095k0442q228j2086j2935q96n126n147j2800p467J287
$$ plain form
15324 12026 10867 23076 29195 21708 12653 10781 -1655 -13340 -10638 5555 9628 19551 23073
15311 23073 15570 14085 17851 11366 12592 14505 25137 23268 17629 -6191 -12547 4408 11045 25857
15297 25857 32007 36465 36758 30453 21812 13283 5009 13916 37044 39717 26495 32794 34839 23752
15283 23752 28950 32763 38805 48047 55154 57892 55279 42184 31488 35981 33210 35556 39306 54640
15269 54640 52859 55172 67689 74368 80122 86890 103575 132112 138421 162609 194202 251110 303750
15256 303750 381978 491857 621899 755585 885083 1020846 1124345 1190391 1200897 1151507
15246 1151507 1055469 924175 784968 655073 525552 429859 354300 283823 227311 202216
15236 202216 184011 174888 157793 137351 129123 117037 104102 103206 98080 92933 80133 72666 73953
15223G3953J9Q282J2719j7034j7521N352r805p167Q94K130K0506L66l011L531
15209G3214j4707j3444J2763K745l933O39K835j1555l716J777J5411P985n065
15196F4949L34m863q753j6362q924j0211M985J1960q248R36R144j1778O494R972
15182C9635R94p200L884J7738P832j3856l13m455j1413n975m237J370j2413m22
15168A1169J5301J1095p290p898j0602l216N641Q884N407j9006q377p6N564J2971
15154A9567J2672J1312p709j983R514p595Q525Q737k565k695j0870n864j5770
15141A5276N81L396J7746J7325M477q363j0675L87L091J1353o875j9404J1875
15128D0190J5394M203j2821j8342L407O257j927J721M509J004m879K743P884m588
$$ plain form
15223 73953 73972 82254 94973 77939 60418 65770 55965 48798 49692 51822 72328 72694 69683 73214
15209 73214 58507 45063 57826 60571 56638 57277 60112 48557 44841 46618 62029 70014 64949
15196 64949 65283 60420 51667 35305 26381 16170 21155 33115 24867 25803 34947 23169 29663 39635
15182 39635 40629 33429 37313 55051 62883 49027 48714 44259 32846 26871 22634 24004 11591 11169
15168 11169 26470 37565 30275 22377 11775 8559 14200 23084 28491 9485 1108 1032 6596 19567
15154 19567 32239 43551 35842 33859 43373 35778 44303 53040 50475 47780 36910 31046 15276
15141 15276 15857 19253 36999 54324 58801 50438 39763 40150 43241 54594 47719 28315 40190
15128 40190 55584 59787 46966 28624 32031 38288 36361 38082 42591 43595 38716 41459 49343 44755
15114D4755K269O726Q349l125L92n086m756P031m609Q677K3850K2918R431L218
15100A20040K3062L2761P417m836J710r276j2463k595j1490j4053j2890m278o717
15087A06392m681j2284j4709j6520O56J7700J3322q952o643P26O794r883k633
15074F9285j2346J592M653J436M716K0567J4098o012L810k212O942P590M762P570
15060A26451l531L777N125J1818K7835L4760K9197L0005J9173J9612K3888J3719
15048C41829j5589j1256l048P568j859l73j5507K039k877q630Q07r891k6182j6348
15034B40683j3423p109n043k5981j5509J952j2674j9265r626j133p73m889o115
15021A21095o578L38q695n576q1n30J0490K0971O25N130M404o263O098q887j2333
$$ plain form
15114 44755 47024 53750 62099 58974 59366 54280 49524 56555 51946 60623 84473 107391 116822 120040
15100 120040 143102 175863 183280 178444 180154 170878 158415 155820 144330 130277 117387 113109 106392
15087 106392 101711 89427 74718 58198 58854 76554 89876 80924 74281 75007 81801 71918 69285
15074 69285 56939 58531 63184 64620 69336 89903 104001 97989 101799 99587 106529 114119 118881 126451
15060 126451 122920 126697 131822 143640 171475 206235 235432 265437 284610 304222 328110 341829
15048 341829 326240 314984 311936 319504 317645 317272 301765 303804 300927 292297 293104 283213 257031 240683
15034 240683 227260 220151 215108 189127 173618 175570 162896 143631 134005 132872 132099 127210 121095
15021 121095 114517 114855 106160 100584 100503 99973 110463 131434 132059 137189 141593 135330 141428 132541 120208
15006A20208K469J0160J0229r537j1506q287L472J3679R998j113j117J0928J2873
14993A62456N471M551J5757K0853R440K1498K7652K4615O944r800j695l739m321
14980B79682j743j3321J50j640p810j4907j5473O400q553j3002j5763n781L77
14967A88616j651p619l714j264k047j592k835l26O715J2466L956N991k80k571
14953A93845m510R553K0083K2235j374L238J8380J3445P313K1302J6498Q941K7588
14940C56537L0574L3418K6555K1092N6707P7241Q9886J09480J55279K04128K63401
14929A424298K91101K75256K15339J38564O5257k9359j15602k03167k29607k26191
14919A605889k29573k01570j73807j47271j00818q8456o8722m7625l8481j1527
$$ plain form
15006 120208 122677 132837 143066 133529 122023 113736 117208 130887 140885 139772 138655 149583 162456
14993 162456 167927 172478 188235 209088 218528 240026 267678 292293 299237 289437 287742 284003 279682
14980 279682 277939 264618 264768 263128 255318 240411 224938 231338 222785 209783 194020 188239 188616
14967 188616 186965 179346 175632 174368 172321 170729 167894 167568 174283 186749 190705 196696 196416 193845
14953 193845 189335 198888 218971 241206 239832 243070 261450 274895 282208 303510 320008 328949 356537
14940 356537 387111 420529 447084 468176 524883 602124 692010 801490 956769 1160897 1424298
14929 1424298 1715399 1990655 2205994 2344558 2409815 2380456 2264854 2061687 1832080 1605889
14919 1605889 1376316 1174746 1000939 853668 752850 664394 595672 548047 509566 498039
14909D98039k4517l0187j3559r420R844J2134Q53p762P149N885k639O509J2094
14896D64423J9559J980k17o566M066J1498O39l96l8K170J0719J2134R677O794
14882E36442M213p598m791J4271P073j0952R709J0490J4429J1919K1635J6229
14870F23069N544J1414K5491K7815K2737J5061K8812M1866L3093J6385K9201L5361
14858I15849L6867L8957M2540L1211M2205M1414L4042L5219L5071L6275N5992
14847A345642N0712N1226O9003P0812Q2832O6515N7860N7261O8443Q2949R2125
14836B095380J19363J34517J37869J53629J71711J87675J99537K18840K31950
14827C650471K53301K65670L05605L23568L45354L92409M47212N04887N85833
$$ plain form
14909 498039 473522 443335 429776 420356 430200 442334 443187 435425 442574 448459 445820 452329 464423
14896 464423 483982 485962 485745 479179 483245 494743 495382 494986 494948 497118 507837 519971 529648 536442
14882 536442 540655 533057 528266 542537 549610 538658 548367 558857 573286 585205 606840 623069
14870 623069 628613 640027 665518 693333 716070 731131 759943 801809 834902 851287 880488 915849
14858 915849 952716 991673 1034213 1065424 1107629 1149043 1183085 1218304 1253375 1289650 1345642
14847 1345642 1396354 1447580 1516583 1587395 1670227 1736742 1794602 1851863 1920306 2003255 2095380
14836 2095380 2214743 2349260 2487129 2640758 2812469 3000144 3199681 3418521 3650471
14827 3650471 3903772 4169442 4475047 4798615 5143969 5536378 5983590 6488477 7074310
14818G074310O92643Q47539J010899J224611J471660J691884J941034K248858
14810A8203438K625786L145460L940916N179137P040865R816527J3743817J8657852
14802H2353798K3778153K7791918K9289273K7553406K2668149J5135069N270182
14795B33839948o365972j7689141k5628275k8699443k7892219k4944158k0863433
14788H1757307j6312104j2119134q845947o551531n003563l974423l273137k789507
14780B2887961k426354k124007j847947j584725j352504j161463j005935q71111
14772A0513915p58138o51323n80562n12841m34685l87565l57115l08142k71451
14763F252093k49801k27866k17783k06856j84104j81832j84649j68931j56518
$$ plain form
14818 7074310 7766953 8614492 9625391 10850002 12321662 14013546 15954580 18203438
14810 18203438 20829224 23974684 27915600 33094737 40135602 49952129 63695946 82353798
14802 82353798 106131951 133923869 163213142 190766548 213434697 228569766 233839948
14795 233839948 227473976 209784835 184156560 155457117 127564898 102620740 81757307
14788 81757307 65445203 53326069 44480122 37928591 32925028 28950605 25677468 22887961
14780 22887961 20461607 18337600 16489653 14904928 13552424 12390961 11385026 10513915
14772 10513915 9755777 9104454 8523892 8011051 7576366 7188801 6831686 6523544 6252093
14763 6252093 6002292 5774426 5556643 5349787 5165683 4983851 4799202 4630271 4473753
14754D473753j50158j61775j41950j28555j30589j27579j22241j15743j18997
14745C276166j05105q4607r6969r3699r2812q8913q8719q9163q8775p1826n9985
14734B315593n6183o4669n7641l9641m0500o8971o0346m4361n3212n8876n9471
14723A711722m8627l9465l9614l9951n5317m3067l2526l5113n3379m6633k5437
14712A252593j6713m1332l3392m6724m1123k3383k3575l2129k9723j9702k5970
14701I18827k2187k4776j4988j2888k7079k8832k3964j6290j0757j6810r667j2936
14689F97653j9817j3067o460q735L368j5800j3318k0251j7195n324j1996j1839
14677E57219M471K356o061j832l583j795l965p367o182j822o383j9164j8552k6706
$$ plain form
14754 4473753 4323595 4161820 4019870 3891315 3760726 3633147 3510906 3395163 3276166
14745 3276166 3171061 3086454 2989485 2895786 2802974 2714061 2625342 2536179 2447404 2375578 2315593
14734 2315593 2259410 2194741 2137100 2097459 2056959 1987988 1927642 1883281 1830069 1771193 1711722
14723 1711722 1663095 1623630 1584016 1544065 1488748 1445681 1413155 1378042 1324663 1278030 1252593
14712 1252593 1235880 1194548 1161156 1114432 1073309 1049926 1026351 994222 964499 944797 918827
14701 918827 896640 871864 856876 843988 816909 788077 764113 747823 737066 720256 710589 697653
14689 697653 677836 664769 658309 649574 652942 637142 623824 603573 586378 581054 569058 557219
14677 557219 561690 564046 557985 556153 552570 550775 546810 539443 533261 531439 525056 505892 487340 460634
14663D60634l0181j8159r281j3573k0254q390j0328j3188j9897j6834l005j0573
14651B86971p360J065j6111j6836m096J965l427k0491j2183r378M150m38l787
14638B00044j580M279j321J858m310m896j4249o779p259o447k5053p278J1867
14625A38876n570j2013L678j165L947J912j7358m779P910R205J090p128j5255
14612A03350j5935p849L885P096j1397o158J4051Q472n571J2352J630j1876k646
14599H9404Q72n134p0K315O940j725P44n913J7L800Q441l358j354M014j4311k8666
14583E6016j4064N678l202M733K008k72J042p600j4658r61J5637k921J810L075
14569D6321K013J3954n345j7051N863K0544l401l089R97m188r427k95J0835K580
$$ plain form
14663 460634 430453 412294 403013 389440 369186 360796 350468 337280 317383 300549 297544 286971
14651 286971 279611 280676 264565 247729 243633 245598 242171 221680 209497 200119 204269 203831 200044
14638 200044 198464 202743 201422 203280 198970 194074 179825 173046 165787 159340 134287 127009 138876
14625 138876 133306 121293 124971 123806 127753 129665 112307 107528 115438 124643 125733 118605 103350
14612 103350 87415 79566 83451 90547 79150 72992 87043 95515 89944 102296 103926 92050 89404
14599 89404 90276 85142 85072 87387 94327 92602 93346 87433 87450 91250 99691 96333 94979 98993 84682 56016
14583 56016 41952 47630 44428 49161 51169 50897 51939 44339 29681 28720 44357 41436 43246 46321
14569 46321 48334 62288 56943 39892 45755 66299 62898 59809 60806 56618 47191 46896 57731 60311
14555F0311r457n165P678j4470K837P816L479N673j1433k508J1663P661l886n715
14541E4484j318j0253n057r601n285q93N81J347M730m657l057m041m833O464n353
14526A3258K3K990k686J096M720k163r348q056k254n725L856J1205R26J659O183
14511A5684l140j2238J1133O26q76p456K864m126q911n694j0365Q583N191K931
14497e794P24l451j7907m081J4989J0043Q57q345N221N875j171k113J0539J613
14483F999k167j598N968R600m76j1287l299l291K384K981J2110n01n402R87k518
14468A0490j351m802R26r026r305p879L416j6946Q254K4165R540n954j1001O75
14454h798P664n697n51M096l169j2466k805R371J1374q095n284L776J292L767
$$ plain form
14555 60311 50854 45689 53367 38897 41734 49550 53029 58702 47269 44761 56424 64085 60199 54484
14541 54484 53166 42913 37856 28255 22970 22077 22658 24005 28735 24078 21021 16980 12147 18611 13258
14526 13258 13281 16271 13585 14681 19401 17238 7890 -166 -2420 -8145 -4289 6916 7842 9501 15684
14511 15684 12544 306 11439 12065 11189 3733 6597 2471 -6440 -12134 -22499 -13916 -8725 -5794
14497 -5794 -5070 -8521 -26428 -30509 -15520 -5477 -4620 -12965 -7744 -1869 -3040 -5153 5386 6999
14483 6999 4832 3234 9202 18802 18326 7039 3740 449 2833 5814 17924 17423 12021 13008 10490
14468 10490 9139 4337 5263 -3763 -13068 -20947 -17531 -34477 -26223 -2058 7482 1528 -9473 -8798
14454 -8798 -1134 -6831 -7382 -3286 -6455 -18921 -21726 -12355 -981 -9076 -14360 -10584 -9292 -5525
14440e525p796J938P165O400J0736J749q151K464m210p660J1620J3055l566q136
14426A0083j6681q714Q560J3889M971o279m857q652J2602p228K621n276O655m380
14412b686j0548R3J5359k109L691P317j0579j0525j586j448O051k675m576q114
14398b2335m915M814M515R48Q388Q599O046k539o689q779m673p412O889L159l292
14383a7276r004q848L046J0537J236K21q943M132J1463O735Q531P96J1595N740
14369A9961j0111J852j131j7624k619M952P497N658J3696Q22J0834J4164J3718
14356F1669J0209J0525J4611J085L082J8467J1169O484J4064L7277N9338P0785
14344C18765Q7986R2276J23648J53784J53369J24978Q6272N4980j0477o3514j06481
$$ plain form
14440 -5525 -13321 -11383 -4218 2182 12918 14667 6516 8980 4770 -2890 8730 21785 18219 10083
14426 10083 -6598 -15312 -6752 7137 12108 5829 972 -7680 4922 -2306 315 -4961 1694 -2686
14412 -2686 -13234 -13141 2218 109 3800 11117 538 -9987 -11573 -13021 -6970 -9645 -14221 -22335
14398 -22335 -27250 -22436 -17921 -16973 -8585 14 6060 3521 -3168 -11947 -16620 -24032 -17143 -13984 -17276
14383 -17276 -26280 -35128 -32082 -21545 -20309 -20088 -29031 -24899 -13436 -6701 1830 2626 14221 19961
14369 19961 9850 11702 10571 -7053 -9672 -4720 2777 8435 22131 22953 33787 47951 61669
14356 61669 71878 82403 97014 98099 101181 119648 130817 137301 151365 188642 247980 318765
14344 318765 406751 499027 622675 776459 929828 1054806 1141078 1196058 1185581 1122067 1015586
14333A015586j38862j38015j15724j09936j06997r6182n6486l7360l3071k8572
14323A54381k9061j1769j0961k5249l0895m605N718J669J847l938J034o151j3416
14310B8604r355J2199j889j1753J027J3446M332j1465r062n129L583m468P681
14297A7751j940j3542q438M327P452Q750p865R88l916J6131l203r371q249k55
14283a380j975J168J0854J2895j2553j6879j1696J6300J5685Q13k0259p758Q74
14270a3911j25o82J233N072N056L916m036n658J1937m249r879j096o11R297J0231
14255F495J172j4392P143L052j1445j5204p358K411Q470M31L973j2902o54L192
14241b5616k865J96M826Q231K80Q472M545m134r087j776J754j2192J923O739Q633
$$ plain form
14333 1015586 876724 738709 622985 513049 406052 309870 253384 216024 182953 154381
14323 154381 125320 113551 102590 77341 46446 41841 47559 49228 51075 47137 48171 42020 28604
14310 28604 19249 31448 29559 17806 18833 32279 36611 25146 16084 10955 14538 10070 17751
14297 17751 15811 2269 -6169 -1842 5610 14360 6495 7483 3567 19698 16495 7124 -1125 -1380
14283 -1380 -3355 -2187 8667 21562 9009 -7870 -19566 -3266 12419 13232 -7027 -14785 -13911
14270 -13911 -14036 -14718 -13485 -8413 -3357 559 -3477 -9135 2802 -1447 -11326 -12422 -13033 -3736 6495
14255 6495 7667 -6725 418 3470 -7975 -23179 -30537 -28126 -19656 -19225 -15252 -28154 -28808 -25616
14241 -25616 -28481 -28285 -23459 -15228 -14948 -6476 -1931 -6065 -15152 -16928 -15174 -27366 -25443 -18704 -10071
14226a0071l104n315m259l15j460R210r156p295K184R211j1008j268R73O490Q741
14211a6442l439K088K637j23M139j163l675J1719p265j3835p304N014Q161N315
14197a4173j862q003Q855K520o36L750j743r73r029j194r754k301N113N668J1890
14182a1872P943j8193k5195J1076Q373j395L568n171J0730J3226q757j0077R53
14169b4791j77o784J463j1136j1360l969O387J0447P274j353o42M468L87o908
14155c6694J634K1337M278j3708l91J4874j5361j4702J2045O763R135J2m394j313
14141a6485r801j681J7964P890k4827r805o949q889j949j342L211J939R210Q790
14127c2724Q413J1099O261J154j4413q0l860l271Q083P341o909j2332J0560q107
$$ plain form
14226 -10071 -13175 -18490 -22749 -23064 -24524 -15314 -24470 -31765 -29581 -20370 -31378 -32646 -31673 -25183 -16442
14211 -16442 -19881 -17793 -15156 -15279 -11140 -12303 -15978 -4259 -11524 -25359 -32663 -27649 -19488 -14173
14197 -14173 -16035 -24038 -15183 -12663 -13299 -9549 -11292 -12265 -21294 -22488 -32242 -34543 -29430 -23762 -11872
14182 -11872 -3929 -22122 -47317 -36241 -27868 -29263 -25695 -30866 -20136 -6910 -15667 -25744 -24791
14169 -24791 -24968 -31752 -30289 -41425 -52785 -56754 -50367 -39920 -32646 -33999 -34641 -30173 -29786 -36694
14155 -36694 -35060 -13723 -9445 -23153 -23544 -8670 -24031 -38733 -26688 -19925 -10790 -10778 -15172 -16485
14141 -16485 -26286 -27967 -10003 -2113 -26940 -36745 -43694 -52583 -54532 -55874 -52663 -50724 -41514 -32724
14127 -32724 -24311 -13212 -6951 -5797 -20210 -20290 -24150 -27421 -19338 -11997 -18906 -31238 -20678 -28785
14113b8785L943l129l175j5587k242J8573N966J631O33p882l984N525n701o609
14099d0823P723P064J154n813r43M8J4779R319k65J5767L584j2086j2584N93N015
14084g468Q665m066p884J483j814l286l029r937p770L238O680J2415R121n024
14070h676n449j379j0962M503N250J450j623q433j6453P050J1243j2199j951R037
14056b8592J6304Q243q657r888J293j0936N417N905J0500O812j0157L955n28K215
14042h114j4286q664J7924Q238M319k4533j9330R249P392k155k029l095Q58J4283
14028a9943O457j4710k0029P805N383L162P979R472j0348L335k956l732L963P985
14014a6177J830o459J069m406K915J41o881J0607J68m813k143r284R83J0246J1231
$$ plain form
14113 -28785 -24842 -27971 -31146 -46733 -48975 -30402 -24436 -22805 -22172 -30054 -34038 -28513 -34214 -40823
14099 -40823 -33100 -26036 -24882 -30695 -31638 -31590 -16811 -7492 -7757 8010 11594 -492 -13076 -12483 -7468
14084 -7468 1197 -2869 -10753 -9270 -11084 -14370 -17399 -27336 -35106 -31868 -25188 -12773 -3652 -8676
14070 -8676 -14125 -15504 -26466 -21963 -16713 -15263 -16886 -25319 -41772 -34722 -23479 -35678 -37629 -28592
14056 -28592 -12288 -4045 -12702 -22590 -21297 -32233 -26816 -20911 -10411 -3599 -13756 -9801 -10329 -8114
14042 -8114 -22400 -31064 -13140 -4902 -583 -25116 -44446 -35197 -27805 -29960 -31989 -35084 -34226 -19943
14028 -19943 -13486 -28196 -48225 -40420 -35037 -31875 -23896 -14424 -24772 -21437 -24393 -28125 -24162 -16177
14014 -16177 -14347 -20806 -19737 -24143 -21228 -21087 -27968 -17361 -17193 -22006 -24149 -33433 -32450 -22204 -10973
13999a0973J568L427N758n994n834n420j881P059k172J2818q406j5955l527r84
13985c0516q856P980l679O088J575N840l073J0445K0861M85M024Q552j2424j1602
13971d300k346m948Q673J4782N005O832j2438m727k302K647L804l345k0780r448
13957b2891N530N025K2278J2136q720j4743m510J0040N356o457j6881M369R817
13944C49k897k8j3535o437K1504J0153j368o558n250q723J673j687p328L656Q974
13929g502N487j0075k697J2267j95J208J978J983J123J1610K358Q068J79j1663
13915A4129q237j955K908j6984k948j170n022Q077J8798L570j959J294l185p274
13901D2m649n834J858J802L187l178Q780R428r587o619j2223R389J824J470r167
$$ plain form
13999 -10973 -9405 -5978 -220 -6214 -12048 -17468 -19349 -12290 -14462 -1644 -10050 -26005 -29532 -30516
13985 -30516 -39372 -31392 -35071 -28983 -27408 -21568 -24641 -14196 6665 7150 11174 19726 7302 -4300
13971 -4300 -6646 -11594 -2921 11861 16866 23698 11260 6533 4231 6878 10682 7337 -13443 -22891
13957 -22891 -17361 -12336 9942 22078 13358 -1385 -5895 4145 9501 3044 -13837 -9468 349
13944 349 -2548 -2576 -16111 -22548 -1044 9109 7741 1183 -4067 -12790 -11117 -12804 -20132 -16476 -7502
13929 -7502 -2015 -12090 -14787 -2520 -2715 -1507 471 2454 3577 15187 17545 25613 25792 14129
13915 14129 5892 3937 6845 -10139 -13087 -14257 -19279 -11202 7596 11166 9207 10501 7316 42
13901 42 -4607 -10441 -8583 -6781 -3594 -6772 2008 11436 1849 -4770 -16993 -7604 -5780 -4310 -13477
13886a3477m654J4431Q776J123J1868l869O18l110L068n45j4615j4635n000J0090
13872i931M208m242M360q123o137P97J1559J4415R309j0368j5686J3264J5062
13859A8487L280J042j2705k1005j165J9575k201m418M102K594J395j985o727o821
13845f552l208n885P499j942l184L047J3046J0487n048J016K13L46j0072k151
13831b388J391j1814q124n269P579P670L655R372k140m400p38k315N758n699Q864
13816A402L298J566j2833j2969m162Q619l255m727n568J7145o52j6357k61J0582
13802a8172j687j4047j2577j3203L442M412Q086R339J2103J1245j720j55j651
13789a4585J484j412q895o420O735O916L33K669j7733j9102J4354J7061R308Q
$$ plain form
13886 -13477 -18131 -3700 5076 6199 18067 14198 14816 11706 14774 14229 -386 -15021 -20021 -9931
13872 -9931 -5723 -9965 -5605 -13728 -19865 -19068 -7509 6906 16215 5847 -9839 3425 18487
13859 18487 21767 22809 10104 -10901 -12066 7509 5308 890 4992 7586 8981 6996 269 -6552
13845 -6552 -9760 -15645 -8146 -10088 -13272 -10225 2821 13308 8260 9276 9489 9835 -237 -2388
13831 -2388 -997 -12811 -20935 -26204 -18625 -10955 -7300 2072 -68 -4468 -5206 -7521 -1763 -7462 1402
13816 1402 4700 6266 -6567 -19536 -23698 -15079 -18334 -23061 -28629 -11484 -12136 -28493 -28754 -18172
13802 -18172 -19859 -33906 -46483 -59686 -56244 -51832 -43746 -34407 -22304 -11059 -12779 -12934 -14585
13789 -14585 -13101 -14513 -23408 -29828 -23093 -16177 -15844 -13175 -30908 -50010 -35656 -18595 -9287 -9279
13775i279j1036p661n591o15j264k362P540j494K648M866j2169P88J4860O21n296
13760b5444j594O021N204n713q457k675J7355K0104j4906P508j1845j4500n445
13747c4387O110J8848L502j2167j3611l023l193J016N273L83j272j911M993J6073
13733a3366n878N889J2807j134j148M847j714m957n200J102j3335j884L494J4297
13719f180L956o8j324o568k228m170k071N986L684O970P55j034N736O061j5764
13704f259q738p728J0555q162l096O986L299K629O583J1450Q731l392k301k932
13690G625j1792j2001M385J162J2602p80m156m421j0121K962O736m607P579N213
13676C86L014j658q32K979O602k198j1734p007j1791k2791o99O519J1567N204
$$ plain form
13775 -9279 -20315 -27976 -33567 -34182 -35446 -37808 -30268 -31762 -29114 -24248 -36417 -35629 -20769 -20148 -25444
13760 -25444 -27038 -21017 -15813 -21526 -29983 -32658 -15303 4801 -10105 -2597 -14442 -28942 -34387
13747 -34387 -28277 -9429 -5927 -18094 -31705 -34728 -37921 -36905 -31632 -31249 -32521 -34432 -29439 -13366
13733 -13366 -19244 -13355 -548 -1682 -2830 2017 303 -4654 -9854 -8752 -22087 -23971 -20477 -6180
13719 -6180 -2224 -2292 -3616 -10184 -12412 -16582 -18653 -12667 -8983 -2013 -1258 -2292 3444 9505 -6259
13704 -6259 -14997 -22725 -12170 -20332 -23428 -16442 -13143 -10514 -3931 7519 16250 12858 10557 7625
13690 7625 -4167 -16168 -11783 -10621 1981 1201 -2955 -7376 -17497 -14535 -7799 -12406 -4827 386
13676 386 3400 1742 910 3889 10491 8293 -3441 -10448 -22239 -45030 -45729 -39210 -27643 -22439
13662b2439m405Q709o346L779k714m472P35j328P595J1606j2130n102l30K3076
13648c766J2010k028j3826j3332M872O579K464j57J1614l485n379J324J51L049
13634I0k461j0999N233R836K769O96o990K326j3693k018l579K734J0553k872L712
13619d663m400j0393J548m613O045J0131O205n967j9030j0641J2705J1754K0512
13606I193j5544j3704O339L989r345O824k918j2824J0962M627j1952O341J7129
13593h83k033j093R222o00p54P787J303l271l969j3535J3908P478j4223j9469
13579b0132P744M950j2767O451K912O031Q647J0275r427m544R54M657j4124m484
13565a2857n60L445j980Q698k80o626j6170N580J3056r138j0144j2761M645j799
$$ plain form
13662 -22439 -26844 -18135 -24481 -20702 -23416 -27888 -27153 -28481 -20886 -9280 -21410 -26512 -26842 -3766
13648 -3766 8244 6216 -7610 -20942 -16070 -9491 -7027 -7184 4430 945 -4434 -3110 -2959 90
13634 90 -2371 -13370 -8137 1699 4468 5164 -1826 500 -13193 -15211 -18790 -16056 -5503 -8375 -4663
13619 -4663 -9063 -19456 -17908 -22521 -16476 -6345 -140 -6107 -25137 -35778 -23073 -11319 9193
13606 9193 -6351 -20055 -13716 -9727 -19072 -12248 -15166 -27990 -17028 -12401 -24353 -18012 -883
13593 -883 -2916 -4009 5213 4613 3859 11646 12949 9678 5709 -7826 6082 13560 -663 -20132
13579 -20132 -12388 -7438 -20205 -13754 -10842 -4811 3836 14111 4684 140 1094 5751 -8373 -12857
13565 -12857 -13417 -9972 -11952 -3254 -3534 -10160 -26330 -20750 -7694 -16832 -26976 -39737 -35092 -36891
13551c6891R740N631J302O343J371q773J929R530J8804P537R558J3771J472J5203
13537E6527L347O793L002J8393K7683L333k201O105O423q051r479j1463q364n799
13523H6249j4057j5654j2499j4168j0234q90p858J994j192j2493l664O588p273
13510e151o285J5558J4600K996O427L22j8192n495L405j1289j4511n852l894J1372
13496a5989J2572J0271o358l055o399J3731O895l842j4450q685j761J6071J374
13483C75r198L99R84N546M330n710n041p712J1274L999q167j6012M270J3936J517
13468e210q098L169l426j2401M974J6826K371j3877J705Q316K792K131m542J909
13454c361J0893n160o9o455l180k1915n059M238Q855J3339K858M425n543r120
$$ plain form
13551 -36891 -27151 -21520 -20218 -13875 -12504 -21277 -19348 -9818 8986 16523 26081 39852 41324 56527
13537 56527 59874 66667 69669 88062 115745 119078 116877 122982 129405 121354 111875 100412 92048 86249
13523 86249 72192 56538 44039 29871 19637 18747 10889 12883 11691 -802 -4466 2122 -5151
13510 -5151 -11436 4122 18722 21718 28145 28467 10275 4780 8185 -3104 -17615 -23467 -27361 -15989
13496 -15989 -3417 6854 496 -2559 -8958 4773 11668 7826 -6624 -15309 -17070 -999 375
13483 375 -8823 -8424 -7440 -1894 2436 -3274 -8315 -16027 -4753 -754 -8921 -24933 -20663 -6727 -5210
13468 -5210 -13308 -10139 -13565 -25966 -20992 -4166 -1795 -15672 -13967 -5651 -2859 -728 -5270 -3361
13454 -3361 7532 2372 2303 -4152 -7332 -29247 -34306 -30068 -21213 -7874 -5016 -591 -6134 -15254
13440a5254n40O77l208J1016Q411j6741k071J2314O583j2586j3150k872J0925
13427a6496Q601l035n857K556p14M264J0050k430m587p595j059K813L46R227J2200
13412H284O128m403k0542L099p679l777p199O264J5694q592l056J3800J2717r307
13398A431J3515K469k729o364m794m532P228j2813j8077j997J537J5515j754J0420
13384i45J770J633n837K335j193J821J0058j1172m796j774l729Q718j180N138
13370H47J136N224N115L922K734m490j9700q76J6602j1889j2264K168j232R430
13356c273N104J0071R285J3862N009j8761o615N326j4810k673P069j2404r678
13343a2488M204Q506K553Q126j1527q799O328Q79j1476Q418K748J016L041l821
$$ plain form
13440 -15254 -15794 -15117 -18325 -7309 1102 -15639 -17710 -5396 1187 -11399 -24549 -27421 -16496
13427 -16496 -7895 -10930 -16787 -14231 -14945 -10681 -631 -3061 -7648 -15243 -16302 -13489 -13143 -3916 8284
13412 8284 14412 10009 -10533 -7434 -15113 -18890 -26089 -19825 -4131 -12723 -15779 -1979 10738 1431
13398 1431 14946 17415 14686 8322 3528 -1004 6224 -6589 -24666 -26663 -25126 -9611 -11365 -945
13384 -945 825 2458 -3379 -1044 -2237 -416 9642 -1530 -6326 -8100 -11829 -3111 -4291 847
13370 847 1983 7207 12322 16244 18978 14488 -5212 -6088 10514 -1375 -13639 -11471 -12703 -3273
13356 -3273 1831 11902 21187 35049 40058 21297 14682 20008 5198 2525 9594 -2810 -12488
13343 -12488 -8284 222 2775 10901 -626 -9425 -3097 -2218 -13694 -5276 -2528 -1512 1529 -2292
13329b292k053J2357J328j893N91J3304N312q500q694M854j451j2867J1538K130
13315A3664N115n752K615L128m713O301L483r97j1674L065l978j7308M123m463
13301g391L399O198j9344J577L165L645n195J774K242J3986J1717p057j3775n579
13287a0638L504Q921N570M769q804L941K695m523M31L35K991K85k526P806J1600
13272B6357P924K82m658j8202l464o171L556N027q667L340K1127R352n335j5822
13258A4646r723J9727M745j3482j2110N400j4636p839J4052J2302J3183l419j0081
13245A2765p774l782J8635Q358j5878j7227m566P748N058l561P20Q621k595P988
13231A4510N342L454p329M593J0491R88j5184q474o930k183o301J828j094q4L578
$$ plain form
13329 -2292 -4345 8012 9340 7447 8038 21342 26654 18154 9460 14314 12863 -4 11534 13664
13315 13664 18779 13027 15642 18770 14057 20358 23841 22844 11170 14235 10257 -7051 -2928 -7391
13301 -7391 -3992 2206 -17138 -15561 -12396 -8751 -13946 -12172 -9930 4056 15773 8716 -5059 -10638
13287 -10638 -7134 1787 7357 12126 3322 7263 9958 5435 5866 6201 9192 9477 6951 14757 26357
13272 26357 34281 34563 29905 11703 8239 2068 5624 10651 1984 5324 26451 35803 30468 14646
13258 14646 4923 24650 29395 15913 3803 9203 -5433 -13272 780 13082 26265 22846 12765
13245 12765 4991 1209 19844 28202 12324 -4903 -9469 -1721 3337 -224 496 9117 6522 14510
13231 14510 19852 23306 15977 20570 31061 32049 16865 8391 1461 -722 -7023 -5195 -6289 -6373 -2795
13216b795m348j566O926n609R06L363N153J269L749J1806J5157q134j2400m933
13202H544n628Q47J0489M343L22M95q845O059L544J388p26p53j0772M972J1814
13187B6093J3611q312n172L230P906k861q327j7146n583k379J8981R7p387J842
13173A4593N447j170L488J0041K048m541l464J598k476j3219j506J5480J6442
13160D2761j0161n896r571J2003l32l500J725Q518R388J046K044j1818r460J1519
13146C8266O764k755q748j7981O785R533M97m217j749m905j0597q177K473J2402
13132A7591L022l468J1135j945L776j162N625J2752P646j069J7539Q919k84O322
13118H6399J4935P950J5917J6801K2716K5277J6819L4824M6939O3319P6289J19036
$$ plain form
13216 -2795 -7143 -8709 -1783 -7392 -6486 -3123 2030 3299 7048 18854 34011 25877 13477 8544
13202 8544 2916 3763 14252 18595 18917 19412 10567 16626 20170 21558 20832 20079 9307 14279 26093
13187 26093 39704 31392 26220 29450 37356 34495 26168 9022 3439 1060 20041 20138 12751 14593
13173 14593 20040 18870 22358 32399 34447 29906 26442 28040 25564 12345 10839 26319 42761
13160 42761 32600 26704 17133 29136 28804 25304 27029 35547 44935 45981 48025 36207 26747 38266
13146 38266 45030 42275 33527 15546 22331 31864 32361 28144 26395 21490 10893 2716 5189 17591
13132 17591 20613 17145 28280 26335 30111 28949 34574 47326 54972 53903 71442 80361 80077 86399
13118 86399 101334 109284 125201 142002 164718 189995 206814 241638 288577 351896 428185 547221
13106E47221J26414J38147J26059J08808Q6336L4714k6469o9743r8821j14380
13096H58286j21102j10966j17112r6860p1207l7795l7661m2725l7275k5109p546
13085A52928k2312l509k844j3263k0176l464O001K276j7177j2467J6633J1104
13073I3730j4964j7618j0752K532J5991R375l888r328o503n243k647o200M595
13060D9080J1437k288N869O959o735r280R74j165m127o967m352N020J352N990
13046E1767j657J169J838J330r035q639j5017j0376Q638K888Q587P779m165o825
13032B8282m804O883K186K028Q004O152r817k947r442k140O245R11m695J064J5383
13017D3293M298l449j332m543l852K383k56k425K668P304J0959K043r005k468
$$ plain form
13106 547221 673635 811782 937841 1046649 1132985 1167699 1141230 1071487 972666 858286
13096 858286 737184 626218 509106 412246 341039 303244 265583 222858 185583 160474 152928
13085 152928 130616 127107 124263 111000 90824 87360 93361 95637 78460 65993 82626 93730
13073 93730 78766 61148 50396 52928 68919 78294 74406 65078 58575 53332 50685 44485 49080
13060 49080 60517 58229 64098 71057 64322 55042 56016 54851 50724 43757 39405 44425 45777 51767
13046 51767 50110 51279 53117 54447 45412 36773 21756 11380 20018 22906 31493 39272 35107 28282
13032 28282 23478 30361 32547 34575 42579 48731 38914 35967 26525 24385 30630 31541 26846 27910 43293
13017 43293 47591 44142 42810 38267 34415 36798 36542 34117 36785 44089 55048 57091 48086 45618
13003D5618J594q981j0191p193J5161K2073L187q343j1282O326J7254j4526P88
12990E1485J2795m021P186R527R22N464K510j4223j6456p403N8n66K721Q70M360
12975E5229l377l43M402K1784K445j0333j376m903K948O722M357o705R6L602K768
12960G7316P15n303r740O746M955o479j8722J2783J2780J2927j159j6139P969
12947G8649K110J93L256K0713K6265L6322J9626K8323L5930K7560K2667J0879
12935C12493J4827p099k5154k8324k6606j7878q805k786J592O797R785J1980J0115
12922B50937J7333k61q344k4269k9867j6263j4587k4605j9445l038m736q86L42
12909A22311j1187M834J4930o64j5812n27N330O317J2902M520m304m719j0294
$$ plain form
13003 45618 47212 38231 28040 20847 36008 58081 61268 52925 41643 47969 65223 50697 51485
12990 51485 64280 60259 67445 76972 77894 83358 85868 71645 55189 47786 47844 47278 49999 50869 55229
12975 55229 51852 51509 55911 77695 80140 69807 68431 63528 66476 73198 77555 70850 70946 74548 77316
12960 77316 78031 72728 62988 69734 74689 68210 49488 62271 75051 87978 86819 70680 78649
12947 78649 80759 80952 84208 104921 131186 167508 187134 215457 251387 278947 301614 312493
12935 312493 327320 320221 295067 266743 240137 222259 213454 210668 212260 219057 228842 240822 250937
12922 250937 268270 268009 259665 235396 205529 189266 174679 150074 130629 127591 122855 121969 122311
12909 122311 111124 115958 130888 130224 114412 113885 119215 125532 138434 142954 138650 133931 123637
12896A23637m850r72l893o463m706J384N570J178J2646J6478R886n800l010j2744
12882A28341j786q018Q363K9488m653p855j451j263J2273J6388J2513N214R510
12869A97064M09p493n169Q461J9375M618Q939J0712o495M7k030J1964J0261J1363
12855B62026J0866J2275N069K4749K9746K7465L3588L7040M3591P5025J10492
12844F71932J80547K54027L47003L97296L59462K36465O4977r7057k22240l00202
12834A892210l06691k89501k25733j74183j33793r2300p1136o1209l3943k5754
12824D77967k7406k0226j1864m408r397O176K1636K1900K4208O199k306p117J8246
12811D93608J6049k913M300J3762Q256p357l0798l0941p664j3707j9647j8008
$$ plain form
12896 123637 118787 117815 113922 107459 102753 104137 109707 110885 123531 140009 149895 144095 141085 128341
12882 128341 126555 118537 126900 156388 151735 143880 142429 141166 153439 169827 182340 187554 197064
12869 197064 197473 189980 184811 193272 212647 217265 226204 236916 230421 230468 228438 240402 250663 262026
12855 262026 272892 285167 290236 314985 344731 372196 405784 442824 486415 561440 671932
12844 671932 852479 1106506 1453509 1850805 2210267 2446732 2511709 2414652 2192412 1892210
12834 1892210 1585519 1296018 1070285 896102 762309 670009 598873 537664 503721 477967
12824 477967 450561 430335 418471 414063 404666 410842 432478 454378 478586 484785 482479 475362 493608
12811 493608 509657 506744 511044 524806 533062 525705 494907 463966 456302 442595 422948 404940
12799D04940k3788j3620M585K089Q36o661M571J5058J6174Q450m63l159N41J3883
12785D23436J0705l886J0552J3198P604J0273L873R601K2865J6003N07j0006J814
12772E16539L263K1246K0546l699q912p42N072j000J9804K1452J1450J2257K4713
12759F41989K6577K0973J5917J9004K6403K8601K1346J8629J6273K1318K6365
12748H83395J2546J3731M1232M1037L4570M3035M3028K5040L1148K5786L4204
12737A228752L9400M5796M1730N0984M1796N4717O7130N3796M6829N6975P8431
12726A806336O5372P7693R5502R7849J19557J22666J30513J53283J70317J93557
12716C032645K09995K24776K30365K60821K76637K96728L21839L58924M00903
$$ plain form
12799 404940 381152 367532 372117 374206 375042 368381 372952 388010 404184 412634 412171 409012 409553 423436
12785 423436 434141 430255 440807 454005 461609 471882 475755 485356 508221 524224 524731 514725 516539
12772 516539 519802 541048 561594 557895 548983 548241 553313 552313 572117 593569 605019 617276 641989
12759 641989 668566 689539 705456 724460 750863 779464 800810 819439 835712 857030 883395
12748 883395 895941 909672 950904 991941 1026511 1069546 1112574 1137614 1168762 1194548 1228752
12737 1228752 1268152 1313948 1355678 1406662 1448458 1503175 1570305 1624101 1670930 1727905 1806336
12726 1806336 1871708 1949401 2044903 2142752 2262309 2384975 2515488 2668771 2839088 3032645
12716 3032645 3242640 3467416 3697781 3958602 4235239 4531967 4853806 5212730 5613633
12707E613633M37226M90915N78984O95518Q32919J020006J233555J461768J672796
12698A4037320J859348K019232K193130K445500K854336L540060M670063O424709
12690D0043698R076759J2918141J8082011K4106100K9193491L0672573K7525264
12683A91618037K0956523J2173105J646102r292942j8341838k4020997k6310946
12676A48427044k5711871k2998924j9167882j5153346j1518331q546226o345703
12669C8984761m819971l806492l139489k705384k389143k134520j931482j740906
12661A6317374j531267j318462j139199r86185q57702p62463o71086n78740m98870
12652G973400m47918l84787l41894l18833k76548k42535k13100k13057j97524
$$ plain form
12707 5613633 6050859 6541774 7120758 7816276 8649195 9669201 10902756 12364524 14037320
12698 14037320 15896668 17915900 20109030 22554530 25408866 28948926 33618989 40043698
12690 40043698 49120457 62038598 80120609 104226709 133420200 164092773 191618037
12683 191618037 212574560 224747665 226393767 217100825 198758987 174737990 148427044
12676 148427044 122715173 99716249 80548367 65395021 53876690 45330464 38984761
12669 38984761 34164790 30358298 27218809 24513425 22124282 19989762 18058280 16317374
12661 16317374 14786107 13467645 12328446 11342261 10484559 9722096 9051010 8472270 7973400
12652 7973400 7525482 7140695 6798801 6479968 6203420 5960885 5747785 5534728 5337204
12643E337204j93723j87853j74700j69644j57257j44690j35008j48520j34827
12634C890982j38933j40085j25366j08523j20056j11498j09615j03913j03988
12625B829005r0335r4269q4861p1214o6697o5619o4408n7340m1992n0420o8259
12614B073591o3810p1214n8054m7080m8364n2391l7584l7931m3348m7079k9916
12603A536820k2614n1848m8145k6911k9613m0624l8062l8928j0047J3372L953
12592A247353l32k9448l7571m3071o4506n1721m2133l5229m0222l8260l1763j9891
12580H13206j7422r951j4562p743p211j1250j3662n973N917o237k382Q077M151
12567G34958m454n764J9255J8239N0016P2385P3641O8401Q5901Q8161N5291J6869
$$ plain form
12643 5337204 5143481 4955628 4780928 4611284 4454027 4309337 4174329 4025809 3890982
12634 3890982 3752049 3611964 3486598 3378075 3258019 3146521 3036906 2932993 2829005
12625 2829005 2738670 2644401 2559540 2488326 2421629 2356010 2291602 2234262 2192270 2141850 2073591
12614 2073591 2009781 1938567 1880513 1833433 1785069 1732678 1695094 1657163 1613815 1566736 1536820
12603 1536820 1514206 1462358 1414213 1387302 1357689 1317065 1279003 1240075 1230028 1243400 1247353
12592 1247353 1247021 1217573 1180002 1136931 1072425 1020704 978571 943342 903120 864860 833097 813206
12580 813206 795784 785833 771271 763528 756317 745067 731405 725432 731349 725112 722730 730807 734958
12567 734958 730504 724740 743995 762234 812250 884635 958276 1026677 1112578 1200739 1256030 1272899
12555A272899j0172n6877j04739j19439j27750r5692q0291o9932n6684l4832q744
12544E07747k2721m5147k4686j0325k0872j6778j2879j1087k777M379j6322j4523
12532C14009j3752l877K2j2618k005L402J2680j314j390l181j2162j82K542N05
12518B82679m079M124K0274L0957N0762M8110O7354J01817Q4645P948m0171p2095
12506E82325o3470p4530o9450o2742n5294m0169j7694l2567j3815n423j4129j949
12494A31093j2583n141l852K192O160K0255P105K759M538O26j5183j4893M937
12481A28013M884L722n841m983j3599n282k224p177m100L854j029j1468r966n930
12467F8874J788J4798m674j4413j1649o156k461J081m206l889J1987J6894l307
$$ plain form
12555 1272899 1262727 1205850 1101111 981672 853922 758230 677939 608007 551323 516491 507747
12544 507747 485026 439879 415193 404868 383996 367218 354339 343252 340475 344854 328532 314009
12532 314009 300257 296380 296402 283784 281779 285181 297861 296547 295157 291976 279814 279632 282174 282679
12518 282679 278600 282724 302998 333955 384717 432827 500181 601998 686643 694591 654420 582325
12506 582325 518855 444325 374875 312133 256839 216670 198976 166409 152594 147171 133042 131093
12494 131093 118510 113369 109517 111709 117869 138124 145229 147988 152526 153152 137969 123076 128013
12481 128013 132897 136619 130778 125795 112196 106914 104690 97513 93413 97267 96238 84770 74804 68874
12467 68874 70662 85460 80786 66373 54724 48568 46107 47188 42982 39093 51080 67974 64667
12454F4667o161Q339j4931O540J4942o148o476n287q049R775N496O349M531L074
12440G6661Q665j2598j3255J790J2145k982P127j0912j6419M474R43J670P814
12427F5123P930j0706j1262r550R791j009Q25P729O205l606r129l987p523j8236
12413B2595r257M620J2441O646j5799n048P107M896J5645n396j3565L451J832
12400C0168Q98p137n695P538l199K201M334r991j6761M257R229n086K462m703
12386H515j2670L233Q950k298J464L064K590j353o770Q94N636p89p34N428L987
12371A9147L966j884j2084m410O969Q918L559o462R341N459j434R991O826P451
12357E5353J2799P557O882J442o653n148L696r292j4858m784J672N996K70j751
$$ plain form
12454 64667 58506 66845 51914 58454 73396 67248 60772 55485 47436 57211 62707 69056 73587 76661
12440 76661 85326 72728 59473 61263 73408 70426 77553 66641 50222 54696 55639 57309 65123
12427 65123 73053 62347 51085 41535 51326 50317 51142 58871 65076 61470 52341 48354 40831 22595
12413 22595 13338 17958 30399 37045 21246 16198 23305 28201 43846 38450 24885 28336 30168
12400 30168 31066 23929 18234 25772 22573 24774 29108 19117 2356 6613 15842 10756 13218 8515
12386 8515 -4155 -922 8028 5730 7194 10258 12848 11495 4725 5619 11255 10466 9732 15160 19147
12371 19147 23113 21229 9145 4735 11704 20622 24181 17719 27060 32519 31085 41076 47902 55353
12357 55353 68152 75709 82591 84033 77380 72232 75928 66636 51778 46994 48666 54662 54932 53181
12343E3181j1203l623q113m534k702L384p085L040j077m735q380J2010J3431j3597
12329A9997r249R440q151p0L833N363m892K933R763O826r754J1829J2980K384
12315E3232m242j1291j6716l58O167n423K73m155n885l846n953m433J895p394
12301h129l046N722O602L903q72O145j0948p36J5215J6842k234j0071l158R167
12287B4402N080j198M80j125n338q636J181J3050N483O254O754P866P894L120
12273F5267K210K3059K3400J4375K7026J6060O871K3710K3155M5977P5127R4510
12261D40747J07539J45492J48047J40932J08983O5393R479m7049j02793j15605
12251I01165j24359j23511j10715q5402p3533n6355m9498k6941l267O72J782Q166
$$ plain form
12343 53181 41978 38355 30242 25708 23006 26390 19305 22345 21268 16533 8153 20163 33594 19997
12329 19997 10748 20188 12037 11967 15800 21163 16271 19204 28967 35793 26039 37868 50848 53232
12315 53232 48990 37699 20983 20625 26792 21369 21642 17487 11602 7756 1803 -2630 -735 -8129
12301 -8129 -11175 -5453 1149 5052 4180 10325 -623 -1359 13856 30698 28464 18393 15235 24402
12287 24402 29482 28284 28764 27639 22301 13665 14846 27896 33379 39633 46387 54253 62147 65267
12273 65267 67477 90536 113936 128311 155337 171397 178268 201978 225133 271110 346237 440747
12261 440747 548286 693778 841825 982757 1091740 1157133 1166612 1119563 1016770 901165
12251 901165 776806 653295 542580 457178 383645 327290 277792 250851 247584 248256 250038 258204
12239B58204j3729n704m321j1923j1399j5347k2500r884J2049J3606J8312p744
12227A99620j9263j0524q642k9284m4543j8524k480r988k484J070J249j0715j638
12214D3854q92j1080j6673l508j060m932M641j689N747o633m80l59l975o274K135
12199a178j576M879J6659R330r480m031j692k022p406n635K6978N843K666Q923
12185D2258j662L385M595N70j314j376j4468O049Q568l163p174j378J3175o932
12171D1133R92Q666k328J2583K5838M675N099L282J5033K5974K4009J6026J6577
12158A97559K0728K9334K3918M0486P1617J05162J45291J81568K03217K23308
12148A242188K30093K10540J54830P4780l5158j24477j80170k24782k35249k04416
$$ plain form
12239 258204 244475 238771 234450 222527 211128 195781 173281 163397 175446 189052 207364 199620
12227 199620 180357 169833 161191 131907 87364 68840 66360 56372 53888 54958 56207 45492 43854
12214 43854 42962 31882 15209 11701 10641 5709 10350 8661 14408 7775 7295 6936 2961 -3313 -1178
12199 -1178 -2754 2125 18784 28114 18634 14603 12911 10889 3483 -2152 24826 30669 33335 42258
12185 42258 40596 43981 48576 49146 47832 46456 31988 38037 46605 43442 36268 34890 48065 41133
12171 41133 42125 50791 48463 61046 86884 91559 96658 99940 114973 140947 164956 180982 197559
12158 197559 218287 247621 271539 312025 383642 488804 634095 815663 1018880 1242188
12148 1242188 1472281 1682821 1837651 1912431 1877273 1752796 1572626 1347844 1112595 908179
12138I08179j65703j44331j13485q0243p2104m1428k6513k0486j9574j4795j2433
12127A97084k4202j4406l967k0460l1239p825o018n559r528j2236J003J049n019
12114E8677m961J0575P402J426j5193j6839R79O417n247K980Q536p0k255q645
12100D3782j9980j118O453J3499J4293l333j0696j3104n881o576o760N773N279
12087B1631N428o008l887l288L70K608M960J0077j1432r579j657L586Q435J177
12073B2421j2308o262j2155l765l477j561J1213J2953k794l971L057r47j1991
12060i587P09J808q030l939k595J0380P72j993P781l950j8311M298r59k248L024
12045b2840K1865K319j2035N64M03R485J6063m202j4146j2591K823P802J1473
$$ plain form
12138 908179 742476 598145 484660 404417 332313 290885 264372 243886 224312 209517 197084
12127 197084 172882 158476 154509 134049 102810 94985 88967 83408 73880 61644 62647 63696 58677
12114 58677 53716 64291 71693 73119 57926 41087 42066 48483 43236 46216 54752 54682 52427 43782
12100 43782 23802 22684 29137 42636 56929 53596 42900 29796 23915 17339 10579 16352 21631
12087 21631 27059 21051 17164 13876 14246 16854 21814 31891 20459 10880 9223 12809 21244 22421
12073 22421 10113 3851 -8304 -12069 -15546 -17107 -5894 7059 4265 294 3351 2404 -9587
12060 -9587 -8878 -7070 -15100 -19039 -21634 -11254 -10482 -12475 -4694 -8644 -26955 -22657 -23616 -25864 -22840
12045 -22840 -975 1344 -10691 -10127 -9724 -239 15824 11622 -2524 -15115 -12292 -4490 6983
12032F983j65k713r483j259K43K750k456q689J1569l298l069L305p169M19J4160
12017A128P612k611M252N374n610j4539l101J0103L783J873j0348n381J2090R193
12003A3818m978k322K335K38j18k375r994n87J1338k87l592q597j1380j985j446
11988a9932L044O13Q969L995N590J550n733j6837j0064R385j378n812J1095L813
11974a1702L988J0634p464j7506q00R669J0243J1483j0922j6920l97r75o803q417
11960c5889M274O981j1619L749K0696Q372m042J982j327k786p708Q070K236L37
11946f674q903j5662j6058J3819J3305N313M882o89J1694J2115O85o464m972p093
11932d702p40j75l282r526L005L59q508q110J044Q208J0163M771J4391Q37o750
$$ plain form
12032 6983 6818 4105 -5378 -6637 -6394 -3644 -6100 -14789 -3220 -6518 -9587 -6282 -13451 -13032 1128
12017 1128 8740 6129 10381 15755 10145 -4394 -7495 2608 6391 8264 -2084 -7465 4625 13818
12003 13818 8840 6518 8853 9091 8973 6598 -3396 -3983 7355 7068 3476 -5121 -16501 -18486 -19932
11988 -19932 -16888 -16275 -7306 -3311 2279 3829 -1904 -18741 -28805 -19420 -20798 -26610 -15515 -11702
11974 -11702 -7714 2920 -4544 -22050 -22850 -13181 -2938 8545 -2377 -19297 -19694 -20669 -27472 -35889
11960 -35889 -31615 -24634 -36253 -32504 -11808 -3436 -7478 -5496 -6823 -9609 -17317 -9247 -7011 -6674
11946 -6674 -15577 -31239 -47297 -33478 -20173 -14860 -9978 -10667 1027 13142 13827 7363 2391 -4702
11932 -4702 -5442 -5617 -8899 -18425 -15420 -15061 -23569 -31679 -30635 -22427 -12264 -7493 6898 7735 985
11917I85m433K459J2599P7p558q69j369N538O436j4989j3332L116O490j020j0289
11902a6159P739J1196j0963j1491P659M505K873r380J0733j598j1217j420J4860
11889b663J4885M355j4163j1916p217j2439j0036R40J8531K631m19L854k259m124
11875b0040j724J8407J0304k178k108J409K559j4900p711m461J968N347N421J403
11861f304p426r661M51r312j59R463K702j2795j2512K915J1323J1459J1782l15
11847h389o625j3726J1822J0996L732J1392K170m035r766j843r964r115Q363M224
11833a0764j6580j0213N019M14J6503J3405Q52k1516o555K0191J0953q059N393
11820i57j1298J4109P284m4l196L822r341o627n785J1812J0437J6347n134l872
$$ plain form
11917 985 -3448 -989 11610 11687 4129 3260 1891 7429 13865 -1124 -14456 -11340 -4850 -5870 -16159
11902 -16159 -8420 2776 -8187 -19678 -12019 -7514 -4641 -14021 -3288 -4886 -16103 -17523 -2663
11889 -2663 12222 16577 2414 -9502 -16719 -29158 -39194 -38254 -19723 -17092 -17511 -13657 -15916 -20040
11875 -20040 -21764 -3357 6947 4769 2661 4070 6629 -8271 -15982 -20443 -18475 -13128 -7707 -6304
11861 -6304 -13730 -23391 -22940 -32252 -32411 -22948 -20246 -33041 -45553 -42638 -31315 -19856 -8074 -8389
11847 -8389 -15014 -28740 -16918 -5922 -2190 9202 11372 7337 -2429 -4272 -14236 -23351 -14988 -10764
11833 -10764 -27344 -37557 -32538 -32124 -15621 -2216 -1364 -22880 -29435 -9244 1709 -6350 -957
11820 -957 -12255 1854 9138 9094 5898 9720 379 -6248 -12033 -221 10216 26563 21429 17557
11806A7557l713R169O529L778j447k0730k5082q406p94k178O250L003M038J3310
11792A284Q259K627r5M14J4183J7016J4172R841K4705L9776M5791N7867L3130
11779B68970J24k7233m0034l4726n0690k8926k6209p832Q85J077J532n066M466
11766E6338j006J2935J3076J8395k192j815O539J3535L9899M5347M9822R542l2299
11753B28116m0473l2543k0197k1192j7498j8956k1044j7918q828k905J2279k34
11741C8607n182j1571j755k281m932N52L016q165m039M033J0774l058j9637j8105
11727b1743J5431J4470R644q748K131R653j0201J1577L704P913o034o093k474
11714A9230N934R781P858M4R119K2043L6715L6951L4212L9818K3194J3572j6862
$$ plain form
11806 17557 13844 23013 29542 33320 31873 11143 -13939 -22345 -23139 -25317 -19067 -16064 -12026 1284
11792 1284 9543 12170 12075 12489 26672 43688 57860 67701 92406 132182 177973 235840 268970
11779 268970 269094 241861 201827 167101 116411 87485 61276 53444 54329 55406 56938 51872 56338
11766 56338 55332 68267 81343 99738 97546 95731 102270 115805 155704 201051 250873 260415 228116
11753 228116 187643 155100 134903 113711 96213 77257 56213 38295 29467 26562 38841 38607
11741 38607 33425 21854 20099 17818 12886 13438 16454 8289 4250 8283 19057 15999 -3638 -21743
11727 -21743 -6312 8158 17802 9054 11185 20838 10637 22214 25918 33831 27797 21704 19230
11714 19230 25164 34945 42803 42847 51966 74009 110724 147675 181887 221705 244899 258471 241609
11701B41609k5164j6087k6801l6774l5351m5396n697J3089p804j1212j4442j0362
11689A9608k92j1597K075L597J961j778J888o342J0418L405q492L594J3578J6271
11675D7894M197q907N837o771j4822j6130o839K037Q345l602r073J427q106J854
11661b659R837j11m366R556P498j402j0J9428J9577j0272j715p741P971N878j117
11646E0352j4635j5277N184l938r484j1492r52J0220M688p499J490p09k527K43
11632E664k585j5401m882K1700K691o510o340O368m977j7230K822K550J327K3718
11618H915L523j1P983m502o098J353j253k329j954L324J3149M411o833J0192n415
11603B4455j0652n818o272m95M444J0495N342j6257k492M495K238k606r470N160
$$ plain form
11701 241609 216445 200358 173557 136783 101432 56036 50339 63428 55624 44412 29970 19608
11689 19608 19316 7719 9794 13391 15352 13574 15462 9120 19538 22943 14451 18045 31623 47894
11675 47894 52091 43184 49021 42250 27428 11298 4459 6496 14841 11239 2166 3593 -4513 -2659
11661 -2659 7178 7067 2701 12257 19755 18353 18343 37771 57348 47076 45361 37620 45591 51469 50352
11646 50352 35717 20440 25624 21686 12202 710 -242 9978 14666 7167 8657 7948 5421 5664
11632 5664 3079 -12322 -17204 4496 7187 677 -5663 705 -4272 -21502 -18680 -16130 -14803 8915
11618 8915 12438 12427 20410 15908 9810 11163 9910 7581 5627 8951 22100 26511 19678 29870 24455
11603 24455 13803 7985 1713 1218 5662 16157 21499 5242 2750 7245 9483 6877 -2593 2567
11589B567j1972R465J4101L134p328n427K626l605r355j0293N967J8089M797o050
11575F716j4759o889p068j866R963M52K189J432N927Q273k284l11J0595o261k313
11560C796J2891l009M104n107J389M436k377P718j0789j5727Q67k400q230N766
11546f672J8695M602J943P88k458q536M623j7777m539R289J9139Q889j52J7005
11532D4839J3431N106O451m773j4302m226q967m723o011o441j0810o625p274N028
11518G03R976L573q917l103R109M530j2149L421m492L336R43O756R023m00n715
11503A6594j0555m357n390J266N411P64J458J3630K355k707j524J4301L2976J6183
11489H0405J6121K4500M4369M2014K4569J7814j4473m2437l0976k6603k1766k3451
$$ plain form
11589 2567 -9405 60 14161 17295 9967 4540 7166 3561 -5794 -16087 -10120 7969 12766 6716
11575 6716 -8043 -14932 -22000 -23866 -13903 -13451 -11262 -9830 -3903 4370 2086 1775 12370 6109 3796
11560 3796 16687 13678 17782 12675 14064 18500 16123 23841 13052 -2675 -1808 -4208 -12438 -6672
11546 -6672 12023 16625 18568 19356 16898 8362 12985 -4792 -9331 -42 19097 27986 27834 44839
11532 44839 58270 63376 69827 65054 50752 46526 37559 32836 26825 20384 9574 2949 -4325 703
11518 703 10679 14252 5335 2232 11341 15871 3722 7143 2651 5987 6930 13686 22709 22309 16594
11503 16594 6039 1682 -3708 -2442 2969 3733 5191 18821 21176 18469 16945 31246 64222 80405
11489 80405 96526 121026 165395 207409 231978 249792 235319 192882 161906 135303 113537 90086
11477I0086k6673j7686o960o36k200j1713j4747K845l407L484m004M129N071q895
11463H694J1759J920J803k761o489o790q837O307Q531K285J1317J1273q385j3416
11449A7211J1766O187k1r998n291j0045p681K33J298J7813L398j3251j2438r240
11435a0059K263J1747J0273pP067P504K337J056k005j3908J946J2053o408O625
11421C0484K706p97l912n581K460q319Q273m71j0090j105q4j162N185L149M972
11406B5708O760o397j8152p325m695M994j1910n926l051J3023l750m349O094N895
11392c081M650Q440J6918M389J4647l715j8340j5760Q826J23p063j2011j2212
11379a4189J0858J5206N764P81l240o692l405m026l733J2153m604j1774K826J1667
$$ plain form
11477 90086 63413 45727 38767 38131 35931 24218 9471 12316 8909 12393 8389 12518 17589 8694
11463 8694 20453 22373 24176 21415 14926 8136 -701 5606 14137 16422 27739 39012 30627 17211
11449 17211 28977 35164 35143 25145 19854 9809 2128 2361 3659 21472 24870 11619 -819 -10059
11435 -10059 -7796 3951 14224 14217 21284 28788 31125 32181 30176 16268 18214 30267 23859 30484
11421 30484 33190 32393 28481 22900 25360 17041 25314 24843 14753 13648 13564 12402 17587 20736 25708
11406 25708 32468 26071 7919 594 -4101 893 -11017 -16943 -19994 -6971 -10721 -15070 -8976 -3081
11392 -3081 1569 10009 26927 31316 45963 42248 23908 8148 16974 17097 10034 -1977 -14189
11379 -14189 -3331 11875 17639 18420 15180 8488 5083 1057 -2676 9477 4873 -6901 -4075 7592
11365G592Q910r909m564N410J603j1388L183K2938N027L460J0617N149J1o506
11351D1533p809k2010o905J4278Q706k618R754J1406r249q065j3397l887J0068
11338B1805Q380j657N19p676l976m749J011K270L522j779M19m460p221l105K60
11323C563N268J0078N182m217K614Q422j4921o510J2839J234k961o469J537L342
11309A9001N381L25R688p608r028O192l211k7799p634J2472J5912R631R738N136
11295C8196l206J217L711O742n554L55M053n054p628L111k264r080m044l23K893
11280B3125p962K221J486K245j031k154j0626O707J0478K468m662k830P376R173
11266C6014O503q367R810J8535o180q315r946j1534k20j739J617J0310J4058P467
$$ plain form
11365 7592 16502 6593 2029 7439 9042 -2346 837 23775 28802 32262 42879 48028 48039 41533
11351 41533 33724 11714 4809 19087 27793 25175 34929 46335 37086 29021 15624 11737 21805
11338 21805 30185 28528 29047 21371 17395 12646 13657 15927 19449 17670 18089 13629 6408 3303 3563
11323 3563 8831 18909 24091 19874 22488 30910 15989 9479 22318 23552 20591 14122 15659 19001
11309 19001 24382 24707 34395 26787 17759 23951 20740 -7059 -14693 -2221 13691 23322 33060 38196
11295 38196 34990 36207 39918 46660 41106 41461 45514 40460 32832 35943 33679 24599 20555 20232 23125
11280 23125 15163 17384 18870 21115 20084 17930 7304 14011 24489 26957 22295 19465 26841 36014
11266 36014 42517 34150 43960 62495 56315 48000 38054 26520 26300 24561 26178 36488 50546 58013
11252E8013Q088m89r152Q56m786o264m734l19m67o823k295K371j64l98J147N137
11236C9721R162K1811J08J281n2o823J177j2707q485k040J1337M889r219r290
11222D0870Q65l763n104j3604m178m734L913J4294N457J164J4401N00j1442j0540
11208B8099k944n502K6040J3225j2535j1229o266j5412J393O791q01J1687o993
11195B5553l970N616j4754j3063K621J3008J9891q167J0648O361L735L613j18
11182E0974k333p074N217O959P322l058J1053J3563O446P502j1579k6759j2648
11169D5585K449K686N066J2186n41n481o323J940l424J1218K4k355P11n725N726
11154F3742Q079P553L538K363p13K122l658p635p976m210R732J918r012Q709O506
$$ plain form
11252 58013 66101 65612 56460 57316 52530 46266 41532 41213 40746 33923 31628 33999 33835 33437 34584 39721
11236 39721 48883 70694 70802 72083 72031 65208 66385 53678 45193 43153 54490 59379 50160 40870
11222 40870 41735 37972 32868 19264 15086 10352 14265 28559 34016 35180 49581 50081 38639 28099
11208 28099 25155 19653 45693 58918 46383 35154 28888 13476 14869 21660 20859 32546 25553
11195 25553 21583 27199 12445 -618 2003 15011 34902 26735 37383 43744 47479 51092 50974
11182 50974 48641 41567 46784 53743 61065 58007 69060 82623 89069 96571 84992 58233 45585
11169 45585 48034 50720 55786 67972 67431 61950 55627 57567 54143 65361 65385 63030 63741 58016 63742
11154 63742 71821 79374 82912 85275 84562 86684 83026 75391 67415 63205 72937 74855 65843 74552 81058
11139H1058p769j9820J1906m484j9912j2898n801P812o397k723J0422K229J966
11126C5589J0001L777l641J157L068O613m295k5761r394J0711l776M354J8255
11113D6658N931l190L31J1925J3583q141j3066o32P405O742L161k309k698q12
11099F4888n663k157j1446n284O00Q036Q272J0664P987r320j9969R006L728q739
11085E0603j664j3559j188J3856P336J075j176O84n085n76R717k872j2867R61
11071D5245J704j0142j5329L987L0415J9805l754o855O546R605j6264j9773K144
11058D7334M281m596J2469O610K525J1960J2410n201l022j3819k0075n738J0783
11045E5921M251J2365j1029q486j2190p806K616J4832J2232L746K67J2794j4203
$$ plain form
11139 81058 73289 53469 65375 60891 40979 28081 22280 30092 23695 20972 31394 33623 35589
11126 35589 45590 49367 45726 46883 49951 56564 52269 26508 17114 27825 24049 28403 46658
11113 46658 52589 49399 49730 61655 75238 67097 54031 53399 60804 67546 70707 68398 65700 64888
11099 64888 59225 57068 45622 40338 40938 48974 57246 67910 75897 66577 46608 55614 59342 50603
11085 50603 48939 35380 34192 48048 55384 56459 55283 55967 50882 50306 60023 57151 44284 45245
11071 45245 46949 36807 21478 25465 55880 75685 71931 65076 71622 81227 64963 45190 47334
11058 47334 51615 47019 59488 66098 68623 80583 92993 87792 84770 70951 50876 45138 55921
11045 55921 60172 72537 61508 53022 40832 33026 35642 50474 62706 66452 66719 79513 65310
11032F5310j4452o48J0617R606R488l709j3719j606q296l443j2298Q587R910j252
11018E4095l960J2553J329m447p672J1107K2055R895r158q551J5886l794j3682
11005G5656K898j3505n444j0956j1161o877p989L653J0534j0498K693N895K1507
10992E6406P444J2307m802m471p021N521O154J1379J3982Q320J6309J326J2401
10979A35255P876R368J2523J6383J0472J4723K3324L0021L8819O0850N6415Q1237
10967D97266J29779J87283K60071L50337M10452L41164J23379j16582k32864k76715
10957A673570k89495k81641k29489j81568j23269r5008o2965m2702l6718l3447
10947B97268k0329j2829k7242k0863o210j1000j2384o617k65q871m719j4042q297
$$ plain form
11032 65310 50858 50210 60827 70433 79921 76212 62493 60887 52591 49148 36850 45437 55347 54095
11018 54095 50135 62688 64017 59570 51898 63005 85060 94955 85797 77246 93132 89338 75656
11005 75656 78554 65049 59605 48649 37488 30611 22622 26275 36809 26311 29004 34899 56406
10992 56406 63850 76157 71355 66884 59863 65384 71538 82917 96899 105219 121528 122854 135255
10979 135255 143131 152499 165022 181405 191877 206600 229924 259945 298764 359614 416029 497266
10967 497266 627045 814328 1074399 1424736 1835188 2176352 2299731 2183149 1950285 1673570
10957 1673570 1384075 1102434 872945 691377 568108 473100 410135 367433 330715 297268
10947 297268 276939 264110 236868 216005 209795 198795 186411 179794 179529 170658 165939 151897 143600
10934A43600j1001J2149O261j147K436R131j4898j7189j0677K341N820M447m310
10921A26963j296J1560L675q936q196L964n808j1306q472l043r327k237P520J1766
10907A06827P231o608o806K699P121J810q85M115j1644K874j4491n004k867J1444
10893I5816O553j843K48Q332O254K420l879j7147J5916N849o554j922o774j3261
10879I0008J359n556L618O693J4487P680m748j2445j0221r28j241J423J4238J0587
10865A14954K854j2213k011Q538J2005J2234J0920J20m993p602j2749j0856N688
10852A16889J5860K6151J148r358q292n874K737Q490n704j3138j327m519j2623
10839A10440N183O170K905j2295j672L279O460L272k79J4505m358L663J0490m832
$$ plain form
10934 143600 132599 144748 151009 149862 152298 161429 146531 129342 118665 121006 126826 131273 126963
10921 126963 125667 137227 140902 131966 123770 127734 121926 110620 102148 99105 89778 87541 95061 106827
10907 106827 114058 107450 100644 103343 110464 112274 111389 115504 103860 106734 92243 87239 84372 95816
10893 95816 102369 100526 100774 109106 115360 117780 113901 96754 112670 118519 111965 110043 103269 90008
10879 90008 91367 85811 89429 96122 110609 118289 113541 101096 90875 89947 88706 90129 104367 114954
10865 114954 117808 105595 103584 112122 124127 136361 147281 147401 142408 134806 122057 111201 116889
10852 116889 132749 158900 160048 150690 142398 136524 139261 147751 142047 128909 127582 123063 110440
10839 110440 115623 121793 124698 112403 110731 114010 120470 123742 123463 137968 133610 137273 147763 142931
10825A42931k72K851k160P92Q200o209m860J8O676j4050p817J3511O002K927Q247
10810A56787M792l33O18J1323o458o888L5512L7119L7421N4412Q0874O2558O1666
10797E29403M9450n337k7774k3776k4596n5215o5911n6023k1711j5748k0202k4564
10785B37996j3802n155m464n119j2896M710q320j1929j5375J4103J8019N213J9236
10772B22217L2972K2264P685M729O883J7267Q772K9433K5220M2413O5752Q8258
10760E73865J24822K07295K84772M11310M78564K59396q7333k52643k67508k91118
10750A441422l09593k41345j77236j25377q6837o8557l4030j8774j1955j5188
10740C52530j4976j7701j443M654l579j1329r780L911J4764K5108N447P398n55
$$ plain form
10825 142931 142659 145510 143350 144142 152342 146133 141273 141291 147967 133917 126100 139611 145613 148540 156787
10810 156787 161579 161246 161864 173187 166729 159841 195353 232472 269893 324305 405179 467737 529403
10797 529403 578853 573516 545742 521966 497370 442155 376244 320221 298510 282762 262560 237996
10785 237996 224194 219039 214575 209456 196560 201270 192950 181021 165646 179749 197768 202981 222217
10772 222217 255189 277453 285138 289867 296750 314017 322789 352222 377442 419855 485607 573865
10760 573865 698687 905982 1190754 1602064 2080628 2340024 2252691 2000048 1732540 1441422
10750 1441422 1131829 890484 713248 587871 501034 432477 398447 379673 367718 352530
10740 352530 337554 319853 318410 323064 319485 308156 298376 302287 317051 342159 347606 355004 354449
10727C54449j691k0972k6562k6082p311P226K5284J1375n73n800M558j7884q963
10714B87054J5769K4548J7114N553L634K404q384k8025k1392j6894j1059r510
10702B60812K653J4386J3938Q916L596p890J1010J6124K9133J8583N791K681L734
10689C83467k40j9440L264J0609L946Q466J5339J8481J3260J955J5061L5734K0994
10676E10896Q359J7735L5383L1197K4949M1396N3796L8973K9857j2450l6368n6052
10664F87671o2788m0308k4366j3317j7413j0861q032r399k584K0777K3502K0789
10652E63671n901M260J6915K4018K8461J7752j0087k847J5906K2561R675K2367
10640G06751K6940J3609P303j4814L293J7756J8682M2382M1190P106m078R739
$$ plain form
10727 354449 352758 331786 305224 279142 271831 279057 304341 315716 315143 309343 313901 296017 287054
10714 287054 302823 327371 344485 350038 353672 356076 347692 319667 298275 281381 270322 260812
10702 260812 263465 277851 291789 300705 304301 296411 307421 323545 352678 371261 377052 379733 383467
10689 383467 383227 363787 367051 377660 381606 390072 405411 423892 437152 439107 454168 489902 510896
10676 510896 519255 536990 572373 603570 628519 669915 723711 762684 792541 780091 743723 687671
10664 687671 624883 584575 560209 546892 529479 518618 510586 501187 498603 519380 542882 563671
10652 563671 557770 562030 578945 602963 631424 649176 639089 636242 652148 674709 684384 706751
10640 706751 733691 747300 754603 739789 743082 760838 779520 821902 863092 870198 866120 875859
10628H75859J0559p139J7612K5868j41J0099L1882K7201K7612J7241L9050L6747
10616A112450L1471M1141N8215P7025P4769R1720J26703J84366K70303L45349
10606B413512L41056J79269j7407j01436j34685j57252j48045j15102l7693J273
10596B223490J4193K1469L5406M7801M8895P2356R3683R2482J00448J13108J14205
10585B977536J18498J54626J76751J67736J90514K27711K43516K70877L11408
10576D839173L36126L62306L74157L75035L99991M56937N04841N75794O46391
10567H870751P05044P77446R06989J084394J306448J535811J672941J688323J716890
10558B0265037J885566K201915K681223L424508M529085O099469Q322923J1442760
$$ plain form
10628 875859 886418 879279 896891 922759 922618 932717 964599 991800 1019412 1036653 1075703 1112450
10616 1112450 1143921 1185062 1243277 1320302 1395071 1486791 1613494 1797860 2068163 2413512
10606 2413512 2754568 2933837 2916430 2814994 2680309 2523057 2375012 2259910 2222217 2223490
10596 2223490 2237683 2259152 2294558 2342359 2391254 2463610 2557293 2649775 2750223 2863331 2977536
10585 2977536 3096034 3250660 3427411 3595147 3785661 4013372 4256888 4527765 4839173
10576 4839173 5175299 5537605 5911762 6286797 6686788 7143725 7648566 8224360 8870751
10567 8870751 9575795 10353241 11260230 12344624 13651072 15186883 16859824 18548147 20265037
10558 20265037 22150603 24352518 27033741 30458249 34987334 41086803 49409726 60852486
10550F0852486J5905769K2453744L2242208M6330238O4562243Q0392107P4519313
10543C97258108L4442419j4904506m2328667m9982239n5396288n7506963m9185439
10536A62396425l6950159k6556900j9013254j3796935j0287296p890799o166868
10529D1734214m878333l826444k942585k285276j970243j899373j868768j759340
10521B0303852j629645j492076j321251j152499r96825q67199p50069o75554n94654
10512A0824080n07967m47914l92732l70597l32553l11429k91140k79858k70862
10503G619028k74771k68545k53451k43089k32292k29402k09640j92293k04611
10494E510934k03150j72758j63757j64584j59640j56032j45707j26783j18538
$$ plain form
10550 60852486 76758255 99211999 131454207 177784445 242346688 322738795 397258108
10543 397258108 431700527 416796021 374467354 324485115 269088827 211581864 162396425
10536 162396425 125446266 98889366 79876112 66079177 55791881 47901082 41734214
10529 41734214 36855881 33029437 30086852 27801576 25831333 23931960 22063192 20303852
10521 20303852 18674207 17182131 15860880 14708381 13711556 12844357 12094288 11418734 10824080
10512 10824080 10316113 9868199 9475467 9104870 8772317 8460888 8169748 7889890 7619028
10503 7619028 7344257 7075712 6822261 6579172 6346880 6117478 5907838 5715545 5510934
10494 5510934 5307784 5135026 4971269 4806685 4647045 4491013 4345306 4218523 4099985
10485D099985j33584j37112j23081j07507j09517r1905o6020o3128o6784r8337
10475C103010q6158q9658r2072p3696o8433o6857o0133o2617o5372o2328p6932
10464B298754p2289o3349o5767n4082m0587o2628p8816p3191m9601n3790n6670
10453A627984l0037k2204l0292m5492m6860l7900n8130m5016k7512k4401l1246
10442A228894l5220l3665k7117m170p543j9508k1238k7462k4852p620j1109K187
10430A011577M551m063k3129k4069q407l2643l1056j5313K190L566k610q10O890
10417H86674K5158J6282l60j8946n2618m0924l4662n3479l7019l6285k5456k5493
10405F02872j6054j3658l1154j6110j6265j525q423j1817j1209r038k2035k4091
$$ plain form
10485 4099985 3966401 3829289 3706208 3598701 3489184 3397279 3331259 3268131 3201347 3103010
10475 3103010 3016852 2927194 2835122 2761426 2692993 2626136 2566003 2503386 2438014 2375686 2298754
10464 2298754 2226465 2163116 2097349 2043267 2002680 1940052 1861236 1788045 1738444 1684654 1627984
10453 1627984 1597947 1575743 1545451 1499959 1453099 1415199 1357069 1312053 1284541 1260140 1228894
10442 1228894 1193674 1160009 1132892 1128722 1121179 1101671 1080433 1052971 1028119 1020499 1009390 1011577
10430 1011577 1016128 1012065 988936 964867 956460 923817 892761 877448 879638 883204 880594 879784 886674
10417 886674 911832 928114 927754 908808 856190 815266 780604 727125 690106 653821 628365 602872
10405 602872 586818 573160 542006 525896 509631 508106 499683 487866 476657 467619 445584 421493
10393D21493Q000K5352R17q517k3353j0989L621J4485L914j338O319J8091N637
10380D63632l591m404J0869K7438M3924O1089J06801J28064J40141J36438J30727
10369A241128O3171j5027o3951q3396j04238j21264j30240j14136j05978j05824
10359D60245p0996n0994n8095l4471p296J5066J2194J243j944j17n111j4179q777
10346B36768j7379j2567J605p989l179o010R091J435m880j1008k5267q920P595
10333A59295L497J037N852o960P411o83j5436j5138j0839q84L670L819q966r682
10319A15993K926j065j4042m285J5338O009R338J6354J0588j869o272R378j180
10306A57211M153q947l102j0617j106j5601j5790J0849Q375J8771m17n971R20
$$ plain form
10393 421493 429493 454845 455762 447245 423892 412903 416524 431009 434923 433585 439904 457995 463632
10380 463632 460041 455637 466506 493944 537868 598957 705758 833822 973963 1110401 1241128
10369 1241128 1304299 1289272 1225321 1141925 1037687 916423 786183 672047 566069 460245
10359 460245 389249 338255 280160 245689 238393 253459 265653 266896 264952 264835 259724 245545 236768
10346 236768 219389 206822 208427 200438 197259 191249 200340 201775 196895 185887 160620 151700 159295
10333 159295 162792 163829 169681 162721 170132 169449 154013 138875 128036 127152 130822 134641 125675 115993
10319 115993 118919 117854 103812 99527 114865 120874 130212 146566 157154 155285 149013 158391 157211
10306 157211 161364 152417 149315 138698 137592 121991 106201 117050 125425 144196 143779 137808 138728
10293A38728q895n14O794J2598K5997j0367j0521o951j1769j8800N151K1111p215
10280A35347j3926k903r301j2316K187J0545O363r365J619j2172m767k801m314
10267H4196n479n425k156O441J10q480L648J0188o509n293R52N170o632j195M446
10252G3982j0269o140Q960o582j2394P142J3244r607j1721P532r265q971L153
10239C9064J1783j1261j8236r274J4110J8906M60l999J954L50k413j201O127N910
10225E2280P984R479P753L123n986n609J2290Q951R498L529Q99L154j1293J045
10211I7097J942K003n982j6654j963J6585J193q627M750P338q437o395j0460j857
10197G0533n703j393J374J160J019K2753J5935n860l23J6212r762Q569J5054J1445
$$ plain form
10293 138728 129833 129319 136113 148711 174708 164341 153820 146869 135100 116300 121451 142562 135347
10280 135347 121421 118518 109217 96901 99088 109633 115996 106631 108250 96078 91311 88510 84196
10267 84196 78717 73292 71136 77577 77687 69207 72855 83043 76534 71241 72193 77363 70731 69536 73982
10252 73982 63713 57573 66533 59951 47557 54699 67943 58336 46615 54147 44882 35911 39064
10239 39064 50847 39586 21350 12076 26186 45092 45552 41553 43507 43857 41444 40243 46370 52280
10225 52280 60264 69743 77496 80619 74633 69024 81314 90265 99763 103292 104191 107345 96052 97097
10211 97097 99039 101042 95060 78406 76443 93028 94221 85594 90344 97682 89245 82850 72390 70533
10197 70533 64830 63437 64811 65971 66990 89743 105678 99818 99495 115707 105945 114514 129568 141013
10183A41013J0081o04J90n39Q815K1815J5193J1415P066J0347J948J9462K5365
10170B71567L3584L6189K5725L6512K9979L2370N6929O8084P8046R4191J46095
10159I09271J87230K68570L93545N63245P92373J054185J232792J090386N53898
10150G045495j17950n89422q14482r12788r06564p97730o26971m60160l35301
10141A484127k39725j68510j24978r7574p8146m8780l5186k5209k5416j1225j3890
10130F15488j9438j1407J0055J9413M6953R3014J30410J73265K60562L60999M10246
10119B089560L07729O6127j55830k46311k79811l11254k90590k24006j71426j46586
10109F37602r9301n0334m5699k7442l4360k2035r370j7334k2798j4891p659j7612
$$ plain form
10183 141013 151094 150490 150680 150141 158956 180771 195964 207379 214445 224792 226740 246202 271567
10170 271567 305151 341340 367065 403577 433556 465926 522855 590939 668985 763176 909271
10159 909271 1096501 1365071 1758616 2321861 3114234 4168419 5401211 6491597 7045495
10150 7045495 6927545 6338123 5523641 4610853 3704289 2906559 2279588 1819428 1484127
10141 1484127 1244402 1075892 950914 853340 775194 726414 691228 666019 640603 629378 615488
10130 615488 596050 584643 594698 614111 661064 754078 884488 1057753 1318315 1679314 2089560
10119 2089560 2397289 2463416 2307586 2061275 1781464 1470210 1179620 955614 784188 637602
10109 637602 538301 487967 442268 414826 380466 358431 349061 331727 308929 294038 286379 268767
10097B68767j4906j0374L466n595j295n323p165J2101J0761K0250O093P987k901
10084B81866k768L320K460Q992J5731J5262J4191M6840N8725O9726J44191K32204
10072H90740L74951O08768P67657L96806k17825m25230l50082l86302m45724l31919
10062H81840k06144j40692q2126n9480n4433n2893l2356j0086j5238j0150r080
10051B09162o08k0263k0273k470M720j5882j8634O232q963j027J5734k166k612
10038A42950L890j1589j459o608j7579o700r47m510R442J749n504k764k085K857
10024A01143M560Q649m181J405N780m21q361j0108j0308k533j804q468K861J7480
10010I5694n24o232M019q632p314o93L713p862O449k034l562j2196j1279N54k99
$$ plain form
10097 268767 253861 243487 246953 241358 240063 234740 227575 239676 250437 270687 276780 284767 281866
10084 281866 279098 282418 284878 293870 309601 324863 339054 385894 444619 514345 658536 890740
10072 890740 1265691 1874459 2642116 3038922 2821097 2395867 2045785 1659483 1213759 881840
10062 881840 675696 535004 452878 393398 338965 286072 253716 243630 228392 218242 209162
10051 209162 208554 188291 168018 165548 170268 154386 135752 141984 133021 131994 147728 145562 142950
10038 142950 146840 135251 133792 127184 109605 102905 101958 97448 106890 108639 103135 100371 98286 101143
10024 101143 105703 114352 110171 111576 117356 116935 108574 98466 88158 85625 83821 75353 78214 95694
10010 95694 95170 88938 92957 84325 77011 76318 80031 72169 78618 76584 73022 60826 49547 50101 49802
9995D9802O70L595j2944M587L890j1746M001J1835P831Q523p802q04M427O14p630
9980E8849m260o15M129M919J4188k899Q820J378p49J105O119J3378K9422L8582
9966A72366K9365J429j2658n949P367o522j1778j1286k2831j8806j4540M753P873
9953A18783j0632k1491q013J832J072j3726k674k983L792p11p842K592J3687j567
9939G2119p910L876q056l784j2935k398N407l007j391J1270q064k147k738j0322
9925B9920N786N127j2283j442o711l728J0694O199N917K982j324k243q57n701
9911C2336p563N323M392J2494N702j0997j909r067L035K0992J5717J66m028j5284
9897E1309p326R225j799l340O87L564Q917O524j727m159P889Q908J050j4695j0886
$$ plain form
9995 49802 50472 54067 41123 45710 49600 37854 41855 53690 61521 70044 62242 61438 65865 66479 58849
9980 58849 54589 53974 58103 63022 77210 74311 83131 84509 83760 84865 90984 104362 133784 172366
9966 172366 201731 203160 190502 184553 191920 185398 173620 162334 139503 120697 106157 110910 118783
9953 118783 108151 86660 78647 80479 81551 67825 65151 62168 65960 65249 57407 59999 73686 72119
9939 72119 64209 68085 60029 56245 43310 40912 46319 43312 41921 53191 45127 42980 40242 29920
9925 29920 35706 40833 28550 27108 20397 16669 27363 33562 39479 42461 41137 38894 38037 32336
9911 32336 24773 30096 34488 46982 52684 41687 39778 30711 33746 54738 70455 70621 66593 51309
9897 51309 43983 53208 51409 48069 48756 52320 61237 67761 66034 61875 69764 78672 79722 65027 54141
9882E4141m255J1328k447K296Q479j5741j1781n030j716N784J4430M911J653P741
9868F9793M687L703o291N375J55j9111j751M364O140J76m269O062J7873J7948
9854A04854L386r980j0282o132q25l206q847O253L775r926q586j1864J4790J0797
9840G4207k159o12K276R409K882l394O658M250O501L653j2011j2681J0270P429
9826I6678j4565q381q01K391K784n351j2520M141J0264j0649L391Q923r575k352
9812F4378J0334j827M656Q880j2094o891n160J1328K253o524J8196J7751L619
9799A08899o391o742o540l2J2150J3172M275M590P08J1716R396N075J2349K3526
9785A86151L9379L5810K6728j4092k7888k7280k8011j3076o298j9772j4928j4174
$$ plain form
9882 54141 49886 61214 58767 61063 69542 53801 42020 36990 35274 41058 55488 60399 62052 69793
9868 69793 74480 78183 71892 77267 77422 58311 56560 60924 67064 67240 62971 69033 86906 104854
9854 104854 108240 98260 87978 81846 81021 77815 68968 75221 78996 69070 60484 48620 63410 74207
9840 74207 72048 71436 73712 83121 86003 82609 89267 93517 100018 103671 91660 78979 89249 96678
9826 96678 82113 73732 72931 75322 78106 72755 60235 64376 74640 63991 67382 76305 66730 64378
9812 64378 74712 72885 77541 86421 74327 67436 62276 73604 75857 69333 87529 105280 108899
9799 108899 102508 95766 89226 89194 101344 114516 118791 123381 124089 135805 145201 150276 162625 186151
9785 186151 225530 261340 288068 273976 246088 218808 190797 177721 171423 151651 136723 122549
9773A22549k3793j4766k847O711J2543J2007J45k806j2293k891N413o74k529Q148
9759A04917R540o422p583j1492l354R704L955O848L74Q010K213j3515j798j806
9745I9591p334J3814p530j4036k917J7087J2921J776j059j706q909p093N68R150
9731A04323R308R646j953j065Q136j9943p418J9093k487o521m004L352L479P888
9717A21834m952j2202J4829P691L985m617j1634n949L213j2166k555L892O434
9704A07803j6569k1412k207P936M456J2116r38p740L018j942O938J5535J725Q821
9690A17540j077k1196q230K5232J3159q362j3558r857J950j9050N461K0020J196
9677A03228M955j995k689J0747j734R435j4307j0908Q625M156P444O22N79J4278
$$ plain form
9773 122549 98756 83990 81143 87854 100397 112404 112549 109743 97450 94559 99972 99298 96769 104917
9759 104917 114457 108035 100452 88960 85606 95310 99265 106113 106487 114497 116710 103195 101397 99591
9745 99591 92257 106071 98541 84505 81588 98675 111596 113372 112313 110607 101698 94605 95173 104323
9731 104323 113631 123277 121324 120259 128395 108452 101034 120127 117640 111119 107115 110467 113946 121834
9717 121834 116882 104680 119509 127200 131185 126568 114934 108985 112198 100032 97477 101369 107803
9704 107803 91234 69822 67615 75551 80007 92123 91185 83445 86463 84521 91459 106994 108719 117540
9690 117540 116463 95267 87037 112269 125428 117066 103508 93651 95601 76551 82012 102032 103228
9677 103228 108183 106188 103499 114246 112512 121947 107640 96732 105357 109513 116957 117579 118158 132436
9663A32436j106M882N453l672j3658p726j647L64Q07j4883p219K0154J4753n970
9649A22968L044q081q866l312J766N423L118J3007J2044m593l940M183m897J678
9635A33542l29L630K802O879p473n108q409j2805J829r02N914p085K944P244l056
9620A19617J822k856Q637K394J0228O953r447j2563q517Q255J566l184J559N830
9606A30294O682Q247n244J475K837o142m543k509p286O170J1950p150p640n871
9592A21270Q600J0951M174L296l636j620J1444k093k8089m673J6618J6761j4145
9579A38858k838K640M10J5323N348j4520Q702N35o393K227k479K987j1264m448
9565A35088Q54P939L834O555k437o290Q251J6939q18p209M90q289j3240Q470K1572
$$ plain form
9663 132436 131330 136212 141665 137993 124335 116609 114962 115326 116133 101250 94031 114185 128938 122968
9649 122968 126012 117931 109065 105753 107519 112942 116060 129067 141111 136518 132578 136761 131864 133542
9635 133542 133213 136843 139645 146524 139051 133943 125534 112729 114558 113656 119570 112485 115429 122673 119617
9620 119617 121439 118583 127220 129614 139842 146795 137348 124785 116268 124523 126089 122905 124464 130294
9606 130294 136976 145223 139979 141454 144291 138149 133606 131097 123811 129981 141931 134781 127141 121270
9592 121270 129870 140821 144995 148291 144655 143035 154479 152386 124297 119624 136242 153003 138858
9579 138858 136020 138660 139070 154393 159741 145221 153923 154458 148065 150292 147813 150800 139536 135088
9565 135088 135942 143881 147715 154270 151833 145543 153794 170733 169915 162706 163196 154907 141667 150137 171709
9550A71709Q807o371j472q065j514M027n762p34o399N100q701L251N861j4925
9536A44812p004M916K1636M080q386O187J2862j980m194L471K689j286J235J645
9522A80683o280j2782o987K556J442K611Q103R18m988o072o216J0405J1561R555
9508A84509L361l054J695J4547M107j1625m418l8j23j0700K144l625R364J374
9494A87518L155j927L037Q065q298K740Q39q937l652R984K944k771j1693J0197
9480A91201J153j3163r820o42J5948J2296m888j3697j5822J4015J8035Q615j1911
9467A91320M756J3839J0717O497l3q824k376J2106o959j7104j860J9630J4924
9454B36633n00j023R007j0738o026M391l416J0928J5658k695k5633q087R808R185
$$ plain form
9550 171709 180516 174145 172673 164608 163094 167121 161359 160625 154226 159326 150625 153876 159737 144812
9536 144812 137808 142724 164360 168440 160054 166241 179103 177123 172929 176400 179089 177803 179038 180683
9522 180683 174403 161621 154634 157190 158632 161243 169346 170264 165276 159204 152988 163393 174954 184509
9508 184509 187870 184816 186511 201058 205165 193540 189122 189084 188961 178261 180405 176780 186144 187518
9494 187518 190673 188746 191783 199848 191550 194290 195129 186192 182540 192524 195468 192697 181004 191201
9480 191201 192354 179191 169371 168729 184677 196973 192085 178388 162566 176581 194616 203231 191320
9467 191320 196076 209915 220632 227129 227096 218272 215896 228002 221043 203939 202079 221709 236633
9454 236633 236133 235110 244117 233379 227353 231744 228328 239256 254914 252219 226586 218499 228307 237492
9440B37492j442j987q077K626N945N919p16l855N037J1320n56Q06M763p139kJ3155
9424B63289J5648n297j8626P849O096N452O1k0784o183Q815M149L024N037l90
9410B68140M94n148n733M109L12n514j2502R190J4822j989p609m804k182J0134
9396B61720K321J3274n71m19j8061l297J6484L308j1060L65J2510R491l432j5747
9382B66886J2860J0664k458l744j2542J339M38J780O210P278l76J2889P133j0632
9368B97725K612P496p492p236J724P632J3179P003j3877j0555J869R249Q420l309
9354C14440J0262q873p876L120m370M054L675J8009M318l164K174l972k853O537
9340C35481J2703j0009r728P7q855K29Q492q32l399J4089N933k720O235j104r343
$$ plain form
9440 237492 236050 234063 225986 228612 234557 240476 239760 235905 240942 252262 251706 252512 257275 250136 250134 263289
9424 263289 278937 273640 255014 262863 268959 274411 274472 253688 247505 256320 260469 263493 268530 268140
9410 268140 268634 263486 257753 261862 262174 256660 244158 253348 268170 266181 258572 253768 251586 261720
9396 261720 264041 277315 276744 276325 258264 254967 271451 274759 263699 264064 276574 286065 282633 266886
9382 266886 279746 290410 287952 284208 271666 273005 273443 275223 281433 288711 288335 301224 308357 297725
9368 297725 300337 307833 300341 293105 294829 302461 315640 322643 308766 298211 300080 309329 317749 314440
9354 314440 324702 315829 307953 311073 306703 310757 314432 332441 336759 333595 335769 331797 328944 335481
9340 335481 348184 338175 328447 328524 319669 319898 328390 327558 324159 338248 344181 341461 347696 346592 337249
9325C37249M480l814o194J1853n9j6585j467K7539R511j5112m510J0671j0046
9312C43516L721J0449Q580P258m183J497J9970O000o153O532l023r974J3453o75
9298C96968m558p190j009N823M579J724l895P712M573K823j115j513K48m948p965
9283C92257N829J942l129J189R228n896j981J2957j932j3311P72K168J0509J6265
9269D26867P751j513n101M935Q552R62L943J543j0111J1998p78j765J80J097R295
9254D57855J4424K84L487k345j3326j2269R169R283L918J830J5553O729o822O761
9240D94531J127R929j26j0976P28m512n06O828J3674n2l003m372Q154K214O858
9225E20496Q345l157j343J0254J079n126k289J637J2764P847k534p025M904J71
$$ plain form
9325 337249 341729 337915 331721 343574 343515 326930 325463 353002 362513 347401 342891 353562 343516
9312 343516 347237 357686 366266 373524 369341 370838 390808 396808 390655 397187 394164 384190 397643 396968
9298 396968 392410 385220 384211 390034 394613 396337 392442 400154 404727 407550 406435 404922 405170 400222 392257
9283 392257 398086 400028 396899 398088 407316 401420 399439 412396 410464 397153 397925 400093 410602 426867
9269 426867 434618 433105 428004 432939 441491 442453 446396 447939 437828 449826 449048 447283 447463 448560 457855
9254 457855 472279 472563 476050 473705 460379 448110 457279 466562 470480 472310 487863 494592 487770 494531
9240 494531 495658 505587 505461 494485 495213 490701 490195 497023 510697 510645 507642 503270 511424 513638 520496
9225 520496 528841 525684 524341 534595 535674 530548 528259 529896 542660 550507 547973 540948 545852 546023
9211E46023j698J5598R140l912J0531J3067K479p059p671j81Q572L084M13P486
9197E95872K0345n996l748p969K502n25O728J6043J2838j064l259Q027m120q560
9183F27114J4511n953p700M480J4407j383O540j074P398M54L818J514J5092k17
9169F79001p996j1563J365Q591K354R742J7306J3144J0463j1893o144p541j1593
9156F85236K0485K3250m365L846M464R832M97O676o265o04q84P101O291q008L775
9141G51327L69J2075M116P78O723Q369L440n669J0380K0005O106J964J8083K1269
9127H59335N24m490j4K610J9629M982r195N790n656N956j0660J0390J2972J7862
9113I10035O007p638Q319Q960M427M295M448M196K393j364O455J0534J4163L60
$$ plain form
9211 546023 544325 559923 569063 565151 575682 588749 591228 584169 576498 576317 584889 587973 588386 595872
9197 595872 616217 610221 606473 598504 601006 600481 607209 623252 636090 635026 631767 639794 635674 627114
9183 627114 641625 635672 627972 632452 646859 645476 652016 650942 658340 658794 662612 664126 679218 679001
9169 679001 671005 659442 660807 669398 671752 681494 698800 711944 722407 710514 704370 696829 685236
9156 685236 705721 728971 724606 728452 732916 742748 743245 749921 743656 743052 742168 749269 755560 747552 751327
9141 751327 751696 763771 767887 768665 775388 783757 787197 781528 791908 811913 818019 819983 838066 859335
9127 859335 859859 855369 855355 857965 877594 882576 873381 879171 873515 879471 868811 879201 892173 910035
9113 910035 916042 908404 916723 925683 930110 934405 938853 943049 945442 944078 950533 961067 975230 975590
9099I75590R608o413P476J5251J052J0906M588J6243O878m465R475J4473l961
9086A056701j619J3226K568j1867R27J7549N219p335L925O477R383J3351J0384
9073A118889R846N302Q724J9097R294J3060O469K798L334m45N47J2513J954P668
9059A219050J4328m492K4437L2809q435j1218J20R269J9629P918M448N666l83
9046A313146J4347J0569P409J0593M538K2335J5225l942l548M222R903J8451J5207
9033A438455J0881J2135R233J6858R927k604M232J1375k169J1088L6116O169j975
9020A559721J0096J526P937N785K152l20J6541K3697J1374P231P499K3736K8993
9007A705968P840N362J5082J223J355J2469J1641J5519K5198K9805R473J4969
$$ plain form
9099 975590 985198 978785 986261 1001512 1002564 1013470 1018058 1034301 1041179 1036714 1046189 1060662 1056701
9086 1056701 1055082 1068308 1070876 1059009 1059936 1077485 1082704 1075369 1079294 1085771 1095154 1108505 1118889
9073 1118889 1128735 1134037 1142761 1161858 1171152 1184212 1190681 1193479 1196813 1196368 1196915 1209428 1211382 1219050
9059 1219050 1233378 1228886 1253323 1286132 1277697 1266479 1266599 1275868 1295497 1303415 1307863 1313529 1313146
9046 1313146 1327493 1338062 1345471 1356064 1360602 1382937 1398162 1394220 1390672 1394894 1404797 1423248 1438455
9033 1438455 1449336 1461471 1470704 1487562 1497489 1494885 1499117 1510492 1508323 1519411 1555527 1561696 1559721
9020 1559721 1569817 1571343 1579280 1585065 1587217 1586897 1603438 1627135 1638509 1645740 1653239 1676975 1705968
9007 1705968 1713808 1719170 1734252 1735475 1736830 1749299 1760940 1776459 1801657 1831462 1840935 1855904
8995A855904K5768J2660J0100O57K567M472J3422P39N611J1511K9435K2930J0363
8982B006139J8944J2604J3248J2084P093P618K1035K2443Q763J9272K2863J6471
8970B188577K744O631J4468K4465L680P54K6900M2241K5607N009J2657J0795J5090
8957B379618J2248J8166K883J6247J9054K3841K6766J5827P764J4293K4688L2550
8945B593945J6885J2229P445L098J0712J9848K7824J9897J3030K4083K3158L1838
8933B803992J4771M481K1785L1219L9370L0700K0534K8205L6799K9852K0062J5171
8921C096941K3197R243J1461P836J5811K2996K0321N659J595j830J5888Q746J9556
8908C257420J6875J7126J4273R152K3737K4506J4387J2248K1205J9913J7718K3107
$$ plain form
8995 1855904 1881672 1894332 1904432 1905089 1907656 1912128 1925550 1926289 1931900 1943411 1972846 1995776 2006139
8982 2006139 2025083 2037687 2050935 2063019 2070112 2077730 2098765 2121208 2129971 2149243 2172106 2188577
8970 2188577 2191321 2197952 2212420 2236885 2240565 2241319 2268219 2310460 2336067 2341076 2353733 2364528 2379618
8957 2379618 2391866 2410032 2412915 2429162 2448216 2472057 2498823 2514650 2522414 2536707 2561395 2593945
8945 2593945 2610830 2623059 2630504 2633602 2644314 2664162 2691986 2711883 2724913 2748996 2772154 2803992
8933 2803992 2818763 2823244 2845029 2876248 2915618 2946318 2966852 2995057 3031856 3061708 3081770 3096941
8921 3096941 3120138 3129381 3140842 3148678 3164489 3187485 3207806 3213465 3215060 3213230 3229118 3237864 3257420
8908 3257420 3274295 3291421 3305694 3314846 3338583 3363089 3377476 3389724 3410929 3430842 3448560 3471667
8896C471667K6991K8687J4053Q200J9741J7103J9220J6317J9252K2637J5445J6328
8884C695641J3269R932O920J4602R885J3639N394J4769J3188K1940L2851J6172
8872C868202o951K2830L5109J8674j128K2210J9898P232J9788J1116J7396R661
8860D044037L693O987K0760K6011J8228Q557J2060J9532J3033O539J5077K4815
8848D219329J4100J8557J2744l417j2004q540Q096K2567P96n62N653M892R980
8835D292191L39l183L85M236J8202O89r765J443J4842L377r293L381J0176M134
8821D331154J2344j363j2485n648J5584j898q096l200l25k250N200j2232k2585
8808D294200j7428l112l145R53O88l602j3059r051r611n860n002j3255j1824j562
$$ plain form
8896 3471667 3498658 3527345 3541398 3549598 3569339 3586442 3605662 3621979 3641231 3663868 3679313 3695641
8884 3695641 3708910 3718842 3725762 3740364 3750249 3763888 3769282 3784051 3797239 3819179 3852030 3868202
8872 3868202 3861251 3884081 3919190 3937864 3936736 3958946 3978844 3986076 4005864 4016980 4034376 4044037
8860 4044037 4047730 4054717 4075477 4101488 4119716 4128273 4140333 4159865 4172898 4179437 4194514 4219329
8848 4219329 4233429 4251986 4264730 4261313 4249309 4240769 4248865 4271432 4272228 4271666 4277319 4282211 4292191
8835 4292191 4292530 4289347 4289732 4293968 4312170 4312859 4303094 4304537 4319379 4322756 4313463 4316844 4327020 4331154
8821 4331154 4343498 4342135 4329650 4324002 4339586 4337688 4329592 4326392 4326067 4323817 4329017 4316785 4294200
8808 4294200 4276772 4273660 4270515 4271468 4272156 4268554 4255495 4246444 4236833 4230973 4225971 4212716 4200892 4199330
8794D199330M25o348q645j2033j0616j2870j0569l1550j2017j2599j2363j9885
8782D050260j1137r272j8673q981l323j2433k1051l5531n676l381q936k6041k9894
8769C855931p737k1851k3575L449n921l1318k6819j0348j8332j4877j7017k1298
8757C660287k0216l156n688q519k3030l0166j9728j0981k5866k9169k6308l1238
8745C426222j4222j4521q479l172j7373j6043j2335j3801j5708j3470j0041p092
8733C279965j906j4069k3033k4626l3064l8186k0528j2310j3203l0052k1495j3265
8721C034228j4313j5971k741q10j6496k1035j2801k920l3458l4618l2717k4744
8709B821604j1251j2223l1877j5119m187j0279j5724o732k1079j7289j4026j2299
$$ plain form
8794 4199330 4199755 4193407 4184762 4172729 4162113 4149243 4138674 4107124 4095107 4082508 4070145 4050260
8782 4050260 4039123 4029851 4011178 4002197 3998874 3986441 3965390 3929859 3924183 3920802 3911866 3885825 3855931
8769 3855931 3848194 3826343 3802768 3806217 3800296 3768978 3742159 3731811 3713479 3698602 3681585 3660287
8757 3660287 3640071 3636915 3631227 3622708 3599678 3569512 3549784 3538803 3512937 3483768 3457460 3426222
8745 3426222 3412000 3397479 3389000 3385828 3368455 3352412 3340077 3326276 3310568 3297098 3287057 3279965
8733 3279965 3278059 3263990 3240957 3216331 3183267 3145081 3124553 3112243 3099040 3068988 3047493 3034228
8721 3034228 3019915 3003944 3001203 3000393 2983897 2962862 2950061 2947141 2913683 2879065 2846348 2821604
8709 2821604 2810353 2798130 2766253 2751134 2746947 2736668 2720944 2714212 2693133 2675844 2661818 2649519
8697B649519J0215Q572j381k0817j8308j9533k5060k0692l1862k6242j6498k1676
8685B466237k4973k2923p061j1147k8710l8080j4730p053j5542k2636l2124r787
8673B231471J833M237n010l0652k4480P992K730L23j591P60O48j4788r201M591
8659B168863j8756R30m044l713j2297j0062p00q773k3015k6175l6897l6279l5346
8646A953736k3135k2098k1213k3692j9479l0487j8865k3537j2325k0957j5898
8635A722050j0144j3147l4230l2682q971n300K306P366p414j4837Q347j1419l938
8622A597987n420j9282r457l020j4280j7547l129r181k2651j1043j9537j3827
8610A449613p921j0829q034j5264q433m130j3154j4286j2717j121k1673j7553
$$ plain form
8697 2649519 2659734 2668306 2666925 2646108 2627800 2608267 2583207 2562515 2530653 2504411 2487913 2466237
8685 2466237 2441264 2418341 2411280 2400133 2371423 2333343 2318613 2311560 2296018 2273382 2241258 2231471
8673 2231471 2233304 2237541 2232531 2201879 2177399 2185391 2188121 2188444 2186853 2187613 2188261 2173473 2164272 2168863
8659 2168863 2150107 2151037 2146993 2143280 2130983 2120921 2120221 2111448 2088433 2062258 2025361 1989082 1953736
8646 1953736 1930601 1908503 1887290 1863598 1844119 1813632 1794767 1771230 1758905 1737948 1722050
8635 1722050 1711906 1698759 1664529 1631847 1622876 1617576 1619882 1627248 1619834 1604997 1613344 1601925 1597987
8622 1597987 1592567 1573285 1563828 1560808 1546528 1528981 1525852 1516671 1494020 1482977 1463440 1449613
8610 1449613 1441692 1430863 1422829 1407565 1399132 1395002 1381848 1367562 1354845 1353724 1332051 1314498
8598A314498N977n332j2390j1946r832j839j784l695k3264j9898n21j0714r452
8585A209808n347l589j4520r67j735L915j3614k2805M68m487J144P825m137j445
8571A150514m407j0716J95n78p079N456K3234J5296J1852l198r920j5571k5759
8558A129319l3710l223j6422j5990j7317j6359J524r964n814j622j0481q858k614
8545I88469n705j0033l163o276j8251j282P304j8099j3916j6075r522J370k774
8532H92047o114j3700j7888j119R054N280j0255k1600q509m145N154L593o579
8519H25219r342j0730m411o206j5150r359n439j2293J030L397j585K20K598j261
8505G56688j3681p452o413j799n22N512o972n850o255M145k288o667J851o197
$$ plain form
8598 1314498 1320475 1315143 1302753 1290807 1280975 1279136 1277352 1273657 1250393 1230495 1229974 1219260 1209808
8585 1209808 1204461 1200872 1186352 1185385 1183650 1187565 1173951 1151146 1151614 1147127 1148271 1156096 1151959 1150514
8571 1150514 1146107 1135391 1135586 1135008 1127929 1133385 1156619 1171915 1183767 1180569 1170649 1155078 1129319
8558 1129319 1095609 1092386 1075964 1059974 1042657 1026298 1027822 1017858 1012044 1010422 999941 991083 988469
8545 988469 982764 972731 969568 963292 945041 943759 951063 932964 919048 902973 893451 894821 892047
8532 892047 885933 872233 854345 853226 862280 867560 857305 835705 827196 823051 828205 831798 825219
8519 825219 815877 805147 800736 794530 779380 770021 764582 752289 753319 756716 755131 755351 757949 756688
8505 756688 743007 735555 729142 727343 726821 732333 725361 719511 713256 717401 715113 708446 710297 704100
8491G04100o733J137n153K98j2318J4220J2764K885N738K0574O443J5630j8231
8478G41354j5785p879k0666j5909k5874k2097n565l735p265l927M243j0488J174
8465F07581l329r901l061o088P421J3085M635n460j5050n338k423k474j0126j777
8451E67695j1587j2487k682k4622J2397J5895m321M340R277l002m609q401j5712
8438E22181l342K0909L87n595J2672K1011L269P207J2837N417l255n869j3829
8425E74000j6902k2159j0777l4647k9419j0285O841J7760O287K139p278k7907
8413D47653k4119J342J4355J9608K0772J4430J3287J5156J2849P390r117l184
8401E30422j4536j7756j2181k4380k9230j8794L605N384N792p687M96K530m056
$$ plain form
8491 704100 697367 698504 693351 693649 681331 695551 708315 711200 716938 737512 743955 759585 741354
8478 741354 725569 717690 697024 681115 655241 633144 627579 623844 616579 612652 616895 606407 607581
8465 607581 604252 594351 591290 585202 592623 605708 610343 604883 589833 584495 582072 579598 569472 567695
8451 567695 556108 543621 540939 516317 528714 544609 540288 544628 553905 550903 546294 537893 522181
8438 522181 518839 539748 540135 534540 547212 568223 571492 578699 591536 596953 593698 587829 574000
8425 574000 557098 534939 524162 489515 460096 449811 456652 474412 480699 482838 475560 447653
8413 447653 423534 424876 439231 458839 479611 494041 507328 522484 535333 542723 533606 530422
8401 530422 515886 498130 485949 461569 432339 413545 417150 422534 428326 420639 421135 423665 419609
8388D19609N256l344j1914m899R598O485p896r08l021J98N70j6936n6R141J3135
8373D15018q094j0196o323q456j6381q515J2148J1192R43k236o494o01J2591R31
8359C85527L813j116j6550r164L677n572L771m196q669p111n737n602K0511J6830
8345C70412j2769m984o980j3605Q4k258L338K148N242j3518j1281N954J3892o068
8331C29607L4m537R803K7339j3337k4283q899l0P842R256J536P698k139J889K0761
8316C62540m34P583K3053K3887K9922J0509k610k649j6960k8310j9667k5241j1524
8303C50099l360n033N958n491j7103j0586q242k825J419L638m149o760j507n239
8289B90819M51j2631k385k815N615j600P204j24O716J2989L204O777K970o982
$$ plain form
8388 419609 424865 421521 409607 404708 414306 420791 412895 411987 408966 409164 409734 392798 392742 401883 415018
8373 415018 406924 396728 390405 381949 365568 357053 369201 380393 381336 379100 372606 372005 384596 385527
8359 385527 389340 388224 371674 362510 366187 360615 364386 360190 351521 344410 338673 333071 353582 370412
8345 370412 357643 352659 345679 332074 332158 329900 333238 335386 340628 327110 315829 321783 335675 329607
8331 329607 329641 325104 334907 362246 348909 324626 315727 315697 323539 332795 334331 342029 339890 341779 362540
8316 362540 362106 369689 392742 416629 446551 457060 454450 451801 434841 406531 386864 361623 350099
8303 350099 346739 341706 347664 342173 325070 314484 306242 303417 304836 308474 304325 297565 296058 290819
8289 290819 291270 278639 276254 273439 279054 277454 284658 284534 291250 304239 307443 314220 317190 310208
8275C10208o157K1637M3835L7501L6175L0540K7876L292j3175l0427m0434m8580
8263C72291l5229j5870j6518o445j7174j3227q090r037p606p823O80M902K935
8250B43789p451o619Q004M081j5755o121P882J1373K650q019P425l663j687R155
8236B45044Q291j4245j1203N33k042R26m625N763p958j592K880J4740K483k78
8222B38717k3690j5999p304Q446n668M327O507J1146J2054j0772k54o611j1677
8209A99222j1144m015J5835J2516k791n737m07J1200j553o178k89j3021J324P333
8195B02295r287l165R406J483p368M0M765j167j7120j3258L772OJ4394p92N644
8180A89648J7648J1359j3411r293k760o37l68p121j0405q705Q669O3J7310p77
$$ plain form
8275 310208 304051 325688 369523 407024 443199 473739 501615 504907 491732 461305 420871 372291
8263 372291 337062 321192 304674 298229 281055 267828 259738 250701 243095 235272 235952 240854 243789
8250 243789 236338 229719 237723 241804 226049 219928 227810 239183 241833 233814 241239 237576 235889 245044
8236 245044 253335 239090 227887 228420 226378 227304 222679 228442 220484 218892 221772 236512 238995 238717
8222 238717 215027 199028 191724 200170 194502 198829 205336 216482 228536 217764 217510 210899 199222
8209 199222 188078 184063 199898 212414 209623 203886 203479 214679 213126 206948 206659 193638 194962 202295
8195 202295 193008 189843 199249 200732 193364 193404 198169 197002 179882 166624 170396 170402 184796 184004 189648
8180 189648 207296 218655 205244 195951 193191 192554 192186 185065 174660 165955 174624 174687 191997 191220
8166A91220r061r019l565J381q157m686L657J2744l12R25R461n468j7234n96J0151
8151A71441q979K108K0852p487l922k979j0381N774J7884R301J23o302j0645j5218
8137A61570k495k039j290l500J1408R59j746M208n779J832P641j0165R922K1397
8123A91923q636j4889m200p542P164R878m773o240N867k64n728q531O103J0343
8109A70475Q797k00k565N071j4026k2135O494J8961p860m166J2559O046R44j6365
8095A62030K620R359m728r790n811P221j2953m460J7376J0534J652p302l6M369
8081A70081j436N958P85r820O110k723j0065o639o962j186L57n072J248j2289
8067A28347J2068J854M33J1302K1316J2544q023P11J2076N623n803j2188K818
$$ plain form
8166 191220 182159 173140 169575 170956 162799 158113 161770 174514 174202 175127 184588 179120 161886 161290 171441
8151 171441 162462 164570 185422 177935 174013 171034 160653 166427 184311 193612 193735 187433 176788 161570
8137 161570 159075 157036 155746 152246 163654 164613 162867 167075 161296 163128 170769 160604 170526 191923
8123 191923 183287 168398 164198 156656 163820 173698 168925 162685 168552 168288 162560 154029 160132 170475
8109 170475 179272 179072 176507 181578 167552 145417 151911 170872 163012 158846 171405 177451 178395 162030
8095 162030 164650 174009 169281 159491 153680 160901 147948 143488 160864 171398 173050 165748 165712 170081
8081 170081 168645 174603 175388 165568 171678 168955 158890 152251 145289 144103 144460 139388 140636 128347
8067 128347 140415 142269 142702 154004 175320 187864 179841 180552 192628 198251 192448 180260 183078
8054A83078k497Q700O281J017k2961m989j0391j4826k999p64P928O2p795q262
8040A31582K731J311O469K701J9814L181j3628K12K679k002k748Q826j528o125
8026A53475P920J1971L000l658j8670j3997m079J0705J6597M945j615M725L678
8013A74997q346Q073j0961j8759K264L284J294m24L782r057j5861l959M50O866
7999A33643j0468K910K124L433L295j296o601n072M168M393J590m013o412o466
7985A15228J585J447O995k742K744O275J3446L333j6724j5701R33J1245K683K704
7971A33451j88J4807o26j8834n937r937p659n919O321N825o90r912K094M880P724
7956A15400n682M736P743n340K391k535o114j0164j1740p92l738q761J489J1627
$$ plain form
8054 183078 180581 189281 195562 196579 173618 168629 158238 143412 140413 139649 147577 147639 139844 131582
8040 131582 134313 135624 142093 144794 164608 167789 154161 154373 157052 155050 152302 161128 159600 153475
8026 153475 161395 173366 176366 172708 154038 140041 135962 146667 163264 168209 166594 171319 174997
8013 174997 166651 174724 163763 145004 147268 150552 151846 151422 155204 146147 130286 126327 126777 133643
7999 133643 123175 126085 128209 131642 134937 133641 127040 121968 126136 130529 132119 128106 121694 115228
7985 115228 116813 118260 125255 122513 125257 131532 144978 148311 131587 115886 116819 128064 130747 133451
7971 133451 133263 148070 147444 128610 122673 112736 105077 99158 105479 111304 110614 100702 102796 107676 115400
7956 115400 109718 114454 122197 116857 119248 116713 110599 100435 88695 87903 84165 75404 76893 88520
7942H8520O952n827K102J4663J764q968l848P395k984J833L914p71o911o99O620
7927A03755L055j1308m175n785j7460M292N960L252o821K970N26K609R423J0646
7913A00939l084j5370k5380J0J8509K1322n961m154J771j1143J148j1637K04o988
7899F0186J37P189J8915J3432l567p647q871j968j97P520K752O350k104r597M956
7884H7486m356m016j3600O380N72Q564N273n129q407k718R241L980n964q389L925
7869G2842n94l459R814J2605J122n675j6682j4757k84P633M311j254j0229j1935
7855D3458r445K390N914p39P374O421L910p112J721n355p21j948M634J755O799
7840E9056J0275K336l942j7933R177O093O07Q131n422j2285J9183K552k90O499
$$ plain form
7942 88520 95472 89645 91747 106410 108174 99206 95358 102753 99769 101602 105516 104745 97834 97135 103755
7927 103755 106810 95502 91327 85542 68082 72374 78334 81586 74765 77735 78261 80870 90293 100939
7913 100939 97855 82485 57105 57115 75624 96946 90985 86831 88602 77459 78607 66970 67174 60186
7899 60186 60323 67512 86427 99859 96292 88645 79774 77806 77609 85129 87881 94231 92127 82530 87486
7884 87486 83130 79114 65514 71894 72466 81030 86303 81174 72767 70049 79290 83270 77306 68917 72842
7869 72842 72248 68789 78603 91208 92330 86655 69973 55216 54932 62565 66876 65622 55393 43458
7855 43458 34013 36403 42317 41578 48952 55373 59283 52171 53892 48537 47816 45868 50502 52257 59056
7840 59056 69331 71667 67725 49792 58969 65062 65669 73800 68378 56093 75276 77828 77538 84037
7826H4037l379o735j2442r729J0656p97k370k306J118L261j745k449n075o750
7812D5295J146k518j475j321P019K120n417r919M494k023O147K98q948N841J3126
7797E3865j6165q367J7557L674J5027k21r019N82K584k552q869j2384K886l248
7783C5350l693J6600Q440J0268K106o661n580n067o983N807K151j956j3930j1757
7769B5095J1834J755p382j0899l29j924J4865R896j475L167k929J2566m65k573
7755E1202J0597j943j6588j0297o478J362j560n430O885N731K678k40J805J5158
7741E2882q044n911M415J0856q209j1276M583Q788r375l832R664p000K428k523
7727C7446l193q037P562j494j3985j5049J2139Q593J3358J0179o723r501j901
$$ plain form
7826 84037 80658 73923 61481 51752 62408 61611 59241 56935 58053 61314 59569 57120 52045 45295
7812 45295 46441 43923 42448 41127 48146 50266 44849 34930 39424 37401 43548 43846 34898 40739 53865
7797 53865 37700 29333 46890 50564 65591 65370 56351 56933 59517 56965 48096 35712 38598 35350
7783 35350 31657 48257 56697 66965 69071 62410 56830 51763 44780 50587 52738 50782 36852 25095
7769 25095 36929 38684 31302 20403 20074 18150 33015 42911 41436 44603 41674 54240 53775 51202
7755 51202 61799 59856 43268 32971 26493 27855 26295 20865 27750 33481 36159 35919 37724 52882
7741 52882 44838 38927 43342 54198 45989 34713 39296 48084 38709 34877 44541 37541 39969 37446
7727 37446 34253 26216 33778 32284 18299 3250 15389 23982 37340 47519 40796 31295 29394
7714B9394l269n984M479M705K565j313P0m561J8772J0725p288Q61M519j0412j5240
7699B8023q323R364R516M684j855n237L363o90k844J5013J063j3769k664P727
7685D3371L687M573l753n164j5244Q985J4756Q42l883j351j2811k348j6374J670
7671A6956J3850P292J550j731o210J228L988j0437q98l399k323n851m755J5543
7657B4803J3918N834O930L259q851q328n862l005R426N088n604m347Q04m879L275
7642C2461J3405J799m81o786m638N124P672p36k0969o558k687r719J1687N792
7628B5366J2336m105k647m007k478n598o561K228r677q271J2000N549o347j679
7614F109l413J862J536o899k26j336N516J5249r744o77L005J1870J2520k042n53
$$ plain form
7714 29394 26125 20141 24620 29325 31890 30577 30647 26086 44858 55583 48295 49156 53675 43263 28023
7699 28023 19700 29064 38580 43264 41409 36172 39535 38845 36001 51014 52077 38308 35644 43371
7685 43371 47058 51631 47878 42714 27470 36455 51211 52053 48170 46819 34008 31660 15286 16956
7671 16956 30806 38098 39648 37917 31707 32935 36923 26486 25588 22189 19866 14015 9260 24803
7657 24803 38721 44555 51485 54744 45893 37565 31703 28698 38124 43212 37608 33261 34065 29186 32461
7642 32461 45866 47665 47184 40398 35760 40884 48556 47820 26851 20293 17606 7887 19574 25366
7628 25366 37702 33597 30950 26943 24465 18867 12306 14534 4857 -3414 8586 14135 7788 6109
7614 6109 2696 4558 6094 -805 -1031 -2367 3149 18398 8654 7977 10982 22852 35372 33330 32777
7599C2777q929n734L647P995K278o24l436J1953m676k0211j2584K117l887P531
7585H217r04J1312J2510j503L203K392J2228O858p878j4308P871k334q091J545
7571C1118K519J7199J513j1198j1170r407l068L522P276r466l161l485j039J3619
7557B4772J2636M444m682o625K69J356l777L611j316o532m61q813n314J187J2367
7542B3122P286J0257l183j3011j4441N799J3225m892n265j0092j0796Q846K070
7529H925J4282l610o840r481M752L620N757J6208J288l518N211k0028j7306M1
7515f99k678P446J282N300m093L385J592J2683K378l281J959K172j0722q663j234
7500F827r642M965L108P550N486l42J751R936N51p889p868J3111J6345r663q959
$$ plain form
7599 32777 23848 18114 21761 29756 32034 31410 27974 39927 35251 15040 2456 4573 686 8217
7585 8217 7313 18625 31135 29632 32835 35227 47455 54313 46435 32127 39998 37664 29573 31118
7571 31118 33637 50836 52349 41151 29981 20574 17506 21028 28304 18838 15677 12192 11153 24772
7557 24772 37408 41852 37170 30545 30814 32170 28393 32004 30688 24156 23695 14882 9568 10755 23122
7542 23122 30408 40665 37482 24471 10030 15829 29054 24162 18897 8805 -1991 6855 8925
7529 8925 23207 19597 12757 3276 8028 11648 17405 33613 34901 31383 36594 16566 -740 -699
7515 -699 -3377 4069 5351 10651 6558 9943 11535 24218 26596 23315 25274 27446 16724 8061 6827
7500 6827 -2815 2150 5258 12808 18294 17952 19703 29639 30190 22301 14433 27544 43889 34226 25267
7485B5267j2572n712P993K2722J3739r208r388r05m65j3188l535L972n082p628
7471F010k393J5551J4607J987P033n517n191j03r961j489R944M776J1197J382
7457D7833o670J292O492P578r419j2354J08l949p356l111N272J644L089J703p876
7442B4276j0808R429J4809j2552j5057P682J203O572P481L362r082p389q28J1512
7428C0610l681o900j5480J0648K5438P423p378j2264j7325M989L050Q62r299j992
7414H701M295J323P44P601m927l61r452Q228R130o149N459m184j0893J1080m253
7399A6342q508P140J0833N190p000o69K876j2948j4475j590p982J3464M087q838
7385b078k650O396j3310l959K0012L797j3342R799J3259r648l220j0076m91O500
$$ plain form
7485 25267 12695 6983 14976 37698 51437 42229 32841 31936 31471 18283 14748 18720 13638 6010
7471 6010 3617 19168 33775 35762 42795 37278 32087 31984 22023 20534 30478 35254 46451 47833
7457 47833 41163 42455 48947 56525 47106 34752 34860 30911 23555 20444 25716 27360 30449 32152 24276
7442 24276 13468 22897 37706 25154 10097 17779 18982 25554 33035 36397 27315 19926 19098 30610
7428 30610 26929 20029 4549 15197 40635 48058 40680 28416 11091 16080 19130 19992 10693 8701
7414 8701 12996 14319 15063 22664 17737 17376 7924 16152 25282 19133 24592 20408 9515 20595 16342
7399 16342 7834 14974 25807 30997 23997 23328 26204 13256 -1219 -2809 -10791 2673 6760 -2078
7385 -2078 -4728 1668 -11642 -15601 4411 8208 -5134 4665 17924 8276 5056 -5020 -5511 989
7371I89J5422N053j2323j3575p823J2015k967n932j513r09k14J3105J3046R72
7357A5346K734L149L429r174o34O255j2586j1384R331K232J168j4032j2511m765
7343b1442J7431K5057O740o705j2068k0149l894J3011M559o732m818j0509L525
7330a5994M553M713K82o118p242N506P086k586N452J0217k906j1649J1998Q630
7316A1942k624l122k960m656m590m356O106R468N274k239p881O189J5036l956
7302A7631K664l763j1448r778L060R495J248p605K800J497J0719J2002j471j9585
7288G466r010J3586J372R897N669j0344J832R434K226q820j016L379Q658O33K601
7273C7563j697k659k1231p029k784P081J6501K587n313j215J769j221J035M033
$$ plain form
7371 989 16411 21464 9141 -4434 -12257 -242 -3209 -9141 -10654 -11563 -11777 1328 14374 15346
7357 15346 18080 21229 24658 15484 14850 21105 8519 -2865 6466 8698 9866 -4166 -16677 -21442
7343 -21442 -4011 21046 27786 21081 9013 -11136 -15030 -2019 2540 -4192 -9010 -19519 -15994
7330 -15994 -11441 -6728 -6446 -12564 -19806 -14300 -7214 -9800 -4348 5869 2963 -8686 3312 11942
7316 11942 9318 6196 3236 -1420 -6010 -10366 -4260 5208 10482 8243 362 6551 21587 17631
7302 17631 20295 16532 5084 -4694 -1634 7861 9109 1504 4304 5801 16520 28522 27051 7466
7288 7466 -1544 12042 13414 23311 28980 18636 20468 29902 32128 23308 22292 25671 34329 34962 37563
7273 37563 35866 33207 11976 4947 2163 9244 25745 28332 23019 21804 23573 22352 23387 27420
7259B7420q581q343L258q64l714p977N508L906m599o162O186j125p192q798K397
7244h680j450k609j516L062J8521j057k238m409j600K528P95O197K96j1363M425
7229I02J0954j6564M221P364M114r274m131l881K545k52j463k223k019J2078j076
7214A295L28j6271n289O026J2905P631k178j1444J0136j858k210n063k354P947
7200c99J8968l881j759J765Q76mr124k297M22K269q147M67J3347K752j6045m569
7184e359R716O442q367m47J1238J428n566j7124K40K0900P960P741j4824r152
7170D826Q108O075O930K679m949j3803J0300J603j0962n299p191P47O890M46j1129
7155d729K037K0571P149n767q848l995k3l523r191q75m876J2700J2438l913j6927
$$ plain form
7259 27420 18839 10496 13754 12890 9176 1199 6707 10613 6014 -148 6038 4913 -2279 -11077 -8680
7244 -8680 -10130 -12739 -14255 -11193 7328 6271 4033 -376 -1976 552 1347 7544 7840 -3523 902
7229 902 11856 -4708 -487 6877 10991 1717 -2414 -6295 -3750 -4002 -5465 -7688 -9707 2371 1295
7214 1295 1623 -14648 -19937 -13911 -1006 6625 4447 -6997 3139 1281 -929 -5992 -8346 -399
7200 -399 18569 14688 12929 14694 15570 15566 6442 4145 4567 6836 -1311 -844 12503 15255 -790 -5359
7184 -5359 4357 10799 2432 1985 13223 14651 9085 -8039 -7799 13101 21061 28802 13978 4826
7170 4826 12934 19009 25939 28618 23669 9866 20166 21769 10807 5508 -1683 -936 5954 6400 -4729
7155 -4729 -2692 17879 25028 19261 10413 6418 6395 2872 -6319 -7194 -12070 630 13068 9155 -7772
7140g772l818J2503J7238k495q111j1284j5387p081M022q028r441O460J9945K4755
7126A1506R534Q823k912J0381J0323m809j3160P077j447j5383j1868l665j0127
7113e727n252O949R838J0735n871k614j4928P076R716P2j6071j9919J4816J3719
7099B539r476j0057j2091m23J006j768J1742Q646N847n278M414k70K830j524M950
7084A087Q652r706j4489J3180J5360k710j5543P857j5268j5530J0636n088q367
7071b9929J2311J2049k010P374K3982J0271j6466j6393j814l637q704P720J199
7058d047P82J6467j5091j1109j297J847R014J7259j0639j2520N559P599J781N081
7044A0686r685j1984l719J1537l158R21r0k956o313M101K880O990M136J1934n54
$$ plain form
7140 -7772 -11590 913 18151 15656 7545 -3739 -19126 -26207 -22185 -30213 -39654 -33194 -13249 11506
7126 11506 21040 29863 26951 37332 47655 42846 29686 36763 35316 19933 8065 4400 -5727
7113 -5727 -10979 -4030 5808 16543 10672 8058 -6870 206 9922 9994 -6077 -25996 -11180 2539
7099 2539 -6937 -16994 -29085 -29508 -28502 -30270 -18528 -9882 -4035 -9313 -4899 -5169 -2339 -3863 1087
7084 1087 9739 33 -14456 -1276 14084 11374 -4169 3688 -11580 -27110 -16474 -21562 -29929
7071 -29929 -17618 -5569 -7579 -205 23777 34048 17582 1189 -625 -4262 -12966 -5246 -4047
7058 -4047 -3265 13202 -1889 -12998 -14295 -12448 -3434 13825 3186 -9334 -3775 3824 5605 10686
7044 10686 1001 -10983 -14702 -3165 -6323 -5402 -5492 -8448 -14761 -10660 -7780 -790 3346 15280 14726
7029A4726q851n387q702J841k016K217J0211n902O173J1476n251l790j936K491
7015G300m246p318K195J237K27P342L864Q23O606J5346p149j416P50p082J487
7000A9966M348n463k337m555j4224k430P461O750R144j3944K598R53L250n62o212
6985D743j7807M016J4004M059o566O565K656q299m877N320j6417O356Q272j0740
6971h715p606N553J7533K361l687K269o700o385J0933l729j0851K661J0325p834
6957c872L469O4J956q486j2771l293J4125l421n5L530Q697p175j67O477j1102
6942a2024m787L917P777K53M009O11j9566L345J0548K49m48N514P858j5037j0422
6927a8203M360M497N918r484n873K472N282J4382J0865L262R353R776k8348j8321
$$ plain form
7029 14726 5875 488 -8214 -6373 -8389 -6172 4039 -1863 4310 15786 10535 6745 4809 7300
7015 7300 3054 -4264 -2069 -832 -605 6737 10601 11424 18030 33376 26227 24811 25561 18479 19966
7000 19966 24314 18851 16514 11959 -2265 -4695 2766 9516 18660 4716 7314 8267 11517 10955 4743
6985 4743 -13064 -9048 4956 9015 2449 9014 11670 3371 -1506 3814 -12603 -6247 2025 -8715
6971 -8715 -16321 -10768 6765 9126 5439 7708 1008 -5377 5556 1827 -9024 -6363 3962 -3872
6957 -3872 -403 -339 1617 -6869 -19640 -22933 -8808 -12229 -12284 -8754 -57 -7232 -7399 -922 -12024
6942 -12024 -16811 -12894 -5117 -4864 -855 -244 -19810 -16465 -5917 -5668 -6116 -602 7256 -7781 -18203
6927 -18203 -13843 -9346 -3428 -12912 -18785 -16313 -11031 3351 14216 17478 26831 36607 8259 -10062
6913a0062K942Q054m063m514K020r733k505o432j780R264L738j52j153k588j18
6898a7082N93O318j2759Q578J836r928o664J2186J0040R876J1573r325j026j506
6884B710j924l536K41p793L140q857j1369K758j966n01L005K044N365j510k034
6869b0227J0140o48J816K169R846J0905r710j2752J2928j736l274J984R90L82
6855B813j0163P398M106O620j4461r634J427J382P851n072n993J032J393j1364
6841b2665r906O230J2914Q548L42N281k0485k307O833J6550O847m068K1907N278
6827C1299j0694j6258k245J1202m678n195p755N288J961K448m474m986R183K1375
6813B6471R041j2108q553j1215p321l309j263Q230J4163R814j239j262J52N961
$$ plain form
6913 -10062 -7120 934 -3129 -7643 -5623 -15356 -17861 -24293 -26073 -16809 -13071 -13223 -14376 -16964 -17082
6898 -17082 -16489 -10171 -22930 -14352 -12516 -22444 -29108 -16922 -6882 2994 14567 5242 4216 2710
6884 2710 786 -2750 -2509 -10302 -7162 -16019 -27388 -24630 -26596 -27097 -24092 -22048 -16683 -18193 -20227
6869 -20227 -10087 -10735 -8919 -6750 3096 14001 4291 -8461 4467 2731 -543 1441 2431 2813
6855 2813 -7350 48 4154 10774 -3687 -13321 -11894 -10512 -2661 -7733 -13726 -12694 -11301 -22665
6841 -22665 -32571 -26341 -13427 -4879 -4537 744 -19741 -22048 -15215 1335 8182 4114 26021 31299
6827 31299 20605 4347 2102 13304 8626 3431 -4324 964 2925 5373 899 -4087 5096 26471
6813 26471 35512 23404 14851 3636 -3685 -6994 -8257 -27 14136 23950 22711 21449 21601 27562
6799B7562P409J484L354Q393R503M242m122k148J1731J4928j6648k7493k3864
6786A4331j4630l351n734J829L541q885N39M213Q58J07O72J0029J637m093J1861
6771A2924J2535K16l160p385q699j8379p22L468l721l955J841j737J8231K0842
6757B2299O37l9811k6836J8062J9372O436j408N208l244p306J234Q276O513n293
6743D139j5072L573M506n921R444R302N175j1572j225l710Q843j6353o743l012
6729a8626k292J5399K555o719k440j521L579n12o887P068J156l049j861M917L213
6714f020J3041K447j1305L828N664m927n028l968r765n753K458k66k957n93o099
6699b9243O294J1142M495J5299P834n73p550q147J1889P183M693l263q727K182
$$ plain form
6799 27562 34971 36455 39809 48202 57705 61947 57825 55677 67408 82336 65688 38195 14331
6786 14331 -299 -3650 -9384 -7555 -4014 -12899 -12360 -8147 -7289 -7182 -6510 3519 5156 1063 12924
6771 12924 25459 25675 22515 15130 6431 -11948 -12670 -9202 -12923 -16878 -15037 -16774 1457 22299
6757 22299 22936 -16875 -43711 -25649 -6277 159 -1249 3959 715 -6591 -5357 2919 9432 4139
6743 4139 -10933 -7360 -2854 -8775 669 9971 15146 3574 2349 -1361 7482 -8871 -15614 -18626
6729 -18626 -20918 -5519 -2964 -9683 -12123 -13644 -10065 -10577 -17464 -10396 -9240 -12289 -14150 -9233 -6020
6714 -6020 7021 9468 -1837 1991 7655 2728 -2300 -6268 -16033 -21786 -19328 -19594 -22551 -23144 -29243
6699 -29243 -22949 -11807 -7312 7987 15821 15248 7698 -449 11440 18623 23316 20053 11326 13508
6685A3508J519n738n765p254J997J207p746M502K517J934J915j1695L161M277
6671a661O398k065M15K015m015O405J0716j4635r647J823o437j953K097n45L178
6656g911k726j645R648J4164k900j958n485j5743j393Q018M670q170J7449p462
6642a444j2065J3812J4470j51o815j0742j1030j4543j489K2421O778N01R082J0264
6628A9049j0961m484K411m753J968j5512K611j618N382J521k764O372Q337m278
6614C281p156R141k873r441P90q710j1685L283K926L685m316J3807j84l649q854
6599a9955K109O28j423N190N963n98K333l379l293Q08m687J7982J3049p796j690
6584E241L479m518j5663Q14P721N284N661l0j515L582k5353N104N112N190Q69
$$ plain form
6685 13508 15027 9289 3524 -3730 -1733 -526 -8272 -3770 -1253 681 2596 -9099 -5938 -1661
6671 -1661 4737 2672 3087 5102 1087 7492 18208 3573 -6074 -4251 -10688 -12641 -10544 -11089 -7911
6656 -7911 -10637 -12282 -2634 11530 8630 6672 1187 -14556 -15949 -7931 -3261 -11431 6018 -1444
6642 -1444 -13509 303 14773 14622 7807 -2935 -13965 -28508 -29997 -7576 -798 -297 8785 19049
6628 19049 8088 3604 6015 1262 3230 -12282 -9671 -11289 -5907 -4386 -7150 -778 7559 3281
6614 3281 -3875 5266 2393 -7048 -6258 -14968 -26653 -23370 -20444 -16759 -21075 -7268 -7452 -11101 -19955
6599 -19955 -17846 -17218 -18641 -13451 -7488 -8086 -5753 -9132 -12425 -11617 -16304 1678 14727 6931 5241
6584 5241 8720 4202 -11461 -10647 -2926 2358 8019 7989 6474 10056 -15297 -10193 -5081 109 978
6569I78o44o914m329l976K182J7058K486j3360m650m181L619j19P453p319p661
6554a9377j2040n124J3531K2862J2912j1495j494n462K54O902M167p650n095P05
6540f404j569K981N261K2465O61j1526j2886O111j467o767j906j1563k541N578
6526a3572J1502o799j3907r75L224K432j3531N372K7519K1181k546o256K502R88
6512A7134j6634n20K804J001J584N817q45j3406o078M138q53k46L018p338n266
6497a5690p991P54J1327J1793K833L920J9230R27j5049L74p355j4171j4330O488
6483a6940Q302k896K067J3225q615k815Q822l63r860J971K121m489j0145K29n534
6468b4920J0542N959J193m332J751j652O907N746K128j5088p358J0386L375j188
$$ plain form
6569 978 334 -6580 -10909 -14885 -12703 4355 6841 -6519 -11169 -15350 -11731 -11850 -4397 -11716 -19377
6554 -19377 -31417 -36541 -23010 -148 12764 1269 -225 -5687 -5433 1469 5636 -2014 -7109 -6404
6540 -6404 -7973 -4992 269 22734 23395 11869 -1017 5094 3627 -3140 -5046 -16609 -19150 -13572
6526 -13572 -2070 -8869 -22776 -23751 -20527 -18095 -31626 -26254 1265 22446 19900 13644 16146 17134
6512 17134 500 -20 2784 3785 5369 11186 10341 -3065 -9143 -5005 -5858 -6104 -3086 -10424 -15690
6497 -15690 -23681 -22927 -11600 193 3026 6946 26176 27103 12054 12428 5073 -9098 -23428 -16940
6483 -16940 -8638 -11534 -9467 3758 -4857 -7672 1150 787 -9073 -7102 -4981 -9470 -19615 -19386 -24920
6468 -24920 -14378 -8419 -7226 -11558 -9807 -11459 -4552 1194 3322 -11766 -19124 -8738 -5363 -6551
6454f551p658j3648R278L718k617p596O667R469J026L059N656m72j8454k0223
6440c8346k1037J2388K2868J2608J3737k962p023j0968K441O309N00o661L740
6427a2406O987m429n85p205P35R8N889K503R090K611m441j1016J0279o27o101
6412h618R88j992j0974k894k574J3114j896j1115m623J4299J9685q708j0820K619
6398a3509R912l391K945M380N508L448j5995m475j0905K791P307l136j476o488
6384b3084Q489o127P410j337m270r759L814j501N552J9747O453o102j6382j6211
6370c3308J718J1704L109P295m692L383Q283N893l221k2307l732J1591k0q321
6356b2625q3O662N573J411L275l566J2206K088q8j0722r43K389r021q851o621
$$ plain form
6454 -6551 -14209 -27857 -18579 -14861 -17478 -25074 -18407 -8938 -7912 -4853 803 331 -18123 -38346
6440 -38346 -59383 -46995 -24127 -11519 2218 -744 -7767 -18735 -16294 -9985 -9485 -16146 -12406
6427 -12406 -5419 -9848 -10433 -17638 -16903 -16805 -10916 -8413 677 3288 -1153 -12169 -1890 -2517 -8618
6412 -8618 -7630 -9622 -20596 -23490 -26064 -12950 -14846 -25961 -30584 -16285 3400 -5308 -16128 -13509
6398 -13509 -3597 -6988 -4043 337 5845 9293 -6702 -11177 -22082 -19291 -11984 -15120 -16596 -23084
6384 -23084 -14595 -20722 -13312 -14649 -18919 -28678 -24864 -26365 -20813 -1066 5387 -715 -17097 -33308
6370 -33308 -31590 -19886 -16777 -9482 -14174 -10791 -2508 3385 164 -22143 -25875 -14284 -14304 -22625
6356 -22625 -22708 -16046 -10473 -9062 -5787 -9353 2853 4941 4853 -5869 -6812 -4423 -13444 -22295 -28916
6341b8916O00K0290J4065n683r696q428J0511K0371J044r147j2416n52Q46K285
6327d826n427j6839R126Q397o007m665N272O952K460R367l511j3581m871K451
6313a5702q393J2293O356p168r321r583m666J8869K4665o30o117j10m503j1633
6299a5643k7185m568J2416k600Q165J8501K1794K9225N153J1087K1037r177k521
6286F5684m17j6557k1662k5610j6698l047m93M681O229j2144J392J0448J951o594
6272a2837r658j118o22J0963J1491j5557o520k726K621k937j015M159J5630p327
6258a5453j4690R082Q481J2634l508J384N086n310j1440j2140j644Q302j801J427
6244a9590K132N38l211J3906O264l775k470o066j626n26Q537l238P037J0948K232
$$ plain form
6341 -28916 -28316 -8026 6039 356 -9340 -17768 -7257 13114 14158 5011 -7405 -7957 -7111 -4826
6327 -4826 -10253 -27092 -17966 -9569 -15576 -20241 -14969 -8017 -5557 3810 299 -13282 -18153 -15702
6313 -15702 -24095 -11802 -5446 -12614 -21935 -31518 -36184 -17315 7350 6720 603 493 -4010 -15643
6299 -15643 -42828 -47396 -34980 -37580 -29415 -10914 10880 40105 45258 56345 77382 68205 65684
6286 65684 65267 48710 27048 1438 -15260 -18307 -18800 -14119 -7890 -20034 -18642 -8194 -6243 -12837
6272 -12837 -22495 -23613 -24235 -13272 -1781 -17338 -23858 -26584 -23963 -26900 -27915 -23756 -8126 -15453
6258 -15453 -30143 -21061 -12580 54 -3454 -2070 3016 -2294 -13734 -25874 -27518 -19216 -21017 -19590
6244 -19590 -17458 -16920 -20131 -6225 39 -3736 -6206 -12272 -13898 -14424 -5887 -9125 -2088 8860 11092
6229A1092q603j3093N256L260N179n980M328R027j240Q000k332L352j2798q124
6215b676n832M724o024j9164r91P494J3622N139J507L21J0232L566j8485p958
6201a4525n050j5565n822L138J4051K3995j802o501L476j0743j5013L82K0121
6188i858k815j3038K334K2831N383j0807K311K722J780m881j707J2280M449M451
6174A5435J4814j4245k0259j1562o746o512j517J5979o928j245J5638N028n728
6161g848n226J6360J2621j110l1j2472k2827k702M620N388K1174J339n507q315
6147d536j0837L809k528j3296o616K3992J4690m597k258l621n58k101K929O370
6133H42j480p873p803o89N830l8j718J072J4774n904j3120n062K209J103J3769
$$ plain form
6229 11092 2489 -10604 -5348 -2088 3091 -2889 1439 10466 9226 17226 14894 18246 5448 -2676
6215 -2676 -8508 -3784 -9808 -28972 -29963 -22469 -8847 -3708 -2201 -1880 8352 11918 -6567 -14525
6201 -14525 -19575 -35140 -40962 -37824 -23773 222 -1580 -8081 -4605 -15348 -30361 -29979 -9858
6188 -9858 -12673 -25711 -23377 -546 4837 -5970 -3659 -937 843 -4038 -5745 6535 10984 15435
6174 15435 30249 16004 -4255 -15817 -22563 -29075 -30592 -14613 -21541 -22786 -7148 -2120 -7848
6161 -7848 -13074 3286 15907 14797 14766 2294 -20533 -23235 -18615 -13227 7947 9286 3779 -4536
6147 -4536 -15373 -11564 -14092 -27388 -34004 -10012 4678 81 -2177 -5798 -6356 -8457 -5528 842
6133 842 -638 -8511 -16314 -17003 -11173 -11211 -12929 -11857 2917 -2987 -16107 -21169 -18960 -17857 -4088
6118d088J2955j0174P93j7476m427L036o106M642K4281M315j0311l223P805j0315
6104h293JJ3000o043m395J9117k934j2926o830o515R924P565K154M305q704j3929
6089a4503n77j675q472J1520J9439n915P934O739l262Q715o132j1929N90k996
6075e24O02M694O035j2129r941J771R855Q950o705r809O83j2972L583J5524O230
6060E847j1233j7550j2486J800J3155P338P920Q829j0192n090l936M775J5360
6047D537k051j784k935m619o081M266p046O212K138n53q91L880o460L146J72j767
6031i836M079J1600J1398R737l766j8892j1565n661L463l787p798p613J1912M891
6017a1838j511m249J3608R017j3296O042m654J663j877O72J253n806o171j122
$$ plain form
6118 -4088 8867 -1307 -514 -17990 -22417 -19381 -25487 -20845 3436 7751 -2560 -5783 2022 -8293
6104 -8293 -8292 4708 -1335 -5730 13387 10453 -2473 -9303 -15818 -5894 1671 3825 8130 -574 -14503
6089 -14503 -15080 -16755 -25227 -13707 5732 -183 7751 14490 11228 19943 13811 1882 2472 -524
6075 -524 78 4772 10807 -1322 -11263 -9492 363 9313 2608 -7201 -6518 -19490 -15907 -383 5847
6060 5847 -5386 -22936 -35422 -33622 -20467 -13129 -5209 3620 -6572 -11662 -15598 -10823 4537
6047 4537 2486 702 -2233 -6852 -12933 -8667 -15713 -9501 -7363 -7916 -8807 -4927 -11387 -8241 -8069 -9836
6031 -9836 -5757 5843 17241 26978 23212 4320 -7245 -12906 -9443 -13230 -21028 -28641 -16729 -11838
6017 -11838 -13349 -17598 -3990 5027 -8269 -2227 -6881 -5218 -7095 -6423 -5170 -10976 -17147 -18269
6003a8269m972k774q493J1525O000J970N914M530j720l400p906J1632J3171q000
5989g92q982n872n985p393l068O920J5187L089p786M50m956J8l067J3570Q210
5974d57j587j594j899P034m214k066P04j795M48k835p881J148R911J1649p901
5959a335k043N339p50j2240o545Q499n130K971o740J0601m298r788r622M017P488
5944a9576k965q625L131J7033L051r811O505L004L073j0536j0209n974J6106J3308
5930b485J174n401j0476J1376M493j1724K840j536K126J1006J6528j111j2161
5917D649j4762N075j046P429P025l801j3986m073j756o29K620Q772j2157Q993
5903g647R291l66m441J7026l557j62J255K303P442j529r989j7651p750l932J198
$$ plain form
6003 -18269 -23241 -26015 -34508 -22983 -16983 -15013 -9099 -4569 -6289 -9689 -17595 -5963 7208 -792
5989 -792 -9774 -15646 -21631 -29024 -32092 -25172 -9985 -6896 -14682 -14232 -19188 -19170 -22237 -8667 -457
5974 -457 -2044 -3638 -5537 1497 -2717 -4783 -4079 -5874 -5426 -8261 -16142 -14994 -5083 6566 -1335
5959 -1335 -3378 1961 1211 -11029 -17574 -9075 -14205 -11234 -17974 -7373 -11671 -21459 -31081 -27064 -19576
5944 -19576 -22541 -31166 -28035 -11002 -7951 -17762 -11257 -8253 -5180 -15716 -25925 -31899 -15793 -2485
5930 -2485 -1311 -6712 -17188 -5812 -1319 -13043 -10203 -11739 -9613 1393 17921 16810 4649
5917 4649 -10113 -5038 -6084 1345 8370 4569 -9417 -13490 -15246 -15875 -13255 -4483 -16640 -7647
5903 -7647 1644 1278 -3163 13863 10306 10144 11399 13702 21144 19615 9626 -8025 -15775 -19707 -18509
5888a8509R72j2638r747J2769J5467J1551R446l414n308K894r904n00K345J549
5874c027L84l257O022O22r097K632o062p587J922k415o50O761R562Q928M440J6260
5858B5438L975j2016m647M096n922j1700j0958P920R416K195p50R222m413r909
5844A947O498M315p514q681n141O58o601P81o46j5371J0545Q408M760L779q003
5829a0266m647Q061k901n783P184L144j0564L226P638k321j9941m970j468R894
5815b3714J9272K114k6025M23J4973Q327n269J518M852j4111J992J364J218N48
5801a2518o128L645L333J1512L099k575M128Q807l264p218j0367l196J4106J6446
5787A9810j5879k0207p954J222M339j1692L647L2208q059j0618p374J1649q929
$$ plain form
5888 -18509 -17537 -30175 -39922 -27153 -11686 -135 9311 5897 589 3483 -6421 -6921 -4576 -3027
5874 -3027 -2643 -5900 122 744 -8353 -5721 -11783 -19370 -17448 -19863 -20513 -13752 -4190 4738 9178 25438
5858 25438 29413 17397 12750 16846 10924 -776 -11734 -3814 5602 7797 7047 16269 11856 1947
5844 1947 8445 12760 5246 -3435 -8576 -7918 -14519 -13738 -14384 -29755 -19210 -10802 -6042 -2263 -10266
5829 -10266 -14913 -6852 -9753 -15536 -8352 -5208 -15772 -12546 -4908 -7229 -27170 -32140 -33608 -23714
5815 -23714 -4442 -2328 -28353 -27930 -12957 -4630 -9899 -8381 -3529 -17640 -15648 -14284 -13066 -12518
5801 -12518 -18646 -15001 -11668 -156 2943 368 4496 13303 10039 2821 -7546 -10742 3364 19810
5787 19810 3931 -16276 -24230 -23008 -18669 -30361 -26714 5494 -2565 -13183 -20557 -8908 -17837
5774a7837j2509O426J6265Q039j1977o737O206Q713J0711j2735k538Q624R59p544
5760e934j1857q385k449O971K97J980L079N135J1399m591o440k522j2475K68J8902
5745f622K651j343l087K012R00J478n435j3468J2510J8935N278l665j792j8580
5731a0228j15L465M250k827p487M039P973O118p487N183l824j1158j6563K411
5717b6250J0392l913O980q57j4572j0222J3998J4126o848l818J3769J0346L557
5704F688p469J1812J759o322o916j2089q688k440Q949O126l733L32L203n387p312
5689b1487r192P100N249M568J260m66N848O917l517O151L620L063J2847j819j2174
5674G968k3795j3165Q867J3195M201L534o336O230O72j2343m17J0028r854q018
$$ plain form
5774 -17837 -30346 -23920 -7655 384 -11593 -18330 -12124 -3411 7300 -5435 -7973 651 1610 -5934
5760 -5934 -17791 -26176 -28625 -21654 -21357 -19377 -16298 -11163 236 -4355 -10795 -13317 -25792 -25524 -6622
5745 -6622 -3971 -5314 -8401 -6389 -5489 -4011 -9446 -22914 -10404 8531 13809 10144 8352 -10228
5731 -10228 -10343 -6878 -2628 -5455 -12942 -8903 -930 5188 -2299 2884 -940 -12098 -28661 -26250
5717 -26250 -15858 -19771 -12791 -13648 -28220 -38442 -24444 -10318 -17166 -20984 -7215 3131 6688
5704 6688 -781 11031 12790 6468 -448 -12537 -21225 -23665 -14716 -8590 -12323 -11991 -8788 -14175 -21487
5689 -21487 -30679 -23579 -18330 -13762 -12502 -12968 -7120 -203 -3720 2431 6051 9114 21961 20142 7968
5674 7968 -15827 -28992 -20125 -6930 -2729 805 -5531 699 1371 -10972 -11389 -1361 -11215 -19233
5660a9233l672J4008k837j0705P498J3061J794L448J228n412L037j3081j4478
5647b5344K093L69j023L49Q745K218j3014J0965J2349n337J79k110j0998k897
5633b3456N858P003J3387Q955O57l141l620j500R451M975j3859j4039m957R412
5619d874R592j2047j6596O430M040J1362J283O618L280r551p019L202Q271l37
5605C654j4723j3894j205O440J630j425K728l581r12M451K2015J0313j1921K918
5591F488J4279J8287m326j1078j0516n994p051J479j0306j37j0525J78R499L505
5577f218L785O812j0061o838j574N032K570k845j4696n687N995K474Q020J651
5563a1580N558J0938p161R071K925j6070j6824l048N537r310k879J4161Q320N473
$$ plain form
5660 -19233 -22905 -8897 -11734 -22439 -14941 -1880 -86 3362 4590 -822 2215 -10866 -25344
5647 -25344 -23251 -22882 -23905 -23556 -14811 -12593 -25607 -14642 -2293 -7630 -7451 -9561 -20559 -23456
5633 -23456 -17598 -10595 2792 11747 12404 9263 5643 4143 13594 18569 4710 -9329 -14286 -4874
5619 -4874 4718 -7329 -23925 -17495 -13455 -2093 -810 5808 9088 -463 -7482 -4280 3991 3654
5605 3654 -11069 -24963 -26168 -19728 -18098 -19523 -16795 -20376 -21288 -16837 5178 15491 3570 6488
5591 6488 20767 39054 34728 23650 13134 7140 89 1568 -8738 -8875 -19400 -19222 -9723 -6218
5577 -6218 -2433 4379 -5682 -12520 -14094 -9062 -6492 -9337 -24033 -29720 -23725 -21251 -13231 -11580
5563 -11580 -6022 4916 -2245 6826 9751 -6319 -23143 -26191 -20654 -29964 -32843 -18682 -10362 -4889
5549d889k927K203P727R329o367q666q925j710L322l053M427m58j3491L015P374
5534a3089K4143J6276o502j2375k975M338J5826q831p099p243j262l860k940o69
5520f262m363J0736J123J3803K292r331n97J4470J2773j7023j5679r735N432J822
5506e39J717p259L334M491l327n393L083j1817k490O877n845L973l816j89M903
5491a2297n875J2785r263l687P090J0224n028q68J6820J0402K26j153o776n02
5477A2098m274l972p263P441N341k30l338j5095K084J2331l073k05j31m63K954
5462D205J119m791J040N949j8099k4344R200O224J1031K953o806k477Q58o93p705
5447b2336O437p65m850Q448r463r425N739J1895q070m767J105J2496J309O279
$$ plain form
5549 -4889 -7816 -5613 2114 11443 5076 -3590 -12515 -14225 -10903 -13956 -9529 -9987 -23478 -20463 -13089
5534 -13089 11054 27330 20828 8453 5478 9816 25642 16811 9712 2469 1207 -2653 -5593 -6262
5520 -6262 -10625 111 1234 15037 17329 7998 7401 21871 34644 17621 1942 -7793 -2361 -539
5506 -539 1178 -6081 -2747 1744 -1583 -6976 -3893 -15710 -18200 -11323 -17168 -13195 -17011 -17200 -12297
5491 -12297 -18172 -5387 -14650 -18337 -11247 -1023 -6051 -6919 9901 20303 20529 19376 12600 12098
5477 12098 7824 3852 -3411 4030 9371 9141 5803 -9292 -7208 5123 2050 1845 1714 1251 4205
5462 4205 5324 533 1573 7522 -10577 -34921 -25721 -19497 -8466 -5513 -12319 -14796 -13938 -14631 -22336
5447 -22336 -15899 -16664 -21514 -13066 -22529 -31954 -26215 -14320 -22390 -27157 -26052 -13556 -12247 -5968
5433e968j2697Q042R287J051k902K765M680q3q516q805r148n98J492K297J630
5418a7473m122m824j298L381m927j601J3600J2084p224k156R652K554l317P912
5404B241J3852k1203q074n273r98j5198m327J5003J1791Q121J0916o501l060P313
5390D603L843l858q649j3118j0271L89Q319J1070J592p328N418j0266K45P755
5376a0256J0866n36O348Q258n251k655k252m823j9603j2357K747J2338P181j062
5362a1057j0098p739l996m224J1234J7161r87j8352l606R839N329Q994M418R96
5348b088r284L118q745j3871J554N907K023P635J6847j4498o683J2142j1413q326
5334b5682n50L04J1730J0050N138j368j3855M070k417o258j4942m820O835L803
$$ plain form
5433 -5968 -18665 -10623 -1336 -285 -3187 -422 4258 4175 -4341 -13146 -22294 -22892 -21400 -19103 -17473
5418 -17473 -21595 -26419 -27717 -24336 -29263 -30864 -17264 -5180 -12404 -14560 -4908 -2354 -5671 2241
5404 2241 16093 -5110 -13184 -18457 -19455 -34653 -38980 -23977 -12186 -4065 6851 350 -2710 4603
5390 4603 8446 4588 -4061 -17179 -27450 -27061 -18742 -7672 -6080 -13408 -7990 -18256 -18011 -10256
5376 -10256 610 74 6422 14680 9429 6774 4522 -301 -19904 -32261 -29514 -17176 -9995 -11057
5362 -11057 -21155 -28894 -32890 -37114 -25880 -8719 -9706 -28058 -31664 -21825 -16496 -7502 -3084 -2088
5348 -2088 -11372 -8254 -16999 -30870 -29316 -23409 -21386 -13751 3096 -11402 -18085 -5943 -17356 -25682
5334 -25682 -26232 -25928 -14198 -4148 990 -378 -14233 -10163 -12580 -18838 -33780 -38600 -31765 -27962
5320b7962J8257j0112k198J7023K577N31j431J4030J510q586m603n513o900K564
5306a0813Q26m582Q821Q670L539l390j379q006o221J1761L547L296j6493M497
5292e927R728o703j088m66J057K814M361L487q51m146l906k764L789N048N257
5277I690k065O296m862j6150m196L3N120R519O834J2660q675j5857q44j2620l532
5262a8649Q30q480J5993J2781K773J242l26j0400j5201j0268R388R591K589J231
5248f906j899q263o755j0965K718J6233J5843L510q224r878l342J4081L799r664
5234i712M947J8300L569j2208p484j3787j011J0064k051N436J5303N145m814J900
5220A3597L550r541o229l353L88J5461O603r606r404j4242L935O339m994L826
$$ plain form
5320 -27962 -9705 -19817 -22015 -4992 -2415 -1884 -3315 10715 12225 3639 -964 -6477 -13377 -10813
5306 -10813 -9987 -14569 -5748 2922 6461 3071 1692 -6314 -12535 -774 2773 6069 -10424 -5927
5292 -5927 3801 -2902 -3990 -4456 -3399 -585 3776 7263 6412 2266 -1640 -4404 -615 4433 9690
5277 9690 7625 13921 9059 -7091 -11287 -11254 -6134 3385 10219 22879 14204 -1653 -2497 -15117 -18649
5262 -18649 -17819 -26299 -10306 2475 5248 6490 6164 -4236 -19437 -29705 -20317 -10726 -8137 -6906
5248 -6906 -8805 -17068 -23823 -34788 -32070 -15837 6 3516 -4708 -14586 -17928 -3847 -48 -9712
5234 -9712 -4765 13535 17104 4896 -2588 -16375 -17386 -7322 -9373 -3937 11366 16511 11697 13597
5220 13597 17147 7606 1377 -1976 -1588 13873 20476 10870 1466 -12776 -8841 -2502 -7496 -3670
5206c670J1044n92n980M63j5904j0572M19M533J0450J5649Q868j0512p637K176
5192a265k688Q48n627j710M94l272N450j847r669J0164P999j0470j5J1044J0543
5177I979L008K95p198j305n757K271k083J534k536k263j958j0618k808J6045k921
5162f315p242m368j2388j1687k625K005P699k303K0982K1342J3190J4550j4406
5149A8434j0323L74j2034J000N031j7577o167r89j77J490J387J3594J1441P25
5135F209k0824j1321j1480K23J95J1893J026q726j130K324R555J1761J4310L234
5121G249j1810r907J0555P567j0728k056M325J289J1449m887n08j7271q904J5247
5107h390J0267L683p577k1812j1065K2289P821J468J0140L871j700k985j9592
$$ plain form
5206 -3670 7374 6782 802 1265 -14639 -25211 -24792 -20259 -9809 5840 14708 4196 -3441 -1265
5192 -1265 -3953 -3105 -8732 -10442 -9948 -13220 -7770 -9617 -19286 -9122 -1123 -11593 -11608 -564 9979
5177 9979 12987 13282 6084 4779 -978 1293 -790 744 -1792 -4055 -6013 -16631 -19439 -3394 -6315
5162 -6315 -13557 -17925 -30313 -42000 -44625 -42620 -34921 -37224 -16242 5100 18290 32840 18434
5149 18434 8111 8485 -3549 -2549 2482 -15095 -21262 -22251 -22428 -20938 -19551 -5957 5484 6209
5135 6209 -14615 -25936 -37416 -37193 -36998 -25105 -24079 -32805 -33935 -31611 -22056 -10295 4015 7249
5121 7249 -4561 -14468 -3913 3654 -7074 -9130 -4805 -3516 7933 3046 2538 -14733 -23637 -8390
5107 -8390 1877 5560 -2017 -23829 -34894 -12605 -4784 -3316 6824 10695 8995 6010 -13582
5094a3582p392J6519J8048j7574j5066k199M4l588K541L543J655L513J6517m230
5080a251l34m390m206j375r70L305N553j4905K198J4668J0583K692l115L348R422
5065B1223j2689j4232q685k627J3246J789J644N595J4149L707P780j933j1500
5052A7467O343j09o959r784l389o116j5086L280R380J0316L34K532k726K448j679
5037F252J1591L061j6606o779J023L709k993n322L767l324r107o763J636N584
5023a4271J0827M590J2642m840j4142j3589l417N416J596L291J0688N103N586
5010I480L323m662m013J1826O793k291j4592q577J567j1143Q456r60Q96n707J0704
4995A100r392j0438r532M766P857P215J1356J3365j0794p056q105m417O818j6279
$$ plain form
5094 -13582 -20974 -4455 13593 -3981 -19047 -21246 -21202 -24790 -22249 -18706 -17051 -13538 2979 -1251
5080 -1251 -1585 -5975 -10181 -11556 -12526 -9221 -3668 -18573 -16375 -1707 8876 11568 8453 11801 21223
5065 21223 8534 -5698 -14383 -17010 -3764 -1975 -331 5264 19413 23120 30900 28967 17467
5052 17467 23810 23701 16742 6958 3569 -2547 -17633 -14353 -4973 5343 5677 8209 5483 7931 6252
5037 6252 17843 20904 4298 -2481 -1458 2251 -742 -6064 -2297 -5621 -14728 -21491 -19855 -14271
5023 -14271 -3444 1146 13788 8948 -5194 -18783 -22200 -16784 -15188 -11897 -1209 3894 9480
5010 9480 12803 8141 4128 15954 22747 20456 5864 -2713 -1146 -12289 -3833 -4793 -3897 -9604 1100
4995 1100 -8292 -18730 -28262 -23496 -15639 -8424 2932 16297 5503 -1553 -9658 -14075 -7257 -23536
4981b3536p096J6083O897N784r0Q826K1268n847j8227j2073o584M783k736R509
4967c039Q327j874J1047J176r520j4279j988L606M584J0374j231j6339r29J8311
4953H226J6558q068j1411k3608l667M235O60p87J0520L13O734l361q437K980k488
4938a1601m346j4812K665J183n551J7912J3366M361p590r131L410P19q877Q786
4924i506N508M262j45J1665R344j3363q378l04M156n567L068o961M103N991L882
4909G755j5545k2514K145R463n013k237N704J227K0868R085j0312M737J1662K859
4895A9884n336j9643k247o42K082M358P388O647mo349L186l315n915p561j0381
4880a7848l13q317M045J6060k278j1047J3605N458k007j0909m672o888j963K290
$$ plain form
4981 -23536 -30632 -14549 -7652 -1868 -1958 6868 28136 22289 4062 -8011 -14595 -9812 -12548 -3039
4967 -3039 5288 3414 14461 15637 6117 -8162 -10150 -6544 -1960 8414 7183 -9156 -10085 8226
4953 8226 24784 16716 5305 -18303 -21970 -17735 -17075 -17862 -7342 -7029 -295 -3656 -12093 -9113 -11601
4938 -11601 -15947 -30759 -28094 -26911 -32462 -14550 -1184 3177 -4413 -13544 -10134 -9415 -18292 -9506
4924 -9506 -3998 264 119 11784 21128 7765 -613 -917 3239 -2328 740 -6221 -2118 3873 7755
4909 7755 -7790 -30304 -28159 -18696 -23709 -25946 -20242 -19015 1853 10938 626 5363 17025 19884
4895 19884 14548 -5095 -7342 -7984 -5902 -1544 5844 12491 12487 6138 9324 6009 94 -7467 -17848
4880 -17848 -18161 -26478 -22433 -6373 -8651 -19698 -6093 -635 -2642 -13551 -18223 -25111 -27074 -24784
4866b4784K324R321J7943O510q881m441r192n790n261R603P910O462m383q341
4852a1000P1J057o038m354j754p70j8158L945J2895N911l026L013J1722O222P132
4837F868n985p896q097k170P288l422O213R832J925M617L675r201j6913p641n93
4822b1500J421j113P260Q40n858k89j1568k853Q698R815P595K118l939p641j232
4807a8246N329N195M244p728M247J2738L350j4107r584N515K694O33L543q22j7681
4792b0680p883J555Q403J3205L362j294n022n151k158J1585l610o987k179Q51
4778a6003N808J140n82L976L812p666m34N323K722r156M124k461j138N558J847
4763c130j9076j2051J479N580J1224j558k784N706p069O521M519o929l265O43
$$ plain form
4866 -24784 -22460 -13139 4804 11314 2433 -2008 -11200 -16990 -22251 -12648 -4738 1724 -2659 -11000
4852 -11000 -10929 -9872 -15910 -20264 -22018 -22788 -40946 -37001 -24106 -18195 -21221 -18208 -6486 -264 6868
4837 6868 883 -7013 -15110 -17280 -9992 -13414 -7201 2631 4556 9173 12848 3647 -13266 -20907 -21500
4822 -21500 -20079 -21192 -13932 -13092 -18950 -19239 -30807 -33660 -24962 -15147 -7552 -5434 -9373 -17014 -18246
4807 -18246 -12917 -7722 -3478 -11206 -6959 5779 9129 -4978 -14562 -9047 -6353 -5720 -2177 -2999 -20680
4792 -20680 -28563 -27008 -18605 -5400 -2038 -3332 -8354 -13505 -15663 -4078 -7688 -14675 -16854 -16003
4778 -16003 -10195 -9055 -9637 -5661 -1849 -9515 -9949 -4626 -1904 -11060 -6936 -9397 -10535 -4977 -3130
4763 -3130 -22206 -34257 -32778 -27198 -15974 -17532 -20316 -14610 -21679 -15158 -10639 -17568 -20833 -20190
4749b0190J857m067k769L475L476m74k257j0144n811J0246R56P278M670o668l702
4734b4124J503m136n773J1785k148j288J0885j0294l293J373P287m003P231l941
4720a8936m47J0645M920N006J1995k793o508n697k594m157q274Q434J3346J2045
4706A6985j5719j3342N575k204q170J02j385R725J6295m795k102k758L178Q214
4692I599o367K497o644q053m981J293j737J0496J3791J3563j0562m145o546o607
4678d403j5704j745J0766N129K997l452k701L088k083m54n116L862J3474J1483
4664A5141J0311j1964j2274o80l60j816j358J066m27j715j560M207J3709r14m430
4649F936M16j0141j4185O926J3764O117j6911q791J6589J6046K286j1433j7880
$$ plain form
4749 -20190 -18333 -22400 -25169 -21694 -18218 -18692 -20949 -31093 -36904 -26658 -25702 -18424 -13754 -20422 -24124
4734 -24124 -22621 -26757 -32530 -20745 -22893 -24181 -13296 -23590 -26883 -25510 -18223 -22226 -14995 -18936
4720 -18936 -19383 -8738 -3818 1188 13183 10390 3882 -1815 -4409 -8566 -16840 -8406 4940 16985
4706 16985 1266 -12076 -6501 -8705 -16875 -16773 -18158 -8433 7862 3067 965 -1793 1385 9599
4692 9599 3232 5729 -915 -8968 -13949 -12656 -14393 -3897 9894 23457 12895 8750 2204 -4403
4678 -4403 -20107 -21852 -11086 -5957 -2960 -6412 -9113 -6025 -8108 -8562 -13678 -9816 3658 15141
4664 15141 25452 13488 1214 534 174 -1642 -3000 -1934 -2361 -4076 -5636 -1429 12280 11366 6936
4649 6936 7352 -2789 -16974 -10048 3716 9833 -7078 -15869 720 16766 19052 7619 -10261
4636a0261r990M139N829j2426K677N561L174M893K045n89K834K100J2703k307
4622A0382q663m835N800q213p522l120L111L040J902J076m775P781R815n295r736
4607i252j722p33J3799l699O132l028L034o259o992Q78L912J0638p374r848K88
4592a0226l827M933J0625j1775n373J792L204o520N409J6039L470k584Q574L252
4578A6993q149j3347j1440j1273L312J383r454p158R80R365J6046J0705J1917
4565I880l441j4312p93q91P925P67J2683J3449q145j2390o891q944k356K585j2271
4550b3145k328K3380J1612K843n475n763j0216n207L738k09j1528j9059n715k796
4536d9868Q11K3477J5585O12m606J213M095q137j0593J2009J0493m168j529j545
$$ plain form
4636 -10261 -20251 -16112 -10283 -22709 -20032 -14471 -11297 -6404 -4359 -4948 -2114 -14 12689 10382
4622 10382 1719 -3116 2684 -5529 -13051 -16171 -13060 -10020 -8118 -7042 -11817 -4036 5779 484 -9252
4607 -9252 -10974 -11707 2092 -1607 4525 1497 4531 -1728 -8720 -7842 -3930 6708 -666 -10514 -10226
4592 -10226 -14053 -9120 1505 -10270 -15643 -13851 -10647 -17167 -11758 4281 7751 5167 13741 16993
4578 16993 8844 -4503 -15943 -27216 -23904 -22521 -31975 -39133 -38153 -28788 -12742 -2037 9880
4565 9880 6439 -7873 -8666 -9557 -1632 -865 11818 25267 17122 4732 -2159 -11103 -13459 -10874 -23145
4550 -23145 -25473 -2093 9519 12362 6887 1124 -9092 -14299 -10561 -10770 -22298 -41357 -47072 -49868
4536 -49868 -49057 -25580 -9995 -9383 -13989 -12776 -8681 -16818 -27411 -15402 -4909 -9077 -10606 -12151
4522a2151P097J0277N597j915j7299k066M522J3374J0970r989o915j254r51J4792
4508A4089j1434p256L965L330N293m167m7n406q84m721q201q096M741O470J0903
4493a421k098j3182j7419K23L389K361Q694P841J3612J3853j3206n31J893J847
4479E856j2446l39j456k345P570m379p803n63L448K599j1888l786O510M231J1772
4464c019O743k636p926Q757O204m359j515l866j0272J0448O866j226J445j361
4450D283r639j3096n288o585J2443M796m944K9614J3141j2936p180o094K586K5476
4436B6577j0235k6930n561J0577P571L305j4282j896o118j263m97R164Q200J1231
4422I843m309P841O231J9670j5611j6965k096p640p233J0983m340Q13n381o917
$$ plain form
4522 -12151 -5054 5223 10820 8905 -8394 -10460 -5938 7436 18406 8417 1502 248 -703 14089
4508 14089 2655 -4601 -636 2694 7987 3820 3773 -1633 -2517 -7238 -15439 -23535 -18794 -12324 -1421
4493 -1421 -3519 -16701 -34120 -33897 -30508 -28147 -19453 -11612 2000 15853 2647 2116 4009 5856
4479 5856 -6590 -6929 -8385 -10730 -3160 -7539 -15342 -15905 -12457 -9858 -21746 -25532 -19022 -14791 -3019
4464 -3019 3724 1088 -6838 1919 8123 3764 2249 -1617 -11889 -1441 5425 4199 5644 4283
4450 4283 -5356 -18452 -23740 -30325 -17882 -13086 -18030 11584 24725 11789 4609 -1485 1101 26577
4436 26577 16342 -10588 -16149 -5572 1999 5304 -8978 -10874 -16992 -18255 -18752 -9588 -1388 9843
4422 9843 5534 13375 19606 39276 23665 6700 4604 -3036 -10269 714 -3626 -2813 -8194 -15111
4408a5111M631J3500q85P787M107j1708j3244J653q619M704O17k554p25M497j5141
4393b6491n667J2186J1526O728N78j1702n284L257m75J476j0278J6513J222l298
4379i709k529j6014J7222Q550l241Q878P013r332o20L808l942j3661N512o366
4365a4431n500k236L964N221m920J1747J198j2157Q118L931M413J915K117P568
4351A0948p951N74J1633j2415k3318K436m309K405J1148J4097J5644j5229o385
4338g22j567j0265l629j3008N729N472r542J1145O324K240J17k663J1205q811
4324g975j738R684m701n307J1729j030j348J387j1647M645o55j06J1885N214p763
4309B274l169m106p214J4988P742L084k991j6003l322N23O113m823k613p859Q232
$$ plain form
4408 -15111 -10480 3020 2135 9922 14029 2321 -10923 -9270 -17889 -13185 -12568 -15122 -15847 -11350 -26491
4393 -26491 -32158 -19972 -8446 -1718 -1140 -12842 -18126 -14869 -15344 -13868 -24146 -7633 -6411 -9709
4379 -9709 -12238 -28252 -11030 -2480 -5721 3157 10170 838 218 4026 84 -13577 -8065 -14431
4365 -14431 -19931 -22167 -18203 -12982 -17902 -6155 -4957 -17114 -8996 -5065 -652 1263 3380 10948
4351 10948 2997 3571 15204 2789 -20529 -18093 -22402 -19997 -8849 5248 20892 5663 -722
4338 -722 -2289 -12554 -16183 -29191 -23462 -17990 -27532 -16387 -10063 -7823 -7706 -10369 836 -7975
4324 -7975 -9713 -29 -4730 -10037 1692 662 -686 701 -10946 -6301 -6956 -7062 4823 10037 2274
4309 2274 -895 -5001 -12215 2773 10515 13599 10608 -5395 -8717 -8194 -2081 -6904 -9517 -17376 -9144
4294i144L366K233k238j1991p036N869J4569Q568K879j0769j5114j0533J3746
4281a5595L141J554o852j1804L851J4934J4351l79r213N65L863L079n155j468
4267e128P447j0413J243k797N514j2029p316Q137K8787J4911r786j9606j4090
$$ plain form
4294 -9144 -5778 -3545 -5783 -17774 -24810 -18941 -4372 4196 7075 -3694 -18808 -29341 -15595
4281 -15595 -12454 -10900 -17752 -29556 -25705 -10771 3580 3201 -6012 -5447 -1584 1495 -3660 -5128
4267 -5128 2319 -8094 -6851 -9648 -4134 -16163 -23479 -15342 13445 28356 18570 -1036 -15126
$$ [...]
##END NTUPLES=NMR SPECTRUM
##END=
