##TITLE=Analysis number 323009
Compound Code cc 58909
Book Reference 494/62
Project Code adrs
Chemist Name craigr
##JCAMPDX= 6.0         $$ Bruker NMR JCAMP-DX V2.0
##DATA TYPE= NMR SPECTRUM
##DATA CLASS= NTUPLES
##ORIGIN= Bruker BioSpin GmbH
##OWNER= nmr
$$ XWIN-NMR		Version 3.5
$$ Mon Oct 16 20:15:38 2006 GMT Daylight Time (UT+1h)  MAYBRIDGE\nmr@NMR_250MHZ
##.OBSERVE FREQUENCY= 250.131544655141
##.OBSERVE NUCLEUS= ^1H
##.ACQUISITION MODE= SIMULTANEOUS (DQD)
##.ACQUISITION SCHEME= undefined
##.AVERAGES= 16
##.DIGITISER RES= 18
##SPECTROMETER/DATA SYSTEM= dpx250
##.PULSE SEQUENCE= zg30
##.SOLVENT NAME= CDCl3
##.SHIFT REFERENCE= (INTERNAL, CDCl3, 0, 16.4533)
##AUDIT TRAIL= $$ (NUMBER, WHEN, WHO, WHERE, WHAT)
$$ ##TITLE= Audit trail, XWIN-NMR		Version 3.5
$$ ##JCAMPDX= 5.01
$$ ##ORIGIN= Bruker BioSpin GmbH
$$ ##OWNER= nmr
$$ C:\u/data/dgb/nmr/ADRS/620/pdata/1/auditp.txt
$$ ##AUDIT TRAIL=  $$ (NUMBER, WHEN, WHO, WHERE, WHAT)
(   1,<2006-10-16 20:15:15.58 +100>,<MAYBRIDGE\nmr>,<NMR_250MHZ>,
      <created by zg, POWCHK disabled, PULCHK disabled
       configuration hash MD5:
       49 4B E0 1D 92 C2 6B 37 9F E6 65 BC 52 41 86 1D
       data hash MD5: 64K
       16 6C 3B 26 CE 4F 65 F7 AD E9 0E AD 2C 05 FE 66>)
(   2,<2006-10-16 20:15:28.99 +100>,<MAYBRIDGE\nmr>,<NMR_250MHZ>,
      <Start of raw data processing
       ef LB = 0.3 FT_mod = 6 PKNL = 1 SI = 32K 
       data hash MD5: 32K
       33 50 B1 5E BE E3 05 72 77 45 63 EB 27 76 1B 9B>)
(   3,<2006-10-16 20:15:30.64 +100>,<MAYBRIDGE\nmr>,<NMR_250MHZ>,
      <apk 
       data hash MD5: 32K
       C8 FA 01 03 7F C5 11 69 86 C0 EA F8 B0 31 E2 0E>)
(   4,<2006-10-16 20:15:31.36 +100>,<MAYBRIDGE\nmr>,<NMR_250MHZ>,
      <abs ABSG = 5 
       data hash MD5: 32K
       67 34 11 80 FF A1 88 56 DF DC F8 41 3D 1A 6F 7E>)
$$ ##END=
$$ 
$$ hash MD5
$$ FF CE 9A 82 E4 3E F7 CA 21 BA 8B 58 D1 B7 DD AE
##$RELAX= 
##$RELAX= 
##$RELAX= 
##$RELAX= 
##$RELAX= 
##$RELAX= 
##$RELAX= 
$$ Bruker specific parameters
$$ --------------------------
##$DU= <C:\u>
##$EXPNO= 620
##$NAME= <ADRS>
##$PROCNO= 1
##$TYPE= <nmr>
##$USER= <dgb>
##$AMP= (0..31)
100 100 100 100 100 100 100 100 100 100 100 100 100 100 100 100 100 100 
100 100 100 100 100 100 100 100 100 100 100 100 100 100 
##$AQSEQ= 0
##$AQ_mod= 3
##$AUNM= <au_zg>
##$AUTOPOS= <46 >
##$BF1= 250.13
##$BF2= 250.13
##$BF3= 250.13
##$BF4= 250.13
##$BF5= 500.13
##$BF6= 500.13
##$BF7= 500.13
##$BF8= 500.13
##$BYTORDA= 1
##$CFDGTYP= 0
##$CFRGTYP= 5
##$CHEMSTR= <none>
##$CNST= (0..31)
1 1 145 1 1 1 1 1 1 1 1 1 1 1 1 1 1 1 1 1 1 1 1 1 1 1 1 1 1 1 1 1 
##$CPDPRG= <>
##$CPDPRG1= <>
##$CPDPRG2= <>
##$CPDPRG3= <>
##$CPDPRG4= <mlev>
##$CPDPRG5= <mlev>
##$CPDPRG6= <mlev>
##$CPDPRG7= <mlev>
##$CPDPRG8= <mlev>
##$CPDPRGB= <>
##$CPDPRGT= <>
##$D= (0..31)
0 1 0 0 0 0 0 0 0 0.06 0 0 0 0 0 0 0.0002 0 0 0 0 0 0 0 0 0 0 0 0 0 0 
0 
##$DATE= 1161026114
##$DBL= (0..7)
120 120 120 120 120 120 120 120 
##$DBP= (0..7)
150 150 150 150 150 150 150 150 
##$DBP07= 0
##$DBPNAM0= <>
##$DBPNAM1= <>
$$ [...]
##$SUBNAM7= <"">
##$SUBNAM8= <"">
##$SUBNAM9= <"">
##$SW= 20.6930455092707
##$SWIBOX= (0..15)
0 0 3 0 0 0 0 0 0 0 0 0 0 0 0 0 
##$SW_h= 5175.983436853
##$TD= 65536
##$TD0= 1
##$TE= 683.16
##$TE2= 300
##$TE3= 300
##$TEG= 300
##$TL= (0..7)
0 120 120 120 120 120 120 120 
##$TP= (0..7)
150 150 150 150 150 150 150 150 
##$TP07= 0
##$TPNAME0= <>
##$TPNAME1= <>
##$TPNAME2= <>
##$TPNAME3= <>
##$TPNAME4= <>
##$TPNAME5= <>
##$TPNAME6= <>
##$TPNAME7= <>
##$TPOAL= (0..7)
0.5 0.5 0.5 0.5 0.5 0.5 0.5 0.5 
##$TPOFFS= (0..7)
0 0 0 0 0 0 0 0 
##$TUNHIN= 0
##$TUNHOUT= 0
##$TUNXOUT= 0
##$USERA1= <user>
##$USERA2= <user>
##$USERA3= <user>
##$USERA4= <user>
##$USERA5= <user>
##$V9= 5
##$VALIST= <valist>
##$VCLIST= <CCCCCCCCCCCCCCC>
##$VD= 0
##$VDLIST= <DDDDDDDDDDDDDDD>
##$VPLIST= <PPPPPPPPPPPPPPP>
##$VTLIST= <TTTTTTTTTTTTTTT>
##$WBST= 1024
##$WBSW= 4
##$XGAIN= (0..3)
0 0 0 0 
##$XL= 0
##$YL= 0
##$YMAX_a= 318974
##$YMIN_a= -419990
##$ZGOPTNS= <>
##$ZL1= 120
##$ZL2= 120
##$ZL3= 120
##$ZL4= 120
##$ABSF1= 16.45325
##$ABSF2= -4.239922
##$ABSG= 5
##$ABSL= 3
##$ALPHA= 0
##$AQORDER= 0
##$ASSFAC= 0
##$ASSFACI= 0
##$ASSFACX= 0
##$ASSWID= 0
##$AUNMP= <proc_1d>
##$AZFE= 0.1
##$AZFW= 0.1
##$BCFW= 0
##$BC_mod= 0
##$BYTORDP= 0
##$COROFFS= 0
##$CY= 12.5
##$DATMOD= 1
##$DC= 0
##$DFILT= <>
##$DTYPP= 0
##$F1P= 14.0000005364418
##$F2P= -0.99999901652339
##$FCOR= 0.5
##$FTSIZE= 32768
##$FT_mod= 6
##$GAMMA= 0
##$GB= 0
##$INTBC= 1
##$INTSCL= 1
##$ISEN= 128
##$LB= 0.3
##$LEV0= 0
##$LPBIN= 0
##$MAXI= 10000
##$MC2= 0
##$MEAN= 0
##$ME_mod= 0
##$MI= 0
##$NCOEF= 0
##$NC_proc= -4
##$NLEV= 6
##$NOISF1= 0
##$NOISF2= 0
##$NSP= 0
##$NTH_PI= 0
##$NZP= 0
##$OFFSET= 16.45325
##$PC= 1
##$PHC0= -46.32415
##$PHC1= 7.418526
##$PH_mod= 1
##$PKNL= yes
##$PPARMOD= 0
##$PSCAL= 4
##$PSIGN= 0
##$REVERSE= no
##$SF= 250.130017194068
##$SI= 32768
##$SIGF1= 0
##$SIGF2= 0
##$SINO= 400
##$SIOLD= 32768
##$SREGLST= <1H.CDCl3>
##$SSB= 0
##$STSI= 32768
##$STSR= 0
##$SW_p= 5175.98343685301
##$SYMM= 0
##$S_DEV= 0
##$TDeff= 65536
##$TDoff= 0
##$TI= <Analysis number 999999
Compound Code 99
Book Reference 9
Project Code 9>
##$TILT= no
##$TM1= 0
##$TM2= 0
##$TOPLEV= 0
##$USERP1= <user>
##$USERP2= <user>
##$USERP3= <user>
##$USERP4= <user>
##$USERP5= <user>
##$WDW= 1
##$XDIM= 32768
##$YMAX_p= 385768552
##$YMIN_p= -414011
$$ End of Bruker specific parameters
$$ ---------------------------------
##NTUPLES= NMR SPECTRUM
##VAR_NAME=  FREQUENCY,     SPECTRUM/REAL,   SPECTRUM/IMAG
##SYMBOL=    X,             R,               I
##VAR_TYPE=  INDEPENDENT,   DEPENDENT,       DEPENDENT
##VAR_FORM=  AFFN,          ASDF,            ASDF
##VAR_DIM=   32768,         32768,           32768
##UNITS=     HZ,            ARBITRARY UNITS, ARBITRARY UNITS
##FACTOR=    0.157963299565203, 1,           1
##FIRST=     4115.45192676581, 0,            0
##LAST=      -1060.5315100872, 0,            0
##MIN=       -1060.5315100872, -414011,      0
##MAX=       4115.45192676581, 385768552,    0
$$ Real data points
##PAGE= N=1
##DATA TABLE= (X++(R..R)), XYDATA
$$ [...]
15645g8772j31787J57075J04643j00588q0650k2017K5033m6951j5879J1786M3612
15634a34495J50437l3796j32184j1736L6115R2307P460j07261l1161R3284N7278
15623a3752q0750j3958Q4935N1287K3886J4557R8196L9781n8599j18617p622M8392
15611F7736J4737M2304k5043j05996j62619K2045R170J37666L4086j29946q0215
15600a76075m3470J7629R0303R55k575j5837K6616l259n6443K372m0080J17696
15588h2168m8699p3739R1192M8524r4717q718J1246P1171R9504M1039o723Q495
15576E6407j1430m7182q6045j349O0093N2788o2341k6858j1416Q2355j4699J5195
15564E518N4202l3844K1530Q7189j7639q1216n6705k3333j05685l1063K8435L1499
$$ y = [-78772, -210559, -53484, 51159, -49429, -130079, -152096, -127063, -174014, -189893, -178107, -134495, 15942, -17854, -150038, -161774, -125659, -33352, -25892, -133153, -164314, -71030, -13752, -94502, -108460, -23525, 27762, 51648, 66205, 164401, 204182, 145583, 26966, 19344, 67736, 82473, 124777, 99734, -6262, -168881, -146836, -137666, 0, 34086, -95860, -176075, -219545, -201916, -111613, -110658, -113233, -129070, -102454, -105713, -162156, -159784, -199864, -82168, -130867, -204606, -113414, -64890, -159607, -168325, -157079, -85908, 13596, 54635, 47912, 56407, 44977, -2205, -88250, -89599, -29506, 23282, -39059, -65917, -77333, 5022, -9677, 5518, 59720, 25876, 47406, 134595, 116956, 35740, -20965, -44298, -149983, -181046, -152611, -121112]
15552a21112m9495L4314J00765k0309j22595K2445L1612O493L4030j0393l9832
15541a34077N156M3060l582K125P6732j6775m9247j1550n435R1160l477k0384
15529b6294J6032K6863j939q7946L3553N7576n1837n4503j8345k5312M6199l3472
15517a19425j9133K6503K2521j1479M3594J4238l6611p0671N1714M5022P338O2338
15505A5949K7373Q8010q3020j00003r983J0190L028r4010m5455Q395O3788J1267
15493a04471o8864O1762L9350J608q041N814K9800J27p2170J8652J25730j2992
15481A6305J2755K7226j21161j19543m8217k5956O2748J06888M1691j2253p7375
15470a36892p4134p776Q1532K7244J0075J1218O3975L861r6945j2028J11675J45690
$$ y = [-121112, -170607, -136293, -35528, -55837, -178432, -155987, -124375, -117882, -83852, -94245, -134077, -128921, -85861, -89443, -87318, -10586, -27361, -76608, -88158, -93593, -2433, -5910, -26294, -10262, 16601, 14662, -73284, -39731, 17845, -33992, -88495, -106840, -132152, -85953, -119425, -138558, -112055, -89534, -101013, -57419, -43181, -79792, -150463, -98749, -53727, -46389, 15949, 43322, 131332, 48312, -51691, -61674, -51484, -48456, -142466, -187921, -179526, -115738, -104471, -173335, -111573, -72223, -70615, -78656, -72842, -43042, -42915, -115085, -96433, 29297, 16305, 29060, 56286, -64875, -184418, -232635, -258591, -195843, -88955, -47264, -59517, -136892, -211026, -218802, -137270, -110026, -99951, -88733, -24758, -20897, -117842, -129870, -18195, 127495]
15458A27495P2501m6077k0607l8856j38776p8107J799O9152M0769j4259N4662
15447B9696j6383k9622m6691K3162J5025L2500Q7433p624P585O598o3462j09042
15435g0825r2351q8729j2228J00251J1470L1986J94322N4672o2323j17645j00625
15424a52025M7080M5895m1862m5757n1191K7036M3759K844K3971J7421J0793M29
15412g1607j37799j2985J30210J17207J2252j5877L2790Q30J161k2702j46422
15401a12942k0279M3701q96m4802O6797J1305J7333O7438j6197n8164N140k4676
15389f6242m6067L6542J14893J12308l2132n1520j04939o7546J06948J35425J06518
15378B44188R238k37268j41054J3597K4148L6214o9895L814K9957n8042M6719
$$ y = [127495, 199996, 153919, 133312, 94456, -44320, -122427, -120628, -51476, -10707, -24966, 29696, 13313, -16309, -63000, -39838, -24813, 7687, 95120, 87496, 95081, 101679, 38217, -70825, -163176, -251905, -264133, -163882, -152412, -120426, 73896, 128568, 66245, -51400, -152025, -104945, -59050, -100912, -146669, -197860, -170824, -127065, -124221, -100250, -82829, -72036, -71607, -209406, -222391, -92181, 25026, 37278, 21401, 54191, 55021, 56182, 33480, -112942, -133221, -89520, -90416, -135218, -68421, -57116, -39783, 27655, 11458, -46706, -41566, -66242, -112309, -75767, 39126, 151434, 119302, 67782, -37157, -104703, 2245, 137670, 244188, 253426, 16158, -124896, -111299, -87151, -50937, -120832, -117018, -87061, -145103, -98384]
15367i8384M0103Q3416P2403K9427K4639P0172j13309j80625m818P0503K4322
15356A7849k0944r1909n6240N7980J39946j6353m1630J365n6352q3395l2669n1566
15344b33918J40489O715L2248M4700r582n5667M257j1863K3702j3146k3473K255
15332i3283n478o4024j6504k454Q4023Q0702o7924m9524L9951L2737q0822m0796
15320a83396O4617R6621J8223r3268j16803r1230J10564J40525k5166J6511J01324
15309C8522K5417j066k2531o5885j4982k5068K192l656K8946j2310m0911J5013
15297g6319K0407P2522O2130j187j31313j36684M5557L1117P2501J46340J5612
15286A20683m1561j18706K6453Q314M514l177o7139M5415j8510R15J7557j3661
$$ y = [-98384, -58281, 25135, 97538, 126965, 151604, 221776, 108467, -72158, -76976, -6473, 17849, -3095, -95004, -151244, -93264, 46682, 30329, -11301, -9936, -66288, -149683, -182352, -233918, -93429, -86714, -54466, -9766, -19348, -75015, -70758, -82621, -58919, -72065, -95538, -93283, -98761, -162785, -179289, -181743, -97720, -17018, -84942, -134466, -94515, -61778, -142600, -183396, -118779, -22158, -3935, -97203, -214006, -305236, -194672, -54147, -79313, -62802, 38522, 63939, 62873, 40342, -25543, -40525, -65593, -63401, -67057, -38111, -50421, -91332, -76319, -55912, 16610, 78740, 77553, -53760, -190444, -144887, -113770, -41269, 105071, 120683, 79122, -39584, -13131, -4817, -303, -3480, -70619, -25204, -43714, -42799, -25242, -38903]
15274c8903o0575K8966m6833L84j5540k8171r2656Q7971J35384O7960J8279p0
15262E6196q401p742m6304J8365m3341K0120K1063k9256O4939K1076q8941j3530
15250c5756P8056J0312l0533o5754l0603Q8779P881p467k2335J670L4240M0828
15238F9318j20518n0760n4386m7049J1443j4696l114J05201P1968k7574j855J3102
15226d8920N1662J444L0045R0097l1500o988M6891l9652n5784L6558j3540P60
15214F1073L306l9908n2235l5024N5008j7874r5270p9317M3784J09744P549o2342
15202a01506k0095n8301L427M8185M4089R9952o1165p5202L0073j6869J9569O773
15190h1070J3723k6639m0329l3180j24171P618J07785J907j05787P2572K19337
$$ y = [-38903, -99478, -70512, -117345, -116961, -132501, -160672, -253328, -165357, -29973, 37987, 56266, 56196, 47795, 40053, -6251, 12114, -31227, -11107, 9956, -19300, 45639, 66715, -22226, -35756, 42300, 52612, 22079, -43675, -74278, 14501, 22382, 14915, -7420, -5750, 28490, 69318, -51200, -101960, -156346, -203395, -191952, -206648, -209762, -104561, -32593, -60167, -62022, -48920, 2742, 4186, 34231, 124328, 92828, 85840, 132731, 93079, 37295, 73853, 60313, 61073, 64379, 24471, -27764, -62788, -7780, -25654, -120924, -200241, -156457, -46713, -39164, -101506, -121601, -179902, -176475, -128290, -84201, 15751, -45414, -120616, -90543, -107412, -87843, -81070, -67347, -93986, -134315, -167495, -291666, -284048, -176263, -174356, -280143, -207571, 11766]
15179A1766Q6077j0578j1871m1594l6793m1141n5697n0546l6346J9670p607l5241
15167b09901M8354l0125Q954K8773j3698l5456Q704J11562O7642k8116r6052k3839
15155a63198J8760j7691O6276O7494M6685P4098l2357j07098m5510N5486L6453
15144f02l5212l1893O1836M5556j01319M3740O5641l1207q1581n3867o9811L9006
15132a49713O6506J25998N4718K5655n4650r9795J8894j62852l4122J54701K5010
15121b9650r0759p5960K4671Q7708m4818O2270N6061K6197j08025j1158J15581
15110A2118q8839r2747J05701O5668L099r5521j29975L7910J5578m0842K2451
15099a85399M1798l0533P7367N005l0346m482m2681Q1258Q6735K5087o0514o3898
$$ y = [11766, 97843, 87265, 75394, 33800, -2993, -44134, -99831, -150377, -186723, -167053, -174660, -209901, -161547, -191672, -182718, -153945, -167643, -203099, -194395, -82833, -15191, -43307, -139359, -163198, -144438, -162129, -95853, -28359, 18326, 92424, 60067, -47031, -92541, -37055, -602, -35814, -67707, -5871, 39685, -61634, -17894, 47747, 16540, -65041, -118908, -188719, -149713, -83207, 42791, 97509, 123164, 68514, -31281, -12387, -175239, -209361, -54660, -29650, -120409, -196369, -171698, -83990, -128808, -66538, -10477, 15720, -92305, -103463, 12118, -76721, -169468, -63767, 1901, 5000, -90521, -220496, -182586, -167008, -207850, -185399, -143601, -174134, -96767, -91762, -122108, -126590, -169271, -88013, -1278, 23809, -36705, -100603]
15087a00603M4569k0776m21K8578j7344N7708L4506l4818j81084k0529M1540N1553
15075a17121J09732K7062J5296Q6258j18032o9723k5892m5524O9088O5613l3447
15064c6690J8490J8968L2867O493L8042q8208n0522J46607J13837r6908n7619
15053D5357l1581J6861L0939k7086q3699o6505r979O4054k9903M891J06814M1066
15041F1229n6044J34071P1302r3317j55561j5104J3405J7433P2487m3053j30052
15030a23204l9437O6595k1490k7822o3797N1495O8962P627M5184n4127j4078k4247
15018a28339m2018o034K8222L2302K1494Q6458J24755n7976m268P3589k1031L548
15006A10702J7528N4410J4034J87021K41505J09913L0864K9183j24504k87919
$$ y = [-100603, -56034, -76810, -77231, -48653, -65997, -8289, 26217, -8601, -189685, -210214, -168674, -117121, -7389, 19673, 34969, 121227, 3195, -66528, -92420, -137944, -68856, -3243, -36690, -18200, 768, 33635, 40128, 78170, -10038, -60560, 86047, 199884, 102976, 45357, 13776, 30637, 61576, 34490, -49209, -115714, -125693, -61639, -91542, -86651, 20163, 61229, 5185, 139256, 210558, 117241, -38320, -53424, -40019, -22586, 49901, 6848, -123204, -162641, -96046, -117536, -145358, -209155, -157660, -88698, -81071, -35887, -90014, -104092, -128339, -170357, -176391, -148169, -115867, -94373, -7915, 116840, 58864, 54596, 128185, 107154, 110702, 128230, 182640, 196674, 383695, 625200, 735113, 765977, 795160, 670656, 382737]
14996C82737k27000j13550K5545M9866n0864N396o1972l4614o7888P3467N5233
14985C6356j12252l4421M0060p466J0475J6123m5713J1374j1499P9527j526j01753
14973a20715m9785M5917K9653P0356P198R801o7197j1288P4484j5060j00964O260
14961a21340L894o7656o0325L1245J09079K4591N595N6990L3973k4986k6570q5708
14949a21218m4760J24859P7141n7548k6641L403m6139p7295J422N9027M7892P2047
14937A2190o4433m4367q5657q3547l2755Q2813P1526J08647P4389l1709P4954
14926H2051p7225o6831n9575k8341K9432M7173L4682n179J13340k558j19481P3235
14914B0723q048L0955J3390O5723O130o8520j56689j8800n3928N006J19335m487
$$ y = [382737, 155737, 42187, 67732, 117598, 66734, 72130, 10158, -24456, -92344, -18877, 36356, -75896, -110317, -70257, -77723, -67248, -51125, -96838, -85464, -96963, -17436, -18962, -120715, -170500, -124583, -94930, -24574, -17376, -7575, -74772, -86060, -11576, -26636, -127600, -121340, -117446, -185102, -245427, -214182, -105103, -80512, -74917, -17927, 16046, -8940, -35510, -121218, -165978, -41119, 36022, -21526, -48167, -44764, -90903, -168198, -166776, -107749, -59857, 12190, -52243, -96610, -182267, -265814, -298569, -215756, -144230, -35583, 38806, 7097, 82051, 4826, -62005, -121580, -149921, -120489, -73316, -38634, -43813, 69527, 66969, -52512, 20723, 12675, 43630, 57020, 122743, 128873, 60353, -96336, -115136, -169064, -164058, -44723, -49210]
14902d9210l185J6491m8264k0922K4610q8632l3362K8755M7386N9506N4937o091
14890a7981m1608L6108l6776q6965j5402K2915K6706j7496L3544J16566N1792
14879G1403O6867p157l5524p7770n6104j12011m9282J11557Q8202J2821J8267
14868C1269n8026j0729R939P836m6669O0282J29676m247j2837K2129n9947j28026
14856e9350l7060k2212J14896m9297L122K4125N3448m3475j7089K1501J6015O140
14844A0764k66M6978J642J9783N9924j34161N4025L1924n9575m5321k853M0243
14832B3107n3952k7679J6631j20608m9073P2385L4019l9253j01879j29386M5524
14821c30164Q1024M8436J22215J23602l9405j12864l728O4916j10760J7473J15886
$$ y = [-49210, -52395, -35904, -84168, -105090, -80480, -169112, -202474, -173719, -126333, -66827, -11890, -17981, -59589, -23481, -60257, -147222, -162624, -139709, -113003, -130499, -96955, 19611, 71403, 138270, 131113, 95589, 17819, -38285, -150296, -199578, -88021, 181, 13002, 31269, -26757, -37486, -27547, -19711, -66380, -6098, 123578, 119331, 106494, 128623, 68676, -59350, -96410, -118622, -3726, -53023, -49901, -25776, 27672, -15803, -32892, -11391, 4624, 10764, 10498, 57476, 59118, 78901, 138825, 4664, 58689, 90613, 31038, -14283, -17136, 23107, -30845, -58524, -41893, -162501, -211574, -139189, -105170, -144423, -246302, -375688, -330164, -249140, -200704, -78489, 45113, 5708, -107156, -110884, -45968, -156728, -139255, -23369]
14810b3369Q9585m3705o7603J0419o9953m4021N8966j7127j05918p4173M5510
14799b41389P5686Q2197L1945L7163R4041l5057l3831P189K6162L6558j05030
14788b4366L2495L1285o757j4144K4578k9268n9373p1010L2305Q3990j8608j32416
14776a51289k747L1279M0954L8838Q8621j9988O357o1192l4619J0427N2146L999
14764B786n3161K224J0594l2000n3070J16462R2804r0432k6454L536N9055l2100
14752B44J4412J07619j53237j05017J2403P8055P5394p1490j13608J9212o3839
14741a99852k462J06215L6147o5842M5943K538j34M5130j7118l8172j09332j9725
14729b16664P6956l6535o6047K5479J17696J39223J2516k2287M3140r8622r116
$$ y = [-23369, 66216, 22511, -45092, -34673, -104626, -148647, -89681, -106808, -212726, -286899, -241389, -165703, -83506, -51561, -14398, 79643, 44586, 10755, 17944, 44106, 80664, -24366, 8129, 39414, 32657, 18513, 43091, 13823, -45550, -116560, -84255, -265, -18873, -151289, -154036, -122757, -81803, -42965, 45656, 25668, 32025, -29167, -63786, -53359, -1213, 2786, -50375, -48151, -37557, -69557, -122627, -6165, 86639, -3793, -30247, -26711, 32344, 244, 14656, 122275, -30962, -135979, -123576, -45521, 29873, -41617, -155225, -136013, -199852, -202314, -96099, -59952, -125794, -79851, -77313, -77447, -32317, -49435, -87607, -196939, -216664, -139708, -176243, -242290, -216811, -99115, 40108, 52624, 30337, 73477, -25145, -34261]
14718c4261j4241K5482j2235P4922P057p0482j28479K0340M7004l6606J6608k720
14706a07611l0080l5643O3640K3962r1389N9702Q0557j6731j00328j9131q158
14695a81210n1201N5267L7443j25155J9310R7499j3349l8002K7880O6700J4987
14684h9831K3943l2125P7011k5390N22J12649K1000l3039R859N7697n5223q4148
14672a7075n573m4160l261n858p4443j2355J08894M6472N459o5835p316K8050
14660d7001q66M0597p8116R2287O7536m2419q1176j04551p106P4970J7857l4745
14648a02733k7041J8529j31061m4830P1076J60279J8166j06577J46265P7244n2599
14637B6718k1680L0469j2133m0738o2740o9124l4173Q5996m994j03193M5282J27433
$$ y = [-34261, -48502, -23020, -35255, 39667, 46724, -23758, -152237, -131897, -84893, -121499, -104891, -107611, -137691, -173334, -109694, -85732, -177121, -117419, -36862, -53593, -153921, -173052, -181210, -232411, -177144, -139701, -264856, -245546, -148047, -161396, -199398, -171518, -104818, -89831, -65888, -98013, -21002, -46392, -45870, 66779, 87779, 54740, 64599, 122296, 67073, -17075, -22648, -66808, -70069, -75927, -150370, -162725, -53831, -7359, -1900, -67735, -75051, -47001, -47867, -7270, -85386, 6901, 74437, 32018, -49158, -153709, -160815, -85845, -67988, -102733, -129774, -111245, -242306, -287136, -216060, -55781, -37615, -144192, 2073, 79317, 26718, 5038, 35507, 23374, -17364, -80104, -149228, -183401, -97405, -102399, -205592, -160310, -32877]
14625c2877o9891q986P3302k5784O643P1937P2940p8312p6777j62994j1515J1388
14613b30926k2362J08564J0185n4891L847J70613J79950j5736j25882M2998n0619
14602A5741j00997l4440n731P9627R5049M7246n781n541k2444o7184M4066M3239
14590H2850J0669K071J3745k8876o2676o5388m7576O5135O4586P6682k1595J5763
14578A05390j22762m0105P9880l547M1348k9594n6501l6240L4177J02243m1401
14567C2888p2749j8195L1682L9329K2443M9376K095k7850k5362j13742m906L029
14555h1962J9660K8000K4593j3136Q8835Q960j01840J09974P3938J9045j25035
14544E1032j24546o1990l7599L8175m863L791P4041j4983M2152j5565q0236M5677
$$ y = [-32877, -102768, -111754, -38452, -64236, -57593, 14344, 87284, 8972, -67805, -230799, -242314, -230926, -253288, -144724, -134539, -189430, -185583, -14970, 164980, 149244, 23362, 66360, 15741, -85256, -119696, -125427, -45800, 49249, 96495, 90714, 85173, 62729, -4455, 39611, 82850, 93519, 95590, 109335, 80459, 17783, -47605, -95181, -30046, 34540, 111222, 89627, 105390, -17372, -57477, 22403, 18856, 60204, 30610, -25891, -62131, -27954, 74289, 32888, -39861, -58056, -26374, 12955, 35398, 84774, 86869, 59019, 33657, -80085, -84991, -81962, -62302, -34302, -9709, -22845, 65990, 74950, -26890, 83084, 157022, 176067, 51032, -73514, -135504, -173103, -134928, -139791, -136000, -61959, -76942, -34790, -50355, -130591, -84914]
14532h4914n5969l5633O697O2765r3914j6155O3481L7253j1195Q469P254m871
14520a16732j3029l8072J7379L2820k5772N7810J40658L7962j7526l825J10296
14509A81969n1010q6339q7712n3357M1625K1220n9806n9751j3771R4301J45453
14498G2822m5002n7697P0811N1005P084m1483o6939M5296K208j1333m9018M4293
14486B2047L0098n5544r9072L5351J56970J42813j09100k13307j2888n64L8937
14475f4259k486j34039R951P4436n581j7328R646N1590J1373l1057j0379n2204
14463a60337O9633O6814j9237K666K1434j6145j13989J3437M8178j3148l9141
14452a39835J51403N1993p6235p2605K4516p576M5582m0040J2955o4163q7107
$$ y = [-84914, -140883, -176516, -169819, -107054, -200968, -217123, -153642, -116389, -127584, -119115, -111861, -116732, -129761, -167833, -150454, -117634, -143406, -85596, 55062, 93024, 75498, 71673, 181969, 130959, 44620, -43092, -96449, -54824, -33604, -93410, -153161, -166932, -72631, 72822, 27820, -29877, 40934, 91939, 99023, 57540, -9399, 35897, 38105, 26772, -22246, 22047, 52145, -3399, -102471, -67120, 89850, 232663, 123563, -89744, -102632, -103196, -64259, -66745, -200784, -190833, -116397, -121978, -139306, -129660, -78070, -66697, -97754, -108133, -160337, -90704, -23890, -43127, -40461, -19027, -35172, -149161, -135724, -87546, -100694, -139835, 11568, 63561, -12674, -85279, -60763, -68339, -22757, -62797, -49842, -114005, -201112]
14441b01112p749M832K7219P1889L8228K7931M1638N1531r7272K7807K6224n2053
14429d0887k2708n4069M5978l0013l5084P0299P5861L0527k9811q4795j7408k403
14417i4513j2984J4580p288j6003l5235N0525J06314J911n6597q3991j28926P7097
14405a85110J72998L5073j70555r305N5007P2219n0784n5186m9335M0810J14313
14394b9855R8543R821K4342o8731o9565k5045m4070L2013k5460l872j8415K8989
14382i1305J5817K7224K90n1764M3891N9414M8038m5229j574J729j7995M4029
14370C2565q4365q2723J15602L2669j07123k2336N4767J039n6505k8901R2195
14359e3116L1389m2215n1653J2602p1969J55628J25719j44775n3189l3550M4144
$$ y = [-201112, -208861, -204029, -176810, -104921, -66693, -38762, 2876, 54407, -42865, -15058, 11166, -40887, -63595, -117664, -71686, -101699, -136783, -66484, 9377, 39904, 10093, -74702, -92110, -94513, -107497, -92917, -100205, -116208, -151443, -100918, 5396, 7307, -49290, -133281, -262207, -185110, -12112, 22961, -147594, -156899, -101892, -29673, -80457, -135643, -184978, -144168, -29855, 68688, 78509, 102851, 34120, -35445, -60490, -104560, -72547, -98007, -101879, -120294, -91305, -75488, -48264, -47974, -99738, -55847, 3567, 51605, 6376, 4802, 6531, -11464, 32565, -51800, -134523, -18921, 13748, -93375, -115711, -60944, -59905, -116410, -145311, -53116, -21727, -63942, -115595, -102993, -174962, -19334, 106385, -38390, -91579, -125129, -80985]
14348h0985P2157L9978p0742N413M3275P0461j7353j7223m2153o0099q2423k4395
14336a64089J03172M5628K2985M546q1644j8282l0149J0551M9680n8653q2910
14325a99165R221J07589P7779N0792l3326j0674M6238J6986j18254o0768P9964
14314c3618J36004O5878k9296j23242l7564J7064m1968k5472j3423K3374o0952
14303a23215N2847J5609j04301m9370N4508J67932n639j06927o2642m1671O0444
14292a42425R5740P921J16412m9054J318P401J8286l6365r7076l2681m1300N4036
14280i7787K3136L9084n9653K3261N2344P508j0815j05174N2938J5983J59637
14269A00462j06531j66355J2977J11620M9790K2593q8816r3736L714J54979r370
$$ y = [-80985, -8828, 31150, -39592, -34179, 9096, 79557, 62204, 44981, 2828, -57271, -139694, -164089, -60917, -15289, 7696, 12242, -69402, -87684, -117833, -107282, -57602, -116255, -199165, -189944, -82355, -4576, 46216, 12890, 2216, 48454, 65440, -52814, -113582, -33618, 102386, 168264, 138968, 15726, -21838, -4774, -46742, -72214, -85637, -62263, -123215, -70368, -54759, -159060, -208430, -153922, 14010, 8371, -98556, -161198, -202869, -142425, -46685, -38764, 77648, 28594, 29912, 37313, 55599, 19234, -77842, -110523, -151823, -97787, -74651, -35567, -95220, -71959, -19615, -12107, -22922, -128096, -75158, -59175, 100462, -6069, -172424, -159447, -47827, 1963, 24556, -64260, -157996, -154282, 697, -8673]
14258h673m1575o2638J9121J16505O1911j48934Q903O138J346p2381J3905N6613
14246d9759M4673l044o0140r3171R3800R4928l5367O498L9993k7167K1084m1565
14234i237r980O943r2609j29658k6323j1670R9766J20231l1515m6959k3766l6787
14222a91564M9983J30161O0079Q691m7055m6909L9773k2945J016K6181N8373Q037
14210G3821m1157j0702k5871k3623K1409K8352r7105j01806j11668J02244R8511
14199h7595k3639j4566l289P22J9055m900R9724N4694p7341l1127L2405j1437
14187d7294m6857N6139n6740J0368L5250j5664O0256N5540m193q78o1493m1723
14175e7289n8291m4591k8083k7534K0265K1663K4673R0796l0919r0718j42855
$$ y = [-8673, -50248, -112886, -93765, 22740, 84651, -64283, -55380, -49242, -47896, -120277, -106372, -49759, -5086, -8130, -68270, -161441, -67641, 27287, -8080, -1582, 38411, 11244, 32328, -9237, -19217, -12274, -104883, -234541, -260864, -272534, -172768, -52537, -84052, -131011, -154777, -191564, -141581, -11420, 48659, 57350, 10295, -36614, 3159, -19786, -18770, 7411, 65784, 73821, 32664, 21962, -3909, -27532, -6123, 22229, -74876, -176682, -288350, -186106, -87595, -111234, -125800, -129089, -128367, -109312, -114212, -14488, 40206, -37135, -68262, -35857, -47294, -94151, -38012, -94752, -84384, -49134, -64798, -4542, 50998, 46805, 45927, -15566, -57289, -115580, -160171, -188254, -215788, -195523, -173860, -149187, -58391, -89310, -180028, -322883]
14164c22883M5996J29618N7332L5500j0224M8800J4192k8943k1332K6363p176
14153c2757r6821K1686J7258p1605l2808J3580N3914Q0328J0609m412N1163L678
14141A3813j5611L078n341K5563R4073L6379j01951n7668j8990J7253M4976j5829
14129A9745o6537j0542K2314l1414K6266r3156P1351J07422Q853j06792j3006
14118f5496Q6659P7297r99n9679j23775q0384P938J25396j4154M8287m4337j42673
14106a85920O1264N7903M4569L7228p1121l4117J53536N7042j01616o9674J0112
14095d0794N610j23428R180J49087o2025m8571R6970m125n8262m2905M6993J16238
14083D3968M9003m8744j55679l3412q402j51895J16237M4382Q4908J43642J18339
$$ y = [-322883, -276887, -147269, -89937, -54437, -64661, -15861, -1669, -30612, -51944, -25581, -32757, -129578, -107892, -90634, -162239, -195047, -181467, -127553, -47225, -36616, -41028, 10135, 13813, -1798, 1280, -4061, 21502, 115575, 151954, 50003, -7665, -26655, -9402, 35574, 19745, -46792, -57334, -35020, -66434, -40168, -133324, -61973, 45449, 54302, -52490, -65496, 21163, 98460, 97461, 37782, -85993, -166377, -158439, -33043, -47197, 1090, -43247, -185920, -124656, -66753, -22184, 15044, -56077, -90194, 63342, 120384, 18768, -50906, -40794, -35184, -158612, -149432, -345, -62370, -110941, -13971, -18096, -76358, -119263, -72270, 43968, 92971, 44227, -111452, -144864, -153266, -305161, -188924, -144542, -59634, 84008, 202347]
14072B02347L3828p3681q5072j45624p6813J39717O3327o0108l505L7960P3375
14061A05751M1190n5436j20241o9731Q8685j744n531k8482r165k4484O0400J33220
14049A14432j0179p9891L3434L1870P9510K0832J9841n6253n7803l8704j7531
14038C9558P8440j5173p189K4009J7130j4636j2548R298M7739l823m1296L1798
14026A53307j0538j05315p5828R1643Q1905R0002J9246J2594k0591J5741j20646
14015A31520r0091j4090Q1056P7801k2797k6943q476K527L2683L7504j4140O0305
14003B46859m8115o914k6985j21931J4332L2126r754j21049j04846k823k2542
13992a71642R5027P5584q459L3836K9489j2459k2427m2158L7578N3086K3760j72616
$$ y = [202347, 236175, 162494, 77422, -68202, -145015, -5298, 58029, -2079, -5584, 32376, 105751, 146941, 91505, -28736, -98467, -9782, -11526, -17057, -45539, -54704, -79188, -18788, 114432, 104253, 24362, 57796, 89666, 169176, 190008, 209849, 153596, 95793, 57089, 39558, 117998, 102825, 95636, 119645, 136775, 122139, 109591, 118889, 166628, 162805, 121509, 153307, 142769, 37454, -38374, 53269, 135174, 225176, 244422, 257016, 236425, 252166, 131520, 41429, 27339, 108395, 186196, 163399, 136456, 127980, 130507, 163190, 200694, 186554, 246859, 198744, 191830, 164845, 42914, 57246, 89372, 79618, -41431, -146277, -149100, -171642, -76615, -1031, -9490, 24346, 53835, 41376, 18949, -23209, 14369, 67455, 91215, -81401]
13980h1401m5290k7690Q3508M1379l9991K5173L75K3453K6930O3539k2430L9450
13968H7005m4154l9175L789m7109O2880J04436R81l7217n0745j18676l428Q2945
13956A532k4588L7088L9040M3643M3784M4188r9802j27214N7802P5417J07179
13945A98069K0288K3282k4493K0803r8837n4766j04204L4695R2891N9431J3447
13934A80606l7522P0170P9136j03355j15483m1692q3014J57067N5938j8724L4958
13923A78085R4154q783q1273q7278m0861r3356j2158m5825P3639N1116Q1011k7646
13911H0825l9670n4471L6365j1685k3188o5973K6563K0537l0877k2264J7501N6351
13899i986J2743K7802k924j40760k5030K1285J00684m5225l9979o344J6802L6304
$$ y = [-81401, -126691, -154381, -70873, -29494, -69485, -44312, -43937, -20484, 6446, 69985, 47555, 87005, 42851, 3676, 7465, -39644, 23236, 127672, 128653, 91436, 40691, -77985, -81413, 1532, -23056, 14032, 53072, 96715, 140499, 184687, 84885, -42329, 15473, 90890, 198069, 218357, 241639, 217146, 237949, 139112, 84346, -19858, 14837, 107728, 167159, 180606, 143084, 213254, 292390, 189035, 73552, 31860, -51154, 105913, 161851, 143127, 178085, 272239, 263456, 182183, 94905, 54044, -39312, -51470, -97295, -23656, 27460, 108471, 80825, 41155, -13316, 23049, 11364, -11824, -77797, -51234, -30697, -61574, -83838, -66337, -9986, 2757, 30559, 27635, -113125, -138155, -116870, -16186, -61411, -101390, -107734, -90932, -54628]
13887e4628P3773K1939P1461J0063m0071k3571l6753J6179o485j11235M3636l2913
13875f8605j22216j1830M4192L7602n1237m7774M9581l4986k7153O3086J8923
13864a50417M4518J57405Q202n7428m269p5740j20228J4096J7194L7059J14099
13853a5509N3460k8038L2j4694j9353N5538P5273o2769k911m4257n294l8272l4901
13840h1695M6212J26447j4550l6731n551j5632L6898L5438M857m3886J07844N0704
13828B10355k05056m5940K4624l3648j49815n6289Q7883K4315L1987Q321q4884
13817a88147n8457L9176M6547K7607Q7838j6235n9693j27674q0618N1008J54160
13806a24488P8974N013m9344J9004m8978l3546Q9567M4762O572o4741n4890k1983
$$ y = [-54628, 19145, 41084, 112545, 122608, 82537, 58966, 22213, 38392, 31907, -79328, -35692, -68605, -190821, -202651, -158459, -120857, -172094, -219868, -170287, -205273, -232426, -169340, -150417, -105899, 51506, 59708, 2280, -1989, -77729, -197957, -183861, -166667, -129608, -15509, 37951, 9913, 9945, -4749, -24102, 31436, 106709, 43940, 41029, -3228, -8522, -46794, -81695, -35483, 90964, 76414, 39683, 34132, 18500, 55398, 90836, 95693, 51807, 159651, 210355, 5299, -40641, -16017, -49665, -199480, -255769, -167886, -143571, -111584, -103263, -188147, -246604, -207428, -160881, -133274, -45436, -61671, -121364, -249038, -329656, -278648, -124488, -45514, -40501, -89845, -70841, -119819, -153365, -63798, -19036, -12464, -77205, -132095, -154078]
13794a54078O2581J57133O065M6918J8324j6950o223M8013m0283n5504r3725J2001
13782a5728J0043L2008P3256R1657l1250j8926L8027P237m167P921n7332j81143
13770d8397j01265J8365L3771P5525r1142P6607J07478Q2800K6790o0223L9841
13759A60150m9979P789m0788l5879k4041l0019j4772N4060J14412n405L801M258
13747A43587p8217N2233j1834r3241m138J2234N916P9678K2183l6397p451N5370
13735A39923N7730l8215L1716L4246J125m2394o8695J1002j8679m971r6570o8737
13723f2519k3130J26927J61324p598p4525j43409N9388R0652J30689K2888r3655
13712A87032j15502J947l185M5118J13553o204L014J0441J0853k268j85389k2728
$$ y = [-154078, -91497, 65636, 71701, 118619, 136943, 119993, 113770, 161783, 121500, 65996, -27729, -15728, -5685, 26323, 99579, 191236, 159986, 141060, 179087, 186324, 182157, 190078, 132746, -48397, -149662, -131297, -97526, -22001, -113143, -36536, 70942, 153742, 180532, 120309, 160150, 110171, 117960, 77172, 41293, 17252, -12767, -27539, 26521, 140933, 135528, 139329, 143587, 65370, 117603, 105769, 12528, 8390, 20624, 26540, 106218, 128401, 92004, 84553, 139923, 197653, 159438, 191154, 225400, 226525, 184131, 115436, 126438, 107759, 102788, 6218, -62519, -85649, 41278, 202602, 195004, 120479, -22930, 36458, 127110, 257799, 280687, 187032, 71530, 73477, 70292, 115410, 228963, 222759, 225773, 236214, 247067, 244799, 59410, 36682]
13700C6682O8727r175L1139J3914m4580r4894n0397N7292L5201K8898N3866O9537
13688A96210N1000l3191O5475j2514r1237P924Q3721j1217m17N5734O4228p6627
13676B99089j55512r8209q857J0129M223L0622L7909K5154O1859J2793M3345O4823
13664C27368j2482l7435N6874k0699j35912r8420P0305Q1513J8978n9540M747
13653A95297N1605P0253N8045K1646K9292J245r4254m420J16124J12346O52r942
13641E47889j3852M9670J04356J23470L6156M7684Q5516M7228O5039l0415l577
13630A059164O0689J99029J80621M6779J68714J59201J73420J90084J94842J99857
13620B632400K47487L99534O64086Q14462J027995J341045J566850J616309J538709
$$ y = [36682, 105409, 96234, 127373, 141287, 96707, 1813, -48584, 8708, 43909, 72807, 126673, 196210, 247210, 214019, 279494, 266980, 175743, 183667, 267388, 256171, 255754, 311488, 375716, 299089, 143577, 45368, 36511, 46640, 50863, 81485, 119394, 144548, 206407, 219200, 262545, 327368, 314886, 277451, 334325, 313626, 177714, 79294, 149599, 231112, 250090, 190550, 195297, 246902, 317155, 375200, 396846, 426138, 427383, 333129, 328709, 444833, 557179, 557831, 547889, 534037, 583707, 688063, 811533, 847689, 895373, 980889, 1028117, 1093156, 1062741, 1059164, 1119853, 1318882, 1499503, 1546282, 1714996, 1874197, 2047617, 2237701, 2432543, 2632400, 2879887, 3279421, 3943507, 4757969, 5785964, 7127009, 8693859, 10310168, 11848877]
13611A1848877J319184J062021P33128N42541N60246P61010R92790J424725J686593
13602B0931115J895000J855387J580246J184026N36096J21009k70141m63775m96102
13593B6872861l47136j07511Q8516M37700Q64922J258707J436175J637262J728830
13584C3870326J436466R03964J56732o56487j544896k112643k173666j947145
13576B7932651j325024n81206j36795J61185K54895L72167K89441J81771N3176
13567B7202261l5472k07538n53172p39984q66704q46128o58456o61202n50137
13558B2083468n14835n76813p18991p11459r04268j110606j471253j698306j617308
13549A2759629j525179j311473j084675p43800n32124m22638l60191k94447j76224
$$ y = [11848877, 13168061, 14230082, 14963210, 15505751, 16065997, 16827007, 17819797, 19244522, 20931115, 22826115, 24681502, 26261748, 27445774, 27981870, 28102879, 27832738, 27368963, 26872861, 26525725, 26418214, 26506730, 26944430, 27809352, 29068059, 30504234, 32141496, 33870326, 35306792, 36210756, 36367488, 35711001, 34166105, 32053462, 29879796, 27932651, 26607627, 26026421, 25889626, 26050811, 26305706, 26677873, 26967314, 27149085, 27202261, 27166789, 26959251, 26406079, 25666095, 24799391, 23953263, 23294807, 22633605, 22083468, 21568633, 20991820, 20272829, 19561370, 18657102, 17546496, 16075243, 14376937, 12759629, 11234450, 9922977, 8838302, 8094502, 7562378, 7139740, 6779549, 6485102, 6308878]
13540F308878j43877k0246J79060K64591N18140O34866P85546J138301J561977
13531A1227236J628543J666718J607096J410541R86460O96446O21758N37834N62868
13522B0945500R01094J088871J255588J500222J476515J438159J141832P40711
13514C0488492M47363K63764k3955k15878m82170n48564m38918L7565O52505J251878
13504C1432082J635333J859929J743221J259967O93949J48571n60771j251373
13496C6960908j624600j971814j860920j493656j115734n35954r2058J03791J46297
13487B8516260K45538J36254j51894l48526m02510o32902q56526j003259j090956
13478B4411479r16765o35542n20335l97924m66312o29999r33607j241181j452360
$$ y = [6308878, 6165001, 6144755, 6323815, 6588406, 7106546, 7741412, 8526958, 9665259, 11227236, 12855779, 14522497, 16129593, 17540134, 18526594, 19223040, 19844798, 20382632, 20945500, 21846594, 22935465, 24191053, 25691275, 27167790, 28605949, 29747781, 30488492, 30935855, 31199619, 31175664, 30959786, 30477616, 29929052, 29490134, 29527699, 30180204, 31432082, 33067415, 34927344, 36670565, 37930532, 38624481, 38773052, 38212281, 36960908, 35336308, 33364494, 31503574, 30009918, 28894184, 28358230, 28266172, 28369963, 28516260, 28761798, 28898052, 28746158, 28397632, 27995122, 27362220, 26505694, 25502435, 24411479, 23494714, 22859172, 22338837, 21940913, 21474601, 20844602, 19910995, 18669814, 17217454]
13469A7217454j804820j923975j795687j624381j383897j162767p87591o83205
13461F051131n71483m88859l38864l50500k76405k69359k38741k80753k18234
13452C017933j78915j54441m8087j31458l3119j67059j51606j16243j06531r7384
13442A833090r8453j22300n9840K5778n9423j22203k6740K0266N2676o8639R839
13431A384051k7654p2337K6663j8479k5437J2857O0708j282q3592j12972m8649
13420A093877k390p3836o9364K0955k5838j33929r5012o6418q4778l6437n655
13409E21175O6082J67984O0295q600j3449k2150K36j9459j15662j41833K3927
13398E18546Q6405o1052K094P9923k526j28762q0510q4878L4287N9500J20136
$$ y = [17217454, 15412634, 13488659, 11692972, 10068591, 8684694, 7521927, 6734336, 6051131, 5479648, 4990789, 4651925, 4301425, 4025020, 3755661, 3516920, 3236167, 3017933, 2839018, 2684577, 2636490, 2505032, 2471913, 2304854, 2153248, 2037005, 1930474, 1833090, 1734637, 1612337, 1552497, 1578275, 1518852, 1396649, 1369909, 1390175, 1442851, 1374212, 1384051, 1356397, 1284060, 1310723, 1292244, 1266807, 1279664, 1340372, 1339090, 1255498, 1142526, 1093877, 1091487, 1017651, 948287, 969242, 943404, 809475, 714463, 648045, 563267, 526830, 521175, 587257, 755241, 815536, 806936, 793487, 771337, 771573, 752114, 636452, 494619, 518546, 604951, 543899, 545993, 625916, 623390, 494628, 414118, 329240, 363527, 423027, 543163]
13387E43163m8481L0974J8186j03733q0072P322J2320k5010r543O3174N9854J4486
13375D82640o7912l2813p0705j1617M6479j3501j6639n7876L8958j6161j560P573
13363B86866j39538K7608j0385N3825N2820L5621O3789j7101j7849l6944o242
13352B92470j18288L4638J10333P8583l7995n5767L9961j27548n5960O0908Q6453
13341C07788K1691N7254J5271q7724r0579l8501n3421q4224J2758J23739J57139
13330C41191k1595q3086j686j18985j87844L4878J28941J1321l4841l2090l5338
13319H66N7806l0059L5878o1173m9210Q228N75O2539J01979q6371j19190J0389
13307f7743P1947O9804J0599L368o81r7136K1662Q481N312J2350N1399k6375p9451
$$ y = [543163, 494682, 525656, 543842, 440109, 360037, 367359, 379679, 354669, 345126, 408300, 468154, 482640, 414728, 381915, 311210, 299593, 346072, 332571, 315932, 258056, 297014, 280853, 279293, 286866, 147328, 174936, 164551, 218376, 271196, 306817, 370606, 353505, 335656, 298712, 292470, 174182, 208820, 319153, 397736, 359741, 303974, 343935, 216387, 160427, 221335, 307788, 329479, 386733, 402004, 314280, 223701, 185200, 131779, 47555, 60313, 184052, 341191, 319596, 236510, 234824, 115839, -72005, -37127, 91814, 103135, 68294, 36204, 866, 58672, 28613, 64491, 3318, -45892, -37664, -37089, 25450, 127429, 41058, -78132, -67743, 4204, 74008, 84607, 87975, 87294, -9842, 11820, 20301, 25613, 37963, 89362, 62987, -16464]
13294a6464O33M7275O0968l834K1197l8438m1516J5739K4551o5850l7828J13890
13282H0323O9338K1226j3153q977K4279O1429j08392j17286N0417M3024r305K6870
13270A19793j4160p0646k1090M2075k68k5630m201k9669q2672K2408L8452J02593
13258G6985l386R0881R6331k5034j33853j53093r0461P4810J69817O364p8338
13247C1023J7450l777k35L6682m9320M6735m0895n6747J35204p9981q5998J0461
13235c9398N4713Q3099J51883l7618p4209j51282J5526J9539n345K1890n275p522
13223B6001j9568m9149J5234O0495k3167K5918Q557M4479N138K135m5292P833
13211E8614o787J2997J2035m971m7459J1877P3932j4812l4106J6418o7216L3255
$$ y = [-16464, -15831, 31444, 92412, 88578, 109775, 71337, 29821, 45560, 70111, 4261, -33567, 80323, 149661, 170887, 157734, 148757, 173036, 234465, 126073, 8787, 59204, 102228, 92923, 119793, 105633, 34987, 13897, 55972, 55704, 30074, 25873, -3796, -86468, -64060, -25608, 76985, 73599, 164480, 260811, 235777, 101924, -51169, -141630, -66820, 102997, 109361, 31023, 48473, 44696, 44461, 81143, 31823, 78558, 37663, -19084, 116120, 36139, -49859, -39398, 15315, 98414, 250297, 212679, 138470, -12812, 2714, 22253, 16908, 38798, 33523, 26001, 6433, -42716, -27482, 33013, 9846, 35764, 44321, 88800, 93938, 96073, 50781, 58614, 51827, 64824, 76859, 71888, 24429, 36306, 110238, 95426, 61320, 77738, 10522, 43777]
13199D3777k4886N4835k2552p2947J1664m2296M4164j2025k5510N8222N9630J8501
13187I0577L0513q1026n1862O0568M4572k4912r1603J05907J6048j837p7777l7452
13175a8284J1125k38L1520R9833j18005J49695J03203j11388p5019n4269M4653
13164F2826J15434m4607k2725M2430n8164L8637J74144O3608J31621L9352j46463
13153C96093q0832n2698J2559L1703r9364o777P6445N1352r893j24447m4570k0694
13141A28877o860K1885L5537k4147q9411M0444M0175M3168n3605l1902L2759k2783
13129A14137J28665Q8310M4550k0208k1766r1380m7094l5378l0614p1775r0409
13118c2962J39504q825q0943K0942K5733J22033J25027j6174n2211m3722M8978
$$ y = [43777, 18891, 73726, 51174, -21773, -10109, -52405, -8241, -20266, -45776, 12446, 72076, 90577, 121090, 40064, -11798, 48770, 93342, 68430, -23173, 82734, 98782, 96945, 19168, -18284, -7159, -7397, 24123, 123956, 5951, 155646, 258849, 147461, 72442, 18173, 62826, 178260, 133653, 110928, 153358, 95194, 133831, 307975, 371583, 503204, 542556, 396093, 315261, 262563, 275122, 306825, 207461, 200684, 277129, 328481, 318588, 194141, 149571, 128877, 122017, 143902, 179439, 155292, 65881, 106325, 146500, 189668, 136063, 104161, 136920, 114137, 242802, 331112, 375662, 355454, 333688, 242308, 195214, 159836, 129222, 57447, -32962, 106542, 97717, 16774, 37716, 63449, 185482, 310509, 294335, 242124, 198402, 247380]
13107B47380j4272m8218K7154j5324M7394P6876j74801r1271K7625J807l7065
13096D7285N2257K9070r6483L2457J34798j9490m8155r2352j01553J512R0001
13085B9347N4893L8395R3778m9472o6613j8645k5386Q3628M633J9774O5261n4058
13073A75535n0482n2282r528r82J09697R1234r6703o2177r610K4334M6315R791
13061A75142K8563p8644q4628R20J30502P4060J7118m4925J2669m382J2131J926
13049B40452j451j14127l9399M9138M5729K3647j48971M0638M4075J26270J18934
13038C84935P234p2790j47366q3941k6464j09400K5302P4510j3321L0182R438
13027G8319o6266Q5541J30727k208o9662r2783q6289O6426j8183M8096k6613J3530
$$ y = [247380, 233108, 184890, 212044, 196720, 244114, 320990, 146189, 54918, 82543, 84350, 47285, 99542, 128612, 32129, 64586, 199384, 179894, 131739, 39387, -62166, -60654, 29347, 84240, 122635, 216413, 166941, 100328, 81683, 56297, 139925, 144558, 164332, 229593, 175535, 125053, 72771, 63243, 62261, 171958, 263192, 166489, 104312, 94702, 119036, 165351, 175142, 203705, 125061, 40433, 41353, 171855, 245915, 263033, 218108, 230777, 226395, 238526, 240452, 239001, 124874, 85475, 134613, 180342, 203989, 55018, 95656, 139731, 266001, 384935, 392169, 319379, 172013, 88072, 61608, -47792, -22490, 52020, 38699, 68881, 78319, 12053, 97594, 228321, 226113, 156451, 63668, -22621, 43805, 25622, 73718, 47105, 60635]
13015F0635M7592m9713k5701j101M4927R2844P3737p2801j2109O35n6557J8460
13003A20848J04826M1480K1666j1585n6559m2347k7161L5502o3065m8252j1663
12992F3690N7556O8140L9800k561N1243p5345J4120N9525J11400L2204m4538l3632
12980C41602J8147j9976J0699M8140k8443p1407m3534K8669N8068L082p583M5452
12968C82916m965q222p0694j05033J104K5614P9403j7830l9165P6123r7810p2332
12956A49109O5232J60075L4629j24674j68160p8780K3273M5144L0244m3716k5548
12945F6828Q0044k7622L0557J17124o7667r6945m6490Q7151N335o448M0127n2187
12933A29807j8677M1333l818Q372j4874M7148J52483N2389k1408m6430j4811L6876
$$ y = [60635, 108227, 58514, 32813, 31712, 76639, 169483, 243220, 170419, 158310, 158945, 102388, 120848, 225674, 267154, 288820, 277235, 220676, 178329, 151168, 186670, 123605, 75353, 63690, 121246, 189386, 229186, 226625, 277868, 202523, 216643, 276168, 387568, 419772, 375234, 341602, 359749, 339773, 350472, 398612, 370169, 298762, 255228, 283897, 341965, 345047, 337464, 382916, 377951, 369729, 299035, 194002, 195106, 220720, 300123, 282293, 243128, 319251, 221441, 149109, 214341, 374416, 409045, 284371, 116211, 37431, 60704, 105848, 136092, 92376, 66828, 146872, 119250, 149807, 266931, 199264, 102319, 55829, 142980, 148315, 141867, 181994, 129807, 111130, 152463, 148645, 157017, 142143, 189291, 341774, 394163, 372755, 326325, 311514, 348390]
12921C48390k4017J00535M2027L6591l3061O0280Q0154k4784p0240J09417J92348
12910H17640J96136J00477J66171J94632R1120M9890j63865j33785k08139j64008
12900I46269J609M4101q5574j59207p4921p3170r8617j28377Q1610l273j543k6408
12888D22499o6859j6579J8361m4007q6516R463N6945J08923N4818J7269l1384
12877D42933J1297P2844k1234O2512J33945j2757L1256J65350J68312J63170M4378
12866A262006l2692q184j43271j90773j50707j00198j5453m6063k32319j45533
12856A96813k1098R8246m6902j21362j00830k3876M093M1498R5920R6966j1424
12845B08044M6896p3321o9515m7462k7682Q3927J0279p9783q0049k3335R5949
$$ y = [348390, 324373, 424908, 466935, 503526, 470465, 530745, 610899, 586115, 515875, 625292, 817640, 1013776, 1114253, 1280424, 1475056, 1566176, 1616066, 1452201, 1318416, 1110277, 946269, 947878, 991979, 906405, 747198, 672277, 599107, 500490, 372113, 453723, 450450, 448907, 422499, 355640, 339061, 357422, 313415, 226899, 236362, 293307, 402230, 457048, 474317, 442933, 454230, 527074, 505840, 568352, 702297, 689540, 720796, 886146, 1054458, 1217628, 1262006, 1229314, 1221130, 1077859, 887086, 736379, 636181, 620728, 574665, 342346, 196813, 175715, 273961, 227059, 105697, 4867, -19009, -14916, 26582, 122502, 219468, 208044, 254940, 181619, 112104, 64642, 36960, 120887, 131166, 51383, -28666, -52001, 43948]
12834D3948L4264L5237J7621N708L122l7154q1288k7188J4861M4710N4561K0956
12822A29358j05782M8917j190o0144k6989J9976L8815l438N6292k0732K4249K503
12810A01835J05558J4025m1296q3324j10772l8279n776P8954Q9901N8601M1173
12799B10600l1754j3407j39938j58604N4537J16616M6340p4940r9147K9867L7363
12788b2467p665N5019K3793j5802N5185j3542j4986O2257J77820l7722j67178
12777I4712J297k743j02536P3311N6506o9069M5111L2616j55430j30740q7304
12766b44269N4644J00919j2725O8472J20045j4585n9821r9575q1324M7741P3772
12755d6706J30114R7525q2898r045o5114o9924l0730J57894j3436j03675k2137
$$ y = [43948, 78212, 113449, 131070, 136778, 139900, 102746, 21458, -5730, 9131, 53841, 108402, 129358, 23576, 72493, 71303, 11159, -15830, 4146, 42961, 39523, 95815, 75083, 99332, 101835, 207393, 221418, 180122, 96798, -13974, -52253, -58029, 20925, 110826, 169427, 210600, 178846, 165439, 25501, -133103, -78566, 38050, 84390, 9450, -89697, -59830, -22467, -30132, 24887, 48680, 32878, 88063, 74521, 59535, 121792, 299612, 261890, 94712, 96009, 93266, -9270, 64041, 120547, 51478, 96589, 129205, -26225, -156965, -244269, -189625, -88706, -101431, -32959, 87086, 72501, 12680, -86895, -168219, -120478, -46706, 83408, 180933, 98035, 88990, 23876, -46048, -76778, 81116, 67680, -35995, -58132]
12744e8132j7928O6605o0730k432P7082p7397p3461L4692P5529Q4638N5253j18459
12732a4740j06404R0600N3642l3300Q6513K6343k5746l3952O5760P7246j39347
12721D6615n0035p4472P404Q6913q6023k9178P7027J746l9082J6025J03480J13677
12709A74097o6620J8373j5405n6750J6952k3650O757k8845p7423O5137m740l8109
12697c0226O9372M3041M937j10406P2299N7444m4154q6248M9390M8889q6855j3629
12685b6146K6579N2652j257q122p148l55J6993m541J5427Q9043j5408L6886L8860
12672B13463R9400K3570o6872r2544n2460L6530N1631n5399p4082r0015O7947
12661F1169J45679n4304l1141L1865M5657K361q555r2265O5083L580o3085m3688
$$ y = [-58132, -76060, -9455, -70185, -72617, 4465, -72932, -146393, -111701, -36172, 48466, 103719, -14740, -121144, -30544, 23098, -10202, 76311, 102654, 76908, 42956, 108716, 185962, 46615, -3420, -77892, -70488, 16425, -69598, -98776, -21749, -20003, -59085, -43060, 60420, 174097, 107477, 125850, 110445, 53695, 70647, 46997, 53754, 24909, -52514, 12623, 7883, -30226, 39146, 82187, 87124, -23282, 49017, 106461, 62307, -23941, 25449, 74338, -12517, -26146, 433, 53085, 51828, 43706, 36558, 36203, 53196, 48655, 64082, 153125, 137717, 174603, 213463, 312863, 336433, 269561, 177017, 124557, 161087, 212718, 157319, 83237, -6778, 61169, 206848, 152544, 121403, 153268, 198925, 201286, 192731, 100466, 165549, 169129, 106044, 62356]
12649F2356L4934P2140N6907M6144n2423k6561j554l2258j3848L1882R1648L7610
12637C06977M2962j4204L6373m6744j02965P577M3452n8266k4763M7954l9899
12626A98454o1547l519n0928P656M8999Q4409m6337m8061m6093o3192o2903n6291
12614i9353J7124K2017Q7160l9658k5427J4107J12598p95j761J6489N5570m0754
12602A17317j0080L4372j4060k8292n9354k9094P8824k0173j36996J7360n4246
12591a04422m6064Q2083J832O3311M8016q140M1258P843M6828m7571l3353L3585
12579H5206Q026j5234j52151q5223R6860l0420j41252K6584J53065N8767q3572
12568g9344L243N1003q740M1262N6519o9033p5664M8379K2496J8447M9523j7589
$$ y = [62356, 97290, 169430, 226337, 272481, 220058, 193497, 191943, 159685, 145837, 177719, 269367, 306977, 349939, 335735, 372108, 325364, 222399, 229976, 273428, 215162, 190399, 238353, 198454, 136907, 133388, 82460, 90116, 139115, 223524, 177187, 129126, 83033, 19841, -43062, -99353, -82229, -60212, 26948, -12710, -38137, -24030, 88568, 87773, 86012, 102501, 158071, 117317, 107237, 141609, 127549, 99257, 39903, 10809, 89633, 69460, -67536, -50176, -104422, -150486, -68403, -66571, -3260, 44756, 36616, 77874, 85717, 132545, 84974, 51621, 85206, 93232, 77998, -74153, -159376, -62516, -92936, -234188, -207604, -54539, 4228, -79344, -76101, -25098, -33838, 7424, 63943, -5090, -80754, -32375, -9879, 8568, 58091, 40502]
12556D0502L2072J4357K9767p1841k837Q3846O5872j5185p866j52356l0228Q873
12544e024r762n8062k2048L8856L8676P8442L0024O644j79822k8814k0098L6113
12532i4875N3400L7980m2902j1845J22391m4246J2068J53505M7767j33969o0597
12521C8677m1292k4079l5241J31385O7617L6788p5634k1051j206K0877o4523k161
12509C0157P1791N9323P891j23993j35508N628L2011J04987J7831o1252o3971
12498e5105J8297Q3710p9198j2669k9497K2131O5625M4651l9201j0790l5210J2507
12486a4749k731q2293k5139O894j08221n5835J05194R6569Q9870M8810l377L9802
12474I4794l1235k9588J22825J17344k4932j4473K3157n4705j13409k4732J1895
$$ y = [40502, 72574, 86931, 116698, 44857, 42020, 125866, 191738, 176553, 168687, 16331, -13897, -5024, -14786, -72848, -94896, -56040, -17364, 61078, 91102, 97746, -82076, -110890, -130988, -94875, -41475, -3495, -46397, -58242, 64149, 19903, 31971, 185476, 233243, 99274, 38677, -2615, -26694, -61935, 69450, 137067, 173855, 98221, 77170, 75964, 96841, 32318, 30157, 101948, 161271, 169162, 45169, -90339, -84711, -52700, 52287, 70118, 8866, -55105, -36808, 46902, -32296, -44965, -74462, -52331, 13294, 57945, 18744, 7954, -27256, -14749, -17480, -99773, -124912, -118018, -226239, -282074, -176880, -80311, 9559, 58369, 54992, 94794, 63559, 33971, 156796, 274140, 249208, 234735, 257892, 203187, 89778, 65046, 76941]
12463G6941l2086Q287P6928J811m9369l5652L4104k9529k8777M7898J33021J5020
12451B18597j0735N6661j37281K6992P8453k7274n5966m7029L4898m7585J3434
12440A03165O6729p2094k0134N0708j05340k5180K8154j4012M4727j3309Q72J09517
12428A53803J00765K6786l5119j11086M2139J7636O9658n7205r3771L984L1881
12417A49471m6645K6183j4372j6927j9856N6886k449P567J0512r732L5229P7034
12405B52901J4366O8443r4564m3155n3040N5253L3998p9195n8271O9118K6529
12394A92383l4105j7772j5953o4332o6561M2003m280L3225n4197o0775K8386N0506
12382B8528l1248l6663O8302j4285l8134J27919J01591M4053M9919l6916j19183
$$ y = [76941, 44855, 53142, 130070, 131881, 82512, 46860, 80964, 51435, 22658, 70556, 203577, 218597, 207862, 264523, 127242, 154234, 232687, 205413, 149447, 102418, 137316, 89731, 103165, 169894, 97800, 77666, 128374, 23034, -2146, 26008, 11996, 56723, 43414, 44286, 153803, 254568, 281354, 246235, 135149, 177288, 194924, 264582, 207377, 113606, 117590, 149471, 102826, 129009, 114637, 97710, 77854, 134740, 132291, 139858, 150370, 140638, 175867, 252901, 267267, 335710, 241146, 197991, 144951, 200204, 234202, 155007, 96736, 165854, 192383, 158278, 140506, 124553, 60221, -6340, 35663, 31383, 64608, 10411, -50364, -21978, 28528, -2720, -39383, 28919, 14634, -23500, 104419, 206010, 250063, 299982, 263066, 143883]
12371A43883o5841o0387L5532j0358Q7880L0872m33o229P2046J736p9297q2650
12359F6754O0888k8102k0772j6549j9105L8928L3276p1520q6214J2396O6341N2815
12347H9136k5926p4836J22459j6218N4425L9326Q402l5266l9473J06734O0527
12336B89290M9962J9699k3826m1665q0653M0174O072m0087J690J8729r061j8666
12324B11658l316O8195P6505N1200L2244n8404m2865K5348M297L1665L4230l4379
12312C96378R535o216O6989J69754N5470J6500O8533N2465m0057j0743M5176J40604
12300I64388P3134m9028m0320R6653L9121J15251J05721M2267l8547J00782P1144
12289A480566N3933J26452M279P325K31229J24467J22199J18571J06414J32787
$$ y = [143883, 78042, 17655, 53187, 42829, 130709, 161581, 161148, 154919, 226965, 228701, 149404, 66754, 127642, 99540, 78768, 62219, 43114, 82042, 115318, 43798, -42416, -30020, 36321, 89136, 63210, -11626, 110833, 94615, 149040, 188366, 196768, 161502, 122029, 228763, 289290, 339252, 358951, 335125, 293460, 212807, 252981, 259053, 218966, 220656, 239385, 230324, 211658, 208342, 276537, 353042, 404242, 436486, 378082, 335217, 360565, 364862, 396527, 430757, 396378, 405913, 399697, 466686, 636440, 691910, 708410, 776943, 829408, 789351, 778608, 823784, 964388, 1037522, 988494, 948174, 1044827, 1083948, 1199199, 1304920, 1347187, 1308640, 1409422, 1480566, 1534499, 1660951, 1665230, 1672555, 1903784, 2028251, 2150450, 2269021, 2375435, 2508222]
12279B508222Q8259P7105K30446K35909K23907K59549K39339K52144L19872L51167
12269D785919L59779L50700M49754N63159M72470N35929O05715R52047R20724
12260I996196J013083R63968J131320J314337J467552J524294J497004J637321
12252B0545075J724821J621145J749011J586896J500078J443957J454660J042531
12244C2668174R11081R40115P22990N02030N44162M42418K67718L62861L42457
12235C7704006K97229M50270N26588N34856M84057M78430N85997N87913N58531
12226D2207877M65035L99862M21418K32796K15458J13318P7536M5313m0923N7795
12216D4195485J21089K5039Q2745K76002M08058L77669K75585J71937J68682K3672
$$ y = [2508222, 2596481, 2673586, 2904032, 3139941, 3363848, 3623397, 3862736, 4114880, 4434752, 4785919, 5145698, 5496398, 5946152, 6509311, 6981781, 7517710, 8123425, 9075472, 9996196, 11009279, 11973247, 13104567, 14418904, 15886456, 17410750, 18907754, 20545075, 22269896, 23891041, 25640052, 27226948, 28727026, 30170983, 31625643, 32668174, 33579255, 34519370, 35242360, 35744390, 36288552, 36730970, 36998688, 37361549, 37704006, 38001235, 38451505, 38978093, 39512949, 39997006, 40475436, 41061433, 41649346, 42207877, 42672912, 43072774, 43494192, 43726988, 43942446, 44055764, 44133300, 44178613, 44137690, 44195485, 44316574, 44341613, 44424358, 44700360, 45108418, 45486087, 45761672, 45933609, 46102291, 46125963]
12206D6125963n7875k18031k90450l37424m11358n55129n15950n00813m54910
12197D2784023l80414l52529m01826l44031k80597k57485k24620j78908j93330
12188D0170283k20886m03309o16430o79026r15339j078316j275167j445344j677927
12179C1858539j794032j809141j798838j710174j728289j752373j563153j410313
12171A8292226j344590j318965j130213j166713j016179q67675p91302p61886
12163I894703o60467n86556m67701m92931m71473m18449l74820k92792k35562
12154E893952j56131j90977k89765k99085k18430k83635k25977r6614j79906k02133
12144C751299k47336j45206q5802q8170j16645J3031j24301j34036m4110k8617
$$ y = [46125963, 46068088, 45850057, 45559607, 45222183, 44810825, 44255696, 43739746, 43238933, 42784023, 42403609, 42051080, 41649254, 41305223, 41024626, 40767141, 40542521, 40363613, 40170283, 39949397, 39546088, 38929658, 38250632, 37335293, 36256977, 34981810, 33536466, 31858539, 30064507, 28255366, 26456528, 24746354, 23018065, 21265692, 19702539, 18292226, 16947636, 15628671, 14498458, 13331745, 12315566, 11447891, 10656589, 9894703, 9234236, 8647680, 8179979, 7687048, 7215575, 6797126, 6422306, 6129514, 5893952, 5737821, 5546844, 5257079, 4957994, 4739564, 4455929, 4229952, 4133338, 3953432, 3751299, 3503963, 3358757, 3272955, 3184785, 3068140, 3081171, 2956870, 2822834, 2778724, 2750107]
12134B750107J9238j61069j56251j45333q606m7234n0490k4351o8298j73352j42824
12123A791537m2925k7366l4610p7930q0064m6453p5812l0389m7662J1029m071
12112A335284j16404j60206n2420J7714J24449j9148q4183j6621J7194n6607q1637
12101I07415j3781l1155R663n9251K3886p1265l1914n751M0023J3670n3899J1256
12089G38897j4570p8j8930q9643q1809j30811m670J39468J05494K9555J846j920
12077F72829j52081q4049J2354n3359j5877M2832Q2718Q5388K4673L7410N3889
12066G06727q4463j05952n8537p097k4670L4430o7562J4960P707j22761j30088
12055A62694j4021L4823N2269Q2110j3665q6841P977J38623N9529q6075k9634
$$ y = [2750107, 2769345, 2608276, 2452025, 2306692, 2298086, 2250852, 2200362, 2176011, 2107713, 1934361, 1791537, 1748612, 1721246, 1686636, 1608706, 1528642, 1482189, 1406377, 1375988, 1328326, 1339355, 1335284, 1218880, 1058674, 1006254, 1023968, 1148417, 1129269, 1045086, 1028465, 1045659, 989052, 907415, 893634, 862479, 872142, 812891, 836777, 765512, 733598, 727847, 767870, 781540, 727641, 738897, 724327, 724249, 705319, 615676, 533867, 403056, 398386, 537854, 643348, 672903, 674749, 672829, 520748, 436699, 449053, 395694, 379817, 422649, 505367, 590755, 615428, 652838, 706727, 622264, 516312, 457775, 450678, 426008, 460438, 392876, 407836, 415543, 292782, 162694, 148673, 183496, 235765, 317875, 304210, 217369, 225346, 363969, 423498, 337423, 307789]
12044C07789o7099j1925r136O870Q572O5958o1711j7472k317l0472J6778n3769
12032A52066q036l1308J2320L5674j8473n9598j9706M763m830L9151J1039J3090
12020A26152n4500j7245l2248j8788n53O4061L8644o9295j17947Q7431J36537
12009A42249L06l9079j2136J17173j3235j69271j14004P4520J24313m2188K4985
11998I3633r4183r1884l2755J13303J12054L251o7095Q4004k2176p9933K2290
11987D0509N0898j41757m7923M2086J51037R0484K3017K8869r329l8692m8268
11976A40931k7973m6061P466J0979o5922Q930O0553N7037N4915J6554p4678p468
11964A35263K0111J7652j3487p4257q2161P1510K6166R80m7984j3474L1357P5469
$$ y = [307789, 240690, 228765, 219629, 226499, 235071, 301029, 239318, 221846, 219529, 189057, 205835, 152066, 144030, 112722, 125042, 160716, 142243, 82645, 62939, 67702, 62872, 102023, 113062, 126152, 71652, 54407, 22159, 3371, 2818, 66879, 105523, 36228, -81719, 5712, 142249, 142555, 103476, 91340, 208513, 195278, 26007, -87997, -13477, 110836, 68648, 93633, -550, -92434, -125189, -11886, 100168, 103419, 36324, 120328, 98152, 18219, 40509, 91407, -50350, -98273, -56187, 94850, 185334, 208351, 237220, 227891, 189199, 140931, 112958, 66897, 74363, 85342, 19420, 28350, 88903, 145940, 200855, 217409, 142731, 135263, 155374, 173026, 159539, 85282, 3121, 74631, 100797, 101777, 53793, 40319, 71676, 147145]
11952A47145J1770j03290q9707l2215o466J285K5815L0536l257K340K5908l9953
11940c0089J380R3772n163r2871p7257r6683P93K6973J62931N5906L0382M1445
11928A11519m5466l5125m1211M2559M0941J6826K5666N447j26278j85449M0599
11917a49972J07991Q7276j08554o9308J6262j2519L0703o9290O6260J08071L6244
11906D3164l7455M5624L6991N04o5234j27988L5765P3101l5842m1848M271l996
11894g2943j7387Q9834K9448r0071P3968J7287J7145n8808n7216q699j23427N3382
11882a47487N4267q702L878M9766m2932L5176O5848p4272r0553M9130R9381L7504
11870C1004K9386r885n385m1595l1156J29833L3399j02492m4981j9187k2299Q8849
$$ y = [147145, 158915, 55625, -34082, -66297, -72763, -71478, -45663, -15127, -18384, -16044, 9864, -30089, -28709, 65063, 59900, -32971, -110228, -206911, -206118, -179145, -16214, 39692, 70074, 111519, 66053, 30928, -10283, 32276, 73217, 90043, 115709, 121156, -5122, -190571, -149972, -41981, 45295, -63259, -132567, -116305, -128824, -98121, -167411, -101151, 6920, 43164, 5709, 51333, 88324, 88828, 23594, -104394, -68629, 4472, -31370, -73218, -68947, -72943, -90330, -496, 28952, -61119, 12849, 30136, 47281, -11527, -68743, -77442, -200869, -147487, -93220, -101922, -98044, -48278, -91210, -56034, 9814, -64458, -155011, -105881, -6500, 31004, 60390, 50505, 45120, 3525, -27631, 102202, 135601, 33109, -11872, -31059, -53358, 35491]
11858C5491R1901o6975J604k1141K4113N1168K8951j00560L8458J1386j04284
11847i888m6493j5199P1929K9087q496l1963j2096o255K201k9301Q003R8800M6662
11834I6991q2346n510J0597o156p4206J61597J2210q6320n9581k2601J07228p4638
11822b2735n9467j6289O0309J7108m3872n8319J00226J24484N8586M2070J6154
11811B18255M1301j8576m3757k6718j01605k4396Q7081Q0339j9725o2663N9679
11800A89215j5911k8173K7194O6748J2201o8466R413k6310m5011K3268P7722O8231
11788B90121K2450p7283l7635k4898K5186N7183q825j15915m8307O4423J37699
11777B84199Q477J7726J2948o304K3781j7109k9940k4231m9586j6548l8262N513
$$ y = [35491, 127392, 60417, 62021, 40880, 64993, 116161, 145112, 44552, 83010, 94396, -9888, -56381, -71580, 349, 29436, 20940, -11023, -23119, -29374, -27173, -56474, -48471, 50329, 96991, 14645, 9135, 19732, 13576, -60630, 100967, 113177, 26857, -32724, -55325, 51903, -22735, -82202, -98491, -38182, -21074, -64946, -123265, -23039, 101445, 160031, 202101, 218255, 259556, 240980, 197223, 170505, 68900, 44504, 131585, 211924, 192199, 129536, 189215, 173304, 145131, 172325, 239073, 251274, 182808, 192221, 165911, 120900, 144168, 221890, 290121, 312571, 235288, 197653, 172755, 197941, 255124, 246299, 130384, 82077, 146500, 284199, 292676, 310402, 323350, 317046, 340827, 323718, 293778, 269547, 219961, 203413, 165151, 170664]
11765A70664o4687N4525M3563j2308m2496j1918P3946J3188j8998J0606m632o1986
11753A49467k8198n0403k4051J9785J02025K4338m8201M4613K2905m5614m9472
11742A17194J8889l566J48453l1763L6820k9513j35713q989Q9861L5147l4748
11731B02072J4276J314L8275p3717l8506n7948o6369R2599l8255J4692j9006l771
11719F5656p3462L3555P6055Q9483l4160j48781n1371J01234M52n8992n2588K4443
11707b8476l6583m2052J7760Q5349p7799k2919m6408j5501J6113M1019M8527m7386
11695a08356k0974O2500J4235l8317M4314Q8586K8876J2338L1078o5411p9488
11684c0619r7408j1437L4707O4412J0148R7824N5367M3524m7939P414Q2851M387
$$ y = [170664, 105977, 160502, 204065, 191757, 149261, 137343, 211289, 224477, 205479, 216085, 211453, 149467, 121269, 70866, 46815, 66600, 168625, 192963, 144762, 189375, 212280, 166666, 117194, 136083, 132517, 280970, 249207, 286027, 256514, 120801, 111812, 201673, 236820, 202072, 216348, 217662, 255937, 182220, 143714, 85766, 19397, 111996, 73741, 88433, 69427, 65656, -7806, 25749, 101804, 191287, 157127, 8346, -43025, 58209, 58661, -331, -52919, -28476, -65059, -107111, -89351, -4002, -81801, -104720, -151128, -166629, -150516, -109497, -60970, -108356, -129330, -66830, -52595, -90912, -46598, 41988, 70864, 83202, 114280, 48869, -30619, -128027, -139464, -104757, -40345, -30197, 67627, 122994, 166518, 118579, 125993, 208844, 213231]
11672B13231l9432o5664k6335M3776q1242j7033m744N3002m4382m0498m08R3670
11660H3941P709k011M4482q5200N1484j0721q6349K2365N4755k9045J2181n4928
11648H663j22232O0090J18552Q5909N3197n2695o2958q8855j5373J5126J30822
11637A30246l469N863O3023L8238K570o964o0010m8497J02513k3834k2621o2712
11625A14346q6481K160O6136j8187l5045K4687N5063k3166j16026O808L72k6471
11613c5804j4828m0634j22706k820J50727L3363j6258k3711J1397L1999j3583
11602d2858j6361n058K2941J1007j25811L9971O1510k3676j6843m596R5149j6453
11590b1078l5283O0054o7539j4354j9652j10197K0718k1215L1783R8762O5952
$$ y = [213231, 173799, 108135, 81800, 125576, 44334, 27301, 22557, 75559, 31177, -9321, -9729, 83941, 91650, 89639, 134121, 48921, 100405, 89684, 3335, 25700, 80455, 51410, 63591, 8663, -113569, -53479, 65073, 150982, 204179, 151484, 88526, -329, -15702, -576, 130246, 126777, 132640, 195663, 233901, 236471, 229507, 169497, 121000, 223513, 199679, 177058, 114346, 27865, 30025, 96161, 77974, 42929, 67616, 122679, 99513, -16513, -9705, -9333, -35804, -50632, -91266, -213972, -216792, -66065, -32702, -48960, -72671, -61274, -29275, -42858, -59219, -64277, -41336, -30329, -156140, -116169, -54659, -78335, -95178, -99774, -4625, -21078, -56361, 3693, -63846, -78200, -97852, -208049, -187331, -208546, -176763, -78001, -12049]
11579a2049Q5700Q8900N6388J05465k4461j01410J0610N3661Q6559q5207l9270
11568B24886Q8447j56790J1137J18980N2324j71535r9272q9221J5219Q5731J78778
11557B58684M1213m5063R921k0104K0323Q8112j4167o0940j19492l9902K1875
11546A40460P590p8143N0399n0402l4981P985J3586j2894j03165j89718M6264
11535b03019J43065J80353k9795q8382l2549O9027j00486p3046P3433O3375J1140
11524A3116k8115k9820l9292K4112M5483N3035p7561j9928M621o533R9115L6053
11512G4286P392l4722q5033O1597K8868m6888P8262P8546K5882q6457n6256n5463
11500i986n056m5002J2601o176j4822p2813j3273J31900R4900N7743O3711J7660
$$ y = [-12049, 73651, 162551, 218939, 324404, 299943, 198533, 209143, 262804, 349363, 264156, 224886, 313333, 156543, 167680, 286660, 338984, 167449, 68177, -21044, -5825, 79906, 258684, 299897, 254834, 264755, 244651, 264974, 353086, 338919, 277979, 158487, 118585, 140460, 148050, 69907, 120306, 69904, 34923, 42908, 56494, 43600, -59565, -249283, -203019, -59954, 120399, 90604, 2222, -30327, 38700, -61786, -134832, -61399, 1976, 13116, -14999, -44819, -84111, -59999, -14516, 38519, -39042, -58970, -54349, -60882, 38233, 74286, 81678, 46956, -38077, 23520, 52388, 5500, 83762, 162308, 188190, 101733, 45477, -9986, -15042, -60044, -47443, -53619, -68441, -141254, -154527, -22627, 72273, 130016, 193727, 211387]
11488B11387k3792m181N8172n3117l0508J563k8243n1064k2234O1636O2694j7641
11476A64672L1132k3294K6828L5284J7943M5868n192p7755q0074j21111R871O1485
11464H5657j5664q2376l3803J19550M4677o9285m181k543P9778K169l207K06k8378
11451I2600k4249K3931K3272j00860l5470k0857p7119r783n43j0162M43J21529
11439a7268O1063J1515L6290j26781k4211J2251M3443O2682o881O9086R7370m6001
11427A72558r5763k7303N6363M2862j8478m0915k6906K0038n7003j1549K0236
11416C4140K0627J8837N7408n3934n0910Q688O1900M9285l3197j5829j4673m0067
11404D2275j4431n0517j9382k6222L3827J48307Q5400j1701o9257K6205N3729
$$ y = [211387, 187595, 183414, 241586, 188469, 157961, 159524, 131281, 80217, 57983, 119619, 182313, 164672, 195804, 172510, 199338, 234622, 252565, 298433, 293241, 215486, 135412, 14301, 24172, 85657, 69993, -12383, -46186, 73364, 118041, 48756, 44575, 42032, 121810, 123979, 120772, 120978, 92600, 68351, 92282, 115554, 14694, -20776, -41633, -118752, -128535, -129078, -139240, -138797, -17268, 43795, 55310, 91600, -35181, -59392, -47141, -3698, 58984, 52103, 121189, 218559, 172558, 76795, 49492, 105855, 148717, 130239, 89324, 62418, 82456, 25453, 13904, 34140, 54767, 73604, 131012, 77078, 26168, 34856, 96756, 146041, 112844, 97015, 82342, 42275, 27844, -22673, -42055, -68277, -34450, 113857, 199257, 187556, 118299, 144504, 198233]
11393A98233N0922K2791j3883p9375o4994J0534L1132l4063J4673L3069j421L5662
11381B03280k7353p9720L0224n8143m6802n8316J12260J12039K4884l5498k9023
11370A47832k2547J2522l1535l1467k9145N6916P0995q9377O4783J09092K3544
11359B81613j60123j86897Q847J17303P2507o6136L7820R8683l7941q0621j3154
11348G1901M7687Q5425k0099r34J2429m717j5487l4879j5224K8555M8525j05408
11336I7774K2917K540M2002P7589N2255Q72j04541j11782j06403j0264L737M7256
11324A3952P6109R291J6794J8598n927l1176O8261l1292K161R0676P6013J7854
11312C21314k2030r6123r6354p3126L1501M5047N7798l4997M802K703J4590o1572
$$ y = [198233, 249155, 271946, 258063, 178688, 113694, 124228, 155360, 121297, 135970, 169039, 167618, 203280, 175927, 96207, 126431, 68288, 21486, -36830, 75430, 187469, 212353, 176855, 147832, 125285, 137807, 106272, 74805, 45660, 102576, 173571, 84194, 148977, 258069, 281613, 121490, -65407, -56560, 60743, 133250, 67114, 104934, 203617, 165676, 85055, 71901, 119588, 205013, 184914, 183980, 196409, 191692, 176205, 141326, 126102, 154657, 203182, 97774, 120691, 123231, 165233, 242822, 295077, 295949, 191408, 79626, -26777, -37041, -33304, 13952, 90061, 99352, 116146, 134744, 128817, 97641, 165902, 134610, 136771, 227447, 303460, 321314, 299284, 203161, 106807, 33681, 65182, 110229, 168027, 133030, 137832, 140535, 155125, 93553]
11300I3553N5555j29543J5728M0537L3253O1935q104L3495j5746j6041J0346m221
11288A70747q4864O082J76615J24661O1835J1629j38993p3239j17489l3530N9465
11277A62919R8793K8429P7494l928M3354M9351k5209J4817Q3881J9121O621N0487
11265F06130p8904k2159Q4347j1065L7536Q1681Q7922L9847J19404J16586k5813
11254A035512Q5315J55012O5307k9557m4540L8735R7860J80123K22601K23740
11244B030108J92457K15846K93365L47084N51416O37946P29896J026431J338757
11235G363306J615462K093985K641363L032808L201767L011177K513800J730822
11227B7204490O82964m50306j261487j508328j542500j210661p28083k37510L60920
$$ y = [93553, 149108, 19565, 35293, 75830, 109083, 171018, 162914, 196409, 180663, 164622, 174968, 170747, 85883, 91965, 268580, 393241, 455076, 466705, 327712, 254473, 136984, 103454, 162919, 261712, 290141, 367635, 363707, 407061, 456412, 431203, 446020, 529901, 549022, 555643, 606130, 527226, 505067, 589414, 578349, 615885, 697566, 785488, 825335, 944739, 1061325, 1035512, 1120827, 1275839, 1341146, 1311589, 1267049, 1305784, 1403644, 1583767, 1806368, 2030108, 2222565, 2438411, 2731776, 3078860, 3630276, 4268222, 4998118, 6024549, 7363306, 8978768, 11072753, 13714116, 16746924, 19948691, 22959868, 25473668, 27204490, 27887454, 27437148, 26175661, 24667333, 23124833, 21914172, 21186089, 20948579, 21309499]
11218B1309499P57543J081753J473283J728220J483949J037932M37441l72785
11210B8936835j148668k027913k575218k884514k777078k451224k109782j800881
11202A1161557j432651j114646r16851o71339n08831l60704m71377l31142l72307
11193D981709k22473k21022k53907j78322j18997l0721r268o715j0095r6061j44915
11182C689213p6880p0522n6586K2877k4081K8061j1983J15934O6431N608K7717
11171C715789Q1588J22620J57464K19353L03671L99132M20409M77990P58510R07911
11161G564437J078824J309110J610738K027841K463369K995561L656550M262262
11153B6968692M672021M709576M218165L317161K469001J785195J132677M78966
$$ y = [21309499, 22067042, 23148795, 24622078, 26350298, 27834247, 28872179, 29309620, 28936835, 27788167, 25760254, 23185036, 20300522, 17523444, 15072220, 12962438, 11161557, 9728906, 8614260, 7697409, 7026070, 6517239, 6156535, 5685158, 5354016, 4981709, 4759236, 4538214, 4284307, 4105985, 3986988, 3956267, 3946999, 3940284, 3930189, 3834128, 3689213, 3612333, 3541811, 3485225, 3508102, 3484021, 3512082, 3500099, 3616033, 3682464, 3688072, 3715789, 3797377, 3919997, 4077461, 4296814, 4600485, 4999617, 5420026, 5898016, 6656526, 7564437, 8643261, 9952371, 11563109, 13590950, 16054319, 19049880, 22706430, 26968692, 31640713, 36350289, 40568454, 43885615, 46354616, 48139811, 49272488, 49751454]
11145D9751454k78144j248880k109794k455191k179348j330698j05314J035567
11137D1079652J903045K611465K822058K701380K101459J234078J03177j032325
11129E3523989k056599k917627l682091m349104m732819m812592m613583m042946
11121B2316628l280630k555739k075393j732440j375953j040481q47949o46589
11113H761454n84888o33596m05282l85755l29409k41897l58875k36866j92474
11104E392412j68418k48163j39135p5873n526j7842j60194n5231m0102N425n7117
11093D430236j07313m8577j52860q2970L3591J3603K9294P2547K08253J08178
11083D503982K81337K87972L84060N65208P25833Q29311R92352J256067J588500
$$ y = [49751454, 49473310, 48224430, 46114636, 43659445, 41480097, 40149399, 40044085, 41079652, 42982697, 45594162, 48416220, 51117600, 53219059, 54453137, 54556314, 53523989, 51467390, 48549763, 44867672, 40518568, 35785749, 30973157, 26359574, 22316628, 19035998, 16480259, 14404866, 12672426, 11296473, 10255992, 9408043, 8761454, 8176566, 7542970, 7137688, 6751933, 6422524, 6180627, 5821752, 5584886, 5392412, 5223994, 4975831, 4836696, 4760823, 4755297, 4737455, 4577261, 4522030, 4481928, 4487353, 4430236, 4322923, 4274346, 4121486, 4038516, 4072107, 4085710, 4115004, 4187551, 4395804, 4503982, 4785319, 5073291, 5457351, 6022559, 6748392, 7577703, 8570055, 9826122, 11414622]
11074A1414622J843864K088020K533482K646806K743044K514350J964965J156001
11066B8905154J44455q18969j740187k222547k240455j825629j351335q54276
11058A7996211j04920M02249J066914J488441J913437K096497J778577J432151
11050B8069557Q94950q9069j102806k105565k805124k993489k858959k481316
11042A4528179k047981j697821j380879j256001j004892r06897o97334m51041
11034E085333n56045l87591k52510l50037k95004k45594j85049j93094j49782
11025B470627n7004o3287K3265r6064j52188l8432j15076l2628m8596r6375o4536
11014A729706j28560j25455o6822p2734q851n4069r2439J2433J42449J40005o6267
$$ y = [11414622, 13258486, 15346506, 17879988, 20526794, 23269838, 25784188, 27749153, 28905154, 29049609, 28230640, 26490453, 24267906, 22027451, 20201822, 18850487, 17996211, 17891291, 18293540, 19360454, 20848895, 22762332, 24858829, 26637406, 28069557, 28964507, 28875438, 27772632, 25667067, 22861943, 19868454, 17009495, 14528179, 12480198, 10782377, 9401498, 8145497, 7140605, 6233708, 5536374, 5085333, 4529288, 4141697, 3889187, 3539150, 3244146, 2998552, 2813503, 2620409, 2470627, 2413623, 2350336, 2373601, 2277537, 2125349, 2086917, 1971841, 1939213, 1890617, 1794242, 1729706, 1601146, 1475691, 1408869, 1336135, 1327284, 1273215, 1180776, 1193209, 1335658, 1475663, 1409396]
11003A409396j43085j15980j66656l9923R3866l0911j40297p2979j3319n267j33489
10992F41356J2883J74315o1270j62074l5608J10496P7544j43633n6466j0624J0752
10981E57671P923K4284N3351n9629o5033J584l0900k8840n6030j1816J11727j0312
10969D93980n0809o309K5613p0308N2436R4475p3251l4493o5396j96124r276K3165
10957A83703m0944J8306q114N9522O1570m3625k5171J3302m4162J389L7770R8606
10945C12152m8142k4580k5714j2447n0197j8734Q7375J9734J2913R7538N1892
10934D01790m6704o6007p7666K6374j9581N7566J5697l3782k6855M4797L8305
10923C13934k2443m9157j31295K0530L7242P6267J6400M767K2520q0305N1276
$$ y = [1409396, 1266311, 1150331, 983675, 943752, 1037618, 1006707, 866410, 793431, 780112, 774845, 641356, 654239, 828554, 767284, 605210, 569602, 680098, 757642, 614009, 557543, 546919, 557671, 565594, 589878, 643229, 583600, 518567, 520151, 489251, 460411, 404381, 392565, 504292, 493980, 443171, 436862, 462475, 392167, 444603, 539078, 465827, 431334, 365938, 169814, 160538, 183703, 142759, 161065, 152951, 212473, 274043, 230418, 205247, 218549, 174387, 175776, 213546, 312152, 264010, 239430, 213716, 201269, 151072, 132338, 219713, 239447, 252360, 349898, 401790, 355086, 289079, 211413, 237787, 218206, 275772, 291469, 257687, 230832, 275629, 313934, 291491, 242334, 111039, 131569, 168811, 245078, 261478, 266245, 288765, 208460, 259736]
10912B59736J5550k3892l4601j662k5553n6859m0924j10M2486l555J8339j9171
10900A29784o8811k9602J7365O9443k6695N7486L0273j20630j29816J08588N6514
10889I3899K857J6622m9400n0745l7331r8402j1132M4756p4753K4649R7789K6785
10877a4406m1655l8006N7073J56326M9761k563j35828p0003l863j0000J2705L2419
10865h040j553j03695K8197R4041K9742K8064J7022R905K7690J4415P8812Q7841
10853C02441m8853J5491j4456p0097p8041J1206Q9523P756j97153r7694J27011
10842D7134J26366n2972m5886P2016M7466o6432L8662R0338l8962m394j3626K4359
10830B24069M3622K8558M6943M022l6389m9538j22020o7561j0992o044J49158
$$ y = [259736, 275286, 251394, 216793, 215131, 189578, 132719, 91795, 91685, 134171, 130616, 148955, 129784, 60973, 31371, 48736, 118179, 91484, 148970, 179243, 58613, -71203, 37385, 93899, 96756, 113378, 63978, 13233, -24098, -122500, -133632, -88876, -163629, -138980, -41191, -14406, -56061, -94067, -36994, 119332, 169093, 166530, 30702, -39301, -43164, -53164, -40459, -8040, -9593, -113288, -85091, 8950, 38692, 66756, 83778, 93683, 121373, 135788, 214600, 302441, 253588, 269079, 254623, 184526, 106485, 117691, 207214, 214970, 17817, -79877, 47134, 173500, 120528, 74642, 146658, 194124, 127692, 166354, 256692, 217730, 213336, 199710, 224069, 267691, 296249, 343192, 347214, 310825, 261287, 139267, 71706, 60714, 54670, 203828]
10819B03828J23960M8350l421o9639j23497L5446J304j9994l5905l7142n4586
10808F8704o531O0605M2803n2002K4964P8960m4722j17301J4184R5129L4330p740
10796A91383Q0396L2861k3904m2346l6384j5296N7489L8160n6874k1939K5752
10785B29298J12702N2320m0784K0415m6637k7924P3071p851k0177l1728L8356
10774C51061P6224p9797j26883K9766Q3971K0084J79558J23811K6841J15259Q9963
10763H89858J34836L2299Q0044L03866M75983P99335J395610K315305L858337
10754A0285473N627203N170980K240018M73942k142044o324422n149603k834866
10746G346681j599759q22721m41493l15461k88618l56470m50632m37717l49194
$$ y = [203828, 327788, 376138, 372717, 303078, 179581, 215027, 216331, 196337, 160432, 123290, 68704, 62173, 122778, 165581, 113579, 138543, 217503, 172781, 55480, 69664, 164793, 199123, 191383, 271779, 304640, 280736, 238390, 202006, 186710, 244199, 282359, 225485, 203546, 229298, 342000, 394320, 353536, 373951, 327314, 299390, 372461, 364610, 344433, 312705, 351061, 427285, 347488, 220605, 250371, 334342, 354426, 533984, 657795, 684636, 799895, 889858, 1024694, 1056993, 1137037, 1440903, 1916886, 2716221, 4111831, 6427136, 10285473, 15912676, 21083656, 23323674, 23797616, 21655572, 15331150, 10181547, 7346681, 5746922, 4924201, 4482708, 4167247, 3878629, 3522159, 3071527, 2633810, 2284616]
10737B284616l32066l00190k14979k31018j02781o7458j17065p3930p8486n1847
10727G14796J12351p6594j63100j4476R7225N2936p9958m6055N4267k1990l8503
10716E90899j2095n0032n0908N6626l496p3506m8906K2730Q1126L611K5656K7425
10704E69130n9257n3054J10721J07890j27330o988j9557n9673n9632j17795J5479
10693B99934k3293N4837O6223n7022J9115K0578J6903k0689j81188o8159j1734
10682A15505R729j8335M0654l3109k3014Q4202O6567Q6543K6830k8948K8700m4120
10670C11204r3283J0535l1291L0565l7415j29944l313k685N7018L0034j8799k042
10658A20584J17078J13968O8582L5317K8925r7863j92253o1796M0347l2488O257
$$ y = [2284616, 1952550, 1652360, 1437381, 1206363, 1103582, 1036124, 919059, 845129, 766643, 714796, 827147, 750553, 587453, 572977, 670202, 723138, 643180, 597125, 651392, 629402, 590899, 578804, 528772, 477864, 534490, 530994, 457488, 408582, 431312, 512438, 516049, 541705, 569130, 509873, 456819, 567540, 675430, 548100, 541112, 521555, 461882, 402250, 284455, 299934, 276641, 331478, 397701, 340679, 359794, 380372, 397275, 376586, 195398, 127239, 115505, 125234, 106899, 147553, 114444, 91430, 175632, 242199, 328742, 355572, 326624, 355324, 311204, 217921, 228456, 197165, 227730, 190315, 60371, 57058, 54373, 111391, 141425, 122626, 120584, 237662, 351630, 420212, 455529, 484454, 386591, 194338, 132542, 172889, 140401, 146658]
10647A46658L2598J563L4671J31145K795q9173m6625M4077M2766P9248l5601m4270
10635B99852r2555J5482o469K029l650O5923J6757m4984o9019o9511J5489J58676
10623B88020J24211J4686k9396l0771P4387J21326J0730j43582q4711p1787n1926
10612B21187J9466P2395P2963J0897m4332k6790m8266o6910J1245l6047l8934
10601A46874R9481J08480L4019M5954O1786P6669J10186j59676p4937p5690p6262
10590B96884j5837J9167j01702r351N4774L2792k9152j02779r2245K11O1601N6627
10578A70990l0510K532K2826O4636K2959l729q5536o9217k9997O0076N1574o7822
10566A08782n3112K577j6164j4662L4286J1188m7926p1623M8875J55892P3012
$$ y = [146658, 179256, 180819, 215490, 346635, 349430, 260257, 213632, 257709, 300475, 379723, 344122, 299852, 207297, 222779, 216310, 218339, 214689, 280612, 297369, 252385, 183366, 113855, 129344, 288020, 412231, 426917, 397521, 366750, 441137, 562463, 573193, 429611, 344900, 273113, 221187, 240653, 313048, 386011, 396908, 352576, 325786, 277520, 210610, 221855, 185808, 146874, 246355, 354835, 388854, 434808, 496594, 573263, 683449, 523773, 448836, 373146, 296884, 281047, 300214, 198512, 189161, 243935, 276727, 247575, 144796, 52551, 52762, 114363, 170990, 140480, 143012, 165838, 230474, 253433, 249704, 164168, 94951, 64954, 125030, 176604, 108782, 55670, 58247, 42083, 27421, 61707, 72895, 24969, -46654, 2221, 158113, 231125]
10555B31125j8856l0080n3430j4743n1385O6629L8800O9977Q2563j8855l9213
10544B62532l5685k8965p8967n3083M5503P9017K9358k1971K5386J7223J43929
10533C84277J11213L60L013l028m4524l3845R5448P9100j7277l1775q2976m9747
10521D10239j5968r3262j26000j6712J2208L0832k4182j13167L0452N9671O1591
10510B15702O6016k2007j15504k6038m0988j206k1202r594Q2685M383J19384O5096
10498C16727m2041P194l9972n899j819K9339p1784n0132l358K9080o2912j5474
10486H8949k0790P05n6060N7035K3824k0906J3598R7202n0167j6599M4945K8666
10474A90402L0299J10760R1698K6394Q8128N4459k457J73410J01865j00932O2784
$$ y = [231125, 212269, 182189, 128759, 114016, 62631, 129260, 168060, 238037, 320600, 301745, 262532, 226847, 197882, 118915, 65832, 111335, 190352, 219710, 197739, 223125, 240348, 384277, 495490, 495850, 498863, 495835, 451311, 417466, 512914, 592014, 574737, 542962, 459986, 410239, 394271, 301009, 175009, 158297, 170505, 201337, 177155, 63988, 94440, 154111, 215702, 281718, 259711, 144207, 118169, 77181, 75975, 54773, 45179, 127864, 132247, 251631, 316727, 274686, 281880, 241908, 236009, 234190, 263529, 191745, 141613, 138255, 167335, 104423, 88949, 68159, 68864, 12804, 69839, 93663, 72757, 86355, 183557, 133390, 116791, 161736, 190402, 220701, 331461, 423159, 449553, 537681, 592140, 589683, 763093, 864958, 764026, 826810]
10463H26810J7451o7155m558o0190p615M423P9333M4993n0590j9451n9057m4923
10451F59471q7803j39837j03464K6912m0755j9864J8762J31577Q3179r5195m2587
10440C90396j8692l6315m456P4801L4262q5778o2691R1367L7184J13154J93935
10429G27167o273j27446k7931j9722O6425J4210P7996O1905j14891K3951L2244
10418G07635Q9865L3467M8422J30558J38609K80185L44356L88371O69883Q68475
10408C699826P18747N64579L97702K0858l58476m02604m89357o82367p52097m84059
10398B232752k79652j22914L7644k3139J447M7019q431o8007j40849o3608r7044
10387A515218O1212J7548m536O0097P3240N5692J15973K37396J56323J26064J42475
$$ y = [826810, 844261, 777106, 772548, 712358, 704743, 709166, 788499, 833492, 782902, 763451, 704394, 659471, 571668, 431831, 328367, 355279, 314524, 294660, 313422, 444999, 528178, 432983, 390396, 371704, 335389, 330933, 405734, 439996, 354218, 291527, 382894, 420078, 533232, 727167, 720894, 593448, 565517, 545795, 612220, 626430, 704426, 766331, 651440, 675391, 707635, 797500, 830967, 879389, 1009947, 1148556, 1428741, 1773097, 2161468, 2831351, 3699826, 4418573, 4983152, 5380854, 5401712, 5043236, 4640632, 4151275, 3468908, 2716811, 2232752, 1953100, 1830186, 1867830, 1844691, 1846138, 1893157, 1884726, 1816719, 1675870, 1612262, 1515218, 1576430, 1593978, 1589442, 1649539, 1722779, 1778471, 1894444, 2131840, 2288163, 2414227, 2556702]
10376B556702J80886K04124K86873K13020K29382M34022L79512M93064O82087
10367E659672P35818P13787R08761J188486J165245J251985J376477J393399J565790
10358A5959420J851268K379147L008071M077632N733057Q389364J3076764K0554544
10350G5029267L1209795M2226594M6970529M7543256N1780581M8425391K8781217
10343C71966630J1719849K082073j7284556m3656478m9794269m3504704m4196723
10336A87331822m7133979l7312992k4671954j6063700j0764090p615267n608686
10329C8161154m280935l318391k753535k371957j998684j721290j629554j470918
10321A8615890j297782j175114j182644j053961q73239p00849p78607p33819n45533
$$ y = [2556702, 2737588, 2941712, 3228585, 3441605, 3670987, 4105009, 4484521, 4977585, 5659672, 6395490, 7109277, 8018038, 9206524, 10371769, 11623754, 13000231, 14393630, 15959420, 17810688, 20189835, 23197906, 27275538, 33008595, 41397959, 54474723, 75029267, 106239062, 148465656, 195436185, 242979441, 294760022, 343185413, 371966630, 383686479, 385768552, 368483996, 324827518, 275033249, 231528545, 187331822, 140197843, 102884851, 78212897, 62149197, 51385107, 43769840, 38161154, 33880219, 30561828, 27808293, 25436336, 23437652, 21716362, 20086808, 18615890, 17318108, 16142994, 14960350, 13906389, 13033150, 12332301, 11553694, 10819875, 10274342]
10312A0274342m77562m57805l13997l18178l24105l25474l28746m16034k81833
10303G030608j55971j86122k82971k58625k26601j72980k01320k66827j31060
10294E148131j73377k35229j61499j37042r5803j31825j32930k04697k34792j18147
10284C522790o0482o3572j33107r2757J0371l5094j49498j53469o8222k6176N8427
10273B809211j190j00792M692m363p4011o8749n1917n7577j36110j84521p7989
10262B056684k1267m0386j14001o7326O7454Q833J7913l6060k0347j03503n6046
10251A691948n0815q6312j3751R2o9728l7408J8342m4296r8276q4967J0797k1405
10239A214221M4415j26170j32297N1559P4995P5554m4368R387r6347n6734j18212
$$ y = [10274342, 9796780, 9338975, 9024978, 8706800, 8382695, 8057221, 7728475, 7312441, 7030608, 6874637, 6688515, 6405544, 6146919, 5920318, 5747338, 5546018, 5279191, 5148131, 4974754, 4739525, 4578026, 4440984, 4345181, 4213356, 4080426, 3875729, 3640937, 3522790, 3462308, 3398736, 3265629, 3172872, 3183243, 3148149, 2998651, 2845182, 2776960, 2750784, 2809211, 2808021, 2707229, 2711921, 2707558, 2633547, 2564798, 2512881, 2455304, 2319194, 2134673, 2056684, 2035417, 1995031, 1881030, 1813704, 1881158, 1889991, 1907904, 1871844, 1851497, 1747994, 1691948, 1641133, 1554821, 1541070, 1541162, 1471434, 1434026, 1452368, 1408072, 1309796, 1224829, 1235626, 1214221, 1258636, 1132466, 1000169, 1051728, 1126723, 1202277, 1157909, 1167296, 1070949, 1014215, 896003]
10228H96003k6427l4636p259O9764M8560j2738j7544L9886J27348O9659N0846
10217A203462J4969K2358L28q9887j42398r6082o4047r8499K6329N150o9441j2676
10205F99566m1877K6850L7745o5192Q6962K9821L7107J7921r8956p7100o8751
10194E84096j17104l8111L576k220M4471Q5748j209j05505k5781n476P5833M5272
10182E43590P1569k1191L130P773m9236J6863l2199p3363n4581L3252m0354J3378
10170D18631m1799M9993J39169L3019p8741K006K7648q0767j11715j50112l6131
10159A71201k5060l3043o9418j01376j18328r2894R2241P9925N2170O0452J77058
10148A92928O1528N675r3877N2854N5547k3657J4713j5385N5368J02441m8312
$$ y = [896003, 869576, 834940, 827681, 897445, 946005, 933267, 915723, 955609, 1082957, 1152616, 1203462, 1218431, 1240789, 1241117, 1151230, 1008832, 912750, 848703, 750204, 776533, 781683, 712242, 699566, 657689, 684539, 722284, 657092, 744054, 773875, 810982, 828903, 729947, 652847, 584096, 466992, 428881, 432457, 430237, 474708, 560456, 559247, 453742, 427961, 422485, 498318, 543590, 615159, 593968, 597098, 604871, 555635, 572498, 540299, 466936, 412355, 445607, 405253, 418631, 376832, 426825, 565994, 599013, 520272, 522278, 549926, 469159, 357444, 207332, 171201, 146141, 113098, 43680, -57696, -176024, -268918, -176677, -96752, -44582, 15870, 192928, 254456, 260131, 166254, 219108, 274655, 250998, 265711, 250326, 305694, 408135, 359823]
10137C59823p2111n2246j4029J899Q3973j8303k6504J3876L1565j03685j12989
10126I1269n0482L6462Q1031O9707O8101l1336n2529j1945J08179R0360r482q1945
10114C07390r5513m1370L9466L6607k0586Q4007o5301O148K2952K2895N067m5369
10102B56393p2593l4170j8036k6869R985O5165K7635N4040o2076r504R4355L559
10090B87884o2077R555L6790Q9646n5475q9873K6221J07004M1755p4108J00246
10079D17568l9927K8725p7667l4582n2364R8349J08279J01117M4977j3685j11184
10068D69606P2888J28703M9571L3051n6933n5151Q3990J00270j146J40557K76474
10057A241880J51094J62702L90138P64185J358221K256198L818750N751659N248234
$$ y = [359823, 287712, 235466, 221437, 223336, 307309, 289006, 262502, 276378, 307943, 204258, 91269, 40787, 77249, 158280, 227987, 296088, 264752, 212223, 200278, 308457, 398817, 389335, 307390, 211877, 170507, 209973, 246580, 225994, 310001, 244700, 250848, 273800, 296695, 301762, 256393, 183800, 149630, 131594, 104725, 114710, 179875, 207510, 261550, 199474, 189970, 284325, 287884, 225807, 235362, 272152, 361798, 306323, 216450, 242671, 349675, 391430, 317322, 417568, 377641, 406366, 328699, 294117, 241753, 340102, 448381, 549498, 594475, 580790, 469606, 542494, 671197, 720768, 753819, 696886, 641735, 725725, 825995, 824849, 965406, 1241880, 1392974, 1555676, 1945814, 2709999, 4068220, 6324418, 10143168, 15894827, 21143061]
10048B1143061J916849K79174k302175o829859n318004k867942j597783j001090
10040C422231p08334m74125l87862k18150k24012k65216j29765O4985O6659O666
10030A153077o5076n8091K6154p9111r3191l7018q8819k1606q1438j0288O7353
10019G11946L6967j11028j5230p6986q3332J1699J05078N7215j00133q620K0677
10008E48253l4527j18886m8952M5522j2877P2472o807q226j1296o2382j3464O4371
9996D13201m3071j2771k5258Q1354N8072P9765j2252j06649j1937q0732o9528
9985B70194j58j8152l1119J1844Q6339N6764o9698j06933P8893J08334O3892J3471
9973D63671k9291k0047M4451L4156o6422n0551l9169l5145n0551o5791Q3332J16688
$$ y = [21143061, 23059910, 23339084, 21036909, 14207050, 8889046, 6021104, 4423321, 3422231, 2713897, 2239772, 1851910, 1633760, 1409748, 1144532, 1014767, 1079752, 1146411, 1153077, 1088001, 1029910, 1056064, 976953, 883762, 846744, 757925, 736319, 654881, 644593, 711946, 748913, 637885, 622655, 545669, 462337, 474036, 579114, 636329, 536196, 527576, 548253, 513726, 394840, 345888, 391410, 378533, 451005, 444198, 435972, 424676, 362294, 348830, 413201, 370130, 357359, 332101, 413455, 471527, 551292, 539040, 432391, 420454, 339722, 270194, 270036, 251884, 220765, 232609, 318948, 375712, 306014, 199081, 277974, 386308, 450200, 463671, 434380, 414333, 458784, 492940, 426518, 375967, 336798, 301653, 251102, 185311, 268643, 385331]
9961C85331J2255o3607p6150L097L6178O3338O6828K0618J80n1403q2127p2044
9949B42494J10326J29662N1623R9402Q6812J47938K78712J91249K77283L20657
9939A936158L24483P2223j40262j20262j08655j80633j90933k14922k77751k50133
9929H49313j92196j26724m0691o8554N579J9637O0453o2243M0290L5649k9121
9918D91392j494l5465J2492n6283n6327P666J12236J9083m207O4835K4937Q8543
9906F67408J09437l0678Q2494O0657o5028L7966r0372n4406n2682N2729J3815
9895G31340r042N622J79003L01803L52592N81269Q64934J003819Q56649L80680
9885E248669M0244n95572j116986j022037p48791m44721l24208k38962l8501M1683
$$ y = [385331, 397586, 333979, 257829, 260926, 297104, 360442, 427270, 447888, 448068, 396665, 314538, 242494, 352820, 482482, 534105, 633507, 720319, 868257, 1146969, 1338218, 1615501, 1936158, 2260641, 2332864, 2192602, 2072340, 1963685, 1783052, 1592119, 1377197, 1099446, 849313, 657117, 530393, 489702, 421148, 426727, 446364, 506817, 444574, 484864, 520513, 491392, 489898, 454433, 466925, 410642, 354315, 361981, 474217, 493300, 489093, 553928, 578865, 667408, 776845, 746167, 828661, 889318, 824290, 862256, 771884, 717478, 664796, 717525, 731340, 722298, 727920, 906923, 1208726, 1561318, 2142587, 3007521, 4011340, 4867989, 5248669, 5288913, 4693341, 3576355, 2554318, 1805527, 1360806, 1036598, 797636, 759135, 800818]
9875H00818N658J4178k1764k1765j36699l3612J8659o3725k2064m828Q4044j0752
9863F08148j07712q977n9063o2853J093P4530j04O843o9722N0892J42702N4122
9851F29899M2999J26505K52220K25132m6032j308q8147k42324k01802k5308j03439
9840E68395r0718k5804M7006j23255k7992j4544q1240j7927M3187n0067k1n1015
9828A76005K2796J0779m0407J8255R0791P6582Q896j6308n8726l9394q6250k7358
9816A35661m0846j7940p747n9430N2081J22998J48520l5680p5984k8095J02239
9805B95777m0275q0497p2410j7629J10149L4545M8639J00300k8197p0344j5506
9794B64552K846j9018N2997l3240k2459n5865p742j07355l5357L6332L7464R528
$$ y = [800818, 806476, 820654, 798890, 777125, 640426, 606814, 625473, 561748, 539684, 534856, 618900, 608148, 500436, 491459, 432396, 369543, 370636, 445166, 445062, 451905, 382183, 433075, 575777, 629899, 672898, 799403, 1051623, 1276755, 1230723, 1229415, 1141268, 898944, 697142, 671834, 568395, 477677, 451873, 498879, 375624, 347632, 333088, 251848, 233921, 277108, 227041, 227020, 176005, 198801, 209580, 169173, 187428, 278219, 354801, 363697, 347389, 288663, 249269, 163019, 135661, 94815, 76875, 69128, 9698, 61779, 184777, 333297, 297617, 221633, 193538, 295777, 255502, 175005, 102595, 84966, 195115, 229660, 278299, 378599, 350402, 280058, 264552, 267398, 248380, 301377, 268137, 245678, 189813, 182071, 74716, 39359, 75691, 113155, 122683]
9782A22683L0118k0126l6802o4759K2197J7930K6714j6103j7695O064K690k6056
9770D6855N1368j322J873L5369J06629K9311L9225J43517m9520o2274r828o8345
9758B62858o7992M9851M8493J01040m286p4491P643n4029o7555Q6860j6726n8401
9746B13265l797n9954J11967Q3132j9979q6726K7935J04231p8509p8864j6939
9735A95762p3788J37245O2329o6455j44619K4638P2831N8606M9628K8772O418
9724C51367J8434J8066o7661K8593l150j2306j33426m4633L7619J23713K4964
9713C41580m4484k4858L8646O7471K1907L2797K2603q385q26n8260m4023Q1040
9701D25208l5335j78022k1066n567P8011J10822M5031J04097n8220j11597O2730
$$ y = [122683, 152801, 132675, 95873, 31114, 53311, 71241, 97955, 81852, 64157, 70221, 72911, 46855, 98223, 96901, 98774, 134143, 240772, 270083, 309308, 452825, 403305, 341031, 331203, 262858, 194866, 244717, 293210, 394250, 389964, 315473, 323116, 269087, 201532, 288392, 271666, 213265, 209468, 149514, 261481, 344613, 324634, 237908, 265843, 370074, 291565, 212701, 195762, 121974, 259219, 321548, 255093, 110474, 135112, 207943, 266549, 316177, 344949, 351367, 369801, 387867, 320206, 348799, 345649, 333343, 199917, 155284, 192903, 316616, 341580, 297096, 272238, 310884, 378355, 400262, 433059, 455662, 447277, 446451, 388191, 344168, 425208, 389873, 211851, 190785, 185218, 263229, 374051, 419082, 523179, 464959, 353362, 416092]
9690D16092M0474p7598R321J04232P929l9321J3057L8557m1461p7193R495K0372
9678D23956P555J2136q5898J15363j5375j58385O3997n5403p3499L4230J34187
9667D02864J12489M2947L0127R31m2162n9564k0249l5317L0125M5866M5899J8345
9655E72301O4677R0816k7571J0822j7181r1265L4240K04239q630Q1511M785j2781
9643I05963K07600L6115J7958P6353j37659M3048J49732J37808R8928J14421K33187
9632A883454K08366K17508K73780L40953M21559N31562N67625O72854O51048O48147
9622F416856M83671L93948L14386K76283K98100L82164M86478N78524O36506O75407
9612A0942323Q54796P86470Q85314J184719J251254J177668J264436J205177J279294
$$ y = [416092, 456566, 378968, 388289, 492521, 500450, 461129, 474186, 512743, 471282, 394089, 403584, 423956, 431511, 443647, 357749, 473112, 457737, 299352, 363349, 307946, 234447, 268677, 402864, 515353, 558300, 588427, 589358, 547196, 487632, 467383, 432066, 462191, 508057, 553956, 572301, 636978, 727794, 700223, 711045, 693864, 602599, 636839, 841078, 832448, 913959, 918744, 905963, 1113563, 1149678, 1167636, 1243989, 1106330, 1149378, 1299110, 1436918, 1535846, 1650267, 1883454, 2091820, 2309328, 2583108, 2924061, 3345620, 3877182, 4444807, 5117661, 5768709, 6416856, 6900527, 7294475, 7608861, 7885144, 8183244, 8565408, 9051886, 9630410, 10266916, 10942323, 11797119, 12583589, 13468903, 14653622, 15904876, 17082544, 18346980, 19552157, 20831451]
9603B0831451J145565J038597Q39868O38542L36614L1413Q3575P0218K07066M41460
9593B5664369O48875P99814Q51958P95400O19864M30624M11563K67759J40554
9584C0630780J5699p1347k08080m45922k80485j99078k5568K10417J18221N0112
9574B9794749j50247l12764m75559o03494o64288o63467p70950q64712j017540
9565B4271728j159713j322607j232015j149989r70937r29511q75160p52607o64636
9556A5214553m58469j30847j73834l7472J47502M1345l6035j59836k97911k10162
9546A3898834m37834l16164k48129k29751j95436l98660m27682l60847k64527
9537A1019804m167L68928O76483R82574J360670J553700J608729J596594J485021
$$ y = [20831451, 21977016, 23015613, 23855481, 24494023, 24830637, 24862050, 24945625, 25015843, 25222909, 25664369, 26313244, 27113058, 27965016, 28760416, 29380280, 29810904, 30222467, 30490226, 30630780, 30646479, 30575132, 30367052, 29921130, 29640645, 29441567, 29415999, 29626416, 29744637, 29794749, 29644502, 29331738, 28856179, 28252685, 27588397, 26924930, 26153980, 25289268, 24271728, 23112015, 21789408, 20557393, 19407404, 18436467, 17506956, 16631796, 15879189, 15214553, 14756084, 14625237, 14451403, 14413931, 14561433, 14602778, 14566743, 14406907, 14108996, 13898834, 13461000, 13144836, 12896707, 12666956, 12471520, 12072860, 11645178, 11284331, 11019804, 11015637, 11384565, 12061048, 13043622, 14404292, 15957992, 17566721, 19163315, 20648336]
9528B0648336J186675Q82610N45887K49742K04304K67485L98098P01367R13874
9519B5998378J048827J242927J189464J414482J587902J667399J770103J834371
9511C7753853J821638J923309K112296K376876K730998L091415L228678K796590
9503E7835653J791176K92666j074223k268766l176520l407177l125033k515603
9495D4352173j710086j070896m79642j5339K54780M40124L62470l3581m43702
9486D1656301j091245j860441k384862k792048k761976k425519k078223j546686
9478B4715301j234394q49251p31459p34132o29083o50102n95130n79476n27274
9469A8185000l38274k01962r9483n4760k56723n39625p34053q27398q53355q78662
$$ y = [20648336, 21835011, 22717621, 23263508, 23513250, 23717554, 23985039, 24383137, 25084504, 25998378, 27047205, 28290132, 29479596, 30894078, 32481980, 34149379, 35919482, 37753853, 39575491, 41498800, 43611096, 45987972, 48718970, 51810385, 55039063, 57835653, 59626829, 59919495, 58845272, 56576506, 53399986, 49992809, 46867776, 44352173, 42642087, 41571191, 41091549, 41076210, 41330990, 41771114, 42133584, 42100003, 41656301, 40565056, 38704615, 36319753, 33527705, 30765729, 28340210, 26261987, 24715301, 23480907, 22631656, 21900197, 21166065, 20536982, 19886880, 19291750, 18712274, 18185000, 17846726, 17644764, 17545281, 17490521, 17233798, 16694173, 15960120, 15132722, 14279367, 13400705]
9459A3400705o57332m87478l31096N9228M66815R26861J268182J253959J086731
9450A6986575O12161J7323o66390j195221j401370j447268j273028j023737p05840
9441I903205n38674n53489l80056l88436j35849k7990J69845M70982Q14409J107253
9431A0441200J430666J777005J703991J552467R94465K35985m72414j048612j382225
9422A5232528j466671j204344q79087n49563m34808l62399j41712j57765j18224
9413I917955J32236J65355J80982K26291N4708k0073m3263j0002j36085j64251
9403A0303853l6900q8399k38928j95152m0188R3973J36198J55509J69597R3738
9393A0353301K1568J17535J43818K88029L57813L41438J31515j81864m12019l93509
$$ y = [13400705, 12743373, 12255895, 11924799, 11984027, 12450842, 13377703, 14645885, 15899844, 16986575, 17598736, 17616059, 16949669, 15754448, 14353078, 12905810, 11632782, 10609045, 9903205, 9364531, 8811042, 8430986, 8042550, 7906701, 7878711, 8048556, 8519538, 9333947, 10441200, 11871866, 13648871, 15352862, 16905329, 17899794, 18135779, 17663365, 16614753, 15232528, 13765857, 12561513, 11682426, 11132863, 10698055, 10335656, 10193944, 10036179, 9917955, 10050191, 10215546, 10396528, 10622819, 10677527, 10657454, 10614191, 10604189, 10468104, 10303853, 10266953, 10178554, 9939626, 9744474, 9704286, 9798259, 9934457, 10089966, 10259563, 10353301, 10374869, 10492404, 10636222, 10924251, 11282064, 11623502, 11755017, 11573153, 11161134, 10767625]
9383A0767625k91819j51289Q9980J27089P0888n598k15159l84783n35758n41647
9373H929529m82478l68159l81804k62051j71963k07572n0554J38725J83017J08994
9363G435684J12553J97517L05046M94071P19424R70338Q30336O50283L88583j08138
9353A1995697o17600q93705j023091j155020j131635q87299n84273m17323j80409
9344E105342J8803O4051J49667K51335L98837M84110L69129K28317K83990K91271
9334G644852J82901J13995m8589j98442m30825n38969n98845m78402l34211l38312
9324D975153k10794j29663o1545K06032L12243M60710N09139N88235M62620K98615
9314G410745N3333j54869j98028m66628n59615m84567m05661k01365k36915j19903
$$ y = [10767625, 10475806, 10324517, 10414497, 10541586, 10612474, 10606876, 10391717, 10006934, 9471176, 8929529, 8447051, 8078892, 7697088, 7435037, 7263074, 7055502, 7004948, 7143673, 7326690, 7435684, 7548237, 7745754, 8050800, 8544871, 9264295, 10234633, 11064969, 11715252, 12103835, 11995697, 11378097, 10484392, 9461301, 8306281, 7174646, 6287347, 5703074, 5285751, 5105342, 5124145, 5188196, 5337863, 5589198, 5988035, 6472145, 6841274, 7069591, 7353581, 7644852, 7827753, 7941748, 7893159, 7694717, 7263892, 6724923, 6126078, 5647676, 5313465, 4975153, 4764359, 4634696, 4573151, 4779183, 5091426, 5552136, 6061275, 6649510, 7112130, 7410745, 7464078, 7309209, 7111181, 6644553, 6084938, 5600371, 5194710, 4993345, 4756430, 4636527]
9304D636527n5231n4606R2361R0204O7396J05292L09102L60307L78956M03024
9294F333332M50205N22785M42080L30681L08389K19852Q5893J31286K43426L49446
9284I417375L18990N05141O12269P34178P19187P97021R91047J218122J370492
9275A6683822J573610J692746J833614K085178K292830K645085L003619L180396
9267C4990900L316552L588506L814437L888761L702071L332010K812291K161735
9259F1607263J391998L12396o63611j454457k154178k783316l152213l372929
9251D9730953l456722l341743l220412k868273k633407k443314k238062k037424
9243B7491596j839804j802269j599050j377088j204367j120312r56240r39178
$$ y = [4636527, 4581296, 4526690, 4619051, 4709255, 4776651, 4881943, 5191045, 5551352, 5930308, 6333332, 6783537, 7306322, 7748402, 8079083, 8387472, 8607324, 8693217, 8824503, 9067929, 9417375, 9736365, 10241506, 10853775, 11587953, 12307140, 13104161, 14095208, 15313330, 16683822, 18257432, 19950178, 21783792, 23868970, 26161800, 28806885, 31810504, 34990900, 38307452, 41895958, 45710395, 49599156, 53301227, 56633237, 59445528, 61607263, 62999261, 63311657, 62648046, 61193589, 59039411, 56256095, 53103882, 49730953, 46274231, 42932488, 39712076, 36843803, 34210396, 31767082, 29529020, 27491596, 25651792, 23849523, 22250473, 20873385, 19669018, 18548706, 17592466, 16653288]
9235A6653288q69817q37470o37352o34609o66716o35043n79256n90713n59754
9226A0642558l37238l02154l52594k22409l45564l87419l91933k35746k82759
9217G784742k35971j40095q3856k73542l39591j63280j78653j98205j01199m3200
9207F027150j18057j65621j02067p2041j42098j45996j36113m2012j07596l7119
9197D958430j01978r7054n4428p9834n7099r6883l6491j06809q3467J5863j17100
9186D143150j23321L323l4773q1839k13519r1688l1682j3327R0397M1599j23156
9175C565164L9366m7660j50129o8950N011j4162K9095O6130N4289L7633K1088
9164C536875r5462j88029j8743n1988O2033k1438k4297J13339J04759m6582o8287
$$ y = [16653288, 15783471, 14946001, 14308649, 13674040, 13007324, 12372281, 11793025, 11202312, 10642558, 10305320, 10003166, 9650572, 9428163, 9082599, 8695180, 8303247, 8067501, 7784742, 7548771, 7408676, 7324820, 7051278, 6711687, 6548407, 6369754, 6171549, 6070350, 6027150, 5909093, 5743472, 5641405, 5569364, 5427266, 5281270, 5145157, 5103145, 4995549, 4958430, 4856452, 4759398, 4704970, 4625136, 4568037, 4471154, 4434663, 4327854, 4244387, 4260250, 4143150, 4019829, 4023152, 3988379, 3906540, 3693021, 3601333, 3569651, 3556324, 3646721, 3688320, 3565164, 3604530, 3556870, 3406741, 3337791, 3342802, 3328640, 3357735, 3423865, 3478154, 3515787, 3536875, 3441413, 3253384, 3234641, 3182653, 3244686, 3223248, 3198951, 3312290, 3417049, 3370467, 3302180]
9153C302180R6962N704m2138j28824l2714N4113N7971J08666p550L3487P1175
9142C519032J4521O8448J11249N5541K4830j9923l8948K0789Q1858P9082M4546
9131C961025O2354P0945O151Q6853J24022J85277J30855M1581N7489J50657J13507
9120D990716R7698J57740J63883K19344L42666K82527J90022J67483K13121J06806
9110F932006J22517L02499L47940L31903L82581L58585L21444L88602L68578M76721
9100A0333376M17882N01644L86581M35433L84904K51041K33184L20251L19811
9091A3584107L35211K89933J80354K78994K52357J63333K42264J06116J32521
9082A5565190K29064K51162J23253J76096K24901L55032M04776L03815L04085
$$ y = [3302180, 3399142, 3404846, 3362708, 3233884, 3201170, 3255283, 3313254, 3421920, 3414370, 3447857, 3519032, 3533553, 3602001, 3713250, 3768791, 3793621, 3773698, 3734750, 3755539, 3837397, 3916479, 3961025, 4023379, 4094324, 4100475, 4187328, 4311350, 4496627, 4627482, 4669063, 4726552, 4877209, 4990716, 5088414, 5246154, 5410037, 5629381, 5972047, 6254574, 6444596, 6612079, 6825200, 6932006, 7054523, 7357022, 7704962, 8036865, 8419446, 8778031, 9099475, 9488077, 9856655, 10333376, 10751258, 11252902, 11639483, 12074916, 12459820, 12710861, 12944045, 13264296, 13584107, 13919318, 14209251, 14389605, 14668599, 14920956, 15084289, 15326553, 15432669, 15565190, 15794254, 16045416, 16168669, 16344765, 16569666, 16924698, 17329474, 17633289, 17937374]
9073A7937374L77040M46297M25714N19250N56619M94948M67796K92230L74392
9064B1891660L94967M13779K56876J28967l9398j15321p9281j07061k27046l95900
9054B2122242n25239m94049n32225n35893o14945n89325n85147n92008l58043
9045A7295368l41410m69881m74482n13652l87540l64233l34055l14504j99787
9036A3895824k26670k27281k80004k35388k28641k54282k03498o7235j98068l32325
9026A1642432k92983l77763k47086k94127l96537k37580m21705m42500k92871
9017H639280k39916k80611k49395l13338k27252l24213l39058k76258k52356k37250
9007E899633k57994k70783k54178k52471k07052j62086j84420j83205j53888j46450
$$ y = [17937374, 18314414, 18760711, 19186425, 19705675, 20262294, 20757242, 21225038, 21517268, 21891660, 22286627, 22700406, 22957282, 23086249, 23046851, 22931530, 22852249, 22745188, 22518142, 22122242, 21597003, 21102954, 20570729, 20034836, 19419891, 18830566, 18245419, 17653411, 17295368, 16953958, 16484077, 16009595, 15495943, 15108403, 14744170, 14410115, 14095611, 13895824, 13669154, 13441873, 13161869, 12926481, 12697840, 12443558, 12240060, 12172825, 11974757, 11642432, 11349449, 10971686, 10724600, 10430473, 10033936, 9796356, 9374651, 8932151, 8639280, 8399364, 8118753, 7869358, 7556020, 7328768, 7004555, 6665497, 6389239, 6136883, 5899633, 5641639, 5370856, 5116678, 4864207, 4657155, 4495069, 4310649, 4127444, 3973556, 3827106]
8997C827106j61351j31625j02797r7304j38830j15294j27283k0327j44472j14904
8987B672919q5450q4008n8467n1664j69401l3372K982j33858r2115m8851o4361
8976A854354J08105K9433L5322n0063r6145k3971O5678r5923j85581j74127j07860
8965A359222O7284J5238o2668p6959J757J6668k9560q2405l0006p041k7707l3783
8953A110040l5918K3144j9116L8680j8113n9006l9363j4802L5695l1713N1607
8942A041135K8844o6737J00366l3610r9428j60626j993l4461K1285Q6332M1287
8931I22394n5405l9226O5363M2252K3372K2817j8086K9704o1456l5096L7147M4589
8919I78369l0351m6962J7111L8363O2917K3973L4667r263p3377j16594r0174p190
$$ y = [3827106, 3665755, 3534130, 3431333, 3334029, 3195199, 3079905, 2952622, 2932295, 2787823, 2672919, 2587469, 2503461, 2444994, 2393330, 2223929, 2190557, 2193539, 2059681, 1967566, 1918715, 1854354, 1962459, 1991892, 2027214, 1977151, 1881006, 1857035, 1922713, 1826790, 1641209, 1467082, 1359222, 1426506, 1441744, 1379076, 1302117, 1303874, 1320542, 1290982, 1208577, 1178571, 1171530, 1143823, 1110040, 1074122, 1097266, 1078150, 1116830, 1098717, 1039711, 1000348, 985546, 1021241, 989528, 1041135, 1069979, 1003242, 1103608, 1069998, 970570, 809944, 807951, 773490, 794775, 881107, 922394, 866989, 827763, 893126, 935378, 958750, 981567, 963481, 993185, 931729, 896633, 933780, 978369, 948018, 901056, 918167, 956530, 1019447, 1043420, 1078087, 1068824, 995447, 878853, 788679, 781489]
8907G81489Q3197p257J9212r597L261l5608m9980j2002j4734K1102J8547Q3459
8895H81089M1299R0997M6298m2901m6612o6804l0382l2335M939j1567p6415K8877
8883G86483l1894j7866l5960j4932o5119j57373j42503j16238O2951O7402P5749
8872D10700R8528m228M2779N1964n0472J8136l951k6957M9865J6370J7124n1874
8860E67984o5405M9157J73148J2045j5813L1175N5758l9499o9885k5677k8082
8849F44906m6908l5044l2066L3028J47555M8890K3944k9735n1008O6860J3270
8838G83692k0261L2442J1268J3971p5790q1439O5975Q2493L1018j3266j608Q4752
8826I13247K7428n3487N8459P4262q6880L1452M866n8405l4476o87l8747O2862
$$ y = [781489, 864686, 857429, 876641, 867044, 870305, 834697, 784717, 772715, 757981, 779083, 797630, 881089, 922388, 1013385, 1059683, 1016782, 970170, 903366, 872984, 840649, 845588, 834021, 757606, 786483, 754589, 736723, 700763, 685831, 620712, 463339, 320836, 204598, 267549, 334951, 410700, 509228, 505000, 547779, 599743, 549271, 567407, 563456, 536499, 586364, 602734, 619858, 567984, 502579, 551736, 724884, 736929, 721116, 752291, 808049, 768550, 698665, 672988, 644906, 597998, 562954, 530888, 563916, 711471, 760361, 784305, 754570, 703562, 770422, 783692, 763431, 795873, 807141, 821112, 745322, 663883, 729858, 812351, 843369, 830103, 828495, 913247, 940675, 887188, 945647, 1019909, 933029, 964481, 969347, 910942, 876466, 875779, 837032, 899894]
8814H99894J4278O4122N8400l3688N3593K1003j17276p3439Q7816l6109Q1696
8803A020290N6565R8592K5885L8819L5557j2740q2882o8941n075k28M8312J14441
8791A268595O3066O0572m2714J17017L02061K27538J55791R5740J71008K10076
8781B628750L56932K71281M03577M57572N31407N94724P25635Q45880J023633
8772G839391J195668J275396J059134Q24631O03521K07150q2716l72841m69529
8763A2079805l92487m95124n52766m69122o61781p38683n92425m26364l15747
8754G435306k44449j52260r4293N6688K16421K60275L76285M56070O22995P12989
8744I646027P28433O87573M78137L79987K76456P6743j60294l14214l31506m94391
$$ y = [899894, 914172, 978294, 1036694, 1003006, 1056599, 1077602, 960326, 886887, 974703, 938594, 1020290, 1076855, 1175447, 1201332, 1240151, 1275708, 1262968, 1180086, 1111145, 1106070, 1105842, 1154154, 1268595, 1331661, 1392233, 1349519, 1466536, 1768597, 1996135, 2151926, 2247666, 2418674, 2628750, 2985682, 3256963, 3660540, 4118112, 4649519, 5244243, 5969878, 6815758, 7839391, 9035059, 10310455, 11369589, 12194220, 12797741, 13004891, 12922175, 12549334, 12079805, 11687318, 11192194, 10639428, 10170306, 9508525, 8769842, 8177417, 7751053, 7435306, 7190857, 7038597, 6944304, 7000992, 7217413, 7477688, 7853973, 8310043, 8933038, 9646027, 10374460, 11062033, 11540170, 11920157, 12196613, 12273356, 12113062, 11798848, 11467342, 10972951]
8734A0972951n49588o41671p04639o02768m99051m16166m39203m63553l58350
8725F297962l18746k92518j20528j19540l9774n0723j01898j51033j37827j11123
8715D854252j04285Q875L4964K28323K59279M30804L76687M41741N84971O09552
8705G725163O94450Q49526J091875J190831J328762J574071J648439J651650J469373
8696A9224140J217805R39264O79176O66840O98016Q81856J062755J154555J095179
8687B7619586R80587N19443J05m81836r77779j386267j566041j476386j192573
8678B2038839j039583o81326l47615l8742L12887N76428Q49117R50350Q07946
8669B3428301O16038N18736K89531N2299Q2613K74158M06796O49662P74918N92800
$$ y = [10972951, 10423363, 9781692, 9077053, 8474285, 7975234, 7559068, 7119865, 6656312, 6297962, 5979216, 5686698, 5566170, 5446630, 5406856, 5356133, 5254235, 5103202, 4965375, 4854252, 4749967, 4758842, 4793806, 5022129, 5281408, 5712212, 6088899, 6530640, 7115611, 7725163, 8419613, 9269139, 10361014, 11551845, 12880607, 14454678, 16103117, 17754767, 19224140, 20441945, 21381209, 22060385, 22727225, 23425241, 24307097, 25369852, 26524407, 27619586, 28600173, 29119616, 29119721, 28637885, 27660106, 26273839, 24707798, 23231412, 22038839, 20999256, 20317930, 19970315, 19931573, 20244460, 20820888, 21670005, 22620355, 23428301, 24044339, 24563075, 24852606, 24904905, 24987518, 25261676, 25668472, 26318134, 27093052, 27685852]
8659B7685852L25454r1406p06596j429948j817752k146938k300320k263225j937713
8650A5317408j552644j214248q83294o32413n09303m44822m03703l30171k99015
8641I047795k32527j20090j11004j89803j13893j11834p8182n895J09570J21948
8631H316085J82278K38730N74378O64495O79576Q47175P42923O97076Q06673J050051
8621A4799440J290400J202097J077956R98619R94256Q38843Q73909R49913Q47557
8612B3872990P76081M67653L70020L47913j8995l83828p29440j104791j330776
8603B2266827j381086j335311j112802o91538l92941j12546K49377M63418P21862
8594A8675260P35069R12773R99111R73450Q46207O48989M86116K95975Q2730q2090
$$ y = [27685852, 28011306, 27919900, 27213304, 25783356, 23965604, 21818666, 19518346, 17255121, 15317408, 13764764, 12550516, 11667222, 11034809, 10525506, 10080684, 9676981, 9346810, 9047795, 8815268, 8695178, 8584174, 8394371, 8280478, 8168644, 8090462, 8084567, 8194137, 8316085, 8498363, 8737093, 9311471, 9975966, 10655542, 11502717, 12245640, 12942716, 13749389, 14799440, 16089840, 17291937, 18369893, 19368512, 20362768, 21201611, 22075520, 23025433, 23872990, 24649071, 25116724, 25486744, 25834657, 25815662, 25431834, 24702394, 23597603, 22266827, 20885741, 19550430, 18437628, 17746090, 17353149, 17240603, 17489980, 17953398, 18675260, 19410329, 20323102, 21322213, 22295663, 23141870, 23790859, 24276975, 24572950, 24655680, 24573590]
8584B4573590r0375p7232l26774n63497q92820j252940j509647j745833j734029
8575A6380443j612744j432140j222710j106843r79141o30322n84414o15905n71810
8566G624414m50503m39110l26283k35063l54445j76747j31189r4565p7628p29
8556E338152K5391q5089M520l052r6876O3778P4930Q0128K12243K31067J27129
8545E972321K71726K56789K46971L19743L84721K98840J60402K37308J51573q5913
8535H214481j46961j86662m00796m71795l41530k82603k34531l33306l48538k24743
8525E243016k17335j31754k9220Q7670K81308L73870M09687L87887L71642M30666
8515G207437M17503J75642J58031M7672q1905k38181l49214m62810n24969n24980
$$ y = [24573590, 24483215, 24405983, 24079209, 23515712, 22622892, 21369952, 19860305, 18114472, 16380443, 14767699, 13335559, 12112849, 11006006, 10026865, 9396543, 8812129, 8196224, 7624414, 7173911, 6734801, 6408518, 6173455, 5819010, 5642263, 5511074, 5416509, 5338881, 5338152, 5363543, 5278454, 5282974, 5279922, 5183046, 5246824, 5321754, 5401882, 5614125, 5845192, 5972321, 6244047, 6500836, 6747807, 7067550, 7452271, 7751111, 7911513, 8148821, 8300394, 8214481, 8067520, 7880858, 7480062, 7008267, 6666737, 6384134, 6149603, 5816297, 5467759, 5243016, 5025681, 4893927, 4864707, 4952377, 5233685, 5607555, 6017242, 6405129, 6776771, 7207437, 7624940, 7800582, 7958613, 8006285, 7924380, 7686199, 7336985, 6874175, 6349206, 5824226]
8505E824226m87733m10018l44236k53506j82724N3513Q9247n4118j41568j68328
8495C924755r8969j81616k97396j99135j24986o8380p0521k27100k78975j83071
8485B194606j50520n6153l8363L3760o2705q7926j74737r2084p2122o8751j17855
8474A307150j31180j21395q1179P323l0208l9501Q5985J2634q9219r3797j20092
8463G06521J6413L559J771K7496P430o978J14490M616j09070r9108l8287L4073
8451F62926K7143P0080r6361j50068q754R1793M0791J5452J1670j6916k3208o4605
8439E59943r3171k657K6985J8200j50147l6062R8670M8542j3102k9728o9511j2042
8427C45920m51L2675O9989N434r9507j26161P8908L5098L874K9539m3486j6490
$$ y = [5824226, 5336493, 4926475, 4582239, 4328733, 4146009, 4199522, 4288769, 4234651, 4093083, 3924755, 3825786, 3644170, 3346774, 3147639, 3022653, 2954273, 2883752, 2656652, 2377677, 2194606, 2044086, 1987933, 1949570, 1983330, 1920625, 1832699, 1657962, 1565878, 1493756, 1425005, 1307150, 1175970, 1054575, 973396, 980719, 950511, 911010, 996995, 1009629, 920410, 826613, 706521, 722934, 726493, 728264, 755760, 763190, 756212, 870702, 875318, 766248, 667140, 628853, 662926, 690069, 760149, 663788, 513720, 504966, 596759, 637550, 653002, 664672, 647756, 624548, 559943, 466772, 464115, 491100, 509300, 359153, 323091, 421761, 470303, 457201, 427473, 357962, 345920, 345469, 378144, 448133, 453567, 354060, 227899, 306807, 341905, 345779, 375318, 331832, 315342]
8415C15342J9245L6973k7124o2144L0495p546j0836r5604o7007Q4793J6047q9802
8403A42832j6978m689J9504J2146J06687M2604P8633m8435n388P1097q4207o3438
8391B50368n9192m9349K8820J30001K6261l9531p4907j8444M1233p14j2087m0915
8379A81544r0943m0199k0016J00562Q56K8715J34023M3286o1331r0290p0782K1021
8367A36446N0869N2723k7207k8712m0792R4052J21641N1409R763M6738j03696
8356C63234o2128p1939p9312r6191P6589j0538O2602P8234n4532p3142p8135j123
8344E3619K3773J8534L3568k5713K9701m0682j14389J995Q3581R5997m0908P075
8332A26151N8636K4695j45809o1597m7383L5489Q1944k3180L6842n5454K9655
$$ y = [315342, 334587, 371560, 344436, 282292, 312787, 305241, 294405, 198801, 131794, 216587, 232634, 142832, 125854, 121165, 140669, 152815, 259502, 302106, 380739, 332304, 326916, 398013, 313806, 250368, 191176, 141827, 170647, 300648, 326909, 287378, 212471, 194027, 235260, 234546, 222459, 181544, 90601, 50402, 30386, 130948, 131804, 160519, 294542, 337828, 276497, 186207, 115425, 136446, 187315, 240038, 212831, 184119, 143327, 237379, 359020, 410429, 420192, 466930, 363234, 301106, 229167, 149855, 53664, 130253, 119715, 182317, 260551, 206019, 132877, 54742, 53619, 77392, 95926, 129494, 103781, 133482, 92800, -21589, -19594, 63987, 159984, 119076, 126151, 184787, 209482, 63673, 2076, -45307, -9818, 72126, 48946, 85788, 30334, 59989]
8321E9989j5251q3884O7048R5618M6676J0921N5790J8606r323j20958o7273L0231
8309H8190l1077j4280L9909K5675M1366P973N4960R6467M8242q1337n3457J07748
8297C30379k1688k1605P5770l1104k9006j39446p1910j7826k9447Q7048O7448
8286A98613J1949N7025k5040j64896k5273Q8073J07887L6386n2301M393o0743
8275A76073j02872L3087J05641n3807m3916L5010J07123M8582n9077j16334j01371
8264B8139L2532Q9440J4605L8812p6807P285K4343k9166K0550j3323l0765J4358
8252A20003j4376J5636k936m3770Q051J8483M0303M5799j318j3016q2325J00155
8240A90689K5920p4556k5059O2313K5716o3051o2865L2720O6125o5793l2252m7711
$$ y = [59989, 44738, -39146, 27902, 123520, 170196, 181117, 236907, 255513, 246190, 125232, 57959, 88190, 57113, 42833, 82742, 108417, 149783, 157756, 212716, 309183, 357425, 276088, 222631, 330379, 308691, 287086, 362856, 331752, 302746, 163300, 91390, 73564, 44117, 131165, 198613, 210562, 267587, 242547, 77651, 52378, 140451, 248338, 284724, 232423, 236816, 176073, 73201, 106288, 211929, 158122, 114206, 149216, 256339, 304921, 245844, 129510, 28139, 60671, 150111, 164716, 203528, 126721, 134006, 158349, 129183, 149733, 136410, 105645, 120003, 105627, 121263, 118327, 74557, 82608, 101091, 141394, 187193, 185875, 172859, 90534, 190689, 216609, 142053, 116994, 179307, 205023, 141972, 79107, 111827, 177952, 112159, 79907, 32196]
8228C2196l1545l387p3131K6274P3957R8348M7240j9325j4235j3209N5L206n072
8215A21372L0883L69K4760J14648Q728J4431K5762j7809p5408j13765m3538o849
8203H3584M6941L5368j57219p5348K5669J07071J17559M2879q5799j74132j10339
8192a43766n143O3512O9451J2687n712K5725K8422j09968Q0887K26488J3594n5177
8180B01000o5546k9182m945k3646P4207J0089l497K1916j24382o6503K0853l0800
8168b0436Q5496m6909o0294L5909n5852j08299Q7983L1603O8540o4297r167J33208
8156G7485L5362l3835j546L8431l7555K0085jl2075l4770j7570L7225j9243m0762
8143h769P784L3190l485P1012J20649k3509j1276j4392K845k5565P3124J12796
$$ y = [32196, 651, -2736, -75867, -49593, 24364, 122712, 169952, 150627, 136392, 123183, 123238, 126444, 121372, 152255, 152624, 177384, 292032, 300760, 315191, 340953, 323144, 247736, 133971, 90433, 83584, 130525, 165893, 8674, -66674, -41005, 66066, 183625, 226504, 140705, -33427, -143766, -148909, -85397, -15946, -3259, -8971, 16754, 45176, -64792, 16095, 242583, 256177, 201000, 135454, 106272, 101327, 77681, 151888, 161977, 158480, 180396, 56014, -10489, 10364, -20436, 65060, 18151, -42143, -6234, -62086, -170385, -82402, -50799, 17741, -46556, -55723, 77485, 112847, 79012, 77466, 115897, 78342, 98427, 98426, 66351, 31581, 14011, 51236, 31993, -8769, -985, 32205, 28720, 99732, 220381, 196872, 185596, 171204, 174049, 148484, 221608, 334404]
8131C34404K199l602o7582l7532l1424r0344q6887M9829r104o2259R537J29009
8119A36244L6686j48410j06542M1848m3554J3985k8710k5351J33880J20734r969
8108A20841j08380L1448N2325J3775J2651L6085L7582l4705o5832K0432m4249
8097G1973p7054n7423j5078N5367M9316j2734m748l1783O3028j8602l7405J5711
8085E68O3996L0726Q865J9025J2352p6336j1870m7812J11712n7523p3635N6580
8073C6648K6008k5159L132J0583m868J2548q1721r269o676r3789Q0385J02489
8061E0311N4102j5257J729J5192P86j3189R6305L5807m0554P284j00354k6039
8049F6123j996L2138N0501J08059J2800p8713l7449O5419M7115l3062J5098J596
$$ y = [334404, 336603, 333001, 265419, 227887, 196463, 106119, 19232, 69061, 59957, -2302, 7235, 136244, 172930, 24520, -82022, -40174, -83728, -69743, -98453, -123804, 10076, 130810, 120841, 12461, 43909, 96234, 110009, 122660, 158745, 196327, 161622, 95790, 116222, 71973, -5081, -62504, -77582, -22215, 27101, 14367, 9619, -22164, 40864, 22262, -15143, 568, 64564, 95290, 104155, 123180, 135532, 59196, 47326, -486, 111226, 53703, -19932, 36648, 62656, 37497, 40629, 51212, 46344, 58892, -22829, -32098, -38774, -132563, -52178, 50311, 104413, 89156, 90885, 106077, 106863, 93674, 189979, 225786, 185232, 192516, 92162, 66123, 64127, 96265, 146766, 254825, 267625, 188912, 151463, 216882, 263997, 230935, 246033, 247629]
8037B47629o9974p0804q1779M1104m0775n0989Q3647k122j4711K3529J9346n2665
8025C1436M845J1098o4888M4272K6539M8912p7787l2489M9016O5269q0573m3336
8013a7686J0974k3344R9217J44180k057j7237O3729J1658r9787n7337n389j8724
8001H8197J03273R1024r6323o457R6041p1316K8130n1926q6134m8177P0766l7549
7989G9549J8690n6266l4404J19218j9678N4461J01375J1136j37287j09864p6057
7978d9127J46174J13136m1351k4191Q641N2581n5455l6132m3390L1060K7902L604
7966A33452j41436K3420J38325l2386k1701q391M723j18144r8011j1148N3620
7955g7677M9605O6307N8680M8072O5853r6942q7071Q2121j9087l0118L5345o778
$$ y = [247629, 177655, 106851, 25072, 66176, 25401, -25588, 58059, 55937, 41226, 64755, 84101, 31436, 36281, 47379, -17509, 26763, 53302, 102214, 24427, -8062, 40954, 106223, 25650, -17686, -6712, -30056, 69161, 213341, 211284, 194047, 257776, 269434, 169647, 112310, 106921, 88197, 191470, 282494, 186171, 179714, 275755, 204439, 232569, 180643, 94509, 46332, 117098, 79549, 98239, 41973, 7569, 126787, 107109, 161570, 262945, 274081, 136794, 26930, -49127, 97047, 210183, 168832, 144641, 153282, 205863, 150408, 114276, 70886, 101946, 129848, 133452, -7984, 15436, 153761, 121375, 99674, 91283, 96006, -22138, -120149, -131297, -77677, -28072, 38235, 96915, 144987, 210840, 113898, 26827, 108948, 89861, 59743, 95088, 88310]
7943H8310p9826M4360j3185R5217L3328l2362N00Q4873L4936j20334l4448o6927
7931C4442o4641N0395M8267J41470r0196j04406o5239L1937r2155Q030R8286R8910
7919I5100L8113l2489j10714l5409R5947J52284j2198j19928r349J01230R3212
7908B55799n4894j34078L2543o6709L6761L9035M7972r947k2914k9630n0521p1633
7896b8216o7666J2654J5082J7121J09696J4354M7446L9159L766j393L3630q4003
7884A11630J6459Q6398J11348L4320j71477o8326O086p9143q4N0785J0930K2932
7872A31858j8419j37209k7491Q713K4103L4837q6886j45030k1100L3214n2789
7861b56199K1291O5221J64656N5986j22051l1550J58024o8175n8208L5948L8799
$$ y = [88310, 8484, 52844, 39659, 134876, 168204, 135842, 136342, 221215, 256151, 135817, 101369, 34442, -30199, 20196, 68463, 209933, 119737, 15331, -49908, -17971, -110126, -102096, -3810, 95100, 133213, 100724, -9990, -45399, 50548, 202832, 190634, 70706, 61357, 162587, 255799, 200905, 66827, 99370, 32661, 69422, 108457, 156429, 146482, 123568, 93938, 43417, -28216, -95882, -83228, -68146, -51025, 58671, 73025, 120471, 159630, 163396, 162003, 195633, 111630, 128089, 214487, 325835, 360155, 188678, 120352, 126438, 47295, 47211, 97996, 108926, 131858, 113439, -23770, -51261, -42548, -18445, 16392, -70494, -215524, -236624, -203410, -256199, -234908, -169687, -5031, 50955, -71096, -102646, 55378, -12797, -71005, -35057, 3742]
7850C742N7278l7820o095l9448J64754N5865j38906r9865j09198k7901Q6383M4367
7838d6844P6634k2713o4494R2042J42845r5353o5723o1741P3882P474r1668l2698
7826h8357q9909j4805L9525Q2702Q6752j5710K8310N3998r1192k4731N4725M6799
7814F8107K271j2231l9941J5991J17958N3188k0691q9594j6135l6936j7376M745
7802B9356j0409Q730M389K458J3769o5006L4132O0704m8572r4758J4748P2243
7790B1784o6593Q8397O868o494k0387k4022m6246O0228N4104J2472L9130J406
7778A20647L9944K4127J6484q116n4820m2574l7991j40600P2787J21529j13683
7767b266k2296k3330k9743L1335M4783K7605K858j25658K2839M3409k7343K4712
$$ y = [3742, 61020, 23200, 17105, -22343, 142411, 198276, 59370, -40495, -149693, -177594, -91211, -46844, 29790, 7077, -57417, 34625, 177470, 82117, 16394, -45347, 28535, 36009, -55659, -88357, -178266, -193071, -153546, -70844, 15908, 198, 28508, 82506, -8686, -33417, 21308, 68107, 70378, 58147, 18206, 34197, 152155, 205343, 184652, 95058, 78923, 41987, 24611, 29356, 18947, 27677, 32066, 34524, 48293, -16713, 17419, 78123, 29551, -65207, -50459, 21784, -44809, 43588, 50456, 43962, 23575, -447, -46693, 13535, 67639, 80111, 119241, 120647, 160591, 184718, 201202, 193086, 138266, 95692, 57701, -82899, -10112, 111417, -2266, -24562, -47892, -77635, -46300, -1517, 26088, 28946, -96712, -73873, -30464, -57807, -33095]
7755c3095M0203o3472O4961R1471l1849M7835J4353j23556L3470K4066J4125p1268
7743G244o8661N6081M4271o8731m8718Q1535K2648m2694N7998r421m0189L6295
7731B7658L1338j8023K0645m8918Q741j3476l862r460o9629L1724N1162m0382
7719c2482k4970L8249J8729l9924K2532P5532J02508j3147L5879o9147j28952
7708a5193o0941O1918j0349j15013J367q022j325m007K3862R705N6488N7308k7595
7695c1797N7867O1874m9819o1567K0603M5025J07506O723J3334l9971o4878q6694
7683b1794j36926M5984P7848N9425j6756n8696L7283O0463n0963j03579o7515
7672a75226j7331L4274q0325J00846R1592R79J30279R8660m7928k3071j413l8339
$$ y = [-33095, 7108, -56364, 8597, 100068, 68219, 116054, 130407, 6851, 40321, 64387, 78512, 7244, -61417, -5336, 38935, -29796, -78514, 3021, 25669, -17025, 40973, 31552, -8637, 27658, 58996, 40973, 61618, 12700, 21441, 7965, 4103, -5357, -74986, -43262, 7900, -32482, -57452, -19203, -474, -40398, -17866, 57666, 160174, 147027, 182906, 113759, -15193, -76134, -14216, -24565, -139578, -138211, -146233, -147558, -151565, -127703, -117998, -61510, -4202, -31797, 26070, 87944, 38125, -23442, -2839, 42186, 149692, 156415, 169749, 129778, 64900, -21794, -158720, -112736, -34888, 24537, 7781, -50915, -13632, 46831, -4132, -107711, -175226, -192557, -158283, -238608, -137762, -46170, -45191, 85088, 183748, 135820, 112749, 111336, 72997]
7660G2997J5026k9636l1610J37760j4872p9551N6233M7779j6207R174O7506m339
7648B30260n5265m7992R163l1864p1141M0344m2105q9045l1909j67N3658J42777
7636A06714K1806j0686k7887j7534m7322K9153J7092m3887l9400K8537k2038J4326
7624H874k8197L9141N110J0962m2749J2577m5261o3782O9994J71855L6588J8638
7612A93750m0943n3811k6451l0179j2861K7136L246p7490q674l8074O989m2885
7600a00247N7847J21261Q6520M5673J2398p2319o8041J9403O9182J3736j11231
7589G4182j56351Q3293P6169q8897k8640l3381M7616P0449M6151j4211k6820N6932
7577A06492q5068n3242j03l057K7439K0958k3869L2584K3263o6510O4821Q5790
$$ y = [72997, 88023, 58387, 26777, 164537, 149665, 70114, 126347, 174126, 157919, 167093, 234599, 230260, 174995, 127003, 136166, 104302, 33161, 73505, 31400, -57645, -89554, -89721, -36063, 106714, 128520, 117834, 89947, 72413, 25091, 54244, 71336, 27449, -11951, 16586, -5452, 8874, -19323, 19818, 24928, 35890, -6859, 5718, -39543, -103325, -33331, 138524, 175112, 193750, 152807, 98996, 72545, 42366, 29505, 56641, 59887, -17603, -26277, -64351, -57362, -100247, -42400, 78861, 165381, 211054, 223452, 151133, 83092, 102495, 171677, 185413, 74182, -82169, 1124, 77293, -11604, -40244, -73625, -26009, 44440, 90591, 76380, 49560, 106492, 21424, -31818, -31921, -34978, -7539, 13419, -10450, 22134, 45397, -21113, 43708, 129498]
7565A29498p6742J211J1515n4229Q951n3056r8045J11971j866r8682n6259q5812
7553b61545M3568J41169J378Q4422j1143q5314N5305J7063K7657O6585J03313
7542A82458n3419O8513q9583K8607K9570J6210k5685j13828l7006q224m9628r6883
7530a48898k152J5966L2779j0121N6975M8746L4634M9155m3991l2640M2405k9061
7518A3797o8311L6449O5563o030p6337K1359M0061k6782J7968o0595r6923L8112
7506a01669O6138p317o4492j4629O5720L8378p7240m466N2581m035N477M0375
7494e179n2715k9712P2277K6628k9184l9859J01938l4150j16124q6612J20366
7483g2326Q6644J01596P6318j02392o3220j15486p5455R6469M8908n1100n0853
$$ y = [129498, 52756, 53967, 65482, 11253, 20204, -32852, -130897, -18926, -20792, -119474, -175733, -261545, -217977, -76808, -75430, 8992, -2151, -87465, -32160, -15097, 12560, 79145, 182458, 129039, 197552, 107969, 136576, 166146, 182356, 156671, 42843, 5837, -2387, -52015, -148898, -151050, -135084, -102305, -112426, -55451, -6705, 27929, 77084, 33093, 453, 42858, 13797, -54514, -18065, 47498, 41468, -34869, -13510, 26551, -231, 17737, -42858, -139781, -101669, -35531, -42848, -107340, -121969, -56249, -17871, -95111, -99577, -46996, -51031, -45554, -5179, -57894, -87606, -15329, 11299, -17885, -57744, 44194, 10044, -106080, -192692, -72326, 14318, 115914, 192232, 89840, 26620, -88866, -164321, -67852, -18944, -70044, -120897]
7472a20897o2916l3001P4291M4983l2762l0324L279O564J07417N5427j11244K2998
7460g6185L0696J7488k7812p5453L4511N4935J39482O8401j07758k8088k0983
7449I234q1664m0162L2679J09573P5086l0177j1069q0233j9497k5270o961k7694
7437i6155M8619m3408l8323l674J0521n4721K1259J42333k1409j01205L5589k9659
7425a30233j93702L3203J79874J23311P2878K8374R273o1245K4956L6750q638
7414A14801m6378j6146m6171o6108j8702M5473J264l8904L6194L8628L4288K7960
7402F6199k305k732L9250J360l2911q090j15145j3383J41315P2912j44413j08510
7390a06453J2739K0859K6711P9324O9530J1020L5077L3534l9272o0429K7713j4553
$$ y = [-120897, -183813, -216814, -142523, -97540, -130302, -160626, -157347, -150783, -43366, 12061, -99183, -76185, -45489, -28001, -55813, -131266, -96755, -41820, 97662, 166063, 58305, 30217, 9234, -72430, -112592, -79913, 29660, 104746, 74569, 63500, -16733, -36230, -61500, -68461, -96155, -47536, -90944, -129267, -132941, -122420, -177141, -155882, -13549, -34958, -136163, -100574, -130233, -323935, -290732, -110858, 12453, 85331, 113705, 122978, 61733, 86689, 123439, 114801, 68423, 52277, 6106, -60002, -78704, -33231, -31967, -70871, -34677, 3951, 38239, 66199, 63894, 61162, 100412, 101772, 68861, 60771, -54374, -67757, 73558, 146470, 2057, -106453, -93714, -72855, -46144, 33180, 102710, 113730, 148807, 182341, 143069, 82640, 110353, 95800]
7378I5800n9001o1835l6873J4663j0187q8039n5730N6040M6429N8143L2883k60
7366g967m9661m3447K6703J23754N1712m4691J7009o639n0544N4500j7019k6148
7354B7562N492O167L9330j4266n2284M1579j1407m5855j01517K495K7376L8567
7342c6761j9448l5321J2156J27962l2880j5338L4393l4345o0686N3077M2739n1972
7330a6424m7403P4127L5807O7086J14232L9094l5162j49881o1362n4538O8515
7319C4091p4756n8800J286k1499N979l1262j7126n68J2667N4137J9406n5160o930
7306a38535J14092o7091m3740L8162M5910L4903j8126j3666K8495J22817j1732
7295I1489m527m1933L5218o7199O6981R2094l1048q8882j22406K2007K6659k2474
$$ y = [95800, 36799, -25036, -61909, -47246, -57433, -145472, -201202, -145162, -98733, -40590, -7707, -7967, -57628, -101075, -74372, 49382, 101094, 56403, 73412, 66773, 16229, 70729, 53710, 27562, 33054, 39221, 78551, 64285, 12001, 53580, 42173, -3682, -105199, -102704, -75328, -36761, -56209, -91530, -79374, 48588, 15708, 370, 34763, 418, -60268, -7191, 35548, -16424, -63827, 10300, 46107, 113193, 227425, 266519, 231357, 81476, 20114, -34424, 34091, -40665, -99465, -98179, -119678, -113699, -144961, -162087, -162655, -149988, -95851, -76445, -131605, -138535, -24443, -91534, -135274, -97112, -51202, -16299, -34425, -48091, -19596, 103221, 91489, 86962, 45029, 80247, 13048, 80029, 172123, 141075, 52193, -70213, -48206, -21547, -44021]
7283d4021K4900R5455K1956P2043p9420m154J433m3078n5363K7052P6485J6509
7271A09797J9339q3441J0484J978j01917L1198M6621K1246p2631J1024M3687K6354
7259F3739q9178J5213m2053m1508n6784j4597L5487J02026N640k5632j9415P859
7247e9203Q0586l7010p2544P056N1715l1179J0443O6914p0609l4317O6719j05392
7235a26821j25936L2238L1111J48737J54204L2710j3398j41788r4790M9694N4001
7224c8L531l2241O8235M1386o7460q2090M0556N6965P1729O806j1817R4556L0315
7211B20433m288m1869p5822j12585P4194K9526O174m7823l4707l1397K2896Q6059
7199I0791M7239r6609N118k9853l147Q5206Q8717q6296j22016l7696N5532m5965
$$ y = [-44021, -19121, 76334, 98290, 170333, 90913, 86759, 88192, 45114, -10249, 16803, 93288, 109797, 129136, 45695, 56179, 58157, -43760, -12562, 34059, 55305, -17326, -6302, 37385, 63739, -25439, -10226, -52279, -93787, -150571, -165168, -129681, -27655, -22015, -47647, -67062, -59203, 21383, -15627, -88171, -81115, -29400, -60579, -50136, 16778, -53831, -88148, -21429, -126821, -252757, -220519, -189408, -40671, 113533, 146243, 132845, -8943, -103733, -54039, -38, 3493, -28748, 39487, 80873, 13413, -68677, -28121, 28844, 100573, 107379, 95562, 190118, 220433, 216145, 174276, 98454, -14131, 60063, 89589, 95763, 47940, 13233, -18164, 4732, 90791, 138030, 41421, 46539, 16686, 13539, 98745, 187462, 101166, -20850, -58546, -3014, -48979]
7187d8979Q0756J48401n5292j78998J6048N5541n239L4958K6566M7088M3573j3263
7175A51160k3344l7195l7748q2814l5890L5919J8933Q6261o5103j15495M1019
7164f4297k7230k5888P8708M1879l3050K4294Q7036J47j29202q6715K2204J5375
7152i6739J6624K57m0686k4555J0236N9079O8116k329k5898n5946O7779L6945
7140A2883R204k5368L4977M837j08819n2425q11O985l3890J3162L5559J29647
7128B5941N0104m6875o6824q927o2626n0660J1790J25697L4351l4363J20617j7458
7116H0767o1225p6142N0299J3723l6294K4338J16437j263p2012J1842p1912r5338
7104a16780m2638j3143J12798J07480m1061j0618l4163j5260K5355k8403M5614
$$ y = [-48979, 31777, 180178, 124886, -54112, -38064, 17477, 12238, 47196, 73762, 120850, 164423, 151160, 127816, 90621, 52873, -29941, -65831, -29912, -10979, 75282, 10179, -105316, -64297, -91527, -117415, -38707, 3172, -29878, -5584, 81452, 81599, -47603, -134318, -112114, -96739, -80115, -79858, -120544, -145099, -134863, -75784, -7668, -9997, -35895, -91841, -24062, 12883, 22087, -3281, 31696, 36533, -72286, -124711, -125522, -118537, -152427, -139265, -103706, 25941, 76045, 29170, -37654, -46581, -109207, -159867, -148077, -22380, 11971, -22392, 98225, 80767, 19542, -56600, -6301, 7422, -28872, -4534, 111903, 110640, 38628, 50470, -21442, -116780, -159418, -172561, -59763, 47717, 6656, -3962, -38125, -53385, -28030, -56433, -10819]
7093a0819K0159L1982K5124l926p2353n4098p4090J17999O7750J2938r4699k4282
7081e8315J2636Q1175N1300k3832O9830k45j2652J7883K3505j17740m6527K0999
7069A8017J0417r8185j235o6448r9316j6090K2640L5268J32339R3016m1516j7961
7057b9054m7517o0144O9899O3201L2317j9835N3265n7105r8166L2118P2816M3336
7045E5131k4869j59608o9641O9232K8934j2012m3084R8265O1942k5545j9682L3208
7033g729K9044j20327j21426l2771L3183P3581N2410q214J03949K8190k7476R56
7021C370K2017P2652J2296k4919Q810J5778n9960n5815k1082q9640j8579P9810
7009e5262J80225O7559j64664j14388J7655M0476l1795q191P5955k5278K9522
$$ y = [-10819, 9340, 41322, 66446, 62520, -9833, -63931, -138021, -20022, 47728, 60666, -34033, -58315, -45679, 35496, 86796, 62964, 132794, 132549, 119897, 137780, 161285, 43545, -2982, 18017, 28434, -69751, -70986, -137434, -236750, -252840, -230200, -194932, -62593, 30423, -11093, -29054, -76571, -136715, -66816, -3615, 28702, 8867, 62132, 5027, -93139, -61021, 11795, 55131, 30262, -129346, -198987, -129755, -100821, -112833, -155917, -57652, 4290, -21255, -40937, -7729, 21315, -99012, -220438, -253209, -220026, -146445, -94035, -102249, 1700, 29890, 2414, 3370, 25387, 98039, 110335, 85416, 94226, 110004, 50044, -5771, -26853, -116493, -135072, -55262, 124963, 192522, 27858, -86530, -68875, -28399, -60194, -68385, 7570, -17708, 11814]
6998A1814N803j8376J18434P7370K230j03831o6402L3613R8357r3479q4315k7801
6986d6583Q2912K4466q8153q012J39417K4656j6218m972n4800j6762j7711m2630
6974b4390m08M1625j5778n9241K0602N4176m645k4785l3810L5067r5168j11278
6962b18033q4694Q3216Q1991L8542K879L0368J7478J933L8042O6899o982K8264
6950G9903j8927q1366J14670M9007L7464l6122q7862n6381q0100J1204L0440N4102
6938A6032o7118n0105O759P6800K7196L5294J9589J0039N4944q1354p1561o0044
6926h3529r726R8466R4340k2395l1871r0454M0416N3465k4146j04435j18437j6111
6914b14417J35125J6415l0114k1675J06572Q1718o2677P088J5889L5842j3782
$$ y = [11814, 17617, -759, 117675, 195045, 197275, 93444, 27042, 60655, 159012, 65533, -18782, -46583, 36329, 60795, -27358, -35370, 104047, 128703, 112485, 107513, 52713, 35951, 18240, -24390, -24798, 16827, 1049, -58192, -37590, 16586, 11941, -12844, -46654, -11587, -106755, -218033, -302727, -219511, -137520, -98978, -96099, -65731, -48253, -46320, -8278, 58621, 51639, 79903, 60976, -20390, 94280, 143287, 180751, 144629, 56767, 386, -79714, -68510, -38070, 16032, -51086, -101191, -94432, -17632, 9564, 44858, 64447, 74486, 129430, 48076, -23485, -83529, -93255, 5211, 99551, 77156, 45285, -45169, -4753, 48712, 24566, -79869, -198306, -214417, -79292, -62877, -92991, -114666, -8094, 73624, 10947, 18035, 33924, 69766, 55984]
6903E5984l2971n2975M9408J15929j641Q636O496n4928k263K735m0514J05358
6891A59254O0043k1026q5279J431k2077L2958Q578j59286K1337J64764Q996o8363
6879A01330k4091k9508m3355l9484L2888j09207J02957L8969q5450m8101J2444
6868i0608M3771k5390J2341J08599M6206o0837j11562P054Q025n2654n1301K9193
6856a37163j022m5570M9246P1845J12495o249n9706N972j33J06227K2908K3190
6844A42040m3219j2839N6205J6263l0940j37093o0432j4351o9397O533J25129
6833b2101L1270K1461O6444k7582j44958o4904m9575j2327P1298J20313K9309
6822A8648N7983P215l2031l6366j26284J03947L8303L0868M8369l0705r2340r0218
$$ y = [55984, 23013, -29962, 19446, 135375, 133734, 142370, 148866, 93938, 91675, 94410, 53896, 159254, 219297, 198271, 112992, 114423, 92346, 125304, 133882, -25404, -4067, 160697, 169693, 101330, 77239, 47731, 4376, -35108, -2220, -111427, -8470, 30499, -54951, -103052, -90608, -46837, -72227, -59886, 48713, 94919, 34082, -77480, -70426, -62401, -115055, -166356, -137163, -138185, -183755, -134509, -62664, 49831, 43582, -16124, -10152, -10285, 95942, 118850, 142040, 98821, 85982, 142187, 158450, 127510, -9583, -70015, -84366, -153763, -147230, -22101, 9169, 30630, 97074, 69492, -75466, -140370, -189945, -202272, -130974, -10661, 18648, 76631, 83846, 51815, 15449, -110835, -6888, 31415, 62283, 110652, 79947, -12393, -102611]
6810a02611m3100Q3799P9358o380p8182n1778J6639R134J21080j7398O308N3911
6798G0780k4948O1052L372J1688m8241p1535p8767N82o66m2011K6808k4874J24985
6785H225Q993L7896P3650J23311j0707j37626o099L805M9362l7335j17090p0097
6773g3712k0109J2887J3527J02613K8646j1388n8265m1277j29657O5759J20288
6762I312O127l9490M685o9903p2128P9336K5592l6965L5666J19077o0069o3202
6750f1962l2824N6999N9168M9674k5330O9871L6120m585m1853R956k4320J6006
6738A06920j4627q4702k8909R2442K6488n5931k4168L0270j5854J6248N4190L5514
6726A37881K3393p8849m5622K6301J12077k6843n402N069J06390J05397J27542
$$ y = [-102611, -145711, -61912, 17446, 11066, -67116, -118894, -102255, -93121, 27959, 10561, 16869, 70780, 45832, 106884, 110256, 121944, 73703, 2168, -76599, -76017, -76683, -118694, -91886, -116760, 8225, 17218, 55114, 128764, 252075, 241368, 103742, 97643, 101448, 150810, 113475, -3615, -73712, -93821, -80934, -67407, 35206, 63852, 52464, -5801, -47078, -176735, -110976, 9312, 15439, -24051, -19366, -89269, -161397, -82061, -56469, -93434, -57768, 61309, 1240, -61962, -94786, -37787, 21381, 71055, 45725, 115596, 151716, 147131, 105278, 115234, 90914, 106920, 92293, 7591, -21318, 71124, 97612, 41681, 17513, 47783, 31929, 48177, 102367, 137881, 161274, 82425, 36803, 63104, 175181, 148338, 142936, 148005, 254395, 359792, 487334]
6715D87334J16291N1649m8601k04957j49911m0912k3022q2870j10888J3481n4645
6704d7051N0190m5324m8578J24658O6586j277k8122j3383K9122J5745p4272R67
6692B9261L8002M8424j1044q2158N7241o5315p2099m6971N2309M683Q055K1782
6680a7830J35371M903j13153j26501m5816J5868Q7093J00630Q9519L033K5880
6669A58997K8606r3079n5755q9820L1631Q6609O592q1814O0969L6061o9813k6261
6657g077l7269M1860J6331p0121J7615J03536L831k4428r8150L1825m1775q0400
6645a44222K438M5885K6362n126M2498K6548M5691M3625q0359N4522J41208J04107
6633C03177n4737j44868p5430k9498k6178o8019L4713P0618o2598l4163k5006
$$ y = [487334, 603625, 655274, 606673, 401716, 251805, 210893, 187871, 105001, -5887, 7594, -47051, 3139, -42185, -90763, 33895, 100481, 99204, 71082, 57699, 86821, 102566, 28294, 29261, 67263, 115687, 104643, 22485, 79726, 14411, -57688, -104659, -52350, -47667, -39612, -17830, 117541, 122444, 9291, -117210, -163026, -147158, -60065, 40565, 130084, 133117, 158997, 187603, 94524, 38769, -51051, -19420, 67189, 73781, -8033, 52936, 88997, 19184, -7077, -44346, -2486, 13845, -56276, -38661, 64875, 68706, 44278, -53872, -22047, -63822, -144222, -141784, -95899, -69537, -74663, -32165, -5617, 40074, 83699, 3340, 57862, 199070, 303177, 248440, 103572, 28142, -1356, -27534, -95553, -60840, 9778, -52820, -86983, -111989]
6622a11989L261M7407K5739q414l4675p0915J09644Q7396l5205p2088R731j9132
6610f9240M0115M2757m983k0292l4343J8093q19k3074j1405l2298o991N0830J487
6597e0163P7016J493l6215r9815j402N8899J7822Q156l053M8736j9623j34580
6585a32729O2376O9053q5303o8155Q598P1475R1298N9555k6920m4905q558k5890
6573c0105m5839R8475P9460j10186q4555M3003m2957J3532o1996o3163J6113J3916
6561a74302l1686M7751O3486P8089k9005j4612J6708L0977n3477q5188O3843J16101
6549B8685k0936r0007m9448j0852j0156J01004M4637M3711K5309n0101Q081K1923
6537D1850O830p4613p3321O2901J51734L6655L0914j25068j7727l9446k7081K8506
$$ y = [-111989, -108728, -61321, -35582, -43996, -78671, -149586, -39942, 47454, 12249, -59839, -50108, -69240, -29125, 13632, 8649, -11643, -45986, -27893, -28712, -51786, -63191, -95489, -102480, -51650, -50163, 26853, 28346, -7869, -107684, -109086, -50187, -32365, -24209, -27262, 21474, 1851, -132729, -70353, -1300, -86603, -154758, -146160, -74685, 16613, 76168, 49248, 4343, -4215, -30105, -75944, 22531, 101991, -8195, -92750, -49747, -92704, -79172, -141168, -204331, -188218, -174302, -205988, -158237, -94751, -16662, -45667, -60279, -43571, -12594, -66071, -151259, -87416, 28685, 7749, -82258, -131706, -142558, -152714, -51710, -7073, 36638, 61947, 11846, 19927, 41850, 48680, -25933, -99254, -36353, 115381, 152036, 182950, 57882, 40155, 709, -26372, 2134]
6525B134n5460R2094J8780o3485r377o2525j3221M6218r425O9781m4588l6463
6513f5537N9156Q3437l3357j40228K2993R411R753L5425l5714n1494j231p6879
6501a84265N6223J66922O9524j04794l5137O5327O9316P2633n0352j3712J7099
6490A28784l0333K582p1347k8758q4096p3089J29733R3574K2734q2739m1042N5596
6478B1599K4303J00594N0501q7095j70262m6590k9131L7255N5924l126R307L5445
6466a276K6472p7998k4782n0906Q3767N110r9081K6220M7297Q0309J4044j08265
6454g9089l8354k0633m1150m4073O3332J833O4083Q724l0622l7164K0635k1077
6442a53555J6254K6406j4405k0115k7132M1271M9100K0240J03558J3643q7825
$$ y = [2134, -53326, 38768, 57548, -5937, -15314, -77839, -91060, -44842, -54267, 15514, -29074, -65537, -6381, 77056, 43699, -96529, -73536, -64125, -54372, -18947, -54661, -106155, -107386, -184265, -128042, 38880, 108404, 3610, -31527, 33800, 103116, 175749, 125397, 111685, 128784, 98451, 101033, 29686, 928, -83168, -156257, -26524, 67050, 89784, 7045, -33997, 21599, 45902, 146496, 196997, 109902, -60360, -106950, -136081, -98826, -42902, -46028, -36721, -1276, 25196, -52802, -77584, -128490, -44723, -39613, -138694, -112474, -65177, 15132, 29176, -79089, -117443, -138076, -179226, -223299, -159967, -158134, -94051, -85327, -115949, -153113, -132478, -153555, -137301, -110895, -125300, -145415, -172547, -131276, -82176, -61936, 41622, 55265, -32560]
6431c2560P0515q5455n559M67m0887M2904K3900m8356o588n1696m3024K2654N7907
6418i5778l8153J553M1263l863J58288j7626j46250m6836O1340P6199j06976o3009
6406a79848m8623J9546J17791O6855N8167j8058L1812O9510r0679l8906l5884
6395d8317k1029l7000K147J7118K8464L6719R9828M683n8645j24897p5060j3975
6383a89964N1303r589o8637M5655O5718q1808J0700K7414L9930o248M5788J19053
6371D9315j3018n1430O599r733n2921O2p6037k2271P0071K9918j1465m2965N5072
6358f8803M3781l9753l6901o8336l9820Q9103P2817J17596m1130k7215p9771r3379
6346a71811j03948L0643J24093P3487K2956j4072O3389m5454O7869k3625k4527
$$ y = [-32560, 37955, -47500, -53059, -52592, -93479, -50575, -26675, -75031, -81619, -133315, -176339, -153685, -95778, -133931, -132378, -91115, -94978, 63310, 45684, -100566, -147402, -86062, -9863, -116839, -179848, -228471, -208925, -91134, -24279, 33888, 15830, 47642, 117152, 26473, -12433, -48317, -69346, -106346, -104199, -87081, -58617, -21898, 77930, 82613, 23968, -100929, -175989, -189964, -138661, -148250, -216887, -171232, -105514, -187322, -176622, -149208, -109278, -115526, -69738, 49315, 36297, -15133, -8534, -18267, -71188, -71126, -147163, -169434, -99363, -69445, -80910, -123875, -68803, -25022, -64775, -101676, -170012, -209832, -120729, -47912, 69684, 28554, 1339, -78432, -171811, -275759, -245116, -121023, -47536, -24580, -38652, 24737, -20717, 47152, 23527, -1000]
6335a000k2047K5166K4244p919O2634j7664M9090r1783n9681n710R5193j0047
6323D0476j3039l1244L1259p1406n7996O109Q7494K9169l7826k9747l2562l0142
6311a09455K6700J36958M5641n2239o6426K8491N0703j39597L9708O5675m3103
6300a6944L4308k3375l3893J53511l5379o7086l4451K5698L0670l777j16579j51388
6288b38685k4273L5227J26420O6554M5574J8377J4130K0623O2225n9858j20377
6277e4063n6581L1140J8792K3334M5155J9331k426j846k545L037m2985j89041
6265b08698O0782J39020m0855q5598K6592J45264j0906l7521L1288l7111m9232
6254f6975J29688J866j37514L141O8475N9467Q8101K6087o1599K6728K805l6995
$$ y = [-1000, -23047, 2119, 26363, 18444, 81078, 63414, 112504, 20721, -38960, -44670, 50523, 40476, 27437, -3807, 27452, -43954, -101950, -95841, -8347, 20822, -17004, -46751, -79313, -109455, -82755, 54203, 99844, 47605, -18821, 9670, 60373, -79224, -39516, 26159, -16944, 17364, -6011, -39904, 113607, 78228, 11142, -23309, 2389, 33059, 29282, -87297, -238685, -262958, -227731, -101311, -34757, 10817, 29194, 43324, 63947, 126172, 66314, -54063, -110644, -79504, -60712, -37378, 7777, 27108, 24682, 22836, 20291, 23328, -19657, -208698, -147916, -8896, -49751, -135349, -108757, 36507, 25601, -11920, 19368, -17743, -66975, 62713, 64579, -72935, -69794, -1319, 58148, 146249, 172336, 110737, 137465, 140270, 103275]
6242A03275j26114l8580J24048M9372M3057p9209j30630j31118J21202J17266
6232E2569k26k7591j34252p8386Q3116n7986O1121J01033J2585n4371k6815J9206
6220d9997N0128l2039l1361J27416J7495n6229J45260k6315j26985J9139K1093
6209E7605O891K4941p9249o8965K5539J7927n8266j5931N5212L3444Q7178M7195
6197A33521K3239n4491n5258j04221m476j4168j7703j3314P6145R6187k8386J9458
6185E6533j0198p2512m7955p240J5027O8892K9330O4831o2757p0471j162o4971
6173a02653r0406n9889J8733J30622q7733Q7554O6047j2425K6170L0195R5447
6162A01662p7180j29211l1083M5101Q906O6850o9263J12m0497o7942j3987J11534
$$ y = [103275, -22839, -61419, 62629, 112001, 155058, 75849, -54781, -185899, -64697, 52569, 52343, 24752, -109500, -187886, -104770, -162756, -101635, -602, 11983, -42388, -69203, -49997, 131, -31908, -63269, 64147, 81642, 25413, 170673, 144358, 17373, 36512, 57605, 64496, 89437, 10188, -58777, -33238, -15311, -73577, -89508, -34296, -852, 86326, 133521, 156760, 102269, 47011, -57210, -61686, -75854, -93557, -106871, -30726, 65461, 37075, 56533, 46335, -26177, -74132, -81372, -66345, 2547, 31877, 96708, 33951, -36520, -37682, -102653, -193059, -252948, -234215, -103593, -191326, -103772, -37725, -50150, -23980, 6215, 101662, 24482, -104729, -135812, -90711, -81805, -14955, -84218, -84106, -124603, -192545, -206532, -94998]
6150i4998q0885o8496k9635M3886M3966P8674J23547n412J1800p1628K0529Q0486
6138E1834K3368L561j9174m1140r363N3453J6864r8080j24594Q8654J16202P5230
6126A36815J517n3926n8020p3135O12j3022l9210K6640M7j8394J11992P4620K2698
6113A19234j24195j44751N1805O7004M2379L4645m490k118L4108L6121N8545J4344
6101A82631p7482l0125j07896r7185n4249J4392J2724k983J29232J4813j9715
6090c5843l447J916J2845L9675N5114m5668j06936k3946L1703l8222o4973M5004
6078a32778K6157P6737L0759j9702n6475L8371J36699j2855j03633P3441m0278
6067A6443m1980Q4609M913m9566N871Q6709l3812J3812j6700j3062M5701j13098
$$ y = [-94998, -175883, -244379, -274014, -230128, -186162, -107488, 16059, 10647, 22447, -49181, -28652, 51834, 75202, 78763, 59589, 18449, 9086, 62539, 79403, -18677, -143271, -54617, 61585, 136815, 138332, 84406, 26386, -46749, -46137, -59159, -98369, -71729, -71682, -90076, 21916, 96536, 119234, -4961, -149712, -97907, -30903, 11476, 46121, 41631, 39513, 73621, 109742, 168287, 182631, 105149, 75024, -32872, -130057, -184306, -169914, -157190, -160173, -30941, -16128, -35843, -39290, -37374, -24529, 15146, 70260, 24592, -82344, -106290, -74587, -112809, -177782, -132778, -106621, -29884, 875, -18827, -75302, -36931, 99768, 86913, -16720, 56721, 16443, -25537, 59072, 63985, 14419, 20290, 106999, 73187, 86999, 70299, 57237, 102938, -10160]
6055a0160p9059j15631O0693J66329J56272o4233r5318k0106n414m1525j21102
6044a69254m1033J00363R1260q1507M662O7740j7080p704K864K2022n7515n9688
6032a44870P0669J08659r7160o7252P9529K6157j5017q123M6561Q5828M0128j20529
6020D580j01361r812J8345N0730J8005K537j5000M8144p8200j36240N9877J10436
6008b7959Q59p6054m7935J3320N6083j467j1326K2529N163K2769m051N5949J7358
5995B5238p262k0093K2666o581r3646K8533M7111o0980l8980m4814n3799Q2817
5983a19790M4386L5149M6651K5820p1031P5290N0335L3600m2535m9198m9706n8242
5971g9271n1501k3088P6081O971o9990n2938M8367R1259K1820O0601L6725m0119
$$ y = [-10160, -89219, -204850, -144157, 22172, 178444, 114211, 18893, -1213, -6627, -48152, -169254, -210287, -109924, -18664, -100171, -95509, -27769, -44849, -52553, -49689, -27667, -85182, -144870, -74201, 34458, -62702, -129954, -50425, -24268, -39285, -47408, -847, 84981, 125109, 4580, -96781, -106593, -88248, -37518, -19513, -16976, -31976, 16168, -62032, -198272, -138395, -27959, -27100, -103154, -151089, -137769, -81686, -83153, -94479, -71950, -66787, -44018, -48069, 7880, 25238, 17976, -2117, 20549, 13968, -79678, -51145, -4034, -65014, -103994, -148808, -202607, -119790, -75404, -40255, 6396, 32216, -38815, 36475, 86810, 120410, 77875, 28677, -21029, -79271, -130772, -153860, -77779, -70808, -140798, -193736, -145369, -54110, -32290, 28311, 65036, 24917]
5959B4917q8869j4764R1976j25398j68902q9860N4138M1629J06624J03457Q3639
5948A8587j3761j75314l9303P7680J71209Q2478P3513Q704m275K8628j11946j32135
5936a5935l7617K6009N3161M0119M2780j51409j9023K6917P4637N7195L6880N1059
5924A84773j07260n2447P3412k7080r9525N2370M5636n812j896n4437m4710n780
5912d2756J8689o4499M1289N3963N2289j5326N975m0060r0115n4189O8873J12251
5900D6384m8404k4285M4945m7609m1367O3861J9388K6157K2572n8506M3362l050
5888D3448J0799o5457n4882L5585r5282K295J13349R5360J1228j27867j6139j9280
5876f6843o1413M4607K9768n3752k6168J9872J6567m6163O4660O621l6131M5177
$$ y = [24917, -63952, -78716, 13260, -112138, -281040, -370900, -316762, -275133, -168509, -65052, 18587, 4826, -170488, -209791, -132111, 39098, 121576, 195089, 203793, 199518, 228146, 116200, -15935, -53552, -27543, 25618, 65737, 108517, -42892, -61915, -34998, 39639, 96834, 133714, 184773, 77513, 25066, 98478, 71398, -28127, 24243, 69879, 64067, 62171, 7734, -36976, -42756, -24067, -88566, -47277, 6686, 58975, 43649, 49624, 9564, -80551, -134740, -65867, 46384, -2020, -26305, 18640, -28969, -70336, -6475, 12913, 39070, 61642, 3136, 46498, 43448, 54247, -11210, -66092, -30507, -125789, -123494, -10145, 85215, 96443, -31424, -47563, -66843, -128256, -83649, -53881, -107633, -133801, -113929, -97362, -143525, -78865, -72244, -108375, -63198]
5864f3198J54946P9131q7182n5685p4151j3604n2383L5157J27311P2588j18697
5853D233p0378k750J04719J9179J1922o0366j8717K4787p3444q512n7021O4506
5841f1842J31052K6190m8425j1543K3612k876l0601l627m0891k3459n2820J15219
5829A9989L9146k5345q411J06898L3117J2238l3278p1291m6295r3512M0140J5852
5817a0752k9601L1794J0786j89048q821J60232k0159m9095m2108K9322L8495P1507
5805g448N3752k11407J6284K50470J0380j26955n2570p5476o4795o050l0252L9567
5793b04500J16166J84183l1713j09121l2333J9914O2799m1742l5566l6960J6855
5782i2018P6022L1287j38250n3533J57545R8957k6259k6911p6371l042O1226j20941
$$ y = [-63198, 91748, 170879, 83697, 28012, -46139, -59743, -112126, -76969, 50342, 122930, 4233, -66145, -68895, 35824, 55003, 66925, 6559, -12158, 12629, -60815, -69327, -126348, -61842, 69210, 95400, 46975, 35432, 59044, 56168, 25567, 21940, -18951, -42410, -95230, 19989, 59135, 33790, 25379, 132277, 165394, 177632, 144354, 73063, 26768, -66744, -26604, -10752, -40353, -8559, 2227, -186821, -195642, -35410, -55569, -104664, -146772, -117450, -78955, -7448, 46304, -165103, -148819, 101651, 112031, -14924, -67494, -142970, -207765, -213815, -244067, -204500, -88334, 95849, 64136, -44985, -77318, -57404, 5395, -36347, -71913, -108873, -92018, -15996, 15291, -122959, -176492, -18947, 80010, 53751, 26840, -49531, -52573, 8653, -112288]
5770a12288L4533o047k5000M5669Q4183R8441k8075k8932M2313m4650k7401R7542
5758A30288m1966q2230l4867k9396l5658O068J61614q5755p2966j8880m828O3012
5746d5564L3976J48465J5592k2510K3156p0588l6423l0219J6891J5987L3200p3162
5734H801m9614o5033L0662N0371R4091M9238O7159L4503j06231r9017K3633J6956
5722E5519L4100O3838n8903j3236o8176j02496k9701N1403K2225K636m5664m0907
5710a29362k7955J30790J57955k2539j41468q7430l7913L9676J38859N6762N3647
5699A31022L5215L4763r4333j18963j7682O140O8872l7152j00000M6246N6806
5688A0934J9778L8025O7106p8046r793N408j4689M987K6044J2215Q581o964L9210
$$ y = [-112288, -77755, -83802, -108802, -63133, 21050, 119491, 91416, 62484, 104797, 60147, 32746, 130288, 88322, 6092, -28775, -58171, -93829, -87761, 73853, -11902, -84868, -103748, -108576, -45564, -11588, 136877, 152469, 129959, 153115, 82527, 46104, 15885, 32776, 48763, 81963, 8801, -40813, -105846, -75184, -24813, 69278, 118516, 185675, 220178, 113947, 14930, 38563, 55519, 89619, 153457, 94554, 81318, 13142, -89354, -119055, -67652, -45427, -42791, -88455, -129362, -157317, -26527, 131428, 108889, -32579, -120009, -157922, -118246, 20613, 77375, 131022, 166237, 201000, 106667, -12296, -29978, -23838, 45034, 7882, -92118, -45872, 10934, 30712, 68737, 135843, 57797, 48004, 53412, 38723, 43710, 69754, 81969, 90550, 83586, 122796]
5675A22796m8833K7441j05620l6621J9271j6946O6175R8873j8361n1874o1229
5664d928m3503N3987J3794j3694l1268K1217M5091q225r2079K0018j8O1350j9337
5651B405Q8557Q6797m1384K8841N8339n2963o0155l7625n4610l0360L2108O0912
5639H0862k4628M8125k8328o0350M8628K4199l3344M0251p3710j28544L6297J1281
5627e9261P2620q7776m3477L1701n2092j9236J8996J3119N4706o6175r8052o882
5615b41809j5153M6233N7136M6802P8445K1648j9586k963n1667M544J04119P8681
5603A06430L6646k1554O6359J7823N346p1730p5363j05210j3378L6094p8389N3690
5591d3236K9726m6073M2104J01426O7796p2169k6054O592o5315k9522M0908O8822
$$ y = [122796, 73963, 101404, -4216, -40837, -21566, -38512, 27663, 126536, 108175, 56301, -4928, -48431, 5556, 19350, 5656, -25612, -4395, 40696, 32471, -59608, -39590, -39608, 21742, 2405, 90962, 177759, 136375, 165216, 223555, 170592, 110437, 72812, 18202, -12158, 19950, 80862, 56234, 104359, 76031, 15681, 64309, 88508, 55164, 95415, 21705, -106839, -70542, -59261, 13359, -74417, -117894, -86193, -138285, -157521, -138525, -125406, -70700, -136875, -234927, -241809, -256962, -210729, -153593, -106791, -28346, -6698, -26284, -29247, -80914, -76370, 27749, 106430, 143076, 121522, 187881, 205704, 211050, 139320, 63957, -41253, -54631, -18537, -96926, -43236, -13510, -59583, -17479, 83947, 151743, 79574, 53520, 60112, -5203, -34725, 6183, 75005]
5579G5005j8026O9752R7170q5984r1002k717j5093r2164N8784L1880l7231l937
5567a3563K7880K3479J7275j653M3573M8412m2158o2763m563k3029o2017O1419
5555A2292J9605O16j24224n9925R5653J37810J4886P487o9744k0278p2474J1962
5543d6334l8574l2568n743P4501j747L2540J40357m1173p0051j30436o9333r1694
5531b80255k792O400P5464P6214J40696O8448l85j06973r3077O5513Q5611N132
5519C9996j55545l0391K2025P8084l0647Q101J25415J8629n8997J830o6627K7505
5507b0622J04802q5082m5630n4876K8454P1701M3904o3358m2902k3445R3109J00246
5495A06301L9657L7427j01672p7739j18750Q1875N6618k068n02J3408j18720J4856
$$ y = [75005, 56979, 126731, 223901, 137917, 46915, 44198, 29105, -63059, -4275, 27605, -9626, -13563, 14317, 37796, 55071, 53418, 96991, 145403, 103245, 40482, 35919, 12890, -49127, 12292, 31897, 32513, -91711, -151636, -55983, 81827, 96713, 104200, 34456, 14178, -58296, -46334, -84908, -117476, -123219, -48718, -50465, -17925, 122432, 81259, 11208, -119228, -188561, -280255, -283047, -276647, -201183, -124969, 15727, 84175, 83790, -23183, -116260, -50747, 34864, 39996, -115549, -145940, -123915, -45831, -76478, -68377, 57038, 75667, 16670, 18500, -48127, -20622, 84180, -902, -46532, -101408, -72954, -1253, 42651, -20707, -63609, -87054, 6055, 106301, 145958, 183385, 81713, 3974, -114776, -32901, 23717, 21649, 21147, 34555, -84165, -69309]
5483f9309P2727J7143k5432m8136J6552L5186r6703n1205M272L9066m1949L026
5471a44762Q5573o0203p2091j6258P9767o52J02386J13039J1661L3003m2475p8034
5459A0954J7590P6958j35143o1143k8428O9320J15945K3206l7368p1043k3074
5448d2226j7498q3790l0602P8686K906J3487m9010L0205J5352o4024R1219O6385
5436A1090p5381L4971p528n2490M2188l0978k4989L4268O400O5299L2295P2277
5424A07422n8816P4581O2361m3712j23261R821J09603J05599r2808j16588r6798
5413f2596l861M3428m1465m7264m1018k4175m7065O2903K34304j0432m2458l7588
5401a7287m5243P1245K3482l6558k2742K2041j4902m9336p6517j589L763O0666
$$ y = [-69309, 3418, 20561, -4871, -53007, -36455, -1269, -97972, -149177, -144905, -105839, -147788, -144762, -59189, -119392, -191483, -207741, -127974, -128626, -26240, 86799, 98460, 131463, 88988, 10954, 28544, 105502, -29641, -90784, -119212, -49892, 66053, 89259, 51891, -19152, -42226, -59724, -143514, -174116, -95430, -92524, -79037, -128047, -97842, -82490, -146514, -55295, 11090, -64291, -29320, -36848, -89338, -47150, -78128, -103117, -68849, -62449, 2850, 35145, 107422, 48606, 123187, 185548, 141836, 18575, 28396, 137999, 243598, 150790, 34202, -62596, -66457, -23029, -64494, -111758, -152776, -176951, -224016, -161113, 73191, 62759, 20301, -17287, -62530, 8715, 32197, -4361, -27103, -5062, -19964, -69300, -145817, -147406, -143643, -82977]
5389h2977J21060P0239n1854o8809n541p0800O0853P9869N7890j1931r0410J0430
5377A8019o3911r3545P2728j7718p0684k7659m3934J727J47474L7997K979J37661
5365A01134L7621q2152q884M7869L9557M5195l7119k0969O554M8488k9180o9602
5353G8512L068J6283q9162j74403M0389J38019j0795p7864o7609r5260J13954
5342a24868J89212o8384j03356M7550K9782o6010n9072q3559N1521Q4180j2937
5331a15941j18842N3137K1243M5213K3717J15862P567p7841M6959j4446j1740
5320b5112p7129m0629R8088R6993l1126j29903J8404m5176M9887K1922l7400m0753
5308a41934l4985m461O566J00686M9311R4330Q893j580p7k9980m853j7038l7553
$$ y = [-82977, 38083, 108322, 56468, -12341, -17882, -88682, -27829, 52040, 109930, 97999, 7589, 18019, -45892, -139437, -66709, -84427, -155111, -182770, -226704, -224977, -77503, -39506, -36527, 101134, 138755, 56603, 47719, 95588, 135145, 180340, 143221, 122252, 128806, 177294, 148114, 78512, 81580, 97863, 8701, -165702, -125313, 12706, 1911, -75953, -143562, -238822, -124868, 64344, -4040, -107396, -59846, -30064, -96074, -155146, -238705, -187184, -103004, -115941, -234783, -181646, -160403, -115190, -91473, 24389, 31956, -45885, 1074, -13372, -25112, -102241, -142870, -44782, 52211, 21085, -108818, -90414, -135590, -85703, -63781, -101181, -141934, -176919, -181380, -174814, -74128, -24817, 69513, 78406, 76826, 76749, 46769, 41916, 24878, -12675]
5295a2675O726q972m6659P9887L4306R3869P955J7395l6041n0979j02471q6536
5283a04195l2386K1078P1728j6330P7789o6408q5674k1123P538J50001o8152j71881
5271b38015j75996N6146J93468L8016M0306j4794J5258l255L6155P0513o1461
5260d3659j6146K376n5879r7107J4396L7452J1079P2007L4596M1602k3194o4437
5248h6914K666J06255L4804q9863j2067P9160M3626P862O4100P501Q87j16307
5236D1710M2092k9994p068P5647n4072N997l2055p2099J8133N2819j0188j2520
5224A8402K3395p252o9026N9493R1942n7167j5587K0624l3292L7869P042L9733
5212A16176k0506q8748n2134p134P2189R2919l3004q997K4978n5838k4282O8066
$$ y = [-12675, -5949, -14921, -61580, 18307, 52613, 146482, 154437, 171832, 135791, 84812, -17659, -104195, -136581, -115503, -43775, -60105, 17684, -48724, -134398, -155521, -147983, 2018, -66134, -238015, -414011, -357865, -164397, -126381, -86075, -100869, -85611, -88866, -52711, 17802, -43659, -59805, -57429, -113308, -210415, -196019, -158567, -147488, -75481, -40885, 717, -22477, -86914, -84248, 22007, 56811, -33052, -45119, 34041, 77667, 85529, 149629, 157130, 158017, 41710, 83802, 53808, 46740, 122387, 68315, 74312, 42257, -29842, -11709, 41110, 30922, 18402, 41797, 34545, -34481, 25012, 116954, 59787, 44200, 64824, 31532, 69401, 76443, 116176, 95670, 6922, -45212, -52346, 19843, 112762, 79758, 70761, 95739, 39901, 15619, 83685]
5200H3685m3943l6785M5319P3212m6392p5798J0950l5918L5350R3048K2789q2921
5188D2596o8363n5954J0145N2399M3194k7455q5448j8457n466o3850N3728Q8990
5176c3941L5674N7432l4616K590R92l2648K4498k5176K9587R0964j15759L0816
5164C0413J47549M661p0144j07237Q1298J7243j01675M2102O7989k4082n3527
5153C4590Q721L686Q7145n2314M6766J168l4178q6546K0513j48595N850K4681
5141h8513K0561j3366Q2384O0110n5493l2729j6099o8318j2980O4905J9986J7249
5129b2303Q5310L0771M1393Q246j0636l8594L2479o6925k2728P5805o5208O3596
5117A11206L6098l2109j5862j1126j5125j1129l7765l2961L4875l7335l6659l6170
$$ y = [83685, 39742, 2957, 48276, 121488, 75096, -702, 10248, -25670, 9680, 102728, 125517, 42596, -25767, -81721, -71576, -19177, 24017, -3438, -88886, -107343, -112809, -176659, -122931, -33941, 1733, 59165, 24549, 27139, 28131, -4517, 19981, -5195, 24392, 115356, -403, 30413, 177962, 182623, 112479, 5242, 86540, 103783, 2108, 44210, 112199, 88117, 34590, 43311, 46997, 134142, 81828, 128594, 129762, 95584, 9038, 29551, -119044, -113194, -88513, -67952, -81318, 1066, 61176, 5683, -27046, -43145, -111463, -124443, -59538, -39552, -22303, 63007, 93778, 135171, 143417, 132781, 94187, 126666, 59741, 37013, 112818, 47610, 111206, 147304, 115195, 99333, 88207, 73082, 61953, 24188, -8773, 26102, -11233, -47892, -84062]
5105h4062k7633m7725p9555O2645Q9997M5744L2381k2967O8659k731L9037n5820
5093A7970l3766L2008J50283J30038P6258m4511p2189r1060j91446q2802L0591
5082g8626k5788q0061K9150Q4270O7449R7107O8241R1300j6981j16920K4977J446
5070A45564j00849R426K8071n6428o1669r1460J5806N9534K784p273m906N8638
5058b762p130m6356o2419J2324M5667m500m8418n2574M9249O5659L5033k2532
5046c8759j10160q9878J33645J7091p3367N5589M2845L4007N6950p3219M0315
5035d941o4004j06090J3894M4082Q0628p259j27350K8084J39027R6572K8218o1361
5023E9500L505p1608j55066L9478L802N552J31444j02437j057N6627j7814L7891
$$ y = [-84062, -111695, -159420, -238975, -176330, -86333, -40589, -8208, -31175, 37484, 34753, 73790, 17970, -15796, 16212, 166495, 296533, 372791, 328280, 256091, 165031, -26415, -109217, -78626, -104414, -184475, -155325, -71055, -3606, 93501, 161742, 253042, 236061, 119141, 144118, 145564, 44715, 54141, 82212, 25784, -35885, -127345, -111539, -52005, -49221, -56494, -61400, -2762, -9892, -56248, -118667, -106343, -60676, -65176, -113594, -166168, -116919, -51260, -16227, -38759, -148919, -238797, -105152, -88061, -161428, -105839, -62994, -28987, 27963, -45256, -4941, -68945, -175035, -161141, -117059, -36431, -43690, -171040, -142956, -3929, 92643, 120861, 59500, 63005, -8603, -163669, -124191, -120389, -114837, 16607, -85830, -86887, -30260, -48074, -10183]
5011a0183m4603o1271K1668q4387K2458O1441L6757j1454K7098l5432j5552R1489
4999a971K5341p0929m1314j6366N1605m4325j5056N352m7863q1967N1471J08662
$$ y = [-10183, -54786, -116057, -94389, -178776, -156318, -94877, -58120, -69574, -42476, -77908, -93460, -1971, 23370, -47559, -88873, -105239, -53634, -97959, -113015, -107663, -155526, -237493, -186022, -77360]
$$ [...]
##END NTUPLES=NMR SPECTRUM
##END=
