##TITLE=Analysis number 323188
Compound Code cc 58913
Book Reference 494/72
Project Code adrs
Chemist Name craigr
##JCAMPDX= 6.0         $$ Bruker NMR JCAMP-DX V2.0
##DATA TYPE= NMR SPECTRUM
##DATA CLASS= NTUPLES
##ORIGIN= Bruker BioSpin GmbH
##OWNER= nmr
$$ XWIN-NMR		Version 3.5
$$ Wed Oct 18 10:23:04 2006 GMT Daylight Time (UT+1h)  MAYBRIDGE\nmr@NMR_250MHZ
##.OBSERVE FREQUENCY= 250.131544655141
##.OBSERVE NUCLEUS= ^1H
##.ACQUISITION MODE= SIMULTANEOUS (DQD)
##.ACQUISITION SCHEME= undefined
##.AVERAGES= 16
##.DIGITISER RES= 18
##SPECTROMETER/DATA SYSTEM= dpx250
##.PULSE SEQUENCE= zg30
##.SOLVENT NAME= CDCl3
##.SHIFT REFERENCE= (INTERNAL, CDCl3, 0, 16.4628)
##AUDIT TRAIL= $$ (NUMBER, WHEN, WHO, WHERE, WHAT)
$$ ##TITLE= Audit trail, XWIN-NMR		Version 3.5
$$ ##JCAMPDX= 5.01
$$ ##ORIGIN= Bruker BioSpin GmbH
$$ ##OWNER= nmr
$$ C:\u/data/dgb/nmr/ADRS/880/pdata/1/auditp.txt
$$ ##AUDIT TRAIL=  $$ (NUMBER, WHEN, WHO, WHERE, WHAT)
(   1,<2006-10-18 10:22:38.20 +100>,<MAYBRIDGE\nmr>,<NMR_250MHZ>,
      <created by zg, POWCHK disabled, PULCHK disabled
       configuration hash MD5:
       49 4B E0 1D 92 C2 6B 37 9F E6 65 BC 52 41 86 1D
       data hash MD5: 64K
       23 84 F9 DF 0E 6C 5F 42 DF E1 78 AD F1 9D 3C C0>)
(   2,<2006-10-18 10:22:53.71 +100>,<MAYBRIDGE\nmr>,<NMR_250MHZ>,
      <Start of raw data processing
       ef LB = 0.3 FT_mod = 6 PKNL = 1 SI = 32K 
       data hash MD5: 32K
       87 D3 48 5A D2 CE DA 4A 75 C9 4A 4D 3F 44 AD 14>)
(   3,<2006-10-18 10:22:55.45 +100>,<MAYBRIDGE\nmr>,<NMR_250MHZ>,
      <apk 
       data hash MD5: 32K
       53 23 9E 0F BA 6A E4 B3 C6 F4 30 2A 8E B4 F7 9F>)
(   4,<2006-10-18 10:22:56.18 +100>,<MAYBRIDGE\nmr>,<NMR_250MHZ>,
      <abs ABSG = 5 
       data hash MD5: 32K
       86 78 A1 7E A0 A8 20 2C 40 CB EB 50 0E 3F 70 AD>)
$$ ##END=
$$ 
$$ hash MD5
$$ 64 31 C2 7D 13 6E 3D 3F 3E BC 3D A0 E5 BA 66 9F
##$RELAX= 
##$RELAX= 
##$RELAX= 
##$RELAX= 
##$RELAX= 
##$RELAX= 
##$RELAX= 
$$ Bruker specific parameters
$$ --------------------------
##$DU= <C:\u>
##$EXPNO= 880
##$NAME= <ADRS>
##$PROCNO= 1
##$TYPE= <nmr>
##$USER= <dgb>
##$AMP= (0..31)
100 100 100 100 100 100 100 100 100 100 100 100 100 100 100 100 100 100 
100 100 100 100 100 100 100 100 100 100 100 100 100 100 
##$AQSEQ= 0
##$AQ_mod= 3
##$AUNM= <au_zg>
##$AUTOPOS= <7 >
##$BF1= 250.13
##$BF2= 250.13
##$BF3= 250.13
##$BF4= 250.13
##$BF5= 500.13
##$BF6= 500.13
##$BF7= 500.13
##$BF8= 500.13
##$BYTORDA= 1
##$CFDGTYP= 0
##$CFRGTYP= 5
##$CHEMSTR= <none>
##$CNST= (0..31)
1 1 145 1 1 1 1 1 1 1 1 1 1 1 1 1 1 1 1 1 1 1 1 1 1 1 1 1 1 1 1 1 
##$CPDPRG= <>
##$CPDPRG1= <>
##$CPDPRG2= <>
##$CPDPRG3= <>
##$CPDPRG4= <mlev>
##$CPDPRG5= <mlev>
##$CPDPRG6= <mlev>
##$CPDPRG7= <mlev>
##$CPDPRG8= <mlev>
##$CPDPRGB= <>
##$CPDPRGT= <>
##$D= (0..31)
0 1 0 0 0 0 0 0 0 0.06 0 0 0 0 0 0 0.0002 0 0 0 0 0 0 0 0 0 0 0 0 0 0 
0 
##$DATE= 1161163355
##$DBL= (0..7)
120 120 120 120 120 120 120 120 
##$DBP= (0..7)
150 150 150 150 150 150 150 150 
##$DBP07= 0
##$DBPNAM0= <>
##$DBPNAM1= <>
$$ [...]
##$SUBNAM7= <"">
##$SUBNAM8= <"">
##$SUBNAM9= <"">
##$SW= 20.6930455092707
##$SWIBOX= (0..15)
0 0 3 0 0 0 0 0 0 0 0 0 0 0 0 0 
##$SW_h= 5175.983436853
##$TD= 65536
##$TD0= 1
##$TE= 683.16
##$TE2= 300
##$TE3= 300
##$TEG= 300
##$TL= (0..7)
0 120 120 120 120 120 120 120 
##$TP= (0..7)
150 150 150 150 150 150 150 150 
##$TP07= 0
##$TPNAME0= <>
##$TPNAME1= <>
##$TPNAME2= <>
##$TPNAME3= <>
##$TPNAME4= <>
##$TPNAME5= <>
##$TPNAME6= <>
##$TPNAME7= <>
##$TPOAL= (0..7)
0.5 0.5 0.5 0.5 0.5 0.5 0.5 0.5 
##$TPOFFS= (0..7)
0 0 0 0 0 0 0 0 
##$TUNHIN= 0
##$TUNHOUT= 0
##$TUNXOUT= 0
##$USERA1= <user>
##$USERA2= <user>
##$USERA3= <user>
##$USERA4= <user>
##$USERA5= <user>
##$V9= 5
##$VALIST= <valist>
##$VCLIST= <CCCCCCCCCCCCCCC>
##$VD= 0
##$VDLIST= <DDDDDDDDDDDDDDD>
##$VPLIST= <PPPPPPPPPPPPPPP>
##$VTLIST= <TTTTTTTTTTTTTTT>
##$WBST= 1024
##$WBSW= 4
##$XGAIN= (0..3)
0 0 0 0 
##$XL= 0
##$YL= 0
##$YMAX_a= 289670
##$YMIN_a= -416644
##$ZGOPTNS= <>
##$ZL1= 120
##$ZL2= 120
##$ZL3= 120
##$ZL4= 120
##$ABSF1= 16.46276
##$ABSF2= -4.230412
##$ABSG= 5
##$ABSL= 3
##$ALPHA= 0
##$AQORDER= 0
##$ASSFAC= 0
##$ASSFACI= 0
##$ASSFACX= 0
##$ASSWID= 0
##$AUNMP= <proc_1d>
##$AZFE= 0.1
##$AZFW= 0.1
##$BCFW= 0
##$BC_mod= 0
##$BYTORDP= 0
##$COROFFS= 0
##$CY= 12.5
##$DATMOD= 1
##$DC= 0
##$DFILT= <>
##$DTYPP= 0
##$F1P= 14.0000005364418
##$F2P= -0.99999901652339
##$FCOR= 0.5
##$FTSIZE= 32768
##$FT_mod= 6
##$GAMMA= 0
##$GB= 0
##$INTBC= 1
##$INTSCL= 1
##$ISEN= 128
##$LB= 0.3
##$LEV0= 0
##$LPBIN= 0
##$MAXI= 10000
##$MC2= 0
##$MEAN= 0
##$ME_mod= 0
##$MI= 0
##$NCOEF= 0
##$NC_proc= -4
##$NLEV= 6
##$NOISF1= 0
##$NOISF2= 0
##$NSP= 0
##$NTH_PI= 0
##$NZP= 0
##$OFFSET= 16.46276
##$PC= 1
##$PHC0= -52.18784
##$PHC1= 5.992218
##$PH_mod= 1
##$PKNL= yes
##$PPARMOD= 0
##$PSCAL= 4
##$PSIGN= 0
##$REVERSE= no
##$SF= 250.130014816978
##$SI= 32768
##$SIGF1= 0
##$SIGF2= 0
##$SINO= 400
##$SIOLD= 32768
##$SREGLST= <1H.CDCl3>
##$SSB= 0
##$STSI= 32768
##$STSR= 0
##$SW_p= 5175.98343685301
##$SYMM= 0
##$S_DEV= 0
##$TDeff= 65536
##$TDoff= 0
##$TI= <Analysis number 999999
Compound Code 99
Book Reference 9
Project Code 9>
##$TILT= no
##$TM1= 0
##$TM2= 0
##$TOPLEV= 0
##$USERP1= <user>
##$USERP2= <user>
##$USERP3= <user>
##$USERP4= <user>
##$USERP5= <user>
##$WDW= 1
##$XDIM= 32768
##$YMAX_p= 343889593
##$YMIN_p= -97285
$$ End of Bruker specific parameters
$$ ---------------------------------
##NTUPLES= NMR SPECTRUM
##VAR_NAME=  FREQUENCY,     SPECTRUM/REAL,   SPECTRUM/IMAG
##SYMBOL=    X,             R,               I
##VAR_TYPE=  INDEPENDENT,   DEPENDENT,       DEPENDENT
##VAR_FORM=  AFFN,          ASDF,            ASDF
##VAR_DIM=   32768,         32768,           32768
##UNITS=     HZ,            ARBITRARY UNITS, ARBITRARY UNITS
##FACTOR=    0.157963299565203, 1,           1
##FIRST=     4117.8306341719, 0,             0
##LAST=      -1058.15280268111, 0,           0
##MIN=       -1058.15280268111, -97285,      0
##MAX=       4117.8306341719, 343889593,     0
$$ Real data points
##PAGE= N=1
##DATA TABLE= (X++(R..R)), XYDATA
$$ [...]
20477 -35268 -18579 -14346 -2732 8409 -14579 -15561 -19340 -7554 9771 6693 5175 -12712 15652
20464 15652 34305 56838 52068 38182 22023 -4331 -6242 1744 9525 15092 9200 -6497 6939
20451 6939 39032 21202 7456 33514 48508 59862 49619 41881 29945 27327 21935 33517
20439 33517 50663 47636 63789 64653 26689 -3979 -8736 20239 36650 25611 -2953 -25486
20427 -25486 -24046 -18410 -17798 -6803 5517 -1308 -16823 6510 22584 -4277 -40453 -40464 -28047
20414 -28047 13911 39380 13754 11047 2363 7304 -10848 4022 -2696 -30420 -35547 4697 8327
20401 8327 -1901 3352 -3802 -3776 13840 12391 10840 -9703 -13680 17280 21953 8817 33065 17803
20387 17803 3180 11408 21326 8284 24569 10287 -1843 2694 8112 -6498 -8616 -24543 -29859
20374 -29859 -16422 -42143 -22261 -29185 -14066 6789 26625 19273 21308 23408 5577 -16927
20362 -16927 8125 28594 13625 14746 -9188 -11663 -12139 -19085 -19838 -29673 -28722 -28655 -30235 -34444 -29461
20347 -29461 1081 15237 -12291 -29846 -3759 4484 -1896 2124 30599 27362 6068 20562
20335 20562 36178 14725 -795 82 -15070 -37841 -36369 -4209 30095 46009 23975 27307
20323 27307 23681 8703 -17197 -26526 -15014 -25482 -18672 -12280 -17357 -45031 -69972 -65948 -32227
20310 -32227 -42159 -31454 -25161 -20606 -7300 2100 -12823 -17158 -27920 -53685 -35976 -29413 -29885
20297 -29885 -16823 -845 112 -14976 -3868 -8650 -17363 -14505 -4461 13632 17866 27033 44499
20284 44499 60222 55054 21295 12029 -876 -26384 -35480 56 -1135 -20899 -358 2365 -18051
20271 -18051 -16006 14797 -18215 -29586 -21531 -20036 14225 7670 -9208 -9226 -2564 18221 17735 8286
20257 8286 7300 -7388 -14638 -19956 -20119 12802 45098 50579 26216 1584 -12289 -3494 -28184
20244 -28184 -24635 -26465 -45702 -26661 -23715 -27448 8572 34141 34853 14971 -6484 -15582 4216
20231 4216 20739 9452 16253 3568 -10935 -16237 -22790 -48739 -75553 -77972 -54850 -47335 -30520
20218 -30520 -7904 39818 40383 7639 4524 -2681 3939 16548 34925 31677 13860 4143 26974
20205 26974 16527 -9993 5069 37732 22094 28520 30621 24921 7549 -15374 -11579 -18004 -18572
20192 -18572 -17184 -28469 -29582 14488 31598 14500 2289 -2537 19728 37560 30601 10174
20180 10174 -7899 -17059 -29338 -17017 -2809 2682 9893 1105 -6262 1566 29771 25829 -5759
20167 -5759 -4196 22532 38474 40942 -1434 -10220 -19126 -13570 -22823 -16510 -37105 -15335 12056
20154 12056 38091 5622 -33699 -27625 -18852 -254 8006 -5534 10341 41652 40706 26216 39467
20141 39467 19024 -28586 -34015 -23914 6413 25599 -2335 -10857 -17395 5320 10362 -12819
20129 -12819 -30407 -20573 -5929 -2182 -24334 5052 11661 7146 -127 12992 10696 7763 18843
20116 18843 43495 51272 38986 36060 25425 9841 -9167 -14432 -9496 5376 -18716 -45942
20104 -45942 -55835 -39432 -20266 214 705 9347 -17003 -36850 -23435 -18757 -21744 -17134 -847
20091 -847 1056 -15121 -16851 -4178 -9336 -2846 33822 24346 -20456 -21129 -16163 -3069 -7984 25199
20077 25199 25553 28266 21694 -12249 -27925 -20353 -32516 -54290 -55901 -43608 -35188 -32550 -22443
20064 -22443 -15532 -26553 -39607 -23123 -2322 20340 9542 5080 20038 16895 -34473 -73637
20052 -73637 -78555 -64443 -21204 1917 -8369 -45453 -43548 -13513 416 621 -4211 -11541 -20613
20039 -20613 -30678 -25171 -25755 -13553 -1383 -19792 -29704 -6630 3171 14634 19597 18183 13815
20026 13815 8804 15220 17090 165 -34267 -35155 -28405 -21669 -9591 -29186 -42487 -9963 -33064
20013 -33064 -44868 -56420 -44733 -28971 -31268 -29096 -2491 1599 -1942 14322 9016 5808 -9733
20000 -9733 -15245 -2871 -23618 -33203 -6899 10993 -2093 -28404 -21928 -31593 -16189 -11063 1235
19987 1235 5902 8279 -13630 -10262 -9222 -5556 -943 -7520 -13367 4135 11520 20705 34473 16368
19973 16368 505 -2793 -15828 -23940 -8844 -6701 4584 13532 26071 36140 47918 45155 36470
19960 36470 10083 3695 18476 34958 35718 10341 8921 30267 38131 28254 31740 58106 70231
19947 70231 62528 33418 20461 7272 -23999 -30228 -581 9904 19258 -2064 -19203 -16617
19935 -16617 -9779 -26421 -60685 -43470 -30775 -16338 -8148 15456 4514 9833 5145 3340 20301
19922 20301 22031 11557 5472 -19308 -21099 -360 -7743 -1 19076 27553 8756 -16486 -23119
19909 -23119 -27009 -14596 -1577 7820 -7854 -27823 -38833 -10415 1699 -12000 -6304 20166
19897 20166 17514 6004 10293 2521 -5306 704 5661 6249 -5980 -4273 -16396 -24946 -19781 -5152
19883 -5152 -14848 -27638 -23127 -16441 -634 8946 -6839 -5206 10106 2287 -14321 -33196 -7002
19870 -7002 18609 25928 30700 20746 5654 -27206 -28186 -29386 -18008 -5937 -4265 14833 12168
19857 12168 -1811 274 -7961 -19519 -19659 -1415 8167 19945 4691 -28823 -6609 24845 11920
19844 11920 4618 10225 27391 57791 53655 33659 35449 1671 -7963 -16516 -37951 -45402 -30577
19831 -30577 13182 17474 9899 -5043 -4794 2330 -584 12884 25222 14890 46495 50306 36746
19818 36746 12724 34007 21364 14406 1305 -12301 -10363 -13891 -20328 -8264 -12215 -26464 -12949
19805 -12949 -3652 14927 28324 33023 67974 85836 44933 14233 21441 3654 19395 21013
19793 21013 -3817 -7787 19333 19871 8866 -1408 -10471 -15480 -34665 -47716 -49828 -33157 -11430
19780 -11430 17239 8870 -854 7585 10917 1570 15354 12500 29233 31611 39826 43874 19738
19767 19738 -5295 -1960 20383 7506 -8903 21775 27241 16364 35369 7723 702 -6518
19755 -6518 9939 6149 5399 14039 17174 38487 35339 18345 13545 -1224 -10403 -2438 14589 23321
19741 23321 19766 4465 2124 2463 25232 59841 83689 103184 89823 96885 84468 107961 173070
19728 173070 221248 250087 256372 298801 353410 412544 464137 493807 502540 504810 497851 473033
19716 473033 440681 414071 388125 329145 270658 232544 217007 185287 138843 121814 80906
19705 80906 76233 74880 62046 39481 39150 59342 72285 41571 17238 -452 -15254 16321
19693 16321 29642 54206 49249 21236 -6035 21114 43730 63005 76664 56057 34834 24495
19681 24495 19683 19752 13194 13918 10262 21273 6778 -448 6671 35222 39787 21069 -11818 -18993
19667 -18993 -9034 -9013 8155 32452 44466 49156 33863 -4805 5299 41805 35756 3587 2711
19654 2711 6734 -11609 -25651 -7431 2637 19649 13684 12682 -9176 -17633 19335 34167 62000
19641 62000 50235 30091 27142 18514 -11946 -2072 -9363 -11279 -23260 -47234 -29239 6650 -8655
19628 -8655 -15847 -14777 -1408 12271 22735 9823 15358 23243 25320 16990 21770 42028 41819 33664
19614 33664 37675 49836 69058 52043 36329 17076 20529 31689 16425 -2280 -160 20754
19602 20754 16502 24995 32403 40378 45447 37519 61940 87650 99273 98068 82998 66203 57804
19589 57804 30467 30439 24372 -4623 -8579 -5826 1044 -9855 11941 37421 41180 31600 12771
19576 12771 -12060 -16012 -19341 -965 21219 39060 47286 63331 55758 69022 66737 24195 -4870
19563 -4870 27354 32343 35211 39795 49906 52436 72473 66803 53170 33339 12199 27874 59796
19550 59796 74360 82883 78866 67131 63451 60052 44405 33855 35625 54783 66041 52291 55647
19537 55647 72025 59527 33743 38475 32258 49289 41526 5273 1062 -4104 -2981 7126 -465
19524 -465 -2595 12468 11840 -973 9615 40181 50281 58404 48860 23593 9003 826 22575
19511 22575 50505 55212 59431 45242 50420 44500 49005 35332 12211 7333 4807 4340 11367 12342
19497 12342 2172 13392 18518 20112 2995 17112 27661 13548 -2345 -22034 -12129 -10116
19485 -10116 -30582 -20253 -34857 -38491 -39940 -35433 -5668 28475 30000 12887 7576 -15198 -8595
19472 -8595 11374 12504 19558 23023 5058 5146 44217 60889 28425 3309 894 14701 28273
19459 28273 43132 52974 33021 20527 18195 -4649 -27805 -7418 3848 8001 -11122 -39737
19447 -39737 -50325 -30295 -647 25105 18778 4329 6791 7147 39399 47465 20701 -19644 -26366
19434 -26366 -4852 25372 17682 -16060 3978 14071 -3883 -21508 -42892 359 28354 40182
19422 40182 35914 24446 782 29827 48712 62083 49574 44463 57507 59003 63600 67142 54351
19409 54351 33909 86957 122889 118532 96656 101522 88176 102437 123029 142327 156582 154489
19397 154489 141295 132158 127507 149874 108091 80019 63181 60163 20779 -20039 -26003 -3442
19385 -3442 10041 -4081 4104 976 10382 22585 11936 34473 45946 45078 38601 39879 28398
19372 28398 10270 15595 9592 4469 28633 65332 87423 72694 78253 75022 51353 62619 97079
19359 97079 125530 108140 72727 32028 35059 61277 86791 95904 111474 99782 75796 88289
19347 88289 59638 48977 50592 57866 68960 86017 99114 99936 93987 100520 100574 87254 83812 89429
19333 89429 120096 190299 220093 213386 241170 306837 379124 450991 509431 540657 585861 599566
19321 599566 602371 612753 609652 587197 532152 469337 404936 339175 287898 238123 176317 138643
19309 138643 126667 128150 130795 149046 136791 135812 126635 138342 132858 137278 139514 143040 138377
19296 138377 135972 139272 120633 95441 116792 119765 89901 113810 139130 172114 177202 161000
19284 161000 143334 174166 201852 189066 169905 170605 200557 225956 233999 213644 214726 228199
19272 228199 218697 192505 200574 198553 154332 127820 141614 146853 156942 175019 177303 159417
19260 159417 166532 147109 116279 112234 123322 143956 159097 162171 147467 143360 158615 182215
19248 182215 191202 171980 192551 223149 246849 251260 243889 219538 197327 204159 212806 196919
19236 196919 197195 207612 238864 233170 230015 207233 210138 235886 249183 221776 242400 253202
19224 253202 266004 259198 245273 244521 253419 243013 253182 268361 284250 296347 301114 331302
19212 331302 350386 363195 370855 382197 398973 387323 395990 441930 460288 451746 468069 471807
19200 471807 472810 510727 554869 579106 620285 673661 721085 776305 838577 918656 969969 1028146
19188 1028146 1096945 1177364 1268424 1392623 1506812 1645284 1811820 1990904 2186755 2403160
19178 2403160 2614467 2797453 2955959 3094002 3174735 3271898 3392804 3540118 3696436 3889929
19168 3889929 4154779 4479709 4896765 5474964 6257117 7305140 8738703 10711533 13345698
19159 13345698 16786323 21129830 26586233 33247298 41079101 49722894 58722176 67757856
19151 67757856 76539714 84269378 89943188 93211468 94324415 93251494 89510311 83212123
19143 83212123 75420977 66935117 57948460 48750796 40039922 32500641 26244694 21100249
19135 21100249 16973084 13793308 11418205 9702501 8440163 7492145 6708774 6120357
19127 6120357 5671993 5303788 5001249 4773986 4585949 4439274 4324955 4214859 4111674
19118 4111674 3989826 3844665 3675833 3475140 3290323 3068996 2855454 2662057 2452619
19109 2452619 2236225 2039971 1883152 1742158 1634788 1560895 1487548 1393960 1302594 1241478
19099 1241478 1183467 1156478 1128109 1103735 1088201 1072646 1043396 1006708 932735 878190 845806
19088 845806 805451 781713 778141 755786 746933 722145 702834 688555 677110 626880 599543 586497
19076 586497 589705 578251 567523 556816 506295 483677 507006 515184 518692 509849 460954 425975
19064 425975 393528 379804 363079 392391 396224 372058 336619 300232 284534 288221 279316 261211
19052 261211 243340 228186 236675 231130 216245 221045 232493 247605 259712 296212 316650 287262
19040 287262 249249 245848 257244 270883 278700 251458 232017 213627 194104 187289 200487 199838
19028 199838 194646 168598 163015 175764 171549 187818 193719 172137 192472 204548 201645 224348
19016 224348 249799 245084 238098 259318 274496 269388 256704 250722 250791 254964 254853 258600 242764 230874
19002 230874 236411 241051 230891 214433 195037 209457 172518 138156 133438 149299 140188 155017
18990 155017 172958 143760 114886 111101 149730 162630 140805 122082 121872 115464 110810 115201 109951
18977 109951 107501 118756 99784 81500 76133 70260 98531 115618 162131 200792 176673 138874
18965 138874 130824 150264 141731 128060 120692 107532 97960 104896 113582 112401 130969 139426 114827
18952 114827 108915 108883 118430 140417 175709 181197 189601 188928 145509 132024 130532 124208 130346 141446
18938 141446 134279 129550 119720 112902 101093 99138 111998 132919 170106 194281 216684 206010
18926 206010 158498 180293 217761 212143 179246 179892 175600 128875 82646 83652 89367 111313 128401
18913 128401 154430 153357 150757 181809 158962 136693 171229 153467 151016 178939 154982 131896
18901 131896 126261 128617 115352 111401 114125 122182 155548 189311 174110 171816 183305 204339 215493
18888 215493 214948 237424 224635 180892 169779 174200 187770 218058 259498 280613 292867 289842
18876 289842 281703 287860 269035 246093 237369 228562 197371 175641 192145 173770 164030 168499 154360
18863 154360 141647 148791 148747 135938 114773 105424 128716 134073 155776 171633 209286 211881 199835
18850 199835 196771 185742 183967 208000 210094 202321 204925 200075 207009 212347 206306 210739 221488
18837 221488 223844 242182 258746 241090 237680 268561 252449 251576 278547 287250 262897 237510
18825 237510 254640 264589 273492 283440 270607 311570 323491 336563 345402 335847 350318 367441
18813 367441 373066 345292 342287 357780 365328 389108 424679 474157 514901 526161 529330 558848
18801 558848 602874 634515 659256 665857 687417 753234 806770 864555 923008 984927 1080305 1170597
18789 1170597 1276273 1401672 1563139 1741523 1903156 2067040 2281235 2474423 2622288
18780 2622288 2753362 2853898 2890142 2917471 2945375 2970445 3030243 3139732 3298124 3477769
18770 3477769 3698416 4007766 4392609 4875316 5518089 6282432 7285468 8681288 10692192
18761 10692192 13473887 17205402 22126029 28429924 36270694 45539437 55809482 66493863
18753 66493863 77130191 86998602 94847395 99589800 101210306 99883752 95140614 87159479
18745 87159479 77395930 66922147 56049906 45447534 36141724 28529371 22456935 17686932
18737 17686932 14129392 11575858 9744754 8404206 7378863 6564641 5906606 5393924
18729 5393924 5002520 4665933 4376678 4146869 3976945 3839339 3739146 3670036 3600968 3556542
18719 3556542 3519462 3484783 3442457 3314174 3190199 3018872 2835600 2635215 2438299 2239937
18709 2239937 2069833 1903591 1764631 1626620 1505500 1428318 1353896 1282746 1221392 1193690
18699 1193690 1138112 1064951 1020894 1007910 984474 962066 917166 863336 851166 838446 810034
18688 810034 770634 742391 731500 712238 668525 642662 634685 638130 602091 581594 546938 515690
18676 515690 500012 502049 501436 486739 480819 480051 486726 494932 473623 440529 421629 390362 363205
18663 363205 342440 347550 351687 349485 335040 322180 295302 284420 269189 264556 274826 265641
18651 265641 244554 215187 197558 205926 230716 243186 245739 252328 233656 218738 223862 234477
18639 234477 250768 252185 253238 240407 215968 232859 231741 238488 249196 244660 228564 219344 221900
18626 221900 203171 181921 176816 202578 227893 232617 220365 173842 130453 148143 161567 138260
18614 138260 144201 156333 131040 98732 115469 148832 184247 178097 159785 126790 108128 99681
18602 99681 86890 98600 123095 123904 108124 110606 104079 86642 81734 94147 113995 132831 127503
18589 127503 120216 130106 130162 130661 148878 149131 189044 203378 200023 216311 245969 262288 301421
18576 301421 327427 348629 404583 482866 511439 518645 534240 530270 515898 483962 456004 441072
18564 441072 395259 343190 292147 263134 254305 228546 206632 181170 164288 140362 131283 117818
18552 117818 101476 107284 101896 105997 116425 129006 120188 119331 116573 114588 112407 110326 93667
18539 93667 101300 93006 67112 48266 66466 90083 76167 65163 67236 89309 114368 114521 101895
18526 101895 99552 100459 103423 105110 115382 127056 109188 78955 81444 107866 93970 85038 80334
18513 80334 75034 71430 96066 98081 88000 71055 48514 30282 47729 46334 46348 42647 41018
18500 41018 35666 36980 68080 70581 55130 70404 88946 84374 70935 51291 25367 1590
18488 1590 11329 37189 44591 42893 54009 51507 37376 60594 54955 53660 45383 35715 18959
18475 18959 18315 50339 65805 82205 67912 54933 50567 70787 95372 72838 33384 18520
18463 18520 40061 41776 32742 83177 133323 150738 151079 116255 96636 103571 82133 80784 82247
18450 82247 59107 56215 79988 120831 131249 108181 85126 78970 53505 41576 58810 77149
18438 77149 65722 27827 4109 22147 44020 58436 53686 42495 41546 19278 18192 35124
18426 35124 42793 70286 67748 69628 87488 98126 90434 111719 106599 116275 121214 106498 67298
18413 67298 57565 61781 65991 57343 70127 54126 26998 35269 56819 71002 67056 76667 109621
18400 109621 124143 122734 82236 23496 40086 57416 59077 70110 76570 78511 82530 79549 70919
18387 70919 82141 96406 110990 84268 82832 84886 106395 89444 82441 78102 70504 61370 72463
18374 72463 55135 66962 77484 59003 45301 39878 51743 88675 103310 98654 61840 34234
18362 34234 18529 49153 61976 73351 69864 52469 40653 16142 3593 -2243 22245 47755
18350 47755 34732 24330 24159 37515 15843 8784 21270 43532 50601 45830 56924 48744 17791
18337 17791 15413 23887 42822 55288 52126 32128 18148 15825 -1619 10853 13314 10365 16146
18324 16146 22178 38240 68287 70114 27225 -11582 -16552 11954 50324 47515 46421 54655 52991
18311 52991 33630 37629 31525 17057 24796 54115 60200 48572 21468 -14003 -10782 9602 9780
18298 9780 20648 13770 30681 55573 62155 35489 35717 54188 70958 62288 44569 35516 58111
18285 58111 71415 74549 67153 57794 49353 20220 20610 38389 50122 42464 27516 37930 58572
18272 58572 58443 38587 33494 38451 65944 68477 65203 60130 39972 22187 8549 30566 33728
18259 33728 24472 17761 46210 52409 38429 46078 56645 50046 35582 54809 70468 63104 21287
18246 21287 15704 22558 33652 55590 51831 11606 39068 70121 74269 58816 47426 40907 40802
18233 40802 52891 42234 29579 52778 63485 82811 68325 44211 18228 13324 4800 26968
18221 26968 30831 30601 52287 58170 48992 28540 33848 48068 44591 60830 46568 51874 42413
18208 42413 60817 75426 84573 73928 48777 57221 65980 75474 72520 72570 82353 49250 23431
18195 23431 26200 34104 54244 85219 90787 90235 89799 67495 50141 24932 20589 76342 105477
18182 105477 149328 193418 227717 253130 303022 362704 425518 463155 472554 504035 533869 535192
18170 535192 538773 551778 539315 486357 428253 396219 361696 288923 240893 185678 161597 171416
18158 171416 163651 168348 183082 188347 180445 175987 165268 133533 126268 125573 129590 144556 171572
18145 171572 175755 180821 191319 198160 197097 214749 252829 268223 273326 283484 315368 323182 363744
18132 363744 366197 385500 405780 440030 493758 539276 606560 699889 807411 936931 1098831
18121 1098831 1328556 1612144 1951961 2481437 3293962 4596223 6723767 10167168 15074462
18112 15074462 19982729 22845087 24330181 26276708 28296069 25485340 17103331 10625884
18104 10625884 7064216 5051958 3816255 3004279 2431703 2014511 1735644 1507466 1309538
18095 1309538 1157585 1045802 943347 858420 820318 787048 759192 696243 616395 555645 506411
18084 506411 479466 473903 457891 437603 410035 404937 397063 373182 347458 327564 300967 267316
18072 267316 260554 256698 262308 242063 231842 237260 224921 213053 189462 197273 192352 179763 152020
18059 152020 137143 149364 172013 159383 161132 169568 166408 156659 130704 109955 103510 114435
18047 114435 111266 88467 97941 78245 69072 81434 74012 57308 64279 76610 100122 104101 94164
18034 94164 83433 75322 50030 44835 56824 53555 42089 28028 37231 52442 59301 38935 30575
18021 30575 30664 52522 47184 37938 34420 55625 24412 32462 53140 59754 52323 35506 22096
18008 22096 52760 70312 63901 60570 46612 31672 12901 12139 12036 18450 20968 24825 9676
17995 9676 23603 34696 31982 36535 66495 87235 81348 51921 30176 30223 31190 57740 66663 71479
17981 71479 49536 7459 -33722 -2611 35541 54418 59475 47587 49847 86113 81446 64288
17969 64288 38304 12741 -11519 8463 15898 9739 19411 11205 -16050 -30362 -26839 -3023 -2902
17956 -2902 -17953 -20997 7365 25750 21552 9960 14083 -2444 -5545 -8567 -19449 -11550 3993
17943 3993 23606 37448 37537 33945 -5449 -14081 -13288 -8728 5823 22248 22491 44436 31734 15490
17929 15490 -7517 3611 -8798 12145 23416 43413 37139 59291 66269 78743 63680 53697
17917 53697 50624 45727 32337 37832 62874 45186 -5712 2494 23664 10314 59 14705
17905 14705 33564 39362 34016 41232 51691 52763 32486 49308 61886 51522 25500 5397
17893 5397 -12805 -24567 -17044 6614 27738 -11405 -14884 1823 17112 28217 28246 38392 31962
17880 31962 39787 50908 48722 48721 55283 41422 33884 19038 32643 20843 24685 30876 9822 8572
17866 8572 17739 26715 32425 13901 -7941 -7752 10408 202 -10807 -23714 -36233 -17009 15780
17853 15780 14041 20775 7836 -19180 -34849 -54524 -34618 -11092 2226 17790 33629 46562
17841 46562 42805 38962 42269 66187 69280 27440 5343 11200 4080 6298 -2070 12226 38985
17828 38985 40480 18118 -23515 -45652 -44069 -49918 -57411 -55053 -53655 -43705 -11705 13966 7567
17815 7567 -29768 -27239 -14077 14438 18652 -10675 -8078 -14793 -11750 -9917 -6452 -24814 -26689
17802 -26689 -7550 -7156 1948 2795 27516 48567 17060 -1414 -3776 -854 -21663 -27273 -17197
17789 -17197 -6233 4155 1426 5884 -4582 -17258 -12411 2117 13653 14840 15743 -5235 -6250
17776 -6250 21728 4301 -29773 -23376 -14820 -12842 -9713 -2522 -20256 12231 11822 -2752 -9034
17763 -9034 -40287 -39780 -6961 -3327 19150 43954 53538 40198 -1658 -4591 15215 55581 63786
17750 63786 24281 1005 13239 38933 51186 35385 25566 11235 8017 8336 20744 23034 41948
17737 41948 62743 48103 5441 -7325 -29887 -24115 -4735 11746 -5739 -18047 -18733 -203
17725 -203 -11617 -33289 -18039 8430 -1316 -35344 -32034 -25512 -57640 -54937 -30055 -21443 -19190
17712 -19190 -17757 -22035 -16509 2720 -11122 -34433 -35218 -38543 -27818 -29303 -40039 -28696 -28149
17699 -28149 -31447 -18482 -18955 -16387 -10138 -8461 -22557 -13937 12930 21057 -17363 -36011 -29249
17686 -29249 -10088 -1220 -6325 774 6279 1919 -39780 -67007 -37383 -10425 949 9876 -1002
17673 -1002 -20457 -11887 10111 -16471 -36118 -519 30817 34245 19874 37572 35221 -10577
17661 -10577 -40182 -41149 -27081 -44251 -52867 -35047 -36982 -24078 -16912 -22490 -27964 -47753 -34151
17648 -34151 17312 3850 -30492 -40073 -37880 -32425 -26299 -55247 -38672 -23447 -7208 -25514
17636 -25514 -15929 -7984 -31145 -34771 6331 -6178 -3412 -28620 -17433 978 -13585 -22548 -19221
17623 -19221 -13300 -2217 795 9517 18523 2026 -28403 -35630 -19571 13230 42857 35036 21907
17610 21907 28817 29330 30443 13204 -13035 -20500 -34107 -19321 5265 25008 14674 21999 16766
17597 16766 3134 -14009 -26353 -24727 -35910 -40828 -29967 -18551 -29130 -23350 -20877 -15772 -24438
17584 -24438 -20563 -12253 -6991 1809 7082 -23572 -31234 3212 2218 -10265 -9920 3313 9895 -22470
17570 -22470 -35165 -26141 -8917 7054 18623 12519 21009 17590 18179 17347 14678 44027 59890
17557 59890 38802 33366 31501 30862 339 -37205 -39069 -37273 -42050 -25964 8586 14765 1183
17544 1183 -6857 -23117 -32057 -3643 13999 -13477 -43085 -34163 -7271 -5077 -11857 14292 17137
17531 17137 6038 -534 272 -4613 -7936 15251 13805 -16922 -23651 8978 4384 -13957 -14911 5915
17517 5915 4891 12510 2155 -15004 18056 -3888 -42566 -18790 -27455 -50157 -14546 -25356
17505 -25356 -31735 -27491 -4115 6671 2747 -559 -16749 -20805 -38604 -23212 -13152 -4306 7846
17492 7846 -6768 -8636 -18657 -22776 -27505 -27365 -18737 14330 34575 -5154 -10637 22650 15647
17479 15647 -7378 -32420 -26604 18849 50732 53736 38888 10304 -17106 -34533 -12300 -9676
17467 -9676 -5639 -27278 -10344 11736 18036 28689 13911 -7739 -18060 -21134 -20324 -27524 -20865
17454 -20865 -23798 -38016 -27658 -27962 -36812 -62597 -43697 11796 70557 82878 105669 149071
17442 149071 166988 129443 86448 55558 45908 41538 38870 9417 2204 3968 16927 59386
17430 59386 71928 34722 34306 31971 -14927 -5973 15322 24446 20060 7389 -1785 -22658 -25674
17417 -25674 -45029 -14153 5275 -12508 -28061 -27860 -40833 -46796 -44602 -13193 -7547 -10974 -31740
17404 -31740 -46129 -32710 -9897 671 -10364 -15934 -13884 -1682 27661 70158 83253 31001
17392 31001 15628 28386 13440 14888 -9992 -15714 15513 26596 31233 9069 6842 23034
17380 23034 -3294 -5882 -6058 -8254 2322 8019 5358 8754 -8194 -3545 6305 19568 12681 -19650
17366 -19650 -35434 -27825 -32606 -26156 -709 -6372 -31072 -39383 -50217 -44289 -12448 1193 -4932
17353 -4932 -19283 -33097 -30426 -20828 -266 -8208 -2926 -10737 -18652 -11003 -10102 -9263 -8107 -13954
17339 -13954 -18 -9178 -16912 -26323 -36273 -43807 -33921 -14740 -6828 1377 -5949 -5757 5224 23643
17325 23643 18195 14439 8765 10240 21104 22202 16734 -4296 -28180 -21887 -8051 -8760 -18065 -21252
17311 -21252 2188 -30866 -24276 -21897 -13265 -34821 -20175 -19524 -25840 -25075 -8488 -9768 -19178 1328
17297 1328 27889 6982 -27873 -12642 -20823 -42771 -21643 -25916 -15079 3330 653 -8071 -19919
17284 -19919 -22900 -9938 -1106 -3202 -25053 -35315 -21430 -30047 -29029 -1684 -14821 -3699 -16876
17271 -16876 -29710 -22147 -28745 -17887 -14239 -19216 13151 -409 -21414 -19564 -12278 7590 31533
17258 31533 15741 2341 3802 7257 2403 11657 30782 31512 24752 3974 2793 7127 12745 8958
17244 8958 27896 40082 34552 11120 4714 17836 29530 2797 -25480 -14513 5963 12884
17232 12884 -7364 -9947 -19746 -20857 -739 16084 -929 -3878 -228 -9708 10417 -10591 -12890
17219 -12890 -3309 -2042 -16651 -25147 -1315 1952 -16473 -22290 -8125 -101 6848 8198 11996
17206 11996 12927 15923 11023 -4173 -6899 -2897 -12837 -22237 -9037 -8697 10092 2562 -4092 -15739
17192 -15739 -33109 -10402 -20891 -46345 -57894 -39879 -30020 -30916 -16209 -10115 -46087 -23633
17180 -23633 -23253 -26852 -17354 -6003 -12744 -17787 8391 -1848 -12437 -13849 -7729 339 -8764 -23872
17166 -23872 -48561 -29966 10813 -7359 -16405 -7274 4452 -14744 8069 14270 23327 22029 3620
17153 3620 6830 5003 2498 9556 24031 46890 50781 25519 841 -11100 7726 -7527 -16342
17140 -16342 -10205 1723 -1169 -12711 -8047 -26739 -14313 8363 -4446 -27416 -24188 -10545
17128 -10545 -11992 13575 4222 5495 -5569 -17896 -1274 -2629 -7623 8496 -7190 -9065 -1577
17115 -1577 -13511 8177 13566 31475 35562 19166 -10694 -18811 -14784 -12747 -40367 -21927 -4644
17102 -4644 32840 68897 50703 36616 24685 23444 18092 5494 -18134 -52956 -17718 15623
17090 15623 5706 -19118 -12037 -5696 -10702 -12353 -31766 -61779 -50953 -23593 -30127 -19868 -25608
17077 -25608 -41585 -36905 -13211 -13070 -18867 -1615 2407 -4884 -42287 -51044 -42700 -21059 -11686
17064 -11686 -5620 -34814 -47222 -31920 -36141 -35179 -20893 -8746 -3286 -17571 -46852 -18306 -989
17051 -989 -1023 19990 49653 43007 29152 6777 -37707 -67701 -26943 17617 -6318 -20725 -35602
17038 -35602 -30798 -27571 -30750 -34802 -29478 330 5551 18204 6395 -4503 -8466 -29004 -20342
17025 -20342 -27045 -44860 -20414 -17 -11673 -35668 -43721 -25884 -22657 -29770 -53534 -45873 -20115
17012 -20115 -16175 -18861 -19951 -1113 -21307 -42066 -14917 8582 31502 23239 1889 -21792
17000 -21792 -10409 8450 25229 28788 22416 16803 7408 20740 23798 23196 -11960 -27865 -9922
16987 -9922 -24145 -28477 -16008 -18289 -17266 -35156 -25970 6580 42890 54677 40363 6063 -17349
16974 -17349 -5546 4634 2252 -11173 -214 5532 27934 25371 5092 20153 291 -35347
16962 -35347 -57532 -23161 -2186 -6889 16052 12998 -15690 -35318 -21666 -32923 -57611 -62339
16950 -62339 -60506 -53065 -36830 -31307 -46765 -37403 -4511 2397 -6103 -18962 -1073 5768 13963
16937 13963 6180 1441 15747 20267 20039 -2268 -38882 -35363 -8429 -14724 -43005 -38368 -30365
16924 -30365 -20218 -32160 -13787 -6738 -20568 -40458 -46930 -46318 -40898 -18586 -7028 -20512 -15790
16911 -15790 -22062 -11252 4182 11437 11434 5963 -22899 -18461 -32749 -47680 -48664 -43599 -24058 -31326
16897 -31326 -21627 -1603 39566 34115 -11783 -16320 -6832 -3094 -25118 -31904 -26391 -9184 -855
16884 -855 -15112 -17530 -6779 8525 11300 13874 13034 5065 11899 -7977 -40333 -57346 -53584 -63009
16870 -63009 -56100 -58422 -35328 -35907 -44402 -42061 -22327 8136 2303 -8223 -20519 -10869 11205
16857 11205 9521 4476 -18659 -5291 -4604 -29880 -41233 -51134 -55475 -29703 -13961 7789 5891
16844 5891 -19117 -23361 -16547 -33988 -40041 -39565 -37897 -48088 -50785 -59621 -76838 -69991 -62667 -49304
16830 -49304 -45824 -19516 2663 -5231 -5947 -998 -4923 -8036 -25427 -22420 -21969 -10181 -11585 -19423
16816 -19423 -12533 -19243 -21493 -6304 -10998 -17910 6460 -1390 -26290 -38898 -51753 -24841 -5200
16803 -5200 -10106 -5124 -25812 -33324 -25738 -3899 11318 17073 1241 -14100 -37511 -46558 -45390
16790 -45390 -57859 -60296 -64961 -55972 -30609 8523 -10290 -13960 -14186 -26019 -21482 2955 -23303
16777 -23303 -38544 -19969 -18460 -63062 -72314 -58316 -58648 -44406 -30839 -28832 -17917 -4207 2807
16764 2807 -10685 -12628 4914 -4441 2709 -22657 -47570 -15202 -21905 -41031 -43125 -4941 20156
16751 20156 27063 13104 -10263 -45762 -60865 -51590 457 26080 12752 -17455 -34052 2844
16739 2844 -8380 -39076 -50644 -44177 -36595 -30581 -29859 -22999 -9819 562 -18839 -19874 -11790
16726 -11790 -768 -4855 -61 9854 -5526 -21560 -30013 -40452 -35188 -4352 11958 8655 23574
16713 23574 17657 15029 23595 15529 -13602 -27019 -39455 -39618 -20280 -10288 -28695 -44683 -29089
16700 -29089 -34661 -44212 -51848 -74508 -56612 -10472 -19905 -24703 -18974 -34553 -36993 -22199 -6815
16687 -6815 12860 -16683 -13999 -4560 1038 -14977 -20326 -14617 -23305 -27449 -35266 -12869 18119
16674 18119 28688 -6109 -24012 -33532 -31994 -19859 -15029 -20279 -5586 11013 26816 28069 2766
16661 2766 -22502 -30872 -14125 -16632 -42607 -46894 -49659 -76537 -87084 -74285 -78841 -48342 -40766
16648 -40766 -44046 -57177 -62722 -47979 -36676 -33948 -29457 -33327 -28459 -20237 -34770 -38017 -38541 -68034
16634 -68034 -73136 -50364 -13497 -12576 -3520 19237 36510 -10674 -6610 -7460 6093 37208 48121
16621 48121 37340 29869 3015 4431 9520 -42864 -65027 -16165 11878 13617 19691 -2249 -33850
16608 -33850 -46851 -44560 -44774 -29460 -8994 10318 -762 -26041 -26500 -7378 -4851 4006 552
16595 552 9904 -15231 -18813 -24271 -22628 -28717 -35378 -38456 -34982 -21466 -16336 -13240 -16222 -21933
16581 -21933 -22086 -45433 -14516 -8066 937 33345 47627 52779 49930 57143 29715 18421 39106
16568 39106 46406 15325 25348 26809 -6056 -16026 -18073 -6546 -694 -8201 -926 -10756 -45451
16555 -45451 -41577 -38667 -57522 -73867 -43575 -24920 -48427 -45024 -35031 -38263 -52989 -49720 -31510
16542 -31510 -5587 8 -10174 -30333 -29201 -5944 21035 14409 12969 18632 -1544 -10000 6859
16529 6859 32072 28919 -7788 -27276 -26726 -17698 1683 24497 17060 -19946 -36470 -25547 -24138
16516 -24138 -23378 -5959 3653 6493 -7562 -10842 -7190 14430 11278 -6455 -10828 -26468 -61145
16503 -61145 -61700 -47369 -24088 -27383 -29756 -35013 -43106 -20114 -87 -15514 -21128 -27352 -19593
16490 -19593 -3675 -839 -7669 10493 18118 -16873 -31469 -21205 1994 -5572 -28768 -7380
16478 -7380 -15668 -42441 -42754 -7890 -15093 -16830 -7363 -26849 -40015 -45975 -40403 -20194 2591
16465 2591 23089 10659 -12523 -26668 -17296 -9289 -15345 -20937 -14729 -37084 -51633 -41690 -32054
16452 -32054 -32567 -29690 -58162 -73956 -56939 -53526 -28529 -15344 -105 14327 8975 20244 14048
16439 14048 -5720 -5254 4369 29958 29231 7592 -30691 -30532 -10533 -17259 -7971 -3670 -11458 -10267
16425 -10267 -13909 -10126 -6946 -14894 -17579 -23041 -25641 29532 53900 47926 25983 8006 992
16412 992 6913 10952 24428 -2627 -16807 -30961 -44296 -34541 -22600 -1342 -130 -25358 -19495
16399 -19495 -32113 -47514 -54680 -50556 -53615 -43407 -35899 -15114 -7004 -12790 15204 22162 -111
16386 -111 12600 16578 16360 21452 4346 -19457 -40196 -22462 798 20046 12953 -5573 -2148
16373 -2148 -8451 9692 32923 14283 13147 11410 -15803 -15711 8145 2016 -12560 -18070 -15189 -38096
16359 -38096 -34911 -19604 -16332 -27707 -31144 -28834 -10992 -23826 -10476 -13578 -811 -15367 -14443
16346 -14443 -29419 -36945 -46704 -51954 -34479 -12821 8672 -5418 -4923 11640 23178 16203 -406
16333 -406 -21281 -10992 -2385 5438 -8020 -9447 4483 -8636 -1674 4046 3589 -18553 -6482
16320 -6482 29299 41472 19528 -2395 -27875 -25391 -18138 -16889 -5683 -5752 16337 22781 12066
16307 12066 2002 29381 35610 8653 -4662 -38788 -60823 -44015 -29137 -23613 -878 18948
16295 18948 39560 39973 9763 -13253 -3235 574 11934 -20812 -31498 -14468 24162 15127
16283 15127 29892 36527 13451 -3076 -28506 -39208 -10893 1852 -27426 -49455 -46344 -47154
16271 -47154 -69941 -66137 -64264 -28006 -2816 -3592 16262 15231 11190 -21754 -12325 -29529 -25332
16258 -25332 -45726 -79608 -75174 -55900 -43459 -18421 4052 -2464 -21075 -11565 13513 20088
16246 20088 20718 12691 9709 37407 41611 17619 -18337 -32803 -44946 -65388 -16017 -2515 18854
16233 18854 8729 -30276 -32338 -25715 -30837 -22636 -23960 -27510 -37869 -10345 -18578 -47960 -69875
16220 -69875 -32925 -16731 -33780 -6415 7979 -16444 -28665 -33175 -30981 -9136 11394 12503
16208 12503 7190 7162 22730 32187 18205 24371 20579 -3609 -31035 -15358 -13382 -19318 -22716 -13554
16194 -13554 -14650 -36814 -21549 18865 30807 12037 343 -23871 -12765 -15568 -17292 -25128
16182 -25128 -52273 -59580 -23761 -6211 -10262 -8544 -31452 -36118 -12323 3732 6470 7975 16781
16169 16781 13314 -2755 -21436 -12372 18 -258 54 -20552 -7355 -17663 -21626 -12769 -2172
16156 -2172 5450 21283 -4403 -12561 2967 -10219 -21943 -4001 2457 -36429 -58571 -49963 -55137
16143 -55137 -61989 -46471 -37067 -15575 -17331 -25285 11030 23438 19226 22136 45872 36027 11015
16130 11015 12945 37022 39353 4352 -25970 -13856 -24438 -11386 -1183 -5682 6166 23968
16118 23968 26337 7552 -25492 -33379 -48121 -39113 -16782 4709 -7573 -60897 -77816 -65443
16106 -65443 -33775 -9927 -433 -1451 -4821 -36882 -67068 -57685 -26646 -3970 15696 18135 18284
16093 18284 6258 -948 -4388 339 9637 -10798 -13748 -2807 8793 8262 9253 5563 -2500 5886
16079 5886 -18125 -32687 -15293 -7031 -8761 -32417 -39363 251 16560 44619 40592 44040 7201
16066 7201 -23807 -4684 20761 3082 -27338 -33940 -23386 -24776 -10806 4904 26055 60190
16054 60190 28534 1719 -10495 -6323 8050 14414 24892 -17314 -25461 -10041 -9367 -14683 -14963
16041 -14963 -21699 -10233 -10615 -13481 -2708 9142 17151 19710 6711 -19573 -39571 -52318 -52719
16028 -52719 -58935 -21389 -4292 -6379 -12435 1634 -4901 25909 46769 34561 21974 -2294
16016 -2294 -7092 -12144 -39812 -38788 -38216 -57541 -43895 -37718 -33457 -14861 -26413 -53352 -47366
16003 -47366 -16189 6170 -9314 -36984 -49065 -41777 -7965 -5068 -8513 -7662 -8922 -27262 -29226
15990 -29226 -23416 -31348 -19688 -9511 10992 -3708 -1238 13585 6862 -2664 3904 7655 16613
15977 16613 -21803 -41638 -47709 -36089 -32671 -34022 -25125 -25093 -53645 -39720 -25186 -13811 -25571
15964 -25571 -47638 -59534 -39043 -41915 -23808 -25382 -27740 -9347 14866 1943 -12072 -18902
15952 -18902 25500 3680 -31930 -28907 -20777 5822 19241 14792 10256 -8195 541 26776 30749
15939 30749 18215 4097 9123 -5107 -16891 16641 20558 27672 22335 -6159 2324 -7036 -15565
15926 -15565 -30205 -15584 -3138 199 -6900 -3076 -18375 -29063 -32634 -37955 -23634 -14353 -16755
15913 -16755 -31117 -52608 -31313 -12325 -54112 -94967 -60805 -35341 -43506 -41084 -16555 -15834
15901 -15834 -17765 -15470 -1107 4268 15818 14674 16428 15616 -4442 -14488 -20862 -38648 -37034
15888 -37034 -17471 -16121 4419 878 -1517 -3807 12792 37027 14571 705 -22535 -7593
15876 -7593 -6457 -8253 22927 27914 21813 8911 -17783 -7709 8572 23079 3332 -7452 -30704
15863 -30704 -42252 -34018 -12591 8174 3485 -16164 -18616 -26022 -8657 -7016 -27677 -43071 -41349
15850 -41349 -38928 -22421 -20644 -8385 16724 4400 -29186 -34840 -619 -2678 5014 19104 18326
15837 18326 16149 23939 14620 18843 -4205 -31837 -64745 -34884 -11885 2470 -8724 733 -9385
15824 -9385 -41910 -46181 -51360 -53641 -52837 -58773 -74987 -62100 -53620 -59421 -67579 -46963 -44562 -37576
15810 -37576 -28667 -7079 -12468 -1649 -3230 16435 13526 -19102 -17630 -9339 7545 22559 22000
15797 22000 28151 28327 3393 -1799 28732 31878 23979 10396 20140 22350 -5077 -39715 -20818
15784 -20818 3450 -1917 -9552 -28220 -59617 -56595 -36133 -12450 -1455 -12302 -11431 -22572 -8492
15771 -8492 20530 -3289 -41662 -63630 -46108 -16031 1248 -8871 -38575 -59402 -45633 -33654
15759 -33654 -24746 -36855 -53632 -44649 -46334 -48809 -69185 -54955 -35936 -20687 -9012 -21344
15747 -21344 -13224 -8582 -28169 -44202 -63133 -34570 -27118 -25883 4243 -18820 -22378 -15363 -34750
15734 -34750 -57454 -54163 -44470 -44020 -15085 -11422 -7142 -4006 -1327 -816 -16443 -31179 -52314 -50196
15720 -50196 -48516 -58182 -56697 -63304 -46709 -25864 -20015 -20206 -22304 -16981 -4906 -5612 -12722 -20729
15706 -20729 -43049 -52743 -31644 -6358 -30319 -58216 -34146 -16376 -14349 3807 11215 24012
15694 24012 20937 -4775 -21619 -4607 -11710 -30259 -42982 -35775 -8252 3656 -9054 -11376
15682 -11376 -4370 19988 25133 8115 -11488 6461 41891 52867 6603 -14859 -12758 5427
15670 5427 13920 -1619 9730 6802 -18954 -41450 -44985 -9509 20653 30890 31179 17822 -3002
15657 -3002 9261 8519 -8590 -24837 -17481 1967 -1614 -11673 -21480 -31794 -48618 -61080 -63734
15644 -63734 -64316 -78129 -47049 -30998 -21313 -25294 -11435 -9262 -33079 -30039 -32552 -21275 -7795
15631 -7795 -10184 -16710 -50542 -26749 -28759 -30518 -35230 -56997 -63958 -46840 -34214 -60472 -35380
15618 -35380 -48273 -61534 -33210 8078 18412 20123 -21130 -35819 -38788 -59988 -63241 -29571
15606 -29571 -3126 -3059 -45181 -76905 -77752 -73665 -69575 -93014 -89207 -74346 -24397 -16117 -19624 -1476
15592 -1476 4419 -7638 4935 8699 21297 24002 34447 22408 -3034 -27666 -33623 -52208 -63293
15579 -63293 -53381 -51305 -51062 -50725 -27130 -18646 -2780 -17564 -27884 -3900 -548 -24823 -39124
15566 -39124 -53015 -32965 -22777 -9851 24408 -1179 -11095 -1137 -22294 -29525 -7085 -1010
15554 -1010 12232 16151 -3297 -24013 -40805 -55630 -37003 -22975 -8504 -10621 -33446 -42800
15542 -42800 -18371 21746 17251 -22955 -8052 21020 -3297 -17131 -12927 -14224 -12289 -6211 -4382
15529 -4382 -19027 -14491 -3003 -33659 -41171 -46955 -44308 -33864 -21077 -22911 -6391 6111 -33369
15516 -33369 -27740 -36810 -61900 -34206 -13994 -11497 -6256 -27491 -35808 -40104 -40262 -37042 -25384
15503 -25384 -14330 -21049 -26165 -7041 11809 -2154 -50965 -41671 -10082 2798 -2682 483 -14128
15490 -14128 -6824 3514 -5547 -11785 -9136 -28845 -19292 -8149 -16990 -25427 -25760 -31018 -29437 -13522
15476 -13522 729 25321 32663 -8268 -64868 -77814 -55234 -54502 -39310 -32279 -25846 -8773 -18275
15463 -18275 -40733 -54040 -42814 -39689 -18396 -15524 -3778 21970 26481 3818 -4423 -24649
15451 -24649 -48463 -57092 -72415 -39267 -26120 -61539 -56591 -26260 -21521 -31095 -34271 -31325 -29792
15438 -29792 -40723 -3553 4170 -25753 -19719 -24557 -36812 -29566 -39933 -21225 -22000 -55811 -57911
15425 -57911 -35990 -15429 -3681 2206 -5231 -19636 -37398 -42714 -21925 -3815 -21668 -32601
15413 -32601 -3373 35400 23225 526 -2031 -4789 536 -22730 -31043 -15646 -1607 3308 22601
15400 22601 25980 -27821 -46653 -28168 -18229 -30601 -43247 -36756 -52088 -68836 -40041 -29286
15388 -29286 -55229 -47860 -22748 -21903 -23507 7857 -4182 3153 9322 4468 -5829 -30828 -33156
15375 -33156 -36289 -8377 22951 7309 -10731 -39557 -30527 -25197 -23514 -6862 -17722 -30810
15363 -30810 -39883 -20878 27108 40080 36269 17346 6847 1964 -12398 -13713 -13449 -28464 -32564
15350 -32564 -8057 -10476 -6489 -23258 -19953 -27136 -35683 -21911 5885 -8713 -32936 -19532 -3139
15337 -3139 -7569 -14849 -11819 10231 22972 15482 17643 14221 -4788 24563 34574 33414 30364
15324 30364 17625 7223 -35013 -49229 -32248 -36210 -22535 6163 33401 9817 -16689 -16932
15312 -16932 -53736 -55310 -14687 10518 30724 38250 24191 17025 9031 -6395 -18188 -23145 -29520
15299 -29520 -46832 -51068 -31551 10697 -8421 -55034 -57023 -23873 6927 -7972 -59108 -51330
15287 -51330 -50368 -53943 -44740 -45018 -35650 -24595 -38098 -22147 -8372 -12547 1313 -427 -26694
15274 -26694 -31699 -7767 10053 17406 29129 6420 -8151 962 2851 -17999 -29501 -33021 -31775
15261 -31775 -6146 28707 25963 20489 13544 -7587 -10829 -15057 -18915 -19461 -5138 2713 -13801
15248 -13801 -27136 -11488 17245 -5934 -20527 -36786 -53210 -52990 -69938 -68979 -30620 -13804
15236 -13804 -23461 -7310 -4664 -14490 -28942 -24181 -41941 -27804 -32337 -34993 -35616 -47760 -34970
15223 -34970 -27516 -8134 17158 23182 -27283 -34617 -49013 -33923 -13488 -3686 1471 -1142 -6843
15210 -6843 -11678 -4817 -5972 2267 2015 2088 22415 19415 37528 36430 17999 27958 32261 -5430
15196 -5430 -11107 -6296 -2674 -11737 -545 -13602 -20457 -15584 -11991 -27719 -42853 -51358 -35105
15183 -35105 -30110 -28225 -8674 -2028 -13484 -10403 -8477 -8793 -24407 -21664 -10818 -25535 -43863
15170 -43863 -50443 -81517 -73689 -35661 -46408 -26379 -3858 1380 -8427 -15777 -27867 -19438 -31605
15157 -31605 -38504 -34347 -22576 -8313 -12156 -45762 -56324 -55334 -15057 22364 42242 23761 13113
15144 13113 16812 8371 -17955 -34190 -47706 -65058 -51253 -32040 -22990 -29071 -20467 -17849 -35330
15131 -35330 -39813 -33289 -38498 -37929 -26956 -24189 -22353 -30135 -13849 7465 13048 39096 36751 16724
15117 16724 17194 998 -12718 -5121 9173 9049 -930 -9567 -10854 -119 11747 12144 6798 4898
15103 4898 9098 -14590 -21876 -40781 -58988 -50680 -37301 -22416 6235 16889 -11541 -25695
15091 -25695 -4195 11427 6729 -5403 -24359 -50927 -37610 -9461 -5789 -28241 -34189 -11181
15079 -11181 -7952 -19537 -15376 -15750 -16952 6254 13810 283 7649 14349 32495 46303 42721
15066 42721 -518 -13002 -20639 -19848 -13582 5297 6028 9508 10789 13445 1583 -19176 -18725 3398
15052 3398 10003 16453 15717 18322 15783 16888 219 33150 37459 19556 -1767 -15556 12363
15039 12363 31613 32397 49455 44115 50453 31052 7070 -5667 -944 -7687 7298 14457 43892
15026 43892 79738 30712 -1405 71 1956 13818 6414 22016 46825 32857 -7500 -16814
15014 -16814 10429 18928 4391 -7753 5563 -11689 -47793 -54332 -37445 -38392 -49574 -43172 -17802
15001 -17802 -9261 -25712 -6847 14234 8645 -12143 15583 22433 -11776 -33323 -38973 -55113
14989 -55113 -43161 -29753 -32094 -7045 12802 42129 37108 41508 9116 45 33317 67799
14977 67799 44045 33156 24670 23553 21010 15905 21234 -4393 -25293 -54350 -30671 -24960 -7559
14964 -7559 -1285 -18181 -35722 -57209 -64613 -69006 -50276 -5798 -8206 -46035 -53350 -36043 -35401
14951 -35401 -39946 -37496 -14787 -167 2756 3028 3798 -5867 -15299 -39727 -46930 -46606 -57193 -63282
14937 -63282 -39318 -44486 -28491 -26028 -29536 -27112 -15334 -321 4575 -22918 -9629 -249 -15048
14924 -15048 -19976 -20075 -22676 -6330 -33283 -46412 -32105 -22464 -24011 -26925 -35029 -41441 -26729 1011
14910 1011 7339 -13137 -16602 -27834 -29816 -37743 -50636 -56601 -38808 -22105 -30899 -12514 -24512
14897 -24512 -23832 -28444 -7622 -6676 -17668 -10389 -25534 -30944 -26026 -37010 -15578 -2872 -18557
14884 -18557 -17164 -20813 -41293 -56194 -37681 -19036 11220 22418 15033 1247 13656 1054
14872 1054 1298 -26778 -20275 -15930 -34475 -51730 -46884 -46348 -52490 -44695 -11382 2212 7713 -4117
14858 -4117 3011 6421 2400 938 3543 -12325 -12270 5389 15745 7307 -342 4242 -11038 -29087
14844 -29087 -11137 -10224 -3884 14507 16626 -8039 -23928 -25022 -25506 11610 11615 -22559 -33531 -53265
14830 -53265 -31052 8157 5235 3917 28665 35795 26518 14723 -415 4151 10874 -13663 -10898
14817 -10898 15709 33415 -6964 -36317 -38214 -24521 -16039 -13709 -17362 -17223 -9741 -38589 -49835
14804 -49835 -38269 -24219 -35107 -42100 -68848 -63991 -56625 -33690 -30788 -13584 -5339 18558 37225
14791 37225 33149 11915 -16649 -35198 -45986 -48989 -14719 8046 12150 -7391 -30259 -47994
14779 -47994 -60971 -51129 -37075 -42993 -55369 -52453 -58389 -3699 5468 5737 -13217 -23669 -18756
14766 -18756 -2975 1888 9662 12357 -3976 -27213 -51312 -42196 -32958 -28366 -24733 -35691 -29051
14753 -29051 19715 6675 -14285 -27852 -23345 -8351 14265 22722 12644 16550 -15712 -42163
14741 -42163 -69881 -59010 -52454 -40136 -17716 -10555 -7970 -12642 -24275 -18904 -13847 -6517 -13154
14728 -13154 -7425 -21066 -46699 -24462 25930 23102 26682 15982 -6787 -34173 -38073 -48088
14716 -48088 -57478 -56645 -52113 -24332 15237 39908 15077 -8490 -22611 -31534 -32315 17358 12568
14703 12568 11010 22916 32279 21179 19331 -2438 -25253 -31818 -37588 -51348 -52792 -40962 -23349
14690 -23349 -23913 -46961 -28303 -15838 -14486 -28859 -50708 -25404 -8913 -16840 -34463 -41841 -41271
14677 -41271 -24379 600 -13567 -19661 -10719 -8560 -5596 -3428 -19891 -54235 -42879 -5600 -13879
14664 -13879 -4778 -2856 1070 5021 -26909 -34485 -15166 -19963 -42068 -44378 -35991 -29180 -37042 -28397
14650 -28397 -9080 -21730 -61658 -80112 -58413 -14257 -103 9181 17870 9368 -12068 -10946
14638 -10946 -17078 -12319 -28202 -65229 -83397 -93000 -79394 -53961 -41591 -27559 -34460 -28201 2293
14625 2293 694 -8944 -7231 -11643 16933 14401 -4165 -1543 7933 3805 20190 22391 6956 -35840
14611 -35840 -52586 -18269 23692 20908 -6530 1077 -7276 -24153 -13097 -31898 -39787 -23144
14599 -23144 -29467 -42088 -46247 -41657 -16685 5053 1735 4867 14770 27278 3016 -10970 -19996
14586 -19996 -9263 -7074 -4475 7038 -14525 -38478 -57240 -50236 -9557 30490 29063 6528
14574 6528 7072 10609 4821 20600 -1290 -9955 -17982 -14520 -27388 -25536 -35251 -8008 -5192 -27258
14560 -27258 -26961 -12588 -35994 -15688 446 -8776 -20665 -24031 1256 23437 4557 5350 29097
14547 29097 5069 -28985 -34656 -41893 -68393 -48350 -9629 -1593 -20212 -24812 -16276 -14345 17630
14534 17630 14099 17160 10364 20015 39127 44474 26858 12874 33684 32755 35223 10375 3600
14521 3600 4841 -21470 -40743 -55833 -48454 -59314 -59546 -52020 -44164 -25926 -13341 -19826 -1247
14508 -1247 16894 20569 5268 15802 713 -26923 -36015 -30885 -17227 4231 9571 9291 -450
14495 -450 5220 16924 8555 7042 32161 34591 925 -8661 -10356 -8275 15056 3096 -23181
14482 -23181 -38657 -21708 -9941 6968 -5974 -11492 -1253 7238 21045 17746 16748 23824 598
14469 598 756 15621 11224 3559 -2307 -1718 4152 -10382 -4755 14684 33047 56503 42349 19440
14455 19440 23473 44708 27304 25206 13334 -3731 -701 10691 29812 26612 19055 -362 -19600
14442 -19600 -15069 -10591 1079 10483 2417 -24471 -21795 -21717 -27977 -19041 -19004 -13807 -5472 -870 1203
14427 1203 -275 -5037 -8411 -9372 -14143 -1205 25844 28189 21011 16836 -427 4475 -6144 8785
14413 8785 33671 9951 3563 -1902 -12069 -9717 -8769 -21316 -28272 -36162 -28002 -8141 -9402 -7785
14399 -7785 -42609 -46227 -28865 -12354 3242 15626 22449 15125 29639 21862 -6403 -18898 -27297
14386 -27297 -28410 -13550 -6160 -23540 -52239 -47936 -31670 -4227 -21810 -34118 -30949 -44007
14374 -44007 -45681 -21621 -36010 -23163 1086 4876 -17514 -41438 -36405 -18027 -37927 -71715
14362 -71715 -46005 -2570 5607 -5244 5536 18246 2894 -15594 -3870 13548 39395 28406
14350 28406 2736 -14227 -4593 14066 19684 25086 20758 19990 24229 1990 5782 10927 1403 20237
14336 20237 56983 42789 35496 23255 13150 31480 25624 27397 53704 50341 43248 39194 68078
14323 68078 68185 56832 59346 64227 50554 36052 29274 28947 35673 15335 -7950 -28375 -18384
14310 -18384 30328 49833 31438 52861 66288 55190 59113 56561 32175 23589 34530 57152
14298 57152 46660 31238 16219 22865 18187 14737 24234 35591 54196 52163 38802 17806 -5828
14285 -5828 11826 10776 -16059 -31880 -12010 3900 -3230 -12249 -24178 -31936 -24586 -13441 -25660
14272 -25660 -39133 -48837 -39802 -37810 -45777 -30113 -30760 -10789 -8305 6325 12710 13459 10146 14745
14258 14745 1537 -11941 726 -15301 -38329 -17318 14178 1142 14972 24449 17162 -16479
14246 -16479 -44282 -32097 -37762 -39335 -31362 -21034 -17478 -27787 -23711 -25371 -14303 7000 10665
14233 10665 -16506 -16087 -20121 -29644 -19500 6873 43389 47713 31165 20290 19667 20476 -7846
14220 -7846 -19319 -29359 -51311 -49154 -32724 -12545 -10286 16341 5616 -10782 3410 -12376
14208 -12376 -47361 -28178 -15849 -52642 -48355 -43832 -28583 -30439 -23614 -17594 -24093 -12533 -10811
14195 -10811 -6828 -8057 -1456 6983 -7656 -9145 19095 23200 6805 34793 41205 25090 11194
14182 11194 22167 46421 48276 44748 28118 21655 17765 -732 -27735 -18888 -1400 14701 -19413
14169 -19413 -33229 -3582 -22088 -23229 317 18496 8519 -9634 -11924 -23144 -24970 -9984
14157 -9984 14766 35416 28951 38551 26384 -4860 -9742 -9183 -7194 -26834 -48672 -56393 -60816
14144 -60816 -47170 -5975 -4318 -18371 -27059 -13497 -1240 5492 1076 -14705 -7416 7092 -16014
14131 -16014 -17668 -14841 -17358 -41898 -40535 -12423 -801 -2734 -16542 -32826 -29507 -26895 -44551
14118 -44551 -40861 -35370 -19066 -13634 -8856 -46011 -39451 -19015 -38045 -43004 -42066 -10894 -5469
14105 -5469 -12577 731 2148 -3906 -26316 -53102 -47939 -20398 1064 -7308 -24854 -37001 -19710
14092 -19710 -7681 2092 -549 2026 13387 25688 51812 66372 43009 46874 68227 45292
14080 45292 17051 -5011 -8462 9358 11576 5429 -8404 -34955 -41305 -39842 -41962 -33952 -45518
14067 -45518 -25479 -13518 -33231 -46224 -35364 -41060 -40509 -46297 -21251 -28731 -28950 10470 9238
14054 9238 1315 -1449 6758 31004 37406 29479 26329 13230 -2335 -24136 -35712 -39347 -16296
14041 -16296 -18119 -41203 -47636 -42844 4710 22174 30223 17778 24792 35171 35013 32863 14654
14028 14654 18598 639 15825 62758 98474 83866 40053 41094 42862 42472 61644 64691 60862
14015 60862 68952 101684 113017 104207 94455 79719 85011 104490 91595 49480 25154 53621
14003 53621 111552 152775 157102 127008 127301 125977 125634 111415 134566 147880 146472 142626 163128
13990 163128 163986 135674 138960 155746 149077 137603 140295 147385 163680 175486 156040 166357 181438
13977 181438 170088 177226 168619 147782 128717 136588 139473 159043 176181 175722 171818 159484 133064
13964 133064 148355 152686 127666 99604 87384 106401 122905 116467 113019 111934 139114 132886
13952 132886 74726 70895 90078 97131 66436 42756 24143 22921 6358 1861 12208 18945
13940 18945 28043 35706 25386 13454 20626 69602 87071 56679 70400 83907 78672 86471 66319
13927 66319 33221 35383 68935 91287 108702 108476 91969 77369 68760 67731 77633 89525 117863
13914 117863 123615 118641 127629 121230 123615 144260 151476 150465 173900 179076 205017 207405 189543
13901 189543 186816 175483 165099 184127 171744 149966 121740 133740 164047 159760 153182 141623
13889 141623 130505 116441 122918 152116 167800 143130 114866 108119 104410 107986 109899 84933
13877 84933 75618 100235 108456 91498 71157 74108 79546 85884 84352 58364 64582 84590 84512 70098
13863 70098 56973 22798 49903 26110 15202 -6048 -28031 -53594 -19845 4576 17034 18317
13851 18317 4123 19312 36302 13339 -2387 -9046 27151 54747 45544 40326 19266 23655
13839 23655 63270 43155 11762 13722 37764 40135 41606 72472 49416 27037 34791 27733 22365
13826 22365 13500 13671 -14144 -12372 -13208 -34269 -10064 -7295 4422 8152 3308 3895 18133 32779
13812 32779 48869 78513 71375 69938 74104 67918 39165 51393 76134 101818 86390 57897
13800 57897 36080 23959 20870 55146 90953 104320 112704 93403 56792 59033 56817 41071
13788 41071 36380 15026 18891 61050 80380 52829 26964 44126 97252 110509 101478 53465
13776 53465 27955 28013 46511 23561 5474 7289 12693 14778 26714 14434 2699 1202 6997
13763 6997 -965 9129 39331 57857 72843 61813 54090 59431 53836 60249 38156 23972 33295
13750 33295 26981 23224 32984 41522 26440 42269 72186 75140 80601 75580 57530 46653 61666
13737 61666 70898 84466 84114 72064 49704 49563 80048 92213 75320 77549 81000 65215 57869
13724 57869 66364 109266 134461 141281 142414 135899 103395 99416 98012 108663 105759 101428 99306
13711 99306 110869 128523 113781 101645 84124 74361 101484 121410 107678 111967 122209 122101
13699 122101 122555 124461 132299 129477 125752 139394 135914 135435 126452 144319 147562 158295 143941 121302
13685 121302 140097 169306 190468 183068 161524 176697 168600 141718 152633 143055 154015 164201
13673 164201 157801 134737 142766 180764 165294 141989 132363 115111 140776 162976 146894 142386
13661 142386 165136 182115 183759 195317 205949 169234 135933 130733 122972 164412 191791 202606
13649 202606 223688 248733 222792 199230 224652 236309 209438 209491 223681 224332 228542 221975 201286
13636 201286 219027 241195 255979 283732 308145 359070 352630 306522 286631 264765 282155 292032
13624 292032 309760 330088 355598 355669 338925 348293 375041 407302 452757 492903 526230 533664
13612 533664 509998 519573 525420 532274 564505 592362 629450 705205 731346 759647 799252 851886
13600 851886 909544 962289 1011704 1077262 1155971 1237278 1325112 1430258 1545752 1637193 1775723
13589 1775723 1940276 2128203 2371129 2633085 2938865 3316665 3757794 4306470 5028685
13580 5028685 5911763 6941378 8141477 9504326 10938058 12345510 13666850 14857530
13572 14857530 15860502 16643473 17290492 17877605 18496425 19201031 19999778 20836403 21673216
13563 21673216 22463025 23152538 23641480 23912651 24018092 24052904 24104262 24230364 24528969 25055122
13553 25055122 25829722 26852018 28124217 29554722 31055689 32536214 33808301 34697387
13545 34697387 35099000 34968675 34275826 33139932 31659053 29985891 28363901 27025958
13537 27025958 26100362 25618162 25521636 25643665 25773867 25864466 25828197 25644822 25375279 24967169
13527 24967169 24421630 23765733 23052239 22306627 21595322 20945234 20320869 19682244 18946923
13518 18946923 18061929 17061674 15977278 14819944 13572509 12258783 10960255 9752749
13510 9752749 8712789 7896312 7297110 6853055 6569129 6410696 6344851 6358779 6471718 6696450
13500 6696450 7049112 7570310 8246384 9127273 10191975 11411850 12750063 14136709 15542287
13491 15542287 16851502 18036127 19049002 19906813 20665782 21327664 21958583 22583012 23277240
13482 23277240 24031170 24797338 25509506 26145445 26629665 26896617 26949791 26920366 26871726 26884687
13472 26884687 27033193 27478153 28242861 29290327 30633582 32224417 33945927 35581372
13464 35581372 36854409 37611430 37763289 37327254 36379797 35072238 33535401 31915553 30358684
13455 30358684 29053353 28043348 27389207 27071748 27010846 27064941 27111309 27003676 26729665
13446 26729665 26249376 25572814 24799251 23944059 23041472 22198277 21476495 20827486 20205006
13437 20205006 19536663 18728839 17745709 16601338 15263598 13812339 12242775 10667168
13429 10667168 9216280 7920311 6823512 5965804 5286693 4744396 4288745 3908771 3588145
13420 3588145 3310348 3048500 2821838 2626919 2477905 2328885 2174246 2026058 1931144 1842247
13410 1842247 1749000 1650738 1571016 1503757 1436599 1385789 1330724 1268171 1213510 1177725 1107846
13399 1107846 1044692 993569 984311 986947 962591 913635 886405 881081 862238 808644 773191 750433
13387 750433 736787 698698 676828 668536 665607 641264 623822 590021 576322 564937 561556 529957
13375 529957 504532 483059 462171 482789 475681 431155 422134 398634 384660 369766 319993 346205
13363 346205 391723 372771 367670 361579 354853 344779 310278 299554 291383 287311 285944 294064 301691
13350 301691 277176 261955 261365 261099 277156 261765 246643 212305 206931 209091 187811 212539 243069
13337 243069 238236 225777 224206 225421 212876 203367 167931 158028 157668 136858 136810 135192 135037 114682
13323 114682 124310 129274 139845 140274 146640 165823 160663 148215 150103 160143 166770 154068 125396
13310 125396 103347 119300 129865 118872 124956 131285 111746 104750 102858 104779 94111 87960 111111
13297 111111 117121 105398 88864 60742 64386 118682 131439 93717 74774 34791 54287 81522
13285 81522 108337 105324 102754 130458 134896 113657 125647 155716 148648 155921 150204 145046 142931
13272 142931 137618 152429 131094 121954 97705 72431 74827 67515 61146 39807 30258 29951 33835
13259 33835 48490 53014 36555 32247 35790 49984 66489 57139 62487 73520 71286 74803 67417
13246 67417 56876 31587 28968 50412 54332 63915 79667 91107 84033 93122 97605 113458 100075
13233 100075 102925 109014 89128 92371 84434 85503 83202 61229 63349 42905 25506 15367 35129
13220 35129 73939 96214 58549 49169 28960 20313 41808 44471 62613 63999 43957 37299 21459
13207 21459 1143 -3574 25384 27273 32243 30503 25757 5842 27423 32055 38615 39574 30981 47513
13193 47513 43637 44099 51893 62137 44492 47282 56876 72808 56096 27941 31911 -3187 11645
13180 11645 43644 9802 -21139 2530 9438 -10603 -15976 -5754 21776 31509 28271 53642
13168 53642 50747 25921 38795 38357 45340 38793 9948 15642 1813 -27484 -57548 -40974 336
13155 336 -9051 -7859 -15991 9911 34154 38061 50017 17530 22545 34700 7312 -4809 -9970
13142 -9970 5190 20853 4457 16629 31548 49237 70077 82590 109097 111638 122567 133834
13130 133834 125540 63774 51085 60393 76135 98504 107075 107110 122090 124392 132130 133556 134029 141452
13116 141452 141687 132578 146935 171185 173240 154406 131668 156752 190331 206665 202256 186732
13104 186732 152245 132755 157256 166653 152283 132116 143422 160478 134588 117011 144875 130522
13092 130522 123382 138031 137095 134156 134697 136274 152598 146334 147655 160092 137508 132759 120266
13079 120266 109001 114775 96816 81527 86950 90772 63725 65766 81108 82536 83723 63990 69197
13066 69197 61638 37705 27553 38292 38275 16608 3438 6305 10051 38516 62319 71717 69578
13053 69578 62940 62506 60911 71808 64265 79755 78296 71950 81956 65751 59777 75292 79595
13040 79595 107749 126307 142312 134256 128968 137115 131673 123860 124907 174651 201285 185751 152009
13027 152009 121417 109481 118194 116030 103877 98390 119253 148643 183335 151812 108062 118179
13015 118179 148209 137688 127150 130396 117598 130292 134863 151353 165394 147553 156439 145151
13003 145151 155298 175516 178157 177129 138320 103768 90058 64788 54742 43979 58348 94982
12991 94982 97267 103782 121731 147572 152017 118561 82291 33825 23427 21582 -9560 -57770
12979 -57770 -54434 -19885 -25520 -13500 8104 17200 -361 3704 -10100 -17347 558 -10191 -13876
12966 -13876 -6557 -25143 2152 -11822 -29086 17463 37016 -1988 -10436 -8927 -19523 12718
12954 12718 21454 10469 -29689 -45227 -41373 -18273 -18688 -9706 -2147 1198 -18757 -13612 8678
12941 8678 10162 18730 1014 -23405 4178 19468 15615 14697 -5677 -30978 -16934 1428 12690
12928 12690 -22558 -28523 -26424 -13351 -307 13839 11774 -20168 -18673 1367 17076 3823
12916 3823 -26614 -25647 -36776 -33892 -39446 -30612 -20355 -1544 -7553 -41148 -47614 -45599 -36813 -22405
12902 -22405 -23908 -38573 -43750 -13940 1144 -1454 -8732 -25046 -20378 -1198 -9270 17223 43337
12889 43337 54063 44528 9447 -3753 9571 15136 28224 -30362 -50023 -28091 -5684 -16658
12877 -16658 -31011 -38964 -48851 -47996 -37974 -8066 4533 36418 7757 -18742 5001 22428
12865 22428 22166 -1787 -21574 -18748 -9375 12422 11314 3766 -12890 -19946 -35171 -35771 -17602
12852 -17602 -234 9387 13926 -13182 -37769 -34441 -37837 -22918 -16202 10550 -15473 -48279 -52664
12839 -52664 -15223 22870 26688 10044 23097 10165 6344 9567 -19260 -24953 -9802 -4179 -37310
12826 -37310 -40683 -33476 -14057 9139 11449 13698 34954 18869 -12537 -18776 -23725 -12673 192
12813 192 1775 -11083 12467 44340 59751 45887 7802 15877 9151 14678 32633 45101 52088
12800 52088 31705 25245 31556 43278 41325 13339 -1175 10362 10209 4991 5353 -9678 5272
12787 5272 18722 11758 242 -3387 -20458 -24402 -16808 -15137 6939 29177 23371 33394 52696
12774 52696 56322 52390 61335 33088 31845 61606 39558 20989 15378 14903 27438 12127 21938
12761 21938 36778 28686 12898 22550 25012 36557 62314 46175 9757 -6171 -41773 -59351
12749 -59351 -42537 -4937 -1623 1077 -7824 -22465 -20358 -4030 16003 -1036 -22943 -1397
12737 -1397 19068 34855 43636 33503 38272 40510 57001 32586 -9158 5212 32695 22845 13230
12724 13230 9808 9083 43398 59156 58569 37454 23764 14389 7875 -11209 -18088 -24494 -41370
12711 -41370 -38254 -28969 -17510 -14845 -13726 -35872 -43735 -15058 -9096 3253 12688 12409 14095 -11094
12697 -11094 -9156 -7411 20170 -11048 -50443 -14291 14605 15675 -17754 -13941 -12938 -22160 -14704
12684 -14704 2556 27094 16657 2858 -4225 -8918 6765 18266 30986 32192 7220 2795
12672 2795 27173 7867 -2646 -17378 -22604 -19266 5154 3571 -17675 -11859 -5291 -5202 -8099 -30994
12658 -30994 -30078 -22032 -14664 -200 -13070 -16644 -22431 -45924 -38611 -36203 -46714 -56327 -42209
12645 -42209 -10445 -10940 -21884 -25587 -39612 -38430 -29628 -18539 -2976 -5483 -22089 -40860 -19930
12632 -19930 -5034 -8203 -22522 -6225 -6237 -14731 -10220 -16855 2318 -5625 -3402 11224 -8958
12619 -8958 -14166 -13031 -3205 -29481 -47176 -31027 -20721 -9256 -10262 -13697 -8374 -12533 -22539
12606 -22539 -21684 -25577 -35133 -25241 -23704 -21164 7961 17089 6448 -14051 -8670 6956 -2324 8259
12592 8259 4081 -21166 -28424 -46159 -49629 -36994 -25768 -42688 -46509 -47222 -29791 -4032 -3850
12579 -3850 -17715 -11811 -32493 -51847 -55930 -59624 -57726 -58390 -70575 -40744 -23143 -21690 -13977
12566 -13977 17934 33010 32741 10263 -9315 -9894 662 1414 -640 11267 25706 -10950 -29362
12553 -29362 -33024 -15766 -36618 -52879 -31665 -5893 -5680 6791 -4417 -5628 -13388 -20082 -21306
12540 -21306 -12132 -32304 -34261 -21278 -23611 -29895 -8320 3712 12607 -1676 -21311 23403 30576
12527 30576 3708 -3754 18221 25096 68157 100486 87945 78997 90951 83517 91697 98590 75558
12514 75558 15915 -21445 -9960 -17950 -15338 -3141 -15571 -9300 13410 16494 -4129 -25302
12502 -25302 -40351 -27700 1087 10661 24670 19047 4941 9292 -2532 -19737 -25724 -8227
12490 -8227 -11456 -5915 -2291 -8219 6 3502 26860 47243 65545 54788 57442 64380 122540
12477 122540 184493 258215 267444 279223 294778 296980 258030 154445 105473 93101 76570 61252
12465 61252 33198 30668 15712 -2307 15561 21846 28590 27797 33810 15229 -4854 2426 9338
12452 9338 12549 36776 20029 12371 -1111 8507 11837 9523 11595 17986 42460 35137 22950
12439 22950 61841 70493 58241 58966 70468 114136 177385 243330 272662 293718 323541 328998
12427 328998 279721 165520 92921 66099 46573 49700 40566 18337 -27783 -30182 -30546 -12408
12415 -12408 -22284 -34258 -9265 21713 17391 24834 42892 17100 -12072 -23889 -31112 -54187
12403 -54187 -59845 -55306 -37707 -55134 -63749 -16767 8186 21221 16135 -11487 -20789 -14156 3953
12390 3953 27954 35384 50887 62975 79755 74121 102341 92995 75508 51416 31812 51154
12378 51154 60092 44189 30109 16147 -11623 -25885 2768 14995 29100 13656 -24825 -27615
12366 -27615 -38734 -32486 -1065 -4024 3193 5160 6898 -16627 -42326 -23650 5829 9572 -7678
12353 -7678 -2173 17748 12184 1646 -4554 17664 8621 1023 -6786 2478 -6637 -24204 -35514
12340 -35514 -47368 -63033 -74883 -55604 -35503 -28189 -34105 -5723 57 -1955 -9985 -25286 -17609
12327 -17609 -7966 -42604 -47705 -45839 -51533 -59977 -74981 -53721 -59028 -58188 -34798 -28964 -13768
12314 -13768 -32374 -32342 -22934 -28529 -18499 -32135 -50933 -1836 14679 1512 -20824 -8259 -12517
12301 -12517 -12509 -9498 -5281 -35193 -52724 -51366 -48375 -37728 -45054 -43145 -12665 6349 -9747 -24538
12287 -24538 -30709 -35242 -33570 -11007 -2140 19598 39557 54809 32552 -10845 -21927 -17828 -24192
12274 -24192 -16740 -11489 -21102 -13280 -18395 -15705 11327 15583 7377 14598 28939 32117 13591 -43473
12260 -43473 -28680 -27177 -10316 -8703 -22299 3796 4854 -13777 -12462 -4234 10362 25212 9530
12247 9530 -18045 -8783 9845 -12377 -62217 -44269 -15118 -30806 -45798 -61578 -51878 -42258
12235 -42258 -27713 -13071 -7976 -17539 -22980 -50473 -37711 -19071 996 21749 25499 33901 35667
12222 35667 30155 -4379 3081 12443 3518 490 -9204 -16573 5806 31630 42688 33658 38705
12209 38705 29284 20089 2886 -1743 10573 16485 3204 -10831 -16072 -15884 -8384 11361 32141
12196 32141 19910 24468 17645 33565 50944 46854 25298 14958 -9922 8033 34031 32489
12184 32489 65986 125308 182715 211628 268124 316253 379456 440109 476623 469024 486740 496602
12172 496602 463384 392160 338806 298426 250263 207061 162368 118689 112981 74366 71851 56288
12160 56288 71789 72301 39249 43297 62074 65532 54543 80660 93718 73935 41015 41631 76956
12147 76956 96313 133112 120125 137806 193444 246694 304225 360037 404176 456419 517026 545727
12135 545727 570854 545563 472516 382482 317117 246449 166550 121702 109323 95945 87813 82386
12123 82386 73725 69923 60897 45635 43992 56084 31970 -1423 -20055 -36648 -35541 -30077 -36718
12110 -36718 -34753 -38518 -34221 -38705 -33619 706 21437 30454 21703 12354 -9181 -18987 7693
12097 7693 6692 5249 -5406 -15976 -32867 -41300 -44004 -11752 2294 1130 8988 -1352 2396
12084 2396 -4883 -14016 18710 34207 18873 -1619 -27718 -19472 468 12468 20882 17719 2875
12071 2875 -2234 -5607 -9687 -27534 -20649 -37299 -32728 -30132 -7351 24357 4558 22500 56524
12058 56524 47302 15086 9058 9375 29388 46285 21636 -13495 -25583 -10605 13169 7723 827
12045 827 -23201 -23087 19495 38028 40528 24735 36319 49716 74936 51558 30987 42523 62782
12032 62782 70514 51060 57694 41305 19718 14743 15564 33789 48026 29758 14819 7438 6194
12019 6194 -5034 -43227 -71098 -56155 -25044 3022 29877 23819 10193 10262 14614 25637 23618
12006 23618 2827 -8656 -4940 -5308 12007 6592 4659 11897 -7591 -19729 -16067 -17630 889
11993 889 6881 865 -9290 568 -5655 -41370 -36102 -25212 -13250 -9924 -1728 36662 41795 18808
11979 18808 9030 27512 46760 82630 90685 29240 -3027 -36680 -51359 -33835 -11473 -23555
11967 -23555 -29525 -11491 9494 -7864 -26513 -24973 -1290 10481 -832 -26728 -36359 -3886
11955 -3886 9878 7747 11856 18956 45144 61773 66592 49171 24465 13761 8936 168 7250
11942 7250 -8618 2378 2858 -4480 -23723 2328 30652 14112 13933 12289 -25203 -25467 -9606
11929 -9606 -7241 -16015 12317 40923 45623 47869 56697 60533 43241 25912 -5097 -24791 -25242
11916 -25242 -4187 -2561 -23861 -22489 -8217 11293 22908 21243 13168 -14536 -3008 28947
11904 28947 45854 46577 43693 18228 22659 32261 29607 36086 36136 11779 -948 -100 -4624 7357
11890 7357 8952 -4153 20888 44794 31682 19276 73697 107876 109604 93069 85781 106572
11878 106572 143833 151228 122429 101276 92601 93624 88738 110543 105298 93841 101844 87844 93973
11865 93973 132030 137242 146427 135895 117479 121832 144084 126030 124005 100412 92675 116781 134627
11852 134627 128632 105674 73799 74603 72232 76976 88796 102066 126894 124784 102187 96476 100144
11839 100144 77190 74619 46450 19082 35199 63259 63400 35034 13222 36480 68389 47563
11827 47563 13126 -11823 -8409 23829 40693 39527 17741 23079 14633 5733 -1686 779 553
11814 553 -34188 -60215 -91050 -85415 -23026 -8295 -10925 -5840 -11343 -20868 -28735 -53402 -60370
11801 -60370 -30882 -27444 -4374 22843 9695 -19649 -32138 -21634 -36784 -58248 -51187 -22323
11789 -22323 -19380 -18806 -9975 -24875 -25127 -1805 18991 19595 -14366 -26493 -7275 34741 22529
11776 22529 16318 18603 -3259 -13981 -10311 -17901 4324 -929 -25813 -37039 -25601 -16751 -32224
11763 -32224 -54806 -24885 15486 17681 -21556 -58109 -44816 -33640 -30217 -276 -512 -28269
11751 -28269 -22601 3831 -4215 -4635 3609 -1147 28569 42989 47635 9304 -40700 -22380 199
11738 199 -1260 -6087 -8392 -25835 -14541 -28528 -32301 -247 995 -13249 -6016 -3471 -8532 -42512
11724 -42512 -53677 -29223 -9946 568 -24654 -7098 28994 24238 -5506 3368 9426 9934 35108
11711 35108 32422 6842 11433 10425 14653 32829 34964 25021 20718 36587 39333 33471 25820 30814
11697 30814 40122 13662 -11482 -10562 -12035 -2629 -14170 -7655 -13834 12079 23717 20157 4762
11684 4762 8645 30125 27076 33507 57687 44221 28785 35789 54222 77818 67907 42361 43895
11671 43895 53901 44126 30513 14779 3291 8932 23403 29941 27754 36019 34552 -1458 8572
11658 8572 28649 23671 -182 3722 9329 9221 9555 28522 42974 24143 15432 16995 3072 12675
11644 12675 26236 41020 27463 12638 -2037 -5806 -12221 -4903 4529 9380 -7528 -17139 5929
11631 5929 6933 10927 31574 35320 39186 37367 -18292 -19754 10634 16415 19887 53922 71567
11618 71567 50323 27878 26992 33411 50552 32976 -223 15047 9659 -13569 14141 63770
11606 63770 69240 94533 134238 156855 176527 193576 200366 186717 152954 150504 148659 131072
11594 131072 145564 140358 119507 91287 66004 77610 92076 101237 118316 129838 138783 125023
11582 125023 157438 154967 150940 131653 85137 82951 72678 39719 2123 -23190 3146 46030
11570 46030 43064 37086 39580 30201 24163 11145 -2949 22992 25626 147 -14443 -23050 -16735
11557 -16735 -33686 -26367 11598 17086 15714 42000 34176 33260 30206 20032 10929 20168 19498 19503 24140
11542 24140 16565 48573 53823 54896 44275 60454 64379 65215 66046 57942 66208 59016 66108 78591
11528 78591 75169 94595 135822 178816 204029 219709 244234 234472 244073 256203 266965 264349
11516 264349 266189 224551 190411 201971 180566 181685 210223 202214 182031 206370 254685 307877
11504 307877 331326 330612 318511 295561 250123 225126 225479 196837 173459 158638 154261 139199
11492 139199 148552 134891 133908 129687 102309 78721 82533 82695 70337 80568 71773 66010 74575
11479 74575 48148 35531 30177 36311 27721 23128 28056 36182 28629 33897 40728 49587 19354 9816
11465 9816 -7812 -16620 -13503 20315 31607 23693 23689 41080 35882 35895 47511 60109 66705 53967
11451 53967 68189 84234 81989 73386 88409 129533 153724 161831 143600 156506 219678 250211
11439 250211 221287 194490 186722 177461 162012 146919 133148 120394 127003 115083 142426 175918
11427 175918 176765 168867 154437 169126 164490 154359 146689 169526 185874 178678 170615 150958 131063
11414 131063 124427 100731 71480 60796 57890 53200 45596 54182 56835 45905 30555 20384 51022
11401 51022 89501 98448 74142 37063 22728 58939 75088 59204 35520 41776 38080 30653
11389 30653 32683 50069 32488 15110 26755 43401 52701 38496 11979 37551 34860 45794
11377 45794 38775 10634 16514 14145 32749 28238 15313 36047 37558 51812 41745 22065 3676
11364 3676 33869 67291 77070 97579 99509 91164 68860 87052 109156 90129 88266 107064 122206
11351 122206 126982 120919 142758 116894 84571 75506 103997 108166 92237 90531 90428 105945 103178
11338 103178 100082 100749 94892 106245 126628 158352 169161 163285 140949 110583 110079 117047 111601
11325 111601 93448 102720 105140 105899 123108 134256 109497 111049 95710 114491 139671 139278 111008
11312 111008 81186 67016 84651 118189 108682 107129 135502 130512 114518 82977 51308 46283
11300 46283 65658 72738 87770 99011 115690 113514 139521 137640 154152 160479 143250 154943
11288 154943 159576 136009 127538 114894 128432 151096 164133 200476 235064 217937 191247 184007
11276 184007 170052 155492 160492 168544 190168 198029 238146 255344 280736 294695 284351 304439
11264 304439 304399 300310 280207 238468 198746 187328 215045 242567 209954 204372 222019 223198 222213
11251 222213 215787 213784 202104 206078 219482 245439 269312 291670 295237 288936 283975 284531 287348
11238 287348 290775 296438 299514 304652 332148 363595 349540 353241 351337 351889 349952 372850 408927
11225 408927 434022 452067 472759 490933 515875 524053 545512 571388 573255 618313 638371 645624
11213 645624 662375 674948 678072 724774 818705 897267 974945 1051653 1102660 1162210 1248366 1339031
11201 1339031 1416276 1511025 1641803 1764933 1899721 2028187 2248670 2531925 2851145 3263012
11191 3263012 3773596 4419661 5212146 6169407 7346668 8765429 10433822 12377975 14588545
11182 14588545 16923074 19281147 21484037 23369880 24775123 25572861 25654440 24986212 23698534
11173 23698534 22141608 20634096 19351986 18451713 17988612 18012382 18454706 19325613 20560682
11164 20560682 22007738 23417478 24643217 25460714 25772768 25506462 24627886 23205736 21351892
11155 21351892 19243853 17045155 14927921 13017014 11370608 9970535 8752364 7695159
11147 7695159 6876581 6212731 5663365 5195084 4846148 4593798 4399765 4254211 4162436 4084345
11137 4084345 4024615 3966248 3863791 3737932 3625148 3521335 3439649 3383733 3350416 3316011
11127 3316011 3307621 3329707 3406086 3465839 3559452 3679565 3827412 3981014 4169855 4391572
11117 4391572 4666233 5060071 5533601 6081682 6761178 7607365 8640363 9899595 11414853
11108 11414853 13278173 15564669 18321337 21500734 25072239 28903631 32803514 36575392
11100 36575392 40070874 43076842 45336794 46698285 47131165 46824955 45962247 44698304
11092 44698304 43072500 41234316 39482375 38321922 37979135 38495327 39727915 41416411
11084 41416411 43277967 45035070 46476182 47428368 47686748 46976479 45334444 42952422
11076 42952422 40121451 37002310 33576647 29836204 26000598 22356004 19139689 16416203
11068 16416203 14166176 12280828 10769868 9488474 8404739 7542343 6834760 6246774
11060 6246774 5771775 5373901 5015347 4699719 4441497 4242551 4079323 3974579 3859104
11051 3859104 3777539 3673093 3606111 3578086 3522331 3497065 3506906 3487278 3482388 3462451 3473259
11040 3473259 3525586 3559560 3583782 3624563 3716694 3896180 4126173 4394697 4743334 5182512
11030 5182512 5719887 6387510 7181704 8124005 9276808 10659862 12269477 14079698 16075035
11021 16075035 18189433 20313195 22289213 23957061 25186549 25837024 25895852 25331862 24233154
11012 24233154 22816120 21308546 19932600 18911670 18363924 18311114 18801515 19736160 20923296
11003 20923296 22238933 23512289 24536151 25093798 25165766 24675476 23548254 21825543 19672200
10994 19672200 17347061 15041179 12906323 11038956 9438226 8053732 6886259 5933349
10986 5933349 5139942 4485610 3965674 3562848 3211198 2935796 2744617 2564948 2383720
10977 2383720 2230831 2114236 2013077 1891970 1824773 1762618 1659987 1574611 1495196 1395505
10967 1395505 1329475 1296895 1253699 1180793 1103127 1084838 1037339 965588 935608 928971 896592
10956 896592 862175 829850 808789 736017 723879 707063 699286 682831 672363 676306 650811 648502
10944 648502 607029 585929 583169 567714 561195 562096 555487 545379 507414 489662 480593 495389 480360
10931 480360 451520 426603 417851 406174 417309 419081 390766 339889 333527 358826 397798 399967
10919 399967 394482 417107 400578 386171 374397 358742 372282 367911 367578 370163 380596 359829
10907 359829 322541 317374 303662 322771 330548 342208 356993 366441 374046 379858 351685 364045
10895 364045 392495 406188 394581 376012 386805 368544 365494 387880 382770 404443 428524 410036
10883 410036 404347 408690 392366 378079 359394 340657 335376 340354 364551 372719 374030 379051 354205
10870 354205 342418 347031 350454 371311 387875 391986 380646 378331 375707 368929 379890 390274 397052
10857 397052 391725 387146 389042 385958 421857 413623 429100 468061 447846 439268 445441 475786 498802
10844 498802 481334 487325 492104 493006 474283 461893 455210 445925 448389 478112 462187 480786 480569
10831 480569 514369 519681 539380 556565 558995 538523 537542 552863 580968 583327 605033 596941 595287
10818 595287 598508 651327 692781 752729 805869 822785 851114 891152 905471 917144 941301 979739
10806 979739 1020156 1055760 1083511 1115297 1145672 1191379 1232666 1277461 1369454 1429549 1492999
10795 1492999 1544770 1590621 1661040 1769875 1897831 2010679 2147797 2320130 2488248 2658275
10785 2658275 2848170 3079023 3336759 3624204 3986129 4407092 4892656 5502515 6238481
10776 6238481 7126742 8215846 9507261 11106711 13168511 15873351 19535333 24588637
10768 24588637 31574810 41102865 53455113 68136721 83851093 98730848 111035995
10761 111035995 119229688 121727315 117309645 106022155 89885416 72318911 56368439
10754 56368439 43635244 34321959 27809302 23226316 19928267 17554927 15804321 14427223
10746 14427223 13339756 12458412 11711923 11101801 10658347 10350629 10180939 10173286 10330168
10737 10330168 10646448 11143679 11805501 12674832 13753723 15143127 16980305 19414817 22752359
10728 22752359 27472403 34108104 43293552 55380278 70053718 86157274 101922785
10721 101922785 115480979 125042743 129018147 126043870 115988929 100355154 82092004
10714 82092004 64415420 49661050 38539470 30566312 24836434 20659403 17606643 15251205
10706 15251205 13402211 11870325 10560715 9476150 8587711 7805227 7137483 6556829 6105968
10697 6105968 5721116 5330761 4967321 4687229 4456678 4214610 3975345 3796758 3608161
10688 3608161 3449028 3264620 3094636 2964394 2816343 2673294 2564172 2454413 2369116 2276569
10678 2276569 2185723 2137558 2087180 2026438 1988367 1963314 1933049 1895332 1850854 1797781 1778030
10667 1778030 1776968 1769550 1719084 1686771 1652086 1616747 1545777 1469309 1426596 1402021 1341656 1311079
10655 1311079 1314447 1294762 1270668 1254149 1238110 1235982 1202836 1152684 1105668 1063572 994446 971957
10643 971957 946428 906427 880698 867790 840315 815880 806004 780273 772130 770928 742757 714759
10631 714759 682643 649398 627959 613041 568275 515625 467051 451994 435103 433941 447915 452585
10619 452585 451011 441077 388966 357872 387462 411659 424580 395139 368317 355625 376074 363152
10607 363152 363469 360871 380839 368004 351403 358886 379361 380248 389102 403983 392411 394778 416042
10594 416042 405339 400355 414119 437220 471344 485173 507907 490241 489896 501235 489940 475080
10582 475080 441570 413694 412081 394215 420205 454530 474493 530879 608965 666294 716152 721854
10570 721854 699189 729553 730171 661856 569913 521052 486197 449723 387447 350638 312995 285383
10558 285383 287087 284149 299656 308205 301485 277026 263482 252127 242164 236917 201088 182402 160910
10545 160910 134762 131300 104652 125647 145951 184567 218230 217829 195406 180179 177911 163558
10533 163558 183511 177831 182652 190555 194371 165850 164821 173647 175762 175874 176911 143256 102799
10520 102799 100445 111850 140238 144298 118517 107087 113649 134475 154563 154803 186527 203222
10508 203222 213625 242681 274202 279504 273629 248693 245113 286680 297788 278061 280660 304178
10496 304178 323843 327681 324717 303943 267533 247959 269036 269183 260177 223783 203562 191773
10484 191773 173003 162981 168067 178493 193377 247879 283357 274831 288329 312242 306759 289947
10472 289947 296988 334822 360627 353843 344702 400857 430740 399726 374774 374822 364841 348157 335917
10459 335917 345458 348364 373006 399445 409346 427945 453954 447988 455615 469525 483776 497562
10447 497562 523708 582733 610353 619086 629118 638612 615498 595411 566462 533913 500698 499366
10435 499366 483687 422358 380052 382800 400248 403261 405862 411536 422866 428232 438200 458755 463876
10422 463876 463326 469253 481932 481716 493242 489163 499292 522369 539476 535851 533273 555641 565014
10409 565014 558876 544904 532397 508603 528003 536754 547867 556248 570305 605463 609341 641355
10397 641355 663843 668762 635553 653448 696602 710218 713755 736773 781827 801269 830014 894230
10385 894230 937099 988494 1001226 1025154 1096057 1167977 1195938 1206893 1233735 1232891 1279449 1309666
10373 1309666 1356330 1429479 1509596 1582307 1668611 1774155 1878164 1956816 1990981 2046747 2133340
10362 2133340 2194505 2296746 2362864 2431010 2487204 2586065 2737467 2868571 3005473 3160095
10352 3160095 3334464 3528464 3753676 4036983 4356229 4700837 5150850 5684785 6306415
10343 6306415 6998568 7722377 8634551 9677822 10770588 11883596 13110484 14539291 16110543
10334 16110543 17825072 19825246 22339202 25593400 29937529 35997013 44650598 57334045
10326 57334045 76063277 102030941 133327163 166971628 204783934 250109064 295723448
10319 295723448 323911342 331553178 337640396 343889593 327706425 283033591 236815012
10312 236815012 202546206 168753983 128905845 94658013 71567803 56558640 46447154
10305 46447154 39297239 34030900 30064926 27009208 24508576 22465606 20796614 19306447
10297 19306447 17895661 16702097 15616762 14506131 13410968 12399611 11494766 10635873
10289 10635873 9822102 9100646 8467406 7952390 7496631 7102787 6762063 6404649 6061237
10280 6061237 5759338 5454092 5193108 4969372 4760390 4581277 4432042 4271543 4076422
10271 4076422 3925191 3762224 3591937 3444395 3328510 3217711 3119103 3016382 2951351 2896741
10261 2896741 2836272 2756678 2689720 2617622 2513199 2409670 2311914 2263242 2191912 2118641 2059407
10250 2059407 1992812 1935696 1885331 1817771 1761134 1717466 1667368 1640085 1593339 1546901 1519224
10239 1519224 1475368 1441298 1396536 1373006 1356242 1305483 1254356 1202250 1159840 1092920 1078394
10228 1078394 1072014 1046462 1027408 1009969 1004030 976515 935336 869553 836919 820961 812663 792595
10216 792595 794686 783158 746770 711020 688805 708686 706798 687061 691721 691693 689759 678260 660985
10203 660985 641900 626865 637806 657326 627351 644500 649873 619535 595445 590982 584532 568570
10191 568570 576096 572002 552988 531338 487050 455609 436192 382967 360863 356978 356362 349679 340850
10178 340850 344050 315908 269826 251411 237607 233673 245434 238860 239270 257017 243533 220284
10166 220284 206028 216625 252683 262341 253055 250860 265383 268677 259804 236097 257827 280055
10154 280055 289378 299265 308412 279337 261230 257310 285454 295625 268796 268800 233552 202092 157030
10141 157030 154840 172596 165967 131341 127456 129789 125181 105015 88576 81979 104730 135417 133037
10128 133037 148515 170874 193189 216192 219340 218068 210933 220396 211816 209244 221151 206773 208761
10115 208761 187835 184272 195619 195318 239388 266503 237376 230471 214677 185859 151241 131013
10103 131013 137288 164660 171939 128207 143420 142478 169375 190500 188307 192284 188868 193703 204364
10090 204364 229001 205926 163910 161392 146002 136267 108609 81944 37160 31365 57181 70698
10078 70698 66740 54025 86690 132027 149386 144482 146182 144764 136891 131967 121040 105303 97284
10065 97284 95021 102705 86685 68278 73092 84227 105858 92297 88966 100341 89605 80713 104414
10052 104414 123297 112538 112602 102582 104665 104182 124802 117736 116424 134013 142005 124789 104962
10039 104962 102532 97398 103237 127932 124276 133172 119590 119470 130887 142765 166334 194577 225661
10026 225661 279540 357137 374042 349462 391547 454815 460539 361135 258566 209359 189680
10015 189680 205595 205098 163922 147956 138998 145730 152301 168783 164875 142557 122583 128528 121629
10002 121629 110554 107921 104759 71202 78181 85696 61341 58876 92602 110703 107468 98652 90180
9989 90180 94859 116042 129289 127226 163534 189766 173368 156038 143470 145369 169420 143648
9977 143648 119394 120248 107712 106299 115462 125734 132208 131792 102221 85368 94231 97612 89988 92173
9963 92173 99534 134561 187997 201969 200933 187122 183164 174069 159448 150641 160983 179427 169638
9950 169638 195557 215497 240967 254358 246992 249599 235339 232500 254365 260820 295795 307947
9938 307947 311442 299564 286918 277442 285732 308357 320743 341041 334731 309964 307735 344025 351262
9925 351262 341702 390905 430900 498842 617997 732617 897918 1059757 1230869 1461336 1690117
9914 1690117 1870218 1981382 2041419 2055857 1998027 1782925 1515812 1308364 1111751 911490
9904 911490 719109 554496 435943 387035 360186 329738 323148 312580 317058 293172 260063
9893 260063 268651 250276 253219 265521 272302 271943 271258 298807 300228 304126 302311 283331 304781 336237
9879 336237 308286 305744 304117 308071 329145 328675 327185 323358 340374 354253 355795 342518 324942
9866 324942 291023 274189 245712 235881 244491 236716 221812 215769 206701 207335 201146 202612 215839
9853 215839 202372 200279 200574 194411 207513 203679 168443 179320 197055 166119 133630 123936 95130
9840 95130 125372 127792 105383 118645 121140 94748 109428 121387 100267 119038 143127 142230 143268
9827 143268 129201 135708 124813 101230 79769 95276 112911 145351 159356 142414 124682 106660
9815 106660 94290 67237 57002 85075 118032 106560 100991 110639 85993 101177 114603 117159
9803 117159 137090 139525 143767 145958 131226 124829 132149 114585 111535 150452 157318 137709 110245
9790 110245 93556 88259 111349 133266 128055 125565 140399 157173 175691 200418 177699 175075
9778 175075 152583 169837 161343 141213 116526 129024 158009 142004 100101 67209 94946 114870
9766 114870 119097 93445 74186 106559 111707 96418 114041 129441 122232 105107 108854 132340
9754 132340 144158 154860 150723 143873 152175 139806 112088 96406 104215 124089 134460 123017
9742 123017 152998 185266 185840 164616 160028 185577 219305 271130 309924 335562 339342 322507
9730 322507 317977 298890 262196 204713 151462 169797 187748 164747 163347 150328 171954 203783
9718 203783 194873 188355 196470 199743 196615 172806 163733 169284 198989 228871 235402 237406 225415
9705 225415 223290 220338 204880 196431 199096 200571 215585 238058 262055 293261 330259 405098 492937
9692 492937 567667 634760 699477 749762 735258 664159 614332 562926 492091 412890 342152 279534
9680 279534 245290 238638 237129 229719 217668 235509 270318 292229 270688 260961 261527 253995 259640
9667 259640 261325 264359 240115 202131 207523 251314 268784 261248 284851 277730 267864 248027 256781
9654 256781 277167 289527 330036 356522 345517 360467 365715 353956 361035 376814 390460 420842
9642 420842 434240 433015 429497 429609 467165 518196 581209 670976 798943 953619 1155970 1319434
9630 1319434 1477874 1621475 1689336 1700947 1604744 1417932 1212237 1006889 871493 770971
9620 770971 701388 654857 640049 631937 622921 638264 671463 665951 672840 696025 728152 772890
9608 772890 810899 860006 892535 943571 975507 990229 1027814 1083466 1158663 1226703 1302095 1371551
9596 1371551 1473671 1611595 1750829 1906940 2142342 2405345 2723722 3117097 3570488 4111385
9586 4111385 4690683 5294428 5881109 6446735 7008029 7518494 7976711 8414495 8836345 9275902
9576 9275902 9767189 10349297 10997252 11768178 12625282 13535409 14515703 15550678 16608458
9567 16608458 17678972 18783500 19841424 20875063 21854580 22752880 23556775 24241311 24846595
9558 24846595 25384349 25805759 26148628 26462893 26816451 27221223 27682528 28097433 28411228
9549 28411228 28577959 28599274 28516830 28447750 28359912 28263834 28176494 28169082 28191911 28222782 28270687
9538 28270687 28309882 28281148 28162491 27916934 27505791 26899118 26113871 25229826 24299111 23372718
9528 23372718 22449442 21554158 20642322 19691210 18765203 17875460 16960443 16037508 15173143
9519 15173143 14392727 13698558 13115384 12636036 12255797 11949094 11689514 11489701 11320229
9510 11320229 11180799 11025186 10893751 10820740 10835524 10917501 11087331 11312455 11538254 11724368
9500 11724368 11930564 12102922 12228418 12369256 12563201 12885785 13398438 14085600 14956145
9491 14956145 15935892 17051356 18267999 19538047 20812003 22072388 23297416 24409740
9483 24409740 25400533 26303782 27135969 27920951 28640434 29350460 30040075 30720142 31352330
9474 31352330 31895999 32317597 32596170 32824026 33003793 33189036 33379212 33494062 33561170 33580325
9464 33580325 33573251 33538861 33452595 33336672 33173810 33008575 32869600 32767312 32719148 32625448
9454 32625448 32463713 32244290 31872018 31270170 30352039 29157426 27784834 26367581 25013801
9445 25013801 23718009 22502087 21344753 20233246 19172459 18197393 17277369 16423940 15623089
9436 15623089 14842632 14094346 13367577 12636488 11923204 11234681 10531331 9808507 9109555
9427 9109555 8391613 7679735 6983714 6295644 5630701 5083942 4588874 4133032 3737883 3403940
9417 3403940 3131855 2905958 2713469 2568889 2420873 2259464 2110872 1997253 1928125 1866131
9407 1866131 1784407 1707903 1620673 1558687 1495691 1457510 1409613 1367023 1338924 1317281 1296009
9396 1296009 1272569 1251079 1199344 1177600 1221751 1270726 1299007 1368349 1481747 1642022 1829181
9385 1829181 1993299 2110653 2166205 2142549 2016445 1798177 1512021 1287925 1128979 998612
9375 998612 910910 864379 835193 792186 754407 749718 714873 726782 718960 670320 664241 663856 626913
9362 626913 599313 585141 551405 544751 588185 613807 603612 595368 555634 514651 495209 491053
9350 491053 491005 470840 472167 487220 476112 449386 430920 410100 388528 380420 399923 433131 403926
9337 403926 401213 403315 408787 403794 413543 387711 372219 359396 355379 388491 389503 374594 373639
9324 373639 366537 378610 401144 407256 405493 387818 358490 299408 304570 332982 329673 318251 321288
9311 321288 316577 326456 333391 318553 305988 264630 251587 274620 294135 284539 262636 256685 253193
9298 253193 256056 239148 231292 252749 266422 238268 240485 245290 239769 270955 289291 272426 253881
9285 253881 225934 219448 229543 252935 254438 272225 267183 273939 287421 283685 258447 264975 284755
9272 284755 283569 275713 292327 281587 255565 213803 214337 225683 214844 223988 228382 228946 223036
9259 223036 240876 267273 281149 255387 243546 264314 282848 251949 253403 279149 284726 277152
9247 277152 262930 250416 250611 255879 284967 298346 336311 342158 323068 334207 359753 342529
9235 342529 319135 346552 389319 414979 440389 465728 472503 522605 608099 703478 799074 948085
9223 948085 1121667 1303743 1496831 1696723 1867837 1984529 2042472 2054846 1967605 1841560
9213 1841560 1677189 1497462 1359929 1228952 1134322 1093497 1115855 1118454 1140606 1207361 1288340
9202 1288340 1391472 1553553 1755633 2031466 2338692 2621532 2851083 3040033 3157872 3183378
9192 3183378 3084975 2894986 2676485 2445502 2257922 2119622 2045247 2048099 2131698 2253519
9182 2253519 2497911 2807949 3158907 3516093 3859995 4180482 4438404 4552666 4513630 4399234
9172 4399234 4191987 3917267 3629674 3367731 3132624 2891916 2719852 2624514 2613796 2665684
9162 2665684 2774531 2979010 3315952 3716840 4217548 4745478 5334333 5936703 6462012 6849433
9152 6849433 7071602 7165378 7132570 7000232 6867099 6721343 6629549 6558504 6462657 6350676
9142 6350676 6155585 5888924 5623327 5463742 5361873 5355134 5397071 5552418 5723860 5899946
9132 5899946 6078854 6241297 6377667 6543056 6758012 6990651 7325276 7745795 8187952 8588487
9122 8588487 8908137 9096655 9078524 8851450 8497615 8055618 7674236 7387888 7256046 7243607
9112 7243607 7332281 7519627 7799350 8143405 8555071 9045583 9587828 10092574 10561646 10919327
9102 10919327 11045240 10935460 10607964 10111784 9546017 8956710 8387351 7863644 7404607
9093 7404607 7087284 6916762 6888468 7002213 7298894 7744760 8353572 9185267 10211438 11337160
9083 11337160 12511457 13631207 14500044 15003411 15021995 14626024 13837460 12788643 11724588
9074 11724588 10764106 10020346 9432571 9013686 8713459 8452300 8279621 8255728 8359447 8582956
9064 8582956 8883975 9257065 9669510 10103463 10425465 10604973 10654960 10594191 10441863 10231176
9054 10231176 10001718 9792102 9680676 9648582 9643162 9647235 9644632 9602108 9487762 9382177 9310893
9043 9310893 9303498 9410543 9574184 9769002 9907063 9942636 9882079 9746875 9586727 9477368
9033 9477368 9479099 9557691 9626643 9679103 9683628 9537492 9236433 8796761 8302148 7815048 7388740
9022 7388740 7042818 6761918 6571121 6493406 6518034 6588797 6752455 7020011 7380701 7820387
9012 7820387 8413485 9078785 9751590 10362981 10813830 10981162 10859314 10360697 9520783 8469180
9002 8469180 7377150 6380667 5538971 4893445 4436864 4194158 4060998 4048983 4178362 4458559
8992 4458559 4812160 5242740 5707212 6173050 6593131 6947860 7133238 7142787 7001771 6684819
8982 6684819 6214293 5652598 5057401 4476977 3987259 3630573 3341843 3194410 3199368 3297764
8972 3297764 3512253 3787120 4140893 4569118 4958372 5281335 5461546 5439052 5259811 4892424
8962 4892424 4388498 3844672 3310191 2840033 2456356 2197679 2014577 1889308 1805931 1764214
8952 1764214 1754676 1809172 1917505 2067080 2228350 2418491 2584319 2751214 2878251 2933144
8942 2933144 2881644 2733339 2536854 2281066 1994201 1703929 1471028 1276693 1141390 1021053
8932 1021053 931693 864691 799947 750584 721269 674773 661591 640357 629002 635026 608717 561427
8920 561427 547358 540665 533089 516926 519642 536759 553330 532872 530170 533896 510517 494082 468783
8907 468783 450336 452954 449269 425403 432237 447022 480043 495066 487176 497986 513863 510832 506338
8894 506338 521949 504721 502747 494725 527514 545770 536266 509487 478270 448593 437900 440022
8882 440022 438436 462513 472188 459800 444172 443837 454742 469814 462831 473424 457755 458699 475423
8869 475423 499043 558365 579971 565253 548511 563152 549126 525941 512986 486247 455211 456568
8857 456568 484134 515957 520263 540373 551651 551710 534010 515987 521735 524805 554303 568584 566336
8844 566336 560336 556711 555948 557779 579953 589855 571146 548067 530673 497271 482772 503648 523477
8831 523477 559138 584501 570064 548137 555165 547728 533388 556276 548170 536893 524771 527754
8819 527754 550143 554924 550019 584992 600317 602433 601933 609408 610569 611388 619604 598557 604248 591672
8805 591672 556822 575253 576857 552671 558228 558833 561427 563080 561682 576569 569442 622197 661304
8792 661304 661915 670484 678824 697697 688542 670766 672507 655360 676753 670447 649395 660707 686256
8779 686256 720220 717484 722833 743182 773321 789184 773997 751773 779499 793327 785098 788872
8767 788872 798018 800200 812707 823853 833206 841378 862607 879889 887192 881696 889859 922990 946035
8754 946035 982459 1001312 1012184 1017056 1031619 1028664 1021880 1040018 1073553 1095246 1089499 1100931
8742 1100931 1111627 1167281 1210116 1227389 1240848 1247087 1282778 1302218 1336551 1344155 1373242 1395912
8730 1395912 1400850 1404367 1408141 1431326 1442439 1463736 1489687 1502536 1507572 1537949 1567104 1570573
8718 1570573 1571211 1598058 1645733 1685785 1698715 1737382 1771359 1791218 1810945 1831292 1844890 1879239
8706 1879239 1894495 1918717 1943243 1978145 2024759 2058014 2099073 2154916 2199539 2212070 2239796
8695 2239796 2300974 2333268 2366961 2437711 2502776 2570830 2632753 2683836 2754596 2872254 2994583
8684 2994583 3071452 3157827 3273446 3406730 3575981 3749598 3916655 4099830 4300644 4532381
8674 4532381 4843375 5199292 5597071 6094736 6728142 7473847 8375435 9457737 10703523
8665 10703523 12110336 13632392 15162772 16601660 17828788 18781197 19324104 19344530 18938306
8656 18938306 18213942 17326170 16374275 15456228 14637476 13934610 13343408 12869733 12539570
8647 12539570 12348127 12350475 12580890 13022206 13678639 14533746 15586397 16848790 18269050
8638 18269050 19809226 21423113 22964795 24367420 25557342 26481532 27169958 27568331 27665685
8629 27665685 27604862 27470753 27357120 27307492 27379927 27597663 27950310 28446339 29113161 29973887
8619 29973887 31091165 32468492 34135436 36055307 38214566 40644839 43371217 46382833
8611 46382833 49656407 53195673 56955052 60926244 65076167 69289525 73447989 77467963
8603 77467963 81267772 84738938 87721224 90054481 91676391 92540835 92704189 92195862 91090784
8594 91090784 89530516 87681950 85655522 83536423 81426865 79488195 77694384 76077583
8586 76077583 74575464 73129507 71734493 70389248 68964707 67341176 65487112 63318287
8578 63318287 60723922 57769810 54556050 51193884 47727628 44332696 41195274 38442931
8570 38442931 36178576 34424039 33162646 32355280 32014834 32094259 32495996 33141854 33976563
8561 33976563 34968608 36031981 37162212 38314464 39355649 40241298 40839004 41136873 40975864
8552 40975864 40164616 38738774 36788055 34434279 31806902 29081514 26428440 23967412
8544 23967412 21773760 19871712 18217007 16758144 15494209 14426749 13473188 12522609
8536 12522609 11636167 10912819 10330105 9899785 9521830 9221293 8988395 8814644 8673167
8527 8673167 8581521 8521308 8515616 8577736 8702245 8942363 9277154 9715388 10304312 11011003
8517 11011003 11851589 12840522 13985933 15243942 16615184 18068975 19525709 20994447
8509 20994447 22417713 23812912 25113544 26236277 27104454 27727350 28109669 28247310 28063815
8500 28063815 27547830 26735297 25658715 24365947 22920370 21409692 19979492 18731203
8492 18731203 17693976 16978706 16648628 16704484 17093945 17795249 18756602 19868852 21057708
8483 21057708 22222015 23292150 24238135 25016106 25584311 25977495 26189197 26263333 26150275
8474 26150275 25789996 25129761 24151193 22848544 21219631 19358849 17359983 15343257 13464714
8465 13464714 11775676 10334337 9141623 8126181 7275076 6578043 5997468 5517056 5122319
8456 5122319 4821743 4566765 4361619 4181526 4008306 3881579 3779366 3676362 3576033 3488658
8446 3488658 3439599 3437415 3463878 3503685 3597639 3738565 3915203 4134294 4432389 4810016 5218644
8435 5218644 5687252 6144086 6640119 7123875 7639357 8109793 8577101 9025373 9402159 9655797
8425 9655797 9767365 9703488 9447383 8989105 8380079 7676881 6988335 6338329 5702029 5146469
8415 5146469 4730177 4435198 4277737 4229604 4298560 4517608 4797088 5150023 5598635 6075805
8405 6075805 6624641 7224628 7814274 8384476 8910148 9288302 9466331 9441665 9185899 8735958
8395 8735958 8041412 7216949 6360176 5544909 4841324 4209838 3704374 3252697 2856866 2556572
8385 2556572 2345015 2125908 1933418 1791627 1675636 1564731 1475554 1420705 1380553 1353606
8375 1353606 1289032 1231110 1174496 1161804 1117281 1063806 1025065 999227 983399 934985 887075
8364 887075 840043 825238 815029 828142 815855 800046 802164 777761 738074 706117 674680 680360
8352 680360 692193 685931 656207 633818 624697 609426 610567 609851 599446 608769 591906 549384 567632
8339 567632 544374 504447 460186 462996 509247 503947 482489 463509 477011 479467 494089 477484
8327 477484 454833 411362 411086 401828 373515 376494 425585 441743 437410 429780 434108 427919 405028
8314 405028 408086 403841 390715 390643 364337 356640 370098 358548 348499 341324 339452 344181 344681 354663
8300 354663 364422 372092 382514 357944 341773 335979 333860 324300 313009 317059 329943 329223 311737
8287 311737 332972 342368 335419 330650 350684 332984 322975 335915 360863 333146 308790 310620
8275 310620 304026 268512 262578 275723 295925 307845 314242 300788 287306 300710 301522 324044 341427
8262 341427 334083 329904 349965 342237 341021 332339 312207 289028 293690 326189 316826 290307 292047
8249 292047 282576 299015 280485 281348 262331 268412 277384 278158 275479 281194 269883 237097 249608
8236 249608 245735 264883 277602 252882 237097 243183 240616 235078 201290 213379 250336 238424
8224 238424 223630 213715 208125 183228 170376 188745 213039 209507 188043 171980 154552 178910
8212 178910 182870 142090 131838 157409 191839 203724 217073 209552 190746 162430 195985 203831
8200 203831 206338 230187 233415 231188 258738 252889 234122 234719 267728 266998 257075 279998 294447
8187 294447 286077 294318 321251 330092 346649 312678 302367 297319 289586 317857 320050 298032 274498
8174 274498 250755 233829 230092 221540 231962 242529 241677 241991 245752 241606 252794 264915 280042
8161 280042 270575 248670 248199 270092 258961 268855 281419 260061 253321 266322 279516 266459 282124
8148 282124 286130 263384 265949 243861 236393 215943 213725 181841 123970 109417 139005 171471
8136 171471 198931 199130 177734 143608 162637 191184 153542 136541 120925 143258 146815 152522
8124 152522 171235 172734 170207 171559 139047 115875 130282 149629 160990 181362 202495 202790 194359
8111 194359 218025 240147 240640 225920 229025 262657 251077 238042 221533 208760 194048 198975
8099 198975 233439 238796 185618 176079 212295 230038 195532 166549 150818 158890 176954 209705
8087 209705 218008 217470 252907 251692 254601 267214 245544 223098 208523 196749 216220 262335 294804
8074 294804 277955 261401 283817 279250 245218 220939 218730 224042 225921 198277 148241 113025
8062 113025 128241 128901 120828 128126 121798 98755 90241 108723 102535 70517 76354 112293 120334
8049 120334 126877 118115 102672 85064 70996 65612 72284 105693 119542 109533 95366 108170
8037 108170 119787 108145 113198 107003 78594 55296 56800 77611 96770 107637 86119 99195
8025 99195 137788 154836 126499 123412 142112 136239 116126 117262 129118 117971 106008 124331
8013 124331 128599 117566 110215 108899 85984 60999 66088 91498 110341 139244 158500 156450 157506
8000 157506 144987 122192 137149 126029 116909 100833 103543 107645 125715 139126 145863 120158
7988 120158 105739 111559 95485 71577 86056 108077 127251 139147 140354 160529 139515 115914
7976 115914 120818 105150 95737 98673 122495 121290 87891 82970 45030 56833 68353 81929 93362
7963 93362 120834 126391 114160 98616 110046 104123 103663 126644 116276 76222 87451 107336 125566
7950 125566 111194 96171 104148 100060 109685 105583 89750 87729 97177 111527 113215 121495 127242
7937 127242 122109 109153 118321 115162 94401 84038 69179 59375 59352 39745 71861 114213 103572
7924 103572 90547 105924 93914 70120 64592 66903 64089 41957 30991 67986 92314 114121
7912 114121 101392 76812 68490 56144 32670 28787 31757 45932 63110 77460 82209 79087 75401
7899 75401 56008 36947 53965 59513 57749 71581 80631 81076 89585 80164 84134 98447 80146
7886 80146 73768 85189 79132 103311 126258 108083 110713 134653 118796 106709 121881 108718
7874 108718 90288 76190 56320 59491 61451 65860 70289 59305 60570 82305 100615 71638 57055
7861 57055 50300 46465 36893 49779 50641 72349 78593 68019 78907 80641 97148 108527 92691
7848 92691 65800 43963 32589 64106 48409 34077 49658 80327 79783 66406 54681 47606
7836 47606 47903 39564 15691 41719 69057 74572 100737 64028 17013 4822 20200 55963 79982
7823 79982 68384 41655 17319 17890 34860 43989 51093 54663 39660 46903 19570 4207 30839
7810 30839 73134 96377 78371 72496 62666 65118 59061 67364 68616 51745 67981 61210 40949
7797 40949 57456 42037 31828 11176 16476 32225 12692 12477 22671 63047 55384 28247 19013
7784 19013 28836 50534 40247 22834 21870 24934 31358 46348 55384 72930 51739 47531 25193
7771 25193 11806 10828 40071 40147 22798 11491 14902 22933 53747 37596 18420 29820 28228
7758 28228 58047 65748 59831 36148 20808 -16414 -13189 9855 9955 31896 56234 34064 -10717
7745 -10717 -2273 20958 27819 38591 37894 44685 27774 39279 56811 66928 53019 11292 -3042
7732 -3042 -13860 1306 28163 38003 47981 49732 76817 58756 56746 39450 5385 12082 6160
7719 6160 4561 41541 52742 22762 -6549 -20801 5954 43354 58133 26269 7006 2829
7707 2829 32680 50295 40847 32298 26939 21662 -7894 -17825 273 20156 30450 30880 18770
7694 18770 -6964 -24881 -20051 -5199 28324 49901 47301 48427 48065 25265 16807 1294 19139
7681 19139 28989 29765 25908 32909 27979 4104 7867 63668 86450 85807 72055 39703 17232 16756
7667 16756 36195 37784 52236 39880 32497 11566 7849 -14126 -28641 -11723 29109 48929
7655 48929 47219 54394 54520 46578 30119 43144 87079 76971 57651 63447 60415 59147 49511 50925
7641 50925 69354 47995 50897 42175 31234 16901 357 8718 14542 14696 14961 -17075 -33676
7628 -33676 -28527 -20610 -36147 -32815 -25875 -6346 -469 -9950 11576 32056 40100 32401 462
7615 462 3020 49873 30828 -16222 -11464 17115 37471 39057 46020 46290 4464 -13294 -8334 9721
7601 9721 32888 48717 54465 35293 23937 4774 19278 28366 24563 30856 47056 52402 49091
7588 49091 39998 25185 31987 50408 62785 82792 68867 48880 41408 32931 23860 2846 20575
7575 20575 15226 26547 78212 78024 70492 64530 38461 24531 27521 40330 36318 41381 21197
7562 21197 5666 16196 31483 16095 4418 -224 19245 13321 14589 26049 29436 18205 15633
7549 15633 6831 37399 53441 45845 41422 47706 53017 38909 20124 31713 16940 20912 37325
7536 37325 30617 16757 25211 48730 52417 38748 40795 39009 43117 49470 68240 50666 27633
7523 27633 -2569 1760 -13330 4853 41180 39372 44628 59242 64151 69561 85440 93144 81704
7510 81704 65256 56364 37092 50003 55747 26780 53323 64370 39699 23141 -4271 -41779
7498 -41779 -22151 -2873 -22923 11843 34052 19684 14765 12615 12752 17370 11262 32443 44589
7485 44589 33212 30555 34972 57306 61209 26013 14624 29156 37691 33508 54818 70663 44110
7472 44110 9419 3653 2712 10857 20749 31118 24194 55112 40342 31885 3909 31465 58675
7459 58675 22294 -8976 9669 26565 25381 6799 -4241 -24231 -30026 -25344 -18678 -6113 199
7446 199 -7993 -16656 -29391 -18943 -4432 -10498 5304 17400 7108 11394 21689 14172 13226 -3256
7432 -3256 1078 8142 -4350 -2180 20686 34525 35250 25911 18784 -1076 -23829 -21991 8268 9060
7418 9060 -6519 8202 40069 10468 -699 8957 49403 51155 27575 3761 -26859 4557
7406 4557 41955 52816 24862 -508 1510 8034 4727 10785 34387 52461 40512 26708 21930
7393 21930 -14191 -17885 -20015 -29273 -28934 -11605 -10188 -36087 -27041 -6628 43297 51868 36407
7380 36407 15727 3456 2995 18872 41793 27530 13794 -5243 -658 26557 28604 3141 -15663
7367 -15663 -21883 -11816 -29356 -19959 -35366 -28087 -22066 -11210 2492 13698 43876 47500 32019
7354 32019 27376 36301 46098 59153 58951 13145 -20294 -12701 -5976 -19835 -12783 10679 15501 16084
7340 16084 3403 -27055 -32961 -17133 -22631 -21297 -34705 -37084 -32484 -12433 -16705 -6771 1752
7327 1752 120 7249 -12614 -8252 16659 39862 32065 13389 17135 20384 40169 44564 7940
7314 7940 30745 31078 16360 -409 -26517 -29476 -24602 -18255 15075 19173 43295 25140 15690
7301 15690 18918 37488 1752 -14354 -22241 -19268 -5901 -7473 -6803 -14443 -15160 -8747 2026 -11085
7287 -11085 -19587 -31338 -25698 2641 3011 293 -9044 -12058 21583 17646 3176 25932 19326 -11850
7273 -11850 -22013 -21737 3040 9801 23074 29547 777 -13651 -27681 -6012 -24089 -18501 10060
7260 10060 39182 44962 52931 63273 56512 44087 29745 34529 21455 -11785 -1603 30472 32452
7247 32452 4584 -7371 -31773 -36068 -34573 -22349 3125 -15083 -42765 -43284 -27722 -29216 -4596
7234 -4596 15016 6833 -30617 -33275 -2956 2514 11734 18978 28945 26210 11346 12555 9073 -24706
7220 -24706 -14530 -4417 17851 22786 10850 -4817 -6427 -2299 -6633 -11991 1757 305 2737
7207 2737 8172 22901 25646 14658 24969 26901 30175 22922 33231 27723 -973 -15125 -21186
7194 -21186 -10808 -23058 -30135 -7218 1512 -19460 -46782 -40832 -12824 5776 -15444 -31940
7182 -31940 -21102 -14484 7828 2377 25680 46597 52972 41567 24375 40825 51031 38978
7170 38978 45638 41056 21105 10340 -5966 -2651 -12746 -25968 -49657 -39790 -7155 7232 16698
7157 16698 26609 17760 14916 17620 14344 8217 -1968 -15130 -27552 -20738 -581 19205 9665
7144 9665 7655 -1487 2221 16717 20736 16825 27939 18038 6087 -23067 -27081 -35534 -33402 -21173
7130 -21173 -1380 9623 -3535 -43039 -43727 -8291 174 -2531 -1811 -8955 -7093 -18071 -35683
7117 -35683 -20541 -11666 7549 -412 -14182 1510 46277 51452 48456 22847 8910 26667 51701
7104 51701 61509 50203 26595 2093 10441 50101 46761 -272 -19476 -25423 -18811 -323 9035
7091 9035 30161 46718 18851 -14699 -22301 -18420 -9460 4302 11369 22694 -6523 -22079 -4896
7078 -4896 -5530 1479 4995 19437 25687 2036 -7061 -36178 -61209 -37381 11150 39241 37353
7065 37353 31499 19095 -3962 103 35943 41754 40029 28702 24711 -2547 -25276 -16325 -29826
7052 -29826 -16026 27887 24029 10918 41151 37234 19744 14817 36724 11898 6152 29948 42353
7039 42353 29877 22763 42330 44857 34576 4272 -1074 16275 22074 27099 39250 42129 31689
7026 31689 16146 2428 13606 2072 -17355 -15753 4034 -11358 -6306 19725 41493 53016
7014 53016 33213 5079 -10748 -17078 -20940 -14233 -29870 -40997 11411 50894 50535 44536 49922
7001 49922 50331 33214 -1422 7527 27741 18618 18821 19883 14574 13032 15041 13830 -11886 -16842
6987 -16842 -5043 3228 26028 28516 15691 18521 28766 34156 21161 17974 10718 25349 60962
6974 60962 44901 29800 1337 -18449 -14620 -32058 -34680 -30430 -53475 -38240 -17258 5883
6962 5883 33189 21002 16806 16389 1785 -6882 -5163 -12421 -10374 -5217 -668 4471 3500 -24183
6948 -24183 -18821 9578 -24613 -28378 5589 25819 -1559 -41847 -49719 -58101 -58631 -46439 -24007
6935 -24007 10260 7248 2429 -4957 -15092 -43850 -55876 -59739 -49015 -33027 -35300 -36462 -42944
6922 -42944 -32145 -37182 -53159 -36226 -28809 -23820 -10867 -22256 -12538 15510 17406 14857 43806
6909 43806 59016 59729 20431 21096 13021 6520 18789 23578 18366 32891 11464 -7793 -15004 -21435
6895 -21435 -2148 14401 27772 -6652 -28870 -21475 5968 16256 25526 13524 8993 15605 6256
6882 6256 -8293 -3349 16214 7263 15372 -2615 -30714 -17495 10214 -4250 -19168 -16022 -2218
6869 -2218 -178 770 2875 -2443 21293 -7376 -25908 -9052 14910 23598 21233 7569 3220 16074
6855 16074 16458 26256 44225 37583 15731 8242 -3845 15464 33164 23610 20424 8870 4638
6842 4638 -11433 -22318 -37766 -31260 -30392 -40229 -51415 -47682 -45055 -45254 -40979 -6217 -1297 4688
6828 4688 -13989 -2908 15581 -8232 -2220 4465 9343 -6579 -293 5273 2168 21414 26092
6815 26092 7189 6167 10083 33817 50474 50860 44100 11421 23078 43798 37956 25557 25308
6802 25308 36361 32343 32891 29825 52234 77005 61617 40254 42070 7855 -15291 6888 14402
6789 14402 25550 4360 21038 38357 37614 61550 78622 94942 123228 116992 112837 109183 70669
6776 70669 50830 71477 40559 41026 80942 62568 36593 43573 32305 17622 10597 18986 24954
6763 24954 37296 54378 23916 14752 30517 33254 63040 65366 60773 56740 69928 77993 56622
6750 56622 71614 76346 43600 20398 45771 84874 101896 87041 38266 50579 73596 40029
6738 40029 10782 35990 53493 75474 82528 58545 58590 57647 67186 47786 70077 115906 127053
6725 127053 93124 89951 129099 121988 109128 114074 134984 177371 205992 188396 192344 206417
6713 206417 196574 150318 125993 129865 161006 186722 205861 222004 255861 297821 339629 373159
6701 373159 403952 405609 408654 406308 381362 330286 273562 210574 160274 114190 79991 58383
6689 58383 54072 62287 52825 58588 53580 46090 47469 35696 16744 18853 43751 46221 40106 35812
6675 35812 41945 24932 19985 18782 21979 -1956 -14373 -31543 -13186 19159 5090 -11578 -19090
6662 -19090 837 5225 7071 20662 21267 1755 3960 33132 18694 -3820 8415 7249 1989
6649 1989 -14764 -28502 -6952 15915 56328 53000 24548 -28000 -35855 -13616 -26218 -44724
6637 -44724 -35963 -14146 15235 43853 30227 23092 24492 -5101 -6623 19857 12114 -9527 -23882
6624 -23882 -28258 -23832 -19261 -6386 -6660 -9852 -4674 -24854 -25247 -30922 -31079 -17335 6911 27610
6610 27610 20788 -12120 -25757 -12602 -22228 4468 18022 10401 -18566 -25833 -10306 -20051 -2770
6597 -2770 19869 24499 30337 31895 18457 1999 -3875 -30882 -57544 -61656 -5338 14775 12377
6584 12377 -9040 -37706 -22692 -14383 -11211 18614 18689 23358 -713 -1201 12037 61494 59574 56762
6570 56762 34750 12137 8133 13845 15598 -8943 3628 14402 27021 59749 48069 32905
6558 32905 20974 11338 8827 9912 10777 1827 -2927 -16282 -16340 -28936 -33905 -22327 -32005 -48550
6544 -48550 -30723 -30974 -36683 -28858 -30132 -23647 -7095 -22849 -24313 -13649 -3095 -16629 -8944
6531 -8944 26117 38861 37821 25187 17483 26593 18253 25164 28519 16884 2388 -39939 -38123
6518 -38123 -57376 -32091 -18158 -3645 -8940 -12117 -28246 -23859 -11436 -4799 1417 24508 12879
6505 12879 -13266 -9922 4965 943 3693 -4303 1816 -15155 -35619 -21986 25187 29484 27034
6492 27034 32884 36345 25415 14612 20342 12438 40507 39354 12122 14542 22130 4381 -7833
6479 -7833 10003 -1586 -7112 -3532 16242 44085 15163 -1084 27128 14979 -13298 -37559
6467 -37559 -37865 -31633 -11127 7487 11415 -7954 -7139 998 204 17964 4775 3340 -1575 5656
6453 5656 19389 -9644 -38444 -28095 -30573 -21951 -7607 -1155 11570 2138 -24918 -40727 -47824
6440 -47824 -40686 -26141 15720 -13086 -14818 3280 -9493 3057 -17733 -23544 -8645 9113
6428 9113 24785 37962 22740 7340 15000 18012 4454 -3186 -28124 -38762 -36744 -17403 -21027
6415 -21027 -28171 -8455 13365 36401 30593 33141 41385 33445 24999 12101 23454 -770 -11578
6402 -11578 -1267 -11166 -12828 -14260 -17608 -6992 -10445 -12139 3464 -6084 -30028 -39874 -27727
6389 -27727 -26023 -15141 -9525 10965 473 4314 5205 11041 28053 31250 22289 20985 16107 20470
6375 20470 10119 -467 311 6880 -1176 20275 19404 -10215 9346 32066 33708 19273 17380
6362 17380 34943 35474 12093 -4593 19006 51234 50785 38075 22576 6052 13507 5738 -2249
6349 -2249 -18522 -26932 -38966 -16596 10133 5037 -7991 -41628 -59856 -53978 -19194 -4281 8407
6336 8407 5888 16890 8054 -19926 -14221 1847 -3072 -9923 -30305 -35766 -14293 4958 7287
6323 7287 -281 -12817 -38167 -43270 -49626 -52482 -48690 -18685 447 14739 15972 3529 -19164
6310 -19164 -21682 -18917 -3891 4187 -7080 -40397 -34233 -29393 -42095 -60275 -25399 -19634 -29029
6297 -29029 -24206 -32322 2581 7696 11925 2763 -19239 -1094 8152 11967 12398 9816 23541 -1479
6283 -1479 -30171 -39294 1693 23739 24553 10568 4049 -7501 -14782 -5472 -22707 -20702 -13842 -20375
6269 -20375 -17056 -6634 24354 33410 31094 44975 32348 23779 9918 13368 28101 20323 35960
6256 35960 42954 59771 52571 8875 -32632 -17369 8649 -10973 -23379 -13767 -21027 -11442 21376
6243 21376 25035 -1557 25204 18357 -7772 -25252 12090 33265 28913 26137 21414 18318 7448
6230 7448 -3344 -17766 -34489 -35640 -22896 -37985 -22015 -13923 -17077 -11097 -9232 -9053 13038
6217 13038 16858 5839 -496 -6372 -53904 -56414 -33438 -9204 20577 23244 17877 -4896 -6640
6204 -6640 10784 5018 -6262 -22677 -15579 -56688 -60954 -2679 11132 5566 8247 20154 17399
6191 17399 -4339 -14099 -1914 16274 24350 44938 49491 36812 49973 51413 35651 4546 -12498
6178 -12498 1574 -4270 -8210 -6713 -14289 -9448 -851 -1565 -20894 -21514 8346 8210 4596 -21841
6164 -21841 -43927 -33518 -21246 -19340 -33669 -47207 -26175 -620 4044 -35 -9714 -304 -2973
6151 -2973 -8971 -23137 -24678 -23183 -21403 -39939 -51036 -42299 -24350 -17295 -25709 -43039 -41853 -44688
6137 -44688 -45828 -29799 -21689 -51379 -65687 -46855 -41501 -46579 -65029 -78352 -60580 -47666 -23427
6124 -23427 -33554 -31744 -10014 10183 30331 36424 22070 23593 14212 -9393 -16854 -16461 19142
6111 19142 45095 31346 11675 2660 -4825 -10630 -26642 -27473 -16840 -25456 -27181 -21729 -34299
6098 -34299 -57056 -19110 -2713 18064 7131 -17104 -37143 -40860 -9705 -17833 -16414 -25640 -22562
6085 -22562 -12197 19633 48259 44625 9893 -26746 -52146 -70762 -38259 -40114 -12188 -17346
6073 -17346 -7326 -11618 -12778 16409 45995 34057 27893 31966 44103 50547 38361 20904 -152
6060 -152 -5268 -2213 -2686 16707 21780 13278 20019 33865 4740 -17121 -29546 726 28346 13892
6046 13892 2621 -6272 -10966 -35847 -50104 -19378 14788 4486 -2692 8644 3851 -29270 -59711
6033 -59711 -55369 -43682 -32263 -31006 -23303 -32714 -39761 -41011 -27170 -34009 -41249 -31394 -26938 -22499
6019 -22499 -17669 -29997 -14735 1833 -1939 2215 -1414 -34296 -9229 -2591 -4828 -9360 -22589
6006 -22589 -15235 -19584 -5277 117 -9611 -7925 1160 483 11942 26919 16358 20122 22469 5395
5992 5395 -6615 23664 7156 -7549 878 -11009 -5936 -8576 -13100 -13504 16798 13725 -24599
5979 -24599 -19415 -6117 12897 26837 29386 19368 291 -31873 -27619 -7592 24342 23813 17899
5966 17899 39316 17151 2027 -30290 -39769 -13037 5526 -4710 -22858 -31301 -61809 -69470
5954 -69470 -54302 -50363 -53725 -35958 -30408 -33652 -24731 10098 14710 2257 -1210 227 36183
5941 36183 22967 -28795 -43231 -18702 3524 17331 19519 -294 5372 24439 -3472 -17177
5929 -17177 -24916 -18755 837 12291 20329 18692 -17292 -17547 -13764 -19627 7613 31714 28026 -13281
5915 -13281 -47428 -51774 -24083 1016 2106 16656 16735 12391 -427 -16568 -8368 -22774 -14735
5902 -14735 -7173 -2023 14919 21176 5538 6741 -5807 -14992 -16904 -12722 850 23788 5106
5889 5106 -9857 -27903 -28909 -1432 4658 -8822 -12780 -53438 -58274 -41544 -32173 -24896 -43768
5876 -43768 -35994 -15769 7152 -6701 -13666 -29404 -15756 16818 1738 -38411 -34493 -34572 -26487
5863 -26487 9189 23501 -31585 -76877 -46246 -15148 -33664 -29965 -16695 3850 8640 29573
5851 29573 37717 37145 28342 35992 43133 47792 38392 2918 7035 33025 18144 18127 6723 -16715
5837 -16715 -11987 926 5406 1220 -2634 -3698 11393 21495 20676 11282 19132 8844 -634 -457
5823 -457 -180 -2300 -14703 -24434 -27030 -10095 -22770 -30551 -38592 -24221 7471 21259 23524 19157
5809 19157 -9953 -14771 -11446 -10684 -29815 -45870 -23976 -25143 -17822 7043 11663 -1466 -20457
5796 -20457 -10657 5193 23453 24148 9145 -7247 -10034 -30695 -29008 -20924 -10225 -38051 -22759
5783 -22759 -12386 -25279 -32383 -11707 -24674 -39329 -11734 -7368 -24371 -14268 -23797 -6720
5771 -6720 7337 2866 -19962 -31383 -33669 -49435 -32597 -6538 -428 -6753 -20950 -34289 -40139
5758 -40139 -13955 -20586 -26964 -12293 -19194 -54096 -75361 -49268 -47286 -34273 -9374 -11610 -39618
5745 -39618 -32926 -49061 -50339 -46811 -25532 -8638 3679 -21635 -22613 -3945 6002 23136 53123
5732 53123 67960 48728 28352 43882 26518 1507 9140 -5379 -10660 -20797 -28930 -33521 -32221
5719 -32221 -23371 -16153 9226 -513 -21313 -6655 2288 -25787 -22477 11277 -13989 -20936 -25494
5706 -25494 -29510 2311 21827 -20756 -53441 -34817 -14535 -342 -19863 -45313 -62599 -62874
5694 -62874 -66559 -46182 -24149 -24692 -26617 -31369 -35449 -48972 -50290 -42046 -33434 -3878 10581 17514
5680 17514 33908 49784 -6185 -41645 -21973 -6096 893 -1120 -6269 -11393 2234 11838 28728
5667 28728 23133 26472 36128 41189 52336 49741 44758 59931 60793 55224 19102 10430 42445 43340
5653 43340 27789 -2798 -26439 -7625 -7785 4365 -1107 -28010 -15237 12051 14651 -15509 -39736
5640 -39736 -53294 -43474 -46724 -60603 -58312 -31340 -13433 8297 -8821 -41949 -20222 11674
5628 11674 30602 24302 2335 -22008 -38016 -29212 5761 6181 -1277 -20234 -52150 -49903 -7566
5615 -7566 10008 4512 2784 31439 40941 34341 13595 240 -28372 -5798 -32227 -65542 -23092
5602 -23092 3544 -19150 -20336 -13608 -29234 -423 10489 5624 -3890 -14860 -5938 -2847 -6679
5589 -6679 -4309 4276 11933 -12918 -43033 -45075 -41392 -17015 -38739 -56295 -54933 -42304 -16969
5576 -16969 -40461 -35226 -16380 6029 41435 26495 27473 35025 32769 3230 1339 -27744 -46906
5563 -46906 -51488 -40477 -46488 -29757 -23694 -19173 5293 22173 31485 15949 5673 -8959 12231
5550 12231 6078 -17714 -19227 -22539 -11751 -19481 -31229 -32510 -27508 -41330 -22953 -14087 -13163 -12567
5536 -12567 -13914 -16098 -14790 -5574 1233 15558 -5529 -5784 2456 -4134 -8475 -19469 -46502 -49768
5522 -49768 -32563 -4777 26215 16409 -20167 -23915 -16032 4019 25811 4 -46179 -28722
5510 -28722 -33721 -50505 -33739 -15150 -2790 4055 1462 5785 14808 12439 27228 46468 31508
5497 31508 -438 -16607 782 8962 -16947 -41448 -40418 -14636 -33777 -43094 -42532 -11721 4546
5484 4546 28743 47790 22807 13037 -25685 -30210 -31709 -58470 -76714 -34882 -12161 -6346 -35336
5471 -35336 -59014 -64731 -41924 -1643 37782 18551 -42903 -43841 -11689 -28493 -19238 -40065 -54189
5458 -54189 -38013 -33744 -9786 1085 -12990 -7596 11973 -232 -27945 -34596 -5272 18187
5446 18187 6827 -6619 -10023 -4474 6410 -14617 -11618 -14779 -29424 -22993 -24597 -40902 -41410
5433 -41410 -30477 -28935 -23888 -8311 20106 19340 -5945 -20831 -11883 -19070 -32374 -29028 -7161
5420 -7161 25510 40320 17268 -15012 -23270 -10982 -17323 -16987 -27517 -59334 -57393 -36026 -31556
5407 -31556 -40661 -33585 -22232 -11609 10708 10575 16018 24813 19792 21436 25098 25762 20558 33816
5393 33816 27279 7250 -8835 -26431 -27508 -21935 -9710 -8643 -3267 -21969 -43283 -13280 -2672
5380 -2672 6871 -1426 4046 -13920 -47039 -42035 -11569 -26890 -47681 -50974 -63017 -34793 -18569
5367 -18569 -34712 -34845 -47157 -37529 -24158 -48453 -29229 -20423 -32313 -24909 -16855 -4815 296
5354 296 18300 18647 14043 4557 -13328 -13064 -6227 -40213 -46004 -5637 24868 26204 13359 16896
5340 16896 6386 -5420 936 -8286 -28126 -46227 -61947 -73922 -90634 -69949 -40970 -24831
5328 -24831 -20759 -7019 -18128 -20595 -3215 2665 -30906 -46719 -9144 19348 5169 -7919
5316 -7919 -23841 -31441 -22921 -20201 -19843 -16209 -30336 -25381 9303 40427 40971 17036 1202 -33149
5302 -33149 -34941 -24531 -22758 -10531 12890 7549 -36035 -55753 -52346 -32484 10490 2290 15942
5289 15942 16968 -6196 -24643 -52427 -54265 -28415 9310 11086 41211 33554 13845 -1114 -30563
5276 -30563 -36182 -20583 -16281 -34975 -25009 -12015 -23415 -30040 -42546 -38498 -30205 -18238 -20500
5263 -20500 -2849 -11556 -19932 -9798 18199 37990 10306 -27732 -15502 -17006 -1750 24187
5251 24187 41077 31519 11026 -34324 -64640 -85210 -65764 -47347 -42105 -46880 -29546 -37089 -3411
5238 -3411 -325 -2712 -18273 -6795 29699 14307 -17508 -3280 -10820 -12477 -7645 -1524 16057
5225 16057 -1396 -47051 -73663 -62100 -28779 -19959 3278 18473 -616 -35816 -36963 -22101
5213 -22101 -20658 -31618 -22658 -5943 2170 -6109 -32042 -44634 -48097 -31193 -35592 -27326 -22400
5200 -22400 -5531 -5887 -22277 -6085 -10223 -29163 -39319 -44389 -47011 -15021 10915 12448 -1277
5187 -1277 -28990 -48869 -4997 7582 -13081 -30912 -10143 2663 -15593 -21798 14258 19701
5175 19701 31165 3562 -33389 -29141 -30166 -22053 -4216 10776 4356 8729 10738 35097 36431
5162 36431 14321 6703 17260 -6352 -2428 6855 7209 571 -15354 -24438 -14765 -19474 -15693 -10034
5148 -10034 -19116 -19121 8730 -21797 -36117 -6630 3661 10688 -1744 -3979 -27968 -52510 -18781
5135 -18781 -8033 -922 18385 22588 -5255 -40421 -30947 -31575 -20081 -6311 15409 20101 17592
5122 17592 37284 67533 45207 -1138 -29543 -41463 -26260 461 -12194 -26114 -18233 -7928
5110 -7928 12462 38988 49283 14239 -31018 -49870 -25341 -19944 -40094 -49802 -49641 -30030 -21662
5097 -21662 -17934 15224 15035 -4148 17029 -365 19809 32671 20331 510 2441 7409 10159
5084 10159 5153 -15730 -14834 -7982 -5745 -9926 5088 1535 -861 1614 32782 38049 -957 -26583
5070 -26583 -18943 -29633 -40711 -49137 -30879 -12879 -18759 -10753 -18340 7663 -5582 -13222 3795
5057 3795 16539 -192 -9523 -19263 -37273 -38974 -17645 -2052 -11550 -15233 -10442 -339 1277
5044 1277 23043 22086 6220 -18944 -51184 -20841 32920 35862 24708 -7972 -14158 -12822 -21122
5031 -21122 -5335 10270 -3309 -2135 14059 -5711 -32316 -9175 10078 -9199 -15525 -26980
5019 -26980 -22251 -17965 -7937 9303 18770 13031 27070 33512 14549 23889 -7082 -36556 -59355
5006 -59355 -68904 -35659 -6267 2570 -23453 -41433 -37263 -23020 -4352 -3238 2 -4304 -27679
4993 -27679 -2631 7458 2119 -16653 -8717 2880 8360 849 -27276 -64730 -41117 -11861 -17184
4980 -17184 -22517 -25354 6441 12488 602 17187 12825 16407 5426 -5667 -17650 -11219 7149
4967 7149 23538 17409 18055 26144 20231 24578 28740 39482 45805 40904 24404 23246 33719 42512
4953 42512 25294 27215 30911 5585 -7051 10422 -11170 -43070 -55309 -47924 -34055 -29409 -20096
4940 -20096 -32508 -34394 -25379 -27875 -44746 -60382 -60004 -51057 -53877 -34397 -17482 -9418 -12960 -8663
4926 -8663 -31164 -44629 -42378 -43750 -38740 -27439 -12779 -9550 -29866 -41310 -38794 -21046 757
4913 757 -14462 -16197 -9297 -2971 -15488 -19617 -26416 -48624 -49602 -48743 -57921 -57012 -62156 -39311 -31134
4898 -31134 -6074 7485 -956 21981 40896 39403 -11291 -36713 -42661 -47463 -61932 -76495 -78731
4885 -78731 -88921 -97285 -87964 -75014 -53410 -42443 -32323 -33092 -37729 -14405 -6601 -11653 -15842
4872 -15842 -22555 -27734 -19611 21122 65947 65603 41728 33311 13401 -28072 -31367 -40966 -50085 -49057
4858 -49057 -7956 15364 -8767 -52656 -64334 -50453 -25858 7868 19517 4809 -28963 -41308
4846 -41308 -17908 -14727 -2539 323 -8949 -336 1011 -13521 -6575 -28379 -32635 2921 -1288
4833 -1288 -5214 -29879 -55146 -40834 -14751 -13585 -4604 5889 -20373 -43255 -29256 -10771 1256
4820 1256 7219 277 -24374 -61067 -63656 -49729 -30798 -9665 -829 -6925 -24846 -24225 -49128
4807 -49128 -20532 -995 10447 -22003 -33461 -27674 -39465 -24482 26976 42801 50263 44581
4795 44581 27639 32501 17262 4278 -11758 123 7377 9365 349 15783 14424 16688 -3289
4782 -3289 -16946 -11195 6170 -11229 -13242 -21318 -11270 -5517 -13362 -7679 -14662 -19855 -9299 -8523
4768 -8523 -5117 5581 -5625 -6862 7173 -10488 -25884 -17185 -3891 -16390 -11138 -5229 -1886
4755 -1886 -4237 -19904 -30255 -26272 -15009 3111 25916 22003 -3120 -9710 -8185 -35075 -27958
4742 -27958 -38969 -21578 3442 13130 -3504 8151 183 -25429 -29440 -29390 -46971 -40663 -18311
4729 -18311 -11628 3013 -5524 -9005 9064 33921 18075 -2613 -20764 -17887 -32983 -34694 -29561
4716 -29561 -42228 -36502 -51301 -32939 -21903 -35269 -6084 32720 11495 -9964 -11019 -34698
4704 -34698 -45800 -28975 -28168 -25100 -30350 -28679 -10269 -6019 -1343 15659 17831 365 -17219
4691 -17219 -29682 -38530 -30877 -54479 -47554 -31283 -43940 -56353 -47490 -63665 -52433 -17937 -29799
4678 -29799 -31766 -44291 -41636 -28691 -31989 -37758 -27492 -37118 -12474 16007 20554 31180 22392
4665 22392 10435 15237 -12420 -46645 -38635 -10176 -10981 -40901 -28705 -19927 -23955 -28065 -19688
4652 -19688 -3231 -13721 -22381 -29279 -16288 -25787 -29204 -12529 7155 15531 18160 -3278 -1171
4639 -1171 -15269 -1944 -16701 2589 3616 -14215 -5247 -1476 7003 28122 43741 26463 28829
4626 28829 15327 35126 45458 17088 -8343 944 2178 10960 18069 4344 -13295 15499 9923
4613 9923 -7402 5577 -10646 -18709 1954 6780 -11490 -23496 -26888 -43192 -38718 -35884 779
4600 779 30207 32654 -20861 -33354 16633 21470 9966 -13061 -19706 -24029 -26022 -7855 -867
4587 -867 -6855 -54196 -74186 -63811 -43975 -23784 -10550 -6080 -11964 -16151 -19555 -34633 -22538
4574 -22538 4634 24494 -17677 -21330 -2993 -5434 -17685 -26511 -31667 -32732 -18545 -8506 5413
4561 5413 -10619 -21873 -26350 -7096 -17846 -17265 -14947 -7877 -18815 -7699 -9655 -23385 -14827
4548 -14827 -20987 -43333 -71816 -65673 -51770 -46613 -29067 -24015 -25117 -42244 -38306 -30302 -8961
4535 -8961 -19425 -41701 -53492 -70114 -49064 -12133 27575 38086 22249 36429 37246 34808 44357
4522 44357 53933 29107 7004 -8666 -6485 -9187 -26237 -8977 -3385 -39785 -43840 -42261 -39685
4509 -39685 -65655 -47016 -11286 12272 -4011 -17218 -890 -2965 -15658 -26589 -18663 -8468
4497 -8468 -5326 21676 23252 2444 -8348 -3812 9143 17586 17391 39515 36324 24490 19552 16117
4483 16117 17734 -2021 -11363 -32850 -31202 -17159 6532 -25264 -33027 -26747 -42950 -50551 -53476
4470 -53476 -3165 26693 14405 4196 30774 35174 15348 -679 13058 1316 -27265 -28670
4458 -28670 -44740 -32406 5508 -12103 -5845 -17020 -2280 15402 -16474 -16519 14300 23716 20490
4445 20490 19008 28322 23800 5733 -15658 -44703 -57216 -25879 -537 -6986 -17975 -28074 -28428
4432 -28428 -6860 -21951 -26493 -46119 -40316 -46176 -40082 -19873 -9050 -5621 4782 13625 29002
4419 29002 17870 26287 10407 10518 15214 28227 30545 16161 -8756 -8334 13608 -3847 -18217
4406 -18217 -26829 -30773 -22596 -28308 -32039 -32680 -21619 -11321 -8795 1845 33864 17603 5769
4393 5769 3618 20683 39923 38120 13465 -2238 -13026 5663 21332 30131 33883 19307 8020
4380 8020 25273 29069 43039 36114 23108 -186 -12289 -1381 -555 17913 6949 -12209 -8718
4367 -8718 10420 14343 4544 -14290 -25341 -37301 -32005 -36962 -36425 -39537 -48897 -45511 -64136 -44465
4353 -44465 -8615 -14749 -10326 -29993 -39920 -37092 -18878 -11473 18795 33457 17810 1596 -7965
4340 -7965 -25336 -20829 -5131 -9411 -22619 -40137 -36077 -19523 -20962 -13661 -16432 2790 19442
4327 19442 25990 13105 -9056 -11572 -18236 1621 12078 18385 21570 10538 22167 42067 26373
4314 26373 8825 -3314 5849 -1709 -19688 -24852 -23717 -27582 -23820 -43569 -67610 -61606 -46007
4301 -46007 -39904 -36422 -16114 -2697 -9048 -56150 -88745 -84193 -76325 -51324 -32278 -15204 -694
4288 -694 -3579 -9464 -5166 -28293 -23656 -9647 -8161 11897 2078 21861 51453 62175 71080 64078
4274 64078 39599 23586 13281 -16152 -25252 9558 23324 21330 -20404 -29739 -40618 -63850
4262 -63850 -65781 -66166 -45490 -38807 -41231 -47782 -53380 -61848 -56985 -24438 -28149 -21126 -4996 25512
4248 25512 1856 -12184 -10431 798 -29393 -12672 7565 11201 12171 13809 -1739 -18594 -13781
4235 -13781 -5941 -30621 -26000 28146 27368 9049 -21045 -16341 17856 38474 41226 28282 2192
4222 2192 -7134 11533 12280 -7161 -27632 -25620 -21724 -10562 -5165 -34859 -22052 -6503 4837
4209 4837 25356 19876 4283 -4944 -16073 -37172 -42532 -9483 933 -16076 -30887 -31751 -1605
4196 -1605 -6253 -4616 11047 29345 7418 -34661 -52126 -24036 11784 19760 27817 37847 6961
4183 6961 8423 10450 -4710 -18934 -19508 -38448 -36374 -32518 -6420 654 15369 19080 8379 45867
4169 45867 39811 11113 -2189 14866 20597 25793 -11688 -37824 -31139 1591 2113 22984 15803
4156 15803 -24293 -19907 12940 25867 3221 -8040 10535 18977 25050 5366 -31545 -54632
4144 -54632 -63662 -41219 764 10988 19089 12186 3157 -28044 -20749 -33721 -18404 16345 45354
4131 45354 88017 105589 86814 59669 21516 2729 -21791 -4682 -6951 -2768 13971 17321
4119 17321 -19056 -14209 1902 12235 2855 17307 9209 -6019 -17441 -21429 3789 4303 21045
4106 21045 18893 4167 6916 12642 16773 5511 2362 7747 -660 3762 -6816 -15857 -12420 3745
4092 3745 -33839 -54244 -36294 -25224 -30836 -37138 -22086 -3758 11908 1434 -24321 7962
4080 7962 34075 23464 20545 33407 19135 -7361 -9288 -18914 -34873 -37684 -37442 -25611 -26791
4067 -26791 -18018 -15533 -11975 2607 -28296 -36724 -18089 -19689 -36175 -13632 19978 5565 -3457
4054 -3457 15612 23418 2799 -13636 -49792 -80896 -51775 -28143 -25918 -35959 -17363 1498
4042 1498 31481 16226 13678 4375 -39126 -47736 -57251 -64265 -37117 -24449 -25785 -11334 -8567
4029 -8567 1331 -121 9903 4978 -1307 -2408 -10830 409 307 -2300 20773 3885 -13236 -32441
4015 -32441 -50826 -60807 -58083 -36757 -9391 19665 35499 27589 19745 -13251 -24879 -37121 -53224
4002 -53224 -40918 -4127 14262 3901 27198 12412 -8304 -8770 3299 -8963 7398 29752
3990 29752 -6706 -3214 31260 25532 -2880 12343 17457 9036 9835 9337 236 -20012 -16182 -18015
3976 -18015 -10278 -12332 -11331 -26186 -30708 -22532 -16022 -46818 -30048 -10575 1993 7687 13101
3963 13101 -11723 -29605 -37899 -65202 -47083 1589 15016 8323 -11575 -19289 -4403 -18267
3951 -18267 -22659 -23698 -33709 -26571 -11507 -8140 -32190 -42180 -14931 -3145 -6472 3290 4806
3938 4806 8547 16360 2541 -9837 8570 11432 11286 -18958 -23209 -7219 4517 -4771 2555 -17678
3924 -17678 -29377 -28435 -16267 4023 -10226 936 19714 21598 -24386 -22912 -46965 -51564 -58844
3911 -58844 -47302 13656 74690 67186 38077 16309 -13087 -36085 -31642 -11813 -16399 -8062 -8996
3898 -8996 -4092 21103 18282 -12810 -5542 11554 11039 3468 -11016 -7387 -12962 -18516 8808 27629
3884 27629 25981 22837 14852 14892 12955 10200 -7205 -15552 -14290 -7006 1010 1759 -18525 -12460 -957
3869 -957 19002 -9187 -16391 10702 8627 -8357 -27769 -31751 -15646 222 -9043 3507 21769
3856 21769 37893 34334 -3791 -38127 -38133 -9254 10085 17214 29855 5515 -26359 -12429 -3665
3843 -3665 -6717 421 5140 9471 19291 17796 40345 20742 12830 27435 19110 911 -16529 -31166
3829 -31166 -7899 10715 17222 -7758 -51834 -53721 -60610 -66298 -26233 6281 8656 -37807 -44950
3816 -44950 -18690 -34812 -66010 -57377 -24973 -36365 -42903 -40578 -9562 5936 8062 -2299 4325
3803 4325 4224 2988 7691 -5502 -20333 -26971 -30305 -8415 28836 18028 758 25135 30556
3790 30556 9888 -6950 -24759 -22584 -24368 -29609 -21390 -27073 -26826 -24044 -3825 15716 25607 17754
3776 17754 -8157 -14780 1844 1047 -17790 -17558 -6109 7003 -4169 16896 21417 17243 8903
3763 8903 -4476 -8471 -28489 -31592 -43224 -49745 -24177 1765 3438 16953 19391 7133 8305
3750 8305 6667 6261 -15957 -26113 -4483 6652 32780 9159 -28664 -22019 -3711 9969 4778
3737 4778 -5632 -3460 5340 9680 -21 -25889 -37674 -24927 -25373 -25643 -17938 -42620 -26924 -19313
3723 -19313 -27286 -4919 16315 12037 6932 1809 741 -18914 -26975 -6700 -6994 16619 33066
3710 33066 28237 -3900 -31622 -7530 -12763 -22530 -16819 -7481 -26981 -22249 10092 -226 8621
3697 8621 23429 12938 -4890 1273 7803 13792 1504 -6379 29242 29823 14021 -8656 -3897
3684 -3897 -13080 -3290 22292 23997 13333 2418 803 -12077 -25462 -20869 -13407 -1709 23255
3671 23255 23575 30982 29394 7084 -9115 -36306 -42592 -31380 -20059 -29416 -32705 -43624 -49318
3658 -49318 -23421 -28677 -24984 -5695 2662 -17566 -19006 11073 -2162 -40140 -50160 -29836 -591
3645 -591 -16587 -47820 -40644 -30078 -10049 16121 19074 -29139 -20029 -20244 -13041 -6574 -6604 -42361
3631 -42361 -48625 -51009 -39331 -12642 26897 25543 17877 10079 -10934 -6781 7037 2945 -340
3618 -340 5825 -3611 -8437 9429 14490 -268 7835 -8693 -35864 -46453 -49288 -40238 -37608 -59460
3604 -59460 -67805 -30730 9758 19942 18282 41878 58756 39418 24139 -6163 -13844 -6959 4377
3591 4377 7576 10699 24811 40903 35556 39632 31165 20242 15804 18499 4986 -12832 -10081 -1288
3577 -1288 7794 23066 26667 34783 16229 -14038 -20418 -10117 6457 11603 18381 21708 15432 43512
3563 43512 61917 60707 43903 60066 34194 24079 42956 29577 -13013 -21925 -865 7664
3551 7664 -15241 -11350 12857 34453 46435 16670 -13329 -12778 -34500 -43052 -14343 -17105 -5116
3538 -5116 -1633 -15340 -36644 -39390 -37086 -48217 -14074 -5091 -23597 -15885 -21855 -14331 -19786 -5667
3524 -5667 4793 14433 1266 -9385 4601 12235 1755 3733 13999 20798 42112 23236 39699
3511 39699 41705 21183 -5754 -12382 -9111 -28531 -43133 -29047 -37506 -34708 -42321 -27256 -31215
3498 -31215 -13747 -30390 -31676 -16746 -127 -1940 -22653 -4975 3651 -6906 14265 44339
3486 44339 33505 53912 40837 16704 31183 17355 14201 28403 8026 -2889 -5743 4198
3474 4198 -8373 -24652 -17384 1844 32498 26501 7906 360 -12034 -23959 -30363 -52012 -34200
3461 -34200 12688 14801 16797 -8723 -23792 -14634 5522 25686 -4365 -25858 -28267 -24797 12550
3448 12550 36927 6825 -28405 -23483 -9068 85 -4922 7747 3613 7740 -12000 -18858 -12307
3435 -12307 -20467 -31791 -33745 -14373 6237 270 -28081 -15001 -5384 -3237 21616 8074 11625
3422 11625 -10141 -11645 -10133 51 6567 -13016 -32745 -23971 -8245 6124 18515 21466 12567
3409 12567 -26909 -16939 -9830 -23790 -5386 -3366 -9513 -23876 -29856 -17151 2610 24564 6424
3396 6424 -4735 -17378 -5750 1419 9037 17173 -7223 -28032 -37370 -33366 -49342 -35603 -23387
3383 -23387 -18445 -13317 4987 18612 20066 10347 18790 13047 15009 13101 615 14627 11004 7085
3369 7085 2205 -21507 -35720 -17262 -7310 -14729 -16623 22198 29426 -22473 -14945 7166 -8944
3356 -8944 -3379 -2477 -16167 -25513 7046 2499 -55346 -76330 -77153 -50695 -23314 -18742 8221 3847
3342 3847 15758 28170 12491 -8545 4874 11183 11178 12487 1376 -19359 -4676 7143 8182
3329 8182 9384 1797 13514 31150 2764 -34041 -54739 -1709 20650 14982 4583 -8708 -18662
3316 -18662 -44093 -64210 -70566 -29348 3482 27885 33144 24033 27169 22907 5740 -12026 -28201
3303 -28201 -34194 -14221 -4386 -7852 -19750 -726 5429 11442 5569 -34479 -46034 -19681 3970
3290 3970 22287 -9731 -38084 -38211 -54224 -48603 -37694 -33515 -3057 5762 658 10556 5778 -20647
3276 -20647 12050 39468 16342 10419 19339 -4 -6199 18587 27330 19094 18946 5474 10324
3263 10324 15833 22671 21542 33057 39434 4863 -9116 -10538 -16390 -20646 -1342 22603 23870
3250 23870 22017 6007 -6019 -5931 5163 5229 3881 7034 -3856 11202 32302 27201 30 -19970
3236 -19970 -11415 -14013 -5844 733 6042 1754 7152 3651 -9523 -9812 -3474 3180 -12443 -25448
3222 -25448 -62022 -73590 -67164 -54969 -18141 -33579 -69017 -60789 -30625 -45317 -51509 -62236
3210 -62236 -60156 -50688 -30608 -56402 -49446 -43172 -38496 -20343 -29745 9781 18423 3102 -12966
3197 -12966 -11441 8448 5454 -9265 -12450 -18375 -20119 -11658 521 12275 -4008 -19984 -4617
3184 -4617 13258 -1603 16053 22887 12451 -13868 -42814 -41192 -4849 5556 27738 27159 21350
3171 21350 25617 9582 -6884 -23635 -35741 -22244 -25997 -41800 -26458 -1328 22331 37332
3159 37332 58223 54252 22514 3708 8943 -16610 -2131 -15135 -36412 -20415 -21543 -36215
3147 -36215 -44879 -9942 -1583 -958 -1851 -18781 -28032 -38138 -42166 -15998 -9512 -42974 -74941 -67381
3133 -67381 -55886 -32056 2119 3300 -10501 -25427 -41882 -62860 -48949 -27402 -15286 -149
3121 -149 -13632 -33058 -18961 6806 7409 9591 36586 18074 -7601 -24942 -17727 -28287 -52297
3108 -52297 -48141 -31611 -16736 -7338 3325 -17376 -22640 7356 42756 8313 -7212 6976
3096 6976 17658 1402 -6848 9485 5786 18779 18088 11910 24364 33978 10218 -3458 -13706
3083 -13706 -31123 -37095 -34270 -27395 6792 12481 -2460 -8895 23783 7965 -16151 -55767 -62799
3070 -62799 -41634 -27234 325 1587 -10817 -12812 6587 -8702 -15263 -34152 -34090 -17886 -4526
3057 -4526 -18433 -27035 -21059 -3783 -29537 -34665 -12669 451 -13090 -13935 -31045 -29204 -3136
3044 -3136 129 -25226 -16716 -7180 18374 30146 23011 27054 3465 -14389 -18888 -24977 -28914 -52851
3030 -52851 -59286 -51735 -47466 -12939 8137 22269 16204 8766 -13493 -20602 -19642 -13733 6378 -2855
3016 -2855 -17204 -39813 -47304 -13006 -13296 -19969 -3478 -27788 -29654 -23054 -13814 -19660 -22191 -24154
3002 -24154 -38229 -36355 -7134 16391 9961 12460 14764 839 10760 16279 27314 29682 17702
2989 17702 -20750 4972 28940 17825 23829 -3824 -25594 -41948 -60769 -51172 -22494 -26330
2977 -26330 -24261 -48553 -30447 5906 -265 423 24497 -9398 1238 8070 7306 14356 17992 44312
2963 44312 46661 36087 47477 69221 60323 56275 23338 2768 6969 32799 40220 37852 27495
2950 27495 30595 22190 15083 -5142 -11142 -21427 -18057 -2074 7612 10891 27786 14303 3675
2937 3675 -21049 -36431 -38796 -50116 -60207 -34856 378 18799 -2977 17786 24680 17405 -4560
2924 -4560 -777 13959 6117 -7333 -21499 -31198 -3445 1539 12602 12634 19555 12725 2912 973
2910 973 -12871 -25230 -6843 22330 49810 43252 14083 -7047 -14087 -31953 -23089 -14789 -30414
2897 -30414 -40318 -25099 -32158 -29234 -14442 13783 22931 2297 -8959 -6165 3622 19747 -10488
2884 -10488 -41570 -31692 -18143 -12487 -11231 -1282 -6643 -13466 -3783 -8316 4112 33786 52226
2871 52226 12758 -10562 -15753 -28935 -56399 -89550 -84942 -72608 -49915 -13913 -9657 -15300 2392
2858 2392 6580 -11115 -18866 -19320 -30280 -29132 -19940 -34627 -19156 -11157 8853 4306 -19612 4508
2844 4508 -9778 -28247 -9714 16187 10792 16082 -7049 -41058 -67368 -56186 -27814 -11518
2832 -11518 19093 8340 -2650 -9960 -29837 -29027 -6321 21161 39079 12358 -20391 -39396
2820 -39396 -21604 -24568 -11249 -2114 12742 40935 23322 7260 31533 49771 40916 24971
2808 24971 6277 4677 8327 3763 -28788 -44278 -24696 -4925 5634 -25654 -28470 -35468 -51692
2795 -51692 -45439 14256 37665 50966 70720 40146 16745 5558 4505 26335 15534 -8604
2783 -8604 12355 17047 31543 11780 -23576 -23899 -5912 -11506 -38407 -46864 -28683 3787 4604
2770 4604 -1625 4047 7708 9451 33173 2448 -11155 -15293 9610 -7375 -14083 9580 16306
2757 16306 16330 27777 15430 4952 22221 17704 21159 22015 20733 50548 48493 21197 8120 26833
2743 26833 33299 40539 59764 48161 5399 -20447 -6189 17964 43398 30921 11014 -8349
2731 -8349 6161 21231 41788 19734 3912 6599 1405 -11006 1113 -7241 -23767 -28004 -31963
2718 -31963 -43108 -45626 -39733 2646 21399 -3304 -32117 -34431 -4639 -10378 -12073 -22408 -46590
2705 -46590 -45692 -22791 -1114 -6659 -1222 12069 3060 6843 -25133 -32013 -30846 -29805 -32215 -34352
2691 -34352 -9464 11597 -7887 -34739 -16201 4706 856 222 -16223 -9031 -26352 -45424 -33162
2678 -33162 -13708 -12581 -10930 9822 -2480 -32856 -29182 -27607 -16917 -23077 -13216 21533 30726
2665 30726 2092 33039 68488 45430 29488 27620 28502 29717 19667 -4492 -7419 805 -18305
2652 -18305 -24260 -24629 -36716 -32609 -13415 26671 2560 -30659 -35183 -19953 -18906 -21183 -20129
2639 -20129 -27816 -21612 -7938 -12449 -31507 12166 44931 23128 29926 43412 38919 20661 -13636
2626 -13636 -36026 -8430 40874 27361 7104 -9048 -8235 2289 -22556 -16524 -1477 7733 25238
2613 25238 51215 34287 11020 15073 -11196 -27165 -26742 -16877 -22350 -54240 -57737 -60299 -45957
2600 -45957 -27269 -61734 -80506 -69425 -45545 -23893 -16492 -20661 -6143 504 -2247 18197 44900
2587 44900 26153 2621 -2659 -22676 -26459 -13119 7327 6046 12604 3165 -6637 -26126 -63079
2574 -63079 -47800 -33572 -44084 -27134 -17620 -17850 -18145 -1427 -7334 -13605 25674 39538 40507 35371
2560 35371 21032 22956 16347 11304 60648 77377 62024 50357 30779 26252 22031 9443 37497
2547 37497 53659 30819 33505 45625 60466 49630 24810 -5399 -27060 -34173 -36976 -23221
2535 -23221 -13045 -3006 -9826 2998 27594 23317 99 -5259 7456 4158 44920 51536 63713
2522 63713 26279 9044 9361 4211 3746 43655 54825 45880 24139 -12920 -42447 -34822 -28136
2509 -28136 -28176 -38800 -29127 -35674 -23797 -17713 -25111 -51662 -40147 -7400 12644 3318 8854 6818
2495 6818 562 -12597 -18806 -4786 -7040 -15493 -12314 -16455 -40064 -33762 -12456 31234 24610 32247
2481 32247 27244 1783 8825 6959 -6217 -6884 9348 8890 -126 4999 16147 10652 -12884 -10229
2467 -10229 -10668 -4567 -23802 -29374 -1629 10501 -2460 10313 35970 30747 7822 -14781 -7533
2454 -7533 927 -11555 -50867 -54305 -39595 -18496 -8235 -21700 -58145 -63474 -37400 -13107 -3221
2441 -3221 3628 -13555 22907 57863 70874 54791 53562 69556 60136 33040 -25 -29932 -38070
2428 -38070 3047 36744 45944 43280 17133 -3272 -4720 -23650 -23808 -207 23588 32301 28406
2415 28406 41884 48989 44527 48265 52481 82564 67866 70772 71205 50697 20140 14211 4655 -736
2401 -736 19508 31864 3797 -22118 -6794 1836 20541 21256 19150 21684 16917 -20545 -37739
2388 -37739 -45434 -25360 -13842 -2206 11572 3369 -2302 -6650 -47808 -52122 -36077 -4676 3887
2375 3887 -8508 -27524 10545 45762 32161 9343 -8600 11937 -6557 -15304 -4650 3419
2363 3419 -38852 -59597 -38138 -31572 -34312 -11859 10375 -4810 1512 12304 -9252 -21656 -25967
2350 -25967 -26027 -4305 -5267 -14673 3651 5069 -4136 -114 -17035 -14073 14517 19484 6206 -13886
2336 -13886 13975 18812 38632 86051 41045 4476 16419 1229 -11866 -10502 -17025 911
2324 911 18133 -6947 -17754 -18457 -2139 -7935 6223 26624 34531 57315 69707 32984 -12789
2311 -12789 7953 4856 -8217 -2479 22522 9983 -5534 -6348 9424 -5663 -12412 -13034 -18004
2298 -18004 -642 -8660 15050 9972 18722 5135 -17986 -54508 -35095 23984 42709 21674
2286 21674 1816 -21721 -23453 -26567 -42400 -35835 -23814 -41415 -41162 -47205 -34383 -54978 -52209
2273 -52209 -53181 -20715 -11027 1214 10219 4475 -12141 -10501 8490 20811 7440 -40536 -53378
2260 -53378 -32778 -20531 -11054 -9233 -1532 1851 12052 -1211 -2629 -668 -1087 5551 1743 2239
2246 2239 18275 53715 32738 10799 -4498 -10470 -14943 -516 3307 8336 14677 13788 20466 34823
2232 34823 25584 16375 8190 -4470 22585 28657 22163 22058 37240 49164 12650 -5790 -633
2219 -633 32233 75626 55845 30996 27942 23321 20139 36897 18293 -12386 -20344 -26038 -7642
2206 -7642 11859 11913 14857 3146 4144 -3651 -8439 -26037 -43984 -29684 -11683 -8698 -22954 -11971
2192 -11971 8847 -1725 -17650 -11402 -14095 -21623 -24049 -16086 -31991 -38516 -31926 -41900 -38163 -27507
2178 -27507 -8855 6470 34470 23964 -14339 -23656 -1426 21159 671 -32468 -21713 -15000
2166 -15000 -4295 26457 23363 5828 -15529 -16609 7375 43240 59270 29810 -8998 -19409
2154 -19409 -14505 -2881 22873 28903 52446 44944 -4879 -31745 -47792 -58897 -33658 12686
2142 12686 29343 16718 16425 27981 12685 -7874 16802 7042 -13847 -41649 -33224 -19674 -21474
2129 -21474 -5316 -1729 3885 -778 3205 -6227 -11575 -19680 -30683 -28149 -1204 9898 23714
2116 23714 35238 51913 40855 40579 33042 -34 -669 23712 20884 17343 19617 9906 5490 7159
2102 7159 -709 12681 40291 45063 20286 21800 22169 -2265 -32656 -45451 -36962 -42612 -30369
2089 -30369 -1839 -1852 -7510 -21084 -40137 -28443 -21023 -18562 -15060 -4296 13751 -9130 -31031
2076 -31031 -17864 -19958 -12242 -14161 -27923 -33071 -1397 18354 14590 8146 33038 26616 3364
2063 3364 -6614 -34345 -32404 3463 7926 22259 33394 15707 19277 22838 45561 67728 41198
2050 41198 13752 6485 -23645 -29723 -19230 -22580 -14779 -4298 37120 56558 46143 29667 6753
2037 6753 -8484 6612 551 -21749 -25691 -21760 -9153 -15241 -78 -16877 -27046 -11421 20329
2024 20329 29874 48870 44357 43531 32262 33809 13873 10633 31627 7890 -4899 -6931 -16782
2011 -16782 -33832 -41226 -23990 -32476 -21356 4219 5060 12254 11120 -10194 5323 6752 -1074
1998 -1074 -3473 -13814 -18484 -7373 3494 -4918 -31091 -33664 -33492 -21888 7029 12933 -21870
1985 -21870 -54412 -31645 10296 7464 -15942 -3952 -9297 -9910 -26426 -32003 -36346 -51439 -34398
1972 -34398 -23027 -15081 -27709 -11416 -8557 3907 12482 10252 -10019 -20907 -18432 -5241 -1126
1959 -1126 -30 9626 -287 16312 -10086 -36354 -29252 -11413 23684 39877 47666 18422 -26603
1946 -26603 -29186 -16575 -20247 -40829 -42845 -36935 -35668 -35989 -16005 11779 -9044 -7314 -12513 -27941
1932 -27941 -21386 -14863 -19819 -26957 -2382 -8382 4875 17120 -3659 369 -2667 -10840 19148
1919 19148 38233 47784 27210 30829 32687 2053 -22660 2065 35701 41744 25943 -14083 14936
1906 14936 15166 7502 -9866 -5551 -19625 -33520 -33162 -8567 222 -20003 -24209 10852 25471
1893 25471 30372 28373 8216 2905 -953 15487 34838 34164 21375 24641 38612 69503 46573
1880 46573 51233 59583 33645 238 2189 3424 15297 4504 4627 8058 18905 27335 3478
1867 3478 -32639 -31580 -23146 -20073 -19768 -12085 -13388 -5305 16583 10798 7641 -9128 -3151 -10645
1853 -10645 -39260 -48037 -51482 -28359 -23979 -56818 -50595 -29437 -26144 -35019 -32080 -18504 -24216
1840 -24216 -37824 -29380 -38314 8385 40072 72348 61812 28111 21902 19134 -293 -49 14658
1827 14658 -17341 -23657 -36498 -36698 -15418 -12271 -13133 -31235 -38761 -33763 -14439 7767 25693
1814 25693 27932 14698 32548 21446 18870 22101 -5492 -24467 -38239 -34471 -45181 -27677 11457
1801 11457 10834 -5040 -8056 -9570 -3786 19938 43142 22282 7986 30393 40702 28730 18962
1788 18962 -4219 6825 11443 5441 -2703 176 -11851 -11479 -12587 21732 34197 36405 45286 39737
1774 39737 42267 14838 -6578 8680 15198 9933 -267 -34499 -31239 -20596 -17178 -15339 -2087
1761 -2087 30123 6195 -4971 4544 39572 64183 43657 4449 -9209 7121 14303 17265 20288
1748 20288 13918 8466 6889 1162 -16991 -14603 -2936 -7849 4896 3549 -4865 -1031 17326 48424
1734 48424 36977 17671 12649 26288 24417 6773 6632 -477 -10689 -21628 -18137 -6271 29535
1721 29535 36509 16248 -3121 3350 20014 3430 14816 8460 -5563 -2331 -31625 -32847 -48797
1708 -48797 -43204 -15720 -13226 -19125 -38711 -24939 -255 -1405 1918 16261 38223 23060 10327
1695 10327 9560 -5330 13834 19371 7506 2611 28833 11963 -22809 -18719 -32798 -49375 -13831
1682 -13831 -713 -24983 -43041 -10044 21967 29736 40032 42157 3084 -19097 -9644 12994
1670 12994 5054 16753 27740 13390 13638 10073 7047 32902 21642 6915 -10703 -5066 -24252
1657 -24252 -31186 -14179 7115 587 -21365 -50368 -18241 17394 22878 26691 15707 3047 -16526
1644 -16526 -22781 -25455 -1531 38505 52692 63658 60150 29037 26044 38079 44829 41631 55967
1631 55967 37371 14282 1769 7869 -11133 -19313 -11152 -5806 17650 34158 28878 10077 2573
1618 2573 3251 8820 17851 17736 -5663 395 38929 23784 31849 47510 37474 11278 4766 -7047
1604 -7047 6893 18995 28069 10366 25657 27915 37872 26574 -6854 9396 26678 42425 40605
1591 40605 9403 21262 33182 33644 26718 32151 11985 -27190 -53214 -9679 24592 26949 13976
1578 13976 10024 5896 -5786 -1161 7307 19728 31600 15840 -1087 -11549 -19470 8522 20706
1565 20706 11975 10005 -12642 -36886 -39042 -10810 18880 13900 25707 33321 15642 929 -11089
1552 -11089 -42426 -71965 -73993 -33750 4487 10335 10839 17993 25743 35379 23111 -3024 -5127
1539 -5127 9999 29422 508 -8726 -16069 -8331 -19098 -35704 -17552 2175 -8117 -1193 -5854
1526 -5854 -24281 -22705 1361 1404 421 19252 40503 37051 36321 31951 12116 8265 7252 35590
1512 35590 31661 -1943 -33744 -41576 -26727 -18016 -8541 -5004 14818 21401 -937 -10664 -26285
1499 -26285 -20486 -9143 5097 25691 38203 36714 29997 45618 42391 32100 35084 25576 31035
1486 31035 32673 12440 22785 2112 -2119 26146 43573 28621 29573 21266 11742 16627 30393
1473 30393 35888 20902 30446 48713 43601 8419 17314 34373 15701 17601 9225 8255 21249
1460 21249 23910 16075 6421 4800 33451 62986 37478 18299 6974 6507 7979 21340 13792
1447 13792 18393 462 -30400 -23198 3967 -93 -25662 -38829 -41575 -11608 23642 33512 22541
1434 22541 26571 -11673 -39922 -32276 -35018 -24922 -14081 -20104 -15296 -10384 1695 -23517 -44880
1421 -44880 -25495 -11627 573 15042 12267 32377 59841 57305 48819 17454 -10241 -9588 -4463
1408 -4463 -16064 -26385 -1221 34960 28966 9087 1113 -16405 -5507 -2672 7054 15019 30998
1395 30998 6332 -842 -6476 -13034 17027 18886 20159 25615 18528 32177 31402 28479 -20579 -26870
1381 -26870 -27822 -13271 -6479 -8569 -9323 -355 -18200 -15039 -20922 -29010 -29980 -8796 15286 -9328
1367 -9328 -871 19880 29964 32269 34084 48431 35373 3471 4642 16177 38132 16845 -3301
1354 -3301 -1422 4314 26435 17586 27470 24353 2393 -5590 -18216 -12329 -10403 -4730 19494 42903
1340 42903 31628 5391 -16975 -20361 -29610 -20374 -1595 12715 35156 15456 -5426 28344
1328 28344 43099 43372 58730 44833 46167 47721 25110 8129 -4158 6315 14941 5872 25752
1315 25752 10926 -1522 -11308 -10648 -2999 3310 35498 44821 46480 18053 -9039 -4457 -7414 -409
1301 -409 -2607 -2308 20928 32573 30695 10061 -12796 -21375 -6532 -280 10410 -14125 -36558
1288 -36558 -19136 -18688 -16931 -25948 -26848 -1155 11798 22968 22033 -5330 -33757 -35066 -31389 -8406
1274 -8406 -2092 -931 6618 -32848 -14319 -22190 -31933 -12200 -9718 3514 -3403 15022 18733 6118
1260 6118 186 -118 -12377 -14348 -9892 5348 9754 17223 4794 -26099 -21227 -16667 11733 26018
1246 26018 31686 15739 8441 7677 4617 10119 -3883 -31555 -27646 -27293 -42720 -28110 -12243 8325
1232 8325 20148 6066 -4773 -10457 -16878 -19562 5106 3435 1991 -2759 33993 8753 -4454
1219 -4454 -6284 17884 17894 1249 12512 47470 31425 25869 20390 -6588 6714 22085 16579
1206 16579 28344 51067 63257 52591 30879 40379 36740 26424 6118 21510 36690 -3128
1194 -3128 -29277 -30704 -42197 -36276 -27047 -34193 -30023 -25666 -29120 -24337 -18913 11952 33991 37624
1180 37624 83332 76532 68194 54103 22463 214 2374 10507 38426 43431 50051 20155 -12563
1167 -12563 -7416 18943 29319 18041 -4775 -6691 -15648 -3747 -16935 -25295 -7674 29267 28196
1154 28196 29209 26068 -3184 -14370 -23712 -25588 -36196 -33472 -10531 -13941 -660 12234 23993
1141 23993 35340 27590 9889 -5552 27738 26342 4110 -5455 -11016 -8335 968 798 -5862 -26352
1127 -26352 -21921 2297 23543 28990 11912 -1480 17147 17368 -12865 8941 18101 -4729 -39974
1114 -39974 -53137 -26018 -8830 16027 20458 8931 -4345 29315 53241 25603 19102 8389
1102 8389 -1156 -7543 6821 14981 8962 7267 2084 22026 44170 34757 19852 19465 22211 29308
1088 29308 37721 30379 -1556 -14794 3811 7149 33638 38442 41744 46031 41188 33546 26947 31077
1074 31077 49089 59403 45689 30687 36393 32165 24128 30286 32634 18551 2602 -2175 15632
1061 15632 -2738 -36167 -25961 -27207 -16502 -59 37873 46506 48527 37335 16488 28909
1049 28909 47163 45583 49415 37869 18855 4136 21840 15714 -20683 -2339 24349 16034 -1889
1036 -1889 -18798 -1575 30289 19418 -400 -9130 -22342 27181 43915 10460 -45772 -40100
1024 -40100 -14735 7253 12963 -4807 8820 26823 31149 46501 42488 37420 23455 33478 45330
1011 45330 29429 19304 16211 37666 45917 40192 50655 50269 39090 45324 31586 38574 12297
998 12297 -14481 -12890 11232 27028 29177 18959 5681 -8866 -44839 -55255 -54352 -27110 -17113
985 -17113 -9840 32901 67467 50081 34958 933 -15572 -17112 -9918 1650 9696 -1132 -20091
972 -20091 -19716 -597 18865 9989 -10841 -15157 -4590 9783 11533 29144 43439 31250 14194
959 14194 16776 20134 -8857 -16431 15362 23961 24424 48206 55085 38784 30971 22858 9643 29261
945 29261 45550 38420 33967 18213 -1147 -5299 20602 32270 24800 23913 24789 24551 35066 28199
931 28199 19631 4863 -1501 6153 40473 44018 10199 -18482 -28155 -28582 -1295 20844 26709 34652
917 34652 17641 10778 1535 -12901 -26726 -7369 9144 12144 15070 -1235 22833 42111 31990
904 31990 17939 6411 -10345 2761 58957 58369 31777 28695 34497 31528 14415 11423 16098
891 16098 44469 35689 27188 24893 49504 71645 83486 71602 43571 33518 48978 46540 39374
878 39374 23198 6544 3559 2322 13019 29349 -4679 -10788 -2128 9030 30899 39332 46583
865 46583 23970 23775 20007 -159 -9678 -5439 -18127 -42882 -8336 -2112 8065 23936 30180
852 30180 35381 25546 3507 -8655 25742 29550 4629 -14085 -12219 -4268 -524 8728 16325 4693
838 4693 -315 14369 27988 17164 5138 2968 22938 44535 52259 29977 21556 5973 -1010
825 -1010 -17681 -12906 654 30368 27735 22933 11885 -23082 -36158 -44334 -17380 -9751 724
812 724 -3140 -3691 -15034 -27808 -26303 -10063 -4831 -6117 -7053 10985 12627 5329 31884 41817 32983
797 32983 39765 29800 23030 546 7439 24447 15628 -5536 -20172 -6753 17145 1862 1642
784 1642 13447 -1199 14377 30108 25048 31067 -604 -19913 -14751 -21391 -28664 4549 12427
771 12427 -14363 7315 17661 8874 -3306 -5642 14279 23536 14033 24425 16942 1035 15952
758 15952 18735 15039 17472 9485 -286 4139 -15520 -7927 6466 -4472 -23389 -43147 -59705
745 -59705 -45888 -20779 -7625 -11029 -6678 -11893 8318 24926 35848 25748 10124 11153 19267
732 19267 29914 29212 19285 15249 8271 -17096 -25161 -28027 -40184 -49038 -68719 -58336 -40721 -14256
718 -14256 -7616 -2485 17537 18728 15818 -8288 -26832 -18880 10454 33405 40522 23072 -16177
705 -16177 -11865 13838 27707 11163 8797 24447 14851 -26505 -32761 -11829 -14470 -15361 -23436 -11674
691 -11674 14464 -7204 -13772 -7225 -14643 -9385 -12513 -12688 -804 3257 27373 49781 2812 -31662
677 -31662 -48288 -18355 25746 48022 41713 8398 3138 13404 -2339 -7057 -17373 -13864 -20364
664 -20364 7707 6133 1556 -15280 -43200 -45809 -42400 -23652 -9884 -15873 18003 11730 9883
651 9883 -7659 -12173 1399 -1260 -33658 -39291 -39004 -21604 2946 36399 24335 35066 25429
638 25429 15810 13285 2534 -21675 -19083 -12249 7159 21367 24822 8840 -6146 -1777 26543
625 26543 25804 17259 -271 -17032 -14465 -6530 -9434 -16336 -51696 -61488 -24074 -7994 -8113 -958
611 -958 -9547 -9858 -3601 -12634 -4725 -15287 -11528 -14200 6416 9357 702 8384 2247 3376 9618
596 9618 39931 34309 9509 6510 10877 8199 12950 6692 -56 1183 -331 4840 25252 14885
582 14885 -1181 9501 10896 30267 50461 32401 11313 -1209 -4251 21726 8239 -301 915
569 915 -10627 -11573 -8983 4671 -282 -18730 -35414 -47918 -4007 25136 51278 30717 15581
556 15581 10488 16824 22263 8365 -20151 5838 16515 4424 -4773 -4739 21747 60261 81660
543 81660 65978 65161 19635 -3307 2962 1650 9452 18838 8048 -4670 12040 15357 13861 23504
529 23504 21918 32026 27903 12110 15165 2573 -34675 -17554 -20821 -19250 7313 25424 -11307
516 -11307 11694 34342 45595 10044 -10374 -42682 -32093 -32530 -28665 -8153 17566 25730 49667
503 49667 35301 34765 34336 35116 -3130 -4664 31437 19484 8507 8112 9882 31635 42786 50860
489 50860 59597 64388 63979 39628 -9420 -50735 -40618 -30446 -43075 -28534 -25606 -16044 -17940
476 -17940 -15703 -24098 -30769 -26090 -39780 -38352 -28116 -21406 -40773 -39986 -22872 10741 6957 -3104
462 -3104 -4245 -23391 -9950 -11232 -27366 -29676 -28011 -11355 1915 5792 -14720 -33868 -34845 -69317
448 -69317 -41137 -30808 -13376 -9346 -697 -2307 5154 33198 34844 27359 14056 22677 42821
435 42821 28115 -3067 -18694 -25460 -49834 -63685 -42132 -20818 -28011 -32036 -29414 -10660 6070
422 6070 25910 43811 40704 30977 20174 23323 2801 -586 5632 -1880 1136 19500 22891 36833
408 36833 27143 15534 14332 26478 12726 -5757 -3885 11039 36739 33699 23776 36127 46518
395 46518 24048 9003 4462 -12085 -30613 -21397 -8349 448 -533 10192 -12504 -38482 -29123
382 -29123 -20549 -3016 -21482 -39478 -10421 -2177 11018 -7282 13138 10520 -7102 -16442 -1390
369 -1390 -1484 -11147 -24825 -42376 -35998 -12500 3112 28198 38093 27115 -9886 -21076 -4286
356 -4286 24997 43879 45237 24063 15420 11912 5851 4674 5113 -679 -23328 -34409 -39621 -24094
342 -24094 -167 32798 28659 9388 8851 21282 20101 -1542 7760 18920 27058 46978 34945
329 34945 3668 -10074 -6602 -114 -11998 -23467 -24920 -38666 -47560 -55885 -37352 -37984 -17059
316 -17059 3336 6352 8508 -7554 -26463 -24686 -2730 334 -17795 -19963 -7431 16398 3213
303 3213 9871 6558 13677 -3083 -1671 23402 29348 10131 -3608 -38618 -32135 -27909 -28734 -20285
289 -20285 2 13893 -11401 -14834 -10118 -2531 10034 45200 59286 35788 10487 10992 3777
276 3777 -3175 11502 27788 3572 -5655 -1720 9059 15441 37667 40840 35830 32706 9029 -13798
262 -13798 -10558 1648 3160 18223 11562 -23377 4757 11589 27563 34758 24638 10050 1570
249 1570 1025 -3535 -5220 -36068 -51169 -31975 -13475 -22768 -25274 -26432 -7308 14614 3970 26128
235 26128 20587 16992 10976 8541 2864 8643 24825 25736 24967 33801 47088 71149 72430 60922
221 60922 54409 30667 27976 10569 -12467 -8261 -4857 4490 2039 3715 4931 1233 9652 12100
207 12100 -9665 -6755 4784 7668 -9366 19237 31287 20718 2922 -17633 3022 24220
195 24220 14823 2350 -890 -7456 2361 -6882 -5727 -15920 -25035 -14720 12092 14268 -18018 -44527
181 -44527 -40636 -21691 -799 -1634 1028 -15011 -27422 -22712 -6768 3664 -5978 -1715 -4973 -1380
167 -1380 17170 375 -19532 1385 24426 28764 39839 42727 34093 19688 31065 35971 38484
154 38484 28975 13238 -11887 -25330 -7303 895 11473 16247 21500 19629 12771 2488 -16463
141 -16463 -5819 5381 21654 13391 10068 -4651 -2217 -19269 -19044 -3177 15627 15287 4627
128 4627 -18004 -29154 -14292 9408 7449 -2085 -13347 -3757 -13460 -15379 -14086 -27770 -40169
115 -40169 -39487 -47102 -42481 -12119 -684 -11568 -15433 1708 13023 15432 11173 -1285 17287
102 17287 26698 7453 -1779 71 16659 23087 44798 44944 25570 25190 20371 31606 13560 20891
88 20891 24924 14115 -2266 -26366 -35984 -18800 12741 16905 20351 22257 22391 -1119 -10870 -10726
74 -10726 -3456 -10995 -14694 -4414 -1609 -5376 -3261 -9909 -10399 -13474 -33167 -18464 620 -10683
60 -10683 -15924 -21777 -7887 1864 -512 -1643 -425 4807 17482 9511 12653 2389 1462 9365 19715
45 19715 18163 19948 13722 -6312 -1404 -6059 11797 32699 28319 7314 10105 2480 -14482 -26891
31 -26891 -4809 12237 16659 17258 7563 -6168 -8066 1557 2047 2493 -8093 -5664 -5208 -2054 14232
16 14232 26313 22686 25398 1910 1657 7287 7018 -223 -1493 -4789 -938 -14145 -15172 4572 24824
1 24824 33515
0 33515
$$ Imaginary data points
##PAGE= N=2
##DATA TABLE= (X++(I..I)), XYDATA
32767 66598 49267 40651 43476 40729 48459 68172 67521 62915 48560 36667 50351 55705 69524
$$ [...]
##END NTUPLES=NMR SPECTRUM
##END=
