##TITLE=Analysis number 323034
Compound Code cc 58924
Book Reference 494/70
Project Code adrs
Chemist Name craigr
##JCAMPDX= 6.0         $$ Bruker NMR JCAMP-DX V2.0
##DATA TYPE= NMR SPECTRUM
##DATA CLASS= NTUPLES
##ORIGIN= Bruker BioSpin GmbH
##OWNER= nmr
$$ XWIN-NMR		Version 3.5
$$ Tue Oct 17 15:47:41 2006 GMT Daylight Time (UT+1h)  MAYBRIDGE\nmr@NMR_250MHZ
##.OBSERVE FREQUENCY= 250.131544655141
##.OBSERVE NUCLEUS= ^1H
##.ACQUISITION MODE= SIMULTANEOUS (DQD)
##.ACQUISITION SCHEME= undefined
##.AVERAGES= 16
##.DIGITISER RES= 18
##SPECTROMETER/DATA SYSTEM= dpx250
##.PULSE SEQUENCE= zg30
##.SOLVENT NAME= CDCl3
##.SHIFT REFERENCE= (INTERNAL, CDCl3, 0, 16.522)
##AUDIT TRAIL= $$ (NUMBER, WHEN, WHO, WHERE, WHAT)
$$ ##TITLE= Audit trail, XWIN-NMR		Version 3.5
$$ ##JCAMPDX= 5.01
$$ ##ORIGIN= Bruker BioSpin GmbH
$$ ##OWNER= nmr
$$ C:\u/data/dgb/nmr/ADRS/670/pdata/1/auditp.txt
$$ ##AUDIT TRAIL=  $$ (NUMBER, WHEN, WHO, WHERE, WHAT)
(   1,<2006-10-17 15:47:14.43 +100>,<MAYBRIDGE\nmr>,<NMR_250MHZ>,
      <created by zg, POWCHK disabled, PULCHK disabled
       configuration hash MD5:
       49 4B E0 1D 92 C2 6B 37 9F E6 65 BC 52 41 86 1D
       data hash MD5: 64K
       AB B5 D6 67 D3 E9 91 BA 2E 12 58 60 F1 A5 47 A3>)
(   2,<2006-10-17 15:47:31.53 +100>,<MAYBRIDGE\nmr>,<NMR_250MHZ>,
      <Start of raw data processing
       ef LB = 0.3 FT_mod = 6 PKNL = 1 SI = 32K 
       data hash MD5: 32K
       28 AB C5 F3 56 D7 0E D3 F7 4E 13 6B 96 38 73 46>)
(   3,<2006-10-17 15:47:33.34 +100>,<MAYBRIDGE\nmr>,<NMR_250MHZ>,
      <apk 
       data hash MD5: 32K
       7E 96 08 9D F5 0D 48 BC C4 2E FF E7 93 8A EB 99>)
(   4,<2006-10-17 15:47:34.14 +100>,<MAYBRIDGE\nmr>,<NMR_250MHZ>,
      <abs ABSG = 5 
       data hash MD5: 32K
       D1 74 1A AD 0C 5B 98 70 5D 88 D3 55 C1 61 E2 5C>)
$$ ##END=
$$ 
$$ hash MD5
$$ EA B3 2D 42 9E ED 64 A3 1C 70 D3 F7 02 40 16 3F
##$RELAX= 
##$RELAX= 
##$RELAX= 
##$RELAX= 
##$RELAX= 
##$RELAX= 
##$RELAX= 
$$ Bruker specific parameters
$$ --------------------------
##$DU= <C:\u>
##$EXPNO= 670
##$NAME= <ADRS>
##$PROCNO= 1
##$TYPE= <nmr>
##$USER= <dgb>
##$AMP= (0..31)
100 100 100 100 100 100 100 100 100 100 100 100 100 100 100 100 100 100 
100 100 100 100 100 100 100 100 100 100 100 100 100 100 
##$AQSEQ= 0
##$AQ_mod= 3
##$AUNM= <au_zg>
##$AUTOPOS= <60 >
##$BF1= 250.13
##$BF2= 250.13
##$BF3= 250.13
##$BF4= 250.13
##$BF5= 500.13
##$BF6= 500.13
##$BF7= 500.13
##$BF8= 500.13
##$BYTORDA= 1
##$CFDGTYP= 0
##$CFRGTYP= 5
##$CHEMSTR= <none>
##$CNST= (0..31)
1 1 145 1 1 1 1 1 1 1 1 1 1 1 1 1 1 1 1 1 1 1 1 1 1 1 1 1 1 1 1 1 
##$CPDPRG= <>
##$CPDPRG1= <>
##$CPDPRG2= <>
##$CPDPRG3= <>
##$CPDPRG4= <mlev>
##$CPDPRG5= <mlev>
##$CPDPRG6= <mlev>
##$CPDPRG7= <mlev>
##$CPDPRG8= <mlev>
##$CPDPRGB= <>
##$CPDPRGT= <>
##$D= (0..31)
0 1 0 0 0 0 0 0 0 0.06 0 0 0 0 0 0 0.0002 0 0 0 0 0 0 0 0 0 0 0 0 0 0 
0 
##$DATE= 1161096433
##$DBL= (0..7)
120 120 120 120 120 120 120 120 
##$DBP= (0..7)
150 150 150 150 150 150 150 150 
##$DBP07= 0
##$DBPNAM0= <>
##$DBPNAM1= <>
$$ [...]
##$SUBNAM7= <"">
##$SUBNAM8= <"">
##$SUBNAM9= <"">
##$SW= 20.6930455092707
##$SWIBOX= (0..15)
0 0 3 0 0 0 0 0 0 0 0 0 0 0 0 0 
##$SW_h= 5175.983436853
##$TD= 65536
##$TD0= 1
##$TE= 683.16
##$TE2= 300
##$TE3= 300
##$TEG= 300
##$TL= (0..7)
0 120 120 120 120 120 120 120 
##$TP= (0..7)
150 150 150 150 150 150 150 150 
##$TP07= 0
##$TPNAME0= <>
##$TPNAME1= <>
##$TPNAME2= <>
##$TPNAME3= <>
##$TPNAME4= <>
##$TPNAME5= <>
##$TPNAME6= <>
##$TPNAME7= <>
##$TPOAL= (0..7)
0.5 0.5 0.5 0.5 0.5 0.5 0.5 0.5 
##$TPOFFS= (0..7)
0 0 0 0 0 0 0 0 
##$TUNHIN= 0
##$TUNHOUT= 0
##$TUNXOUT= 0
##$USERA1= <user>
##$USERA2= <user>
##$USERA3= <user>
##$USERA4= <user>
##$USERA5= <user>
##$V9= 5
##$VALIST= <valist>
##$VCLIST= <CCCCCCCCCCCCCCC>
##$VD= 0
##$VDLIST= <DDDDDDDDDDDDDDD>
##$VPLIST= <PPPPPPPPPPPPPPP>
##$VTLIST= <TTTTTTTTTTTTTTT>
##$WBST= 1024
##$WBSW= 4
##$XGAIN= (0..3)
0 0 0 0 
##$XL= 0
##$YL= 0
##$YMAX_a= 386850
##$YMIN_a= -469872
##$ZGOPTNS= <>
##$ZL1= 120
##$ZL2= 120
##$ZL3= 120
##$ZL4= 120
##$ABSF1= 16.522
##$ABSF2= -4.171173
##$ABSG= 5
##$ABSL= 3
##$ALPHA= 0
##$AQORDER= 0
##$ASSFAC= 0
##$ASSFACI= 0
##$ASSFACX= 0
##$ASSWID= 0
##$AUNMP= <proc_1d>
##$AZFE= 0.1
##$AZFW= 0.1
##$BCFW= 0
##$BC_mod= 0
##$BYTORDP= 0
##$COROFFS= 0
##$CY= 12.5
##$DATMOD= 1
##$DC= 0
##$DFILT= <>
##$DTYPP= 0
##$F1P= 14.0000005364418
##$F2P= -0.99999901652339
##$FCOR= 0.5
##$FTSIZE= 32768
##$FT_mod= 6
##$GAMMA= 0
##$GB= 0
##$INTBC= 1
##$INTSCL= 1
##$ISEN= 128
##$LB= 0.3
##$LEV0= 0
##$LPBIN= 0
##$MAXI= 10000
##$MC2= 0
##$MEAN= 0
##$ME_mod= 0
##$MI= 0
##$NCOEF= 0
##$NC_proc= -4
##$NLEV= 6
##$NOISF1= 0
##$NOISF2= 0
##$NSP= 0
##$NTH_PI= 0
##$NZP= 0
##$OFFSET= 16.522
##$PC= 1
##$PHC0= -55.95882
##$PHC1= 9.13553
##$PH_mod= 1
##$PKNL= yes
##$PPARMOD= 0
##$PSCAL= 4
##$PSIGN= 0
##$REVERSE= no
##$SF= 250.13
##$SI= 32768
##$SIGF1= 0
##$SIGF2= 0
##$SINO= 400
##$SIOLD= 32768
##$SREGLST= <1H.CDCl3>
##$SSB= 0
##$STSI= 32768
##$STSR= 0
##$SW_p= 5175.98343685301
##$SYMM= 0
##$S_DEV= 0
##$TDeff= 65536
##$TDoff= 0
##$TI= <Analysis number 999999
Compound Code 99
Book Reference 9
Project Code 9>
##$TILT= no
##$TM1= 0
##$TM2= 0
##$TOPLEV= 0
##$USERP1= <user>
##$USERP2= <user>
##$USERP3= <user>
##$USERP4= <user>
##$USERP5= <user>
##$WDW= 1
##$XDIM= 32768
##$YMAX_p= 413128802
##$YMIN_p= -122866
$$ End of Bruker specific parameters
$$ ---------------------------------
##NTUPLES= NMR SPECTRUM
##VAR_NAME=  FREQUENCY,     SPECTRUM/REAL,   SPECTRUM/IMAG
##SYMBOL=    X,             R,               I
##VAR_TYPE=  INDEPENDENT,   DEPENDENT,       DEPENDENT
##VAR_FORM=  AFFN,          ASDF,            ASDF
##VAR_DIM=   32768,         32768,           32768
##UNITS=     HZ,            ARBITRARY UNITS, ARBITRARY UNITS
##FACTOR=    0.157963299565203, 1,           1
##FIRST=     4132.6476996994, 0,             0
##LAST=      -1043.33573715361, 0,           0
##MIN=       -1043.33573715361, -122866,     0
##MAX=       4132.6476996994, 413128802,     0
$$ Real data points
##PAGE= N=1
##DATA TABLE= (X++(R..R)), XYDATA
$$ [...]
20299 23943 47119 52168 54309 39360 29412 30709 15537 2433 -19712 1627 10105 43700 50127
20286 50127 30179 48841 63716 36870 22556 12290 9390 4082 1543 31286 39156 19342
20274 19342 5646 -14207 -3110 4324 14639 -23934 -40825 -40178 -18994 -12188 -33651 -36498 -19268
20261 -19268 6450 28920 26783 26438 10102 -5069 -8917 6183 37160 41868 33250 24422 32368
20248 32368 46011 54214 52104 27434 23933 1963 -14361 8443 25239 9789 34998 52543
20236 52543 41516 9319 6304 6718 33128 14056 28113 8599 -11573 -14737 -37607 -17327
20224 -17327 22167 18657 6562 23823 9895 7453 19917 30720 32090 9640 -9790 -5136
20212 -5136 2486 15595 21463 23548 14408 21570 44640 47212 37132 35810 20825 47843 39717
20199 39717 24981 18139 9855 3269 5504 -1528 -6019 -5737 17885 24003 22235 24743 22552 32889
20185 32889 18181 -217 3760 -1611 2545 23062 2203 -90 143 -8970 -39840 -43881 -6485
20172 -6485 12003 -10262 -23024 -1066 18715 18437 14837 26667 44693 60656 67487 50719 50427
20159 50427 32629 25474 22510 13752 33250 20376 27238 51076 56296 38908 25363 18626 21868
20146 21868 16797 -364 -9705 -10058 -24370 2687 24810 15234 5399 10211 2696 -25982 -25865 -4487
20132 -4487 30291 21012 36025 83030 73643 68473 53053 46418 30294 10104 -4993 -20959 -22482
20119 -22482 17531 30096 24161 34143 44969 36466 30048 13541 11659 -3321 -23966 -14563 -8504
20106 -8504 -2590 27227 45149 25147 2640 -10311 16188 43366 47669 18137 2489 -2100
20094 -2100 1723 -10968 -5823 -15735 -385 18002 46864 59075 49297 38821 36113 52342 34681
20081 34681 34597 47335 56923 56015 28542 15318 56855 89537 69845 24093 7519 21914 23647
20068 23647 15850 -973 -12000 2482 28174 26393 30683 32684 44871 52299 46121 29723 5094
20055 5094 -28660 -3325 19147 27305 21509 19245 42366 32208 29489 22608 -26 13746 24984
20042 24984 30893 18706 13488 18520 11548 19356 11027 8432 16004 33570 48878 40443 45142 50550
20028 50550 44305 26337 24601 59123 89716 94058 46461 22519 32972 46891 24847 3504
20016 3504 -17455 -7740 19703 6389 7336 -3193 15808 -132 -30772 -29591 -22168 -28103 -4736
20003 -4736 19906 35603 58445 87437 55844 30030 24409 25544 10912 9540 14744 4485 -13922
19990 -13922 -773 5443 20860 44610 48330 52244 58884 28102 20365 34550 31173 33651 16861
19977 16861 31701 19267 -5827 1508 -3464 -1697 -607 -291 -3533 13965 16975 -4479 2761
19964 2761 23852 55974 43461 55771 41632 23955 7585 20505 29036 10552 12211 15926
19952 15926 16540 9680 -4993 21546 46782 36396 30818 7938 -15080 -606 -640 -26254 -5365
19939 -5365 -355 8085 32018 19166 4955 5369 3482 28730 47566 59807 36223 19671 18884
19926 18884 33137 -12564 -31695 -3768 8570 25753 32147 36425 28543 9104 -1262 29096
19914 29096 32723 1985 29406 68703 57859 30424 5497 13840 15465 17669 11748 13644 37303
19901 37303 48726 3051 11809 11600 20898 12948 42601 88592 80577 30033 -4831 -21843 16609
19888 16609 30972 29263 -2693 -24309 5447 11208 44017 57540 42474 28011 25015 40675
19876 40675 5713 20003 38426 25829 10092 43450 57768 43371 37476 32876 42653 32823
19864 32823 39901 37176 23713 15564 21503 27710 28472 28881 36903 40974 18303 26756 18010 10389
19850 10389 27790 29126 31855 58882 45772 11731 26405 38629 30065 13088 22315 37322
19838 37322 27314 37824 43109 49495 52167 35639 44813 48659 61396 57019 67185 81974 77960
19825 77960 62039 49005 52233 67001 49361 42724 59746 37356 -4252 -8881 10589 33197
19813 33197 39816 23067 9671 19783 13525 28650 32834 36498 43292 65099 63852 72495 83558
19800 83558 97931 96513 85070 96034 75557 74198 70808 71632 68223 67428 59232 48266 60170
19787 60170 59715 52427 59486 64812 62780 58120 47415 29987 40955 50349 54641 67961 66978 55096
19773 55096 57459 43810 44149 66972 83799 93309 104052 113115 121119 75400 26724 55380 84470
19760 84470 89263 98948 84520 82694 68108 89773 127718 154350 174540 171528 180063 249454 298012
19747 298012 345680 392016 422647 466260 517503 543031 547079 542316 527446 510841 500134 479854
19735 479854 440195 426228 407731 355454 299192 245739 190494 150648 111976 78596 58909
19724 58909 75070 112151 131080 123910 95465 126312 123712 92545 91681 78259 78461 105880 97006
19711 97006 81724 50264 78156 97582 95959 93569 102005 107858 96370 114993 107909 96318 100418
19698 100418 97088 79372 77165 73956 64474 58788 59349 56801 39691 57534 96573 82143 61242
19685 61242 71060 77305 71826 62185 59518 40526 32873 33617 39218 38021 20378 31615 51485 48227
19671 48227 42147 37091 13467 34423 73019 72695 60592 53438 60031 59182 61725 65235 88601 83600
19657 83600 83274 77531 59373 57286 69415 53977 43333 43264 38225 24220 19337 33673 54711
19644 54711 64826 90943 113485 96131 85562 80163 56202 48060 53869 66026 52819 43065
19632 43065 50858 42549 22502 22638 22370 12342 -245 -2616 4680 2338 25120 40101 29128
19619 29128 43505 34488 34725 27309 55711 70413 72202 50222 64414 68142 70597 89186 99857
19606 99857 80967 28221 29094 48359 61683 68859 87650 73036 61199 55895 63944 33012 38593
19593 38593 33816 54867 56678 68352 75552 79783 72647 59066 58748 84729 55805 38243 52432
19580 52432 55660 72838 65912 80292 67266 46535 50947 62385 80808 101865 91669 82215
19568 82215 65073 87944 103336 92432 86275 61960 37630 49856 76909 82060 84971 64247
19556 64247 41500 39310 53211 54093 52915 51607 44036 44192 45026 71443 73072 81844 84659 55167
19542 55167 55840 53767 68168 84964 95559 89797 43630 39477 34515 47830 43606 64786 81259
19529 81259 87732 100433 98070 106555 85351 70067 63799 65566 61350 90226 112612 117877 98053
19516 98053 91879 81691 79803 78830 60770 74691 83242 100114 103222 89296 83355 62989 82425
19503 82425 95131 94339 70257 82793 95989 108915 100118 52624 51988 63642 85328 91440 84082
19490 84082 42958 42633 67069 65368 89502 95311 92100 103492 73460 58023 56333 87797 90972
19477 90972 73092 62051 36760 16259 1330 25435 56054 90888 77151 54876 30921 33201
19465 33201 34910 68858 87118 82289 58291 41371 51850 69714 88216 92098 98899 122631
19453 122631 121734 117515 120905 113835 105469 104200 120472 118278 94625 110222 116201 120002 106598
19440 106598 65506 70405 70629 81439 110490 141356 153317 148066 140596 162549 195425 189223 195174
19427 195174 226865 230421 219649 241611 245646 248431 240422 243090 245123 203492 194241 178526 173868
19414 173868 176736 149772 136879 133448 131664 137716 147445 122001 105518 100821 90344 100664 144234
19401 144234 150883 133255 123820 119488 132081 138973 117558 108249 121750 133729 129614 108180 111612
19388 111612 126381 114724 99881 83350 100742 126870 149512 160749 170196 187307 181906 202189
19376 202189 224436 253921 298557 343923 387663 465876 526314 597424 679393 719489 746644
19365 746644 695935 671961 665223 625417 582937 495109 435777 394531 355975 291768 237350 229834
19353 229834 236044 212112 184368 162337 166599 180751 189649 191468 173576 169444 157366 141278
19341 141278 158675 195689 215443 197178 188665 191013 161747 143152 152468 172076 190686 168026
19329 168026 140195 125501 137329 127794 126578 130486 157377 176756 203817 217788 201496 208542
19317 208542 202357 189575 222182 269637 277294 302760 271182 226489 240452 270486 274350 254943
19305 254943 248048 249051 270901 284895 295950 318597 326267 318322 318794 334075 354285 351959 350788
19292 350788 351224 344989 325515 287117 291841 291815 289422 270709 268818 295601 307848 323068 343509
19279 343509 317987 318333 311535 303181 300862 304248 356083 362107 345187 340609 338964 314248 318106
19266 318106 338009 357649 365695 369491 396796 414443 421084 442637 432788 427301 426159 416865 432071
19253 432071 426988 417641 430439 464737 489650 479676 453333 439439 461661 474301 445015 431719
19241 431719 425941 456316 496288 511974 548755 572910 585492 579969 592965 624695 635105 627678
19229 627678 645238 685200 701890 706025 729125 755008 802321 812411 839101 885041 936990 1000237
19217 1000237 1066619 1130012 1170453 1197702 1265254 1338963 1433624 1520040 1625056 1740984 1866850
19206 1866850 1994089 2160105 2362490 2576495 2792458 3007947 3251275 3502784 3724645
19197 3724645 3914467 4107688 4288586 4476190 4699297 4931218 5188059 5489597 5879828
19188 5879828 6353218 6981804 7767239 8801123 10127557 11870968 14225131 17306605 21223886
19179 21223886 26215655 32387990 39751690 48212117 57505697 67301836 77185523 86494885
19171 86494885 94502878 100575673 104460508 105970115 104870776 101068261 95099572 87594091
19163 87594091 78992887 69722055 60422023 51749809 43994912 37271610 31640394 27038675
19155 27038675 23345949 20459584 18195415 16393708 14948267 13750194 12733839 11905011
19147 11905011 11194973 10597335 10057844 9622300 9244038 8915311 8602466 8297069 7989291
19138 7989291 7647599 7323383 6972962 6635678 6308012 5972827 5654879 5368133 5071880
19129 5071880 4808492 4546375 4299405 4063681 3869772 3688803 3493983 3351721 3239576
19120 3239576 3105512 2959218 2831598 2741360 2633810 2533860 2459180 2367371 2283458 2205362
19110 2205362 2151326 2074198 2018845 1955786 1891066 1818210 1755781 1684369 1628637 1583889 1534778
19099 1534778 1478038 1431436 1387281 1371282 1344632 1286752 1228725 1157692 1112766 1080104 1053835
19088 1053835 1002208 963719 937838 918048 912997 872626 833024 822537 821190 802516 778931 748424
19076 748424 720211 719024 703464 667801 656830 611751 583809 565912 554950 566832 539656 520029
19064 520029 551499 565643 561099 532193 489047 453325 422648 425371 435787 446802 456596 451059
19052 451059 439152 452930 457418 482338 487328 475797 455515 430330 401732 359333 340307 326890
19040 326890 340662 330351 297341 257625 222100 204078 198882 210701 201685 162458 159508 199236
19028 199236 219407 198365 202860 194227 190490 192212 190970 170136 153779 141861 134236 131813 141544
19015 141544 145042 136181 128047 144786 165500 168334 167260 172441 177544 188843 179299 190289 202707
19002 202707 174706 151211 156516 149126 144840 161673 152486 139660 118267 114028 125754 118254 121265
18989 121265 144389 123009 110193 122088 133324 118441 99077 70705 72969 113507 145652 174846
18977 174846 178989 142092 126744 112320 125526 125435 126156 132517 107981 82963 88535 113675 122824
18964 122824 115865 109311 119185 121301 120555 136124 133515 138008 138066 164604 145913 134612 136112 132780
18950 132780 134595 125786 125160 162806 175474 153170 148176 159325 168365 148615 119339 127062 166124
18937 166124 163344 161269 164435 182529 207054 209140 167569 126937 157527 193485 206723 189581
18925 189581 191686 171554 142146 149688 152778 165085 183006 155723 176525 211298 196883 173869
18913 173869 183586 183594 206815 235355 222182 213591 214659 226668 206658 194357 193743 197778 201074 187371
18899 187371 165239 169041 170862 172938 200750 209711 213121 199545 220984 255212 242076 234681 245502
18886 245502 262290 258252 228837 236752 260239 269957 275492 274924 286764 320315 343418 344679 330906
18873 330906 315647 305358 339545 372027 382916 357170 366697 378657 379647 386974 407412 411981
18861 411981 395445 397312 400025 408159 415901 450715 472415 479136 487751 502470 563488 596854 594149
18848 594149 631182 689660 699010 725457 766994 855463 896235 953747 1002191 1056275 1123213 1183999
18836 1183999 1290825 1409626 1568884 1734161 1879085 2060022 2275715 2493903 2717592
18827 2717592 2917351 3093258 3228439 3310392 3367322 3431229 3444799 3460609 3519296 3625052
18817 3625052 3803939 4024717 4315907 4703224 5171340 5757000 6508057 7440003 8659580
18808 8659580 10259267 12372766 15208389 19008345 24042214 30491894 38559693 48247138
18800 48247138 59232967 71052809 83068312 94435773 103995410 110835152 114498477
18793 114498477 114679083 111180405 104366275 95237541 84660823 73366283 62191613 52000047
18785 52000047 43232603 35936235 30042076 25465116 21944040 19252614 17160244 15494640
18777 15494640 14109824 12956171 12005292 11192717 10504124 9912567 9411049 8969124 8583606
18768 8583606 8291064 8026744 7779725 7526854 7304970 7127027 6943772 6729649 6491193
18759 6491193 6202354 5899177 5620116 5339133 5047968 4736072 4439163 4169539 3909401
18750 3909401 3664474 3460794 3277833 3129148 2981768 2841817 2739606 2634856 2530562
18741 2530562 2440417 2358567 2285856 2208384 2139555 2065318 1977875 1929489 1880302 1809656 1729346
18730 1729346 1689898 1650127 1626709 1562213 1507443 1442317 1397414 1341927 1303260 1233463 1177748
18719 1177748 1158062 1147096 1117553 1038188 989744 940087 906919 893036 855607 808346 747668
18708 747668 710328 689470 683685 662049 622311 622279 598914 572488 561232 537458 517899 502727
18696 502727 507496 500075 480204 452562 425281 429577 446829 451122 455972 421514 403759 390478
18684 390478 338215 274373 240298 239106 262697 278545 291121 280538 250867 225450 189256 167301
18672 167301 147704 107389 104120 128474 125818 94600 92288 64598 55605 75388 94098 69312
18660 69312 67701 67003 80049 117917 105663 97965 115343 97976 82696 70439 56375 51835 64050
18647 64050 87373 85698 81192 66606 43553 5494 -12126 -4090 35294 55275 59517 54832 57254
18634 57254 61251 78897 79344 72041 42135 31552 28138 54894 47714 48696 62884 45255 32849
18621 32849 34982 40637 44309 29366 25420 28979 13429 37487 78291 80844 108228 112482 113732
18608 113732 122752 127674 120890 133250 139931 136296 159009 156240 185285 237425 267058 320294 368013
18595 368013 428493 452623 479726 520268 544661 538924 524475 494366 511195 499281 466393 402371
18583 402371 353636 313494 242156 183343 135576 93838 100622 108673 93995 102746 94879 98348
18571 98348 96425 92057 64593 50649 64766 51263 35205 50030 64349 46607 65279 64876
18559 64876 48421 25722 -13764 -28424 -31254 -30564 -14902 33891 24098 13193 -10993 -10093 21279
18546 21279 41998 21828 20399 150 -28157 -5752 -11053 -2712 3249 -2677 5843 -147 16074
18533 16074 11493 -2513 -19057 -57408 -73070 -49968 -23378 -18377 10727 8928 -105 -21733
18521 -21733 -35945 -42947 -51082 -23040 -11031 -20604 -27957 -23015 -17617 -33415 -41164 -26546 -32507
18508 -32507 -33960 -45650 -40970 -47024 -65761 -64512 -55951 -36579 -44799 -66958 -51631 -48536 -42697
18495 -42697 8277 18747 1295 8617 31467 23372 4403 -31237 -22832 -8758 1124 -4380 -2086
18482 -2086 -35137 -41460 -25663 -33542 -43811 -40347 -28019 -18356 -5019 -1429 6254 6550 -24537
18469 -24537 -42386 -84084 -91596 -75115 -73679 -69673 -50997 -28457 -41354 -30707 -17337 -57034
18457 -57034 -64293 -65834 -56090 -22106 -10055 -37976 -36178 -35704 -35402 -23302 -45918 -35138 -38746
18444 -38746 -71004 -78866 -67045 -68863 -55235 -42310 -51765 -57047 -48497 -37642 -15595 -23394 -22657
18431 -22657 -24747 -43999 -64805 -68735 -81019 -88820 -79098 -80568 -58108 -54866 -57434 -67875 -64506
18418 -64506 -49084 -34955 -59686 -68841 -65725 -32046 -5243 -18415 -44452 -62762 -77677 -36109
18406 -36109 -7987 -25751 -34134 -19599 -3396 -8106 -19753 -6839 -11861 -10569 -16956 -26468 -36645
18393 -36645 -43302 -31924 -21060 -14907 -24608 -53615 -50862 -25601 -13758 -27323 -35463 -9759 -4337
18380 -4337 -35061 -50169 -28634 -5456 7132 25614 -8628 -26167 -31516 -15897 -9996 -11119
18368 -11119 -15715 -35249 -32793 -18514 9902 24468 17637 -11911 -36038 -60071 -72190 -44871
18356 -44871 -40321 -54172 -49455 -52339 -53618 -78209 -76848 -66531 -64366 -53278 -36378 -70993 -81272
18343 -81272 -75395 -81172 -75337 -44563 -36536 -32943 -20544 -22001 -38348 -23150 -7621 -17075 -44326
18330 -44326 -42463 -31950 -31481 -5942 -30992 -61854 -55873 -47569 -48884 -60931 -47109 -35950 -39507
18317 -39507 -31959 -26334 -21524 -47022 -68790 -78469 -53688 -27811 -16570 -21511 -8839 -11487 -37552
18304 -37552 -56733 -31011 -14105 -3072 10322 -11195 -22361 -21488 -49924 -57772 -35571 -37547
18292 -37547 -38361 -30099 -33179 -33750 -42990 -58525 -29351 -2366 -20853 -21826 -7288 9718 -2107
18279 -2107 -10363 -38159 -43209 -41721 -34380 -26623 -19497 -24851 -27919 -20837 -15380 -12690 -38682 -66710
18265 -66710 -70985 -28351 -25347 -34997 -12474 -13985 -21023 -22286 -25739 -34430 -1991 33385 36986
18252 36986 6185 7007 -8743 -11656 -32248 -68771 -83157 -33920 6404 -390 -40753 -27662
18240 -27662 -9805 21860 16649 25788 50095 18626 22024 49647 71011 62998 68567 71426 105277
18227 105277 133440 157663 165584 185331 231849 288665 325393 385139 468438 539282 582605 602751
18215 602751 587499 577261 557749 520734 482781 435809 377614 338962 290408 208497 181200
18204 181200 174159 140282 126186 96686 86882 80037 108034 92942 77640 84517 85717 102454
18192 102454 99960 56501 33866 30839 33174 46270 34308 37781 43154 40130 27941 22229 51029
18179 51029 58281 45828 40126 42970 21201 1156 17051 37915 39439 29368 36293 54596 60161
18166 60161 55065 23691 -7044 27611 26759 11288 42139 31390 10492 5228 23532 32133 59201
18153 59201 92267 104703 92875 69039 90706 116548 109007 97722 86238 93777 122971 132512
18141 132512 125231 141692 159198 181490 227853 233788 226322 240705 265458 274444 343639 422207
18129 422207 440751 484365 513037 531070 571013 619692 728352 892696 1083899 1312036 1625224
18118 1625224 2070792 2765850 3887094 5762060 8740273 12746676 16662386 20123142
18110 20123142 23389705 25088102 23334221 17704783 12295061 8719782 6450017 4977003
18102 4977003 3968816 3293665 2820385 2480603 2223441 2037655 1852054 1720626 1614257
18093 1614257 1494217 1389407 1264567 1154199 1094545 1019570 942323 894613 870120 831092
18083 831092 779259 725483 698462 664209 645708 621228 575629 550578 527790 503123 478550
18072 478550 470949 490137 460164 430670 409489 396539 360473 357561 343578 315746 293879 297192
18060 297192 286557 283997 291542 287197 281004 284211 272316 263193 235565 215559 225695 229690 251350
18047 251350 270798 243835 212144 206328 196177 153257 146871 141600 148303 151270 135685 114489
18035 114489 118347 101589 100119 70487 60507 97351 108988 91525 79768 80145 93939 82732
18023 82732 42992 39038 32922 34510 44744 62488 89758 82269 40563 31824 43503 49655 52586
18010 52586 60949 70775 76002 59532 32494 20269 3534 2111 6275 -6868 -17601 -14329 -4793
17997 -4793 13796 24331 27310 26453 21541 8522 4034 3141 14046 -5594 -41675 -64150 -43213
17984 -43213 -46745 -8749 26622 14271 -23904 -27061 -12352 -28727 -41877 -54429 -60421 -38086
17972 -38086 -7898 -28401 -15832 -17735 -26648 -26128 -17418 -45812 -58717 -6407 7375 -10417 -43398
17959 -43398 -31134 -32566 -62702 -96882 -88559 -76216 -30140 -9407 -52889 -43850 -38829 -39797 -33075
17946 -33075 -9398 -16395 -8070 -3340 4611 -41 -9465 -8888 9034 6283 -25634 -31272 -14750 13817
17932 13817 30041 18182 2415 -387 15278 20401 1521 6859 -4565 1825 20331 23805 21515
17919 21515 -2205 -17144 -26218 35 -21125 -24734 -11957 -11160 -18570 -37464 -42828 -32765 -48758
17906 -48758 -52865 -75325 -84602 -56714 -45384 -52595 -91256 -86968 -42431 -15868 -9010 -4677 -7569
17893 -7569 -31457 -35126 -35566 -19365 18156 18355 18057 6521 -2891 -23697 -52461 -45524 -14967 -24828
17879 -24828 -40646 -52947 -24432 -8381 -1671 -4436 -18636 -17517 -34284 -27424 -23385 -45387 -57631
17866 -57631 -21122 20009 22601 5773 -22749 -35798 -40632 -33594 -16629 -16708 -26160 -9238 14732
17853 14732 -9945 -24674 -40052 -33933 -10106 579 -21090 -12455 -414 3759 15399 -10675
17841 -10675 -22100 7354 -4359 4371 5530 15251 19848 976 -27706 -16510 -12338 -14924 -22807
17828 -22807 -22292 1644 12370 26760 35971 18172 15918 -11860 -43131 -39580 -47596 -53923 -39703
17815 -39703 -57693 -84308 -94295 -57821 -17712 -23754 -52888 -66152 -18865 -14852 -16469 -20694 -19605
17802 -19605 -11445 1753 8775 13743 1836 5253 -8957 -33230 -30396 -39747 -44761 949 6057
17789 6057 -39187 -21482 3994 -3372 -29076 -52720 -64487 -46111 -44501 -41917 -37872 -30706 -35959
17776 -35959 -31064 -28928 -34382 -29787 -36338 -47244 -10374 -5835 -23544 -25593 -31427 -39609 -38872 -24746
17762 -24746 -20802 -40695 -77798 -71911 -78449 -77645 -60478 -50665 -16150 6804 17059 -2298 -11552
17749 -11552 -3858 4340 -8927 -26388 -20576 -21117 -23828 -35776 -25394 1308 13765 10579 401
17736 401 -36271 -69112 -76753 -52970 -31872 -15718 -51 15092 348 -10820 -16766 -35461
17724 -35461 -47734 -58316 -46540 -29280 -22036 -29468 -52165 -49526 -28758 -9899 -36591 -67331
17712 -67331 -44918 -27534 -22816 -40281 -25684 9639 12229 34399 26616 12395 -2811 -16135
17700 -16135 -5897 7841 13518 -4989 -18542 6445 21998 32894 30178 191 5063 11457
17688 11457 17103 19108 10639 10913 6934 43694 47400 38191 26339 21383 25267 34132 61215 67917
17674 67917 34461 26220 8677 -1692 20528 6309 20478 30470 25915 24781 -13376 -25460
17662 -25460 -23912 -19820 9140 35200 34715 12652 6577 1335 1643 8048 6408 19189 -7368 -39558
17648 -39558 -19180 -13860 -13443 2513 14809 -23109 -46706 -21132 -18480 -20717 -22302 -9064 26326
17635 26326 16129 -14002 633 -10828 -12353 -6006 -18425 -11583 8334 4846 -16265 -11478 -14108
17622 -14108 -33016 -29144 -12595 -10568 -15814 -18383 -17435 -8283 -4193 12105 15223 1653 2393 30554
17608 30554 46234 30497 15804 30462 33299 9395 -17465 -13995 6780 -1761 2413 1078 30703
17595 30703 27762 14876 775 1841 -17153 -34113 -21606 -30778 -38154 -24960 -9021 14493
17583 14493 2161 -34404 -36826 -45970 -30133 -11911 -32458 -24372 -14671 1619 17652 22534 30345
17570 30345 22569 -801 -26372 -17583 4666 218 -21520 -35681 -37018 -36296 -44655 -32241 -44403
17557 -44403 -28774 -1412 29707 19891 15234 35908 46846 44796 29976 60528 40657 1775
17545 1775 -19396 -20149 -15405 -13581 1070 -6897 -14159 -22116 -13811 -820 -13373 -36859 -29945 -11408
17531 -11408 -9208 8161 -6386 -10909 -12943 -14689 -5302 -10955 -14829 -218 -6183 -5010 -31417
17518 -31417 -49360 -65485 -70872 -45049 -7725 -13515 -24082 -58339 -76498 -75277 -49403 -38202
17506 -38202 -27159 -23287 -14356 -1696 17519 24630 20182 696 -33790 -35436 -47632 -28679 -10257
17493 -10257 -4029 -7813 -14071 -5001 13748 20854 21440 23512 -1677 -29016 -25245 -38545 -40502 -27467
17479 -27467 2331 18502 15324 -16287 -34177 -35598 -19273 7958 -2598 -12104 -3068 9061
17467 9061 -11646 -37542 -39278 -12905 -16890 -27750 -29496 -50139 -39405 -35315 -25522 -5067 16361
17454 16361 -11038 -44250 -28666 15494 30336 20852 1902 9254 18425 41180 62588 72839
17442 72839 57916 55250 48633 28645 38785 54180 38055 4398 5400 -2753 -8846 -4390 13001
17429 13001 17949 -18952 -42443 -22146 4838 -5982 -25050 -26173 -46388 -62888 -71969 -50067
17417 -50067 -36412 -16851 9560 1695 7716 -12620 -25532 -29932 -19454 -19640 6154 8050 -1691
17404 -1691 -23160 -18185 -5086 -9364 -1016 -14549 -20737 -23828 -18846 -33058 -20701 -25650 -22687
17391 -22687 19503 -224 -18741 -23504 -27623 -29430 -16925 -29709 -41789 -51946 -37844 -59976
17379 -59976 -63169 -56874 -74107 -86272 -69227 -48029 -24504 -8858 -1501 -3987 -15749 -1272
17367 -1272 1253 -10263 -24204 -24073 -35346 -35532 -20188 -22495 -31893 -50695 -34109 1939 11554
17354 11554 9155 14222 31792 16860 -2856 -7136 16222 6153 -27058 -36259 -29496 3098 6073
17341 6073 -10301 -10431 -29497 -29668 -20995 -18212 -21156 -19690 -16210 -35350 -71153 -82300 -45499 -20257
17327 -20257 -38462 -34847 -31480 7225 31503 17051 -24191 -57539 -59786 -38345 -21087 -10220
17315 -10220 -14887 -10490 -28271 -29863 -972 -24030 1438 28640 17817 -19899 -30199 -45267
17303 -45267 -26525 -29947 -66419 -85885 -93949 -82682 -63630 -43534 -26924 -24377 -29479 -41522
17291 -41522 -46037 -10739 46794 58278 33373 8411 14330 -5698 -16287 -3295 -20466 -31899
17279 -31899 -31852 -16590 -14632 -59811 -64726 -22896 5196 13813 -10827 -27587 -34444 -6624 4888
17266 4888 -17230 -29072 -36042 -38639 -36256 -31657 -2631 3422 -24065 -38259 -11238 -10355 -11269 12702
17252 12702 -131 -8215 -7530 -28654 -47209 -51399 -26218 13935 4274 -13361 -33094 -44281 -35249
17239 -35249 -39840 -29809 -49092 -54334 -30666 -21296 -10244 432 -4713 22517 26375 28066 20547
17226 20547 -26677 -16408 -22292 -4693 -11058 -46315 -37616 -8826 -3318 -25807 -39291 -32413 -54595
17213 -54595 -58791 -60682 -50553 -39660 -37889 -22302 -17565 -45468 -45567 -31778 -52537 -56936 -40660
17200 -40660 -47427 -78938 -75310 -51826 -43609 -66773 -73793 -55373 -36491 -13713 75 -14433
17188 -14433 -23164 -23222 -34811 -19317 -6421 -10377 -1130 -13665 -2107 5116 -15283 -26362 -31231
17175 -31231 -9292 -2971 -28097 -1270 14471 257 -17335 -21531 -27079 -38160 -19090 -15041
17163 -15041 -5969 3408 7896 7434 7896 -1608 -4146 -4087 -21741 -27668 7412 6737 -394 11271 18197
17148 18197 -3482 -28684 -30428 -65354 -66299 -50751 -47500 -51502 -45597 -59168 -62210 -68145 -63255
17135 -63255 -68443 -43941 -23072 -57593 -81683 -65145 -56429 -34148 -26361 -38794 -27500 -13799
17123 -13799 -21887 -41152 -65850 -49277 -46436 -94180 -68462 -19311 -29047 -35783 -41046 -36979 -52346
17110 -52346 -75673 -69764 -55396 -68656 -53202 -44273 -35077 -36149 -43071 -43032 -70925 -65545 -29019
17097 -29019 -26663 -26066 5242 3577 11428 -34993 -41204 -40052 -23022 -26929 -35952 -35787 -36321 -39920
17083 -39920 -32123 -13175 -25045 -23585 -23485 -22008 -27104 -47172 -39427 -54491 -33127 -31811 -34233
17070 -34233 -28734 -47140 -50155 -43187 -47126 -50949 -19414 -25625 -47151 -50684 -42512 -51712 -33510
17057 -33510 -11877 -4951 -14562 -34160 -42916 -36576 -24753 -1220 11974 17516 10676 6525 -2447
17044 -2447 -399 -44337 -69052 -60998 -50176 -14495 -16862 -9089 -6009 -13038 -39850 -24414 5235
17031 5235 -2386 -15420 -5567 9504 5855 -6741 -16038 -43516 -50202 -52961 -57101 -67059 -55491
17018 -55491 -59706 -57484 -45921 -30234 -29608 -61700 -71618 -47012 -17601 -10397 -11476 -21224 -4545
17005 -4545 -22065 -24494 -25062 -43342 -58714 -39840 -23270 -33059 -46439 -63379 -86996 -66868 -22954
16992 -22954 -22465 -42635 -42299 -42429 -55471 -77169 -55774 -43101 -39773 -9533 -303 -4876 -32254
16979 -32254 -42184 -66158 -61520 -46935 -10113 -14995 -42186 -37537 -39011 -51261 -57066 -39565 -51819
16966 -51819 -43170 -23694 -17951 -45492 -56441 -27604 -19876 -24194 -21345 -27206 -19730 -21593 -46728
16953 -46728 -46038 -7724 -5446 -11376 -25065 -24585 7748 -6661 -53906 -50240 -17685 8718 36224
16940 36224 22225 -11312 -10977 29994 36096 7353 4269 -3470 -20703 -27591 -25277 -11625 -27512
16927 -27512 -25007 1982 16685 -20693 -32881 -57851 -76166 -70220 -65431 -57287 -48637 -45223 -27030
16914 -27030 -24372 3872 -4641 -38402 -59049 -74269 -70052 -50161 -36068 -41309 -25878 -17549 -18500
16901 -18500 -10910 13845 -925 -42187 -65076 -46435 -7011 -34870 -57710 -44021 -18468 -32840
16889 -32840 -42541 -52025 -29200 -19686 2762 2482 -26869 -33327 -26629 -30796 -27127 -14762 25046
16876 25046 26120 23456 13042 37793 16781 21146 30715 26593 5180 -16339 -14900 -4203 26513
16863 26513 37919 24247 17357 -2434 -1498 -1336 6869 6834 -1882 -18359 -18984 -30744 -42727 -29462
16849 -29462 -21950 -31515 -18294 -937 4650 669 23200 21548 30298 8737 -5043 3383 15080
16836 15080 92 -38654 -27734 -15528 -6691 1351 6072 2852 6273 -15273 -26644 -5617 -26104
16823 -26104 -37647 -70602 -98567 -107509 -122866 -91544 -85443 -95498 -92692 -41671 -33683 -28534 -24598
16810 -24598 -30450 -58294 -38246 -15794 3133 -23366 -36002 -45691 -50672 -40928 -16623 -2398
16798 -2398 27972 8454 -29650 -36746 -39288 -31548 -3259 1886 -1256 -876 -19204 -52704 -32863
16785 -32863 1485 2019 2063 -8807 -53999 -76755 -50602 -28923 -9390 -15025 -30597 -14928 -10471
16772 -10471 -620 -6679 -21049 -28681 -30330 -25837 -19054 -6988 5536 -2286 -32697 -32639 -39884 -31904
16758 -31904 -29328 -53427 -67119 -51326 -36277 -16683 -18895 -13926 -1961 -16823 -35621 -49872
16746 -49872 -65452 -62549 -56250 -44922 -38032 -22366 -877 4522 -3951 4942 -20293 -15849 -32420
16733 -32420 -30895 -21633 -20218 -3884 23920 25067 21079 -2827 -15856 -23484 -38271 -52173 -22206
16720 -22206 -15659 -25276 8214 11929 -9784 -32114 -38370 -29868 -23092 -16900 11488 43364 27709
16707 27709 14990 43445 31269 11369 -7822 -28557 -29971 -30528 -28371 -30302 -27027 -47120 -61184
16694 -61184 -53939 -32187 16709 22716 -905 2092 -12705 -48448 -35136 -27040 -43670 -30321
16682 -30321 -23081 -22259 -27851 -3116 3333 -32749 -53183 -35097 -24719 1024 14082 8341 5323
16669 5323 -17718 -47420 -43235 -23960 -14208 -15812 -14047 -26284 -34962 -30366 -21449 -44006 -48583
16656 -48583 -75384 -95301 -71897 -45643 -29286 -41646 -54860 -54433 -33981 -45267 -60282 -32504
16644 -32504 -1836 -22968 -48393 -45469 -32445 -20332 -22291 -18885 -22640 -42615 -52618 -70646
16632 -70646 -86592 -76710 -85606 -66659 -51597 -46155 -13559 3748 9555 32571 15186 -24234
16620 -24234 -7179 13082 20948 15038 -43 -23752 -25912 -36176 -31823 -26722 -10273 -6856 -16835
16607 -16835 -28529 -24418 -37066 -49538 -40291 -37009 -51041 -56557 -43388 -45741 -53246 -73916 -67711
16594 -67711 -41243 -5904 10464 21501 1832 -52994 -73371 -66911 -60621 -56599 -40485 -61043
16582 -61043 -65146 -36919 -37318 -29358 -14497 -208 -24898 -37331 -55563 -33033 -13481 -28693
16570 -28693 -37178 -41682 -31628 -30504 -57080 -50765 -18186 -25159 -34631 -33661 -24040 5963 11631 6605
16556 6605 -8945 -10637 -17663 -20659 -41169 -39495 -16366 -7980 14360 10816 23422 27191 4494
16543 4494 -5774 -19068 -34944 -46394 -29205 -24473 1752 -13085 -28358 -45664 -76118 -53002
16531 -53002 -29510 -30962 -50785 -38785 -41924 -29816 -38254 -62948 -39791 -16558 -985 17158
16519 17158 38721 27296 -3316 -30684 -23788 14 -4913 -5553 7276 -10463 -19010 -40323 -83874
16506 -83874 -105268 -75653 -32890 -11427 -24467 -35250 -43014 -39030 -29720 -44814 -37750 -16849
16494 -16849 3467 -40087 -69027 -69714 -49076 -37514 -20276 -30928 -75909 -78735 -86897 -82273 -73161
16481 -73161 -60344 -41758 -38549 133 25642 47543 12475 -28410 -22866 -11432 -12647 -11310
16469 -11310 -7862 -10975 -21291 -20372 -64424 -86001 -59288 -38052 -19845 14381 48756 26078
16457 26078 22486 4932 -26733 -19812 -26488 -59480 -46812 -20885 -13796 -8688 -5262 -6702 -7742
16444 -7742 -25086 -20280 -8469 -935 -11520 -32343 -46087 -59260 -46172 -47656 -47220 -42979 -16198
16431 -16198 -4851 -8438 -22629 -16670 -10978 -14976 -57091 -74469 -62477 -64568 -59622 -51601 -46388
16418 -46388 -28672 -38130 -56589 -63181 -58133 -37802 -28477 -44165 -49613 -27900 -10678 -25180 -31242
16405 -31242 -30141 -31731 -31297 -20290 -7021 -29253 -46133 -56667 -79995 -72649 -54508 -45805 -34481
16392 -34481 -59264 -97973 -86993 -55951 -33650 -24417 -12686 -22599 -27092 -52413 -45144 -24456
16380 -24456 -29010 -36839 -39367 -59175 -56235 -13546 -5896 -28311 -45122 -51432 -41817 -45920 -64791
16367 -64791 -74115 -56063 -31193 -17447 -23841 -29867 -46569 -39705 -19100 -51846 -57226 -40831 -26507
16354 -26507 -22999 -12981 -10926 -26651 -4217 13081 18508 -13981 -23520 -43084 -32848 -40231 -61411
16341 -61411 -76189 -58924 -45217 -42732 -64113 -82241 -75007 -62319 -55388 -55205 -45740 -22840 -26448
16328 -26448 -35478 -41601 -38350 -56076 -76921 -67767 -50669 -39163 -53357 -63212 -50541 -39217 -55657
16315 -55657 -52903 -50437 -29996 -57672 -57146 -65462 -53281 -50231 -43915 -42233 -41535 -50455 -47470 -43898
16301 -43898 -38095 -29738 -13115 -20207 5287 20039 -4579 -7931 -2303 -3216 16241 38744 38783 34057
16287 34057 44289 42245 31807 20811 15873 343 -19645 -41831 -46744 -36837 -37833 -19769 -10705
16274 -10705 -11301 -784 3370 3813 -23721 -44504 -42972 -7229 38509 33767 -530 -10532 -4544
16261 -4544 822 -383 -12170 -190 -22119 -41073 -28574 -33530 -6883 32856 35375 10618 -19324
16248 -19324 -23605 -39776 -37013 -20610 -11952 -18116 -34957 -35277 -34608 -19460 -16032 -31832 -16913
16235 -16913 -12347 -46631 -31442 -27293 -21044 -33955 -38014 -53417 -59067 -28186 -27494 -40290 -36511
16222 -36511 -31830 -2220 -15841 -18425 -27650 -44469 -27132 -29271 -43271 -57588 -38902 -2696
16210 -2696 -5542 -16993 -18871 3699 -5923 -24887 -22814 -2414 -25799 -60715 -68194 -54155 -45679
16197 -45679 -51297 -51447 -28903 -39400 -42233 -37737 -37439 -33828 -46323 -36452 -17089 -9094 -39532 -44024
16183 -44024 -36005 -49373 -27465 1123 -4220 -40653 -54859 -52200 -36778 -27240 -31091 -37126 -26212
16170 -26212 -28583 -53949 -54491 -63682 -59119 -30758 -33227 -36345 -34998 -47616 -54254 -28891 -11605
16157 -11605 -8027 -1888 17680 13677 -405 -3370 16370 12733 12366 -10761 -32285 -36106 -44157
16144 -44157 -48424 -24522 -25471 -23807 -7427 19444 27559 12459 -7896 -6887 -16129 -9081 -16798
16131 -16798 -16456 -6205 3746 25402 19841 -15666 -49824 -60418 -73150 -56113 -42015 -44990 -72417
16118 -72417 -48910 -35609 -50673 -68909 -69627 -46528 -36361 -48528 -48752 -28314 -19594 -27673 -32372
16105 -32372 -38357 -51594 -31853 -21546 -14964 -4272 1849 -17693 -16760 -11154 -1196 -29984 -49757
16092 -49757 -29487 -37698 -31829 -37148 -62248 -70985 -28806 1498 -7993 -33919 -63284 -68599 -46453
16079 -46453 -24187 -31032 -41342 -23828 -12583 -23891 -28976 -18559 -45225 -37120 -9879 -4740
16067 -4740 -5742 -8700 -31143 -20359 -31811 -31148 -20775 -25504 -38934 -38491 -37654 -38359 -48972 -50530
16053 -50530 -42570 -53886 -34302 -43109 -55287 -29238 -10820 -13270 -29008 -34591 -60191 -72405
16041 -72405 -49680 -41921 -40990 -38311 -20259 -3064 -1237 -31941 -29091 -19460 -19058 -58144 -47617
16028 -47617 -16644 15926 27068 5324 7753 13519 35511 46005 37576 6243 984 12758
16016 12758 9873 12083 22376 5861 -14651 -57 -7518 -17482 -14436 -15308 3906 -15171 -18877
16003 -18877 -6768 521 -17994 -31334 -34384 -26675 6840 23469 32693 10184 -24789 -40682
15991 -40682 -43819 -45991 -52100 -28998 -3809 2226 -19831 -21063 -7835 -21878 -10392 4913 -17542
15978 -17542 -25067 -58042 -59630 -41193 -32461 -38784 -33768 -23994 -12633 -24028 -24367 -14902 -7258 2283
15964 2283 4331 12960 3570 1462 6967 -2165 -13581 -45062 -60299 -40412 -12149 -3723 -12405
15951 -12405 -18058 -12999 -13282 -14799 -29427 -39561 -37099 9770 22007 -29440 -66490 -58906 -36215
15938 -36215 -30012 -16852 -31182 -49909 -35949 -17953 -24850 -36569 -21435 -6831 -10427 -31116
15926 -31116 -35782 -29123 -30847 -37220 -40321 -17753 -21509 -11940 4451 -15473 -20855 -29300 -32333 -26945
15912 -26945 -12276 -12117 3476 -9338 -2468 -3549 9551 2888 -970 23703 -2819 -23212 -34073
15899 -34073 -29036 -19698 -26056 -20242 -22216 -44044 -39240 -41134 -30828 -26725 -10943 -889 1985
15886 1985 -470 12459 34220 24905 -7701 947 15099 15932 -10385 -17936 -16319 -11620 2788
15873 2788 17271 6985 -2300 -3536 10254 21256 8170 -3961 11599 24761 3262 -7055
15861 -7055 -14906 -8403 2860 16785 15842 -11106 -7051 -5913 9345 -437 -12575 -1984 -16647
15848 -16647 -16645 -10121 -1314 24196 46992 27195 -2491 -6870 -3453 17890 26177 17885 -11522 -20925
15834 -20925 -33400 -29906 -26596 -35495 -25815 -15345 -23406 -18899 -24685 -25857 -39176 -38166 -28961 -44569
15820 -44569 -38632 -24092 -24419 10338 -8075 -21096 -7320 14409 21724 1568 -24559 -37074
15808 -37074 -37513 -23712 -23428 -35407 -59777 -63950 -31670 -35074 -36410 -37142 -45257 -52236 -60960 -62066
15794 -62066 -57838 -9 29777 -6310 -29136 -47918 -51644 -28852 -34208 -24867 -32366 -40945 -48299
15781 -48299 -21018 -9222 1385 9253 -9854 -20105 -5128 -22847 -45956 -36872 -14826 -36678
15769 -36678 -37157 -41531 -17954 -25232 -21398 -27932 -51427 -65994 -89172 -68272 -47739 -37522 -61541
15756 -61541 -75354 -66311 -41625 -11352 21307 29862 19361 22962 -2113 -40280 -64148 -61573
15744 -61573 -36083 -34755 -48176 -61900 -23444 -26402 -34233 -42018 -17269 -20465 -27496 -30796 -8882
15731 -8882 -5636 -25995 -8818 -1262 10773 555 -6704 -11276 -21761 -28568 -46226 -60209 -58407
15718 -58407 -31356 -9901 -9512 -6084 4803 -7404 -714 19274 24876 13043 12351 -761 -17277
15705 -17277 -42643 -64693 -51972 -50490 -55597 -41583 -41496 -57794 -36776 1984 -8479 -15558 -11236
15692 -11236 16075 3625 12427 2761 -12880 -9666 -26870 -48337 -49547 -38079 -1405 31198
15680 31198 23169 9878 9786 29169 18806 -5246 7771 18012 12315 -3162 5400 -2331 -25605
15667 -25605 -26848 -14701 197 -5723 -39998 -37384 -32305 -34505 -41642 -51006 -56636 -16196 -16338 -36994
15653 -36994 -60732 -60018 -39024 -18133 7501 -5649 -2502 5778 -15300 -34657 -34963 -33362 -20025
15640 -20025 4304 -21641 -9475 -35189 -42639 -51818 -41990 -55700 -29025 -14522 -16802 -27533
15628 -27533 -48895 -29183 -19107 -27476 15137 24004 12554 -14511 -19447 -10099 -18260 -28418 -23047
15615 -23047 -15970 -16488 -25371 -22102 -49438 -74284 -69910 -45777 -68391 -44203 -25589 -27099 -48635
15602 -48635 -45066 -39622 -35412 -36592 -61324 -65796 -70893 -57850 -38272 -31853 -20811 -2123 3328
15589 3328 2269 10350 -12024 -8098 -13189 -22981 -44427 -29433 -13604 -17030 -16042 -14591 -1812 -25319
15575 -25319 -47496 -48879 -33389 -18796 -26384 -12950 1952 8378 -4336 -39516 -39771 -42989 -49695
15562 -49695 -45695 -46928 -68255 -79624 -63210 -56533 -70063 -60925 -41906 -7871 18522 30371
15550 30371 18329 -18722 -28355 -33380 -37376 -31029 -42441 -28089 -2885 10939 7896 19768 -331
15537 -331 -27472 -38678 -37796 -34610 -11509 -10352 -9079 -13706 6972 23928 49586 47542 10473
15524 10473 1440 5424 26722 16455 1785 1122 4464 -20148 -33530 -37381 -5735 -58898 -65643
15511 -65643 -39884 -10654 -674 -47911 -56887 -45361 -61423 -63864 -36841 -15134 -17452 -7413
15499 -7413 -17910 -2098 3299 10421 -28255 -64271 -75588 -71707 -61055 -44065 -17016 -17084 -21461
15486 -21461 -25727 -12717 -12411 -17785 -26867 -63343 -84256 -57305 -56954 -76217 -53748 -50573 -49208
15473 -49208 -16976 -12091 -46613 -73773 -72044 -43326 -13143 -7559 -10670 2793 -35622 -51543
15461 -51543 -24269 -7506 13708 -1814 4009 20046 11543 -10089 -25988 -31504 -25462 -13142
15449 -13142 -16070 -3429 1721 -22682 -39828 -30246 -25510 -15709 12668 -499 -15953 -31586 -42999
15436 -42999 -15611 11523 14826 -13061 -17481 227 -6467 -35185 -23240 -34539 -71113 -57347
15424 -57347 -51561 -50424 -37398 -42791 -51422 -42756 -57952 -75307 -70009 -40923 -28680 -17786 -20161
15411 -20161 -26840 -6373 -17686 -38927 -61434 -63170 -42122 -28847 -22544 -7675 -13501 -13099 -11263
15398 -11263 -3425 -150 3527 8170 -3759 -6952 10126 32919 21655 -1047 -10962 -38700 -41837
15385 -41837 -66067 -58706 -16911 -3917 7575 9495 -125 -19949 -10643 -12590 5249 18443 -1033
15372 -1033 -18682 -14092 -19064 -42921 -30339 -44983 -55813 -62873 -79957 -57998 -32136 -13154
15360 -13154 27083 35010 45608 37053 31307 34384 42961 8418 -10329 7049 7904 16619 3561
15347 3561 -1984 33284 34774 16152 -7962 -10636 -2337 3249 12463 1828 -18307 1453 2032
15334 2032 -7016 878 -26860 -43532 -35822 -5047 6320 16703 3580 -10935 -30881 -57624
15322 -57624 -78165 -70584 -32759 -13313 -960 15199 32911 41056 26986 10999 17706 3513
15310 3513 -23423 -31246 -44485 -69488 -75975 -54385 -27268 -8696 -29370 -45239 -40469 11543
15298 11543 25824 -13297 9649 21424 11628 3040 17267 31021 67832 62971 32310 18312
15286 18312 -11656 -2043 28905 28836 20427 21187 18848 19373 24745 23791 29560 -3471 -12804 18133 22738
15271 22738 -30495 -51031 -26314 5224 4281 -29173 -26622 -8719 18153 17080 8171 20035 -2109
15258 -2109 -34129 -31118 -53756 -41277 -29106 -6647 -2749 -4219 -7087 16881 13185 -18312 -37717
15245 -37717 -45592 -26022 -12822 -17564 -37732 -48134 -26509 -5708 -7391 6188 16116 -259
15233 -259 -23431 -23655 -8397 -13258 -21648 -15444 -14177 -21124 -15951 -23678 -33437 -48725 -75516 -69313
15219 -69313 -79187 -67188 -34303 -29680 -34266 -37113 -54749 -51353 -16540 -11953 -12826 -31981 -37053
15206 -37053 -25083 -48534 -57795 -58071 -44136 -34207 -34096 -40375 -28347 -9062 -14551 -19546 -60035
15193 -60035 -57450 -26063 -10736 15405 16335 1388 -16577 -31451 -38015 -28325 -11138 -21365 -8178
15180 -8178 1463 6526 12177 -5047 -12177 -20948 -23034 -22994 -21736 -31776 -4386 928 -11824 -26264
15166 -26264 -32899 -28575 -35096 -39046 -18357 -20270 -28743 -31931 -39973 -36560 -29951 -3653 27840 -12412
15152 -12412 -45728 -68630 -57979 -20474 -35457 -56113 -54105 -42143 -28570 -49513 -43781 -43936
15140 -43936 -27614 -12586 -13517 4858 2285 -10024 -7259 -26821 -30064 -16840 -16930 -10027 -10524 -24646
15126 -24646 -29308 -46033 -21714 -2823 -18628 -34483 -14691 3595 -19713 -42294 -39429 -48339
15114 -48339 -49226 -18466 -7195 -21910 -24472 -36482 -40298 -33965 -43433 -21188 3101 7948 -10597
15101 -10597 -26817 -50215 -39672 -28343 -27548 -24673 -20784 -44600 -26996 2106 29178 33072 22244
15088 22244 40442 39277 24444 22691 12838 9294 -8447 -11837 6542 21936 14825 10674 15745
15075 15745 12106 13480 33961 26821 142 -22469 -31360 -19322 2459 19823 -5647 -6461 -11912
15062 -11912 11599 17856 7469 -19555 -13986 -8882 -15277 -10800 -6725 -17753 -7391 6587 -2436
15049 -2436 -9276 -15523 -28180 -34394 -32199 5840 30400 13668 22816 29701 2356 -17314 -29834
15036 -29834 -15127 -22391 -45346 -42291 -28966 -9294 5950 9772 -8115 -23047 -8020 7715
15024 7715 -11691 -3813 20395 4353 12872 24766 15898 8178 6901 3527 9514 18135 14883 -1047
15010 -1047 -20361 -23866 -22127 -31505 -42998 -54430 -10496 19003 6936 -7581 10034 32619
14998 32619 44557 41042 34698 40657 27229 14801 56758 109272 168820 223771 249487 266426
14986 266426 258045 217353 146216 88195 50451 21614 27795 41343 39973 41163 37658 75702
14974 75702 59435 33032 -7086 -16131 -23131 -20740 -22890 -6926 3720 -94 -8986 -27737 -17500
14961 -17500 -6030 -37487 -29934 -31215 -23508 15623 13217 -21883 -21473 -23765 -34349 -31821 -7583
14948 -7583 -18459 -42641 -41765 -22075 -9197 25238 55001 26479 1859 -2232 -14708 -13358 -12884
14935 -12884 -29344 -41358 -9518 10508 8530 -3592 -11920 -7450 -4913 -16157 -33792 -26061 -37096
14922 -37096 -38082 -19625 -1567 37074 31057 -8169 -27365 -37896 -47660 -52581 -82889 -66915 -57231
14909 -57231 -35686 -40342 -47054 -17001 -374 -20198 -19631 511 1673 3357 11432 -12380 -22821
14896 -22821 -10336 -10270 -311 -866 -4518 -19426 -433 -1475 -3099 -9209 -10225 -30475 -46446 -67151
14882 -67151 -27331 -17999 -14540 -22794 -24107 -33426 -24223 -30714 -11745 -7615 -9217 -19583 -15264 -8398
14868 -8398 -50352 -56929 -35261 -9326 -14140 -19895 -8545 -11519 -13604 -6545 -3803 -13753 -22524 -21886
14854 -21886 -8187 12793 9376 -1140 18612 32776 30845 20364 -12966 -18155 -3891 -10617
14842 -10617 -10711 -20660 -26770 -33392 -31605 -13640 -311 -14305 -24365 -43628 -23502 -2508 7545
14829 7545 15879 12740 -10130 -34903 -30826 -16433 5193 9810 6121 8840 28282 32782 16487
14816 16487 1541 17020 23469 -1281 -20093 -35980 -26571 -29811 -23397 17873 18790 9488 881
14803 881 -17457 -31580 -25387 -26186 -17044 -10555 8872 2494 5140 38150 21067 -13118 3748
14790 3748 27726 45717 28220 31599 8073 30784 59223 25416 15862 19533 6319 1064 3766
14777 3766 -18290 -40505 -41975 -31613 -39753 -21968 -10402 -31883 -15315 -9610 24085 44313
14765 44313 46743 48843 59528 27503 -13892 -43334 -26534 3286 1874 13286 -6482 -31868
14753 -31868 -26281 -11332 -10988 -17040 -8107 -12208 12724 13650 -7907 -9222 -10647 -29484 -48661 -41745
14739 -41745 -28569 -28934 -18093 -16303 -7160 -12696 -21131 -16809 -2073 7750 10030 13271 -11626 -31073
14725 -31073 -19976 -15205 -9876 -4022 -6775 -18202 -37598 -23732 1187 -4665 -16510 -11578 -2386
14712 -2386 9794 16854 11400 -4051 12538 25013 29948 11628 1053 -20948 -44389 -24370
14700 -24370 12362 41325 46964 31281 22809 22193 26870 -2102 -8258 -34377 -40806 -14020 -8986
14687 -8986 -18528 -15698 9964 9402 -10315 -39136 -6783 49175 46842 13846 14017 37238 25829
14674 25829 4103 -22743 -37736 -25709 -10125 -17674 -26757 -6611 11142 44 -17685 -32991
14662 -32991 -19842 -34083 -45343 -50098 -42577 -42403 -26085 -9300 -5144 -10030 -20111 -46744 -50359
14649 -50359 -38961 -18959 -1428 40351 39012 44614 26768 4565 20808 25778 30745 23472 4241
14636 4241 -17952 4514 23925 11245 7853 18580 34455 16872 7007 3810 3773 21627 28588
14623 28588 32117 43933 35788 20702 5740 2254 8141 6885 15638 22951 -15250 -11278 7044
14610 7044 -3251 -12932 -31084 -33051 -28412 -8881 721 13766 15732 -12880 -19176 -16036 -23068
14597 -23068 -50524 -52762 -50582 -38834 -3202 23968 50519 43880 21918 23776 31376 28683 30788
14584 30788 -1184 -38998 -44459 -39813 -28557 -28070 -10427 -13187 -17850 -12141 5284 24403 23214
14571 23214 19625 5961 -28332 -5203 27975 22841 -2468 -18838 -15042 -25583 -41010 -24984
14559 -24984 -14148 -5858 -198 -8245 -2027 -2223 -20763 -9325 9967 25324 -6513 -22917 7850
14546 7850 -5947 -44338 -22227 -6397 21388 23082 -6944 -35492 -43595 -45222 -22001 2981
14534 2981 -12235 -26766 -35250 -16822 -9500 1339 -17875 -10831 -6542 -13376 -18193 -23795 -27103
14521 -27103 -35935 -27814 -17472 -22707 -11720 1765 -10192 -8761 -14826 -8167 -17962 -17287 -18670 10887
14507 10887 6826 -35475 -39285 -20284 -9440 -2574 -14518 -8007 -20947 -35022 -30994 -18048 -4401
14494 -4401 15305 508 -12597 -25003 -37629 -30650 -12726 -17155 1642 -11152 -32665 -24575
14482 -24575 -6000 -20680 -15591 -8513 -15249 -28471 -3340 5262 -26347 -40849 -49415 -37336 -30407
14469 -30407 -49656 -33128 -32707 -49444 -40459 -13209 -11438 23263 14220 -7225 -6152 2397 35343
14456 35343 50806 47967 35588 21994 18076 10342 16676 9780 -14406 -49667 -54991 -48746 -29762
14443 -29762 -17040 -13404 12949 17659 -8214 -33022 -17812 -12554 10633 25833 32692 23943 -16432
14430 -16432 -32479 -4172 18687 6478 -20072 -33475 -36552 -16314 -5055 12382 4079 -9434
14418 -9434 -25813 -20957 -15833 -17191 -14073 -170 5532 20514 17298 -2213 3388 -1168 -9584 -12563
14404 -12563 -10459 29842 18045 15498 25304 42493 36376 14558 -7986 -10082 -7223 -10809 -13798
14391 -13798 -1354 10288 34789 28894 2582 -23472 -31911 -18901 -15669 -24655 -39928 -40314 -31310
14378 -31310 -33688 -23569 -3366 -2053 -34278 -52719 -59694 -32220 -13452 9895 25955 21241
14366 21241 -9690 -2697 6016 12537 11924 14479 32792 34000 6999 -7908 -2495 12109 21978
14353 21978 5834 -9059 -13035 -5111 -3505 -219 25331 43820 12660 -14576 -6069 -655 -18574
14340 -18574 10619 51001 35028 11613 7331 -8474 -7902 -3505 10187 8246 16411 20619 -4785
14327 -4785 -10030 -13270 8895 11660 9011 966 -2297 -14731 -34085 -22640 -1649 10374 -9401
14314 -9401 -51876 -16928 910 -4876 10728 84 -11046 10096 24112 21094 -815 4190
14302 4190 6227 4655 5421 3313 -4795 -20778 -9171 -14098 -32732 -58655 -65795 -26230 520
14289 520 -4073 5 -5091 -21077 3690 32705 74396 58870 36640 44899 32574 14800 4259
14276 4259 22048 20370 24082 48454 46515 50839 31190 19388 29518 33472 39270 33765 29304
14263 29304 23534 15149 16164 8260 22218 13700 35042 57984 46692 26129 12969 17203 29332
14250 29332 39508 56495 49945 28127 -11783 4323 36197 54509 45285 22177 43933 50866
14238 50866 28949 38040 31907 47167 40230 37290 51687 42165 24319 26581 3695 -19949 -35726
14225 -35726 -37394 -31763 -25073 1521 -4803 -9429 -23462 -10667 9358 35227 47364 52951 23962
14212 23962 13333 6206 3709 10206 15688 28724 32254 24661 -2868 -17587 12661 25004 12071
14199 12071 -8985 773 27826 25685 20947 18736 18281 8183 -16005 -18070 -35237 -53094 -51489
14186 -51489 -54500 -38694 -33035 902 16192 20328 8434 -14576 -2584 -5732 -10630 8664 12783
14173 12783 -14864 -34100 -35429 -19265 22439 34994 10280 9122 7965 -2624 874 -8112 5568
14160 5568 30708 22518 3376 1132 15801 13312 14279 28482 18367 -18195 -19350 -4970 -16956
14147 -16956 -3117 14066 35491 3693 -22387 -24601 -20181 -13011 6569 -5120 -15026 -12587 1697
14134 1697 22252 7666 16562 18973 20692 11464 8140 6223 -11119 -652 4889 -18653 -37703
14121 -37703 -17824 -8424 -9673 -13657 -29483 6312 26858 37248 11598 29807 54211 66254
14109 66254 66518 81618 66931 48700 38164 -1025 -24676 1721 22899 6934 17545 14588
14097 14588 11099 11786 1563 6725 11365 36187 56797 44101 23907 20929 28845 51924 51034
14084 51034 36842 37168 35083 48272 61557 34628 25214 47324 48017 48395 69134 48929 38801
14071 38801 41874 16600 10293 15424 41491 68195 64520 68068 82968 97575 137298 124239 124783
14058 124783 117462 112547 128196 143764 126491 150107 177290 214857 221361 222406 239616 206940
14046 206940 215604 218409 227761 222743 209152 214704 216982 207785 200205 201767 226273 242626 251780
14033 251780 238742 236180 221896 201359 208862 223454 198946 160104 164596 205844 249707 253633
14021 253633 245988 234191 214992 197180 195458 220353 208565 189707 208847 212380 189227 162594
14009 162594 137560 153347 166693 186589 191783 196970 187302 185219 179447 155746 135033 133419 100538
13996 100538 76035 74525 96867 109034 108906 111649 88353 76998 106231 143841 182022 228476
13984 228476 242463 239108 261684 273451 242357 235509 226550 203120 200674 178452 169219 191134
13972 191134 196956 198370 221921 236683 221098 214477 231253 224483 195899 212553 215743 204588
13960 204588 193109 213363 215151 221821 217122 222157 238665 256963 286019 284505 265262 268709 241425
13947 241425 241315 276495 259414 225316 237123 240513 241026 266014 284427 287384 267435 244794 219917
13934 219917 214790 212236 181601 177739 168605 171014 164588 184544 191785 190507 197443 199761 171924
13921 171924 139310 147951 162725 130684 114122 71978 82967 99281 76127 64902 44455 16044
13909 16044 20239 47524 72350 62225 32019 52061 93993 82769 59218 41958 39847 34746
13897 34746 51931 58612 62192 44094 41783 49040 61027 39797 53204 70286 60299 62049 82386
13884 82386 79571 99964 114240 102357 95891 72348 68455 43239 29960 57321 100468 103411
13872 103411 92099 104549 104729 114976 132511 117719 103624 82315 62521 50602 89604 140748
13860 140748 131183 132804 123631 104695 100005 132134 134223 120877 101555 99275 115652 115243 118513
13847 118513 118618 126223 147214 144370 129284 101727 108706 87546 82423 91346 92786 117942 132850
13834 132850 136497 112780 89260 66291 64024 76034 82371 96680 83890 90249 103323 92577
13822 92577 91705 88516 55266 43425 38761 39296 34471 52325 50782 40722 42801 61081 51195 54503
13808 54503 61240 57005 40602 42501 34727 56589 61917 62606 77051 79752 93505 109479 110763
13795 110763 100883 121623 123771 102007 89974 103554 114455 117208 141015 149169 127991 112461
13783 112461 101603 110493 127843 132963 127364 146540 162877 165725 169147 163825 157111 153680 143389
13770 143389 143032 152102 147377 143519 149765 153311 155166 153578 145083 131910 133927 126140 139363 143760
13756 143760 125488 139531 145807 146375 160754 161934 156326 162118 175673 172266 155057 161135 168335
13743 168335 157932 166586 142676 142514 151129 178459 206469 201803 188757 195787 204549 209195 174900
13730 174900 186118 207969 212249 239106 269833 283029 271741 233242 228042 232429 216037 205660
13718 205660 197569 194368 205049 219251 193254 189683 217772 223379 221816 236321 226477 191421 185995
13705 185995 205870 215243 221184 244082 257940 263246 276297 262701 251976 254502 267700 304572
13693 304572 323988 334722 319279 308859 310725 310394 315179 311663 306707 291579 301526 314508 311351
13680 311351 311554 326337 358527 376445 385851 403658 423905 414415 433789 448361 445153 435445 424659
13667 424659 441771 442428 450496 485390 504792 543098 587747 632623 668915 696461 715457 767695
13655 767695 773396 816039 866540 902306 947735 1011732 1087237 1159753 1231118 1303088 1383026 1448366
13643 1448366 1523081 1634320 1730280 1833010 1984067 2121629 2284279 2464079 2684324 2956617
13633 2956617 3319199 3746221 4287428 4936642 5781763 6821347 8105816 9597969 11260666
13624 11260666 13008492 14744469 16352861 17732140 18842321 19704628 20394425 21049977
13616 21049977 21763732 22686607 23909639 25403510 26989722 28537489 29896796 30955297
13608 30955297 31586182 31876404 31897274 31720081 31485378 31366459 31547409 32182862 33315609
13599 33315609 34944319 36909592 38929647 40729229 42052446 42674108 42510408 41568991
13591 41568991 39994744 38025966 35996685 34233261 32946400 32260931 32168426 32489730 33076144
13582 33076144 33734211 34287031 34625980 34717024 34469889 33900318 32987625 31854000 30631227
13573 30631227 29502429 28573216 27813342 27181812 26581299 25889289 25019951 23935991 22618299
13564 22618299 21117330 19456716 17749802 16075790 14534845 13244321 12212968 11405633
13556 11405633 10764389 10277977 9919876 9620635 9420545 9282924 9240978 9288757 9472349 9826331
13546 9826331 10333163 11047923 12019166 13275776 14795545 16464027 18211665 19971497 21569659
13537 21569659 22896334 24008124 24953491 25778239 26606539 27522382 28586871 29883510 31425651
13528 31425651 33080358 34592567 35783576 36517285 36771674 36601596 36126815 35557650 35124773
13519 35124773 34988791 35331084 36247858 37772205 39783323 41983791 44011036 45537719
13511 45537719 46306605 46229513 45389779 43908082 41992002 39918315 37963383 36401749 35342876
13502 35342876 34840201 34827724 35178666 35724561 36254629 36600124 36634640 36361294 35749756 34846474
13492 34846474 33626858 32209394 30772842 29510687 28479497 27706389 27091238 26483597
13484 26483597 25789988 24880589 23673404 22177286 20407258 18463093 16482945 14618895
13476 14618895 12941359 11501615 10325981 9371176 8598599 7943420 7394537 6937831 6533019
13467 6533019 6162404 5827832 5519938 5233952 4992598 4753839 4491572 4269690 4071892
13458 4071892 3882968 3721323 3561802 3392814 3222275 3050263 2935409 2815593 2727983 2649266
13448 2649266 2526573 2404721 2317050 2248453 2161314 2065583 2000264 1945649 1865202 1807674 1787694
13437 1787694 1714162 1645448 1606712 1576083 1538134 1476156 1418201 1365336 1317031 1243687 1182889
13426 1182889 1183575 1176735 1156193 1125447 1075121 1045413 984004 952758 954101 922435 879114 862223
13414 862223 847517 844759 820756 785293 749588 732722 722813 710188 691556 671574 629097 595940
13402 595940 601214 609581 592269 581741 556011 530984 505584 479989 465777 441451 416564 410105
13390 410105 408797 397897 377371 351431 295457 283990 328011 338006 301849 287033 292570 290859
13378 290859 271573 255207 203727 200121 227770 247890 230679 218573 204099 224383 215250 207972
13366 207972 205252 183739 180236 190407 167958 140348 136295 168992 184085 150655 156660 165571
13354 165571 158024 164913 191036 177345 174818 183243 178398 179168 159956 99688 93308 134447 130538
13341 130538 96543 87120 103756 83599 71265 71147 48556 49770 41556 34973 37194 29485 30865
13328 30865 36904 39219 64915 101912 76260 49753 71484 76088 48676 52018 86705 112246
13316 112246 109284 91817 92554 84233 62490 61424 71191 74048 74435 73158 83004 91496 96887 95094
13302 95094 96698 77279 89970 67519 48327 46888 51825 23968 39032 64942 58503 64143 70678
13289 70678 61385 50262 39865 48803 63228 61932 27132 17872 27806 36589 21764 51889 53149
13276 53149 47929 41926 58099 61407 51338 28502 1770 18048 28126 25966 31111 30925 29583
13263 29583 24265 32306 55622 69723 70585 64226 49055 30426 14117 26154 28915 15399 7988
13250 7988 3677 7129 15177 8786 3858 -145 -16588 -20598 -29734 -39135 -22380 69 33562 45750
13236 45750 8 -35359 -32098 -10766 -15929 -32710 -24266 8520 -9541 -10786 -10202 4453 46782
13223 46782 81069 91306 80840 66261 43862 53739 73344 53084 8960 3155 598 15232
13211 15232 13717 46485 43114 2867 5399 5417 21168 24162 29325 32580 32336 63782 46766 34235
13197 34235 39330 44164 43269 49240 79843 92276 83436 80307 98887 104732 87313 94534 105221
13184 105221 124177 127440 109887 87332 112716 129826 132020 133457 131459 146220 143382 135099 131329
13171 131329 97760 107473 149925 183042 164595 152533 168864 156058 131168 115696 118712 135556
13159 135556 135418 140425 143734 151886 160033 138410 151090 153905 159102 175875 189959 213752 255203
13146 255203 310196 356286 393994 422578 430930 408773 396494 422733 422556 400993 347784 281825
13134 281825 259609 249899 233412 224195 209152 208303 206246 187276 187262 189719 183055 147569 125428
13121 125428 126051 135602 130030 143474 138309 133602 90994 70666 63009 66633 91383 99744 90041
13108 90041 76115 50043 24135 52501 101486 140233 160939 182330 218349 254721 288879 312846
13096 312846 345647 360064 334600 305317 264159 204565 206488 207694 189776 202748 210962 202854
13084 202854 188998 186567 174921 161604 189721 200607 208909 212404 220044 221687 187144 192649 199058
13071 199058 202696 241287 242077 230929 211304 214790 203304 212518 212002 203820 187684 204258 232597
13058 232597 228360 231145 247028 277650 302479 325989 323283 319965 316587 287886 269791 238425
13046 238425 195028 163582 175574 197782 185182 178009 190402 182259 155832 147503 157575 144945
13034 144945 142104 129638 80597 85611 81569 55052 32646 20070 26310 47661 65898 54411
13022 54411 53437 57341 37810 28858 27354 51790 46635 39271 70851 68251 49545 34141 14365
13009 14365 -22292 -1169 18461 2984 17573 24620 25412 25255 -756 18406 26810 39228 31839
12996 31839 21580 10186 3576 13168 -13130 -37514 -51711 -41269 -26542 -23344 -30119 -25825 12460
12983 12460 -3110 -27920 -30440 -30381 -37606 -8842 10748 1500 35695 42443 2633 -5290 14907
12970 14907 13498 30188 25711 8497 31229 38263 26622 25654 11044 4250 13538 15446 -17641
12957 -17641 -17510 -17430 -17902 13075 52120 57646 37324 3367 -26181 -53384 -33511 -22959 -11961
12944 -11961 -5403 -15161 -21602 -9859 6801 44502 34398 29859 38741 17344 21443 32389 25776
12931 25776 -3671 -7066 -31320 -25572 -871 1170 36798 40981 6717 18482 33889 29309 13425
12918 13425 14332 10938 203 -27767 -15575 -23283 -44534 -53031 -17550 1898 11529 19749 21450
12905 21450 32479 45350 31592 5212 31423 57542 57071 35027 8143 -2602 20209 32627
12893 32627 17580 39301 54298 35285 25922 45468 29976 31363 26536 18215 22917 15030 11549
12880 11549 13921 33048 44926 41017 54369 44041 10793 9922 -153 -13003 -12735 -22894 9197
12867 9197 27919 -1927 -6639 -18442 -18409 9812 28019 -2757 -19160 -4745 -6280 -15640 -14490
12854 -14490 12141 16512 21735 29998 22818 2098 123 -22342 -23974 17748 20668 15622 9777
12841 9777 12709 3159 -7113 3782 18644 24665 36868 45023 41939 41013 15966 14835 11207 18131
12827 18131 32054 41705 49046 55945 55356 30586 3003 -6071 -7152 -26348 -27077 -18515 -17604 -10491
12813 -10491 -10792 -17836 -13357 -11821 -5390 24940 50097 53470 26802 23181 22055 33546 54328
12800 54328 36523 32356 8988 5597 -8548 -16994 -3295 13054 -14843 -33331 -12341 -4053
12788 -4053 -15246 -7322 8845 11781 -4897 1766 9214 29857 10588 -2022 7230 3731 4986
12775 4986 17406 -8707 -28936 -13395 -4225 19031 54864 64874 47032 33039 36588 25661
12763 25661 29103 33735 59124 81915 50985 2324 10753 7505 -25222 -19583 -5598 -25039 -47078
12750 -47078 -15654 -5242 6466 -682 9352 28214 12370 13876 20720 21441 19687 5600 -4499
12737 -4499 19685 15543 7426 24261 29276 37415 53339 76915 34248 588 2857 -1196 -14983
12724 -14983 -33975 -7789 -11358 -4419 9021 15078 5791 4813 -1545 12838 27382 39224 57770
12711 57770 51080 3210 -6580 -14783 -20893 8579 36350 42923 38579 65896 69409 70683 66820
12698 66820 51720 16929 24076 25672 17313 16930 35285 33824 22761 26498 59417 78069 73339
12685 73339 81501 52069 51002 42218 23622 -1648 -9559 -23770 -35535 -22109 -12240 18546 11340
12672 11340 -4591 -16779 -9936 5314 23951 41416 41537 44266 8037 812 36272 28121 7828
12659 7828 19902 -654 5492 2871 -42346 -48591 -36769 -35521 -11808 -10920 17895 30055 35214
12646 35214 21360 28438 29195 3361 -13097 -12718 2275 1238 12172 21774 54961 67259 22216
12633 22216 -6706 12247 35000 49789 59357 60300 52412 56072 46877 47335 19726 -2590 -6856
12620 -6856 21305 17787 26576 43694 47668 47345 53381 42221 38951 61915 72715 46863 28890
12607 28890 53333 46566 32150 41189 67138 70313 65336 65973 71863 80391 62189 43028 32384
12594 32384 47512 67588 60106 75848 68511 55181 41944 45221 61855 58175 89598 86768 59555
12581 59555 54333 33426 40640 48607 59602 74145 76913 46948 40984 42897 18573 31223 83168
12568 83168 95156 85567 100702 124983 121312 105892 83164 69303 88873 112375 138500 142876
12556 142876 119335 107983 131818 143370 155546 178224 177196 160402 183144 191895 218655 266902
12544 266902 306918 347300 412097 480420 539547 582861 627381 656692 651600 607653 569016 524087
12532 524087 444196 395074 385924 359607 333247 317313 315827 296267 229676 195166 194633 154955
12520 154955 156456 172453 216279 244962 235376 218918 210329 185525 190844 222742 270153 291808
12508 291808 320710 346488 356628 381605 426590 480455 547412 612696 690440 759754 766156 751283
12496 751283 705793 635173 556375 470717 356763 313130 261727 210678 205601 187934 158776
12485 158776 150677 162833 185193 203418 177190 163395 141028 114323 94338 75572 60264 75698
12473 75698 101053 111550 108838 79136 59989 69807 103785 113796 100834 75101 57423 31175
12461 31175 9869 41685 36501 16657 33175 63687 77885 85779 80789 63381 49999 38158
12449 38158 58180 51252 40643 22796 39087 44607 31664 11211 7746 27516 50285 44418
12437 44418 20962 34640 38940 43526 20407 1026 23097 21845 16074 25145 14214 36672 44444
12424 44444 30705 43868 50367 57812 74609 76712 64789 69883 94743 99126 118810 131077 121767
12411 121767 122969 97107 48536 30672 46245 73840 76413 82535 96977 111627 98418 71694
12399 71694 47430 6586 10672 11875 21105 26019 24904 18688 31844 19179 12287 26605 41032
12386 41032 35571 27855 39148 54974 74155 95540 113640 95157 84799 64655 68681 62324
12374 62324 61124 66563 66931 59527 59433 41949 54889 64237 38491 34725 41185 69339 84009 70995
12360 70995 78897 96237 98680 57687 55869 87148 112040 101642 106972 92400 58108 44509
12348 44509 31609 28579 59907 83542 102335 74804 49746 50005 60629 70064 93324 90557 84830
12335 84830 134187 155104 167369 161930 148837 152288 190935 197671 223312 230478 238533 229048 209782
12322 209782 232530 259751 264692 256610 227415 204751 208564 199149 197286 201453 164563 161811 193993
12309 193993 166634 134729 140032 152490 146772 125745 92976 86171 92759 135954 153643 150993
12297 150993 131505 159240 173393 209834 193596 171031 202285 234400 243294 247658 244226 242608
12285 242608 236754 236924 241102 231598 228268 208947 181460 158485 165886 165039 135371 160623 174781
12272 174781 176332 178164 162222 149977 146441 150731 136828 118974 96405 82268 101990 84790
12260 84790 64893 36466 34336 31814 26233 42877 46478 57939 52476 40246 47475 77147 80650
12247 80650 51976 29077 39079 48106 45386 38259 33023 45068 39601 53133 45795 87618 101971
12234 101971 102033 80587 63008 101269 98881 81416 71257 67577 85077 59661 71298 109362
12222 109362 101574 101737 98995 97392 111889 127899 99979 129299 159561 185870 191608 188424 180864
12209 180864 176295 153448 142204 145380 166295 175315 204615 243688 215457 191275 156947 161687
12197 161687 172075 143867 147841 194117 221362 263609 295770 286108 269285 261436 264921 261491
12185 261491 276457 288513 269660 268938 295088 311358 332789 329707 345471 341520 344676 330235
12173 330235 327946 335305 341784 340987 331843 335335 356538 373809 391626 404237 427592 438223 466403
12160 466403 474233 480053 483009 495131 507057 498823 523681 534536 527569 503382 497506 502992 505923
12147 505923 490222 498493 500841 510168 516738 543682 557673 557887 555881 533041 524565 527782 551058
12134 551058 574498 585798 609041 639490 684622 711902 749389 773505 792052 828302 898348
12123 898348 964117 1004818 1039897 1080448 1142962 1191932 1225856 1244429 1295421 1325174 1367221
12112 1367221 1422501 1485500 1558036 1639211 1729165 1821170 1925428 2031814 2133606 2245451
12102 2245451 2351519 2480378 2656772 2867319 3079962 3350298 3672243 4068363 4538858
12093 4538858 5087632 5708633 6447358 7315587 8334098 9449698 10695248 12018252 13369522
12084 13369522 14678255 15919028 17187297 18619927 20471023 23067037 26757155 31967596
12076 31967596 39046705 48253042 59645899 72960228 87230872 100806127 111782086
12069 111782086 118642542 120365759 116243434 106456144 92970430 78877751 66630137
12062 66630137 57115852 50075882 44917042 41058819 38051016 35613303 33544592 31808389
12054 31808389 30365148 29209861 28377306 27789810 27435886 27271876 27340140 27615967 28066190
12045 28066190 28760416 29780498 31140883 32911869 35232939 38272131 42360205 47909041
12037 47909041 55509770 65657404 78352171 92808418 107544880 120652969 129871163
12030 129871163 132696061 127647719 115747818 100200629 84269849 69995588 58215791
12023 58215791 49113123 42416367 37667824 34281446 31835689 29991662 28433664 26928261
12015 26928261 25397141 23822755 22211991 20578958 18973457 17447048 16092228 14914368
12007 14914368 13843348 12951942 12165831 11466236 10835451 10248670 9693559 9175296 8700609
11998 8700609 8264806 7901404 7553349 7198154 6830896 6513453 6243155 5986863 5734537
11989 5734537 5495026 5293989 5079200 4887577 4684972 4495648 4354598 4214997 4075488
11980 4075488 3906147 3739269 3600720 3472052 3367963 3281732 3168415 3063916 2975998 2890882
11970 2890882 2797132 2687438 2600253 2531137 2413433 2326929 2268984 2216316 2140727 2067110 2016129
11959 2016129 1974405 1924590 1877588 1801642 1713515 1615468 1566167 1540301 1484240 1423387 1382082
11948 1382082 1347465 1267199 1205140 1157369 1120518 1086977 1067434 1067833 1032351 1012784 1010443 967378
11936 967378 928464 909447 906999 874803 857801 835480 824726 787176 776487 766849 745904 714597
11924 714597 686363 651711 612979 574329 562769 542591 504859 474596 471069 474426 454417 446913
11912 446913 458661 465016 441182 383343 376421 374948 344907 328545 328101 340030 361709 352588 326711
11899 326711 300395 293821 281827 293346 297034 288802 291707 280056 277265 277159 284785 283980 277140 273230
11885 273230 261211 259830 282826 276746 260903 242359 230831 238860 214076 203831 207384 195020
11873 195020 196750 217764 237216 241607 257237 244247 218729 188527 184263 215916 220072 199279
11861 199279 200746 200975 219877 206078 176481 163786 162517 136115 113031 89378 86083 125717
11849 125717 151275 165005 171693 193239 209130 209323 178811 161942 177162 175716 171566 160802
11837 160802 167601 165217 137359 120730 99395 89121 106333 102901 99502 95799 103598 105505 84021
11824 84021 58816 67473 84183 101413 113770 102292 70741 52247 65082 81184 145522 141113
11812 141113 103413 40704 37643 48832 66319 80776 83639 72991 33097 35437 30396 41763
11800 41763 50462 60899 62291 39653 26981 16558 -2532 -4051 -1418 8775 40386 53479
11788 53479 35894 17164 29918 29509 30939 42189 43112 49753 67336 45241 43232 39083 29305
11775 29305 43683 60135 46569 20270 38412 19284 26226 51144 35537 32858 36166 32088
11763 32088 38624 32237 19864 18888 25681 32681 9964 -5732 -5882 948 29495 38876 50354 42292
11749 42292 14821 11077 21227 10822 20375 22534 591 -7034 -3523 9889 -72 -22280 -37376
11736 -37376 -37544 -49856 -27756 -3019 25793 52913 42403 24524 32349 18433 13330 55409
11724 55409 59401 37591 32786 20491 8845 3653 -4580 1422 25663 39799 43159 44112 26993
11711 26993 32179 44643 43917 39956 22927 37375 57432 52125 39400 14783 19905 27594 37706
11698 37706 45254 35915 11166 3321 5024 15300 11251 15679 17569 6184 22455 60904 36882
11685 36882 -15263 -38413 -35863 -17821 -577 -4866 34126 56772 45080 31513 35753 26896
11673 26896 24039 13756 25657 49662 39700 22220 23073 23450 7742 11279 22565 23408 11829
11660 11829 43283 56343 51641 41687 31846 22577 13186 3729 7329 -4357 14206 29080 34149
11647 34149 31121 47838 48114 67558 63072 58178 60251 72239 46061 24173 30460 26874 23230
11634 23230 28703 12284 36088 47560 42741 43961 54589 95824 126871 156697 186322 216528
11622 216528 226806 228103 233406 202409 177886 184853 193966 201841 176282 182639 219195 227319 264937
11609 264937 308028 316173 312877 324725 316242 328142 330788 328569 324424 318642 345952 390975 465417
11596 465417 541994 613240 653038 669272 640194 595975 520356 449457 404132 383856 332932
11585 332932 294885 257087 217983 187778 166720 174760 185988 206537 206298 191671 180123 155217
11573 155217 138961 155554 185262 194957 218280 227920 214522 214883 234700 237865 246781 290872 346176
11560 346176 403187 482194 588663 664206 702275 738924 741007 707070 634914 558466 495775
11549 495775 478789 484983 502716 515068 530828 505894 491560 493506 464568 452915 469667 506615
11537 506615 475508 413978 383992 385754 393819 426860 428122 418363 410664 431484 444936 431660
11525 431660 420819 399683 340519 286525 258614 235886 233228 206526 189662 183086 160161 119717
11513 119717 125563 136289 126901 108300 76699 96490 120746 101291 75722 84028 94416 90900
11501 90900 88983 84024 70804 89542 99649 115084 95828 91495 90690 98188 90550 107624 90976
11488 90976 84340 102093 107927 105606 110686 97430 98354 83163 74727 71197 79438 71745 108704 126855
11474 126855 127082 120202 156030 171301 148700 152583 169984 188580 195930 201587 200711 206473 209659
11461 209659 209931 219849 200824 206964 228225 221000 222303 227467 225133 210439 208651 198600 197412
11448 197412 209331 223573 243860 255628 267208 222184 191456 157178 169304 175568 153266 144413
11436 144413 133299 114855 111173 108139 114541 111413 86603 84632 109567 124218 111055 126667
11424 126667 117340 99580 79114 50487 40297 57779 99469 121967 88135 54548 44735 62840
11412 62840 62355 82756 75722 54611 88936 123870 140229 107488 54059 37207 65576 74661
11400 74661 79381 55059 62264 72045 88254 95363 68891 28548 22362 14627 27620 55030 72254
11387 72254 88480 117698 127778 111431 110149 110319 121267 110533 115966 121930 77019 82355 105855
11374 105855 129876 146744 151256 152091 174458 166118 136681 119379 114546 132324 126779 117479 143551
11361 143551 163069 167359 161459 144145 129993 138857 136719 133603 145467 150870 141259 135350 124021
11348 124021 125926 136943 138090 129170 117344 107616 100917 81126 78645 74025 71545 89171 90410
11335 90410 77708 75395 87764 116333 113843 116746 137343 165677 133076 131038 135799 115057 122916
11322 122916 159173 174627 170981 173835 149252 145092 153504 162616 159544 166040 164817 157717 151507
11309 151507 141867 116830 106787 131185 149636 163892 168548 163899 162193 140874 131614 157819
11297 157819 203675 220101 187136 172166 180944 205719 212598 200500 176366 182046 202871 208981
11285 208981 205455 193070 198609 195521 201596 221610 223801 222286 219168 248194 284478 296164 305193
11272 305193 297000 300717 304305 295425 288144 282991 285029 325985 319547 278677 270919 249752 243273
11259 243273 241420 294148 345325 364641 331218 325234 334643 338539 353376 365862 404168 454658
11247 454658 480070 487442 507583 514442 551007 584231 583748 601303 619887 618619 615973 658048 735053
11234 735053 805955 845688 894972 957149 1019976 1099365 1181931 1239480 1295643 1367818 1467001
11223 1467001 1592138 1689488 1790337 1943922 2075041 2243735 2514852 2850148 3231375 3693122
11213 3693122 4306999 5044017 5938007 6989587 8252999 9801676 11633433 13803974 16352182
11204 16352182 19215019 22238623 25170823 27729223 29540735 30413391 30360116 29563790 28352326
11195 28352326 27092395 26016586 25360291 25220028 25605983 26515045 27902823 29587455 31319845
11186 31319845 32783915 33653310 33779161 33043496 31456854 29186326 26491577 23714859
11178 23714859 21082750 18756081 16710757 14952410 13433999 12117502 10993354 10046918
11170 10046918 9264300 8569482 7975234 7511790 7114832 6750612 6420983 6127211 5883981
11161 5883981 5680209 5524216 5391106 5288085 5193324 5120379 5021413 4906657 4779973 4664273
11151 4664273 4582380 4539723 4555610 4594877 4659587 4720711 4819336 4950835 5135628 5356675 5615944
11140 5615944 5939970 6358253 6788813 7303698 7951619 8722313 9642609 10761778 12108468
11131 12108468 13745338 15722948 18158947 21132249 24742195 28891813 33436646 38101106
11123 38101106 42575564 46483256 49519555 51686353 53234511 54392908 55316077 55937615
11115 55937615 56014722 55535721 54795406 54236127 54244970 54978014 56296913 58018095 59912105
11106 59912105 61629437 62803429 63046044 62145108 60093303 57212815 53867990 50141225
11098 50141225 46007410 41581070 37073669 32777121 28960560 25699040 22903962 20517107
11090 20517107 18496407 16806448 15357849 14136183 13124011 12251247 11502958 10842096
11082 10842096 10236045 9707857 9212966 8767173 8344483 7969006 7616572 7319128 7060608
11073 7060608 6801879 6566635 6376788 6242249 6111811 6011996 5910655 5827057 5761538 5680962
11063 5680962 5607382 5568022 5514483 5491938 5514195 5624552 5774593 5941255 6164234 6452760
11053 6452760 6832342 7325628 7944093 8735074 9689546 10919527 12374728 14079118 16099737
11044 16099737 18426785 21034997 23856102 26739274 29392400 31528235 32809135 33064275
11036 33064275 32307907 30780446 28862477 26940563 25344023 24283589 23834568 24021170
11028 24021170 24811520 26065535 27662852 29450408 31158100 32515707 33304672 33239649 32197031
11019 32197031 30213396 27514078 24482815 21507155 18822403 16545179 14609780 12933608
11011 12933608 11530738 10336335 9280646 8370805 7628243 7014080 6459580 5971675 5564917
11002 5564917 5200886 4878517 4612675 4356327 4109153 3887556 3699850 3526452 3379386
10993 3379386 3211161 3041555 2902564 2791390 2676438 2566273 2455921 2338259 2250866 2173793
10983 2173793 2116878 2017873 1933678 1866512 1794140 1735321 1678441 1615977 1570566 1498765 1421597
10972 1421597 1377159 1339932 1299391 1263689 1209228 1144706 1130677 1121969 1098732 1055131 1021773
10961 1021773 984651 951841 922539 923344 915592 903681 896994 839064 784727 756532 741892 732286
10949 732286 723171 711464 665533 640423 626046 645723 606704 581998 560934 563025 552651 558617
10937 558617 565315 563568 555271 557047 553044 549759 532769 523577 505518 490913 490963 469615 429022
10924 429022 421865 417898 426971 402227 383126 341777 320309 319506 296017 297744 290896 283266 293241
10911 293241 317773 308344 297628 289860 278613 272902 267703 255113 253466 234677 248854 246696 226035
10898 226035 195748 148270 135109 135336 129527 148851 164855 168635 176703 167104 151146 168301 159833
10885 159833 128519 142482 156587 128932 111680 120558 125560 123934 129694 125018 112801 122217 144053
10872 144053 157701 141251 120386 127471 112499 120211 105958 104446 109083 127237 119078 97305
10860 97305 56642 68205 91194 97558 62597 46227 78654 84249 81024 83971 99222 102895 85040
10847 85040 75706 100595 126411 116496 89191 66180 66747 78249 98942 112548 112040 96763 89384
10834 89384 116441 107188 112466 129235 96265 101517 116444 114146 89633 100133 111695 120474 124929
10821 124929 100515 87241 86064 79292 90322 107537 116814 119446 138666 152009 149534 139731 158254
10808 158254 178499 201393 174855 166795 160619 166014 169890 195667 202854 206117 217860 196392 196736
10795 196736 183930 189236 160786 119015 115470 128257 109804 67409 84064 98502 69090 81628
10783 81628 131773 155947 154236 154437 148889 167193 174655 229033 269141 282487 293798 287511 289493
10770 289493 301789 306537 305836 282706 271099 272752 286290 296979 305994 297698 275912 261604 270061
10757 270061 286159 323895 337365 358236 342667 352771 370918 385242 375549 380027 377637 372533
10745 372533 390809 438743 541599 694211 897235 1131960 1404818 1682045 1911778 2117892
10735 2117892 2243280 2288435 2253033 2133597 1936696 1717702 1493783 1250168 1025400 825257
10725 825257 662842 563376 478535 459675 431264 400827 368674 347976 329010 319701 317643 309247
10713 309247 321024 320790 322569 317316 304845 267272 258791 256465 280309 282876 263156 246591 255668
10700 255668 254380 255003 272117 299423 293037 300147 345350 394077 433970 475230 441472 409107
10688 409107 421543 431257 468353 479552 468728 457419 458967 444897 421160 427843 446648 482982
10676 482982 505162 499150 496986 516520 522089 484222 441810 420975 419450 386860 353998 315029
10664 315029 292488 267032 220187 210002 216690 228527 242138 267889 272956 285330 299238 285185
10652 285185 237006 192027 162050 124559 120783 123757 121699 111550 134737 128654 136822 114280
10640 114280 104494 105197 115285 113610 95550 83146 78961 97071 109726 85366 85503 111638 111375
10627 111375 121639 129360 138328 142466 180499 180938 192286 219326 248474 245589 252039 259819 267940
10614 267940 298855 383557 467465 564767 718885 907708 1033893 1124812 1135595 1061813 860529
10603 860529 702730 626716 572354 529065 521711 538865 555009 609387 692802 764787 799065
10592 799065 878125 938756 957167 952339 905652 848603 803434 728923 623413 567852 517868
10581 517868 441797 365929 325571 306424 310052 307808 301803 320534 370293 437125 508604 565271
10569 565271 647790 743206 794062 764121 710417 669424 598433 456803 339420 284402 266135
10558 266135 232572 198908 179564 165112 145689 140686 139905 119591 117662 144650 172071 167985
10546 167985 166092 198718 209583 169593 165490 156430 161992 176544 188879 198988 199253 211831 216018
10533 216018 175672 125655 104044 85792 100039 96576 61974 48721 23770 -12554 6567 26442
10521 26442 12444 7645 48606 102710 148169 123682 126757 150337 177031 186707 193127 197508 194748
10508 194748 205228 183555 137964 123094 90811 66164 87569 126563 145752 161367 168270 177572
10496 177572 201710 236962 262819 281046 321935 307878 342310 397383 441456 446356 473596 506436
10484 506436 513169 524396 526133 513362 480099 457963 450774 441762 463710 444215 421385 436421
10472 436421 463767 495682 473909 467411 493566 477155 449771 438314 433658 466548 481768 475071
10460 475071 459957 466015 480352 490290 482136 473425 471668 488372 482755 483384 478278 472714 496988
10447 496988 508734 519729 546175 550956 503721 484741 466884 474977 497515 512229 536276 550118
10435 550118 552285 563448 579940 613986 613559 623413 668684 666999 643000 631980 614512 616658 598200
10422 598200 595540 615911 646672 678909 696059 711452 719265 725203 740022 756871 785843 785007
10410 785007 775842 747874 730421 747947 761476 765077 768046 773253 787698 795851 788391 798842 813905
10397 813905 847689 886008 899515 921503 985813 1070000 1137997 1182072 1272655 1367823 1424251
10386 1424251 1521945 1621561 1680849 1735535 1800020 1859404 1937700 2045606 2116345 2183465 2253946
10375 2253946 2341452 2426051 2506760 2652193 2828169 3009945 3210449 3453513 3699356 3971293
10365 3971293 4251749 4575300 4955698 5412689 5947293 6597604 7402022 8342690 9362296
10356 9362296 10511617 11723246 13089647 14641614 16347978 18211207 20500899 23297833
10348 23297833 26857004 31495088 37809951 46815353 60178999 79901881 107602980 142705824
10340 142705824 183910489 233062659 287681888 337264103 370530588 393389998 411279897
10333 411279897 413128802 386381549 343120039 301039357 260573010 215042759 169470072
10326 169470072 133418807 107876091 90021554 77247555 67849854 60734748 55182745
10319 55182745 50631644 46802940 43520198 40658650 38058883 35683203 33519004 31509762
10311 31509762 29550779 27716460 26071516 24554774 23112087 21801266 20624657 19575776
10303 19575776 18617331 17758329 16954355 16231002 15522233 14855087 14243788 13663825 13079303
10294 13079303 12537469 12042331 11560410 11081488 10629922 10211460 9829372 9457240 9114914
10285 9114914 8774968 8437707 8174929 7911337 7656731 7413917 7139773 6899237 6679381
10276 6679381 6464290 6246176 6042638 5876166 5717902 5545158 5358219 5186056 5041977
10267 5041977 4870950 4725208 4598888 4443609 4308988 4195391 4076216 3935197 3804631
10258 3804631 3669636 3550677 3417105 3280552 3140383 3029434 2939885 2872198 2812275 2753656
10248 2753656 2685174 2600535 2494381 2423942 2369459 2303333 2240527 2192793 2136515 2091021 2061719
10237 2061719 1990991 1942016 1927208 1876831 1793181 1723088 1688498 1660282 1608808 1524406 1467600
10226 1467600 1440863 1391136 1349787 1288406 1242899 1217823 1177219 1140898 1103783 1069888 1034985
10215 1034985 993870 986709 979550 960341 962965 946021 915459 888607 892957 891893 892632 865657 847256
10202 847256 839625 811077 794902 786376 771196 780504 781441 748538 724436 687639 650115 599672
10190 599672 555436 543634 496165 466870 459862 448521 409319 410496 426762 417641 403087 426771
10178 426771 468686 495430 482108 487171 511366 497999 488970 508620 549389 558378 541845 521996
10166 521996 509778 512114 499496 482267 455055 419594 386307 347908 333789 348102 330766 337383
10154 337383 362735 376747 367089 367669 401751 431820 456080 491436 515068 488028 479297 482067
10142 482067 501957 499865 474651 431499 408274 409938 388698 362926 325060 298240 280870 260109
10130 260109 276629 314478 344122 328414 343287 367193 407777 454454 469571 476984 500631 513195
10118 513195 517324 564096 588406 575618 607285 626570 628611 625688 628661 631849 641580 606378 554178
10105 554178 526184 524251 522401 541662 553559 550100 548698 523749 512037 506408 483385 470531
10093 470531 420007 388254 383040 387066 376139 382038 373843 375486 369042 371801 396938 396339 380699
10080 380699 363983 377294 386314 356953 341938 321701 318185 324366 339470 327697 313198 306042
10068 306042 294240 285197 294685 319216 348128 340572 315745 285184 302590 343443 345777 363703
10056 363703 422134 443406 450350 481043 524641 582541 611143 636260 682939 729403 808630 889922
10044 889922 1005168 1150782 1349451 1636335 2005683 2524574 3408228 4872388 7248349
10035 7248349 10721276 14461200 17625857 20812825 22917385 22497758 17927878 12649560
10027 12649560 9041094 6769466 5316159 4336350 3650313 3154702 2812582 2578614 2388289
10018 2388289 2193681 2064342 1988015 1920548 1827388 1739195 1696220 1643091 1545268 1450356 1385641
10007 1385641 1347244 1267843 1188828 1141884 1105047 1029735 989372 977608 957900 938654 911487
9996 911487 871424 843746 838260 794242 756614 716456 665416 635983 629685 618129 595823 569191
9984 569191 539957 573774 575968 567202 582840 568853 525472 507296 489206 487127 485860 475565
9972 475565 467500 455911 438874 430296 415165 421761 415234 413524 426143 427504 479963 498499 468007
9959 468007 443583 431182 405865 390683 365270 370691 383409 401256 400513 396158 409250 413388 398946
9946 398946 395142 410129 406294 426052 479361 518937 561481 621687 711252 829990 983513 1192362
9934 1192362 1417309 1698422 2003713 2214479 2328808 2439505 2494113 2409432 2220410 1994912
9924 1994912 1771394 1507326 1254446 1040745 872167 737503 646427 567511 511820 467586
9914 467586 427884 409157 397893 389795 383733 374068 360986 329118 328085 345326 335055 302504
9902 302504 283917 277815 265643 257294 251660 266102 307176 302931 295587 320978 340440 356607 344949
9889 344949 350642 365978 356158 319029 263535 239113 247922 272418 279398 270515 270312 250277 247853
9876 247853 272669 251111 229656 211521 204441 217633 201715 194219 215928 236619 238675 249427
9864 249427 251906 217192 183612 192646 208034 214013 242990 231474 214665 202989 191412 190331
9852 190331 193834 202040 200697 246450 303212 287434 256717 259405 283943 307564 320629 327867 373287
9839 373287 427568 483626 621968 803174 1020254 1208214 1347809 1415112 1382695 1230324
9829 1230324 991099 794314 636755 534321 455010 410687 407813 407683 383183 361017 391210
9818 391210 401918 401711 406848 376783 350365 377660 377827 389411 360389 358775 361016 356666 353506
9805 353506 388525 404361 400396 403180 386101 382545 378931 379293 362221 362367 357596 380270 398683
9792 398683 431596 448135 460385 467331 467585 467301 525597 583762 604399 610810 669559 757429 854075
9779 854075 957089 1079612 1219455 1378415 1533859 1667080 1766752 1810162 1778134 1687876
9769 1687876 1607971 1516537 1444358 1406792 1363785 1368499 1373288 1400665 1472968 1544094 1665247 1870397
9757 1870397 2107104 2382076 2726742 3087857 3494938 3875709 4168942 4374811 4474468 4479315
9747 4479315 4390867 4243145 4036122 3856763 3763396 3735204 3763677 3914152 4219567 4640416
9737 4640416 5180014 5888468 6693614 7575181 8495920 9372437 10158577 10843300 11372224 11791701
9727 11791701 12111937 12341922 12547108 12734700 13000989 13393355 13946252 14703626 15735226
9718 15735226 17072938 18643107 20396944 22230100 24042918 25769766 27285275 28560338
9710 28560338 29600987 30408594 31003455 31465749 31826374 32016172 32090469 32233855 32662414
9701 32662414 33520435 34836083 36491445 38380398 40365341 42295043 44050182 45471492
9693 45471492 46543818 47218607 47576644 47734078 47796024 47891306 48030238 48162131 48217271 48241663
9683 48241663 48311221 48457197 48639533 48859619 49100591 49412715 49757132 49909197 49814914 49443272
9673 49443272 48893346 48212253 47394409 46339321 44950330 43256192 41432401 39626915 37865219
9664 37865219 36148771 34493814 32903392 31443978 30076577 28723291 27331704 25927600
9656 25927600 24637580 23549625 22767053 22328119 22205427 22359799 22634774 22923295 23190053
9647 23190053 23417343 23699823 24348563 25586938 27533507 30211473 33545114 37324242 41159305
9638 41159305 44576398 47191813 48683303 48807339 47629100 45696713 43680984 42015917
9630 42015917 40895493 40509000 40948963 42193134 44305385 47230191 50716567 54413733
9622 54413733 57875074 60736141 62800415 64036632 64482915 64287124 63605348 62695495 61823816
9613 61823816 61132396 60706837 60519562 60571914 60842744 61153021 61269938 60937445 60092627 58802664
9603 58802664 57204689 55460449 53741250 52049656 50373293 48712949 47076770 45401997
9595 45401997 43771591 42237453 40826403 39532752 38373947 37445338 36808914 36503763 36484700
9586 36484700 36535840 36475319 36172888 35521193 34527402 33177878 31562788 29748265 27851266
9577 27851266 25920788 24097885 22436494 20985835 19685601 18548390 17536235 16605933
9569 16605933 15750239 14968194 14315534 13812160 13498745 13428062 13603415 14013960 14583579 15206648
9559 15206648 15786651 16172213 16247494 15936978 15216146 14213690 13016677 11754586 10637135
9550 10637135 9701431 8965748 8417056 8054912 7857640 7777627 7804091 7967255 8222012 8514799
9540 8514799 8842426 9137045 9356423 9490352 9463934 9323754 9107198 8759182 8250883 7676305
9530 7676305 7078872 6522414 6036764 5615865 5330162 5153434 5111093 5202953 5398637 5666769
9520 5666769 6039837 6419503 6765791 7030169 7127130 6965239 6634853 6183642 5612642 4996329
9510 4996329 4468304 4023783 3677415 3426258 3226627 3033946 2916181 2846121 2781123 2761750
9500 2761750 2788272 2857674 2963445 3091729 3239907 3366921 3458146 3486006 3426071 3266957
9490 3266957 3052179 2785821 2502766 2227529 2005753 1820209 1673472 1559614 1475242 1389265
9480 1389265 1318510 1263748 1222563 1171880 1091634 1053459 1013217 993948 976651 928488 904339
9469 904339 881917 866453 852617 832318 790469 763050 708654 682010 694189 690346 665258 636425
9457 636425 622267 602964 565533 538350 523451 527446 535156 525076 513295 516751 518317 507313
9445 507313 501735 491866 474621 465925 483124 466847 459786 440539 423786 412819 399615 400795 395415
9432 395415 381855 356067 353216 339139 350683 389024 405129 407035 393610 352721 351049 351654 371929
9419 371929 397340 398140 377783 383651 364319 347111 305446 291487 289786 294069 318166 286203 263657
9406 263657 272916 307061 339300 338255 336430 336331 314055 298362 272439 271204 288940 261351 227688
9393 227688 228550 215483 193866 194123 216717 246332 261776 226769 196140 188654 188895 162650 167984
9380 167984 179389 161229 165501 195584 173474 158462 165522 185593 178837 179969 187071 182448 159969
9367 159969 164166 182387 175472 146475 108259 98524 97034 96913 117838 121218 137430 168827 182015
9354 182015 157989 130615 116523 107825 112510 126727 150266 158142 167605 152501 153184 137123 143999
9341 143999 167853 154794 167749 168113 148186 118868 118967 117731 114775 142540 139420 152787 194546
9328 194546 208691 198647 168876 159597 187714 187523 171043 138118 153327 182961 180122 162921
9316 162921 160964 159680 168263 191319 182888 164007 192149 226918 226917 227697 260556 262450 235927 242474
9302 242474 293479 312894 326143 302109 285290 268447 268730 263178 284416 283180 282031 280710 261335
9289 261335 278188 321257 334872 331448 336309 334042 342208 355654 364760 360962 352923 329433 312934
9276 312934 326446 332773 329913 324474 306698 275519 270012 277060 272855 284738 297002 305614 331190
9263 331190 347653 348756 345500 332440 282471 264167 267191 271725 258046 237573 242504 253422 252490
9250 252490 279101 279116 274300 257991 270993 287298 286098 279171 248922 267424 287085 289236 314609
9237 314609 337752 331937 345181 376370 397922 408568 417556 409201 388818 387473 397950 417447
9225 417447 403324 414430 442794 439045 437617 424698 405979 406125 397005 394701 400144 414555 399283
9212 399283 406274 432346 428509 421822 446074 482506 511852 530320 532867 506255 520417 535997
9200 535997 527470 501354 484036 480805 466403 441337 422425 392587 359241 358411 363726 385519 392550
9187 392550 379950 383066 370848 342983 321538 326452 337598 325786 321064 317925 358173 356694 311795
9174 311795 272613 265240 268878 280512 295095 313231 330246 324544 320417 319754 339586 349883 341682
9161 341682 312784 323989 314064 338821 353864 354114 359320 381382 375067 373612 383197 386052 376089
9148 376089 361932 321255 291075 268430 246945 242527 223253 214406 245967 245842 245038 238349 250087
9135 250087 268187 284099 345984 363239 367174 363568 329993 308274 334134 357833 334362 291215
9123 291215 285396 303414 302653 301398 299629 287296 215519 180620 200283 201081 210362 187694 168773
9110 168773 161715 160704 153075 137864 146259 155753 148421 148715 150561 141007 147421 146485 139774 132777 120838
9095 120838 121801 138415 154626 166208 180031 171041 166324 167114 160850 168513 195129 235693 270141
9082 270141 267083 259096 222759 233310 258541 265659 266440 256072 273882 283652 277556 279356 253283
9069 253283 243442 228433 212719 184572 175132 186859 206152 207567 225028 219933 195372 187964 214992
9056 214992 224864 235219 246951 246984 237119 253722 259948 223820 218046 203340 212201 231926 232951
9043 232951 241578 233213 198861 137075 128273 117508 118105 117684 124245 125049 123187 123049 109219 111308
9029 111308 86621 119213 154334 158627 165830 162983 147742 155744 144759 139346 94499 87470 101370
9016 101370 113129 106808 127720 138312 125346 154354 176380 185728 204044 211932 193412 205688
9004 205688 193969 184177 196567 178670 159184 176214 160552 140612 128057 134886 149495 170738
8992 170738 172023 199869 206267 174575 152917 164971 147284 141062 172132 188615 184363 151083
8980 151083 136402 144281 154206 165850 155891 160324 150166 175944 207560 199338 172586 155479 133798
8967 133798 135040 151388 161493 133757 121655 105038 109511 113373 121282 140904 144801 140144 139805
8954 139805 130324 127008 120793 116414 105665 135967 152390 130846 105858 100856 109262 119267 119177
8941 119177 139935 155768 168610 182067 200310 198690 220031 209372 180813 159943 146705 148100
8929 148100 156610 179447 194199 186206 194009 190730 185944 196393 188292 185930 170470 171705 200426
8916 200426 222815 214174 226269 231944 240628 250175 242528 250627 244775 253893 280715 285946 270172
8903 270172 277316 270237 268764 275349 285625 286579 303201 316165 342446 359905 364998 372644 374653
8890 374653 394520 407295 432649 417084 408607 442924 462977 472749 495613 516058 517388 529146
8878 529146 550836 560591 586890 615746 619185 638050 651942 679402 745894 799239 840156 892027
8866 892027 950534 1074209 1208998 1353321 1487080 1635278 1803772 1994447 2252207 2533833
8856 2533833 2838156 3181709 3504745 3824187 4098007 4327223 4538195 4722083 4890675 5076061
8846 5076061 5312238 5615435 5992848 6487858 7053071 7748102 8537897 9358541 10159739 10870241
8836 10870241 11429459 11706489 11671287 11436972 11142853 10898835 10711779 10618337 10485427 10335585
8826 10335585 10175211 10022252 9940676 9949201 10017705 10129598 10297189 10456280 10586960 10696083
8816 10696083 10852415 11038802 11246352 11472801 11748259 12043438 12292244 12446653 12509805 12383631
8806 12383631 12035686 11513632 10848059 10120463 9412546 8735114 8133060 7625853 7221720
8797 7221720 6917308 6697907 6557343 6440818 6339039 6271190 6272474 6285141 6298586 6319511 6375262
8786 6375262 6410044 6436245 6452984 6480436 6534782 6647966 6790751 7014853 7340803 7770901
8776 7770901 8340288 9053273 9870166 10873152 12029956 13323157 14716982 16235824 17875289
8767 17875289 19586701 21279152 22807982 24120747 25198251 26070037 26740114 27274521 27726348
8758 27726348 28214365 28785122 29461980 30219471 30926212 31455492 31677917 31431184 30655997
8749 30655997 29510858 28285436 27160391 26331283 25786209 25514570 25542160 25834250 26382997
8740 26382997 27237056 28336329 29558426 30793081 31966578 32914418 33506884 33695701 33504723
8731 33504723 33077191 32625551 32250151 31938983 31598587 31094008 30292593 29136473 27568464
8722 27568464 25684582 23714769 21781619 19998823 18448190 17167227 16084932 15130015
8714 15130015 14246316 13429115 12668287 11959656 11348876 10834514 10447099 10095898 9848226
8705 9848226 9674474 9577746 9600615 9713444 9880507 10132296 10446656 10864562 11368820 11919639
8695 11919639 12476941 13055234 13664840 14333081 15116721 16096657 17320781 18729122 20294489
8686 20294489 21896269 23471850 24903811 26124002 27074722 27779038 28373804 28835084 29158224
8677 29158224 29357890 29375447 29155034 28713046 28016392 27059640 25987257 24976206 24127496
8668 24127496 23507589 23165296 23024552 23086181 23332595 23767391 24372263 25120080 25973601 26869699
8658 26869699 27729898 28458183 29010832 29322345 29358072 29183218 28963669 28749602 28508543 28153987
8648 28153987 27618175 26904337 26000659 24840372 23496009 22074672 20619893 19164677 17789668
8639 17789668 16516463 15284080 14132820 13119102 12181417 11388114 10723549 10151375 9654469
8630 9654469 9198923 8751807 8298765 7909465 7587458 7325448 7103163 6909892 6757655 6608158
8620 6608158 6477896 6362418 6281037 6227501 6210385 6216031 6267732 6323191 6411291 6552598 6722890
8609 6722890 6895059 7082832 7300290 7533425 7794729 8094351 8431722 8730731 8979411 9231303
8599 9231303 9410738 9587251 9754458 9849423 9933918 9991501 9929508 9766865 9594204 9424849
8589 9424849 9244608 9077271 8866352 8648299 8381105 8083208 7855382 7731355 7771148 7908157
8579 7908157 8080385 8300262 8526507 8731327 8903552 9068224 9196598 9287299 9306586 9211246
8569 9211246 9006922 8711643 8325654 7846201 7371970 6882849 6419987 6002002 5590923 5171160
8559 5171160 4785735 4418217 4074726 3778346 3547046 3337634 3152230 2965730 2760136 2603910
8549 2603910 2478006 2358766 2252736 2163823 2096058 2037658 1960128 1907885 1848314 1766705 1695925
8538 1695925 1609562 1524422 1469970 1407669 1327336 1259651 1205679 1129423 1083045 1059243 1027344
8527 1027344 962335 921622 915032 924090 876855 856304 837422 810259 776124 746245 729790 735435
8515 735435 759809 765285 760996 730295 677712 660117 640283 612215 609701 594510 574576 546675
8503 546675 531000 509782 482567 469814 437145 428370 448082 462833 455432 427948 421575 422059 410464
8490 410464 413623 421982 413725 408175 404632 406087 384508 378371 363230 367025 353308 351358 354284 351832
8476 351832 333828 357780 359792 327149 326424 319327 285278 261574 252750 258384 280213 304958 299839
8463 299839 301779 319644 298554 273684 294696 268861 255391 265894 264980 263802 259909 217599 212696
8450 212696 218368 229261 222625 207234 180063 182238 190995 207619 214225 232106 236822 248280 273741
8437 273741 285976 304660 313149 272959 255601 247111 233074 246196 258640 260805 269048 250382
8425 250382 236110 234209 241276 230127 214279 186264 180465 200984 205814 188528 158548 127078
8413 127078 145665 145525 157002 188464 218120 234411 223900 202388 241552 238521 223115 222549 225137
8400 225137 222269 231315 234150 248753 258251 234605 206776 179423 190608 159029 145942 141064 133724
8387 133724 145554 151372 158840 178316 193617 193868 172641 158966 153247 132226 128512 150143 143604
8374 143604 140050 138517 125992 133770 164318 187147 186827 192509 202349 170409 155752 168023 183948
8361 183948 212045 209472 218498 222036 218611 217891 226326 249342 263040 274489 271504 269736 274570 263215
8347 263215 272777 254777 234772 219083 200544 230021 239494 227892 237402 250113 243553 251269 218332
8334 218332 240761 258629 274574 285287 249386 229261 244495 242240 248797 248097 236729 237792 239847
8321 239847 239732 234330 222211 209314 230033 242566 215626 204016 180894 156666 148889 139080 118257
8308 118257 96216 89667 113618 117098 111410 121538 150958 152203 137385 119265 127150 115777 95136
8295 95136 75065 68359 59874 38306 33701 61692 83553 88042 105339 110585 123582 114956 140000
8282 140000 149340 152932 184849 240901 243418 248597 245421 253899 275363 262194 248405 235583 250374
8269 250374 244057 221622 197596 207184 203043 181968 162770 156721 160471 146257 144488 169948 202342
8256 202342 222722 192209 197687 217495 213458 213050 239339 231195 217968 237422 261824 258942 255966
8243 255966 240442 212752 188866 173102 157376 131575 113201 116950 106844 128546 145310 126094
8231 126094 101495 95025 99377 94979 69705 64005 59156 61993 58626 42387 37005 42008 66390
8218 66390 60637 53368 51055 41407 47605 50097 61168 48646 35771 70640 63790 43794 57445
8205 57445 93467 92050 93506 106415 121206 129777 152015 129217 106468 89894 104980 128317
8193 128317 112800 111249 106568 69961 58292 71677 84026 74111 65083 69926 68692 59030 57149
8180 57149 87094 108732 136370 143838 108452 77972 82814 115113 119048 107894 98170 113459 127571
8167 127571 162256 124138 80657 83016 86697 72198 47452 65625 90545 110892 103085 72154
8155 72154 83067 82247 90725 108581 131656 130217 120002 112276 71527 46113 45641 89428 90462
8142 90462 92529 84037 55990 34834 42581 59405 44011 16569 13706 4793 1112 14410 62220
8129 62220 100303 93308 81029 97885 113426 115813 111164 94913 117360 116293 71294 53097 68387
8116 68387 58350 49497 61017 78595 72996 71946 74282 79205 71112 70999 74276 79276 83590 97771
8102 97771 101166 102013 78640 45241 28830 49315 49158 45075 66024 84872 89391 76032 73328
8089 73328 98448 94772 110539 118361 91860 85209 82951 90380 83921 65480 57086 57727 79898 89506
8075 89506 95207 72648 59529 58106 50073 69185 99570 120272 119712 97492 84373 85647 70698
8062 70698 34458 18431 39379 76071 87273 90455 118406 108742 110983 106239 106593 82049 87743
8049 87743 110451 139096 158076 148193 113853 125713 136210 123477 118054 148906 173672 176786
8037 176786 161658 157560 175513 169282 135127 142799 177632 204753 234296 250267 251798 257403 232254
8024 232254 205282 210997 201038 202148 215713 235410 212449 211377 205426 202602 205071 200647 181878
8011 181878 173966 190348 209140 226509 238691 220579 213148 195765 204016 213256 237077 236372 228438
7998 228438 234396 257774 268958 269188 299641 301248 305660 320158 343465 381989 434400 440507 448317
7985 448317 434525 400002 399230 405437 408864 427570 406128 389368 348330 317024 316782 336253 334305
7972 334305 304377 300717 294273 272596 289139 305305 274477 246669 232969 241590 272940 315131
7960 315131 314183 275773 239059 229116 234850 243725 226296 205587 209813 251342 282703 292942 329776
7947 329776 363048 359680 356222 359609 366347 392520 401658 380521 398282 417521 403386 351749 319005
7934 319005 307163 310502 283914 254591 247754 264232 240514 229713 210422 192548 207627 201394
7922 201394 198887 222635 231348 187689 188539 191839 199531 196302 197145 208863 219708 222588 200458 183082
7908 183082 186317 213881 211589 199769 169682 184477 204377 204821 187992 176517 155127 134340
7896 134340 143579 143723 136282 120395 108319 119590 145710 150201 134875 109332 84377 77632 87427
7883 87427 100855 97965 90985 98628 95436 78527 76017 73732 59978 67477 55695 86296 127361
7870 127361 111606 110641 95987 69686 59898 36165 30478 39781 54177 43735 -2610 33444 45136
7857 45136 77111 90198 76136 61405 72971 91366 70831 6417 -14869 2839 27440 30641
7845 30641 40010 35647 30720 46310 25571 39501 49796 64854 63643 21610 -8008 -10132 5102
7832 5102 6718 20814 51411 79716 41714 39981 73779 87708 63577 64303 55820 59563 51945
7819 51945 47648 37792 26810 8695 -6584 -17958 -16690 -9089 14481 -10849 -10693 21800 27635
7806 27635 9156 -20088 -4514 10177 40863 81006 65990 47027 64623 53899 42907 25329
7794 25329 23345 46254 46894 30153 8980 -13353 -19702 -21080 13437 5619 -3223 -16054 13232
7781 13232 25215 -2903 -20394 -19272 7288 -4048 28690 60445 54520 41085 25166 21618
7769 21618 32359 16757 -4412 3336 9448 -23765 -21842 -15566 5517 27470 29811 29931 11270
7756 11270 6770 3560 -4586 5217 2452 5654 -9206 1691 28082 46773 56167 46146 37909
7743 37909 48708 18245 -3782 -1738 10647 10067 -11671 -24483 -25467 -22848 -41462 -49463 -54494
7730 -54494 -6229 15655 1674 -6779 19330 26202 -17754 -12747 16257 42757 36161 27870 38634
7717 38634 32894 12772 7893 -3710 784 12336 33865 33304 24874 42850 37060 35800 14229
7704 14229 -381 -15286 -8034 9621 19117 917 -12065 -1288 -2183 -9896 -11423 -13128 2661
7691 2661 26735 24753 18960 36565 46868 42338 16863 5679 24552 32777 26418 29277 19296
7678 19296 52648 55937 37586 35061 30548 43780 35715 27640 36352 24453 41003 50149 36932
7665 36932 25759 39836 32063 26616 38082 60058 32709 17046 26874 50305 47509 42849 22967
7652 22967 867 -2751 -5653 -16070 -9047 -19184 -8362 -6189 -4416 2504 33792 38339 30739
7639 30739 29742 45335 45804 44228 44557 14802 -5481 -26240 -3180 31449 29269 41602 37093 27952
7625 27952 42007 33497 32916 28557 22754 5204 4000 33639 22889 13874 5035 8265 17382 27569
7611 27569 7021 -22216 -11752 -385 39499 29740 17114 30741 58365 64781 48835 25206
7599 25206 19920 29666 21058 5773 10778 2263 -9141 -586 13882 33048 3912 -26734 -22585
7586 -22585 -14349 -9166 5796 10283 4301 -23802 -41150 -43188 -29530 -47997 -37517 -7715 12853
7573 12853 24893 26690 32116 26672 20456 14874 9723 24281 14666 12502 20549 32513 3203 -14318
7559 -14318 -10223 -7655 -5920 7996 -3712 -18021 -48741 -16108 -272 21922 21359 20730 18334
7546 18334 4477 -17892 -32843 -8386 3470 -12140 -20713 -36659 -44929 -47913 -44784 -12778 -5935
7533 -5935 -13071 -35021 -23985 -209 262 -19376 -24345 -359 3919 8054 19126 8590 6311
7520 6311 3712 -20750 -17843 -39377 -22789 8125 18340 22624 555 16521 -1438 -23086 -32273
7507 -32273 -17441 7047 1316 -20479 -44685 -38742 7110 7806 -1521 -18989 -14731 -6408 687
7494 687 1641 11570 25709 8431 -4031 -4570 12860 4302 4820 7 -19681 -14685 -9462 -14552 -21989
7479 -21989 -11632 2137 15082 12729 -1018 -22247 -27686 -4174 -6130 -19503 1535 -17548
7467 -17548 -36459 -15379 -17939 -36732 -49313 -34807 977 22167 13354 -425 -11423 1101
7455 1101 -17130 -17273 -31425 -27060 -9251 13903 19636 22289 1275 -7534 -32226 -2770 15562
7442 15562 -237 -3480 -10534 -9906 -17410 -23388 -27567 -57610 -60284 -20452 10986 13630 21101 11318
7428 11318 -8110 -27628 -33846 -34444 -50480 -43105 -7767 5224 3449 23148 15185 11898 5370
7415 5370 -8903 5062 17740 13647 -8619 -3731 -816 23025 25849 5292 10687 13517 31372
7402 31372 1461 9623 23464 2015 10867 700 -15200 -18564 -11950 -9836 3806 25407 40389
7389 40389 39061 24306 23182 11479 21249 37182 27882 20539 4138 9956 -7651 -24137 2352
7376 2352 21975 858 1022 25726 44289 16241 -23727 -50574 -18000 -5614 9166 10173 -9821
7363 -9821 -17722 13354 19053 3099 -935 378 -8604 -13839 -15718 -19767 -24459 -30124 851 32091
7349 32091 11078 18182 4741 -11220 -56124 -75956 -69120 -45002 -27766 -7737 -2195 -10343 -13822
7336 -13822 -2079 5773 41107 58140 29519 22961 1457 11010 -19204 -42275 -22978 -7204
7324 -7204 -16599 -27884 -33970 -43846 -46325 -48273 -35040 -30899 -15895 8558 -3333 13395 -4340
7311 -4340 -1642 7893 17028 9980 -2599 -17578 3320 17367 10943 6034 -4599 -9761 -23751
7298 -23751 -20318 -11041 21055 21800 9652 916 -10438 264 12531 26058 21746 8265 7976
7285 7976 -290 -3377 26021 30056 45620 41915 7157 6761 9403 18633 19652 26713 36234 61671
7271 61671 41777 34982 33494 16898 12440 25098 -13331 -30845 -4863 19144 39653 14515
7259 14515 -23168 -59748 -57991 -30380 10066 6559 6608 11556 -1986 -36145 -7307 15892 11945
7246 11945 -4516 -22236 3635 6688 -3900 3992 2876 29072 23647 19520 -12224 -8714 -677
7233 -677 9766 9327 19888 31747 26168 21745 16624 10689 36367 4358 -32158 -49450 -27124
7220 -27124 -9762 -8432 -22996 -32747 -20441 3419 16387 13003 37921 29372 5395 2089 6476
7207 6476 25135 29539 28719 33279 29040 14004 -5096 -14377 -14224 3049 1307 19150 31692 32136
7193 32136 17026 25492 33215 21433 16984 4920 346 1980 -4798 -16380 -2887 -22786 -24058
7180 -24058 -38905 -23450 -9338 -27048 -26756 -17840 -24993 2284 418 22199 39561 30846 2883
7167 2883 -16820 -31369 -21263 -12026 -32790 -29603 12178 36401 44467 60552 62396 53624 37272
7154 37272 25799 23440 31277 26492 11483 1649 -7025 3755 7187 -27205 -28698 -11614 -13746
7141 -13746 -19174 -21628 5807 28946 30395 30240 1081 -19760 -36693 -40022 -16641 3739 -13673
7128 -13673 -28417 -41697 -33788 -14905 -4616 -25361 -3669 55941 57147 33314 10544 15918
7116 15918 20263 18171 -3953 -7698 2630 26182 32015 3555 4141 22771 27585 34051 6714
7103 6714 9497 19625 13728 -6063 -32039 -55050 -60799 -36901 -12740 13679 4936 -5853 -17900
7090 -17900 -15849 -15419 17096 1438 -15152 -12870 -6763 1770 16105 -1705 -7162 -9904 -20392
7077 -20392 -14465 -4634 8505 5674 6445 22397 32308 9757 -5619 -25546 -14243 -16385 -4089
7064 -4089 6466 -8188 -4450 2388 7811 19855 30908 15681 -7921 1531 13781 8147 21485
7051 21485 29428 4651 -13688 -22264 -17722 3266 36461 35167 31345 21602 16191 16829 13989 -8131
7037 -8131 -20098 -7854 3168 -22721 -57453 -52650 -33782 -16198 -32527 -29551 -33762 -45644 -38790
7024 -38790 -36248 -43604 -55960 -45830 -42686 -24390 -27929 -22994 -13387 -8057 10248 15511 24925 17352
7010 17352 10607 -4928 -39559 -28997 -3124 -13426 -35246 -36777 -41924 -324 -2527 -8228 1859
6997 1859 15370 17787 8720 -11088 -2544 -5799 -23336 -37284 -10094 -16315 -12808 -25395 -29975
6984 -29975 -15308 -35384 -23338 -10890 -5839 -9015 -23321 -41496 -48865 -43780 -17620 -16415 -41822
6971 -41822 -31861 -31961 -15630 -14332 5452 -28749 -69350 -39453 -19018 2031 4983 11051 7685
6958 7685 35679 33025 28967 17260 -5266 -36226 -28183 -3623 -4686 -7623 4310 8958 -9294
6945 -9294 -15102 -730 12928 8722 -1318 -5493 -10962 -8889 5801 10313 27941 24705 3246
6932 3246 21891 33433 41398 38966 18881 13940 -18345 -27956 -21101 -23983 -19431 -11017 -21159 -15960
6918 -15960 -2824 14175 23843 22131 42791 38800 1304 -27541 -43318 -30050 -18763 -9845 -21563
6905 -21563 -28023 -37841 -39464 -32993 -20439 -27611 -16182 -21973 -28085 -37683 -31621 -21169 -7459 12313
6891 12313 38227 38301 36750 25046 -1880 -3571 5019 14306 16751 30267 35647 36661 29836 20064
6877 20064 21482 33743 16724 20174 24404 16302 -19255 -29740 -14329 -3741 -13765 -20307 1401
6864 1401 13657 5258 -7672 -1591 8998 36577 44235 41395 35016 13057 -12829 -12441 14494
6851 14494 15296 -4685 -15507 -6412 4186 10704 12000 -735 20598 33464 1905 -35671 -40841
6838 -40841 -38018 -6755 -14345 -24614 -26166 -3461 18046 24473 18738 -3970 -32030 -43546 -24584
6825 -24584 -21978 -11226 13427 13459 7121 5838 -10385 3585 3204 10707 41150 25859 24379 15824
6811 15824 33837 33995 -2576 -15370 -22458 -16907 -12490 -21845 -22835 -9216 10137 2118 12792 22888
6797 22888 19416 23519 -5726 6764 20414 15620 7911 3162 5740 5122 -5782 -29040 5482
6784 5482 17071 1337 -15770 -41734 -29469 -4543 7173 13560 5995 21325 31127 30435 -510
6771 -510 -5319 -14873 -20658 -18821 -6364 1166 -26036 -15046 -1910 -28652 -57779 -51679 -38225
6758 -38225 -14568 15803 21591 22113 7211 -1617 -16358 -14085 -14248 -31914 -43411 -42637 -31279 -22900
6744 -22900 -4713 5791 3635 5642 20964 30944 12047 9205 -20233 -782 8291 13300 -4431
6731 -4431 732 8405 12954 13548 -13593 -33957 -35173 -44194 -20682 -23309 -26022 5077 6851 -24318
6717 -24318 -38066 -8245 23832 26577 18257 139 -5894 4823 11148 -1283 9479 27471 39520
6704 39520 37788 23658 1611 3352 -10893 -20384 -15221 -24320 -31111 -39498 -16089 -42003 -47258
6691 -47258 -13415 -5801 -10718 -14920 -1749 3514 26142 23851 -1892 -4899 -14853 -29089 -55367
6678 -55367 -29511 -10459 -17933 -15387 -23238 -15775 -1938 -4063 -14147 -4806 -19742 -17937 -14219
6665 -14219 -18209 1973 27806 10747 17592 22969 28583 21654 27019 34062 62331 62220 21449 15193
6651 15193 -4301 -27388 -11977 20115 11539 -37164 -62619 -53751 -22795 -10220 -2901 -7366 -20220
6638 -20220 -38690 -41454 -45866 -33205 -14903 3741 -18731 -28387 -10884 -3444 8421 19005 502
6625 502 7451 17618 20132 11640 28142 27228 29715 9750 -22002 -28175 3574 32682 59168 63551
6611 63551 45675 76919 73814 32594 31207 36388 33778 24132 -3957 2218 -6507 -38142 -14704
6598 -14704 -4282 -2973 11 -31314 -32919 -21450 -11918 -42471 -48309 -36252 -24294 -49616 -74794
6585 -74794 -42793 -33032 -55538 -73719 -58346 -40338 -32523 -18294 -15358 -16347 -6665 14435 6230
6572 6230 1054 22200 28793 47678 33644 31345 16120 -17137 -29610 -24280 -25077 -16122 -6620 11116
6558 11116 11864 12178 7423 6698 -3691 -6637 -30650 -47873 -66485 -74303 -60818 -40794 -30547 -16810
6544 -16810 -7086 13367 17675 31644 35716 13354 -2407 20572 44589 63382 41439 331
6532 331 -7604 -3684 13554 21637 13745 5684 -10948 -20425 -22060 11126 13090 11550 79 810
6518 810 18702 29582 19215 -5967 -13740 1990 -2957 -20286 -19093 6546 5437 1512 -7707
6505 -7707 -319 3808 22388 31442 26478 28173 37796 17715 -13467 -14700 -28328 -15555 -16658 -34398
6491 -34398 -48144 -43577 -14452 4300 13051 27940 42952 31780 19215 8451 742 15275
6479 15275 11201 -6384 5404 -7471 -19410 -18515 -33405 -27844 1139 2988 13483 17842 33607
6466 33607 49470 39692 15055 23067 27656 -19228 -25644 -5307 -17570 -17500 -17475 -19439 -5698 -13683
6452 -13683 -12187 29170 56336 42498 14871 -10161 9215 46178 43139 35135 16033 -5442
6440 -5442 -12982 -8627 -5785 8032 1150 7272 6196 14622 1272 -7656 10930 -5113 11442 41520
6426 41520 46748 32135 14682 13123 -5083 5120 16702 5814 10027 3963 -11587 -33882 -32449
6413 -32449 -533 51442 54772 27519 13250 -4439 3860 -2416 20968 34096 15451 6404 9648
6400 9648 33356 25407 3502 15105 -1242 -8726 -3088 -1703 -15635 -24449 3138 15992 -13097
6387 -13097 -33774 -20395 9229 1909 -3169 12602 -17150 -36962 -40341 -51016 -44768 -27451 -8222
6374 -8222 -32553 -40606 -39550 -37632 -38937 -17300 7105 4018 -16840 -17295 2093 7199 -26262 -42547
6360 -42547 -45072 -35353 -8441 -387 17958 24819 14791 -15670 -19195 -16286 -16961 -11530 -33601 -40162
6346 -40162 -21439 -14052 -36437 -50277 -17369 -10512 -4683 19120 30305 10064 -19013 -20903 -12948
6333 -12948 -14891 -21186 -18815 -30299 -23872 -35016 -35013 -6566 -22278 -15760 455 26006 41227 45820
6319 45820 24014 20608 18173 35633 56374 74143 29240 -28450 -44834 -34690 -16444 22097
6307 22097 508 -34509 -41582 -41314 -25556 -24342 -34298 -42580 -36385 -29472 -44514 -74379 -55996
6294 -55996 -24560 1748 -16821 -23330 -16609 -22785 -30375 -31528 -18229 -31953 -30817 10418 41086
6281 41086 53520 55723 22704 11345 17031 7193 -7488 -36185 -57901 -64195 -44587 -21305 -34053
6268 -34053 -35627 -21603 -7557 -19411 -20524 -27585 -39763 -43849 -24530 9633 5432 -1207 -7614
6255 -7614 2794 6851 23837 546 -5087 -387 12266 545 -24249 -23844 -24761 -2716 -16696
6242 -16696 -28969 -17478 -34109 -43695 -30997 -4970 -8606 -25850 -24774 -20864 -27508 -13046 9636
6229 9636 4306 -25505 2263 5465 25598 26436 10772 7852 7130 4182 1204 7174 -1708 -27036
6215 -27036 -18897 -23049 -28016 -9781 -2119 -17331 -36909 -23701 -19577 -45628 -55976 -18205 26843
6202 26843 46598 36495 -21689 -26533 1349 10069 7585 -7894 8257 27869 41762 25173
6190 25173 20595 30945 7090 -21087 -31094 -15490 -9567 2889 1352 -13944 4385 1331 -26100
6177 -26100 -11122 -20909 111 26666 14464 14818 31140 30081 26153 3947 2975 31155 7314
6164 7314 -7917 20672 27991 16663 18420 37939 55277 58486 12788 -22124 -2160 19136 19706
6151 19706 21746 -296 -15042 -5373 15473 51867 40828 22263 31083 55612 48677 18980 3627
6138 3627 -11968 -30563 -26225 -16113 5568 -31601 -41056 -41290 -23857 -13094 2652 11551 21543
6125 21543 13325 -10220 -9997 -8763 -22126 -31440 -38904 -31253 -10640 -14642 -24411 -9251 -26695 -12510
6111 -12510 3887 8613 15315 21185 -2475 8264 -15823 -26948 -5361 482 -186 6929 8004
6098 8004 33659 44110 64247 47739 -10192 -44668 -39684 -8897 30393 17880 10761 8053 -9886
6085 -9886 -41978 -57137 -54838 -60194 -28574 -19508 -29433 10470 45256 41935 23326 16165 681
6072 681 10364 38051 44067 12344 584 -24770 -34410 -8148 7099 12905 3404 -23254 -40754
6059 -40754 -45703 -9601 -22455 13693 40722 9177 -33004 -9152 7705 -9932 -35098 -39842
6047 -39842 -41408 -24350 -14471 -4989 -2371 16997 33347 14674 -11262 -17471 -46912 -48439 -43435
6034 -43435 -38622 -40589 -16742 2523 -4349 -26151 -25628 -16030 -10588 -279 3283 -28957 -42727
6021 -42727 -11572 -28188 -20829 -28507 -41987 -23704 -4834 13434 10334 2787 15073 18571 24120
6008 24120 8318 -6846 -32759 -41839 -34209 -23312 -16720 -14956 -5119 19513 30540 16803 -8650
5995 -8650 9989 28946 30218 7170 -10302 -9561 -10375 7737 21584 32435 24702 30653 40141 27956
5981 27956 -5871 1764 12308 21440 27421 -2359 -16965 9634 4459 -2427 -7090 -24055 -1222
5968 -1222 23211 971 -15212 -5515 25023 23727 24472 20291 1247 15458 -1978 -14184 -12794
5955 -12794 -15495 -40102 -26870 -13007 -20258 -41707 505 42551 67528 50837 17289 22489
5943 22489 22352 39974 29692 13134 -6250 6156 15084 -2032 23636 8093 -16877 -16414 -5499
5930 -5499 26276 14287 -23808 -25818 10333 36761 36256 38123 20096 17869 5219 -456 25073
5917 25073 32609 29984 1229 -15024 -31552 -50912 -93258 -75761 -63175 -66594 -57130 -50043 -34112
5904 -34112 -29704 -34600 -55479 -51911 -43447 5515 -6231 -270 2299 -2183 -11515 -14011 -8258 -12966
5890 -12966 -10856 6391 9811 3972 -10810 2455 25990 10654 6296 13181 -2318 3237 15038
5877 15038 -17113 -35320 -27538 -35816 -40027 -39727 -49361 -41410 -20165 7425 17338 -22362 -37711
5864 -37711 -41845 -24610 -18141 13580 26193 11080 -2089 7385 9753 -13604 -22610 5854 19954
5851 19954 9390 -9596 -23302 -36801 -15627 -11680 -8136 2336 -6376 -6113 -13006 -15079 -2014
5838 -2014 2536 19136 7498 -3380 6641 23212 30327 2815 -28124 -39771 -18228 19049
5826 19049 42609 48278 35514 40897 20845 4637 -21134 -22045 -18099 -29428 -29124 -21921 -22308 -27980
5812 -27980 3095 4052 -16505 -43532 -40920 -2905 29140 45952 20187 3228 27871 45504
5800 45504 25021 4521 -16496 -30572 -42873 -34741 -30897 -18373 -15727 -22421 -4908 -5191 11002
5787 11002 34495 14577 32170 12324 5884 4578 -388 21871 36284 20187 -29423 -47259
5775 -47259 -19638 -24822 -48126 -26343 -27288 -41928 -41290 -22863 -11230 -9439 -20039 -42859 -55988
5762 -55988 -53581 -48741 -35495 -32132 -47687 -52793 -30733 -16939 -13257 -29 -17482 -43928 -12728
5749 -12728 1426 16679 528 98 -13178 -7394 3584 5063 6019 11389 20784 12257 8423 7741
5735 7741 4458 4369 -14301 -39494 -44969 -30895 -21356 -24108 -2370 14921 17134 13136 -3228 -22013
5721 -22013 -26214 -12718 -12907 -37633 -23225 -15869 -38539 -33342 -27307 -27349 -34547 -26731 -10887 -17963
5707 -17963 5624 -15733 -36003 -41759 -17034 19640 19859 -10597 -36021 -44461 -43688 -13934 -1311
5694 -1311 -7031 -10187 -189 18856 41494 29167 24556 15443 -13545 -27543 -1456 8715 -10787
5681 -10787 -13324 -10211 -20051 -29491 -11065 -3532 -3042 228 -866 -6151 4703 19677 7584 -89
5667 -89 18778 31682 20570 19052 5824 14446 14579 -13881 -20873 -9905 32984 38145 5251 5931
5653 5931 9442 29865 33008 22726 14544 256 -1662 -15044 -12641 -3705 -14114 -19294 -35174
5640 -35174 -19596 -9165 -26171 -63998 -66229 -46403 -29811 -23148 -1554 17122 1148 -5448
5628 -5448 -108 16257 2466 -18593 -25000 -3431 -8134 -20245 -42603 -68418 -61769 -33363 -21239
5615 -21239 -8764 329 8598 9031 8342 10613 -3788 -1028 -6187 14926 26766 11705 -10111 -21724
5601 -21724 -7913 -9312 -18747 -45000 -32253 -13690 5853 7017 -24684 -14245 8186 -477 -28044
5588 -28044 -19922 -24761 -16304 1405 4721 -11772 -10530 -12944 -3187 -4642 -13264 -13001 -7599 -21336
5574 -21336 -14914 -4008 -4240 -11538 -15937 -30430 -42088 -38723 -19281 14085 19143 48091 26564
5561 26564 13696 22709 26622 11900 -21086 -35161 -43446 -18150 -20154 11396 13309 -6390 -21842
5548 -21842 -7329 -12367 -8327 524 -17989 -36824 -46455 -71307 -76890 -60047 -46999 -26000 -18242
5535 -18242 -24265 -69424 -72994 -37466 -40207 -30910 -53200 -50251 -49874 -65075 -65005 -66535 -60530 -32057
5521 -32057 -29656 -21265 1038 -1974 -2153 1809 -22215 -22235 -7807 -12667 -9688 5288 -13118 -9272
5507 -9272 23178 45275 26020 -8988 -21516 -41974 -16766 4189 -11784 -2879 2632 1310 -75
5494 -75 -2147 5642 23971 16528 -2918 -4239 -2575 12365 -967 27082 23347 -20279 -49530 -37041
5480 -37041 -39491 -32316 -21465 -21900 9331 32196 52267 44045 40079 19419 12709 31174 21934
5467 21934 -11645 -37077 -3956 -5677 2572 -6931 -2190 12145 7007 9460 24220 39805 24399
5454 24399 -105 10311 6546 39351 41864 126 -38591 -53648 -39442 -13709 -22446 -23236 -13021
5441 -13021 -9268 -2961 24229 19751 9128 -657 -8369 -15532 -13555 -3819 -19284 -16141 -15070 -14617
5427 -14617 12728 18062 21958 20966 16558 13398 5046 12875 21056 36648 17154 -10038 -30302 -3569
5413 -3569 22682 31384 20290 8675 -8956 -13021 -46749 -54876 -60313 -46224 -38675 -38056 -29801 -9076
5399 -9076 5847 27536 13795 -9294 -37398 -51662 -42327 -43383 -14100 -8416 -15713 -6374 8616
5386 8616 -6659 -11186 -23629 -18484 2365 -15784 -35472 -5174 -7940 -23738 -28795 -40318 -25010
5373 -25010 1878 5936 -10821 -32418 -34022 -27235 -17220 -13148 -31543 -33178 -17224 -3828 3927
5360 3927 1984 15288 27121 13471 21599 10472 -20610 -27988 -39966 -37903 -42628 -59150 -53471
5347 -53471 -40172 -6419 -12336 -20669 -21708 -25544 -23019 -33023 -16872 -16063 -9411 -14154 -29167 -32986
5333 -32986 -12890 5513 -1351 6420 -15321 -33561 -37271 -18963 -32384 -8297 6505 40205
5321 40205 37965 7979 -20162 -26081 -1775 429 -1941 -4279 -6231 -36287 -26162 -17034 -22056
5308 -22056 -23876 -28007 -22024 364 11285 -2912 -24201 -35023 -30200 -25654 -8060 -9462 -18863
5295 -18863 -40808 -20480 -4946 -33297 -36760 -23567 -32848 -32207 4095 26527 26998 13593 10288
5282 10288 26729 22436 14524 30657 34103 37983 43528 11729 -23364 11620 745 -22378 -13825
5269 -13825 5101 8642 12461 -15646 -39821 -39312 -44779 -25413 5428 19488 1906 8155 7420
5256 7420 18307 18269 -228 -24056 -21958 -9472 -27162 -20520 -19441 -15595 -39582 -31594 -44375 -59382
5242 -59382 -58596 -49938 -46330 -35018 -28751 -21216 -5636 -13967 -14731 321 2659 -19763 -10347 -5993
5228 -5993 -7797 372 -26641 -42497 -23118 -8078 581 -6285 -20346 -8846 -8557 -19055 4481
5215 4481 19522 27626 2330 -1480 -3422 -6241 3904 17523 78 -5929 -18595 -18587 -22270 -4746
5201 -4746 9263 3917 8181 7181 -10727 -11682 -7850 -28022 -46215 -31462 -14566 -6717 -18051
5188 -18051 -57229 -57242 -49096 -30130 -19278 -36588 -23393 -451 16454 20179 25847 26071 15863
5175 15863 -12942 -33436 -21314 -10480 -19794 -5187 24299 24207 18862 21660 12207 -4343 2374
5162 2374 -10853 -18004 -21223 -39222 -16675 -27737 -31966 -19491 -11621 -5826 -4553 6325 7878
5149 7878 -33932 -41633 -45367 -21579 -5653 -8169 -37649 -16770 11196 16558 -6208 -23213 -31645
5136 -31645 -19609 4660 34997 18782 -21104 -6579 3881 -8769 -5474 -26204 -55873 -37617
5124 -37617 -29107 -24510 -15534 -14035 -19602 18605 31443 12099 25450 44103 32889 11960 -16863
5111 -16863 -39483 -13738 2406 -5585 -14113 -9781 -9779 -11503 27502 48227 56859 51473 44923 46116
5097 46116 41765 9478 -42205 -44156 -29971 -48363 -38344 -48738 -41449 -17429 -8004 -38978 -37781
5084 -37781 -48605 -24109 10385 14235 -11844 -37981 -30076 -21196 -15155 31677 19160 1936 2736
5071 2736 -11454 -5267 -13247 -91 7358 3424 18162 41102 10857 -26802 5306 35825 41775
5058 41775 27318 29326 26291 38785 38130 51975 33242 12282 32414 28877 11624 4858 -11878
5045 -11878 -19761 -21459 -21794 -39432 -60427 -51299 -7836 -5564 -12387 -49131 -41470 -27748 -31022 -14260
5031 -14260 -6811 -4443 -20360 -13409 -12122 -10801 -3066 -11635 17668 6242 -29577 -39648 -21384
5018 -21384 10628 43931 54250 38553 44324 25357 7135 8206 13902 28982 41732 40496 34431
5005 34431 27207 7321 2127 -9617 -30467 -37948 -20132 -3059 23439 4106 3160 -5990 -13046
4992 -13046 -4470 -8130 -18914 -25623 -35067 -54835 -59623 -61247 -43947 3024 27595 19897 0
4979 0 23686 20560 8956 -13157 -24579 -33946 -15315 -26107 -29294 -16701 -37061 -34181 -24271 -42304
4965 -42304 -46204 -39405 -18981 -5029 3389 -17855 -29564 -33038 -5829 -17170 7114 4727 -5772
4952 -5772 -12374 -30547 -38667 -29254 -24836 -30941 -23176 -36453 -38086 -7872 -5684 -6063 -4569 -862
4938 -862 9606 1106 -15830 -21155 -16765 -9648 17861 17570 10430 -12397 -9262 5381 6562 8853
4924 8853 -14589 -13975 -10221 1096 -10500 -9916 -9473 -11174 -13754 -18324 -14478 20113 26535 9703
4910 9703 -875 4649 -27024 -53683 -20613 5615 11488 32815 30007 17429 -5195 -24464 -44897
4897 -44897 -33892 -9514 -2823 -25264 -29977 -29811 -49135 -39136 -3813 6863 2283 -6063 4152
4884 4152 10389 -8362 -48780 -47018 -18300 18809 30883 44603 56213 40459 13917 8594 -4498
4871 -4498 -10464 -17696 -28514 -48832 -39078 -3414 5017 -592 14468 33274 35465 5636 20457
4858 20457 19224 26803 21470 7515 23987 36213 29082 1929 -22602 -5317 14996 -14839 -32614
4845 -32614 -24165 -16951 -23298 -34025 -27138 -22318 -20882 -2383 8012 -2229 -15227 554 30717
4832 30717 38864 -9072 -7421 10748 18868 14115 -6659 -17295 -18055 -18891 -2087 22409 13937 -15048
4818 -15048 -41799 -43952 -7616 22323 -5768 -20229 -10784 -1358 -3724 -21776 -25443 -11144 675
4805 675 4967 18449 38336 45330 53727 33158 26596 11168 -2249 -1965 11299 25426 20430 4693
4791 4693 10495 5482 724 12139 16549 24817 7739 -3021 -8916 -16759 5390 27569 -3653
4778 -3653 -27680 -16184 15246 32390 35469 18774 -5631 -26254 -26793 -25214 -41514 -51058 -59343
4765 -59343 -59936 -36255 -34683 -43112 2289 66629 84686 43951 -661 -12406 -33809 -40841 -26219
4752 -26219 -17469 -5679 -2284 13173 21111 5164 -9799 -5245 -3159 -22861 -26937 -52365 -26427
4739 -26427 -12924 4696 5866 -171 -2139 -21882 -22523 -9956 3148 3396 13480 9754 10845 26452
4725 26452 19672 12627 -23996 -28972 -19371 -25145 -13586 -44031 -59700 -54996 -56038 -32611 -31821 -34414
4711 -34414 -35119 -55008 -65151 -52059 -34815 -29706 -10716 6922 2824 -8409 -36256 -29518 -31500
4698 -31500 -35169 -30133 -52518 -42363 -25680 4053 -4059 648 6501 -21191 -59489 -62554 -67787
4685 -67787 -38955 -17675 9271 18705 37190 44238 12287 11288 21996 13247 28450 45826 38668
4672 38668 9897 -2597 -22653 -35389 -1488 14096 -18200 -8589 12775 8770 -15596 2325
4660 2325 13041 4453 -13051 -14022 -9656 -15490 -21466 -13554 379 4383 12006 10009 20603 38035
4646 38035 27454 -5697 -3717 18403 8699 15208 21327 22322 35729 47250 24128 -7696 -17766
4633 -17766 -26029 -23907 -20231 -7803 -23211 -25820 -30936 -6407 20189 16942 -23489 -10847 9602
4620 9602 17999 29770 31687 44329 52336 15447 16365 14721 -7321 -10557 -13604 -29668 -49005 -60902
4606 -60902 -48028 -40091 -40317 -33066 -15378 12293 1288 11943 10967 -18863 -39324 -40113 -26268
4593 -26268 -29551 -33995 -24520 -29255 -40224 -44498 -30582 -2539 -35 -22938 -25145 -7211 9088
4580 9088 1969 3915 16554 -2391 -11630 -11420 -3304 15259 706 -7181 -26471 -30673 -27438 -55675
4566 -55675 -39433 -7821 -13682 -13390 -8335 -7112 -30775 -55793 -70694 -61462 -42815 -31967 -39572
4553 -39572 -14924 17005 -2606 -22225 -14936 -3728 4825 19630 11191 15884 7214 -24060 -30968
4540 -30968 -7265 15579 984 -12464 -5368 13515 14463 36713 25383 973 -5609 9963 24211
4527 24211 -13304 -29097 5217 24167 21303 23710 16098 15183 5589 11389 10059 9065 -1168 -1752
4513 -1752 12806 12350 21116 10747 -967 16383 18079 30132 22450 23043 26640 35246 18471 -3446
4499 -3446 11700 -12383 20003 37443 31750 9985 2696 48388 63112 35097 29858 37002 17653
4486 17653 -2244 13587 7086 -12234 -12092 -47992 -73012 -39122 5343 28284 11667 22832
4474 22832 18428 10674 -8177 -2093 7654 6494 -19691 -43057 -40735 -37346 -15106 -29650 -17584
4461 -17584 9518 9991 -4660 -9931 -11120 19356 31881 29901 23449 15679 32295 22117 31814
4448 31814 8943 -37336 -50152 -55207 -38611 -49558 -48667 -50199 -43436 -28019 -21130 -21902 -32995
4435 -32995 -43704 -44318 -36368 -35558 -29636 -31978 -20831 1853 20143 23009 24416 20522 21715 -14031
4421 -14031 -38934 -30924 -27933 -12784 3056 14918 3021 -8257 13558 24910 41281 18802
4409 18802 15230 9880 13615 810 -15448 -7731 -9591 4768 24180 17193 22213 11147 -16449
4396 -16449 -44889 -49749 -28595 3869 2706 -2152 -16558 -1624 13277 16850 -3453 -34680 -45642
4383 -45642 -20955 13391 30425 42306 25533 24374 18249 -9037 -16997 -40766 -31115 -3525 2786
4370 2786 15575 35446 38346 12768 -3911 -15221 7091 32632 38441 13051 4381 23905 45
4357 45 9765 40130 16957 -1897 10193 13647 4440 -14438 -24045 -14863 -9015 -17316 -38982 -31895
4343 -31895 -16772 -35546 -42571 -40817 -23976 -52616 -66410 -37100 -14083 -1377 -27970 -26214
4331 -26214 -40030 -26449 -6482 14136 16666 -5871 -10114 -14392 -34907 -49343 -50956 -31957 -48341
4318 -48341 -55287 -54738 -26538 6767 1215 -28205 -31272 -29541 -2064 13578 41163 29641 25377
4305 25377 2687 -14835 -25023 -25134 -19216 -54910 -49460 -45053 -23678 -19397 -36309 -29266 -28096
4292 -28096 -27983 -39134 -27599 -10270 -18585 -25247 -37550 -49494 -41464 -6449 33554 21865 -7893
4279 -7893 -10895 -7877 -511 5368 18111 25889 15645 16260 32986 22457 887 -7781 10959 8217
4265 8217 -8026 -26601 -46573 -41819 -26939 -16507 5985 11757 -2827 5934 33158 2758 -11087
4252 -11087 -17182 12021 16027 30801 59086 36904 13968 23724 35415 65744 59923 7603 -3476
4239 -3476 12114 -3506 15622 13957 6783 1732 3500 -18625 -21875 -3204 2085 13286 12429 43387
4225 43387 35390 19879 13615 9223 28860 36007 21806 24039 28086 40040 51855 36508 16775
4212 16775 -23857 -35431 -35291 -30336 -22072 -5533 -11705 -27929 -21784 -24159 -20392 21078 10611
4199 10611 -779 -14078 -11608 -14412 -18538 -9990 -26243 -41933 -22630 14405 6063 -619 -21874
4186 -21874 -40495 -51717 -29161 -19585 -33642 -27919 4741 -3688 -6072 -5569 -7810 -22027 -26818
4173 -26818 -8457 -8423 -24470 -10582 13568 -2119 5300 5670 17642 18020 29449 34306 9785 -12189
4159 -12189 2569 -12192 -17167 -6766 -14109 -39734 -16394 -28935 -53724 -46363 -42715 -25249 -20359
4146 -20359 -23299 -23850 4045 -2793 -7889 -10588 -41277 -43635 -37668 -24594 -10567 -1391 4498 11822
4132 11822 20638 28501 30686 28967 30343 18581 29732 50739 45058 61124 45823 35556 -11263
4119 -11263 -17637 -9899 5395 13995 18757 -6755 -25068 -14168 -11850 -10424 -16621 -19170 4775
4106 4775 2326 -8959 -9076 16280 38806 39214 34047 9539 -7898 -22736 -22361 -7735 -7196 -27652
4092 -27652 -48675 -27945 -14490 -4986 -10206 -12275 -12869 -35378 -51759 -25462 862 -3985 -28238
4079 -28238 -12709 5663 -2903 -28385 -107 -4648 -2993 3595 -19951 -26093 -20423 -26304 -40082
4066 -40082 -35871 -55806 -71589 -56024 -36729 -39261 -58224 -40573 -14333 -6262 -5627 -27168 -39108
4053 -39108 -46930 -33498 -21040 -28435 -41216 -43478 -40165 -28687 -14345 -40127 -37598 -15828 -24683
4040 -24683 -20857 -26139 -43766 -30341 -9316 -1582 3994 4222 -3334 -16439 -37443 -20402 -6191
4027 -6191 -8562 1747 -20153 -7689 2391 13987 39253 22098 11936 2205 -17204 5756
4015 5756 -2168 8802 7300 -15506 -36175 -23887 -19659 -19838 -19910 -24748 -5537 -564 -16151 12130
4001 12130 45115 73344 36932 13342 9201 -8218 -10487 -438 -17522 -13145 -17998 9613 25267
3988 25267 21522 18515 16380 24006 40132 11082 -17324 -40329 -45155 -27602 -5443 -3527 -39846
3975 -39846 -55435 -39075 -50514 -19527 9739 10515 -6596 -8814 -8531 20480 34753 48156 26453
3962 26453 28945 37373 5548 -10675 -26415 -37693 -36464 -44340 -17991 1734 -12654 -2696 5636
3949 5636 -6980 -4424 7032 16356 2759 -20102 -24084 -1699 -3463 -43757 -44454 -25645 -1878
3936 -1878 13122 29662 -16153 -15708 -1321 4432 -3416 -3287 3654 27964 34682 -444 -1366 29685
3922 29685 27730 35796 5181 9783 16278 -3672 7375 22979 3988 -6542 24189 37383 26436
3909 26436 10368 15228 11964 -3939 -5982 4590 17126 17291 5255 -17743 2187 -2032 -21828
3896 -21828 -45457 -23325 -16899 -5645 7012 -22878 -55488 -64907 -43451 -20476 13771 -9380
3884 -9380 -15874 6456 -252 -24061 -3571 17557 4388 -29110 -24860 10092 53882 41891 5877
3871 5877 2744 5762 8343 -3349 -42350 -42640 2156 6868 14612 -2277 -23121 -33586 -51042
3858 -51042 -47656 -17021 15388 30311 46379 40723 37881 16966 -5477 12452 795 1344 -12749
3845 -12749 -23201 -58531 -48889 -41263 -22073 -35006 -33926 -15580 -30622 -58906 -76647 -56276
3833 -56276 -11424 8535 -204 17492 19815 38175 50120 46833 14978 -42460 -55525 -45710 -38951
3820 -38951 -4701 25696 -3519 -17767 -7068 -23967 -14949 -5099 -8231 14371 30767 20604
3808 20604 18845 23133 27733 31524 29177 26111 51150 44641 8742 -14141 -8234 1124 3536 -8574
3794 -8574 -17405 -17588 -19987 -11986 -8511 -18133 461 7738 14000 15894 -5222 -12584 -31661 -13680
3780 -13680 -14885 -27596 -12321 -9828 -27754 -37163 -42154 -10869 7886 3480 -13407 -14819 -38682
3767 -38682 -69965 -76025 -23649 21599 4753 -12301 -40306 -47733 -41835 -29926 -2419 -22722
3755 -22722 -36010 -27824 -33167 -28334 -21817 -33836 -20537 -4281 -8843 16769 23026 8263 -7558
3742 -7558 -15860 -29897 996 35876 16352 11233 843 -16265 -8173 -4472 -1883 -13176 2327
3729 2327 25320 28277 32285 10530 -5561 -11920 -20984 757 30691 44617 31846 22851 -5440
3716 -5440 -34992 -34420 -35913 -47164 -60957 -52562 -17860 7047 6712 -32641 -20279 10720 5781
3703 5781 17075 -4100 -30905 -54611 -23241 -16372 -18121 1437 18421 32608 39111 19947 37171
3690 37171 36416 32204 4355 -24368 -33690 -50049 -61573 -69146 -50567 -30639 -24797 -21305 -10593
3677 -10593 -12111 -15029 -27918 -26367 -7446 -50163 -61902 -32719 -20288 -17404 -1611 1010 3806
3664 3806 -16238 -30240 -17356 -8634 2063 3006 -21905 -25487 -13993 -2614 -14312 -17709 -6610
3651 -6610 -12801 -25381 -17220 3914 13875 5874 -3871 8101 -32822 -31458 -26863 -26462 -5064 21436
3637 21436 23347 6464 15607 19053 6712 -25907 -19626 -3022 -108 9659 13372 17273 737
3624 737 -26478 -28425 -21545 -5762 4563 11407 6502 11258 22229 23678 6918 -13890 -8251 17951
3610 17951 400 -7886 -30069 -32038 -26660 -7845 9065 28620 42133 46471 19530 -12312 -2742
3597 -2742 8301 -5601 2102 6343 -13227 -10859 8457 29181 40136 28915 16790 22365 -2349
3584 -2349 -15724 -9215 -19478 -24254 -32770 -31575 -34217 -28950 -31419 -13770 13068 28332 4719
3571 4719 -21346 -16508 -4117 5993 21446 7782 -12113 -10351 -40073 -40047 -23366 -35284 -31065
3558 -31065 4216 24026 25384 29124 14662 17385 44354 31857 1028 -9068 -11618 -14644 -5054
3545 -5054 6572 18560 7982 1603 117 -2455 -3085 -6519 15225 11334 -11844 -49568 -59698
3532 -59698 -30842 -13364 -29419 -36553 -26292 -19841 -26636 -14403 -3355 -564 -1835 -21023 912
3519 912 20613 27205 22091 17787 19281 8330 16851 -2635 -7880 -914 -2248 -737 2530 10041
3505 10041 14417 20373 4292 -16067 -13869 25759 28798 1071 -9328 14560 -452 -5499 11749
3492 11749 10840 3898 -4859 -7377 -8794 -23409 -26956 -33506 -42310 -40852 -21502 -1963 -43477 -55508
3478 -55508 -13469 -22980 -22494 3712 7021 -9777 -32152 -41439 -31525 -8035 -25368 -21744 -13361
3465 -13361 -5858 -5629 16073 8450 -4416 -2733 7800 3131 20037 30926 -1105 -25068 -49100
3452 -49100 -41681 4878 34679 13748 336 -5127 -22403 -34384 -28462 2044 37442 50659
3440 50659 49939 30547 38188 41089 41175 24027 15616 49928 69546 45636 11719 3807 4627 1900
3426 1900 -8567 -6981 -23369 -36579 -36234 -32312 -34889 -34771 -36202 -21380 16834 8637 3109 15348
3412 15348 12318 3170 5321 21572 42771 31122 16063 17560 5534 2956 1533 19959 25827
3399 25827 5192 -19889 -15825 14414 -16737 -58281 -24604 -16002 -21440 6319 25404 3585
3387 3585 -2082 3395 3854 18968 20401 16706 -23485 -30374 -17683 1626 12605 12172 -1591 -657
3373 -657 1339 8342 -1695 -5257 -6626 -18092 -16051 -4382 -6250 -38879 -69583 -65629 -73202 -44061
3359 -44061 -37872 -53991 -55617 -46638 -20034 16163 9045 -17536 -6674 -4859 -17736 -11690 39944
3346 39944 39025 24274 15115 17735 -18072 -47047 -20017 -1986 6107 1106 -34075 -48280 -22923
3333 -22923 -15877 -8482 -20003 -22908 -7723 8028 10660 28501 28900 31222 8498 39567 75574
3320 75574 40719 -1906 -17062 -5707 -35905 -46896 -38800 -45591 -19300 -3251 10837 -889
3308 -889 -27481 -46708 -47641 -10251 8149 17886 7586 -14910 -44817 -48377 -37459 -34389 -34638 -12955
3294 -12955 1058 -14330 -26972 -22410 -17917 2012 -8906 -23239 -35021 -39531 -39163 -15167 -27259
3281 -27259 -17595 -1759 -11009 -34490 -48349 -37442 -49526 -34448 -29124 -23117 -19558 -43683 -71211
3268 -71211 -40676 -38260 -61558 -72131 -40952 -21339 -27888 -3098 7749 -9184 -20859 -31545
3256 -31545 -41605 -41013 -35865 -30472 -33791 -23005 -16713 -7496 -18827 -25436 1094 5603 1376 -16903
3242 -16903 3844 366 -8758 -2461 -14399 -18301 2351 12383 13217 -10126 -17437 -36965 -30393
3229 -30393 -31316 -25042 -37074 -44665 -27434 -27867 -28712 -9657 -4041 23425 44976 46532 43499 41544
3215 41544 49236 24224 34850 49074 25178 -1827 13833 54094 48502 29449 32177 37305 21413
3202 21413 16400 39527 29673 35408 36446 19319 -2524 -7187 -29333 -36218 -38278 -41034 -27518
3189 -27518 -16684 -9275 -37779 -34844 -33135 -40693 -22562 8114 8778 21272 4085 3548 7038 -15618
3175 -15618 -39099 -30730 -23310 -28338 -43495 -56603 -52570 -58401 -60213 -46171 -14873 -3107 -29671
3162 -29671 -24911 -6315 10377 34267 21520 542 -25832 -33037 -4075 16320 38336 47146
3150 47146 6945 -25052 -61552 -69087 -67690 -55786 -32752 -33774 -37404 -14505 13339 4114 3846
3137 3846 20728 23944 38467 46523 62532 52609 27939 17672 5186 33750 55996 55505 36013
3124 36013 38391 39277 28934 -859 -15008 -18084 -11410 28868 21737 25504 54490 68530 52150
3111 52150 -3731 -20838 3620 -7867 -39853 -41253 -31317 -20422 3123 -1597 5528 21454 40299
3098 40299 54420 44070 26437 20243 13043 15043 9477 17158 -1127 -23137 -39327 -56892 -56297
3085 -56297 -56478 -32881 -32678 -33466 -18742 -20837 -17494 -36708 -58605 -44882 1226 -5611 -16730 -48561
3071 -48561 -57061 -28193 3896 3614 -2551 -10225 -19560 -26148 -26275 -16203 -9424 -5165 -21705 -19726
3057 -19726 -11655 -11120 -12988 -25389 -27045 -25310 -5892 10775 24055 32204 21896 12136 7163 -13653
3043 -13653 -16882 6448 29471 22420 17576 30745 39229 53199 35906 17500 -8922 -15503 -5448
3030 -5448 26661 25679 22153 22206 -9122 -30365 -46195 -36209 -12416 -14526 -7097 10290 6538 7091
3016 7091 14959 22371 19723 18609 9084 12135 9481 9896 -9771 9246 15164 6249 25232 48479
3002 48479 46771 24070 24228 3831 1592 14206 20175 11040 11465 7023 16638 45163 42554 31072
2988 31072 53163 60291 11228 16815 37569 23495 6501 -186 22857 9166 2141 -22058 -13589
2975 -13589 -15080 -5376 10397 -12721 -47835 -58973 -41055 -11961 -1174 4712 -38441 -29872 -6821
2962 -6821 4104 7216 -1610 -17456 -26281 -17624 -15435 6422 35969 57605 19237 3868 -5927
2949 -5927 -25763 -26766 -28160 -27763 -13388 -781 10769 20241 39928 50560 42226 18838 2593
2936 2593 -23514 -18842 17791 45469 37768 3138 -8861 -15288 -4961 -11370 -5634 -12310 9275
2923 9275 64851 86248 52222 21848 29177 46424 13263 -16100 -22468 -43284 -54532 -55589 -46780
2910 -46780 -31085 -22218 -13048 -12016 1798 -27281 -28591 -33677 -41462 -30759 -29807 -35854 -36437 -18451
2896 -18451 -17064 -12600 -6986 -5767 11071 -22784 -36381 -29310 -35672 -45204 -39898 -16674 7563
2883 7563 -2676 -31401 -20793 -17248 -15486 -31965 -31230 9985 15062 8491 433 11548 11422 15070
2869 15070 13752 27447 7987 2067 -19551 -30323 -5922 788 5556 -9666 -10086 7147 2656
2856 2656 18526 28940 19036 4533 20254 31493 35901 5530 -25428 -30719 -32127 -63647 -50472
2843 -50472 -12567 4481 3133 -1187 16254 22829 33244 43367 46051 34846 36014 54309 41290
2830 41290 11294 2024 30277 31140 26488 19983 -418 15420 29739 34785 5891 -11573 -27110
2817 -27110 -47388 -40403 -33428 -14622 -7484 11387 9387 10556 33764 46070 32423 35074 23128
2804 23128 25402 18626 12282 7640 10499 13120 15271 24103 23429 25473 21448 6946 25140 16341
2790 16341 -1478 3493 4463 12836 26429 20458 9593 -26310 -25493 -24220 5549 20986 6756
2777 6756 23940 39885 16499 -12381 -7188 -17725 -21654 -22346 -6122 -7807 -5142 4577 22710
2764 22710 30896 14993 -4023 -9406 -9240 -8666 -1263 17218 44554 44965 31988 17468 -8503 -18619
2750 -18619 6295 10625 -10506 -346 2945 9256 29306 25245 5877 15924 14706 40688 46873
2737 46873 63460 59866 26107 10551 907 6154 -12370 -30503 -8684 22787 -1200 1703 35271
2724 35271 37381 7201 -19419 -26003 -13825 2682 16212 31850 21412 15030 5254 -21420 -17471
2711 -17471 4072 2416 -16366 -18077 -16050 -15880 -17306 -79 -282 -11266 -9032 -25687 -4447 -1815
2697 -1815 13847 -3044 -1546 8338 22799 40195 29287 12607 17496 8230 4345 18923 26274
2684 26274 -4578 -15833 -1482 680 768 -4526 -21761 -17220 -17850 -14081 -30666 -37173 -19176 -881
2670 -881 -1554 5227 24334 31240 35857 24972 28161 47010 47742 29347 -9445 4582 22940 22137
2656 22137 24778 27078 39522 63820 59802 47387 20528 -2737 -2192 -1141 40617 38514 25586
2643 25586 3296 2065 10032 18470 67081 74955 77375 72619 42266 7202 -17302 -10022 -9817 -4575
2629 -4575 -11627 2568 34 -6756 12962 5090 -9739 -31266 -22622 -12638 -24956 1559 -22956
2616 -22956 -28012 -20341 5137 -2419 -13982 -9368 3722 7872 14964 -9445 -24710 -25872 -12917
2603 -12917 2022 21584 25341 30698 27204 -3023 -8192 -28188 -25948 -7041 -3151 -12819 -4131
2590 -4131 3403 15182 -4353 -22171 -26182 -668 35601 55957 42116 13991 -565 -5188 6789
2577 6789 30115 22871 15462 -17826 -2889 -910 -25121 -35475 -37675 -36360 -22785 -36854 -38936
2564 -38936 -28805 -9257 14537 4885 14548 14057 27987 40340 39245 23063 16077 19903 11400
2551 11400 -29898 -40421 -42262 -45880 -32514 -31951 -39308 -30531 -3470 -8313 -26796 -40168 -55720
2538 -55720 -28828 -3465 -17393 -19961 9916 28814 10909 -11420 -13400 -26373 -23136 -14978 -5507
2525 -5507 -31064 -45477 -32036 -19854 -3612 8750 1368 -5719 -13038 21437 32393 25560 15587
2512 15587 25036 41687 42175 35874 17303 2793 870 21122 30174 52587 40307 27122 12339
2499 12339 -2061 -5800 -133 18396 18340 19096 -6999 -25073 -25052 -25820 -17372 -36791 -36180 -12583 14373
2484 14373 19990 19877 19779 21715 27782 10278 23301 32422 28181 30139 21393 -3402 23162 28914
2470 28914 33347 33659 53616 43877 21442 5874 -1593 2018 -10732 -18200 6866 -294 -29255
2457 -29255 -10314 17542 -13162 -14486 7524 25690 21035 37019 9444 -12018 -35942 -57739
2445 -57739 -25431 -20517 -8334 7055 -774 19630 38126 23930 -4826 -43502 -38316 -16850
2433 -16850 -17898 4080 4835 -7514 -33283 -59956 -24323 25249 38933 9893 -10394 -27203
2421 -27203 -16705 -30354 -70762 -63303 -29519 -5358 -5924 2777 2478 581 -21393 -38323 -22012
2408 -22012 -12412 10544 8144 -24802 100 6188 -23893 -34905 -27884 -26689 -9485 12098 15247
2395 15247 7841 9139 2892 30567 37368 25387 45996 47599 38934 296 -16518 -5866 -5261
2382 -5261 -277 18159 15750 -6283 -566 23685 -6126 -7846 880 -4335 -11326 -24733 -16037 -4802
2368 -4802 -4025 -2290 4659 -22868 -62772 -57775 -26617 7586 32089 39640 41470 49918 55231 44987
2354 44987 42186 52486 60837 43176 19325 28875 9541 19150 6982 -2297 4580 -7548 -12265
2341 -12265 -2065 31591 41979 22748 -23271 -27497 -10713 7631 -17232 -19430 7525 268
2329 268 12307 48209 45674 7808 -20893 -12274 -1912 -3372 -24520 -14654 -9383 -15191 -35116
2316 -35116 -31756 -30188 -24761 -31804 -27399 -62174 -35846 -10415 6156 14025 5089 -27055 -19605
2303 -19605 8127 -344 -6141 12807 -7407 -697 35652 27077 6584 6767 656 -15279 -14117
2290 -14117 -11867 -12469 -13180 -16749 -5051 13914 -12470 5187 22101 11942 2656 10985 -18389
2277 -18389 -54212 -54946 -61983 -64135 -42635 -25837 -13780 19278 26362 1547 -28208 -38166 -20996
2264 -20996 -2292 -26484 -29950 -4912 -9165 -24843 -29419 -1417 9172 1948 -10183 -42097 -34265
2251 -34265 -9426 -1525 5467 10954 8014 8039 7098 11984 971 -2861 14889 21239 25535 15684 365
2236 365 3216 -7608 -37173 -43825 -38514 -6571 2875 7919 15880 -6857 -29875 -20657 9185 7142
2222 7142 1549 -9980 -13500 -24381 -48620 -30170 -18802 -17866 -19874 -7350 5094 14222 29991
2209 29991 13477 -18438 -31872 -22421 -19970 -39115 -26611 -25747 -30958 -62608 -66888 -53097 -16697
2196 -16697 12153 5301 -13345 -5366 16598 29567 13697 21213 16048 1140 -11990 -9354 8108
2183 8108 10856 27773 46300 35189 39538 34353 51188 37631 30547 27570 14782 39446 87507
2170 87507 70043 38351 6406 -7803 -8272 -6709 -13287 -14797 -11001 -16818 -22462 -23631 -43425 -52242
2156 -52242 -13892 726 5929 1598 -2370 1831 20502 18802 25398 24415 -9136 -37498 -16368
2143 -16368 1241 -5714 -9462 -24709 -32927 -12790 14274 10050 9764 5772 29771 1503 -3837
2130 -3837 23574 23267 288 -721 3662 -11014 -7208 -14065 -8617 -5315 -152 15091 5423 -11192
2116 -11192 -8277 -12005 -37376 -45735 -29789 -26307 -38353 -10313 13682 1618 2618 -8685 -15280
2103 -15280 -31914 -13189 14226 32888 489 -5486 -197 -4996 -21079 -1978 24155 23096 23338
2090 23338 34976 38314 7969 11015 30799 6286 -30014 -41702 -32773 -31471 -18257 -10068 -16100
2077 -16100 -5328 -10676 -13434 991 5327 38807 38810 30841 6712 -41424 -45064 -12057 11742 -6769
2063 -6769 -7092 -724 -13522 -12491 -6851 21231 20064 25248 29583 17632 -1874 206 13982 9448
2049 9448 -19742 -16812 -6640 -22422 -29650 -29635 -29330 -29760 -27530 -34324 -21462 -19220 20464 26767 4346
2034 4346 -3789 -5390 6830 14570 7862 18983 31307 12253 3386 -7327 -7635 -24908 -37949
2021 -37949 -35687 -41177 -35386 -9500 -5125 -21950 -26823 8868 -11500 1797 20997 17704 15756
2008 15756 19826 34152 37977 4370 -17893 -16313 -5820 6820 28476 33425 11362 -2010 -13850
1995 -13850 -21814 -33630 -38234 -20258 21425 -15544 -11945 7390 -8037 -46696 -62011 -52513 -16812
1982 -16812 -21884 -45350 -19289 14324 35714 35877 8108 594 -17276 -25893 -29060 -18740 -7254
1969 -7254 -5470 -8679 -7355 -5925 4459 -4153 -19042 -12965 6610 14615 -7855 -17238 23498 5980
1955 5980 -19451 -9051 -7224 -7482 2408 -3365 -15054 -4310 7943 -2880 -11850 31633 20538
1942 20538 -15807 -47494 -57578 -72060 -70234 -62368 -6707 18707 -4102 -20905 17386 29087
1930 29087 16500 19795 34653 23681 9348 -2070 -21831 -1404 -18056 -9259 1866 20240
1918 20240 32181 45991 58026 61892 55397 36690 50746 65234 45642 33806 7735 -32328
1906 -32328 -36412 -31070 -20816 -4832 13035 18044 271 -42610 -40327 -27839 -28732 -36085 -34790
1893 -34790 -24231 -15431 -17191 -34094 -35045 -46030 -48145 -65449 -51474 -38000 -21858 -1245 21191
1880 21191 27043 41862 44074 77260 69597 60556 62790 53971 50240 30283 22282 -6779 -9187 -9894
1866 -9894 -28723 -50304 -47400 -43837 -21727 -24949 -31743 -25292 -18379 11868 8828 8689 7117 7969
1852 7969 -28110 -37682 -43821 -50495 -44376 -26519 -28027 -19077 -10847 4568 552 5260 -2273 -20924
1838 -20924 -14019 24243 -3958 -19306 -15001 -12350 964 18319 18603 -7277 -26603 -28108 -20770
1825 -20770 -20712 -29336 -21232 -26749 -16017 -51472 -50508 -23345 523 30679 35846 -2319 4888 -11551
1811 -11551 -6152 -11893 -18847 16140 31646 16057 23376 31211 45228 13720 -28709 -44116 -29175
1798 -29175 -14663 -3336 13744 4659 -1277 -16295 -17572 -32329 -32868 -34861 -37034 -25330 8489
1785 8489 6863 -18754 -35635 -4671 27666 28316 39678 41698 14572 4322 3440 13281 19464 22659
1771 22659 -8572 -20107 -4320 -6520 -18327 -11610 -5314 -3668 -5848 -1360 18946 17851 9580
1758 9580 -21913 -36168 -28901 -7081 13970 -2145 4244 17269 40191 30754 26002 30586 32364
1745 32364 6170 -35807 -8797 19974 22433 21430 11153 9625 5142 1830 -24804 -26528 -5446
1732 -5446 10095 6129 9092 -3559 -14323 -4676 -2467 -20388 -27208 -38981 -43411 -47316 -26776
1719 -26776 -6723 5579 16489 18563 11808 -11137 -13624 6990 5296 9115 15939 574 -6422
1706 -6422 -27233 -53168 -18473 -15108 -16696 -10006 -222 -14966 -55685 -76850 -39931 -39890 -28854
1693 -28854 2299 -4032 -49716 -87079 -63819 -11682 -11179 -9089 2326 10127 -7175 -22313 -13870
1680 -13870 -651 -6980 -18924 -24381 -35741 -36049 -13309 -21444 -31305 -22947 13484 34988 37364
1667 37364 33868 22353 -20888 -30787 -20181 -19232 -5250 -7202 -21279 802 18667 17241 14444
1654 14444 10235 425 -5551 -1510 36871 57489 34006 65605 47480 20449 18405 5428 6442
1641 6442 23386 19049 1495 -15923 -14055 10245 33289 29286 20202 8362 2852 14030 14283
1628 14283 11496 7102 5783 119 11169 11262 3567 -7834 465 -1735 10743 16974 33307 51380
1614 51380 57847 50042 37534 21620 -13638 -22206 -31220 -10990 32445 22483 5175 -12040 -5963
1601 -5963 3046 29297 32816 30447 35557 38941 23980 9741 16485 12165 -10986 -31845 -23712 8318
1587 8318 49350 54790 25615 -17127 6307 19178 17353 24231 20290 22414 32424 39974 37763
1574 37763 15621 18732 9179 -18451 -23063 8966 37502 33156 11325 10789 -7839 -17390 -41423
1561 -41423 -56283 -43145 -20620 3554 29525 60517 54553 46843 39128 14249 -19599 -21489 -24896
1548 -24896 -37312 -31261 -1502 21881 37190 20223 -13527 -16534 -22245 -10866 -5001 -28024 -32316
1535 -32316 -19197 -21231 -30408 -30984 -7149 2281 17248 6863 -1999 7029 14765 27016 55272
1522 55272 57087 47508 23252 12823 23356 35260 23121 27631 15086 -12117 -10835 -8860 -22627
1509 -22627 -12910 -14010 5815 33242 37014 9883 22716 22690 16133 44051 73722 50746 16982
1496 16982 33192 14591 4760 -5136 -24834 -51600 -36030 -4167 27631 27734 -3945 -4652 -8149
1483 -8149 1843 9711 10016 12623 22381 31214 19184 -3360 -5054 12439 25453 28241 27575 15303
1469 15303 3441 -16571 -25520 -10317 1835 -4342 -25192 -23639 8571 17404 16011 -6205 -18665
1456 -18665 8361 36975 90497 78026 50101 23449 15623 22578 16963 26622 42603 56446 50148
1443 50148 41793 41527 19157 17730 28260 9427 11850 48353 28826 7502 24168 40895 38662
1430 38662 38018 25333 6008 1598 4327 17869 20054 15080 25201 28411 51396 55461 30832
1417 30832 21585 30958 40214 29647 39781 60651 58066 45765 34624 18914 13502 -15880 -23395
1404 -23395 -20701 -20933 9917 45122 40281 14941 -3066 35804 44144 22371 13031 36097 42619
1391 42619 13716 27064 6194 -16604 -10906 2565 21529 19638 19085 10470 14695 7418 34320
1378 34320 38671 39342 33006 48499 29808 7462 11971 14164 14013 13351 21108 18128 -20282 -19732 7293
1363 7293 32051 30894 47011 57711 43984 32920 30370 4314 -38194 -56090 -23737 -18233 -7871
1350 -7871 9484 25516 31047 41820 27643 2251 -2307 -25855 -41439 -12841 -8295 -17114 -28036
1337 -28036 -31637 -26255 -20354 -13204 -13272 -2960 -10310 -39108 -29184 -3698 6233 -24066 -36654 -45104
1323 -45104 -48511 -31893 -29283 -4290 -19857 -31038 7000 25411 25646 -3727 22176 8693 -5556
1310 -5556 -1031 457 23082 21148 5014 11837 -3417 -3270 15761 29233 8680 9734 4701 -2910
1296 -2910 921 19158 5485 3133 15784 22095 28999 34033 41660 52620 25679 25117 21930 13813
1282 13813 17212 21054 23077 35143 18111 -1428 7064 25603 41349 45996 24803 5056 -17362
1269 -17362 6172 27926 29247 26959 32672 11427 4040 -2718 15061 8571 -2923 7902 -8813
1256 -8813 2911 -2000 -8521 14256 9921 -12682 -11504 8352 6770 11637 6180 -5796 14781
1243 14781 27221 6763 -12612 -14694 12754 24739 31867 27858 32439 27410 23125 15052 -3926
1230 -3926 -18719 -42471 -35141 -30459 -9689 12742 3993 -20006 6692 20570 27736 27530 8203
1217 8203 6878 47203 29553 6499 4101 7787 12298 4020 22404 27394 46164 54662 31149
1204 31149 6680 23954 14635 6870 17603 29077 15014 4414 924 10197 17483 -16711 -39529
1191 -39529 -17110 -123 5356 41744 37202 47461 41602 28615 25699 25281 10951 -1730 -13046
1178 -13046 -15772 21121 21374 7238 -4736 -20493 -10303 -7246 -20767 -1765 -8438 -4780 -5899
1165 -5899 -10489 9196 16056 -14895 -30818 -20665 -7658 16312 32024 34240 23020 23679 24938
1152 24938 25472 42415 9119 -26612 18359 24200 9003 3125 -20133 -26583 -29880 -45071 -41942
1139 -41942 -4507 -23792 -36950 -22497 17757 40758 68955 62523 46623 23238 21084 7496
1127 7496 2754 -3492 9927 17426 29182 31128 40855 49570 44127 37342 35105 30502 40527 75807
1113 75807 67217 40417 30243 42391 42893 31548 29198 37073 28530 31913 35075 19202 25517 5853
1099 5853 12764 12308 24553 4893 -63 30568 19232 -14907 -15789 13800 22289 13303 -16193 -12091
1085 -12091 -7976 13656 19629 11287 8023 2414 6444 22627 55554 60936 53507 47097 40867 29762
1071 29762 19752 27528 14728 7083 29426 32951 25964 34059 37550 24465 35050 63498 46562
1058 46562 14517 15483 35825 40352 9050 -15299 15624 49498 44065 33384 25271 21266 215
1045 215 -11417 15690 28606 -6371 -11931 -169 2810 -14214 -25540 3183 14049 15353 33859
1032 33859 27222 5813 16816 5900 8393 4843 28385 6378 -23556 -32672 -15598 -8167 -5439
1019 -5439 -11325 -37399 -24133 -24884 -8608 17172 36545 33646 21511 30214 19818 32337 21262
1006 21262 8825 -1237 -7151 1783 35793 36495 20388 22158 3142 -24052 -12387 -2458 -20295
993 -20295 -28156 -37859 -38662 -23032 9779 33912 50468 54552 40692 -1467 -23201 -19702 -15344
980 -15344 8737 37974 57002 63285 54559 14912 -37928 -37412 -29776 -20630 -12693 -691 32077
967 32077 6640 20573 67731 75701 35734 15585 15355 -9520 -53375 -75956 -68890 -57594 -19874
954 -19874 3297 -7256 -6574 -13631 -35590 -39334 -59157 -51284 -26102 -5176 21221 15949 19313
941 19313 40934 54113 30979 24644 15878 622 22928 38879 31939 50205 44569 20950 -9204
928 -9204 -10293 19838 33305 32526 31619 45425 18552 8208 827 -22467 -7894 -1630 -1613 579
914 579 -12342 -22378 -24485 -12732 -20976 -10751 -15341 -15911 -19166 -8759 -7314 -10955 -20958 -6877
900 -6877 -4421 4053 -386 3841 -27783 -6734 3049 6258 20799 26742 35572 42632 7200 -28183
886 -28183 -40411 -41280 -26235 -18964 -18358 -38945 -45778 -45590 -18033 8387 -1705 -8792 3082 35481
872 35481 39738 18157 19156 2850 12898 32437 47483 48908 59102 54507 50261 35699 32782
859 32782 26298 24618 23085 -2301 -41744 -41261 -19200 9939 32979 13546 -23680 -29867 -24154
846 -24154 12229 31915 61292 61444 34170 29469 25920 21339 3235 -3373 9450 6566 4484 9615
832 9615 26657 43545 39371 43235 49461 34025 3007 -15167 -11069 -9425 -9455 -10614 -4679 -5126 19628
817 19628 11220 27885 48198 52638 58471 36237 22567 33468 42799 72177 72237 44400 2296
804 2296 -1362 627 -12014 -21022 -21381 -25185 -19040 -34820 -23464 -11203 14889 20213 35016 16290
790 16290 42911 50955 30802 23361 9444 28279 13419 -5378 10050 6346 22275 6954 25125
777 25125 44620 53803 14903 -12516 -27204 -7327 2349 4702 21601 16932 -10770 -18023 -15639
764 -15639 -44122 -13889 45880 41513 15424 15280 24126 30721 15008 5857 -1542 10406 30133
751 30133 31790 26659 14627 -7353 -15458 -16000 23389 26931 36956 37566 39504 44704 52646 34989
737 34989 33321 4287 -21798 -32051 -20485 -1416 22827 26090 -6948 -12065 11234 33889 52587
724 52587 20952 2581 16584 14916 14385 6737 -12900 -6739 -5802 8492 17807 -6977 -12014 -14080
710 -14080 11803 27267 5574 -4513 1584 3713 9557 55505 68361 41374 26552 47785 42842
697 42842 34998 42735 35537 32133 11510 7937 32113 30884 39067 32341 30890 45942 50630 36975
683 36975 21581 7546 5652 12199 -2114 11579 15444 1683 16026 30027 -330 -22518 -34968
670 -34968 -10956 -16172 -18295 16811 26511 9354 180 7320 9675 24827 27839 43408 60732
657 60732 61121 49476 24230 41494 57498 45419 38354 64766 63474 44921 60240 72825 46361
644 46361 20572 16389 5985 40600 77130 84637 71638 52337 58075 67563 58385 62501 57732
631 57732 26486 17883 12906 13033 27377 43354 46639 24401 -1415 -19437 -19013 -4772 9410
618 9410 15728 33533 35945 25228 27983 31326 17006 -6731 -16490 -20252 -12187 -14566 -14517 3244
604 3244 22705 32624 -10731 14719 23336 -6586 -2510 29710 11010 17054 21813 11149 9955
591 9955 17196 17122 -14028 -31111 -33290 -23192 -53027 -61213 -40620 -18861 -264 -2351 -14785 -15874
577 -15874 -7922 -13561 2560 1785 22621 41856 68274 65782 50668 27190 27935 44948 55434
564 55434 25615 -18802 -17947 1020 -1748 -13185 -13383 -3815 1791 3766 -14451 -9330 -716 -2719
550 -2719 3538 369 -32230 -19553 24785 35418 22406 36325 28044 3328 -7067 -25860 -13821
537 -13821 8389 15543 24545 22917 14923 3563 11252 15735 19379 12214 20731 23850 -12491 -26248
523 -26248 -13271 -24886 12026 11038 31504 49347 39561 1466 -12265 -19140 -33444 -49747 -57389
510 -57389 -27833 -8914 -4329 -7588 -15749 -19323 -12440 -13213 -4216 -18711 -1886 26390 32120 46569
496 46569 33571 30751 13605 10209 34612 47481 45473 26540 16920 27426 27857 25123 38344
483 38344 42880 21835 17385 28356 44795 27079 35113 33424 25165 25145 33053 57242 69424 64366
469 64366 63387 68051 34848 28591 17932 14412 654 -1018 27632 28336 31502 32345 39585 32179 20140
454 20140 17591 29244 28155 23069 27248 35304 33620 24305 17319 12001 25674 20018 6153 -30418
440 -30418 -28784 -13003 -138 9196 2057 -16871 -34949 -4802 13347 14619 30498 43340 16362
427 16362 3690 27365 45399 32942 41470 46325 46544 60027 52578 53479 43008 13858 5608 -3043
413 -3043 845 7985 14187 25319 45286 19014 -13797 -26803 -4784 30887 18230 25111 24105
400 24105 4384 -12348 14741 45401 53600 20187 -14467 -3893 11607 15594 20034 35387 43399
387 43399 40082 21753 10769 14745 20552 49864 45845 19932 -4184 2347 17888 688 -27607
374 -27607 -18867 -11717 -31563 -21866 -42794 -28802 18179 24647 17775 20047 5137 19797 -10171
361 -10171 -31570 -28575 -13873 4764 12231 27490 40013 43699 22054 23155 -1779 -4264 21043
348 21043 28069 15956 862 -4553 -23032 -6517 7696 22479 22910 16214 4832 11548 26418
335 26418 17342 -8927 -19431 -26697 -45641 -29923 -21894 -14395 -11032 -13934 15407 22376 30655 32510
321 32510 10056 -6806 -4406 -4137 -22349 -7818 10896 14502 21005 24007 17366 7539 8224 17727
307 17727 12264 14446 24733 53541 57850 50436 45610 35336 29818 21186 22682 19155 6738 -6779
293 -6779 8322 30831 18822 9029 8744 -1525 -7309 1653 13303 36627 32019 36423 32386 20328
279 20328 1247 5652 12483 5911 14506 25827 36781 26321 16735 37355 56345 74729 50291
266 50291 37925 30470 57133 52681 44886 15632 -15193 -12126 -10287 -8139 -37450 -39193 -17636
253 -17636 -23465 306 11849 33297 31157 24399 16474 -3701 2054 7012 24565 29472 32406 20069
239 20069 22631 28888 26682 18789 30464 28223 33296 30787 27824 49732 47481 45965 35885 39561
225 39561 48022 30325 12738 -1427 -7913 18802 5214 -13416 -12566 -23577 -8760 9459 11203
212 11203 12408 42990 56867 23530 31892 21194 4287 2076 -1424 -18207 -25443 -26124 -22518 -10590
198 -10590 6146 -9163 8448 25572 30158 27751 28742 16120 -1490 -634 7487 10172 21217 5394
184 5394 -2451 -12905 -9046 347 14961 34639 46680 46837 32487 44995 53973 54439 24852 24710
170 24710 39432 48367 35589 26002 19033 3486 -26864 -26729 -10640 -21928 -16487 14234 31584
157 31584 36532 20677 14371 18926 39351 50899 38112 40283 23490 502 14827 8738 -1239
144 -1239 -2190 -3056 10945 9629 4416 4113 9530 20936 21330 13412 23053 14218 7867 -22300 -23915
129 -23915 1116 17521 18843 3759 2057 18846 31135 22784 32863 28118 14550 20555 27872
116 27872 34541 40908 46333 48431 37456 29522 32617 29656 18368 19373 15985 1094 -2650 -810
102 -810 -3463 -1051 13549 5697 4378 20322 22109 23615 26938 10978 4001 -2732 7022 -7073
88 -7073 -14149 2827 14243 7655 -1306 -531 5762 6222 -2909 -104 -9825 10459 4271 -19567 -17885
73 -17885 -26301 -30110 -14319 -11603 8793 16897 27550 27696 23980 20684 8218 2411 8201 -4818
59 -4818 -15967 -17332 6587 5719 -702 5178 18969 28220 28853 11413 5154 -5023 612 9520 24211
44 24211 9592 -6319 -2971 -4737 -10840 -3417 4607 -18816 -19796 -17613 -26342 -7312 9496 5213
30 5213 3896 5589 942 25 563 18645 19824 2780 12787 26248 22147 26425 21807 6536 16307
15 16307 20409 11830 10162 20318 44654 47016 49258 44171 42498 45847 44054 42259 36742 32299 27986
0 27986
$$ Imaginary data points
##PAGE= N=2
##DATA TABLE= (X++(I..I)), XYDATA
32767 120559 132809 146678 158861 152270 152380 163716 159187 170329 171780 161230 157744 160644 156270
32754 156270 157969 150449 133225 148615 143928 139819 140712 119514 99014 116433 127122 149859 150614
32741 150614 166306 162188 152153 185075 196329 173817 170871 166561 177919 192397 175649 160155
$$ [...]
##END NTUPLES=NMR SPECTRUM
##END=
