##TITLE=Analysis number 323141
Compound Code cc 63601
Book Reference 470/111
Project Code adrs
Chemist Name mikem
##JCAMPDX= 6.0         $$ Bruker NMR JCAMP-DX V2.0
##DATA TYPE= NMR SPECTRUM
##DATA CLASS= NTUPLES
##ORIGIN= Bruker BioSpin GmbH
##OWNER= nmr
$$ XWIN-NMR		Version 3.5
$$ Tue Oct 17 16:50:07 2006 GMT Daylight Time (UT+1h)  MAYBRIDGE\nmr@NMR_250MHZ
##.OBSERVE FREQUENCY= 250.131544655141
##.OBSERVE NUCLEUS= ^1H
##.ACQUISITION MODE= SIMULTANEOUS (DQD)
##.ACQUISITION SCHEME= undefined
##.AVERAGES= 16
##.DIGITISER RES= 18
##SPECTROMETER/DATA SYSTEM= dpx250
##.PULSE SEQUENCE= zg30
##.SOLVENT NAME= DMSO
##.SHIFT REFERENCE= (INTERNAL, DMSO, 0, 16.522)
##AUDIT TRAIL= $$ (NUMBER, WHEN, WHO, WHERE, WHAT)
$$ ##TITLE= Audit trail, XWIN-NMR		Version 3.5
$$ ##JCAMPDX= 5.01
$$ ##ORIGIN= Bruker BioSpin GmbH
$$ ##OWNER= nmr
$$ C:\u/data/dgb/nmr/ADRS/730/pdata/1/auditp.txt
$$ ##AUDIT TRAIL=  $$ (NUMBER, WHEN, WHO, WHERE, WHAT)
(   1,<2006-10-17 16:49:47.57 +100>,<MAYBRIDGE\nmr>,<NMR_250MHZ>,
      <created by zg, POWCHK disabled, PULCHK disabled
       configuration hash MD5:
       49 4B E0 1D 92 C2 6B 37 9F E6 65 BC 52 41 86 1D
       data hash MD5: 64K
       53 E6 72 54 6D 03 30 C6 52 BE 5E 92 22 28 9C 48>)
(   2,<2006-10-17 16:49:59.22 +100>,<MAYBRIDGE\nmr>,<NMR_250MHZ>,
      <Start of raw data processing
       ef LB = 0.3 FT_mod = 6 PKNL = 1 SI = 32K 
       data hash MD5: 32K
       B6 BE 81 76 38 08 A8 32 53 7A 1B 69 4D 87 00 93>)
(   3,<2006-10-17 16:50:01.00 +100>,<MAYBRIDGE\nmr>,<NMR_250MHZ>,
      <apk 
       data hash MD5: 32K
       1D CD F9 0D 32 F0 68 0B 9A 86 C1 25 3C 8D 1A FA>)
(   4,<2006-10-17 16:50:01.86 +100>,<MAYBRIDGE\nmr>,<NMR_250MHZ>,
      <abs ABSG = 5 
       data hash MD5: 32K
       F7 83 A5 7F BC F6 7C CA E7 E7 4A C7 08 BB C6 0F>)
$$ ##END=
$$ 
$$ hash MD5
$$ 8A 13 21 26 84 A5 D7 64 8F 2B 4D 7A 30 2F 81 67
##$RELAX= 
##$RELAX= 
##$RELAX= 
##$RELAX= 
##$RELAX= 
##$RELAX= 
##$RELAX= 
$$ Bruker specific parameters
$$ --------------------------
##$DU= <C:\u>
##$EXPNO= 730
##$NAME= <ADRS>
##$PROCNO= 1
##$TYPE= <nmr>
##$USER= <dgb>
##$AMP= (0..31)
100 100 100 100 100 100 100 100 100 100 100 100 100 100 100 100 100 100 
100 100 100 100 100 100 100 100 100 100 100 100 100 100 
##$AQSEQ= 0
##$AQ_mod= 3
##$AUNM= <au_zg>
##$AUTOPOS= <8 >
##$BF1= 250.13
##$BF2= 250.13
##$BF3= 250.13
##$BF4= 250.13
##$BF5= 500.13
##$BF6= 500.13
##$BF7= 500.13
##$BF8= 500.13
##$BYTORDA= 1
##$CFDGTYP= 0
##$CFRGTYP= 5
##$CHEMSTR= <none>
##$CNST= (0..31)
1 1 145 1 1 1 1 1 1 1 1 1 1 1 1 1 1 1 1 1 1 1 1 1 1 1 1 1 1 1 1 1 
##$CPDPRG= <>
##$CPDPRG1= <>
##$CPDPRG2= <>
##$CPDPRG3= <>
##$CPDPRG4= <mlev>
##$CPDPRG5= <mlev>
##$CPDPRG6= <mlev>
##$CPDPRG7= <mlev>
##$CPDPRG8= <mlev>
##$CPDPRGB= <>
##$CPDPRGT= <>
##$D= (0..31)
0 1 0 0 0 0 0 0 0 0.06 0 0 0 0 0 0 0.0002 0 0 0 0 0 0 0 0 0 0 0 0 0 0 
0 
##$DATE= 1161100186
##$DBL= (0..7)
120 120 120 120 120 120 120 120 
##$DBP= (0..7)
150 150 150 150 150 150 150 150 
##$DBP07= 0
##$DBPNAM0= <>
##$DBPNAM1= <>
$$ [...]
##$SUBNAM7= <"">
##$SUBNAM8= <"">
##$SUBNAM9= <"">
##$SW= 20.6930455092707
##$SWIBOX= (0..15)
0 0 3 0 0 0 0 0 0 0 0 0 0 0 0 0 
##$SW_h= 5175.983436853
##$TD= 65536
##$TD0= 1
##$TE= 683.16
##$TE2= 300
##$TE3= 300
##$TEG= 300
##$TL= (0..7)
0 120 120 120 120 120 120 120 
##$TP= (0..7)
150 150 150 150 150 150 150 150 
##$TP07= 0
##$TPNAME0= <>
##$TPNAME1= <>
##$TPNAME2= <>
##$TPNAME3= <>
##$TPNAME4= <>
##$TPNAME5= <>
##$TPNAME6= <>
##$TPNAME7= <>
##$TPOAL= (0..7)
0.5 0.5 0.5 0.5 0.5 0.5 0.5 0.5 
##$TPOFFS= (0..7)
0 0 0 0 0 0 0 0 
##$TUNHIN= 0
##$TUNHOUT= 0
##$TUNXOUT= 0
##$USERA1= <user>
##$USERA2= <user>
##$USERA3= <user>
##$USERA4= <user>
##$USERA5= <user>
##$V9= 5
##$VALIST= <valist>
##$VCLIST= <CCCCCCCCCCCCCCC>
##$VD= 0
##$VDLIST= <DDDDDDDDDDDDDDD>
##$VPLIST= <PPPPPPPPPPPPPPP>
##$VTLIST= <TTTTTTTTTTTTTTT>
##$WBST= 1024
##$WBSW= 4
##$XGAIN= (0..3)
0 0 0 0 
##$XL= 0
##$YL= 0
##$YMAX_a= 659325
##$YMIN_a= -409416
##$ZGOPTNS= <>
##$ZL1= 120
##$ZL2= 120
##$ZL3= 120
##$ZL4= 120
##$ABSF1= 16.522
##$ABSF2= -4.171173
##$ABSG= 5
##$ABSL= 3
##$ALPHA= 0
##$AQORDER= 0
##$ASSFAC= 0
##$ASSFACI= 0
##$ASSFACX= 0
##$ASSWID= 0
##$AUNMP= <proc_1d>
##$AZFE= 0.1
##$AZFW= 0.1
##$BCFW= 0
##$BC_mod= 0
##$BYTORDP= 0
##$COROFFS= 0
##$CY= 12.5
##$DATMOD= 1
##$DC= 0
##$DFILT= <>
##$DTYPP= 0
##$F1P= 14.0000005364418
##$F2P= -0.99999901652339
##$FCOR= 0.5
##$FTSIZE= 32768
##$FT_mod= 6
##$GAMMA= 0
##$GB= 0
##$INTBC= 1
##$INTSCL= 1
##$ISEN= 128
##$LB= 0.3
##$LEV0= 0
##$LPBIN= 0
##$MAXI= 10000
##$MC2= 0
##$MEAN= 0
##$ME_mod= 0
##$MI= 0
##$NCOEF= 0
##$NC_proc= -4
##$NLEV= 6
##$NOISF1= 0
##$NOISF2= 0
##$NSP= 0
##$NTH_PI= 0
##$NZP= 0
##$OFFSET= 16.522
##$PC= 1
##$PHC0= -57.74777
##$PHC1= 1.587063
##$PH_mod= 1
##$PKNL= yes
##$PPARMOD= 0
##$PSCAL= 4
##$PSIGN= 0
##$REVERSE= no
##$SF= 250.13
##$SI= 32768
##$SIGF1= 0
##$SIGF2= 0
##$SINO= 400
##$SIOLD= 32768
##$SREGLST= <1H.DMSO>
##$SSB= 0
##$STSI= 32768
##$STSR= 0
##$SW_p= 5175.98343685301
##$SYMM= 0
##$S_DEV= 0
##$TDeff= 65536
##$TDoff= 0
##$TI= <Analysis number 999999
Compound Code 99
Book Reference 9
Project Code 9>
##$TILT= no
##$TM1= 0
##$TM2= 0
##$TOPLEV= 0
##$USERP1= <user>
##$USERP2= <user>
##$USERP3= <user>
##$USERP4= <user>
##$USERP5= <user>
##$WDW= 1
##$XDIM= 32768
##$YMAX_p= 347736549
##$YMIN_p= -140068
$$ End of Bruker specific parameters
$$ ---------------------------------
##NTUPLES= NMR SPECTRUM
##VAR_NAME=  FREQUENCY,     SPECTRUM/REAL,   SPECTRUM/IMAG
##SYMBOL=    X,             R,               I
##VAR_TYPE=  INDEPENDENT,   DEPENDENT,       DEPENDENT
##VAR_FORM=  AFFN,          ASDF,            ASDF
##VAR_DIM=   32768,         32768,           32768
##UNITS=     HZ,            ARBITRARY UNITS, ARBITRARY UNITS
##FACTOR=    0.157963299565203, 1,           1
##FIRST=     4132.6476996994, 0,             0
##LAST=      -1043.33573715361, 0,           0
##MIN=       -1043.33573715361, -140068,     0
##MAX=       4132.6476996994, 347736549,     0
$$ Real data points
##PAGE= N=1
##DATA TABLE= (X++(R..R)), XYDATA
$$ [...]
20172A1991J4684Q721N419j07M08m13K459O68O850j3211j0271L257P968O989Q872
20157E4284n569P222j902k3791J0434L1832j652P182m0985j7430J3259J2186j7174
20144B7896j898K6657J2060q646r313j848M215q290j9042j2945Q405N585K0788
20131D3624J8974j5489J5141J820k1900n834K0423j149j7232J1536j0548L597
20119D2963J3674k1586j6590r439r999K9669L5179k235j1795l777J146q955p730
20106C0525R97j1443K126j5585j6134r541J5543J8498Q481O775l578L367k3166
20093F865j6072Q687L3665J7007j0439j6309N016J3362j0733J1940N460J7082
20081F5531J1141n930k0920m3196l2502j13K9263J6693k386J076K738n731O307
$$ y = [11991, 26675, 35396, 40815, 40708, 41116, 40703, 43162, 43830, 50680, 37469, 27198, 30455, 38423, 45412, 54284, 48715, 55937, 54035, 30244, 40678, 72510, 70858, 78040, 37055, 19625, 32884, 45070, 27896, 25998, 52655, 64715, 56069, 46756, 44908, 49123, 40833, 21791, 8846, 17251, 22836, 43624, 62598, 47109, 62250, 64070, 42170, 36336, 56759, 55610, 38378, 49914, 39366, 42963, 56637, 35051, 18461, 9022, -977, 28692, 63871, 61636, 49841, 46064, 47210, 38255, 30525, 31522, 20079, 22205, 6620, -9514, -19055, -3512, 14986, 23467, 30242, 26664, 30031, 6865, -9207, -520, 33145, 50152, 39713, 23404, 28420, 41782, 31049, 42989, 48449, 65531, 76672, 70742, 49822, 6626, -25876, -25989, 3274, 19967, 17581, 18657, 21395, 15664, 21971]
20068B1971J5826j2336P544L0291k2563n237m949m480m8342j1256l889L0403K6750
20055A9733O612J1337j5319K2448j1338J832j1082J4247N46o256L2880N029n37
20042G0132L2330K5399j4765j6O937K6859l4712m482J3411M115K554R232M6733
20029A83727j207m684K770j574p401j7578l0456Q126J5662O10k603M227j8801
20016A30818k0172j0973K9665q952l1430l8235p507L559k6150K3554K3321q525
20004E8973J6773L9108l735j3167J675m390m239K1265j5833k262q797k354k5113
19991E7904k2017J1722l717K1161n672O762O72j7133j3441O640J0696J6211Q601
19978G8389j0519j7209K0354J508M025j458q598k5310j0188L1002K412o760r939
$$ y = [21971, 37797, 25461, 33005, 63296, 40733, 35496, 30547, 26067, -22275, -33531, -37420, -7017, 19733, 26345, 37682, 22363, 44811, 33473, 35305, 24223, 38470, 39016, 32760, 65640, 70669, 70132, 102462, 127861, 113096, 113080, 120017, 146876, 112164, 107682, 121093, 125208, 127762, 136994, 183727, 182520, 177836, 180606, 179032, 171631, 154053, 123597, 131723, 147385, 147995, 145392, 149619, 130818, 110646, 99673, 129338, 120386, 88956, 50721, 43214, 46773, 20623, 44177, 67498, 58973, 75746, 114854, 111119, 97952, 99627, 95237, 90998, 112263, 96430, 94168, 85371, 83017, 57904, 35887, 47609, 43892, 65053, 59381, 66143, 66815, 49682, 36241, 42881, 53577, 69788, 78389, 67870, 50661, 71015, 72523, 76548, 75090, 66492, 41182, 30994, 61996, 64408, 57648, 47709]
19965D7709l132o820J644O104o973r69J8351J9920l125J3045m44o611N270p130
19951G6839k4880j6668K079L7522j9472l9577P384o141L280L7927J4500j614k3443
19938D7736J11m95j1692k825L9135J4355K802q130j5441p404O072l861k5053J2003
19924D7313R080K867p189N84K0827J3222j1739p519j3362K1790K8918P86K940
19911A08518K379l102O530k552k470j1980J4961k508k3866J5203K5254M080p520
19898A22927r50k5453l81J6505K6882K2777K3614L7958N1375M3760L4736K9823
19886C83573K6356M6029Q486K7923K5485J6824J9712K5685J2093K7587J3504o55
19874F32602J4596J1649p139N263l2683n1305j1433q705l6141k6366j2229q106
$$ y = [47709, 44577, 37757, 39401, 45505, 38532, 37563, 55914, 75834, 72709, 85754, 85310, 78699, 83969, 76839, 51959, 35291, 37370, 74892, 55420, 15843, 23227, 17086, 20366, 58293, 72793, 71179, 47736, 47847, 47352, 35660, 32835, 71970, 86325, 89127, 80997, 65556, 58152, 64224, 60363, 35310, 47313, 56393, 59260, 52071, 52655, 73482, 86704, 74965, 67446, 54084, 75874, 104792, 105578, 108518, 110897, 107795, 114325, 111773, 109303, 97323, 112284, 109776, 85910, 101113, 126367, 130447, 122927, 121977, 96524, 96143, 112648, 139530, 162307, 185921, 223879, 275254, 319014, 353750, 383573, 409929, 455958, 464444, 492367, 517852, 534676, 554388, 580073, 592166, 619753, 633257, 632602, 647198, 658847, 651708, 656971, 624288, 572983, 561550, 552845, 516704, 490338, 478109, 470003]
19862D70003k6632n2583n2449l5664o962j5309P263k5562l4013k3407j5706k7186
19850A61793j0718k6282p984K2242r689K493k910O807r86l774j0110k1105j6943
19837H2834J2334J4179k430o351M453K8621J287m6064O84L5618K999n661m107
19824A18396l3571J1033j5862j4388J1696l0320m197J2536N239j056K6352L9540
19812A25398L141R250n229j4308k8378R516J6583m3461j925J219K2192L9589K299
19799A35886l1382k1480j2120k5707j3941l897J332K4328K8493J535j2345n605
19787F5097L393j0029J2934K3147J2043K6686j859L350M652j2225k9409k0975
19775G6805R056J5456k1220k5981j4791K0539L1830m92j3330K104K2811J3881
$$ y = [470003, 443371, 390788, 338339, 302675, 295713, 280404, 287667, 262105, 228092, 204685, 188979, 161793, 151075, 124793, 116809, 139051, 129362, 131855, 128945, 135752, 134766, 130992, 120882, 99777, 82834, 95168, 109347, 106917, 100566, 105019, 133640, 134927, 88863, 89547, 125165, 128164, 122503, 118396, 84825, 95858, 79996, 65608, 77304, 46984, 42787, 55323, 60562, 59506, 85858, 125398, 128539, 137789, 132560, 118252, 89874, 99390, 115973, 72512, 70587, 71806, 93998, 133587, 135886, 104504, 83024, 70904, 45197, 31256, 27359, 28691, 53019, 81512, 83047, 70702, 65097, 68490, 58461, 71395, 94542, 106585, 133271, 131412, 134762, 139414, 127189, 97780, 76805, 85861, 101317, 80097, 54116, 39325, 59864, 91694, 91202, 77872, 79976, 102787, 116668]
19763A16668k2915J6177m310j4539o518J4761K838p532k2733q829j2162J2079
19751F2985K5321J5581p178j5257k5984j0493p045M3250M5999n475J7267K9872
19739A68843n136o924j1873k9131j7502J8765J1953J0478J8073j894l2313q071
19727A15268K3657Q868k277j6504l218K0508J34N169L8168Q192L0037K332J829
19714B32163J0120L0084L8007L2941N147J979K9276K5172Q328p828K0660J2003
19702D38052n268k9997O140J8030J422k2954M587L454l1633j0218J7171k3843
19690C64943k0449k9966R188J2927k4361p610K837l0830L269O14j9417j983L5905
19677B95067r862k0776J7858L170r316J6649K474O20K3599L198K333R304M723
$$ y = [116668, 93753, 109930, 105620, 91081, 84563, 99324, 102162, 94630, 71897, 63068, 50906, 62985, 88306, 103887, 96709, 81452, 55468, 44975, 37930, 81180, 127179, 121704, 138971, 168843, 163707, 156783, 144910, 115779, 98277, 117042, 128995, 139473, 157546, 155652, 123339, 115268, 138925, 147793, 145516, 129012, 125794, 146302, 146436, 151605, 189773, 197965, 228002, 230334, 232163, 242283, 272367, 310374, 343315, 348462, 350441, 379717, 404889, 413217, 405389, 426049, 438052, 432784, 402787, 408927, 426957, 428379, 405425, 410012, 413466, 381833, 371615, 388786, 364943, 344494, 314528, 323716, 336643, 312282, 304672, 307509, 276679, 279948, 280562, 261145, 259162, 295067, 285205, 264429, 282287, 285457, 276141, 292790, 295264, 295884, 319483, 322681, 325014, 334318, 339041]
19664C39041j4368l855m485K8335L3242R904J2241J9061J4601j2602M3930L5525
19652E00570L2517M926j1789o893j6326q654j7669k4604n725Q855L483r522l7559
19639D11610j8487j9222q160J157j9104m650r953o518J7740j5688k1193j1185
19627B96347j9642l3777J1538J9302L2913j8116o011q44l2K0994j093J3424j9282
19614B95721p630m729J2053J8522k5j7801k2769J2094K606q06k3747k4209l024
19601B36256M015m2163p580K5636o450N608K4451k1735m812L406k4761j0384j134
19588A80353J7733L2175k2318k9782j0619Q014j9942k021J7606J0613o228N987
19576A81571j0694j5216m7174K1590L2582K9187J8916q763k8411P627M0302j1067
$$ y = [339041, 324673, 320818, 316333, 344668, 377910, 387814, 400055, 419116, 433717, 421115, 465045, 500570, 533087, 538013, 526224, 519331, 503005, 494351, 476682, 452078, 446353, 455208, 458691, 449169, 411610, 393123, 373901, 365741, 366898, 347794, 343144, 333191, 326673, 344413, 328725, 307532, 296347, 276705, 242928, 254466, 273768, 306681, 288565, 282554, 281710, 281678, 302672, 301579, 315003, 295721, 288091, 283362, 295415, 313937, 313912, 296111, 273342, 285436, 288042, 287236, 263489, 239280, 236256, 240271, 198108, 190528, 216164, 209714, 215322, 239773, 218038, 213226, 216632, 191871, 181487, 180353, 198086, 230261, 207943, 178161, 167542, 175556, 155614, 153593, 171199, 181812, 175584, 181571, 170877, 155661, 108487, 130077, 162659, 191846, 210762, 201999, 173588, 181215, 221517, 210450]
19564B10450J217J1201P957N642l916o658K0711k890o595j4847Q338J0078J0343
19551B51031K2218J9377N561k651k2467j1321J8058j5736J0694L2083j3064n0548
19539B43235J1658K1615J4121j121R499j077k1569j7155J1495r956l1079L3231
19527B62897K8593l1117l6237P053m853j0712K1163P763L5806M2906m015k2307
19515B96940o732K2145J9231J9307r054k2396J9517L9807K4963Q527l421r146
19503C99688K1883M0457L7184j2957j2943j5299K7780K645o266K6188N0336K1330
19491E80026k869j4753k3330r49k2191K2315J0305R448l2126j4433l0429k0699
19479D60315J6870J3578p933j4953n506l1006m972K1015l667j199J798m346J8746
$$ y = [210450, 211667, 222868, 230825, 236467, 232551, 225893, 246604, 243714, 237119, 222272, 230610, 240688, 251031, 273249, 292626, 298187, 295536, 273069, 261748, 279806, 264070, 274764, 306847, 293783, 243235, 254893, 276508, 290629, 289508, 299007, 297930, 276361, 259206, 270701, 260745, 229666, 262897, 291490, 260373, 224136, 231189, 226336, 215624, 236787, 244550, 280356, 323262, 319247, 296940, 290208, 312353, 331584, 350891, 341837, 319441, 338958, 378765, 403728, 412255, 408834, 399688, 421571, 462028, 499212, 486255, 473312, 458013, 485793, 488438, 482172, 508360, 558696, 580026, 577157, 562404, 539074, 538125, 515934, 538249, 548554, 558002, 525876, 511443, 481014, 460315, 477185, 490763, 482830, 467877, 462371, 431365, 426393, 447408, 443741, 442542, 444340, 439994, 458740]
19466D58740J3111J730P442J2747K128J0671L766l077J2677J5682K631j455m842
19453E31951O693K663J4985K4713J2049K6159K1220k360k263L1375J1992K5010
19441G04187L626O808J6598K4407L2109j3268k1214p580K1221M8862P644K3921
19429H47321K6945K2793J2908M418K2992K3112K1034K1854L83K7489O1532P8281
19417A171062O7244N0604N1645L5351M7060K1728O0782N3134M6408J38318J24096
19406A867432R5986J07810J53481J43385J96084K09577K19373K71941L02885L48329
19396C916283L83859M50948N08709N97322P33128R34876J151628J449388J852119
19387A1978260K383024K952292L595712M368176N137711N693165N856040N870982
$$ y = [458740, 471851, 473581, 481023, 493770, 495898, 506569, 510335, 507258, 519935, 535617, 538248, 536793, 531951, 538644, 541307, 556292, 581005, 593054, 619213, 640433, 638073, 635810, 667185, 679177, 704187, 707813, 714621, 731219, 755626, 787735, 774467, 753253, 745673, 766894, 815756, 823400, 847321, 874266, 897059, 909967, 914385, 937377, 960489, 981523, 1003377, 1003760, 1031249, 1092781, 1171062, 1238306, 1288910, 1340555, 1375906, 1422966, 1444694, 1505476, 1558610, 1605018, 1743336, 1867432, 1963418, 2071228, 2224709, 2368094, 2564178, 2773755, 2993128, 3265069, 3567954, 3916283, 4300142, 4751090, 5259799, 5857121, 6590249, 7525125, 8676753, 10126141, 11978260, 14361284, 17313576, 20909288, 25277464, 30415175, 36108340, 41964380, 47835362]
19379D7835362N995063O068125N631518M620896M035453M691432N471747N429303
19371H9778899N577546O025730N917103N614494N278661L902954O27276k708422
19363A20014241l392290l128443m420883n703911n110230m005652l420752k983962
19355H7848118k858943l974340n952322o561048o094071o491504p306086p009317
19347D1600487n897330m866406m138841l545125k908580k327306j903101j639512
19339A4374286j415148j217389j032287r11736q29880p29369o50578n89506n11852
19330F486541m76665m12636l48519k98626k86338k36061k26747k15770k29650
19321C755529j85124j39357j39583j39521j28361j12364j01504q6876j13755r5776
$$ y = [47835362, 53830425, 59898550, 65530068, 70150964, 74186417, 78877849, 84349596, 89778899, 95356445, 101382175, 107299278, 112913772, 118192433, 122095387, 122722663, 120014241, 116621951, 113493508, 109072625, 103368714, 98258484, 94252832, 90832080, 87848118, 84989175, 81014835, 75062513, 68501465, 62407394, 55915890, 48609804, 41600487, 35703157, 30836751, 26697910, 23152785, 20244205, 17916899, 16013798, 14374286, 12959138, 11741749, 10709462, 9797726, 8967846, 8238477, 7587899, 6998393, 6486541, 6009876, 5597240, 5248721, 4950095, 4663757, 4427696, 4200949, 3985179, 3755529, 3570405, 3431048, 3291465, 3151944, 3023583, 2911219, 2809715, 2722839, 2609084, 2513308]
19311B513308o0511p5708q4294o7185o6917j4839j3797l5054n7720p2853l8069
19300A926361l6580q0936o9063m5535k0409m7577n1482j5773J5019l7971n4998
19289A481056m2043l9841m5982l2632j6614j951m4653m3683k0769o292m8791m6667
19277A091138k8393m691k371n009j1271o358k5413k5214k139l747k3563q586J1001
19264I55384R149j473J3605j477j4232k5931l1426k7564L2609J1389l874o11K418
19251I17966k7334k2613L839J139K3525J6214K290k7537l060j1234O417L3554
19239I13166J5107K6474L8477J0219p121K9119O2652N2652L6843J9731J3822M5402
19227A256543P0734O4532O0525P7791N7743R0099R9059R1006J27441J08860J13134
$$ y = [2513308, 2452797, 2377089, 2292795, 2225610, 2158693, 2143854, 2130057, 2095003, 2037283, 1964430, 1926361, 1889781, 1808845, 1739782, 1694247, 1673838, 1626261, 1574779, 1559006, 1574025, 1536054, 1481056, 1439013, 1399172, 1353190, 1320558, 1303944, 1301993, 1257340, 1213657, 1192888, 1186596, 1137805, 1091138, 1062745, 1058054, 1055683, 1050674, 1039403, 1033045, 1007632, 982418, 980279, 976532, 952969, 944383, 955384, 964533, 963060, 976665, 975188, 960956, 935025, 903599, 876035, 908644, 920033, 916159, 915548, 917966, 890632, 868019, 871858, 872997, 896522, 912736, 915026, 887489, 884429, 873195, 879612, 913166, 928273, 954747, 993224, 1003443, 996322, 1025441, 1088093, 1140745, 1177588, 1197319, 1211141, 1256543, 1327277, 1391809, 1452334, 1530125, 1587868, 1677967, 1777026, 1868032, 1995473, 2104333, 2217467]
19216B217467J56562J83418J97297K09492K31555K77362L38699M37098N38955
19207D787905O41876Q25275J160992J525113K008324K634828L206846L740967
19199B0532126M045798M061396L891465L660704L546816L395928K848697K187545
19191D8170475K306231K824125L035746K916696K543981J789429L34334j726710
19183F2194307k813779l017993l283308k989937k269995j809531j654729j738823
19175D2616212j948476k696555m002315m628501m181721l507649k806420k022378
19167A6822197j399413j006290p23842o18996n26973l25618j49254l2899J34643
19158A2173555L61757O63755J092658J638439K295582L015096L685612M276019
$$ y = [2217467, 2374029, 2557447, 2754744, 2964236, 3195791, 3473153, 3811852, 4248950, 4787905, 5429781, 6255056, 7416048, 8941161, 10949485, 13584313, 16791159, 20532126, 24577924, 28639320, 32530785, 36191489, 39738305, 43134233, 45982930, 48170475, 50476706, 53300831, 56336577, 59253273, 61797254, 63586683, 63921017, 62194307, 59380528, 56362535, 53079227, 50089290, 47819295, 46009764, 44355035, 42616212, 40667736, 37971181, 33968866, 29340365, 25158644, 21650995, 18844575, 16822197, 15422784, 14416494, 13692652, 13073656, 12546683, 12221065, 12071811, 12038912, 12173555, 12535312, 13199067, 14291725, 15930164, 18225746, 21240842, 24926454, 29202473]
19150B9202473M658397M557922M262431M001843L888801L574482K695606J978617
19142E8820572K389175L005066L273061L191532K660741J483340l97636k155886
19134G2269965k966604l673854m283284l746389k909094k501772k385614k369734
19126D7433620k727698l842127n153122n418513m841306m078658l240629k433571
19118A5697996j779918j388032j136617r61014q45112p65656p10491o49039n82027
19109F880090n01502m28061m00973l32731k83148k50251k37608j84738k12722
19100D048356j94604k02931k02747k00242j82662j86577j67966j57243j05598
19091B447786j41302j14132p7480n0290q4459q0511m8375m2683l2655j4322R459
$$ y = [29202473, 33860870, 38418792, 42681223, 46683066, 50571867, 54146349, 56841955, 58820572, 61209747, 64214813, 67487874, 70679406, 73340147, 74823487, 74425851, 72269965, 69303361, 65629507, 61346223, 57599834, 54690740, 52188968, 49803354, 47433620, 44705922, 40863795, 35710673, 30292160, 25450854, 21372196, 18131567, 15697996, 13918078, 12530046, 11393429, 10432415, 9587303, 8821647, 8111156, 7462117, 6880090, 6378588, 5950527, 5549554, 5216823, 4933675, 4683424, 4445816, 4261078, 4048356, 3853752, 3650821, 3448074, 3247832, 3065170, 2878593, 2710627, 2553384, 2447786, 2306484, 2192352, 2114872, 2064582, 1980123, 1899612, 1851237, 1808554, 1775899, 1761577, 1771036]
19080A771036L1347K5194M4374M086k972J3310J8570o167l7220l0902J4446L3912
19068A879014L2313N5471M9673L9116k6207m5778m0323o6153p8963k6551j603
19057A770009R932J9063j5255j6400m1256k9050o7491r3370j05173j19826q8969
19046A222214j06995p1484n6937m1915m6957n2876l2895m5980k8509j7660o4039
19035F55967m2715LN143m155m843j282m3335m4776k0111O09Q442j1458m0653p926
19021D48910J4195K0474m614j6250K234j3997p716J8096L8140p260J968P7J7736
19008E11993K5528J4776L0252M2676L6310r476m5805k2928k9238J9404J4935l1220
18996E57207l4061j6474l0972m397n902Q197K1469n945j0829K257l376O0l402
$$ y = [1771036, 1802383, 1827577, 1871951, 1876037, 1873065, 1886375, 1904945, 1898778, 1861558, 1830656, 1845102, 1879014, 1911327, 1966798, 2016471, 2055587, 2029380, 1983602, 1943279, 1877126, 1798163, 1771612, 1770009, 1779941, 1799004, 1783749, 1767349, 1726093, 1697043, 1629552, 1536182, 1431009, 1311183, 1222214, 1115219, 1043735, 986798, 944883, 897926, 845050, 812155, 766175, 737666, 720006, 655967, 613252, 613255, 618398, 614243, 609400, 608118, 564783, 520007, 499896, 500505, 508947, 497489, 456836, 448910, 463105, 483579, 478965, 462715, 464949, 450952, 443236, 461332, 499472, 492212, 494180, 494257, 511993, 537521, 552297, 582549, 625225, 661535, 652059, 606254, 583326, 554088, 573492, 588427, 557207, 523146, 506672, 475700, 471303, 465401, 473598, 495067, 489122, 478293, 480550, 477174, 477234, 473832]
18983D73832j1632O901L9756J5162r44j5545J5651j889J4045n650R768L0495K228
18970E72178M607k69J9218k6032k0079j3806J3051M747r137j8475J9822J6276
18958E62101k641O403J2429K0352L2535L7101j0418j2636P791k1561J2869K7644
18946F71969M2782M8211O790j6894N082P498K8648M90J6833J518J06r607L118
18933H06544J8766J1184K4627J5643m720j3894j2223j022q442k7016k1231k6658
18921G61558J4065J016n005p574o744k2280N827M035j1192j1342K6719M834O29
18908G54546r26j0807j5411K0743J2403J4877l087P741J3428L0031R641j6200
18896H16979K1928L4930K4521K4047M6571L0261L4872J4577N8422M6509N9967
$$ y = [473832, 462200, 469101, 508857, 524019, 523075, 507530, 523181, 521292, 535337, 529687, 539455, 569950, 572178, 576785, 576516, 595734, 569702, 549623, 535817, 548868, 553615, 544478, 526003, 545825, 562101, 559460, 565863, 578292, 598644, 631179, 668280, 657862, 645226, 653017, 631456, 644325, 671969, 714751, 762962, 769752, 752858, 757940, 765438, 794086, 794576, 811409, 812927, 813033, 803426, 806544, 825310, 836494, 861121, 876764, 872044, 858150, 845927, 844905, 836463, 809447, 788216, 761558, 775623, 776639, 771634, 764060, 757316, 735036, 740863, 744898, 733706, 722364, 749083, 753917, 754546, 753620, 742813, 727402, 748145, 760548, 775425, 772338, 780079, 793507, 823538, 833179, 816979, 838907, 873837, 898358, 922405, 968976, 999237, 1034109, 1048686, 1107108, 1153617, 1213584]
18885A213584N8613N0792O2940N6414Q4080J05928P8656O7733Q8754P9402P1145
18874B018041J35617J49713J67662J90469K09728K32453K78634L24631L86669
18865D093617M75574O02899P87778J040669J312711J660567K015405K407843K852727
18856A7249790L248223L394722L252827K955306K908796L074310K938765K260249
18848D1282988J853052K214558K432581K113683J798106J666643J140399k46676
18840E4255334j519699j587923j610011k091607k106548j831641j895986k140931
18832C9470988k086641j892928k275662l351408l765265l232040k707029k399881
18824A7760134k051361j567703j133827q17451o10386l95840j67339M5189K90537
$$ y = [1213584, 1272197, 1322989, 1385929, 1442343, 1526423, 1632351, 1711007, 1778740, 1867494, 1946896, 2018041, 2153658, 2303371, 2471033, 2661502, 2871230, 3103683, 3382317, 3706948, 4093617, 4569191, 5172090, 5959868, 7000537, 8313248, 9973815, 11989220, 14397063, 17249790, 20498013, 23892735, 27145562, 30100868, 33009664, 36083974, 39022739, 41282988, 43136040, 45350598, 47783179, 49896862, 51694968, 53361611, 54502010, 54255334, 52735635, 51147712, 49537701, 47446094, 45339546, 43507905, 41611919, 39470988, 37384347, 35491419, 33215757, 29864349, 26099084, 22867044, 20160015, 17760134, 15708773, 14141070, 13007243, 12189792, 11579406, 11183566, 11016227, 11061416, 11351953]
18815A1351953N72395R49725J438998J954469K522172L081462L695329M346558
18807B9913061M821740M795992M270685L875291M033585M085253L279963K098278
18799F1173848K084392K738129K900086K703272K468688J795627K87026j336234
18791G4814834j757761j923749l147992l947708l438039l103394l380033l469288
18783E0646870l124954l171745m237500n119232m871370m160619l645816l205803
18775A9109831k652575k105856j674366j377705j153356r81365q72585p50648
18767G541375o61222n71681m88376m11484l62864l36579l18287k71537k52951
18758C866394k25965k22026j97140j44782j30465j36382j33939j09691r3237p9265
$$ y = [11351953, 11924348, 12874073, 14313071, 16267540, 18789712, 21871174, 25566503, 29913061, 34734801, 39530793, 43801478, 47676769, 51710354, 55795607, 59075570, 61173848, 63258240, 65996369, 68896455, 71599727, 74068415, 75864042, 76151068, 74814834, 73057073, 71133324, 67985332, 64037624, 60599585, 57496191, 54116158, 50646870, 47521916, 44350171, 40112671, 34993439, 30122069, 25961450, 22315634, 19109831, 16457256, 14351400, 12677034, 11299329, 10145973, 9164608, 8292023, 7541375, 6880153, 6308472, 5820096, 5408612, 5045748, 4709169, 4390882, 4119345, 3866394, 3640429, 3418403, 3221263, 3076481, 2946016, 2809634, 2675695, 2566004, 2472767, 2393502]
18748B393502p6257n9946q7400p7806o0548m5253m1100o9080o7994n8540p4707
18737A674871n3093k3782l4239l1511j4834j2847j5753o7403q4887n0643k6235
18726A259644l6421r327m076j4767o1118j0484L405o073k7120m6710r247k7152
18714A010554l6443j6095k9637l8139q027r029q075j0893p922K1913J5562N4439
18702I38208L0034K0147J6631M8568N340L104K6829l12k3726L444N9494M5187
18690A172948K9177N3481M4793K9428k001J6175K1367l8347o9253m2306J1438
18679A226900J2797J4285O738J1184j0173k6834l1791m1139l6361L066j5711n9782
18667A053179q706n396k2258q120k7892k0963k7877j3755L246L9302J8226j0471
$$ y = [2393502, 2317245, 2257299, 2169899, 2092093, 2031545, 1986292, 1945192, 1876112, 1808118, 1749578, 1674871, 1621778, 1597996, 1563757, 1532246, 1517412, 1504565, 1488812, 1421409, 1336522, 1285879, 1259644, 1223223, 1213896, 1209820, 1195053, 1133935, 1123451, 1126856, 1120783, 1093663, 1046953, 1037706, 1010554, 974111, 958016, 928379, 890240, 882213, 873184, 865109, 854216, 846294, 868207, 883769, 938208, 968242, 988389, 1005020, 1053588, 1058928, 1062032, 1088861, 1088549, 1064823, 1068267, 1127761, 1172948, 1202125, 1255606, 1300399, 1329827, 1327826, 1344001, 1365368, 1327021, 1257768, 1215462, 1226900, 1239697, 1253982, 1260720, 1271904, 1261731, 1234897, 1203106, 1161967, 1125606, 1128672, 1112961, 1053179, 1044473, 1039077, 1016819, 1008699, 980807, 959844, 931967, 918212, 921458, 960760, 978986, 968515]
18655I68515n48K9250K2127j188M744K8891Q176J4084M5889O3343L0033L3132
18643A246448L6674L9915K941L2460M9631L0598L7189M8886O0609P6220Q3095
18632A744666P3216P3699J07523J04263N3275K3564M5837M9278L9168Q8092J63103
18621B565684J32029J19285J19161J37266J65919J28560J08335J15293P8130P6491
18611C746153J05406J18896J16697J14361J71666K64748L76572N43233P01728
18602F259460R43736J259886J744522K439241L353548M598524N982216P204467
18594C3785600P978129Q113169P842533P166296N722664K915403j024463m350705
18586F8148626o043303p331965q642072q681044p187506n277999l722025k669759
$$ y = [968515, 967967, 997217, 1019344, 1018156, 1022900, 1051791, 1059967, 1074051, 1119940, 1183283, 1213316, 1246448, 1283122, 1323037, 1325978, 1358438, 1408069, 1438667, 1475856, 1524742, 1585351, 1661571, 1744666, 1817882, 1891581, 1999104, 2103367, 2156642, 2180206, 2226043, 2275321, 2314489, 2402581, 2565684, 2697713, 2816998, 2936159, 3073425, 3239344, 3367904, 3476239, 3591532, 3669662, 3746153, 3851559, 3970455, 4087152, 4201513, 4373179, 4637927, 5014499, 5557732, 6259460, 7203196, 8463082, 10207604, 12646845, 16000393, 20598917, 26581133, 33785600, 41763729, 49876898, 57719431, 64885727, 70608391, 73523794, 72499331, 68148626, 62105323, 54773358, 46131286, 37450242, 30262736, 24984737, 21262712, 18592953]
18578A8592953j999067j615857j394004j195183j009728q04813n85157m25583
18570I563561k84210j85657j11011n8899q1397j30172j54315j44766j09113j17333
18560H186688r8245J7036J44599L34037M85222P34643J066732J501282K095173
18551A4467167K969315M215453N889035P944241J0115954J1869369J2607428J2403454
18543H2481416J1782545J0432337P256379J710122m539884q405349j0408837j2737485
18535G7571244j4326213j3045316j0076001p199062n049651l710668k922581k433865
18527A8807887k149638j914213j627583j343208j072915p70621o12501m99647
18519H817561l61501k95095k53460k18856k28761k71548k61219k00879k00200
$$ y = [18592953, 16593886, 14978029, 13584025, 12388842, 11379114, 10574301, 9989144, 9563561, 9279351, 9093694, 8982683, 8923784, 8842387, 8712215, 8557900, 8413134, 8304021, 8186688, 8088443, 8105479, 8250078, 8584115, 9069337, 9803980, 10870712, 12371994, 14467167, 17436482, 21651935, 27540970, 35485211, 45601165, 57470534, 70077962, 82481416, 94263961, 104696298, 111952677, 113662799, 109122915, 100717566, 90308729, 77571244, 63245031, 50199715, 40123714, 32924652, 27875001, 24164333, 21241752, 18807887, 16658249, 14744036, 13116453, 11773245, 10700330, 9929709, 9317208, 8817561, 8456060, 8160965, 7907505, 7688649, 7459888, 7188340, 6927121, 6726242, 6526042]
18510F526042j17208K6417J24674K36473L67296N16849P23600R06810J278089
18501A0589042J858906K613449L456729M260760M773696M845850M733474M432309
18493D1564215L560015J730425q61946k963313l884701m705917n706394n709447
18485B3022937m661743l436342k398196j705214j302106j048006r45604q29550
18477F696176p13563o13755m79596l93112l34414k53835j76442j23556j21572
18468C486331j09434j07426j11499j17358r6298k6381l530L1902L3611N2069M5601
18457C077588O2099M7488n3470j52690j55979j74269k19113k56091k16274j56895
18447A802394j34173q4958k4646n5959n6227o1979q1574n7150j7556m9634k2186
$$ y = [6526042, 6408834, 6435251, 6559925, 6796398, 7163694, 7680543, 8404143, 9310953, 10589042, 12447948, 15061397, 18518126, 22778886, 27552582, 32398432, 37131906, 41564215, 45124230, 46854655, 45992709, 43029396, 39144695, 34438778, 28732384, 23022937, 18361194, 14924852, 12526656, 10821442, 9519336, 8471330, 7525726, 6696176, 5982613, 5368858, 4889262, 4496150, 4161736, 3907901, 3731459, 3607903, 3486331, 3376897, 3269471, 3157972, 3040614, 2944316, 2917935, 2914405, 2946307, 2979918, 3031987, 3077588, 3139687, 3187175, 3133705, 2981015, 2825036, 2650767, 2431654, 2175563, 1959289, 1802394, 1668221, 1583263, 1558617, 1502658, 1446431, 1384452, 1302878, 1245728, 1228172, 1178538, 1156352]
18436A156352P599k6001m8715l2752l1538j2946k9224j7483k3048l2174n190k0294
18424H84586l430J1984J889j2084n988m490j6519J442J9179K1885N5498N7304
18412A011256L0750M1503Q5223Q5130N2227J7602l5139n6960o3107p8791p1377
18401A018317p2098q9880o9852k8436O68o529k9100j7779n485j3876m268k842
18389F78840o054p89m952K2582j3655m3923j4417J2949q205o496J5882K4510o78
18376F55594J4773J7913o202r83P526K0583K7008p34N038J4099l218R622m811
18363G56208P181j0832j4215m32J0101N44K0772l368L231N1455K3394l4K1304
18350H65309K4541J0457k6596k7949M467M4474N850n0065n7167j7185Q010J4614
$$ y = [1156352, 1163951, 1137950, 1089235, 1056483, 1024945, 1011999, 982775, 965292, 942244, 910070, 904880, 884586, 881156, 893140, 895029, 882945, 876957, 872467, 855948, 857390, 876569, 898454, 953952, 1011256, 1042006, 1083509, 1168732, 1253862, 1306089, 1323691, 1288552, 1231592, 1168485, 1089694, 1018317, 946219, 856339, 786487, 758051, 758719, 752190, 723090, 705311, 699826, 685950, 681682, 678840, 672786, 671997, 667045, 689627, 675972, 632049, 617632, 630581, 622376, 615880, 631762, 656272, 655594, 670367, 688280, 682078, 681095, 688621, 709204, 736212, 735478, 740516, 754615, 751397, 761019, 756208, 763389, 752557, 738342, 737910, 748011, 748555, 769327, 765959, 769190, 820645, 844039, 844005, 865309, 889850, 900307, 873711, 845762, 850229, 894703, 900553, 850488, 793321, 776136, 784146, 798760]
18338G98760J0685K2917L4974L4249K0522K1713K896L9593N742n888l084N470
18326I88549M3763K8135L715j2867J264r309J487K5017K8783K2495k3760k7754
18314A069518m1182o199K2251J8805K9255M9442J9697J161P65J9467K521n884
18302A179617J5930J9996k6276J2513K4028R500J9109K0899L1058L1506J9619
18291A357499J1074M4362M1862L0203M0674K1845M4137K6114M2208L0423K0079
18280A710480J9823O3726M5733M0627K8004M3499O7335P1252J10055J35866R8566
18269B434966J25538J10612J37698J52716J28755J08737J59342K47184L16769
18260C922317M52358N87131Q10930J003617J089466J043132R00502Q40212R04686
$$ y = [798760, 809445, 832362, 867336, 901585, 922107, 943820, 946716, 986309, 992051, 986163, 983079, 988549, 1032312, 1060447, 1064162, 1051295, 1052559, 1043250, 1044737, 1069754, 1098537, 1121032, 1097272, 1069518, 1028336, 1022137, 1044388, 1063193, 1092448, 1141890, 1161587, 1162748, 1163513, 1182980, 1185501, 1179617, 1195547, 1215543, 1189267, 1201780, 1225808, 1235308, 1254417, 1275316, 1306374, 1337880, 1357499, 1368573, 1412935, 1454797, 1485000, 1525674, 1547519, 1591656, 1617770, 1659978, 1690401, 1710480, 1730303, 1794029, 1839762, 1880389, 1908393, 1951892, 2019227, 2090479, 2200534, 2336400, 2434966, 2560504, 2671116, 2808814, 2961530, 3090285, 3199022, 3358364, 3605548, 3922317, 4374675, 4961806, 5772736, 6776353, 7865819, 8908951, 9809453, 10649665, 11554351]
18251A1554351Q57146M80143P001K36757J093739K187454L599385N459186P465964
18242C2941126Q813977Q908502P851249O578014N940653N065412J724346l608636
18234G4214643q280505r888682p091862l689280k477203k937069k411243j300979
18226C6137820q93529q26821o27532n13661j335633l235367m367590l760190k595817
18217A7981680j589311q79332l78984L8149L82283O46946O86292O17530O00584
18208A8105837O98722R78460J005242N94764N55020J461585K864182M320135N789294
18199C6373241P132203Q683895J0820105J3026444J3528647J1060785P583931
18192A08209251O930977Q934046Q286185J919127l740458j657732L388053M492962
$$ y = [11554351, 12411497, 12891640, 12898641, 13135398, 14229137, 16416591, 20015976, 25475162, 32941126, 41755103, 50663605, 58514854, 65092868, 71033521, 76098933, 77823279, 74214643, 65934138, 56045456, 48953594, 45264314, 42787111, 39850042, 37438799, 36137820, 35244291, 34417470, 33789938, 33276277, 31940644, 28705277, 24337687, 20577497, 17981680, 16392369, 15513037, 15134053, 15172202, 15554485, 16201431, 16887723, 17505253, 18105837, 18804559, 19783019, 20788261, 21383025, 21938045, 23399630, 26263812, 30583947, 36373241, 43505444, 52189339, 63009444, 76035888, 89564535, 100625320, 108209251, 115140228, 124074274, 132360459, 134279586, 130539128, 128881396, 132269449, 136762411]
18184A36762411J741757o45689j745595k690052p234084j3928035j7534216j5744861
18176G8981636j2751700j0595200p987667n315546l304367k220893j940099j952761
18168C2913403j781884j368448j301984k034829k814559k517374j708019r77311
18160A8408995m10090K7094N53285J123771J812863K602532L377596L775176L513170
18151C4784392K958598K766662L111881L127023J948130O92888J312333L151845
18143E3853752N460613Q408183J1563514J2727144R766160M677234J984449J332158
18135A09773207k96098n194443j1766363j7988420j8051883j2695197p811870
18128C5968933m734478k875891j749607j094747q52342r90522j194292j122412
$$ y = [136762411, 138504168, 137858479, 136112884, 133422832, 126188748, 112260713, 94726497, 78981636, 66229936, 55634736, 47647069, 42331523, 39027156, 36806263, 34866164, 32913403, 31131519, 29763071, 28461087, 26426258, 23611699, 21094325, 19386306, 18408995, 17998905, 18025999, 18579284, 19703055, 21515918, 24118450, 27496046, 31271222, 34784392, 37742990, 40509652, 43621533, 46748556, 48696686, 49389574, 50701907, 53853752, 59314365, 67722548, 79286062, 92013206, 101779366, 106456600, 108441049, 109773207, 109477109, 104282666, 92516303, 74527883, 56476000, 43780803, 35968933, 31234455, 28358564, 26608957, 25514210, 24661868, 23671346, 22477054, 21354642]
18120B1354642q59303q34791j556425k569086k655477k002740j382887r59028
18112H534905o97669n05033l91516l82820l87357l55488l11324k72243k93312
18103D938143l02113k72535k53427k41549k34336j76109j90182j97327j44723
18094B925842j15240j49264j24086r8512j07321o4105o3333o2988p8350q8398
18084A974245q5142q8823o0542l1416k4854l5788k0850j5982m0236k0536n1689
18073A498387l2251p1133n9950p7740n9926k1747l5019n0072n0707n6396l2381
18062I51065r924j8931l3988k3539j498p241L877q831k0127m361J1058L9964L8216
18049I15740L887n1933l8932l2289j116J31P5M957R905m987r523p120Q728Q294
$$ y = [21354642, 20495339, 19660548, 18104123, 15535037, 12879560, 10876820, 9493933, 8534905, 7837236, 7332203, 6940687, 6557867, 6170510, 5815022, 5503698, 5231455, 4938143, 4636030, 4363495, 4110068, 3868519, 3634183, 3458074, 3267892, 3070565, 2925842, 2810602, 2661338, 2537252, 2438740, 2331419, 2267314, 2203981, 2140993, 2062643, 1974245, 1889103, 1800280, 1739738, 1708322, 1683468, 1647680, 1626830, 1610848, 1570612, 1550076, 1498387, 1466136, 1395003, 1335053, 1257313, 1197387, 1175640, 1140621, 1090549, 1039842, 983446, 951065, 941141, 922210, 888222, 864683, 863185, 855944, 859821, 850990, 830863, 826502, 837560, 877524, 915740, 919627, 867694, 828762, 796473, 795357, 795488, 795563, 800520, 810425, 805438, 795915, 788795, 797523, 805817]
18035H05817J978K5394L0481N8631M2843L4556L9677N5387L8995J3723k9796n7230
18023A060456o4365o8342o8560m9681m0346o2356m2572k9603j9908m9913l6025
18012E28785l1787j5644j1212j5563K0373l294J5959J3179J2763j3092r656Q967
18000D99778N983n60j6364p02k664L042j1625j6291K3776K4013k149p148Q887
17987E07976J9466M537p532J5728K7614J8931L2989K4652K6806k926j3647J6551
17975F71145K4287k1559m0799m4529k2814L873l8696o8937l8629j0992k77k1899
17963C90174j0418L7809K5911k0281j3056J3283j588j6584j5229r185K7703J2855
17951D21394o430N004K586j525K0038K9074K1107m1551n2870k6695j4490O403
$$ y = [805817, 807795, 833189, 863670, 922301, 965144, 999700, 1039377, 1094764, 1133759, 1147482, 1117686, 1060456, 996091, 927749, 859189, 809508, 769162, 706806, 664234, 634631, 614723, 564810, 528785, 496998, 481354, 470142, 454579, 474952, 471658, 487617, 500796, 513559, 500467, 490811, 499778, 505761, 505201, 488837, 488135, 485471, 488513, 476888, 460597, 484373, 508386, 506237, 499089, 507976, 527442, 531979, 524447, 540175, 567789, 586720, 619709, 644361, 671167, 668241, 654594, 671145, 695432, 673873, 633074, 588545, 565731, 569604, 530908, 461971, 423342, 412350, 412073, 390174, 379756, 417565, 443476, 423195, 410139, 423422, 421834, 405250, 390021, 380836, 408539, 421394, 414964, 419968, 422554, 421029, 441067, 470141, 491248, 449697, 396827, 370132, 355642, 362045]
17939C62045M501P643K2222J3695m407J8828k053k0555j1560K8075j1282O071
17927D13223K3908l171O644J3132P968K878j8964Q443l776K724J8122k919m207
17914D64005j4877k69L9146M7347Q516O90L6646N9030K6768k1550p026J9610J6343
17901F74379j5912N822K9742M705n5601l5530J6721J3764j1782N53J8433K4064
17889F69358J1203L2714l160K592J6398j7650l759J8994j5001j9182L2640m801
17877G20346p015k1558O969J859l3328r555R117M3349L32M478L2931N5731K9611
17864H33267K0155l180J6981k0941R841L2313J2105N361l250L2077N1029L2251
17852A018009J2947L5508K5182J4009J0655j284K375R377L7061J2562J3360K2836
$$ y = [362045, 366546, 374189, 396411, 410106, 405699, 424527, 422474, 401919, 390359, 418434, 407152, 413223, 437131, 433960, 440604, 453736, 461704, 464582, 445618, 454061, 450285, 453009, 471131, 468212, 464005, 449128, 448859, 488005, 535352, 543868, 544558, 581204, 640234, 667002, 645452, 638426, 658036, 674379, 658467, 664289, 694031, 698736, 643135, 607605, 624326, 638090, 626308, 626861, 645294, 669358, 680561, 713275, 710115, 712707, 729105, 711455, 707696, 726690, 711689, 692507, 725147, 720346, 713331, 691773, 698742, 700601, 667273, 657718, 666835, 710184, 710516, 714994, 747925, 803656, 833267, 853422, 850242, 867223, 846282, 856123, 888436, 900541, 905902, 902652, 934729, 985758, 1018009, 1030956, 1066464, 1091646, 1105655, 1116310, 1115026, 1117401, 1126778, 1163839, 1176401, 1189761, 1212597]
17840A212597K9956L2905K8665k302L5638O2861N1718M3383J9441L5090M4792
17829A594744N7470N1948O5993J7976M3591R0739P3885Q4419Q7451R0791M9180
17818B308187Q2992J17136J04467J24245J43175J60423J78445K31828K83267K86107
17808D020272L39539M21924M99375N62378O21888Q10409J019569J296574J682499
17799A1274427K118257K379108K459873K579768K854233L015148K709021J975126
17791C1364961J747173K627813M051240N534250P481764R900015J1556960J1466988
17783H5731164J0610969J0849283J2524849J3517882J1082608N664688J968891
17776A51950334J589363L270271O073838O040481k121098j5239500k0938902j7203408
$$ y = [1212597, 1242553, 1275458, 1304123, 1301821, 1337459, 1400320, 1452038, 1495421, 1514862, 1549952, 1594744, 1652214, 1704162, 1770155, 1788131, 1831722, 1922461, 1996346, 2080765, 2168216, 2259007, 2308187, 2391179, 2508315, 2612782, 2737027, 2880202, 3040625, 3219070, 3450898, 3734165, 4020272, 4359811, 4781735, 5281110, 5843488, 6465376, 7275785, 8295354, 9591928, 11274427, 13392684, 15771792, 18231665, 20811433, 23665666, 26680814, 29389835, 31364961, 33112134, 35739947, 39791187, 45325437, 52807201, 62707216, 74264176, 85731164, 96342133, 107191416, 119716265, 133234147, 144316755, 149981443, 151950334, 153539697, 156809968, 162883806, 168924287, 166803189, 151563689, 130624787, 113421379]
17768A13421379j1710778q857864q292682p934685o683059n171034m193294l496827
17760E7081156k862271k663965l576878n283745o078073n255330l895941k719627
17752B4745326j865776j191981p52644m81347k45343R8576O06957J335977K157375
17743B4407120L002675L595851L829256M027422M591666N541486O236814N633464
17735F0865754L931794L010958L894433O104800Q270570Q602054O791880N063460
17727A06535703M676417N722440Q006334Q988964M776760l263232q574988r507980
17719A17360418p072814m119004m661194j0111035j5272825j4531566j0719921
17712E0872059p235589m832688l489462l064150l022249k669460k098971j575632
$$ y = [113421379, 101710601, 92852737, 84560055, 76625370, 69942311, 64771277, 60577983, 57081156, 54218885, 51554920, 47978042, 42694297, 36616224, 31360894, 27464953, 24745326, 22879550, 21687569, 20934925, 20453578, 20208235, 20306811, 20913768, 22249745, 24407120, 27409795, 31005646, 34834902, 38862324, 43453990, 48995476, 55232290, 60865754, 64797548, 67808506, 71702939, 77807739, 86078309, 94680363, 101472243, 106535703, 111212120, 116934560, 124940894, 133929858, 138706618, 135443386, 126868398, 117360418, 110287604, 106168600, 101507406, 91396371, 76123546, 61591980, 50872059, 43636470, 38803782, 35314320, 32250170, 29227921, 26558461, 24459490, 22883858]
17704B2883858j251449j031322q55277p18364q28597j244541j680404j627067
17696A3646837j212120q02926m90599k77819j36940j8435J87783M68264Q09424
17687A2173469J364067K141450K996778L625901L694089L273741L158705L935365
17679C6363565M996064M811097K586499N63061R4457N16085J617927K143224n5479
17670E3636500m231529o129183n244572l665161k160713j418485k227274m137949
17662B4421634m534667l447672k382377j583797j045018p29755n17772m39354
17654I741222l64433k97602k30307j45990n9030K3828Q9041K02083L84133O39736
17644I982681R84860J453420K163950L063707L971921M512423M630934M938668
$$ y = [22883858, 21632409, 20601087, 19745810, 19027446, 18198849, 16954308, 15273904, 13646837, 12434717, 11631791, 11141192, 10863373, 10726433, 10707998, 10895781, 11364045, 12173469, 13537536, 15678986, 18675764, 22301665, 25995754, 29269495, 32428200, 36363565, 41359629, 46170726, 48757225, 49320286, 49414743, 49930828, 51548755, 53691979, 53636500, 49404971, 43275788, 38031216, 34366055, 32205342, 30786857, 28559583, 24421634, 19886967, 16439295, 14056918, 12473121, 11428103, 10698348, 10180576, 9741222, 9376789, 9079187, 8848880, 8702890, 8643860, 8667688, 8756729, 8958812, 9342945, 9982681, 10967541, 12420961, 14584911, 17648618, 21620539, 26132962, 30763896, 35702564]
17636C5702564N733225O568328O600205N537122N507090O887142O220843L090368
17628H1846887J321989K268464K610929j197735p722752j0660397q441502n473118
17620E4552765m732026n557398n097778l721392l502674m507392m776959l771087
17612A8886059k695726j951892j476828j123308q54447p43932o79419n97500m61212
17603H301795l41987k75770k25854j33696r0051K2177K12041M29742P72231J276482
17593I947110J884881K487184K712343K364882K115402K506713L441944L841949
17585C1302408K473410P08265J38799K02074Q95028J836164J124264k300454m922002
17576C1457956m377272l010183j803914j043953j269831k702115l527012k859407
$$ y = [35702564, 41435789, 48004117, 54604322, 60141444, 65648534, 72535676, 78756519, 81846887, 83168876, 85437340, 88048269, 86850534, 79127782, 68467385, 60025883, 54552765, 49820739, 44263341, 39165563, 35444171, 31941497, 27434105, 22657146, 18886059, 16190333, 14238441, 12761613, 11638305, 10783858, 10039926, 9360507, 8763007, 8301795, 7959808, 7684038, 7458184, 7324488, 7234437, 7256614, 7468655, 7898397, 8670628, 9947110, 11831991, 14319175, 17031518, 19396400, 21511802, 24018515, 27460459, 31302408, 33775818, 34484083, 34622882, 34824956, 35719984, 37556148, 38680412, 36379958, 31457956, 27080684, 24070501, 22266587, 21222634, 19952803, 17250688, 13723676, 10864269]
17568A0864269j995007j357339r62370p03937n44027m68675m28506l76347l20999
17559C707062k99564k65194k31315k01185j44951j54447j61444j49887j23013
17550A976062j14026j11943p2460r7056j26050q4636n4171p1868n5324l7503l1678
17539A119347n5644l2717n1457l3464o351l2145L265j2377m7705k0154M931J25
17527H35654n009K389J2631M3806L5782L6340K9548L5819L6739n380n0928m9359
17515I58032m8069m9296o4787o0218p0831p0500m5483m2617n5428m1545k4453
17504C84805l1411o1181m5781K1309K0687o998l0566Q846l206m4575j8557k2558
17492A70814q643L5792L0064j6943l232P253L35o293k726o904k0093J4881n142
$$ y = [10864269, 8869262, 7511923, 6549553, 5845616, 5301589, 4832914, 4404408, 4028061, 3707062, 3407498, 3142304, 2910989, 2709804, 2564853, 2410406, 2248962, 2099075, 1976062, 1862036, 1750093, 1677633, 1580577, 1454527, 1369891, 1315720, 1243852, 1188528, 1151025, 1119347, 1063703, 1030986, 979529, 946065, 939714, 907569, 910834, 898457, 850752, 830598, 835529, 835654, 830645, 833034, 845665, 889471, 925253, 961593, 991141, 1026960, 1063699, 1058319, 1007391, 958032, 909963, 860667, 795880, 735662, 664831, 594331, 548848, 506231, 450803, 409258, 384805, 353394, 292213, 246432, 267741, 288428, 281430, 250864, 259710, 256504, 211929, 193372, 170814, 162171, 197963, 228027, 211084, 207852, 215105, 215440, 209147, 206421, 199517, 179424, 194305, 189163]
17479A89163l0218k4825J6265j855J9896Q005k0606j3631J8294j0964j2069j6435
17467A21020j957n712Q878j831l4124q708j7946k3505K507L572k5667R299J378
17454B7204j5653j0947J6194J436j845K7036k5829k4888J5933M6802J1537q873
17442E8107m4214k1278P051q302q888N956O602J0093J4325K965K8953L693k639
17429E2424l8654j0348k897o19j0622J2385K2279K344k0085J8807K6788M254l851
17416E2205j6247m586j6890j1355P905n156p403o1K9731k582k5418q489J6981
17403H635p860k4445K042K88j2360j1161p25l5793J751L2939L4356j3629k5667
17390e1629k904J6465K1096k7209l3565M154J5110J8964J2242Q639m60L7900J4820
$$ y = [189163, 158945, 134120, 150385, 148530, 168426, 176431, 155825, 142194, 160488, 149524, 137455, 121020, 119063, 113351, 122229, 120398, 86274, 77566, 59620, 36115, 38622, 42194, 16527, 25826, 27204, 11551, 604, 16798, 18234, 16389, 43425, 17596, -7292, 8641, 55443, 66980, 58107, 13893, -7385, -334, -8636, -17524, -11568, -4966, 5127, 19452, 22417, 51370, 55063, 52424, 13770, 3422, 525, -94, -10716, 1669, 23948, 26292, 6207, 25014, 51802, 56056, 52205, 35958, 31372, 14482, 3127, 11032, 5876, -1527, -1588, 28143, 25561, 143, -8346, 8635, 775, -23670, -21628, -21340, -33700, -44861, -45586, -81379, -79628, -46689, -12333, -25962, -51629, -54533, -38068, -16972, -44181, -77746, -73592, -58482, -39518, -27276, -18637, -19097, 18803, 33623]
17377C3623M404k0982j4104j2932J7774K1173j8330P868k949K891k5040n368J5371
17364C399m899k3888r147j8460j6975M173K7782K7720J7623P163l6647j7920J2550
17351b7526m227q490R11m585k8834l818J0897J5323K480K9833L4013k3618l9313
17338d6954l8982k863M2236L940J8721K7161k960n3513q037K4092j4948k5215
17326g7322K8320J4225J2908J1057L428J2334l0798J8191M388j3335j0471J3681
17314a3394K835M769l211M62K502p999J6845K2609o18J3877k417l726q445j825
17300B2264r255j7489j2701L1753L4233R641K134J154n882J9837J8977M267J7553
17287A16486L3104M6241M1743N3576N0988K7724M6837R907R281K0934J6846Q691
$$ y = [33623, 38027, 17045, 2941, -9991, 7783, 28956, 10626, 18494, 15545, 18436, -6604, -11972, 3399, -1500, -25388, -34535, -52995, -69970, -65797, -38015, -10295, 7328, 14491, -22156, -40076, -27526, -31753, -40243, -39332, -43917, -72751, -76569, -65672, -50349, -47869, -18036, 15977, -7641, -46954, -85936, -88799, -46563, -42623, -23902, 3259, 299, -53214, -61251, -37159, -52107, -77322, -49002, -34777, -21869, -10812, -7384, 4950, -25848, -7657, -3269, -16604, -27075, -13394, -10559, -5790, -9001, -8539, -6037, -14036, 2809, 25418, 24800, 38677, 36260, 32534, 24089, 22264, 13009, -4480, -17181, 14572, 48805, 58446, 60580, 61734, 55852, 75689, 94666, 98933, 116486, 149590, 195831, 237574, 291150, 342138, 369862, 416699, 426606, 435887, 456821, 473667, 482358]
17275D82358q155j5834k1284K4179R036K377j674j2322l284R805N887J6230K4832
17262E12151j3434l1109m2745q889k2710l3389j0775k1071l3291o4204k2008j7821
17250A90705j6510j545l0545k3954K5587K2603k125j5231j8126j8071m395J4951
17238A23344L4271K0915K8647K2206j1558M2112P2514O7993K1981L2853L0113
17227D85391R825L0849j7390k4070j9526L378j3481j3755j1056j3206k7545l8612
17215C50802K576M4208j856j810R665J4289K0466J752l4959o146m1700l8602L490
17202C22175J5658N556m2320m9430m2720m3178l3483k6944k9701O485p808j2362
17190F1928r090Q83n911o952k0408l960L80J4235K4437L1838J5426o698j9498
$$ y = [482358, 474203, 458369, 437085, 461264, 470300, 472677, 471003, 458681, 455397, 465202, 471089, 487319, 512151, 498717, 467608, 424863, 415974, 393264, 359875, 349100, 328029, 294738, 230534, 208526, 190705, 174195, 172650, 142105, 118151, 143738, 166341, 164216, 148985, 130859, 112788, 108393, 123344, 157615, 178530, 207177, 229383, 217825, 259937, 332451, 400444, 422425, 455278, 485391, 495216, 526065, 508675, 484605, 465079, 468457, 454976, 441221, 430165, 416959, 389414, 350802, 353378, 397586, 395730, 393920, 403585, 417874, 438340, 440092, 405133, 398987, 357287, 318685, 322175, 337833, 343389, 301069, 251639, 208919, 165741, 132258, 105314, 75613, 82098, 74290, 61928, 52838, 53721, 47810, 40858, 20450, 16490, 16870, 31105, 55542, 87380, 102806, 96108, 76610]
17177G6610J506J1293K3831J2284K7962J5574J0613K2753N1874N1682K4259M7476
17165C77717M5819j1096q255n223J1472Q561m9054k7395k2492k5961j8889l4134
17153B41070j9880l330k3966l7176k1557m162k499o365j0786k0011p397P432K0997
17140A12370j5119k1609j5662J5779j5008k4219o075J7969K3361O671K1809J6028
17128A16295J7459L5017K2117K963m427N0502M0663K9831j1408J8235K4300Q417
17116C49964J1430p663J594J3368j2709n4239k6450p25n692k2047l9917l6984
17104A69930j9466m5987k1561j7476k8892J6387k4819j7292K1797r942J5194J0700
17092D8573n562J0375J3196p202J5289j7184j0762l040Q421k635l835K2521J7109
$$ y = [76610, 78116, 89409, 113240, 125524, 153486, 169060, 179673, 202426, 254300, 305982, 330241, 377717, 423536, 412440, 404185, 398962, 410434, 418995, 369941, 342546, 320054, 294093, 275204, 241070, 221190, 217860, 193894, 156718, 135161, 130999, 128500, 122135, 111349, 91338, 83941, 91373, 112370, 97251, 75642, 59980, 75759, 60751, 36532, 30457, 48426, 71787, 78458, 100267, 116295, 133754, 168771, 190888, 193851, 189424, 239926, 280589, 310420, 299012, 317247, 341547, 349964, 361394, 353731, 355325, 368693, 355984, 301745, 275295, 274570, 268878, 246831, 206914, 169930, 150464, 104477, 82916, 65440, 36548, 52935, 28116, 10824, 32621, 22679, 37873, 48573, 43011, 53386, 66582, 59380, 74669, 57485, 46723, 43683, 52104, 49469, 45634, 68155, 85264]
17079H5264j8659J8506J6965Q487R974K3185J7777k053J4618K11q709k4464j744
17066A39358j1375J1508J0180L561m317M444l1545j8810k2448k2167k0147k6387
17054A1855m635M274K157J571K4140j8125p133j9908j4562k1308M381j8098j97
17041e5588L0428N082J5681j0440j1579J3141J0179j242N73r722j0723L806k3438
17028d3842K2862J2071J5298O732K2966p248n4736l5835m169K3645R602p462N063
17015c5053J9534R503k548j3010j7234M61J0009j1602l552P095Q490J5038r468
17002b2337j0106K826O093J9372j6659R258J2230r099k6877k1535p18N201J1589
16989d0762k3906k257K2480n123j0976r42Q478M2412K5903M505k8062l0223R211
$$ y = [85264, 66605, 85111, 102076, 110563, 120537, 143722, 161499, 159446, 174064, 174275, 165566, 141102, 139358, 127983, 139491, 149671, 153232, 148915, 153359, 121814, 103004, 80556, 58389, 38242, 11855, 7220, 11494, 13651, 15222, 39362, 21237, 14104, -5804, -20366, -41674, -37293, -55391, -55588, -25160, -20078, -4397, -14837, -26416, -13275, -3096, -4338, -3765, -13487, -24210, -20404, -43842, -20980, -8909, 6389, 13121, 36087, 28839, -25897, -61732, -65901, -42256, -32654, -40116, -35053, -15519, -6016, -8564, -21574, -38808, -38347, -28338, -39940, -43492, -36397, -27907, -12869, -22337, -32443, -29617, -23524, -4152, -20811, -11553, 677, -8422, -35299, -56834, -57552, -52351, -40762, -64668, -66925, -44445, -49568, -60544, -61486, -53008, -10596, 15307, 19812, -8250, -38473, -29262]
16976b9262N519o90J4261j090j2661Q770J7488j5087l8765J2926J602o82O146
16963c1525j1645p840J3061O388J1317R320J1534Q369q121j6957J269R057J6245
16950A0472K613k0220k9869L602P638K5224Q518k571l0726q213N843M0751K6286
16937C9348k1595n5468m2175j6114J2423M9487l842n377J2961K370o093n98O516
16924b8157K184j2706J2738J5623P897j8031k9462j5540J8590l055N983J2860
16912c1076J3533P460k9002j1327J1630O354j4158o793k0618p996p51K9069o202
16899e9877J5664L2695K314r729j254q91l8958k4480o48L2511K0484j0605j5388
16886e8162j333J4526J8649k718R274J7068j4732j8347j8021J6513P691j9811
$$ y = [-29262, -23743, -24433, -10172, -11262, -23923, -15153, 2335, -12752, -51517, -38591, -36989, -37671, -31525, -43170, -51010, -37949, -31561, -20244, -10924, 610, 8979, 858, -16099, -14830, -5773, 10472, 13085, -7135, -37004, -33402, -25764, -540, 7978, 5407, -25319, -33532, -27689, 13062, 39348, 17753, -37715, -79890, -96004, -83581, -34094, -37936, -43313, -30352, -27982, -34075, -34673, -28157, -25973, -38679, -25941, -10318, -2421, -20452, -49914, -65454, -46864, -49919, -43936, -31076, -17543, -10083, -39085, -50412, -38782, -32428, -46586, -53379, -73997, -81993, -82744, -53675, -59877, -44213, -11518, -9204, -18933, -20187, -21078, -60036, -84516, -85164, -52653, -32169, -42774, -58162, -59495, -44969, -26320, -29038, -19764, -2696, -17428, -35775, -53796, -37283, -29592, -49403]
16874d9403k6315O486J1818N020J6878J3633k4096M069J3459R32p707k7017j2035
16861g4278K0307K7105J5639R185j2036k855J949k5729p576r453q400J432R08
16848f3802j5353q750J5428n029J0825L7190L8869J469n676j4314p215j9369r836
16835d5563j4236p30R982J9532K6564J0433K995k0062k3452j4846j0373p655K765
16822f4646J1154P814J8946J0176j4154J128L9055Q982l2589N769J1999n649k0340
16809b2355j0129r730Q954J170j5134j8627J4443J5299K767K1381o248j4835n147
16796c8191K5170K752k581J0993p371k3380n062m722q203J5337J3902j4622j0285
16783d6263q434P787O331K254j0962J9328K5159j5807k4023R216K2885J7665p074
$$ y = [-49403, -75718, -69232, -57414, -52394, -35516, -21883, -45979, -41910, -28451, -27519, -35226, -62243, -74278, -53971, -26866, -11227, -2042, -14078, -16933, -14984, -40713, -48289, -57742, -66142, -64710, -63802, -79155, -87905, -72477, -77506, -66681, -29491, 9378, 10847, 5171, -9143, -16358, -35727, -45563, -59799, -60529, -50547, -31015, -4451, 5982, 8977, -11085, -34537, -49383, -59756, -67411, -64646, -53492, -45678, -26732, -16556, -30710, -29582, 9473, 18455, -14134, -8365, 3634, -2015, -22355, -32484, -42214, -33260, -32090, -47224, -65851, -51408, -36109, -33342, -11961, -18209, -33044, -38191, -13021, -10269, -12850, -1857, -9228, -32608, -37670, -42392, -50595, -35258, -21356, -35978, -46263, -54697, -46910, -40579, -38325, -49287, -29959, -4800, -20607, -44630, -35414, -12529, 5136, -1938]
16770a938l0447j5421o084K0416J3232r296j0126L286j8909j0725J4810J7018
16758c4184k4909j267L26Q836q365o163l321o350K4723j5769n837M552n825K3384
16744e0169j0958k3778O519J0319N417L5631K4608Q247l6715j3019M7471L3826
16732C7399j3506M824j150J8824P453m5561l8969j4005K39L7812l6256o685J0983
16719c8598j0658J6395R923j2675m6074j2846j5477J1106J3561L3541K8187n144
16707b8759l0551m1596L856K4022J8292L0960p020K2370N391K077j8510k6618
16695d6086k6752J2143Q711J0957J5681o826p351K5357L2303L2945k78j6650k0713
16682A3441n933l0145j900P455j6637R083L071j9166n263K6138K365L53J5540
$$ y = [-1938, -32385, -47806, -53890, -33474, -20242, -29538, -39664, -36378, -55287, -66012, -51202, -34184, -59093, -60360, -60034, -51198, -59563, -65726, -69047, -75397, -50674, -66443, -72280, -67728, -73553, -50169, -61127, -84905, -78386, -68067, -62650, -27019, -2411, 5836, -30879, -43898, 3573, 37399, 23893, 28717, 27567, 46391, 53844, 8283, -30686, -44691, -44452, -6640, -42896, -49581, -38598, -49256, -32861, -22938, -35613, -81687, -94533, -110010, -98904, -85343, -51802, -23615, -28759, -59310, -100906, -97050, -73028, -54736, -23776, -30796, -8426, -3035, -958, -19468, -46086, -72838, -60695, -51984, -41027, -25346, -32172, -39523, -14166, 18137, 51082, 50804, 34154, 13441, 7508, -22637, -24537, -17082, -33719, -24636, -21565, -40731, -45994, -19856, -17491, -17138, -1598]
16669a598j4353J229j2562q479N574J6281Q475o867j6790j6892j0968j00P127
16656d9923J0970O85k5339k1493J5148J2578L17q368K7585k3480j2789L5765L2540
16643e804j0725o217q929n819L3866J4422j0195j2394j7950k2616j8127K0409
16631e0079J9273L9568R998M712q062n391L676Q446k0302k2507k0722N133L5424
16618h33r768j9154L668P88J5361o943j0433K0106p281k2837k2083n52P149J1915
16604d0897j079L171j4014j3634j415J2138L325J3153J5611j1019j8115J9587
16592c3188L5222J6268j7607j9176M155o36l1423j7654M212J9712K1452l00K75
16579a8688k2131l1452K87K4256N705K2786j0671m0656M5675K1703l3678j6594
$$ y = [-1598, -15951, -14722, -27284, -35763, -30189, -13908, -5433, -12300, -29090, -45982, -56950, -57050, -49923, -38953, -38268, -63607, -85100, -69952, -57374, -57057, -65425, -37840, -61320, -74109, -38344, -5804, -16529, -22746, -31675, -37494, -3628, 10794, 599, -11795, -29745, -52361, -70488, -50079, -30806, 8762, 18760, 23472, 15410, 10019, 13695, 22141, 1839, -20668, -41390, -36257, -833, -10601, -29755, -26087, -25299, -9938, -16881, -27314, -7208, -14489, -37326, -59409, -59961, -52812, -40897, -41976, -38805, -52819, -66453, -67868, -55730, -52405, -39252, -23641, -34660, -52775, -33188, 2034, 18302, 695, -18481, -14326, -14962, -46385, -64039, -59827, -40115, -18663, -18963, -18688, -40819, -72271, -71984, -47728, -42023, -19237, -29908, -70564, -24889, -3186, -36864, -53458]
16567e3458O38J3778R634p000j3044r177K6923P794j3278j6888J7111L0793j3878
16554b0052k8962L6248R934q461j762r310M047K6025K821k6636j8436p304J2616
16541b9232n409o049j4341k2889p949M329K8536L5296p049N230O046k559J231
16528a4809k4050j52J4419J0190J3134Q955k5556l0995m748j0116k6133K0311
16516f9550L1526j768K6339J30j7417j7262m18J9149J2399K5302L3489n301k0798
16503A5820l0220k6302N322M641J0161l636j2174j6594r963J1263K5662K547J4971
16490h502J5747k2200j9828q782O802P068j4884P541l663j276j1311J1443L8733
16477c112L436k0102N44J2762N225j4044j9398Q438J2465K1229J4694m1706l4623
$$ y = [-53458, -52820, -39042, -29408, -36408, -49452, -58629, -31706, -23912, -37190, -54078, -36967, -6174, -20052, -49014, -12766, -2832, -11293, -13055, -22365, -18318, 7707, 10528, -16108, -34544, -41848, -29232, -34641, -40690, -55031, -77920, -85869, -81540, -53004, -17708, -24757, -19527, -13481, -16040, -14809, -38859, -39011, -24592, -14402, -1268, 7687, -17869, -48864, -53612, -63728, -89861, -69550, -38024, -39792, -13453, -13323, -30740, -48002, -48420, -29271, -16872, 8430, 41919, 36618, 15820, -14400, -40702, -35380, -30739, -20578, -24214, -36388, -52982, -62945, -51682, -26020, -23473, -8502, 7245, -14955, -34783, -43565, -36763, -29695, -44579, -37038, -40701, -41977, -53288, -41845, -3112, 324, -19778, -19234, -6472, -1247, -15291, -34689, -26251, -13786, 7443, 22137, -19569, -54192]
16464e4192j4233J1729L2032K1885j3445o656q78J0689M906j8732J1726m878J3703
16451f344j1051l41j4083j935J2508J8279j9742k3303k1108J831R87m55J47N114
16437e9496j0674J3127N908k72J2235L516j1170p401P912l916k1487j5227L899
16424h3046Q993J7729J7990J8971k22k1603J481R244O709l5206K294Q280L788
16411d4598k889k294R629k6004k8829K377J9842J9967k3966m239J4911q568k703
16398g7364L1514J061r741m097L017j657L5162K2642K0233q075n5061l2624N315
16385f9675J8459K2796J1365l1494k0673J6621k286J037l5035R204L6923K173
16373d0585k606o314l1282P241K9204M682j1779M040J7569q796j4822l8880J4040
$$ y = [-54192, -68425, -56696, -24664, -2779, -16224, -22880, -23758, -13069, -8163, -26895, -15169, -20047, -6344, -17395, -17736, -31819, -33754, -21246, -2967, -22709, -46012, -67120, -65289, -64302, -64757, -64610, -59496, -70170, -57043, -51135, -51407, -39172, -35656, -46826, -54227, -46315, -50231, -71718, -86945, -83046, -74053, -56324, -38334, -19363, -19585, -41188, -39707, -30463, -23754, -58960, -56666, -48386, -44598, -47487, -49781, -40152, -66156, -94985, -92608, -72766, -52799, -76765, -81004, -66093, -74661, -77364, -45850, -44789, -54530, -58627, -55610, -57267, -22105, 537, 20770, 12695, -42366, -74990, -69675, -51216, -28420, -17055, -48549, -69222, -52601, -54887, -53850, -88885, -79681, -42758, -40585, -43191, -49505, -80787, -73546, -44342, -39660, -51439, -47399, -29830, -38626, -53448, -92328, -78288]
16360g8288J8759K744j8990j1344K0730J6813m809o919K5234J6428J376r264j0214
16347c7744k1756O40j2813j4972K8653L8511j201k4893j4723q106Q54l495N566
16334f5479L1974K1519j3048l116J2652O985J2786J220j8481l4381m1397o495
16322i5261J0491K0234N451j9886O540K5727J6969J4028n619j9082j764Q813J482
16309c1877j3388m762J6903k673n855j1522j1011K226K3362O579K0748N247J003
16296e020K9073M452k7335k3829m08J0273k9726n380J6950K0871k0614k306j8968
16283e1967K5782n798K730j116J6790N507m0151j7297J5673J7212r229k207J5992
16270b8079K1140k541q94Q950l669Q57j1044l4172j1565k1943l096N886l584R099
$$ y = [-78288, -59529, -56785, -75775, -87119, -66389, -49576, -54385, -61304, -36070, -19642, -18266, -27530, -37744, -59500, -58860, -71673, -86645, -57992, -19481, -20682, -45575, -60298, -68404, -67550, -71045, -65479, -33505, -11986, -25034, -28150, -15498, -8513, 4273, 5493, -12988, -47369, -88766, -95261, -84770, -64536, -59085, -78971, -72431, -46704, -29735, -15707, -21326, -40408, -42172, -33359, -31877, -45265, -50027, -33124, -35797, -41652, -53174, -64185, -61959, -38597, -32018, -11270, -6023, -5020, 24053, 28505, 1170, -22659, -23067, -12794, -42520, -47900, -30950, -10079, -30693, -32999, -51967, -26185, -31983, -29253, -30369, -13579, -8072, -48223, -65520, -49847, -32635, -41864, -44071, -28079, -6939, -9480, -10374, -1424, -5093, -4236, -15280, -49452, -61017, -82960, -86056, -80170, -83754, -74655]
16256g4655J5439Q505O559m28m754N005J2320j2423J8429j0743n89J7537J0466
16243i332p147l1623j0512L8295K4996p175N55r741j8284j0382J1307j696k966
16230c3705K6961L0797K144k9375j4492l5116J2134l970j6696K1050O096j3709
16218d7881k0788K1305K1015m209J3280L327M041k1281m9501P493L4278J7421
16206b1500M210O996J3574R233j072j4140L018q80o169j6029j0659K957J5673
16193a4788k902J9893j3722k6119K649J9165J9369J2042J263J343J618k4715j9356
16180b4260l2818j8309J9376J3492L7868O786Q093P27J1816j4455j2589J089o100
16167i284l99l1773j8042n418N473J2087J3742Q220L50j5933J7263j118M516K767
$$ y = [-74655, -59216, -50711, -44152, -44580, -49334, -44329, -32009, -44432, -26003, -36746, -37335, -19798, -9332, -16479, -48102, -58614, -20319, 4677, -2498, -1943, -11684, -29968, -40350, -29043, -30739, -33705, -6744, 24053, 26197, -3178, -17670, -52786, -40652, -44622, -61318, -40268, -34172, -47881, -68669, -47364, -26349, -30558, -17278, -13951, -9910, -31191, -80692, -73199, -38921, -21500, -17290, -10294, 3280, 12513, 11441, -2699, 319, -561, -6730, -22759, -33418, -30461, -14788, -17690, 2203, -11519, -37638, -34989, -15824, 3545, 15587, 16850, 18193, 19811, -4904, -24260, -57078, -75387, -56011, -42519, -4651, 2135, 10228, 10955, 22771, 8316, -4273, -3184, -9284, -9683, -41456, -59498, -64916, -59443, -47356, -33614, -25394, -25044, -40977, -23714, -24832, -20316, -17549]
16153a7549N45m729O713k1024K559L1170K418k1056j7601J1987J5907N821j1632
16140a6471J9208n388k7439k7797J4023K5967J3318j6189j3597J3656m466k9764
16128e4939r619K9859l5865p733K3691O650J9097p851p208J2478p586J0362K5626
16115c038J0426j0854P479J1041J1050J1503m234k4024l2949p749P405J482l288
16102b5750J987l3209P739K3270j0560M806J4245l708J800q647Q838K9082J1195
16089B1088l715m5396k0726J0085j1207R433J3714j1752j5580j0334j270J760
16077f3900K7022K4060J2252k5169j5842L755Q047J4631q944k3941P006L1700
16065i323L079j3253q027j072o915J5983O571j2741j1436r398k3652J0183K8900
$$ y = [-17549, -17004, -21733, -15020, -36044, -33485, -2315, 103, -20953, -38554, -26567, -10660, -4839, -16471, 2737, -2651, -30090, -57887, -43864, -17897, -4579, -20768, -34365, -20709, -25175, -54939, -64558, -34699, -70564, -78297, -54606, -47956, -28859, -36710, -43918, -31440, -39026, -28664, -3038, 7388, -3466, 4013, 15054, 26104, 37607, 33373, 9349, -23600, -31349, -23944, -22462, -25750, -23763, -56972, -49233, -25963, -36523, -31717, -17472, -21180, -19380, -28027, -19189, 9893, 21088, 17373, -28023, -48749, -38664, -49871, -40438, -26724, -38476, -54056, -64390, -65660, -63900, -36878, -12818, -566, -25735, -41577, -37822, -29775, -15144, -24088, -48029, -41023, -9323, -6244, -19497, -27524, -28596, -35511, -19528, -12957, -25698, -37134, -46532, -70184, -60001, -31101]
16052c1101J7271P453o963k027K229K8016K0045M116K949l2393N675Q125l0436
16039g041k1699m4906k4329J7136N2151L0724j5193k6498J4963K6072k9206j3970
16027d1796j4619K6199K1920K629P048J7903j3972k7014j8262J8190k665J4707
16015i732J9166k0804j4353L677K1071J3638o182m4772j125J0337K3972R391N
16002D289j3899j8261O474J3184J3116j9284k9796O448K4937J1022j6034k8323
15990d6127q975m692K6782J4684K9339K2430l4847l2386p233o116J0720Q220k3054
15977e1255J5370O006j483p626j5112K3274K6107n192j9962j493j379P62q039
15964d0022K0572K1354p856r212J0090N953j1120n972j0105l1928j643L8593J3197
$$ y = [-31101, -13830, -6377, -13340, -15367, -13138, 14878, 34923, 39039, 41988, 9595, 15270, 23395, -7041, -28740, -73646, -97975, -80839, -28688, 2036, -13157, -39655, -24692, 1380, -27826, -41796, -56415, -30216, -8296, -5667, 1381, 19284, 5312, -21702, -39964, -21774, -24439, -9732, 9434, -11370, -25723, -22046, -975, 12663, 6481, -38291, -39416, -29079, -5107, 4284, 4289, -9610, -27871, -21397, -8213, 4903, -14381, -44177, -37729, -12792, -1770, -17804, -46127, -55102, -59794, -33012, -18328, 11011, 33441, -1406, -33792, -41025, -47141, -36421, -28201, -51255, -35885, -29879, -31362, -38988, -54100, -30826, -4719, -9911, -29873, -31366, -32745, -31983, -40022, -19450, 1904, -5952, -15164, -5074, 879, -10241, -16213, -26318, -58246, -59889, -21296, -8099]
15951h099j4035L500R267R707l965J9576J022n293L286K2043L35j2935j8004j2442
15937f037K1647l726j8793k610J1393j366l6435j7199Q437j6549j340K6845K3029
15924a2704J6238M104j3870P689j0343j7071j3144j3615J5331M0552R842k5626
15912a2617J8054J7426j2758J4199k7178n399K0267p873Q09m554l08n196L457
15899a671P72N539o231j935J2780K0965p326j4626j6627J4234J3790o573l0399
15886a7308j0855k555k677l320L890J3293K8885j4885k7507J9654J9238r91n677
15873h15Q110J358k0789N045P763n871l4721j514K3926J35l1039Q374K4193K1024
15859E179K9261j2131k5849N661O077j8377r981O798P79k3522L2911p656j1854
$$ y = [-8099, -22134, -18634, -9367, 340, -3625, 15951, 16973, 11680, 14966, 37009, 37344, 24409, 6405, -6037, 15610, 11884, -6909, -9519, 1874, 508, -35927, -53126, -44689, -61238, -62578, -35733, -12704, 3534, 7638, -6232, 1457, -8886, -25957, -39101, -52716, -37385, 3167, 13009, -12617, 5437, 22863, 10105, 24304, -2874, -8273, 11994, 4121, 4930, 376, 68, -5128, -1671, -899, 4640, -1591, -3526, 9254, 30219, 22893, 8267, -8360, 5874, 19664, 13091, -17308, -28163, -30718, -33395, -36715, -32825, -19532, 9353, -5532, -33039, -13385, 5853, 4862, -815, 7295, 8653, -12136, -7091, 672, -5199, -39920, -41434, -17508, -17373, -48412, -40038, -15845, 5179, 34440, 22309, -3540, 2121, 8198, -10179, -20160, -13362, -12583, -36105, -3194, -10850, -22704]
15846b2704k3427j3601l600r557K1232K0852K2734Q051K1164N90j1065j1092l7454
15833c7877j5329N303p946J1240J8765M648m241j825K0664J9052j2217j040K5757
15820B4954M237Q141j7386O808j7858j7505N629k2993l121J1653l130o476Q023
15807a9024j6242j4722J3747J4131j0218m352K3346k905r587j6729j148P559J9857
15794a6287o268O473J0877r592J7948j6816Q463L3160N398j7766j0089J9205J8409
15781D3115k4483k3871L199L833j6024j5885r90J1053k0458j3356L366J7921J2380
15768b0200k3537K2280O171n83Q098J3721R121p785q73n731m568J772K0212K195
15754B0293l3853P267m053j2695J9656L0214J353o741k1951j1137Q054P636R427
$$ y = [-22704, -46131, -59732, -63332, -72889, -51657, -30805, -8071, -20, 21144, 21734, 10669, -423, -37877, -53206, -47903, -55849, -44609, -25844, -21196, -25437, -27262, -6598, 12454, 237, -803, 24954, 29191, 37332, 19946, 26754, 8896, -8609, -2980, -25973, -29094, -17441, -20571, -27047, -19024, -35266, -49988, -36241, -22110, -32328, -36680, -13334, -16239, -25826, -42555, -43703, -36144, -16287, -22555, -16082, -5205, -14797, 3151, -13665, -5202, 27958, 33356, 15590, 5501, 24706, 43115, 18632, -5239, -2040, 1793, -14231, -30116, -31106, -20053, -40511, -53867, -50501, -32580, -20200, -43737, -21457, -15286, -15869, -7771, 5950, 15071, 7286, 6413, 682, -3886, -2114, 18098, 20293, -13560, -6293, -10346, -23041, -3385, 26829, 28182, 21441, -510, -11647, -3593, 4043, 13470]
15741A3470J9456p917l8366j560p453K2922J0639j0612Q206J1822P002k613j6745
15728H251M145j7263k0802R041J0001J806j0966l504q109j387j0230k854J6235
15715b5636O8M017M458k2656r232o218K2355J9871L6986K7563j79P767k7139k8874
15701C151j5412M562o450J2203k1237J9587J8279K2079K6725l3433O815J8003
15689E4872j8114j1151j7204J2297l689j1393p590j87J6192J0881J748j6454k8964
15676a8756L828M3533p903l410j9189J0686M749k7673j5851m595k445Q847K6452
15663a727R061J7788l741j2963j017j1043l7261j0875K9881M5885J3149K362O892
15650D6391k3239j7847L388O750J8578j0215q871J3917O060k649j2349J99r132
$$ y = [13470, 32926, 25009, -13357, -14917, -22370, 552, 11191, 579, 8785, 20607, 27609, 24996, 8251, 12396, -4867, -25669, -16628, -6627, -4821, -15787, -19291, -27400, -28787, -39017, -41871, -25636, -25568, -21551, -17093, -39749, -48981, -55199, -32844, -12973, 24013, 51576, 51397, 59164, 32025, 3151, -12261, -7699, -14149, -1946, -23183, -3596, 14683, 36762, 63487, 30054, 36869, 54872, 36758, 25607, 8403, 20700, 17011, 5618, -1972, -2159, 14033, 24914, 26662, 10208, -18756, -14928, 28605, 20702, 17292, -1897, 8789, 13538, -14135, -29986, -34581, -37026, -28179, -1727, 7334, 25122, 21381, 8418, 7401, -3642, -40903, -51778, -21897, 23988, 37137, 39499, 46391, 23152, 5305, 8693, 15443, 34021, 23806, 14935, 28852, 34912, 32263, 19914, 20113, 10981]
15637A0981k6151n047j928J0456n044Q839P062m870q631J3846J9607j1308k0823
15624a3011Q374K1772n284O578j2646k687K7492o848p105J523J6314R971j9551
15611B4892p341l1683J0260J4736j8255l6968m521J5272L9142J9950M49m653J7218
15598C8498L048j4677l2196J964K5637P180j6866P746q297j4539p251N157J0289
15585E693Q290j2952j5463n997J6719J1624J7934j590J3563l08q75P800J4408
15572E8846j2478j1043j1719n178J5121K7275M230q357j7567l128j0564N936n491
15559B5883j0842n393J8668j3954l6913k260l850J5050J7659K4351J1984j1004
15547B9379q683K094O214R858j1716o306J52N399L308K1330K697N808j1239q923
$$ y = [10981, -15170, -20217, -22145, -11689, -16733, -7894, -832, -5702, -14333, -487, 19120, 7812, -13011, -4637, 17135, 11851, 18429, 5783, 3096, 30588, 23740, 16635, 18158, 34472, 44443, 24892, 17551, -14132, -3872, 10864, -7391, -44359, -48880, -33608, 5534, 25484, 25933, 21280, 38498, 41546, 26869, -5327, -3363, 22274, 29454, 12588, 20334, 12037, -2502, -9753, -4596, 5693, 13983, 1031, -14432, -20429, -3710, 7914, 25848, 24258, 37821, 37513, 36638, 44438, 58846, 46368, 35325, 23606, 18428, 33549, 60824, 65054, 56697, 39130, 36002, 25438, 31374, 25883, 15041, 9648, 28316, 14362, -22551, -24811, -28661, -13611, 4048, 28399, 40383, 29379, 20696, 22790, 29004, 38862, 27146, 20840, 20992, 26391, 29699, 51029, 53726, 59534, 48295, 39372]
15533C9372J8415j0761k7499k6921j475p979n26K5877K2579R00r391O838j6383
15520A3046L867N946j6273j3376K108N512O994p582j2066J9973K4668j0434M304
15507B6687n763j7063J6921L5054J1515r053j4478j2635k655J5883k3805m117
15495A6491n949J2784R281j3020O70L1003J2431R589K0758J7263j2004l8849k3630
15482C6818k456o648J1848R357K5126K8109o739l2321k6228L817J1339J4082n225
15469F0879l4461j4396J9423Q653J5438K6250q511n3523j4748J3945J8036R344
15457D6329n753K1894J3982j8521K5586J6767m4676l2869J4088r299k510n404
15445A9614k913J6657J2760K3076K7409P674O192J658k2430j2336q925K0261L3197
$$ y = [39372, 57787, 47026, 19527, -7394, -8869, -16848, -17374, 8503, 31082, 31982, 22591, 29429, 13046, 16913, 22859, 6586, -6790, -4682, 830, 7824, 242, -11824, 8149, 32817, 22383, 26687, 20924, 3861, 20782, 55836, 67351, 58298, 43820, 31185, 28530, 44413, 20608, 16491, 10542, 23326, 32607, 19587, 20257, 51260, 63691, 73280, 94038, 111301, 99297, 60448, 36818, 34362, 27714, 39562, 48919, 74045, 102154, 95415, 63094, 36866, 40683, 52022, 66104, 60879, 26418, 12022, 31445, 40098, 55536, 81786, 73275, 19752, 5004, 18949, 36985, 46329, 40576, 62470, 76452, 57931, 83517, 100284, 55608, 22739, 36827, 27528, 25018, 19614, 16701, 33358, 46118, 69194, 96603, 104277, 110469, 112127, 89697, 77361, 68436, 88697, 121894]
15432A21894j7203n150j3720N004j9228m6200l2995L373N828L1183O211j6816
15420B2181r564J1704j7782l056k06J0953K0674K4659J2930L562l968n603j0819
15407E5665p404p393L628K3666k299o381J1702J6456q880n3058k5621J2690L2035
15394D4806l354j4150J2909J7980K2536K1005N675K41P548l5935n192K5203j5286
15381H3986J0970l8618j5675N272r081p187P269L7509K6080J0333l455j9615k1021
15368F6767j6170K532j2991K7293K758j7901o089m13k855J1523J4136K1687M605
15355I4882j0104o408q21j3753j811k0093L2271L3486j2395N57R151k316l1538
15342G1108J814J3635M0067J4279j4751q337j8420n78k4329p145J2068q588J4053
$$ y = [121894, 104691, 99541, 85821, 90825, 71597, 25397, -7598, -4225, 1603, 32786, 38997, 22181, 12617, 24321, 6539, 3483, 3277, 14230, 34904, 59563, 72493, 76055, 72087, 66484, 55665, 48261, 40868, 44496, 68162, 65863, 59482, 71184, 87640, 78760, 25702, 81, 12771, 44806, 41452, 27302, 40211, 58191, 80727, 101732, 107407, 107648, 115196, 79261, 74069, 99272, 83986, 94956, 56338, 40663, 45935, 36854, 29667, 36936, 74445, 100525, 110858, 107403, 87788, 66767, 50597, 53129, 40138, 67431, 70189, 52288, 46199, 45786, 42931, 54454, 68590, 90277, 94882, 84778, 78370, 77549, 63796, 61985, 41892, 74163, 107649, 95254, 95811, 104962, 102646, 71108, 72922, 86557, 126624, 140903, 126152, 117815, 99395, 98817, 74488, 67343, 79411, 70823, 84876]
15329H4876N144M860J6069J1949j3075O71n82L231o792O62K9476J3582o786p777
15315A35508J0110K919k4676j388K7964K7678N840J5910K9578L7481M3778L8636
15303C49338M1508P2485P8243P6467R9353R6405J27264J21479J07357J14723J61937
15292A446559J43778R3492M1569K0777j3892n3229q9431r2971j07115j13450j54782
15281A121305j14633j21155j17777j25190p6206l1337n6741p2866k7252l2444
15271C45704j5058Q633q095l9257l7437k329O43j3602J6877q790k494k0309p221
15258B17265P672n410j9011k6775l5897r103Q952k0768M241J2066j0471p743J793
15245A16811J8795J043K548j4635R730j8852J2197M033j3009j662Q389l593l546
$$ y = [84876, 90020, 94880, 110949, 122898, 109823, 110494, 109912, 113143, 106351, 107013, 136489, 150071, 143285, 135508, 145618, 148537, 123861, 122473, 150437, 178115, 183955, 199865, 229443, 266924, 310702, 349338, 390846, 463331, 541574, 618041, 717394, 813799, 941063, 1062542, 1169899, 1284622, 1446559, 1590337, 1683829, 1725398, 1746175, 1732283, 1679054, 1589623, 1496652, 1389537, 1276087, 1121305, 1006672, 885517, 767740, 642550, 566344, 535007, 478266, 405400, 378148, 345704, 330646, 339279, 331184, 291927, 254490, 252161, 252804, 239202, 256079, 247289, 244795, 224486, 217265, 224937, 219527, 200516, 173741, 137844, 128741, 137693, 116925, 121166, 133232, 122761, 115018, 116811, 135606, 136649, 139197, 124562, 134292, 115440, 127637, 131670, 118661, 116999, 125388, 121795, 118249]
15232A18249P884J3458j1112Q227n376p771j63n069p54M058l350K1759J690k1701
15218A20029n42k0750l015j5758j7386L7360L5089o510j1493K606J05k0581J383
15205A00537L4299j0186m0637n905Q729R583Q703K8078L3170j966J270p454j4776
15192A43445J9529Q928l965l59j1103k244l3623j0689M632J3671R457m177k3769
15179A09733P980Q634L140J0205J4095K0543O134j0801k6548q838Q625J2436P870
15166A63208j4188k9037K9510J7155k2300o879J5184K7102J9626j9733k1746K2554
15154A80456N099Q072k2047j2848J7904j2390M969j4124k5688K8857L1377K8558
15142B18195k0925l0853J785L602P251K2452J6298j7058k3195r197p518J2850
$$ y = [118249, 126133, 139591, 128479, 136706, 131330, 123559, 123396, 118327, 117573, 121631, 118281, 140040, 141730, 120029, 119487, 98737, 95722, 79964, 62578, 99938, 135027, 128517, 117024, 119630, 119735, 99154, 100537, 134836, 124650, 84013, 78108, 86837, 96420, 105123, 133201, 166371, 164405, 165675, 158221, 143445, 162974, 171902, 167937, 167578, 156475, 154231, 120608, 109919, 114551, 128222, 137679, 133502, 109733, 117713, 126347, 129487, 139692, 153787, 174330, 180464, 169663, 143115, 134277, 142902, 155338, 163208, 149020, 119983, 149493, 166648, 144348, 137469, 152653, 179755, 199381, 179648, 157902, 180456, 185555, 193627, 171580, 158732, 176636, 164246, 169215, 155091, 129403, 158260, 189637, 218195, 197270, 166417, 168202, 171804, 179055, 201507, 217805, 200747, 177552, 168355, 160837, 173687]
15130A73687k0559k777K3434J3608K1908J0349K5850K2604j2849j7350M631j4781
15118B27755l737J9996K0451j3339n88K670j8766l1807J3916J7059P299j3702
15106B27207Q684m762L077J4036J2159r203j4372K6427M5111p50K0300M1459m809
15093C64564L6938J9295K1176M5043O3135J8583j824M5551J0288k1309r870l9043
15081E52527m0986k1843k2218m9035j4700r434l6439j3144j7407n666J3964R437
15069C45056j4505k1903O309J3409Q1k746p82l898m896j0631l3482k5357J2165
15056B58820K9044j1920M401P502r267j5145j2016R422O367Q34L473M2j4056j1705
15042B45796J9643J7739N900J2830k0790l9986o557K8812J8844J3189K7221L5550
$$ y = [173687, 153128, 150351, 173785, 187393, 209301, 219650, 245500, 268104, 255255, 237905, 242536, 227755, 224018, 244014, 264465, 251126, 250538, 253208, 234442, 202635, 216551, 233610, 240909, 227207, 235891, 231129, 234206, 248242, 260401, 251198, 236826, 263253, 308364, 307614, 327914, 369373, 364564, 401502, 420797, 441973, 487016, 550151, 568734, 566910, 612461, 622749, 601440, 591570, 552527, 511541, 489698, 467480, 418445, 403745, 394311, 357872, 344728, 327321, 321655, 335619, 345056, 330551, 308648, 314957, 328366, 328447, 325701, 324919, 321021, 316125, 305494, 272012, 246655, 258820, 287864, 275944, 280345, 287847, 278580, 263435, 251419, 260841, 267208, 268042, 271515, 271557, 257501, 245796, 265439, 283178, 289078, 301908, 281118, 241132, 234575, 263387, 282231, 295420, 322641, 358191]
15030C58191o660j1223j6623j0764J8576J0174l1128k4388K3422K2968J1312n654
15018C38203K1509R522Q185P129L6413K6081K598J1507R980K8078l854k0221l4729
15005D40401j3532j9997K0279n933j6830K8283K741j3J2237P431o663j7192p360
14992D23852K1526J9568K4044j0473L6159K9869K4191Q237n958J2958K1780p920
14980E97833p342Q341K349J2966J504j3259K9173K4960K4917N8420N0572L3343
14968H23777R174L2762M2333N1840K2214L2017N4690M5253N94L9927K6132k647
14956A178066m0686m0403k1878Q801J0350m244k9245l3084j5150j419J0621M830
14944A026559K0449L4417L3505M084n8017n5858k7129K263J7823J9530J0135Q837
$$ y = [358191, 351531, 340308, 323685, 312921, 331497, 341671, 310543, 286155, 309577, 332545, 343857, 338203, 359712, 369234, 377419, 384548, 420961, 447042, 449640, 461147, 471127, 499205, 495351, 475130, 440401, 426869, 406872, 427151, 421218, 404388, 432671, 435412, 435399, 447636, 455067, 448404, 431212, 423852, 445378, 464946, 488990, 478517, 514676, 544545, 568736, 576973, 571015, 583973, 605753, 597833, 590491, 598832, 601181, 614147, 615651, 602392, 631565, 656525, 681442, 739862, 790434, 823777, 832951, 865713, 908046, 959886, 982100, 1014117, 1068807, 1114060, 1114654, 1154581, 1180713, 1178066, 1137380, 1096977, 1075099, 1083900, 1094250, 1090006, 1060761, 1027677, 1012527, 1011108, 1021729, 1026559, 1047008, 1081425, 1114930, 1119014, 1060997, 1005139, 978010, 980273, 998096, 1017626, 1027761, 1036598]
14932A036598J9465J9849K4373j61j0506M603M6074M4872K3725M195K1546J6611
14920A251244M3306L7385P31l339K2238M1166N5297M6949K6977N302J7891L2574
14908A577721L2218K7678N4342J8524K2598M8798L5190M7648M8500O1013P0727
14897B044957N1798P1469O3470N0393Q0870Q5805P6945J01216Q4636O5454O6294
14886B843307J07077J24723J24396J08547J12662J01751J14721J61251J73401
14877C971836J43209J21210J56939J64730J85720K44051K50561K34369K70776
14868E743401L03122L30969L65571M47614M79404N15856N85108O24066P20976
14859A0116087Q58130R89665J132857J305052J474651J702466K035806K426512
$$ y = [1036598, 1056063, 1075912, 1100285, 1100124, 1089618, 1094221, 1140295, 1185167, 1208892, 1213087, 1234633, 1251244, 1294550, 1331935, 1332666, 1329327, 1351565, 1392731, 1448028, 1494977, 1521954, 1527256, 1545147, 1577721, 1609939, 1637617, 1691959, 1710483, 1733081, 1781879, 1817069, 1864717, 1913217, 1974230, 2044957, 2096755, 2168224, 2231694, 2282087, 2362957, 2448762, 2525707, 2626923, 2711559, 2777013, 2843307, 2950384, 3075107, 3199503, 3308050, 3420712, 3522463, 3637184, 3798435, 3971836, 4115045, 4236255, 4393194, 4557924, 4743644, 4987695, 5238256, 5472625, 5743401, 6046523, 6377492, 6743063, 7190677, 7670081, 8185937, 8771045, 9395111, 10116087, 10974217, 11963882, 13096739, 14401791, 15876442, 17578908, 19614714, 22041226]
14851B2041226K855672L423039M080002M926720O045494P493950R396277J1889169
14843G2151549J4868380J8225504K1820163K5433115K8658984L0905031L1661839
14836B43724565L0534213K7454266K2545895J5835470P642140j209191r695598
14829C36831760j7207267k3300199k7630211k9892593l0045328k8496583k5797773
14822A54461806k2516443j9049423j5679616j2756178j0525634q837131p531362
14815E7566019o527629n739926n060306m377164l771430l250302k762373k349792
14807B3727097k029640j744674j505449j321397j174228j065280r58697q65724
14799A3062008p88060p11839o70283o10262n53784n31478m95214m53450m22826
$$ y = [22041226, 24896898, 28319937, 32399939, 37326659, 43372153, 50866103, 60262380, 72151549, 87019929, 105245433, 127065596, 152498711, 181157695, 212062726, 243724565, 274258778, 301713044, 324258939, 340094409, 347736549, 346527358, 336831760, 319624493, 296324294, 268694083, 238801490, 208756162, 180259579, 154461806, 131945363, 112895940, 97216324, 84460146, 73934512, 65097381, 57566019, 51038390, 45298464, 40238158, 35860994, 32089564, 28839262, 26076889, 23727097, 21697457, 19952783, 18447334, 17125937, 15951709, 14886429, 13927732, 13062008, 12273948, 11562109, 10891826, 10281564, 9727780, 9196302, 8701088, 8247638, 7824812]
14790G824812l97579l60662l23991l05888l06482k75560k48644k54899k35959
14781E115148k04672j97348k05537k12461j76098j46642j48616j27611j27164
14772C568999j17824j45716j22825j03991j12598j08785j62561q7250p4481r5220
14762B437748o7604p7989p8241q7602q8956o6854q7717p2525o5940o6597o1168
14751A616555o2546l3497l2819k8331n0171m8457m4339p2785n0577o4820m2889
14740A085324K5137j7067n3431l1899l9524k8168l4722l4997j8071n4075j1778
14729G86729M899J687j3316l4764l7139k9703k2972k1423j7701k7881j3723j2780
14717E61913J8999m0310o1432n9264m232l446j1160j6020n3610m6604k8480K320
$$ y = [7824812, 7427233, 7066571, 6742580, 6436692, 6130210, 5854650, 5606006, 5351107, 5115148, 4910476, 4713128, 4507591, 4295130, 4119032, 3972390, 3823774, 3696163, 3568999, 3451175, 3305459, 3182634, 3078643, 2966045, 2857260, 2694699, 2607449, 2532968, 2437748, 2370144, 2292155, 2213914, 2126312, 2037356, 1970502, 1882785, 1810260, 1744320, 1677723, 1616555, 1554009, 1520512, 1487693, 1459362, 1409191, 1360734, 1316395, 1243610, 1193033, 1128213, 1085324, 1110461, 1093394, 1039963, 1008064, 968540, 940372, 905650, 870653, 852582, 798507, 786729, 791628, 793315, 779999, 745235, 708096, 678393, 655421, 633998, 616297, 588416, 574693, 561913, 580912, 540602, 479170, 419906, 415674, 412228, 401068, 385048, 331438, 284834, 256354, 258674]
14705B58674R961J2740J6705K9994N8706M4403L6522M6303r081j6560r457k4259
14693D54651j4480k0720m930o840k7311r540j9616n8379n5311j9525J6695j2914
14681B21780j4418l5850N503K833n093k7900Q260K9087M393p696l8173l9478N025
14668A08273m31J0261n848n431k3840k3417j0372J1454L430k1368j3016m329Q072
14655C3438N318m447j762j3396k1266n076j508J6642l775J993N254N233L2508
14642D9156M0764K9157k1817j8411M239o916n120j0980J9664q451K4006j2631
14630H2660l2513j8504J506n287j4958M039k2765m417L5736Q62j0483K6839N550
14617D8265j4254J654k2182q104n025N568K5854R923J1382j2809p131m5754q525
$$ y = [258674, 268635, 281375, 298080, 328074, 386780, 431183, 467705, 514008, 504927, 488367, 478910, 454651, 440171, 419451, 414521, 407681, 380370, 370830, 351214, 292835, 237524, 217999, 234694, 221780, 207362, 171512, 177015, 179848, 174755, 146855, 155115, 184202, 188595, 180899, 142726, 103248, 108273, 107842, 118103, 112255, 106824, 82984, 59567, 49195, 60649, 64079, 42711, 29695, 25366, 33438, 38756, 34309, 32547, 19151, -2115, -7191, -8699, 7943, 4168, 6161, 11415, 16648, 49156, 89920, 119077, 97260, 78849, 83088, 76172, 71052, 60072, 79736, 71285, 95291, 82660, 50147, 31643, 33149, 27862, 12904, 16943, -5822, -10239, 25497, 26359, 15876, 42715, 48265, 34011, 35665, 13483, 5379, 354, 5922, 31776, 41699, 53081, 40272, 33141, -12613, -21138]
14604b1138J7500q148p887J0912K5639j7172J2541R18q013k6927l7181j7675N562
14591g1069L3266J9442J2523k469Q293J4783l797R802l3682j8087J8750J3799
14579A554K7167j9022J302J2343j0505j2641j682n861K3947j0246k1503J2785
14567b362Q969j5994k9428l0365L954L893K3889j2172j4622K2927L938j6000P282
14554d6091j4098k784p448l535j6145J6442k63k0195j1728K604j2378k4449J4011
14541a26057P513k860p08J3895J8653L5685M6003K4143l2085j2438j766j523O644
14528b4901j1912j2566j6295j1020J8501K7107r294l8078M5p476r922J2852K8073
14515e4886J241j0094n232O47O116L651J8316k6005J7826k222L175L0733J890
$$ y = [-21138, -3638, -11786, -19673, -8761, 16878, -294, 12247, 13165, 5152, -21775, -58956, -76631, -71069, -37803, -18361, -5838, -8307, -14, 14769, 10972, 20774, -12908, -30995, -12245, 1554, 28721, 9699, 11001, 23344, 12839, 198, -1484, -7345, 16602, 6356, -15147, -2362, 6607, -9387, -38815, -69180, -65226, -61333, -37444, -49616, -64238, -41311, -37373, -53373, -46091, -60189, -62973, -70421, -73956, -90101, -73659, -73922, -94117, -105845, -103241, -115619, -140068, -126057, -118544, -121404, -122112, -108217, -89564, -53879, -7876, 16267, -15818, -28256, -30022, -31545, -24901, -36813, -49379, -65674, -76694, -58193, -31086, -40380, -78458, -78413, -85889, -95811, -82959, -54886, -53645, -63739, -68971, -68324, -62208, -58557, -40241, -66246, -48420, -50642, -47467, -16734, -14844]
14502a4844j5657k1476k4720j3858J7707J6644J6233j740j5488J5575l55P321
14490c4658p780p449q67R631l830O401m327O62p606j9385j51K5449r80j1105k2048
14475g8043j4226q465J2923j4036K541N500P856K0800N793Q151J5070P109J7458
14462a1569M188j2809k1162q13J3425L631k7948k639J4050M103R461J8809q463
14449a7736Q410N631j6491j2197k5918J657o037k5133J8578K7382K6293K3342
14437G781j1118j7425K7783L051K83r924P518l0618l6314M780J3596o206L4572
14424a2241J9513K201l3561q065K3480j4712l7177k7016J99K7812j1888j1610
14412h3065n418Q019L3454K9170n552l027k4356J6728K4317j4733k046J7676j1019
$$ y = [-14844, -30501, -51977, -76697, -90555, -72848, -56204, -39971, -41711, -57199, -41624, -41979, -34658, -42438, -49887, -50754, -41123, -44953, -38552, -42879, -42217, -49823, -69208, -69359, -43910, -44890, -55995, -78043, -92269, -100734, -87811, -101847, -99306, -93806, -85950, -65150, -59357, -51206, -36136, -29027, -11569, -7381, -20190, -41352, -42165, -28740, -25109, -53057, -55696, -41646, -37543, -28082, -9273, -17736, -9326, -3695, -20186, -32383, -58301, -56644, -62681, -87814, -69236, -41854, -15561, 7781, -3337, -20762, 7021, 10072, 10355, 431, 7949, -22669, -58983, -54203, -40607, -46813, -12241, 7272, 9473, -24088, -32153, -8673, -23385, -60562, -87578, -87379, -59567, -71455, -83065, -88483, -80464, -47010, -17840, -23392, -26419, -50775, -34047, -9730, -24463, -26509, -8833, -19852]
14399a9852l496O543J870O135O299K0000k187K3705L4261M753J9129K7338j588
14386A22910j4834K305R669L7613M3235M5636N6370P6561Q2797R9297J02374J36011
14374G99944J67493J30605J22292J21964J01155Q8182N3805m12q315p9148r5997
14363A401568j02570j22112j30067j46792j16178p6676r9680j16980r0956l7415
14353C62142k2779n5386l0120j9228m6898k3148l6498O465J051l1969J3514k4150
14341I2996l4341j7335m461l211J0284o270o568l2684l7843M392J6775K659J9356
14328C749J0462j0634r050k016J0308J2147j7819n025p07m298k0314p013j072
14315d1282P358K0013K3021L893k0505M148k150m5807P076o841r173j2583O296
$$ y = [-19852, -23348, -16805, -14935, -8800, -2501, 17499, 15312, 39017, 73278, 78031, 97160, 124498, 122910, 108076, 110381, 120050, 157663, 200898, 246534, 302904, 379465, 462262, 561559, 663933, 799944, 967437, 1098042, 1220334, 1342298, 1443453, 1531635, 1585440, 1585028, 1576713, 1497565, 1401568, 1298998, 1176886, 1046819, 900027, 783849, 707173, 607493, 490513, 399557, 362142, 339363, 283977, 253857, 234629, 187731, 164583, 128085, 134550, 135601, 103632, 117146, 92996, 58655, 41320, 36859, 33648, 43932, 37662, 31094, -1590, -39433, -35041, -18266, -15607, 3749, 14211, 3577, -5473, -7489, 2819, 14966, -2853, -7878, -8585, -12883, -33197, -40210, -41282, -33924, -13911, 9110, 13003, -7502, -3354, -5504, -51311, -44235, -51076, -60249, -72832, -66536]
14302f6536j9302q592L9158K1118K655l179N467j246j904m416q835p882p775k6210
14288h7479J8245R837k532R837j6662K4854J3019R63m666o937l4931l2163R322
14275i9293K0211j2739J3394J3047J0200J3891o92J0524L826j958N173p803o151
14262c8370K153M717j1785j2201M687R629p918q72k1151P916Q669J1656P385J930
14248c3555K2277n971j7095r953J9934L0030O519k1589j3044l118l536Q89K7414
14235g98l542l6249j628m449Q880p661r270K2376K807J724L0950j0106j9866j341
14221b8173L742K4355l3986k828J2052K5274j8783k2261K7247j149m089k5290
14209d3889r016J5733Q884l597j951M7688M542l6545r116j9274m28J51J8676p245
$$ y = [-66536, -85838, -94430, -55272, -34154, -31499, -34678, -29211, -30457, -32361, -36777, -45612, -53494, -61269, -87479, -69234, -59397, -61929, -52092, -68754, -43900, -30881, -29918, -34584, -41521, -76452, -108615, -99293, -79082, -91821, -78427, -65380, -55180, -41289, -41981, -31457, -27631, -29589, -24416, -32219, -38370, -36217, -31500, -43285, -55486, -50799, -41170, -49088, -49960, -71111, -63195, -54526, -42870, -35485, -33555, -11278, -17249, -34344, -44297, -24363, 5667, 12186, -9403, -22447, -25565, -29101, -28212, -798, -4340, -40589, -42217, -46666, -37786, -45447, -54717, -32341, -29534, -27810, 3140, -6966, -26832, -28173, -24431, -76, -34062, -36890, -24838, 436, -18347, -40608, -13361, -14510, -18599, -43889, -52905, -37172, -28288, -31885, -33836, 13852, 18394, -18151, -27267, -46541, -46969, -46818, -28142, -35387]
14195c5387p115k786M580J1727P730k6696j4301J3426Q72L1002J9847q675k706
14182h482j4307j5472j5824j5887J5183J3197N644J3856l3836l7283N622J5513
14170g2076K0689j3919P978M984k242K4445K1449j8976j8820K0867R04m125k1525
14157e0367p784J4576r998k8568k682O003J8403K5940K0675k0004k3307j053P457
14144e0709j1668j8342K94K0381M198L97K3630M667l286J7016n942P698L1406
14131A9740j1413j9407j652o730J1310m049L514k0873J4988k668m4619j9313K5101
14118e6071L1777J0334j2062q007M677p498k528K305J8166j1726p729K5583k469
14105a5248k4236q900M587L0447K1559j758j4772k3276J1064L6956R28l9842j4669
$$ y = [-35387, -42502, -45288, -40708, -28981, -21251, -47947, -62248, -48822, -47950, -16948, 2899, -5776, -8482, -22789, -38261, -54085, -69972, -54789, -41592, -35948, -22092, -55928, -93211, -87589, -72076, -51387, -65306, -57328, -52344, -54586, -30141, -8692, -27668, -46488, -25621, -24717, -28842, -50367, -58151, -43575, -53573, -82141, -84823, -78820, -60417, -34477, -13802, -33806, -57113, -58166, -50709, -62377, -80719, -80425, -60044, -55846, -55449, -31819, -27152, -30438, -13422, -19364, -11666, 19740, 8327, -11080, -12732, -19462, -8152, -12201, -8687, -29560, -14572, -17240, -61859, -81172, -56071, -24294, -13960, -26022, -34029, -29352, -36850, -39378, -37073, -18907, -30633, -38362, -12779, -15248, -39484, -48384, -43797, -13350, 8209, 6451, -8321, -31597, -20533, 16423, 17351, -22491, -37160]
14092c7160Q472M2120k129k4262j9476k6102j6229M725J1567K8506j511j2469
14080d3948K0250J5847j284m0055l5117J0143L8019J2175m4597j7636J3756K1303
14068e1144J4016K0036j0614r692Ro040k2143j1982L141J9408L6938J5929n524
14055g662Q534J6176j1443l3013k0163K269O971j360K3315L5412j684n408N39
14042A2483k8499m1026n274K7801N869j7651K0269m55k0480k3472o876j30Q990
14029f8451R852j3180P979J7605J9258M858J6292j5146r930J7288J0631J1969
14017I025k7489n4520j3476J8140L6522L1515j7136k5381L3357k061j3736j1815
14005c7055k0035J191K3558J6806k7772p711q421L0322K5322K829j5769J0322
$$ y = [-37160, -28688, 13432, 11303, -12959, -32435, -58537, -74766, -70041, -58474, -29968, -31479, -43948, -23698, -7851, -9135, -49190, -84307, -74164, -36145, -23970, -68567, -86203, -72447, -51144, -37128, -17092, -27706, -37398, -37389, -43429, -65572, -77554, -74413, -55005, -18067, -2138, -7662, 872, 17048, 5605, -27408, -47571, -45302, -38331, -39691, -16376, 19036, 17352, 11944, 12483, -16016, -57042, -62316, -34515, -28646, -46297, -26028, -26483, -46963, -70435, -77311, -77441, -68451, -58599, -71779, -63800, -46195, -26937, -22079, -5787, -20933, -30863, -13575, -2944, 9025, -18464, -72984, -86460, -68320, -31798, -283, -17419, -42800, -9443, -11504, -25240, -37055, -57090, -55899, -32341, -15535, -43307, -51018, -59439, -29117, -3795, -966, -16735, -6413]
13993f413j3977N785K2555k9862l0988K7259K1228j9674k0138J0408O918o306
13981c3205J6329J1275Q399J6683R710k4426n4636l406N878k42K966K660j3125
13968e5140L058K666J6545M0146J8992k7960J1488K5068j0707r945N353j4895
13956D669k0860n589J8163j3331n534k234q146K4428J2628k0823j3074K1128K0835
13943A2260N498k4665j2773o930J7555j0945k4979O999L777L3218n876n450J5610
13930C299M899J3496P37l869k017R385j1404m102l6115o209J4481J1127p404j1956
13916b5652J0820r320p86N226L707k0874l68K9120l04o336J3407O387j0443J8878
13902A3462J6134J4038j3918k8175j9710J367j3914J2880J8665J3866J9190o049
$$ y = [-6413, -20390, -14605, 7950, -21912, -52900, -25641, -4413, -24087, -44225, -33817, -26899, -33205, -16876, -5601, 2798, 19481, 29191, 4765, -49871, -53277, -47399, -47641, -44675, -42015, -55140, -52082, -49416, -32871, 7275, 26267, -1693, 9795, 34863, 24156, 14211, 19564, 4669, -16191, -21780, -3617, -16948, -22482, -24716, -32862, -8434, 4194, -16629, -29703, -8575, 12260, 17758, -6907, -19680, -26610, -9055, -20000, -44979, -37980, -34203, -985, -6861, -12311, 3299, 8198, 21694, 22431, 18562, 16545, 25930, 14526, 10424, -25691, -31900, -17419, -6292, -13696, -25652, -14832, -24152, -24938, -19712, -16005, -36879, -37247, -8127, -8431, -14767, -1360, 5027, -5416, 13462, 29596, 43634, 29716, 1541, -18169, -16802, -30716, -17836, 829, 14695, 33885, 27836]
13890B7836l3682j4409j3512Q674K1839L97k5344J4076L5089O2k646K3077k9460
13877A1997k0258L646K3903K8107J5399m315J092N34J5181j383l9731m519J3720
13864D3373l954j2973L236M1482J4676N481J5430q823j5544n1929k2866r532j297
13851c240K1635K3322J3010j4087j3114j4400p06j6477n642q497Q147K7713K5744
13838D3408j0990j11M251k3831k4118N64R890L375K3104O840M977n340j3480j4272
13824D267n998l165K6436J9767J3316j2935j2808Q051N338K3208K0711L332j6546
13811G2974j1204L333J3601q906p687r191k130J6632P705j614q53J3428r556J1028
13797H7560M468j1960q651r380l538J3643K3931J4751L3101N7077M3284K2621
$$ y = [27836, -5846, -20255, -33767, -25093, -3254, -2857, -28201, -14125, 20964, 21026, 18380, 41457, 11997, -8261, -4615, 19288, 47395, 62794, 58479, 59571, 60105, 75286, 73903, 34172, 29653, 43373, 39419, 26446, 29682, 71164, 85840, 91321, 106751, 97928, 82384, 30455, 7589, -1943, -3240, 18395, 41717, 54727, 40640, 27526, 13126, 12420, -4057, -9699, -18196, -10049, 17664, 43408, 32418, 32307, 36558, 12727, -11391, -10827, -937, 2438, 25542, 32382, 37359, 32019, 18539, 4267, -1731, -4896, 21540, 41307, 54623, 41688, 28880, 36931, 42269, 65477, 86188, 89520, 72974, 61770, 65103, 78704, 69798, 62111, 52920, 50790, 67422, 75127, 73513, 72660, 86088, 76532, 87560, 92028, 80068, 71417, 62037, 58499, 72142, 96073, 110824, 143925, 201002, 244286, 266907]
13785B66907L3369L8240N8205M4761O8057J38018J37897J72957K16710K83787
13775A458908L57388M06626M50894N39812N58498N39975M24668L52122K62951
13766E351842Q3587j10277k37274l38814m21891n05057n24243m81613m44456l95301
13756A976503l33164k84859j81253j32721j55982j13993q2258r9322q3203m4707
13746D65041n5217o4547o1464j5803k9046j1453j9863j4780j6644q944k0679j6351
13734A30250j0686P800K146P190m167j2849k646k1958p99j5402J3276K6844Q319
13721A27318N020j0688k972L1942J9758J8359J6066M1589O3531J3055K3008O0675
13709D06661Q6242N3044L358K3511K007k9772k5489l9784p5802q3745j02353k7094
$$ y = [266907, 300276, 338516, 396721, 441482, 509539, 647557, 785454, 958411, 1175121, 1458908, 1816296, 2222922, 2673816, 3213628, 3772126, 4312101, 4736769, 5088891, 5351842, 5435429, 5325152, 5087878, 4749064, 4327173, 3822116, 3297873, 2816260, 2371804, 1976503, 1643339, 1358480, 1177227, 1044506, 888524, 774531, 692273, 592951, 509748, 465041, 409824, 345277, 283813, 268010, 238964, 227511, 207648, 192868, 176224, 167280, 146601, 130250, 119564, 127364, 129510, 136700, 132533, 119684, 117038, 95080, 94281, 78879, 92155, 118999, 127318, 132338, 121650, 118678, 150620, 170378, 188737, 204803, 246392, 309923, 322978, 345986, 406661, 492903, 545947, 549305, 572816, 574823, 545051, 519562, 479778, 403976, 320231, 217878, 190784]
13697A90784n807l5204m2696r079L0552Q366n609j3792k1369k0476j9046O524
13685F3148k9332l1436r189L7832J9116o861K4480j1306j2506r187k6897m2980
13673c5118o863L0490L1706J3710l1235k5652j2601J9642M2775J6627j5419k7579
13661D83J5013J1100j4944J1851j3643l7735K18l296j721L7096L1661m497p009
13648B4577l1515j2437P074P166k2794l6899l10K0601J7862L566j1875j3590j7213
13635f5787R66M1592K621J2354p431j4981N493k0696n580Q201r692k518J681j2962
13621f6739k392M093J9538R533n755K8142J7515L136j6876l1383k165K9410L1452
13608A7509j5476k124L742j9009j4363q822p234o480J8770K0478j955p435Q850
$$ y = [190784, 184977, 149773, 107077, 97998, 128550, 136916, 131307, 117515, 96146, 75670, 56624, 63148, 33816, 2380, -6809, 31023, 50139, 43278, 67758, 56452, 43946, 34759, 7862, -35118, -41981, -11491, 20215, 33925, 2690, -22962, -35563, -15921, 26854, 43481, 28062, 483, 15496, 26596, 11652, 23503, 9860, -27875, -27657, -30953, -32674, 4422, 36083, 31586, 24577, -6938, -19375, -12301, -5135, -27929, -64828, -65138, -44537, -26675, -23109, -34984, -48574, -65787, -64821, -23229, -20608, -8254, -15685, -30666, -25173, -45869, -51449, -43248, -52940, -55458, -53777, -66739, -69131, -65038, -45500, -35967, -41722, -13580, 3935, 7071, -9805, -41188, -43353, -13943, 17509, 2033, -91, 3651, -15358, -29721, -38543, -45777, -52257, -33487, -13009, -14964, -22399, -13549]
13595a3549k2248J2735p654p170J8026L3048j8973p438K0496R427m338j3305l014
13582c957K369j906k0799k8650j3468J0711L1030J3558K1576J6067M199l0201
13570E29l3236M91N421J1002l7435j705K4222K8838K057J2525k285J3302k3709
13557A7j7521k3885j2474K3182K1389q930J353M204Q423L746p84N2262p859k7564
13543A5559k3730k0028j3504J7116J1005Q123J0214q162k0979L2083J1393k0577
13531a487R843J2106k0575J0749k4037m1263o306K8885J0377J6068J2912K200
13519I472p623k6514R579K3770j4171M354K282N206k3519Q400O048j9413j2294
13506c4423L1558J8478N645K9578M777l1915j1053k9747L09M832j1343k8400R924
$$ y = [-13549, -35797, -23062, -30716, -37886, -19860, 13188, -5785, -13223, 7273, 16700, 12362, -943, -3957, -1588, -3494, -24293, -52943, -66411, -55700, -24670, -11112, 10464, 26531, 30730, 529, -32707, -32216, -26795, -15793, -53228, -54933, -30711, -1873, 184, 12709, 10424, 23726, 17, -17504, -41389, -53863, -30681, -9292, -18222, -16869, -12665, -4242, -496, -1280, 50982, 43123, 15559, -8171, -28199, -41703, -24587, -13582, -5459, 4755, -3407, -24386, 7697, 19090, -1487, 8356, 20462, -113, 10636, -13401, -54664, -60970, -32085, -21708, -5640, 7272, 9472, 1849, -24665, -15086, 8684, -5487, -1133, 1149, 6355, -17164, -8764, -2716, -22129, -34423, -2865, 15613, 21258, 50836, 55613, 23698, 12645, -17102, -16793, -11961, -23304, -51704, -41780]
13493d1780L6820N382l1604Q452K4882j7357j6486K2476K1313j988N789j4548
13481A351K0112R797j3022j5636k798o269Q372p0l2844J216J7031K1706J0148
13468A9094r220J1277K3538j8150l6176j2939j5156k201M331K0443j0332J2022
13456a3469l106n34L6977K2034j9242O687j6619m810j958r925l334o588p602J3070
13442h419K0499N367o825l375K1965j3602j3610j8199J5269J8445k3798p424K9117
13429A5410l525o214k3018l513J0456K449k0271k1327j2074j4026J097K1317O739
13416d6500K2610K0323o768O96k3531J9859L0447K4699j0491j9858P865J0189
13404B9540m22l480k2371j0012M994J9796Q636q789m3770O972L2268n61j3063
$$ y = [-41780, -4960, 422, -31182, -22730, 2152, -15205, -31691, -9215, 12098, 10110, 15899, 1351, 21463, 31260, 18238, 2602, -196, -6465, 1907, 1837, -31007, -29791, -12760, 8946, 19094, 9874, 21151, 44689, 26539, -9637, -22576, -37732, -39933, -35602, -15159, -25491, -13469, -16575, -17109, 19868, 41902, 22660, 29347, 12728, 7918, 5960, -3965, -7299, -13887, -21489, -8419, 12080, 17447, 10622, 7247, 29212, 15610, 2000, -16199, -930, 17515, -6283, -13707, 15410, 11885, 5671, -17347, -20860, -10404, -7955, -28226, -49553, -61627, -75653, -74556, -53239, -46500, -23890, -3567, -10335, -9639, -33170, -13311, 17136, 41835, 31344, 11486, 19351, 29540, 29118, 25638, 3267, -6745, -1751, 18045, 26681, 17892, -25878, -18906, 13362, 12801, -262]
13391b62J6630l760J5257J4513n427j2446J5514k8265K0698J0278k7894j3711
13379A125O775j528j2718J9916n2j2178K6032k18L75J3352j4655r845J2673K660
13365C1714j8266k0081J67J7462J703r686O801o789L3989q513k1088o905J2645
13352A3153r133m06M681k915j8179j5077k912K8100K60L951J3130J359n745j6363
13338f096p713o6j0421j6549L572K272J125n315L0458J8783k5401p68O924p964
13324a7159j3225J4985J5975P436m0879k1094K2353L7467J4325J4145O45p873
13312B7101k2871L054Q519J443j4838k8081J5215K2796J4244k965k2692j1529
13300a0604n413J0172M884O973J1542o079q058l130p813J062k054Q189J4349L921
$$ y = [-262, 16368, 12608, 27865, 42378, 36951, 24505, 40019, 11754, 32452, 42730, 14836, 1125, 7900, 6372, -6346, 13570, 13518, 1340, 27372, 27154, 27529, 40881, 26226, 16381, 29054, 31714, 13448, -6633, -6466, 10996, 12699, 3013, 9814, 3025, 37014, 28501, 7413, 508, 13153, 4020, 3614, 8295, 5380, -12799, -27876, -30788, -2688, -2428, 1523, 14653, 16012, 10267, -6096, -13809, -13875, -24296, -40845, -37273, -35001, -33876, -39191, -8733, 10050, -15351, -16119, -9195, -17159, -30384, -15399, 576, 8012, -32867, -53961, -31608, 5859, 20184, 34329, 34974, 27101, 4230, 7284, 15803, 17246, 2408, -25673, -10458, 12338, 26582, 23617, 925, -10604, -16017, -5845, -961, 6012, 17554, 11475, 3417, 287, -7526, -6464, -8518, -329, 14020, 17941]
13286A7941q772m715N400J7092L1132j8610j2852j9754k0191l9461J0421J2560
13274b9809J3323j558R412j176R461Q210R484k037p635k5582Q543j8643J9901
13261h106K5603J8R73l27l6440q203L911m598j6247p562K7865R958l0333K7477
13247a6011L2546K4135j1013p936j0467j1047Q283k030O522N616j0985M885K3750
13234C6248N077k558k1254r658k4336m3407L863K1508j2072O867m096K540K554
13221c8724J2491j4827J1151J1261K3452J2435m31K2018K7276P666j7918l7189
13209A8661j5353J5471M587k2165K167O36j8055j2820m437J4888L2754N990K780
13196B5104j0931R009k146j1066L0553r868l3589m750J155M0213K4451j149J4422
$$ y = [17941, 9169, 4454, 9854, 26946, 58078, 39468, 26616, 6862, -13329, -52790, -42369, -29809, -16486, -18044, -8632, -9808, -347, 7863, 17347, 15310, 7675, -17907, -9364, -28007, -8106, 17497, 17515, 18488, 18161, -18279, -26482, -22571, -27169, -43416, -50978, -23113, -13155, -43488, -16011, 16535, 40670, 29657, 21721, 11254, 207, 8490, 6460, 12982, 18598, 7613, 12498, 36248, 41325, 38767, 17513, 7855, -16481, -59888, -56025, -34517, -46589, -39722, -43818, -41278, -38724, -26233, -41060, -29909, -18648, 4804, 17239, 16808, 38826, 66102, 73768, 55850, 18661, 3308, 18779, 23366, 1201, 3368, 4004, -14051, -26871, -31308, -16420, 16334, 22324, 25104, 14173, 23182, 21036, 9970, 40523, 30655, -2934, -7684, -6529, 33684, 58135, 56986, 71408]
13183G1408k6294k9409J0437K898N173N475j1604j5588J0595K1464o229k262M692
13170D0756j648j61O238j1885k8996K012n332n945l2996J0083M5626J5795l3615
13157f8j2345J2613N396r578K8176j4582m709j8637O846J7602K615j2519k0081
13144a9271P919J0175J3035L404J2417K9583K0820J4024o213m1065k2547j5756
13132F525Q517J993q922M321j1573J3766J6232M46M877m142N369J2485R530k9795
13118B9629P087K494j3799L492N148j8476o920K285o668r531K2780N418j9089
13105C850J038k763R572M924p28Q693J3909p947j7543j6122n11j899j6996K5735
13091C212K6057O675j6229j4907J6231K3N660k808M34j3340J4026J2240m961j9479
$$ y = [71408, 45114, 15705, 26142, 29040, 34213, 39688, 28084, 12496, 23091, 44555, 38326, 36064, 40756, 39108, 38947, 45185, 33300, 4304, 6316, 984, -4961, -37957, -27874, 17752, 33547, -68, -12413, 200, 5596, -3982, 24194, 9612, 4903, -13734, -6888, 10714, 13329, 810, -19271, -11352, -1177, 11858, 15262, 27679, 57262, 78082, 92106, 85893, 44828, 22281, 6525, 15042, 17035, 8113, 12434, 861, 14627, 30859, 31305, 36182, 32040, 37409, 49894, 59424, 29629, 36716, 39210, 25411, 28903, 34051, 15575, 8655, 10940, 4272, -5259, 17521, 22939, 3850, 4888, 2125, 11697, 16621, 15893, 24586, 38495, 30548, 13005, -3117, -3628, -5527, -22523, 3212, 29269, 35944, 19715, 4808, 21039, 21062, 26722, 23914, 24348, 11008, 25034, 37274, 32313, 12834]
13077A2834j853N723m862P497J738l094J1629n752J9647K87r533J8091k053l8628
13063A1671R64L514O965J6365K3144P369j771J2484O04o24k8150j2138k4719k5886
13049a0208L678K0954J0502K2790O8l269j0128j7272p287J0676J0612R954n520
13036C5550K1080N533R469J704P438K9983p708o789J834j2983o384k1548k2257
13023C4922J5880R25k7475q437J2107j495j4075K5847R309m419N0970K6710k5683
13010I5086J0797j7081l1911k0316J0067J9798k750O245P477n547q446J1119K6572
12997A01110K6801K4950M550J2146j8898J6509K815J461k0941k0101k6188J265
12985A05479K854q882J6784K556j0343l340j3614j5373l428j2597L158P375q760
$$ y = [12834, 10981, 16704, 11842, 19339, 21077, 17983, 29612, 23860, 43507, 43794, 34261, 52352, 50299, 11671, 12635, 16149, 23114, 39479, 62623, 69992, 68221, 80705, 81309, 80685, 52535, 40397, 15678, -10208, -6530, 14424, 24926, 47716, 47784, 44515, 34387, 17115, 9828, 20504, 31116, 41070, 35550, 56630, 62163, 71632, 73336, 80774, 110757, 103049, 96260, 98094, 85111, 78727, 57179, 34922, 50802, 51727, 24252, 15815, 27922, 26427, 12352, 38199, 47508, 43089, 94059, 120769, 95086, 105883, 88802, 56891, 36575, 46642, 66440, 63690, 69935, 77412, 71865, 63419, 74538, 101110, 127911, 152861, 157411, 169557, 150659, 167168, 169983, 171444, 150503, 130402, 104214, 105479, 108333, 99451, 116235, 118791, 108448, 105108, 91494, 76121, 72693, 60096, 63254, 70629, 61869]
12972F1869j1079J653l0134q305J9383J1163o358j2218K0263P626q627o261l4936
12959D039j876L2987L0214k3485o730J2660Q809M552j3898j2948j796R813J9971
12946F2312l285L281J3015J6138l37k1312l6409J5091J9438K1071r859q762Q031
12933G8413l2003m199J886j4697L312K7463J4457j2213l90k450J329J7515j5495
12920F2928j1708K0271J3632k2814k8730O629J8677L665k5803r109J4598J3076
12908E5312N317o101j7222M753r613k0327j7382L4946K2064L1069J9152O580n193
12895A03355k0361P714r827O73O738J5780j0902j8698q088L172J88K0996K219
12882I2959K7559K2861j8120l850L0912O663J4549j4707K07M420p425j5490J089
$$ y = [61869, 50790, 52443, 22309, 14004, 33387, 44550, 38192, 25974, 46237, 53863, 45236, 38975, 4039, 2163, 35150, 65364, 41879, 35149, 47809, 56618, 61170, 47272, 34324, 32528, 42341, 62312, 59027, 62308, 75323, 91461, 91124, 69812, 33403, 48494, 67932, 89003, 79144, 70382, 78413, 46410, 42211, 44097, 29400, 32712, 60175, 74632, 62419, 62029, 59579, 60908, 78423, 62928, 51220, 71491, 85123, 62309, 33579, 40208, 58885, 62550, 36747, 27638, 42236, 55312, 60629, 54528, 37306, 42059, 32446, 12119, -5263, 29683, 51747, 82816, 101968, 108548, 103355, 82994, 90708, 80881, 81554, 88292, 104072, 93170, 74472, 66384, 69556, 69744, 90740, 92959, 120518, 143379, 125259, 121409, 152321, 158984, 173533, 158826, 159033, 163453, 156028, 140538, 141627]
12869A41627N219j972j811L899k4023m974n936q576K5427J0033l946k5838o308
12856A02821j5338o796p87O8J114p182k3305M261J8901j14J2312N707m1383R037
12842E9316J3958l1660m4419K7328L5717k837K7769k26r834j6898n445J0932K5212
12829H8913J2112k1292N617J0602j4972j6034N469J4671J3064J971j1765r323
12817G9033J0105P70n768j6031N110N443J9072Q376l289J7162L0316k2534k5163
12804A02602o429M664J5746k296J3049p07k9374J4448J0722J026K7431Q320j2203
12791A46999O564M795q04j8264j0260J3943m914l1214k4780j8207L574O249N801
12778G9482K2768j289q491N826R810p003L942k46K6486j6959k1978p130m211L618
$$ y = [141627, 146846, 144874, 143063, 146962, 122939, 117965, 112029, 103453, 128880, 138913, 134967, 109129, 102821, 87483, 80687, 79900, 79968, 81082, 73900, 50595, 54856, 73757, 73643, 85955, 91662, 50279, 59316, 73274, 41614, -2805, 24523, 60240, 57403, 85172, 84946, 75112, 58214, 52769, 63701, 88913, 101025, 79733, 85350, 95952, 80980, 64946, 70415, 85086, 98150, 100121, 88356, 79033, 89138, 89908, 84140, 68109, 73219, 78662, 97734, 106110, 102821, 119983, 150299, 127765, 102602, 96173, 100837, 116583, 114287, 127336, 126629, 97255, 111703, 122425, 123451, 150882, 159202, 146999, 153563, 158358, 157554, 139290, 129030, 142973, 138059, 106845, 82065, 63858, 67432, 73681, 79482, 102250, 100961, 92470, 98296, 108106, 101103, 105045, 104799, 131285, 114326, 92348, 85218, 81007, 84625]
12764H4625J8270J7842J5654j2290k0994j3889k335J2483J4872p937l895J023
12752A03429J8436L0582M5o937l248k4941k4372j2438j8472J2424K7791J5819
12740A18118K4942L779n117J426N798j5126r941P20P563O324m357p81l762j8889
12726A10697m693N388j7195j4518j5119L0121K0489n380M561J8576Q497M07P42
12713A42573N112J0528J2020j5411l673j404m1476k5769J9769J6540J9459J626
12701A39894o137J491J2818N983o84k8670J4163J7407j1370j5291J4146J9613
12689A63363o264k3350j634o261Q105K445n371K856j841J3411r785j6542k0375
12676I8757j120Q933J8320K5925K3323m274l2924m0p14k08K2931J3501J659Q956
$$ y = [84625, 102895, 120737, 136391, 124101, 103107, 89218, 86883, 99366, 114238, 106301, 102406, 103429, 121865, 152447, 152492, 145555, 142307, 117366, 92994, 80556, 62084, 74508, 102299, 118118, 143060, 146839, 141722, 143148, 148946, 133820, 123879, 124599, 132162, 138486, 134129, 133348, 129586, 110697, 106004, 111392, 94197, 79679, 64560, 94681, 115170, 109790, 114351, 132927, 141424, 141831, 142573, 147685, 158213, 170233, 154822, 151149, 149745, 108269, 82500, 102269, 118809, 138268, 139894, 133757, 135248, 148066, 154049, 153365, 124695, 138858, 156265, 144895, 129604, 143750, 163363, 157099, 133749, 132115, 125854, 133959, 136404, 131033, 133889, 132048, 145459, 135674, 119132, 98757, 97637, 106570, 124890, 150815, 174138, 169864, 136940, 136900, 136186, 135978, 158909, 172410, 174069, 183025]
12662A83025M653k3709j8128Q068J2069J0348K0537p677M159j5253m843J2610
12650A85859j0944j9371n545j2803l761L112Q91K4995K0727k7747k2920M819L534
12637A40846j0830l820J8560P979R25M6691J175k3475r50J6295P871J665J9644
12624B22576R063j7314k663k386j2003r066k6389j7978n38L0467J8243k924q871
12611A80217N4J7829j845r504J9266k3403j5162p849k609M1059j040k3752j5537
12598A57724J5125J9585M1718O976k3676J2626L0701J2139j1711j4706j2481j882
12586B32138j218K2000l705j4131j392M246n006L166j1598J2104k2498k4572p844
12573A81690L2223J5254j657J0594j977J1355o374l0062l0044J1355R716K0315
$$ y = [183025, 187678, 163969, 145841, 153909, 165978, 176326, 196863, 189186, 193345, 178092, 173249, 185859, 174915, 155544, 149999, 137196, 133435, 136547, 137438, 162433, 183160, 155413, 132493, 137312, 140846, 130016, 126196, 144756, 152735, 153660, 200351, 201526, 178051, 177101, 193396, 201267, 202932, 222576, 231639, 214325, 211662, 209276, 197273, 188207, 161818, 143840, 143302, 173769, 192012, 189088, 180217, 180271, 198100, 196255, 186751, 206017, 182614, 167452, 159603, 156994, 198053, 197013, 173261, 157724, 172849, 192434, 234152, 241128, 217452, 230078, 260779, 272918, 261207, 246501, 234020, 232138, 230920, 252920, 249215, 235084, 233692, 237938, 232932, 236098, 224500, 236604, 214106, 189534, 181690, 213913, 229167, 227510, 238104, 236127, 247482, 241108, 211046, 181002, 192357, 202073, 222388]
12561B22388J6181M556j3637m1534M601J2807L6045n021r966o279j1557j9585
12549A88999J0263n381p449K3036J9092K1135k6059M614K4355m761q080j9420
12537B20344J4373N965o658L085P838O428j6070J6559J2799J3502R095j307J7789
12524C03742J584k3583k737j0632p774j7178k5926L2003L7599j3140k1974j812
12512B50172j368o928n837J0935J576J7349L6756o268k5551k1329o372L2408L0894
12499C06437j1413j2811j3656J006l177N714K321j8498J9686J094n810J6090P594
12486B94577k7625J4512L0011J039l2907J0773L4922J0310j0197K101L4814Q50
12474C63180k6438j9929J4979J1722K6099o353j2384j8022Q809K1064J1952r146
$$ y = [222388, 238569, 243125, 229488, 187954, 192555, 205362, 241407, 236386, 226420, 220141, 208584, 188999, 199262, 193881, 186432, 209468, 228560, 249695, 223636, 228250, 252605, 247844, 239764, 220344, 234717, 240682, 234024, 237109, 244947, 251375, 235305, 251864, 264663, 278165, 287260, 285953, 303742, 305326, 281743, 279006, 268374, 260600, 243422, 217496, 249499, 287098, 273958, 251984, 250172, 248804, 241876, 236039, 246974, 248550, 265899, 302655, 296387, 270836, 249507, 243135, 275543, 306437, 295024, 282213, 268557, 269563, 266386, 272100, 274421, 255923, 275609, 276703, 270893, 286983, 294577, 266952, 281464, 311475, 312514, 279607, 290380, 325302, 335612, 325415, 327516, 362330, 363180, 336742, 316813, 331792, 343514, 369613, 363260, 350876, 332854, 341663, 362727, 374679, 365533]
12462C65533k3195q268J5293K1241j2603j2433j1048O07n88o96L363L8325N5229
12449D30760K7855l5399j2171m1602k6259j0198N937L8590K3883n407K1938J7579
12437D35506L0345l680L701k5871L805k927j995n21r56J1547M1525K4355Q535
12424E23369P819n657J1529K3222M929j1409k818m0615k1984M118J8726l957J431
12411E08703M410k649J0563J0307k581q815l0778j0761J6622N998K0144N883J736
12398E28782j9915j1101P430J9669L0997k3320j8599K5693L0556P222O043O814
12386E90271j1198k0922M950J1802m268M31K324O954n179k0638j017M2528K1607
12373F17645o038p485K6702K1378J3709Q119J8194Q831L3261M9267O6792O1154
$$ y = [365533, 342338, 334070, 349363, 370604, 358001, 345568, 334520, 335127, 334539, 333843, 337206, 375531, 430760, 458615, 423216, 411045, 369443, 343184, 332986, 338923, 377513, 401396, 395989, 417927, 435506, 465851, 462171, 465872, 440001, 443806, 440879, 438884, 438363, 437407, 448954, 490479, 514834, 523369, 531188, 525531, 537060, 560282, 565211, 553802, 550984, 510369, 488385, 492503, 511229, 507272, 508703, 513113, 510464, 521027, 531334, 528753, 519938, 489160, 478399, 495021, 501019, 521163, 527046, 528782, 508867, 497766, 505196, 524865, 555862, 532542, 513943, 539636, 570192, 577414, 583457, 590271, 579073, 558151, 563101, 574903, 570635, 571066, 573390, 580344, 575165, 554527, 553510, 596038, 617645, 611607, 604122, 630824, 652202, 665911, 674030, 692224, 701055, 734316, 783583, 850375, 911529]
12361I11529Q6249O9304O1189M8269J1712n7576o2764l7736q751k257l7998k1606
12349I59564k2347o956J7970K6279l162J3880M1613L3134K6459j6749q921K8701
12337A089465L4686K4061k183J7639M1751K8342J0160j2266j8386J2326M3403
12326A268998N1774Q9245P2775R0462J29113J36596J22585N6676K4321O9731J11058
12315B223334P775j38056k08103j68547o8326m0934k3442n4789n1385l6756j697
12304A439074m967k4006l0772p238J1552k634n4304o0350k6007Q159K2707j5459
12292A255755j1761q486J819M1l0583j7484k777J1859J3210L5278K7096J9858
12280A293825O1401N0528M5192O156m1247j2335K1953K2591r2767j32225q9155
$$ y = [911529, 997778, 1067082, 1128271, 1176540, 1188252, 1130676, 1067912, 1030176, 1021425, 1019168, 981170, 959564, 937217, 930261, 948231, 974510, 971348, 985228, 1026841, 1059975, 1086434, 1069685, 1060764, 1089465, 1124151, 1148212, 1146029, 1163668, 1205419, 1233761, 1243921, 1231655, 1213269, 1225595, 1268998, 1320772, 1410017, 1482792, 1573254, 1702367, 1838963, 1961548, 2018224, 2042545, 2112276, 2223334, 2231109, 2093053, 1884950, 1716403, 1648077, 1607143, 1583701, 1528912, 1477527, 1440771, 1439074, 1434107, 1410101, 1379329, 1372091, 1383643, 1381009, 1326705, 1266355, 1240348, 1248507, 1271214, 1255755, 1243994, 1235508, 1237327, 1237368, 1206785, 1189301, 1186524, 1198383, 1211593, 1246871, 1273967, 1293825, 1355226, 1405754, 1450946, 1457102, 1415855, 1403520, 1425473, 1448064, 1355297, 1223072, 1133917]
12269A133917l1459J4557N555j0870k009n969q354k8109l754K3338O651j7014
12257A076480N441n522k4285k6823K950J6162K4837p361J7502K82Q105K9077J1578
12244A128423l2543k9585K233K0990L8362K7147K7908N6320M1813j8303N7875
12233A320640J25882J49661J37175P8939O3974O8534P8586Q876q0649j50414j48733
12222A652471j25579o9665k6514J4991l915J9201j5916m3251m989l131r176Q186
12210A392713j002j160P710j2502K3041l972J5342M4478J7370L1579M7919K7389
12198A588905k4971N275M4716K0069O8330O7493J13783J58491J92860K68144L82337
12187B885432M40025L57048K42009J59113J78919J27441j02046n17420o24801
$$ y = [1133917, 1102458, 1117015, 1122570, 1111700, 1109691, 1103722, 1095368, 1067259, 1063505, 1086843, 1093494, 1076480, 1081921, 1076399, 1052114, 1025291, 1028241, 1044403, 1069240, 1061879, 1079381, 1079663, 1087768, 1116845, 1128423, 1095880, 1066295, 1068528, 1089518, 1127880, 1155027, 1182935, 1239255, 1281068, 1262765, 1320640, 1446522, 1596183, 1733358, 1812297, 1876271, 1944805, 2023391, 2032267, 1951618, 1801204, 1652471, 1526892, 1457227, 1430713, 1445704, 1441789, 1460990, 1445074, 1401823, 1396834, 1393703, 1384527, 1392713, 1391711, 1390551, 1398261, 1385759, 1408800, 1404828, 1420170, 1464648, 1482018, 1513597, 1561516, 1588905, 1563934, 1569209, 1613925, 1633994, 1702324, 1769817, 1883600, 2042091, 2234951, 2503095, 2885432, 3325457, 3682505, 3924514, 4083627, 4262546, 4389987, 4287941, 3770521, 3145720]
12178C145720m08004k64623j61789j01966m4495j7781j9786l2959n6039m2132
12168A996146j3832j5956m8460j8128L126j378j18K1523M0433J8376K3941L5959
12156B041632R756R246J3155L7785K2477N5204O4976N2955J26071J51303J76467
12145B761027K62188L87292M25065M01971K71840J51750J29212J30160J495l85358
12135D536642o33038n06322l19409j76445j01429m9217l6301l9075m4625k4794
12125B605987k8106m1869j543Q804j1495k1331J1215k42l416j803r539J7326K3052
12112B547040K7197K3700J5080L2136O6975K3530K0867L3782L2674N6479Q3215
12101B962675J09236J14244J33302J58694J42923Q6332N0764N3606j0877j13209
$$ y = [3145720, 2737716, 2473093, 2311304, 2209338, 2164843, 2147062, 2127276, 2094317, 2038278, 1996146, 1982314, 1966358, 1917898, 1899770, 1902896, 1901518, 1901400, 1922923, 1963356, 1981732, 2005673, 2041632, 2051388, 2060634, 2073789, 2111574, 2134051, 2189255, 2254231, 2307186, 2433257, 2584560, 2761027, 3023215, 3410507, 3835572, 4237543, 4509383, 4661133, 4790345, 4920505, 4922000, 4536642, 3903604, 3397282, 3077873, 2901428, 2799999, 2750782, 2714481, 2675406, 2630781, 2605987, 2577881, 2536012, 2534469, 2543273, 2531778, 2510447, 2521662, 2521420, 2518004, 2516201, 2506662, 2523988, 2547040, 2574237, 2597937, 2613017, 2645153, 2712128, 2735658, 2756525, 2790307, 2822981, 2879460, 2962675, 3071911, 3186155, 3319457, 3478151, 3621074, 3707406, 3758170, 3811776, 3800899, 3687690]
12091C687690j89235j63698j06440l2197j6693J5220q92k8476r732J2857r129
12080C159275J4412K1764K8726K8592k514J4906J33r056Q310J9442J6185R104
12068C309279Q078J8939J9397L2217M2711M8057K1641K1668m512q074J6966o827
12056C519540L674K5696M5992M694P58J4676J9736M2132J6749J2670L7071J3425
12044C756813J6306L0389L9434J8820J2875M024N688q481Q716L3628j2365M614
12032C910461J8822L8627J2393L020R074o250j6695M112J4589O809L4162J3476
12020D042600P833J6627J2856K6398J9783P062j2656l332j3184M902J3592J2815
12008D135296j0112r703p958L640J5697K3905K9273k9658l0356o132j2877J569
$$ y = [3687690, 3498455, 3334757, 3228317, 3196120, 3179427, 3194647, 3193755, 3165279, 3155547, 3168404, 3159275, 3173687, 3195451, 3224177, 3252769, 3250255, 3265161, 3265294, 3256238, 3264548, 3283990, 3300175, 3309279, 3317357, 3336296, 3355693, 3387910, 3430621, 3478678, 3500319, 3521987, 3517475, 3509401, 3526367, 3519540, 3523214, 3548910, 3594902, 3599596, 3600354, 3615030, 3634766, 3676898, 3693647, 3706317, 3743388, 3756813, 3773119, 3803508, 3842942, 3861762, 3874637, 3878661, 3884349, 3875868, 3884584, 3918212, 3905847, 3910461, 3929283, 3967910, 3980303, 3983323, 3992397, 3986147, 3969452, 3973564, 3988153, 3994962, 4029124, 4042600, 4050433, 4067060, 4079916, 4106314, 4126097, 4133159, 4120503, 4117171, 4103987, 4108889, 4122481, 4135296, 4125184, 4115481, 4107523, 4111163, 4126860, 4150765, 4180038, 4150380, 4120024, 4113892, 4101015, 4102584]
11996D102584m670J7839K2772J8698k05n4926k4994L077j159j0356K274j0799
11984D060135o681P366J2822j5435k3319k1113k2635m769M94n954k4019j5308
11972C941584J3445J472k7524k3004j9207l1034k1417q686j2460q933q620j2778
11960C782838k8346m1239M803J7394N142k3502k2900j8081l9270J8159p38j4136
11948C640124j6403j4484l5516l9986q051J0904j1074m6183m9358j2835N289Q734
11936C431161j9284m6810p3505m1740k4939j5870j4659J6422j0440k1845j1687
11925C166804k9110l5515p659l844l9341l7727j1829q789l5138l0727k4690J0106
11913B912541J6770J0047j3992o1045o6942j7037j6250j3616k2409j5050l3014
$$ y = [4102584, 4097914, 4115753, 4138525, 4157223, 4157018, 4102092, 4077098, 4080175, 4079016, 4068660, 4070934, 4060135, 4053454, 4060820, 4073642, 4058207, 4034888, 4013775, 3991140, 3986371, 3986865, 3980911, 3956892, 3941584, 3955029, 3956501, 3928977, 3905973, 3886766, 3855732, 3834315, 3825629, 3813169, 3804236, 3795616, 3782838, 3754492, 3713253, 3718056, 3735450, 3740592, 3717090, 3694190, 3676109, 3636839, 3654998, 3654260, 3640124, 3623721, 3609237, 3573721, 3533735, 3525684, 3536588, 3525514, 3479331, 3429973, 3417138, 3422427, 3431161, 3411877, 3365067, 3291562, 3249822, 3224883, 3209013, 3194354, 3210776, 3200336, 3178491, 3166804, 3137694, 3102179, 3094520, 3090676, 3051335, 3013608, 3001779, 2992990, 2957852, 2927125, 2902435, 2912541, 2929311, 2939358, 2925366, 2864321, 2797379, 2780342, 2764092, 2750476, 2728067, 2713017, 2680003]
11902B680003k6444k7141k1881j8518l854j0337J3251J554k9660j9858L691j1070
11890B529736l3285m1109j5919k8210j1435J641k0844k1126K568m0755j6588k1384
11878B283290r767J6545r25N929j1795j5896j8167K9815J19270J13955J45528
11867B657782J62738J15311P3738L8407M1707J6585j82739l15713k58813j16341
11857B232662p1699q633m1688k0242m6773p2143n5091m3181l8005k0533K1636
11846A836310k2006l6893m615j3801k4635k9998j6861j8554k6262o308l3287l1107
11834A571983J2221L2864o432l0134m0831j5835K517l141k9334l1714n715r843
11822A446606L1275P344l0407j9295k2847j4610k4110J077q312j9092j0471j0259
$$ y = [2680003, 2653559, 2626418, 2604537, 2586019, 2582165, 2571828, 2585079, 2586633, 2556973, 2537115, 2540806, 2529736, 2496451, 2455342, 2439423, 2411213, 2399778, 2401419, 2380575, 2359449, 2362017, 2321262, 2304674, 2283290, 2273523, 2290068, 2289143, 2295072, 2283277, 2267381, 2249214, 2279029, 2398299, 2512254, 2657782, 2820520, 2935831, 3009569, 3047976, 3089683, 3106268, 2923529, 2607816, 2349003, 2232662, 2160963, 2152330, 2110642, 2090400, 2043627, 1971484, 1916393, 1873212, 1835207, 1814674, 1836310, 1814304, 1777411, 1772796, 1758995, 1734360, 1704362, 1687501, 1668947, 1642685, 1636377, 1603090, 1571983, 1584204, 1617068, 1610636, 1580502, 1539671, 1523836, 1526353, 1523212, 1493878, 1462164, 1456449, 1446606, 1477881, 1485225, 1454818, 1435523, 1412676, 1398066, 1373956, 1375033, 1366721, 1347629, 1337158, 1326899]
11810A326899m335j651J796O559j5759j7128j7852j1412j7832K248j2121j5287
11798A224125l2468k8801q644J3370j697l7595r371k3603p379j8895K9540K640
11786A101222k848o975P181k7738M738J7232J2472l7513k9471k0490K1925J4595
11774A054330k3106k9668k6280q55M16j3140O804M732o63L4091q710l8032k7438
11761I32481n483J0774k7794l0641q849j0247N415K3449n25m193j1358o602j6009
11748H50418R424k6375k493J848J431o730k551r201L39j934n446j5507m1298k468
11734G49457J8511R598n758r770k6577q261J2095L211K303k4250L0716J2328j2595
11721G51008j0674j1844o144N973k5891l2474O83K1936k394k1246M398R244O056
$$ y = [1326899, 1322564, 1320913, 1322709, 1329268, 1313509, 1296381, 1278529, 1267117, 1249285, 1251533, 1239412, 1224125, 1191657, 1162856, 1154212, 1167582, 1165885, 1128290, 1118919, 1095316, 1087937, 1069042, 1098582, 1101222, 1098374, 1091399, 1098580, 1070842, 1075580, 1092812, 1105284, 1067771, 1038300, 1017810, 1039735, 1054330, 1031224, 1001556, 975276, 974421, 974837, 961697, 968501, 973233, 972570, 1006661, 997951, 959919, 932481, 926998, 937772, 909978, 879337, 870488, 860241, 865656, 889105, 888580, 884387, 873029, 866427, 850418, 859842, 833467, 830974, 832822, 834253, 827523, 824972, 815771, 816110, 814176, 808730, 793223, 751925, 749457, 767968, 777566, 771808, 762038, 735461, 727200, 739295, 742506, 744809, 720559, 751275, 763603, 751008, 740334, 728490, 722346, 728319, 702428, 669954, 670637, 692573, 690179, 668933, 673331, 682575, 688631]
11708F88631p937r027j6433k9870m996K5842K2485k0836k1728j1137n411L618
11696F13201j5782R606R865j7775K27l0194K0133J3173r632L693M720J8680j8239
11683F01676k5489o681k0175j9893k1903o047K8561J844l9460k4078M851L165
11671D76371J1339L1140J030j3913L736Q489j9988o354K932m276L189P248R168
11658E10111J4521p655k7618r653k8516j2609n11p41M114m120J5620J5810J1518
11645D80271j2282l6414R971O685L374M055j4149k0306J3533k5292k5216Q25L141
11632C88196Q065M498J027j835j2207j720J3507j3679j126K5158J7584j9542j9524
11619C88402o386r400j8799j3615Q134J9984J2049o519J2028j1621n359K82q576
$$ y = [688631, 680694, 671667, 655234, 625364, 620368, 646210, 668695, 647859, 626131, 614994, 609583, 613201, 597419, 607025, 616890, 599115, 599342, 569148, 589281, 602454, 592822, 596515, 601235, 619915, 601676, 576187, 569506, 549331, 529438, 507535, 501488, 530049, 531893, 492433, 468355, 473206, 476371, 487710, 518850, 519880, 505967, 509703, 518192, 498204, 491850, 494782, 490506, 493695, 500943, 510111, 524632, 516977, 489359, 479706, 451190, 438581, 438070, 437329, 441443, 437323, 452943, 468753, 480271, 467989, 431575, 441546, 448231, 451605, 455660, 441511, 421205, 434738, 409446, 384230, 385055, 388196, 396261, 400759, 401786, 399951, 387744, 386024, 399531, 385852, 384726, 409884, 427468, 407926, 388402, 382016, 372616, 353817, 340202, 348336, 368320, 380369, 373850, 385878, 374257, 368898, 369180, 360604]
11606C60604j5904K144R383J5336k4670O211j1515J6994J6492l0200j9865J4035
11594C39045J8930l1065j406O573J7096O366o997k2478l112N060j5375n934J1877
11581C18580j408J859J063P567k357j8451j8272k367j6267o475J9075J1549M849
11568B98945k5580J1608P188Q684J535k4273l946L160J9737J2848j3828l0007
11556B66071k986m381K3347P891j8865j4331n414Q179j4543q177J0578k198j5366
11543B29805r243N238j3248q332n999P581o336j1623M078R136K4436K0051o505
11530B39039k726J1738K5291J4087N857k1781j1962j0189n980l2470j218K3722
11518B33408L7777L094l494k971o827j2387k9051j6565L684K024O840J3206j3813
$$ y = [360604, 344700, 346844, 356227, 371563, 346893, 353104, 341589, 358583, 375075, 344875, 325010, 339045, 357975, 326910, 325504, 332077, 349173, 355539, 348542, 326064, 322952, 328012, 312637, 306703, 318580, 317172, 319031, 320094, 327661, 325304, 306853, 288581, 286214, 269947, 263472, 282547, 294096, 298945, 273365, 284973, 292161, 300845, 302380, 278107, 274161, 277321, 297058, 309906, 296078, 266071, 263085, 258704, 282051, 289942, 271077, 256746, 251332, 259511, 244968, 236791, 247369, 245171, 229805, 220562, 225800, 212552, 204220, 198221, 205802, 199466, 187843, 191921, 201057, 225493, 245544, 239039, 236313, 248051, 273342, 287429, 293286, 271505, 259543, 249354, 243374, 210904, 209686, 233408, 271185, 274279, 270785, 267814, 260987, 248600, 219549, 202984, 206668, 208692, 215532, 228738, 214925]
11505B14925j4464K67J4551L1565o153k1191k9908n632L1387N890J6078j1848
11493B25467n4109n545J46m552J0073K2143K0363N917J0202K2228O086r463j7138
11480B31818j684j4865j408L0163k3947l736P888k6969k2053k548J0135L202K443
11467A88439j0936j3761k6907J1227K3587J2875l541l714R189j9774k139J5775
11455A80320p69l2361K6635J7715M093l0918k4739p255j998K783L9528k40R5J7621
11441A90510K2664k6178l4039j801J1796m38j4023O981K4466k573p485r660K643
11428A62863J0568M684o248l1571K96M2397J6328j8659j7584L937Q364L148O079
11415A84602L809q189q424l453J1498j0629j3845K3927j7164j3796N840j697R357
$$ y = [214925, 200461, 200728, 215279, 246844, 240691, 219500, 189592, 183960, 215347, 221237, 237315, 225467, 171358, 165813, 165959, 161407, 171480, 193623, 213986, 219903, 230105, 252333, 258419, 248956, 231818, 230134, 215269, 213861, 244024, 220077, 216341, 224229, 197260, 175207, 172659, 182794, 185996, 188439, 177503, 163742, 136835, 148062, 171649, 184524, 180983, 177269, 186458, 166684, 164545, 180320, 179551, 147190, 173825, 191540, 195633, 164715, 139976, 132721, 130723, 133506, 173034, 172794, 172889, 190510, 213174, 186996, 152957, 151156, 162952, 162514, 148491, 155472, 179938, 177365, 169880, 160220, 162863, 173431, 178115, 171867, 140296, 140592, 182989, 199317, 180658, 163074, 167011, 175375, 178523, 184602, 188411, 180222, 171798, 168345, 179843, 169214, 155369, 179296, 162132, 148336, 154176, 152479, 161836]
11402A61836P739l3010k0665K0821p973k5859K6908L2900p296j7202p78p938m585
11389A24898K6316j6660l598j5527O931K0352o997l801N824J0222n515P541k639
11376A47347l389Q996J5239O760k2089L024m710j2877j1823J1442M537J9247K2893
11363A84597j1881j0863p831l8836j5481M215J2188q474q833J9373L279o20j9467
11350A01366n675J7644m284N326J5094p414k1830N978J0850o802l715m2806j619
11337F2113L4292Q462Q726K4253j5551j3520k2498l680L1635L1030j3148J6242
11325A48356l6194j1604J1521j1409J0428k901j6891j0310K458L4655P370k8813
11313I6666J2662K2086k0882j8484Q303L891L281p708J9139R326m892J0052j0261
$$ y = [161836, 169575, 136565, 115900, 136721, 128748, 102889, 129797, 162697, 155401, 138199, 137421, 129483, 124898, 151214, 134554, 130956, 115429, 122360, 142712, 135715, 131914, 137738, 147960, 142445, 149986, 147347, 143958, 152954, 168193, 174953, 152864, 155888, 151178, 138301, 126478, 137920, 142457, 161704, 184597, 172716, 161853, 154022, 115186, 99705, 103920, 116108, 107634, 98801, 118174, 121453, 120833, 101366, 95691, 113335, 109051, 114377, 129471, 122057, 100227, 106205, 117055, 110253, 106538, 63732, 62113, 96405, 104867, 113593, 137846, 122295, 108775, 86277, 82597, 114232, 145262, 132114, 148356, 112162, 100558, 112079, 100670, 111098, 108197, 91306, 80996, 83454, 118109, 125479, 96666, 109328, 131414, 110532, 92048, 100351, 104242, 107523, 99815, 118954, 128280, 123388, 133440, 123179]
11300A23179j8485k5773l2775Q624J9451n509L0398K8542j1212l9509q633J6979
11288H5277R565p176j7165l0929j1941K2988J9835M455j4716M679K9252j303l189
11275H9632P905J557K7923j6446J2135K5433p715j7664l1197k4152J2123M3922
11263A23456P033j6249K9467n420l0752Q392J996j9308j6840r566J1775j1911
11251G2073p452j1413K2712K4283J385k3216l2183m592K1974J0303J484J7340
11239I2698J7621k2936j6637L6736K6291O38l7744k9859l399J4983p23J0582N162
11226I3413j2334l3465j3657L979m027J4188M963M286o638l6202n955J6341L831
11213B8723o531J23j438L1689J7473Q058j5731j281L103l0270j002j6241Q716
$$ y = [123179, 104694, 78921, 46146, 54770, 74221, 68712, 99110, 127652, 116440, 76931, 68298, 85277, 94842, 87666, 70501, 39572, 27631, 50619, 70454, 74909, 60193, 64872, 94124, 92821, 89632, 97537, 99094, 127017, 110571, 122706, 148139, 140424, 122760, 91563, 67411, 79534, 123456, 130489, 114240, 143707, 138287, 107535, 115927, 117923, 98615, 81775, 72209, 83984, 72073, 64621, 53208, 75920, 100203, 101588, 78372, 46189, 41597, 63571, 73874, 75358, 92698, 110319, 87383, 70746, 107482, 133773, 134411, 96667, 66808, 63409, 78392, 77669, 88251, 93413, 81079, 47614, 33957, 37936, 33909, 48097, 53060, 57346, 50708, 14506, 8551, 24892, 28723, 22192, 22315, 20877, 52566, 70039, 78097, 62366, 61085, 64188, 33918, 32916, 16675, 25391]
11200B5391K926n681k0048p912J5021K4916j1087r548R872K0423P709j6123K148
11187C8007J5323J3329j2109Q64J299J7169K7506j642k0080l8975k2313K3554
11175D1932J1313J3612K7453J2912J2590J1811P3j4619l4476k7293R108R26n657
11162E9685r275J3826K256j4879K909n329q399j1819k900q840O19K853j810J7754
11148C6651J6687o493j4126K6506J0249K5002j5247M804j3648k306p912j8897
11136D1270o699o179j5841J0993j0884K863J4796K8939N27K121p196J9742K8132
11123A02584J2511Q893J1619k0938l5125k2446K1758q733k1413j1030j328K2387
11111E8739J3851p443l044k7545k1933K1460K1881j0793q703P71q748J3918O911
$$ y = [25391, 28317, 22636, 2588, -5324, 9697, 34613, 23526, 13978, 23850, 44273, 51982, 35859, 38007, 53330, 66659, 54550, 55414, 56713, 73882, 101388, 99746, 79666, 40691, 18378, 41932, 53245, 66857, 94310, 107222, 119812, 131623, 131696, 117077, 82601, 55308, 64416, 65342, 59685, 50410, 64236, 66492, 51613, 54522, 49193, 40794, 28975, 26075, 17235, 17854, 20707, 18897, 36651, 53338, 46845, 32719, 59225, 69474, 94476, 79229, 84033, 70385, 68079, 60167, 41270, 34571, 28392, 12551, 23544, 12660, 15523, 30319, 59258, 59785, 61906, 54710, 74452, 102584, 115095, 123988, 135607, 114669, 79544, 57098, 78856, 70123, 48710, 37680, 36352, 58739, 72590, 65147, 62103, 34558, 12625, 34085, 55966, 45173, 36470, 37241, 28493, 42411, 49322]
11098D9322J3157P063p682k683M810O53j4779k2075J1514j6300j1696M837L4613
11085E0754L544R873m926p126K5447M346j060K8760k2475N08J7395p792m4185
11072E3063n0670K4545L2277Q846j1333k9398j3131K8576M0301n49k1606J2326
11060G3247K9823J0056K6984j5392k1132j2532l65j3479j5252j6870K2832L945
11048G1865k274J8560J2952J6332j1792J737O489J0311L481r686J3184K3749R4
11035A55002m147M5494J9149l92k4961q599n478J5364L874j1826P579K1295k0469
11022A91885r548r068k3766r008J8075J0251j768k794j3508l515l834J0403j4141
11009A39664k7774j5462k337P381j1094j1624Q215L1728K0798j5934j3938k2572
$$ y = [49322, 62479, 69542, 61860, 59177, 63987, 64640, 49861, 27786, 39300, 23000, 11304, 16141, 50754, 54298, 64171, 59245, 52119, 77566, 81912, 80852, 109612, 87137, 87645, 105040, 97248, 53063, 2393, 26938, 59215, 68061, 56728, 27330, 14199, 42775, 83076, 82527, 60921, 73247, 103070, 113126, 140110, 124718, 103586, 91054, 90689, 77210, 61958, 45088, 67920, 71865, 69591, 88151, 101103, 117435, 105643, 107380, 113869, 124180, 127661, 117975, 131159, 154908, 155002, 150855, 196349, 215498, 215106, 190145, 181546, 176068, 191432, 195306, 183480, 191059, 212354, 191885, 182337, 173269, 149503, 140495, 158570, 168821, 167053, 164259, 150751, 147236, 143402, 153805, 139664, 111890, 96428, 94091, 101472, 90378, 78754, 86969, 118697, 139495, 123561, 109623, 87051]
10997H7051P523j1633M316O333M465k7285K148j2189j3096M60K7011J0604k8955
10984E6753o584M782q368j8533J0163l458K7597M835j289j4477o013J4435k739
10971E7104k1298Q014j1247j504J4703l128N625L0053p395l1175k1262J3452l375
10958B8567q926J208L7254N690l0069p776O010p797o533J9832q540P317m543l1258
10944D36j7954R858K0833L4435J3469r027j0045k6803K811j649J1252k816N358
10931C0158M3587N209m3538j5802k831j2463R64L0984R912J1946j2055k8283l2269
10918a4481p63K1613K7042K3231J5044k2297l9708j2833O94K343p233l294J447
10905i195J8644j1281j2828K6871l638Q745M4164L0128j3122l1961k2998L132
$$ y = [87051, 94574, 82941, 87257, 93590, 98055, 70770, 72918, 60729, 47633, 48093, 75104, 85708, 56753, 50169, 54951, 46583, 28050, 38213, 34755, 62352, 67187, 65898, 51421, 45408, 59843, 57104, 35806, 43820, 32573, 31069, 45772, 42644, 48269, 78322, 70927, 39752, 18490, 31942, 28567, 19641, 20849, 58103, 63793, 33724, 25948, 31958, 24161, 17628, 37460, 28920, 36237, 31694, 436, -17518, -7660, 13173, 47608, 61077, 52050, 42005, 15202, 18013, 16364, 27616, 24800, 30158, 73745, 78954, 35416, 19614, 16783, 4320, 5284, 36268, 46180, 58126, 46071, 17788, -14481, -15244, 6369, 33411, 56642, 71686, 49389, 9681, -3152, -2458, -115, -7348, -10642, -9195, 9449, -1832, -14660, 12211, 8573, 17318, 61482, 91610, 78488, 46527, 23529, 26661]
10893B6661m722j2152J7465L316K8140K1208j6190j0677j4586n587o536k7485
10881a145m625J7356K3748o008j5122O537J2683L5031K2282K190J818M519j1394
10868H7870J3723J9055k6221j9368o477J2596K0308o5j9120j4530k3081p076K08
10855C7822o481r640M283J1456K8810J3328k0127l225j3158K4016J0783L448M596
10842H5911j769k303m242J5663j4445k1658k41K5483J1787j3857k460j2601M788
10829G0056p305j8867m510j5514J4842K1461j2139J129J5965J6264j2542m884
10817F3956l1065o251R148M052L8473K5843j1893j7103j0601k1903J7850r45j2070
10804D7491O151K7676o887k0071j7749M43j4592NJ1023j0580m926K4324P493r217
$$ y = [26661, 21939, 9787, 27252, 30568, 58708, 79916, 63726, 53049, 38463, 32876, 26340, -1145, -5770, 11586, 35334, 29326, 14204, 20741, 33424, 68455, 90737, 92927, 94745, 99264, 87870, 101593, 120648, 94427, 75059, 68582, 81178, 101486, 101421, 82301, 67771, 44690, 37614, 37822, 31341, 21701, 25984, 37440, 66250, 79578, 59451, 56226, 43068, 67084, 77867, 81315, 85911, 84142, 81839, 77597, 93260, 78815, 57157, 56916, 82399, 94186, 80329, 77869, 65268, 70056, 62751, 43884, 39374, 23860, 38702, 60163, 48024, 49153, 65118, 81382, 68840, 63956, 32891, 26640, 35788, 39840, 78313, 104156, 92263, 75160, 64559, 42656, 60506, 59561, 47491, 53642, 81318, 74431, 54360, 36611, 37054, 22462, 22467, 33490, 22910, 17984, 42308, 49801, 40584]
10790D0584j971K3661p925j7901j875K8988P32J3709R705L086j3540l0645M070
10777E0678J2741K3064P237k4510j1614k7160J199K7500J2957K0576k0079k4782
10765D7807J9475N300j6164J4604K4292j2171j5539k669r659l6970j0794Q908
10753A6420L0077p14J966J692Q72J0189M6371m637j2432K6860J4815j222k4675
10740A05582l4331O969r195l869L4419J3983O535m459k4587k1317K050q644K1004
10727H4140L1447K972l642J9680q74j7453o118J0921J993j0222j1901o687K782
10714I7038J3172j4364R089J2783j930o452J1245l752j5554q200J2909j780j8500
10701H5704L833L837K1632K2365J6947r255l689R045J3568j2742P283J1515j072
$$ y = [40584, 38613, 62274, 54349, 36448, 34573, 63561, 64293, 78002, 87707, 90793, 77253, 46608, 50678, 63419, 86483, 93720, 69210, 57596, 30436, 31635, 59135, 72092, 92668, 72589, 47807, 67282, 72582, 56418, 71022, 95314, 83143, 67604, 64935, 55276, 18306, 7512, 16420, 46497, 45783, 47749, 49441, 50313, 60502, 106873, 102236, 89804, 116664, 131479, 130257, 105582, 71251, 78220, 69025, 65156, 99575, 113558, 120093, 115634, 91047, 69730, 71780, 63136, 84140, 115587, 118559, 114917, 134597, 133723, 116270, 110152, 121073, 123066, 112844, 100943, 94256, 97038, 110210, 95846, 104935, 117718, 115788, 109336, 120581, 116829, 101275, 93075, 105984, 104204, 85704, 89537, 93374, 115006, 137371, 154318, 145063, 141374, 150419, 163987, 151245, 158528, 170043, 168971]
10688A68971r076p362j7654l101J9320j3143P040R516J875n627K1888R392O741
10675A88780O733j3333k834J8401r860j382J3177K1695l701o354k58M933L5944
10662B51941L3896j1715j6238J2418K50K1830K4898j3249n618K2661J6155M1916
10650C79145J1700j0694K7323L5102N862K1450L5227R651Q169r048J9024O947
10638E39858J9466P7387P8478Q8095P3165R3579R2824P9120J23511J44031K12321
10627A621835K75034L35885M20200N88671P39319Q70173R32070R74212Q91541
10618G648940P53841P34566O20489L78137K32893K15407M91311R20938J350144
10609A3346666J616777J579996J372798J168726R93768O34041J4710n76643o25087
$$ y = [168971, 159895, 152533, 134879, 131778, 151098, 137955, 144995, 154511, 156386, 150759, 172647, 182039, 188780, 195513, 182180, 179346, 197747, 187887, 186505, 199682, 221377, 217676, 211322, 211064, 215997, 251941, 285837, 274122, 257884, 270302, 270552, 292382, 317280, 304031, 298413, 321074, 337229, 379145, 390845, 380151, 407474, 442576, 448438, 469888, 505115, 514766, 522935, 513887, 532911, 539858, 559324, 636711, 715189, 803284, 876449, 970028, 1062852, 1141972, 1265483, 1409514, 1621835, 1896869, 2232754, 2652954, 3241625, 3980944, 4851117, 5783187, 6757399, 7648940, 8402781, 9137347, 9757836, 10135973, 10368866, 10584273, 11075584, 11996522, 13346666, 14963443, 16543439, 17916237, 19084963, 20078731, 20712772, 20727482, 20150839, 19525752]
10600A9525752q0251O88732J394203J764011J669446J263669R41801N65752q2834
10591B7650281j138161k085863k215991j594215o96500J6928M08299M62000K32883
10582B1039661j3335l05874p28981j416701j993063k060022j564425r27899m93342
10573A1536019k33289j86855k47471l54926n30236p73563j011812j194834j174279
10564E828754r99927p72156n80167m34643l58817k83832k15507j99627j91019
10555A793059j91160j80225j12547p2470q6118j03922r0701q6651q4621m0650
10545G43994m6449l2056n0578l8785j3802l0671o5721l0287N951k5271m5397j896
10533C69032p616m534l1028k9359j3791j4638j5797l655j3132P296j8978k1956
$$ y = [19525752, 19445501, 20134233, 21528436, 23292447, 24961893, 26225562, 27167363, 27733115, 27650281, 26512120, 24426257, 22210266, 20616051, 19919551, 19936479, 20344778, 20806778, 21039661, 21026326, 20720452, 19991471, 18574770, 16581707, 14521685, 12957260, 12029361, 11536019, 11302730, 11115875, 10868404, 10513478, 9983242, 9209679, 8197867, 7003033, 5828754, 4828827, 4056671, 3476504, 3041861, 2683044, 2399212, 2183705, 1984078, 1793059, 1601899, 1421674, 1309127, 1236657, 1150539, 1046617, 955916, 869265, 784644, 743994, 697545, 665489, 614911, 576126, 562324, 531653, 465932, 435645, 441596, 416325, 370928, 369032, 361416, 356882, 325854, 296495, 282704, 268066, 252269, 248614, 235482, 242778, 223800, 201844]
10521B01844J4772l5815l4199k5941j3489q794J3296M6477J1197k9906k7340L210
10509A15312j0410l120Q561n280k3884l360J3098P807J801j8149j0988j8324Q084
10496F1148k097J2678M011M156l716J1335O394L1489L9105K4053L8605J5868J6953
10483B59982L4897J4881l244n4997m1864k6885k7719k6780l9452j2279j3931J46
10471F2755N332j0739l9544L858J4568L1051j2388l1514k606M930j3181j8440
10459e918q244J0466K8189J7882q683j3253Q856P99k7317j604j0302n922K7737
10446A2686J3359j5166N186L1193k1574j9797j7251l277j1985J7109k3442K476
10434c0483J1098j7240j2109L233J8883O608j695j4591k8774J1766L0236K2728
$$ y = [201844, 216616, 180801, 146602, 120661, 107172, 98378, 111674, 158151, 169348, 139442, 112102, 115312, 104902, 101782, 110343, 105063, 81179, 77819, 90917, 98724, 100525, 82376, 71388, 53064, 61148, 59051, 71729, 75740, 79896, 76180, 87515, 93909, 125398, 164503, 188556, 227161, 243029, 259982, 294879, 309760, 306516, 251519, 209655, 182770, 155051, 128271, 88819, 76540, 62609, 62755, 68087, 57348, 17804, 21662, 36230, 67281, 54893, 23379, 20773, 25703, 12522, -5918, -14162, -3696, 24493, 42375, 33692, 20439, 29295, 30094, 2777, 1173, -9129, -15051, 12686, 26045, 10879, 16065, 47258, 25684, 5887, -11364, -14641, -26626, -9517, -32959, -30483, -19385, -36625, -48734, -45501, -26618, -20010, -21705, -36296, -65070, -53304, -23068, -340]
10422c40r932L775K2403n39j5581j5629l4264k0183M516K1036j052q286J2872
10409d1204K3686p351J954L5287n779o655J9397q355J0673j2262n749N440k208
10396F874R17j559K8551j0403k3567M269J3620J7703M685p919J3047P931J577
10383E5726l014q660k0080J3109j0398J4507K3811L751L2047M4361L823J6294
10371A65277N3753O1189R0740P4228P0212P3625R1879P5560N5480K3640L4782
10360H70365J3971o4248o5615o2762p2588q5938q5929p6978r0988p6690k3627
10349A78973k4167j9891k1444j2505j9288j6775l726k6451j7771K0521J6446J1341
10337F5263k1390k8462k0453k6891q737j0520Q254L774K2678K8429J3730l6487
$$ y = [-340, -10272, -6497, 15906, 15367, -214, -15843, -50107, -70290, -65774, -44738, -45790, -54076, -41204, -17518, -24869, -22915, 12372, 6593, -62, 19335, 10980, 21653, 9391, 3642, 9082, 6874, 7791, 6232, 34783, 24380, 813, 5082, 18702, 36405, 41090, 33171, 46218, 54149, 55726, 52712, 44052, 23972, 37081, 26683, 41190, 65001, 68752, 100799, 145160, 148983, 165277, 219030, 280219, 370959, 445187, 515399, 589024, 680903, 756463, 811943, 835583, 870365, 884336, 820088, 754473, 691711, 619123, 533185, 447256, 370278, 279290, 202600, 178973, 154806, 134915, 113471, 100966, 81678, 64903, 61177, 34726, 16955, 37476, 53922, 65263, 43873, 15411, -5042, -31933, -40670, -51190, -42936, -39162, -16484, 11945, 25675, -10812]
10325a0812m3013j0533J1698K9643J4848j4680j2199j8614j352J6231m30j0276
10313d9489K3277j333J5803J8933J141Q48R199J5268k8721j9937l173J8304N024
10300E144k2620j1164L1701L8140l49k5730m0522J470O392o865L976J3887k8617
10287c5157l8079Q99K7565l363k6458q721J7435J6882K5373K0029K404n412J7338
10274A0735k0107l3901N419j2773j8733J261K6056L6667N865J5320j1637l184
10262I88k420m065l832J1811O004L363p257K798p299l576k073k7276n670j3791
10248e2295q516J3496j0993r338N79J2792l60R785K3268j3112j3064j2381J1739
10235d8400K1365J3439j5406k3749K125N465K3878n006l053m668O391R745J3704
$$ y = [-10812, -53825, -64358, -52660, -23017, -8169, -22849, -35048, -53662, -55014, -38783, -39213, -49489, -26212, -27545, -11742, 7191, 8332, 9180, 18379, 33647, 4926, -15011, -18184, 120, 5144, -17476, -28640, 3061, 41201, 40852, 15122, -25400, -23930, -17538, -24403, -20427, -6540, -35157, -73236, -72337, -44772, -48135, -74593, -83314, -65879, -48997, -23624, -3595, -1191, -6603, 10735, -9372, -43273, -37854, -50627, -69360, -68099, -42043, -5376, 489, 15809, 4172, 988, -1432, -5497, -9329, 2482, 8486, 11849, 4592, 7390, 91, -3485, -5558, -32834, -38504, -52295, -60811, -47315, -58308, -67646, -67067, -54275, -54635, -44850, -21582, -34694, -47758, -60139, -48400, -27035, -13596, -29002, -52751, -50626, -45161, -21283, -26289, -29342, -34010, -27619, -17874, -4170]
10222d170k9266k2561R777J927N401J404j285J8567R846k100j8452N719M470k2992
10208d3715k5082K2718J5684q665J8658L4880j3984k2286J6327J4508L889j6507
10196c575j3071J1710j6275J1445j6007j213j6049Q014K1158J3331j8817l199
10184b2548K2335K3651K7329j3287k5879J8278M2984j0374k0012M670K1243m054
10172F4336J1265j656l860K7208J822k0397L606j3530j994N200J720j1752L679
10159F5647J9079K0424M093j7269j3499J8927j3157n777k2973k9776j6013l004
10147F702L2349J9247O462J911k7421m022M475M867J3989L250K4260L3760L169
10134A22998j6375k7136l5008P417j0212m4450j8043N649L179L357j1989j0923
$$ y = [-4170, -33436, -55997, -46220, -44293, -38892, -37488, -38773, -20206, -10360, -12460, -30912, -25193, -20723, -43715, -68797, -46079, -30395, -39060, -20402, 14478, 494, -21792, -5465, 9043, 12932, -3575, -16646, -4936, -21211, -9766, -25773, -26986, -43035, -35021, -13863, -532, -19349, -22548, -213, 23438, 50767, 37480, 11601, 29879, 72863, 62489, 42477, 47147, 68390, 64336, 75601, 73945, 70085, 97293, 99115, 78718, 82324, 68794, 66800, 72000, 73720, 61968, 65647, 84726, 105150, 109243, 91974, 78475, 97402, 84245, 78468, 55495, 25719, 9706, 6702, 39051, 58298, 64760, 66671, 39250, 35228, 39703, 44570, 58559, 61809, 86069, 119829, 122998, 106623, 79487, 44479, 51896, 41684, -2766, -20809, -15160, -11981, -8624, -20613, -31536]
10122c1536P484J7751k113J7096j5137j3052j9892Q668K4693k690J2955k8976
10110b4749P074K9042M0715P159K2553L0271R902j1628l8560J06M1682K8425L8911
10097A80903P4536O4285P5266Q6402J14148J22561P6369O3074N9671J8473M99
10086I36187k6098r1733r8060q2491q1079r6549q4327n5536o7357l8007m2680
10075A72270k6303l0053k3703j8428j8590R186J2142K592K2226j7125k1389M795
10063F7620m750j5988m2066l7148j1615J1216J7660p716Q647K8273J1536k4133
10051A536q451N144O920j3921L086k869P338k0733j58k244k2374J6560R547R69
10037a9650l998O7P85k2758L522J3196N965o776k688j4324J3009K2906J2717L865
$$ y = [-31536, -24052, -6301, -8414, 8682, -6455, -19507, -39399, -30731, -6038, -8728, 4227, -24749, -17675, 11367, 52082, 59241, 81794, 112065, 121967, 110339, 71779, 71885, 113567, 141992, 180903, 255439, 319724, 394990, 481392, 595540, 718101, 794470, 857544, 917215, 935688, 936187, 910089, 818356, 720296, 637805, 556726, 460177, 375850, 320314, 252957, 214950, 172270, 145967, 115914, 92211, 73783, 55193, 64379, 76521, 79113, 101339, 84214, 62825, 67620, 62870, 46882, 4816, -32332, -43947, -32731, -15071, -22787, -14140, 14133, 25669, 1536, -6915, -1771, 5149, -8772, -5686, -8555, -1217, -21950, -22108, -24352, -46726, -30166, -20619, -19650, -23648, -23581, -22796, -45554, -42032, -28836, -22871, -29647, -32335, -46659, -33650, -10744, 1973, 5838]
10023E838m293j9149j7645R603j892J3944N585j8427j2746J1643J2348J2048N282
10010B139j4483k3943O601M498j8378p673j6525k2311K564K7093N2827K8797J6386
9997C7592k4495k9382r792p83p485j4664j7316J0951K6873K898J4693j0753k3615
9984d5278J9876K3226l9285l7388j816N004k323K8988j968J6277p174k126J088
9971d2899L2723M703k4398l0811j007J2644J6044j280n257j2065Q234k1490J4054
9958e0805J2070J1752J5504Q445j3978n570M776r038k0705K6747n047j2434r859
9945d8142l490j97K0730K1201o606l2262l2065J7275M1915k1558p457l132K1197
9932c2591K7315P867J8138l1047J0623k4528n318p617J4487J6147M919O350j2350
$$ y = [5838, 1545, -17604, -35249, -25646, -27538, -13594, -8009, -26436, -39182, -27539, -15191, -3143, 2139, -12344, -36287, -29686, -25188, -43566, -51239, -67764, -90075, -87511, -60418, -7591, 21206, 37592, 13097, -16285, -26077, -26860, -34345, -49009, -66325, -55374, -28501, -25603, -10910, -21663, -45278, -25402, -2176, -41461, -78849, -80665, -75661, -77984, -48996, -50964, -34687, -41861, -43987, -42899, -10176, -5473, -29871, -60682, -61689, -49045, -33001, -34281, -39538, -51603, -43369, -64859, -50805, -38735, -26983, -11479, -3034, -17012, -22582, -17806, -26844, -47549, -20802, -25849, -38283, -48142, -51632, -51829, -31099, -9898, -16504, -48766, -80831, -63556, -21641, -43199, -50656, -53788, -32591, -5276, 2591, 20729, -10318, 305, -24223, -29541, -37158, -22671, -6524, -1605, 4745, -7605]
9919g605m61J5284N780k6776J44J5510j4311J668K2316j7213l8410J1378L285
9906b9411q112J6200P120J6578m3367j6760M9597j4170k1336J6927J4939m59l953
9893a6207j5584k2481r480j0297M536p99J1763J5743p969K524J2767J2643J5465
9880g376j6270j582j9431k0778k455J7106J8987k3758O687j0765J3198j77n886
9867e2500j2086p420K598j1503J8202J6132k776k52o553j905L946J0727L2465
9854a0925j8502j2612J541l589R012J5999L1598k1437k9947j2789K5468K4945
9842a238O073l521k48j7521k5716M543m63q610L337l076l784m879J7633O633j533
9827c2370o710J554k957l749m276L7728M385M297J7116j9179j2932P379j965J2815
$$ y = [-7605, -8066, 7218, 12998, -13778, -13634, 1876, -12435, -10767, 11549, -5664, -44074, -32696, -29411, -37523, -21323, -14203, 2375, -40992, -57752, -8155, -22325, -43661, -26734, -11795, -12254, -16207, -31791, -54272, -63752, -74049, -69513, -70312, -58549, -42806, -50775, -48251, -35484, -22841, -7376, -23646, -25228, -44659, -65437, -67892, -50786, -31799, -55557, -48870, -59635, -46437, -46614, -52500, -64586, -72006, -69408, -80911, -62709, -46577, -49353, -49605, -56158, -58063, -54117, -43390, -10925, -29427, -42039, -40498, -44087, -35075, -19076, 12522, -8915, -38862, -51651, -26183, -1238, 4835, 1314, 1066, -16455, -42171, -37628, -38091, -46701, -43364, -46440, -50224, -55103, -37470, -30837, -32370, -39080, -37526, -40483, -44232, -48508, -10780, -6395, -2098, 15018, -4161, -17093, -9714, -11679, 1136]
9813A136J1308k9183k8380J947K8883O62l4519j211L7221L1666j4613k5789p690
9800b8562j9158J1039K4909l020j5388j3995k7062M9361L1692j4481Q83O249j2548
9787a0081J6251K3790P660k9756k0177K2759k602k1105J0164Q681o679l2544j9465
9774e3104J6182K0500K2983J2374k3892j8409j3554j5442J671J9232l032j3194
9762d7685Q975J0884R145K6647J0247qr265q270m705K632j5321J2399J3029J7760
9748B6464o557n4685l3978L5835J3927j4749J1067M810m693J199k6760J1683P005
9735b9432Q857j0729k7724j2345k7756J9001J8065J4903L6362k24k1877L641R993
9722a9265j6132M834o831k7744j3257R290M1022k831k9788n627Q065k5610l4615
$$ y = [1136, 12444, -16739, -45119, -43172, -14289, -13627, -48146, -49357, -12136, 19530, 4917, -20872, -28562, -47720, -36681, -11772, -14792, -30180, -44175, -71237, -21876, 9816, -4665, -3782, 2467, -10081, 6170, 29960, 37620, 7864, -12313, 10446, 7844, -13261, -3097, 5584, -1095, -33639, -53104, -36922, -16422, 6561, 18935, -4957, -23366, -36920, -52362, -50691, -31459, -34491, -47685, -38710, -27826, -18681, 7966, 18213, 18205, 8940, 670, -4035, -1403, -16724, -4325, 8704, 26464, 19907, -34778, -68756, -32921, -18994, -33743, -22676, -17866, -22559, -21360, -48120, -36437, -29432, -20575, -31304, -59028, -71373, -99129, -80128, -62063, -47160, -10798, -11022, -32899, -29258, -19265, -35397, -30563, -37394, -65138, -78395, -69105, -28083, -30914, -60702, -66329, -58264, -83874, -118489]
9709a18489K4672K6802J5654L1623o429j0825L130O830N792M0258J667m430l406
9696A2849N701j7141R104O570K2633p485M970j8930k9795p638k5671k435J9643
9683b7625L2764j1192m931p692n484J9442J5761O90o747K1198j8478k0414R798
9670b910p643J1085J3294k1579j528J7202Q865K241J4783J3486J6819k3495l9264
9657A356m41n181j626j2027k1649J3395K5380m555p514j0501o828L53N959N392
9643a8487J4288J0664J4825K707J1327Q126k8202k0883j4047K1344J9808o966
9631A4504j4440j8127l0064k7760k144J8411K1112j0706j0995J3593J7846O476
9619b2294p438j3413K5895K7487j020l176l1426N740l526J3585R546j6773j355
$$ y = [-118489, -93817, -67015, -51361, -19738, -26167, -36992, -33862, -27032, -21240, 19018, 20685, 16255, 12849, 18550, 1409, 10513, 17083, 39716, 32231, 37201, 18271, -11524, -19162, -44833, -47268, -27625, 5139, -6053, -10984, -18676, -24160, -4718, 11043, 11733, 4986, 26184, 7706, -12708, -2910, -10553, 532, 13826, -7753, -9281, 7921, 16786, 19027, 33810, 47296, 64115, 40620, 1356, 915, -4266, -5892, -17919, -39568, -26173, -793, -5348, -12862, -23363, -30191, -29838, -23879, -18487, -4199, 6465, 21290, 23997, 35324, 43450, 15248, -5635, -19682, 1662, 21470, 14504, 64, -18063, -48127, -75887, -78031, -59620, -38508, -49214, -60209, -46616, -28770, -22294, -29732, -43145, -17250, 10237, 9217, 6041, -25385, -19645, -23171, -9586, -40, -16813, -18168]
9606a8168K008J8613Q427n0371j7712K3600j7934j2850J6528P048M2681J1941
9594A3811P625M426m2903l1041J7266j3024j9010J6745K9885P215J3535K0566
9582B5096j1601j5182j5580N376J0172J1847J1188m502L8490J2036k0958l0006
9570A6376j4688r593k135l1354p575J6407J5425P331R76n752Q797L4862k929r421
9556A6727k1740l267k0979j059k3115k289L1668J7796K7530j5103n412l956j5573
9543a8772p921K6559R43J8797K2816k149Q74j5241j2865j454j0988k2301l5913
9530e7615o830Q155P84k009L3493M1390J2128K875j6978p531N142j1595n757Q375
9516D027j0299q017K0759K0032k8022K395J8117k1248k576j4623L8833K0835l3441
$$ y = [-18168, -16160, 2453, 10880, -39491, -57203, -33603, -51537, -64387, -47859, -40811, 1870, 13811, 21436, 25862, -17041, -48082, -30816, -43840, -62850, -46105, -16220, -9005, 4530, 25096, 13495, -1687, -17267, -11891, -1719, 10128, 21316, 16814, 55304, 67340, 46382, 16376, 1688, -7905, -10040, -41394, -48969, -32562, -17137, -9806, -8830, -14582, -5785, 29077, 26148, 16727, -5013, -8280, -29259, -30318, -53433, -55722, -24054, -6258, 21272, 6169, 757, -3199, -18772, -26693, -134, 809, 19606, 42422, 40273, 41147, 25906, 13041, 11587, 599, -21702, -57615, -64445, -56290, -55506, -57515, -24022, 17368, 29496, 32371, 15393, 7862, 13004, 1409, -4348, 4027, -6272, -14289, 6470, 26502, -1520, 875, 18992, -2256, -4832, -19455, 19378, 40213, 6772]
9503F772j8027K0014K3270K0794p254j119K840j0283J131j2241j249m358j4376
9490E914K6946P561l2021L193M0327Q442k2633k1487l1269j2026P145J5026K753
9477b129J9294J5730N067M3560K010k336j7416k4669K720k0306J2507m009k9445
9464E78j6390j9783j1584K706P209n758R528J6395N208J9459M2887o264k8614
9451A5577l1959k3488J9374J6141O548J4545N106Q206K0514K3327Q254K7398L4268
9438A43811O674k338K2992K8455L9995O3108Q2776O4542K7663M2862N5328N2806
9426F28674J8252q5358j00817m0067j3918l3232k8362k5831j2489J7369J7557
9415C41778J3418L1285P4658J08984L6138N3684L7254M2111m71j4948l1528k8006
$$ y = [6772, -11255, 8759, 32029, 52823, 45569, 44450, 47290, 37007, 38138, 25897, 24648, 20290, 5914, 32860, 40421, 8400, 11593, 51920, 60362, 37729, 16242, -15027, -27053, -19908, -4882, -2129, 17165, 32895, 37962, 81522, 83532, 81196, 63780, 39111, 41831, 21525, 34032, 30023, 578, -15812, -35595, -47179, -44473, -37264, -43022, -33494, -17099, -11891, 7568, 50455, 44191, 15577, -16382, -39870, -20496, -4355, 2193, 16738, 21844, 30050, 50564, 73891, 82145, 109543, 143811, 150485, 148147, 171139, 199594, 239589, 302697, 385473, 450015, 477678, 520540, 575868, 628674, 646926, 561568, 460751, 420684, 406766, 373534, 345172, 319341, 306852, 324221, 341778, 355196, 386481, 461139, 570123, 606261, 659945, 697199, 739310, 738839, 723891, 692363, 664357]
9403F64357l5061l0139j3371l0651j4537k2560j0668K4069O5193M8945P7314R5216
9391H18107J60901J94525J77065J39822P4501L9828M5110j4904k05203l33709
9381A096043k55204j26499o5685l9930p482K1940K9658n263N364J3208p62J0882
9369F76270J5054L1909K9728N583j045l307m452l4965l9661q6598p4724m9863
9357D63929m0890m3886m7988n841n61n472L0949M8893O7090N3861N5145J1498
9345E86727j8214o916j1978j4307r2881j36117q3940l6563j5225J4567J2414k7099
9333A70468j2680j5101m5679r129J9310N240j5817m716K0475j1821m4333k0087
9321C6130R588L9633n883j5954j8085j4351L067q231P274j2228J1946N209Q958
$$ y = [664357, 629296, 599157, 585786, 555135, 540598, 518038, 507370, 531439, 596632, 645577, 722891, 818107, 979008, 1173533, 1350598, 1490420, 1564921, 1604749, 1649859, 1634955, 1429752, 1096043, 840839, 714340, 648655, 608725, 601243, 623183, 652841, 647578, 652942, 666150, 665388, 676270, 691324, 723233, 752961, 758544, 757499, 754192, 749740, 714775, 675114, 588516, 513792, 463929, 423039, 379153, 331165, 325324, 324763, 319291, 350240, 399133, 466223, 520084, 575229, 586727, 568513, 561597, 549619, 535312, 442431, 306314, 222374, 185811, 170586, 185153, 197567, 170468, 157788, 142687, 97008, 87879, 107189, 112429, 96612, 91896, 112371, 100550, 56217, 36130, 45718, 85351, 79468, 63514, 45429, 31078, 34145, 25914, 33188, 20960, 32906, 38115, 47073]
9308D7073j6718K232Q626n880j4416K3732J2472J199k9559K211J289L4524k0020
9295D6765j7118K1295M237j7737j2823p134p967J2098o387m167l0686k2L9239
9282A9593J7986r986k2571O524j4122L584J4284K7858j087j3866j3588J3543k169
9269B5983r835n8554j8723J4186J7196J6654K5472r010J779j5304L540Q735q986
9256f867K51q383m730j6160J873J5777R636m947k753k274Q652N85j0601j6610
9242c6551j2156L1267Q045J6591l0308k8326j5016J2298K829p887J1290j6386
9230f4310m128L0653m153m738q402j4841l571r339K3184j2303l5313o457K2464
9217i1254L0486J9586p036J533J2546l641m942k723m613P684n988K9135L047k681
$$ y = [47073, 30355, 32587, 41213, 35333, 20917, 44649, 57121, 58320, 28761, 30972, 32261, 66785, 46765, 29647, 50942, 55179, 37442, 24619, 17485, 9518, 21616, 15229, 11062, -19624, -19646, 19593, 37579, 27593, 5022, 11546, -2576, 1008, 15292, 43150, 42063, 28197, 14609, 28152, 25983, 16148, -42406, -61129, -46943, -29747, -13093, 12379, 3369, 5148, -10156, -6616, 2119, -6867, -6616, -14999, -19729, -35889, -34016, -18239, -8603, -13550, -16303, -18577, -9925, -9340, -19941, -36551, -48707, -17440, -9395, 7196, -23112, -51438, -66454, -54156, -51327, -59214, -47924, -64310, -68438, -37785, -41938, -46676, -55078, -69919, -73490, -82829, -59645, -71948, -107261, -113718, -91254, -60768, -41182, -48218, -46685, -34139, -37780, -42722, -45445, -50058, -42374, -48362, -19227, -16180, -18861]
9203a8861n482L51J1264K3608k2382R635K0286o353K485j5657J2276J6338j5714
9190A1794K914K069L3427j6628k3121P206k9899p192J9176q87J960J744j4183
9177a1620o926J5874K5943K0409q577j1292j1203j214j6915J307k0090r795l726
9164c7825M689L592j2216J2002p232l6816O015K1301J5130L0435L555J1835l344
9151A1121j5895K644P924k757J880k3527l356Q644k7455J9110L8198m582l6129
9138b4180j0701j7225L3058M4028j3775k4542J3780o250k3327O465L719q18q26
9125b0594j9590j1858r617m326j0279K3147K4324j6266q752J3132m686J7206K1443
9112f716J3485j1471Q198k397l1381P447j5021M8K0272j1179N620K9145k581q591
$$ y = [-18861, -24343, -23992, -12728, 10880, -11502, -1867, 18419, 12066, 14551, -1106, 11170, 27508, 11794, 14708, 16777, 50204, 33576, 10455, 17661, -12238, -19430, -254, -1141, 819, 2563, -11620, -18546, -2672, 23271, 43680, 35103, 23811, 12608, 11394, -5521, -4214, -24304, -34099, -37825, -33136, -29544, -41760, -29758, -36990, -73806, -67791, -46490, -31360, -925, 2630, 14465, 11121, -4774, -2130, 5794, 3037, 4917, -18610, -21966, -13322, -40777, -21667, 16531, 11949, -24180, -34881, -52106, -19048, 24980, 11205, -13337, 443, -5807, -29134, -22669, -18950, -19768, -20594, -40184, -52042, -61659, -65985, -76264, -53117, -28793, -45059, -53811, -40679, -45365, -28159, -6716, 6769, -4702, 3496, 1099, -30282, -22835, -37856, -37808, -17536, -28715, -23095, 6050, 3469, -5122]
9098e122k2441L9779J8663j5037O360M250j881k7778k1015P403P271p083P733
9085h898L7092k5642j6656k3385k4555M7855L0654J948l810j0143N396R106j8106
9072H56J9228J5216K7618j2713J322j6928k9935l441j2121k3481n115K0083J007
9059a8404J4590j3189j4576J8086K738n832j4059k077J6373K205K2419J5075j2868
9046A0481j8038j0790m348J9391R65M991O115K711K5015j9769k8621j157J8205
9033E151K9449O670j4252o954m489j5672O126j3312J2887M669M108q100j1641
9020e360K4582J2266P098p244p837p112L806j5623k004J9285j76J2220j3189Q355
$$ y = [-5122, -27563, 12216, 30879, 15842, 22202, 26452, 24571, -3207, -24222, -16819, -9548, -16631, -8898, 28194, 2552, -14104, -37489, -62044, -14189, 16465, 18413, 14603, 4460, 9856, 18962, 856, 20084, 35300, 62918, 50205, 51527, 34599, 4664, 1223, -10898, -34379, -39494, -19411, -18404, -3814, -17003, -31579, -13493, -10755, -16587, -30646, -32723, -16350, -14145, 8274, 23349, 10481, -7557, -18347, -22695, -3304, -2339, 2652, 8767, 11478, 36493, 16724, -11897, -13054, 5151, 34600, 41270, 27018, 20064, 15575, -97, 6029, -7283, 5604, 10273, 14381, 6281, -5360, 19222, 31488, 38586, 31342, 23505, 16393, 20199, 4576, 2572, 21857, 21681, 33901, 20712, 29067]
$$ [...]
##END NTUPLES=NMR SPECTRUM
##END=
