##TITLE=Analysis number 323152
Compound Code cc 63613
Book Reference 470/109
Project Code adrs
Chemist Name mikem
##JCAMPDX= 6.0         $$ Bruker NMR JCAMP-DX V2.0
##DATA TYPE= NMR SPECTRUM
##DATA CLASS= NTUPLES
##ORIGIN= Bruker BioSpin GmbH
##OWNER= nmr
$$ XWIN-NMR		Version 3.5
$$ Tue Oct 17 17:12:38 2006 GMT Daylight Time (UT+1h)  MAYBRIDGE\nmr@NMR_250MHZ
##.OBSERVE FREQUENCY= 250.131544655141
##.OBSERVE NUCLEUS= ^1H
##.ACQUISITION MODE= SIMULTANEOUS (DQD)
##.ACQUISITION SCHEME= undefined
##.AVERAGES= 16
##.DIGITISER RES= 18
##SPECTROMETER/DATA SYSTEM= dpx250
##.PULSE SEQUENCE= zg30
##.SOLVENT NAME= CDCl3
##.SHIFT REFERENCE= (INTERNAL, CDCl3, 0, 16.4342)
##AUDIT TRAIL= $$ (NUMBER, WHEN, WHO, WHERE, WHAT)
$$ ##TITLE= Audit trail, XWIN-NMR		Version 3.5
$$ ##JCAMPDX= 5.01
$$ ##ORIGIN= Bruker BioSpin GmbH
$$ ##OWNER= nmr
$$ C:\u/data/dgb/nmr/ADRS/760/pdata/1/auditp.txt
$$ ##AUDIT TRAIL=  $$ (NUMBER, WHEN, WHO, WHERE, WHAT)
(   1,<2006-10-17 17:12:15.92 +100>,<MAYBRIDGE\nmr>,<NMR_250MHZ>,
      <created by zg, POWCHK disabled, PULCHK disabled
       configuration hash MD5:
       49 4B E0 1D 92 C2 6B 37 9F E6 65 BC 52 41 86 1D
       data hash MD5: 64K
       87 1D 25 1A 83 67 F8 33 FD 9B 8A EB 7E E8 93 3C>)
(   2,<2006-10-17 17:12:28.80 +100>,<MAYBRIDGE\nmr>,<NMR_250MHZ>,
      <Start of raw data processing
       ef LB = 0.3 FT_mod = 6 PKNL = 1 SI = 32K 
       data hash MD5: 32K
       7A 83 93 CD 45 84 B7 5A 0A C7 29 9A 10 25 47 D3>)
(   3,<2006-10-17 17:12:30.59 +100>,<MAYBRIDGE\nmr>,<NMR_250MHZ>,
      <apk 
       data hash MD5: 32K
       46 17 8A E7 FB 60 5E 07 13 22 91 AA 88 1D 65 D7>)
(   4,<2006-10-17 17:12:31.34 +100>,<MAYBRIDGE\nmr>,<NMR_250MHZ>,
      <abs ABSG = 5 
       data hash MD5: 32K
       BF FB 56 DB 8C 05 AA 8C DE D3 8F 2B C9 00 38 1D>)
$$ ##END=
$$ 
$$ hash MD5
$$ C4 12 79 EA 2B 21 AD FD E8 57 59 09 05 95 8A F3
##$RELAX= 
##$RELAX= 
##$RELAX= 
##$RELAX= 
##$RELAX= 
##$RELAX= 
##$RELAX= 
$$ Bruker specific parameters
$$ --------------------------
##$DU= <C:\u>
##$EXPNO= 760
##$NAME= <ADRS>
##$PROCNO= 1
##$TYPE= <nmr>
##$USER= <dgb>
##$AMP= (0..31)
100 100 100 100 100 100 100 100 100 100 100 100 100 100 100 100 100 100 
100 100 100 100 100 100 100 100 100 100 100 100 100 100 
##$AQSEQ= 0
##$AQ_mod= 3
##$AUNM= <au_zg>
##$AUTOPOS= <11 >
##$BF1= 250.13
##$BF2= 250.13
##$BF3= 250.13
##$BF4= 250.13
##$BF5= 500.13
##$BF6= 500.13
##$BF7= 500.13
##$BF8= 500.13
##$BYTORDA= 1
##$CFDGTYP= 0
##$CFRGTYP= 5
##$CHEMSTR= <none>
##$CNST= (0..31)
1 1 145 1 1 1 1 1 1 1 1 1 1 1 1 1 1 1 1 1 1 1 1 1 1 1 1 1 1 1 1 1 
##$CPDPRG= <>
##$CPDPRG1= <>
##$CPDPRG2= <>
##$CPDPRG3= <>
##$CPDPRG4= <mlev>
##$CPDPRG5= <mlev>
##$CPDPRG6= <mlev>
##$CPDPRG7= <mlev>
##$CPDPRG8= <mlev>
##$CPDPRGB= <>
##$CPDPRGT= <>
##$D= (0..31)
0 1 0 0 0 0 0 0 0 0.06 0 0 0 0 0 0 0.0002 0 0 0 0 0 0 0 0 0 0 0 0 0 0 
0 
##$DATE= 1161101534
##$DBL= (0..7)
120 120 120 120 120 120 120 120 
##$DBP= (0..7)
150 150 150 150 150 150 150 150 
##$DBP07= 0
##$DBPNAM0= <>
##$DBPNAM1= <>
$$ [...]
##$SUBNAM7= <"">
##$SUBNAM8= <"">
##$SUBNAM9= <"">
##$SW= 20.6930455092707
##$SWIBOX= (0..15)
0 0 3 0 0 0 0 0 0 0 0 0 0 0 0 0 
##$SW_h= 5175.983436853
##$TD= 65536
##$TD0= 1
##$TE= 683.16
##$TE2= 300
##$TE3= 300
##$TEG= 300
##$TL= (0..7)
0 120 120 120 120 120 120 120 
##$TP= (0..7)
150 150 150 150 150 150 150 150 
##$TP07= 0
##$TPNAME0= <>
##$TPNAME1= <>
##$TPNAME2= <>
##$TPNAME3= <>
##$TPNAME4= <>
##$TPNAME5= <>
##$TPNAME6= <>
##$TPNAME7= <>
##$TPOAL= (0..7)
0.5 0.5 0.5 0.5 0.5 0.5 0.5 0.5 
##$TPOFFS= (0..7)
0 0 0 0 0 0 0 0 
##$TUNHIN= 0
##$TUNHOUT= 0
##$TUNXOUT= 0
##$USERA1= <user>
##$USERA2= <user>
##$USERA3= <user>
##$USERA4= <user>
##$USERA5= <user>
##$V9= 5
##$VALIST= <valist>
##$VCLIST= <CCCCCCCCCCCCCCC>
##$VD= 0
##$VDLIST= <DDDDDDDDDDDDDDD>
##$VPLIST= <PPPPPPPPPPPPPPP>
##$VTLIST= <TTTTTTTTTTTTTTT>
##$WBST= 1024
##$WBSW= 4
##$XGAIN= (0..3)
0 0 0 0 
##$XL= 0
##$YL= 0
##$YMAX_a= 456536
##$YMIN_a= -378915
##$ZGOPTNS= <>
##$ZL1= 120
##$ZL2= 120
##$ZL3= 120
##$ZL4= 120
##$ABSF1= 16.43422
##$ABSF2= -4.258951
##$ABSG= 5
##$ABSL= 3
##$ALPHA= 0
##$AQORDER= 0
##$ASSFAC= 0
##$ASSFACI= 0
##$ASSFACX= 0
##$ASSWID= 0
##$AUNMP= <proc_1d>
##$AZFE= 0.1
##$AZFW= 0.1
##$BCFW= 0
##$BC_mod= 0
##$BYTORDP= 0
##$COROFFS= 0
##$CY= 12.5
##$DATMOD= 1
##$DC= 0
##$DFILT= <>
##$DTYPP= 0
##$F1P= 14.0000005364418
##$F2P= -0.99999901652339
##$FCOR= 0.5
##$FTSIZE= 32768
##$FT_mod= 6
##$GAMMA= 0
##$GB= 0
##$INTBC= 1
##$INTSCL= 1
##$ISEN= 128
##$LB= 0.3
##$LEV0= 0
##$LPBIN= 0
##$MAXI= 10000
##$MC2= 0
##$MEAN= 0
##$ME_mod= 0
##$MI= 0
##$NCOEF= 0
##$NC_proc= -5
##$NLEV= 6
##$NOISF1= 0
##$NOISF2= 0
##$NSP= 0
##$NTH_PI= 0
##$NZP= 0
##$OFFSET= 16.43422
##$PC= 1
##$PHC0= -56.21037
##$PHC1= 9.12286
##$PH_mod= 1
##$PKNL= yes
##$PPARMOD= 0
##$PSCAL= 4
##$PSIGN= 0
##$REVERSE= no
##$SF= 250.130021955344
##$SI= 32768
##$SIGF1= 0
##$SIGF2= 0
##$SINO= 400
##$SIOLD= 32768
##$SREGLST= <1H.CDCl3>
##$SSB= 0
##$STSI= 32768
##$STSR= 0
##$SW_p= 5175.98343685301
##$SYMM= 0
##$S_DEV= 0
##$TDeff= 65536
##$TDoff= 0
##$TI= <Analysis number 999999
Compound Code 99
Book Reference 9
Project Code 9>
##$TILT= no
##$TM1= 0
##$TM2= 0
##$TOPLEV= 0
##$USERP1= <user>
##$USERP2= <user>
##$USERP3= <user>
##$USERP4= <user>
##$USERP5= <user>
##$WDW= 1
##$XDIM= 32768
##$YMAX_p= 561792475
##$YMIN_p= -349926
$$ End of Bruker specific parameters
$$ ---------------------------------
##NTUPLES= NMR SPECTRUM
##VAR_NAME=  FREQUENCY,     SPECTRUM/REAL,   SPECTRUM/IMAG
##SYMBOL=    X,             R,               I
##VAR_TYPE=  INDEPENDENT,   DEPENDENT,       DEPENDENT
##VAR_FORM=  AFFN,          ASDF,            ASDF
##VAR_DIM=   32768,         32768,           32768
##UNITS=     HZ,            ARBITRARY UNITS, ARBITRARY UNITS
##FACTOR=    0.157963299565203, 1,           1
##FIRST=     4110.69164942368, 0,            0
##LAST=      -1065.29178742933, 0,           0
##MIN=       -1065.29178742933, -349926,     0
##MAX=       4110.69164942368, 561792475,    0
$$ Real data points
##PAGE= N=1
##DATA TABLE= (X++(R..R)), XYDATA
$$ [...]
19913A03469r8699r489L4374M1416Q16L3671L5679j6834J1092J41218j089p2814
19901B02810j37458m2908K9242L9792P663O2480M042j746m5728M645J303k6556
19889I7581P224O0514l3489L8277M72O6953K8485o1290M0246j5904J9418K5977
19877B74464k0733k6020l2821j5464K688m029j3750m5934k0352j6125n1282L1134
19865F1776J7944o8963m0556m6967l8217L7616J6239m3825K3591k9745p48L962
19853a07893r88L0750P2126n400M609L0168O9566K1157m4677l3158r0538j8889
19841g3167P7993j133N7970M0776m3088l8809m3093P37Q5224M5958l8434M9124
19829A20058k9746o6917l0708K3902J2091n5183j0024K8272k7370M1244j0988
$$ y = [103469, 4770, -4719, 29655, 71071, 71887, 105558, 141237, 124403, 135495, 276713, 275624, 202810, 65352, 22444, 51686, 91478, 99141, 161621, 165663, 163917, 118189, 122834, 124137, 97581, 104805, 165319, 131830, 170107, 170579, 237532, 266017, 204727, 244973, 229069, 248487, 274464, 253731, 227711, 194890, 179426, 182114, 178085, 164335, 118401, 98049, 81924, 30642, 61776, 79720, 10757, -29799, -76766, -114983, -77367, -61128, -104953, -81362, -111107, -111855, -107893, -108881, -78131, -6005, -11405, -6796, 23372, 92938, 114095, 69418, 36260, -54278, -73167, 4826, 3693, 61663, 102439, 59351, 20542, -22551, -21814, 63410, 109368, 70934, 120058, 90312, 23395, -7313, 16589, 28680, -26503, -36527, -8255, -35625, 5619, -5369]
19818e369M1779k2447m7701k2715K237J06510L6312j6718m2383O679j6337q3156
19806f3309K6895L1676K9746M940n4852j7659N8575P3051R0157R414j3346m3348
19794A31940j9199L4714L8144J3020j2521j8002L3551l7616K5025n2904p8273
19783E7879k5842k5530Q1140P274M745J8155j28438K9276R7811L9946o070N031
19771A55377k4685n606j133j7514J5497q8090q1340l1135P9878O7843R7497K1745
19759A88334k8830p536n3214q5194L625L8040O6480j7415M1504J5999p9478N6677
19747A38992O4023m2059l8493J9204m4106l5952P73N514N003P2349k2935m6180
19735G6133m1732m1924J6153m211N0362J17453R751m5208o0036q6524m1704q5252
$$ y = [-5369, 36410, 13963, -33738, -56453, -54216, 52294, 88606, 71888, 29505, 36184, 19847, -63309, -36414, -4738, 25008, 29948, -24904, -42563, 16012, 89063, 179220, 188634, 175288, 131940, 112741, 147455, 185599, 198619, 186098, 168096, 201647, 164031, 189056, 136152, 57879, 32037, 6507, 87647, 94921, 99666, 117821, -10617, 18659, 116470, 156416, 150346, 155377, 130692, 125086, 123953, 106439, 121936, 33846, -47494, -78629, 1249, 69092, 166589, 188334, 159504, 151968, 98754, 13560, 17185, 55225, 121705, 104290, 145794, 161793, 82315, 138992, 203015, 160956, 122463, 141667, 97561, 61609, 62382, 67896, 72899, 145248, 122313, 76133, 34401, -7523, 8630, 4419, 54781, 172234, 181985, 136777, 76741, -9783, -51487, -136739]
19723a36739O8138J10815j7389j2136L7682K4479n0696J5775j4702J6487P1891
19712A13605M1252N3764o726k7512l9907J11030n6144o6636j608o3776j9069j9724
19700A8549K0531j3141j9390P1235M3144J4691k75K5839l1179l4900r3632n4411
19688e2939l555J3739j1175P0668N2549k3146j11728L0480J29692k142l0666O528
19676F8305k0628o0949j0953N5217J17227M8221m2277J814O438j44265l8041L7589
19664A7698P8133P2905M4241n4442n6996K1800p993k2802j259R187q2601o2063
19652d4192L8183M9816K9381j2282k1086j9199N260n1858j5696J903P9913M6629
19640H6772j575L5470k6532n0549j7536q445K4124N549j3250P546K6053k1703
$$ y = [-136739, -68601, 42214, 24825, 12689, 50371, 74850, 24154, 39929, 25227, 41714, 113605, 154857, 208621, 201895, 174383, 134476, 245506, 189362, 122726, 121118, 57342, 38273, 18549, 39080, 25939, 6549, 77784, 120928, 135619, 135344, 161183, 130004, 95104, 1472, -52939, -56494, -42755, -53930, 16738, 69287, 46141, -65587, -35107, 94585, 92443, 61777, 68305, 47677, -13272, -24225, 30992, 148219, 196440, 154163, 155977, 162415, 18150, -19891, 17698, 95831, 168736, 212977, 158535, 101539, 123339, 115346, 92544, 91285, 100472, 17871, -44192, -6009, 43807, 73188, 60906, 39820, 20621, 25881, -25977, -41673, -39770, 40143, 86772, 85197, 120667, 94135, 43586, 26050, 17605, 41729, 47278, 34028, 41574, 67627, 45924]
19628D5924J1468j1276q063j03888L9869M9876k1662M407Q329m8605m7546J2444
19616f8723N2412j2237J8468K2156M4436O211K6018r6162k4946j1470m5918M6057
19604d3698J0420j4477N2307K3149K3846J7595N1040N5347k9437o8142L1250J53
19592A09353o1123j8584J2292M1522O2034j06421j14831L968O413o98M2084k162
19580b6153n7520K9549J05839N0874k5255K0073j89n4820n0382K2639M19j03858
19568h8784l3639l088L9615P3078o0245r690J2565j8959J6498O8768O1041L2886
19556I0046N3886R391l1923Q2187n2805q5929l5988J7224N0367M6373k1840l8184
19544H2805j138l7769l5054l5269J4621J04002p5554L1189M7129M1834J2781O6286
$$ y = [45924, 57392, 46116, 38053, -65835, -25966, 23910, 2248, 6655, 14984, -33621, -81167, -68723, -16311, -28548, -10080, 12076, 56512, 62723, 88741, -7421, -32367, -43837, -89755, -43698, -33278, -47755, 4552, 27701, 51547, 69142, 120182, 175529, 146092, 77950, 109200, 109353, 48230, 29646, 41938, 83460, 145494, 39073, -75758, -71790, -65377, -66075, -23991, -26153, -83673, -54124, 51715, 102589, 77334, 97407, 97218, 42398, -7984, 14655, 15074, -88784, -122423, -125511, -85896, -12818, -73063, -82753, -70188, -89147, -72649, -3881, 57160, 90046, 143932, 153323, 121400, 203587, 150782, 64853, 28865, 46089, 96456, 142829, 120989, 82805, 81667, 43898, 8844, -26425, -11804, 92198, 16644, 47833, 94962, 136796, 149577, 215863]
19532B15863r569n8742J4576o7314p4183k1031Q513K8411O0306J4103l53L2753
19520A43333J4108L5790J3983r7983j16240k2833k4474M427M3118N5095o468r858
19508C1998j7169k4082P8272N9923M9478M1686k0939J9331p738j6186j6255p3731
19496A04588m779m885J9991o0085o447r634n5135j4205k5766k5910m515K5345
19484f1437M6276M2025j7650O2105M9883O4084J815l7236M2537J4661j3433k157
19472A91473p3103p1677N975m1584J8522M342l5453R410P5678K9696l2737O15
19460H1157q547j9958K5382k009O4979m864l7921J8798j0362k0253l1538l0504
19448B4360L6823O7254N5496M8155K1692m5269k3385j24867n8405j01114j8900
$$ y = [215863, 206294, 147552, 162128, 94814, 20631, -400, 8113, 36524, 96830, 110933, 110580, 143333, 157441, 193231, 207214, 109231, -7009, -29842, -54316, -49889, -6771, 48324, 41856, 31998, 14829, -9253, 69019, 128942, 178420, 220106, 199167, 218498, 210760, 194574, 178319, 104588, 99809, 94924, 114915, 54830, 48383, 38749, -16386, -30591, -56357, -82267, -86782, -61437, -15161, 26864, 9214, 71319, 121202, 185286, 187101, 149865, 192402, 207063, 193630, 191473, 118370, 46693, 52668, 11084, 29606, 33948, -1505, 7905, 83583, 113279, 80542, 81157, 72610, 52652, 78034, 76025, 141004, 136140, 98219, 117017, 106655, 86402, 54864, 24360, 61183, 128437, 183933, 232088, 253780, 208511, 185126, 60259, 1854, -99260, -118160]
19437a18160J00637P3341K4168J4287j5370j292k4173o0599k5280N5924N4631
19426G8114Q2108K3610k091L3098k244l0592k5051m89m3401k7381n8446K9122
19414E6357L4576l3147O857k2894k948K1337O43j9687p5612J7150N8179L854J1807
19401E6472Q261K7081l0423j02489K3168L1342l679n1920p2116P6079J23646M2611
19389A28033j4129q275M3377r292j6274N1211r4266n6909L5550r848l3240L0856
19377D6794O3886K9415M8796P663k4698l2955n9386j6032p451p4525j4029M5744
19365A3222J4316J1235k8323j682N2545M2523P540q5714n5334L9000M9249n6818
19353A759m5218Q301L0917R6490Q2115j052n8743r5345n151O1369m561j3980O394
$$ y = [-118160, -17523, 55818, 79986, 94273, 78903, 77611, 53438, -7161, -32441, 23483, 78114, 160222, 183832, 181741, 214839, 212595, 182003, 156952, 156463, 113062, 85681, 27235, 56357, 90933, 57786, 64643, 41749, 38801, 60138, 60781, 41094, -34518, -17368, 40811, 44665, 56472, 64733, 91814, 61391, -41098, -17930, 13412, 9733, -42187, -114303, -38224, 85422, 128033, 113904, 105629, 149006, 139714, 123440, 174651, 80385, 23476, 59026, 49178, 15938, 46794, 110680, 140095, 188891, 196554, 171856, 138901, 79515, 63483, 56032, -18493, -32522, 13222, 27538, 38773, 10450, 8768, 61313, 103836, 111376, 25662, -29672, 9328, 58577, 1759, -43459, -35158, -4241, 92249, 174364, 173312, 114569, 19224, 14073, 75442, 70881, 56901, 63295]
19340F3295J9836M7429P1981J9466n8880k741J0116j5699o9140L5610O1997Q5271
19328B68541Q5575k9314p2909l8854q0752o5262N364N009J7975k4095k4049j2002
19316C5227p280M8926K9452k3875K8428m2329K0764n9631l259J7199k1261j7446
19304D915r052j8279M0925r923J4850P5600O3279N2518m2970n4937n777M0619
19292A51768k1513n4633j9567m9345m8143O9820J8712k4755k5698N5325M6361
19281I8332K5056L268L7223K0193L4247k9003k9973k6245j5090j17430l0020J0206
19269a9236l6611j5133N8637N4534J0122O0337L2577j05945k4694J0271J02695
19258A27554J1855l7426p2642n935N5748p854N8086R1778l4644j5420K3721K6815
$$ y = [63295, 83131, 130560, 202541, 222007, 163127, 160386, 170502, 154803, 85663, 121273, 183270, 268541, 354116, 324802, 251893, 213039, 132287, 67025, 72389, 77398, 95373, 71278, 47229, 35227, 27947, 76873, 106325, 82450, 110878, 68549, 89313, 29682, 26423, 43622, 22361, 4915, -4137, -22416, 18509, 8586, 23436, 99036, 162315, 214833, 171863, 116926, 111149, 151768, 130255, 75622, 56055, 6710, -41433, 28387, 47099, 22344, -3354, 51971, 98332, 123388, 126656, 163879, 184072, 218319, 189316, 159343, 133098, 118008, 578, -29442, -19236, -55847, -70980, -12343, 42191, 52313, 112650, 145227, 39282, 14588, 24859, 127554, 139409, 101983, 29341, 23406, 79154, 71300, 129386, 221164, 186520, 171100, 194821, 221636]
19246B21636o472j4550j4522K6415J051k4952J2282n57j2066n843K1578M2399
19234B46399p28n0570k5249p6065M1605L77k1642M0196J8101k8220o0946m2347
19222D0911M8357m005j2364J0935m24M3277m9517m3108r512M5571K5959J9782
19210A15862K788L4068l2331K808j6009L84O350l0905L1347Q4666P1179n3786
19198B16421q8292j7712J4860L7729K1684l2878n0535K2779P7523k7585n6146
19187A17848K7744M39J6815J0905o2373N4324M4769n9784p859o5692j5685j9059
19175D2392O7647J2389J8719L1300j923L7888l1498k0631P147J7373o4484j3257
19163A03062j3285j7910k148q486l36K6969J7636j2732L4644M3413J4312K1563
$$ y = [221636, 215164, 200614, 186092, 212507, 213558, 188606, 200888, 200331, 188265, 182422, 204000, 246399, 245671, 195101, 169852, 93787, 135392, 135769, 114127, 154323, 172424, 144204, 83258, 40911, 89268, 85263, 72899, 83834, 83410, 126687, 77170, 34062, 24550, 70121, 96080, 115862, 118650, 152718, 120387, 123195, 107186, 107570, 113920, 83015, 114362, 199028, 270207, 216421, 128129, 110417, 125277, 163006, 184690, 151812, 101277, 124056, 201579, 173994, 117848, 145592, 146031, 162846, 173751, 111378, 165702, 210471, 150687, 142828, 77136, 61451, 42392, 110039, 122428, 141147, 172447, 170524, 208412, 176914, 156283, 163430, 180803, 116319, 103062, 89777, 71867, 69719, 61233, 60897, 87866, 105502, 92770, 127414, 170827, 185139, 206702]
19151B06702m4731n2136l1388l7319L2839K4537K1377j6129l2446o8931n838P8208
19139G4745J6002k799K6291N1209J281k3377n4072M3749K2139Q949n6304j8486
19127H9327Q7731k670m9615J1079K3595K7184P9500P875m2430j290L2861J4239
19115B77386l4859m3701K566Q2440P6430Q1545L2821K0191N1288l30K2509M9889
19103F18175N1243N7610P1636L6933O6856L5617P5693Q4817k4015j1496K3177
19092A086246K7468K1951j35779m0071P1625o790q1024o3847J2156l9965l9492
19081H12478j42917n3715j9732Q160p2914r6851m2958M887j16614p4891n978K6724
19069B25679j067j4733l1238J05117J4227n2370m8959o0446N1429N7631l7383
$$ y = [206702, 161971, 109835, 78447, 41128, 73967, 98504, 119881, 103752, 71306, 2375, -3463, 74745, 90747, 87948, 114239, 165448, 166729, 143352, 89280, 133029, 155168, 164117, 107813, 89327, 177058, 174388, 124773, 135852, 159447, 186631, 266131, 274006, 231576, 230286, 263147, 277386, 242527, 198826, 201392, 283832, 360262, 441807, 474628, 494819, 546107, 545777, 568286, 618175, 669418, 727028, 798664, 835597, 902453, 938070, 1013763, 1098580, 1074565, 1063069, 1086246, 1113714, 1135665, 999886, 959815, 1031440, 1024650, 943626, 879779, 891935, 851970, 812478, 669561, 615846, 596114, 604274, 531360, 434509, 391551, 396438, 279824, 204933, 198955, 225679, 224612, 209879, 178641, 283758, 297985, 245615, 196656, 136210, 187639, 245270, 207887]
19058B07887k1587k5795J6092M6876q321K1598K1652j4932j6599m6790o824K3273
19046A96530r953n773J4189n5346r118J1201k8039k708k1451o7977Q9171P1285
19034A82011q283m2076L3029O5328j8015k5981k6905q698J671J2007k6062j3404
19022A24622L394L012m4705K3216M9949l4741m6767j8600N3020L7513K9318k4871
19010A54360j7703M5959K7762n511R278j0348j4408M6458J2131K2163M1733l6638
18998B75236l3782M9249K5392o9080k2412K2437R2766j4099n2040j04337L0295
18987A99625Q7154N6376M3544o0231l8399l6915k2018K0488l1417m915l7066j12499
18975F3727K654M0290Q3665J15304n7329m4306J9416k8533M6445K8397Q858L5223
$$ y = [207887, 186300, 160505, 176597, 223473, 215152, 236750, 258402, 243470, 226871, 180081, 173257, 196530, 186577, 180804, 194993, 139647, 130529, 141730, 113691, 110983, 89532, 21555, 110726, 182011, 173728, 131652, 164681, 230009, 211994, 186013, 159108, 150410, 152081, 164088, 138026, 124622, 128016, 131028, 86323, 109539, 159488, 124747, 77980, 59380, 112400, 149913, 179231, 154360, 136657, 182616, 210378, 204867, 214145, 203797, 189389, 235847, 247978, 270141, 311874, 275236, 241454, 290703, 316095, 247015, 224603, 247040, 339806, 325707, 273667, 169330, 199625, 286779, 343155, 386699, 326468, 288069, 251154, 229136, 249624, 218207, 213292, 176226, 63727, 66381, 106671, 190336, 305640, 248311, 204005, 223421, 194888, 241333, 269730, 278588, 313811]
18963C13811M0602l5971J2405J685R418J1366o9051J6724k6467P741K008L4056
18951C18327J6199J8131P7013l4240o8988N5485j946l5922J8238q5994J845J8630
18939B96778r5429o9036K7305J09851N9260N2546n0155j32550j1350M1962j2659
18928B16523l6390O2625Q7818K9449j3522o6640n1311o0252K6758M409M0955O1814
18916C02236m0929p7135P640J0626O2907J3812J7341K1976Q338m5958L6984K5779
18904C43617p3477M3530Q4166k4661l1564N833J8630P6652m8286J5999O7530O9859
18892E47828J20144L7062l9893l0019j223L4745L8725N6176J3795K6114J0679
18881H14133k2354k821p2809q4379o894O2385l0769r2494J5496P5377m0743J3366
$$ y = [313811, 354413, 318442, 330847, 332532, 341950, 353316, 284265, 300989, 274522, 282263, 284271, 318327, 334526, 352657, 429670, 395430, 326442, 381927, 379981, 344059, 362297, 276303, 278148, 296778, 201349, 132313, 159618, 269469, 328729, 381275, 331120, 198570, 187220, 229182, 216523, 180133, 242758, 330576, 360025, 346503, 279863, 228552, 168300, 195058, 199467, 240422, 302236, 261307, 184172, 191812, 202438, 265345, 279157, 296498, 318474, 326812, 280854, 317838, 343617, 270140, 313670, 397836, 373175, 341611, 347444, 366074, 442726, 394440, 410439, 477969, 547828, 667972, 705034, 665141, 635122, 633899, 668644, 707369, 763545, 777340, 803454, 814133, 791779, 788958, 716149, 631770, 624876, 687261, 656492, 563998, 579494, 654871, 614128, 627494]
18869F27494M5324r688r3287q4877P36k049k7748J9341M3631n805Q6499Q490m3586
18856E64475K7881R516J1581M9062L8523N7552Q4561P4297m2323L5602R5409O3680
18844A069816m3397K5512l820M0392J57354J11612N8544J14823J3252N5807N0555
18833A650450K7064k5986k7120q1335o2446l3808m3119m6983l1789L0154p512
18822A347570L815j1920j20453j41679j00945j02429l6170r9373r6228o9887m0070
18811E32231m5851m5333r968l646k3311r611M7202J05033N2635k0133n0825m8790
18799D79633m6994n1202o177k9929P1618J31646O065l6063q976K0767j0018L2945
18787E53315l5298k1190J9655M4920O965N3761O3939N8280M0302R3450J03372
$$ y = [627494, 672818, 663130, 569843, 484966, 485702, 483653, 455905, 475246, 518877, 513072, 599571, 608061, 564475, 592356, 601872, 613453, 662515, 701038, 758590, 843151, 917448, 875125, 910727, 1006136, 1069816, 1026419, 1051931, 1048111, 1088503, 1245857, 1357469, 1416013, 1530836, 1544088, 1599895, 1650450, 1677514, 1651528, 1624408, 1543073, 1480627, 1446819, 1403700, 1356717, 1324928, 1355082, 1347570, 1351385, 1339465, 1219012, 1077333, 976388, 873959, 837789, 738416, 642188, 572301, 532231, 486380, 441047, 431079, 427433, 404122, 394511, 441713, 546746, 599381, 579248, 528423, 479633, 432639, 381437, 375260, 345331, 416949, 548595, 554660, 518597, 509621, 530388, 520370, 553315, 518017, 496827, 516482, 561402, 568367, 622128, 686067, 744347, 784649, 878099, 981471]
18776I81471J56609J43060J614R214m7465m4148m8276K7112N2784n9852j27655
18765A044468j76775j33744j50383q7865K3651M3779K186N1759j630j8085K6979
18754F24340M9928k6998P3095K8855o1814k4953L09K5588L6016O8519L7204K1744
18742H51833n978P952M3574M6570M5877r3348K5202N8374J52569N8906R6252O8559
18730A356342o8306N9827O7755l3319l3633m6705q548P2509l042o9321j19966
18719A173593j49017j74941r0451j3675k7540P4796L1942k8508j1741o2487q069
18708G13902J04039M3658M9962m6142N1701J8870n8076P193P5014O9049P696M115
18696A040981l0376J4176o562M7960J30238L7666N1510O6889R9272M1879l7451
$$ y = [981471, 1138080, 1281140, 1282754, 1291968, 1244503, 1200355, 1152079, 1179191, 1231975, 1172123, 1044468, 867693, 733949, 583566, 495701, 519352, 563131, 565317, 617076, 615446, 597361, 624340, 674268, 647270, 720365, 749220, 687406, 662453, 662762, 688350, 724366, 792885, 830089, 851833, 845855, 853807, 897381, 943951, 989828, 896480, 921682, 980056, 1132625, 1191531, 1287783, 1356342, 1288036, 1347863, 1415618, 1382299, 1348666, 1301961, 1293413, 1365922, 1362880, 1293559, 1173593, 1024576, 849635, 759184, 745509, 717969, 792765, 824707, 796199, 784458, 721971, 713902, 817941, 861599, 911561, 865419, 917120, 935990, 877914, 885107, 960121, 1029170, 1036866, 1040981, 1010605, 1024781, 1018219, 1066179, 1196417, 1234083, 1285593, 1352482, 1451754, 1493633, 1456182]
18685A456182n115n4521m8354K7615L5946o4554J2918J62146J65261O8107m7771
18674A707860q6605j88253j53254m1051j9561M4381N5379Q2922K3318q4070o5302
18663A275764r5921q9625m1954K9526j7465l6912k0189o0215l6753n8297m2592
18652H05367j0590P4294M3859k0713q7955n6092R1801Q5720J07425j9953J0697
18641A023860j4489k0080j2132M1465O065M9103K5967L4016J9290O6696P8698
18630A298459N1370K7044n703p4317m3550J1512L5903M1813K3796N646J7120k2598
18618A366495n7919j02316j04975j3815O5873O851J2756m4190q7563n4165l5380
18607I51652j2257K8471l5508n2322M3220m968l3838l988m3665p5278k0547N168
$$ y = [1456182, 1451067, 1396546, 1348192, 1375807, 1411753, 1347199, 1360117, 1522263, 1687524, 1755631, 1707860, 1621255, 1433002, 1279748, 1238697, 1219136, 1263517, 1318896, 1401818, 1425136, 1341066, 1275764, 1179843, 1090218, 1048264, 1077790, 1060325, 1023413, 1003224, 943009, 906256, 847959, 805367, 794777, 869071, 912930, 892217, 804262, 748170, 839971, 925691, 1033116, 1013163, 1023860, 1009371, 989291, 977159, 1018624, 1024689, 1073792, 1099759, 1133775, 1153065, 1219761, 1298459, 1349829, 1376873, 1371170, 1296853, 1253303, 1264815, 1300718, 1342531, 1366327, 1371973, 1389093, 1366495, 1308576, 1206260, 1101285, 1087470, 1153343, 1160194, 1172950, 1128760, 1041197, 987032, 951652, 939395, 967866, 932358, 880036, 923256, 918288, 884450, 880462, 836797, 761519, 740972, 746140]
18595G46140N7593O4386k5339J7194M7180K6884N500K5596M099j12517n7150M415
18583H03981J0300q1381m8032O8113K0813k9227L6281M553L3088q563K9010P2356
18571I11292O8740k8433n1010j7910K029P8814P0800l6526K8154l1684j8226J77
18559I76217K5041l7696q761Q20R9736J05935J6278j0213k4862q055l4839K9708
18547A129309l3657m2259p6948j2961l8868J085m854K7730k8892Q4147Q2761M6240
18535A132833n6508r3948k3793L0528O1478P0300n1980l912M7970P9296O9263
18524A261527M2373N3509K8336m5105K3302M4039O4047J12131N3783j8573n906
18513A613463Q1615M350N6215p5467q7968J6273j1958n6089m1871P4268k3108
$$ y = [746140, 803733, 868119, 842780, 859974, 907154, 934038, 939538, 965134, 969233, 856716, 799566, 803981, 814281, 732900, 684868, 752981, 773794, 744567, 780848, 785401, 818489, 809926, 838936, 911292, 980032, 951599, 900589, 882679, 884708, 963522, 1034322, 997796, 1025950, 994266, 976040, 976217, 1001258, 963562, 954801, 955621, 1055357, 1161292, 1177570, 1167357, 1142495, 1134440, 1099601, 1129309, 1095652, 1053393, 976445, 963484, 924616, 925701, 920847, 948577, 919685, 1003832, 1086593, 1132833, 1076325, 982377, 958584, 989112, 1050590, 1120890, 1068910, 1064998, 1112968, 1192264, 1261527, 1303900, 1357409, 1385745, 1340640, 1363942, 1407981, 1472028, 1584159, 1637942, 1619369, 1613463, 1695078, 1699428, 1755643, 1680176, 1592208, 1608481, 1596523, 1540434, 1498563, 1572831, 1549723]
18502A549723j2285L0809j6927q1172O837j509J8910j9177P454n826l6104r401
18490A431332r870k6660L1334q329j18550K4800J16412R1920o179l9840m0807
18479A445563l2307m2191m9616J7158L1461L23j4072O4989P9428k8349J0342R34
18467A483663p7096o5254m526N7227k7718n8502n6971L6737N7834P5006M2562
18456A462962O4863O6143j5923L4537R5642R8647J19175J37800J23225P0460M0695
18445B298226m1981K2162o7030r8034m5683k83l849p0878k1494K8115N1079l4187
18433B016163K6256M793j4376k2334P2895J48655J31064L9099o4595p4132j2038
18422B251450K7786R9629N5891Q916K730L7579Q1161J00090L5235k9768o4379
$$ y = [1549723, 1537438, 1568247, 1551320, 1470148, 1476985, 1475476, 1494386, 1475209, 1482663, 1476837, 1440733, 1431332, 1421462, 1394802, 1426136, 1417807, 1299257, 1324057, 1440469, 1532389, 1526210, 1486370, 1445563, 1413256, 1371065, 1321449, 1338607, 1370068, 1370391, 1356319, 1421308, 1500736, 1472387, 1482729, 1483663, 1406567, 1341313, 1336787, 1394014, 1366296, 1307794, 1250823, 1287560, 1345394, 1420400, 1462962, 1527825, 1593968, 1578045, 1612582, 1708224, 1806871, 1926046, 2063846, 2187071, 2257531, 2298226, 2256245, 2278407, 2211377, 2113343, 2067660, 2067377, 2063528, 1992650, 1971156, 1999271, 2050350, 2016163, 2042419, 2047212, 2032836, 2010502, 2083397, 2232052, 2363116, 2402215, 2337620, 2263488, 2251450, 2279236, 2378865, 2434756, 2443672, 2446402, 2483981, 2565142, 2665232, 2700467, 2670699, 2606320]
18411B606320l089m1059K4983R3861O7940J10511N2069P4100J75041J59050P8746
18400C398473N0280J07241P7601J06014L9772j6195k6569j19512m2206j5680R294
18389C568513O1435J10126J53091J52909K51335J95257K62433L24275K96455L05998
18379E681827L49313M24767M82503M42089N35573O33972P23041Q74651J181993
18370A1329729J423886J755130K207057K659546L428252M414267N080563N270576
18362C7569006N547636O244648P003094O712805O195867N692138N572627N994306
18354H6532127O482991O359505N367632N741528O749560P465957O381315M958349
18346A36038964L455523K739321K155189L23779k732431n066968n314170m456177
$$ y = [2606320, 2603231, 2562172, 2587155, 2681016, 2748956, 2859467, 2911536, 2985636, 3160677, 3319727, 3398473, 3448753, 3555994, 3633595, 3739609, 3779381, 3763186, 3736617, 3617105, 3574899, 3559219, 3568513, 3629948, 3740074, 3893165, 4046074, 4297409, 4492666, 4755099, 5079374, 5375829, 5681827, 6031140, 6455907, 6938410, 7380499, 7916072, 8550044, 9273085, 10147736, 11329729, 12753615, 14508745, 16715802, 19375348, 22803600, 27217867, 32298430, 37569006, 43116642, 49361290, 56364384, 63077189, 69273056, 74965194, 80537821, 86532127, 93015118, 99374623, 104742255, 110483783, 117233343, 124699300, 131080615, 136038964, 139494487, 142233808, 144388997, 144712776, 141980345, 136913377, 131599207, 127143030]
18338A27143030m580164n687387n919027m263036k459368k499658m074874n601257
18330I2058259o341690o360889p010174q479562r645052r286660p809517o054204
18322C1070511m599947l418835k394034j784257j405998j047230r02281p34821
18314A4783108n94190m65367l40043j92415j25970j06230q8241o5695p5990j8040
18304A2710927l8058q6990j01029J378J42224K10360M06411P57406J143922J754256
18294A6900807K785872M100311N574884O163120N945472O416590Q536817J2285940
18286F8709813J4572958J2081179N994364o80274n245481o945650q025518j0090779
18278G0370612j2084748j2094540r754018o772358m327846k674492j734470j184415
$$ y = [127143030, 122562866, 116875479, 110956452, 106693416, 104234048, 101734390, 97659516, 92058259, 85716569, 79355680, 72345506, 63865944, 54220892, 44934232, 37124715, 31070511, 26470564, 23051729, 20657695, 18873438, 17467440, 16420210, 15517929, 14783108, 14188918, 13723551, 13383508, 13191093, 13065123, 12958893, 12870652, 12804957, 12728967, 12710927, 12672869, 12585879, 12484850, 12486228, 12628452, 12838812, 13245223, 14002629, 15146551, 16900807, 19686679, 23786990, 29361874, 35524994, 41470466, 47887056, 56423873, 68709813, 83282771, 95363950, 101358314, 100678040, 95432559, 88486909, 80461391, 70370612, 58285864, 46191324, 36437306, 29664948, 25337102, 22662610, 20928140, 19743725]
18270A9743725p09628l59839o3842M4962Q2561L14059O02521P47505P50024P57490
18260B1909538P42632O32960N50478O14919P92847J195590J784332K582087L730904
18251C4536287N306906P262916R961742J3657152J8507703K5595994L4484301
18244A49313001L8550820K9644114J4168096j602131r941900l567474K134195
18237B18698721j331686q683930j4363716j1163863J115302J4631495K4555320
18230B23457643K5955251J9885843O043111j2645979k2421590k4532941j9432686
18223A96308652j3069041r078245q807797q039824o657959o317404o839632p182266
18215A30316484q228290j1586842j4003971j5887157j4541871j0155545o161504
$$ y = [19743725, 19034097, 18674258, 18610416, 18655378, 18737939, 19051998, 19654519, 20402024, 21152048, 21909538, 22652170, 23285130, 23835608, 24450527, 25243374, 26438964, 28223296, 30805383, 34536287, 39843193, 47106109, 57067851, 70725003, 89232706, 114828700, 149313001, 187863821, 217507935, 231676031, 230073900, 220132000, 216564526, 218698721, 217367035, 208683105, 194319389, 183155526, 184270828, 198902323, 223457643, 249412894, 269298737, 275341848, 262695869, 240274279, 215741338, 196308652, 183239611, 174161366, 165353569, 157313745, 150655786, 144338382, 137498750, 130316484, 122088194, 110501352, 96497381, 80610224, 66068353, 55912808, 49751304]
18208D9751304l535415j871524n56798L55236J193893J963457L056382L864241
18200E4220776L519427L086542K353341J753999J285393O09392M6636k11187P70180
18191F7434499K498783M730292Q119606J3491108K1635465L2023644L9491917
18184A89425314L5070646J5964024l281747j8024299j6798985l193320O170706
18177B05332339J0134552Q774452J0151865J6518974J5666104N402431o182187
18170B65798530k2089797k9232546k2848691j7187933j2162916p552154m854157
18163A49870336m669139n401504n481008n653665o919386q395878q789677q891807
18155I5668272o765230l620656j955815j835059k682295l950319m849964m654864
$$ y = [49751304, 46215889, 44344365, 43787567, 44142803, 45336696, 47300153, 50356535, 54220776, 57740203, 60826745, 63180086, 64934085, 66219478, 66828870, 66875506, 66664319, 67434499, 69933282, 74663574, 82783180, 96274288, 117909753, 149933397, 189425314, 224495960, 240459984, 237178237, 219153938, 202354953, 199161633, 205332339, 215466891, 224241343, 234393208, 250912182, 266578286, 271980717, 265798530, 243708733, 214476187, 191627496, 174439563, 162276647, 154724493, 149870336, 145201197, 139799693, 134318685, 128665020, 121745634, 113349756, 104560079, 95668272, 88903042, 85282386, 83326571, 81491512, 78809217, 74858898, 70008934, 65354070]
18147F5354070l626769j916053Q59609M564042Q268688Q571907M631450j31971
18139H6574973m995854n744211k096941K596780O985653J0799077J0787308Q432731
18131A13339516Q669291J1874792K0926531K6413787K4404856Q831481j3035022
18124B01425232k4951121l1241386k4709778j4494610r012290o249963n092470
18117H5673614m719685l975380k181857J439776P205695J5595226K5785180K5403275
18109A50225844M345115j0207611l0495033l3330058j9967584j1572048p812240
18102D1186385n826549m445904l468108k657723j994137j482536j337027j057967
18094A8916434j031557j041433r86885q44220p59353n14065m30087k98432l09263
$$ y = [65354070, 61727301, 59811248, 60670857, 65234899, 73503587, 82075494, 86706944, 86574973, 81579119, 75834908, 73737967, 76334747, 83320400, 94119477, 104906785, 113339516, 122008807, 133883599, 154810130, 181223917, 205628773, 214460254, 201425232, 176474111, 145232725, 120522947, 106028337, 97016047, 90766084, 85673614, 80953929, 76978549, 74796692, 76236468, 83442163, 99037389, 124822569, 150225844, 154570959, 144363348, 113868315, 80538257, 60570673, 48998625, 41186385, 35359836, 30913932, 27445824, 24788101, 22793964, 21311428, 19974401, 18916434, 17884877, 16843444, 15856559, 15012339, 14252986, 13738921, 13308834, 13010402, 12701139]
18085A2701139m58617l48466k41721o9569J2653k0483O6783J05694K36687K75973
18075A2260073L00004K12114j23566l60610n33723o68510o99943o22010n42303
18066I221526m36805l28963k04956j02866Q935j363m195M322p4158j29652j90629
18055G761196k24430k54941j79570J3951J04435J09431M4450j7123j1808n0188
18045G295403j57720j14919k00253k45240k35517k14966j55210j56161j340O9245
18035E883322J56279Q2822J2978l5511M9375J29843N5200k0600l1868j6145j16907
18024F148788k72343l86078l83703l82062k93644k41876k96967j94522j58606
18015C538987j60626j28303k463N2286J1902K5371L9430l6962J0738n2536k6466
$$ y = [12701139, 12242522, 11894056, 11652335, 11582766, 11595419, 11574936, 11641719, 11747413, 11984100, 12260073, 12560077, 12772191, 12648625, 12288015, 11754292, 11085782, 10385839, 9763829, 9221526, 8784721, 8455758, 8250802, 8147936, 8156871, 8155508, 8151313, 8155635, 8081477, 7951825, 7761196, 7536766, 7281825, 7102255, 7116206, 7220641, 7330072, 7374522, 7357399, 7345591, 7295403, 7137683, 7022764, 6822511, 6577271, 6341754, 6126788, 5971578, 5815417, 5814077, 5883322, 6039601, 6122423, 6135401, 6099890, 6149265, 6279108, 6334308, 6313708, 6281840, 6265695, 6148788, 5876445, 5490367, 5106664, 4724602, 4430958, 4189082, 3892115, 3697593, 3538987, 3378361, 3250058, 3247595, 3299881, 3311783, 3337154, 3376584, 3339622, 3350360, 3297824, 3271358]
18004C271358l4501M5405O300J1128M3666j00346j15034q0525k1132m802O9829
17993C091346K6492q1846J9721l9198o1283p5601p0205l6783j16301o8682M665
17982B592325P5909L769q0250j79147j42070j14662j17673l8061k7418j04034
17972A868688n0576L422N4003J5675J20432J20686J51286N481n1706P3074J7516
17961B327981j02436m3231j0929J22151J22824L9629Q7203O604K8846k1099l428
17950B554115Q0928K3222J190O803R0018J3159N3031k636P2893R1459R2428J44326
17938C220936O3778N7534J66243K65439J88295K12047J82135J89688K65440K19043
17928E030578K26438J34465J48656N3248N9391J05127R7508M2943L7498j7665
$$ y = [3271358, 3236857, 3282262, 3288562, 3299690, 3343356, 3243010, 3127976, 3047451, 3026319, 3021517, 3091346, 3117838, 3035992, 3055713, 3016515, 2955232, 2879631, 2809426, 2772643, 2656342, 2587660, 2592325, 2668234, 2672003, 2591753, 2412606, 2270536, 2155874, 2038201, 2000140, 1972722, 1868688, 1818112, 1821534, 1875537, 1891212, 2011644, 2132330, 2283616, 2289097, 2237391, 2310465, 2327981, 2225545, 2182314, 2171385, 2293536, 2416360, 2455989, 2543192, 2549796, 2578642, 2557543, 2554115, 2635043, 2658265, 2659455, 2666258, 2756276, 2769435, 2822466, 2819830, 2892723, 2984182, 3076610, 3220936, 3284714, 3342248, 3508491, 3773930, 3962225, 4174272, 4356407, 4546095, 4811535, 5030578, 5257016, 5391481, 5540137, 5593385, 5652776, 5757903, 5855411, 5898354, 5935852, 5918187]
17918E918187n749j0692j08383j32375j38082j14404p9736j48925j93332j45744
17908D840765n4281q9651j65202j59487j13118j47662j40435k8660n5446r1785
17898C795038P0536L366L5280m5402p7707r2164j89062j61580j19393j19894p8160
17887C020858j05447j07306j12842p7791q1949l5019r2461j022l7990r4924o7053
17876B207054m701M9108K494O17Q2680J56338J06071M0454n0981Q5612O7709R0079
17864B832534K22838J89941J15120L2312O7348L8277R3441R3702R2680N8331j5535
17853C820989j1987O9742J12526L9615j6661J17815N6941r989R9625O9550O6520
17842D414686n6467n3441P4585L2299k745l7321l2680j78141o2550L5920N1702
$$ y = [5918187, 5912438, 5901746, 5793363, 5660988, 5522906, 5408502, 5328766, 5179841, 4986509, 4840765, 4786484, 4696833, 4531631, 4372144, 4259026, 4111364, 3970929, 3942269, 3886823, 3795038, 3865574, 3868940, 3904220, 3858818, 3781111, 3688947, 3499885, 3338305, 3218912, 3099018, 3020858, 2915411, 2808105, 2695263, 2617472, 2535523, 2500504, 2408043, 2407021, 2369031, 2274107, 2207054, 2202353, 2251461, 2253955, 2254572, 2337252, 2493590, 2599661, 2640115, 2589134, 2674746, 2742455, 2832534, 3055372, 3245313, 3360433, 3392745, 3460093, 3498370, 3591811, 3685513, 3778193, 3836524, 3820989, 3809002, 3878744, 3991270, 4030885, 4014224, 4132039, 4188980, 4178991, 4278616, 4348166, 4414686, 4358219, 4304778, 4379363, 4411662, 4408917, 4371596, 4338916, 4160775, 4098225, 4134145, 4185847]
17831D185847j706j22565j89180m7914J2159o5002j02560j19784j10324j44523
17821C294448j59787n8062o2024o6636l8863j2632J7661N8545l8887o7330R280
17810B875713n7583l4344q2079o1678q534j51812j05991J1981J2982J1747j3664
17799B396738k2604J22168P7732o9802j9643R0049O3568O7196R4318J01028J01712
17788C002460J6796N7648J04457Q3382m3897p071o690o5422j0806k4276o8924
17777C037657q3740j22568k9684j6335O5973M8768K6939j4098n3754l2297k7137
17766B799724J44164J42596K29816J03697R3380J17949K2846n4682o8928n4436
17756C476126m0322O9610P5916J1582O2927J22013J48017J57255K66161K47351
$$ y = [4185847, 4184141, 4061576, 3872396, 3824482, 3836641, 3771639, 3669079, 3549295, 3438971, 3294448, 3134661, 3076599, 3014575, 2947939, 2909076, 2896444, 2914105, 2972650, 2933763, 2866433, 2875713, 2818130, 2783786, 2701707, 2640029, 2631495, 2479683, 2373692, 2385673, 2398655, 2410402, 2396738, 2374134, 2496302, 2574034, 2504232, 2484589, 2574638, 2638206, 2705402, 2799720, 2900748, 3002460, 3019256, 3076904, 3181361, 3264743, 3220846, 3213775, 3207085, 3141663, 3130857, 3106581, 3037657, 2953917, 2831349, 2801665, 2785330, 2851303, 2900071, 2927010, 2912912, 2859158, 2826861, 2799724, 2943888, 3086484, 3316300, 3419997, 3513377, 3631326, 3654172, 3599490, 3530562, 3476126, 3435804, 3505414, 3581330, 3592912, 3655839, 3777852, 3925869, 4083124, 4349285, 4596636]
17746D596636K96700L34266L15366L90617O08243O38855O48816O34150Q21470
17737I285119R69786J289024J814714K626976L876869M959875N152095M437030
17729C4411488L324765J733011L23338l65181m25226R01665M177623Q692376J3232267
17720F6006126J5365547J4429001J2305169R540964R507158J5227236K5744794
17713A68125995L6961431M0045146K7232680J512434k3234665l5243848l0022974
17706A85376199j6326217m592430K020081L345601j685679p266583r848409r111805
17698A41910758m370340k578924o480038j2714822j4983543j4269091j1743943
17691G4770057r027451o929287n318731m420715m163345m306911l361463k030459
$$ y = [4596636, 4893336, 5227602, 5542968, 5933585, 6541828, 7180683, 7829499, 8463649, 9285119, 10254905, 11543929, 13358643, 15985619, 19862488, 24822363, 29974458, 34411488, 37736253, 39469264, 39792602, 39427421, 39002195, 39903860, 44081483, 52773859, 66006126, 81371673, 95800674, 108105843, 117646807, 127153965, 142381201, 168125995, 205087426, 245132572, 272365252, 273877686, 250643021, 215399173, 185376199, 169049982, 164457552, 166477633, 169823234, 168137555, 160870972, 151022563, 141910758, 137540418, 134961494, 128481456, 115766634, 100783091, 86514000, 74770057, 65742606, 58813319, 53494588, 49073873, 44910528, 40603617, 37242154, 35211695]
17683C5211695r45986k23822N26117J449416K459826L551137N136945O380963
17675E3546291O090081M685215L285101L535269O775704J0586568J0588790O481754
17667A05574773J430382o84028M600926J6819385L0184213L6557028L2508064
17660B26990743J8926403J107730m756965M18266P364476O701838l967417j7755613
17652B35029461k3492614j9209900j6041568j5774157j8787703j9998872j6838500
17645A04886147j2930093q868410o060037n224870n683328p013651q138858o680160
17637D4286740m872151m057037l730137l211307k505135j799408j268894j024531
17629B1818140r70439p01931n73472n52477o19187o75034n63517l70389k68747
$$ y = [35211695, 34265709, 34041887, 34568004, 36017420, 38477246, 42028383, 47165328, 53546291, 59636372, 64321587, 67606688, 71141957, 77917661, 88504229, 99093019, 105574773, 107005155, 106321127, 110922053, 127741438, 157925651, 194482679, 226990743, 245917146, 247024876, 242267911, 242686177, 250050653, 256752491, 252785074, 235029461, 211536847, 192326947, 176285379, 160511222, 141723519, 121724647, 104886147, 91956054, 83087644, 77027607, 71802737, 66119409, 59105758, 50966900, 44286740, 39414589, 35357552, 31627415, 28416108, 25910973, 24111565, 22842671, 21818140, 20847701, 20145770, 19572298, 19019821, 18400634, 17725600, 17162083, 16791694, 16522947]
17620A6522947j01499J27836M30116R32242J741461L059631N140485P263559O198192
17611D1314970K521996p97069l503923j218535M382567Q817458O924801R12110
17603E9354375n046726j0400391q374607l183165M14237M35691j584922l888799
17595B7725693n808255m847568l100735j932116j280098r55178o56129m43884
17587H701730l86999l70409m00236k95625k45691j28500j64921j95063k86966
17578F227320l83042k33930l43470k23051j09886j13139j64952k64821k37479
17569D153550j92430k09127j53861j17983j9128j33618j95364j59562r5116p5805
17559B801556k0592j37317j04628l0236j11498j3470l0446p4696j39530r8313
$$ y = [16522947, 16421448, 16549284, 16979400, 17911642, 19653103, 22712734, 27853219, 35116778, 41314970, 43836966, 43039897, 39535974, 38317439, 42700006, 51517464, 58442265, 59354375, 54307649, 43907258, 35532651, 32349486, 32763723, 33199414, 31614492, 27725693, 21917438, 17069870, 13969135, 12037019, 10756921, 9801743, 9145614, 8701730, 8314731, 7944322, 7544086, 7248461, 7002770, 6874270, 6709349, 6514286, 6227320, 5844278, 5610348, 5266878, 5043827, 4933941, 4820802, 4655850, 4391029, 4153550, 3961120, 3751993, 3598132, 3480149, 3461021, 3327403, 3132039, 2972477, 2877361, 2801556, 2780964, 2643647, 2539019, 2508783, 2397285, 2383815, 2353369, 2278673, 2139143, 2040830]
17549B040830j28332j16513j1237k8524q0872l6107J4605J8619n1181j1343J30422
17538A740367M5302j17068M811P1865p7239j05333n8971r5020l2864j8864l2357
17527A324629J3774k7289l3654N6507m5213J4677k0144j6642j27134n2954j0033
17516A076524m6313l9217o3386j0530q9078l8701k3961j8493k0240j31303n3921
17505E41381o3651p4122R7217M8804J0572q3996q233J3122r3114J4332J25651
17494E27963O4969j14816m6647j8829K6488q064P3233K1502k5525P523l4501n303
17482D67993k0069k8758K638K1051O4188k3803l4237o8463o7423p3052j4986K54
17470B25333J1145j9169o9998l2295L9886J5989Q659l0256M5639K0443K3985J45890
$$ y = [2040830, 1912498, 1795985, 1784748, 1756224, 1675352, 1639245, 1653850, 1672469, 1621288, 1609945, 1740367, 1785669, 1668601, 1673412, 1745277, 1668038, 1562705, 1503734, 1408714, 1375850, 1356986, 1324629, 1338403, 1311114, 1277460, 1333967, 1288754, 1303431, 1283287, 1266645, 1139511, 1086557, 1076524, 1030211, 990994, 927608, 917078, 828000, 789299, 765338, 746845, 726605, 595302, 541381, 477730, 403608, 500825, 549629, 560201, 476205, 467972, 481094, 387980, 402312, 527963, 592932, 478116, 431469, 412640, 439128, 431064, 504297, 525799, 500274, 507797, 473296, 467993, 447924, 419166, 421804, 442855, 507043, 483240, 449003, 380540, 313117, 240065, 225079, 225333, 236478, 217309, 147311, 115016, 154902, 170891, 179550, 149294, 194933, 215376, 239361, 385251]
17458C85251P0528n5286r3124l1319j23844m2674p504P7648M6733J114j8575J0867
17446B19815P3957R0312J57923P5176J30n1964j93085k03222j12770K074k1222
17435C7124j2652J5007L0178k1054k1117l644m0769K2000J9501L2085P761L2599
17423I7019K9009m8325j5501j9785n7981k7258M7510P6718J0603k6675J8413j3003
17411G0744J5780j6384N7741J632p1459n661j6354r3887J7348K3903M6178J07250
17399A36831N8035J4946l0951q037K2737l9818m3631m8875j2770L5713j7596k4162
17387D2422n4067q658l5346j20211j2783J31951R5508o078n1516K0350k8550p234
17375c4212K5955q0409n7409P3266N0398j5669M3130M2975J4482K0329o1270p5888
$$ y = [385251, 455779, 400493, 307369, 276050, 152206, 109532, 102028, 179676, 226409, 227523, 208948, 219815, 293772, 384084, 542007, 617183, 617313, 565349, 372264, 169042, 56272, 58346, 37124, 24472, 39479, 69657, 48603, 27486, 23842, -16927, 5073, 24574, 56659, 64420, 97019, 126028, 77703, 62202, 42417, -15564, -42822, 4688, 81406, 92009, 65334, 83747, 70744, 86524, 70140, 127881, 129513, 58054, 52393, 36039, -57848, -40500, -16597, 29581, 136831, 194866, 209812, 178861, 170824, 193561, 153743, 110112, 61237, 48467, 84180, 66584, 42422, -11645, -20303, -55649, -175860, -188643, -56692, 38816, 32738, -18778, 1572, -26978, -34212, -8257, -88666, -146075, -72809, -22411, -38080, 5050, 48025, 62507, 82836, 21566, -54322]
17363e4322j3882J03092M1796o9985m3491J9290p0794j0258J1735J3238M8736
17352b4845M0941R277m689O6891n8m5588n8507j4773M0464l6319J3486j3968q1999
17339a09687K0698J39067L6610n5166k5970k7834n0530o6318J4335N6789n661
17328g3667L9717J9859o3011J3348L3488P7350k5430j7540j4350n2675k7820l8461
17316a29192q281K5108k9665n2506N8082L9306p0138j077Q8211N7842L8045l1538
17304a5803k3545q0022j3360N7400p6269o0851R8816M0689J1920N2480J26484
17293A17939N3169j06722r8653k1415l9587K4024j2537j00720P4605J1366o3217
17282a61748O1720J9676j282l2002k2388j1778o768J0889P3626Q6489o7628M5035
$$ y = [-54322, -68204, 34888, 76684, 6699, -36792, -17502, -88296, -98554, -86819, -73581, -24845, 16096, 25373, 20684, 87575, 87517, 41929, -16578, -31351, 9113, -27206, -13720, -27688, -109687, -88989, 50078, 86688, 31522, 5552, -22282, -72812, -139130, -124795, -68006, -73667, -33950, -14091, -77102, -63754, -30266, 47084, 21654, 4114, -10236, -62911, -90731, -129192, -137473, -112365, -142030, -194536, -136454, -97148, -167286, -168363, -80152, -22310, 15735, -15803, -39348, -119370, -132730, -75330, -151599, -212450, -113634, -72945, -61025, -8545, 117939, 171108, 64386, -34267, -55682, -95269, -71245, -83782, -184502, -109897, -98531, -161748, -100028, -80352, -81634, -113636, -136024, -147802, -154570, -143681, -70055, 16434, -51194, -6159]
17270f159L5230o3226p7006k944O978l6266O6813K5684j29478J8161N0206K4661
17258h7346j0501K7136M0196O4433N661K4301n9736j8190K6383j675K9062L3806
17246G3530l9166m1354K572M0054J2251q6236j04523K9169M1686O9242M0478J2351
17234E0054L5117k4574p3466L3654K3973N0515q030K1216M7113M4707P7031P3542
17222C50852M4785P8608M0739N9772j0717p9385L5671L2112O0256L2505L8612
17211F83810k1011L1523N8436j645n7333J1888m0120r38k1820K2735m6736j5663
17199F03126O0128K8760J8871o599m7722n14j8681n4842j15634m411J8640j08992
17187C72130O1678K9140o5321q8164r2554k3801O1831P4311N9980q2066j01324
$$ y = [-6159, 29071, -34155, -111161, -114105, -107127, -143393, -76580, -50896, -180374, -162213, -112007, -87346, -97847, -70711, -30515, 33918, 39579, 63880, 4144, -14046, 12337, 10662, 39724, 73530, 34364, -6990, -4418, 35636, 47887, -38349, -142872, -113703, -72017, -2775, 37703, 50054, 85171, 60597, -12869, 20785, 44758, 95273, 87243, 108459, 155572, 200279, 277310, 350852, 395637, 474245, 514984, 574756, 564039, 484654, 520325, 552437, 612693, 645198, 683810, 662799, 694322, 752758, 751113, 693780, 705668, 665548, 664610, 642790, 665525, 618789, 603126, 663254, 692014, 710885, 704286, 656564, 656050, 637369, 582527, 466893, 462482, 481122, 372130, 433808, 462948, 397627, 309463, 216909, 193108, 254939, 329250, 389230, 307164, 205840]
17176B05840p8625J4541L7689L9645L2044m81J04310P8732M9286M6181K3583Q6877
17164F39622J46981L1364j17158j41666j00700p857j4994P4186K8621p9371r2552
17153C66476J8526P4142Q3053R8835P8393J55660J06222K1262p2492j09814p8576
17142G41687M1529J49647J46660K1678o7593k32401k74425p7737L0049N8130p5194
17131D62030r7240j04440j89098j8129n81k1682k6611p55j6911J9482j2924R807
17119B948L4575l8885l8950l7577K8448J7259J5954Q9564J2446r209m226j7351
17107E4996j0866n6182m1175m5501n346N6020J0677K7539Q558J7970O2872J11992
17095A91554L4504P8991j9687p9113q6428n8255j8655j329L4888J1921K2108o7311
$$ y = [205840, 127215, 141756, 179445, 219090, 251134, 250653, 354963, 433695, 482981, 529162, 552745, 639622, 786603, 817967, 700809, 559143, 458443, 450586, 435592, 509778, 538399, 459028, 366476, 385002, 459144, 542197, 641032, 719425, 875085, 981307, 1002569, 930077, 820263, 741687, 783216, 932863, 1079523, 1101201, 1033608, 801207, 526782, 449045, 479094, 537224, 462030, 364790, 260350, 71252, 53123, 52542, 30860, 4249, 3494, -13417, 6065, -6859, 2948, 37523, -1362, -40312, -77889, -49441, -32182, -16228, 73336, 85782, 76573, 72347, 54996, 44130, -12052, -53227, -98728, -104074, -48054, -37377, -9838, -1280, 16690, 79562, 191554, 226058, 305049, 285362, 206249, 119821, 61566, 42911, 41582, 76470, 88391, 110499, 43188]
17083D3188j6805p8549k3921j6405Q5092K4985p4277j2069M0624k4540j0583O4004
17071G44Q460q2363n089M5326l4735L773j047J0743L6723m3132o75p249p5073
17058a43594N7178P5302j2936J824L5969K8803r2178m8886p0146m7796O3336N322
17046a47802j2435L7076J9573M904n4404j8531J2440k0855K4465l9150O5776J818
17034a27125j1100j1364L9755N0961K711k3049P568l5887q807k8815J4756J1610
17022a18786L0033m4086j1642J8333J3726N598L871L7362O8289L1143o711p3604
17010d6474l7105l6322L548n405k7892K4861L7659M5084J6975j07605l1120k3768
16998a87564R3505R1099k3285j11238l7729M3353L2971j6011J1187K3792k4175
$$ y = [43188, 26383, -52166, -76087, -92492, -7400, 17585, -56692, -68761, -28137, -52677, -63260, 744, 9204, -73159, -78248, -32922, -67657, -63884, -64931, -54188, -17465, -60597, -61272, -68521, -143594, -86416, -11114, -24050, -22226, 13743, 42546, -49632, -98518, -168664, -216460, -153124, -147802, -160237, -123161, -103588, -98684, -153088, -171619, -159179, -180034, -155569, -194719, -128943, -127125, -138225, -149589, -109834, -58873, -56162, -79211, -71643, -107530, -116337, -145152, -130396, -118786, -88753, -132839, -144481, -126148, -112422, -106824, -102953, -65591, 2698, 33841, 27130, -46474, -83579, -119901, -116353, -121758, -149650, -124789, -87130, -42046, -25071, -132676, -163796, -187564, -94059, -2960, -26245, -137483, -175212, -131859, -98888, -114899, -103712, -79920, -104095]
16987a04095j1978R7038N539n6913o7789l5880K0492M4736P2788J009m5038q399
16975h8490M0624k3584l1959k1054L1196q9644j0826O7365J0315k3853L9688Q7912
16963a2310j5919M8141P192o1329q0464J5834M325N857j5207J0861l7554r281
16951a39854m3464l3451Q640n1423J1668p811K7485L0151L5899P0245J1823j2919
16939i3011J788o9682n9071o100K7404M2906M2236l169L8960O0631J6813j0038
16927a0333q2212J6478L0312K1926k2547P993J2118J3253L262K8719j31238l5090
16915a47359M1705l2184M02L3551K1914K6914j0668l7387j7514J1881j2443l986
16903a25174K8328k3150M2187P4445l6675p0186J1141M7705K6104k9276l0304
$$ y = [-104095, -116073, -19035, -13496, -70409, -138198, -174078, -153586, -108850, -36062, -35053, -80091, -88490, -47866, -71450, -103409, -124463, -93267, -182911, -193737, -126372, -116057, -139910, -100222, -12310, -28229, 19912, 27104, -34225, -114689, -98855, -94530, -88673, -103880, -93019, -130573, -139854, -183318, -216769, -208129, -259552, -247884, -255695, -228210, -198059, -162160, -91915, -80092, -93011, -91223, -160905, -219976, -226076, -198672, -155766, -113530, -116699, -77739, -17108, -295, -10333, -92545, -76067, -45755, -23829, -46376, -38383, -26265, -13012, -9750, 18969, -112269, -147359, -105654, -137838, -137436, -103885, -81971, -55057, -65725, -103112, -120626, -108745, -121188, -125174, -96846, -119996, -77809, -3364, -40039, -110225, -99084, -51379, -25275, -54551, -84855]
16892h4855N0086m5814m5499l4702N1465m5881j3803O7320K6512L2801J6534L3989
16880H153K7773L893o3198q5933o465J3057N4543k0138l847k1846k4534J7370
16868a01172n9306j3881Q0691m6400N6467J1836j1785k0777l3157q7118L9994
16857a84608R8479k9123p1007L8672P663j4763p829M5926O4922k9780J5972k6733
16845i2209N045P2227k5922m2531M445K5735J3516m0958p587l1592J4770l4445
16833a39506K4663K7747Q166m9019L2199M853L7425p0661k8746K4609K2441O0023
16821d5806o616o9210O7133J28720j115q0898l6572n3575j1161k6369L8287j1498
16809a08680j1423j27m2362k7181L4513R6392n836K9497l6018k6656K7440M7145
$$ y = [-84855, -34769, -80583, -126082, -160784, -109319, -155200, -169003, -101683, -75171, -42370, -25836, 8153, 35926, 39819, -23379, -109312, -115777, -102720, -48177, -68315, -72162, -94008, -118542, -101172, -160478, -174359, -93668, -140068, -83601, -71765, -83550, -104327, -137484, -224602, -184608, -86129, -115252, -186259, -147587, -139924, -154687, -162516, -116590, -51668, -81448, -65476, -92209, -87164, -14937, -40859, -83390, -78945, -53210, -39694, -80652, -88239, -119831, -105061, -139506, -114843, -87096, -78930, -127949, -95750, -90897, -53472, -124133, -152879, -128270, -105829, -45806, -52422, -121632, -54499, 74221, 73106, -7792, -44364, -97939, -109100, -135469, -97182, -108680, -120103, -120230, -162592, -189773, -155260, -58868, -64704, -35207, -71225, -97881, -70441, -23296]
16797b3296k7139q2120M5056R2559J9159J220j6660q1404l4171K2574L8666O4168
16785A8612N591q2710o0695L6407R880K0448J9900L5409K7685p0389j7270J8848
16773c8284l5048P2949j734p0613P066J3528q2640j0708Q9320k2610K1294j9673
16761g7153l4653M3680P7990L9457k4435m5957p0898J4434N991r173N4492l0053
16749e6278K688q2270K363J04951J8850m1372m7245l7434L299Q849j0540J2627
16737a21512P848M5633k7003j5686O7868K8212r06J84k6919J2201J2844J7438
16725B02L800l3856p331R942N3757K0351l2206j0047j10680p9383j0039L9746
16713a55744K9257K1132N76j5541J02944K6364n8563r2771m6634M1388L4590Q904
$$ y = [-23296, -50435, -132555, -87499, 5060, 24219, 25439, 8779, -72625, -106796, -84222, -45556, 18612, 24203, -58507, -119202, -82795, -72915, -52467, -32567, 2842, 30527, -39862, -57132, -38284, -73332, -383, -2117, -72730, -65664, -52136, -134776, -145484, -56164, -78774, -57480, -77153, -111806, -68126, 9864, 49321, 24886, -21071, -91969, -77535, -71544, -80717, -26225, -56278, -53590, -135860, -133497, -28546, -9696, -51068, -98313, -135747, -132448, -123599, -134139, -121512, -113664, -68031, -95034, -110720, -42852, -14640, -15546, -15362, -42281, -30080, -17236, 202, 4002, -29854, -37185, -27243, 26514, 46865, 14659, 4612, -106068, -185451, -195490, -155744, -126487, -105355, -104779, -120320, -17376, 8988, -49575, -142346, -188980, -147592, -113002, -104098]
16701a04098k6984l7464r53M7081j352k4776J5696L7642O6219j4506m7292N0242
16689d0545K7005p394P219l5613K3382K0728p8400m9188l4122k0577N0080l659
16677a41084o161n5420M8082O3421m167K1906J5008J1722n178k0974n7558M544
16665a25859K6880n297N3456O9944j9623r9771n6285J5463O2099j7984l6979J3870
16653a20086J8419J3181K1398M212M8525J5426j3320K3747q934j3171o3045q2247
16641a55895l5675j5646k0693M928J814J2436N0254L5176N388P1549M2299k1619
16629b5684l1208k6971l0814O9581J3790l0336k8720M2115K1892n7706m9926p452
16617a41439m671M8369N7762L5954o9009j01728k28K8399o945K4204N8744M456
$$ y = [-104098, -131082, -168546, -169499, -122418, -123770, -148546, -132850, -95208, -28989, -43495, -90787, -40545, -13540, -20934, -13715, -49328, -25946, -5218, -83618, -132806, -166928, -187505, -137425, -141084, -147245, -202665, -154583, -91162, -95329, -73423, -58415, -46693, -51871, -72845, -130403, -125859, -98979, -104276, -50820, 19124, -499, -100270, -156555, -141092, -78993, -96977, -133956, -120086, -101667, -88486, -67088, -62876, -14351, 1075, -12245, 11502, 2568, -10603, -73648, -155895, -191570, -207216, -227909, -222981, -221167, -208731, -158477, -123301, -117913, -46364, -4065, -25684, -56892, -83863, -114677, -45096, -31306, -61642, -90362, -48247, -26355, -84061, -133987, -141439, -146110, -97741, -39979, -4025, -73034, -174762, -174990, -146591, -153536, -129332, -70588, -66132]
16605f6132j4306L2064j3954n0134J0364J1742l7226j2667J521L1842K8764m7239
16593a25361p5821p906R3654N7118J4626L7020M4331P755m5913r0302m0285n472
16581a36556j6977K7707N2405J7074q2644p452M253O7994j0285j8379O3998m7423
16569h6285m367K7287K7847l1535J3409j2677m3126j7543P6650J3957m4967o0863
16557a42213J7709n778m4717K0002K5379P1007j5787p8281o8197j7239M686J7065
16545b16364P4058K3542Q4605M2876n8000o3341p2813j6276K680J07238K8961
16534f2834j9054k5969J1215J6518k3999K3943O1908k4223p4411p960K3689N0966
16522e0211o5849n8395j1613l4211j0666K661K7972N3330N3383K4470m4438J3348
$$ y = [-66132, -80438, -48374, -62328, -112462, -102098, -90356, -127582, -140249, -138728, -106886, -78122, -125361, -201182, -209088, -115434, -58316, -43690, -6670, 37661, 45416, -497, -90799, -131084, -136556, -153533, -125826, -73421, -56347, -138991, -146443, -142190, -74196, -84481, -102860, -38862, -86285, -90652, -63365, -35518, -67053, -53644, -66321, -109447, -126990, -50340, -36383, -81350, -142213, -124504, -130282, -174999, -154997, -129618, -58611, -74398, -152679, -220876, -238115, -233429, -216364, -142306, -118764, -34159, 8717, -49283, -112624, -185437, -201713, -199033, -91795, -62834, -81888, -107857, -96642, -80124, -104123, -80180, -18272, -42495, -116906, -124866, -101177, -50211, -116060, -174455, -186068, -220279, -230945, -228284, -200312, -146982, -93599, -69129, -113567, -100219]
16510a00219Q1632N1470k6286j36428J5745P6194R8400K385r9675k0308J36867
16499G9777M6117j02029n2424n5714n9108K6418J06369L9396M85l2607j14210
16488a17530l2222J08274J23635J3464r1886M433L5986R260J7874l9520j2473
16477A9295Q2537L5448j0359m1905n6630j00472l3825l2016R684j7438J1048l6734
16465a71367r6858q1701R4489J58076K3204L3208l4294j35148l8837N1229M2718
16454a55281l7059J9747P7895K0300L6437O6675O3656J4124p6843m8631l1225
16443e0205l0254L3015o765l9633k0143N5212l1489L4539K9274J5615J3598m1395
16431c8631J1739l966l3473K3222O0592M427q9415m4986K8361l6180j9076K0898
$$ y = [-100219, -18587, 32883, 6597, -129831, -114086, -37892, 60508, 62893, -36782, -57090, 79777, 125894, 23865, -28559, -84273, -143381, -116963, -10594, 28802, 29287, -3320, -117530, -149752, -41478, 82157, 95621, 3735, 8168, 44154, 53414, 71288, 31768, 19295, 101832, 137280, 126921, 85016, 28386, -72086, -105911, -137927, -128243, -145681, -134633, -171367, -268225, -349926, -255437, -97361, -74157, -40949, -75243, -210391, -249228, -197999, -155281, -192340, -172593, -94698, -74398, -37961, 28714, 92370, 106494, 29651, -18980, -50205, -80459, -47444, -54209, -93842, -113985, -58773, -90262, -55723, -26449, -10834, 2764, -38631, -26892, -30858, -64331, -41109, 19483, 23910, -65505, -110491, -82130, -118310, -137386, -116488]
16419a16488J4726n0158N1871M4661N3311j5821K8314J2333m5101L5089O2578
16408G5315J4140o5743j5764l225k2779M0764Q5067J707o8126j2661K4061m5532
16396G224q5082l4l8667q818p937M2846J3224j060K3174K6085N676P768J21487
16383A05886L2770p1348n7863n4171N3621m4143l2939K1738k8302J8452K3167
16372c3132L7662L3022N296o3513k1438M5874L8840n6230o2563J0852Q348M5730
16360a1252J6161l4581k3479O2420R890l5138o0076m9644J892K1471L4829K3115
16348d4392K8684N1645j3663j01215N6445L0646K3934L5613k6067j3820P8499
16337A06309j4991m9832q4710j5074K0939n0387k6627O374L1004R889M2526M4499
$$ y = [-116488, -101762, -151920, -100049, -55388, -2077, -17898, 10416, 22749, -22352, 12737, 75315, 89455, 23712, 7948, 4723, -18056, 22708, 107775, 109482, 41356, 28695, 52756, 7224, -77858, -77892, -116559, -125377, -133314, -90468, -77244, -78304, -55130, -29045, -23369, -15601, 105886, 138656, 67308, 9445, -44726, 8895, -35248, -68187, -46449, -74751, -56299, -33132, 4530, 37552, 42848, -20665, -42103, 3771, 42611, -13619, -76182, -65330, -56982, -11252, 4909, -29672, -53151, 9269, 19159, -15979, -76055, -125699, -123807, -102336, -67507, -44392, -15708, 35937, 22274, -78941, -22496, 8150, 32084, 67697, 41630, 27810, 106309, 91318, 41486, -43224, -58298, -37359, -87746, -114373, -107999, -76995, -67106, -24580, 19919]
16325A9919l5431m7250k7330n2202L9466K7692n7833J0533j1953j8727O1838M2799
16313d8479l407n2627l4048k4260l1080m4840P9208K7838J8995N6613P2468m5111
16301b8730p901k4246N6758L1760n4135J8377k0364j3127l1453L5309n1027J6477
16289g2302p5715j2229P647k4354Q1228k0489n5569L3237O1265J5034n04M3K3192
16276c9516N8449m3141m0727N4089M102q9786n5729o6823M9744J65585M648o9197
16264f8302l221O3090q4580m366J3757M7992n9415J622L2348m2511q024M3694
16252f7916j5431K0926N9347M4799m1470j7552P916n5624l8445K8472k5930l0106
16240a31014j010k843q129k825J1849L085K8557M287n6134o09O9024J4791J5244
$$ y = [19919, -15512, -62762, -90092, -142294, -102828, -75136, -132969, -122436, -134389, -153116, -91278, -48479, -51886, -104513, -138561, -162821, -193901, -238741, -159533, -131695, -112700, -56087, 16381, -28730, -36631, -60877, -4119, 27641, -26494, -8117, -28481, -41608, -73061, -37752, -88779, -72302, -148017, -160246, -152599, -176953, -95725, -116214, -171783, -138546, -77281, -62247, -62751, -62708, -39516, 18933, -24208, -64935, -10846, -6744, -96530, -152259, -219082, -169338, -3753, 895, -68302, -71523, -8433, -93013, -97379, -83622, -35630, -95045, -93423, -61075, -103586, -111610, -67916, -83347, -62421, -3074, 41725, 255, -17297, -9381, -65005, -103450, -74978, -100908, -131014, -132024, -134867, -142996, -145821, -133972, -130887, -102330, -98043, -154177, -154786, -85762, -70971, -55727]
16227e5727L649j05j9556p8381K2844N5017J5152k3458m636J3636M0883Q543L0966
16214H827J1660K1145j22943k7468O701l4584j3675M0526O50O0639Q3895K5756
16202F1129r248j3096l661M08k3635n2000l6959K8479o0026L6358m732n0758M9333
16189g8408N5386j2508l1375p939K4656P2942J05115l3178j21517j07036j7592
16178a51454J7526N291m0123j6835P5076J25829l2933k0214M1904p9887p8204
16167a54024M5228P2049Q659J8552j510r9969N385Q0963j4851O26k3494k8518
16155i0904j6843Q110o5253q3639L3978J11599K0755K0009K8134J6870k7165K6251
16143a8098J3228n0980k652l3494l846l4189j4248N2026Q7121M446o9076M0003
$$ y = [-55727, -52078, -52183, -71739, -150120, -127276, -72259, -57107, -80565, -85201, -71565, -30682, -22139, 8827, 20487, 41632, -81311, -108779, -102078, -136662, -150337, -109811, -109161, -48522, 35373, 61129, 51881, 38785, 35124, 35532, 11897, -40103, -77062, -48583, -108609, -72251, -76983, -127741, -78408, -23022, -35530, -66905, -74844, -50188, 22754, 127869, 94691, -26826, -133862, -151454, -133928, -128637, -168760, -185595, -110519, 15310, -17623, -37837, 4067, -75820, -154024, -108796, -36747, -28088, -9536, -11046, -111015, -105630, -24667, -39518, -38892, -62386, -90904, -107747, -99637, -164890, -248529, -214551, -102952, -82197, -62188, -34054, -17184, -44349, -18098, -4870, -55850, -58502, -91996, -95842, -130031, -144279, -92253, -5132, -686, -69762, -29759]
16131b9759J6686n3700p417K1286Q814l1003L451j3652k9800m3021o0286J1969
16119b06432N3232O5499k8570K4726N2937J3391n778j715l6892j6777L2849M9333
16107d197k5926o9971j0291P2982n5466p9303j9051m980O9720O3988J1989L297
16095d7209P045l6741J95N600o0828j1276O3391N188P1737L5051q3255m1128L0516
16082f1714M2550N168J5184l62j7486n4013k5570m516m734O8740J2160K4438J1414
16069A1259L6680O5173j711q9572k7052j7887q4336n9485L0455K7875k6088L7610
16057i7079M0435M323L9454l6852J398N986q4061j626N3880J8417k5228l5665
16045a16618n9391k2384N1092Q2839K7145j4591N2467P01m2481p811J9824M017
$$ y = [-29759, -13073, -66773, -74190, -52904, -44090, -75093, -71642, -85294, -115094, -158115, -218401, -206432, -153200, -87701, -116271, -91545, -38608, -25217, -30995, -32710, -69602, -86379, -53530, -4197, -30123, -100094, -110385, -37403, -92869, -172172, -191223, -196203, -126483, -62495, -50506, -47209, -40164, -76905, -76710, -71110, -131938, -143214, -79823, -74635, -2898, 32153, -51102, -92230, -61714, -19164, -13996, 1188, 826, -16660, -70673, -96243, -100759, -105493, -36753, -24593, -155, 11259, 47939, 113112, 111401, 21829, -5223, -23110, -107446, -166931, -136476, -108601, -134689, -97079, -56644, -52321, -12867, -49719, -48321, -42335, -126396, -128022, -74142, -55725, -80953, -116618, -176009, -198393, -147301, -64462, -37317, -51908, 559, 1260, -41221, -49032, -29208, -25191]
16033b5191k8460L8610k9396l4287l8187l213L7101l5418K3695j5591L5797M9959
16021b4581m321r5941L8732P648j1460p1635m6207l9392N9070o197M777N3266
16009a36241r3513l9641J01072N4949l7811J6949J09180P7631j41627m0782P548
15998a22286M847L7207p37K7246K6692k7109L033J327k1819j197N919K799l270
15985f7348j7662j7916J4127K6714n2234k0358M4034N0366L2203P520l3461l5223
15973f9238q2199Q806M4792J4756N4451P5204k3872m9667J2478J4213m6729J1182
15961c5823N6649k5342l2869N609k6734n6376J1831k6962p9057K9451J5676M9881
15949a14066N4569M0771M6424q3264n8505J0182J0367J4796R6458J776Q0059K7156
$$ y = [-25191, -53651, -15041, -44437, -78724, -116911, -120124, -83023, -118441, -94746, -110337, -74540, -24581, -28902, -124843, -86111, -78463, -89923, -161558, -207765, -247157, -188087, -194284, -189507, -136241, -229754, -269395, -168323, -113374, -151185, -134236, -25056, 52575, -89052, -129834, -122286, -117439, -80232, -80969, -53723, -27031, -54140, -51107, -49780, -71599, -72796, -66877, -64078, -67348, -85010, -102926, -88799, -62085, -114319, -134677, -90643, -40277, -8074, -554, -34015, -69238, -151437, -142631, -97839, -83083, -28632, 46572, 22700, -26967, -14489, -276, -47005, -35823, 20826, -4516, -37385, -31776, -58510, -114886, -103055, -130017, -209074, -179623, -163947, -114066, -59497, -18726, 27698, -55566, -114071, -103889, -93522, -78726, 17732, 19508, 99567, 126723]
15937A26723o7713n8202q1997p5456j06210M9573K8499Q2521j0110q3831l1000
15926b27203R885Q2911O8147J370p209P308l9564j14200k5999N3525P5963M9331
15914f5735N6299j2722l431n7266O0937L6856l909n0509K215N0082k6511j6441
15902c0135N1475m4998J4384J4685J4276l7080P86k6506k0942K5580j9308o3536
15890a21319l8762M3476J3959n255l6787L8715O6609P0702p4778l5489J1880r2642
15878a59691Q743J5836O0151K4425M928J2569P7134N5539j3522M7270M220j22794
15866A4808l7118K7541L7704j6980N0575M4107K9089k2371q8806N0166J204n3260
15854C6659m7298J4424n2682n5454K5306K5332l8399P1796O5022K7760j11071
$$ y = [126723, 59010, 808, -81189, -156645, -262855, -213282, -184783, -102262, -112372, -196203, -227203, -217318, -134407, -66260, -64890, -72099, -64791, -104355, -218555, -244554, -191029, -115066, -65735, -9436, -22158, -25589, -82855, -21918, 14938, 11029, -39480, -37265, 12817, -13694, -30135, 21340, -23658, -9274, 5411, 19687, -17393, -16607, -43113, -64055, -38475, -57783, -121319, -160081, -116605, -102646, -107901, -144688, -105973, -39364, 31338, -43440, -78929, -67049, -159691, -150948, -135112, -74961, -50536, -45608, -33039, 44095, 99634, 86112, 133382, 137602, 14808, -22310, 5231, 42935, 25955, 76530, 120637, 149726, 127355, 38549, 88715, 89919, 36659, -10639, 3785, -48897, -104351, -79045, -53713, -92112, -20316, 44706, 72466, -38605]
15843c8605n2350L338p0730l3770J0546M9470J0156o8092N4780J05960P376J6163
15831e758O7908J0803L2171R994k2661m0673p8385p4922K0055J2622K4898j4661
15819e8609k2464J28442L2117p1012m8475L997K859m8258L5134R6940J2032j23250
15807f0547r9557Q560j609M760N281P1385k0708k1470L6962j8864p3893J9050
15795a50650L7430L9484J8342l736l0528k1704J5251j2449r046L8882L833m2513
15783a17404l2440Q685L1489K3536m7095q1582k0515J13806L0373K7470j193j4411
15771g9281M8135K8374r894k3046k40k7765j4142J6137M4354L5912k2021q2764
15759h6241l6675m0926O8998J08093l3378r999K3958M856J0784p6229J127N4440
$$ y = [-38605, -90955, -87617, -158347, -192117, -181571, -132101, -121945, -190037, -135257, -29297, -21921, -5758, 62150, 72953, 105124, 115118, 92457, 51784, -26601, -101523, -81468, -68846, -43948, -58609, -81073, 47369, 79486, 8474, -40001, -36004, -33145, -81403, -46269, 50671, 62703, -60547, -160104, -151544, -153153, -148393, -143112, -71727, -92435, -113905, -76943, -95807, -169700, -150650, -113220, -73736, -55394, -59130, -89658, -111362, -96111, -108560, -117606, -78724, -74891, -117404, -149844, -141159, -109670, -86134, -133229, -214811, -235326, -121520, -91147, -63677, -64870, -79281, -31146, -2772, -12666, -35712, -35952, -63717, -77859, -61722, -17368, 18544, -3477, -86241, -122916, -163842, -94844, 13249, -20129, -30128, -6170, -1314, 9470, -66759, -65632, -11192]
15747a1192K5458l0669m5141J2829R851j3626n5720Q4228L3797j26899o0679L8750
15735a39013M4650J7011J2630l9558N4568l9524j4774j9376k7899L0360P173k2951
15723a36703J9522J2563l5831M173O6292O7665K0080k4952q3972n9077J4531k7700
15711a63409j5262J8819P7542j5918o4067r299K0452o1140K215M7843r689Q7177
15699h4736M7071l3200k7079m0295n2196j1448J8695K7089K8847m980M1194M69
15687i0569J2814p094l2666k1276L2794N1056m3620m4044n007J8964L5137J22129
15675B8618O7246l6898r0911n0951L0560K5612J7248M029l6659m8871j2480k4194
15663a27651L5746L6079L698j644L4337m4992p6331L1663O3215l8311r116N1430
$$ y = [-11192, 14266, -16403, -61544, -48715, -38864, -52490, -108210, -23982, 9815, -117084, -177763, -139013, -94363, -77352, -64722, -104280, -49712, -89236, -104010, -123386, -151285, -120925, -113752, -136703, -117181, -104618, -140449, -136276, -69984, -2319, 17761, -7191, -91163, -150240, -135709, -163409, -178671, -159852, -82310, -98228, -162295, -171594, -151142, -212282, -210067, -162224, -171913, -84736, -37665, -70865, -97944, -138239, -190435, -201883, -183188, -156099, -127252, -132232, -91038, -90569, -77755, -84849, -117515, -138791, -105997, -54941, -98561, -142605, -147612, -128648, -93511, 28618, 95864, 58966, -31945, -82896, -52336, -26724, -9476, -5447, -42106, -90977, -103457, -127651, -91905, -55826, -52128, -53772, -19435, -64427, -140758, -109095, -45880, -84191, -93307, -41877]
15651d1877L8010N235j4126k6892k4054k0008O7135K1017j8854k8227M8222P16
15639F297m151l2950j5299M0332j6603p1029q415j8925m7871j5696O5763L8724
15627g9823k5878k5565l5930K6916J07117J2978m0964L376j0822q597n623K2014
15615f0801M466l8331L7913n249n7164p5643P6696M3723l9633l253O2899J6250
15603c8127M0010n573n4498k2396J5346l1466o7790J2456N775J1240J0252L4902
15591h9869J09706m0200j5103l9914L3803L2153K7492k9454o8457M4363O0942
15580B5462N5242p1684l9398j1398J5964o7726o5179L1323L6743l1010M633M0110
15568g6918l0943p9449M4269O8823L1065k6915l9226L276n249J6165j5730K1056
$$ y = [-41877, -3867, 1368, -12758, -39650, -63704, -83712, -16577, 4440, -14414, -42641, 5581, 6297, 2146, -30804, -46103, -5771, -22374, -93403, -101818, -120743, -168614, -184310, -118547, -79823, -105701, -131266, -167196, -140280, -33163, -20185, -61149, -57773, -68595, -77192, -82815, -60801, -56335, -94666, -56753, -62002, -119166, -194809, -118113, -74390, -114023, -117276, -54377, -38127, 1883, -3690, -58188, -80584, -65238, -96704, -164494, -152038, -146263, -135023, -124771, -89869, 19837, -20363, -35466, -75380, -41577, -9424, 18068, -11386, -79843, -35480, 25462, 80704, 9020, -30378, -41776, -25812, -93538, -158717, -127394, -90651, -121661, -117028, -76918, -107861, -187310, -143041, -74218, -43153, -70068, -109294, -106018, -111267, -95102, -110832, -89776]
15556h9776M4359J0626M4048q790o5002P64K7875j3546K2571q1001n1821L4441
15544a25252Q4568O8763m9059l4520K1935l4619m2585R2900L2510m772J1132l2962
15532a1961k1503L8617m6918m6273L8364L8231K470M4241N2874r6369j2517m2479
15520f3223k7163p5949r494N1444Q754j097r011L5819L7103l0763k850O3771J8210
15507d449r255M7461J1100m7074m4627N0039l0031n7463o1523k988N3604J07562
15495A2356K6446n9470M6193j8666K3019k8425p8007O1583P9185j4331k7675n2861
15483c0653o1592K8830n93j9569k187M8647K8018M2765p9118n1081m8594N0057
15471i5070J1041k8892m8324N8925P0586M342j2653O177K2488m3052L1991M3754
$$ y = [-89776, -45417, -34791, 9257, 467, -64535, -63771, -35896, -49442, -26871, -107872, -159693, -125252, -40684, 28079, -20980, -55500, -33565, -68184, -110769, -17869, 14641, 9869, 21001, -11961, -33464, 5153, -41765, -88038, -49674, -11443, -8973, 35268, 88142, -8227, -20744, -63223, -90386, -166335, -175829, -124385, -115631, -116728, -125739, -89920, -52817, -83580, -86430, -22659, -4449, -13704, 33757, 44857, -2217, -46844, 3195, -26836, -84299, -145822, -148810, -95206, 12356, 38802, -20668, 25525, 6859, 29878, 1453, -76554, -14971, 64214, 49883, 22208, -30653, -92245, -63415, -64008, -83577, -85764, -37117, -9099, 33666, -45452, -96533, -145127, -95070, -84029, -112921, -161245, -102320, -31734, -27392, -40045, -33868, -11380, -54432, -22441, 21313]
15459B1313L5403j0226k3906k2879j03339K5128P6824K2630m0516n2330n6572
15448a28470j278M7753k5373l065L6338M7030L8594n1618l8167m0740j6903M8555
15436h7344O8199l1727j4886k2836P2163N722O2273J8556r4403K6207L6429k7586
15424A0767j281k3887n1997m6368P3757J9704l3757p2906j6977j2373L2791K5182
15412i7345n5084P8437P8273L986m2729L5882P959p6665k0216M5545Q2039j4551
15400B5531o4992q1196J1501M695M7031k1979j4677L499j7502o8778l9414O2526
15388a53755J21694L9987L733p587M4374k9867l3303q7514L9866j6350j5086M9748
15376d4060Q395O692m6201l2901j8725K5918J6324r41k6050J1603P190J9990l3069
$$ y = [21313, 56716, 46490, 22584, -295, -103634, -78506, -1682, 20948, -19568, -71898, -128470, -129748, -81995, -107368, -110433, -74095, -27065, 11529, -40089, -78256, -118996, -135899, -87344, -19145, -50872, -65758, -88594, -16431, -10709, 51564, 70120, -24283, 1924, 38353, 10767, 9486, -14401, -66398, -112766, -39009, -19305, -53062, -125968, -142945, -155318, -122527, -97345, -152429, -73992, 4281, 8267, -34462, 1420, 9379, -67286, -87502, -41957, 40082, 25531, -39461, -120657, -109156, -104461, -57430, -79409, -94086, -90587, -108089, -176867, -216281, -153755, -32061, 7926, 11659, 4072, 48446, 18579, -14724, -102238, -62372, -78722, -93808, -44060, -35665, -28973, -75174, -108075, -126800, -100882, -84558, -85499, -111549, -99946, -92756, -72766, -105835]
15363a05835j7379P036l9653Q907K6679k4406J04526J18090M1384m0243p1481
15352G625j11396M4685M118n7249n7264N2107M1996l1339J4645K2336j3903J8165
15340f5474m9480j9097N4557k1129j8734L6459m8270j4382L62N4969N3432p2745
15328a09532K2835J7150M2059q637N019n0120M785K9825p5654L0861N8064j5440
15316d8785N8470M9987o4805m7556o4167M998k5476M0350R3896k1911k706p254
15304c4959l5583n8611O5669K9549r287N3658n9256l9655Q0395R0521L4501R001
15292A25943m4878n6474j2992q3834R3419J00084j13180m4279L5143L0866m9744
15281a9926q654K9005K0200M2722L7290r2007q4808o0956N4564P8586J1499L1998
$$ y = [-105835, -123214, -116178, -155831, -146924, -120245, -144651, -40125, 77965, 119349, 79106, 7625, -103771, -59086, -54968, -112217, -169481, -117374, -75378, -106717, -92072, -69736, -83639, -65474, -114954, -134051, -79494, -100623, -119357, -82898, -131168, -145550, -145188, -90219, -36787, -109532, -86697, -69547, -27488, -36125, -31106, -81226, -76441, -46616, -122270, -91409, -33345, -48785, 9685, 59672, -5133, -52689, -116856, -111858, -137334, -96984, -3088, -24999, -27705, -34959, -70542, -129153, -63484, -33935, -43222, 10436, -48820, -88475, -8080, 82441, 116942, 125943, 81065, 24591, 11599, -72235, 21184, 121268, 8088, -36191, -1048, 29818, -19926, -28580, 425, 20625, 63347, 100637, 8630, -76178, -137134, -82570, -3984, 7515, 39513]
15269C9513k9934n6777m8215l0473Q481O9573J6730K8441M654l4900o291j1235
15257e0433l9504K386M5641L9155k5051q1120n692P3698R8152K629K271p573n395
15244D9164j8890l9252L3814M3778l3001m995j4636j25597n8854M9650Q4952L9125
15232E258K7475j5234k6281L670j766p1661J383R637l8112m5466N9305N6315M2371
15219F894K3512n850K6701J4214R283m882l2962m5403L6444K4064q1177L3952
15207D790L9854r1030o0023J9840J1199j1389Q4655K1843K3056j0344K5697j0472
15195D7676L870m6569l1591K8738K5485l7136n4504q0183P1707O8987M4771P5699
15183A16950n5612m0735n0747J6215J4006n0366n2528j3237K4450P5327O7473
$$ y = [39513, 9579, -47198, -95413, -125886, -117405, -47832, -31102, -2661, 1993, -32907, -39198, -50433, -89937, -87551, -41910, -2755, -27806, -108926, -114618, -40920, 57232, 59861, 62132, 54559, 49164, 30274, -8978, 24836, 68614, 35613, 30618, 15982, -109615, -168469, -118819, -33867, 5258, 32733, 17499, -8782, -5112, -6878, -78539, -77156, -67519, -105631, -151097, -91792, -35477, 6894, 30406, 24556, 51257, 65471, 74754, 69872, 36910, -8493, 27951, 52015, -29162, 4790, 44644, -46386, -106409, -86569, -75370, -86759, -2104, 19739, 42795, 32451, 58148, 47676, 51546, 4977, -26614, 2124, 27609, -9527, -64031, -144214, -72507, -3520, 41251, 116950, 61338, 20603, -30144, -13929, 77, -50289, -102817, -116054, -91604, -16277, 51196]
15172E1196L8235p840N2904p1458j52626q839Q7469L7474L6195J9953p9025O1007
15160F4645J4940j02783m2641M1345l7904K8481J1632Q5897M5873l4624m1865
15149C2996l6378l9923n014L8229M0562J3872j1210j9186m0029n2296N1198J8113
15137i066J6726l8431K2829k9712K705R708l256L1272M4544K5014n136L1613j8976
15124G9834j0071j5028m2110M512M2497k8463K4014J19926K9982q9381j11196
15113D516K4562n49j22973k5895M6554N5521j0219p0042O1672R5896L3461K0473
15101A12977j7798m5018o3504J21692J24063Q8747O0613J37324J92098J98460
15091I09654J85416L00912M47762M30145L16129K77853M1820r2143j69773k35607
$$ y = [51196, 89431, 81591, 134495, 63037, -89589, -98428, -10959, 26515, 62710, 82663, 3638, 64645, 79585, -23198, -65839, -24494, -62398, -33917, -22285, 63612, 109485, 74861, 32996, -3382, -43305, -48319, -10090, 30472, 44344, 33134, 13948, -26081, -78377, -27179, -9066, 7660, -30771, -7942, -37654, -34949, -25241, -28497, 2775, 47319, 72333, 67197, 98810, 79834, 69763, 54735, 12625, 17137, 59634, 31171, 55185, 175111, 205093, 115712, 4516, 29078, 28529, -94444, -120339, -73785, -18264, -28483, -98525, -36853, 59043, 92504, 112977, 95179, 50161, -13343, 108349, 232412, 321159, 381772, 519096, 711194, 909654, 1095070, 1395982, 1843744, 2273889, 2590018, 2867871, 2909691, 2817548, 2647775, 2412168]
15081B412168l32621l63727l56289j94264j66234k07122j70257q0083j00982m4630
15071C95959k9403n7089n5262n5660q2985K2486j9848K8582M3867K5624j5737
15060B00534q664l2374r143o1576L0618O8207m4267j03085k636R9981K238J132
15048A40965k1540M6474o0246n9362K1212Q1829k7592q6740k8262r845o1921J5211
15036d9817o2941M4489N4692J7908L0137L7132l7622q025K0509l4498r028n8144
15024e5208M9435P0285J4080m0690n4254j4364O70j8708k5578j230Q0686J1046
15012A6170L7274j2041m1855m4317o5062N1258R2645J01786l9883l8435l7984
15001A9556P595l8550n2273j9424R4808K1626q6596j5270N4825P6643l0224q5338
$$ y = [2412168, 2079547, 1715820, 1359531, 1165267, 999033, 791911, 621654, 541571, 440589, 395959, 366556, 309467, 254205, 198545, 115560, 138046, 118198, 146780, 190647, 216271, 200534, 191870, 159496, 150353, 88777, 119395, 187602, 143335, 40250, 37614, 137595, 139833, 140965, 119425, 165899, 105653, 46291, 67503, 149332, 121740, 35000, 6738, -3107, -65028, -49817, -112758, -68269, -13577, 4331, 34468, 71600, 33978, 25953, 46462, 11964, 2936, -55208, -5773, 64512, 78592, 37902, -16352, -30716, -30046, -48754, -74332, -75562, 5124, 16170, 53444, 41403, -452, -44769, -109831, -58573, 34072, 135858, 95975, 57540, 19556, 27151, -11399, -63672, -83096, 11712, 33338, -53258, -68528, -13703, 62940, 32716, -52622]
14989e2622m8957J9131Q0027k9850l2660N5431l2437q599O1613N0106Q444L173
14977G2800J3096L0717n9013l2923R811K8413p8228J8065N2566j8685p6975K2461
14965a7895R4809L4748o92l8118l5642L4509J4912J7187n0877m7833R5516K2881
14953A23505n8888j14027L556O3367l356p7353k7475o884L9132O330M5685M3121
14941C6713J7489k6706o1956m3120j778p376K7341M4155K0366j7544N2680J2773
14929E3037L6121L0223L4085l9816o9848L483M4691j5714q431R6522J6273l1339
14917A49287M640J287m750J583j5906M8206O218r880P4865L1871l6491j2658n2709
14904A85563n1168L2971l0073j7311J761J3766J5686J0735L7800P7562J05505
$$ y = [-52622, -101579, -82448, -2421, -32271, -64931, -9500, -41937, -50536, 11077, 61183, 69627, 72800, 85896, 116613, 57600, 24677, 34488, 62901, -15327, 2738, 55304, 36619, -40356, -17895, 76914, 111662, 110970, 72852, 37210, 71719, 86631, 103818, 52941, 5108, 100624, 123505, 64617, -49410, -45854, 17513, 14157, -63196, -90671, -97555, -58423, -52093, -6408, 36713, 54202, 27496, -34460, -77580, -79358, -86734, -59393, -15238, 5128, -12416, 40264, 53037, 89158, 119381, 153466, 113650, 43802, 47285, 91976, 76262, 67831, 164353, 180626, 149287, 153927, 155214, 150464, 152047, 136141, 184347, 190565, 180685, 255550, 287421, 250930, 238272, 185563, 134395, 167366, 137293, 119982, 121743, 135509, 151195, 161930, 199730, 277292, 382797]
14893C82797M2546k5468O6834N1767J10901Q1863k1989J1685J1456j9302j02308
14882E90782j23321r7078n9523j8498N5872k4818n0741j04978q5662k0636L0890
14871I2289j3209J10140L1940r6841p0321J9530J759M361N5969K7251l1964j113
14859A29791N5993J1210K5601l1442l8346J9287J7923j21193J5265R8115K9799
14848B12003j7356l6792J5044O5300l9273p158J6396k6511O696l397J7418K5054
14836B27424j16651q3079N1469L9138N1108L8280N1711o1280q4433j4577K850
14825A01960j8059L7995O920l7273j6411M7716M2744K2038n116M01P1197o005
14813B48107n9313j7680N858m4476R6281L8654l659P6287J0969o4820P3260O693
$$ y = [382797, 425343, 399875, 466709, 518476, 629377, 711240, 689251, 700936, 712392, 693090, 590782, 467461, 370383, 310860, 292362, 348234, 323416, 272675, 167697, 82035, 61399, 92289, 79080, 189220, 221160, 124319, 53998, 73528, 75287, 79648, 135617, 162868, 130904, 129791, 185784, 196994, 222595, 191153, 152807, 172094, 190017, 68824, 84089, 182204, 212003, 194647, 157855, 172899, 238199, 198926, 191768, 208164, 181653, 188349, 184952, 202370, 227424, 110773, 27694, 79163, 118301, 169409, 207689, 259400, 198120, 113687, 99110, 101960, 83901, 121896, 128816, 91543, 75132, 122848, 165592, 187630, 182514, 182915, 254112, 248107, 188794, 171114, 176972, 132496, 228777, 267431, 263772, 340059, 351028, 286208, 359468, 366161]
14801C66161o1644j06208O8577R0657m4101M029K4177J5960o0965M6492K7094
14790C70229j8181j798M878K6336L9071M1915N3833j9297l1267K2670L7989m6637
14778D79741l4746m2834o4463M6767N240l031P3859K418N3841K7015j5863L8950
14766E66894Q9334R82j8696l5336J3080J9467N002j6418r751p8954r0040n2366
14754C93198m8222M5663R5393L678n3095k0192K4956N2116Q146P979M5080L3347
14742E88047J1744Q006K4789O3799l1637J8716O0396m2294k5916J0511J2317K0569
14730G19047L3145j8385j3660K960m0398J8458R5585P0434J3381l770p222j0999
14718H58576k2805J4955J6402o88Q7595R7235P3894P1809Q560L6258O3306J14551
$$ y = [366161, 304517, 198309, 266886, 357543, 313442, 317471, 341648, 357608, 296643, 343135, 370229, 352048, 350250, 355128, 381464, 420535, 462450, 516283, 496986, 465719, 488389, 526378, 479741, 444995, 402161, 337698, 384465, 389705, 386674, 460533, 462951, 516792, 543807, 527944, 566894, 656228, 657210, 638514, 603178, 616258, 635725, 640727, 624309, 614558, 535604, 445564, 393198, 344976, 390639, 486032, 489710, 436615, 416423, 441379, 493495, 501641, 509620, 554700, 588047, 599791, 607797, 632586, 696385, 664748, 683464, 743860, 701566, 675650, 686161, 698478, 719047, 752192, 733807, 720147, 723107, 682709, 701167, 796752, 867186, 880567, 876797, 869575, 858576, 835771, 850726, 867128, 866440, 954035, 1051270, 1125164, 1196973, 1205533, 1241791, 1305097, 1419648]
14706A419648R5701Q0436O0296J11444P1881L3199P9122K79729K92632L43341
14696B867429M17669L02302L51238M48133L55822L48706J77966n8622j04676n6383
14686E049584j24459l27783l29560j85684p8340r2245M8851k3176l1059N0245
14676C956374O6745Q4293J45811K18566J72997J57849K12533K54753K30821L09578
14666E810320L92267M08199M70453M47439M66255N25868O89383Q49683Q95237
14657A0955104J026504J237667J472201J844938K257175K660803L216951L774907
14649B8446250M379435M947820N939366P297293R341395J2580458J8024835K6774037
14641A17730889L8726223N1819346O3005661O9606041O9887271O2893416M9496839
$$ y = [1419648, 1515349, 1595785, 1656081, 1767525, 1839406, 1872605, 1951727, 2231456, 2524088, 2867429, 3285098, 3587400, 3938638, 4386771, 4742593, 5091299, 5269265, 5210643, 5105967, 5049584, 4925125, 4597342, 4267782, 4082098, 4003758, 3911513, 3960364, 3937188, 3906129, 3956374, 4023119, 4107412, 4253223, 4471789, 4644786, 4802635, 5015168, 5269921, 5500742, 5810320, 6202587, 6610786, 7081239, 7528678, 7994933, 8520801, 9210184, 10059867, 10955104, 11981608, 13219275, 14691476, 16536414, 18793589, 21454392, 24671343, 28446250, 32825685, 37773505, 43712871, 51010164, 60351559, 72932017, 90956852, 117730889, 156457112, 208276458, 271282119, 340888160, 410775431, 473668847, 523165686]
14634E23165686L0950307P676482j8362671m2041508n9194488o7495590o6847448
14627C07850770o0200627n1674011m2365563l2455280k3190469j5938862j1321339
14620G0704619q567054o863463n756825n073529m428400l943989l424661k902066
14612B9744632k432698k067465j695822j490497j310638j161911r67120q40769
14604A7777712q61216p60886o48274o16783o00819n49117m43242m45057m06969
14595A2445349m06735m46963m25719l74205m45748l61628l08891l28509k77200
14586I069751l06496k84673k68146k15105j81623j58686k57305k27414j37074
14577G033229k12545j87458j17179j95979k46052k05033k19252j21332j05117
$$ y = [523165686, 554115993, 561792475, 543429804, 501388296, 442193808, 374698218, 307850770, 247650143, 195976132, 153610569, 121155289, 97964820, 82025958, 70704619, 62137565, 55274102, 49517277, 44443748, 40015348, 36071359, 32646698, 29744632, 27311934, 25244469, 23548647, 22058150, 20747512, 19585601, 18618481, 17777712, 16916496, 16155610, 15507336, 14890553, 14289734, 13740617, 13297375, 12852318, 12445349, 12038614, 11591651, 11165932, 10791727, 10345979, 9984351, 9675460, 9346951, 9069751, 8763255, 8478582, 8210436, 7995331, 7813708, 7655022, 7397717, 7170303, 7033229, 6820684, 6633226, 6516047, 6320068, 6074016, 5868983, 5649731, 5528399, 5423282]
14568E423282j99254j96424j97227k10227j60770j11370j38566q9850j07553j89571
14558C822470k7172j16330j47788o6572q8784q6836J1683M8121j10692r0130o3631
14547C084339m7172k6556j30308j15930o5911n1970q9799j03590l7396P489n6505
14536B366691p8903n9434j0164n3720p6940r6047o0092p9631o4798n8944j01373
14525A626645n6121m1877k6759N782P4805K5843J9896N5062p2353o8641P602L5311
14513A585195k3296n355M5838j8137k7149k8635j4435l0704l5820J7252K860j11293
14501A356321j29466j26661l4884N5641p7634j25047n0904l3357m9640k9597k2352
14490G32420n4700k6082J6246j3141n1007l5941R249Q695m2023o4004j5955M8319
$$ y = [5423282, 5224028, 5027604, 4830377, 4620150, 4459380, 4348010, 4209444, 4119594, 4012041, 3822470, 3795298, 3678968, 3531180, 3464608, 3375824, 3288988, 3300671, 3348792, 3238100, 3147970, 3084339, 3037167, 3010611, 2880303, 2764373, 2698462, 2646492, 2556693, 2453103, 2415707, 2423196, 2366691, 2287788, 2228354, 2218190, 2164470, 2087530, 1991483, 1931391, 1851760, 1786962, 1728018, 1626645, 1570524, 1528647, 1501888, 1507670, 1582475, 1608318, 1628214, 1683276, 1610923, 1542282, 1549884, 1585195, 1561899, 1556544, 1602382, 1584245, 1557096, 1528461, 1514026, 1483322, 1447502, 1464754, 1467614, 1356321, 1226855, 1100194, 1065310, 1120951, 1043317, 918270, 867366, 834009, 784369, 754772, 732420, 677720, 651638, 667884, 654743, 603736, 567795, 577044, 585739, 543716, 479712, 463757, 512076]
14478E12076J338J8004K8084K6796N6993J5278m1016p8400r3987j6361p6282Q310
14466C60833l0564K6320J9587M4228M1431J6223j3947p081Q65q7212o1934o369
14454C02380j5633L4491K1796o675k0109P584O3128j1427K657J1209J80j8272
14442C71309J0595j8327m4223j772P030r242j191l0010r7906j4723L6167k5346
14430A82361l299q7321o298J9757L5742J02767O3725K8269o9923k8700K8616l1339
14418B34357k9101J0063P2268L5043l794l4832o5860N7525Q5379l5861n0584n217
14406B69386L6318j7477l0708J585m8807o7195k0239N4475O2755m18p6038n4221
14394A09416j4443N9439J22132n408j586j5783o5230k1513k0489K8013N6052L8249
$$ y = [512076, 513414, 531418, 559502, 586298, 643291, 658569, 617553, 539153, 445166, 428805, 352523, 360833, 330269, 356589, 376176, 420404, 461835, 478058, 464111, 457030, 457895, 370683, 308749, 302380, 286747, 321238, 343034, 336359, 316250, 323834, 386962, 375535, 378192, 389401, 389581, 371309, 381904, 363577, 319354, 317582, 324612, 315370, 314179, 284169, 186263, 171540, 207707, 182361, 179062, 91741, 85443, 105200, 140942, 243709, 307434, 335703, 265780, 237080, 265696, 234357, 205256, 215319, 287587, 322630, 318836, 284004, 218144, 275669, 361048, 325187, 274603, 269386, 305704, 288227, 257519, 259104, 210297, 143102, 122863, 177338, 240093, 239675, 163637, 109416, 94973, 154412, 276544, 271136, 269550, 253767, 188537, 167024, 146535, 174548, 230600, 268849]
14382B68849m5487k7061p5714m8680J5215O7691r137n2811j8238j7665J2477K3947
14370I3386n4045n7758L7474N7488P838p4117J2401J05387K8680K2625m5515k4139
14358A09705k505k0701o1170J7938K8239j1452m6711L640J3745j6765N1757O1353
14346A27073k8216j6753o0611p4614J9349L436P776Q3856Q1047N1998l4662o0848
14334I8831J7102O1552K9520k4284o66K3615J6972k1621k4476J219j9036M1164
14322A99892M978K9424L0928p858M2728N1272J8087K5250Q2144J11950N6786M6608
14310F92189R3977J91651J52934J52047J62520J29085O6506J08037J35976J00636
14300A985558R989O974P4539N2648J377K9207n9507m4834j88838j50327j36624
$$ y = [268849, 223362, 196301, 120587, 71907, 87122, 154813, 145676, 92865, 74627, 56962, 69439, 93386, 39341, -18417, 19057, 76545, 84383, 10266, 22667, 128054, 156734, 179359, 133844, 109705, 107200, 86499, 25329, 43267, 71506, 60054, 13343, 16983, 30728, 13963, 65720, 127073, 98857, 82104, 21493, -53121, -33772, -30336, -22560, 61296, 142343, 194341, 159679, 98831, 115933, 177485, 207005, 182721, 182055, 205670, 222642, 201021, 176545, 177764, 158728, 199892, 204870, 234294, 265222, 257364, 300092, 351364, 369451, 394701, 476845, 588795, 645581, 692189, 786166, 977817, 1130751, 1282798, 1445318, 1574403, 1640909, 1748946, 1884922, 1985558, 1995547, 2002521, 2077060, 2129708, 2131085, 2160292, 2100785, 2055951, 1867113, 1716786, 1580162]
14289A580162j80888j74349j63780p2652j00058m2859o3646m503N6278R977K9533
14278H73215l5435q8098o1149l7178J6802J8275J6985l400p4424l3072l4243m2508
14266E15770j31855k9314N262K8752m411j0246K1864J2464j04616k5463n6460
14255B21747n9463N2944N2292j5037J42j6935j9500m2189L3868N5074J2023q442
14243B66524N2196M3007j5530J9179q826o6419l0859Q6017J43515l139q0201m7231
14231C58233o8001J2866j17275m2295J1108m7682K009j5148N9940k5776l7191
14220I0788M554m5748R23O5125L0697N3413N6456r163q019j9899j05239L5176
14208A49064M5227N2276j7702o2712L8981n9554k6872L8362L3542r382K8009N588
$$ y = [1580162, 1399274, 1224925, 1061145, 988493, 888435, 845576, 781930, 777427, 833705, 843682, 873215, 837780, 749682, 688533, 651355, 668157, 686432, 703417, 700017, 625593, 592521, 558278, 515770, 383915, 354601, 359863, 388615, 384204, 373958, 395822, 408286, 303670, 278207, 221747, 162284, 215228, 267520, 252483, 252625, 235690, 216190, 174001, 207869, 262943, 274966, 266524, 318720, 361727, 346197, 365376, 356550, 290131, 259272, 345289, 488804, 485665, 405464, 358233, 290232, 303098, 185823, 143528, 154636, 106954, 108963, 93815, 153755, 127979, 90788, 95342, 49594, 50517, 115642, 146339, 199752, 256208, 247045, 239026, 219127, 113888, 149064, 194291, 246567, 228865, 166153, 205134, 145580, 118708, 157070, 190612, 181230, 209239, 214827]
14196B14827k6115O2997N3874k6131p1809k3400L9599j5809K1272J59946J45205
14185E34456R5132J16724O1023K09899L70755L61787K77087L71718L77684K58572
14175C034837J14284l9208k49808k95875k67889l53651l47257l06374j79654k18649
14165H90756k59928j19910o7593j2539P226o4680J0494l2057j9841l8294l2748
14154B60886m1377n8169l3780l8334o337L3496M0774R900K2096p5123l3962L9577
14142A19647K1717l5392j9244N2713K344l8938n2203j19140o0083M0516Q4163
14131c900m290j174K0208k6954J05307k2890j8463k3535l5232J3851k136m4717
14119d3925l436j4443K1951N1866K2949J9675j5880J5900j5927n1822j6476l133
$$ y = [214827, 188712, 251709, 305583, 279452, 207643, 184243, 223842, 208033, 229305, 389251, 534456, 629588, 746312, 807335, 1017234, 1387989, 1749776, 2026863, 2398581, 2776265, 3034837, 3149121, 3109913, 2860105, 2564230, 2296341, 1942690, 1595433, 1289059, 1109405, 890756, 630828, 510918, 443325, 430786, 438012, 373332, 383826, 351769, 331928, 293634, 260886, 219509, 161340, 127560, 89226, 82889, 116385, 157159, 167059, 189155, 114032, 80070, 119647, 141364, 105972, 86728, 139441, 141785, 102847, 50644, -68496, -128579, -88063, -3900, -8190, -9364, 10844, -16110, 89197, 66307, 47844, 24309, -10923, 2928, 792, -43925, -47361, -61804, -39853, 12013, 34962, 54637, 38757, 54657, 38730, -13092, -29568, -32701]
14107c2701l0008Q1576M9256L5458P668j3247j2790J3786J32756m406l7817q5464
14095A04067N475j5497m9058k8082J8279J6098j6039K6922K2190R7944k1885q3083
14083G7331J8436K2906P703n4529r0294j00560J8419L3463L2870M0065L1908j0137
14071B7581M0212J7561M200p1582j2922J02951K8090k0534O0803Q286o2147q004
14059A14495p3960j1181J8111k9704J337k3433J09363J08091O3373J80582J50175
14048F07249J07528J55000J34032R6242J47076J86768J56899J2530m060r4171
14038A505093k07932j88553j85885k34565j98866j18806n1024j11424n6464J6652
14028A68226J9389j19888m1419k7762J8082J6433j06046k3610j0447Q974L7863
$$ y = [-32701, -62709, 18867, 68123, 103581, 111249, 98002, 85212, 98998, 231754, 227348, 189531, 104067, 109542, 94045, 44987, 16905, 35184, 51282, 35243, 62165, 84355, 182299, 160414, 77331, 95767, 118673, 126376, 71847, -18447, -119007, -100588, -67125, -34255, 5810, 37718, 27581, 67793, 85354, 89554, 17972, 5050, 108001, 136091, 115557, 176360, 184646, 122499, 114495, 40535, 29354, 47465, 17761, 19098, -4335, 105028, 213119, 276492, 457074, 607249, 714777, 869777, 1003809, 1100051, 1247127, 1433895, 1590794, 1603324, 1599264, 1505093, 1297161, 1108608, 922723, 688158, 489292, 370486, 319462, 208038, 151574, 168226, 187615, 67727, 26308, -1454, 16628, 33061, -72985, -96595, -107042, -98068, -60205]
14017f0205K0886j1077k6597O5001K8895j1407p2201n9847P1799J1629L9419k6677
14005c0382M7311O3080l2752j831K7716L4929q0996o6350J1455L0952j9766N137
13993a1497O683L1738N7932r728j7711j0680m0804l1240k7429K8775l5544K8023
13981c1482K1731J060m2324k4429N2940M3826n7701q9508O3661L2412L7485R354
13969A7025j2283k9364k4024m1865o163N4972O1360K2925J803K1759l1382p0024
13957c5261k0664M2828O116O791P576P6652P7559R842j0370m0014p1995K1288
13945G0348K3948m7455N7461m1857l0032P8924O6090l6538k2081N0695l7214j10335
13933B1954m8371M4198j3767m5745K0073K5729N3721n132j2509k5785j6725N212
$$ y = [-60205, -39319, -50396, -76993, -11992, 16903, 5496, -66705, -126552, -54753, -43124, -3705, -30382, 16929, 80009, 47257, 45426, 73142, 108071, 27075, -39275, -27820, 3132, -16634, -11497, -4814, 26924, 84856, 75128, 57417, 46737, 5933, -25307, -52736, -23961, -59505, -31482, -9751, -8691, -51015, -75444, -22504, 21322, -36379, -125887, -62226, -29814, 7671, 17025, 4742, -24622, -48646, -90511, -96674, -41702, 19658, 42583, 44386, 66145, 34763, -35261, -55925, -13097, -6981, -190, 7386, 84038, 161597, 171439, 161069, 121055, 49060, 70348, 94296, 46841, 104302, 62445, 32413, 111337, 177427, 140889, 118808, 169503, 132289, 21954, -26417, 17781, 4014, -41731, -21658, 4071, 57792, 52660, 40151, 14366, -2359, 2853]
13921B853L7049l0299l1022J6805K5831p601K3083J03785j2726K3065k8656j5538
13909A06629R396j7017k7531k9764j8751L4531O8543R872N3284l3827m4245K9255
13897A40375l1698n3772l4772O9317m900m1170P4087L0183o0982j8499j5375p0795
13885a8001k9619m7901q1121J195Q7445M9129O2290J9107l8644K2421O4375L2624
13873A23300n96k0683K3815k2002J065J3290j0040n756l8748n736K1455p0665
13861H699L2873R3850j19228o7966K3728M1836P1370J0438K7143l4624m4065K704
13849D6758k0425J7561J8864l6858q235K7572J8352j531k2789j2278k838j2340
13837A1813J6867l1104l7535M0509n9092l2346q1177O3266K6374J4683J4877K4102
$$ y = [2853, 39902, 9603, -21419, -4614, 21217, 13616, 36699, 140484, 127758, 150823, 122167, 106629, 116025, 99008, 71477, 41713, 22962, 57493, 126036, 135908, 189192, 155365, 111120, 140375, 108677, 54905, 20133, 89450, 84550, 43380, 117467, 147650, 86668, 68169, 52794, -18001, -47620, -95521, -176642, -175447, -88002, -38873, 23417, 42524, 3880, 26301, 90676, 123300, 122704, 102021, 125836, 103834, 104899, 118189, 108149, 102393, 63645, 57909, 79364, 8699, 41572, 135422, 16194, -51772, -28044, 13792, 85162, 95600, 122743, 88119, 44054, 46758, 26333, 43894, 62758, 25900, 17665, 45237, 63589, 62058, 39269, 26991, 24153, 11813, 28680, -2424, -39959, 550, -58542, -90888, -172065, -108799, -82425, -67742, -52865, -28763]
13825b8763m780m2102O7474L6999j8859q6014j9797K5037m4304l9621M8964N7683
13813d8083K5001L7307N0315L4817J1616M2556n6595n0964N349j9928N170N5023
13801I1584J28032J539q4160L6220L3584q41l2302j57748p6857n5287j2951j4850
13789a44037J08634J24819j493p8112p744k1649q584J7264K7032N338l9571M176
13777a3927O2227p027k1809k5480j0526J8542j0317O6044k929P817j9707L4875
13765G7783p6556j05549J8584O3231j815M3081J0588r6372J0726L7296J8773j0499
13753a0729j7241k556L7360M230L0961k7380J0972k0327q7K3677K9867Q7000N9584
13740B05331K054p8192p6722J4452q5349p2264m792k4210J820j3482J13742N8444
$$ y = [-28763, -33543, -75645, -8171, 28828, 9969, -76045, -95842, -70805, -115109, -154730, -105766, -48083, -23082, 14225, 64540, 99357, 110973, 153529, 96934, 45970, 51319, 31391, 36561, 91584, 219616, 221155, 136995, 173215, 206799, 205958, 173656, 15908, -60949, -116236, -129187, -144037, -35403, 89416, 87923, 9811, 2067, -19582, -28166, -10902, 16130, 21468, -18103, -13927, 48300, 41273, 19464, -6016, -16542, 2000, -8317, 57727, 54798, 62615, 42908, 77783, 1227, -104322, -85738, -22507, -24322, 18759, 29347, -67025, -56299, -19003, -230, -10729, -27970, -30526, 6834, 11064, 42025, 14645, 25617, 5290, 5203, 28880, 58747, 145747, 205331, 207385, 129193, 52471, 66923, -18426, -90690, -95482, -119692, -117872, -131354, -17612, 40832]
13728D0832M248l8799N8239K1472m5781j7975k2663N9379k6664N0347k8574l4199
13716A9862M4983J7098m6068l3826L7082J1715N3285k8667K5678K9713r19K2842
13704A52778L3414p64K2879J16757J02648M9421m0748q373K5403Q6723O9007N6625
13692F65770k3105p3507q3203k2878M1672M5126R4839j4277p0374r0489J686l7472
13680D33788j6527k0903j07916n8727j0092j239L0638o7252K3023N0746n105l2446
13668B17988R0974q175n1591K6717l8317N0132N3684l7542K9173O5600M4419O679
13656D49741M2602j2339p7041k1733J1187p7921o0550j9586p5365l973Q7470M9596
13644B92088O97k3907r6066o0795P5969N7639n1777L8154n5934K6800L1757p7256
$$ y = [40832, 45080, 6281, 64520, 85992, 40211, 22236, -427, 58952, 32288, 82635, 54061, 19862, 64845, 81943, 35875, 2049, 39131, 50846, 104131, 75464, 101142, 130855, 129936, 152778, 186192, 185428, 208307, 325064, 427712, 477133, 436385, 428012, 453415, 540138, 609145, 665770, 642665, 569158, 485955, 463077, 504749, 549875, 644714, 630437, 560063, 469574, 471260, 433788, 417261, 396358, 288442, 229715, 219623, 218384, 249022, 181770, 204793, 255539, 250434, 217988, 308962, 300787, 249196, 275913, 237596, 287728, 341412, 303870, 333043, 398643, 443062, 449741, 492343, 480004, 402963, 381230, 392417, 314496, 253946, 234360, 158995, 155022, 242492, 292088, 292785, 268878, 172812, 112017, 187986, 245625, 193848, 232002, 176068, 202868, 234625, 157369]
13632A57369m8105K1181K7869K2813K3120l8739m3210m4131n430L6589Q4419k6929
13620A66816J5599L8511L49M3458k3438r4546o374L7610M175M6193K1163K603
13608B52119J6587l1520n2530l395j9447j10607n3902N9772R0924j6585N1981
13597A83397M4468K4078m9318p1563n0618o687j8491Q3885R2823L2252j4896q0275
13585A69055m8252N650K0753m2205j0876L9391o4192r8737K0896N233l4294M1028
13573C450M2269M0541m3383r5929J3437P6722L0693P584k3571p7556l880p247
13561c6870K6810L7091N8995j945p8702O3921L2987o557j9878n8428k058k5218
13549i852N134P7733N1434j2125p1772Q2678L0558J4000m8644q1824j687L8262
$$ y = [157369, 109264, 130445, 158314, 181127, 204247, 165508, 122298, 78167, 72737, 109326, 193745, 166816, 182415, 220926, 221275, 264733, 241295, 146749, 140375, 177985, 182160, 228353, 249516, 252119, 268706, 237186, 184656, 181261, 161814, 51207, -2695, 57077, 148001, 131416, 183397, 227865, 251943, 202625, 131062, 80444, 73757, 55266, 139151, 231974, 264226, 249330, 169055, 120803, 126453, 147206, 105001, 94125, 133516, 69324, -29413, -8517, -3284, -37578, 3450, 45719, 86260, 42877, -53052, -39615, 37107, 67800, 75384, 51813, -25743, -29623, -36870, -10060, 27031, 86026, 84081, 5379, 69300, 102287, 95730, 75852, 17424, 15366, -9852, -4718, 73015, 124449, 112324, 40552, 123230, 153788, 167788, 119144, 37320, 35633, 73895]
13537G3895L1029P71R25m7557p4170n8139L8091J4336m4863K4116J08944L5605
13525A02983r5220K0388L8134j1759j2093k572M9794m9718m3780L1114M3490p8904
13513h143o3250L0980q21N0019l6430m397J1240J44661M1206O383m3988l7546
13501H9914m483m5210o854R0107l2547j5008K1616j4948K5423O0919P9863R904
13489B58696l0012j00603o2970k9763k9249p7818l0633R5426K5347k2103o2417
13478f6099M6446L6561N0665J7361P0525l2977m2189M5066K2593K1221k8213J5780
13466A56740k4112l464j567k9500L9538j7943k4391J7082l5135l0836m8606k642
13454d836O6485m2306l2001q5772K8733O1127K4484O5017n6499k8707M1531M6246
$$ y = [73895, 104924, 105695, 106620, 59063, -15107, -73246, -35155, -20819, -65682, -41566, 67378, 102983, 7763, 28151, 66285, 54526, 42433, 39861, 89655, 39937, -3843, 27271, 70761, -8143, -71393, -40413, -41234, 8785, -27645, -32042, -20802, 123859, 165065, 171448, 127460, 89914, 85431, 40221, 33367, 123474, 90927, 75919, 97535, 82587, 108010, 168929, 248792, 258696, 228684, 128081, 65111, 35348, 6099, -71719, -102352, -6926, 18421, -3682, -66099, -19653, 16908, 67573, 84934, 155459, 122482, 80293, 125359, 147952, 169173, 140960, 156740, 132628, 129164, 127597, 98097, 137635, 119692, 95301, 112383, 77248, 46412, -2194, -4836, 61649, 19343, -12658, -98430, -69697, -8570, 15914, 80931, 24432, -4275, 37256, 83502]
13442H3502Q33J5160r6464L3729K9053l6328j6287k4251o1405p693J04028L1576
13430E5453P357L7680P042l0238k8576n6821j8614L7342N2729j8653n4857n2501
13418f2657P4009J3227P3114k4278r3361j3703J7622m0557m5668R6791M2463k98
13406C6704l7538K3047M1634k8093N454j8922k8761J0967L070n2495R121q584
13394d4396o658k5258M804M077L1390P5898q710r4879J5101K9632m8105l2159
13382i9263m2124K4560R0451J8026L0826R063O3535q2932m4232N0725L7905N349
13370F1889j263K1920N0702M8148K2203L9297k1822k0732l0777l9475p2723m181
13358E3186K3394J4349j6106o9155l1592K6251J4358o3438n4451M3124Q5511O7757
$$ y = [83502, 84335, 99495, 3031, 36760, 65813, 29485, 13198, -11053, -72458, -80151, 23877, 55453, 62810, 100490, 107532, 77294, 48718, -8103, -26717, 10625, 63354, 44701, -10156, -62657, 11352, 24579, 97693, 73415, -19946, -33649, -16027, -56584, -102252, -5461, 37002, 36704, -834, 22213, 63847, 35754, 41208, 22286, -6475, 4492, 7562, -44933, -35812, -44396, -51054, -76312, -71508, -67431, -36041, 39857, 31147, -63732, -48631, -18999, -67104, -99263, -141387, -116827, -26376, -8350, 22476, 31539, 95074, 12142, -32090, 18635, 56540, 61889, 60626, 82546, 133248, 181396, 203599, 242896, 221074, 200342, 169565, 130090, 57367, 53186, 76580, 90929, 74823, 5668, -25924, 327, 14685, -48753, -103204, -60080, 25431, 93188]
13346I3188j7033J4080j1371j8409j5134l967q8400Q880P7996P7954M395l2815
13334H9364k5325Q655K4411N1358o0503q4041L4710j4241k6639P1276K6686N1726
13322A47437n0253m7026M4199P203p9182l5289J6582p542J1497K2100O4885N2779
13310A47390K2134o145Q3996Q1952J9832o3601p5443l6463m3478j2615J7009n598
13298A28970J1889L3675J0369p586J03845J0257j0964n8240n2044O116j5318P1642
13286B32611r051l4332k187J8912j6538L2392j3335M9127j0865m6627j4284k5855
13274A59968n296k5090K901m8474l0225j15239o554J36760O1843q9290j0587P1433
13262A02150m7473m3923m702l346O8119l4257q2508K7533J6603P5120l4286m4986
$$ y = [93188, 76155, 90235, 78864, 60455, 45321, 41354, -47046, -38166, 39830, 117784, 122179, 89364, 64039, 72694, 97105, 148463, 87960, 3919, 38629, 24388, -2251, 69025, 95711, 147437, 97184, 50158, 94357, 101560, 22378, -12911, 3671, -3871, 7626, 29726, 94611, 147390, 169524, 163379, 247375, 329327, 349159, 285558, 210115, 173652, 130174, 117559, 134568, 128970, 140859, 174534, 184903, 177317, 281162, 291419, 280455, 222215, 170171, 176287, 160969, 232611, 223560, 189228, 187041, 205953, 189415, 221807, 208472, 257599, 246734, 200107, 185823, 159968, 154672, 129582, 132483, 84009, 53784, -61455, -68009, 68751, 130594, 41304, 30717, 102150, 54677, 10754, 6052, 2706, 70825, 36568, -45940, -18407, -1804, 73316, 39030, -5956]
13250e956N228m4460K7736M0918k3919L3067P5494j4430l5315k2532l1579K5138
13238B9390K3785m8530N9955K3765J2674J5540k8176K6415K568L3572N9890J7377
13226B28225K8494L111K8711P0460J06868J12826K15154L37441L13723L44456
13216A789469L25542L12277K64905K12086J1307j62860j77507k42548k30228l82152
13206A720291m16423l41726j63592o5426j04574l6956j7760n4j32675o2781r2810
13195B85514o0545k5931J3128p2603P942O465J0025j4453m2086n8521l7234J7296
13183B8997M3447L0863K3538K6128J5471j1011M8977K892m8993o2410N1851l5694
13171A14056o6588l7021r227M3074j7226j0724N0979J9421r0140L0825J9082r996
$$ y = [-5956, -728, -45188, -17452, 23466, -453, 32614, 108108, 93678, 58363, 35831, 4252, 29390, 53175, 4645, 64600, 88365, 101039, 116579, 88403, 114818, 117386, 150958, 210848, 228225, 256719, 259830, 288541, 359001, 465869, 578695, 793849, 1131290, 1445013, 1789469, 2115011, 2427288, 2692193, 2904279, 2915586, 2752726, 2575219, 2332671, 2102443, 1720291, 1303868, 962142, 798550, 733124, 628550, 591594, 573834, 573780, 441105, 378324, 285514, 224969, 199038, 212166, 139563, 147505, 153970, 163995, 149542, 107456, 48935, 11701, 28997, 72444, 103307, 126845, 152973, 168444, 157433, 206410, 209302, 160309, 97899, 149750, 114056, 47468, 10447, 1220, 44294, 27068, 16344, 67323, 86744, -3396, 27429, 46511, 36515]
13159C6515k3934P9577N8697q693l109q1114n4524L7835M786P0233k8904k9682
13147E7683m2311M1778N1162J25702p8958o8874j5350k1970N8198M409k6013j5074
13135G0382K0167K9131l3853n1380K0415q211r605K0733R8412J1678n9121J071
13123A09819M1M0026n5308J0567K6233p503M7944J2199m2186k68l3686o294K8939
13110A30523J6150Q685J3846k6098l0230p161n622m5333n2781M7125P1223J2236
13098A32563N1252L261o2189J3341p299k3895j7711M7579k0747Q5513M5649L7479
13086B84796k1674j24596o1472L4014k0679J3555O2921Q8740o9847m0576R253
13075A54435L6197m9210N9870O4920k3046J2656n4144l6652M5200k8179J152M1686
$$ y = [36515, 12581, 92158, 150855, 142162, 139053, 57939, 3415, 41250, 46036, 116269, 87365, 57683, 15372, 57150, 108312, 234014, 155056, 86182, 70832, 48862, 107060, 111469, 85456, 70382, 90549, 119680, 85827, 34447, 54862, 46651, 37046, 57779, 156191, 167869, 108748, 109819, 109860, 149886, 94578, 105145, 131378, 123875, 171819, 184018, 141832, 141564, 107878, 101584, 130523, 146673, 155358, 169204, 143106, 112876, 105715, 100093, 54760, 1979, 49104, 120327, 132563, 183815, 187076, 124887, 138228, 130929, 107034, 89323, 136902, 116155, 201668, 247317, 284796, 263122, 138526, 77054, 111068, 90389, 103944, 166865, 255605, 185758, 145182, 154435, 190632, 141422, 201292, 266212, 243166, 255822, 201678, 165026, 210226, 182047, 183199, 224885]
13063B24885m0517p0843j1915O1187O7658o710R2945Q0338m2001o1972n8118l2278
13051B02659L3473L5575M1781J21567P1094O5347L8102R7818k884J3538L6228
13040G54298J1701j9250j4732n4109j47652j45448j32986n953N4789K2178N2622
13029C75458k7018q2929l9718l9066r166K6759l5152r4784K1352L9680J1515L9051
13017A85982O5251L4197J896l9386K1840o519K2427J4676J707J0022M1463J74533
13005E28089L743m8304j02408l218Q8676K9220j1833M8086M384o0889r5757n5489
12993C24300K6881P7693J380l9398n5878o9023J3505m6858n4697j6872R0554p0514
12981A81073m8895L2518N8359j6272l3220L3520M2963m9618Q418N7800J4815n044
$$ y = [224885, 184368, 113525, 101610, 162797, 230455, 223745, 316690, 397028, 355027, 293055, 234937, 202659, 236132, 271707, 313488, 435055, 506149, 571496, 609598, 707416, 704532, 718070, 754298, 765999, 746749, 732017, 677908, 530256, 384808, 251822, 245869, 300658, 322836, 375458, 348440, 265511, 225793, 186727, 177561, 204320, 169168, 74384, 95736, 135416, 146931, 185982, 251233, 285430, 287326, 247940, 269780, 263261, 285688, 300364, 302071, 312093, 353556, 528089, 531832, 483528, 381120, 377902, 466578, 495798, 483965, 532051, 536435, 475546, 379789, 324300, 351181, 428874, 430254, 390856, 334978, 265955, 279460, 232602, 177905, 161033, 251587, 181073, 132178, 164696, 223055, 206783, 173563, 207083, 250046, 200428, 208846, 266646, 281461, 276417]
12969B76417K229p4045j9289L0560K4942m222l2547J6163M5616L5639K9848k2176
12957C09135J607K62N6316J8892o7598M2915P2771k8369N3366J24152m8544m5613
12945D89292n4564p678l7806r942R3124J06008k0985q723k9680m9376n5208K6725
12933D41187Q2127K3879o2000o0986L5682r017j5866K7045P2026J10161K4344
12922F68582l0827k3057P0006K6586j1872k3186m9225P08M1174j9240o7687j12647
12910D69315n6210P0933L8204j6190j1588P1989j3909J8712R306j2677j5655L6274
12898E88504K7468L6241J2260M4449N7546Q378n8113j4628N4853P1052O9502L7413
12886I34925p3279j3643o6744p9271m3555j2434J5131P1109M3559J11630J7863
$$ y = [276417, 278646, 204601, 185312, 215872, 240814, 236592, 204045, 220208, 265824, 301463, 331311, 309135, 310742, 311004, 367320, 386212, 318614, 361529, 434300, 405931, 459297, 583449, 534905, 489292, 434728, 427050, 389244, 379302, 472426, 578434, 557449, 548726, 519046, 469670, 414462, 441187, 523314, 547193, 485193, 424207, 459889, 450872, 435006, 462051, 534077, 644238, 668582, 637755, 614698, 684704, 711290, 699418, 676232, 627007, 627715, 668889, 649649, 581962, 469315, 413105, 484038, 522242, 506052, 494464, 566453, 552544, 571256, 580562, 567885, 552230, 588504, 615972, 652213, 664473, 708922, 766468, 774846, 716733, 702105, 756958, 828010, 897512, 934925, 861646, 848003, 781259, 701988, 658433, 645999, 661130, 732239, 775798, 887428, 905291]
12875I05291J6458J9966j9650p965J0208Nn0760N4910J74818J6252q147L0348
12863A141734L5428J4430P5013O0806L0174K1797P3449N9480K7096J9271L4967
12852A593645P8361k7042j6436M4687R6678J24198J26053O247j8028J31103J13689
12841B253155P4850J17857J52347R4195J33845J42442J28953K57499J76100J55837
12831C687080J17383J12744Q3902K27868K81322J94806J86011K16057L30746M50232
12821E888151M60809M22150M68304N08609O64488P94629Q25422R37477J035934
12812A2005973J231565J525098J779371K083233K502507K988714L333367L619130
12804C1068958M044536M747417N745869O975390R138271J2635883J8256535K6623451
$$ y = [905291, 921749, 941715, 922065, 914100, 924308, 924313, 873553, 928463, 1103281, 1119533, 1111386, 1141734, 1177162, 1191592, 1266605, 1327411, 1357585, 1379382, 1452831, 1512311, 1539407, 1558678, 1593645, 1672006, 1644964, 1628528, 1673215, 1769893, 1894091, 2020144, 2026391, 2008363, 2139466, 2253155, 2328005, 2445862, 2598209, 2692404, 2826249, 2968691, 3097644, 3355143, 3531243, 3687080, 3804463, 3917207, 4001109, 4228977, 4510299, 4705105, 4891116, 5107173, 5437919, 5888151, 6348960, 6771110, 7239414, 7748023, 8412511, 9207140, 10032562, 10970039, 12005973, 13237538, 14762636, 16542007, 18625240, 21127747, 24116461, 27449828, 31068958, 35113494, 39860911, 45606780, 52582170, 61720441, 74356324, 92612859, 119236310]
12796A19236310L7918209M9564924N8099685O2090163O0886514N4509594M3549139
12789D85854538K7525910O726778j6612028l6938226n0775296n7749457n8333461
12782B99698758n4760287m8760463m1032849l1835002k2946846j6104184j1522665
12775G2736462q619106o874479n620663m914302m354679l922190l423557l018476
12767C1989010k630320k201971j855115j483400j252996j005109q76084p14279
12759A9969736p38004o31476n82494o35418o27929o79579n99939o80520n84444
12750A4209933m87734n35913m70060m00114l47337l81225k93988k89807j26340
12741A0877415L5115J18235K56952M68456O03268P55207Q74875Q93864P15511
$$ y = [119236310, 157154519, 206719443, 264819128, 326909291, 387795805, 442305399, 485854538, 513380448, 520107226, 503495198, 466556972, 415781676, 358032219, 299698758, 244938471, 196178008, 155145159, 123310157, 100363311, 84259127, 72736462, 64117356, 57242877, 51622214, 46707912, 42353233, 38431043, 35007486, 31989010, 29358690, 27156719, 25301604, 23818204, 22565208, 21560099, 20684015, 19969736, 19231732, 18600256, 18017762, 17382344, 16754415, 16074836, 15474897, 14794377, 14209933, 13722199, 13186286, 12716226, 12316112, 11968775, 11587550, 11293562, 11003755, 10877415, 10912530, 11030765, 11287717, 11756173, 12359441, 13114648, 13989523, 14883387, 15598898]
12732A5598898N06469K45060j47042n95068j006327j258530j284518j210582r82367
12723I865993q46139o84251n41160l82037k45047j33019J211J74551L08450L04553
12713G823105L35536L83269M31575L26574J16878l3621j52323j89113k30242l42177
12703H469461l46048l17948j08075k5912J26327M80785Q26196J070563J275559
12694A1450908J387652J327415J250753R67870N48201J07478k90953o09873r47071
12685A5192380j173023j251746j256082j180268j132832r94340q90225p26991
12677F586873p11737n63218m08808l96595l68200l06227k38674j59301j32906
12668C301207j13810o0169m5879p0649k6735m6951j8081O4041M0667l6904k9258
$$ y = [15598898, 16105367, 16350427, 16203385, 15608317, 14601990, 13343460, 12058942, 10848360, 9865993, 9019854, 8335603, 7794443, 7412406, 7167359, 7034340, 7035551, 7210102, 7518552, 7823105, 8158641, 8541910, 8973485, 9300059, 9416937, 9383316, 9230993, 9041880, 8811638, 8469461, 8123413, 7805465, 7697390, 7671478, 7797805, 8278590, 9104786, 10175349, 11450908, 12838560, 14165975, 15416728, 16384598, 16932799, 17040277, 16749324, 16139451, 15192380, 14019357, 12767611, 11511529, 10331261, 9198429, 8204089, 7313864, 6586873, 5875136, 5311918, 4903110, 4506515, 4138315, 3832088, 3593414, 3434113, 3301207, 3187397, 3127228, 3081349, 3010700, 2983965, 2937014, 2918933, 2982974, 3023641, 2986737, 2957479]
12657B957479l6499p6066k05400k26811j67340j67600j51634j19187q2021j7707
12647A707214k000j30364n3711O0759L2600r1487q8157k6011K9704r398p5401
12636A353748q9261q0020n5691R786k0276q895o6537r952j2947j08248l9712j3805
12624H58190l873r362O1244k32k8562O8491N8770j681M6878k2092P7541N1688
12612A157000K8991l8104J03942N1037O1131L6060l9198J2704k1946J8157p4848
12601A294926k2951q181l0965k7965p9715o6127l0695l2075j09786j6385p0625
12590G99456j24929J1027m9870k2889K9234J2143K4483J7416o6159M6326K4859
12579G01097n1428L244O57J8766R5088N4194N0104P3985P6108j4574j13688R493
$$ y = [2957479, 2920980, 2844914, 2639514, 2412703, 2245363, 2077763, 1926129, 1806942, 1724921, 1707214, 1705214, 1574850, 1521139, 1581898, 1614498, 1523011, 1434854, 1408843, 1438547, 1429149, 1353748, 1264487, 1184467, 1128776, 1138562, 1118286, 1109391, 1042854, 1032902, 1019955, 911707, 871995, 858190, 854317, 844955, 906199, 905967, 877405, 945896, 1004666, 1002985, 1049863, 1027771, 1105312, 1157000, 1185991, 1147887, 1251829, 1302866, 1363997, 1400057, 1360859, 1373563, 1351617, 1369774, 1294926, 1271975, 1263794, 1232829, 1204864, 1125149, 1059022, 1028327, 996252, 886466, 870081, 799456, 674527, 685554, 635684, 612795, 642029, 654172, 678655, 696071, 629912, 676238, 701097, 649669, 652913, 653570, 672336, 767424, 821618, 871722, 945707, 1021815, 1007241, 893553, 903046]
12567I03046N5408J0742L9590o9153q5761q238m2704k8175q563M1888P3960M293
12555H86333l8617K0397K8743j25263o4611M9399o2264o0194q7717j0153o797
12544E29256N0113O0368o8884n4552k0107o431o0355J802J3536L4600K4128k1064
12532D82410j06663J2933M8655m7334o5944q520Q9567M8594k6823j9694J567N521
12520D14269M7529P298p4549Q103M1158O7961l5004j15305n7809K6246o1530l1673
12508B36694P3797M2595N7380J9078N494r3100j7803J5109P6026L0432K5480L4740
12496E05922N1423J0374j71N01K0484l9115n1591n6376j1337M349m2739J1102
12484D02826J5644M0078M7889k3279m5782K6205l7591K2392K139j3724P2967M493
$$ y = [903046, 958454, 969196, 1008786, 939633, 853872, 845634, 802930, 774755, 766192, 808080, 882040, 886333, 847716, 868113, 896856, 771593, 706982, 756381, 694117, 633923, 546206, 536053, 529256, 579369, 639737, 570853, 516301, 496194, 489763, 429408, 431210, 444746, 479346, 503474, 482410, 375747, 388680, 437335, 390001, 324057, 315537, 405104, 453698, 426875, 407181, 408748, 414269, 461798, 469096, 394547, 402650, 443808, 511769, 476765, 361460, 303651, 329897, 268367, 236694, 310491, 353086, 410466, 429544, 435038, 341938, 324135, 339244, 415270, 445702, 471182, 505922, 557345, 567719, 567548, 568049, 588533, 549418, 497827, 441451, 430114, 434463, 391724, 402826, 418470, 458548, 506437, 483158, 437376, 463581, 425990, 448382, 450521, 436797, 509764, 514257]
12472E14257M6379J10988J40610J45707K27596L32296M84983M83428L54551J02747
12462B943542j51941k35136k67194k49677r7753p1478o0290n0466l3276q4065
12452A642266P4225O1438J15242R5684L5129N471m5517R552M8617P4877J08312
12441B225296J49536O6152q1389k9258l1186n5450J03255J11019J41343L37783
12431B937101M28382O10848R23263Q72042O27159K65905k12005o21131q17065
12422E014499q77829o20809m19909k55266j20660q9323n0394M3054R8469R0881
12412B812713M0426p5564j74165j43072j12325j05667l9812N8814K1642r5497
12402B187493j41317j17196r9127k5856o899q5910K640J02777K10735K47646M04382
$$ y = [514257, 560636, 671624, 812234, 957941, 1185537, 1517833, 2002816, 2486244, 2840795, 2943542, 2791601, 2556465, 2289271, 2039594, 1941841, 1870363, 1810073, 1759607, 1726331, 1642266, 1716491, 1777929, 1893171, 1988855, 2023984, 2029455, 1983938, 1993490, 2042107, 2116984, 2225296, 2374832, 2440984, 2359595, 2330337, 2299151, 2243701, 2346956, 2457975, 2599318, 2937101, 3365483, 3976331, 4899594, 5771636, 6398795, 6664700, 6452695, 5831564, 5014499, 4136670, 3515861, 3095952, 2840686, 2720026, 2630703, 2580309, 2623363, 2721832, 2812713, 2853139, 2777575, 2603410, 2460338, 2348013, 2242346, 2202534, 2261348, 2282990, 2187493, 2046176, 1928980, 1829853, 1803997, 1797098, 1711188, 1713828, 1816605, 2027340, 2274986, 2679368]
12391B679368L92032L40823N1015l07564n14732m32863l43665k31982q0596K6126
12381A577962l3531m6271O2535R3391J25277J32452J43861J41686K09458J96090
12371B602910K45047J97497K05857P9666R4070J63321N3163N6975K19436K23651
12361D141593K13242K15282Q2824J9599K5575M1910N3547K91120M45736O22002
12351F152430R21511J072713J061660Q33878N52183k5954n10895q57205j122451
12342H077870j168514j194898j113720r65427p04607l86908k72179k43561k61487
12333A766569j44228j68568m2161q7566r0389k5099r2175j1541m3354q1709l3838
12322I45941p0058j29661m9094r846K91l2822M1743R7710L436J5531J6115l9272
$$ y = [2679368, 3071400, 3412223, 3463238, 3155674, 2640942, 2208079, 1864414, 1632432, 1551836, 1577962, 1544431, 1498160, 1560695, 1654086, 1779363, 1911815, 2055676, 2197362, 2406820, 2602910, 2847957, 3045454, 3251311, 3330977, 3425047, 3588368, 3641531, 3698506, 3917942, 4141593, 4354835, 4570117, 4652941, 4672540, 4698115, 4740025, 4793572, 5084692, 5530428, 6152430, 7073941, 8146654, 9208314, 10042192, 10594375, 10568421, 10057526, 9200321, 8077870, 6909356, 5714458, 4600738, 3635311, 2930704, 2543796, 2271617, 2028056, 1766569, 1622341, 1453773, 1411612, 1324046, 1233657, 1208558, 1116383, 1104842, 1061488, 979779, 945941, 875883, 746222, 697128, 687282, 687573, 654751, 696494, 794204, 797640, 813171, 829286, 790014]
12310G90014j7450J9014m5774l4655K594l6311o6078o2684K3988j2275M971j34698
12298D30656q8117j9783R7174L28k2144m9059l5487M5605J6378J1232O4863L4766
12286D86412L1161N298R879J1608l5420l5607o177l727l7985n8053j5597M4923
12274C96715L8901p099j42787p0565K6085J7974K4206M4819M5712O0058L7227
12263D71246M7495r945k1005K0950n2028r9496l944m1680q2681j0671p5745n8592
12251H3904J17344j0153k327O4456o9588o1202p726n4345J3189j9109Q0606J4588
12239A49637m1018J4385R2210j8710K5774K9980n8085J8928M4060m3729j14296
12228I9136m8011k4504K0764M6716j8820J041p951L4391J0490l8968j6437J8927
$$ y = [790014, 772564, 791578, 745804, 711149, 713743, 677432, 611354, 548670, 572658, 560383, 565354, 430656, 342539, 322756, 419930, 420258, 398114, 349055, 313568, 359173, 375551, 386783, 451646, 486412, 517573, 522871, 532750, 544358, 508938, 473331, 467154, 463427, 425442, 367389, 351792, 396715, 435616, 428517, 285730, 215165, 241250, 259224, 283430, 328249, 373961, 434019, 471246, 518741, 508796, 487791, 508741, 456713, 357217, 353273, 311593, 228912, 218241, 142496, 83904, 201248, 191095, 188768, 253224, 183636, 122434, 114708, 60363, 73552, 54443, 135049, 149637, 108619, 123004, 215214, 196504, 222278, 252258, 194173, 213101, 257161, 213432, 99136, 51125, 26621, 47385, 94101, 75281, 76322, 68371, 102762, 113252, 74284, 57847, 76774]
12216G6774J5959K1361K3722R577L2365k7234l335J0195K375q4207j6460M6182
12204A07274m1253k3013J8111k2683O9833Q2750N1178o5350N062o2037r4474J7009
12192D2407O628J9508o1871j7226Q1027l491p7460J9538K3905n577L2816q814
12180E1390L0145k6183j4870j3664M784j7541M3089j0573m317Q2554k1320M63
12168A03957M3896l3505r3933o7078j0655J10605l2194o1581K7094M3921K2302
12157E2829J1298j14475p1217O9272L9516L8974K1785J0764r4322n0756R688P1237
12145e407J3640m3688L9839L5211K6476K7060j9690L1426M0729k753p7161k1764
12133D3918N8194M5991j0177k6106L6110J1686k0191p9788m5200N395Q1066R835
$$ y = [76774, 92733, 114094, 137816, 147393, 179758, 152524, 149189, 159384, 161759, 77552, 61092, 107274, 66021, 43008, 61119, 38436, 108269, 191019, 242197, 176847, 181909, 119872, 25398, 42407, 49035, 68543, 6672, -10554, 70473, 66982, -10478, 9060, 32965, 27388, 60204, 51390, 81535, 55352, 40482, 26818, 31602, 14061, 57150, 46577, 42260, 124814, 103494, 103957, 147853, 114348, 20415, -46663, -57318, 53287, 21093, -40488, -13394, 30527, 52829, 64127, -50348, -121565, -52293, -12777, 26197, 47982, 58746, -35576, -86332, -76644, -5407, 8233, -35455, 4384, 39595, 66071, 93131, 73441, 104867, 145596, 142843, 65682, 43918, 102112, 148103, 137926, 111820, 147930, 159616, 139425, 59637, 14437, 19832, 100898, 110733]
12121A10733M36j7338O2808k2185l9250p9427j5433n134m7148k0589P094M2471
12109b2962N9080L2682J4405N9973o184Q662m7225j3000j0544L1854m3267j9252
12097D4222p3054J3058J7649K9669K0511Q023P194k9959k6149l3254j7889J4745
12085b5234N1831l7552J8811J8957L6310M8625l5821m0328J5317M5228m9505k9332
12073A7307o1102P952p329J4154q6507o5960N7071O7120K2445O8638K2714k1799
12061C4704n6726k5824n8073M91J4780J08612M5853l6691r4917J2517N9704L0162
12049C4592M3908j9466j7722l4094l4188r27L7334r552N405P4615j8545n5411
12037E949L8094J1926l2479k148J7760l1n1521k1639m6506K7254K8714L62l460
$$ y = [110733, 111169, 93831, 156639, 134454, 95204, 15777, 344, -4790, -51938, -72527, -65433, -22962, 36118, 68800, 83205, 143178, 136994, 145656, 98431, 85431, 74887, 106741, 63474, 44222, -28832, -15774, 1875, 31544, 52055, 60078, 67272, 37313, 11164, -22090, -39979, -25234, 26597, -10955, 7856, 26813, 63123, 111748, 75927, 35599, 50916, 96144, 46639, 17307, -43795, -35843, -43172, -29018, -115525, -181485, -124414, -57294, -34849, 33789, 56503, 34704, -22022, -47846, -105919, -105428, -90648, 17964, 63817, 27126, -67791, -55274, 4430, 34592, 78500, 59034, 41312, 7218, -26970, -27897, 9437, -115, 5290, 79905, 61360, 5949, 44043, 55969, 23490, 21342, 39102, 39071, -12450, -34089, -80595, -53341, -24627, -24265, -27725]
12024b7725O1703J3580o3186J4097O2736L9982p2086K153N4297m6365k9414L6490
12012D6262N034Q76n4008k3715m2955k256L9138J7090L475q0735k9832M654J1335
11999a05637P2957O8121O0134J186m8637M768k5415k6443k4846J8512m8114j26456
11987a79870R0028J45169L301r5031N0156R2909k2375J1985l982j6830n2644l3289
11975a0473L9837k8598l5328M6082l4739p4699l6452O8450M1133j0829P6161K4101
11963F4646R8674L6941q2202n7945L260o4921j5645J10942K6665n4364K2063O215
11951I4329k4757l8056q972o98j4493K232l0218J8008j873N864N9744M3225Q944
11938A13279k472Q2829n9994j13144j05605r491Q2777M4110J8980n513j1523l6765
$$ y = [-27725, 33978, 47558, -15628, -1531, 61205, 101187, 29101, 31254, 85551, 39186, 9772, 46262, 51296, 52172, -1836, -25551, -68506, -70762, -31624, -14534, -11059, -91794, -121626, -116972, -105637, -32680, 35441, 95575, 96761, 48124, 52892, 27477, 1034, -23812, -5300, -53414, -179870, -89842, 55327, 58628, -36403, 13753, 106662, 84287, 96272, 92290, 75460, 22816, -10473, 29364, 766, -34562, 11520, -23219, -97918, -134370, -65920, -24787, -35616, 40545, 64646, 163320, 200261, 118059, 60114, 63374, -1547, -17192, 93750, 120415, 66051, 88114, 94329, 69572, 31516, 22544, 21846, 7353, 9585, -20633, -2625, -4498, 1366, 61110, 104335, 113279, 110807, 193636, 133642, 20498, -85107, -94598, -11821, 32289, 51269, 45756, 34233, -2532]
11926b532L7484N7781N427m5237m4202L5952j289J2402O243j0489n1369l5152
11914c4981J0267J931J7289r003q1768k3613L3334N4446J5639j1633J0747J6505
11902h40n3350k8692L1414K6184m9833m6950P3491L7609M7370k9686m5517j4604
11890e3404p6272j3205M4449M255Q6736J08586J8803q5345k0877M8744P9555L581
11878A45606o7497j12247q1194N0601J0967L1331J09291K3483j692o3337P533
11867E2845N456p852L5326N1957q1661j060O7359K5789M3432j3760l5329m0799
11855A01703j12055K0041K4409j1557K5043J2301n9538M1381J4975j6031m0496
11844A76p8407N2103P7668J1885j8078M7754M819n0220n8269q240n2987M969n233
$$ y = [-2532, 34952, 92733, 98160, 52923, 8721, 44673, 43384, 55786, 62029, 51540, 171, -34981, -24714, -22783, -5494, -14497, -96265, -119878, -86544, -32098, -16459, -28092, -17345, -840, -54190, -82882, -51468, -25284, -75117, -122067, -48576, -10967, 36403, 6717, -38800, -53404, -129676, -142881, -98432, -94177, -7441, 101145, 119948, 34603, 13726, 62470, 142025, 145606, 78109, -34138, -115332, -64731, -53764, -22433, 86858, 110341, 108649, 45312, 52845, 58301, 50449, 85775, 137732, 56071, 55011, 122370, 148159, 191591, 177831, 142502, 101703, -10352, 9689, 34098, 22541, 47584, 59885, 347, 41728, 56703, 40672, 176, -78231, -26128, 51540, 63425, 45347, 93101, 97920, 47700, -10569, -18809, -71796, -66827, -72060]
11831g2060J975J06416l0343n6456L4424k0962M9359l6270l7663L7221R4601M3124
11819A13366n146J8596K9845n1390n5093m0360j4308o2792L0359R7781M3238L7274
11807A41370M2007l2138m1002k6573P057M4315k2629o8306r1629K0527N3194O396
11795C2589p303K6356n1245l3823j1828l8686k9086P2116K992o2990j3583J351
11783a13140k5035P8024N2864Q9485L1231o7518k0238P9486n5977P818k012L886
11771E8874j8959k7842k0294L9424O1871j6713n9303l7638l5721p3141O447P308
11759a15687m0R3241K3883k9115l0437J3155K4860k8447m0832q664J5525K0044
11747f2514M5284J8288J1667K846K2221N7315j9304n2890j2607R5257K3174n5067
$$ y = [-72060, -70085, 36331, 5988, -50468, -16044, -37006, 12353, -23917, -61580, -24359, 70242, 113366, 108220, 126816, 156661, 105271, 50178, 9818, -4490, -67282, -36923, 60858, 104096, 141370, 183377, 151239, 110237, 83664, 90721, 135036, 112407, 44101, -47528, -27001, 26193, 32589, 25286, 51642, 397, -33426, -45254, -83940, -113026, -40910, -37918, -100908, -114491, -113140, -138175, -60151, -7287, 82198, 113429, 45911, 25673, 105159, 49182, 57000, 54988, 58874, 39915, 12073, -8221, 31203, 93074, 76361, 17058, -20580, -56301, -129442, -122995, -115687, -115727, -22486, 1397, -27718, -58155, -45000, -20140, -48587, -89419, -98083, -82558, -62514, -17230, 1058, 12725, 15571, 37792, 95107, 75803, 22913, 10306, 105563, 128737, 73670]
11735G3670k1897n676J3215M816k6099o4101n8223m1739J17505Q2985J2170k1165
11723F5461n005p0429k5999L6789j2921o2397L6783P7217N3729m1674r4082m9026
11711i1554M4954j6380J8966O1380n460N782M6661j7405l1164n8196J3984k2689
11699e1121L953L035r1644j1026J496J0125L5270K1881L8288l6441J3019M428
11687e8737k2096P8390M501j0013Q238J0569O7563q7877J1358N0105N1668j9448
11675H4221j1277k862r2396o6066k1315P1626k6909J1997M7245o557N572j1967
11663a8688n766L514M5654P7284n7183r1146j603j7158n6877r681O320M2236m3098
11650a26192n7474l3628Q8377R1125L1063q6068P6830n1q9466K5444O4632J5240
$$ y = [73670, 51773, 46097, 59312, 64128, 38029, -26072, -84295, -126034, -8529, 74456, 86626, 65461, 60456, -9973, -35972, 817, -12104, -74501, -37718, 39499, 93228, 51554, -42528, -91554, -46600, -62980, -44014, 17366, 11906, 17688, 64349, 46944, 15780, -42416, -28432, -51121, -47168, -44133, -135777, -146803, -145307, -135182, -99912, -78031, -39743, -76184, -63165, -58737, -80833, -2443, 2058, -7955, 283, 10852, 78415, -9462, 1896, 52001, 103669, 84221, 72944, 70082, -22314, -88380, -109695, -38069, -64978, -52981, -5736, -12293, -6721, -18688, -24454, -20940, 24714, 101998, 44815, -46331, -47934, -65092, -121969, -131650, -125330, -83094, -126192, -183666, -217294, -128917, -37792, -6729, -92797, -15967, -16018, -105484, -80040, -15408, -168]
11638a68l0040m1905n240L3091M2439J4159n801K5419o757m5105j8237k4597K6551
11625c6191j556j6220M1744m2876j0074m6043n3953J1555N4558J21498j8265k3515
11613a9338M2195M5932L4420l1851k4921l1715l9780m3364l8853l924K3092j2526
11601a00633j6867q2393p363N8587J16793J12476L4965l9610K4146p9947q2720
11590f2566k0291P4744P9442N2189j3347m4323l1261k7567n0706j7095k5722j3127
11578i9630M6511q163L8177J3329M0236N8610J563l3564n6283M5332j751m5548
11566a181p441J463k6156K3428J2063o4134o0218M8631P96J8318M1549Q6082P0376
11553A43576m6358k5178L5676o235L5401r914m9525l5574K7196J03874j07976
$$ y = [-168, -30208, -72113, -77353, -44262, -1823, 12336, 6535, 31954, 25197, -19908, -38145, -62742, -36191, -37747, -53967, -12223, -55099, -65173, -111216, -165169, -153614, -99056, 22442, 4177, -19338, 22857, 68789, 103209, 71358, 46437, 14722, -25058, -68422, -107275, -111199, -88107, -100633, -117500, -199893, -207256, -148669, -31876, 80600, 115565, 75955, 100101, 20154, -62566, -82857, -8113, 71329, 123518, 110171, 65848, 34587, 7020, -43686, -60781, -86503, -99630, -53119, -61282, -23105, -9776, 30460, 89070, 90633, 57069, 786, 46118, 44367, -1181, -8622, -7159, -33315, -9887, 2176, -61958, -122176, -73545, -72749, -54431, -12882, 73200, 143576, 97218, 72040, 107716, 101481, 136882, 126968, 77443, 41869, 69065, 172939, 64963]
11542F4963q2518O03N2167J4160j8558K3310k0629p2915L8511P0443J8296l4916
11530E2917p5179j03054m4975O338P7540m1000r6777J4412R3956N4022O918J7634
11518c7248J4400j4239K8794J7045K8273J6921L9964j0707L0620O6344M558j00900
11506H3825j16421M1608m1957p0859N9267J9202m7150O8768m2850m5551L676P401
11494h1041q160L3026M787k181q7714k7029L0422j592L1226J21703J49367R8717
11482B61531j41066r4162k0290j9680L0299k9462r1375K235N1707N8831J23033
11471A31601j23017j17303J2061j3174j5664O6269N0147L6280M0416M4618l2070
11460H0164j1705N816J2828J2703j5728j5886N252L9591m8650J795P7599L614
$$ y = [64963, -17555, -16952, 35215, 49375, 30817, 54127, 33498, -39417, -906, 69537, 87833, 52917, -22262, -125316, -170291, -163953, -86413, -127413, -224190, -209778, -115822, -61800, -54882, -37248, -22848, -37087, -8293, 8752, 37025, 53946, 93910, 83203, 113823, 180167, 184725, 83825, -32596, 9012, -32945, -103804, -44537, -25335, -72485, -3717, -46567, -92118, -88442, -81041, -89201, -56175, -51388, -53569, -141283, -168312, -137890, -139482, -108256, 13447, 162814, 261531, 120465, 26303, 6013, -13667, 16632, -12830, -104205, -101970, -50263, 8568, 131601, 8584, -108719, -96658, -109832, -125496, -59227, -9080, 27200, 67616, 112234, 80164, 68459, 74275, 87103, 99806, 84078, 68192, 73444, 113035, 64385, 66180, 143779, 147393]
11448A47393l8216k1547q1336l0240O4606R554L8J7413M3549M0079m4120j6470
11436I0703m0523n6389N439K8242J3962J3879R147P1670n5095j8896L8282J03315
11424B03736L6813j8216n4909L5450p658j2511J44o6613r8356n9556p459J5918
11412c3217L8366K4266m6438K4753k2042l1497j2801M8247j3754j3545K4704m7740
11400f0698O3711K5739K3498l343j3954m8409O06J2039J3814J8942m3485p3563
11388h5103K1960L7044J0016p633o1125M2378O9097O168L8064N7784K835m6074
11376H5411j1981j7538k7254N8230j1331L8806K5385n1474k1357r4866N531N2410
11364B9972M471o8020M6487j8468l1145k5040J2442J8299Q0305K056J3967M4247
$$ y = [147393, 109177, 87630, 6294, -23946, 40660, 50214, 50252, 67665, 111214, 151293, 107173, 90703, 50180, -6209, -770, 27472, 41434, 55313, 64460, 136130, 81035, 62139, 100421, 203736, 240549, 222333, 167424, 202874, 195216, 182705, 182849, 116236, 17880, -41676, -49135, -33217, 5149, 29415, -17023, 7730, -14312, -45809, -58610, -10363, -24117, -37662, -12958, -60698, 3013, 28752, 52250, 48907, 34953, -13456, -12850, -811, 13003, 31945, -11540, -85103, -63143, -26099, -16083, -23716, -84841, -42463, 26634, 32802, 70866, 128650, 131485, 85411, 73430, 55892, 28638, 86868, 75537, 114343, 139728, 88254, 66897, -27969, -22438, 29972, 34443, -33577, 12910, -5558, -36703, -61743, -49301, -31002, 49303, 51359, 65326, 109573]
11352A09573M3704j2372l6291M1182L0519n09L647M121l456Q1377j7997n531j19698
11339A18269M305N914m2501J402o6738K3778M7744M4262K2803l9620p506r1058
11327B1054n3740o3693P2734J36538m682o514K897o6504j2547Q5355M0998r338
11315A42558L7726q705j1593j08575p3974L7304M7869O1344p0321j9879O664P9827
11303A20245J1452J6000Q6668O0700n1175l8819K7919L4631K9844q0787n1470
11292A65208k8554k0399j7605K9631J7679J1128O3518J37622n615n2728n7998
11281B41887j26231O1533J04990N460L7147n8741n6552P615L2247N891L1082L2628
11269C18956Q238k4474l1247l5210K3931J14558K3901r606M3205P7588K5323L1058
$$ y = [109573, 153277, 140905, 104614, 145796, 176315, 175806, 179453, 183574, 180118, 261495, 243498, 237967, 118269, 122574, 128488, 85987, 87389, 20651, 44429, 92173, 136435, 159238, 119618, 112112, 21054, -32686, -96379, -23645, 112893, 108211, 101697, 104594, 38090, 25543, 110898, 151896, 142558, 180284, 171579, 159986, 51411, -22563, 14741, 62610, 123954, 53633, 33754, 40418, 120245, 131697, 147697, 234365, 295065, 243890, 205071, 232990, 267621, 297465, 216678, 165208, 136654, 116255, 98650, 128281, 145960, 157088, 220606, 358228, 352613, 299885, 241887, 115656, 177189, 282179, 287639, 324786, 266045, 209493, 217108, 249355, 255246, 286328, 318956, 327194, 302720, 271473, 236263, 260194, 374752, 398653, 389047, 432252, 509840, 535163, 566221]
11257E66221J7083J15574Q6949J44709J91043L15371M88632O69275P76506R59105
11247D330468Q56710P04657L04473j52361n41099q59493r12394q10439o87519
11238B233003n20596l94423j77628j18706j42206j29528p2299r6890r8424k1158
11228D61145l6995o4005j5928l3726J3685M8905K0944k87p0277k6201j6289J0611
11216B91582r5638n3344N8145j9843j1796j0928J6291P7502k9537J9638m28l2883
11204B08761Q628j10861k8683O8113k171j5376J9J8369m9039o4452j2745j455
11192A9108o2474k9469O4528Q1508q492J5740N5759m6460j7169n2753m3608N1411
11180B7629K5822m5338L0593R7201J4556q1637k1085M027k1750J0190N0663J4280
$$ y = [566221, 583304, 698878, 785827, 930536, 1121579, 1436950, 1925582, 2594857, 3371363, 4330468, 5187178, 5891835, 6196308, 6043947, 5502848, 4643355, 3730961, 2920522, 2233003, 1712407, 1317984, 1140356, 1021650, 879444, 749916, 677617, 580727, 482303, 461145, 424150, 360145, 344217, 310491, 324176, 373081, 394025, 393738, 323461, 297260, 280971, 291582, 195944, 142600, 200745, 180902, 169106, 158178, 174469, 251971, 222434, 242072, 241644, 208761, 217389, 106528, 77845, 145958, 143787, 128411, 128430, 146799, 97760, 33308, 20563, 19108, -43366, -72835, -8307, 73201, 64709, 80449, 136208, 89748, 72579, 19826, -23782, 27629, 53451, 8113, 38706, 135907, 150463, 68826, 47741, 51768, 30018, 40208, 90871, 105151]
11168A05151l0878L5120p7693m0651M8267K616j5052R3711P4353O680o616J5948
11156B10956l0568p066N2807M0191K8675j8212n4708M1371K8479k7270p855o8377
11144A88423L0176l6572p0951K1050J4344l5062j13115n3165l3741J07087L8775
11133E7249J4412Q6236k0220j04051j21762K2707L4875J1267K610R642M1886j5505
11121A9346L9821j1572J5775j691k6506o1029l4562K9693O5587L1020n172o2288
11109a578o5589J0484K3152N3915L5748O684k9871k5743M6161P0407J4610j2152
11097A26228N1432N1938k1175j9333m7897j0342k7029m6748o647n8094J2126J48785
11085A53244l9676q4764o8973o7497j2179M9865P2689Q0209O2296M0451l9849
$$ y = [105151, 74273, 109393, 31700, -8951, 39316, 41932, 26880, 120591, 194944, 201624, 195008, 210956, 180388, 173322, 226129, 266320, 294995, 276783, 222075, 263446, 291925, 264655, 256800, 188423, 218599, 182027, 111076, 132126, 146470, 111408, -1707, -54872, -88613, 18474, 57249, 71661, 157897, 137677, 33626, -88136, -65429, -30554, -19287, -16677, -7035, 34851, 19346, 59167, 47595, 63370, 61679, 35173, -25856, -60418, -30725, 34862, 65882, 60710, -1578, -67167, -56683, -33531, 20384, 56132, 62816, 32945, 7202, 53363, 123770, 138380, 126228, 177660, 229598, 208423, 189090, 141193, 130851, 103822, 57074, 50427, -7667, 4459, 153244, 113568, 28804, -40169, -107666, -119845, -69980, 2709, 82918, 145214, 185665, 145816]
11074A45816l0589j4542r1752K7443K3053o1032J2842M6860J3005o5466M256L3369
11062D3263o75n5439J8957L6718L8678m7398m4830l5345j4825O4313l2755M9702
11050B0364L2918n1240l0322q077N5123M0286L4056p9186K2885j3159n3634L16
11038b9670L3605l3503l4487m382p409N2532L1350L9529j1412M032M9638m7878
11026D1945n7513M9733p8238o5907J4433P4306P5855K0745K8634p4894K5189p515
11014D6773O4412R7822M998l1378J2832l5911l2637k3055P07k865K378J996M7844
11001A53916k7576j7593j06689n535N5671j8899n7269O2759J10483l292j13940
10990C2036j3976L6281Q9839N493q013P5869j077K2154O1500l8721o4693p0562
$$ y = [145816, 115227, 100685, 8933, 36376, 59429, -1603, 11239, 58099, 71104, 5638, 9894, 43263, 42588, -12851, 6106, 42824, 81502, 34104, -10726, -46071, -60896, 3417, -29338, 20364, 53282, 2042, -28280, -36357, 18766, 59052, 93108, 13922, 36807, 23648, -29986, -29670, 3935, -29568, -64055, -68437, -75846, -23314, 8036, 47565, 36153, 40185, 89823, 41945, -15568, 34165, -44073, -109980, -95547, -21241, 54614, 75359, 103993, 29099, 54288, 46773, 111185, 209007, 214005, 182627, 195459, 159548, 126911, 103856, 104563, 101698, 104076, 106072, 153916, 126340, 108747, 2058, -3477, 52194, 33295, -23974, 38785, 149268, 145976, 32036, 18060, 54341, 144180, 149673, 141660, 217529, 216452, 238606, 300106, 261385, 196692, 126130]
10978A26130l2870j3260k1286M252r682q461J3983n1571j8951l2086N8562K9072
10966D3832r0539J1524N6055n9782J8457N4862K5197Q971m7441p2758O5027M2075
10954E5480J9553M3110K2594n5081k1189P3028j2446R15N0240N953P7756n9522
10942B00391o562J3817N366m8855k1274j085m0844q6098m2038k7928n099j2983
10930g3192k2126n776J1938L5991N4488R0568l750J6539K0444l1133l6885j9119
10918C7987p0815M109j909Q8478K2957m123l6656K1535Q1127o1501j7435j4930
10906D8824p733J5172n2014k108N4906O1541O4535L1365M4604p1319o6771J7744
10894A38746l3792r1549k6160J6147O667O4890J9611M859J7836p584o0885j5710
$$ y = [126130, 93260, 80000, 58714, 62966, 53284, 44823, 58806, 7235, -11716, -43802, 14760, 43832, -46707, -35183, 20872, -38910, -20453, 34409, 59606, 68577, 21136, -51622, 13405, 55480, 75033, 118143, 140737, 85656, 64467, 137495, 125049, 125964, 176204, 182157, 259913, 200391, 193829, 207646, 213012, 164157, 142883, 141798, 100954, 14856, -27182, -55110, -60209, -73192, -95318, -101094, -89156, -53165, 1323, 91891, 88141, 104680, 125124, 93991, 57106, 37987, -32828, -28719, -30628, 57850, 80807, 76684, 40028, 61563, 142690, 81189, 63754, 48824, 41091, 56263, 4249, 2141, 57047, 118588, 183123, 214488, 259092, 187773, 121002, 138746, 104954, 13405, -12755, 3392, 10059, 74949, 94560, 99419, 117255, 109671, 48786, 33076]
10882C3076o5725L2901N6151k118M920M4907j290n9538p887p334P0039k0455J0392
10869H8039k738m1928j9227J7269Q6167M3549j8697n420k8948k4039l7363r07
10857E5757q97K651j1961J566k3655j5907j0075j07598N018N7661l196j5312r333
10844g5281R3344J618m1990j8873M2343J16640O1292n270j7578L8935M0671M0180
10832B76031j5822o3293n6954p7472J0820L5036l4518j20966o1743M5632J16086
10821E2837Q0912o4235k4696p895j8839K2750N8038L7544J702r4796k5184j3786
10809D352k1449J38277K9029m8778P201O31L0300k092m0589l2679l1568O9886
10797A02521K1847L6696K6003p0632K61o9552j221k8459r923P906L7729J399J1963
$$ y = [33076, -32649, 252, 56403, 54285, 59205, 104112, 102822, 43284, 35397, 28063, 98102, 77647, 88039, 85301, 43373, 24146, 41415, 127582, 171131, 152434, 147014, 118066, 94027, 56664, 55757, 54860, 57511, 45550, 47116, 23461, 7554, -2521, -110119, -105101, -47440, -50636, -65948, -75281, 18063, 19681, -22309, -41182, 1161, 117801, 179093, 173823, 156245, 195180, 235851, 276031, 260209, 196916, 139962, 62490, 73310, 108346, 73828, -47138, -108881, -63249, 52837, 133749, 69514, 44818, 36923, 18084, 40834, 98872, 136416, 138118, 43322, 18138, 4352, -17097, 121180, 150209, 101431, 108632, 109263, 139563, 137471, 96882, 64203, 32635, 102521, 124368, 161064, 187067, 116435, 116696, 47144, 45923, 17464, 7541, 15447, 53176, 54575, 66538]
10784F6538k7599L6076K8407N1989n0532p6663l5565j2742P1222O847L2164M5298
10772A35440M2025r558o0885n126n457l6915o9589l4363M5326K7971L2430O8717
10760A30016R4438p7125P362L6677k5081l0934m0506k0959O1674L3822L9229K6301
10748B34914P104O292K1513m5322p4657p7191j4399L5331N3476j7300j8427P6491
10736A87825J2654j48794m4569O0835o5931O8357P4096L200k9331P5586l8863
10725A55065l9738N4314P6453L3218K1973n5239o2802Q9323M5693j4414k2696
10714B81150l6755Q982K7705o9267p2460l3596n8298J6350R143Q535k8906r598
10702D2985J14600N3440j6063m9081j15659J2970M7681l8330j1492P4417M6010
$$ y = [66538, 38939, 75015, 103422, 155411, 104879, 28216, -7349, -20091, 51131, 57978, 90142, 135440, 177465, 167907, 107022, 101896, 96439, 59524, -10065, -44428, 898, 28869, 61299, 130016, 224454, 147329, 154691, 191368, 166287, 135353, 94847, 73888, 135562, 169384, 208613, 234914, 242018, 248310, 269823, 224501, 149844, 72653, 58254, 93585, 147061, 129761, 111334, 187825, 200479, 51685, 7116, 67951, 2020, 70377, 144473, 147673, 118342, 193928, 155065, 115327, 169641, 246094, 279312, 301285, 246046, 183244, 272567, 318260, 303846, 281150, 244395, 253377, 281082, 211815, 139355, 105759, 47461, 63811, 72954, 81489, 52583, 42985, 157585, 211025, 194962, 145881, 30222, 43192, 90873, 52543, 41051, 115468, 161478]
10691A61478M6682K4931l4500p0O114J3196N4741J9351M5142j6675n5863L7661
10679C02188K9576M3402L3145k8312J027L3231J6953L6069l7525p0646o9388j8838
10667B70882L6030J5158O5243O1516K002j0400k1819L2759r768J9262N5209J9475
10655E35549M6660R3078K37728M02735K98011K03922J87616M1109o9961j61619
10645A814828p0229j5922J34009J22622J12962M611r4221m7449n0320o869R3562
10634A997584P3604M4805P581k2460o5827K4396J10700K37758K07865Q6577P0717
10623B773300o864r759l1469k164N0657M0843O7237J16840Q5134J19567K21152
10612C424474R7484J74926L54125M68336N53523L88041O7252k57928l62405l73932
$$ y = [161478, 208160, 233091, 198591, 198521, 204635, 217831, 272572, 291923, 337065, 320390, 264527, 302188, 331764, 375166, 408311, 379999, 381026, 414257, 431210, 467279, 429754, 359108, 289720, 270882, 306912, 322070, 387313, 448829, 450831, 440431, 418612, 451371, 441603, 460865, 516074, 535549, 582209, 675287, 913015, 1315750, 1613761, 1817683, 2005299, 2046408, 1976447, 1814828, 1744599, 1728677, 1862686, 1985308, 2098270, 2102881, 2008660, 1961211, 1910891, 1904022, 1997584, 2071188, 2115993, 2123574, 2101114, 2035287, 2059683, 2170383, 2408141, 2616006, 2702583, 2773300, 2766436, 2756677, 2725208, 2723044, 2773701, 2814544, 2881781, 2998621, 3083755, 3203322, 3424474, 3521958, 3696884, 4051009, 4519345, 5072868, 5460909, 5528161, 5270233, 4907828, 4533896]
10602D533896l09722j84267r8783r1330j19161j36413j27858j0142k1854p6435
10592C357931L7376p2112p6558j22216o0230j27533j66136j72684j15026o3028
10582B419784J7082J1858K8171m9960n4586J9058l9164Q3844J74609K7857q2129
10571B556424l0614p1430j17873k1005K6715J51952J80206K02971m313k85037
10561B587996l66938m52952l31856j65997j25632m1086r0193j42259p9925r9713
10551F91445J1806Q9786j4317o9862L5680k0023J1416o176l5263K8893J617k135
10539G22867k1018n2227K203n3814L5931K0116k2407n3135k6966m4838L7914p3688
10527D70938P664N6606k9546l465k7073l6217n6425k4835K239r745n5820K8605
$$ y = [4533896, 4224174, 4039907, 3941124, 3849794, 3730633, 3594220, 3466362, 3456220, 3434366, 3357931, 3395307, 3323195, 3246637, 3124421, 3064191, 2936658, 2770522, 2597838, 2482812, 2419784, 2436866, 2448724, 2476895, 2426935, 2372349, 2391407, 2352243, 2436087, 2610696, 2638553, 2556424, 2525810, 2454380, 2336507, 2315502, 2342217, 2494169, 2674375, 2877346, 2873033, 2587996, 2221058, 1768106, 1436250, 1270253, 1144621, 1103535, 1013342, 871083, 791158, 691445, 703251, 793037, 778720, 708858, 744538, 724515, 735931, 729755, 694492, 723385, 725002, 722867, 701849, 649622, 651825, 598011, 633942, 654058, 631651, 578516, 551550, 506712, 544626, 470938, 478602, 535208, 505662, 502197, 475124, 438907, 382482, 357647, 359886, 350141, 294321, 322926]
10515C22926p2938l3304N4888j317O8835N3564r842Q202j042n6500q4769q575
10503B40128K5556M3411P1463q237L548k6460j1075M9611l6991j04501o3808K5291
10491B07936O377k8636p5378K5848Q0747m2632O9080O9669j4627M4411n2153j8976
10479B71666L809K8298j01371n9270o173j7267k2037K5400O1932j0130j938J4500
10467A87419p3244R942N4928j5583K5038n8791K2844O9061P9406N2561k3920l6848
10455B92813N202N40l2653q1297R227k1850j2363j9528J7625k517p6117R784N9180
10442A48046k035l0396l6721N610P7030j9446k3959L9194n4636o528P3195O6450
10430B35804l1101r282P3412k0546n8258J0357P1610k7855n4511J1321K8427n6807
$$ y = [322926, 249988, 216684, 271572, 270255, 339090, 392654, 382812, 391014, 389972, 333472, 248703, 240128, 265684, 309095, 380558, 372321, 375869, 349409, 338334, 387945, 350954, 246453, 182645, 207936, 214313, 185677, 110299, 136147, 216894, 174262, 243342, 313011, 298384, 342795, 290642, 271666, 275475, 303773, 202402, 143132, 136959, 119692, 97655, 123055, 184987, 174857, 172919, 187419, 114175, 124117, 179045, 163462, 188500, 129709, 152553, 221614, 301020, 353581, 329661, 292813, 298015, 298555, 265902, 184605, 193832, 171982, 159619, 140091, 157716, 155199, 79082, 88866, 148046, 146011, 115615, 78894, 84504, 161534, 142088, 118129, 157323, 102687, 96159, 169354, 235804, 204703, 195421, 268833, 248287, 190029, 200386, 271996, 244141, 189630, 200951, 229378, 172571]
10418A72571k9917J4767K7050J2322o3694j6492P1595P4726j5496Q826J15408
10407C71666K5390M675Q4255J22405L914m9568n789J09229P4140l8602j08439
10396E93276O564k5422j16259p011n6253k4910l9149R699R5294M9206o5411p043
10384D12581J0120J4017J23064Q7011j3992P4927K5367n1254j2288L8035L7686
10373G45274Q8842M2474n757L7442P0606N9656J2729O5359J72921J97799L14706
10362A802051N44593P61846R92399J334647J496400J682279J878350K017411J897917
10353A4407893J458518Q30735K52135j29400o20666j280738j723103j876243j850099
10344I469032j752529j487322j309551j056967p19381m48994k79983k63849k62788
$$ y = [172571, 142654, 157421, 184471, 196793, 133099, 116607, 188202, 262928, 247432, 256258, 371666, 397056, 401731, 485986, 608391, 612305, 562737, 556948, 666177, 740317, 701715, 593276, 599840, 574418, 458159, 451148, 394895, 369985, 330836, 340535, 435829, 485035, 419624, 412581, 422701, 436718, 559782, 646793, 632801, 707728, 733095, 681841, 669553, 707588, 745274, 834116, 876590, 870833, 908275, 978881, 1038537, 1051266, 1116625, 1289546, 1487345, 1802051, 2346644, 3108490, 4100889, 5435536, 6931936, 8614215, 10492565, 12509976, 14407893, 15866411, 16697146, 16949281, 16819881, 16199215, 14918477, 13195374, 11319131, 9469032, 7716503, 6229181, 4919630, 3862663, 3143282, 2694288, 2414305, 2150456, 1887668]
10335A887668j30900r8707j27220q8805l2314o6687q7805j47103j26533j02234
10325H79360K621L0986j1552j19049j11132j00849r3203O49m3961m3538O0579
10314D50911M355l811n562R0348L7083j7681O1115m9336l2194k8242p5687P1465
10302E02764l0727m1981o0374k6002J0378j7666J9648J1899j8973M953n0490O165
10290C09594l4856N9827P6990n057q4540n8868n25N0821R6089L10L4657n7415
10278C87027j8742J78j022M103n3415l6109q3781J4900O3629l5951n5541L3299
10266B18575K0714J3578L9542m275n1929l526l0550l2362L9676N491K921l1173
10254A86682K4168O793J7620R543p5744q7225j8506K5662N2255J4772K0946N953
$$ y = [1887668, 1756768, 1658061, 1530841, 1442036, 1409722, 1343035, 1255230, 1108127, 981594, 879360, 881981, 912967, 901415, 782366, 671234, 570385, 477182, 477831, 433870, 390332, 450911, 455266, 451455, 445893, 536241, 573324, 555643, 616758, 567422, 535228, 506986, 431299, 502764, 472037, 430056, 369682, 343680, 354058, 336392, 356040, 367939, 348966, 353919, 303429, 309594, 274738, 334565, 411555, 406498, 321958, 263090, 262565, 313386, 409475, 409785, 444442, 387027, 368285, 368463, 367441, 371544, 318129, 282020, 198239, 213139, 276768, 240817, 185276, 218575, 239289, 252867, 292409, 288134, 236205, 232679, 202129, 169767, 209443, 214934, 217855, 186682, 210850, 217643, 235263, 244806, 169062, 81837, 63331, 88993, 141248, 156020, 176966, 182919]
10242A82919J2917l5012j6306P086Q5544r758o50k8781L3981N6270j0511l5439
10230B42260o1327k5777J6141O1309P1120j907o9154N8904j6502q922k0761j6468
10218B28916J0812p1394l3111N0734J9920j2795n0867n3633K6293Q231p043L633
10206A19696r52m1539R655M2535M7403o7786m5917M0239n266j9248O5760L5149
10194A79729m9729m7744p2147J6960J33921O1359j6640k8376q6648j1814m4360
10183C4511L6888J0419j86n857o470J5583m9859m135O7473M7600L0122R908o1122
10170A24875j18085j1290O0245N1093L4985K7763p259k4180J0487L7829k3176
10159A63287j17009M2623M5357p6613j0467K93J9279L770j2463m0767k504Q2037
$$ y = [182919, 195836, 160824, 144518, 151604, 237148, 227390, 226740, 197959, 231940, 288210, 277699, 242260, 180933, 155156, 171297, 232606, 303726, 301819, 232665, 291569, 275067, 266145, 245384, 228916, 239728, 168334, 135223, 185957, 205877, 193082, 142215, 88582, 114875, 123106, 116063, 119696, 118744, 77205, 86860, 129395, 176798, 109012, 63095, 103334, 98068, 78820, 144580, 179729, 130000, 82256, 10109, 27069, 160990, 222349, 205709, 177333, 90685, 78871, 34511, 71399, 81818, 81632, 75775, 69305, 84888, 35029, 30894, 98367, 145967, 176089, 185997, 124875, 6790, -4500, 55745, 106838, 141823, 169586, 162327, 138147, 148634, 186463, 163287, 46278, 88901, 134258, 57645, 47178, 47471, 66750, 70520, 58057, 17290, 14786, 96823]
10147I6823M6299N2592L6514O4208M4139M3249j9539r0938j42376q3351j3417
10136C4203k0230O2375N2017m5572L1682L9652j6997Q002l7790L6416L5979k6163
10124A53574j35668k984j9470J6876L2773j7121J2921O8702K1179J1027M511k9157
10112A17163L1749J1590N6852J5754K37M2510n0680k6394P4753R08O549l1429
10100B49562k5662k2848m9932J6545n584J4468L5102l0583P3749L394L3123P2170
10088C63504M9144k4893j2569l0752q5259k618L9029Q5556J31007K0680K9545
10077E62374Q4717J12260M6671K25622K06258P0944p270m6523J3814J02761K17726
10066A589354M30103L83180N00697P53709J079347J660794K677301M834190R137411
$$ y = [96823, 143122, 195714, 232228, 296436, 340575, 383824, 364285, 273347, 130971, 47620, 34203, 13973, 76348, 128365, 82793, 114475, 154127, 137130, 145132, 107342, 143758, 179737, 153574, 17906, 14922, -4548, 12328, 45101, 27980, 40901, 109603, 130782, 141809, 146320, 117163, 148912, 160502, 217354, 233108, 233345, 275855, 225175, 198781, 273534, 274442, 280991, 249562, 223900, 201052, 151120, 167665, 162081, 176549, 211651, 181068, 254817, 258211, 291334, 363504, 412648, 387755, 375186, 344434, 259175, 256557, 295586, 381142, 512149, 532829, 562374, 647091, 759351, 806022, 1031644, 1237902, 1308846, 1301576, 1255053, 1268867, 1371628, 1589354, 2019457, 2402637, 2903334, 3657043, 4736390, 6397184, 9074485, 13908675, 23046086]
10057B3046086J6465738J8835920N838565j955639j5919912j9278289j0593110
10050A6439359n213451k867320j712594j142541r05644p02297n49432l61565k47698
10041B736817k05265j62583j17224r5172n8003j05632q3875j69676l01367l0088
10031A407932q4595r6626q2358n7172p7949M2301M4083k7750r25l4953j27017
10020I04971r4878k428k5529q3427l7492J2747K9683N1692o549j7032q859o6920
10008F55979p7808L9530N6115M1714p1098q6976n2913P089M8408M8332j8963n3396
9996E36013k6185J5170K4856l0955l1652k366O5735k253k3921p4248M054J4731
9984D68979k0486m7227J4151L4560k6439N232L910N37N6999q80q2576P036m1574
$$ y = [23046086, 39511824, 58347744, 64186309, 62230670, 46310758, 27032469, 16439359, 11225908, 8358588, 6645994, 5503453, 4597809, 3895512, 3346080, 2984515, 2736817, 2531552, 2368969, 2251745, 2156573, 2098570, 1992938, 1909063, 1739387, 1438020, 1407932, 1323337, 1226711, 1144353, 1087181, 1009232, 1051533, 1095616, 1067866, 1066941, 1031988, 904971, 810093, 807665, 782136, 698709, 661217, 673964, 703647, 755339, 748790, 731758, 722899, 655979, 578171, 617701, 673816, 715530, 644432, 557456, 504543, 511632, 560040, 608372, 589409, 536013, 509828, 524998, 549854, 518899, 487247, 484881, 550616, 548363, 524442, 450194, 454248, 468979, 448493, 401266, 415417, 449977, 423538, 428770, 432680, 433217, 490216, 489336, 406760, 413796, 372222]
9971C72222j46330R922L257K9842j3212l6420L3692J1268l6252J9438O2367L2401
9959C42195n8691k5132J1700k304k3624J4242O5296R6506R9937L3025Q6832O1274
9947G01256j4661l2308l0039O2652P3499J786L0949Q7716J1189l4738r1837j25608
9935F39856n6999L9113M7325K5332m482J6939r1451j63030n7048m4346L3516M0357
9923D25082j5897n9734n6673j07896o9977M0566N3107j4586O4103M5925m9980
9912B54040m8264q1268m6334K6802L3513N6375N7313N9445K2823M8144j2121l0739
9900C39729m8311n1563n0263n093j3905m8662K4488j3758l1954K5936O9919j6140
9888A80423L7826j3190L951q57p5040n1535K2122L618J07819p7746j01638m0167
$$ y = [372222, 225892, 235814, 239071, 268913, 255701, 219281, 252973, 264241, 227989, 247427, 309794, 342195, 283504, 258372, 270072, 267768, 244144, 258386, 323682, 420188, 520125, 553150, 639982, 701256, 686595, 654287, 624248, 686900, 760399, 762185, 793134, 880850, 892039, 857301, 765464, 639856, 582857, 621970, 669295, 694627, 690145, 707084, 615633, 452603, 395555, 351209, 384725, 425082, 409185, 349451, 292778, 184882, 114905, 155471, 208578, 193992, 258095, 304020, 254040, 205776, 124508, 78174, 104976, 138489, 194864, 252177, 311622, 334445, 382589, 370468, 339729, 291418, 239855, 189592, 184499, 170594, 121932, 146420, 132662, 100708, 126644, 196563, 180423, 218249, 205059, 209010, 208153, 133113, 81578, 103700, 107318, 215137, 137391, 35753, -4414]
9876d414P3550J19379J8415j7564n1631l3382l4376L0495K2236J1253N3009J0144
9864A97114M8537k0526j8111m7149l581M2546P0608L7192m7957r288p156K8019
9852B70248l6150p8163l3621N801q8942M7289M4753M5816N1307K8147j6379L1021
9840B71127j2571n1216o2343n3250J6761O2480Q633n5987n4528k7657N0057n636
9828H5870P7543n1014n7343k254q266J7053P2737j2247j2700L796p7419N289M3235
9815H4280P3192L4280Q240j6957n9376N8930N3386m3140q6798Q0411J15846l4363
9803B67931q2651j6686P5706R310j1298k308K5770k5147l5307j1841j8867n3699
9791A20913j0022L416n754P3936n793j9269N7171M5164o4191k6347j4665m3792
$$ y = [-4414, 69136, 188515, 206930, 189366, 137735, 104353, 69977, 100472, 122708, 133961, 186970, 197114, 245651, 225125, 207014, 159865, 156284, 198830, 269438, 306630, 258673, 249385, 242229, 270248, 234098, 155935, 122314, 128115, 39173, 86462, 131215, 177031, 228338, 256485, 240106, 271127, 258556, 207340, 144997, 91747, 108508, 170988, 179621, 123634, 69106, 41449, 91506, 85870, 163413, 112399, 55056, 52802, 44536, 61589, 134326, 122079, 109379, 113175, 35756, 41045, 84280, 157472, 191752, 199992, 183035, 123659, 182589, 235975, 192835, 106037, 186448, 302294, 267931, 185280, 168594, 244300, 253610, 242312, 240004, 265774, 240627, 205320, 193479, 174612, 120913, 110891, 114307, 108553, 182489, 176696, 157427, 214598, 259762, 195571, 169224, 154559, 110767]
9779A10767L4136J8622P0110j3282q7891k8331O4246m5049q342k6386K7901Q1249
9767A97750J9465K0904n201M3655N0009L3142j5478r2845k0160j8919O8221j2708
9755B67835l9949p2547l9518P1003J01684o009l4437K071J3353N0331q510j0392
9743B94915K6187k6130p3860k3740O4909N4319m8015k4376J6699r403J5118n2068
9731B14555P181P7926Q107m1385M9703Q948l5258n8980O8666K0074o3230l5423
9719B20884N590K5256j7156L366k8522m9634P9164Q4374k8306p926N8464l1773
9707C13781O920N178J0960K4151J1318m1803j6598n8200M6239L7248r1182N8876
9695C06888R6187j0697O2370O3821J5074J3825J87030K30280J09716Q3435M8026
$$ y = [110767, 144903, 163525, 233635, 220353, 132462, 104131, 168377, 123328, 114986, 88600, 116501, 197750, 217215, 238119, 232918, 276573, 326582, 359724, 344246, 251401, 231241, 212322, 280543, 267835, 227886, 155339, 115821, 186824, 288508, 282499, 248062, 250133, 263486, 313817, 305307, 294915, 321102, 294972, 221112, 197372, 262281, 316600, 268585, 244209, 260908, 251505, 266623, 214555, 221736, 299662, 307769, 266384, 316087, 325035, 289777, 230797, 299463, 319537, 256307, 220884, 226474, 251730, 234574, 237940, 209418, 159784, 238948, 323322, 295016, 287090, 345554, 313781, 320701, 325879, 336839, 360990, 372308, 330505, 313907, 255707, 301946, 339194, 248012, 306888, 403075, 392378, 454748, 518569, 533643, 547468, 734498, 964778, 1074494, 1157929, 1205955]
9684A205955J21039J91864L3641j83865j86479n8115j64495j03165p0143p4211
9674G12026m7282L859m3187R365K194k4850J732P5477K3528m087l8686p3527q1682
9661E14880m1773m3835N0445j8603N9173P7903O9985K3415N0376P616n4573j1352
9649F83657m7256l5312k1961J8266m2798n7818o3121q046J47368L6262j2052l7774
9637E59415n3478n1891k3168N867p42J7263L3456N4088R2872J6569P273n5883
9625F01641n9654j3656O0450j0136R7338Q4700j24053j24527k9588k2005p342
9614D53168J4503K6135J7968j3608L4275j1319m0456k958L4473K7441p3648K2073
9602D88047M6191Q0236Q615l7046l909K1540L0739N1816L0708L4105k5381n6145
$$ y = [1205955, 1326994, 1518858, 1552499, 1368634, 1182155, 1124040, 959545, 856380, 786237, 712026, 664744, 668603, 625416, 634781, 636975, 612125, 613857, 689334, 712862, 708775, 670089, 596562, 514880, 473107, 429272, 479717, 461114, 520287, 598190, 668175, 691590, 741966, 749582, 695009, 683657, 636401, 601089, 579128, 597394, 554596, 496778, 433657, 425611, 572979, 609241, 597189, 559415, 505937, 454046, 430878, 436745, 436003, 453266, 486722, 540810, 633682, 650251, 657524, 601641, 541987, 528331, 588781, 578645, 675983, 760683, 636630, 512103, 482515, 460510, 453168, 467671, 493806, 511774, 498166, 532441, 521122, 480666, 477708, 512181, 539622, 465974, 488047, 534238, 614474, 623089, 586043, 582134, 603674, 634413, 686229, 716937, 751042, 725661, 669516]
9590F69516o3511l3105K1815k9283K1819P2252m47L7858o4941p9167k5078M1699
9578E69427O1509L7864J6720l0639K5015o5374r0197k9824K258M8834l1835q2035
9566D31723j8206J7533K0564K1818O797O632M2978J7198N5682O0256j6609K6898
9554F73264K1268k0296m6038J4954P7546J28930n692m2651j1964m8409o9430L5196
9542G06678J4089k947j9474j19956N1888O1766j5260l5595m7305M0295K3501l8872
9530F18808o4448l119K3997R9500J25294J01253M324p6513k375N8269M6970p310
9518I24650l9817l8402n8784Q8602J52638L8378L9903Q5126N3432J26048N0508
9507A422282P5819P9636J18689K15542K63365L04227K56677J53720r758m7514
$$ y = [669516, 606005, 572900, 594715, 565432, 587251, 659503, 659056, 696914, 631973, 552806, 527728, 569427, 630936, 668800, 685520, 654881, 679896, 614522, 524325, 494501, 496759, 545593, 513758, 431723, 413517, 431050, 451614, 473432, 480229, 486861, 529839, 547037, 602719, 662975, 646366, 673264, 694532, 674236, 628198, 643152, 720698, 849628, 843936, 801285, 789321, 740912, 671482, 706678, 720767, 717820, 698346, 578390, 630278, 692044, 676784, 641189, 593884, 634179, 657680, 618808, 554360, 551241, 575238, 674738, 800032, 901285, 905609, 829096, 826721, 884990, 931960, 924650, 884833, 846431, 787647, 876249, 1028887, 1067265, 1107168, 1192294, 1245726, 1371774, 1422282, 1498101, 1577737, 1696426, 1911968, 2175333, 2479560, 2736237, 2889957, 2880199, 2832685]
9497B832685k19445j27696j70837q0612r313J8496P7957P9747R9024N6391O4744
9486B621141J14645J55518K33776K82172K07727K03635K4171j16081p1281O924
9476C662347J5006l0017r4456J798k6544j27909p6447k69N0268J43914J63981
9465C681672J16284R1742K03930L48735M19803N96940P01108O40152L21191j51881
9455F969676n69278o97850o79815n98094m37270l12021j42000p0637j1890l6093
9445C414728j6999k1398r0984M5458J46922J97269J10502R8906J38629J69191
9435D192224Q4441J4642k790j44090k61711l64663l11988k80935j75598r2436
9425B657096l0455J1705m9958m9080j01752M042O9997J34341J92820J89420N8110
$$ y = [2832685, 2613240, 2485544, 2314707, 2234095, 2224782, 2243278, 2321235, 2400982, 2500006, 2556397, 2621141, 2735786, 2891304, 3125080, 3407252, 3614979, 3818614, 3842785, 3726704, 3655423, 3662347, 3677353, 3647336, 3552880, 3554678, 3528134, 3400225, 3323778, 3323509, 3373777, 3517691, 3681672, 3797956, 3889698, 4093628, 4442363, 4862166, 5459106, 6160214, 6800366, 7121557, 6969676, 6400398, 5702548, 5022733, 4424639, 3987369, 3675348, 3533348, 3462711, 3450821, 3414728, 3397729, 3376331, 3285347, 3330805, 3477727, 3674996, 3785498, 3884404, 4023033, 4192224, 4276665, 4291307, 4288517, 4144427, 3882716, 3518053, 3206065, 2925130, 2749532, 2657096, 2626641, 2638346, 2588388, 2539308, 2437556, 2441598, 2511595, 2645936, 2838756, 3028176, 3086286]
9414C086286j8346j27505k02362k47425k58130j80113j26898j13169o3802p1402
9404A677134n8672k7221k9642o7464L6254P0899j5037p6656J051K5353r298j6337
9392A510364j7146K5800p3898o1068j0563o202k4205j955j3794j66402j05197
9381A055734J13303P7803J8997Q0592n7941L496n216m0047m3644Q635l125l438
9369A205149K2825J6905O0735n2226K6334M2519m2644k5352J8627J6725j7989
9358A271608o3625l7563q7006J2438m0083l7383J2529R2286j3968j11587M9335
9347A046981O6091O1108L7883p924k4473j3460p939k3258j7208l3254N673l017
9335A087203l7843K050J37766M9686k8849J8914O6380j7167j11665o2291J13547
$$ y = [3086286, 3067940, 2940435, 2738073, 2490648, 2232518, 2052405, 1925507, 1812338, 1748536, 1677134, 1618462, 1591241, 1561599, 1494135, 1530389, 1601288, 1586251, 1509595, 1510646, 1535999, 1526701, 1510364, 1493218, 1519018, 1445120, 1384052, 1373489, 1367287, 1343082, 1341127, 1327333, 1160931, 1055734, 1169037, 1246840, 1265837, 1346429, 1288488, 1291984, 1286768, 1246721, 1203077, 1211712, 1208587, 1205149, 1227974, 1244879, 1305614, 1253388, 1279722, 1322241, 1279597, 1254245, 1272872, 1289597, 1271608, 1207983, 1170420, 1083414, 1095852, 1055769, 1018386, 1030915, 1123201, 1109233, 997646, 1046981, 1113072, 1174180, 1212063, 1204139, 1179666, 1166206, 1158267, 1135009, 1117801, 1084547, 1090220, 1087203, 1049360, 1051410, 1189176, 1238862, 1210013, 1228927, 1295307, 1278140, 1166475, 1104184, 1217731]
9324A217731P5531q676q9050N3567J8707l4002M7667N8303R1162O0679M996J21137
9312A617752K08945K90378L67209L64393M00291K61047L5362n6814k24700m05010
9302B858853l94767k40258j40456m0069L2139P8001J25053K66061K22895K35234
9292C002686K88172L47338J30771K6524k7915j42954j20322o1778r2752j38542
9282C211228j28564j7866n385q06Q9804J59865K31560M18018O03058P91922R73781
9271F326615R43800O20123M9534n12889r30337j022738p84505n89190l45376j74056
9261C580981j20593l4714q735K7129k6736L7343J25895K29826J75981J45247O4537
9250D196161j2390J5835j561k51522l37828l55436k36591j72632j21399P028m5407
$$ y = [1217731, 1293262, 1284586, 1195536, 1249103, 1267810, 1233808, 1281475, 1339778, 1430940, 1491619, 1496615, 1617752, 1826697, 2117075, 2484284, 2848677, 3248968, 3510015, 3545377, 3488563, 3263863, 2858853, 2464086, 2223828, 2083372, 2043303, 2075442, 2153443, 2278496, 2544557, 2767452, 3002686, 3290858, 3638196, 3768967, 3795491, 3767576, 3624622, 3504300, 3442522, 3349770, 3211228, 3082664, 3064798, 3059413, 3058607, 3148411, 3308276, 3539836, 3957854, 4560912, 5352834, 6326615, 7270415, 7890538, 7940072, 7427183, 6496846, 5474108, 4689603, 4100413, 3755037, 3580981, 3460388, 3425674, 3416939, 3444068, 3417332, 3454675, 3580570, 3810396, 3986377, 4131624, 4196161, 4183771, 4199606, 4198045, 3946523, 3608695, 3253259, 3016668, 2844036, 2722637, 2729665, 2684258]
9239B684258Q1037J24486K29361K95345L33711L91361K42378j4920l05806l41872
$$ y = [2684258, 2765295, 2889781, 3119142, 3414487, 3748198, 4139559, 4381937, 4367017, 4061211, 3719339]
$$ [...]
##END NTUPLES=NMR SPECTRUM
##END=
