##TITLE=Analysis number 322964
Compound Code cc 63901
Book Reference 439/191/32
Project Code adrs
Chemist Name ronp
##JCAMPDX= 6.0         $$ Bruker NMR JCAMP-DX V2.0
##DATA TYPE= NMR SPECTRUM
##DATA CLASS= NTUPLES
##ORIGIN= Bruker BioSpin GmbH
##OWNER= nmr
$$ XWIN-NMR		Version 3.5
$$ Mon Oct 16 18:35:59 2006 GMT Daylight Time (UT+1h)  MAYBRIDGE\nmr@NMR_250MHZ
##.OBSERVE FREQUENCY= 250.131544655141
##.OBSERVE NUCLEUS= ^1H
##.ACQUISITION MODE= SIMULTANEOUS (DQD)
##.ACQUISITION SCHEME= undefined
##.AVERAGES= 16
##.DIGITISER RES= 18
##SPECTROMETER/DATA SYSTEM= dpx250
##.PULSE SEQUENCE= zg30
##.SOLVENT NAME= DMSO
##.SHIFT REFERENCE= (INTERNAL, DMSO, 0, 16.522)
##AUDIT TRAIL= $$ (NUMBER, WHEN, WHO, WHERE, WHAT)
$$ ##TITLE= Audit trail, XWIN-NMR		Version 3.5
$$ ##JCAMPDX= 5.01
$$ ##ORIGIN= Bruker BioSpin GmbH
$$ ##OWNER= nmr
$$ C:\u/data/dgb/nmr/ADRS/520/pdata/1/auditp.txt
$$ ##AUDIT TRAIL=  $$ (NUMBER, WHEN, WHO, WHERE, WHAT)
(   1,<2006-10-16 18:35:37.28 +100>,<MAYBRIDGE\nmr>,<NMR_250MHZ>,
      <created by zg, POWCHK disabled, PULCHK disabled
       configuration hash MD5:
       49 4B E0 1D 92 C2 6B 37 9F E6 65 BC 52 41 86 1D
       data hash MD5: 64K
       F0 C1 48 27 95 02 DC CD 41 4F 4E 67 D5 11 F9 AA>)
(   2,<2006-10-16 18:35:50.61 +100>,<MAYBRIDGE\nmr>,<NMR_250MHZ>,
      <Start of raw data processing
       ef LB = 0.3 FT_mod = 6 PKNL = 1 SI = 32K 
       data hash MD5: 32K
       6C 7E 37 FA BF 3C 86 55 A8 74 D3 D1 82 F1 B3 12>)
(   3,<2006-10-16 18:35:52.22 +100>,<MAYBRIDGE\nmr>,<NMR_250MHZ>,
      <apk 
       data hash MD5: 32K
       01 EB C6 2D 90 AB E3 BD A6 81 7B E9 E4 00 F2 37>)
(   4,<2006-10-16 18:35:52.99 +100>,<MAYBRIDGE\nmr>,<NMR_250MHZ>,
      <abs ABSG = 5 
       data hash MD5: 32K
       BF 7F CD 9D 7B A8 D4 24 EB 6D B6 68 1E 9F 83 38>)
$$ ##END=
$$ 
$$ hash MD5
$$ CF 41 99 7C 33 D7 20 85 6C 73 76 3E 5E EE B9 73
##$RELAX= 
##$RELAX= 
##$RELAX= 
##$RELAX= 
##$RELAX= 
##$RELAX= 
##$RELAX= 
$$ Bruker specific parameters
$$ --------------------------
##$DU= <C:\u>
##$EXPNO= 520
##$NAME= <ADRS>
##$PROCNO= 1
##$TYPE= <nmr>
##$USER= <dgb>
##$AMP= (0..31)
100 100 100 100 100 100 100 100 100 100 100 100 100 100 100 100 100 100 
100 100 100 100 100 100 100 100 100 100 100 100 100 100 
##$AQSEQ= 0
##$AQ_mod= 3
##$AUNM= <au_zg>
##$AUTOPOS= <33 >
##$BF1= 250.13
##$BF2= 250.13
##$BF3= 250.13
##$BF4= 250.13
##$BF5= 500.13
##$BF6= 500.13
##$BF7= 500.13
##$BF8= 500.13
##$BYTORDA= 1
##$CFDGTYP= 0
##$CFRGTYP= 5
##$CHEMSTR= <none>
##$CNST= (0..31)
1 1 145 1 1 1 1 1 1 1 1 1 1 1 1 1 1 1 1 1 1 1 1 1 1 1 1 1 1 1 1 1 
##$CPDPRG= <>
##$CPDPRG1= <>
##$CPDPRG2= <>
##$CPDPRG3= <>
##$CPDPRG4= <mlev>
##$CPDPRG5= <mlev>
##$CPDPRG6= <mlev>
##$CPDPRG7= <mlev>
##$CPDPRG8= <mlev>
##$CPDPRGB= <>
##$CPDPRGT= <>
##$D= (0..31)
0 1 0 0 0 0 0 0 0 0.06 0 0 0 0 0 0 0.0002 0 0 0 0 0 0 0 0 0 0 0 0 0 0 
0 
##$DATE= 1161020136
##$DBL= (0..7)
120 120 120 120 120 120 120 120 
##$DBP= (0..7)
150 150 150 150 150 150 150 150 
##$DBP07= 0
##$DBPNAM0= <>
##$DBPNAM1= <>
$$ [...]
##$SUBNAM7= <"">
##$SUBNAM8= <"">
##$SUBNAM9= <"">
##$SW= 20.6930455092707
##$SWIBOX= (0..15)
0 0 3 0 0 0 0 0 0 0 0 0 0 0 0 0 
##$SW_h= 5175.983436853
##$TD= 65536
##$TD0= 1
##$TE= 683.16
##$TE2= 300
##$TE3= 300
##$TEG= 300
##$TL= (0..7)
0 120 120 120 120 120 120 120 
##$TP= (0..7)
150 150 150 150 150 150 150 150 
##$TP07= 0
##$TPNAME0= <>
##$TPNAME1= <>
##$TPNAME2= <>
##$TPNAME3= <>
##$TPNAME4= <>
##$TPNAME5= <>
##$TPNAME6= <>
##$TPNAME7= <>
##$TPOAL= (0..7)
0.5 0.5 0.5 0.5 0.5 0.5 0.5 0.5 
##$TPOFFS= (0..7)
0 0 0 0 0 0 0 0 
##$TUNHIN= 0
##$TUNHOUT= 0
##$TUNXOUT= 0
##$USERA1= <user>
##$USERA2= <user>
##$USERA3= <user>
##$USERA4= <user>
##$USERA5= <user>
##$V9= 5
##$VALIST= <valist>
##$VCLIST= <CCCCCCCCCCCCCCC>
##$VD= 0
##$VDLIST= <DDDDDDDDDDDDDDD>
##$VPLIST= <PPPPPPPPPPPPPPP>
##$VTLIST= <TTTTTTTTTTTTTTT>
##$WBST= 1024
##$WBSW= 4
##$XGAIN= (0..3)
0 0 0 0 
##$XL= 0
##$YL= 0
##$YMAX_a= 308880
##$YMIN_a= -369013
##$ZGOPTNS= <>
##$ZL1= 120
##$ZL2= 120
##$ZL3= 120
##$ZL4= 120
##$ABSF1= 16.522
##$ABSF2= -4.171173
##$ABSG= 5
##$ABSL= 3
##$ALPHA= 0
##$AQORDER= 0
##$ASSFAC= 0
##$ASSFACI= 0
##$ASSFACX= 0
##$ASSWID= 0
##$AUNMP= <proc_1d>
##$AZFE= 0.1
##$AZFW= 0.1
##$BCFW= 0
##$BC_mod= 0
##$BYTORDP= 0
##$COROFFS= 0
##$CY= 12.5
##$DATMOD= 1
##$DC= 0
##$DFILT= <>
##$DTYPP= 0
##$F1P= 14.0000005364418
##$F2P= -0.99999901652339
##$FCOR= 0.5
##$FTSIZE= 32768
##$FT_mod= 6
##$GAMMA= 0
##$GB= 0
##$INTBC= 1
##$INTSCL= 1
##$ISEN= 128
##$LB= 0.3
##$LEV0= 0
##$LPBIN= 0
##$MAXI= 10000
##$MC2= 0
##$MEAN= 0
##$ME_mod= 0
##$MI= 0
##$NCOEF= 0
##$NC_proc= -3
##$NLEV= 6
##$NOISF1= 0
##$NOISF2= 0
##$NSP= 0
##$NTH_PI= 0
##$NZP= 0
##$OFFSET= 16.522
##$PC= 1
##$PHC0= -51.54482
##$PHC1= 8.128845
##$PH_mod= 1
##$PKNL= yes
##$PPARMOD= 0
##$PSCAL= 4
##$PSIGN= 0
##$REVERSE= no
##$SF= 250.13
##$SI= 32768
##$SIGF1= 0
##$SIGF2= 0
##$SINO= 400
##$SIOLD= 32768
##$SREGLST= <1H.DMSO>
##$SSB= 0
##$STSI= 32768
##$STSR= 0
##$SW_p= 5175.98343685301
##$SYMM= 0
##$S_DEV= 0
##$TDeff= 65536
##$TDoff= 0
##$TI= <Analysis number 999999
Compound Code 99
Book Reference 9
Project Code 9>
##$TILT= no
##$TM1= 0
##$TM2= 0
##$TOPLEV= 0
##$USERP1= <user>
##$USERP2= <user>
##$USERP3= <user>
##$USERP4= <user>
##$USERP5= <user>
##$WDW= 1
##$XDIM= 32768
##$YMAX_p= 394532915
##$YMIN_p= -307210
$$ End of Bruker specific parameters
$$ ---------------------------------
##NTUPLES= NMR SPECTRUM
##VAR_NAME=  FREQUENCY,     SPECTRUM/REAL,   SPECTRUM/IMAG
##SYMBOL=    X,             R,               I
##VAR_TYPE=  INDEPENDENT,   DEPENDENT,       DEPENDENT
##VAR_FORM=  AFFN,          ASDF,            ASDF
##VAR_DIM=   32768,         32768,           32768
##UNITS=     HZ,            ARBITRARY UNITS, ARBITRARY UNITS
##FACTOR=    0.157963299565203, 1,           1
##FIRST=     4132.6476996994, 0,             0
##LAST=      -1043.33573715361, 0,           0
##MIN=       -1043.33573715361, -307210,     0
##MAX=       4132.6476996994, 394532915,     0
$$ Real data points
##PAGE= N=1
##DATA TABLE= (X++(R..R)), XYDATA
$$ [...]
22674 75973 46621 24881 -48718 -88380 -45914 32520 7428 51931 95958 139667 109685 135481
22662 135481 51808 8186 61100 13850 35629 -32249 49341 122783 154163 187346 93661
22651 93661 -77040 -130043 -12679 -16935 -44127 -132005 -218224 -154259 -83441 -23816 39459
22640 39459 56139 42818 5127 35805 87194 49426 -35573 -62878 -42471 35062 -16218 -52148
22628 -52148 -1493 35867 14676 -17226 49609 73827 25221 60639 45274 -18638 -2579 64578
22616 64578 58353 70032 22183 18452 87613 138201 84756 90619 75588 -34126 -36748 88754
22604 88754 128546 56186 -134116 -191203 -153965 -124175 -85030 -72741 23853 27 50639
22593 50639 90264 126682 132292 74571 65193 -38459 -46738 11833 13773 -96034 -80057 -31240
22581 -31240 52801 63822 7030 2586 -30128 -91032 -64605 -56498 -26948 -64089 -113565 -36356
22569 -36356 95624 152702 79855 -18123 -64292 -104063 -61051 26799 59512 58702 96475 93637
22557 93637 16717 4080 28308 38392 63264 76909 26316 -69627 -1487 -32220 -19530 14176
22545 14176 -34078 -70567 -5524 94236 109712 70882 3609 55129 -20800 -25594 31788 19115
22533 19115 -59506 -49066 -18327 -123228 -67275 -12227 43129 30036 38209 20618 -45513 -26056
22521 -26056 -40159 7565 -4703 -33446 -112747 -155428 -159823 -125148 -112578 -182587 -213030 -160551
22509 -160551 -85163 -7611 81219 82379 48607 -13801 -76187 -59883 -104921 -71538 -101850 -77714
22497 -77714 -136407 -32193 43266 64255 31969 50761 14886 -45389 -36053 -79277 -101504 -116750
22485 -116750 -81629 21311 105500 148240 76009 38836 -54182 -43027 -63059 -85526 -50324
22474 -50324 6283 64981 136027 151044 73873 80167 53709 50854 8684 -40091 -25503 -69915
22462 -69915 -95167 -75142 -82674 -68092 -41663 -19750 43353 -12257 30129 114750 144644 43417
22450 43417 -48898 -96605 -35821 3510 14235 -32340 -57008 -52019 -108954 -121307 -171847 -191563
22438 -191563 -124751 6827 90320 35213 27251 95764 -5399 48005 87441 -11030 -33537
22427 -33537 34850 134118 75573 -69682 -161229 -173502 -136842 -192014 -216851 -165948 -133592
22416 -133592 -93250 -96780 -119772 -68613 71195 74917 60883 67722 3306 63073 85617 -43634
22404 -43634 -122016 -104778 -102704 -55954 -34584 -19574 37701 118987 132148 87201 59371 43116
22392 43116 -48784 -29859 -74910 -66122 -40535 -25143 48481 -5759 -132982 -156969 -76326 23782
22380 23782 89628 20725 -26213 20095 20667 -35716 -61012 -61952 5487 -51497 -23785 -49690
22368 -49690 -22816 47637 43690 -84663 -87900 -37711 -71790 -31067 -64905 -42539 41227 -28770
22356 -28770 -51009 -13888 -58481 -89588 -96546 -39798 -49634 -20446 -35286 -84583 -69307 -13794
22344 -13794 9592 -6041 30142 48745 43929 61780 -10846 -164655 -255692 -197744 -68598
22333 -68598 33697 63418 52421 -26425 -36119 -84571 -131334 -143609 -63029 20291 28885 -28982
22321 -28982 -100362 -98710 -39607 -40243 -47237 -104172 -20750 60206 56194 10385 23489 93978 47505
22308 47505 -22965 -85522 -81010 -22860 54566 -18619 -46872 -61163 -5104 -14092 -76092 -117125
22296 -117125 -90621 -53483 55026 88996 -10890 -64580 -38433 1898 -51824 -147964 -179299
22285 -179299 -91561 25588 42313 34593 -34990 -184302 -246825 -182485 -33969 50201 37560
22274 37560 53334 46070 84629 104597 96115 101662 -4908 -41514 -63339 -56455 2770 43375
22262 43375 54712 22949 5424 84908 130648 77122 45028 -75892 -86213 -129977 -181250
22251 -181250 -126165 10826 66225 85776 81430 109034 50629 33687 108845 38913 26583
22240 26583 -72496 -61383 -3833 -61964 -85883 -76949 -115933 -113408 -87478 -71254 -34890 -15737
22228 -15737 -3611 56015 74878 55307 12355 -16261 -9989 -7551 32364 53549 -5000 -40133
22216 -40133 55502 66751 10956 -7963 29079 49816 43790 28316 16460 -49938 -88506 -6174
22204 -6174 73137 108367 61541 105761 108803 99154 79131 70933 9198 -31154 -9406 17849
22192 17849 59976 92102 69230 45893 4855 -16964 13646 19201 -38238 -123447 -103598 -68598
22180 -68598 -86245 -72740 -1598 -16548 4303 -28526 -89858 -103504 -84893 25868 31951 40013
22168 40013 9127 -46358 -80807 -31799 34829 36829 32662 45468 38136 -32115 -55207 -63771
22156 -63771 -57979 -61661 -130586 -95067 -78327 238 3259 -52645 1021 90080 98885 64320
22144 64320 -28141 -47154 -18251 -5812 -49722 -30529 -2782 49093 -10589 -29594 104 -51874
22132 -51874 -65476 6988 42096 57461 51676 -31687 -54280 -34798 -70545 -10850 78540 111582
22120 111582 139764 113005 51596 41513 -14266 -77078 -115148 -83068 -67270 -112886 -117028 -100701
22108 -100701 -20127 24361 42778 -2421 -27678 -51091 6770 17213 -18204 48277 126204
22097 126204 104260 56221 27398 16710 15163 44908 46640 154441 107731 36293 -12371 38056
22085 38056 60930 20697 -2325 125240 80453 100943 163132 124997 138941 88006 17907
22074 17907 78346 45100 -18497 -69646 -55644 12655 8525 32566 93835 115447 67953 41070
22062 41070 53425 115609 108225 94034 70460 29362 -17521 3756 34013 47428 67665 19987
22050 19987 -68841 -164002 -92933 -85197 -47488 -62176 -77686 34438 121606 101963 79708 21467
22038 21467 -14788 84795 131176 92939 -7146 46574 80360 -41970 -99078 -114163 25754
22027 25754 54187 30409 612 -46581 -36677 88138 98310 116331 101835 21688 15772 31633
22015 31633 -18703 1057 134465 108769 54275 76568 62965 36457 37655 45322 51721 48058
22003 48058 -34230 -61972 -19805 19870 21992 -1438 -4142 52524 46496 37411 42336 54331 -61681
21990 -61681 -117354 -1101 -48451 -81497 -58245 -40654 52906 83816 53701 55638 88719 21249
21978 21249 -83020 -72927 -22931 -18595 -47183 -50664 23695 -15218 -93604 -88587 24228 -25817
21966 -25817 -51862 -52491 -26108 -12036 -30458 23312 164145 155223 182939 218458 185909 178968
21954 178968 96346 69395 49242 -9546 -15283 31136 37540 101575 89394 84863 96650 14294
21942 14294 21830 85013 79866 73303 93468 57476 32595 39994 41713 33198 -19675 -43933 -53270
21929 -53270 -42845 11949 -47418 -99282 -56241 -71853 -59842 -51015 12698 -68904 -95460 -34392
21917 -34392 -46797 -134242 -103812 24297 27346 -53368 -90073 -41929 82238 40093 -36214
21906 -36214 -49545 -43097 -56120 -72002 -40731 -30014 -57332 -98851 -66102 -49739 -180279 -181584
21894 -181584 -104120 20000 65577 44524 33852 24809 58353 164822 103390 6714 -101328
21883 -101328 -158812 -129852 -163522 -188727 -206569 -183126 -105850 -57064 -94904 -169293 -184669
21872 -184669 -126382 -53840 39355 -14767 -69166 -78275 -8413 -34847 -42283 28934 5292 10428
21860 10428 17642 44212 48982 82342 747 -46304 -37972 34031 5939 -76419 -135680 -80463
21848 -80463 -65238 -44258 47163 49193 -86813 -73033 -69869 -31864 -51878 -155017 -96868 14912
21836 14912 40964 -46496 -56635 -91664 -148114 -168425 -99044 3827 -2396 -5725 16731 47742
21824 47742 25428 -21813 36587 12800 -76052 -134802 -65403 2468 -85820 -133359 -100801 -54738
21812 -54738 -13738 39803 42858 -36429 -8515 37429 -9193 -25822 41671 97029 66266 -2238
21800 -2238 22351 77126 72906 26072 84523 112293 74080 18815 -18839 -82388 -90094 -40135
21788 -40135 31103 1330 -44711 -37547 -87199 -113150 -86068 -52570 -39364 -82726 -158456 -161573
21776 -161573 -89681 -29511 -32828 -72069 -93113 -82171 -67433 -61544 -92732 16433 55801 -12508
21764 -12508 -110266 -94371 -42117 -45008 -73302 -29937 53582 90903 60111 66323 56841 17968
21752 17968 -39299 -37682 -20525 9985 16909 -59227 -44261 -100038 -103162 -131472 -159106 -98274
21740 -98274 -85287 -63466 -19036 77078 57585 -4373 46965 48743 58232 -42792 -109213 -99991
21728 -99991 -5075 49699 139129 115064 1371 -1644 -15237 -19359 -43718 -51191 -72085 -523
21716 -523 31029 21258 -17919 -11770 -26835 34479 88964 85504 25993 -117410 -147928 -73282
21704 -73282 52472 78837 45560 -77304 -86063 -23389 -3482 25743 13776 -1855 18946
21693 18946 58840 109974 139281 69925 40313 56025 50818 86380 109185 59831 104031 108568
21681 108568 110968 -51877 -218204 -179680 -103665 -45824 -55868 -118072 -93350 -92496 -81990 -142344
21669 -142344 -118424 -150366 -134467 -128113 -126107 -117440 -50940 -105937 -86551 -16245 -38801 -36327
21657 -36327 -82204 -63667 -92298 -114831 -89501 -68074 -21016 65441 61137 48410 59281 56517
21645 56517 93745 60209 405 80188 59145 -14315 -25972 26694 36579 -5353 18673 64391
21633 64391 67312 7810 -14026 -66155 -29115 -12423 2691 -33198 -128058 -167841 -210929 -74614
21621 -74614 55479 69349 -14381 -108505 -132508 -210265 -170833 -166716 -57803 -34517 -101626
21610 -101626 -122617 -160062 -122194 -102449 -88923 -64217 -76850 -103525 -24527 -48697 -32912
21599 -32912 -62441 -160312 -180204 -143278 -86397 -64078 -102238 -28374 12860 45391 93616 195241
21587 195241 221641 124641 12059 20385 72751 123302 63928 62564 98048 44828 7909 -11330
21575 -11330 22450 -40580 -89565 -109488 -114295 -61665 -26107 -104950 -141934 -113480 -70336 -116164
21563 -116164 -9104 85206 98226 18384 -107465 -193243 -146143 -99836 -93526 -76235 -38150
21552 -38150 22769 20392 -25281 -2790 109131 15872 -87436 -77874 -64081 -7417 -28811 -114794
21540 -114794 -97978 -29337 49166 -1378 -72796 -18719 4001 43150 -1744 -23825 -16436 34738
21528 34738 188309 206053 133298 85236 59426 -47260 -61214 19864 108635 54861 20081
21517 20081 44351 60418 5397 -108894 -141373 -92295 -24066 -6650 38856 19746 -49500
21506 -49500 -3676 -52145 -91626 -79510 -25813 361 -3410 -92450 -113082 -132469 -54642 11728
21494 11728 -70894 -20161 75680 108968 58624 -87426 -179003 -102637 51714 3586 -7994
21483 -7994 7684 31032 86267 67980 -2029 -8356 -26304 14730 68773 128505 99798 -16826
21471 -16826 -30524 -47130 -53823 -46715 -68169 -77279 14512 29988 -22275 -45202 61189 90084
21459 90084 164539 114737 61126 -27783 -73187 -79174 -94858 -96168 -70630 -46297 70427 107168
21447 107168 64232 51515 49579 -30895 -129330 -154186 -125251 -46914 6327 -23883 -16075 -23127
21435 -23127 -45179 -5215 -51125 -78133 -49325 -79286 -78902 -84273 -106442 -103734 -18242 86811
21423 86811 87143 3056 -99453 -70830 -4161 -21560 -13139 12932 -39837 -23361 -14766 -23707
21411 -23707 -36539 -14293 -22644 -93064 -104234 -85766 -34801 -12564 148 -52648 -53285 -118888
21399 -118888 -125494 -112180 -88008 -122649 -76763 -45869 -7769 2673 -9902 -24530 -109197 -109144
21387 -109144 -104619 -57034 -117437 -225728 -192000 -85460 55840 104950 9165 9053 -36527
21376 -36527 -68508 -28408 -61402 -36074 -31962 -136767 -182387 -156495 -113109 -41819 72913
21365 72913 76399 51666 88735 118943 197893 115803 32627 -37109 -68146 -19571 -67251 -81148
21353 -81148 -30208 -46993 -58043 -47059 -72831 -5339 4176 -36734 -54339 -129442 -55717 -100920
21341 -100920 -131729 -106395 -2890 50877 12161 15525 72914 7344 -36433 -37632 -111088 -112900
21329 -112900 -89665 -89845 -81521 -42398 2144 28661 20063 -10202 -43735 -17106 -2668 49789
21317 49789 15984 79651 123714 152330 83214 79996 102778 61951 17203 20385 46980 -43472
21305 -43472 -76014 -90855 -44842 -29649 -18999 -45396 -65931 -13994 3134 -6 5907 -16923
21293 -16923 -85465 -35739 35028 -18077 -69057 -52311 -61057 -42368 -42541 58453 122059 111964
21281 111964 51800 78694 97738 122140 72831 77061 79822 33193 -73547 -56145 58588
21270 58588 56401 17910 -25677 -105307 -53034 -85390 -47900 -64991 -89318 22402 107357 122887
21258 122887 107591 54647 70864 106136 27794 66122 120195 100137 14148 -45628 -38042 37904
21246 37904 53956 40972 37475 -35694 -44822 -46565 -31358 -60572 -142414 -112442 -99393 -89297
21234 -89297 -89336 -58175 -59521 -13617 32632 10129 18160 -49905 -52069 -20994 -17478 74641 104276
21221 104276 -24580 -116839 -58433 58425 1999 6737 13449 15353 29527 -11487 -63440 -5567
21209 -5567 94832 81452 10066 -13797 11625 16297 44654 152693 118203 34129 66625 155591
21197 155591 82372 63101 22303 -14103 -79209 -34186 29770 40163 42258 -30990 -47386 18152
21185 18152 121867 159554 188822 61118 -30073 -48217 -80305 -69242 -13025 -6626 51385
21174 51385 54451 42639 43103 3561 53994 2237 28539 73833 37357 -7197 33324 -18222
21162 -18222 -103283 -117363 -13405 72436 43328 38704 54959 85697 100162 172488 145757 118161
21150 118161 69108 21228 53052 54010 -54229 -146639 -58889 -65109 -11993 12059 -7641 -130029
21138 -130029 -136830 -122966 -137895 -198679 -223695 -181071 -91218 -41482 -111326 -103426 -46854 13867
21126 13867 5995 31546 50615 10609 -52866 -24579 11034 31051 9360 21033 -7462 -21776
21114 -21776 -6756 -57073 -61857 -68639 -86759 -11806 -10068 -54617 -75383 -98647 -103083 -122081
21102 -122081 -107495 -144838 -175189 -64893 -109542 -86385 -23939 -52185 24934 56793 90408
21091 90408 80315 50662 -33892 -74443 -18657 38531 101376 104432 97515 21035 9635 -58136
21079 -58136 -58158 -98277 -43414 -152 -50164 -69522 -104282 -175688 -89159 21126 -68940 -34638
21067 -34638 -38518 -34852 -57697 8669 -7540 -56887 -111647 -110301 -37101 54146 73333 48008
21055 48008 43904 71592 26639 -17686 -24396 -65850 50921 144206 162329 74065 5628 -56332
21043 -56332 -171525 -148113 -83889 -55001 4883 15118 -56953 -94118 -85789 -89086 -94610 -84751
21031 -84751 -73799 -8581 47161 9834 -49246 40332 69049 109066 169626 114117 73291 80218
21019 80218 44531 -700 -53410 -59083 -61423 -41595 -84732 -65429 -76954 -12889 15470 87156
21007 87156 90431 95564 98916 93933 45766 -7299 -61 15710 -4211 -15148 -52174 -79835 -34858
20994 -34858 -32993 -29286 -83404 -1735 14027 -34251 -94156 15957 137879 149784 129031 103984
20982 103984 89553 62484 40095 37543 43035 41060 -84030 -86648 -111478 -101134 -68446 62653
20970 62653 56884 33060 15846 25257 49714 -22157 -85528 22 -1776 -59481 -54075 -44484 -66647
20957 -66647 -60462 40014 32987 33366 15652 -34700 -99340 -90796 -79855 -43213 -26218 11415
20945 11415 28025 6041 46955 95791 35530 34768 -44373 -118220 -59827 -56696 1335 79950
20933 79950 105581 150847 101871 53914 55457 -24432 -41754 27669 14886 26314 71390 10610
20921 10610 -38547 -1876 -105011 -111691 -23608 6183 31807 9800 -118332 -280642 -234890
20910 -234890 -86407 -16308 24403 31021 18671 32025 36306 -9414 -111418 -40897 -53633
20899 -53633 -61960 -54192 21629 31783 -1705 -8047 -4778 -37870 -59572 19568 -11712 -10946 -35915
20886 -35915 -62223 -82190 -131626 -158733 -79404 -64543 -115645 -219059 -256702 -176344 -100290
20875 -100290 -126050 -50536 48942 71726 70532 -28794 -63986 -26878 -44418 -75846 -114342 -30335
20863 -30335 38667 43273 26453 -53584 -57448 40596 72534 -9149 -20029 51244 -36226 -41596
20851 -41596 -65485 -68799 -44571 2176 -20564 -39312 16579 -25143 -62041 -83543 -84637 -43919
20839 -43919 -17453 -49806 -63673 -73420 -110674 -88908 -71044 -42683 -74724 -80506 -88185 -57920
20827 -57920 -12772 26853 38445 74864 82955 40340 13287 -64784 -137110 -99043 -20126 -11340
20815 -11340 -33374 -94941 -98279 -94674 -25582 30440 56987 17327 -21072 -1557 -39922 -64589
20803 -64589 -10002 31580 -106105 -201067 -173789 -165512 -134251 -80048 -70493 137 49719 10498
20791 10498 -3280 35909 113270 123525 37699 -5520 -28233 -10978 -32125 -44123 -111516 -98574
20779 -98574 -755 -78692 -163756 -150734 -166611 -130481 12554 63850 17251 17831 -14966 -113087
20767 -113087 -192301 -154199 -132790 -40 26083 -14394 -10916 -124313 -133873 -94664 -24666
20756 -24666 41914 60443 20339 61005 89710 65060 10652 6555 112800 90917 -3655 -36391
20744 -36391 -62820 -27270 -26871 22842 80044 119763 156405 106132 127980 124630 116600 62302
20732 62302 81565 42795 52665 42561 -10540 42922 99774 12501 -10782 103171 208888
20721 208888 207689 146696 92612 11004 27744 -10245 2659 -6833 -64748 -51668 8084 25268
20709 25268 -9151 -15813 10731 63531 -4531 -1335 49632 64038 51120 20339 41409 -17614
20697 -17614 -36061 -57092 -27055 74068 126155 134743 54339 -31278 -86254 -74891 -101211 -145489
20685 -145489 -156780 -111437 -83845 -8108 20794 -17502 -29244 -329 16136 4 18087
20674 18087 -37777 -108371 -140529 -86399 10294 -23659 -18491 66592 20164 7705 53125 65612
20662 65612 26411 -25670 -86837 -2760 29736 967 18554 17007 -35856 -52748 -7720 4632
20650 4632 24198 29351 -38766 -80388 -54531 30367 37908 24051 -60584 -102060 3526 -41646
20638 -41646 -121725 14488 72585 -36598 -31110 -14185 -16268 21361 4295 -10616 26959 79772
20626 79772 48453 31057 -17803 -106604 -95718 -81677 -117343 -101824 -90395 -168315 -173286 -136680
20614 -136680 -135318 -108830 -7713 5211 5254 17982 53293 130958 198043 288705 265968 177704
20602 177704 170049 132333 80349 18515 12407 -29828 -52932 7356 -4570 -86392 -87126 -144524
20590 -144524 -169902 -126914 -180660 -136378 -41326 -40336 23709 38903 -5123 -90339 -91770 6968
20578 6968 88242 99911 143222 157378 116920 87688 772 -71483 -7253 -14408 8754 -35173
20566 -35173 -72871 -117217 -53424 -21904 -26953 67253 88123 8693 -60532 -45753 -89439 -117471
20554 -117471 -177979 -150322 -152700 -30120 -6967 20412 44179 85087 65096 63889 111547 112554
20542 112554 87805 92639 75893 -14908 -40489 -66885 -47852 -40906 -121337 -168055 -165054 -163736
20530 -163736 -139731 -174257 -205979 -163160 -83152 -115558 -134812 -107899 -114795 -196475 -119754 1283
20518 1283 77491 102377 21501 97885 116077 97631 81571 -88075 -96480 27087 75645 90567
20506 90567 66182 65798 64591 12987 -53531 1856 48934 43811 -40735 -69837 -3479 47165
20494 47165 58324 92591 39772 -86735 -142123 -111222 -34921 -47894 -22340 -38928 -149701
20483 -149701 -96675 -34156 -26092 646 3845 24875 31595 -91597 -116409 -36738 -75741 -125939
20471 -125939 -37766 -21856 -31763 12539 70908 39531 -48117 -109396 -128191 -48617 -80663 -87570
20459 -87570 -3315 -12533 -28984 -74116 -69935 -20558 53660 146430 141501 55279 57555 60709 15139
20446 15139 -27099 -34802 -24398 38986 -34322 -114031 -129703 -89066 -22365 -2575 -90968 -36228
20434 -36228 13431 116248 100664 69048 114976 110286 54817 58660 5481 -63262 -64634 -124366
20422 -124366 -108511 -55589 -4494 -18270 -81767 -100115 -121261 -72475 -70503 -104693 -136970 -194473
20410 -194473 -183523 -162455 -104724 -145988 -132016 -26172 -3014 -703 31811 136840 186068
20399 186068 102860 39567 -82571 -147624 -141216 -39890 17003 76803 62028 73891 61483
20388 61483 19665 -33295 13386 82029 64519 34090 -107749 -158222 -109044 -93037 -67770
20377 -67770 -29619 -23826 -4019 3673 84154 108528 44558 46073 81130 64619 11943 -27679
20365 -27679 -78315 -97721 -93300 -66943 18533 102971 29871 -56411 -57879 7488 12321 -28922
20353 -28922 25006 123236 115606 136675 72250 34430 83717 35923 25962 4840 -88023 -12520
20341 -12520 697 -51190 -69419 -66759 -14754 1156 8461 14282 -9795 -67786 -125509 -85879
20329 -85879 7884 22579 -68802 -111533 -106184 -125981 -138568 -168409 -123984 1958 -3239 -88807
20317 -88807 -12191 35151 -31578 -83053 -62628 -50824 -87043 -34663 30758 92741 76792 -20275
20305 -20275 -99639 -68925 -24115 2614 60180 69748 8348 -45496 -22930 28272 61557 23944
20293 23944 -24371 58994 96553 97994 111506 121478 55831 50414 53404 14870 -67636 -76370 -28622
20280 -28622 -17081 101373 -25310 -152865 -199601 -217948 -205229 -150853 -47328 15892 -25926
20269 -25926 -69298 -103290 -73111 -54679 -60437 -170285 -170805 -128424 -668 -1061 10646 -16430
20257 -16430 -23950 21894 -14948 -20807 1299 10643 -10718 -56958 -89574 -77352 35575 99354
20245 99354 101161 153752 59218 -3948 4026 8605 -17731 -25114 -50325 -133024 -84247 15606
20233 15606 18642 -13876 36698 123770 88584 19894 55767 89304 155551 180548 192731 163989
20221 163989 152369 132245 -2716 -92547 -94174 -44167 -4633 31464 101655 94173 61352 -22876
20209 -22876 -112422 -100370 29785 109677 115686 81127 63269 71184 9360 -82501 -103923 -153089
20197 -153089 -103777 20953 76869 33152 4294 -38384 -33535 -19592 -78863 -61254 33638
20186 33638 35448 25476 -25703 -90778 -55434 7663 21507 24611 16684 -28127 -39215 -34606 -33599
20173 -33599 -13999 10933 -32697 -29484 24337 -49992 -91021 -52228 20567 12374 12258 39372
20161 39372 90004 113578 117343 62305 63104 62795 76450 103896 75688 27458 42016 -16412 -57623
20148 -57623 -24856 -1286 8366 -27307 5607 42622 53476 75300 78713 53282 78101 68864
20136 68864 45325 77088 79175 12826 11024 -42310 -155529 -119155 -85664 -58736 5191 15783
20124 15783 1512 7991 9639 24822 -37179 -24822 55902 58756 -9817 -14654 -90093 -68708
20112 -68708 -26231 -15742 30248 91249 102564 60017 26954 -102574 -70909 -20620 70603
20101 70603 108429 26779 59333 124013 129646 74319 -4228 4980 -3760 11685 14489 45411
20089 45411 78526 124808 150644 123380 15286 -76029 -127153 -122823 -148639 -175700 -164595 -57807
20077 -57807 -23615 47755 34455 -45612 -39612 48925 68336 37188 25670 54825 108521 165484
20065 165484 132913 156548 149685 144413 78538 52889 63867 71230 17271 8718 -8218 -47004
20053 -47004 -52870 -76134 -122010 -81210 -41060 -6790 -8474 -12586 42991 60019 26393 13590
20041 13590 8098 58784 135067 133759 164951 115291 95155 139642 131035 102059 116968 192248
20029 192248 205800 106454 84766 119429 172494 236509 225647 193472 260585 260652 271598 178607
20017 178607 207243 426333 517524 590782 599855 571361 561510 516300 490124 374588 217440
20006 217440 70133 32334 96619 88187 103164 123753 168148 116821 34998 -32021 -46065
19995 -46065 -77993 -6213 -7962 -62147 23427 87958 68776 55364 80114 49995 24536 -19314
19983 -19314 -97851 -148740 -183105 -91585 60714 51059 -25658 -24874 17329 -65792 -82635 -19669
19971 -19669 27708 66946 34784 -3063 17147 30503 2900 14486 136344 154555 61998
19960 61998 -36060 -135956 -174503 -132243 -20381 -71470 -126077 -121025 -49817 -3591 44857 124721
19948 124721 136105 175046 70073 -6517 -107129 -168884 -144363 -73090 36887 84399 108704
19937 108704 21651 31413 -14612 20755 103369 82888 21215 -46146 -99590 -128635 -97117 -77781
19925 -77781 -106676 -80477 18976 29030 38428 50132 30246 6196 -102145 -140966 -163168 -136929
19913 -136929 -178227 -92819 -29935 37940 47136 -27924 -56461 -48804 -28228 -72292 -100706 -92833
19901 -92833 25298 -6632 -159831 -253669 -216228 -133775 -78734 -55472 -82637 -14672 -25054
19890 -25054 -75314 -87655 -45702 -61022 -24180 10810 7791 -23694 21100 175955 168773 125073
19878 125073 156321 229589 223979 133108 60624 18099 -8314 -69268 -102474 -59035 43751
19867 43751 23940 4145 -1499 27445 63245 9834 49700 53077 110070 151812 55492 57994
19855 57994 35614 74356 124006 95942 60493 74016 48335 -56455 -154012 -175475 -162284
19844 -162284 -133384 -111381 -66839 -6110 18970 78659 57032 40823 94103 101787 112829 47197
19832 47197 -19254 -9454 27894 2665 -66220 -145233 -151059 -105082 -31868 -118389 -118778 -53127
19820 -53127 20496 34663 39538 45341 37408 -22132 42194 109803 87491 1889 -2087 13477
19808 13477 1516 32278 71724 43555 -10528 -47006 -20451 6889 74986 20263 -948 25523
19796 25523 17942 -23162 -1004 17292 44360 21021 -31686 -4737 58225 44560 58036 200744
19784 200744 260370 192735 154502 27642 -1732 -42119 -36640 37913 22966 -12602 -98653
19773 -98653 -84396 -50025 75646 90443 -104016 -152387 -65383 -17660 28656 106614 66134
19762 66134 7868 -15496 20847 -10343 -130300 -109187 -122765 -128443 -98472 -185494 -93526 26033
19750 26033 12295 -32085 51944 134583 74895 41541 112890 108421 22888 -113187 -95670 -70844
19738 -70844 -20930 -33286 -71772 -104416 -130675 -219414 -178704 -70470 -46526 -31283 -4508
19727 -4508 -31167 -20455 -36581 -56083 -39241 74393 105842 100655 133987 177383 131493 80024
19715 80024 85069 84663 45991 -7854 -37752 -12006 -9792 -10924 56775 3091 -84462 -52767 -18110
19702 -18110 -21060 -65920 1257 18374 -32002 20435 13008 -60139 -72498 -175340 -137022 -125642
19690 -125642 -86228 -141372 -115531 24665 140594 140955 54697 -48936 -71960 -50425 -21255
19679 -21255 78415 135663 73227 125338 144415 131324 112899 126668 123214 84329 95563 110633
19667 110633 148441 191138 125823 34651 48690 24372 10128 10661 5254 -63401 -110086 -103559
19655 -103559 -43280 -74436 -22895 109298 134294 65998 45396 103536 147406 146705 120213 46032
19643 46032 28703 79397 210973 204240 172132 131598 125509 157897 176231 141217 112369 76814
19631 76814 32028 -67580 -24832 -39760 -78374 31202 39946 65226 51867 -24913 87648
19620 87648 164290 144981 114881 117502 122706 44267 -34646 -78999 -200626 -123998 -62185 -60292
19608 -60292 -14816 -12600 18696 71899 193367 260097 183451 131137 197107 174270 119263 177572
19596 177572 205368 49134 -90800 -36243 -29220 -87301 24044 47076 39886 73756 105842
19585 105842 85306 4083 -110975 -110771 -80540 -90456 -103823 -61595 -32441 -41201 19936 34447
19573 34447 87476 135341 112253 88206 -12511 -1953 61760 59707 62039 109915 103280 98975
19561 98975 99976 63094 6169 -21416 -30378 31321 58718 -18296 -17614 9721 -31598 -34893 -27944
19548 -27944 -52538 -110669 64968 82349 114999 108285 34523 23476 52016 29924 85109 171593
19536 171593 187776 273335 292216 218733 110786 68421 55799 116668 131330 162083 173988
19525 173988 169360 139806 95680 106418 144135 110790 106889 10452 -31994 -53620 -39144 -6583
19513 -6583 48840 66093 69551 119929 175507 172178 88950 53824 15742 8334 45127 8411
19501 8411 46740 170086 239902 272434 263391 180714 144634 57022 -840 39934 102590 215798
19489 215798 317192 270010 215744 144429 106761 90289 87144 83606 43157 49353 30751 50940
19477 50940 71755 185293 214178 235446 333019 371207 321275 226099 154601 140923 169751
19466 169751 148514 124070 68990 51855 67496 125997 203516 266715 298773 384833 344589
19455 344589 225202 172734 169632 234669 308884 320133 362651 378048 430132 480022 549782
19444 549782 506896 478094 535510 531596 515552 510995 470005 488636 567169 626002 677764 676329
19432 676329 726922 674122 685214 758156 746178 785436 866062 942808 1017021 1156486 1271005
19421 1271005 1465987 1748731 2036637 2271093 2603192 2822407 3039088 3224667 3306961 3303836
19411 3303836 3374211 3541051 3896493 4382085 5130210 5989775 7367907 9335964 12234756
19402 12234756 16917958 24218460 35035066 49973976 69049863 90616633 112093101
19395 112093101 128596296 136309652 129202998 110780210 86739535 60622783 41124253
19388 41124253 28216046 20196432 15294582 12177785 10112142 8743278 7761010 6926170
19380 6926170 6348355 5953832 5608286 5231527 5038144 4918562 4882950 4869341 4724704 4330501
19370 4330501 3795389 3380149 3047565 2759431 2526765 2352052 2208034 2105044 2077155 1941297
19360 1941297 1856704 1760137 1759449 1716460 1612333 1507087 1434704 1360721 1323583 1268426 1279221
19349 1279221 1247239 1215178 1135426 1153028 1255832 1279920 1192396 1034562 966278 958323 850832
19338 850832 804610 787493 848296 857266 837968 814547 793210 805298 783413 740676 743768 708037
19326 708037 676863 699400 633211 570737 529898 546880 568958 519485 438278 451896 462088
19315 462088 496531 505287 492583 500218 515746 470083 415287 374145 386945 394468 385131 416955
19303 416955 412323 396610 353469 384946 344829 294252 279540 320486 321184 233985 179802 205978
19291 205978 197423 157801 265708 298089 289859 322520 286040 264358 321898 303829 221697 223729
19279 223729 292982 310796 319568 301587 217929 187372 174024 191002 291508 315723 318803 254076
19267 254076 144374 161710 146724 168902 183644 213338 242504 158037 40544 69769 105892
19256 105892 46156 -1066 -17712 31132 170228 198246 172307 125999 164602 202872 117155
19245 117155 120266 138502 142500 183176 205428 244577 149323 72054 85034 137355 149151 143755
19233 143755 102778 25532 25636 93994 156578 227368 224684 137792 125595 81534 25892 23850
19221 23850 147437 239050 235564 209031 151967 143062 133812 26115 -6057 67472 144200 136109
19209 136109 109143 93712 122186 134595 60043 -20350 2025 63653 41118 94952 152565
19198 152565 175409 181537 141572 34235 -23936 -22400 -23159 -16570 -66087 -54424 -62935 -87639
19186 -87639 7164 -56617 -78038 -103278 -34977 -85389 -110868 -122192 -86327 -45401 -37341 -1172
19174 -1172 19648 -12239 29984 82023 121601 61857 50521 109722 90718 61118 -10394 7135
19162 7135 41605 -39816 -59604 -56929 -47771 -44134 -4759 -30074 -12925 9188 88578 112256
19150 112256 154978 51379 -45107 -81000 -61941 6463 19190 22881 -302 97461 208371
19139 208371 105710 58591 2170 -61888 -68303 -54547 -55293 -20721 -80101 -34015 18519 54278
19127 54278 66120 17200 32458 99469 37690 104 99479 66834 66492 80070 118175 161827
19115 161827 190326 113475 114094 115188 141493 150114 95724 27379 51103 154998 163795 108529
19103 108529 98224 79766 22667 28970 46119 101970 192692 191508 139653 64325 71981 55235
19091 55235 9813 -5286 -49905 -8637 24306 94467 111385 38028 18605 82945 162000 185657
19079 185657 113564 81264 10861 -32341 70197 135897 136723 77563 -29369 -75462 -43230
19068 -43230 -12598 49454 61363 64309 89469 102983 51310 -79570 -63470 -45951 -45032 -16871
19056 -16871 -49803 36553 49612 -6875 -3501 43934 40974 -20614 5060 43780 -8076 -80507
19044 -80507 -61226 33048 106440 95444 -7979 -99821 -97286 -97785 -59255 6127 43527 23641
19032 23641 65480 -10213 -104154 -33736 69032 23045 -98875 -109479 -84470 -94561 -46783
19021 -46783 -77218 -140203 -153035 -77788 -5641 -30040 19449 856 62196 88602 42007 -6830
19009 -6830 -22680 23851 104654 121124 74065 3781 -6451 22191 73688 75876 92544 40787
18997 40787 31268 -25130 -77432 -1586 104772 126202 103087 101484 115480 77705 16718 21553
18985 21553 -2466 -3036 34139 73896 66387 7747 -45769 -31251 -32908 10729 71297 87908
18973 87908 43493 -7254 -33156 52106 36814 34322 80940 5316 59169 104215 96494 163244
18961 163244 278415 315959 383333 488849 499553 481181 500410 576555 455518 280499 254754
18950 254754 145196 126811 243195 329493 352054 403622 501132 524111 625115 676697 553725
18939 553725 391034 315633 191448 153328 147576 104004 34151 -15887 -510 103355 134802
18928 134802 119072 115472 108341 82799 51801 90380 122000 140285 142341 136950 150408 104405
18916 104405 51732 47242 111848 81634 6762 -19269 -33878 14571 80559 57860 14453 -16360
18904 -16360 70574 79500 -1443 -34415 -35262 -41856 -36270 -91456 -113326 -61883 -84247 -28936 79016
18891 79016 46524 28437 -12307 -5580 -24361 34845 61780 49931 32587 102739 106734 32016
18879 32016 25032 36829 17047 -22242 -12100 -21863 -26001 8986 3651 8124 -3159 -37341 -44951
18866 -44951 -53706 -147239 -175732 -51308 -17532 5948 47926 41522 92536 89357 126873 118097
18854 118097 58034 59268 56992 56153 -26302 -44218 -7781 5070 -25829 -75269 -43995 -30130
18842 -30130 1288 80665 102102 55907 60515 57321 39105 22273 -56299 -11433 -29387 -87890
18830 -87890 -57176 60001 94612 53219 1959 10243 -23169 -29296 26828 67413 9976 -20370
18818 -20370 61470 139208 138352 47286 -61176 -159158 -213012 -209670 -14161 106901 148931 113550
18806 113550 44132 89817 87101 27210 -55625 -38284 -58632 -69671 -26876 58557 54214 40201
18794 40201 -62950 -23924 -9710 -49648 17332 58495 132192 161787 113604 44922 69476
18783 69476 106918 154630 126989 52402 21667 -2535 -72035 -42301 58593 141752 306404
18772 306404 367036 419260 454695 495585 476947 433581 380679 331859 273710 194971 137031
18761 137031 107401 19558 -33726 -12006 20893 -55473 -116783 -56921 -61117 39982 27609
18750 27609 28238 71953 110677 113575 58229 9113 81476 80045 43037 27730 -55731 -50247 2340
18737 2340 83849 96791 32220 58675 129168 171974 105769 -5532 -74119 -16242 53783 114498
18725 114498 141690 204315 115722 121414 64624 -4796 20345 83391 43059 32731 -4991 -14295
18713 -14295 55858 7368 1513 -2015 -54406 -92277 -16961 29477 19661 53343 -26499 -133028
18701 -133028 -109664 -84753 -45502 12910 9836 -16714 28997 26799 -17479 -1756 74135 53198
18689 53198 41678 117722 133681 121973 116013 131581 143153 89604 56346 34509 36834 16997
18677 16997 50590 61578 -53497 -190342 -210275 -157092 -83605 -94417 -174818 -204978 -175085
18666 -175085 -234799 -162786 -70014 -77814 -44225 34341 93498 48289 67482 60267 4606 -138032
18654 -138032 -100920 -98118 27619 53301 43920 15944 11494 -51541 -109715 -112011 -134253 -78427
18642 -78427 -64036 -60090 52727 105298 150626 13891 -73444 -21370 25160 8370 60856
18631 60856 129440 61589 -27308 -105686 -88950 -23105 3461 68005 31858 25453 -128686 -188733
18619 -188733 -66656 -56574 -62949 -65223 -156792 -133492 -9374 57126 -106545 -116975 -14772
18608 -14772 22655 7062 -15274 25812 19437 14198 93208 95154 41925 33395 -34647 -7068
18596 -7068 3127 -135715 -196656 -165221 -76419 -80798 -136121 -77943 -89153 -170955 -158959 -135515
18584 -135515 -98948 -89975 -2150 46498 18332 -6043 -66554 -43802 -57874 -82092 -29684 14865
18572 14865 37749 22231 -47453 -59527 -61455 -86622 -27689 25648 39709 42568 59121 57342
18560 57342 867 -7240 -71880 -60786 -74815 -6509 36535 69345 32427 11492 40982 -30923
18548 -30923 -66344 -2468 30572 -3640 -89258 -39806 50486 47388 -18723 -68981 -52961 -52397
18536 -52397 -48447 -92900 -55869 -12040 19870 74533 145955 128780 104984 74473 52943 23195
18524 23195 14877 -902 -16863 23882 50279 89795 82930 172756 180251 75109 10315 -6428
18512 -6428 5885 -7633 -6149 -4009 -119 59145 112635 136139 98122 -39699 -10433 82560
18500 82560 111533 161053 61172 58953 17391 -49205 2128 81350 29109 822 12336 85439
18488 85439 114282 12820 -101495 -64345 -23642 -6227 -29084 -70789 -93800 -33859 36301
18477 36301 12476 45545 19342 -24148 -28755 -51479 -73536 -42233 27527 86104 76138 70401
18465 70401 21926 54368 3504 -78547 -64018 -49853 2 50971 -4864 -5314 6615 -41086
18453 -41086 -32389 -26796 -5829 -25664 -71848 -55428 9129 1592 -30942 -9323 -7053 3219
18441 3219 -23892 -3894 -47057 -41105 11275 21615 -42960 -2580 8576 29223 -13082 -53904
18429 -53904 -38095 -130870 -99091 -72903 -65707 -42318 -1198 -14253 -50233 -64726 -52351 -71534
18417 -71534 -89682 -72327 -6884 -50912 -98963 -94688 -53509 -164594 -224279 -200256 -171502 -209271
18405 -209271 -236947 -134730 -124574 -151025 -137485 -74756 49378 41036 -5826 80088 -3293
18394 -3293 -80254 34389 61206 83157 116415 23949 -61055 -106805 -123087 -56180 -80783 -126971
18382 -126971 -102494 -88701 13825 37023 40786 30851 47594 114718 120371 134383 107632 45873
18370 45873 -1926 -12511 13425 -32745 -72934 -21405 49217 83090 115699 47065 57909 31195
18358 31195 33218 60087 100285 21575 8340 64251 41555 -10843 53471 104046 134699 59706
18346 59706 65895 12688 -192951 -235958 -157475 -124561 -26690 40610 45026 101557 75818 2389
18334 2389 41372 -18562 54586 128294 86997 2442 20793 55372 111756 95079 41975 82325
18322 82325 89610 -28289 364 -56193 -94589 -88668 -60684 -67702 10831 11491 -12948 28520
18310 28520 -9670 4452 -4590 -67401 -20415 46685 -5423 -49096 -43950 -57289 -3547 59393
18298 59393 -18307 -56780 32314 54058 23333 16256 4427 44552 44132 25299 22233 25024 21265
18285 21265 20275 9358 -11215 -30462 -20792 28091 56614 4228 -2416 22333 -22765 -99893
18273 -99893 -22085 62158 96932 93226 65504 55177 80848 88227 100569 182536 155301 102755
18261 102755 35829 -87298 -159833 -107819 -805 3293 3044 -33376 -46731 -6637 -8461 -14214
18249 -14214 15930 46862 129792 108589 114467 131017 28186 3002 92126 96619 45823 19983
18237 19983 76367 59909 35075 -35209 -74452 -94683 -68557 -92548 -104543 -51233 43631 93498
18225 93498 -12014 -21886 40978 44636 -29015 -49292 -63199 -71909 5022 -42632 8667 -22620
18213 -22620 -36628 -102049 -149147 -69082 15272 70954 84196 82279 112625 85113 116130 93743
18201 93743 112603 120715 17427 -28721 -29709 13744 18548 -11497 -56800 -133027 -120784 -71193
18189 -71193 10724 70095 30655 42663 62100 -12210 -70230 -16232 -115297 -175867 -71931
18178 -71931 -41987 -106976 -123252 -82638 35383 18926 -74705 -104367 7782 76359 125371
18167 125371 133309 155373 126798 73887 35982 -10008 -82835 -36066 18151 109594 36331 105986
18155 105986 149498 151167 204713 84838 9641 -42411 -97006 -25778 -51958 -97996 -116563
18144 -116563 -112871 -90889 -66130 22740 29002 -53448 -87010 -47334 -36202 17210 -15193 -64357
18132 -64357 -108219 -97077 -47342 -9829 53963 58007 -948 -26215 -3913 40852 -25527 -67751
18120 -67751 -115201 -165569 -145044 -65086 -62944 -75034 -74922 -96115 -136300 -203126 -141471 -67839
18108 -67839 -16473 25149 12260 14005 79845 132631 75197 39939 36215 -58648 -73307 -51631
18096 -51631 -78398 -31191 6920 75566 111702 121703 51619 103933 187227 150111 82887 28731
18084 28731 4400 -31140 -19436 4734 238 19082 39754 58234 25942 -33666 -90408 -11861
18072 -11861 30005 75069 81315 74129 85271 58417 -15286 -95184 -104372 -156410 -118030 -116716
18060 -116716 -131774 -114933 704 69875 101071 70176 29466 -10683 -18855 -89588 -20747
18049 -20747 -53709 -166917 -127177 -92594 -90765 -109978 -97787 -96152 -45742 -91087 -62000 31837
18037 31837 52968 66477 107993 83822 82235 93933 98640 85273 90511 79087 42931 -36258
18025 -36258 3464 20652 49481 80437 -9421 -25192 16039 41180 7188 -17380 -87002 -92822
18013 -92822 -30567 -63292 -124928 -134872 -74730 46485 83855 157912 217291 145986 10560
18002 10560 -18623 19434 38760 5569 -50350 -25950 -28991 -92674 -109205 -49391 13248 -9685
17990 -9685 81583 -12111 -80398 -31514 -49896 -24258 -8276 -40521 -28158 -19099 -11998 -29463
17978 -29463 -24458 5888 34249 13179 -20042 -64106 -118486 -56228 -41463 7196 -33085 32068
17966 32068 54347 -4839 -31731 -78714 -67349 -27942 15831 -9749 -63192 -65387 -13694 42180
17954 42180 86843 51591 -20829 -60283 -89186 -41087 -70658 -66454 -71432 -42132 -2831 68819
17942 68819 142811 16924 -71909 -100463 -44582 -49069 -60344 -153880 -206144 -82930 43961
17931 43961 6828 -87615 -105498 -168676 -106582 -13034 35180 42511 31035 73129 102915 62784
17919 62784 34828 -31932 -104629 -107299 -14341 3624 -9888 -11375 -61100 -151424 -122303 -99659
17907 -99659 -23640 6504 -32683 -82670 -49686 -46777 -115901 -128478 -116941 -124530 -90952 -93005
17895 -93005 -107009 -114283 -179832 -154229 -63945 13482 87373 65811 48042 -19365 -84185 -105500
17883 -105500 -88256 -42900 -109237 -108851 -32989 61858 42350 -18678 -23886 -11002 41155 59316
17871 59316 21520 -101006 -116077 -47346 47495 84539 116523 85248 28542 35402 -31950 -50702
17859 -50702 -69457 -11059 52951 18822 7826 37255 43514 -13999 -25469 -68838 -45145 19407
17847 19407 -66283 -170039 -88877 -29675 41175 82863 122427 119351 98447 52396 -20165 -33946
17835 -33946 -82478 -19014 -30812 -53023 -7167 81998 87579 132093 147989 67790 39581 80594
17823 80594 69273 -12637 12120 -47980 -104879 -53144 83561 100246 39210 -40085 -63110
17812 -63110 -40556 -52374 -93319 -82634 50333 162035 221030 241575 199133 155278 55186
17801 55186 -20661 38620 33963 -13141 -80718 -54278 18283 50690 153652 186600 191918 85203
17789 85203 119102 103159 44091 11829 -6476 -15071 -53598 -110657 -173224 -274046 -223074 -184641
17777 -184641 -173821 -170456 -67805 -68214 -79661 -91403 -121573 -97199 -89389 -25674 -8076 4553
17765 4553 -26561 -15370 28208 58325 -31865 -28423 11583 -63289 -53968 15829 63741 79972
17753 79972 141840 153533 96296 45059 51164 70842 83497 73196 110830 172045 102750 36202
17741 36202 8434 -117494 -180779 -131286 -68014 -38837 -47482 -56308 -77728 -96212 -161526 -185300
17729 -185300 -112765 -59923 -97812 -166709 -82551 -54490 -76872 -40313 -16529 -28963 2511
17718 2511 -35809 -93132 -46918 -96155 -77631 -71853 -101514 -98325 -85198 -65914 -47506 -95441
17706 -95441 -142121 -152177 -134095 -62831 -80688 -112024 -16235 93370 69672 -55712 -74993
17695 -74993 26874 63007 2322 -105867 -64871 -56545 -46095 -47617 -28663 12956 57458 24391
17683 24391 -4503 -15912 45891 69479 134004 105447 29418 3711 14419 16293 -61233 -17664
17671 -17664 90460 58229 -50464 -71192 -34367 -102481 -157983 -75832 -26780 55691 39977
17660 39977 -62681 -113357 27815 95476 67476 112037 187822 117765 79315 163680 122974
17649 122974 9310 -64236 -37700 -41038 -80652 -59259 -27742 842 34640 28579 -56510 -19905
17637 -19905 91489 106218 73812 59483 97109 25566 -26285 -8087 -38935 -32142 38889 52143
17625 52143 40096 5072 16093 36284 4971 -20607 2540 72908 37885 24051 9353 -2633
17613 -2633 -123768 -160414 -183353 -111456 -30540 -12785 -55342 -84984 -71786 -90533 -99895 -79158
17601 -79158 -47920 52543 100848 150412 124638 3732 14403 41912 30691 47293 16847
17590 16847 -41574 -61562 -47582 -33737 -7191 -43756 -79109 -78604 -44721 -23353 2350 19165
17578 19165 74388 152117 157391 99201 59629 95157 39377 -4348 -17192 -83912 7903 41036
17566 41036 43868 101235 152535 153810 159590 30848 40661 80669 -4014 -57544 -36338 -5118
17554 -5118 -81584 -143588 -145976 -165855 -56917 14719 9083 -91274 -43781 68750 52587 -1729
17542 -1729 -5524 47441 12368 -60563 -122624 -154675 -154594 -151587 -101702 -38030 -4428 -3379 30480
17529 30480 -7158 -109688 -166615 -28122 44912 32706 -26378 58388 77981 -16498 -63435
17518 -63435 49562 41302 51474 40864 68135 105766 86762 79885 134355 30281 -89932
17507 -89932 -116298 -71240 -144640 -160869 -76394 -60101 -52649 43448 96212 88250 54180 -20859
17495 -20859 -34555 -140784 -228058 -183806 -55284 1971 702 36904 -5214 -44016 -24524
17484 -24524 -71015 -13908 35032 31878 15178 -33922 -93908 -119191 -80378 -3603 28890 89644
17472 89644 78204 100573 118736 78864 41053 21511 1007 -49994 -83574 -42829 57278
17461 57278 9197 -82830 -132620 -48946 23234 48664 103412 74852 45054 40802 15369 33880
17449 33880 33066 15146 16999 -33169 1937 24828 36574 55189 70158 68651 -2804 -33014
17437 -33014 -15904 117368 196422 182719 55648 9673 -89252 -177686 -203029 -209834 -119395
17426 -119395 -102352 -86557 -23619 -38839 -68518 -105512 -103197 -107685 -76072 -33958 14718 50352
17414 50352 41098 3919 -16095 -101787 -67893 -36340 -48920 42836 151003 180763 166024 156833
17402 156833 78302 -738 -34285 -48594 -112680 -116737 -121799 -53919 -17249 -105106 -195128 -219625
17390 -219625 -207314 -184560 -198262 -175810 -132053 -99840 -94037 -101281 -141742 -131575 -31297 -51043
17378 -51043 -54240 -35939 -59755 -137047 -102925 -98909 -47925 21789 -56970 -145705 -166883 -152114
17366 -152114 -18212 18835 22261 4412 -13268 30966 17668 -15937 5439 26530 57675
17355 57675 105218 1786 -128282 -122794 -7110 2424 -44302 -114904 -147460 -163127 -144395
17344 -144395 -94264 -113572 -161743 -125758 -155644 -95472 -42149 -36828 15306 15726 -77997 -102848
17332 -102848 -147954 -202823 -217257 -259697 -223466 -102215 27687 33639 17315 49413 36521
17321 36521 32780 79147 82513 50261 -40555 -56884 -76264 -35538 -76868 -82073 -73122 -47945
17309 -47945 -41664 39966 58347 40728 -24602 -80507 3264 43309 108791 112469 -2048 -11190
17297 -11190 66313 127615 122024 -10848 -146304 -181187 -116130 -90706 -58335 -14242 -31156
17286 -31156 -55399 11526 107356 68296 -43347 -13445 -53125 -172433 -146147 -43971 21929
17275 21929 25604 26455 75749 8040 -112362 -102090 -1996 -20055 -29510 4195 -28992 -24846
17263 -24846 8434 -33806 -76204 -43716 -72269 -29883 104145 111267 62811 145074 86179 10977
17251 10977 -12232 -63966 -73042 -135742 -108314 -7424 -4690 42886 53293 12377 -11877 -58673
17239 -58673 -74762 -83528 -44021 14611 -7498 -32109 -14595 8444 -15712 -40024 -51137 -3451
17227 -3451 46332 43359 8333 71815 121641 22452 -4655 -53738 -120724 -44059 17493 26918
17215 26918 27509 88628 154359 121928 70766 68175 -211 -70803 -90660 -82147 -53582 -79297
17203 -79297 -5208 56163 73807 47278 100073 153832 240359 410168 566420 654673 652860
17192 652860 588650 434657 328433 328975 336818 298602 321219 350079 356581 459834 533868 620388
17180 620388 649148 659672 613174 487288 309737 204955 151571 85145 -4448 463 86789
17169 86789 218016 297646 242996 88448 9837 10934 -65393 -52513 -35688 -26097 -3731 7676
17157 7676 39388 122175 137305 45923 31083 77890 128387 103843 -11308 -422 24960 7244
17145 7244 28176 8487 63338 94200 49516 -22153 -62820 11715 36189 14095 65508 13500
17133 13500 -116763 -56518 -22061 -74088 -72430 -76620 -106867 -129074 -157710 -134092 67032 143843
17121 143843 128543 123677 45405 -19156 -48937 -39833 -50223 -23175 31241 101474 188951 139959
17109 139959 81492 46337 78156 28470 44200 -32637 -4627 78486 146987 139233 47522 -7565
17097 -7565 -27358 -15535 51364 34556 29655 -62879 -9045 54340 36226 28473 -3181 -9419
17085 -9419 -50488 -57756 -71000 -36036 -58786 -59292 -104642 -71353 -34397 -64605 -76684 -75768 -7214
17072 -7214 272 -39145 -32341 -72061 -24362 558 -44522 -87638 -32504 28888 -5472 3250
17060 3250 63669 -92999 -218941 -196407 -171110 -149364 -51422 40329 98488 66129 -15685
17049 -15685 -56969 -73997 -119006 -158646 -192932 -157880 -121259 -76006 -6772 23105 745 -28005
17037 -28005 6232 -15517 -35161 -76480 -89430 -21431 20670 65324 72311 -25478 -100769 -22214
17025 -22214 77198 97537 71777 67620 54606 36686 13585 3117 -14548 53597 54979 50040
17013 50040 129057 76258 5258 -60008 -79906 -27617 92993 48312 11754 13426 -19227 -32776
17001 -32776 2488 127972 111957 68517 22172 123586 51301 31869 73346 87869 89158
16990 89158 17913 -6901 6509 -35340 96596 121151 5141 -49736 -77130 -136286 -41874
16979 -41874 39607 23425 -5916 -79852 -91196 -42054 -40819 -70791 -59229 -92791 -26801 -56657
16967 -56657 -21054 92214 120993 152322 148730 66317 75106 -5237 -131575 -46885 -19772 -103092
16955 -103092 -93321 -97034 -80689 -95308 -68968 -21837 -110403 -136527 -143932 -59494 -30539 33291
16943 33291 55152 33691 78089 80468 93230 80765 98371 103010 114810 141537 81926 -1587
16931 -1587 9134 -40595 -94920 -119719 -105666 -41605 -316 -30867 -16839 -78333 -84496 -87937
16919 -87937 -132794 -103839 -111602 -42954 51106 134842 153229 100592 118748 178456 179445 90330
16907 90330 -756 -27501 33164 6001 -110332 -150248 -178560 -141149 -27654 -50394 -120265
16896 -120265 -115912 -95570 -95955 -67693 -16083 59629 98517 111550 76913 -3607 -115811 -92744
16884 -92744 -43654 43213 42290 -19732 -69376 -113376 -78972 -61009 -102105 -26808 131721 188795
16872 188795 78192 -13365 -199113 -287060 -174663 -32369 33435 40811 -23 -115996 -206425
16861 -206425 -202345 -127170 3471 24041 16982 3482 14862 -61885 -36182 20053 29209 -15579
16849 -15579 -56484 -45405 -49774 -54647 -26656 12082 -35525 -12233 62113 20022 70624 94097
16837 94097 80003 13043 49949 91803 58864 45535 -13185 -18267 26751 27881 44246 32072
16825 32072 22040 -26763 -92628 19522 110024 20038 -25801 -75189 -138049 -133717 -132697 -107870
16813 -107870 -95046 -110319 -41223 38589 -149 68129 123069 90826 22022 3731 15639
16802 15639 -24653 -8249 -34855 -87838 -138285 -106916 -18019 -82240 -119662 -118098 -127555 -106565
16790 -106565 5639 132374 124685 1044 -110514 -117401 -93992 -64824 28244 7744 -5135
16779 -5135 -47733 -45996 64669 54009 60769 91654 98416 172894 193518 48800 -87250 -74438
16767 -74438 -21594 -7682 -33918 -24438 26903 13682 -64954 -47464 5975 8983 46309 160216
16755 160216 208047 142026 93367 59409 2012 43500 34177 4935 -51306 -47994 -65378 -33512
16743 -33512 -75527 -111219 -145947 -129187 -145548 -135716 -31456 113406 50641 55539 57916 10715
16731 10715 56555 34824 30453 31176 24149 26547 44415 21014 -7430 13714 -38459 -69679 -11401
16718 -11401 21154 -13966 -22032 -85431 -27050 -31076 -91539 -113136 -120612 -125046 -102280 -114921
16706 -114921 -149088 -69575 -9154 -29500 -108885 -88585 -73762 -95148 -23250 -43661 -130843
16695 -130843 -131071 -105148 -105618 -134541 -147397 -94269 -70722 -83449 -12042 -35644 -102914 -167982
16683 -167982 -194610 -89990 -23343 -60318 -85123 -123704 -85467 -47157 -152222 -182615 -173565
16672 -173565 -39147 107851 97977 116799 125045 45384 8862 64966 39483 -65055 -70015
16661 -70015 -4150 19915 -45523 -55281 -19386 -19499 -73473 -82919 -38401 -4734 -40932 -101300
16649 -101300 -103659 -50979 -129304 -206745 -147704 -130157 -63709 -32805 -32609 -158 38439 51512
16637 51512 21708 -5527 -792 -41061 10018 -26188 13585 -43072 -31404 29183 38918 95559
16625 95559 104238 74087 52274 -18135 -87472 -118863 -29856 3943 21063 -28398 -39295 -8972
16613 -8972 -51412 -46979 -102623 -185577 -204824 -156476 -9568 46337 -25109 -70347 -53811 -23303
16601 -23303 46194 90959 80200 -25667 -71306 -125016 -55285 46085 44355 73558 111407
16590 111407 73673 -5478 -82371 -107126 -93804 -93243 -102705 -36613 53014 83700 38529 -2398
16578 -2398 27951 56945 53131 27567 -77091 -155212 -143954 -15269 32799 -2153 -6911 23723
16566 23723 76657 69642 -25852 -1698 1910 28907 -4603 -67573 -14553 21034 32674 13787
16554 13787 34221 44653 6282 59755 97990 104039 -10437 -19767 -4499 -11658 -64301 -70855
16542 -70855 119 53014 37236 77758 43518 56741 123713 119476 102222 116708 -6153 -60797
16530 -60797 -9228 68403 46075 54174 135925 153599 39292 -44426 24881 60147 49482 35278
16518 35278 52886 29257 -8509 -42260 -53455 -46263 -14597 46934 65788 74329 -31223 -108064
16506 -108064 -30587 -17157 -107649 -125555 198 50254 -18497 -27105 -47436 -35606 -4642
16495 -4642 18875 -49048 -9336 -15936 -27658 -23547 -5299 14331 22205 64453 34937 -36277
16483 -36277 -49205 -119141 -66312 37898 -11621 -100687 -74149 -36507 5223 -894 591 34586
16471 34586 13366 -66872 -76818 -82117 29763 74454 2634 -52864 -19237 82573 102245 -40748
16459 -40748 -53312 30253 99862 57066 -51456 -19536 16027 71098 155110 147799 36211
16448 36211 -69660 -91113 -50873 -139572 -135815 -110441 -10320 -2584 -99988 -74180 -47054 51608
16436 51608 27425 -137602 -108810 7940 47693 -35826 -38514 -30729 -6263 -37885 12460 34169
16424 34169 -16051 -61639 -122513 -85741 -24365 62477 44285 -28316 -13077 -58075 -67812 -49887
16412 -49887 -15360 25546 61092 67450 -22064 -49055 -59974 -2631 -2975 2384 88430 127183
16400 127183 54459 24584 -18451 2957 -6158 -18804 -55091 -8951 39852 125749 189814 194152
16388 194152 62436 -83371 -168924 -143101 -135603 -102739 -67556 -82279 -138327 -139424 -92717
16377 -92717 -84797 -94822 -54255 -73377 -125411 -41921 42475 58900 -49157 -112723 -139930 -84062
16365 -84062 -107516 -129595 -96067 -87033 -149852 -134209 -104037 -77755 -75223 -115695 -120333 -97834
16353 -97834 -85210 12454 117951 41132 -45341 -39494 -36523 -87922 -75527 -86626 -117965 -21727
16341 -21727 -44104 -62914 10958 54441 84441 49107 48366 40655 45837 112951 114662 7826
16329 7826 -56914 -17938 42296 53476 157968 130914 68710 28497 27477 -1686 17545 52990
16317 52990 108845 75649 28843 71059 120639 -8021 -88168 -82787 -32387 -24327 -2702 -14933
16305 -14933 -74508 -33729 -31560 -30064 -30492 -45379 -94350 -155449 -108770 -46474 -73214 -104500
16293 -104500 -80697 -52523 -110312 -58426 4838 21536 -32535 -4507 48733 84937 120977
16282 120977 122835 102501 12046 -76604 -47273 -18670 -24921 -69185 -88781 -17528 800 -21422
16270 -21422 -13463 -46722 8434 50471 117995 53240 8540 -6087 -10357 75134 103550 75061
16258 75061 47468 -150 49199 40755 79987 115479 109841 131538 109613 122045 73191 55461
16246 55461 11046 78444 126567 74232 39002 13867 -28628 -66880 -61997 -124070 -153995 -43225
16234 -43225 53093 63501 76800 78762 -27108 -49534 -21547 35976 47034 33544 14482 -42238
16222 -42238 32598 90238 53972 21494 17013 40420 -12772 -56243 1897 33961 -10613 -112909
16210 -112909 -114100 -71546 -93246 -60111 -37099 8150 29558 12180 -131764 -153871 -170256
16199 -170256 -165189 -122215 -1549 46304 2963 -2265 -5646 -96685 -108844 -3326 -39465 -121823
16187 -121823 -51072 54483 79488 45323 -7434 -21913 -47638 -66036 -110014 -130087 -112270
16176 -112270 -100492 -140113 -125191 11319 120414 202549 178857 80163 -6779 2128 -132
16165 -132 73327 177162 126264 114607 28913 33002 56085 113260 40234 19427 26103 22852
16153 22852 -18345 -50791 -3423 14174 105014 114231 94414 33509 -39369 -32901 -83327 -32618
16141 -32618 -17310 -7367 49194 85545 81451 157911 150700 31158 -17787 -23222 -80828 -88884
16129 -88884 -155038 -182992 -71788 64876 76144 14141 -84528 -113978 -135110 -37487 10178
16118 10178 10641 13459 44519 49445 53409 90247 42130 967 -26651 9776 11707 -18664 -23705
16105 -23705 60184 89615 69918 26878 19563 73483 31989 -71656 -140064 -126541 -67558 -55149
16093 -55149 -21949 -43125 -20733 -48194 -22917 -52127 -736 36325 35584 -7870 118198 140442
16081 140442 52137 -32867 -110511 -10052 109135 71241 -34446 -73639 -61762 -51812 -21256
16070 -21256 60195 -7164 2125 34805 -8457 -22747 20933 -14055 5039 -4013 -39695 -70741
16058 -70741 -139115 -157851 -79825 -152222 -183747 -92704 49431 30880 -20909 -48389 -44101 -58440
16046 -58440 -51667 -94337 -61055 -122787 -127937 -92235 -63681 -31685 -42387 -57896 -30354 -22456
16034 -22456 -45684 -46021 -63924 -23820 2060 -66850 -80574 -78077 -74589 -67182 -18985 -56639 -148445
16021 -148445 -193017 -171062 -125870 -125631 -155 70695 100989 84002 27735 8559 -18924 20950
16009 20950 -26075 13968 93915 116412 85399 364 -45007 -71037 -71414 -23758 83326 34611
15997 34611 12205 -46818 -83437 -87230 -21460 -6858 -77537 -63542 -34021 -5954 3394 -14494
15985 -14494 -28165 94390 132216 50670 30962 46792 45410 42326 33475 -46177 -109306 -134854
15973 -134854 -73718 -22562 -82550 -99205 -128144 -114651 -169634 -148296 -126488 -98097 -871
15962 -871 80472 62005 39543 26323 -46453 -100399 -25461 92754 153882 92151 105380 46920
15950 46920 -66889 -31622 -59440 -106036 -106517 -116651 -207497 -107301 -39939 5799 42074 67451
15938 67451 101504 103520 12596 -80548 -56977 15495 15356 25901 16620 -27466 -76395 -145898
15926 -145898 -167230 -131203 -78203 -99119 -137252 -17933 20648 -42423 -74410 -100531 -161137
15915 -161137 -138420 -92199 -69675 -33240 14800 69637 110530 57310 3535 -51037 42013
15904 42013 14449 3301 24720 39803 71903 76255 -17753 -95188 -97499 -92054 -208469 -119061
15892 -119061 3493 108013 89639 43926 -22592 54167 137731 166277 150469 156793 152387
15881 152387 199579 141228 31949 -25972 -7284 -4438 -7343 -24651 -41988 -72900 -94880 -127423
15869 -127423 -146434 -128486 -99314 -99576 -124483 -74828 -25221 -33861 -33603 -12579 -19056 62079 43606
15856 43606 -16733 -43887 18171 43711 -5060 2615 57727 71398 12427 -6976 -33152 18837
15844 18837 38241 88498 78207 54116 74125 101666 89099 5895 13422 20830 47935 33732
15832 33732 -71099 -106733 -85154 -26260 24512 105258 34833 -71662 -175703 -70456 85410
15821 85410 89677 66898 101729 146215 105095 67416 84520 84068 89336 63005 29215 57782
15809 57782 41694 -15167 -32595 -42945 -20290 32594 53912 87653 106001 4228 -20157
15798 -20157 -3484 -35103 1933 5963 46732 13847 26494 69516 25286 75559 39307 -21568
15786 -21568 22676 18217 23641 -43526 -54933 6156 65334 -88 33270 82318 50999 39188
15774 39188 27792 85258 87538 141711 91261 69506 113983 115435 48475 85030 154895 103092
15762 103092 27194 84806 47686 -1235 -3625 -4948 -78115 -51156 49188 49839 30639 60901
15750 60901 -57673 -69876 1625 -17610 -25613 -44067 -52322 20709 54767 36714 41201 30138
15738 30138 61743 16211 -63140 -53726 -26963 -23136 -6839 837 119 55887 45516 35213 107399
15725 107399 138311 66875 54736 66317 97363 25684 -60055 -8496 74186 102489 68547
15714 68547 -18585 -77611 13315 19861 18644 34362 23144 -8023 15551 -23836 -34415 17514
15702 17514 91420 100558 27818 -69269 -19186 -18853 -59070 -92577 -24573 -38331 -47629 -54330 -58332
15689 -58332 -46450 23511 22971 29684 -121522 -145946 -138010 -142298 -37650 875 48575 105492
15677 105492 76546 97064 172061 111135 26475 6226 -27047 9685 30042 -10787 85957
15666 85957 112748 71142 34511 -27956 59467 25867 28857 -9765 1110 89490 93636 -1245
15654 -1245 -25170 -1466 53793 13416 -7822 -14612 -20893 -55764 -101194 -115417 -112787 -94335
15642 -94335 -100124 -127818 -126805 -131818 -66926 -7107 -108302 -138140 -124365 -170160 -129579 -48816
15630 -48816 -37126 -47635 -108221 -179844 -144079 -118439 -97847 -137906 -113145 -74361 -59316 -96326
15618 -96326 -50931 -24683 21632 80461 1292 -47764 -71220 -34399 -8421 13094 -6977 65623
15606 65623 40819 -4030 -32818 50235 66598 6655 -17448 78261 -1061 -6133 -4882 13555
15594 13555 9678 12166 88504 47021 -20995 -13246 -18255 -16775 82730 117090 109255 66359 49815
15581 49815 120931 105295 28013 -75541 -79192 -117839 -227851 -241389 -173033 -69252 -29987
15570 -29987 -90069 -133801 -114564 -86158 -16200 -68285 -91039 -59942 -42910 -15401 -92962 -128759
15558 -128759 -100403 -70244 -94925 -143768 -123032 -96646 -46615 15357 52764 124744 155876
15547 155876 102364 31103 26229 -43418 -113491 -114647 -53225 -33785 -52293 69360 105259 44123
15535 44123 41540 123526 128567 74752 -36550 -83917 -102959 -64197 17621 30905 -62227 -91281
15523 -91281 12893 76901 49358 20528 55923 81851 8394 1523 1870 -22648 -10395 59018
15511 59018 19768 34932 37952 52655 80254 14483 -83856 -33082 -26303 -63502 -50823 -20026
15499 -20026 26200 12108 -76444 -141760 -50590 7748 -38697 -61413 -24295 -11830 31346 55158
15487 55158 66368 25376 48957 75999 69320 43498 100718 82342 87889 63128 -54793 -135997
15475 -135997 -147266 -67054 -114707 -117360 -22003 35032 14964 12699 -6093 -105147 -88732 -14231
15463 -14231 -46185 -21112 -54582 -11198 13074 -62661 -33633 -19077 -2861 -99149 -131168 -106720
15451 -106720 -42188 5139 -30199 -78806 -145968 -136226 9239 112801 43795 49541 39515
15440 39515 81796 100047 56706 -2177 -59821 -37615 6197 11758 -46847 -58341 -122245 -142243
15428 -142243 -49389 -107014 -96971 -19085 -6517 -15706 -104974 -126472 -139685 -102759 -31822 61071
15416 61071 4579 36329 -29223 -45852 -36978 -3712 12408 73827 123483 138436 70310 60641
15404 60641 26241 -103629 -83634 -24532 -17038 97278 156306 109247 105720 103975 63028 75486
15392 75486 70542 115411 110339 97185 148398 87298 -7295 2349 103952 101573 63491 13179
15380 13179 18018 -16306 -62 36341 70804 90424 -64722 -114357 -101631 -104206 1498 10753
15368 10753 -69486 -124393 -95035 -65111 -40124 -97764 -57464 -2524 -95768 -131184 -53325 59596
15356 59596 55175 14914 -49668 -42237 23807 11291 -3454 -23349 25225 37033 26095 -38558
15344 -38558 -92841 -50278 -37996 -53223 -88759 23335 121153 19459 11117 -20481 -54051
15333 -54051 -60973 39467 15005 -34133 -29016 -43709 69861 47559 36443 73491 111770 -27165
15321 -27165 -43818 28629 141085 149687 63154 1590 -76770 -4459 11919 -34959 -44576 -32281
15309 -32281 26192 15783 -78557 -66318 1901 96253 90166 5325 -58259 -88078 -3178 87349
15297 87349 123244 63269 -31843 -100561 -105078 -86762 -118442 -141397 -141334 -73345 -83464 -108812
15285 -108812 -172517 -190873 -118923 -175190 -181482 -138759 -115399 -69483 -17161 -54946 -86402 -86827
15273 -86827 -59734 -38036 5089 10920 -17437 23804 82703 90670 20399 -5630 -27776 -28593
15261 -28593 -56245 -3712 -32477 -107128 -70395 -24769 -124946 -168458 -77387 2074 1529 -83623
15249 -83623 -109280 -101647 -69858 -55752 -54995 -30233 25366 -105831 -105886 -117790 -153050 -188102 -61104
15236 -61104 -679 -16144 -23021 -31317 45288 68981 1159 -63604 -153777 -53490 15399 119511
15224 119511 167978 117800 67320 -23458 -19177 41796 26335 -12164 -87546 -185937 -179216 -131559
15212 -131559 -153710 -43875 -4286 -36143 -63806 -98256 -133722 -41064 87071 97077 32831
15201 32831 51312 43965 1917 39182 41602 53019 14623 -1716 -25582 -31640 -79405 -97114
15189 -97114 -49088 -9428 38757 73926 129950 128992 168403 170985 135051 130819 135164 87062 86268
15176 86268 155533 123734 56161 111636 74672 20129 35111 65782 57946 -63529 -99241 -14707
15164 -14707 43947 113193 124471 73004 -114 -54108 -34304 1413 5965 3325 -22299 -29904
15152 -29904 -22331 44845 57404 95887 24321 -73106 -81293 -20024 -150950 -138094 -25105 71557
15140 71557 110985 43342 12942 27876 9809 115512 64423 50180 -6413 -42636 -23934
15129 -23934 20985 13160 45139 -15726 -76877 -72709 -68770 -128311 -229251 -301864 -203125 -159910
15117 -159910 -82967 -49957 54164 171569 166115 -18600 -148167 -130216 -83689 -78019 -113771
15106 -113771 -169386 -89684 -15848 39123 26348 6752 -17720 -55311 -28427 -4847 -108383
15095 -108383 -99203 -69326 -52446 79474 157731 110664 95582 43369 -60125 -29663 -8713
15084 -8713 -61857 -56499 -105446 -36020 -53333 -141493 -103637 -41490 -34630 -15718 -119746 -131110
15072 -131110 -74138 -89 143983 137006 62943 61860 21453 -41185 -68936 1482 16794 75413
15060 75413 79352 96578 62883 23123 7332 35091 109621 62622 41417 -826 -31987 -98236
15048 -98236 -116317 -85515 -9582 44781 -17231 -50397 -54881 -52950 -52648 -53477 -28884 -25614 -12805
15035 -12805 18614 31276 155723 114279 108009 143658 233703 146527 24411 -34633 -95781
15024 -95781 -103336 -9221 1268 -62176 -97672 -63507 -26600 -79548 -1567 71736 14300 9020
15012 9020 -63128 -157067 -108484 -92512 -106451 -117159 -35184 -6444 -16964 35766 64699 -46529
15000 -46529 -66211 8767 7406 -28663 -24921 5997 -34356 -146887 -162701 -130156 -77846 -86434
14988 -86434 -157115 -122919 -52974 -62084 -76661 -43104 -45008 -37576 -106977 -89156 -137246 -129272
14976 -129272 -110561 -98771 -21264 106323 155178 103848 50625 1419 80678 96299 27940
14965 27940 -6461 -18578 -15188 33301 71131 47921 44568 99302 112948 127419 77480 19495
14953 19495 5535 -36442 8461 73855 26529 -16193 68960 15736 20890 37261 45068 78417
14941 78417 97181 12710 9146 38722 27521 4541 30600 31570 127523 124437 127231 86294 -1016
14928 -1016 -47162 -7707 32648 9454 9563 46403 39973 22024 -31480 -50605 -75569 -67890 -36689
14915 -36689 -35493 -41479 -104178 -121920 -76348 -43710 71584 131302 74137 -47069 -83237 -79508
14903 -79508 -38851 14148 -6527 -27438 49222 -20195 -93509 -123778 -149482 -62885 352 -43785
14891 -43785 -74733 -69591 -47989 -42243 -100962 -170383 -86822 -75373 -37190 -13218 -41960 -60757
14879 -60757 -102072 -164690 -149140 -98933 -52154 -16458 50928 45706 24743 38096 -20039 -93723
14867 -93723 -67060 -98292 -151691 -181380 -119293 -125513 -133959 -184709 -151823 -119038 -56178 25676
14855 25676 -35140 -99887 -101427 -94729 -91401 -69583 -40565 -59124 -57809 -9799 73171 116210
14843 116210 27337 -75030 -148420 -172731 -131999 -37636 -12506 -63407 -127342 -17726 98693
14832 98693 68012 -695 -22671 -16156 30465 154096 228901 130485 118205 79972 3531 -21704
14820 -21704 -138628 -154738 -84941 -127736 -149289 2918 -19960 -102213 -99737 -66184 -8603
14809 -8603 44973 -24409 -34395 18029 -2428 -62905 -68573 -15651 17426 42453 -5626 -17860
14797 -17860 -20008 -56988 -14306 659 17967 -55814 -97274 -84453 -91534 -93942 -111485 -192169
14785 -192169 -189176 -106111 -125352 -109147 -82366 -79010 -47249 -14417 10730 2681 3464 36321
14773 36321 51748 55676 95915 78360 37261 54695 37178 -42143 -161124 -159107 -201211 -229212
14761 -229212 -180751 -158025 -84797 -69311 -131423 -176118 -147404 -136978 -66521 -38828 -31312 -29382
14749 -29382 -9882 -2732 8621 -23915 -94453 -63558 -75117 -121825 -37836 -24223 -138498 -134860
14737 -134860 -56137 -61553 -162000 -104220 -72274 -32384 -100811 -111465 -88441 -65373 -33552
14726 -33552 26147 -22639 -55213 -115193 -60715 10950 25535 -63949 -71511 16678 53034 31238
14714 31238 55325 15843 95442 110053 84320 34114 -12587 -124719 -87776 -28163 -17878
14703 -17878 3878 21167 42265 -15106 35157 13623 -14135 -50746 -16359 -33644 43788 16959
14691 16959 -4086 -1415 27864 -31981 -24779 49876 8899 52182 193189 170572 115257 73960
14679 73960 58246 103945 121393 100051 8012 -101042 -58603 -44423 32822 -245 -43481
14668 -43481 -26677 -30925 22887 50400 45667 66346 23047 6183 72217 79001 112941 38995
14656 38995 -10272 -19648 -34073 35179 39810 -48679 -66965 -81900 -76226 -92547 17607 143092
14644 143092 149396 73930 67462 67238 -1574 -11029 1595 33224 63796 41744 43986 110732 124033
14631 124033 52270 56253 138106 84070 -7595 -116323 -47227 -3059 -20250 865 21083
14620 21083 25539 -6261 -15188 -61604 -123692 -83970 -83560 -135396 -102399 -34950 26599 -35611
14608 -35611 21248 33212 -33785 -11612 97480 9092 -135988 -103383 -21385 16736 26479
14597 26479 -14230 -61194 -34544 9094 39857 70445 75408 88458 51719 -16041 -54986 -102357
14585 -102357 -18706 -22711 -53967 24365 21515 -8102 -54984 -63089 2582 68458 52584 61843
14573 61843 24927 -16356 23917 9335 -7188 41025 36846 -85382 -95145 26131 58024 126594
14561 126594 189336 203048 80949 55934 30166 -67593 -93747 -5911 21618 4468 -4039
14550 -4039 -110355 -110186 -50016 -63550 -118194 -173240 -162614 -34814 -62015 -84855 -86317 23881
14538 23881 79062 78510 58224 35958 -70639 20897 74465 -82909 -113850 -123566 -99269 -25726
14526 -25726 -26903 -39173 23747 -22452 -10209 23817 -33020 -28608 19839 24439 -29402 -65151
14514 -65151 -79426 -104006 -58528 -71413 -85717 -15743 16330 -7111 44821 76674 60665 173218
14502 173218 176094 36400 20270 49780 35213 51799 77025 35425 -77102 -120822 -35133
14491 -35133 19598 -58500 -71893 1907 -13466 -56832 -85636 9928 -75841 -163314 -51830
14480 -51830 -11222 47235 120445 67476 6414 58595 28759 -93431 -55953 21533 48361
14469 48361 72796 118823 75696 -51774 -78584 -70055 -138950 -90811 -134366 -128055 -142398 -93833
14457 -93833 -41543 36121 81491 19811 -15645 51449 149082 124890 21248 -81907 -69792
14446 -69792 -34337 -1478 -36122 -70958 -105221 -62164 -37350 -57808 -89057 -77209 15665 -29237
14434 -29237 -19261 6527 -40623 1609 62191 52680 52799 47773 72160 -36971 -92379 -102224 -72705
14421 -72705 1625 59690 -1544 -15140 -56615 -10433 11131 -56172 -67427 -72141 -62281 -54767
14409 -54767 12751 88393 96548 14099 38487 438 -25546 -45457 -75685 11637 27640 -41783
14397 -41783 -60720 -19329 -26665 -61848 -26507 -3953 91662 192924 227539 144697 31388
14386 31388 -12732 45094 -5788 -37675 -52882 -9128 5060 -41064 -71217 -82267 -69892 -36597
14374 -36597 -1437 -27935 -37290 -2087 61862 104195 59576 -7981 -21100 -25722 36063 67760
14362 67760 54276 -14055 -12644 72065 62091 49450 141748 130783 156181 61638 -103726 -137884
14350 -137884 -118676 28501 81988 68648 29433 91235 77980 105315 115857 83916 17825
14339 17825 36784 72344 59684 44176 -44109 18661 10104 -63262 -65896 -65488 7183 91030
14327 91030 82702 24501 -92314 -94321 -22220 28650 59079 175075 178358 93523 2493 32796
14315 32796 41509 93182 128206 172743 84265 -18418 -46766 19284 26782 10172 21069 41313
14303 41313 34024 23768 113729 116424 38704 -3124 5151 21746 52716 37784 -23475 -73571
14291 -73571 -76678 -28874 55912 46792 13787 46401 116271 95787 73934 14908 47690 15437
14279 15437 -5708 86053 105218 80313 151842 80056 -50409 -90188 -55518 -10924 956
14268 956 24912 48860 46260 46812 -45039 9919 69505 62690 56457 119019 116325 129887 56459
14255 56459 -118323 -189737 -121604 -75525 -18592 13079 78934 110875 87720 33075 -45862
14244 -45862 25520 62959 18127 -117710 -118062 -92374 -85307 -76704 -118333 -155296 -20567 68709
14232 68709 62320 22903 -26977 47084 62713 43724 68253 74458 51959 21724 13900 36964
14220 36964 96556 196495 206601 134583 -639 -66262 -62388 -103869 28835 135554 71522
14209 71522 -104386 -137751 -7705 54868 43038 46793 -17489 -60423 -114065 -6225 -22557
14198 -22557 -43885 -91308 -159612 -88178 -23230 -55793 -138451 -174878 -121791 -61511 -156755 -174478
14186 -174478 -140959 -94604 -128976 -165903 -58482 -2858 -22031 -36291 -34035 -65871 -28445
14175 -28445 -21436 16238 -25516 -71449 -26746 55648 54653 58280 33109 6775 -30624 91951
14163 91951 32368 71038 56346 13926 29505 40108 1038 -81474 -66164 -75061 -98188 -55801
14151 -55801 -14630 4995 -62755 -96456 -69396 -30844 -45782 -32814 17414 62746 5080 -45795
14139 -45795 -103947 -47314 51825 -7860 -12299 168223 170510 123533 99371 51213 32756 -10281
14127 -10281 -6237 67366 46078 -6595 37217 74744 48374 64330 136813 90195 -48366 -91879
14115 -91879 -58574 -4673 105433 78816 -32378 -32465 14281 -6885 23214 111112 156805 116039
14103 116039 134640 151504 72400 -40695 4306 -10212 -59919 -3522 54902 -11155 -76917
14092 -76917 -48392 -37898 -50205 -89063 -134246 -102740 -133167 -164889 -113913 14943 21886 78167
14080 78167 75723 -19322 -118036 -189743 -132251 -123749 -97428 -121124 -63945 -18596 -4246 -28315
14068 -28315 -50064 -679 38620 -11722 -4184 -7759 7142 22315 15504 1014 41083 68720
14056 68720 68098 28862 17293 32300 72568 -36803 -82378 -133532 -142755 -50280 -73476 -80286
14044 -80286 -52346 -79219 -25909 -2662 9955 -14274 -22287 -70094 -90476 -129482 -58420 -86728
14032 -86728 -106047 -54942 -52739 -24768 -48585 -111878 -148625 -80155 -48833 -55046 -111686 -124522
14020 -124522 -92660 -33798 -36856 -10383 13244 508 -17855 57264 120582 87550 20903 29580
14008 29580 13265 18524 -10231 -31505 -42279 -19645 25889 -6768 59825 102238 54391 67912
13996 67912 18775 65737 71437 54307 67386 -1651 -50359 -16472 -53256 -58629 -38949 -1448
13984 -1448 -28401 3513 74222 43997 55322 80688 61089 92818 120991 62900 56772 72363
13972 72363 124422 118085 93734 129362 102357 6312 22325 2341 -50314 -51410 -50332 12394
13960 12394 -124137 -183379 -75265 -32387 -2088 -21786 64880 66961 -3103 -17837 -58964
13949 -58964 -160981 -103481 -140972 -184725 -107464 -90245 -72241 -124254 -75613 -67602 -46179 -17565
13937 -17565 -68472 -96871 -67527 67114 63167 -30641 -44148 12117 29142 -9208 20654 27522
13925 27522 -60476 -134790 -18649 -2521 41936 78943 67518 37107 -18232 -89538 -53648
13914 -53648 5514 -34664 -49584 -60860 -54577 -79101 -42673 11152 35753 40228 56400 112179
13902 112179 26298 37358 51144 3916 -79437 -41800 26003 65242 25481 -90776 -127461
13891 -127461 -110916 -142862 -95050 -8446 -25024 -65643 -22786 7496 -17838 -42151 -126086
13880 -126086 -156354 -127162 -59885 13470 55113 78650 53693 64057 59737 26925 -42144 -46428
13868 -46428 -24524 -56314 -128654 -162741 -122360 -120737 -78151 -75549 -58796 -34727 39931 26324
13856 26324 88 -3590 82764 54183 29029 -81784 -80638 31575 110835 86999 -870 -71164
13844 -71164 -56716 -62724 -2533 110901 97847 37965 -37006 -106123 -78982 16096 105203 58099
13832 58099 -17693 24920 69361 40286 63452 34831 -64128 -73041 -30246 -30445 28788 38203
13820 38203 -29242 -39139 -19912 -84254 -104369 -56643 -23957 -54074 -55747 -58961 -138479 -181225
13808 -181225 -150239 -119172 -131714 -148991 -133557 -200715 -155765 -15841 38270 -31245 -87404
13797 -87404 -129894 -116549 -88539 88678 139519 58802 -45935 -3051 59351 35779 3818
13786 3818 -48155 -8779 26385 41740 26043 -43347 -4740 -13233 -69587 -324 42703 54372
13774 54372 33880 23470 80824 114491 25884 -73399 -83226 62044 5566 -100733 -121081
13763 -121081 -100890 -64215 -37953 -60170 -37823 -61033 -57902 -190 630 15396 56091 74445
13751 74445 31978 58816 87878 109437 87827 64623 77011 70139 119221 126875 141859 187404
13739 187404 150303 60455 35032 40897 -26245 -48546 -25459 35141 69803 36545 -48554 -39087
13727 -39087 3773 6821 -52442 -45688 -2651 36938 83083 83939 12528 -18032 50050 -31842
13715 -31842 45850 13791 25966 64926 121329 78970 -25083 -58870 -101307 -109365 -118404 43122
13703 43122 116101 127444 111354 105467 126095 69941 97509 86982 72334 2140 16199 10873
13691 10873 -9062 306 2425 48913 -7302 2057 82747 80580 12266 12315 119979 105238 58361
13678 58361 80901 147337 166552 149923 199955 111653 10115 97859 160127 89767 9969
13667 9969 -25654 -96563 -197128 -127722 -91202 -128583 -133724 -52946 -1363 31531 56773 79102
13655 79102 63550 1749 -35857 -69345 -61484 45330 151715 149281 41692 -64296 -42333
13644 -42333 -22330 -72917 -80817 -74288 -152766 -117618 -41224 -42633 -23059 -25539 -50168 -128433
13632 -128433 -177273 -180648 -138555 -109363 -111059 -43388 -32954 -45446 10583 37171 -5557 -23404
13620 -23404 60744 111725 108986 126604 56319 23240 20381 -31706 -545 -36630 -86781 -44661
13608 -44661 23029 132194 58779 -35009 -27559 38593 11770 -17974 20472 -29516 -56329 13601
13596 13601 39656 -29194 -2262 23835 -2166 25928 -33379 -48250 -99263 -178828 -186570 -92095
13584 -92095 -99980 -73356 -13316 72401 35414 -30106 -21284 -78557 -152921 -124856 -7418 -104763
13572 -104763 -165595 -85513 -109473 -46460 -2745 37189 -46633 -104259 8329 18392 -132466
13561 -132466 -172947 -163916 -138569 -95818 -930 153408 210055 178931 69976 70513 50817 -5569
13549 -5569 43476 56028 28074 65947 127787 108632 51428 -26090 -72515 -51894 -35781 -31755
13537 -31755 3153 106226 10185 -125392 -188688 -105770 -67650 -41849 34104 48834 35693
13526 35693 -60426 -53046 37798 97057 41471 -11613 -32916 9595 -24560 -76070 -154547 -114306
13514 -114306 -91153 -86269 25153 -25398 -22536 -38958 -1945 35078 10684 -7966 -32695 -67124
13502 -67124 -201852 -214138 -92509 -6391 36773 92229 92253 -1105 -19401 -2562 -34793 -19965
13490 -19965 91631 139635 222349 159443 126778 84892 101298 28936 49179 46562 52273 48751
13478 48751 -45877 -62625 -32544 -25825 -300 -36967 -42511 -24950 10226 42425 4603 -87690
13466 -87690 -119950 -89428 -19634 -76479 -135404 -99014 -131687 -148243 -104428 -101126 -100796 -103039
13454 -103039 -113102 -78152 -15115 5750 -24708 26208 117970 108577 93709 108886 141920 17200
13442 17200 -67408 -10751 101263 106577 82344 45233 58050 128204 109264 145646 94245 109898
13430 109898 140033 11226 -44768 -62081 3359 21386 59909 94549 117341 87827 -42444
13419 -42444 -21233 27207 -30122 82221 54433 -38610 -39873 -42045 -20839 -95810 -145150 -106853
13407 -106853 -1588 23747 49029 90325 -6297 6528 96283 73683 5205 -63671 -81903
13396 -81903 -25610 1575 -51466 -107364 -44090 23843 39474 -38955 -72051 -33348 -23549 35823
13384 35823 66928 39221 -58679 -102493 -114013 -84645 1967 27969 30816 135052 180930 122056
13372 122056 77543 33899 33146 35677 -7070 15584 58362 82714 92415 107321 51552 -56020
13360 -56020 -18702 32165 58497 15195 65325 17308 -52562 -76545 -75934 -84842 -134216 -93404
13348 -93404 -95547 -44403 -49200 -41036 -10286 -30093 -16795 15132 41536 -1621 -45721 -185739
13336 -185739 -184010 -138418 -116649 -116855 -59294 -35203 -47217 -75698 -79262 52180 -8752 40015
13324 40015 116796 99629 14018 -89320 -117133 4653 13318 -44932 -69773 -135024 -77503
13313 -77503 -38410 28999 89387 130884 75065 29746 48063 -22026 -88669 -52183 -27704 7399
13301 7399 42464 19474 13119 37340 52035 99340 177098 216944 200755 109228 7557 -13375
13289 -13375 14005 72172 77004 -17610 2128 87557 44415 -74504 6961 98567 92923 78184
13277 78184 110229 106993 110286 75306 72386 40532 3637 -15151 21806 -20525 -23308 25976
13265 25976 6976 -110575 -119596 -76664 -40621 -57475 -89758 -36716 -61637 -80494 3645 90186
13253 90186 96542 -1212 -47183 -41214 -85170 -109308 17513 75195 33659 86994 197713 183598
13241 183598 150158 238341 336117 593893 822968 988286 1284681 1559751 1821220 2031139
13231 2031139 2045675 1743930 1485070 1213908 897615 678927 610462 549667 460711 359801
13221 359801 252414 207064 140673 57186 46668 79298 141049 196050 127104 66158 111710
13210 111710 103072 55684 51990 67376 89453 132948 134849 63421 19024 9343 29590 -18010
13198 -18010 5498 33775 175444 243533 173074 149172 99841 69507 -15289 -17790 122527
13187 122527 99050 106936 193721 181063 112715 177815 224589 145517 48372 72290 163706 151388
13175 151388 22577 129258 153843 83365 75809 114600 217104 207693 101752 -2811 -74154
13164 -74154 -70462 14251 25755 83870 72124 40402 105940 120065 85667 25410 -16056 -73136
13152 -73136 -59554 -914 -21700 30859 28753 24214 72053 103948 73653 4660 36985 94007
13140 94007 50430 73858 15422 25737 -296 -46111 -58554 -38580 -3720 35867 75303 101851
13128 101851 53879 49840 80866 97065 143591 111860 54973 92790 102179 143442 103481 24816
13116 24816 -687 100764 169203 143500 64024 66831 49695 -11830 53 -30662 -85228 -35560
13104 -35560 -16574 -15745 -73156 -58872 -67235 -40350 72022 126491 -26662 -100118 -21181 8538
13092 8538 -6828 -20690 6014 7666 -11913 -5589 145 29230 31588 21844 26954 32341 76259
13079 76259 62834 92894 172062 240647 213232 138820 82388 17112 -15231 -22499 -16069 -119110
13067 -119110 -192893 -176452 -145275 -93403 -54160 -20842 -12851 -80053 -62757 43704 69377
13056 69377 55004 38447 -61242 -112159 -4611 60329 102739 156969 196558 198508 279142 316659
13044 316659 391193 460086 492375 520176 468476 375041 351225 345511 179124 108482 135091
13033 135091 160165 114904 36275 24492 71261 79359 145885 132914 60368 129686 98126 25254
13021 25254 19955 76951 124141 93272 3354 -14004 -3826 99546 35488 -15433 -25726 -76970
13009 -76970 -45446 59833 104928 107452 37291 48999 50750 34520 146956 218167 168673 204457
12997 204457 126809 136586 68739 -40579 52744 94497 9779 -55467 -48135 -45892 -51763 -19231
12985 -19231 -13489 -67879 13816 60274 16895 80033 149604 148882 99379 680 -15071 -2212
12973 -2212 -8719 41155 58529 40016 19205 17571 -8886 26185 58258 56140 99545 142943
12961 142943 161075 185841 252717 251648 210594 230682 139319 -7656 -114795 -100910 -6677
12950 -6677 56426 38736 312 46997 57572 52885 40162 28754 21020 84765 176780 272962
12938 272962 339003 304971 313326 197794 172110 130833 46771 -27991 57898 151424 188553
12927 188553 190462 164116 114920 104520 144224 188461 280309 325373 371695 405907 414766 416452
12915 416452 343517 287001 328582 259103 183815 204570 207437 145144 97693 57099 58027 111010
12903 111010 170126 181124 137765 153682 173859 284676 289532 258917 265513 245374 147953 40967
12891 40967 64538 72412 76179 94180 144049 264939 339353 415519 475176 450230 392716 382311
12879 382311 448079 405836 249080 310199 441695 510518 523057 481168 464521 422498 466429
12868 466429 428056 393084 434761 382938 427284 434892 442865 412374 407767 469630 485830 509596
12856 509596 513344 437449 449228 579345 649784 629405 655359 691981 679312 699115 740215
12845 740215 829978 921161 937450 952618 1040281 1079869 1102364 1186879 1208852 1302263 1326639
12834 1326639 1401707 1501298 1692725 1799094 1855862 1841630 1924763 2108877 2218086 2326447
12824 2326447 2480539 2619505 2768980 2999633 3133888 3290156 3530410 3775595 4036099
12815 4036099 4346163 4671663 5056651 5518080 6084690 6830588 7788461 8903096 10177063
12806 10177063 11554649 13168589 14788187 16376444 17985602 19952482 22631555 26516310
12798 26516310 32164980 40089099 51568227 68577397 93556674 128946325 176139220
12791 176139220 233059158 294568474 350818134 389008460 394532915 356703999 292354714
12784 292354714 216223855 151737124 108851090 81959657 64514583 52470366 43856970
12777 43856970 37478198 32394030 28380761 25213918 22638273 20426151 18625195 17092844
12769 17092844 15741560 14592495 13549606 12611995 11820941 11104609 10327919 9699177 9138444
12760 9138444 8621933 8183206 7855490 7509993 7140926 6877417 6639671 6432842 6227776
12751 6227776 6017346 5834685 5582172 5434694 5253398 5029119 4823248 4725410 4596639 4455837
12741 4455837 4283702 4095670 3976393 3869154 3796829 3871957 3767361 3568793 3439973 3290815
12731 3290815 3148649 3143206 3193285 3170765 3016954 2933368 2796349 2603170 2484106 2484248 2475562
12720 2475562 2409432 2344123 2310450 2245507 2253810 2198969 2041644 1979250 1951175 1855939 1805793
12709 1805793 1803058 1856750 1826466 1786861 1769086 1639433 1556573 1556641 1520286 1517273 1506416 1508987
12697 1508987 1479672 1394951 1333773 1266221 1222874 1175740 1118179 1032839 1000396 1002706 1030484
12686 1030484 934013 943738 889139 916491 943361 906633 820210 863709 865857 896895 918917 891138
12674 891138 944229 914732 834852 783126 912413 907756 882950 860870 833050 804975 856701
12663 856701 906933 1008745 1112456 1234152 1243628 1111741 966067 809745 628634 536715
12653 536715 571352 561024 546825 532664 509699 435026 416934 470951 538264 551832 383749
12642 383749 361150 347418 347878 381794 389464 344178 354506 465316 449278 330670 250732 232404
12630 232404 237242 245695 381204 356267 313004 293528 281317 254307 343296 417067 424106 365903
12618 365903 303449 252947 318821 386572 454340 516710 443328 372048 384759 415312 381816
12607 381816 344421 351710 448309 443703 390879 393787 339726 262367 189271 249424 307686 312770
12595 312770 245402 231542 235037 283691 228366 147366 170546 200817 187640 194674 192007 193555
12583 193555 354044 435493 408151 335211 237013 217035 251472 295928 276623 223527 217709
12572 217709 186253 178072 253564 209872 197571 182437 138430 206723 239709 191209 129822 162695
12560 162695 188009 157088 57430 44799 84230 115769 99287 163137 280320 214512 162689
12549 162689 225876 242828 202603 111333 102639 94163 130725 170434 208431 260276 210105 203344
12537 203344 203525 146504 146092 192283 241917 188550 150799 123711 67516 64686 124254 119356 114642
12524 114642 120099 138471 113418 36772 5766 37192 40181 16070 42540 5419 -86662 -29917
12512 -29917 -14104 98586 117867 117245 89089 70620 -12959 -10879 76058 126369 26299 -26469
12500 -26469 52618 57668 10927 26890 122633 194481 182753 171289 60100 90078 164928 125805
12488 125805 108537 218186 206446 86482 76153 72855 80192 42278 56798 48817 98070 108723
12476 108723 55262 907 31689 -14827 -21354 27525 -9753 -36862 3829 7166 2143 -36534
12464 -36534 -42244 42318 104174 147872 143752 69385 10400 29618 55598 72660 42750 9522
12452 9522 100195 149339 51643 -23144 52955 122085 50603 69043 90537 80241 94577 155416
12440 155416 162160 121507 80229 112064 70958 72052 110051 80339 138635 32880 -68036
12429 -68036 -3836 -14686 -63088 -119112 -91730 -5021 27382 22292 -87996 -29075 48496 67388
12417 67388 97293 4536 2662 -4992 -2987 -49526 -34995 51839 160075 112977 59020 35953
12405 35953 -12618 48728 88232 21391 -18789 16825 44685 70988 115563 107679 67267 76073
12393 76073 53031 56366 157359 236133 218021 187591 158024 144440 121223 24475 -66712 -35323
12381 -35323 81230 107050 83901 128881 137964 141590 191621 132215 81773 88756 144125 119671
12369 119671 66876 47842 60969 109792 133345 109088 92294 100098 94456 43243 48708 107854
12357 107854 103190 133434 137548 59213 24086 -10714 11254 119248 191984 203548 284419 324434
12345 324434 391415 463521 532746 697024 918743 1183947 1438998 1619607 1833798 1961256
12335 1961256 1758815 1502347 1233756 934329 668577 455355 362061 342205 444872 464044
12325 464044 478788 449170 420255 341612 221806 164618 174952 186208 180820 195154 163942
12314 163942 179302 212496 349988 372490 297211 246331 334751 342369 154301 119477 202813
12303 202813 204823 124468 41037 -4771 20553 37389 130581 242541 186164 179530 189439 113094
12291 113094 63836 72878 101994 36555 18063 61587 101546 98569 89495 102986 153778 204574
12279 204574 230446 207640 159116 154977 220303 123549 61511 38728 63931 71758 101703 183918
12267 183918 207921 218752 186516 176227 184282 261307 260809 213449 152462 149247 134090 78281
12255 78281 106201 140314 130005 114188 142017 187444 205817 168861 139635 156569 165665 196082
12243 196082 237002 268715 300497 355074 381436 382697 356824 313269 327035 345584 322069 325512
12231 325512 398899 356700 286315 348879 407054 366703 273516 262235 357438 367040 371935 334028
12219 334028 310940 308410 190488 132442 56125 -6189 -1672 131101 198505 129169 111913
12208 111913 89561 83470 166017 234516 251128 318930 219453 243381 167190 217703 311572 300588
12196 300588 308832 321139 330385 315271 285324 320756 278991 186954 150163 80829 106430 168863
12184 168863 319535 390418 402780 276439 307052 386567 410147 398026 430725 499904 443342
12173 443342 426251 507274 461207 406753 440986 438945 449633 390699 290449 274025 371743
12162 371743 381696 345436 316963 318951 285831 261673 293998 289764 285895 274802 310493 303058
12150 303058 284731 321139 300284 241365 216529 174811 152709 270591 376958 406856 357631
12139 357631 337994 403152 478064 543732 528181 433581 386290 469320 476897 368303 380004
12128 380004 439316 480708 417618 450607 446799 365511 325810 314032 295591 378558 379432 411188
12116 411188 460872 443337 367167 359743 381463 315831 346631 388176 391718 391482 413849 443824
12104 443824 461004 425430 346015 300462 316518 331583 363109 347876 283881 291261 309931 311705
12092 311705 311664 376785 508786 525839 512796 531479 520093 509521 529875 472636 470777 444237
12080 444237 468333 489206 524627 592288 577810 645287 611985 567960 629045 568945 511675
12069 511675 411948 434403 453865 505092 553909 612416 626797 590267 643725 686351 668434
12058 668434 658039 660940 654280 669735 704039 697081 728393 782829 870889 878515 871705 820381
12046 820381 790815 806426 878779 906349 886597 831337 810413 835779 947197 1020517 1045449
12035 1045449 1098849 1079666 1004927 1036257 967143 1059853 1137825 1141285 1215169 1251027 1359317
12024 1359317 1338523 1285807 1270415 1299244 1312082 1374911 1335107 1274457 1390745 1474570 1421693
12013 1421693 1389674 1479964 1596343 1598959 1595336 1639804 1704244 1757191 1745408 1766394 1761373 1836223
12001 1836223 1856089 1988796 2116408 2143370 2187798 2148006 2175714 2181554 2272607 2312330 2310098
11990 2310098 2455427 2685934 2786968 2946729 3010562 2964060 2989751 2995583 3140326 3293153
11980 3293153 3419629 3504521 3626958 3757521 3891878 3952700 4089238 4313635 4465608 4669276
11970 4669276 4846579 5025658 5226506 5380082 5509111 5707766 6028727 6287656 6515101
11961 6515101 6802110 7184795 7532449 7888668 8286974 8662946 8960245 9335882 9879505
11952 9879505 10523389 11206537 11853066 12408114 13110136 13912981 14825775 15732357 16722981
11943 16722981 17866926 19075198 20492438 22136014 23897000 25744633 27812788 30080282
11935 30080282 32724236 35602858 38774455 42256922 46259099 50740670 55692461 61099956
11927 61099956 66782146 72824108 79071251 85490384 91831524 97739033 102956328 107149053
11919 107149053 110108469 111513181 111310903 109524929 106189458 101697797 96333480 90539627
11911 90539627 84362029 78048745 72064291 66443583 61153918 56293994 51952617 47909976
11903 47909976 44195461 40820887 37847156 35180777 32748474 30468820 28456307 26687728
11895 26687728 25131357 23724057 22300177 20890331 19676523 18592060 17696492 16851416
11887 16851416 16003949 15237618 14499633 13900259 13324096 12689798 12167474 11701360 11254570
11878 11254570 10800982 10298509 9923910 9666402 9367488 9055391 8712185 8280908 7972732
11869 7972732 7729038 7529770 7300065 6989297 6726402 6522413 6352045 6242215 6036610
11860 6036610 5804726 5580925 5377943 5302005 5212907 5037493 4804092 4703497 4665849 4487120
11850 4487120 4282348 4166983 4071752 4068488 3995924 3872448 3732925 3685420 3628847 3577393 3487690
11839 3487690 3403288 3309038 3212681 3088580 3015207 3040085 2966768 2855354 2713616 2664724 2653906
11828 2653906 2634341 2571248 2527418 2538358 2625922 2520419 2331314 2219929 2185752 2124751 2055888
11817 2055888 1970016 1917470 1937020 1970612 1948697 1897340 1798680 1807245 1763823 1647849 1667720
11806 1667720 1738290 1741444 1646765 1606685 1549366 1527217 1529687 1500328 1524645 1562565 1438364
11795 1438364 1379933 1337923 1388952 1416178 1399100 1379769 1368584 1306836 1319228 1267414 1213577
11784 1213577 1245687 1204770 1156559 1167426 1226378 1187226 1159441 1061197 1008001 995765 1000553
11773 1000553 1006398 1049774 916409 803815 818955 916766 939982 935122 885332 884447 814002 785243
11761 785243 786865 778986 737941 748190 801784 719476 720911 767437 803554 872848 808628 737538
11749 737538 635888 620566 570007 603043 643263 573313 570970 483446 472046 493186 496579 534636
11737 534636 567111 502361 535423 622963 651848 696778 672578 720443 752285 702686 618148
11726 618148 609972 605151 531344 486078 430906 407668 397575 360873 374947 440318 397213 463870
11714 463870 571158 564146 502055 524879 540705 436781 374595 390097 393500 337575 252239
11703 252239 366677 406897 237506 259423 394734 390692 312444 361835 321380 318950 336530
11692 336530 387240 377227 383578 356809 310377 248682 302454 349189 337638 396233 416896 396226
11680 396226 393510 288836 294891 340638 282851 233065 311469 452331 438986 390651 296154
11669 296154 358087 359154 335226 319077 356887 352170 377124 413020 355624 333870 337504 367521
11657 367521 357167 336017 322702 254402 284134 342837 264815 320539 302434 249914 217924
11646 217924 245767 245136 281954 347717 331925 253733 236900 241297 214036 198085 166852 149396
11634 149396 211937 229965 172973 154452 129354 82265 70272 143879 202570 183932 172008
11623 172008 300293 363492 342705 360867 292169 140733 62778 125066 212811 195346 210478
11612 210478 271728 299789 259479 342999 318859 184604 66661 117893 104444 112052 119205
11601 119205 147385 98150 109561 124408 165908 109259 -7197 32047 17063 15266 15413 125552
11589 125552 236669 260443 149093 107791 91973 158265 146910 96755 21118 -16365 12108
11578 12108 124267 207306 146726 70582 77082 54863 53204 64698 142988 61133 122769 188373
11566 188373 148925 141808 159060 179495 208684 245761 219198 147558 138654 142503 98725 123991
11554 123991 151725 224025 204507 139290 147094 69539 44322 71536 11429 54106 81568 81708
11542 81708 89272 97068 77507 -46847 -20722 53043 108419 127289 104526 97329 96526 201471
11530 201471 216931 200695 138339 16865 73502 124869 89345 104370 68536 152269 137048
11519 137048 100214 177479 172974 167193 141818 68107 112511 77078 959 20351 121616 151476
11507 151476 176164 146333 61289 -18652 -9830 32778 29260 25492 72334 98976 28903 46120
11495 46120 31486 4776 69515 96420 106059 102896 158545 207651 209319 149136 126968 160966
11483 160966 120081 118361 139770 164259 251179 238190 184294 196618 207822 249412 289209 260310
11471 260310 252484 190760 68133 26451 51878 48533 58933 46050 70001 136425 235086 276657
11459 276657 164162 86970 51559 1418 25504 31420 -22944 -74955 56253 89589 61482
11448 61482 8611 -52648 -58298 -32140 46202 97995 66686 18268 7003 1224 7891 -14848
11436 -14848 35442 102560 131382 46020 -41274 -28205 8079 37921 48256 28608 30002 60082
11424 60082 146455 148344 117282 72667 52845 49750 37341 84878 155722 158166 126555 11933
11412 11933 50743 90798 105462 125441 152914 116147 76894 9534 92036 191802 269664 215446
11400 215446 157803 74819 52743 13895 16068 -15257 2896 79436 166278 113410 25654 52432
11388 52432 122130 129809 77633 118233 39204 -32469 -39354 -23857 -68577 -58871 92164 108965
11376 108965 70763 63108 38770 22193 43943 58245 6508 24674 -38739 22358 94743 138857
11364 138857 134423 158455 148026 126499 148530 121421 97233 26307 -38777 -15776 87467
11353 87467 99872 128626 59850 50615 80847 34019 32296 24199 49764 59300 160575 180392
11341 180392 154864 94789 52992 92286 111897 86980 70630 122131 115747 78073 92173 85368
11329 85368 87090 130280 108347 127106 228837 155768 145752 138961 44324 3288 41140 -9130
11317 -9130 18853 35348 26374 17521 45506 90467 39595 -30287 -55408 -50110 -36623 -10609
11305 -10609 51387 -5029 -40787 29989 166433 271963 249470 220930 189316 133475 95360
11294 95360 44259 86395 107091 56220 20711 -39207 -14094 -35103 33005 122827 64123 12568
11282 12568 96778 56790 -15768 -1479 38527 115563 49931 -78465 -99203 -69595 -53460
11271 -53460 48442 122425 53701 -34405 -136817 -182406 -216884 -226832 -162374 -51903 -38424
11260 -38424 10646 19404 -95849 -171150 -74176 -19442 17342 20915 -40490 -85938 -25079 53446
11248 53446 3846 -378 114409 167439 155375 83217 96477 130363 128371 77534 32983 80644
11236 80644 86452 56587 39227 51627 7416 -12110 -6836 -54501 -66177 -61535 -45941 -4188
11224 -4188 28408 -48229 -141890 -220394 -50431 -40680 -111771 -169020 -60072 22702 -21678 104397
11212 104397 201358 168488 178355 223657 186114 198920 152175 106070 90621 119781 108130 52962
11200 52962 -20148 -19765 -12438 7385 88539 -4627 -53335 7397 -15068 -55841 -30640 -39584
11188 -39584 11876 68038 8468 6807 30357 87709 142383 93236 -251 -107862 -109494 -130129
11176 -130129 -70120 -36331 15643 30941 32845 -473 -41638 -44742 -130769 -99921 -49689 -28412
11164 -28412 -41095 -40677 -398 54573 84946 31767 -1435 -21014 -21450 -60498 22338 31582 -35195
11151 -35195 -37430 -7416 18421 24934 -11671 7348 70477 109577 83943 47789 84605 112912
11139 112912 107034 26816 -1715 100481 86684 -1730 27252 48758 34564 22442 45070
11128 45070 59023 20231 -9956 -39651 68934 105362 126628 55444 1308 103176 131221
11117 131221 131920 76894 66333 48171 54228 96826 123901 102303 81390 56400 25385 20298
11105 20298 1392 -38052 -16159 58612 152734 210008 206996 180687 172591 101945 37104 -75357
11093 -75357 -129087 -103467 -102116 -64362 -18300 -12008 -16425 -46952 -14088 68956 34980 87380
11081 87380 106108 112500 53468 -49627 -47159 -53158 -62451 -102529 -55347 23692 14357 -3642
11069 -3642 -17827 -31198 -83908 -27922 27070 52000 22101 -30440 -89376 -47378 -3569 -66802
11057 -66802 -19236 29602 69579 166095 227409 196196 121390 100507 127501 144516 160182 208160
11045 208160 166319 82059 81356 154288 192914 295251 369270 370302 330723 325401 356698 408275
11033 408275 435656 412607 348324 308318 360980 374792 440001 492062 541823 555177 531949
11022 531949 579586 500097 371632 256093 294750 368984 328269 354230 441841 500695 474382
11011 474382 473122 446899 331635 249240 229966 267139 299384 169267 143168 150229 226757
11000 226757 262273 288544 165306 188273 123830 123455 164308 95363 54650 108186 83580 47696
10988 47696 -6845 -49032 -3001 64297 37585 6200 -20186 -81823 -36744 -22673 -26406 -39555
10976 -39555 67728 83938 72893 90699 23878 -56846 -57500 -41469 -13941 -64728 -78782 -108190
10964 -108190 -107519 11694 43010 -7669 -29292 -29318 -38669 -69969 -38353 -19275 -9627 -69311 -129076
10951 -129076 -133752 -44408 27821 2162 1087 22045 58826 26998 27558 -1642 76069 133592
10939 133592 97098 70179 77043 127691 92702 69020 120044 113865 53148 68555 45413 -1662
10927 -1662 23140 -2080 -33294 -57842 -26387 63811 -4700 -135533 -151387 -49624 1964
10916 1964 22224 58235 37379 41091 136631 133073 96413 63417 949 -52421 -118294 -71966
10904 -71966 -9842 55921 73348 40306 43020 66560 102410 78225 -2765 -63128 -49994 -5064
10892 -5064 -26467 -17602 12995 14141 -51161 -107914 -45807 22720 -18407 -31055 -3030 -15708
10880 -15708 -101261 -85749 -69914 -100158 -89016 -70662 -82808 -74738 -9640 17247 15618 64544
10868 64544 110282 72322 94366 2722 -7253 86261 175812 194863 186607 199333 143499 176822
10856 176822 185687 149045 91621 100513 117250 180907 147657 124920 116778 61332 74053 227196
10844 227196 189994 132704 81882 97225 88847 94582 54852 90497 128133 131664 153905 192807
10832 192807 176724 159270 175257 220417 188952 126592 103369 93363 124477 131014 150652 145668
10820 145668 146462 141036 159938 123378 178803 95189 49590 -41375 -94143 -72030 -68027 -10212
10808 -10212 -32107 -93483 -87699 63443 173574 225974 159239 37285 -8984 18952 53460
10797 53460 62603 80994 79432 84681 44839 -12176 -44063 -7745 48298 105456 107627 7928
10785 7928 -21543 -20517 -26308 -27044 -134511 -210470 -172757 -120000 -75333 -17320 -47675 -37090
10773 -37090 -61705 -58334 1352 22951 13907 -8420 -40107 -28803 5648 -26660 -117661 -114763
10761 -114763 3465 65542 84250 88785 11902 43882 86227 65405 112396 116077 30083 -38175
10749 -38175 -25292 59226 101710 87282 81708 110554 87476 118375 158794 125761 47007 18802
10737 18802 -19889 17504 21152 2012 -15424 24311 38123 134764 109062 156298 158287 76372
10725 76372 -58532 -66194 -35011 26000 46009 36958 -4307 -2822 73348 118061 71568 79963
10713 79963 172681 171369 98246 13810 -74146 -74237 -92596 -78432 -14776 21578 107829 116206 138688
10700 138688 107790 95758 146569 183182 200211 88148 63912 48087 74018 85121 113153
10689 113153 40222 -17080 -34183 100523 178457 208065 247222 269539 192561 92292 44924
10678 44924 68337 77453 84140 101059 153973 240021 302399 221748 232844 139697 69597 131127
10666 131127 233095 236094 266610 307653 302271 339588 324597 252989 344228 458665 412324
10655 412324 436883 476541 461559 462994 494490 471731 554795 668139 756482 743503 762627
10644 762627 894769 976292 933289 973744 1104588 1162319 1204599 1303251 1537685 1785266 1926188
10633 1926188 2123313 2348451 2604222 2882106 3192071 3622271 4217438 5085973 6213333
10624 6213333 7775972 9906059 12732247 16256710 20226618 24485055 28491423 31542932
10616 31542932 33413166 33662187 32829716 31999762 32276696 34255955 38121369 43976986 51287184
10607 51287184 59182015 66451222 71525729 72951673 70285928 65125211 60290895 57904732
10599 57904732 58841370 63059470 70154139 79178274 88524887 96272722 100354140 98845974
10591 98845974 91581962 80793892 70462702 63224382 59807980 59634536 62078064 66107532
10583 66107532 70348848 73437549 73902174 70587767 63483238 54429607 46131751 40230081
10575 40230081 36704728 35102789 34994679 35647667 36321679 36348439 35219301 32528868 28340116
10566 28340116 23540751 19136552 15674052 12990008 11076180 9608979 8559872 7763746
10558 7763746 7104974 6565503 6112695 5664618 5331519 4996753 4689278 4516200 4295618
10549 4295618 4082579 3891599 3725457 3602142 3424481 3203175 3044632 2972013 2977068 2950272
10539 2950272 2907836 2765433 2593061 2505037 2432756 2317079 2311050 2294940 2263385 2240949 2122170
10528 2122170 2036077 2064098 2074227 2033654 1961084 1930362 1901619 1784926 1772787 1697799 1595375
10517 1595375 1503387 1400505 1319955 1266121 1213066 1236208 1264761 1294339 1260153 1212384 1212559
10506 1212559 1208992 1099690 973189 981670 1037194 1015613 949804 1036542 1008357 942456 923566
10495 923566 862480 759289 740367 872376 902108 835321 894111 912976 877968 797586 696035
10484 696035 727300 742502 679391 651492 604070 595559 614007 639029 719055 675060 629365 636198
10472 636198 668133 708535 615583 667285 643885 641930 571758 549894 623511 595796 479458
10461 479458 421987 450027 441109 364277 359832 415359 436074 448507 415122 416170 409751 401585
10449 401585 361524 303842 304290 328483 351467 361045 291399 286433 249488 186865 177873 259614
10437 259614 269361 252320 263487 340497 304332 347145 241660 172665 106203 86596 156836
10426 156836 182021 157804 159707 193477 184171 161329 256535 292220 278439 149406 177972 175588
10414 175588 173723 234423 250016 340572 284951 226572 172975 259455 353062 290729 178870
10403 178870 227580 233356 156378 147490 180759 216334 272611 192617 112623 101370 69637 60738
10391 60738 86955 42773 79216 115456 144971 95768 136669 171256 141053 122344 129999 165747
10379 165747 243939 311230 253586 253509 162388 37921 52357 53443 105601 73462 24822 -7883
10367 -7883 -103610 -104407 -79723 -75442 -92513 -20469 37350 12856 -109674 -120558 19852 26964
10355 26964 -20309 -12995 -10091 63303 48619 61977 159049 285874 243950 144835 -16188 -52925
10343 -52925 -40366 -797 65491 57759 20733 -4072 647 -23223 -107146 -96101 -123383 -9303
10331 -9303 120612 113879 80173 82728 -14592 -180446 -73393 24514 43877 90379 89465 39327
10319 39327 -91124 -142694 -105792 -109689 -146815 -75988 -92243 -39131 5791 98160 123968 45223
10307 45223 16276 20437 106751 98458 87412 65926 39429 28505 30948 86877 175743 123658
10295 123658 158471 192238 118434 76707 75030 -6327 33350 123267 53495 53210 100908 139445
10283 139445 152863 199868 162780 191579 168698 113133 28430 -39115 -13952 108326 134837
10272 134837 164468 107983 106714 126290 63685 12221 38846 34502 103635 118293 56313 42426
10260 42426 22410 31465 23475 13385 -8093 -44309 -13556 -32077 -42813 -38343 28105 100046
10248 100046 211556 202149 88635 36296 1803 7347 73985 88074 123446 154104 52198
10237 52198 -62776 -93116 -107246 -84494 -12362 51409 73986 97903 118210 144317 70967
10226 70967 51760 92218 36841 -70343 -98341 -13178 44456 26597 53773 33949 44804
10215 44804 43194 26719 -36461 -23718 47319 81626 69665 34090 27783 49052 113538 145005
10203 145005 64130 -4797 -44618 -71210 -35232 -24626 -29881 -16580 21095 47703 115936 114776
10191 114776 70555 91672 171941 198685 161220 120802 55331 98864 111446 130937 158168
10180 158168 269037 285980 172830 110636 126110 165845 206609 189629 231115 324984 423673
10169 423673 475726 521769 560785 479145 408871 366333 315661 379366 401466 457639 484857
10158 484857 500011 584876 551199 471516 365762 298497 234132 315521 400378 396582 368641
10147 368641 418892 400352 453346 455817 422974 368955 317222 299823 261320 220009 210042 281499
10135 281499 331709 316164 192889 144019 125766 30901 -9279 97796 108129 138489 100709
10124 100709 2031 748 -33316 -19228 -58585 -17645 87447 124120 105877 111600 109741 55471
10112 55471 53697 80759 93131 -2789 -33034 26818 11786 81574 108877 117727 62726 -14730
10100 -14730 -109755 -124939 -152516 -204635 -148266 -124953 -92737 -17224 27062 82333 150851 160989
10088 160989 55690 -32518 -42584 16866 11044 -26168 -47793 -142839 -127047 -39339 7649
10077 7649 -8163 -45793 -52535 -16937 1192 8442 61392 90650 91668 126629 100125 43318
10065 43318 114991 206916 139621 91313 17858 -4458 -20528 82278 72094 45186 66551
10054 66551 93288 162241 213066 142691 36394 73434 2567 3218 -10199 73394 93840 194275
10042 194275 158471 53895 31694 43097 42446 34247 78725 112796 169680 201220 85962 -40958
10030 -40958 -94141 -91344 16220 70765 -16385 -6541 5263 -19722 63792 176453 133536 101220
10018 101220 33810 -15968 -64350 -35558 12298 60266 56388 81650 152829 115491 33554 18822
10006 18822 45407 -73095 -50125 36700 60777 -5165 -76458 -28188 39280 75183 69279 72255
9994 72255 98014 84734 71718 103597 49920 34276 18390 18689 11588 166 39622 60007
9982 60007 101145 114819 34951 21807 48275 85767 93887 43159 59505 40939 -11143 85963
9970 85963 129873 158553 117711 113141 148723 107765 66502 -19871 -92508 20405 136174 129155
9958 129155 15243 -33265 -45618 -58017 31347 40274 1905 -5981 -46688 -25181 -14633 -29986
9946 -29986 97713 86036 55194 44490 113088 89032 83527 75775 86695 110916 102828 18349
9934 18349 -46453 -18982 -35910 -49663 -16475 -92088 -131976 -98144 -13233 15394 32617 52328
9922 52328 76617 99920 54449 94263 115231 75196 -2347 25369 33030 33152 -432 -32759
9910 -32759 69405 -14115 -49475 -57458 -104654 -79034 -68771 -54899 -30929 -47216 -3438 44246
9898 44246 31815 14237 88611 105751 69168 59188 -13063 7744 80481 48555 5710 45994
9886 45994 72127 106820 161606 133348 58111 87159 70949 -49935 -55272 49302 31029 73124
9874 73124 -33277 -46957 -2696 962 -1457 85520 77090 44412 16240 -48953 -131693 -45095
9862 -45095 -74574 -110164 -98627 -114450 -61413 45685 76641 103213 91705 25907 56579 71101
9850 71101 133204 80112 138125 160153 100721 28068 -4795 25453 -16462 14517 137849 200067
9838 200067 136953 83266 40812 -57855 -113020 -52570 -23995 -71087 -62272 -69245 -101042 8320
9826 8320 54680 6794 -9180 -7222 -40152 -45731 35859 50665 58077 39388 12085 30126 11128
9813 11128 1040 25660 5748 -27853 9538 73541 16363 25023 143417 199921 125765 125952
9801 125952 77897 84191 73530 124676 152517 154831 97248 45472 34254 44124 -2470 8439
9789 8439 26184 10273 1754 27217 14463 12957 -20322 13463 35494 34416 74497 134277 118401
9776 118401 -23565 -196256 -197011 -76528 -29037 -30267 -59820 8218 80782 76785 -9926 -19074
9764 -19074 7217 -29631 -73298 -71762 -45274 43374 101210 127563 108653 46417 87090 128184
9752 128184 206295 152481 42443 -30269 -27429 99881 104843 47340 100249 75066 87394 7592
9740 7592 -63021 -4536 2796 69590 76231 33559 -4727 -36024 -61885 -45718 -14583 13531
9728 13531 28 -3161 -349 46493 51322 60264 15743 -38999 3788 -25289 -39272 -131365 -138652
9715 -138652 -109604 -5189 -22619 -10965 56944 51084 2136 -15984 -39779 -75864 -89975 -73672
9703 -73672 29784 102598 107800 47187 -16058 41540 -26866 -73080 14838 43692 40087 49245
9691 49245 94007 32758 37753 141522 129891 73866 81895 177989 136603 18333 -10364 2447
9679 2447 65099 108080 154623 171154 135536 149918 45375 -11505 -8782 -74585 -150954 -92445
9667 -92445 64237 99790 81048 171991 230549 255579 209000 334441 480940 603749 731241
9656 731241 1101845 1513889 1695290 1739029 1690156 1257742 767795 433600 223496 160370
9646 160370 152715 204438 205965 164144 82172 96966 138790 168663 180896 144061 163407 160579
9634 160579 209550 227406 140539 51266 -57033 -163401 -122128 50083 109673 60689 25946
9623 25946 93880 138676 135684 73831 31696 -49194 -116900 -67675 -21745 -23555 -73436 -24247
9611 -24247 11634 -20900 12035 84556 19991 105171 86133 33773 42828 26550 67883 88127
9599 88127 26211 18591 -29346 -22105 -12668 1217 30233 -24380 -23118 63380 28335 10528 5448
9586 5448 -30855 -77318 -36662 -48405 -9986 12852 39526 82366 129345 150607 125735 73106
9574 73106 42359 36323 -2128 -83628 -113888 -53406 -19668 -102633 -130393 -89034 -167401 -167076
9562 -167076 -137674 -87309 -22022 30452 84279 74792 37597 71232 105376 115374 144946 132341
9550 132341 105298 -26456 -178153 -178924 -137400 -49021 -11574 -100947 -63284 -38358 -89287 -116933
9538 -116933 -7604 10224 92637 30885 101410 80617 21417 85465 94713 106276 79866 42713
9526 42713 121712 76635 51302 34790 39398 26812 101213 90195 -3421 2550 35652 -9023
9514 -9023 39701 52816 45322 59396 114849 115706 68568 30695 -6923 3245 -26065 -15033 -97999
9501 -97999 -95363 -32683 2187 92338 94374 57955 -2660 -71662 -95187 -52374 17678 136385
9489 136385 192879 44594 -58196 20285 108141 145246 75393 39369 62032 -3193 5938
9478 5938 -36808 -29727 -98104 -77076 19397 -12007 -129489 -143721 -106688 -100854 -135241 -125341
9466 -125341 -115508 -76717 -148850 -134089 -84132 -98009 -48458 -22239 -48198 -122895 -27220 -53920
9454 -53920 -43049 25287 -8764 -60895 -46288 4839 61437 73353 37429 -15698 -46444 4377
9442 4377 33874 -32580 -42433 -9509 36228 103698 74185 28223 -8685 1643 12098 25528
9430 25528 -20605 -96175 -143776 -146225 -235721 -260649 -138928 7847 72816 7953 -33621 44697
9418 44697 31817 64077 68659 -22830 15654 23988 -41454 17073 94243 81586 -47627 -43822
9406 -43822 8262 26144 94769 34315 -23034 -65402 -67392 -36116 41604 42649 -23089 -72346
9394 -72346 -118018 -146940 -88951 -40792 -39869 -31645 -15081 9271 -28506 36546 -2730 -12374 -117092
9381 -117092 -73874 -30382 -4893 38207 -9139 -51995 -72116 -26951 -103786 -52861 54670
9370 54670 65459 105180 189561 200057 154114 36871 45352 -33796 -74224 -92443 -75834 -102039
9358 -102039 -97839 -131756 -87816 -25210 82590 127172 45077 -95634 -124977 -41245 37193
9347 37193 90616 106486 111830 85992 37461 63020 41559 -7432 -81158 -14765 96344 55153
9335 55153 87211 -9238 -77503 -59926 -113033 -110117 -137099 -92657 -153184 -73962 144396 159588
9323 159588 97113 4723 -52384 -104 -3428 -58224 -51025 18050 71429 4667 -85636 -35825
9311 -35825 -15025 -16627 -5490 -94699 -198634 -268297 -163038 -93207 -38840 -63881 -95916 -26462
9299 -26462 -8058 -50554 -59130 -71469 -71429 30870 -20393 -62070 -129866 -126189 -112566 -67333 -38685
9286 -38685 -26101 -26471 9310 47012 -43024 -128561 -101455 -102005 -119362 -45607 -34523 -17650 -49308
9273 -49308 -75913 -100847 -46018 -43261 41754 95440 17134 44048 92789 70234 -49020 -71949
9261 -71949 -140325 -166695 -156289 -49154 -72335 -18271 -17902 -60838 -13575 46845 -7601 -33803
9249 -33803 -10657 -38328 -45972 -17466 -18476 129911 139848 108734 145578 115872 110779 84911
9237 84911 115513 156865 206253 133430 -47319 -41987 6286 -16389 16151 28299 4310 19375
9225 19375 21924 52590 53278 -27916 -38458 -33534 -46923 13352 77449 105646 23447 -53992 -26866
9212 -26866 12774 -11 79943 130876 102371 91988 119598 123324 93709 128990 115031 115183
9200 115183 160980 162168 93371 86067 27303 -34814 -4478 95304 136499 94606 98709 118328
9188 118328 68958 7425 -13157 97129 84591 22625 -59109 -20692 -78519 -136251 -92952
9177 -92952 -17390 70315 66958 31762 -4745 -50905 -25853 51190 21971 66001 23260 -17463
9165 -17463 -33081 28493 99315 141456 95258 25213 25613 -18075 -20406 16942 74470 150995
9153 150995 171969 163878 90268 128463 85704 62470 4727 26617 4330 20624 3152 5939
9141 5939 -81571 -6710 61414 78485 -91128 -106144 -49941 -8108 10661 -668 -8341 -35804
9129 -35804 -29974 65265 61498 39000 -41329 -111714 -91794 -120390 -150240 -113568 -58768 -2263
9117 -2263 13947 -6817 43339 19749 -37512 10078 64585 80057 4669 -32305 -82377 -139120
9105 -139120 -97098 -49955 -68078 -54790 -77148 -163093 -36935 29376 39735 73800 20914
9094 20914 6073 18940 12039 -8343 14115 71601 145843 108087 87088 63821 5532 6898
9082 6898 -24118 -45377 -43132 -12010 -64236 -32262 28449 66546 16946 -15315 -69227 -35092
9070 -35092 18742 -81997 -68111 25620 4381 -10792 5174 9221 127487 137808 126067 71571
9058 71571 -82920 -67513 -45758 35475 108419 72360 42101 7 49537 -19080 -54499 -49817
9046 -49817 -68619 -123639 -118209 -95119 -45554 -57425 -124053 -158844 -93797 -27845 19284 52812
9034 52812 90330 66076 -26334 -85638 -37509 20509 -18859 -77803 -125288 -112455 -54044 -10345
9022 -10345 -5601 23402 -57968 -4200 38897 -55041 -47757 -91534 -122376 -141727 -92656 -12876
9010 -12876 -33104 -39725 -38937 -39983 -7067 31757 -4782 -30701 -45288 -38851 -36389 -29963 -74630
8997 -74630 -64330 -117692 -95811 -41367 18751 32928 69106 90004 30429 65329 99694 159636
8985 159636 130244 32088 4687 5959 -917 -15800 -14675 -21710 100805 94952 12902 -46054
8973 -46054 -58917 17002 58504 83547 -4684 -39110 -15489 24356 -37969 -70223 -3888 -3013
8961 -3013 -24654 989 -66868 -155111 -151807 -85596 -50881 30807 71573 27423 -81492 -83188
8949 -83188 -6600 12034 11582 -26011 -40755 -96275 -51430 -22274 24525 11203 12538 74209
8937 74209 -5991 -4810 -18241 -99420 -39519 -43754 -47970 -545 -42790 -86350 -118878 -37208
8925 -37208 54016 10258 -3265 -45555 -65891 -28227 -41243 -53379 20360 64766 124550 77260
8913 77260 56229 21346 -19363 -5220 52851 -26310 31259 138384 111378 112172 124574 76830
8901 76830 109439 135909 81350 54114 -3351 31971 -1286 1780 17213 50168 6187 8991
8889 8991 -53407 -45707 -17964 30966 83856 535 -125418 -45573 14058 -23271 80716 118215
8877 118215 140921 191805 172384 125580 82690 26868 -17948 19233 10239 -58106 -79410 -38040
8865 -38040 -50278 -94291 -155319 -134872 -114632 -109211 -171686 -133319 -64957 -42203 -55469 -55564 2145
8852 2145 -63795 -89780 -198980 -191155 -155921 -57346 -25006 -4550 27037 -24015 -51970 -8063
8840 -8063 95433 60425 16171 36361 26852 35506 1951 36880 61190 19784 68773 101801
8828 101801 26738 -51413 -70748 897 59579 57036 13261 -50257 -36410 -34691 -47350 -31064
8816 -31064 50588 20007 -97040 -39259 37393 -36852 -49906 28376 130380 107995 59109
8805 59109 65071 36433 35753 164589 130247 68619 41857 23826 84330 139105 120293 66677
8793 66677 -29628 -52712 19049 -24966 -24377 -56076 -62406 -64892 -105744 -85092 -25357 17119 76662
8780 76662 59459 -11214 -39287 -85466 -78046 -92157 -34065 19583 -17907 -38706 -21242 -64644
8768 -64644 -940 97486 91257 124431 108307 22622 -44792 -67466 -50505 -41279 36927 22319
8756 22319 -87481 -82628 34266 2911 -28310 -6443 -26012 -55518 -135159 -163564 -97686 3277
8744 3277 39019 -68127 -125951 -93816 -50105 -156867 -142711 -87074 -124701 -125967 -60935 -73091
8732 -73091 -87993 -66497 -7003 22788 42284 46198 -55810 -121923 -92729 38218 79597 92118
8720 92118 92051 75120 15434 -16198 30 -26381 -14887 42262 58762 -47957 -49673 -40920 10461
8707 10461 40675 68697 26102 -49420 -97728 -81005 -16623 -24012 -45185 -29609 -35450 -47774
8695 -47774 -13161 46978 42920 -11564 -26773 17481 26710 -53931 -111530 -49046 33311 -55375
8683 -55375 -110090 -108074 -46378 -10019 -56432 -100145 -41603 24486 43638 88203 73642 127805
8671 127805 136278 85333 93504 88382 178774 182107 121714 45315 -44787 -35095 -66722 -87988 -9467
8658 -9467 122530 143401 152299 29354 -14279 30709 61752 117168 109443 72679 133578 108824
8646 108824 84054 89248 131503 122266 88409 151713 143971 111731 39088 25515 -17902 -106912
8634 -106912 -120135 -44839 37467 137553 170832 93678 39947 19730 62444 81128 129323
8623 129323 191653 177592 213944 192869 202354 215384 270248 152906 91932 105540 103642 77956
8611 77956 -19177 -56377 -71664 27047 90810 3438 -27402 38415 91112 66943 90 -53630
8599 -53630 -13772 123065 207760 166454 121504 68598 96852 77734 83064 120637 145442 225111
8587 225111 314990 283776 248300 237374 268528 243976 263025 259871 150183 105041 199817 155467
8575 155467 138250 41376 23027 -41555 -124236 -123748 -71596 -32915 995 116375 160896 117952
8563 117952 145948 17005 -38248 -19842 27101 -16741 -38845 -9291 49410 53771 14387 -129
8551 -129 6222 2109 -20511 -30156 -10591 20507 47330 -26523 -39272 2600 -14700 -65555 57132
8538 57132 155692 90374 8911 -88463 -29910 76313 113038 128245 82724 23427 21255 3470
8526 3470 29653 38159 -23685 -83857 13489 44393 -56755 -51891 -33308 45763 50919 -19364
8514 -19364 59909 147690 62691 -39441 -131490 -102023 -79156 -67692 -43065 -40236 -81794 -53729
8502 -53729 -38555 -2980 48142 -1478 -44667 -33472 59495 3869 6772 7366 -54626 29149
8490 29149 139372 99810 44369 5683 -38023 14614 -15475 -44143 -89385 -67857 25996 6501
8478 6501 -13584 -102494 -156669 -97412 -25910 18698 17746 913 -112890 -75220 29996 31988
8466 31988 46168 4542 -69002 -97265 -130703 -121959 -107335 -42768 -59498 -26613 41485 10109
8454 10109 19908 72096 -32528 8490 58600 59689 47913 28770 -25801 16044 137501 146463
8442 146463 171203 199298 95938 20627 87920 145410 49136 21292 53102 125141 60758
8431 60758 -14360 -19152 -73500 -53416 -27939 -11907 -12786 -71680 -116205 -89372 -112957 -96722
8419 -96722 11502 33547 -33099 -97981 -108645 -34479 -51972 -48722 -58097 -69961 -184568 -248186
8407 -248186 -143161 -67091 34575 47651 -53484 -30797 -13774 -33880 -69705 -89143 -73556
8396 -73556 -24007 -31181 -78554 -45245 24893 42252 45959 74443 84132 126303 120298 30362 -37
8383 -37 4882 -55646 -82893 -9658 13371 -22022 48938 29161 17047 36159 118078 92352 94100
8370 94100 94907 78406 43210 43049 31836 93676 166168 148385 77213 25451 58411 109535 124214
8357 124214 144678 190904 128136 28435 -96630 -119024 -81097 -81544 -64116 -95644 -137465 -63736
8345 -63736 1294 18031 8361 -61334 -72393 -77177 -87473 -36016 36607 80558 92498 9209
8333 9209 -35565 -63437 -94587 -42452 -18603 -22638 -49507 -58356 -85861 -83779 1617 57111 30353
8320 30353 -73495 -123345 -137513 34256 106212 13820 -52958 -61992 -46754 -114408 -102050 -21579
8308 -21579 -51223 -83800 -66323 -16045 -18169 -115745 -65250 -20269 -26713 -25982 -17397 -21873 -28824
8295 -28824 2057 64392 -15195 22672 59732 35948 79943 97627 129745 101341 46136 -24031
8283 -24031 -30103 75333 99138 110786 47420 -60051 -100097 -108991 -75152 -20672 73576 98166
8271 98166 52965 -27564 4731 -63191 -40730 8871 -1013 22949 42953 7843 9782 92165
8259 92165 133233 131272 85878 99100 -24902 -92888 -70427 -78821 -6175 -64412 -110116 -98021
8247 -98021 -172093 -143240 -48878 67720 -37296 -110018 -60254 -13119 32818 -64439 -67871 -1562
8235 -1562 16794 29247 -54665 -28243 -4063 -82615 -68389 -36074 -126035 -222333 -164602 -65464
8223 -65464 -37045 -74668 -32099 -2779 -8648 -6724 -28368 2792 -12216 -47670 3861 90761
8211 90761 98284 149997 174287 92673 58408 -25437 -53636 -39500 67599 40199 -36703 155
8199 155 60170 116735 79152 130021 90659 60449 108574 155753 79235 13389 15156 77372
8187 77372 -6995 -36151 30884 100632 54368 20575 -8392 -57846 38583 -2428 -36734 41664
8175 41664 136868 85320 81491 129789 213286 147478 39892 76465 25135 9785 66640 137484
8163 137484 104939 116457 48376 -8289 -56208 -35216 -1514 14493 67058 81256 -51666
8152 -51666 -61905 -25135 -53140 -63248 -114748 -184408 -176283 -106747 -54219 42151 40772 77970
8140 77970 94454 12331 -9731 16924 49420 -6948 -22063 23447 138738 130064 102139 70381
8128 70381 19808 17688 -31147 -81452 -110838 -88918 8171 3151 -33140 -2983 12086 73701
8116 73701 69373 -15069 -35324 -30922 32002 17751 14307 -7267 3461 -32582 -18637 -17909 -9323
8103 -9323 38980 30857 53355 -8118 3432 125479 138153 174185 159116 98983 38929 67230
8091 67230 59301 11533 -15175 -31196 44683 70305 44532 75261 43904 77373 103449 59895
8079 59895 81166 33746 -26581 24205 88640 159131 123924 60082 52169 -9900 33694 74763
8067 74763 10098 -69549 -116459 -72754 135826 219647 193085 110692 26066 -75764 -81592 -89215
8055 -89215 -153179 -195667 -203590 -134883 -93136 3380 30520 -32578 -152804 -124803 -32435 -57985
8043 -57985 -60928 -41184 -33399 -19767 28914 107523 94213 77386 114496 106362 74754 33944
8031 33944 16042 -20348 -37223 -81866 -100122 -54310 -11170 -9674 -22325 920 35152 -10261
8019 -10261 -67194 -115778 -102546 -56125 -83076 -9489 4148 -103205 -78102 -65308 -89845 -173647
8007 -173647 -165548 -104004 -20327 -29715 14631 57889 64191 154469 175754 163948 151837 69021
7995 69021 61911 56220 -5800 -40711 -65992 -98049 -72885 -2015 -3652 -52249 45001 33144
7983 33144 -38635 -41811 -24544 -50380 -77922 -12418 74066 98255 26591 -20416 52775 58265
7971 58265 46270 31237 -22858 -81589 -88697 -61696 -75774 -50464 -116676 -146437 -109828 -149007
7959 -149007 -156021 -156331 -102903 -61941 -53663 -27989 -25579 67038 40473 25956 -2144 -1748 19563
7946 19563 41142 79256 127068 140361 109426 18574 26147 111225 140142 88539 54196 10023
7934 10023 -23041 -122743 -161129 -108751 -74821 -20960 -10136 -77668 19611 92733 67628 -19092
7922 -19092 5135 69084 -27921 -64804 1360 108527 130888 67483 110151 76685 -43739
7911 -43739 -129523 -203234 -181080 -168450 -225420 -179899 -115817 -108196 -137006 -218249 -204096 -167079
7899 -167079 -78893 25328 16723 -62063 -45468 -78501 -81562 8489 -5775 12514 24205 28608
7887 28608 1927 -10377 38502 31339 60655 116363 92118 -6326 -20376 45729 19791 4603
7875 4603 -4943 -40716 -136394 -129147 -100267 -89267 -114365 -112621 -133058 -36475 37828 77293 127254
7862 127254 104590 32302 39466 66642 75433 55168 4363 45755 65930 -25925 -33571 42909
7850 42909 70948 26675 60523 -27919 2264 60611 8532 -86924 -124738 -70459 -68810 -95391
7838 -95391 -53528 -75663 -39170 33586 -12688 -16744 62717 9615 -16202 -28172 3404 28132
7826 28132 28684 12925 18563 14338 19969 63676 34313 46814 -28733 -60966 -58347 -75117 -60719
7813 -60719 22437 106856 89090 -32709 -134396 -144777 -86029 -44489 -73334 -62829 -19833
7802 -19833 44070 34372 10660 -2111 26971 22981 -42026 -106256 -200943 -182497 -195816 -279081
7790 -279081 -273253 -201526 -198951 -91722 22919 69820 4385 15080 44081 71360 -5316 11062
7778 11062 72159 12079 -75134 -115728 -102299 -12136 -40038 -49162 -119336 -140210 -89443 -42383
7766 -42383 -64429 -145393 -127066 -112148 -117585 -94826 -42264 -3563 49452 40002 13017 -54222
7754 -54222 -76566 -51807 -61000 -84273 -61481 -69280 -41708 43093 102601 72681 10258 -48382
7742 -48382 -29815 -66204 -43605 -629 36149 38354 19001 -5210 42039 52953 57838 56821
7730 56821 140563 134071 66841 30713 7962 -34533 -25992 -11939 4900 -84717 -163441 -199838
7718 -199838 -182219 -112460 -88084 -64544 -29810 -62046 -73677 -79009 -4091 -20388 -23974 4668
7706 4668 46171 145433 -2769 -45969 -49480 -72208 -44072 -92802 -96913 -38633 14011 120235
7694 120235 41910 -72297 -74152 -31150 25609 32585 21939 -11860 32971 34611 78414 32061
7682 32061 44262 81616 50482 55470 73064 3486 -109183 -132170 -81236 -84117 -119219 -113229
7670 -113229 63835 71700 -9535 -2645 14337 -107001 -55743 -69632 -105659 -91380 -151923 -56017
7658 -56017 78548 81031 51670 100111 70958 14937 -26972 -113899 -185507 -172776 -112956 -62413
7646 -62413 -40006 7387 18395 33099 111840 157829 124819 90845 68380 44343 45983 99109
7634 99109 92871 -3403 -33906 13461 73790 75588 53131 -13789 -25021 -40311 -2247 -136999
7622 -136999 -109298 44052 69280 52391 63954 94389 -5348 -10246 22867 -28344 -47744 -41431
7610 -41431 95 -35018 -3925 -52712 -83319 -115436 -90752 -47815 -76940 -98407 -80208 -81441
7598 -81441 -25290 -17353 -2588 -80072 -142194 -98278 -136385 -144201 -113928 -23221 -31946 -22924 30726
7585 30726 -26624 -48474 -66324 -155209 -223862 -208379 -133895 -67354 -5992 15383 -53365 -57013
7573 -57013 -5302 53868 23612 55984 100699 50231 18714 52077 99054 71950 22567 4190
7561 4190 -84976 -143656 -121447 -120032 -20002 87310 12846 -18679 -28426 -102680 -37473 42941
7549 42941 44807 -74860 -80212 15506 45511 78366 121529 44113 42873 107326 123663 110810
7537 110810 91288 61318 53803 154047 176774 115434 59328 83886 82983 79032 18877 -55853
7525 -55853 21356 -16645 -64142 -85143 -49733 -59172 -79954 -118346 -152644 -53377 -88207 -57311
7513 -57311 -46280 -137259 -142055 -111574 -162571 -149893 -164908 -193006 -218768 -231357 -135652 -31872
7501 -31872 -29858 25598 49688 33769 59121 -14637 -78781 -29080 -74144 -184550 -103139 -81930
7489 -81930 -169530 -150451 -87689 -55064 -125340 -130200 -122830 -146673 -113567 -26534 -24199 -107000
7477 -107000 -59800 -107800 -109501 -89396 -163999 -144147 -109041 -136134 -139956 -73792 -22395 -32165
7465 -32165 -36818 26725 42596 36763 -14379 18581 -12128 -46203 -82337 -97558 -103333 -35622
7453 -35622 -28011 -30658 65548 55932 -7211 7115 40779 31319 -13600 -75582 -106262 -159564 -117631
7440 -117631 -72456 -15624 15586 16188 33695 24647 28912 -19191 -89577 11336 96643 74049
7428 74049 23847 -36210 -4424 78675 1391 -6954 11665 62776 -963 -4900 -35719 -50043
7416 -50043 -118242 -113950 -112724 -121031 -58662 -28359 -87065 -119712 -10925 116833 116996 152745
7404 152745 50916 -44987 -25913 -20627 275 6343 -25955 -68294 -98212 -76860 -15938 -12965
7392 -12965 -49157 5365 -27265 -55411 -7450 -14916 12905 3654 -12245 -90535 -172696 -98440
7380 -98440 -33809 -78682 -114080 -148295 -118135 -122105 -126624 -61755 -41043 -33841 -89724 -107192
7368 -107192 -62589 -99633 -187048 -151330 -37711 42758 6119 -122470 -205533 -110019 -14855
7357 -14855 -129892 -229857 -212400 -137647 -97313 -181830 -238696 -204526 -116936 -48529 18125 22890
7345 22890 25657 45854 69820 23282 -64661 -71743 -24492 -47337 -6505 -21127 -58185 -100376
7333 -100376 -119920 -115541 -126079 -222383 -242300 -123870 -35468 24185 26627 35302 65486 79483
7321 79483 10005 -66695 -101207 -113237 -48986 -24258 1983 50749 62785 92628 53030 19155
7309 19155 45132 129380 135615 78544 44049 50661 36429 69040 94089 91178 113839 82803
7297 82803 78404 36473 51850 103314 134384 70542 39673 26423 41218 126108 136289 85277
7285 85277 -16248 -49598 -66419 -28480 -24009 -2017 9362 29072 15932 16229 44395 59134
7273 59134 81066 27743 -82715 -132832 -125994 -143327 -101651 -74833 -50816 10870 37460 39943
7261 39943 -2927 -34472 -13499 51489 39354 4290 28105 53029 38643 33537 38469 78640
7249 78640 132815 123354 79762 166132 158787 199483 240722 158268 70899 29046 27802 51913
7237 51913 30321 -67727 -208804 -187286 -56357 11833 40263 70669 81153 107752 62028
7226 62028 56593 85467 89870 85929 91926 -2144 -37010 41777 -17309 -9503 84225 116659 3403
7213 3403 -30307 17301 -41774 -116896 -148357 -59653 -28100 -6770 -56430 -52343 -14388 -56774
7201 -56774 -126408 -45844 51747 25345 21284 14948 8254 16164 24674 45301 8283 50800 38011
7188 38011 72278 60371 -21088 -32654 -74931 -105145 -105853 -101616 -144845 -83295 -40939 -71390
7176 -71390 -49676 81068 101958 23594 8497 -21910 13701 18108 -69683 -102966 -139141 -167085
7164 -167085 -130155 -166948 -69667 -57040 -119999 -178849 -147321 -161757 -72487 -7334 -12207 -4276
7152 -4276 -44517 -47415 -83449 -23361 54679 -13630 -85677 -34293 -92943 -113898 -45920 -35824
7140 -35824 -48393 2958 -13406 -37512 -1888 -261 -39365 -47808 26708 231 -30738 49711
7128 49711 86436 27469 -27308 -86556 -81788 -164283 -78717 1168 11231 7928 -26264 -32404
7116 -32404 40816 22779 -56040 -50702 -53259 5071 51497 4422 -11837 -66748 -56178 43176
7104 43176 39579 87715 -49599 -135048 -57179 28886 52647 5010 -37460 4495 -3525 -26663
7092 -26663 -69913 -120579 -75672 9233 15718 10757 24937 21923 57687 6543 14260 23679 1073
7079 1073 59784 107579 119960 96024 55668 38848 -11342 -11159 -42686 -44688 -38628 -32239 -22200
7066 -22200 -103568 -59613 36478 83299 59359 34880 -51256 -21615 -23400 -43522 -4902 104695
7054 104695 100104 66725 -8105 -24757 -101093 -141890 -71595 -112474 -186400 -165730 -181285 -201004
7042 -201004 -216497 -104004 -21985 -1315 -34694 -92197 -128226 -162911 -116123 -159169 -168467 -115300
7030 -115300 -148069 -138616 -111448 -12063 62141 137700 130446 85305 117586 53737 21466 26114
7018 26114 -118782 -198625 -211323 -247474 -152820 -19906 44020 -38826 -71746 -148076 -103369
7007 -103369 18887 28202 -19589 -51323 -29403 -40109 51203 75711 98888 88639 105009 63682
6995 63682 150277 148518 75546 48231 18970 -7917 44473 88539 114513 73374 67560 -19335
6983 -19335 -80480 -108653 -115005 -72312 -52693 -102118 -111257 -47399 -44266 -26763 18195 11859 29861
6970 29861 35710 -48149 -5571 21488 -33697 55801 90108 -5381 -108919 -35870 767 -86987
6958 -86987 -131322 -110700 -64197 -63646 -44748 -45296 -69999 -19270 11947 21882 51015 45168 -64055
6945 -64055 -32394 6931 26528 -3693 -34238 -130598 -177729 -159697 -94613 -62425 -120371 -128909
6933 -128909 -121164 -67665 -79611 -71800 -82466 -100267 1434 75168 96510 59999 -7497 -62927
6921 -62927 -24584 38294 64578 30222 -4868 -36853 -82237 14720 64429 53257 23290 -7807
6909 -7807 16243 53051 20789 -3085 -44124 -72204 -8599 20629 121714 163943 181721 120936
6897 120936 60628 -53250 -141935 -90443 -112088 -97429 -123369 -111812 -12189 233 -2175 -21276
6885 -21276 -79276 -66755 -68692 -36671 -13858 -4306 52 -95675 -36060 94247 59197 119594
6873 119594 81161 49143 24807 8319 55756 39826 23029 -57295 -134113 -198038 -105633 -35614
6861 -35614 -39168 -28179 -1687 74685 82521 68887 34562 -434 -44686 -76257 -137003 -165350
6849 -165350 -99190 -14676 -35513 15808 19914 -44458 -91032 -22100 -17130 -7977 8466 72974
6837 72974 165930 85926 15977 -20648 -76858 -25342 65288 100268 138636 125741 108739 48581
6825 48581 75488 108991 27181 27066 84795 45377 -7100 23376 49420 47565 47618 94064 133882
6812 133882 99113 51008 -98110 -148358 -185643 -183288 -158376 -140159 -41290 94633 144820
6801 144820 73212 54620 45476 79669 49117 -28261 -10132 -25388 -46817 -69374 -91928 -87599
6789 -87599 -73986 -53115 -51909 -20710 114111 83243 101508 27402 113539 238959 222325 172033
6777 172033 47495 -65486 -34324 -81551 -108217 -94996 -56711 46970 35661 -39364 -68805
6766 -68805 -68451 -32747 42064 100424 78931 -18338 -20282 -13070 7680 18242 67646 106410 180776
6753 180776 104268 105017 20754 4746 -917 -26883 2812 19844 -65145 -85413 -53103 -64916
6741 -64916 -16758 -49774 -98056 -147000 -159753 -97419 -127550 -150993 -148965 -88050 -28805 -48124
6729 -48124 -54322 5121 27193 51396 1887 -12378 -42980 -554 -24188 -76502 -73410 17803
6717 17803 94700 157991 186244 197532 125756 -25580 -94504 -84566 -102136 -47341 -27669 -43904
6705 -43904 -46058 -39520 -15249 35537 3701 -23659 -20150 -60982 -12484 -53119 -86760 -126225
6693 -126225 -131742 -65014 -50102 45297 65013 77803 86797 44360 -4474 -22662 -4650 17868
6681 17868 58848 103099 25874 -17062 -14689 -2104 29775 66154 11012 -45666 4647 103070
6669 103070 121185 143801 61526 28101 -37182 -74831 -77175 18937 101096 96674 75687 67611
6657 67611 25394 -12549 -76125 -68734 -103496 -83405 -30218 -4527 -56250 -80504 -12596 -60812
6645 -60812 -135090 -180405 -224584 -223265 -275869 -278234 -253118 -130481 -84318 -86367 -39426 -107522
6633 -107522 -165331 -41218 14539 104391 84430 153651 155371 108977 37035 33900 -43123 -17523
6621 -17523 63066 56474 26057 19151 3166 -27698 -64225 -20908 -11195 -77709 -28848 66965
6609 66965 19900 -60536 -3622 28395 59126 40265 -19188 -14242 43685 -46224 -87114 32198
6597 32198 62394 31825 -21898 -110842 -190443 -223964 -191132 -133379 -28476 -32909 -22802 -47718
6585 -47718 -56718 -106884 -128044 -122321 -5653 59920 54729 -7369 -64121 -92920 -136003 -144680
6573 -144680 -164565 -139930 -100449 -68667 -65118 -72508 -4257 30588 63038 55714 28183 57526
6561 57526 101350 121017 55630 16016 15813 11113 -36631 -54511 -13608 -2760 54823 95854
6549 95854 46622 54626 -26312 -56345 28164 34724 9886 44838 124765 187403 173247 136947
6537 136947 125018 88091 51376 -6391 -55321 -21519 -25668 -30578 -30229 -14714 -58796 -61253 -97065
6524 -97065 -82584 12757 75413 81464 79973 135499 190643 115280 73493 115173 130827 76886
6512 76886 73718 104836 60657 5979 -121753 -58071 19029 56119 56551 57273 4236 -37393 -39962
6499 -39962 -5290 57934 31654 18377 -20109 -33257 15481 30501 56275 15807 -20379 60757
6487 60757 -22133 -140152 -156143 -100413 -48384 -73653 -89168 -90127 -130703 -98644 -103573 -1525
6475 -1525 -4600 -24152 -19600 50204 13912 3627 33737 85445 58907 -121108 -217211 -185064
6463 -185064 -152600 -146559 -159007 -132655 -167761 -181240 -66735 6187 -13230 -17133 59739 48880
6451 48880 -82666 -142987 -22729 24076 -66131 -89749 -43263 20241 -2832 25112 65850
6440 65850 131382 91351 70303 97209 129906 79013 29020 18621 23033 -20198 -12342 118323
6428 118323 217260 215490 168279 128263 82237 33095 46361 99795 162197 91634 -36033 -45271
6416 -45271 -58796 -6615 41570 -8346 -117580 -126341 -13782 -33668 15039 87999 83703 -7794
6404 -7794 -69347 -34067 -19303 -49435 -63901 9616 59597 78850 -9646 34758 -4410 -109645
6392 -109645 -58281 19022 -31163 -79330 -31884 7222 -69870 -90498 -60775 -19521 79738 130418
6380 130418 51305 -20856 -60779 -91853 -54805 24808 -46675 -52867 19341 56162 40903 32656
6368 32656 -55798 -61681 -74951 -64149 -107784 -117787 -105698 -82023 -92396 -149913 -151216 -89263
6356 -89263 -62465 32713 -31269 -102475 -164323 -155147 -141997 -107309 -94542 -177237 -185793 -163268
6344 -163268 -132280 -150560 -162170 -47225 56877 10796 -79550 -94384 -93714 -89619 -23012 2728
6332 2728 51116 34633 11400 73173 39523 -4728 -10647 -4666 -25052 5583 11109 -2181 22075
6319 22075 -21844 -84293 -140481 -140069 -132509 -145156 -198526 -110261 -38881 -48274 -64061 -25301 -3499
6306 -3499 15966 44342 1211 -42956 -88308 -37753 63051 62844 27223 -43675 -19596 48153
6294 48153 41781 3346 -47972 -42817 -13163 17175 52557 349 -104260 -210420 -244066 -196653
6282 -196653 -205717 -188661 -101023 -105281 -88922 -57400 26028 69762 115238 154475 123715 85054
6270 85054 -5884 -83295 -109391 -18518 78804 99477 96426 81361 46767 26445 52334 50295
6258 50295 12767 -18539 -79842 -119180 -42998 -36986 24627 14779 23005 -39206 -1490 20534
6246 20534 37866 87110 71130 66885 20477 -4687 -2960 -41521 -46040 -128123 -124574 -2888
6234 -2888 29025 5376 -67626 -90181 -78708 -28023 2258 35397 -11921 -119073 -127339 -75960
6222 -75960 -44239 27255 73353 165553 108637 6148 -20289 20973 39615 -9007 -64197 556
6210 556 60106 -18119 -76374 -132554 -152115 -120963 -74025 -89056 -36817 10826 57190 69407
6198 69407 64572 -9415 -32788 -58433 -52279 -3264 -22215 -15208 -75625 -131514 -65285 -72459 -76670
6185 -76670 -123266 -90766 31638 74341 119980 139319 95120 29502 -6379 -28717 -90487 -54386
6173 -54386 -7574 -46341 -66242 -51386 -123334 -136556 -53504 15281 -12291 -39901 -54899 -63152
6161 -63152 -69048 -133504 -6706 56306 52407 -3833 -6913 -9714 -8744 -68062 -117811 -93699 -103522
6148 -103522 -158262 -193378 -125792 -200934 -240898 -190500 -166486 -186029 -143140 -108777 -130815 -172378
6136 -172378 -165276 -145175 -61555 2247 -32352 -70697 -102692 -92279 -94747 -66781 -126199 -68364
6124 -68364 45889 24388 3357 -3736 33262 58250 -36692 -111384 -123690 -64097 -45631 -38464
6112 -38464 -6962 -2979 8692 -48779 -49241 -35199 13204 43403 74631 78652 62105 -10616 -36473
6099 -36473 -38666 13062 124315 87648 -5058 -51056 -126187 -58285 -44665 -108944 -146516 -106280
6087 -106280 -98359 -24184 64851 65461 68934 -25743 -61325 -76457 -67721 -88274 -160959 -98861 -116596
6074 -116596 -171230 -144458 -49420 -11993 -2886 31603 77574 48140 73395 54728 -25141 -108980
6062 -108980 -185472 -179476 -84101 -25087 -37357 -5277 13775 -77543 -81539 -11632 11563 -37851
6050 -37851 -22915 15284 79354 138272 53910 -25063 -12632 62404 106467 44459 54783 -11529
6038 -11529 -85661 -46138 -23751 -43487 -86380 -25579 26225 44076 74959 74081 20022 13075
6026 13075 -32028 -88135 -60499 -72668 -46930 59677 63976 43410 1875 42851 -62083 -136413
6014 -136413 -90233 33871 36523 -106631 -175809 -99059 -104752 -139771 -59201 -78402 -150604 -116045
6002 -116045 -102050 -13501 20972 51638 83383 53072 99329 54335 21466 10329 -23457 -36338
5990 -36338 -47207 -41770 -61536 -134530 -144771 -109579 7763 81383 78903 92543 58364 8939
5978 8939 22485 -3411 26251 16044 31930 30551 -2207 -50653 -44258 -70449 -4799 -39343
5966 -39343 -151130 -186035 -100504 -65530 -37324 66059 86672 11815 64320 -15494 39100
5955 39100 121812 94247 39956 66150 134267 70104 68954 75749 32800 -4555 -16981 -50921
5943 -50921 -110372 -87343 -47366 -21314 -25804 -61178 23218 54959 93436 142538 73739 54244
5931 54244 67119 52047 72583 71773 104146 78516 46525 40039 -50884 -48855 -48658 -60252 -49859
5918 -49859 12826 87963 119417 117813 119194 14054 -23099 63261 113975 93402 44739 121521
5906 121521 75967 -2487 -52694 12714 90567 135150 100580 22838 -32912 38308 52363 4634
5894 4634 40655 68840 74350 31401 -63389 -53881 -12255 22753 37437 2120 88104 37276
5882 37276 -19970 -20007 -10256 23394 18595 70689 69334 28805 90090 56475 55697 16680 6969 -12853
5868 -12853 -27690 -50939 -40975 -43182 43931 118250 43447 -8242 -68480 -67732 19455 40322 13650
5855 13650 -1905 20866 27506 -25851 -58170 -10940 77230 133786 70273 44028 -25829 -155495
5843 -155495 -211325 -165750 -120713 -55419 -26539 -33970 -35598 -31650 -48386 2446 8044 49358
5831 49358 157680 64188 -12653 -13263 43954 25288 51826 167744 62418 -60088 -112952
5820 -112952 -73537 -87248 -99311 -94674 -67897 35788 112135 -6511 -64307 -58005 -48899 17964
5808 17964 34431 50124 31879 90623 95647 81730 117116 62246 118352 162264 110932 99496
5796 99496 143930 79531 10354 51217 68534 110054 169615 123442 98583 105610 153975 117285
5784 117285 23618 -90679 -125313 -157287 -151461 -42619 -38799 -108615 -30044 -4427 -33989 -110782
5772 -110782 -67648 -53950 -157283 -114842 -45908 15798 15691 -58466 -58909 -24231 -121650 -113589
5760 -113589 7299 56479 73812 52071 -1550 -67864 -45106 -51535 39703 93791 68540 46988
5748 46988 33405 -69335 -93330 -88079 -67370 -76307 -47883 -59624 -61730 -75360 -64003 -47622
5736 -47622 196 111512 123948 100767 -15089 -100660 -49615 -3931 36176 46252 -19325
5725 -19325 -40704 5146 11348 -52943 -136027 -147155 -174340 -101950 -106694 -107214 -81793 -41578 -79593
5712 -79593 -106792 -87478 -97635 -157677 -155983 -105992 -149959 -187552 -228462 -265271 -242593 -143473
5700 -143473 -125102 -55766 -92713 -97995 -13628 29982 41551 -179 -55056 -22962 48612 100306
5688 100306 46232 -90076 -83101 -141213 -171250 -225707 -192317 -96286 -88478 -85766 -36092 19835
5676 19835 29202 73727 127963 71505 58335 67209 52896 102101 62917 87467 48339 -21221
5664 -21221 -26487 -23194 -58564 -59677 -29735 -3338 105666 79751 -14451 -27665 -9030 -39642
5652 -39642 -20139 -25088 -3081 -4445 -19651 2370 22548 -30581 -39216 5382 38231 16439
5640 16439 46657 155358 193167 90326 -29111 -93662 -153860 -207150 -166495 -174557 -164132
5629 -164132 -87051 -41294 -88385 -15970 86705 23092 -41922 -54385 -97873 -59965 -32457
5618 -32457 -86356 -23114 65636 -38065 -54622 -43260 -10706 7255 -11026 75895 98977 24784
5606 24784 -56103 -137315 -135747 -134640 -66358 -84866 5912 55894 25663 -11459 25144 40756
5594 40756 40219 11722 -41775 -37751 -11671 8491 22557 -23074 -89806 -63882 -52301 -77160
5582 -77160 -88781 -21607 -58477 -157883 -77737 -10981 -60415 -47666 54834 109724 102586 56829
5570 56829 90856 198362 176522 128643 163448 119459 67431 46861 -34224 -109361 -141164 -116640
5558 -116640 -107909 -102872 -125249 -103286 -52632 -20566 -31223 -12801 30462 -31996 -52641 35445
5546 35445 133530 30229 -77961 -119433 -87095 -97244 -74099 -20847 75590 321 -15977
5535 -15977 38101 54547 71338 58183 22419 -8008 68138 117732 15059 -38941 -73924 -105329
5523 -105329 19683 119731 60928 9970 18655 18724 87357 118335 32039 -28141 -54822 -43907
5511 -43907 -73174 -90554 -35606 25539 39410 33664 48040 -10620 -57822 -103486 -139230 -162058
5499 -162058 -174562 -161931 -66584 -37765 -138288 -192098 -76678 3096 -12158 -23971 -61583
5488 -61583 -166267 -279903 -307210 -273726 -283595 -209689 -129871 -55162 -16852 -95389 -121494 -99678
5476 -99678 -122735 -205483 -180350 -27890 -8274 -14468 -46616 -6957 17198 59317 52465 -22914
5464 -22914 -32949 29770 77700 12214 -142936 -193748 -164191 -108814 39777 141555 78992
5453 78992 45201 26098 7911 -12339 26392 67690 106047 2986 -70269 -62246 30110 113539
5441 113539 88476 16037 -46969 -21528 -5735 617 73353 41096 -17484 7413 42766 36594
5429 36594 62601 -22364 -96675 -55930 24340 108600 118296 126553 130286 33715 -6211 -751 -61277
5416 -61277 -60457 7700 33034 -28053 -92905 -95981 -119445 -85719 -75457 -35458 -44554 -136118 -197774
5403 -197774 -95693 -976 3399 -24961 28055 129558 224014 245594 235606 256258 199086 71994
5391 71994 -22421 -154422 -165130 -84419 -58404 -57921 -87659 -93316 -145636 -113444 -98299 -57092
5379 -57092 -127123 -155010 -189894 -183044 -184339 -166478 -135551 -107751 -81899 30084 -24844 -99241
5367 -99241 -92836 -81276 -143930 -157922 -58424 -21845 31686 1999 -33595 -1632 2883 28731
5355 28731 77893 59420 26657 10051 9810 -7318 8935 4928 -24074 -60286 13028 7299 -32400
5342 -32400 -71762 -82634 -98233 -139346 -67991 -106840 -194974 -155805 -40836 -8471 -27501 22674
5330 22674 75059 42759 22784 40975 54995 39999 -46363 -113739 -14528 121997 131457 -11023
5318 -11023 -108219 -75160 -53078 -35172 -105783 -134740 -41330 19888 57909 23191 -39430 -16196
5306 -16196 -62534 -95223 -78966 -25950 55958 85865 22432 48620 70525 58365 105916 111870
5294 111870 39423 -97251 -47802 31376 2720 -32567 -64390 29828 20984 130673 183500
5283 183500 123940 86566 116917 159217 69702 -36597 -38214 33201 -3124 -44962 -55244 -79432
5271 -79432 9996 59448 -8374 55329 84000 39268 41029 87303 73455 136330 127683 145949
5259 145949 115561 29124 -24968 -39518 -14599 -8217 53876 58590 25372 32088 25656 -27437
5247 -27437 -38697 2892 57608 63473 37293 11309 62648 80087 129804 124667 71749 38053
5235 38053 -7507 -40008 -183 -271 -64047 -51124 -35926 -26323 -66713 -8550 45865 16967 -86026
5222 -86026 -155769 -188309 -130410 -15289 -1286 101842 156926 97770 56087 30381 -37088
5211 -37088 -70637 -39960 -101498 -105558 -109990 -97492 -42613 -48661 47633 35546 36524 -21846 -104323
5198 -104323 -175163 -131503 -43994 13697 2403 -86881 -69660 -36891 40336 93837 46863 115078
5186 115078 115570 82239 85304 -974 -44943 -61381 -46365 -125841 -190933 -148179 -82651 41512
5174 41512 33355 62426 -19436 9858 29679 -165 -2581 -53209 8962 67556 43579 -48585
5162 -48585 -61312 -15212 -54971 -82924 -19158 -20493 -36164 -86330 -129816 -82601 -43629 -31098
5150 -31098 28456 -44655 -37833 -7858 -57713 -154932 -133724 -93589 -36141 -34992 -70015 -120971
5138 -120971 -165315 -187418 -172225 -85781 -9930 -5938 36448 42524 86961 101624 92861 707
5126 707 -12001 724 -9434 -32982 -77640 -10736 3953 -4603 -53915 -53999 36185 41438 50140
5113 50140 155688 107704 -4170 24127 42235 -27636 -39955 -35273 28891 -24044 6904 5923
5101 5923 -30520 -62356 -22752 46566 34927 -50473 -59309 -60355 -78931 -37723 -14525 -16107 -15905
5088 -15905 18916 79872 132439 53721 42421 -29586 -94933 -56397 30149 16382 -15943 30784
5076 30784 23729 10743 42302 27031 -55663 2705 77571 114566 62488 -44170 -70111 2237
5064 2237 99369 153568 65811 679 27924 -21260 -37710 42331 37661 15775 98216 89016
5052 89016 18510 42903 46419 70884 98795 173978 160810 109951 22585 -7807 -23745 -24786
5040 -24786 -65824 -95816 -43847 -48247 -40242 -8908 42950 -43309 -136729 -140375 -19008 9455
5028 9455 -4787 -39336 -114322 -121446 -95415 -65090 -24596 24694 17476 -23354 -45119 -37804 -24983
5015 -24983 -5549 15746 10337 29082 6310 -77327 -81648 -69842 -19745 6953 6715 5984 -27774
5002 -27774 -51438 -119922 -93483 -63236 -5535 97594 134188 80858 -9461 -18711 789 3535
4990 3535 5471 -17597 -17165 46085 147038 144199 98978 33958 15213 -19277 -96426 -43927 28943
4977 28943 24251 -17307 33829 30503 -31654 -50556 7398 -21213 -65718 -73292 -69237 19015 85068
4964 85068 61352 16540 -26467 -64828 -124038 -115529 -65623 -57133 -42520 -11586 -62661 -67542
4952 -67542 -59082 -81935 -99868 -19156 11002 -26496 -45701 -50789 -57601 -90354 -159272 -208966
4940 -208966 -142292 -116418 -106742 -28500 29292 32255 3412 -16819 -16487 15994 49974 57993 123063
4927 123063 110263 148897 143493 80056 35045 27759 58495 -40353 -87030 -147717 -145745 -100160
4915 -100160 -98016 -102785 -125741 -85626 57497 74836 -66322 -163588 -192395 -127270 -45157 -28044
4903 -28044 6591 57803 62219 44160 97813 180334 151615 35136 -97110 -153832 1657
4892 1657 26338 -48366 -75642 -142353 -82543 -35719 -73091 -139982 -166665 -52990 18747 20667
4880 20667 -14470 -19175 -22587 10027 91728 71913 78416 33683 -48523 -90641 16394 80138
4868 80138 116881 117954 22449 11249 73761 164656 99624 131542 72455 -10554 -25111 -27983
4856 -27983 -55383 -16407 32010 31362 37006 -22490 -83616 12329 100215 97964 68125 91591 91105
4843 91105 67603 100725 127005 176726 155967 89136 126956 189545 78633 -37468 2790
4832 2790 23242 -49646 -27600 32701 119126 34710 -46285 -52769 -118213 -52131 8078 34518
4820 34518 11433 -78320 -109369 -118422 -118350 -112220 -26694 73266 64506 -51083 -126312 -115724 -70284
4807 -70284 -20327 -91874 -141483 -117491 -87756 -93815 -99575 -117941 -121431 -86236 -78607 -36719 -12420
4794 -12420 27032 18233 12697 -60750 -162188 -120567 -123062 -93465 -77658 -69775 -102965 -92735
4782 -92735 -91053 -126953 -89564 -44591 -21452 -15974 -66305 -3183 -6346 -88013 -65651 -61254 -80625
4769 -80625 -130434 -43422 -18607 -97409 -192549 -122104 40178 31553 -89492 -99899 -61871 -52765
4757 -52765 -96681 -36965 -68998 -99749 -3621 -27588 -54379 -731 -1134 -32677 -35017 -115055
4745 -115055 -101907 -53999 -31238 923 41957 13274 -10586 -1604 62172 79328 77252 70918
4733 70918 52008 63000 42543 78930 135970 68580 140738 181654 98490 -27693 -16690 31975
4721 31975 -14010 -23484 56538 68816 -61893 38547 206224 223646 86430 -8313 1309
4710 1309 66349 90825 -177 8286 -24934 -71807 -11056 35238 -5214 -25425 -31766 -93758
4698 -93758 -9626 47455 13299 24903 43648 39103 -26654 -70925 -97682 -153242 -55367 -65898
4686 -65898 -95792 -126038 -76942 -16663 -110312 -140099 -97506 -47826 -151860 -144326 -178306 -172126
4674 -172126 -68952 33727 144102 196085 124196 136312 145471 59355 953 14488 -35304
4663 -35304 -120473 -84827 -34675 65370 -46918 -135820 -159998 -98974 -32728 -39066 14841 110537
4651 110537 74165 -28012 -58504 -94613 -187054 -182954 -175797 -136418 -98331 -55561 -75391 -19487
4639 -19487 29778 30869 102015 82042 71249 89818 61052 -25818 -56726 -44352 -53085 -37019
4627 -37019 -62604 -25200 -5874 -14521 -55259 -19115 77690 128635 201235 186608 184071 177622
4615 177622 172986 120672 82686 65421 28483 -50830 -103819 -131169 -84003 -40447 68668 120894
4603 120894 36923 -59721 -84876 -102561 -112507 -75318 73626 128616 85472 -8013 -34436 -6336
4591 -6336 70465 124285 123172 85124 49410 -10319 -90786 -111718 30470 51798 -32728 -18878
4579 -18878 72702 103416 155422 98506 28139 -116278 -144024 -142335 -32872 34849 21548 37851
4567 37851 -6083 -57334 -57458 -68547 -109078 -172960 -145534 -35011 -36082 -53763 -31279 -37388
4555 -37388 -78757 -154405 -164935 -261518 -215698 -144885 -123053 -43680 -81050 -93395 -89148 -66456
4543 -66456 -753 46461 7298 19098 -20153 -14296 -16062 -54474 -96089 -61104 -50769 45082
4531 45082 -6852 -15630 6953 -51079 -28686 43029 68287 37921 -9765 -20402 21672 -1058
4519 -1058 -110579 -190535 -159558 -65619 -112606 -78514 -52081 -54609 -124793 -119906 -107137 -78766
4507 -78766 -64234 -49501 -36263 -20931 117488 152317 46666 -5058 -19044 23699 -18867
4496 -18867 -1442 14909 -95034 -30445 44951 -39510 4027 44605 26309 23082 -16386 -49578
4484 -49578 -84137 -112889 -83253 -54734 -67528 -50322 -7486 -5844 -58164 -81588 -30251 -33221
4472 -33221 -19937 -44023 -79866 -21230 13551 61130 -16008 21185 87026 24841 27412 60689
4460 60689 109483 95844 31590 -13997 -35448 -39141 -2450 21298 13074 18628 -51448 -76485
4448 -76485 -44671 -7391 -44462 -10350 22844 51564 4118 7163 45526 16465 -10539 2560
4436 2560 34577 38809 51621 32492 -21895 -32376 -11914 -19241 2639 -46969 13964 102883
4424 102883 84172 50872 -41506 -52104 -104344 -110211 -40546 25736 51015 40959 93086 145740
4412 145740 167133 150577 115428 123629 98183 41556 43437 43724 73945 75799 90735 88595 116631
4399 116631 112497 132478 1086 -80683 -16147 57408 10425 -42598 19524 63646 43413 -4315
4387 -4315 -4376 50315 5105 -77177 -42609 -58944 -91710 -18698 -4659 40164 35385 8929 -43209
4374 -43209 -11882 65096 67371 17211 -38088 -80175 -21475 -16867 -8132 23086 40978 65619
4362 65619 130535 63143 57430 64661 45706 14487 -19504 -21145 24677 54200 -13378 -68271
4350 -68271 -42449 -50730 -12379 57415 -650 -17814 92203 99044 54461 32512 -5485 -47448
4338 -47448 -30709 -33183 -81949 -89897 -92891 -79975 -21422 65257 20508 -3526 84905 174724
4326 174724 197878 123169 91065 107097 122878 85740 49147 32325 61131 66886 112093 182126
4314 182126 118649 51179 11513 70011 118128 172225 125104 117434 146927 155050 68751 -16676
4302 -16676 -54079 -44280 34050 114940 111867 57912 44208 4543 66802 45786 32334 61608
4290 61608 71021 38955 67377 152813 199942 98320 10056 84451 69199 111630 193432 252555
4278 252555 210042 130309 3009 -9652 16256 36875 84053 41737 -82114 -57987 29864
4267 29864 6425 -46320 -134085 -181401 -94999 -21031 5771 -359 21715 63531 11063 40396
4255 40396 37962 16036 67469 8370 -35328 -57881 -60052 -80885 -84839 -3694 19497 -5206
4243 -5206 56502 21952 -14841 -36198 7904 -15440 -11304 12326 8958 -15104 -50990 -20416
4231 -20416 -15970 -32965 -14745 -29423 -18626 -34189 -80337 -2951 -6681 -90067 -33590 102000
4219 102000 98878 20901 -88800 -60169 15000 14659 -1373 4585 48421 47752 -2060 -7244 41516
4206 41516 67199 78233 67574 89826 54982 31296 117088 49104 -52546 -100651 -112849 -82465
4194 -82465 -83582 47359 175079 175380 164206 73404 -7608 -17029 9632 18070 11568 -72094 -57867
4181 -57867 57917 57956 3169 40809 46106 22110 -8743 27671 -3476 -58884 -65288 -23323 -18182
4168 -18182 -38518 -74629 -88343 -72021 -118855 -121156 -81942 -54118 -46858 -60328 -47254 -27697
4156 -27697 9375 27720 1320 -23280 -62074 -66066 -143882 -134210 -77266 -47653 -3242 11406
4144 11406 67639 127161 102777 47530 17703 -74410 349 74870 -88128 -137189 -107519 -96618
4132 -96618 -48108 -39765 22558 -42575 -22464 -16802 -12773 -29226 -40682 -47129 -122244 -183468 -113896
4119 -113896 -92735 -114659 -71475 -30234 6889 6566 17892 1407 -24443 2312 58985 31259
4107 31259 33811 1290 -54250 16030 23811 -71858 -131790 -93697 -103550 -116024 -52449 -28005
4095 -28005 -59687 -69955 -49039 -80625 -419 23534 2698 -26821 -23462 -49863 -54626 36176
4083 36176 28155 25227 10557 56153 -13821 -35 50720 128100 100013 84844 17865 -37409
4071 -37409 -11660 -20684 7736 24569 35361 -23909 21795 -6581 23312 48329 -44635 -91937
4059 -91937 -57857 -27830 -63813 -139395 -72096 -62521 -50641 31562 35385 -9882 46921 33796
4047 33796 32400 -28800 4427 21663 83845 64866 -68304 -165323 -147091 -69842 -108208 -61238
4035 -61238 -9329 -23984 -54592 -86975 -163152 -130785 -70580 -16991 10403 64318 23798 -49125
4023 -49125 -79854 -51537 -101438 -166238 -54186 33626 4637 -36092 4704 126249 152746
4012 152746 115709 74073 51373 41999 26620 -16421 -109694 -145242 -111070 -55293 -38927 10720
4000 10720 45404 59231 17680 9612 2213 17628 27498 12451 -38695 -164042 -144666 11989
3988 11989 25591 13761 15379 65981 60955 26947 28330 -48417 -125919 -115763 -140731 -127163
3976 -127163 -120267 -143158 -127494 -101469 -76463 -17194 -7079 20474 26317 -19275 74543 118360
3964 118360 78140 32745 -13888 -36197 3357 8811 44150 110703 148608 166761 177552 213314
3952 213314 224408 148766 154720 86677 100832 126690 88532 15946 40279 138437 118984 68037
3940 68037 15062 24914 64997 117101 113463 79038 28591 -26475 -42018 405 8001 33618
3928 33618 2861 -23722 -95785 -51075 -56144 -128113 -55126 -69802 -30424 -41881 27631 119145
3916 119145 95212 109036 26194 -59911 -11878 -5870 -36191 -40655 -15201 32203 43511 118686
3904 118686 174847 107939 -5011 -65899 -23046 82068 29871 45355 28522 39609 91593
3893 91593 92101 61563 69613 140898 137521 204454 166852 97449 37645 -6685 -81087 -4313 49763
3880 49763 54012 143124 201682 182159 141227 36864 -65324 -40154 -14403 45688 85538 104235
3868 104235 154275 84818 -20082 41168 106792 98131 155537 118856 34680 -62834 -28741 -9210
3856 -9210 -28910 -28836 -2844 -19181 -78300 -31257 -4510 15757 -10590 -14043 -28543 -19541 55365
3843 55365 123803 95969 -7417 55811 57170 89931 88127 92222 -98 -90077 -145198 -147894
3831 -147894 -57115 64187 159558 195802 146239 56575 14534 51352 76350 36576 -19842
3820 -19842 -87686 -53429 -10524 -41368 -23581 53448 -11927 -409 7038 -22411 -36070 -63684
3808 -63684 -31528 25199 65860 -895 -45975 -117762 -82332 -34024 -39852 15511 83242 17773
3796 17773 11344 40303 53189 61972 63292 35556 -38956 -42342 8755 106977 35089 -11961 -73711
3783 -73711 -89000 -40386 -54450 -79422 -84540 -124206 -181079 -216833 -210350 -181687 -84039 -34639
3771 -34639 18401 21826 -14145 -17003 -20552 85200 82349 69359 140569 144981 109206 51672 -17117
3758 -17117 -51685 -3519 -31650 -52812 -30805 39851 186576 213205 149461 37738 12160
3747 12160 -33536 10730 -2351 16472 2528 -3255 -34070 -34297 -5680 -4729 -29107 48383 64398
3734 64398 31402 64647 -7113 -15179 3352 -13897 -44790 -107227 -208279 -208175 -118727 -114952
3722 -114952 -68996 41653 29108 -76561 -155966 -157581 -151165 -19682 121615 99390 130141
3711 130141 103818 106500 66 -25926 21930 75805 94971 122983 98552 59961 19430 -20488
3699 -20488 78279 99887 132286 58717 11253 42124 34513 29596 -35696 -15175 -36578 -38039
3687 -38039 -31958 -79888 -33846 37811 9272 99149 81146 176 18681 -51853 -66780 -94175
3675 -94175 -113451 -53408 -60010 -35073 31558 100661 41479 45620 88774 129132 90033 127482
3663 127482 73552 5394 17799 27813 48852 59131 59932 17739 16491 22359 12531 -5357 -43373
3650 -43373 -36862 -32200 -99152 -112013 -85524 -132861 -39351 51989 54372 157873 100714 4465
3638 4465 26095 26864 -55038 -33348 41634 112852 79492 18824 -73817 -137930 -151177 -84730
3626 -84730 -100970 -194460 -189595 -118528 -93387 -33089 -54637 -67997 -82856 -35308 -7699 -62033
3614 -62033 -88033 1554 95289 32193 -71181 -142944 -142738 -175989 -140857 -121014 -91271 -120566
3602 -120566 -108307 -59926 -52480 38508 68552 130550 43629 -12404 -53330 -99406 -122800 -122912
3590 -122912 -121551 -121626 -50473 61882 46023 63088 76055 48759 -907 23535 -1779 5933
3578 5933 23880 42052 60917 80690 58888 44010 64481 65696 37412 31632 -44697 -114321
3566 -114321 -71704 -149557 -222229 -94546 115793 188039 198106 162467 87648 104062 157964
3555 157964 40574 -75159 -21271 34430 61910 38667 51447 32819 77358 20445 -21452
3544 -21452 12829 36655 102790 64488 35390 32698 4465 -39078 -82137 -23209 -16879 -57216
3532 -57216 -72533 -22151 47232 11619 -73708 30269 114673 199617 172083 130232 182372 166286
3520 166286 184221 200626 189307 155767 136930 19852 -86837 -48675 -65490 -85195 -104078
3509 -104078 -42600 -55016 -78843 13934 87016 20648 49166 73909 60076 27680 16674 17621
3497 17621 -1401 -57126 37986 -16217 -25858 3941 31863 16927 -29399 -34389 33942 55162
3485 55162 116201 86711 -60780 -91454 -177982 -202135 -121050 -42478 35637 60306 113705 47490
3473 47490 34079 50410 74361 178670 166441 205471 199667 35251 -85742 -97152 -56650
3462 -56650 -156387 -200103 -215104 -180992 -86531 -65037 -39981 -35357 25554 60386 1951 -54909
3450 -54909 -29099 30107 68392 74127 66303 101204 78040 61972 -25275 -82893 16407 119859
3438 119859 160463 174231 169312 130478 -4448 -78472 -96535 -6785 -13422 -50378 9450 78662
3426 78662 32180 33376 118032 126283 41285 14898 23764 105123 125509 116027 69280 -4781 -19964
3413 -19964 -60379 -117397 -129486 -68888 -76041 -23890 -34245 20731 36834 -64629 -131637 -25467
3401 -25467 -38206 -141192 -140951 -57356 -60265 -75579 -112421 -82628 -1217 -36400 -12887 -20333
3389 -20333 18923 46765 24290 23941 -6958 23178 67803 -42417 -102576 -56477 -36556 -27829
3377 -27829 31337 171012 157915 94300 68703 55170 -13019 -21640 39881 55029 5798 -46134
3365 -46134 -12901 -19658 20301 43868 103556 117098 91209 80445 85708 61225 51340 32472
3353 32472 -34291 -65212 -95860 -64140 17057 100223 181130 124920 9975 17348 -98891 -186441
3341 -186441 -148299 -150078 -35184 51161 3033 36879 1695 -57563 458 -5308 -55608 -40758
3329 -40758 -43863 -61500 -8951 56754 35678 12072 -22604 -86367 -45399 -24404 -45337 -27737
3317 -27737 -8673 -10789 72273 55678 19795 -37544 -67584 -51791 -72115 -19048 51465 20626
3305 20626 -52459 14742 35666 -6222 -72431 -56894 -24991 6257 -49259 -90202 -19127 6978
3293 6978 -47840 -52304 -26637 -97346 -123113 -59835 6801 29078 -35361 -109229 -104766 -75420
3281 -75420 -44350 1922 9149 -30732 -75852 -106796 -94881 -74238 -69067 -112051 -121283 -96666
3269 -96666 -116912 -71108 326 26331 34170 21409 -4333 -67073 -113909 -157445 -99984 -171057
3257 -171057 -154238 -104892 -38917 75545 143686 194695 203374 141868 85172 50496 -17997 -43797
3245 -43797 -34724 -15005 23760 55671 1569 -70252 -56954 26343 21668 22266 56104 66721 -4016
3232 -4016 -62714 -58260 7487 23219 7050 8602 -51036 -88233 -87603 -35257 -67809 -101775 -95352
3219 -95352 -4498 -2149 11139 56121 12907 -44787 13595 37370 -39690 -62070 -31253 -43296
3207 -43296 -1880 -56947 -47618 -85778 -59314 14162 15233 31133 96384 59729 -14619 -5572
3195 -5572 -35947 -53900 -9503 -15712 1050 -33349 -72455 -60530 -44738 -58627 -104823 -71806
3183 -71806 -31085 -38250 37630 7036 38546 125887 152574 94208 -13775 -54675 5156 5956
3171 5956 -11675 20021 -40528 -26571 13421 14257 -54051 -119767 -52361 37644 129840 105884
3159 105884 23515 -45562 35323 146731 100976 -19346 -93941 -40685 -31853 -3807 -38634
3148 -38634 -43755 -27234 -23487 47727 39910 86044 51196 38840 17227 97049 185137 156389
3136 156389 103098 72719 54079 55087 130012 178216 159961 33708 -115237 -98483 16903
3125 16903 69466 85140 85226 71223 -15883 -93770 -104281 -65704 28597 51230 -3730 -17227
3113 -17227 -68813 -109529 -83336 -72187 -86172 -80677 -98231 -90802 -74555 -111174 -76945 30334
3101 30334 88021 65720 4840 -34664 98111 198281 69671 -4294 49870 1646 -46167
3090 -46167 38670 112602 153242 199080 152839 127312 121897 12068 -52486 -6869 102775 57705
3078 57705 18270 -28600 10473 76957 111438 143156 125885 50264 24479 2790 -17272 24208
3066 24208 16902 5757 13808 69788 95514 72203 27570 60995 42382 42210 122753 180154 82376
3053 82376 -48533 -65366 -10483 -27771 -65379 -125333 -132816 -123315 -119060 -113730 -14050 48448
3041 48448 -47909 -98317 -35842 43590 72904 149728 121846 59554 51397 23301 14210 7239
3029 7239 23866 -10130 53791 55426 26451 28706 -50521 -27392 33165 42834 17564 3831 30895
3016 30895 10954 -57076 -57960 -29435 -15898 23561 52503 5429 2941 19640 94935 136766
3004 136766 97485 11183 -22179 -16468 -96651 -131776 -139133 -13857 27583 -54611 -98940 -140883
2992 -140883 -120779 -112722 -69824 -66285 -39911 -56201 -70621 -45422 855 73971 24842 -10882
2980 -10882 -30627 16076 8274 -61162 -65939 -54038 -31740 -73258 -154520 -82550 -10399 -2775
2968 -2775 -11752 -13317 -320 -27387 -69121 -23996 -43302 -69077 -90528 -21729 -8522 25831
2956 25831 69016 99731 90060 62670 24549 19931 37875 3722 17203 4860 -4709 22217
2944 22217 37902 -30010 -8347 -48311 -38706 -41430 -61607 -29373 -44854 -41829 -66968 -67476 -16493
2931 -16493 47579 10047 60657 -13436 -14406 45149 -16829 -75527 -75285 11732 -3908 -14082 11480
2918 11480 -63325 -25382 19846 95751 94186 57304 20729 -30790 -63655 -57567 -88040 -29856
2906 -29856 -21374 44718 69049 35993 -78789 -26777 80025 125652 27587 -64018 -61595 -23535
2894 -23535 1929 62468 36975 11662 5687 -43084 -89873 -112858 -105808 -83101 -45568 -11510
2882 -11510 -56908 -83487 -31659 -27094 -33947 -103655 -154755 -139704 -140135 -129660 -49954 -12675 -30972
2869 -30972 -37425 -87228 -36997 -66056 -90867 -84130 -89019 -64811 -73386 -84090 -57427 11303 45352
2856 45352 32395 56952 84767 63702 -14326 -91088 -67198 -8918 2544 -25437 -66248 -80721
2844 -80721 -60789 -53100 -125519 -175679 -188113 -180496 -118830 -48626 -53942 -33809 -131770 -131637 -32219
2831 -32219 18667 54368 9331 -44809 -76506 -172907 -169599 -123418 -129844 -108802 -114951 -104272
$$ [...]
##END NTUPLES=NMR SPECTRUM
##END=
