##TITLE=Analysis number 322724
Compound Code cd 10452
Project Code adrs
Chemist Name scafell
##JCAMPDX= 6.0         $$ Bruker NMR JCAMP-DX V2.0
##DATA TYPE= NMR SPECTRUM
##DATA CLASS= NTUPLES
##ORIGIN= Bruker BioSpin GmbH
##OWNER= nmr
$$ XWIN-NMR		Version 3.5
$$ Sat Oct 14 11:31:45 2006 GMT Daylight Time (UT+1h)  MAYBRIDGE\nmr@NMR_250MHZ
##.OBSERVE FREQUENCY= 250.131544655141
##.OBSERVE NUCLEUS= ^1H
##.ACQUISITION MODE= SIMULTANEOUS (DQD)
##.ACQUISITION SCHEME= undefined
##.AVERAGES= 16
##.DIGITISER RES= 18
##SPECTROMETER/DATA SYSTEM= dpx250
##.PULSE SEQUENCE= zg30
##.SOLVENT NAME= CDCl3
##.SHIFT REFERENCE= (INTERNAL, CDCl3, 0, 16.4422)
##AUDIT TRAIL= $$ (NUMBER, WHEN, WHO, WHERE, WHAT)
$$ ##TITLE= Audit trail, XWIN-NMR		Version 3.5
$$ ##JCAMPDX= 5.01
$$ ##ORIGIN= Bruker BioSpin GmbH
$$ ##OWNER= nmr
$$ C:\u/data/dgb/nmr/ADRS/300/pdata/1/auditp.txt
$$ ##AUDIT TRAIL=  $$ (NUMBER, WHEN, WHO, WHERE, WHAT)
(   1,<2006-10-14 11:31:19.35 +100>,<MAYBRIDGE\nmr>,<NMR_250MHZ>,
      <created by zg, POWCHK disabled, PULCHK disabled
       configuration hash MD5:
       49 4B E0 1D 92 C2 6B 37 9F E6 65 BC 52 41 86 1D
       data hash MD5: 64K
       A3 B4 A4 E7 BE 68 E0 A2 91 1A BE 41 A7 AE 07 AC>)
(   2,<2006-10-14 11:31:32.21 +100>,<MAYBRIDGE\nmr>,<NMR_250MHZ>,
      <Start of raw data processing
       ef LB = 0.3 FT_mod = 6 PKNL = 1 SI = 32K 
       data hash MD5: 32K
       F0 84 39 98 A8 29 5A E1 64 DC 57 45 87 9F A6 1F>)
(   3,<2006-10-14 11:31:37.03 +100>,<MAYBRIDGE\nmr>,<NMR_250MHZ>,
      <apk 
       data hash MD5: 32K
       F9 D8 8C 55 FA CD DA A5 DF AE 1B BA 2A CD 50 DB>)
(   4,<2006-10-14 11:31:38.98 +100>,<MAYBRIDGE\nmr>,<NMR_250MHZ>,
      <abs ABSG = 5 
       data hash MD5: 32K
       F9 0C 1E 71 9F A7 66 91 54 6D 57 5F B8 A1 19 22>)
$$ ##END=
$$ 
$$ hash MD5
$$ 63 2A F2 55 F0 32 74 83 75 09 10 E8 45 BD 40 71
##$RELAX= 
##$RELAX= 
##$RELAX= 
##$RELAX= 
##$RELAX= 
##$RELAX= 
##$RELAX= 
$$ Bruker specific parameters
$$ --------------------------
##$DU= <C:\u>
##$EXPNO= 300
##$NAME= <ADRS>
##$PROCNO= 1
##$TYPE= <nmr>
##$USER= <dgb>
##$AMP= (0..31)
100 100 100 100 100 100 100 100 100 100 100 100 100 100 100 100 100 100 
100 100 100 100 100 100 100 100 100 100 100 100 100 100 
##$AQSEQ= 0
##$AQ_mod= 3
##$AUNM= <au_zg>
##$AUTOPOS= <7 >
##$BF1= 250.13
##$BF2= 250.13
##$BF3= 250.13
##$BF4= 250.13
##$BF5= 500.13
##$BF6= 500.13
##$BF7= 500.13
##$BF8= 500.13
##$BYTORDA= 1
##$CFDGTYP= 0
##$CFRGTYP= 5
##$CHEMSTR= <none>
##$CNST= (0..31)
1 1 145 1 1 1 1 1 1 1 1 1 1 1 1 1 1 1 1 1 1 1 1 1 1 1 1 1 1 1 1 1 
##$CPDPRG= <>
##$CPDPRG1= <>
##$CPDPRG2= <>
##$CPDPRG3= <>
##$CPDPRG4= <mlev>
##$CPDPRG5= <mlev>
##$CPDPRG6= <mlev>
##$CPDPRG7= <mlev>
##$CPDPRG8= <mlev>
##$CPDPRGB= <>
##$CPDPRGT= <>
##$D= (0..31)
0 1 0 0 0 0 0 0 0 0.06 0 0 0 0 0 0 0.0002 0 0 0 0 0 0 0 0 0 0 0 0 0 0 
0 
##$DATE= 1160821878
##$DBL= (0..7)
120 120 120 120 120 120 120 120 
##$DBP= (0..7)
150 150 150 150 150 150 150 150 
##$DBP07= 0
##$DBPNAM0= <>
##$DBPNAM1= <>
##$DBPNAM2= <>
$$ [...]
##$SUBNAM7= <"">
##$SUBNAM8= <"">
##$SUBNAM9= <"">
##$SW= 20.6930455092707
##$SWIBOX= (0..15)
0 0 3 0 0 0 0 0 0 0 0 0 0 0 0 0 
##$SW_h= 5175.983436853
##$TD= 65536
##$TD0= 1
##$TE= 683.16
##$TE2= 300
##$TE3= 300
##$TEG= 300
##$TL= (0..7)
0 120 120 120 120 120 120 120 
##$TP= (0..7)
150 150 150 150 150 150 150 150 
##$TP07= 0
##$TPNAME0= <>
##$TPNAME1= <>
##$TPNAME2= <>
##$TPNAME3= <>
##$TPNAME4= <>
##$TPNAME5= <>
##$TPNAME6= <>
##$TPNAME7= <>
##$TPOAL= (0..7)
0.5 0.5 0.5 0.5 0.5 0.5 0.5 0.5 
##$TPOFFS= (0..7)
0 0 0 0 0 0 0 0 
##$TUNHIN= 0
##$TUNHOUT= 0
##$TUNXOUT= 0
##$USERA1= <user>
##$USERA2= <user>
##$USERA3= <user>
##$USERA4= <user>
##$USERA5= <user>
##$V9= 5
##$VALIST= <valist>
##$VCLIST= <CCCCCCCCCCCCCCC>
##$VD= 0
##$VDLIST= <DDDDDDDDDDDDDDD>
##$VPLIST= <PPPPPPPPPPPPPPP>
##$VTLIST= <TTTTTTTTTTTTTTT>
##$WBST= 1024
##$WBSW= 4
##$XGAIN= (0..3)
0 0 0 0 
##$XL= 0
##$YL= 0
##$YMAX_a= 463661
##$YMIN_a= -459167
##$ZGOPTNS= <>
##$ZL1= 120
##$ZL2= 120
##$ZL3= 120
##$ZL4= 120
##$ABSF1= 16.44218
##$ABSF2= -4.250992
##$ABSG= 5
##$ABSL= 3
##$ALPHA= 0
##$AQORDER= 0
##$ASSFAC= 0
##$ASSFACI= 0
##$ASSFACX= 0
##$ASSWID= 0
##$AUNMP= <proc_1d>
##$AZFE= 0.1
##$AZFW= 0.1
##$BCFW= 0
##$BC_mod= 0
##$BYTORDP= 0
##$COROFFS= 0
##$CY= 12.5
##$DATMOD= 1
##$DC= 0
##$DFILT= <>
##$DTYPP= 0
##$F1P= 14.0000005364418
##$F2P= -0.99999901652339
##$FCOR= 0.5
##$FTSIZE= 32768
##$FT_mod= 6
##$GAMMA= 0
##$GB= 0
##$INTBC= 1
##$INTSCL= 1
##$ISEN= 128
##$LB= 0.3
##$LEV0= 0
##$LPBIN= 0
##$MAXI= 10000
##$MC2= 0
##$MEAN= 0
##$ME_mod= 0
##$MI= 0
##$NCOEF= 0
##$NC_proc= -2
##$NLEV= 6
##$NOISF1= 0
##$NOISF2= 0
##$NSP= 0
##$NTH_PI= 0
##$NZP= 0
##$OFFSET= 16.44218
##$PC= 1
##$PHC0= -47.80269
##$PHC1= 4.75843
##$PH_mod= 1
##$PKNL= yes
##$PPARMOD= 0
##$PSCAL= 4
##$PSIGN= 0
##$REVERSE= no
##$SF= 250.130019962969
##$SI= 32768
##$SIGF1= 0
##$SIGF2= 0
##$SINO= 400
##$SIOLD= 32768
##$SREGLST= <1H.CDCl3>
##$SSB= 0
##$STSI= 32768
##$STSR= 0
##$SW_p= 5175.98343685301
##$SYMM= 0
##$S_DEV= 0
##$TDeff= 65536
##$TDoff= 0
##$TI= <Analysis number 999999
Compound Code 99
Book Reference 9
Project Code 9>
##$TILT= no
##$TM1= 0
##$TM2= 0
##$TOPLEV= 0
##$USERP1= <user>
##$USERP2= <user>
##$USERP3= <user>
##$USERP4= <user>
##$USERP5= <user>
##$WDW= 1
##$XDIM= 32768
##$YMAX_p= 322846516
##$YMIN_p= -172731
$$ End of Bruker specific parameters
$$ ---------------------------------
##NTUPLES= NMR SPECTRUM
##VAR_NAME=  FREQUENCY,     SPECTRUM/REAL,   SPECTRUM/IMAG
##SYMBOL=    X,             R,               I
##VAR_TYPE=  INDEPENDENT,   DEPENDENT,       DEPENDENT
##VAR_FORM=  AFFN,          ASDF,            ASDF
##VAR_DIM=   32768,         32768,           32768
##UNITS=     HZ,            ARBITRARY UNITS, ARBITRARY UNITS
##FACTOR=    0.157963299565203, 1,           1
##FIRST=     4112.68297010333, 0,            0
##LAST=      -1063.30046674968, 0,           0
##MIN=       -1063.30046674968, -172731,     0
##MAX=       4112.68297010333, 322846516,    0
$$ Real data points
##PAGE= N=1
##DATA TABLE= (X++(R..R)), XYDATA
$$ [...]
17688G7669p233p447n164n500n397n115p571q056K837O22q576J405K500k388o139
17673A6447j090q78k677R462K802l974l586J029M293P089O196m524m777n711j098
17658A9003J036n906M48m92k234k988K741L943M529q207n049K655j095j537K500
17643I347j31L858N256k912o997L145Q794L551p801r25J859j68P639R696J121
17628C5332J2778J3650J4280J8099K5931K9577K5678K8962L3312J8060K3812K8720
17616C08191K0208J3447N393M171P9J160o691j2446p991k0086k3150j9926j8799
17603B43560k3772l3034k9518k8242k2670j3213j4727j5933n901r168o314q317
17591C2751m345o82l62l030k392k851l458k763N666L351J695n458K106q576n374
$$ y = [77669, 70436, 62989, 57825, 52325, 46928, 41813, 34242, 26186, 29023, 29645, 21069, 22474, 24974, 22586, 16447, 15357, 14479, 11802, 21264, 24066, 20092, 16506, 17535, 21828, 28917, 35113, 30589, 25812, 20101, 19003, 20039, 14133, 14581, 14089, 11855, 8867, 11608, 15551, 20080, 11873, 6824, 9479, 8384, 6847, 9347, 9216, 13074, 18330, 15418, 8421, 11566, 20360, 23911, 16110, 15185, 17044, 16876, 24515, 34211, 35332, 48110, 61760, 76040, 94139, 120070, 149647, 175325, 204287, 237599, 255659, 279471, 308191, 328399, 341846, 347239, 351410, 351489, 352649, 345958, 333512, 325521, 305435, 282285, 262359, 243560, 219788, 186754, 157236, 128994, 106324, 93111, 78384, 62451, 56550, 47382, 41068, 32751, 28406, 27724, 27362, 24332, 21940, 19089, 15631, 12868, 18534, 21885, 23580, 18122, 20228, 11652, 6278]
17576F278M48m668l537L035Q790O364m54j594J890J138l339k600J271m090o998
17561A934J332L075L61N491m26K401m597l938P4K585J845J919L439O76o475n865
17545C831N472l25J205J146n497j913n80q77M9J229k728M9M679l087l25o204L992
17528A16N108l183n48m977l714p48K997k653O466O913l510m551P08j471L538M047
17512D538K20J452r69j437o234J283J683j520l327n28O628L66o585K197O287k766
17496A288j355K076J405M263Q85K931j178L022J98n381k800M234k676k952p39
17481C221R9L596L829L462o136j4540m55Q017L698j038J242J909n126N73J29J970
17465D450K784k291M481O514O928J4268K4741L7174M2499M9500L8762j8407p1539
$$ y = [6278, 6726, 2058, -1479, 1556, 10346, 16710, 16256, 14662, 16552, 17690, 14351, 11751, 13022, 8932, 1934, 3266, 6341, 6702, 12193, 11767, 14168, 9571, 5633, 5707, 8292, 10137, 12056, 15495, 16171, 9696, 3831, 9303, 8978, 10183, 11329, 5832, 3919, 3339, 2462, 2511, 3740, 1012, 1061, 5740, 2653, 2328, -3876, 116, 5224, 2041, 1493, -3484, -7198, -7946, -4949, -7602, -1136, 5777, 2267, -2284, -1576, -3047, 491, 4538, 4758, 6210, 5241, 3804, -2430, -1147, 536, -984, -4311, -4839, 1789, 2155, -4430, -2233, 4054, 1288, -67, 2009, 3414, 7677, 8562, 11493, 10315, 13337, 13535, 8154, 5354, 9588, 6912, 3960, 3221, 3320, 6916, 10745, 14207, 8071, -6469, -6924, 1093, 4791, 3753, 4995, 6904, 1778, 2351, 2480, 4450, 7234, 4943, 9424, 15938, 22866, 37134, 61875, 99049, 141548, 191048, 229810, 211403, 139864]
17452A39864n3508k7141j3850j1991n838l735l14J7063M401K974M747j2774q878
17439C1020l807r093r736%J842O0O64j919M930r508N64K274r282J886L730k261
17423A364J556LL466m96n106K341j50J000K53J602K398l034n513n259n8p100l725
17406a6458K68R764P34n878J839P259R823N96l834j187M654q142o371K680l031
17391g284P326J451q532J761M061J582M717j347r443J69O206L377j495n378k84
17376c113N129J299K78l469l555l184M497R318M99l610l933k196k92L806L111
17361D585L53k064l475R31K150L923o04o704j776j580R39J626o40P558P136j886
17345A0472j1017J672L435M657J67M33p897l363J08J514o116p351J297N849O889
$$ y = [139864, 86356, 59215, 45365, 33374, 27536, 23801, 23487, 40550, 44951, 47925, 52672, 39898, 31020, 27213, 18120, 8384, 8384, 10226, 10286, 10950, 9031, 13961, 4453, 5017, 7291, -1991, -105, 3625, 1364, 2920, 2923, 6389, 5893, 787, 3128, 2978, 3978, 4231, 5833, 8231, 5197, -316, -5575, -5633, -12733, -16458, -16190, -6426, -5692, -11570, -9731, -2472, 7351, 7947, 4113, 2926, 7580, -562, -6933, -4253, -7284, 42, 1493, -7039, -5278, -1217, 365, 5082, 3735, -5708, -5539, 667, 4044, 2549, -2829, -3113, 2016, 3315, 3593, 124, -3431, -6615, -2118, 7200, 7699, 4089, 156, -2040, -2332, 1474, 4585, 4938, 2874, -601, 330, 2480, 6403, 5799, -905, -2681, -4261, -3322, -1696, -2336, 5222, 12358, 10472, -545, 1127, 4562, 9219, 9386, 9819, 1922, -1441, -1333, 181, -5935, -13286, -11989, -6140, 749]
17330G49N495K137o01L94l325j348M76M086o657j87n911L53m07R713K664k155
17314E476o199o875M305R52Q02j995l82k172j818k503M851P536L687l748j905
17299A2K970L48o305q169K454m65k879R8J106m272J180R99r4J0152Q700R9p727
17282a793o836q73j298K618q94P34Q10M035L087K364p570n844K380N407Q390J971
17266F688p883p289L594J425L189K744l65o768J619L046O391j034l101n268J37
17251b875P123q24k118L641M97l486K050j811J742K033j474O187p73l997L253
17236I168j50l94K631k964m328k093N97p40R25j189L343K499n24p472m73j312
17220b476l410l142n472k990M828K924K902P768J857K734k489j669K214L054L489
$$ y = [749, 6244, 8381, 7780, 8174, 4849, 3501, 3977, 8063, 1406, 1219, -4692, -4339, -4746, 4967, 7631, 5476, -723, -7598, -3293, -2341, -1539, -3534, -3916, -6088, -7906, -10409, -5558, 1978, 5665, 1917, 12, 2982, 3330, -2975, -11144, -8690, -9155, -12034, -11936, -10830, -15102, -13922, -12923, -13017, -2865, 5835, 5934, -1793, -8629, -9502, -10800, -8182, -9076, -8342, -7532, -3497, -410, 1954, -5616, -11460, -9080, -3673, 4717, 6688, -1195, -8484, -4890, -3465, -276, 2468, 2103, -4665, -3046, 0, 6391, 5357, 2256, -3012, -2875, 4248, 3424, 1306, 4947, 5444, 1958, 4008, 2197, 3939, 5972, 4498, 10685, 9912, 5915, 9168, 9018, 8624, 11255, 8291, 3963, 1870, 2467, 1727, 2652, 1463, 4806, 7305, 6781, -691, -1164, -2476, -5886, -9028, -14500, -17490, -12662, -9738, -6836, 932, 2789, 5523, 3034, 1365, 3579, 6633, 10122]
17205A0122n887l562k226J407N851k801o491k017M014k456p491J020J257L453
17191e807O271M969J809K353j436j938l107r329q563J237Q799N611o87j812M185
17176B555K157o148L936r31l290m147l943M729j222P744N818k295j15J480n236
17161A092L33r601l763L397M567K052n482j93O356J745j516j672j661k916L095
17146d167k90j863k150O247O889j937K356L646P087k95q240j624r64Q488Q202
17131B1385q112n924l714l748k62J846M60K765J102O34M911n03r328l307J588
17116b07K589l015k502L684l45k103M709K025k817l488m622M01N240L306J443
17101D298j258l838P9J065J24j14L005L24N925N38l88p310j630l21l784M6j881
$$ y = [10122, 4235, 673, -1553, -146, 5705, 2904, -3587, -5604, -1590, -4046, -11537, -10517, -9260, -5807, 464, 5433, 7242, 9595, 8159, 6221, 3114, -6215, -14778, -13541, -4742, 869, 182, -1630, 2555, 4712, -1436, 2500, 1569, -1721, -5868, -9811, -5082, -6304, 1440, 7258, 4963, 4848, 6328, 1092, 1425, -8176, -11939, -8542, -3975, -1923, -7405, -7598, -1242, 503, -1013, -2685, -4346, -7262, -4167, -4457, -6320, -8470, -2223, 4666, 2729, 5085, 8731, 15818, 15523, 7283, 5659, 4695, 13183, 21385, 13273, 7349, 3635, -113, -375, 1471, 1931, 4696, 5798, 6432, 11343, 10840, 1512, -1795, -207, 2382, -633, -3135, 549, 204, -1899, 2810, 4835, 2018, -1470, -6092, -5691, -451, 2855, 4298, 3040, -798, -719, 346, 470, 356, 3361, 3685, 9610, 10148, 9760, 2450, 820, 499, -3285, -3239, -5120]
17084e120j801n627j65Q206O869K836m605n468m553j474L003j194M166K811J438
17069f78m979Q38O22R63j467J524K774J147l679j268N140M687k600J426L064K928
17053A0442J0183l150j2053n324Q10L113J718N346k619j991N93j1999j857l256
17039a0044j895K856M978N024P21k072l039j487M171L127p316J896J0377o157
17025A140m177j77Q99R07R2r42J292n331q63J511J570L619K219l603J959K6k720
17008b579J1572K688p93p300o405n380Q67M549M195n389m615k240K860R590l2
16993A588m730j743N698Q021J704n281j491o44k938K244j220o326l060L623M477
16978g8N02O689L882r052l545o8K930O20J980K110L337R06q30L60m270L77k550
$$ y = [-5120, -6921, -12548, -12713, -4507, 2362, 5198, 593, -4875, -9428, -10902, -7899, -9093, -4927, -2116, -678, -5657, -4819, -4197, -3234, -4701, -3177, -403, 744, -2935, -4203, 937, 5624, 3024, 4450, 7514, 10442, 20625, 17475, 5422, 98, 908, 4021, 5739, 11085, 8466, 6475, 7068, -4931, -6788, -10044, -11939, -9083, -4105, 919, 1640, -432, -3471, -4958, -787, 2340, -4976, -3080, 7297, 1140, -3037, -3214, -2315, -1408, -1316, -2258, -966, -6297, -7160, -5649, -4079, -460, 1759, -1844, 115, 141, -2579, 8993, 11681, 10888, 3588, -2817, -8197, -7330, -2781, 1414, -3975, -8590, -10830, -7970, 1620, 1588, -3142, -4885, 813, 8834, 10538, 5257, 3766, 3122, 184, 2428, 1208, -5118, -8178, -4555, -78, 424, 7113, 10995, 1943, -1602, -1670, 1260, 1880, 3860, 5970, 9307, 10213, 9383, 9743, 5473, 5850, 3300]
16961C300k715N68j284n401K35J0554K246p632L80K634n742j414K139L336K931
16946D135l565j352J32l901k625L605N019k037m777o980M132O418K770R506K38
16931A0718k914l259n40n37K624n98m148k428l426o350j151J298L939K300L6J358
16915c078q662l994o30L443K918O990j348o022J830K591K768J773m225R652m895
16900h89Q06P298n400J31M565o296L018N32k425M209j585l5n725j446N934q50
16884A842o985J255J536k18k478r62L490p260n992k584j550J078J913M757M420
16869g738J351Q081R3k490N298K110J412j599o098Q56L673l209j576n371p503
16854a2710J043M832K004J392q87j388K38n67L49M083k175o53K68m959j402L903
$$ y = [3300, 585, 1153, -131, -5532, -5297, 5257, 7503, -129, 251, 2885, -2857, -4271, -2132, 1204, 4135, 570, -782, -650, -4551, -7176, -3571, 1448, -589, -5366, -12346, -8214, -1796, 974, 10480, 10718, 7804, 4545, 4005, 3468, 6092, 5494, 1346, -1082, -4508, -10858, -12009, -10711, -6772, -4472, -4436, -3078, -11740, -15734, -16364, -12921, -10003, -3013, -4361, -10383, -8553, -5962, -3194, -1421, -5646, 4006, -889, -83, 7215, 1815, 1946, 6511, 215, 3233, 3765, 1340, 5549, 3964, 3929, -1796, -3242, 2692, 1842, -5143, -3888, -2352, -2570, -5048, -6010, -2520, -9780, -15772, -18356, -19906, -18828, -16915, -12158, -7738, -6387, 1694, 1787, -703, 4595, 6705, 8117, 6518, 420, 1276, 4949, 1740, 164, -5207, -12710, -11667, -6835, -4831, -3439, -4326, -5714, -5476, -6043, -5694, -1611, -3786, -4439, -4171, -9130, -10532, -6629]
16838f629l884K618K953q80m077L724Q26P073J464m414j677M517L549n717j223
16823a777l472l282L315l179O801K235m655j922j770N571L528M217M68q197o455
16808h574k164M123M916P188l345j0868m355l854M258M211o3M249k024m11p47
16793g460K307q56k3J719l469Mm667L447Q152p84l114L8m910m438p32K590L702
16776h494J686n69Q63K854M459l909j431K816j1304L861Q207k016K845N335O945
16761A2148r83o611l957l390L393l955L495R622k657k50p289m449M187O65%m77
16745e08n98L274j649j0929J602O828N37k415k010K845P145j052r754P61n66j524
16729h013M729O04j741J185K772K48j704k202k943N03O963M642J013k893j754
$$ y = [-6629, -10513, -7895, -4942, -5822, -9899, -6175, -5349, 1724, 3188, -1226, -2903, 1614, 5163, -554, -1777, -5249, -8531, -5216, -8395, -1594, 641, -4014, -5936, -7706, -2135, 1393, 5610, 6078, -2119, -8574, -10738, -6615, -1699, 5489, 2144, -8724, -13079, -16933, -12675, -8464, -8527, -4278, -6302, -6713, -7460, -5153, -6009, -6032, -4313, -7782, -7778, -12445, -8998, -846, -1630, -4744, -4706, -9616, -14054, -14786, -12196, -8494, -6808, -7377, -6514, -3660, 799, -3110, -4541, -1725, -13029, -9168, -961, -2977, -132, 5203, 12148, 11165, 4554, 597, -2793, 600, -3355, 140, 9762, 7105, 6855, -434, -4883, -696, -31, -31, -508, -1106, 2168, 519, -10410, -8808, -1980, -1443, -3858, -5868, -3023, 4122, 3070, -6684, -5923, -6489, -8013, -3284, -2680, -4421, -3236, -464, -216, -1920, -4122, -7065, -6562, 401, 5043, 6056, 3163, 1409]
16714A409m840l280K49j417P053O10m93l39l780n697N292N597L183l178n148r899
16698a4678o70K129M000L220Q052L931j15O067K011J874j0122j0325n563j838
16684a2027O88M093R755P71m094m43K379r61J0210K167j513L023l465o534j237
16669B812N789l373k083J95k131k766L86j495l227M330m472k0J878J225o72N286
16653A662j863J339N26n041K957O87k207q75N46J689m032o949n882M444Q255O018
16637A274K98j441o400o89K972l825J442N383L880l085l639k845M737K826k188
16622a300j748P321m3m086l710l45R26l454j382K674L701J993K948J273n644q237
16606i113k545O992P407L806k200k152q029n227J666L375j112j666k985k54P726
$$ y = [1409, -3431, -6711, -6462, -7879, -826, -216, -709, -1048, -4828, -10525, -5233, 364, 3547, 369, -4779, -14678, -15348, -13219, -9219, -5999, 2053, 5984, 5869, 11936, 13947, 15821, 5699, -4626, -10189, -12027, -11339, -7246, 2509, 3280, -814, -1257, 1122, 161, 10371, 12538, 11025, 14048, 10583, 4049, 2812, 8601, 5228, 3145, 3340, 1209, -1557, -1171, -2666, -5893, -1563, -6035, -6055, -4177, -2952, -3624, 1662, -201, 1138, 1664, -3377, -420, 267, -1940, -2815, -2269, -580, -4612, -11561, -17443, -12999, -4744, 1274, 1572, 131, -6269, -6958, -3986, -7811, -6369, -986, 2894, -191, -3830, -6675, -1938, 888, -1300, -3048, 4273, 4230, 144, -3566, -3911, -2985, -6439, -7821, -5147, -1446, 547, 3495, 4768, -876, -9113, -11658, -4666, 2741, 6547, 4347, 2195, -5834, -11061, -9395, -6020, -7132, -8798, -11783, -12037, -4311]
16591d311O991J532k58L444K924p683j373J395m38q246j61o61L235k520j360l965
16575a1455O97N466M387k180k635K471L702k248p89O838L010k852n128l357l509
16560g582l36q87N537L109o821J545N838P966j170k093l386n140m266n241O27
16545a2300P087K191J458m050k232J009J375k463K054k779N074j182j875P000
16531C67L712m612L591k772n77r42J19J821N019o487r438J160L473J890J489K634
16515D47K581K846k237j471j549J664l359J712k68m094L779P193L074j860j0846
16500b388q901j279O610M471p667k834K689Q593q74J79r64n250k828N071j96o393
16484a1961J410l996l321K021J0101L805k559j10J135l786k786m207N078J0957
$$ y = [-4311, 2680, 4212, 3954, 7398, 10322, 2639, 1266, 2661, 2223, -6023, -6184, -6845, -3610, -6130, -7490, -11455, -10758, -5292, -905, -3085, -5720, -3249, 453, -1795, -2584, 4254, 7264, 4412, -716, -4073, -7582, -7918, -8805, -3268, -159, -6980, -5435, 403, 8369, 7199, 5106, 1720, -3420, -7686, -12927, -12300, -5213, -3022, -1564, -5614, -7846, -6837, -5462, -7925, -5871, -8650, -3576, -4758, -6633, 367, 4079, -533, 3058, 286, -291, -1233, -1114, 707, 5726, -761, -10199, -9039, -5566, -3676, -2187, 447, 3028, 5874, 3637, 2166, 617, 2281, -1078, 634, 366, -3728, 51, 7244, 10318, 8458, -2388, -11289, -12568, -5958, -1487, -9154, -11988, -9299, -706, -1580, -1401, -2365, -7615, -10443, -5372, -5568, -11961, -10551, -14547, -17868, -15847, -5746, -1941, -4500, -4610, -3475, -7261, -10047, -14254, -9176, 1781]
16470A781p223j893J060M665j059k999p62o252O95O183L288N970j2p094K614J804
16454G66Q935L492o526j258K633j306l346o20m08o269j525O102N84o040J043M82
16438c261k056J099q5j096j599J473K376R406N480O026K813k564j2255k163j227
16423B367m960N12j730k753N623J31r3j10J550M073m196k112m958M724K109p24
16407e47O109K379m952k225q511p659n048Q202N576R32O95j310J125k846K11L162
16391d707j4010J259Q023K185L307M786k46J151L158L886r16k531j0221l66k360
16376g602M05J478R820o110J898J400r761n539L114P055L7N236l076M63j058p819
16360a0059l156J858Q244N094P56l749k964K68O855m628j043N222j441J614J0607
$$ y = [1781, -5442, -7335, -6275, -1610, -2669, -5668, -6430, -12682, -11987, -5804, -2516, 3454, 3442, -3652, -1038, 766, 9701, 13193, 6667, 5409, 8042, 6736, 3390, 2770, 2362, -3907, -5432, 670, 1254, -4786, -3743, -3261, -5317, -4218, -4303, -5399, -6998, -5525, -3149, 6257, 11737, 17763, 20576, 18012, 5757, 3594, 2367, -2593, -2081, -3811, -6564, -941, -810, -903, -1013, 537, 4610, 414, -1698, -6656, -1932, 177, -547, 5562, 7941, 2989, 764, -7747, -15406, -20454, -12252, -6676, -5744, -5049, -6359, -5234, -8080, -7869, -4707, -18717, -17458, -9435, -7250, -3943, 843, 597, 1748, 4906, 8792, 7876, 5345, -4876, -5242, -7602, -7197, -5719, 4101, -2009, -111, 1289, -8472, -14011, -10897, -3842, -3805, 1431, -1645, -1182, -2240, -10059, -13215, -11357, -3113, 1981, 2737, -1012, -3976, -3708, 3147, -1481, -2524, 2698, 1257, 2871, 13478]
16345A3478Q3j369m495J989J790n2l163j145n476j967k47N61n028k378Q26l119
16329i712J683P357K844p283j08n03q062O020Q528j878j405K063M924k080j052
16314A336K663Q616P866K208l196r063r412n030k488O327N355M92J748M739l848
16299H313n027k642q16Q98N773L077J516O60N364r358l668M346K307q44k469o366
16283A064p439k879K734L855m58l126L91J521N746j731K726k274K009j80L94P98
16267C151j181j149L661j088j741N34l338N803J757J270l16m291l242q02L209
16252B237N315N333o772j2308k411L784K35L337k037J149L706o739q402K689O796
16237d088R62M783r35j95K983P57R98J048N18k903m011m998M989l006n14m630
$$ y = [13478, 13561, 12192, 7697, 9686, 11476, 11424, 8261, 7116, 1640, -327, -574, -13, -5041, -7419, -6593, -9712, -8029, -672, 2172, -5111, -5219, -5722, -13784, -7764, 764, -1114, -2519, -456, 4468, 2388, 1336, 3999, 12615, 20481, 22689, 19493, 10430, 1018, -4012, -6500, -173, 5182, 5674, 7422, 12161, 8313, 3286, 644, -172, 726, 6499, 9576, 11092, 11752, 17116, 7758, 4090, 8436, 10743, 9899, 7430, 1064, -6375, -9254, -6520, -2665, -3123, -6249, -5858, -4337, 1409, -322, 2404, 130, 2139, 1959, 2353, 3151, 1970, 821, 4482, 3394, 1653, 2187, -1151, 4652, 6409, 7679, 7363, 3072, -170, -972, 2237, 7552, 12885, 6113, -6195, -8606, -4822, -4587, -1250, -3287, -2138, 1568, -5171, -13573, -10884, -4088, -3126, 1657, 722, 527, 3510, 4267, 5265, 6313, 6831, 3928, -83, -5081, -92, -3098, -3612, -8242]
16221h242m50j979M696J250N62j127j728L111j256J111K520k894n50L793R32l472
16205c723P005P124k30r767r195K498O164P448K559n421o602L67M510p859j1117
16190a6239l04R491L051P16L75p85M720k107k394J887K963o462l274K65P95n750
16174a3052P26M744m447r54L360K767J78k526p808k795Q432N665o482n313N978
16159a1527R046R42j882J085k470q007J256L719K558J507P91k232l516K070n906
16144a2566K279P178j244p067j668J105R486J299l224m741M136k575m172J25M029
16129g620P59r27L274k233J179J175K037N722N352l501j097k623m268M83j279
16114c567q39m038O464O977j440J05K741j851j334k932m799m448J0205Q895k684
$$ y = [-8242, -8692, -10671, -5975, -4725, -4163, -5290, -7018, -3907, -5163, -4052, -1532, -4426, -4976, -1183, -251, -3723, 3282, 10406, 10176, 409, -8786, -6288, -124, 7324, 9883, 4462, -2140, -1773, 2737, -5122, -16239, -16543, -7052, -4001, -3285, -2910, -3695, 1025, -1082, -3476, -1589, 1374, -5088, -8362, -8097, -7302, -13052, -12326, -7582, -12029, -12983, -9623, -6856, -6678, -9204, -17012, -19807, -11375, -5710, -12192, -17505, -11527, -2481, -1539, -3421, -2336, -4806, -12813, -11557, -7838, -5280, -3773, -2982, -5214, -8730, -6660, -12566, -10287, -3109, -4353, -11420, -13088, -11983, -2497, -1198, -4422, -9163, -5027, -7602, -11774, -11649, -7620, -6861, -7788, -4514, -6747, -5568, -4393, -2356, 3366, 8718, 5217, 4120, 1497, -2771, -2288, -3567, -4406, -8444, -1980, 4997, 3557, 3662, 6403, 4552, 3218, 286, -4513, -8961, 1244, 10139, 7455]
16099G455m629J279l539j738K63M062M8k094k955L731P90j497K449l89p804l419
16083g987O880l204j56K042p640J386K152n63K522K430k021o302N779M302l788
16068d168k736Q43J349Q58M326M615J845j020n913N484l938p598j942J834K580
16053c581Q95o276M887J971o321J460M341m893l181J077J065O59r882p315J517
16038b3577J0176N119L972K468J007o349n408J943O051L975k083l819r4p063n743
16023a9425O847J569O957J228o52N7o689n540J7M333L884j188r9K921k844m583
16007a3207L311J3080L104k461o182J272P71O472j06J461l95l987l710P252M28
15992G103j930O25k575K020K896q50l671o612l909j18m464j713K973m830L56P099
$$ y = [7455, 2826, 4105, 566, -1172, -909, 3153, 3201, 1107, -1848, 1883, 2673, 1176, 3625, 3236, -4568, -7987, -1107, -4311, -4467, -2425, -10065, -8679, -6527, -7090, -4568, -2138, -4159, -10461, -4682, -380, -4168, -6904, -6061, -4712, -3854, 472, 5087, 6932, 5912, -1, 5483, 1545, -6053, -7995, -6161, -3581, -2686, -8962, -4075, -2104, -8425, -6965, -2624, -7517, -10698, -9621, -8556, -7897, -17779, -25094, -23577, -13401, -8282, -4310, -1842, -835, -7184, -12592, -10649, -4598, -623, -2706, -6525, -6619, -13682, -19425, -12578, -11009, -4052, -2824, -3476, -3419, -10108, -15648, -15631, -11298, -7414, -8602, -8701, -5780, -8624, -13207, -9896, 3184, 6288, 3827, -2355, -1083, -312, 6160, 6054, 7515, 7120, 3133, -577, 6675, 7103, 5173, 5798, 3223, 5243, 8139, 7289, 3618, -2994, -6903, -7021, -11485, -13198, -10225, -15055, -14699, -7600]
15976g600P174n125j0249L110Q544p13L031J0343L526p306l693L193M54k058k242
15961C89j25l964l588K095l035j701M027J593J616j326L778P26n028K546k563
15946d560m608K537O067k409p998M163m951p60L948N073j11j08R1l568n322N346
15930g170j021J582O173J456m250p352J595J0947M105J4m051q849m156q20N96
15915a1201N397p496k385N084Q362P096M343J213m170l577m646k444K734N674
15901C984j809j2363l97k2K542O981L814L092n602k493N36j26n910L694J717J218
15885a144k458k75m435n502j099Q962M815p30K021p923k643O130r30L176Q631
15870F596k244q089k220K649M468o214l833K095J97N652j464l198o051j1433L133
$$ y = [-7600, -426, -5551, -15800, -12690, -4146, -4859, -1828, 8515, 12041, 4735, 1042, 4235, 4689, 2631, 389, 264, -3700, -7288, -5193, -8228, -9929, -5902, -4309, -2693, -4019, -241, 485, -4543, -1997, -4560, -9168, -6631, -564, -2973, -10971, -6808, -11759, -12519, -8571, -3498, -3609, -3717, -3626, -7194, -12516, -7170, -8191, -6609, -436, 1020, -3230, -10582, -8987, 1960, 6065, 6079, 2028, -6821, -10977, -11797, -11201, -5804, -13300, -15685, -10601, -2239, 4857, 9200, 10413, 6243, 2666, -1980, -4424, -1690, 3984, 2175, -10188, -10585, -10607, -8065, -1084, 2730, 5822, 220, -2273, -1737, -1863, -7773, -4079, -2362, -1144, -3602, -3877, -8312, -13814, -14913, -5951, -1136, -1866, 155, -7768, -10411, -4281, -5211, -2035, 6596, 4352, -3737, -5957, -3308, 1160, -5054, -8887, -6792, -6595, -943, -2407, -5605, -11656, -23089, -19956]
15855a9956k91J870L192K463K726KQ62K006L276N508j365Q63J164j1304m26R356
15839e4k738j17J105N19R96m455J292N233J176l883o09j839j560Q26M544l815
15823c379l964p28M819k51L14l657l123K318O793j527J211p63J065J117n239K482
15807b512n999K165K688r94l307M513J874O450l084k381m792J737P536l317L16
15792H93K478m010K478J390n026m81J83J144M692L088j813n749k23N039p357j994
15776e268K280O68O1m94k269p4K320O933p703l777k032L369L974J993l492o68
15760d179j578k338L960K933j198m736O004K597j575p98M608O126M067o360m341
15745C192j746K644m10l210m258J256J560K157m236k277q289j427l682k492M965
$$ y = [-19956, -20247, -18377, -15185, -12722, -9996, -9994, -9132, -7126, -3850, 1658, 293, 1156, 2320, -8984, -9410, -54, -2792, -2909, -1804, -1285, -289, -4744, -3452, 1781, 2957, -926, -1535, -3374, -4934, -4108, 436, -3379, -7343, -8071, -3252, -3503, -3189, -6846, -9969, -7651, -858, -2385, -1174, -1937, -872, 245, -4994, -2512, -8511, -6346, -3658, -4652, -7959, -3446, -1572, 4878, 1794, -587, -5379, -3642, 3894, 577, 893, 3371, -639, 1839, 3229, -1797, -2278, -2095, -951, 3741, 6829, 5016, -733, -956, 4083, -3274, -5268, -2988, -2320, -2259, -2753, -5022, -5096, -2776, 4157, -3546, -7323, -9355, -5986, -2012, -19, -3511, -4179, -5757, -8095, -4135, -1202, -2400, -7136, -1132, 1465, -110, -908, 3700, 9826, 13893, 7533, 3192, 1446, 4090, 3680, 470, -3788, -2532, -972, 1185, -3051, -5328, -13617, -15044, -18726, -21218, -16253]
15730a6253P745P361j459j972N77j246k583k375J948n182Q50M426L382n43m70
15715e794J807M613l368o040J419R551L022q412R4P409j012n613K12N80M133M433
15699G034m672k469m63m216K63j711R9l391n122K509Q947K251m412j817o761L81
15683a3550j880O480K766J725K914J353K236j234m133p19L682L127J86l449J86
15668c10k461m98J124K610K691L572n457n913l520J045M017Q760M429m958j1630
15653f499p501K732J0021r94N373J515J189k033m811J569N100l83m282l364L419
15638A051M072j85o689p888M45K128L343R71K016K015l22m826L627M893k374n665
15622c388k783l132l286J742m192K789R894L760j793L575J25q242k73K989Q55
$$ y = [-16253, -8508, -1147, -2606, -4578, -4001, -5247, -7830, -10205, -8257, -13439, -12589, -8163, -4781, -5324, -5794, -3987, 626, -2742, -8782, -7363, 2188, 5210, -3202, -3108, 4301, 3289, -2324, -2112, -1532, 2601, 7034, 2362, -107, -570, -4786, -4523, -6234, -6135, -9526, -14648, -12139, -3192, -941, -5353, -7170, -13931, -13550, -15430, -8950, -6184, -4459, -1545, -192, 2044, 810, -3323, -4042, -360, 2767, 2953, -496, -310, -2771, -3269, -2145, 465, 3156, 6728, 1271, -4642, -8162, -7117, -3100, 5660, 10089, 5131, -6499, -14000, -11268, -1247, -2241, 3132, 4647, 5836, 3803, -1008, 561, 5661, 5278, 996, -2368, 1051, 5123, 4938, -1751, -9639, -9194, -7066, -3723, -2752, -736, 1279, 957, -3869, -242, 4651, 2277, -3388, -6171, -9303, -12589, -10847, -15039, -12250, -2356, 1404, -389, 3186, 3311, -4931, -5204, -2215, -1360]
15607a360L377J04n41o37m07O532l937L58L426n677K828k624J000J537j424k809
15591b54m90o107N434R062j368k876j511n973k048J3333K059o840Q80J56q182
15576d725m64O622K87n153k817N409j034o214j120j582Q80L169K706k460M673
15561a823J49r828q84K027o889O66R06M171K865k23N70N395L955o743l353J794
15545g245J375K454l679p654M09J1943L931o449K851O468l727o840L252N380j063
15530A406L739M554J992n749j206q7K131M283k431l631m922m591k934M95K460
15515d491M168O921K563q602n725J861P383J308m311n051m439k249K343K369M274
15500a678K587k238m587J996k832K651O880L91l651o268M593k387m434Q01q47
$$ y = [-1360, 2017, 2121, 1580, 943, 536, 7068, 3131, 3489, 6915, 1238, 4066, 1442, 2442, 3979, 2555, -254, -744, -6851, -1417, 7645, 6277, 3401, 1890, -4083, -6131, 7202, 9261, 2421, 3301, 3457, -4725, -5189, 1433, 1720, -3433, -6250, -841, -1875, -8089, -9209, -10791, -9911, -6742, -4036, -6496, -1823, -1674, -11502, -12386, -10359, -17248, -16582, -15676, -11505, -8640, -8863, -8293, -2898, 1057, -5686, -9039, -7245, -5870, -3416, -7095, -14749, -14340, -2397, 1534, -4915, -2064, 4404, 677, -6163, -2911, 2469, 1406, 5145, 9699, 11691, 5942, 4736, 4649, 6780, 11063, 8632, 5001, 79, -4512, -7446, -6951, -4491, -323, 6598, 9161, 559, -5166, -3305, 4078, 5386, 1075, -3976, -8415, -10664, -8321, -5952, -1678, 909, -1329, -5916, -3920, -6752, -4101, 2779, 3170, -481, -6749, -2156, -4543, -8977, -8176, -9023]
15485i023O439N840q15k502j717M129J6o639q751l032J347R503m394m822K937
15470a1484N490j326L081N817K003n871k644J538J361N42k199J134M942K289q86
15455C787J361j750R28p504K109L948L318J955k282k678k24K313P74N411n766
15440E700q583k088n246K403M346q20K944J761L452L214K360n162M597n390n790
15425b302n254J671O242Kp797m027L952k583o029L828O13K898K923Q419o022N025
15409A559j738q988R23M972k152k933N189P636n40m563j85L959K582q355m910
15394g544K760P66K266K724l936m451M33q953M014J58N135O261J969l52j701n015
15378e466k204J226J0239k476r523m49K905m302N34K120l538L123K07l317n004
$$ y = [-9023, -2584, 3256, 2441, -61, -1778, 2351, 2367, -4272, -13023, -16055, -14708, -5205, -9599, -14421, -11484, -5994, -7320, -4239, 1578, 3581, -2290, -4934, -3396, -2035, -1493, -3692, -2558, 2384, 4673, 3787, 5148, 3398, 4326, -3178, -1069, 2879, 6197, 8152, 5870, 3192, 2968, 5281, 6055, 11466, 5700, -2883, -4971, -10217, -7814, -3468, -4288, -1344, 417, 3869, 7083, 9443, 4281, 8878, 3488, -2302, -7556, -5885, 357, 359, -7438, -11465, -7513, -10096, -16125, -12297, -11684, -8786, -5863, 2556, -3466, 1559, -179, -9167, -8244, -3272, -5424, -8357, -3168, 4468, 3928, -635, -820, 3139, 5721, -2634, -7544, -4784, -4018, -1752, 972, -2964, -7415, -6982, -15935, -11921, -11763, -6628, -367, 1602, 1250, -451, -5466, -7670, -6444, 3795, 1319, -8204, -8653, -5748, -10050, -9516, -7396, -10934, -7811, -7604, -10921, -15925]
15363a5925J262K016J916l232k664k075P519J590R37N302N459j502l922P80r139
15348a1678L892O298L669l57m483j0190J898O12n883m733r10Q916K622Q56J279
15333h192m202L913P538L754O664J54n464j1102n646o81J109K921M775P772j074
15318B239l188K078N58J490m466k651k104k096O546j138r73N71P46oq33M422L49
15301A544j463J275K02L161j235p90j51o780j77l1K727O569j155q018l469K418
15285e373M294P64m35l133N46r245j19R947M328L127k359k584q24L036m579q209
15269a0818K921O336Kr0j633k915N036N907j361J710l845j255K656k998K125L131
15253D909N394r007r26M934j22m888l674N145N260O020J43l434j2948l278K188
$$ y = [-15925, -14663, -12647, -10731, -13963, -16627, -18702, -11183, -9593, -8656, -3354, 2105, 603, -3319, -2539, -11678, -7786, -1488, 2181, 1824, -2659, -12849, -10951, -10339, -16222, -20955, -21865, -12949, -10327, -9471, -8192, -12394, -8481, -943, 2811, 9475, 9629, 4165, -6937, -12583, -13264, -12155, -9234, -4459, 3313, 2239, -949, 1129, 1687, 3177, -1289, -3940, -6044, -8140, -1594, -2732, -3705, -3134, -2388, -2394, -3227, 1195, 1544, 81, 1356, 1558, 4719, 3484, 2694, 2543, -4237, -4414, -4445, -1718, 4851, 3696, -4322, -7791, -5373, -1079, -315, -750, -3883, -3337, -12582, -12701, -2754, 1574, 4701, 2342, -242, -1066, 1970, -2609, -10818, -7897, -1561, -1559, -1649, -3282, -6197, -1161, 4746, 3385, 5095, 1250, -5, 2651, -347, 1778, 4909, 10303, 1296, 370, 5304, 5182, 294, -3380, 1765, 7025, 13045, 13188, 9754, -3194, -6472, -4284]
15238d284j600m4k926p539j767M695K375K238L688R32N988K649K094p783l116
15223d400L080P064j837k808L824m381n252j1914J629Q751J541l75j061O22M021
15208a496J722P66k155j368j911J100J529M00M143n18j618j108l659p26J125N508
15192A734k389p00J082l539p813O558l132K651M07k982M447K65m157J284Q114
15177A830l534R308N977p83o960l138Q568J918n645l63K710l0r247l292j83L231
15161C67J517l630O12j741p737l984m8M094R01K753N321K329p735m259m92M45
15145a1287N112k742j619K577P94L647L455m75o930J6J055p51l68l584r288J265
15129a9123M723O379L159l805k469K540K232K803J926k206m892k292J806M137
$$ y = [-4284, -5884, -5928, -8854, -16393, -18160, -13465, -11090, -8852, -5164, -4232, 1756, 4405, 6499, -1284, -4400, -1320, 5744, 3907, 1099, 4923, 542, -4710, -16624, -14995, -6244, -4703, -5078, -6139, -5517, -1496, 226, 992, -1163, -2531, -4442, -3342, -1813, -1413, 2730, 2212, 594, -514, -4173, -4899, -3774, 1734, -655, -1355, -273, -3812, -11625, -5067, -8199, -5548, -5141, -8123, -3676, -3411, -7568, -6284, 1830, -1704, 7604, 13581, 12798, 5838, 2700, 11268, 13186, 7541, 7178, 9888, 9858, 611, -2681, -2864, 367, 1884, -1746, -1134, -2875, -10612, -14596, -14644, -10550, -9649, -6896, -1575, 754, -6981, -11240, -11732, -11287, -6175, -8917, -10536, -7959, -7165, -3518, -63, -538, -7468, -7452, -6397, -7148, -7516, -11100, -20388, -19123, -14400, -8021, -4862, -8667, -11136, -8596, -6364, -3561, -1635, -3841, -8733, -11025, -9219, -5082]
15115e082L222l311j52O32p669p69R80M366R121L044j019j510l921m152J832L566
15099h22l066n210k392J446O824N436j118o704l075N006L373m46j419m850j786
15084h803p40K757O234l30k928K286l697o595J980K340K351M929R17j889L72Q021
15068G205K163m22k475p969n922q58O506P977m462j425M249K754K713J71L145
15053A3350m835k58k007o128J890p546k006k42L266l65p37j796P087k701l921
15038f949L388K209j662l495n366l722L362N562M538k007p147R57j683L62L869
15023g784l231m41P778J293J166j78L5K635k498j0K342j044L9L72q887k169L695
15006f887J034Q188O062n123n141L087N413k709J87j908q099o192K061P674K858
$$ y = [-5082, -1860, -5171, -5323, -4691, -12360, -13129, -12149, -7783, 1338, 4382, 3363, 1853, -2068, -6220, -4388, -822, -3888, -9098, -11490, -10044, -3220, 2216, 1098, -5606, -8681, -3675, -302, -748, -2167, -7017, -8803, -9543, -6786, -552, -882, -3810, -1524, -5221, -11816, -9836, -7496, -5145, -216, 701, -1188, -816, 7205, 9368, 8946, 6471, -1498, -7420, -8278, -1772, 6205, 1743, 318, 4567, 7321, 10034, 10205, 13350, 8515, 8257, 6250, 122, 2012, -5534, -7540, -7782, -4516, -4881, -5618, -7414, -327, -3028, -6949, -3561, -1352, -3014, -6509, -11875, -15597, -12235, -6673, -2135, -4142, -11289, -10332, -12015, -11653, -7784, -11015, -11456, -3678, -2385, -1219, -1397, -1362, 1273, -1225, -1235, 1107, 63, 102, 474, -8413, -10582, -6887, -5853, 2335, 8397, 3274, -1867, 1220, 6633, 3924, 4111, 2203, -5896, -12088, -10027, -2353, 505]
14991E05O02J4425Q034m53K718N229J0993J1128L0443N1077O4807P7026O7681
14978C44215K0604r0099j00963n3113l2647k4240j5792j7169r716r334q825k792
14966A29Q024l071n582J191k95m47L686j736J643J113o75m021r801N335P684J550
14950D727n629l849J568M524k624j375q80O282l567J310J358k071O96O669N754
14935A2893J261l080k123q323n11L061n564K081L128J501q512n548O004M689L215
14920D172l840M912J511K74k604P57r99M833l27m036K96k511n113k899l739J910
14904g403p66J465M345M660p17p73L064N210m262q026l007P260N185l786p195
14889d746j0n833J123O308M80k796j65k632J77M409j137q93j809O640K332m38
$$ y = [505, 1107, 15532, 23566, 23113, 25831, 31060, 42053, 53181, 83624, 134701, 199508, 276534, 344215, 364819, 274720, 173757, 120644, 87997, 63757, 47965, 30796, 21080, 11746, 2921, 129, 8153, 5082, -500, 691, 396, -51, 3635, 1899, 3542, 4655, 3980, -41, -9842, -4507, 3177, 4727, -902, -4751, -3183, 1341, -1283, -2658, -3538, 2744, -823, 487, 1845, -226, 470, 7139, 12893, 14154, 11074, 8951, 628, 117, 3178, -2386, -305, 2823, 4324, -4188, -9736, -3732, 957, 4172, 332, 5244, 6755, 7029, 4425, 5182, 4183, 9016, 8689, 4653, 4949, 2438, -2675, -5574, -9313, -7403, -8169, -6704, -2359, 2301, 1584, 811, 3875, 9085, 4823, -3203, -6210, 1050, 6235, 2449, -4746, -4756, -10589, -9466, -3158, -2678, -5474, -5639, -8271, -8094, -3685, -4822, -5715, -7524, -884, 1448, 1010]
14873A010j268r75m960k240Q55j148M50k124J818N292L760Q05n79l585j6855J192
14857a8552N541P57j097N381N338n696l751M872O065K967q756l372o8QO705k252
14841e910k102n706O494P008j78l660J395o36k71q069l133N547k49n00L792M975
14825a203J115R64m432l248n757o89K512k825m126j223P176j672K010R512j567
14810c453m34k160o609M82M878l122M513j027k589N745L056k416q91M370K344
14795B687J418m591m720n763J262L839O330P6m457m71l148k575J081M033m84J578
14779c905M198p520r360j740O380k321L399Q592j212q62l674q024n87Q463N851
14764b322J672J956k226l622J786k02l336j000J548M321K085P664P266j258p312
$$ y = [1010, -258, -1233, -6193, -8433, -7578, -8726, -8276, -10400, -8582, -3290, 470, 1275, 696, -2889, -19744, -18552, -13011, -12254, -13351, -7970, -2632, -8328, -12079, -7207, -1142, 1825, -6931, -10303, -10371, -10363, -3658, -5910, -8012, -13718, -7224, -216, -394, -4054, -2659, -3295, -3566, -11635, -14768, -9221, -9470, -9970, -6178, -1203, -88, 876, -3556, -6804, -12561, -13250, -10738, -13563, -17689, -18912, -11736, -13408, -11398, -1886, -3453, -3887, -6047, -12656, -12174, -7296, -10418, -5905, -6932, -9521, -3776, -720, -3136, -4027, 343, 2687, 4105, -486, -5206, -10969, -9707, -5868, 462, 538, -3919, -4390, -7538, -10113, -9032, -4999, -5483, -3905, 293, -7227, -16587, -18327, -11947, -14268, -10869, -2277, -3489, -4351, -8025, -16049, -16636, -8173, -2322, -650, 1306, -920, -4542, -2756, -2958, -6294, -7294, -5746, -1425, 660, 8324, 15590, 14332, 7020]
14749G020k559k161O08j115J163K592l380j014K711k063p4K0n086j994l124n00
14733h956L490o46m994L819O779M784k103n56O31o23p252l818n185n903l660N008
14717a9185J405N073J1721J472N448r99j052J394k803p752q95J720j53l946m09
14702h961M872P241N749j146p320n108k687J653p36m332O107j085M01L80K446
14687b526l301j500J660L539P24o095J935K35m738N085K136K826L710k344K33
14672A579j209n348j179O459m482J182M413n768M50P51L102K848m738j319ol321
14656f586j260j125K421Q37M117P454L560m204p094l830Q2N935J24m921l802N569
14640b723M677q304k931l170O591J148m024j205O042L441R91M771Q83l998k409
$$ y = [7020, 4461, 2300, 2908, 1793, 2956, 5548, 2168, 1154, 3865, 1802, 1728, 1748, -3338, -5332, -8456, -8956, -5466, -6112, -11106, -7287, -508, 4276, 2173, 1617, 2248, 1625, -5627, -9445, -14630, -20533, -24193, -19185, -17780, -12707, -986, 486, 5934, 4935, 3883, 5277, 2474, -5278, -6173, -4453, -4606, -8552, -8961, -4089, 3152, 8901, 7755, 435, -4673, -7360, -5707, -6443, -10775, -4668, -5753, -5352, -4972, -2526, -5827, -7327, -5667, -2128, -1404, -7499, -5564, -5329, -10067, -4982, -2846, -20, 3690, 1346, 1579, 370, -4978, -6157, 302, -4180, -2998, 1415, -4353, -3903, -3152, -50, 2798, -1940, -3259, -3265, -6586, -7846, -8971, -6550, -5713, -1596, 5858, 9418, 5214, -1880, -5710, -5628, 307, 431, -4490, -8292, -2723, 1954, -6350, -9281, -12451, -5860, -4712, -8736, -9941, -3899, -458, 533, 5304, 6187, 2189, -220]
14625b20J16M312l289k702K032k987k550L528m277j848K773K293K587J151p559
14610f640j436l389n845L64N808j071j448O611K571j988L989J44n004j535N92
14595h277K633q20k26K361l215k912j151J604L351J977K763L417l200n406m035
14580a1136M36L820M4k478l275M266k101m698K228N883J2925N0n470n001K088
14565b419Q508K950p734n633p874m868O975J129j030L019k6K391L490j345K45
14550b222K013R617r24N8p555p547j866P08l384k293M943Q874L032l629m025k681
14534f881k556p01O035P183j356M810N774k198k000J505J660m652k739l03L616
14519G197l523J350J642J635m972k277R73j699Q09j301L026O36QK594K338m215
$$ y = [-220, -104, 4208, 919, -1783, 249, -2738, -5288, -1760, -6037, -7885, -5112, -2819, -232, 919, -6640, -8076, -11465, -17310, -16946, -11138, -12209, -13657, -7046, -4475, -6463, -2474, -2330, -7334, -8869, -8277, -5644, -6464, -6690, -4329, -7544, -10456, -11607, -10003, -6652, -4675, -1912, 1505, -1695, -7101, -11136, -10700, -6880, -6836, -9314, -12589, -8323, -10424, -15122, -12894, -7011, 5914, 5964, 494, -4507, -2419, 6089, 9039, 1305, -4328, -12202, -17070, -10095, -8966, -9996, -6977, -7003, -4612, -1122, -2467, -2222, -209, 9408, 8484, 8542, 987, -6560, -8426, -7718, -11102, -13395, -8452, 422, 3454, -175, -4200, -6881, -9437, -10138, -4103, 3080, 1724, 6534, 12308, 10110, 8110, 9615, 11275, 6623, 3884, 3581, 7197, 3674, 5024, 6666, 8301, 3329, 1052, 2025, 326, 1135, -166, 2860, 3496, 3504, 6098, 8436, 4221]
14503D221k106k751N025P00n046k002K238M738n183m605o168J123K611M14J183
14488e608n086j344M249O969j357l73L55L277M527K704m36m061J220p210r443
14473a1617M364O440L52o546k041O274N492k243M026m180n344O802O665P154o846
14458H752k614r427n266Q494N57k332J341J016m760k356o80M099Q65O01L18k124
14442c516K047j298l76m04m038L962P40M203K979o000j690j274O392m497L776
14427A006N42j590J570l199k282L176m545R97k048n943N430Q378J330k022J877
14412B677J025o139J266J1186o64q310k73l535l066J935P556M049L046O378n223
14397A1908m284p977m503j019K969p615k377p37n082K697M113N731l674j920L132
$$ y = [4221, 2115, -636, 4389, 5089, 43, -1959, 279, 5017, -166, -4771, -10939, -9816, -7205, -6791, -5608, -10694, -12038, -7789, -820, -2177, -2550, -2195, 1082, 5609, 8313, 7877, 3816, 5036, -2174, -11617, -7253, -813, -461, -7007, -9048, -2774, 2718, 475, 4501, 321, -5023, 1779, 8444, 15598, 8752, 6138, -3289, -8555, -61, 496, -1836, -495, 521, -4239, -6595, -7275, -3176, -2311, -1710, -1392, -3516, -1469, -2767, -3143, -3547, -7585, -3623, -2883, 1320, 4299, -1701, -3391, -4665, 1727, -2770, 1006, 1548, -42, 1528, -1671, -3953, -777, -5322, -4325, -6373, -12316, -6886, 1492, 2822, 800, 2677, 3702, -2437, -1171, 10015, 9351, 1041, 768, -2767, -5833, -3898, 3658, 7707, 10753, 17131, 11908, 7624, -353, -4856, -5875, -2906, -10521, -12898, -13635, -18717, -16020, -11907, -6176, -9850, -11770, -8638]
14382h638j097O56M351Q518j50q010l952O018M160K778L450p048l186K72J136
14367g42N47o231j604M120j131n075N075k961L746J77o273L078o67n054L078M722
14351e195k424p65J524P035p56j951m530N46L138L931k022m153K316L671K740
14336C105K680m12m822l401r083M767O702J177P25j826k093J931L60p30n539R67
14320e492L013p15l741m53K832k952q875M455J1376R18k414K853O67j151N43p280
14304f416n91K922O466q40n243r5K218J005Q184K848J219Q65j823m605m220p828
14288e934j175l370J297R42o19j172K730N77j754k578L709r2K609O142r21L400
14272C791k31j914m508m070m45O149O82p713j343r06j09M10k542k157J895L219
$$ y = [-8638, -9735, -9079, -4728, 3790, 3640, -4370, -8322, -2304, 1856, 4634, 8084, 1036, -2150, -1878, -742, -195, -6426, -8030, -3910, -5041, -10116, -5041, -8002, -4256, -4079, -10352, -7274, -7941, -12995, -9917, -5195, -7619, -8384, -6860, 175, -581, -2532, -7062, -6516, -3378, 553, -1469, -5622, -3306, 365, 3105, 5785, 5373, 551, -2850, -11933, -7166, -464, 713, 1438, -388, -2481, -550, -190, -920, -6459, -5492, -2479, -3194, -6935, -7388, -4556, -7508, -16383, -11928, -552, 366, -2048, 805, 1472, 321, 864, -6416, -7007, -4085, 2381, 1541, -3702, -3797, -1579, -574, 7610, 10458, 11677, 12542, 10719, 6114, 1894, -5934, -7109, -10479, -9182, -8240, -8859, -10031, -7301, -6724, -8478, -11056, -7347, -7439, -4830, 1312, 391, 3791, 3560, 1646, -2862, -6932, -7377, -1228, -546, -8259, -9602, -10508, -10617, -10207, -12749, -14906, -13011, -9792]
14256i792N15J711r06m58k462K712K648K002M788R9o585J082L373M548l211L030
14240C094L308n892m607j461l772L307M584J926q24m17j561j926j39J313j417
14225d484k916N179O45O360L594n754J927L250j864k462m097L99l300n880K218
14210g185L10n045l000P524L899j090p726j91r08n069L784J1537J629j768p278
14195a0577k101O907P441j427K31N433l566r469l12j389o447k513N299N885L455
14180c150j847n798l723K806L559L235n08K575k322k433L561M884K126n593n66
14165c194p12m710j122K62M458r49j016k952K870J111L382K174j273p813j0673
14150b0157m557N645J493M556Q809l595L177J503o95j81J156K820r39k779o675
$$ y = [-9792, -9277, -7566, -8472, -8930, -11392, -8680, -6032, -4030, 758, 857, -5728, -4646, -1273, 3275, 64, 3094, 6402, 510, -4097, -5558, -9330, -6023, -1439, 487, -337, -754, -2315, -4241, -4380, -3067, -4484, -7400, -2221, -1576, 4784, 8378, 2624, 4551, 7801, 5937, 3475, -622, -223, -3523, -9403, -7185, -6875, -11920, -14920, -7396, -3497, -4587, -12313, -12504, -13412, -18481, -14697, -3160, -1531, -3299, -10577, -12678, -5771, 1670, 243, 474, 5907, 2341, -7128, -7440, -8829, -15276, -17789, -12490, -6605, -3150, -4997, -10795, -14518, -11712, -8153, -4918, -5426, -2851, -5173, -7606, -4045, 839, 2965, -2628, -3194, -3906, -8616, -9738, -9476, -5018, -5967, -6983, -9935, -7065, -5954, -2572, -398, -1671, -9484, -20157, -24714, -19069, -17576, -13020, -4211, -7806, -4629, -3126, -3821, -4002, -2846, -26, -965, -3744, -10419]
14135a0419M491O529m057m290J610k08k18M459N949m968k289m720p005R56L352
14120a0828J1584Q993q84n374q949j566L622K987m647o0r82l161M246K345L458
14105G84M201l852M68l925j967K723N928k023l589k442J350k826Q899M096o388
14090A437k732K732M855K627O50j689n204m764l397O63J873k557L319K134M599
14075D546q109n839j005l172p5J0218Q203L221J205J486J6J314j770m770l693
14060A776L91J876J874L158l730p385O177L799k770K30K497M863j700m675o916
14045e35m969N171L642L850K466k758L768O036R358R375J1413Q527O837J1403
14031G3584R341Q259K2141L6709O3909R7683J27968J54622J52871J19981Q1627
$$ y = [-10419, -5928, 601, -3456, -7746, -6136, -6344, -6562, -2103, 3846, -1122, -3411, -8131, -15136, -14180, -10828, 756, 9749, 8865, 3491, -5458, -7024, -3402, -415, -5062, -5122, -6104, -9265, -5019, -2674, 784, 4985, 1133, 1601, -2324, -4291, -1568, 4360, 2337, -1252, -3694, -2344, -5170, 3729, 7825, 1437, -1295, 1437, 6292, 8919, 9569, 7880, 2676, -2088, -5485, -4822, -2949, -5506, -2187, -53, 4546, -3563, -9402, -10407, -13579, -13654, -3436, 4767, 7988, 9193, 10679, 10695, 12009, 10239, 5469, 1776, 2167, 4043, 5917, 9075, 5345, -2040, 4137, 7936, 5166, 5396, 7893, 12756, 11056, 6381, -535, -5504, -333, 3309, 7159, 9625, 6867, 10635, 16671, 26029, 35404, 46817, 55344, 62181, 73584, 82925, 91184, 113325, 150034, 213943, 311626, 439594, 594216, 747087, 867068, 948695]
14020I48695L8049m8091j23158j35820j33338j34718j10516p8125n2450l7899
14010A32629k5927j1427j5891n292k345m342n450j0307m298K655l085p301j0090
13997B9529j195k294o312l682n345J984J932N12J828L84n24m6k080l321j792j671
13981G907k750N453J851K463j0380j1605m49J0027l88j128l438N81J3437L360
13967A4941K107J895k019m408l157L146j070o379l294N08L965J648L130j027m376
13952E610K97M317J374m073k386p61J121K6j155m185n650J311O325j271l10K752
13936C342o443j070K042M144K714j0422n627Q79J954K965Q305j489o45j66Q42
13921A325K128j002q533m2O669l28l923k742k656L586Q129R879o021n569K270
$$ y = [948695, 986744, 938653, 815495, 679675, 546337, 411619, 301103, 222978, 170528, 132629, 106702, 95275, 79384, 74092, 71747, 67405, 61955, 51648, 47350, 50005, 46920, 39619, 29529, 28334, 26040, 19728, 16046, 10701, 12685, 14617, 15129, 16957, 17341, 16817, 16771, 14691, 11370, 9578, 7907, 5157, 10610, 12461, 14924, 4544, -7061, -7510, 2517, 2129, 1001, -2437, -1856, 11581, 14941, 17048, 18943, 16924, 12516, 9359, 12505, 11435, 5056, 1762, 2270, 6235, 7883, 11013, 9986, 5610, 5907, 10224, 11598, 7525, 5139, 4378, 5499, 5525, 4370, 185, -5465, -4154, 2171, 900, 590, 3342, -3101, -4171, -2129, 2015, 4729, -5693, -11320, -10441, -8487, -5522, 2783, 1294, 649, 483, 1325, 3453, 2451, -6082, -6124, 545, 217, -3706, -6448, -9104, -5518, 2611, 12490, 6469, 900, 3170]
13906C170K123l122j70o58m320K91L374K455k461l589m494j585j61M508J280M501
13890A142p4k019P934M353n984o396K060j040l577n385l209L244J0436k560n267
13875f342J2622L90j51J445l277l374k186o292j789M819M151j376j0653k994N028
13860i979J1294P123J178M316K230m408m873o54j600m951l894j701L115L674l937
13845c067K895k859p010l526P121J0517M059m115k708K477L89q252Q44M139K349
13830C253n46k434N051J203J80n168q746q477j743Q570N23J942k945j599N87j421
13814a1770p36Q03O973j600j037n761N067O061K453K099N755K155q264o913J057
13799c658K020J65l444l831n17j413M11P991r81o831n619N418P698O210k771l328
$$ y = [3170, 5293, 2171, 2001, 1343, -2977, -2686, 688, 3143, 682, -2907, -7401, -8986, -9147, -4639, -3359, 1142, 1068, -951, 6983, 11336, 5352, -1044, 1016, -24, -3601, -8986, -12195, -8951, 1485, -1075, -6342, 6280, 6670, 6519, 7964, 4687, 1313, -873, -7165, -8954, -4135, 16, -1360, -12013, -15007, -9979, 1315, 8438, 9616, 13932, 16162, 11754, 6881, 6227, 4627, -324, -4218, -5919, -2804, 870, -3067, -172, -3031, -10041, -13567, -6446, 4071, 8130, 4015, 1307, 3784, 4173, -4079, -3235, 904, 3253, 2707, 273, 5324, 6527, 6707, 1539, -7207, -15684, -17427, -8857, -8334, -6392, -9337, -10936, -10349, -11770, -12506, -11703, -4730, -6330, -7367, -13128, -8061, -2000, 453, 2552, 8307, 10462, 2198, -4715, -3658, -1638, -1473, -4917, -8748, -9265, -10678, -10267, -2276, -3257, -10088, -15707, -10289, -2591, 3619, 848, -2480]
13783b480j31K876k65M041O934l547p814m295O95L351m015o50l350m439J940P870
13767c279n61k082K835K615j159k783k429Q706M282k972l212R33J181l275M864
13752C664J541m233L763M773n663p018K248m471m564l849N897N635K903l988m503
13737g865J74Q583J83p18M699J701l866l003j530j122k130K121L956J568r272
13722f521m564L351O935O542o050K606N109m182j903j450P700l817J688k11m193
13707A040n64p075p797L985J888K42M56J772o577o352K140O817O482j34p390K95
13691a0772R565Q402L140j2209k825K423k274n889K593J509J876j546J696P77
13677c534J582j352J54n039l964L97K039P277M972R52k052o000l540K966M579
$$ y = [-2480, -2611, 265, 0, 4041, 10975, 7428, -386, -4681, -3986, -635, -4650, -5300, -8650, -13089, -11149, -3279, -3840, -5922, -3087, -472, -1631, -4414, -6843, 1863, 6145, 3173, -39, 894, 2075, -1200, 3664, 5205, 972, 4735, 9508, 3845, -3173, -925, -5396, -9960, -13809, -7912, -2277, 626, -3362, -7865, -7691, 892, 1075, 357, 5056, 6757, 2891, -112, -1642, -2764, -4894, -2773, 1183, 2751, -6521, -11085, -7734, -799, 5743, -307, 2299, 7408, 3226, 1323, -127, 7573, 3756, 5444, 5233, 1040, 476, -6599, -14396, -10411, -8523, -8281, -7825, -6053, -12630, -18982, -16842, -10025, -3543, -3677, -11067, -10772, -1207, 7195, 10335, -1874, -4699, -2276, -4550, -10439, -7846, -6337, -4461, -6007, -4311, -3534, -1952, -3304, -3150, -8189, -12153, -11756, -9717, -2440, 2532, 3484, 1432, -4568, -8108, -5142, -563]
13662e63J488K441n032o954n417O703J4833k647l175m361J914J424K118P22r437
13647e943J442N169k230j535p36K255j959J370o133p448M445M468k507j013O002
13632d353K303J881P427N79j0365o187j350J964j960J907m473J521O409K67j541
13617e971N188l869m049J533R685K460k98l65j045l833k437p529J651J1323N605
13602H049p816k472l965m476j823R00k961m479j940J0656O56P45P4n965L268M54
13586a1095P194P049l73j532L150J818P31o76rK035m80R43L3J682n174m813j467
13569i84M451j039k759o32J061j205r83r92r096n310l811l858P003J1085j376
13554h445K546n126M97N132K666L718n452M42m061l180j981M425O714J992O70
$$ y = [-563, 925, 3366, -1666, -8620, -14037, -7334, 7499, 4852, 1677, -2684, -770, 654, 2772, 3494, -5943, -4501, 668, -1562, -3097, -3833, -1578, -3537, -2167, -8300, -15748, -11303, -6835, -9342, -10355, -4353, -2050, -169, 7258, 7837, -2528, -8715, -10065, -8101, -10061, -8154, -12627, -11106, -4697, -4430, -5971, -783, -4652, -8701, -7168, 2517, 4977, 4679, 4314, 3269, -564, -3001, -10530, -8879, 2444, 8049, 233, -2239, -6204, -10680, -12503, -11603, -14564, -19043, -20983, -10327, -9671, -8926, -8852, -14817, -11549, -11095, -3901, 3148, 2775, 1243, 4393, 6211, 6942, 6266, 6257, 8292, 7812, 8755, 8788, 10470, 5296, 483, -984, 3467, 2428, -331, -963, 98, -1107, -2090, -3082, -12178, -17488, -21299, -25157, -18154, -7069, -8445, -5899, -11025, -10528, -5396, -2730, 988, -4464, -4022, -8083, -11263, -13244, -8819, -2105, -113, 557]
13539E57J049N734N354L732J427n390l059m259k245j1606m660O518O392L456J15
13524C115q728J073J022k575k372k07K466l032l472J070O720Q263j631n329q059
13509a1676k459M791P63O6K382R30O574q08J302J555j430j249o704L04K552M96
13493b611n234K609r10P615K306L807k031j874j211J480j837j278O03r64K429
13478B899J432o32N80l704n592O17M475L396j172j1433l525K859N484J081l87
13463c622O062K651o828n873J76L037J570Q95l748k931M799m56K765R71J229K543
13447C240O36J408n223k606L15P17p019J086Q806L002p545r053R527J3685m927
13432F049p550j031K611M058J607L531R47m580J808k745M018n916m156J368j307
$$ y = [557, 1606, 7340, 12694, 16426, 17853, 12463, 9404, 5145, 2900, -8706, -13366, -6848, -456, 3000, 3115, -5613, -4540, -3518, -6093, -8465, -8672, -6206, -9238, -12710, -11640, -4920, 3343, 1712, -3617, -11676, -14135, -9344, -8581, -8515, -6133, -5203, 1371, 563, 1865, 3420, 1990, 741, -5963, -5659, -3107, -2611, -7845, -5236, -6146, 1469, 3775, 7582, 5551, 3677, 2466, 3946, 2109, 831, 1434, 470, 2899, 4331, 3699, 4279, 575, -5017, -4400, 75, 3471, 2299, -9134, -12659, -9800, -4316, -3235, -3622, 2440, 5091, -1737, -7610, -7434, -4397, -2827, -1932, -5680, -8611, -3812, -4268, -1503, -532, 697, 3240, 3876, 5284, 61, -2545, -2230, -1513, -8532, -7446, 1360, 4362, -3183, -12236, -2709, 10976, 6049, -1501, -2532, 79, 4137, 5744, 9275, 10222, 5642, 7450, 4705, 8723, 2807, -1349, 19, -1288]
13417a288j341n653M298P432j531k586p38l448J930K166K386K712M46k221j864
13402G00L067m53n196k636n735M137L760P223j30m765K072J129k242n325r56L056
13386b294k148k793J203J685j755k104N393K07J122l801m77j511L401L581M235
13371C944k854m870l779J49k466N941N594L401M400j0547j482n019k734m467J875
13356a2914R545M833Q458n89l494l899P832p65R407m630q023o557k908j961N689
13341B4J0914o04q274n928k00n239p49j566r137j561Q657J0836M74j78l511J166
13325d876J741L060p283K137L670j334L203M702m998p189k330K271k096j765Q271
13310b816M16J216J269j328j545k042m858N811O303l150k881N128K083M95m563
$$ y = [-1288, -2629, -8282, -3984, 3448, 1917, -669, -1407, -4855, -2925, -759, 1627, 4339, 4785, 2564, 700, 3767, 3314, -1882, -4518, -10253, -6116, -2356, 4867, 4737, -28, 2044, 3173, 931, -4394, -5350, -2294, -4442, -7235, -6032, -4347, -6102, -8206, -2813, -2606, -1484, -5285, -5762, -7273, -3872, -291, 3944, 1090, -3780, -7559, -7410, -9876, -3935, 1659, 5060, 9460, -1087, -2569, -7588, -10322, -14789, -12914, -3369, 1464, 9922, 9333, 5839, 1940, 9772, 9007, 18414, 13784, 5761, -796, -3704, -5665, 24, 10938, 10334, 2060, -3868, -4068, -9307, -10056, -11622, -20759, -22320, -13663, -2827, -2353, -2531, -6042, -4876, -3135, -75, -7358, -5221, -1551, -2885, 318, 5020, 22, -7167, -9497, -7226, -9322, -11087, -2816, -2400, -1184, 85, -1243, -2788, -4830, -9688, -3877, 2426, -724, -3605, 1523, 3606, 4101, -462]
13295d62o08M738L000K039n296o789N481n854j885O497N23m243L50k924L523N638
13279C728N961n053m843m378o454o37k007P073Q977p229r317l081k858N314L374
13264a1430m406J369L116J697n108l033O238N625M993K955k292l703O896K816
13250E733n985q2n379K21P266L813K355n678m775r132J430J2933N500Q345l674
13235A2891j019o675o610o079P76K010L147O212k966p075j678j385L693Q27N73
13220c358j905N42O1k69r867r21Q719O341M615K115o929J031R61K43J014n05l388
13203a500Q83N819M794N66J462K899j4847q379K304M313M889Q907J860n675q227
13188F8m028m707j90R89q574k3J1551K567N13K135K011J698m936p592k46O734
$$ y = [-462, -1070, 3668, 6668, 8707, 3411, -3378, 2103, -3751, -5636, 861, 1384, -2859, -2509, -5433, -1910, 3728, 9689, 4636, -207, -4585, -11039, -11676, -13683, -6610, 2367, -4862, -14179, -17260, -20118, -14804, -11430, -15836, -14467, -11351, -9654, -14762, -17795, -11557, -5932, -939, 2016, -276, -3979, 2917, 5733, -252, -334, -5713, -5492, 1774, 5587, 7942, 2264, -2511, -11643, -10213, 2720, 8220, 16565, 12891, 11872, 5197, -1413, -7492, -6716, -4706, -1559, 4653, 1687, -5388, -7066, -8451, -4758, -3931, -3358, -5263, -4721, -4660, -4929, -14796, -15717, -6998, -657, 3958, 6073, -856, 175, 1136, 1379, 2393, 1888, -1500, -617, 5202, 9996, 10562, 12024, 14923, 76, -8303, -5999, -1686, 3203, 12110, 13970, 8295, 68, -3960, -8667, -8857, -7868, -16442, -16465, -4914, -2347, -1834, 301, 2312, 4010, -926, -8518, -8764, -2030]
13172b030J0154k181J428n558j617O797Q75m140O46J02J427M990l551m068P322
13157A0596M320k501p023l426m06M271J994r962J086O831l725l045r29n321j969
13142i209L9K070M953k45l540l556L954J652p20q59L593N461M065m005q185k698
13126g230N135L390N308L096N491r8P85m184o313j479j450J152J743j840r246
13111e740N81P877M986l596j653J179l52p00k872j081j298P173J92J621l664p455
13095d802K468L765o078q77J660j198K753N134P94O549O185O774m042j0246L96
13080I235O05J521m290r871l531Q28L130N00O333J500j414O120L789k086n029
13065G340q660M789j804l84M630j402m215m923n124J504N108N580N893k33n884
$$ y = [-2030, 8124, 5943, 7371, 1813, 196, 6993, 7868, 3728, 4374, 4476, 5903, 10893, 7342, 3274, 10596, 14916, 12415, 5392, 1966, 1560, 5831, 7825, -2137, -1051, 5780, 2055, -990, -1919, -7240, -9209, -9170, -7100, -2147, -2392, -5932, -9488, -5534, -3882, -4602, -5461, -1868, 3593, 7658, 3653, -4532, -7230, -2095, 1295, 6603, 9699, 15190, 15092, 15877, 11693, 5380, 3901, 2451, 3603, 5346, 3506, -5740, -5159, 2718, 7704, 4108, 2455, 3634, 3282, 2582, -290, -1371, -2669, 4504, 4696, 6317, 2653, -4802, -2334, 1431, -4647, -5524, -3864, -5062, -2309, 2825, 3619, 10168, 16353, 23127, 19085, 8839, 9235, 9840, 11361, 7071, -2800, -6331, -5503, -2373, -1873, 4460, 5960, 4546, 10666, 14455, 12369, 7340, -1320, 3469, 1665, 1281, 5911, 4509, 294, -4629, -9753, -8249, -3141, 2439, 8332, 8099, 2215]
13050B215m703o348l033M352J946M299N138r094m935m402M17N182R271l17j878
13035a890m049K839k22L438j767k558l223J276L895r33j891L987m930J900j397
13020e525O370M776M0k01k451j910m009O260q903k318J528J51K814K208M27o490
13004g233O652O221l99m075k187n739J175j656J150K979N066O699L716o060k14
12989F095n567n876L467j827j741J706q78k893O052L409N405J386p502k890o88
12974b342M03m120l371L712M408L270k546R05l119k540j207L117L387k168K31
12959a980N181n303l407l491j782n322K780J713Q411N459K289n414K358l581n421
12944g510O156M307j643Q91n019l813K939N030j777L044O188k720o4n77n326J567
$$ y = [2215, -2488, -8836, -11869, -7517, -5571, -1272, 3866, -5228, -10163, -14565, -14148, -8966, 305, -12, -1890, -5939, -3100, -3322, 116, -1651, -4209, -7432, -6156, -2261, -3194, -5085, -1098, -6028, -4128, -5525, 845, 5621, 5661, 5460, 3009, 1099, -2910, 3350, -5553, -7871, -6343, -6192, -3378, -1170, -743, -7233, -581, 5640, 5241, 1166, -1021, -6760, -5585, -7241, -6091, -3112, 1954, 8653, 12369, 6309, 6095, 528, -5348, -1881, -3708, -5449, -3743, -4621, -7514, -1462, 1947, 7352, 8738, 1236, -1654, -2342, -1939, -6059, -9430, -5718, -1310, 1960, -586, 319, -2800, -5340, -6547, -3430, -43, -2211, -1980, 3201, -2102, -5509, -9000, -10782, -16104, -13324, -11611, -3200, 2259, 4548, -866, 1492, -2089, -7510, -1354, 2953, 1310, 2201, -2818, -6631, -3692, 1338, -439, 2605, 8793, 6073, 6009, 5432, 106, 1673]
12928A673m64n560r163k946J2246R193L282j6J330K695m969j222o80n886l68Q891
12912H036O416l287k630o067l368m677l208L550M575L267K805K661l271L865L719
12897A2386n313r511j329j65k671J34P447K806K68K803k632N53l08k986O806j554
12881F734n612r321q25P265L470o10J31K550l444k034P364L222M32j737m530j749
12865A306Q18J487K428k717l311K846J021m374O754L852J478j369j877k834l746
12850A762o863J543M185J0285q14q603k086M571M017J618J403k616n923K424M607
12835I510L270k535p779l231r57M56m356K654l49J62M822J622j106k805l827L18
12819d131N821Q5k396k858O864n23j630k243N662N041l777p478l257j666N464
$$ y = [1673, 1209, -4351, -13514, -16460, -4214, 4979, 8261, 8245, 9575, 12270, 7301, 6079, 5399, -487, -855, 8036, 14452, 11165, 8535, 2468, -900, -5577, -8785, -5235, -660, 2607, 5412, 8073, 4802, 8667, 12386, 7073, -2438, -3767, -3932, -6603, -6469, 978, 3784, 4052, 6855, 4223, 4776, 4468, 1482, 8288, 6734, 1122, -8199, -9024, -1759, 1711, 1101, 1232, 3782, 338, -1696, 5668, 8890, 9322, 7585, 3055, 1306, 2124, 3611, 6039, 3322, 11, 2857, 3878, -496, 6258, 10110, 11588, 10219, 8342, 5508, 1762, -5101, -3558, 627, 10912, 10098, 1495, -591, 3980, 7997, 9615, 11018, 8402, 2479, 4903, 9510, 12780, 10245, 2466, -765, -1722, -1266, -5622, -2968, -3317, -3155, 1667, 3289, 2183, -622, -4449, -4131, 1690, 1775, -621, -3479, 3385, 2862, 1232, -1011, 4651, 9692, 5915, -1563, -4820, -6486, -1022]
12804a022N07o97p311j646R118J0106K513l876j50n600j942J2095J875o573K120
12789I517l548q191n230J410M711l632P39o09J362K803Q042l662o513L262M850
12774E311p646K437Q20l694n080Q03K753m058p00K599M26K653K477j436l445N129
12758f51L772Q722O53l884m773n538M805K046j301K086M094j918m27m27m188k183
12742H88k052n714N70L736O6J282J164P610j317l959K138m462o10N295j634o500
12726c499L295n501N275l404J008K234m551k905N142j011J541Q24m24j833m123
12711g932k080K739M728N497k638M356O11Q389Q585M498j3350q935M06m998j106
12696a230q031o555L330O433P833j518k730j02l158m489j870R823L277P879M217
$$ y = [-1022, -515, -1212, -8523, -10169, -1051, 9055, 11568, 7692, 7542, 1942, 0, 12095, 13970, 7397, 9517, 5969, -2222, -7452, -6042, -1331, -4963, -4224, -4833, -3471, -668, 7374, 3712, -2801, 461, 5311, -2335, 102, 922, -2772, -7852, -7049, -4296, -8354, -9054, -6455, -6029, -3376, -899, -2335, -5780, -651, 3121, 11843, 12496, 8612, 3839, -1699, 3106, 5152, 3851, 5937, 10031, 8113, 7686, 7259, 3071, 888, -1164, -6878, -6308, -2572, -2506, -1224, -60, 7550, 6233, 2274, 4412, -50, -660, 4635, 3001, -3499, -204, -5705, -430, -3834, -2826, -592, -5143, -8048, -2906, -3917, -2376, -1552, -1976, -3809, -7932, -10012, -7273, -2545, 2952, 314, 4670, 5281, 13670, 22255, 26753, 13403, 4468, 4874, -124, -1230, -9261, -15816, -12486, -6053, 1780, 262, -2468, -2570, -5728, -10217, -12087, -2264, 1013, 8892, 13109]
12681A3109l425n330m891m024j477K115j906L858M884J409k099L161l67O22R71
12666F610m019l393l82l150n028K47K848R66J859J170k483J958J766L151J945
12651D065L377M446M138K608o547o72k273j728j147l446J044O975L695m807Q055
12636A7783Q91M244Q66J607K547Q365J0953J3137J6856J1095L3411P0934J08886
12623C01575J34505J23361R2034l8188j74553j43928q9370n7466l5543k8138j8895
12612F5394o151p496n924l155n037o606N08q39k616K766q01J254l496p207K999
12597B3593m101o35m426l492J784J874K210Q35p327N196K61n516m626r718M19
12582c669k48Q30j374m181o662N305P63l329O372N163J028J734m28J498l23j125
$$ y = [13109, 9684, 4354, -537, -4561, -6038, -3923, -5829, -1971, 2913, 4322, 2223, 5384, 5017, 5639, 6610, 2591, -802, -1184, -4334, -9362, -9115, -6267, -5301, -3442, -2272, -4755, -2797, -1031, 2120, 4065, 7442, 11888, 16026, 18634, 12087, 11415, 9142, 7414, 6267, 2821, 3865, 10840, 14535, 9728, 17783, 18674, 22918, 23784, 25391, 27938, 36303, 47256, 60393, 77249, 88344, 121755, 192689, 301575, 436080, 559441, 651475, 613287, 438734, 294806, 205436, 147970, 112427, 84289, 65394, 59243, 51747, 45823, 42668, 37631, 31025, 31533, 30694, 28078, 30844, 30043, 31297, 27801, 20594, 23593, 19492, 18857, 14431, 10939, 12723, 14597, 16807, 17642, 10315, 15511, 15772, 10256, 5630, -4088, -3669, -3917, -3087, -4461, -8642, -15304, -9999, -9236, -12565, -6193, -1030, -2, 1732, 1304, 2802, 2479, 1354]
12566A354j501r8l060R43M19N990m977k844K156K941P155j530L48L462m957p685
12550a884j168J138N630L159K634R35j58k663p027L136j704j338K768O534P637
12535A7629l63o062j6773k808O77R85p19N934J166r40o0K728o64k001l657j043
12519e971N65R48J994m003j78J287O211L985j534k497k890l248M897Q097p274
12504C89r392k391o31K248L407k671m76m81Q5P587L854l572N699K483j941%n80
12487C617K70k390k500p26R87K219L543k114K78j854K121J846l643m838o218K01
12471i201L958K101J242L365l034p71M712J708J992p720k332k051L178J296j030
12456b587O78J0703M454K78l379m236L701j94M1O476j332k85r64p529p276k361
$$ y = [1354, -147, -245, -3305, -2362, -1943, 4047, -930, -3774, -1618, 1323, 8478, 6948, 7296, 10758, 5801, -1884, -3052, -1914, 3716, 6875, 9509, 10444, 10286, 7623, 596, 3732, 2028, 690, 3458, 9992, 17629, 17266, 11204, -5569, -8377, -7700, -6715, -7434, -1500, -334, -1274, -1334, 1394, 730, -1271, -4928, -5971, -5406, -4458, -2464, -6467, -6645, -5358, 853, 4838, 3304, 807, -2083, -5331, -434, 7663, 389, -9003, -11394, -12025, -9777, -6370, -9041, -9517, -9998, -9913, -2326, 1528, -2044, 3655, 6138, 4197, 4197, 3617, 3887, 1497, -1003, -1729, -742, 1477, 5020, 2906, 3184, 1330, 3451, 5297, 1654, -3184, -9402, -9201, -5243, -3142, -1900, 1465, -1569, -2340, 2372, 4080, 6072, -1648, -3980, -6031, -2853, -1557, -2587, -1909, 8794, 13248, 13526, 10147, 5911, 9612, 9418, 9459, 15935, 14603, 14318, 13354, 5825, -1451, -3812]
12440c812m6R13L215O240P732m66l333o598q65n840q068M331L47j593n149Q465
12424d527J0665Q05j040L525j564l676j710j370J148J524l494M985J063n060m587
12409c313Q198L438j098o489l884n71O385M537K199p423r439P893N605L503k303
12394G238R44K948q49l28m970k173k496L742L865l132o792k737k373Q57M526O657
12378D927M99p319J799K26K512M016k052J963K493o620N38n390J974q19j235L124
12362F36r04j468N332j304l924R73M189l046p62j037j184m542L983K710M550J929
12346F131p942J064N659n87j330n40j559o243J565n3P30P572j239o031l527O10
12330e720q92l422J999N873J1800J95j0395l89M16J820K761r3J97L614P28k116
$$ y = [-3812, -3858, -2945, 270, 6510, 14242, 13776, 10443, 3845, 2980, -2860, -10928, -6597, -6250, -7843, -12992, -4527, 6138, 6943, 5903, 9428, 7864, 4188, 2478, 1108, 2256, 3780, 286, 5271, 6334, 1274, -3313, 4885, 8323, 7225, 736, -3148, -3719, 2666, 7203, 9402, 1979, -7460, 433, 6038, 9541, 7238, 8182, 11130, 10281, 9953, 4983, 2810, 314, 4056, 7921, 4789, -2003, -4740, -7113, -6256, -1730, 4927, 5426, -1893, -94, 132, 2644, 6660, 4608, 6571, 9064, 2444, 2982, -2408, -434, -1253, -2488, 636, -268, -1736, 3596, 2292, -1632, -659, 3530, 484, -278, -1315, -2499, -7041, -3058, -348, 4202, 6131, -1811, -747, 4912, 4325, 2995, 2455, 896, -5347, -3782, -3835, -3105, 4467, 3228, -2803, -6330, -5720, -6612, -10034, -8035, -2162, 9638, 9833, -562, -951, -535, 1285, 4046, 3953, 4150, 7764, 8492, 6376]
12314F376k019L739J0027J920l332n887J181k963J972o57p666r847j173l21K35
12299h415N24J3015L470j0081J705k934n283o62N674M999k627j641o023J07N598
12284b574O471N364L938K928l919n03j144p273r738p700J640J142L272J140K949
12269d007K095j106K442L390j80j060m496r387m47M205Q646L614q71m950l124
12254e236K317P28m847k516J228j513L184N974J775l566P52N642L308l297j788
12239B145L224J92O456j885r288n919M424N994L458m8j482j955J205K524M713
12224A3758n538m693j360j573j859n891k00O740K335k688o07N846K925M054p148
12209D101q841N845K172k512M915M612l620m530p575P96L898n18J62o902l26L890
$$ y = [6376, 4357, 8096, 18123, 20043, 16711, 10824, 12005, 9042, 11014, 10357, 2691, -7156, -8329, -8650, -8415, -7891, 5124, 8594, -1487, 218, -2716, -7999, -8661, -2987, 2012, -615, -2256, -8279, -8172, -2574, 3897, 9261, 13199, 16127, 12208, 11705, 10561, 3288, -6450, -14150, -12510, -11368, -8096, -6956, -4007, -1912, -3018, -576, 2814, 2634, 1574, -2922, -12309, -12756, -8551, 95, 3709, 2838, -2112, -5236, -2919, -2191, -7038, -9554, -8326, -9839, -6655, -681, 1094, -2472, -1720, 3922, 7230, 3933, 2145, 5369, 5561, 12017, 10132, 844, -5075, -651, 5343, 8801, 8753, 7271, 5316, 6521, 9045, 13758, 8220, 3527, 2167, 594, -1265, -7156, -7356, -616, 1719, -969, -1576, 4270, 7195, 11249, 4101, -4740, 1105, 3277, 765, 5680, 10292, 6672, 2142, -5433, -4637, -739, -1257, -1095, -7997, -8323, -4433]
12193d433N733J589Q26n835l57K015m269K560Q914J284J258N022j330j0078k580
12178C19N028o229O7J617l157Q263N903J256M035k872m651j984l808q843L727
12163a329J646k366Q20J450K929j836K471M587j059n477m710J91n50N114K674
12148D555l669j147p50O48j713K98K963j038J269J421r83n4l308k57J117O305
12132E657J889K079p80l272j616M52L232K919j252J952K910l920m933M161j284
12117H194k989L785j479l776J0077N599n482n019o28l757J843K333n238p099l597
12102g233K850L982k416L37N372m227k999n736J007R874J0305j0438k869M710
12088B519k59L0l96l504O686k375l800L931K694J684j486l732j784O877J756j35
$$ y = [-4433, 1300, 2889, 3715, -2120, -2477, -462, -4731, -2171, 6743, 8027, 9285, 14307, 12977, 2899, 319, 5347, -882, -815, 802, -2355, 5908, 11811, 13067, 17102, 14230, 9579, 7595, 3787, -5056, -1329, 317, -2049, -1229, 221, 3150, 1314, 3785, 8372, 7313, 1836, -2874, -2683, -3233, 1881, 4555, 886, -261, -1011, -363, -2076, -1778, 1185, 147, 1416, 2837, 1854, 1800, -1508, -1765, -648, 5657, 7546, 9625, 8845, 5573, 3957, 4409, 7641, 10560, 9308, 11260, 14170, 10250, 5317, 9478, 8194, 5205, 8990, 7511, 3735, 13812, 19411, 13929, 8910, 8282, 4525, 6368, 8701, 3463, -3636, -7233, -4383, -401, -2817, -2480, 2892, -1335, -4334, -10070, -9063, 811, 11116, 678, -2191, 2519, 2260, 2290, 1894, -1610, 5076, 2701, -1099, 2832, 5526, 7210, 5724, 1992, 208, 7085, 8841, 8706]
12072H706q577M670K202l118K046N49n507n274m948K134m62J435L372p12Q43K376
12056b65m03m50p72N017N304j009l564K168O317L416k495o489n975J800P655n66
12040I689m89p210l385K537K203q50L084M842l593n748N83M669O14j968j997j506
12024A475j803K966l897j965l287M668N551n094O134Q971M174p057p216J082K971
12009G673M36Q95N237K792k243n281n009q36J284Q065k787j807j1091l519M82
11994e709O248N276m61j3391k569L893l934L885k113K941J745J474O161L318m327
11979B437L60j497J519L611k752L522R07j2662o839m600L825J4767O165m792p249
11964c278n372P361R983J355O64K206l791n069j004K564k94J344K972j35o077
$$ y = [8706, 129, 4799, 7001, 3883, 5929, 6478, 971, -4303, -9251, -7117, -7579, -6144, -2772, -3484, -2641, -265, -668, -1118, -1890, 3127, 8431, 7422, 3858, 6026, 12343, 15759, 13264, 6775, 800, 2600, 10255, 9689, 9200, 1990, -1395, 1142, 3345, 2495, 5579, 10421, 6828, 1080, 1663, 6332, 6946, 4978, 2981, 1475, -328, 2638, -1259, -3224, -6511, -1843, 3708, -1386, 4748, 13719, 17893, 10836, 3620, 4702, 7673, 8109, 9004, 14241, 17033, 14790, 9509, 4500, 3664, 4948, 13013, 10226, 8419, -2672, -6191, -5709, 539, 5815, 5354, -8037, -10606, -6713, -10647, -6762, -8875, -5934, -4189, -2715, 3446, 6764, 2437, 2797, 1300, 2819, 6430, 3678, 7200, 8107, -4555, -11394, -15994, -12169, 2598, 8763, 3971, -3278, -8650, -1289, 8694, 10049, 10713, 12919, 9128, 4059, 3055, 5619, 5325, 6669, 9641, 9506, 3429]
11949C429J681J738L086j297m458J409M783o184J229J758n545j368K045k05K082
11934D183J0086J751l361N71q827j862j371L266L794k629j684k868q06k790M701
11919B154k658L103J467k795K30j673n52J148N577N96O495o42l086L03R69J804
11903A2440M452n568l981J447N16n065J122j443L905L769n12J842N214M8M891
11888B3077l339L476q45j0977p733j333K983J033M812K99M691p441l460O01j2568
11873f724O030L310K596n540m660N471P965K837L791n470m580j764p467j801Q008
11858B002j815j269N824L046m162p27m059L541M257l79L76k76p2m548n546K849
11842i58K903o246P840J682q860Q447Q967l529n087j418L215L478l03q348l208
$$ y = [3429, 5110, 6848, 9934, 8637, 4179, 5588, 10371, 4187, 5416, 7174, 1629, 261, 2306, 2101, 4183, 14269, 16020, 12659, 13230, 4403, 2541, 1170, 4436, 8230, 5601, 3917, 1049, 243, -2547, 2154, -504, 2599, 4066, 1271, 1501, -172, -724, 424, 6001, 6597, 13092, 12450, 9364, 9667, 10636, 12440, 16892, 11324, 7343, 8790, 9306, 4241, 5363, 3920, 7825, 11594, 11082, 12924, 18138, 18186, 23077, 19738, 23214, 22369, 11392, 3659, 2326, 5309, 6342, 11154, 11453, 16144, 8703, 5243, 5844, -6724, -694, 2616, 5212, -328, -4988, 483, 8448, 11285, 15076, 9606, 5026, 3262, -4205, -6006, 2002, 187, -1082, 4742, 7788, 3626, 2899, -1160, 2381, 6638, 6259, 6635, 6359, 6287, 1739, -3807, -958, 1945, -4301, 3539, 5221, -3639, 4808, 13775, 10246, 5159, 3741, 6956, 10434, 10131, 1783, -1425]
11827a425j403j001K178l456L283R031P098j267k963k120n437m698K839J135m998
11812c204J030P143K672K6j443l543J118Q84L325K762p609K665N174M162P487
11797B2649o20o570l085l252k633J925l395o447k268L329N361L55Q82O58k52L708
11781A0345M448o700k494o170M762J208k39m641j356o66q07J83O503l888q082
11766g594p68k367M556J0070P204j79l967n096m774k241P551O249R74n960p44
11751B914P816L241k33k996n25l072J879L85N346K364o278J184J511r88L850l712
11735A2686J447M075j545q061k878K637M057j451J454l902l764J07l427m928M154
11720F61R324R40L079J823j434p12j671K425K833K485n20o925k088J338n805j338
$$ y = [-1425, -2828, -3829, -1651, -5107, -1824, 7207, 14305, 13038, 10075, 7955, 2518, -2180, 659, 1794, -3204, -2174, 4969, 7641, 7667, 6224, 2681, 3799, 4683, 8008, 10770, 3161, 5826, 11000, 15162, 22649, 22029, 15459, 12374, 9122, 6489, 8414, 5019, -1428, -3696, -367, 4994, 5349, 6231, 6889, 6637, 10345, 14793, 8093, 5599, -571, 4191, 5399, 5160, 519, -837, -1503, -2310, -2127, 4376, 488, -7594, -8362, -10729, -6173, 3897, 11101, 10922, 6955, 1859, -2915, -5156, 2395, 8644, 9618, 3658, 2914, 10730, 13971, 13738, 10742, 10217, 7145, 9024, 9409, 14755, 17119, 10841, 12025, 13536, 12548, 16398, 12686, 14133, 18208, 16663, 8602, 5724, 8361, 12418, 10967, 12421, 8519, 4755, 4862, 1435, -3493, 661, 9985, 10925, 14004, 15827, 14393, 13681, 12010, 14435, 17268, 19753, 19233, 12308, 10220, 11558, 5753, 4415]
11704D415p768J004P396j259m771N949l927M936M150j793m6n892L774j062M28
11689E534M237K905M355L265n502k342L57J81O620Q19l772o316L56M389m160K293
11673A3219k033m961m140m170P510M928M24L732K468J335n151N04N673K090p675
11658A3753n012Q76n851J896K466k626M809J400k594J528l933k774J640N040M635
11643A5253m632k952k0P204m148k269J2610Q890k163j88k348o100m507l299K339
11628A3670N914K396j465o20n906j269k619K544l413j0124R921J2404P1j792l34
11613A9378L577o73j3179n514n78M443J792k739K50N750k97M873m97K175K182
11598B0943k348l796l442o01k732m376J169L935R986q32n535L100l828J589N719
$$ y = [4415, -3353, -2349, 5047, 3788, -983, 4966, 1039, 5975, 10125, 8332, 8286, 2394, 6168, 5106, 5534, 9771, 12676, 17031, 20296, 14794, 12452, 12809, 12990, 19610, 20429, 16657, 10341, 10697, 15086, 10926, 13219, 11186, 6225, 2085, -2085, 5425, 10353, 10777, 14509, 16977, 18312, 13161, 13665, 19338, 21428, 13753, 8741, 9617, 3766, 5662, 8128, 5502, 10311, 11711, 9117, 10645, 6712, 3938, 5578, 10618, 15253, 10621, 7669, 7649, 14853, 10705, 8436, 21046, 29936, 27773, 27585, 25237, 19137, 14630, 11331, 13670, 19584, 21980, 20515, 19895, 13989, 12720, 10101, 12645, 9232, -892, 9029, 21433, 21504, 19712, 19378, 22955, 22282, 9103, 3589, 3011, 7454, 9246, 6507, 6757, 12507, 12210, 17083, 16586, 18761, 20943, 18595, 14799, 11357, 10756, 8024, 3648, 4817, 8752, 18738, 17906, 12371, 15471, 11643, 13232, 18951]
11583A8951J233K320J755l582k779l278k212K183J959K121M203J330m575o607
11569A3022P430l380p391L742m207p39J207L499J375L693n368j778K021l540j211
11554H375j742n52Q304P636K612K617p818l491l342n921k45Q48K291n617n750
11539a795M094J076K480P914j848p189M022O257j007n018o327L444J280L070J20
11524A0573M47J166k767M143P439j757k856l225j31j391J742q06R53r14k524M025
11508A4117N027N645l354o339k277M743K538n583l527N292J592J129k888j52m838
11493A1125m794P01k598O216K800k097N190p30R840l745l408n591m557k500J690
11478G542K584m192n868O808P754N156K970l669l601j512N220O784K634L246q565
$$ y = [18951, 20184, 22504, 24259, 20677, 17898, 14620, 12408, 14591, 16550, 18671, 22874, 24204, 19629, 13022, 20452, 17072, 9681, 13423, 9216, 8477, 9684, 13183, 14558, 18251, 12883, 11105, 13126, 9586, 8375, 6633, 6081, 14385, 22021, 24633, 27250, 19432, 15941, 12599, 6678, 6433, 7281, 9572, 3955, -1795, 2299, 3375, 5855, 13769, 11921, 4732, 8754, 15011, 14004, 8986, 2659, 6103, 7383, 10453, 10573, 11020, 12186, 9419, 13562, 21001, 19244, 16388, 13163, 13032, 11641, 13383, 12577, 13530, 12616, 10092, 14117, 19144, 24789, 21435, 15096, 12819, 17562, 20100, 14517, 10990, 16282, 17874, 19003, 16115, 15963, 11125, 6331, 7032, 4434, 10650, 13450, 11353, 16543, 15813, 25653, 21908, 18500, 12909, 8352, 5852, 7542, 10126, 5934, 66, 6874, 14628, 19784, 22754, 19085, 15484, 13972, 19192, 25976, 28610, 31856, 23291]
11463B3291j0099J95j335K031J0639Q127m457l388Q58O371j636l769R08P153J538
11448C6427k731j000n900o044m652r80k773j315K997O438P91m834j41M441p215
11433A3509n792L113L323K556Q88r46n765n178l053Q92P118k330m140M647K447
11418A1289p078J829K754k6k054L040Q586K365L95l259l465k590Q552P001P38
11403B8077J00o141k506P384R260j50j4739l963k919m040R35J531L61j846O04
11388A1948l211K072K968M105k418m81N318l867n720L925M653k43P193j860K396
11373B6778l318k402j651j120k102J968P943L893k904n300j365Q216M372J307
11359C4315N1K97n234q224n255N08K24N146L528O051N40M403j406k85N084j220
$$ y = [23291, 13192, 13387, 12052, 14083, 24722, 32849, 28392, 25004, 25862, 32233, 30597, 26828, 27736, 34889, 36427, 33696, 32696, 26796, 20752, 16100, 15120, 12347, 11032, 14029, 20467, 21258, 16424, 16283, 20724, 13509, 7717, 10830, 14153, 16709, 17597, 16651, 10886, 5708, 2655, 3547, 10665, 8335, 4195, 8842, 11289, 4211, 6040, 8794, 8768, 6714, 9754, 18340, 20705, 21100, 17841, 14376, 11786, 20338, 27339, 28077, 28177, 22036, 19530, 26914, 36174, 36024, 21285, 17322, 14403, 10363, 11298, 12829, 13190, 11344, 11948, 8737, 10809, 13777, 17882, 15464, 14983, 20301, 16434, 10714, 14639, 19292, 19049, 26242, 24382, 26778, 23460, 21058, 19407, 18287, 16185, 18153, 26096, 29989, 27085, 21785, 20420, 28636, 33008, 34315, 34366, 34663, 29429, 21205, 15950, 16458, 16682, 21828, 25356, 31407, 31947, 36350, 34944, 34659, 39743, 38523]
11343C8523p383K78l304o11O700L830l476m182J330m375J393L021O239L380l402
11328C7961m030K27o179n559l820j318P515J0607M621n00k805k255j671j76J386
11313C4004j954j1830o320l983k985L645J1116J569l132M995L595j651o511L479
11299B4037O082M974K643M096J777l409k265p110l13J578l711l210M635M561K067
11284C6432K392L786J713r836j0780j463K158M008j083K035j719N461P432O894
11270D7430N00j954p197k701O168j013j283O620L008L994l155L038R622K882K670
11255F8629k604n403j1219m734k186o051l852P609M804l745l640J589N480o743
11241C7934r164m253N549J986M634j489K204L389k9m403p231j758K693k360N739
$$ y = [38523, 31140, 31418, 28114, 27503, 34203, 38033, 34557, 30375, 31705, 27330, 28723, 31744, 37983, 41363, 37961, 33931, 34158, 27979, 22420, 18600, 17282, 24797, 35404, 40025, 39525, 36720, 34465, 32794, 32618, 34004, 32050, 20220, 13900, 9917, 6932, 10577, 21693, 23262, 20130, 25125, 28720, 27069, 20558, 24037, 30119, 35093, 37736, 41832, 43609, 40200, 37935, 30825, 30512, 32090, 28379, 25169, 29804, 34365, 36432, 38824, 42610, 44323, 34487, 23707, 22244, 24402, 28410, 27327, 29362, 27643, 33104, 40536, 47430, 47930, 45976, 38779, 36078, 42246, 41233, 39950, 46570, 49578, 53572, 50417, 53455, 63077, 65959, 68629, 66025, 60622, 49403, 44669, 42483, 36432, 32580, 40189, 44993, 41248, 37608, 39197, 44677, 37934, 28770, 24517, 30066, 32052, 36686, 35197, 37401, 40790, 40761, 36358, 29127, 27369, 30062, 27702, 33441]
11226C3441N927l4n503k01L687k005j24M36j722o221J566M354k879M830N212J578
11210D2342j444m257l099J015L715N656L548J262j736M459p35j0466p574M605
11196C7291M374m603R953L310o690o553m160J558Q379J535J538M265q2k110M506
11181E2511O811K272K405O101O624j658L430N813J0444M947K717P704M184j878
11167A12427Q799K1505R202J4526K1632K8581M7079P6379J17231J56782K04789
11156H18932K40924K50558K20675J73629J18553M0651p6182j64508j95994k07872
11146A219366k32243k20312j69848j25125q3504n3752m0190l3538j8004j5047
11136B27803j8483o851j1075k0630q842k194l238p737p681o538n050o026q272
$$ y = [33441, 39368, 39334, 33831, 33630, 37317, 35312, 35188, 35624, 33902, 27681, 29247, 33601, 30722, 35552, 40764, 42342, 40898, 36641, 33542, 34557, 38272, 43928, 47476, 48738, 47002, 51461, 50726, 40260, 32686, 37291, 41665, 37062, 47015, 50325, 43635, 37082, 32922, 34480, 42859, 44394, 45932, 50197, 50115, 48005, 52511, 59322, 61594, 63999, 70100, 76724, 75066, 78496, 84309, 94753, 99700, 102417, 110121, 114305, 112427, 121226, 142731, 151933, 166459, 188091, 216672, 263751, 340130, 457361, 614143, 818932, 1059856, 1310414, 1531089, 1704718, 1823271, 1863922, 1787740, 1623232, 1427238, 1219366, 987123, 766811, 596963, 471838, 388334, 334582, 294392, 260854, 242850, 227803, 209320, 202469, 191394, 170764, 161922, 159728, 156490, 148753, 141072, 134534, 129484, 123458, 115186]
11123A15186n267o509m929q748p751j146k095N82J626q13l557N493P199o6m690
11108H4515n397j557j0128O7k922n644r96P450Q356j005J682l182J262m57K02
11093G2246j056l897K586N219l478o457o345k192O465j279l205P724R201K495
11079G8027l729o729K576M634l698k003k997M78J196j505J068L632J0376L489
11065H4815J870n754j862J160j0615o925J574M046k495n790L822L744O121K481
11051G6192J732M103K274l243j457o457Q1P798K900J226J127k974K345m36n234
11036G9977L270K138j0746N36R401n45M210M876Q51j953J754P128j677O753K634
11021A08607Q095Q998l909lN081n536q187J303J0573Q370P846J7860K5360L3901
$$ y = [115186, 109919, 103410, 98481, 89733, 81982, 80836, 78741, 79323, 80949, 80136, 76579, 82072, 89271, 89205, 84515, 79118, 77561, 67433, 67500, 64578, 58934, 57938, 65388, 73744, 72739, 74421, 71239, 72501, 72044, 72246, 71190, 67293, 69879, 75098, 71620, 65163, 58818, 56626, 63091, 61812, 58607, 66331, 75532, 78027, 74298, 67569, 70145, 74779, 71081, 69078, 66081, 66559, 67755, 66250, 67318, 70950, 81326, 84815, 86685, 80931, 79069, 80229, 69614, 62689, 64263, 68309, 65814, 60024, 63846, 67590, 73711, 76192, 77924, 82027, 84301, 81058, 79601, 73144, 73225, 81023, 83923, 85149, 86276, 83302, 85647, 85211, 79977, 83247, 85385, 74639, 75175, 84576, 84031, 88241, 93117, 93968, 92015, 93769, 100897, 99220, 105973, 108607, 116702, 125700, 121791, 121788, 126869, 121333, 113146, 114449, 125022, 133392, 141238, 159098, 184458, 218359]
11007B18359M1042M4377M5285M6939M5489L1606J2612o631k0339m0772m6739m8316
10995C22912m0504m1373l6135j8288j1642j2306o839p608m385N57J2051J110o934
10982A50616q378j457n275o364M803R854K712k35P837N939O945N002O591J4524
10968A93114O877J319j148O62J737L289J0472J561P800O934J052P095K965M789
10954B48518n828l858J862J3466J1649J3067J2150K3857L6081L7382L8373L2678
10942D59397K9417J8848j4119l4400o1757o2153p8281j05770j08819q2880n3301
10931i3818m4127k8800O92K1446L3586K7215K2840J8950J5026J8135J5971K0369
10919B7485Q159M471R981J0040N333R562J0720Q425J242l045l612L033K031N150
$$ y = [218359, 259401, 303778, 349063, 396002, 441491, 473097, 485709, 479078, 458739, 417967, 371228, 322912, 282408, 241035, 204900, 186612, 174970, 162664, 155825, 148217, 143832, 144389, 156440, 157550, 150616, 142238, 140781, 135506, 129142, 133945, 143799, 146511, 146276, 154113, 160052, 166997, 171999, 178590, 193114, 199991, 201310, 200162, 200824, 202561, 205850, 216322, 217883, 225683, 232617, 233669, 240764, 243729, 248518, 242690, 238832, 240694, 254160, 265809, 278876, 291026, 314883, 350964, 388346, 426719, 459397, 488814, 507662, 493543, 459143, 397386, 335233, 256952, 151182, 42363, -40517, -93818, -137945, -166745, -166053, -144607, -111021, -83806, -60966, -42016, -26990, -8855, 7116, 27485, 35644, 40115, 50096, 60136, 65469, 75031, 85751, 94176, 95418, 92373, 88761, 91794, 93825, 98975]
10905I8975k71J52p597Q37P73j294o57K866N486J0419O440J691J0789P866J0253
10890A46728J2277Q701J8690J9611P158o11R124J7525K3614L1753L6975M5268
10878C76813M9789L9321M2245M2274L0643M134q317j4899k0542l2125m1603l4005
10866D33728k2676j1131q370J3994J3443K3082L5423M8792P8034J25185J92317
10855I21821K67904L07657K93334K01978P4270r191m4182j16374k28227k91232
10845A377758k61806j80909j11666q4127o1876l5489k5847k5657k1272j6322j9545
10834E33242j9408p413q59n672J646J1152J3032P953J9232J7104J1338J6357J9114
10821F16818J8736K2276K3583K0579K6199K6571K9169K9627L1915L7989M1080
$$ y = [98975, 98704, 98856, 91259, 92096, 92869, 91575, 90918, 93784, 99270, 109689, 116129, 117820, 128609, 136475, 146728, 159005, 167706, 186396, 206007, 213165, 212554, 221678, 239203, 262817, 294570, 331545, 376813, 426602, 465923, 508168, 550442, 581085, 585219, 576902, 562003, 541461, 509336, 467733, 433728, 411052, 399921, 391551, 405545, 418988, 442070, 477493, 526285, 604319, 729504, 921821, 1189725, 1497382, 1790716, 1992694, 2066964, 2057773, 2013591, 1897217, 1668990, 1377758, 1115952, 935043, 823377, 739250, 677374, 641885, 616038, 590381, 569109, 552787, 533242, 513834, 506421, 505562, 499890, 501536, 512688, 525720, 533673, 552905, 570009, 581347, 597704, 616818, 635554, 657830, 681413, 701992, 728191, 754762, 783931, 813558, 845473, 883462, 924542]
10810I24542L6626L6291M6791N5098N1010M3056M6389M3173L9452L8966M6255
10799A407649M9844M9367N6836N9757O9357P3741Q3301R0241J04076J15719J28186
10788B288074J33530J31919J37989J45603J53178J62290J76470K04912K31803
10779C765768K69397L07594L56343M07692M73076N47441O35027P16441P72850
10770H251629Q18848Q82259R63383J018727J082122J231876J455969J732419K135142
10761A9572374K761336L715804N212882P649067J1640957J7749226K5729560L4120794
10753A28152000M0948183M3734777L9836327L1453184K4026881J4695164k920952
10746C19925564k2371849l1955699l3986835l7832137m1239546l7192089k7771527
$$ y = [924542, 961168, 997459, 1044250, 1099348, 1150358, 1193414, 1239803, 1282976, 1322428, 1361394, 1407649, 1457493, 1506860, 1563696, 1623453, 1692810, 1766551, 1849852, 1940093, 2044169, 2159888, 2288074, 2421604, 2553523, 2691512, 2837115, 2990293, 3152583, 3329053, 3533965, 3765768, 4035165, 4342759, 4699102, 5106794, 5579870, 6127311, 6762338, 7478779, 8251629, 9070477, 9952736, 10916119, 11934846, 13016968, 14248844, 15704813, 17437232, 19572374, 22333710, 26049514, 31262396, 38911463, 50552420, 68301646, 94031206, 128152000, 169100183, 212834960, 252671287, 284124471, 308151352, 322846516, 319925564, 297553715, 265598016, 231611181, 193779044, 152539498, 115347409, 87575882]
10739H7575882j8950551j2892070r054906o609834n019320l973230l225258k622583
10731B5228130k153549j822401j593137j375372j192391j109108j077368j027580
10723A3877224r56449q97156q46992p64342o62335n74920m94309m38735l94932
10714G847054l57305l24534l00363k90204k62009k48530k41726k26668k10564
10705E385151j94969j78793j76228j72108j52609j46593j42327j36304j26283
10696C958937j24555j18217j08073r5370r3245q5167q5068p8679p2968p4390p1850
10685B951355p0343o7767n6451n3952n7319o1280o3610o4622n3805m5903n2475
10674B303828n5510n0873m7193m3767m5536m2971l7408m7257m7929m2458m4552
$$ y = [87575882, 68625331, 55733261, 46678355, 40068521, 35049201, 31075971, 27850713, 25228130, 23074581, 21252180, 19659043, 18283671, 17091280, 15982172, 14904804, 13877224, 12920775, 12023619, 11176627, 10412285, 9749950, 9175030, 8680721, 8241986, 7847054, 7489749, 7165215, 6864852, 6574648, 6312639, 6064109, 5822383, 5595715, 5385151, 5190182, 5011389, 4835161, 4663053, 4510444, 4363851, 4221524, 4085220, 3958937, 3834382, 3716165, 3608092, 3512722, 3419477, 3334310, 3249242, 3170563, 3097595, 3023205, 2951355, 2881012, 2813245, 2756794, 2702842, 2645523, 2584243, 2520633, 2456011, 2402206, 2356303, 2303828, 2248318, 2197445, 2150252, 2106485, 2060949, 2017978, 1980570, 1933313, 1885384, 1842926, 1798374]
10663A798374n0877n7277n7449m6663m9110m9916n0488l8495m2367l2098l2758
10652A290876k2774k8299k9910k2636k5102k1684k1356j9524j4461j1503k2525
10641A051102k0320j8736j8198j6394k0747k6016j5382j1698r979j3018j2463
10630H68151q132q832L398O357M898P423J6267J1922n657j1358k3804l0014k9173
10617H01446l6609m2252l8683l2891k9259k3124j1026q383m472j5519j3239l839
10605E42150j429n294q480n000K490n544r461j2301j2826o746o347o125r787j0724
10591D44576q568j4783p093m403j2040j0415r668j0901j007O277p3k193J791J855
10577C73355n341J227Q393J7473J8211J7820J7442K7554K8460K6449J2454L364
$$ y = [1798374, 1747497, 1690220, 1632771, 1586108, 1536998, 1487082, 1436594, 1398099, 1355732, 1323634, 1290876, 1268102, 1239803, 1209893, 1187257, 1162155, 1140471, 1119115, 1099591, 1085130, 1073627, 1051102, 1030782, 1012046, 993848, 977454, 956707, 930691, 915309, 903611, 893632, 880614, 868151, 860019, 851187, 854585, 860942, 865840, 873263, 889530, 901452, 895795, 884437, 860633, 830619, 801446, 764837, 722585, 683902, 651011, 621752, 598628, 587602, 579219, 574747, 559228, 545989, 542150, 540721, 535427, 526947, 521947, 524437, 518893, 509432, 497131, 484305, 477559, 471212, 465087, 455300, 444576, 436008, 421225, 414132, 409729, 397689, 387274, 377606, 366705, 365698, 371975, 371902, 369709, 371500, 373355, 368014, 369241, 377634, 395107, 413318, 431138, 448580, 476134, 504594, 531043, 543497, 546861]
10565E46861j9152l9738n9839q2281j01254j06051r5941q0387n7407m7284k8338
10554a70811j920J6370K0771K6101K9212K3389J8863J3497J0220P246O491M26
10542a45N75o7N9O511n379o987L091N344Q400Q081K016K775l93M24O76K360j57
10525B7184j92J1085Q520M178N218O20J230l300k031j508L502r92K295o137j568
10510D8104J86M384J535j241l548l268K143L923J439O03l359p59J0675N813n037
10495F1593r985N050m93l265O387j295j0084l023k963j91K195p03Q85J902J476
10480D7486j274o700o433m308L664P70k646j1041o233M19M777M500L530l674l990
10465A8847L788N537N410l417j947O274R197p950r497l885m533J620L373p636
$$ y = [546861, 527709, 487971, 428132, 345851, 244597, 138546, 42605, -37782, -95189, -142473, -170811, -172731, -156361, -135590, -109489, -80277, -56888, -38025, -24528, -14308, -7062, -571, -145, 430, 363, 422, 6933, 1554, -5433, -2342, 3002, 11402, 19483, 21499, 24274, 23881, 24305, 24981, 27341, 27184, 26992, 38077, 46597, 50775, 55993, 56613, 57843, 54543, 52512, 51004, 54506, 53514, 55809, 49672, 48104, 48290, 52674, 54209, 52968, 49420, 46152, 48295, 52218, 53657, 54260, 50901, 50142, 60817, 66630, 61593, 51608, 56658, 56165, 52900, 59287, 57992, 47908, 44885, 41922, 41731, 43926, 43223, 44108, 46010, 47486, 46212, 39512, 33079, 28771, 32435, 33205, 30559, 19518, 13285, 13704, 18481, 22981, 26511, 22837, 18847, 22635, 28172, 33582, 30165, 28218, 34492, 43689, 35739, 26242, 22357, 17824, 19444, 22817, 15181]
10451A5181m151J592m607K739K776j18m016N567R945O14R46M936J398K474R14
10436C6190q194m945l052k046j0449j5109m413N876Q462R682l73K387L843k964
10422A4895m256M33o125k090Q122N265J0127p93j221m006j861M032o01N906O388
10407C4215k737M78J780k878k726l435k808q193p015j543k853j426M010Q063O215
10392A9147k712n363o699k576n289P589J351N298N144m462m230j205Q698l800
10378A0891k508m185N563P126K465j150r710l92O462K081K644N50j958l748P762
10363B1893P482Q60r76M594P832L158N914J0478O668J1510K1112J2649J4790L0166
10349A58130M4841O2245R8460J41959J88583K33420K45064K29479J82823J41156
$$ y = [15181, 11030, 12622, 8015, 10754, 13530, 13412, 9396, 14963, 24908, 25522, 26468, 31404, 32802, 35276, 36190, 27996, 23051, 19999, 17953, 7504, -7605, -12018, -6142, 2320, 12002, 11629, 14016, 17859, 14895, 10639, 11072, 4947, 2857, 10979, 16244, 26371, 25578, 24357, 20351, 18490, 22522, 21921, 27827, 34215, 31478, 31956, 33736, 30858, 28132, 24697, 21889, 13696, 6681, 5138, 2285, 859, 4869, 12932, 19147, 16435, 11072, 4373, 1797, -3492, 4097, 5448, 10746, 15890, 11428, 7198, 5993, 14691, 10891, 8383, 4198, 9761, 16887, 19352, 18202, 8492, 8100, 14562, 16643, 19287, 19837, 17879, 14131, 21893, 29375, 30235, 29259, 33853, 41685, 44843, 50757, 61235, 67903, 79413, 100525, 113174, 127964, 158130, 202971, 265216, 363676, 505635, 694218, 927638, 1172702, 1402181, 1585004, 1726160]
10339A726160Q4469k6088j34339j89195k00125k20150k29418j95021j42710j02007
10329C71576p0127m3942k9289j7458j4692j1806q066j285j2958j0763j2q327n210
10316A37641k034j0747p874p509n055r416r640o916q085o673J992L229p119j2703
10302D9091l158l315N70k865j0567m475j43K030m206j111L759N445k483p50j904
10287B5918m125m700k01O7k611K180K919K295k590J12K415K838o254Q86J74o866
10271A2457M68J745n021o54P201Q114o89o115l796O01l39Q21J682L615k156n868
10255A2066M960l060m593M290k837n065K477j747n487K176l108K094P02K33K857
10240E958n30k059K548o215N67N53M507r382l426L323n348K203M967P94m009Q07
$$ y = [1726160, 1810629, 1784541, 1650202, 1461007, 1260882, 1040732, 811314, 616293, 473583, 371576, 301449, 257507, 228218, 210760, 196068, 184262, 176196, 174911, 161953, 151190, 151178, 142851, 137641, 135607, 124860, 116986, 109477, 104422, 95006, 85366, 78450, 70365, 63692, 65684, 68913, 61794, 49091, 45933, 42618, 43188, 40323, 29756, 25281, 25138, 27168, 22962, 21851, 25610, 31055, 28572, 27822, 25918, 21793, 17093, 16892, 16959, 14348, 16528, 19447, 21742, 19152, 19264, 21679, 24517, 18263, 19149, 19323, 12457, 12925, 14670, 9649, 8995, 16196, 24310, 23621, 17506, 13710, 14311, 13972, 14793, 16475, 20090, 17934, 12066, 17026, 13966, 9373, 13663, 10826, 5761, 8238, 6491, 1004, 3180, 72, 2166, 2868, 3101, 5958, 5428, 3369, 5917, -298, 269, 822, 5329, -4053, -7479, -4156, -9504, -7301, -2334, -1540, -5549, -4742]
10224d742N858n550J477j442n341k928L648j399K177M630P243J567j864Ok323
10209A017o00J146M002l208kJ515J357j845q473j401N220j243K398o93j958Q85
10193a883m608L127M290r73p896k839L448L104O315J05k723j072p07J467j505
10178b350l717j162l018K172R612J53n919m037O55O117L518K563M31n433j875
10163b290J687j216P629K087k066n985n143M599K071j2277K853M874k752L666
10149b263m640L428P62J256L095K839M98p336m451J70R05J066l345Q67M594m64
10133c019q87r107J606M13k801k94L23M394M282K46r567q62l919K789M448K725
10117i230k29j678j737L123J882K619J781k80J466j463j669N053J587J533O210
$$ y = [-4742, 1116, -4434, -2957, -4399, -9740, -12668, -9020, -10419, -8242, -3612, 3631, 5198, 3334, 3340, 1017, 417, 1563, 5565, 2357, 2355, 3870, 5227, 3382, -5091, -6492, -1272, -2515, -117, -810, -2768, -1883, -6491, -3364, 926, -47, -7943, -10782, -7334, -4230, 2085, 2190, -533, -1605, -2312, -845, -2350, -6067, -7229, -10247, -8075, 1537, 1690, -4229, -8266, -7611, -1494, 2024, 4587, 5018, -415, -2290, -603, -1819, 5810, 7897, 5831, -154, -5297, -698, 1373, -10904, -8051, -3177, -5929, -2263, -6903, -3475, -2713, -1457, 1638, 4477, 4975, -2361, -6812, -6642, -5737, -4671, -8016, -7149, -2555, -3019, -3906, -13013, -11407, -10994, -13795, -14089, -13766, -9372, -5090, -4844, -14411, -15273, -19192, -16403, -11955, -9230, -9459, -11137, -12874, -9751, -7869, -5250, -3469, -3749, -2283, -3746, -5415, -362, 1225, 2758, 8968]
10102H968l213p130j489M016l957L340N05j367n049M504N296J018Q9J230m16R6
10086F441L902O837r717q252o143j0458M913R524p088q043K086N170j388J30R1
10071a1995J848R984L506j513k986q14J938j879n698L096O022k684p440o409J306
10056a3718L532N649L718L664N304M838k692m558K234o235k278k588r42J744J151
10041a177J739m548o780j87o48rK514q70l365O122P209L167L262j745o327q03
10025b446Q342N210K910n987l182M110q96n716q42j535m176j692P237J672N793
10010H802j818k14k844m213j577M16l282K063J322P74K019N259l711j0640n659
9995a3303L13n539N374n62L216P76O321N193J226K324L647m371n996j401r36L435
$$ y = [8968, 5755, -1375, -2864, 1152, -2805, 535, 1040, -327, -5376, -872, 4424, 5442, 5531, 6761, 6345, 6441, 10343, 17180, 7463, -789, -6932, -17390, -12477, -2953, -10041, -18084, -15998, -10828, -12216, -12086, -11995, -10147, -163, 3343, 1830, -1156, -1970, -32, -1911, -7609, -4513, 1509, -1175, -8615, -15024, -13718, -10186, -4537, -819, 2845, 8149, 12987, 10295, 5737, 7971, 1736, -542, -3130, -4072, -2328, -1177, 562, -3986, -10766, -10953, -11601, -11610, -9096, -9966, -13331, -7209, 0, 3167, 6429, 4684, -1643, -2446, 5896, 11106, 14016, 8029, 4847, 8957, 8061, 2345, 1503, -32, -4208, -5900, 1337, 3009, 8802, 6984, 6770, 3926, -287, -1864, -1448, -4730, -2667, -1345, -571, 1448, 6707, 2996, -7644, -13303, -12990, -18529, -13155, -13717, -10501, -9725, -3404, 1789, 3015, 5339, 8986, 4615, -1381, -2782, -3718, -283]
9979b83J169j066o755O08l542M953K641J717o41m744N08K680K567K963J189m148
9963a84nK811J403K278N071n698l888l470K135J203l0Q00l067L174p123m934j368
9946a0892r93j102k610N107K749n80N160k977l909K735r55q464k78Q775Q284N164
9930E214n020q106N27mJ31k022K905m071N51k773m772l586M287Q805Q036L967
9914D069K022N909N819l950n930m531J51k935j050k692n627K93L407L254m435
9899f226p872K300R707P850J955J576l451j2655j732M454J333J039K76O754L294
9884H602l345j2868n36P745K179j074K218r531o937R517N449j665L017q338K742
9869b825O668J473k774o796O536K094k389m344K50l823p18K677j0572P78P850
$$ y = [-283, 886, -180, -6935, -6327, -9869, -4916, -2275, -558, -1199, -5943, -5435, -2755, -188, 2775, 3964, -184, -189, 2622, 4025, 6303, 11374, 5676, 1788, -1682, 453, 1656, 1626, 2426, -641, 2533, -4590, -9524, -10892, -11885, -12987, -15597, -10490, -7741, -8321, -3161, -6138, -10047, -7312, -8267, -16731, -17009, -8234, 50, 5214, 194, -7912, -7385, -7389, -7258, -9280, -6375, -10446, -9895, -12668, -17440, -21026, -16739, -7934, 102, 4069, 6091, 12000, 17819, 13869, 7939, 3408, 3559, 624, -426, -3118, -8745, -8452, -5045, -1791, -6226, -14098, -11798, -2091, 5759, 7714, 9290, 5839, -6816, -8548, -4094, -2761, -1722, -1446, 5308, 8602, 5257, -7611, -8147, -402, 1777, 703, 2921, -6610, -13547, -4030, 1419, -246, 2771, -5567, -2825, 3843, 5316, 2542, -4254, 2282, 4376, 1987, -2357, -2107, -5930, -6648, -3971, -14543, -13765, -5915]
9854e915L350M361J565l650J555j804m339k499J514n453l215L705N06K822N168
9839b329K353j873J160r55j29L29j0J53m6n107l652j879l564M652N363O918m289
9822b905k352Q009k003K039J182n064O79O413K867q025j299l229j837J0420L064
9807G959k266l308K766M974K63k450P76m682n904K378L358M168K018O714K407
9792A9171m551o486l986l785k123M342l456L448k034n47k201Q905P014K593l329
9777A2975k570l421L86J35p490n32M080l662J20q006l510K184P996M462Q94K062
9761F103m806J671J06k958M247l753l046K845N714n46n164n987K394L226K456
9746B502N093K552M228K40r440l685J531L882K540r07o417J263K83l04l676j130
$$ y = [-5915, -2565, 1796, 3361, -289, 1266, -538, -4877, -7376, -5862, -11315, -14530, -10825, -10319, -7497, -2329, 24, -1849, -689, -1644, -1773, -1444, -1454, -1301, -1347, -6454, -10106, -11985, -15549, -10897, -5534, 1384, -2905, -5257, 2752, 749, 2788, 3970, -1094, -415, 5998, 8865, 840, -459, -3688, -5525, 4895, 7959, 5693, 2385, 5151, 10125, 10388, 7938, 8714, 4032, -1872, 506, 3864, 8032, 10050, 16764, 19171, 14620, 8134, 4148, 363, -1760, 2582, -874, 2574, 540, -7, -2208, 6697, 13711, 16304, 12975, 10405, 6984, 7370, 7505, 15, -517, 3563, -99, 21, -7985, -11495, -9311, -1315, 3147, 4041, 6103, 1297, 2968, 3074, 116, 4363, 610, -2436, 409, 6123, 5577, 413, -5574, -3180, 46, 2502, 7595, 10147, 14375, 14615, 5175, 1490, 3021, 6903, 9443, 8536, 2119, 3382, 3665, 3361, -315, -1445]
9730a445k102k251O708M55P258P684r38j3054J593M25r227o782L313N876K29P109
9714D851N924n704q796n912K897R485M337K736m551q593q922Q22O354N753N231
9699E912p605K427J193M414k513j83J746j775j931k264J83N448o33L653q59l954
9683C259l320j317j950k325K392P007j56k336O031j252l390j741N001O721r862
9668B762m323j225L185N095J401N94L954n700n017M009N24J711L322q484o749
9653d941L009M720p7o10M165M7j428N002P938o76m454j269m160j904j1093m208
9637i939N194J1562J922k533J081n708L482l959j811K820L598O69m064j635K570
9622C249O022j647l482l059n473M563P006K162j786J013J124Q06k577n669K86
$$ y = [-1445, -3547, -5798, 910, 1365, 8623, 16307, 15369, 2315, 3908, 4333, -4894, -11676, -8363, -2487, -2258, 4851, 10775, 5071, -3725, -9637, -6740, 2745, 7082, 9818, 5267, -3326, -12248, -11426, -5072, 681, 5912, -1693, 734, 1927, 6341, 3828, 3645, 5391, 3616, 1685, -579, -396, 5052, 4419, 8072, 7213, 3259, -61, -1378, -3328, -5653, -3261, 3746, 3590, 1254, 7285, 6033, 2643, 902, 5903, 12624, 2762, -1561, -2786, 399, 5494, 6895, 7489, 11443, 5743, 726, 4735, 5259, 6970, 10292, 1808, -4941, -1932, 2788, 2711, 2101, 6266, 6313, 4885, 9887, 17825, 17149, 12695, 11426, 7266, 5362, -5731, -9939, -4745, 6817, 8739, 6206, 7287, 1579, 5061, 1102, -709, 2111, 5709, 6378, 2314, 679, 3249, 9271, 7624, 4142, 1083, -4390, 173, 7179, 9341, 7555, 8568, 9692, 10498, 7921, 2252, 2538]
9607B538R34M132r88J210o50o437M149M56J292J626R94M873K808m451m153L925
9591A2258J027p401M429M834K733K482j46J435K750J004r0j0083m012L580O617
9576B1417M769o250m265j362J033M594J091k30N802L39o388m985m467n5O369j0663
9560F749R16M828o541J046L639j054P188L998Q62L253R35j195o767o662o226J0599
9544A5568N614m148o926Q86L727J862L426j622J426o471J273L517j113j1089L566
9529I496J0182Q808o505l478O135l03l261J267K521O648K243p132o822O47P411
9514B7857J0032M000L120K01m558k372R64m41Q40k36J118j124n911N24J2712r08
9498D5818j934N43k081J149Q212j48n684L044K734m73n774j833N244n78l55l82
$$ y = [2538, 3472, 7604, 6616, 7826, 7176, 739, 4888, 5344, 6636, 8262, 9256, 14129, 16937, 12486, 8333, 12258, 13285, 5884, 10313, 15147, 17880, 20362, 20216, 21651, 24401, 25405, 25315, 15232, 11220, 14800, 21417, 26186, 19936, 15671, 14309, 15342, 19936, 21027, 20797, 26599, 26938, 20550, 15565, 11098, 11043, 17412, 6749, 7665, 12493, 5952, 6998, 10637, 9583, 16771, 20769, 21631, 24884, 25819, 24624, 17857, 11195, 4969, 15568, 21182, 17034, 10108, 10994, 14721, 16583, 20009, 18387, 19813, 13342, 14615, 18132, 17019, 5930, 9496, 19678, 28486, 21981, 18503, 24638, 24335, 21074, 22341, 24862, 31510, 33753, 26621, 19799, 20446, 27857, 37889, 41889, 45009, 45210, 40652, 38280, 39244, 38803, 39643, 39407, 40525, 39401, 33490, 34014, 46726, 45818, 43884, 44427, 42346, 43495, 51707, 51559, 45875, 48919, 51653, 51180, 45406, 43573, 48817, 48239, 47884, 47502]
9482D7502j199j168R211O286n10J621L114J312n49k696j726m116j030J960N314
9467F3326J666K341l552K672R044K752N64L638M234P9l351J128L220L263P143
9452I8167J564o22N424N062n498o557J783J0657M118P054O034K209P571K465m37
9437A38994O060O443N211P244N663M125N711M451J379P604J857N041J3908J2560
9423B26251K985q32M766R548J2076J2608J1462M987O616J3291J5364K2763K3167
9410C65052J5150J5018J4993J4125J5623K1471K3984K7509K7678L1500K9157K4534
9398F25794K7039L2541L2315L8388M0463M5976N1217M6658M7386N5438N0888N0988
9386A145091N6618N4540O2744O1993M6127M2767N7751M3084K8491K5630J6748
$$ y = [47502, 46303, 45135, 54346, 60632, 60122, 61743, 64857, 66169, 65620, 62924, 61198, 57082, 56052, 58012, 63326, 64992, 67333, 63781, 66453, 75497, 78249, 78813, 82451, 86685, 86764, 83413, 84541, 87761, 91024, 98167, 99731, 99109, 104533, 109595, 104097, 97540, 99323, 109980, 114098, 121152, 127186, 129395, 136966, 139431, 138994, 145054, 151497, 156708, 163952, 169615, 173740, 179451, 183902, 185281, 192885, 194742, 199783, 213691, 226251, 229236, 228404, 233170, 242718, 254794, 267402, 278864, 283851, 290467, 303758, 319122, 341885, 365052, 380202, 395220, 410213, 424338, 439961, 461432, 485416, 512925, 540603, 572103, 601260, 625794, 652833, 685374, 717689, 756077, 796540, 842516, 893733, 940391, 987777, 1043215, 1094103, 1145091, 1201709, 1256249, 1318993, 1380986, 1427113, 1469880, 1527631, 1570715, 1599206, 1624836, 1641584]
9375A641584R919M994q934j9084k1191k8693l6549m6022m9066m8131n1955n2415
9363A294457n3276n1609n1678n9001n4186m8360l8782l4317m3691m1545l6284
9352G81728l1344l6826l7111k7315k5164k5933k7205k4319j8982k7072k1838j3560
9340D65059j5052j9178j4451j4300k3099k1919j4992j7938j0934r788l441j3928
9328B86039n679m551m515p198m828j0006j2132l150n392j2622r081q001l670o231
9314A88983m159k991o252o252o277K639j280o781J378p915p961j806k44O18j784
9299A39916r314k748L62m349k008q444n146J505n075o591m130j214J276j296m846
9284H7898N257K315K143k212m382k233j64j388k248K663p46n39l467p495r088
$$ y = [1641584, 1651503, 1656497, 1647563, 1628479, 1607288, 1578595, 1542046, 1496024, 1446958, 1398827, 1346872, 1294457, 1241181, 1189572, 1137894, 1078893, 1024707, 976347, 937565, 903248, 859557, 818012, 781728, 750384, 713558, 676447, 649132, 623968, 598035, 570830, 546511, 527529, 500457, 478619, 465059, 450007, 430829, 416378, 402078, 378979, 357060, 342068, 324130, 313196, 303408, 299967, 286039, 280360, 275809, 271294, 264096, 259268, 249262, 237130, 233980, 228588, 215966, 206885, 198884, 195214, 188983, 184824, 181833, 175581, 169329, 163052, 165691, 164411, 157630, 159008, 151093, 143132, 141326, 141082, 141700, 139916, 130602, 127854, 128216, 123867, 121859, 113415, 108269, 109774, 104699, 98108, 93978, 92764, 94040, 92744, 87898, 93155, 95470, 97613, 95401, 91019, 88786, 88622, 87234, 84986, 87649, 86903, 86364, 82897, 75402, 66314]
9269F6314p528K153P116Q031l609j510ko387n296p719l815K863K156j22j31J097
9253E3611n726J130p01P96o718J669P299j585m422L55O319l10q562l338n61n604
9237C3652l785K645QJ833J482j732M261J441k786j118q366o703M110M371M98M73
9221C0284j909J63q55n502R80M676j450l460J464k628l967O406O34J748N373o321
9205B5636n581l120N235J282j1525k556J450J3964Q366j1847r538K309J553J931
9191A7559O520O63n402J519L236j025k601l318K053P22k36J019K688j888j0342
9176A1167n896R464K14L129Q150N094k843m206m971j2608n850k58K103j893j431
9161f35K624N530k366J246o230K747M362L017j797k152k39j850K208N118Q88r87
$$ y = [66314, 58786, 60939, 68055, 76086, 72477, 70967, 70965, 64578, 59282, 51563, 47748, 50611, 52767, 52645, 52514, 53611, 47885, 49015, 48314, 49110, 42392, 44061, 51360, 49775, 45353, 45708, 52027, 51717, 43155, 39817, 39256, 33652, 29867, 32512, 32520, 34353, 35835, 34103, 38364, 39805, 37019, 35901, 27535, 20832, 24942, 29313, 29811, 30284, 28375, 28538, 27683, 22181, 23161, 27837, 26387, 22927, 24391, 21763, 17796, 24202, 24836, 26584, 31957, 25636, 20055, 16935, 22170, 23452, 11927, 9371, 10821, 24785, 33151, 21304, 11766, 14075, 15628, 17559, 24079, 24742, 19340, 20859, 24095, 23070, 20469, 17151, 19204, 19926, 19690, 20709, 23397, 21509, 11167, 5271, 14735, 14949, 18078, 26228, 31322, 28479, 24273, 19302, 6694, 844, 586, 2689, 796, -635, 1989, 7519, 5153, 6399, 169, 2916, 7278, 10295, 8498, 6346, 6107, 4257, 6465, 11583, 12471, 11484]
9145A1484j715J9j831k035o299l924N72O792R121M4K181k093J494m148k302m58
9129F902K527j876N713K89K526J798n447l674j629M071j94m710P345N700O07j495
9113A8453j258q54K673r686n880K99N788o23o90K977o236L304L403R80K921o538
9097I033j480J630M73p08k594J565L46n60k525k148K037k727n037m247j342P277
9081a007N222O237j840N32K012l417P78k248j560J326k588K272O033L356p029
9066H079j725N84k493n02N037o131o981M525L962P18N508k619n596R12L687k344
9050D621n681O25M281k507j803o311n537l110J0275N515M481q71n187K877J571
9035C239J018k00l022k558k492R08Q79o230l428Q428M470M58j879m456M277J05
$$ y = [11484, 9769, 9788, 7957, 5922, -377, -4301, -3729, 3063, 12184, 12228, 14409, 12316, 13810, 9662, 7360, 6902, 9429, 7553, 13266, 13555, 16081, 17879, 12432, 8758, 7129, 11200, 11006, 6296, 13641, 19341, 19948, 18453, 17195, 16341, 19014, 9328, 3448, 3747, 9535, 8912, 8222, 11199, 4963, 8267, 11670, 12650, 15571, 9033, 7553, 9183, 9656, 8948, 6354, 7919, 8265, 7705, 5180, 3032, 5069, 2342, -2695, -6942, -8284, -1007, 4215, 10452, 8612, 9144, 11156, 7739, 8517, 6269, 4709, 6035, 3447, 5719, 11752, 15108, 8079, 6354, 6938, 4445, 3943, 8980, 2849, -4132, 393, 4355, 5073, 10581, 7962, 2366, 3278, 6965, 4621, -1060, -435, 3846, 1339, -464, -6775, -12312, -15422, -5147, 368, 4849, 3978, -1209, 1668, 3239, 4257, 4057, 1035, -1523, -4015, -3107, -2228, -8458, -11886, -3458, 1012, 1470, -409, -4865, -588, -483]
9019d83L548N163m662o290j243N030J916j139P56O01J774r017l601Q353O842L550
9003A1098o458k850K100L81L545j656j965m417l454l015J392N716P620J041l085
8988E993l593j041r92k587m111K152K316o237L703R174M37J51l858j487P487L124
8972A0631K836L602j0087r862L385P311J089k122q631M50j62N20M010K500r535
8957d065j662L211m480m044L644K901J0674K882j228O294k033l511r823m274r97
8942f511k762K11N761M505m743R63l87l170k99K321l639o086O388N010l215m615
8926a0268L112J620K698p26M899j456l577p052k042P207J35K665J282L368n308
8911c443j744n326L758J216r23M50L120R059Q46n613o580l054O01K578p95M794
$$ y = [-483, 3065, 8228, 3566, -2724, -3967, 1063, 2979, 1840, 2596, 3197, 4971, -4046, -7647, 706, 7548, 11098, 4640, 1790, 3890, 4271, 7816, 6160, 4195, -222, -3676, -6691, -5299, 417, 8037, 9078, 5993, 2400, 1359, 367, -2220, -6331, -4179, -1863, -8100, -4397, 4777, 5214, 5365, 1507, 20, 7507, 10631, 13467, 17069, 6982, -2880, 505, 7816, 8905, 6783, -1848, -1398, -1560, -1040, 2970, 5470, -4065, -5727, -2516, -6996, -11040, -7396, -4495, 6179, 9061, 7833, 14127, 12094, 8583, -1240, -5514, -6511, -9273, -9062, -3301, 1204, -3539, -2576, -2963, -6133, -6432, -4111, -7750, -13836, -7448, -2438, -5653, -10268, -7156, -5536, -2838, -3564, 1335, -121, -3698, -10750, -12792, -5585, -5450, -2785, -1503, 1865, -3443, -5187, -10513, -6755, -5539, -6462, -6012, -2892, 6167, 7013, 1400, -5180, -8234, -7633, -5055, -5850, -1056]
8895a056l131K474o316J566N509j43j574Q7K632J347P53M794n596k648o491J40
8879g653N816K341J796K312j613n721n842M598j568L210L5r770k243P778N587
8864i37n90q965N601M314m063L943j31n69R80j200J403M64p32q861m222L675M811
8847e079J004J234L793J698Q3o941O08P513J658l008M081K245o763j528l74K430
8831B654K342L45J359k818R10r0R453k127m424j744n54J995O57J720J459M47l81
8814A1203O59m293K428j975n77l958q475m18K452J912k437M434M271j682j883
8799A661o916o24M637O641J147K47k06m212l020j166L60N662j240q717M038J586
8783a22K837L53n785m39O894L280l025j102J779J925l64j487q033l253k747Q058
$$ y = [-1056, -4187, -1713, -8029, -6463, -954, -1097, -2671, -2584, 48, 1395, 2148, 6942, 1346, -1302, -7793, -7653, -1837, 504, 2300, 4612, 2999, -2722, -8564, -3966, -5534, -2324, -2289, -12059, -14302, -6524, -937, -1527, -10492, -4891, -577, -4640, -697, -828, -1397, -417, -1617, -214, 250, -482, -9343, -13565, -9890, -5079, -4075, -2841, 952, 2650, 2733, -4208, -3600, 3913, 5571, 2563, 6644, 8889, 2126, 598, 224, 2654, 4996, 5341, 6700, 3882, 4792, 4702, 14155, 12028, 7604, 5860, 5306, 7301, 7958, 9678, 11137, 11584, 11203, 11862, 7569, 9997, 8022, 7445, 3487, -4988, -5406, -2954, -1042, -3479, 955, 5226, 3544, 1661, -5255, -5879, -1242, 5399, 6546, 6793, 6587, 2375, -645, -1811, -1451, 4211, 2971, -5746, -1708, -122, 2715, 3068, -2717, -3156, 3738, 7018, 3993, 2891, 4670, 6595, 6231, 4744, -3289, -6542, -9289, -1231]
8767a231M268M836K30o508Q60q02K288L373l11J114O55Q2m91K869l198j274m866
8750A894M07L665J257k293N89K782M7l079m179J044L646l249o328m594K02L842
8734d347Q528K388m271l451k538J599Q953L855O9m662o871n168K715K689j605
8719b117o304J307P533j85l746N953k457l10K120J122O765R94r90j846k5k026
8703E788k596n323n556L131K690N992K168K803j156k784P60O078R40K446o307
8688I074K444n957n495M864J359m619l445K748l464M041L935l723m667L887m83
8673D99r925J773P858R966r07J500L385M07M376M861q642j0918n714l995K481
8658b995N41m394k085j624K832K903J426P889K128P090K592Oj963j409k548l954
$$ y = [-1231, 3037, 7873, 8103, 1595, 2455, 1653, 3941, 7314, 7003, 8117, 8772, 8854, 8363, 11232, 8034, 6760, 1894, 2301, 5966, 7223, 4930, 5519, 8301, 8348, 5269, 1090, 2134, 5780, 2531, -3797, -8391, -8189, -4347, 4181, 6569, 2298, -1153, -3691, -2092, 6861, 10716, 10785, 6123, -748, -5916, -3201, -512, -2117, -8421, -7114, 419, 234, -3512, 2441, -16, -326, 1794, 2916, 9681, 10675, 9685, 7839, 7814, 5788, 3192, -2131, -7687, -4556, -1866, 4126, 6294, 9097, 7941, 5157, 5917, 11995, 12935, 15381, 9074, 11518, 5561, 66, 4930, 6289, 1670, -1775, 973, -2491, 1550, 5485, 1762, -2905, 982, 499, -9426, -7653, 205, 10171, 9264, 10764, 14149, 14556, 18932, 23793, 15151, 4233, -1481, -5476, -2995, -2454, -6848, -8933, -10557, -7725, -4822, -3396, 4493, 6621, 13711, 16303, 16309, 14346, 12937, 10389, 6435]
8642F435O13L027m395k916L092L881p95L533l70m750K696k344l837J777K552l486
8626D713j01l01k674l66j05N333Q410k863j123j12n339Q57M268R491L514j1230
8610A2372p827L736L177j351p222r75M253M136m362q928K142j138M750J207k427
8595A543J652L008N905K561j354o23N80m856m040k107K817p651j201P451M309
8580G994J805k048k197R970Q252O24n691q624o222K486K676k664M735J0173M047
8565B5316k981m564n135j209j1143J42N261R45L917p504n586O790N425N541l599
8550A1616n770q320j060N024P027J61m482r409j62M181j608j604J358k95M061
8535G18P332M75o242n007J251k911l077k386Q038M957L454k4o228m73J261k883
$$ y = [6435, 7048, 10075, 5680, 2764, 5856, 9737, 8942, 12475, 12105, 7355, 10051, 7707, 3870, 5647, 8199, 4713, 4612, 4311, 1637, 1271, 1166, 6499, 14909, 12046, 10923, 10811, 5472, 6329, 10597, 20088, 23602, 12372, 4545, 8281, 11458, 10107, 2885, 1910, 6163, 10299, 5937, -2991, -849, -1987, 2763, 3970, 1543, 3195, 6203, 12108, 14669, 13315, 12692, 13272, 8416, 4376, 2269, 5086, -2565, -3766, 3685, 7994, 9799, 7751, 5554, 15524, 23776, 24400, 18709, 10085, 3863, 6349, 9025, 6361, 11096, 21269, 25316, 22335, 17771, 12636, 11427, 284, 426, 5687, 6632, 10549, 3045, -2541, 4249, 9674, 15215, 11616, 5846, -2474, -3534, 1490, 8517, 8678, 4196, -5213, -5375, -1194, -2802, -4406, -3048, -3343, 718, 8050, 8525, 2283, -2724, -1473, -4384, -7461, -9847, -1809, 3148, 6602, 6578, 350, -123, 1138, -1745]
8519a745Q27l237M736m497R70M125m019j945L786N653K896J062n68n149l646m730
8503e481j982J708j114N406O180O8m019q388N173K499k976k81P041l680l103k580
8487e529K22r19J652Q94J722r53M249L464j429J640K864n782j338L33M192m5q184
8470b947l156M315M303L346P01m532n764k02N532J874j407j284q03M942L275k992
8454E201l585L222j130N221q75K326j312K079M261m299q590r11K167L279o967
8439H7n776j665N83n71k361K963j13M726J2934O907o648o159l752K009K688m66
8423E386m490J456n411m500J738R11K064K251M904k411p376N9l660Q01J71J699
8407f408N512J344J785L855j668p505P65l835j28R639M019o559n453j275J852
$$ y = [-1745, -918, -4155, 581, -3916, -2946, 1179, -2840, -4785, -999, 4654, 7550, 8612, 8044, 2895, -751, -5481, -7463, -5755, -6869, -1463, 4717, 4785, 766, -7622, -2449, 50, -2926, -3207, 3834, 154, -2949, -5529, -5307, -6226, -4574, -3680, -1958, -2911, 1338, 4802, 3373, 5013, 7877, 2095, 757, 1090, 5282, 5237, -2947, -6103, -1788, 2515, 5861, 6562, 2030, -3734, -3936, 1596, 3470, 2063, 779, -24, 4918, 8193, 5201, 1616, 4838, 3708, 8929, 8054, 10380, 9068, 11147, 15408, 11109, 2519, 1608, 3775, 7054, 87, -5689, -7354, -6771, -7342, -9703, -6740, -6853, -2127, 10807, 17714, 11066, 4907, 1155, 3164, 5852, 5386, 896, 2352, -3059, -7559, -5821, -4910, -2846, -595, 4309, 1898, -5478, -5419, -9079, -8278, -8107, -6408, -896, 448, 2233, 6088, 4420, -3085, -2320, -6155, -6283, 3356, 7375, 816, -4637, -5912, -4060]
8392d060K142L204l755n755N280j96m248M407k605K714J229k47q022p29j5M240
8376f416L172l490l036M674L354k230J734K717o486Q15P079O017m126Q530L795
8361A6103p975m780o723K062P638K98n91J667k056l81K721L804J556o916r993
8346c566p020J0296K066m386J707M621j496k870j952k817l65N808K207n056N61
8331b262K760n140J720M422L738k22n227K593j683p004J426R05n96k087N260o70
8315b067o997N083J754l006j229q22O439N239m369K595k710p91l012l185P612
8300E34l96L56L257K890N509K303k430k796K50K270n315l519K286m678m103L104
8284d78M129O107L863m710j0366m594k34j88M085m69n14q11j448k753m051j367
$$ y = [-4060, -1918, 1286, -2469, -8224, -2944, -3140, -7388, -2981, -5586, -2872, -1643, -1890, -9912, -10641, -10656, -6416, -3244, -6734, -9770, -5096, -1742, -3972, -2238, 479, -6007, -5192, 1887, 7904, 3778, 12308, 16103, 8128, 3348, -3375, -1313, 6325, 6623, 6032, 7699, 5643, 5262, 7983, 11787, 13343, 6427, -3566, -10586, -290, 1776, -2610, -903, 3718, 2222, -648, -2600, -5417, -5782, 26, 2233, -2823, -2262, 498, -4642, -2922, 1500, 5238, 5016, -211, 2382, 699, -6305, -4879, -3974, -4570, -6657, -1397, -2067, -9064, -3981, -2227, -5233, -6462, -7284, -845, 4394, 25, 2620, -90, -881, -3893, -7078, 534, 138, 494, 3751, 6641, 12150, 14453, 12023, 9227, 9477, 11747, 6432, 2913, 5199, 521, -3582, -478, 3651, 9758, 13621, 8911, -1455, -6049, -6283, -6471, -2386, -2855, -3369, -4180, -5628, -8381, -12432, -13799]
8268a3799L58L161O544m752K16J2340L265J409m726Q61L12n095j935K126K712
8253B997L361J933l151m271k315m594N769O386l386k626K060L984n834l923K619
8238i91N996k602o364m315M229J153M353N281j236o175L658j88O47q028o053m188
8222a4823L952M234J786o014K210K316J0158J455p80m781q569m688R509J314p414
8207a0135J0203Q489k74l272q351L340M357j608j879j161m434m276k868M232Q433
8192G96K005P628o59m473J468N045k710q157n46Q222K041j126l91k51l324l120
8176B448L67n322p788N804O467J725r22k742N125M759M073j476l796p561m92J692
8160B361k311j241N281N029k598r847k40J198N140n89l044k516k41K623K708O379
$$ y = [-13799, -13441, -10280, -3736, -8488, -8272, 4068, 7333, 8742, 4016, 4877, 5189, 94, -1841, 285, 2997, 6358, 8291, 5140, 869, -1446, -6040, -271, 6115, 2729, 103, 2163, 6147, 313, -3610, -991, 5005, 2403, -3961, -8276, -4047, -2894, 1459, 6740, 5504, -671, 2987, 2799, 3446, -4582, -10635, -14823, -10871, -6637, -4851, -10865, -8655, -6339, 3819, 5274, 4494, -287, -8856, -13544, -4035, -2721, -10135, 68, 8557, 8283, 5011, -3340, 0, 4357, 2749, 870, -291, -4725, -9001, -11869, -7637, 796, 2801, 10429, 9770, 5297, 6765, 11810, 9100, 943, 397, 8619, 10660, 9534, 9143, 8892, 5568, 2448, 2815, -2507, -10295, -4491, 1976, 3701, 2779, 37, 5162, 9921, 13994, 12518, 8722, 1161, 669, 2361, 50, -1191, 4090, 9119, 6521, -3326, -3566, -2368, 2772, 2183, -861, -3377, -3618, -995, 1713, 8092]
8144H092m566n564Q58j830m687Q369Q846k996m387j400N6k053j106k932m716j333
8128a1349J530Q49M83l321K804j429O95N960J395L82j082O99K986k159N01K974
8112A918l632Q246P532k381l091p509m034K073l125N18N607N415q245o686k540
8097i934J692J296K384L548l60j611m522L171J596l923k318L152J099K323K830
8082D23L03n12k299O56o374m426P954N961N618m032n10M296J161k991N18j517
8066D229j436P44j139J670K643m157k09K543k406j265k25k980p559P231J65k833
8050d984p675k357m357P820L711J358J473k063L378N058M449l025k453k497n389
8035g553P52O992l376Q16j092j15N080j938j389K343M970q588j09n185Q58J513
$$ y = [8092, 3526, -2038, -1180, -3010, -7697, 672, 9518, 6522, 2135, 735, 791, -1262, -2368, -5300, -10016, -11349, -9819, -8970, -8487, -11808, -9004, -10433, -9738, -3778, -2383, -2001, -3083, -2384, 602, -1557, -1056, 1918, -1714, 6532, 14064, 11683, 8592, 1083, -2951, -878, -4003, -3485, 2122, 7537, -708, -7394, -9934, -8242, -6946, -4562, -1014, -1374, -2985, -7507, -4336, -2740, -6663, -8981, -5829, -4730, -2407, 423, 726, 214, -2085, -1429, -7803, -12229, -4275, 1686, 7304, 3272, 2762, 7058, 8219, 5228, 5746, 4229, 2793, 3537, 2398, 4068, 6711, 2554, 2345, 4888, 2482, 1217, 992, -1988, -9547, -2316, -2151, -4984, -12659, -15016, -19373, -11553, -7842, -6484, -5011, -7074, -3696, 1362, 5811, 2786, 333, -2164, -7553, -6801, 191, -3185, -2369, -3461, -3576, 1504, -434, -1823, 520, 5490, -3098, -3207, -8392, -7534, -6021]
8019f021o7j57K477l124m779L965O501J326J023j061k817O083j076l801L808M781
8003G061N767j73k824j887k683l81O44j351j92j637o070J413O535M823p592p769
7987f316j043K761M863J709j258O128p90j107J762J654O732k524k861K868N58
7972A3136k118j724L074M922l246K604O623Q91r331l565K390L799Q63J21l683
7957A4756K9K156L380j0032n943j43L254l533j426m319l785J303L157J0204J149
7942A0207q4P735R39n579j1754N5M753J098k278J422j758L947k98M546J1077l60
7926B3668m595r92R755L564m192p289q402L222R925k253K131l137P42L896l455
7911B2588J762k80M72j1811m126K013M902r79N453j137l087k163p333M184R14
$$ y = [-6021, -6088, -6245, -3768, -6892, -11671, -7706, -1205, 121, 1144, 83, -2734, 3349, 2273, -1528, 2280, 7061, 12828, 12655, 9831, 7944, 5261, 4880, 5524, 4173, 3981, 2344, -3726, -2313, 4222, 9045, 1453, -6316, -7359, -4598, 265, 1974, 716, 6844, 6054, 4947, 6709, 8363, 15095, 12571, 9710, 12578, 13136, 11018, 9294, 12368, 17290, 14044, 16648, 23271, 24162, 14831, 11266, 13656, 17455, 18318, 18439, 14756, 14785, 16941, 20321, 10289, 4346, 4203, 7457, 3924, 2498, -1821, -5606, -4303, -1146, 9058, 10207, 10123, 17858, 18797, 13218, 1464, 1519, 6272, 7370, 5092, 6514, 4756, 8703, 8405, 12951, 24028, 23668, 19073, 18081, 27836, 31400, 27208, 19919, 11517, 14739, 24664, 22411, 24542, 21405, 22147, 26043, 22588, 24350, 24070, 24542, 12731, 8605, 10618, 15520, 14541, 19994, 18857, 15770, 13607, 6274, 10458, 11372]
7896A1372o54J164K086O227N672J96n409Q625m369n518N954J934l831k117N859
7881B7191k771m697p116N449L121r702l139j561L757R513l24n062P85l192n205
7866G047L235K210K17o675j273Q26o3P31M035n15J063k422J933K623k157l562
7850G253R68l743m772Q64N294m307p250j50N907J397M916P817K970j053J820q173
7834I758n083Q55J124L696M398o719n601j703k69J147K529j37l665K387M272k911
7818D078j174r25M06m16M061K355m81k235m342l623K094J558J446R19o910L518
7802C29R732l077n330J978K302k07K950o182n242J606R603Q79k593k742L836M794
7786A2636j032m738Q49p860k157k042R38L689M747j091j474K582K078M79O308
$$ y = [11372, 10718, 11882, 13968, 20195, 25867, 26063, 20654, 29279, 24910, 19392, 25346, 27280, 23449, 21332, 27191, 24420, 19723, 12607, 18056, 21177, 11475, 8336, 6775, 10532, 20045, 19721, 14659, 15444, 12252, 7047, 10282, 12492, 12709, 6034, 4761, 5587, 5524, 6255, 10290, 9775, 10838, 8416, 10349, 12972, 10815, 7253, 8221, 4478, -294, 570, 5864, 1557, -5693, -5843, 64, 1461, 6377, 14194, 17164, 16111, 17931, 9758, 4675, 5530, 6654, 10350, 14748, 8029, 2428, 725, 456, 1603, 4132, 3995, 330, 2717, 6989, 4078, 2904, 1979, 2385, 1969, 6030, 8385, 7904, 5669, 1327, -2296, -202, 1356, 2802, 3721, -3189, 329, 10061, 6984, 1654, 3632, 5934, 5727, 8677, 2495, -2747, -1141, 8462, 9341, 6748, 4006, 7842, 12636, 11604, 6866, 7715, -145, -2302, -4344, -3406, 283, 5030, 3939, 2465, 5047, 7125, 7604, 13912]
7771A3912o391k351j921m666q37k068m613L459M560K619j8J614l184N03M306m497
7755D27n324l661N36M706K147j584m782j799k153q65L260N409L033j918o367N488
7739c447j75n055n76K612m04K492k256o225j362L506n27j257P44O55K910L311
7723e054N338k67Q03K366l259p60j708K01m443K404M208p28J583K7k196n526k417
7706i428N980N832l163p846N236O018J561p47k001O35l217K855O230m919n708
7691b682K244k753n755n39j847m79j391K023l79o62J592J19l581N063Q266M262
7675C501o763p612K146K097n63K816J991M978k13k524j526n91k416m461m943J605
7659a2478M743L425j765r82M494L983J914q69l571m120L246N736j200L354k168
$$ y = [13912, 7521, 5170, 3249, -1417, -2254, -4322, -8935, -5476, -916, 1703, 1685, 3299, 115, 618, 4924, 427, -4897, -8558, -8022, -3316, -1169, -2753, -7535, -9334, -11487, -12352, -9092, -3683, -650, -2568, -8935, -3447, -3622, -8677, -9253, -6641, -7045, -4553, -6809, -13034, -14396, -10890, -11417, -12674, -11930, -11275, -8365, -5054, 284, 17, 820, 3186, -73, -833, -2541, -2340, -6783, -4379, -171, -899, 684, 711, -1485, -7011, -9428, -3448, 2384, -779, -8625, -3389, 2629, 4190, 3443, 1442, 2077, -1140, 1715, 7945, 3026, -2682, -438, -3191, -8946, -9485, -11332, -11811, -13202, -11179, -11558, -12220, -10628, -10509, -14090, -9027, -761, 3501, -3262, -10874, -8728, -6631, -7194, -4378, -2387, 2591, 2378, -146, -1672, -2263, -4679, -9140, -14083, -12478, -7735, -4310, -6075, -7057, -2563, 1420, 3334, 2465, -1106, -5226, -1980, 3756, 2556, 5910, 3742]
7644C742M03l72k641m285m124N330O768l92K256l147p89n99O953m518l648l123
7628b186o278M508K035N380q527q336O36L977L25K013j540K181j667r780j107
7613a8366O340K072K450L794J696J634P53J858j647k006r84J693J610N09j095
7598C11o347L554P406m767o141l884O400J720j948J599k529k075r98L884M124
7583C09o5K121P71n328p657k602M052L500m547L312P739N394j028q121q356o001
7567a6507M391J2734L935J245n271j3108J012J378Q464O660j3M325Q345m493o250
7552F847l26k436L151L309O376m412o676l630o180r766m09O789O57J018j82p06
7536f576K881J0023m95l986m96j971q809m838j385N430J456k297J109j80m019
$$ y = [3742, 4145, 3773, 1132, -3153, -7277, -1947, 4821, 4429, 6685, 3538, 2749, 2150, 9103, 4585, 937, -2186, -8464, -3956, -1921, 3459, -5068, -13404, -12768, -8791, -8466, -6453, -7993, -5812, -7479, -17259, -18366, -12026, -9954, -7504, -3710, -2014, -380, 373, 2231, 584, -1422, -2406, -713, 897, 1406, 311, -6036, -2482, 4924, 157, -5984, -9868, -3468, -1748, -3696, -2097, -4626, -6701, -7699, -3815, 309, 244, 2365, 3136, -2192, -9849, -12451, -8399, -4899, -9446, -6134, 1605, 6999, 5971, -2150, -10506, -16507, -12116, 618, 4553, 5798, 527, -12581, -11569, -10191, -1727, 4933, 4920, 9245, 17590, 13097, 6847, 6521, 4085, 7236, 10545, 16921, 12509, 5833, 2203, -3977, -13743, -14152, -7363, -6706, -5688, -5870, -6576, -3695, 6328, 5833, 1847, 1351, -620, -9429, -14267, -15652, -10222, -8766, -11063, -9954, -10134, -14153]
7521a4153q2N792M449N722j260p312m766j821n17j214K570K541O22L126J367l928
7505h864J484Q326m60J503K859o71n140l923j368l677m182L238Q102J344j370
7490b799l181J957m86M032N226l825o85M82k261Q51K266M913J881q205k56K614
7474B524J294o416m826l864l94P803N083n686K192N398L95q310k350m947l223
7459a5327N118R641P84M784K369p541n613K387J875K006k705p534m709M223J3567
7444C325N160j36m771l921K42l331m260M297K153j628P082k471k834K029m870
7429c934m744J717K272O59r074J972R169N235k171K725O03n95q448o521j362J146
7413a1351K554j149k03O395K980L145L862k773o030L937J122Q127K391j738l828
$$ y = [-14153, -14235, -8443, -3994, 1728, 468, -6844, -11610, -13431, -13948, -15162, -12592, -10051, -9429, -6303, -4936, -8864, -7380, 946, 486, 1989, 4848, 4177, -963, -4886, -6254, -9931, -14113, -10875, -2773, -1429, -2799, -5980, -4023, -4509, -477, 4749, 924, 239, 721, -1540, -689, 1577, 6490, 8371, 166, -90, 2524, 3818, -2598, -7424, -11288, -11682, -3879, 1204, -4482, -2290, 3108, 3503, -4807, -7157, -12104, -15327, -10209, -568, 216, 5000, 7369, -172, -5785, -3398, -1523, 483, -2222, -9756, -14465, -10242, 3325, 8485, 8349, 3578, -343, -101, -3432, -7692, -3395, -1242, -2870, 4212, 1741, -1093, 936, -3934, -8678, -6961, -4689, -4030, -13104, -11132, -1963, 3272, 1101, 3826, 4429, 3834, -4614, -11135, -12497, -11351, -8797, -9946, -10149, -3754, -774, 2371, 6233, 3460, -2570, 1367, 2489, 10616, 13007, 11269, 7441]
7398G441j0098m39L590P61L277J401o080k865J209k936n216M711k787j536R456
7383a11J515k743j217P07O58k507n826o692K740p03K40K845J0541M864k362p639
7367e690L90K006k514o54J004M306L409l500o786k87M195q82M675J2146l080p643
7351A095n691m000L022K908k34m269p985L441j71j741N086l375j519L454Q83J637
7335g459J0104M301r527J040N318m08M92P69K408m596p725p996K303M342j372
7320h006J111L975j281j0117q07M413Q73J568n75J534K157M029j505K28J971k239
7304b671k395Q186N002p578o028Q64P21J0959N076o165K051M907l262n801m653
7289g87k456p905m362O640O110J03M134q6l669O71o739J382N808Q789j171p62
$$ y = [7441, -2657, -3096, 494, 1255, 4532, 5933, -147, -3012, -1803, -4739, -9955, -5244, -8031, -9567, -111, 1404, -1339, -2556, -1849, -1191, -3698, -9524, -16216, -13476, -14179, -13939, -11094, -553, 4311, 1949, -5690, -5300, -3294, -5808, -6462, -5458, -1152, 2257, -1243, -8029, -8316, -4121, -5003, -328, 11818, 8738, 1095, -4596, -8596, -5574, -2666, -2900, -7169, -15154, -11713, -11884, -13625, -8539, -11914, -13433, -9979, -9096, -7459, 2645, 6946, -2581, -1541, 3777, 3369, 3861, 4630, 7038, 2442, -5283, -13279, -10976, -6634, -8006, -6895, -2920, -4201, -14318, -15125, -10712, -9839, -8271, -8846, -7312, -5155, -1126, -2631, -2403, -432, -2671, -5066, 3120, 8122, 544, -5484, -4620, -3899, 7060, 12136, 5971, 8022, 12929, 9667, 3866, -787, -3243, -11148, -15510, -8870, -2760, -2657, 1477, 1391, -2278, -1607, -8346, -6964, -1156, 7633, 6462, 5700]
7273E700l963L094N703J476m784k849L077n674o84M24m822K431Q458M59j1509
7258c463r34K343j375K71N374K836m843P900M699n242q40J685m235l6Q90o370
7242a340R31o47k1j563M50k102k44M550j743l9M059l452L010J195R96j0756o706
7225a3422J1367M501l817o300K471q99r18M891K764q518l432q17K553L952L310
7210b314k487j787K699j276k334j093j350K556K552o131k081K962J678J467l45
7195g284O872M499m793j0977n495j693r26N566K448j730N145N109q052j794k166
7180a5271N442N222j431o052L724M865M752j069j165j135L102j140n738o508P8
7165a2324J678L287N660J957K074j0m133l414l371j672N108k186k505M518M228
$$ y = [5700, 1737, 4831, 10534, 12010, 7226, 4377, 7454, 1780, 1096, 1520, -3302, -871, 7587, 8046, -3463, -4397, -2054, -3429, -3158, 2216, 5052, 209, 8109, 12808, 7566, 6726, 8411, 4176, 4140, 5030, -1340, -409, -1056, -1077, -2640, -2190, -4292, -4536, 14, -1729, -1768, 2291, -1161, 1849, 3044, 4040, -6716, -13422, -2055, 2446, -1371, -7671, -5200, -6099, -7017, -2126, 638, -7880, -11312, -12129, -9576, -5624, -2314, -4801, -6588, -3889, -5165, -7499, -8592, -9942, -7386, -4834, -10965, -13046, -10084, -8406, -6939, -7284, -412, 4087, -706, -11683, -17178, -18871, -19797, -14231, -11783, -13513, -8368, -3259, -11311, -13105, -15271, -9829, -4607, -6038, -12090, -8366, -3501, 1251, 182, -983, -2118, 984, -156, -5894, -12402, -12324, -10646, -7359, -1699, 258, 2332, 2322, -1811, -5225, -8596, -10268, -5160, -7346, -9851, -5333, -1105]
7150a105J846J016M200k261J696m145r05J470p95j247J917O635l637m594o791
7135f700l22j512J534R739J889o498k886K140r575l028O812N75o667j525M708
7120a1316P668O499j843K537m881o17J0651j292q316k486J14p62n833k85N071
7105e091j935J201P751P616o75l562j0617k250L272n177o473q18N163L577j369
7090i387N025m075k011K614N692N932N074k387p785n214p00N85L705N47j334K837
7074h82j217j654m258l199k754P246j389k345M550l396p508j482J155R102K793
7059e238k83j409L382r31M120O211q86O96o600J398P0k577k240l26m823O046N742
7042B352m959m039J150j221n097J513J852L877K333M418Q92k419r452l232l288
$$ y = [-1105, 741, 1757, 5957, 3696, 5392, 1247, 342, 1812, 1017, -230, 1687, 8322, 4685, 91, -6700, -7022, -8534, -7000, 2739, 4628, -1870, -4756, -2616, -12191, -15219, -8407, -7832, -14499, -16024, -11316, -3648, 2851, 1008, 3545, -1336, -1953, 8698, 7406, -910, -3396, -3282, -4044, -9877, -10162, -5091, -7026, -5825, 1926, 9542, 8867, 5305, -5312, -7562, -4290, -9467, -15940, -16758, -11595, -8018, -9387, -4362, -8437, -10448, -7834, -2142, 3790, 8864, 6477, -1308, -6522, -7222, -6637, -2932, -2385, -3719, -882, -2099, -3753, -8011, -11210, -13964, -6718, -8107, -10452, -5902, -9298, -16806, -18288, -17133, -8031, -5238, -5521, -6930, -3548, -4479, -359, 5852, 4966, 5662, -938, 460, 530, -2047, -4287, -4613, -9436, -3390, 2352, -2607, -6646, -5496, -6717, -11814, -10301, -8449, -4572, -2239, 2179, 3071, 652, -8800, -12032, -15320]
7027a5320J1663P013q61J013K488o488n864K474k885l031L669r3L778J229j043
7012b258J362J785q679n729J282k720j413J88L110K312M010m388l449J316M395
6997h876k349L84L150k50P64Q82K8K261l462o037l31J277J867O320K266J063n58
6980a601M352n98j0532p473O324J485p04N331r22j757j939l1M681J403l715n497
6964a1193N986N95M268M380R40k228L713n291o071j039M229N586l249n392l328
6949h094K686L87J654j698J005j995L359k601L841J914O23L11j038n723L75M717
6933b77K014n434o448J230J627L873n74m447m908M745N195P93O79m575K489P335
6917C317J269m148n912m865J003N326j781P019L996r142O321M247m767j33K560
$$ y = [-15320, -3657, 3356, 2495, 3508, 5996, -492, -6356, -3882, -6767, -9798, -6129, -6222, -2444, -1215, -2258, -896, 889, -7790, -13519, -12237, -14957, -16370, -16182, -13072, -10760, -6750, -11138, -14587, -13271, -8876, -11225, -10841, -7691, -7941, -7177, -6295, -6267, -4006, -7468, -13505, -13836, -12559, -10692, -4372, -2106, -1043, -1601, 2751, 2153, -8379, -15852, -9528, -8043, -8747, -3416, -4338, -6095, -8034, -8065, -3384, -1981, -5696, -11193, -5207, -4612, -344, 4036, 4976, 2748, 6461, 1170, -4901, -5940, -1711, 3875, 626, -4766, -8094, -5408, -5021, -3367, -5065, -4060, -6055, -2696, -5297, -1456, 458, 1081, 1392, 354, -5369, -4994, -277, 1737, -3697, -10145, -8915, -7288, -3415, -3989, -8436, -13344, -8599, -3404, -2611, -1932, -6507, -4018, 3317, 4586, 438, -5474, -10339, -9336, -4010, -5791, 1228, 5224, -3918, 2403, 6650, 1883, 1750, 4310]
6902D310k691k497K503l696l469n030o82N689J897o626q61K215M37P329Q735L155
6886A0718J93r90j1238p116l403O895K194L84K609l268n957K445O610Q68J502
6871B446k455q666k546P678P52o979K28L553j39K39N08j701K380L608L108l762
6855a748k351P694j846j10J542J009L263j124J681O858j251Q8l377m07k935o451
6839E35j55M984J0643m184o926L093j386m82r52m407o91N23j018m568j352J085
6823e258N652j048k609k238R29k367M376k099m684Q64P076M760k958J967O999
6808I362j997m508q729p824P37R680J447L98K856K110J065J286J216L4j189o86
6792E258K802j145p42j736p57O398k787j117j449l317m82k117J131q7L42M920
$$ y = [4310, 1619, -878, 1625, -2071, -5540, -10570, -11252, -5563, -3666, -10292, -11153, -8938, -8501, -1172, 7563, 10718, 10911, 9921, -1317, -8433, -11836, -4941, -2747, -2363, 246, -3022, -8979, -6534, 76, 944, 2446, -9, -8675, -11221, -3543, -2791, -9770, -9542, -5989, -6128, -5889, -5381, -7082, -4702, -1094, 2014, -1748, -4099, 3595, 1749, 1639, 3181, 4190, 7453, 6329, 8010, 14868, 13617, 13705, 10328, 9921, 6986, 535, 380, 5364, 16007, 11823, 4897, 7990, 6604, 6122, 5170, 763, 72, 595, -423, -4991, -6343, -5258, 394, -654, -3263, -5501, -4572, -6939, -2563, -4662, -9346, -8482, -1406, 3354, 396, 2363, 9362, 7365, 2857, -5872, -13696, -12959, -3279, -1832, -1434, 1422, 3532, 4597, 5883, 7099, 7133, 5944, 5258, 8060, 6915, 6173, 4437, 3680, 10078, 7291, 6174, 4725, 1408, 926, -1191, -60, -147, 195, 5115]
6776E115j2l959J162J074M315O039L828k009n553o247K053K490J438p707l590
6761a563O046J0515J953J095K774K277o570m788n557k67O42P344P618L718l517
6746B1720J865M972l8L173O167P065Q196O461K0442L8160N9344J00683J30249
6733D08459J25936J05656j523j65334j60841r2744n4284m4203k6419j4489j6116
6722F4098o153m473o208l45J4049R182P625J4415J9990N0929O7720R9803J05831
6709D36463R2151L3972r1687j19119q9928o8330m6995l0295k4555j5563j7766
6698E8348j4632n768q399J939l270l886L877l430n094J852L19N707L803l252n386
6683B2728J864q075M19M245l334o115j446k873o311k416K123Q157K225m772o688
$$ y = [5115, 5103, 1144, 2306, 3380, 7695, 13734, 17562, 15553, 10000, 3753, 5806, 8296, 9734, 2027, -1563, 4483, 14998, 16951, 18046, 20820, 23097, 16527, 11739, 6182, 5915, 6557, 13901, 21519, 25237, 21720, 23585, 28557, 28519, 31692, 37859, 44924, 53120, 59581, 80023, 118183, 177527, 278210, 408459, 534395, 640051, 638528, 473194, 312353, 219609, 165325, 121122, 94703, 80214, 64098, 57945, 53472, 47264, 46919, 60968, 70150, 77775, 92190, 112180, 163109, 230829, 330632, 436463, 528614, 562586, 470899, 351780, 261852, 193522, 146527, 116232, 91677, 76114, 58348, 43716, 37948, 29549, 31488, 28218, 24332, 28209, 24779, 19685, 21537, 21856, 27563, 31366, 28114, 22728, 24592, 16517, 16936, 21181, 17847, 11732, 10286, 7413, 1102, -1314, 809, 8966, 11191, 6419, -269]
6668b69L644J0952L138r036m724K190N43r68q376M046N852J143K59k871p002M708
6652C229R274q85M666l157r945k378k563L881l501m328J314L861j790l165K911
6637b576L229N503N942N77o774n140j170Q35j208k673R33l380k206M082L095J991
6621A060K259J810o004j715O16N64K012j168L611q381n041K94L264k738j122N740
6605d939q18l691N775J308M647J861m062n911j920K396j049N28J8j24j680l793
6589a1454M352Q645L484p5j369l316o663q040O295J2175p727j453N27P467J2723
6574A5571M021j0356n873k465l566r13l34n662m226j660L662J532J0813L533m055
6559B2j95L122J339k574o0K335m427j361M241N311o087n91M240n217m962L618
$$ y = [-269, 3375, 14327, 17465, 8429, 3705, 5895, 6438, 5470, -2906, 1140, 6992, 8135, 8394, 5523, -1479, 3229, 12503, 11618, 16284, 13127, 3182, 804, -1759, 2122, -1379, -5707, -4393, -532, -2322, -5487, -2576, 653, 6156, 12098, 12675, 5901, 761, -409, 426, -782, -3455, -2522, -5902, -8108, -4026, -931, 1060, 3319, 5129, -875, -2590, -1974, -1410, 602, -566, 3045, -5336, -10377, -10083, -6819, -9557, -10679, -4939, -5757, -9448, -3673, -2365, 2282, 4143, 81, -5830, -7750, -5354, -6403, -5875, -5857, -5981, -7661, -11454, -7102, 1543, 5027, 4952, 3583, 267, -6396, -14436, -8141, 4034, -3693, -5146, -4619, 2848, 15571, 19592, 9236, 3363, 898, -2668, -3581, -3915, -9577, -13803, -15463, -11801, -10269, 544, 4077, 22, -173, 2949, 4288, 1714, 1654, 3989, -438, -1799, 2442, 7753, 1666, 1075, 5315, 98, -4864, -1246]
6543a246J208m555m415J174K911n317J505M213O725N177n887m405J932J692O335
6528G047L546n83p553m30p477j855p385J841M724J280P4K773j397nJ059k669L242
6511c768r68N454n136j274O686n409k888R98N138J565J560M292m232o322l760
6496h064L520n261n642R246J048o47O966M117n301M817Q06o966l619o497L0K855
6480h592k223K236N891l47M487p13Q68k741k969L997k707k219N068N74k44J0812
6464A1178K564k485p325m615o173K167K380J588j061M1M276j841p775L435R37
6449b709K517L58l451k908L144L400J717l462J317K828j422r57J894K765k637
6434B394k671p738J2384M150k164p968K574L423j879n92n427l752J27N005k866
$$ y = [-1246, -38, -4593, -9008, -7834, -4923, -10240, -8735, -4522, 2203, 7380, 1493, -2912, -980, 712, 7047, 10593, 10010, 2457, 2027, -5450, -7305, -14690, -12849, -8125, -6845, -6771, -3998, -5395, -5400, -4341, -7010, -3768, -4736, 718, -4418, -5692, 994, -4415, -7303, -6305, -1167, 398, 1958, 6250, 2018, -4304, -8064, -4544, -9805, -15447, -6201, -5153, -5800, 1166, 5283, -18, 4799, 5605, -1361, -4980, -11477, -11447, -8592, -10815, -8579, -2688, -3035, 1452, 739, 1607, -1134, -4103, -106, -2813, -5032, 36, 610, 366, 11178, 13742, 11257, 3932, -683, -6856, -4689, -2309, -721, -1782, -1741, 2535, 694, -7081, -3646, -2709, -192, 166, -3285, -6193, -3049, 351, 2068, -1394, -77, 2751, 1329, 372, 2266, 5031, 2394, -277, -8015, 4369, 8519, 6355, -1613, 961, 4384, 2505, 1913, -3514, -7266, -7139, -2134, -5000]
6419e000M69k036k55m977m11k367O891J946J445p95K337N892Q335j600l097p845
6403a068k449l454j489k395M397k184K595O98j847K978J602N32o2K62k57n49N719
6386C029J071k708q646r354P501N124L637K838M018k066k066l91j0131L271J727
6371c146M284J07r07n884r79K579M051N439l768n016k584L913L783p120l306k67
6355h821J1325M260k601n757l433N561ml318L369n885p836O525N197J83j67j258
6339b660m858O148L116o868P87N99M157M385o458J659P12j639M853N773j668j498
6323F540L816J6m176m784k214k507L12J876M852K631J651j2208p361k531m854
6308a8941K876L23J186N018M554j104M181q53J966Q745L810k991n964p464l384
$$ y = [-5000, -4531, -6567, -6822, -11799, -12210, -14577, -7686, -5740, -4295, -5090, -2753, 3139, 11474, 9874, 6777, -1068, -3517, -6971, -8460, -10855, -6458, -8642, -6047, -5349, -7196, -4218, -2616, -2084, -2146, -1884, -2141, -2690, 3029, 4100, 1392, -7254, -16608, -9107, -3983, -346, 2492, 6510, 4444, 2378, 1987, -8144, -4873, -3146, 1138, 1245, 338, -5546, -6525, -3946, 105, 5544, 1776, -3240, -5824, -1911, 1872, -5248, -8554, -8821, 2504, 6764, 4163, -1594, -5027, 534, 530, -2788, 581, -5304, -13140, -6615, -1418, -1235, -1402, -2660, -7518, -1370, 1746, -5122, -4335, -3736, 421, 4806, -1652, 7, 719, -920, 3933, 9706, 8038, 6540, 10356, 10372, 6196, 1412, -802, -3309, -2997, -1121, 3731, 6362, 8013, -4195, -11556, -14087, -18941, -16065, -15742, -14556, -9538, -4984, -6088, -1907, -2760, -794, 7951, 11761, 8770, 2806, -4658, -8042]
6293h042m490m5L267O206L052L081j590k780q89M23m301R29l040k026K631N283
6277b331j744p769L926K330M327Q31k945n666K345l896P90L253j098O147J084
6262d16L051M530K730l01l855o175l146m090j163K294p29j8j524m212l72M536
6246h860M525K550q619p943K000L907L207L848k497j351J0883j650k679J029K11
6231a439j663m43l842j069j41j603l236M318M4m746m53L397L958N359K403j732
6215h88l265m883N640K115k347Q320P095N07p166L87J239j599K453M491l474r524
6199h99l094j635N820O396j360o172j108L589M98k714m914L50K790k904O904m230
6183b683j0565l518J104L498n34K331N99k890p0n68N061P386P54k834M334N037
$$ y = [-8042, -12532, -12577, -9310, -3104, -52, 3029, 1439, -1341, -2230, -1807, -6108, -5179, -8219, -10245, -7614, -2331, -4075, -11844, -7918, -5588, -1261, -430, -3375, -9041, -6696, -10592, -9802, -6549, -7647, -1500, -416, 2635, 7165, 9895, 9594, 5739, -436, -3582, -7672, -8835, -6541, -7270, -7288, -8812, -13024, -13396, -8860, -4335, -1785, -10404, -18347, -16347, -12440, -9233, -5385, -7882, -9233, 1650, 0, -2679, -1650, -1439, -3102, -3545, -7387, -8456, -8597, -10200, -13436, -9118, -9074, -13820, -14273, -10876, -6918, -1559, 844, -888, -4153, -9036, -3396, -1281, -3628, 4692, 11787, 12294, 5128, 5515, 6754, 5155, 7608, 12099, 8625, -899, -3993, -5628, 192, 6588, 5228, -944, -2052, 1537, 2035, -679, -5593, -5243, -2453, -5357, 1547, -2683, -13248, -16766, -15662, -12164, -12698, -10367, -9768, -12658, -12728, -13296, -8235, -849, -95, -2929, 1405, 6442]
6167F442k809o419K847N680r5P27j483m301J539K664Q34k543L903K801n06l400
6151E881o800j0692M94P914n787l678J831O338k340l256N09L872K314K093L442
6136B135m134m41J982M555Q259Q34m3j806k427j0124q381l406N456Q377r1j437
6120f92Q530L470k44j734m170j145Q806J222m038N735l82o138m822J738p57m129
6104A250K704J174j728p41P90P680r0j2938m136Q076j050j1256j680M954l596
6089a0587j57O006L428l136j989m457O015j833l628L75P423p85j630O96R30J534
6073a795p958j731P427K807k34p683L772P728K112p49J67o620l118M422P885n977
6057D55k24K239J278k590N759J444m92j067m315m321l457j100J372m77K752L630
$$ y = [6442, 3633, -2786, 61, 5741, 5646, 6373, 4890, 589, 2128, 4792, 5626, 3083, 6986, 9787, 9281, 5881, -919, -11611, -11117, -3203, -8990, -12668, -10837, -4499, -6839, -10095, -9586, -5714, -3400, -1307, 2135, -1999, -2440, -458, 4097, 12356, 13190, 13147, 11341, 8914, -1210, -9591, -12997, -7541, 836, 745, -692, 7838, 11308, 11064, 9330, 5160, 4015, 12821, 14043, 10005, 15740, 15358, 9220, 4398, 6136, 5379, 1250, 3954, 5128, 3400, 2659, 3449, 11129, 11039, -1899, -6035, 2041, 991, -10265, -11945, -6991, -10587, -10744, -4738, -1310, -4446, -6435, -10892, -4877, -6710, -10338, -9963, -2540, -3325, -4955, -4259, -3329, -1795, -9753, -11484, -4057, -1250, -1484, -9167, -5395, 2333, 4445, 3696, 3863, -2757, -5875, -1453, 6432, 455, 231, 2470, 3748, 1158, 6917, 8361, 7869, 6802, 2487, -1834, -5291, -6391, -5019, -5496, -2744, 886]
6041H86J089p912J370J245O20j213l584l906N37j394l012K171N910M23k3N21O934
6024F62n026l719M621O267k343k246j393m235p12P169k129j895L595l117L278
6009a223K393j296l381J328Q61j24l574l402J624M26J919l19K107L056K851j560
5993A686P03n018o012O46Q292O657j11n973p338n185K082N64l390R902J576M250
5977C331J986l655n833R3L576l682J691L756J037m357o7l943L26k360M26M4L222
5960d409L169M903J569k733l447L693l951k419O144M698j0792j0427J6P889J1791
5945E694j148m373k831j481j792K65R95l033J0351L082R14n483k137J627k523
5930a873l922M422l412n308N962K214l066j341K611K092K81K490J01N505k845
$$ y = [886, 1975, -5937, -4567, -3322, -2702, -3915, -7499, -11405, -10868, -12262, -15274, -13103, -7193, -6770, -6793, -6272, 662, -4364, -8083, -3462, 2805, 462, -1784, -3177, -7412, -8124, -955, -3084, -4979, -1384, -4501, -1223, 1170, -126, -3507, -2179, -1318, -1442, -5016, -8418, -6794, -6368, -4449, -4768, -2661, 395, 3246, 1686, 2389, -2629, -8641, -7995, 297, 6954, 6843, 870, -6468, -11653, -9571, -9007, -12397, -2495, -919, 3331, 5317, 1662, -4171, -4078, -502, -4184, -2493, 1263, 2300, -2057, -2124, -6067, -5741, -8101, -7675, -7631, -4409, -1240, 3663, 5232, 2499, -948, 2745, -1206, -3625, 2519, 7217, -3575, -14002, -13986, -6097, 5694, 4546, 173, -2658, -4139, -5931, -5666, -4671, -7704, 2647, 5729, 6643, 1160, -977, 650, -1873, -5795, -1373, -4785, -10093, -4131, -1917, -4983, -6324, -3713, -1621, -1340, 1150, 1251, 6756, 3911]
5915C911m376K263N614m155o314K368M689r48o916k539J767O388o057j0080K988
5900a1397P756J299K733p2n064J987J3468L616o803n34q558j014K15M10L054r00
5884A96R0O003L22k64j995l520N995k927j0287j546P861Q58J734q992n605M326
5868g751N083J1139L038n723q159l681N126N729K371J070K264l239m550p66m298
5853b347j100k535l297Q896N148k055j731l936j54k913M67l693m362L555L334
5838f723J838O065J768j273K131j461n702L125N325K205J362m398m486K199M02
5823B377n519k854P46J029m594l357n10R106L632j169m567j786R434r35j208l42
5807e17o874k345j5L827n13m592N560L916R44K62L085J041l896j269m44O464O08
$$ y = [3911, -465, 1798, 7412, 3257, -3057, -689, 4000, 3052, -3864, -6403, -4636, 1752, -4305, -14385, -11397, -3641, -2342, 391, 319, -4745, -2758, 10710, 14326, 7523, 6989, -1569, -2583, -2368, -1958, 1096, 196, 286, 6289, 6611, 6347, 4352, 832, 6827, 3900, -6387, -7933, -72, 786, 2520, -6472, -12077, -7751, -2668, 8471, 11509, 5786, -2373, -6054, -928, 4801, 7172, 8242, 10506, 7267, 2717, 1951, -2347, -3447, -5982, -9279, -383, 4765, 2710, 979, -2957, -3111, -6024, -5557, -9250, -13612, -10057, -6723, -4885, 1180, 2948, 1675, 3806, 2345, -3357, -232, 5093, 7298, 8660, 4262, -224, 1975, 2377, -3142, -5996, -5250, -4221, -8815, -12172, -12682, -3576, 56, -1113, -5680, -7466, 1968, 1033, -175, -517, -7391, -9736, -9751, -5924, -6437, -11029, -5469, -1553, -609, -347, 2738, 3779, -117, -1386, -1830, 4634, 5242]
5790E242r198P73O536N376k702m511l045K295J326j674J825N609K345p708n013
5775b524K449K300n36l81k470n050q647k73N274j062l022L228R642o42k545k716
5759f975P624K056n652N637q773m227L132k565J65j097j534n893K81q6N306K722
5743i879k814K807Q101N302n177l128n224J998J967P438j206n743J06R969j357
5728C160j821n853j1566r14Q757L608j806m162l579J62O554M130L07j416J137
5713c302M324Q40j284j031l843j487k067n727o713L313R598Q120L285M033M815
5698A2874R21o72m247m105M45j562o12l565J065r106o900K260N413N711j97K662
5682C85k271m190k080J5n166N78J0367N965r537R3P586j304n638L206O313l812
$$ y = [5242, -3956, -3183, 3353, 8729, 6027, 1516, -1529, 766, 2092, 418, 2243, 7852, 10197, 2489, -2524, -75, 2225, 1689, 1308, -1162, -6212, -14859, -15132, -9858, -10920, -13942, -10714, -1072, -1714, -4259, -6975, 649, 2705, -2947, 2690, -6083, -10310, -7178, -9743, -9578, -10675, -12209, -18102, -17821, -17907, -12601, -9879, -12693, -9886, -1785, 3517, -1660, -4788, -10012, -8014, -6047, 1391, 185, -5558, -5452, 4517, 3160, 1339, -4514, -16080, -16994, -8237, -4629, -6435, -10597, -14176, -14014, -7460, -3330, -3023, -4439, -3302, 1022, 1862, 578, -453, -4296, -5783, -7850, -13577, -20290, -16977, -7379, 741, 4026, 8059, 12874, 13795, 13123, 8876, 4771, 5216, 3654, 3042, -523, 542, -8564, -15464, -13204, -7791, -2080, -2277, 385, -1886, -6076, -8156, -8141, -13307, -12729, -2362, 3603, -5934, -5841, 1745, 441, -5197, -1991, 4322, 510]
5666E10J588O913J567j020k807Oj56R56l918o41m944L406j218n08J301j319J048
5649G64M657K841l489j369k531l659K633O083L226O36n726q015p268N66O129L97
5633d125M372O270m9j046k506l569j140N320M044m490J571Q66k736J5O3q247j515
5616f902p58N155O583J573p749q738l794N00J4629M268p384m033m032M048K309
5601d325k103k354j948k926k647M177K595J112N779J124M229k612p53k554p92
5586c998j220k668M962n931p663L288O476K117O378K799l474J511m858K071L659
5571C449K25p790j151j019L7L96j767L489r40K372K197K515J775l178r01K78m168
5554d181j286q95k681M045J403J249M357M363m275l032j915j87k206O998K452
$$ y = [510, 2098, 9011, 10578, 9558, 6751, 6757, 6601, 7557, 3639, 2998, -1946, 1460, 242, -266, 1035, -284, 764, 5421, 8262, 4773, 3404, 873, -2786, -153, 5930, 9156, 9792, 4066, -3949, -11217, -10651, -4522, -4125, 247, 6517, 6468, 5422, 2916, -653, -1793, 3527, 7571, 3081, 4652, 5518, 2782, 2797, 2860, -5387, -6902, -7660, -2505, 4078, 5651, -2098, -10836, -14630, -14130, 499, 4767, -2617, -6650, -10682, -6634, -4325, -6428, -8782, -10730, -13656, -16303, -12126, -9531, -8419, -2640, -1516, 2713, 101, -652, -3206, -3998, -5218, -7886, -2924, -8855, -16518, -13230, -6754, -4637, 1741, 4540, 1066, 2577, -2281, -210, 3449, 3674, -4116, -5267, -6286, -6249, -5853, -7620, -4131, -5071, -2699, -502, 2013, 3788, 610, -291, -13, -4181, -5467, -6362, -9043, -4998, -3595, -2346, 2011, 6374, 2099, -933, -2848, -3035, -5241, 1757, 4209]
5539D209j179M412K993K472J846j514k355M208K652q459K695j736j0133J188K629
5524C928l587n955o794L915O615J516J87n986k758Q60J342l8J060L918K642L254
5508D119O7L03O09m643j233M874O236k973l398q215m727j44J357R927M467J584
5492H210n487l505k309n382k214N800P356l422P43J096m331J773q34O75j009k859
5476e699l113J754P716J190m337J177O97L672o7J931K31p423M102o2K166J051
5460D986n015o991M388M705p672m934j057j900M574O585j064j155m70M204k883
5445c699Q68L202N481j613l126o099l820J305N209N384r63q19N426j560o495M866
5429C547o353j874J111N024j58j333j433L574J145p199k003J088P791L889n805
$$ y = [4209, 3030, 7442, 10435, 12907, 14753, 13239, 10884, 15092, 17744, 9285, 11980, 10244, 111, 1299, 3928, 341, -5614, -12408, -8493, -1878, -362, -175, -6161, -8919, -8059, -6717, -6755, -5695, -1777, 865, 4119, 4186, 4489, 5098, 455, -778, 4096, 10332, 7359, 3961, -4254, -8981, -9125, -7768, 2159, 6626, 8210, 2723, -782, -3091, -8473, -10687, -4887, 2469, -953, -210, 886, -3445, -1672, -2506, -1831, -2840, -5699, -8812, -7058, 658, 1848, -2489, -1312, -615, 3057, 2990, 4921, 5152, -2271, 1831, 1769, 3935, 4986, -29, -7020, -2632, 2073, -5599, -10533, -11590, -13490, -8916, -2331, -3395, -4550, -5020, -816, -3699, -2831, 371, 5852, 4239, 1113, -4986, -8806, -7501, -2292, 3092, 2129, 1310, 6736, 5176, -1319, 3547, -2806, -4680, -3569, 1455, 1297, -36, -1469, 2105, 3250, -3949, -5952, -4864, 2927, 6816, 1011]
5414A011p952n388j849N29P778J63l160K032Q408o747L77O878q59m686j685l457
5398h607p03J099M504L317m6P6M636N337n931j24l671k944J562m548L935J510
5382e98K836M43o999K289O26R1j114j963j483J862K927j435K840J795j289j13
5366G15M714M388j444l077k840k934J006j866q916k947J0550M657k433k781Q521
5351E313K762N568n662j1026k731Q476K549m083p04N374m437k728M25K604n713
5336d013P236J0748n214l544K086m128m656j263L495l532J856k755L240J888k574
5321a130l909Q71n654M253P70j020Q56j939K536K128l041J105K752j784Q80J059
5305a267R60k548L452P773l439J312O200m455q283p45k598p193J399J961k163
$$ y = [1011, -6941, -12329, -14178, -13649, -5871, -5708, -8868, -6836, 1572, -5175, -4798, 2080, 1221, -3465, -5150, -8607, -9310, -8211, -3707, -390, -436, -360, 4276, 9613, 3682, 3558, -113, -3057, -1495, -6043, -2108, -598, 2238, 2681, -4318, -2029, -1403, -1312, -2426, -4389, -5872, -4010, -1083, -2518, 322, 2117, 828, 715, 5429, 9817, 8373, 5296, 2456, -478, 528, -1338, -10254, -13201, -2651, 2006, -427, -3208, 5313, 8075, 13643, 7981, -3045, -5776, 2700, 5249, 1166, 462, 5836, 1399, -1329, -904, 1700, -4013, 3223, 13971, 8757, 5213, 7299, 3171, -1485, -2748, 747, -2785, -929, -3684, -444, 1444, -1130, -5039, -4168, -9822, -5569, -4799, -5819, -4963, -6902, -4366, -2238, -5279, -4174, -1422, -3206, -2326, -1267, -307, -2855, 597, 8370, 4931, 6243, 12443, 7988, -295, -1040, -3638, -10831, -9432, -7471, -9634]
5290i634J36L727R429J829L270L86j982O94J732q018l097L422k95K93N493K40
5274G625p343l882l069K449m436M24N162j692N384M231J2525J1101j2365j6884
5260g70j1195l436m72M232L601j236K393l989L911o118m814j665k850M31L499
5245a8478N46Q994k26K14J07L050L382K486Q33l026o993qJ491L273K68m947l248
5228a2282O392l03O066N692P87r582j091O436M622m247j0014o374m031Q499M900
5213d530K162l533Q29P420J137n053m527M044M118j768K081o08j309k039k12Q329
5197F541l37p796l727J382L170k79J610O622O172k358P4p030q594p760J988N408
5181d914R22M097J050N98K666m644l001K671J680K253J905j495j365o197l973
$$ y = [-9634, -9498, -5771, 3658, 5487, 8757, 9143, 7161, 7855, 9587, 1569, -1528, 1894, 1599, 1892, 7385, 7625, 282, -3600, -6669, -4220, -8656, -8232, -3070, -4762, 622, 4853, 17378, 28479, 16114, -770, -11965, -15401, -15873, -11641, -8040, -9276, -6883, -10872, -6961, -13079, -17893, -19558, -22408, -21977, -18478, -17932, -8938, -9164, -8950, -8843, -5793, -2411, 75, 908, -2118, -9111, -9119, -7628, -4355, -4087, -9034, -12282, -5890, -6193, -127, 5565, 6352, -3230, -4321, 2115, 6737, 2490, -7524, -13898, -17929, -9430, -4530, -2368, -5901, -5072, 2348, 3485, -1568, -6095, -2051, 2067, 299, 2380, 1772, 463, -1576, -1788, 6541, 6204, -1592, -5319, -3937, -767, -1046, 564, 7186, 13358, 11000, 11074, 4044, -4550, -12310, -10322, -4914, -3992, 105, 1155, 1753, 4419, -225, -3226, -555, 1125, 3378, 5283, 3788, 2423, -3774, -7747]
5166g747K510m564L552O123J630n045o743k387m479P784M116O399l231o816J478
5151g420R91r9K876N98L115J881j325l182K460k138n461m190L64J870o40J485
5135h815K032P18M998M027Q53k06l445m220l217k659O036K999M043j683J359j298
5119A522j200n728n971Q189M800q82M945j587j1125l848J105L637J73L827K664
5104E21K449l07k886L146K942K918p845n811k088K975l053K117M837Q166j525
5089F556j297J730n470m087k340L105J0578m460l221L595K615l636J139m30l243
5074A134L55J335j262j564o142q349O824O049M229L722k109k820J408k808O08
5059F10k47P58l877n049q835O749J0193k45n625K602j956L321Q026j143l192o16
$$ y = [-7747, -5237, -9801, -6249, -126, 1504, -3541, -10284, -12671, -17150, -9366, -5250, 1149, -2082, -8898, -7420, -6429, -6528, -3652, -3054, 61, 1942, 617, -2565, -105, -2243, -7704, -11894, -11530, -9660, -10300, -8815, -6783, -6065, -1067, 2960, 3813, 3607, 162, -4058, -7275, -9934, -3898, -899, 3144, 1461, 2820, 1522, 322, -5406, -11377, -3188, 1612, 730, 5675, 4088, -7037, -10885, -9780, -6143, -5970, -2143, 521, 2970, 2663, -223, 2923, 5865, 8783, 938, -4873, -6961, -3986, -7039, -4922, -85, 8081, 6556, 5259, 6989, 1519, -2568, -4908, -1803, 8775, 4315, 1094, 4689, 7304, 3668, 4807, 4377, 1134, 1489, 2824, 1562, -2, -6144, -14493, -7669, -1620, 2609, 6331, 4222, 1402, 2810, 2, 610, 363, 1121, -2756, -7805, -16640, -9891, 302, 57, -5568, -2966, -4922, -1601, 6425, 5282, 2090, 1474]
5043A474L306P146P5r456k918K858l32j276j371R16o288k758J0259M065L139m177
5027D662k366L571M276j662l6L177J121j181J381R77l326K703m328p671m290k29
5011c221K784m007L21J843J191J984j509j794k14K54J786k193k318j783J67J716
4995d993k327j35L765l059J771O699q23j581J041M08L616L536R3l470R06l778
4979A669l733j875l114L320K217j772J876K530m146L069L002J110m511n697j386
4964g441P94K162j706p49L279M652o22N15N894K432j497n282m659j252m452J379
4948f553J312J129M663N578J493q23l060j058o32L370j414l723o599j424O659
4933a082O569m798k952j166m359O79o867L322Q385J23n484l486j991L527O398
$$ y = [1474, 4780, 11926, 12001, 2545, -373, 2485, 2153, 877, -494, 422, -5866, -8624, 1635, 5700, 8839, 4662, 2296, 5867, 10143, 8481, 8445, 11622, 12743, 11562, 12943, 13920, 10594, 13297, 8969, 1298, -2992, -3221, -437, -4444, -4123, -2280, -1089, 895, -614, -2408, -2622, -2368, -582, -2775, -5093, -6876, -6709, -4993, -7320, -7455, -3690, -6749, -4978, 1721, 898, -683, 358, 766, 4382, 7918, 8011, 4541, 5447, 1669, -2064, -3939, -7053, -3733, -1516, -3288, -1412, 1118, -3028, 41, 3043, 4153, -358, -6055, -7441, -6647, -4485, -6191, -6940, -3661, 991, 369, 884, 6778, 9210, 7713, 2431, -2228, -3480, -7932, -6553, -5241, -4112, 551, 6129, 7622, 6799, 3739, 2681, 2049, 5419, 4005, 282, -6317, -7741, -1082, 5487, 689, -2263, -3429, -7788, -7109, -13976, -10654, -2269, -2146, -7630, -11116, -13107, -9580, -3182]
4918c182L606l865m769m99j548P37L930L397M226L390j222m365l161n161K07L853
4902d426k693M638N49k605J07o72M992o965k041n181K483J931l377M190Q170l665
4886d565J365l730j783o7L661n075j305Q824L715p54o412l234N026P704K041K389
4870G800j171n000j765K143r47J129L557M25J475Q74o525o039n45J51K422o008
4854h024R927k222m735k481J0058M068Q3k543m498n346j484j29P88J082m903K8
4838a0331K088N917K83j60j260j838N67O708L285k445j718K769n816l899q80N20
4822f210m542N016O446p72j774K877K533m028n054M99j588q31K608M079k668m710
4806h119l5K8k582J682K103N272K870j316J325j096J095l178k895J744R43j223
$$ y = [-3182, 424, -3441, -8210, -8709, -10257, -9520, -5590, -2193, 2033, 5423, 4201, -164, -3325, -8486, -8279, -4426, -7119, -2481, -1932, -4537, -4430, -5102, -110, -7075, -9116, -14297, -11814, -9883, -13260, -9070, -900, -4565, -3200, -6930, -8713, -8780, -5119, -10194, -11499, -2675, 1040, 286, -6126, -9360, -4334, 3370, 5411, 7800, 6629, 1629, -136, 2007, 1060, 2189, 5746, 6171, 7646, 8520, 1995, -4044, -4589, -4438, -2016, -8024, 1903, -319, -5054, -7535, 2523, 6591, 6674, 4131, -367, -5713, -7197, -7326, -6538, -5456, -10359, -10331, -8243, -2326, -2043, -2203, -3463, -5301, -4734, 1974, 5259, 2814, 1096, 3865, -1951, -5850, -6730, -6210, -10752, -5736, 710, -62, -1836, 1041, 3574, -454, -5508, -5009, -6597, -7428, -4820, -741, -3409, -8119, -8154, -8126, -10708, -9026, -6923, -1651, 1219, -97, 1228, 132, 1227, -1951, -4846, -3102, -2159, -3382]
4790c382L79j828L41K459O124j811k058l108J913K513m51K806K031J055n534K729
4774D178L275K272j499j689n87p331l592N471P190l925p801m915J135J879Q266
4759B327Q98m30l210r575K978O347N493K552L815p934o325m40l866m226L342Q616
4743C62L306K317j3417n215J290L410M058n03r79L317J24L24J633m08l741mJ669
4726b457m51J265J01j364J739L890K237j820o4k671K415P22n619m750N30M416
4710a881k965j094m580q754J886J1284M027M85j788k104k934J558r077m484R782
4695a0639R324M315j897p379l700M953K946k593l819p53j539n247J041L535m69
4680a1921O18P125j670o60N24Q307k353J068k515o06k072l092k848K706O491j396
$$ y = [-3382, -3003, -4831, -4490, -2031, 4093, 2282, 224, -2884, -971, 1542, 1091, 3897, 5928, 6983, 1449, 4178, 7453, 9725, 8226, 6537, 5950, -1381, -4973, 498, 7688, 3763, -4038, -8953, -7818, -5939, 2327, 3225, 2795, -415, -9990, -7012, -665, 4828, 7380, 11195, 3261, -3064, -3504, -7370, -11596, -8254, 362, 3668, 5985, -7432, -12647, -11357, -7947, -3889, -4392, -5371, -2054, -1930, -1606, 27, -381, -4122, -4126, -2457, -2908, -1643, -1542, -2906, -1167, 2723, 4960, 3140, 3076, 405, 2820, 3542, -2077, -6827, -6297, -1881, -4846, -5940, -10520, -19274, -17388, -6104, -2077, -1592, -3380, -5484, -8418, -6860, -15937, -20421, -10639, -1315, 3000, 1103, -6276, -9976, -5023, -2077, -4670, -8489, -9242, -10781, -16028, -14987, -11452, -11921, -11303, -4178, -5848, -6508, -5984, 2323, -30, 1038, -1477, -2083, -4155, -7247, -10095, -7389, -898, -2294]
4664b294L229J956M286L01k882l037K033l779q144p011K377M759j787K794O564
4649f35m65l692m107j82O485j107n999L940P27N401N431N92m564k524k462k665
4633e826N067n41k157L590J965k774K117k267p60m084J000M83M269J488k307j447
4617b184n502k424k305K358O20K965l853q42J1362N905l322l322l094Q846O407
4602A1615n465p107M354L434l037p195o13L224P71Q084n304r703M88K82m83K793
4586c862j550j571P470n303m662K641N694M629j851m219J776k255p828m87R116
4571b262J321l800o540k911O924P432L639O333L070p544l076l742j685O534l09
4556C384o655m226K97k64k568M172k546N274j854M313l907J110Q155n904j948
$$ y = [-2294, 935, 2891, 7177, 7478, 4596, 1559, 3592, -187, -8331, -15342, -12965, -8206, -9993, -7199, -635, -1100, -4792, -8899, -9081, -2596, -3703, -9702, -5762, -5035, 366, 5797, 6389, 1825, -699, -3161, -5826, -759, -1300, -3457, 133, 2098, -676, 1441, -826, -1586, -5670, -4670, -4187, 82, 1570, -737, -2184, -7686, -10110, -12415, -10057, -9437, -6472, -10325, -11167, 195, 6100, 2778, -544, -3638, 5208, 11615, 6150, -957, 3397, 6831, 3794, -3401, -4014, -790, -19, 8065, 2761, -6942, -6454, -6172, -6655, -3862, -5412, -6983, 487, -4816, -9478, -6837, -1143, 3486, 1635, -2584, -808, -3063, -10891, -11378, -2262, -941, -4741, -11281, -14192, -7268, 164, 3803, 10136, 13206, 5662, 2586, -1156, -2841, 3693, 3384, -3271, -7497, -7200, -7464, -10032, -5860, -8406, -3132, -4986, -673, -4580, -3470, 4685, -1219, -3167]
4541c167Q053k001m735N22k918R33J655J886j914m480Q13L686O784K087J271o019
4525B456q316k891J1387N18j804k554m895M24k718J196j793n23k484L014J946
4510g037K280r564O000M126M124n654j556K72j964L426J14j138M878L226Q685
4495A0218p46o352j897K161J930j63o354K997n45j289P44q157k584J895L814k792
4479g120M164K332j273p7N318J085K720j130k903l375k479P47J908k219K857l047
4463b492M760N318R02l983J88O708j194o092L452l886J195L009r409j1931j89
4448a3644P015M735M221j108q013L365N311J41k877j067Lq27J376k394J937r60
4432b786P973M757q007r01R3j623m74k701k318P692J930k754K427N9N13J68k33
$$ y = [-3167, 4886, 2885, -1850, -1328, -4246, -3313, -1658, 228, -1686, -6166, -5353, -1667, 5117, 7204, 8475, 2456, -5860, -8751, 2636, 3154, 1350, -1204, -6099, -5675, -8393, -7197, -8990, -9513, -11997, -8983, -7037, -4757, -14321, -8321, -4195, -71, -5725, -7281, -7009, -8973, -5547, -5433, -6571, -1693, 1533, 10218, 9472, 3120, 1223, 3384, 5314, 5151, -1203, 1794, 1249, -40, 704, -7453, -10037, -8142, -4328, -7120, -2956, -624, -1897, -1974, 3344, 4429, 7149, 6019, 3116, -259, -2738, -1991, -83, -2302, 555, -2492, 2268, 7586, 8488, 4505, 4693, 11401, 10207, 4115, 7567, 3681, 4876, 7885, -1524, -13455, -13644, -6629, -1894, 2327, 1219, -6794, -3429, 1882, 2023, -854, -1921, -1918, -2745, -1369, -3763, -1826, -2786, 5187, 9944, 1937, 1036, 1129, -494, -968, -3669, -5987, 1705, 3635, 881, 3308, 3367, 3880, 4048, 3815]
4415C815j932o630l989M854N240L904J75L769k933q296J892o13r06o10O139M345
4399H224k931q922n606K299N696q100k354K927R450P327J369J619n673o862n346
4384f883q56J947L54o253k669O761J0331N495l884p877k137L149M101n794l383
4369g598O150Q808l040m049m921j436n900m403P986L105n636l571M669N041K702
4354b093k813r417q79M193M133Q015P472p314q809j0081j03P865O967l3k707k248
4338g852L43j011P375L087j720l259l242J986r73k419n16L234N387L077j171j528
4322G98J398L37k438o158O781o874n693N624Q490o02n456k177n044N984J250l62
4306d142j733N376N177j017q293k756k089O516j871N70J1222M582k987o446k710
$$ y = [3815, 1883, -4747, -8736, -3882, 1358, 5262, 5437, 9206, 6273, -2023, -131, -744, -1650, -2260, 3879, 8224, 5293, -3629, -9235, -6936, -1240, -9340, -11694, -8767, 683, 8010, 9379, 10998, 5325, -1537, -6883, -7739, -5792, -5438, -11691, -14360, -7599, 2732, 8227, 4343, -3534, -5671, -2522, 1579, -4215, -7598, -1448, 7360, 4320, 271, -4650, -6086, -11986, -16389, -8403, -5298, -10934, -14505, -9836, -4795, -2093, -4906, -14323, -15202, -11009, -6876, 1139, 8611, 1297, -7512, -17593, -17696, -9831, -2864, -2897, -5604, -7852, -7509, -8520, -1145, 1942, 222, -3037, -6279, -4293, -5266, -7685, -8201, -4967, 420, 3497, 2326, 798, 2196, 2533, 95, -6063, 718, -6156, -11849, -6225, 2265, 1663, -3793, -5970, -11014, -5030, -3780, -4142, -5875, -499, 4678, 3661, -4632, -7388, -9477, -2961, -4832, -4262, 6960, 11542, 8555, 2109, -601]
4291f01r84O541N653J872l229j452m092k560o458r608J157P340Q367J946K425
4276F317J03K342p27n022o960O376M89k915J670N657n184p354O581R979j039l481
4260F832j96M21N304l066n002j606P82P70p443j670q69j010L386Q43K974K823
4244C273r40J653J987n197n37O509L94l013o588l680J673M909N61j039n43k893
4228c471N139L406P49j122n18n287K340L042R58l872J265N748p019r437L86L170
4212d523K83p436l398O401O588j575M789L923Q66K200l308R61R64o579k684L018
4196D90J675n312J196P060n812m228N260n524m748R547o44o029J973N334N060
4181E298M15k392o97L087k288l328n975p12L228k031k891K339P72p501j825L852
$$ y = [-601, -1585, 4956, 10609, 12481, 9252, 7800, 3708, 1148, -5310, -14918, -13761, -6421, 1946, 3892, 6317, 6420, 8762, 8035, 3013, -3947, 2429, 2918, 3, 1673, 7330, 2146, -5208, 1373, 11352, 10313, 6832, 6636, 7057, 12361, 9295, 4293, 2687, 3469, 4239, -3204, -4874, -5743, -6753, -3367, -2524, 450, 3273, 2333, 3986, 5973, 776, 239, 6748, 7142, 4129, -2459, -6139, -4466, 443, 1004, -35, -578, -3471, 1668, 5074, 5823, 4701, 4183, -1104, 1236, 4278, 5236, 1364, 2629, 8377, 1358, -8079, -7693, -4523, -4240, -11676, -15074, -8673, -2085, -3660, 1129, 5052, 5918, 8118, 4810, 5771, 6735, 156, -2528, 490, 2165, -3147, -1951, 5109, -703, -4931, 329, -5195, -9943, -396, -1040, -7069, -5096, 238, 5298, 5713, 3321, 2624, 5711, 3423, 95, -5880, -6592, -3364, -5395, -8286, -5947, -5175, -12676, -14501, -10649]
4165a0649r5M346M883l95J303J046K459K427K537K816m725m184o999m795n697
4150a5722N670Q14K082L227n280j16N172K139M661K896l295J600M169o886K7J0052
4134A1210k20j2051m660K019j56q095K778K014O10o60N877n44j397N551J709j354
4118B631n910n620M792r14M012N571l28R88m024l14l807Q62l771M028R50j080
4102a934NP011O032j783r717o247l207K793M401o392m609Q057O702L476o405j0454
4086a2271k8Q198J2023J007r44n77j073n110o698N827P901k436j071o978J089
4071a141L761J403o878k840N34N223j920j902M56j48J430P281k181q043j121k314
4055h400N892L470R66N19K428O9l610J39p99k594Q80j79J502K595L44n59N77l829
$$ y = [-10649, -10744, -6398, -1515, -1910, -607, 439, 2898, 5325, 7862, 10678, 5953, 1769, -5230, -10025, -15722, -10052, -9238, -7156, -3929, -9209, -9325, -4153, -2014, 2647, 5543, 2248, 3848, 8017, 1131, 1158, 11210, 10990, -1061, -5721, -3702, -3858, -11953, -9175, -7161, -6551, -7211, -1334, -1878, -3275, 2276, 3985, 2631, -3279, -8899, -4107, -5021, -1009, 4562, 4234, 5222, 1198, 884, -2923, -2061, -5832, -1804, -854, -1934, -1929, 5082, 11114, 9331, -386, -6633, -9840, -7047, -2646, -9038, -13647, -5590, 1112, 4588, -1817, -12271, -12299, -4101, 7922, 8929, 7985, 7408, 6335, 1225, -5473, 354, 8255, 5819, 4748, -2230, -1141, 2620, 4023, -2855, -5695, -5161, 62, -1858, -3760, -3304, -3452, -2022, 5259, 3078, -4965, -6086, -8400, -2508, 962, 1928, 2447, 4875, 4944, 1334, 1473, 674, -1920, -1040, -1219, 283, 2878, 3222, 2663, 3240, -589]
4037e89L187Q108r52j723L788n731n444J495m287n143M921N421m132L362N12K94
4021C087m465K085J660K637j973l616n64P330k16J807m13k40m69l080o766l063
4005f259j020k753j770P289Q421K972m729K84j820M54l062K712K760l316k777
3990b614M466j85r297o696M722K399Q00k92L18P33j338m26P68l687L682K22P31
3973e694O091O530M79k670m512l531k084k142O28J084K047N204Q93om147o741
3957h571K00k274L155K161n014N333M057L658m785p654l278N826N988K867l108
3942a439p822o41K578l117p335P90P883P850k490o200N712M859l677L798O335
3927G084L882r808j0337L479P184o23j867K527K9J523l135p167n753L934Q773
$$ y = [-589, 2598, 10706, 9754, 8031, 11819, 6088, 644, 2139, -2148, -7291, -2370, 3051, -1081, 2281, 2793, 3087, -1378, 707, 2367, 5004, 3031, -585, -1149, 6181, 5965, 7772, 7359, 7119, 6650, 3570, -3196, -6259, -7279, -10032, -11802, -4513, 3908, 6880, 2151, 2435, 615, 1069, -1993, 719, 3479, 163, -2614, 1852, 1667, -7630, -14326, -9604, -7205, -6405, -6697, -6379, -5646, -6984, -7410, -6642, -10329, -6647, -6425, -5694, 397, 6927, 7406, 4736, 224, -3307, -5391, -7533, -6905, -5821, -3774, 1430, 2323, 2317, -1830, -8571, -8371, -10645, -7490, -5329, -10343, -5010, -953, 2705, -2080, -9734, -13012, -7186, -1198, 1669, -1439, -9261, -9902, -7324, -10441, -17776, -16986, -9103, -1253, -3743, -9943, -4231, 628, -3049, 749, 7084, 10966, 1158, -9179, -5700, 1484, 861, -1006, 1521, 1550, 3073, -62, -7229, -12982, -9048, -275]
3912b75K139J83R88K142l838r15M065j008K351L814M07r841l925J705J242J617
3896H51j978J016P699l347p101k118O177M897K185M70O88k557j138o943J400K763
3880B964Jl722k111J987R89N028P445l986p187j658L898O722k097k351o119l32
3864e29m405m836Q123m954n452M789R271K63l357k149N497l570l132K921N375
3849C855K559r07l438P2n093k990M87R28M42M378J79q341L006K890L3l404R471
3832D127l853q511P133L832l065Q01O181j2811L72N793L805J790p433k098k083
3817f020k858K274l398k29j075L236M328j442k212Q51J156J274M577K607o5m737
3801a733r496j878J989P051N541o14j783k013K26K53K553O99p861n576K813J831
$$ y = [-275, 1864, 2047, 3035, 5177, 1339, 424, 4489, 3481, 5832, 9646, 10053, 212, -3713, -2008, -766, 851, -1127, -111, 7588, 4241, -2860, -4978, 1199, 6096, 8281, 8751, 9439, 6882, 5744, -1199, 201, 2964, 2965, -757, -2868, -881, 108, 5136, 12581, 8595, 1408, -250, 3648, 10370, 8273, 5922, -197, -529, -4934, -9770, -1647, -6601, -12053, -7264, 2007, 2270, -1087, -3236, 2261, -1309, -4441, -1520, 3855, 6414, 5507, 2069, 2141, -2952, -5942, -5455, -4527, -4085, 293, 472, -7869, -4863, -1973, -1940, -5344, 4127, 274, -8237, -1104, 2728, -337, 464, 6645, -6166, -5794, -1, 3804, 5594, -1839, -3937, -6020, -8878, -6604, -10002, -10231, -11306, -8070, -3742, -5184, -7396, -6545, -5389, -4115, 462, 3069, 3004, -1733, -11229, -13107, -11118, -4067, 1474, 860, -923, -2936, -2710, -2457, 96, 795, -7066, -12642, -9829, -7998]
3785g998R164P422J120K099n451o877J889L23q223M019N709k236L898j683k515
3770F60m451k022m73j505R388J0337m930q980L960L051J646Q89K16R77J835k961
3754G637P58o098J01p652l030K555M610P267J889l201n15K997j294n760n428K073
3738c091M054L739r70o686J475O222l011M000o01N87j939l344M688o005m734m387
3722a0003r63Q043L184L153j219k315k613l446L436K758m058L494k876l094M956
3707a563K040n618M108L491p001J007K271o62J190O04J735L011J563K937n662
3692C451k609M189m143p636J809L720L72J112O578K522p529l809O326M995l588
$$ y = [-7998, 1166, 8588, 9708, 11807, 6356, -521, 1368, 1691, -6532, -2513, 3196, 960, 4858, 3175, 660, -3791, -5813, -6286, -7791, 1597, 11934, 7004, -1976, 1984, 5035, 6681, 7570, 7786, 8763, 10598, 7637, 8395, 2297, 2398, -5254, -8284, -5729, -1119, 6148, 8037, 4836, 4321, 7318, 6024, 264, -5164, -3091, 963, 4702, 3732, -2954, -1479, 4743, 1732, 5732, 5131, 5718, 3779, 435, 5123, -882, -5616, -10003, -10966, -2923, 261, 3414, 2195, -120, -2733, -6179, -2743, 15, -4043, -549, -3425, -6519, -1563, 477, -5141, -1033, 2458, -4543, -3536, -1265, -1927, -737, -133, 1602, 4613, 6176, 9113, 3451, 842, 5031, 888, -6748, -4939, -1219, -847, 265, 6843, 9365, 1836, -1973, 4353, 9348, 5760]
$$ [...]
##END NTUPLES=NMR SPECTRUM
##END=
