##TITLE=Analysis number 322732
Compound Code mo 00344
Project Code adrs
Chemist Name ugmt
##JCAMPDX= 6.0         $$ Bruker NMR JCAMP-DX V2.0
##DATA TYPE= NMR SPECTRUM
##DATA CLASS= NTUPLES
##ORIGIN= Bruker BioSpin GmbH
##OWNER= nmr
$$ XWIN-NMR		Version 3.5
$$ Sat Oct 14 12:03:30 2006 GMT Daylight Time (UT+1h)  MAYBRIDGE\nmr@NMR_250MHZ
##.OBSERVE FREQUENCY= 250.131544655141
##.OBSERVE NUCLEUS= ^1H
##.ACQUISITION MODE= SIMULTANEOUS (DQD)
##.ACQUISITION SCHEME= undefined
##.AVERAGES= 16
##.DIGITISER RES= 18
##SPECTROMETER/DATA SYSTEM= dpx250
##.PULSE SEQUENCE= zg30
##.SOLVENT NAME= CDCl3
##.SHIFT REFERENCE= (INTERNAL, CDCl3, 0, 16.522)
##AUDIT TRAIL= $$ (NUMBER, WHEN, WHO, WHERE, WHAT)
$$ ##TITLE= Audit trail, XWIN-NMR		Version 3.5
$$ ##JCAMPDX= 5.01
$$ ##ORIGIN= Bruker BioSpin GmbH
$$ ##OWNER= nmr
$$ C:\u/data/dgb/nmr/ADRS/340/pdata/1/auditp.txt
$$ ##AUDIT TRAIL=  $$ (NUMBER, WHEN, WHO, WHERE, WHAT)
(   1,<2006-10-14 12:03:08.64 +100>,<MAYBRIDGE\nmr>,<NMR_250MHZ>,
      <created by zg, POWCHK disabled, PULCHK disabled
       configuration hash MD5:
       49 4B E0 1D 92 C2 6B 37 9F E6 65 BC 52 41 86 1D
       data hash MD5: 64K
       34 65 34 D9 F5 C1 E2 53 53 1A 15 E1 18 51 BB B2>)
(   2,<2006-10-14 12:03:21.59 +100>,<MAYBRIDGE\nmr>,<NMR_250MHZ>,
      <Start of raw data processing
       ef LB = 0.3 FT_mod = 6 PKNL = 1 SI = 32K 
       data hash MD5: 32K
       6F 63 60 D3 E5 10 9C A7 02 D2 26 D1 CE 8C E7 D5>)
(   3,<2006-10-14 12:03:23.28 +100>,<MAYBRIDGE\nmr>,<NMR_250MHZ>,
      <apk 
       data hash MD5: 32K
       47 A2 D6 59 5F 72 BB 2B D1 1F 4A 07 DE 80 ED 90>)
(   4,<2006-10-14 12:03:24.07 +100>,<MAYBRIDGE\nmr>,<NMR_250MHZ>,
      <abs ABSG = 5 
       data hash MD5: 32K
       3F 82 01 B2 0A 3C 36 DA E0 29 37 42 C2 7A 0D CD>)
$$ ##END=
$$ 
$$ hash MD5
$$ 11 A5 A0 48 07 5B 3B B9 27 AA 76 55 1B B7 4C 4E
##$RELAX= 
##$RELAX= 
##$RELAX= 
##$RELAX= 
##$RELAX= 
##$RELAX= 
##$RELAX= 
$$ Bruker specific parameters
$$ --------------------------
##$DU= <C:\u>
##$EXPNO= 340
##$NAME= <ADRS>
##$PROCNO= 1
##$TYPE= <nmr>
##$USER= <dgb>
##$AMP= (0..31)
100 100 100 100 100 100 100 100 100 100 100 100 100 100 100 100 100 100 
100 100 100 100 100 100 100 100 100 100 100 100 100 100 
##$AQSEQ= 0
##$AQ_mod= 3
##$AUNM= <au_zg>
##$AUTOPOS= <11 >
##$BF1= 250.13
##$BF2= 250.13
##$BF3= 250.13
##$BF4= 250.13
##$BF5= 500.13
##$BF6= 500.13
##$BF7= 500.13
##$BF8= 500.13
##$BYTORDA= 1
##$CFDGTYP= 0
##$CFRGTYP= 5
##$CHEMSTR= <none>
##$CNST= (0..31)
1 1 145 1 1 1 1 1 1 1 1 1 1 1 1 1 1 1 1 1 1 1 1 1 1 1 1 1 1 1 1 1 
##$CPDPRG= <>
##$CPDPRG1= <>
##$CPDPRG2= <>
##$CPDPRG3= <>
##$CPDPRG4= <mlev>
##$CPDPRG5= <mlev>
##$CPDPRG6= <mlev>
##$CPDPRG7= <mlev>
##$CPDPRG8= <mlev>
##$CPDPRGB= <>
##$CPDPRGT= <>
##$D= (0..31)
0 1 0 0 0 0 0 0 0 0.06 0 0 0 0 0 0 0.0002 0 0 0 0 0 0 0 0 0 0 0 0 0 0 
0 
##$DATE= 1160823787
##$DBL= (0..7)
120 120 120 120 120 120 120 120 
##$DBP= (0..7)
150 150 150 150 150 150 150 150 
##$DBP07= 0
##$DBPNAM0= <>
##$DBPNAM1= <>
##$DBPNAM2= <>
##$DBPNAM3= <>
$$ [...]
##$SUBNAM7= <"">
##$SUBNAM8= <"">
##$SUBNAM9= <"">
##$SW= 20.6930455092707
##$SWIBOX= (0..15)
0 0 3 0 0 0 0 0 0 0 0 0 0 0 0 0 
##$SW_h= 5175.983436853
##$TD= 65536
##$TD0= 1
##$TE= 683.16
##$TE2= 300
##$TE3= 300
##$TEG= 300
##$TL= (0..7)
0 120 120 120 120 120 120 120 
##$TP= (0..7)
150 150 150 150 150 150 150 150 
##$TP07= 0
##$TPNAME0= <>
##$TPNAME1= <>
##$TPNAME2= <>
##$TPNAME3= <>
##$TPNAME4= <>
##$TPNAME5= <>
##$TPNAME6= <>
##$TPNAME7= <>
##$TPOAL= (0..7)
0.5 0.5 0.5 0.5 0.5 0.5 0.5 0.5 
##$TPOFFS= (0..7)
0 0 0 0 0 0 0 0 
##$TUNHIN= 0
##$TUNHOUT= 0
##$TUNXOUT= 0
##$USERA1= <user>
##$USERA2= <user>
##$USERA3= <user>
##$USERA4= <user>
##$USERA5= <user>
##$V9= 5
##$VALIST= <valist>
##$VCLIST= <CCCCCCCCCCCCCCC>
##$VD= 0
##$VDLIST= <DDDDDDDDDDDDDDD>
##$VPLIST= <PPPPPPPPPPPPPPP>
##$VTLIST= <TTTTTTTTTTTTTTT>
##$WBST= 1024
##$WBSW= 4
##$XGAIN= (0..3)
0 0 0 0 
##$XL= 0
##$YL= 0
##$YMAX_a= 524608
##$YMIN_a= -399317
##$ZGOPTNS= <>
##$ZL1= 120
##$ZL2= 120
##$ZL3= 120
##$ZL4= 120
##$ABSF1= 16.522
##$ABSF2= -4.171173
##$ABSG= 5
##$ABSL= 3
##$ALPHA= 0
##$AQORDER= 0
##$ASSFAC= 0
##$ASSFACI= 0
##$ASSFACX= 0
##$ASSWID= 0
##$AUNMP= <proc_1d>
##$AZFE= 0.1
##$AZFW= 0.1
##$BCFW= 0
##$BC_mod= 0
##$BYTORDP= 0
##$COROFFS= 0
##$CY= 12.5
##$DATMOD= 1
##$DC= 0
##$DFILT= <>
##$DTYPP= 0
##$F1P= 14.0000005364418
##$F2P= -0.99999901652339
##$FCOR= 0.5
##$FTSIZE= 32768
##$FT_mod= 6
##$GAMMA= 0
##$GB= 0
##$INTBC= 1
##$INTSCL= 1
##$ISEN= 128
##$LB= 0.3
##$LEV0= 0
##$LPBIN= 0
##$MAXI= 10000
##$MC2= 0
##$MEAN= 0
##$ME_mod= 0
##$MI= 0
##$NCOEF= 0
##$NC_proc= -4
##$NLEV= 6
##$NOISF1= 0
##$NOISF2= 0
##$NSP= 0
##$NTH_PI= 0
##$NZP= 0
##$OFFSET= 16.522
##$PC= 1
##$PHC0= -42.4966
##$PHC1= 8.183173
##$PH_mod= 1
##$PKNL= yes
##$PPARMOD= 0
##$PSCAL= 4
##$PSIGN= 0
##$REVERSE= no
##$SF= 250.13
##$SI= 32768
##$SIGF1= 0
##$SIGF2= 0
##$SINO= 400
##$SIOLD= 32768
##$SREGLST= <1H.CDCl3>
##$SSB= 0
##$STSI= 32768
##$STSR= 0
##$SW_p= 5175.98343685301
##$SYMM= 0
##$S_DEV= 0
##$TDeff= 65536
##$TDoff= 0
##$TI= <Analysis number 999999
Compound Code 99
Book Reference 9
Project Code 9>
##$TILT= no
##$TM1= 0
##$TM2= 0
##$TOPLEV= 0
##$USERP1= <user>
##$USERP2= <user>
##$USERP3= <user>
##$USERP4= <user>
##$USERP5= <user>
##$WDW= 1
##$XDIM= 32768
##$YMAX_p= 302679659
##$YMIN_p= -609615
$$ End of Bruker specific parameters
$$ ---------------------------------
##NTUPLES= NMR SPECTRUM
##VAR_NAME=  FREQUENCY,     SPECTRUM/REAL,   SPECTRUM/IMAG
##SYMBOL=    X,             R,               I
##VAR_TYPE=  INDEPENDENT,   DEPENDENT,       DEPENDENT
##VAR_FORM=  AFFN,          ASDF,            ASDF
##VAR_DIM=   32768,         32768,           32768
##UNITS=     HZ,            ARBITRARY UNITS, ARBITRARY UNITS
##FACTOR=    0.157963299565203, 1,           1
##FIRST=     4132.6476996994, 0,             0
##LAST=      -1043.33573715361, 0,           0
##MIN=       -1043.33573715361, -609615,     0
##MAX=       4132.6476996994, 302679659,     0
$$ Real data points
##PAGE= N=1
##DATA TABLE= (X++(R..R)), XYDATA
$$ [...]
23712d7404K2183r6672q7196L6777l325J00886J10423J00783r0923n4646J91026
$$ -47404 -25221 -121893 -209089 -172312 -175637 -74751 35672 136455 45532 -9114 181912
23701A81912J01763j23135K8058L9221m8729q6878j46038J039M3768R892m7339
$$ 181912 283675 160540 188598 227819 179090 92212 -53826 -52787 -9019 873 -46466
23690d6466N8031m8020n2348j28508J44450J25702m6206o3089l8674P9220R8173
$$ -46466 11565 -36455 -88803 -217311 -72861 52841 6635 -56454 -95128 -15908 82265
23679H2265J88812L1313k5508p6960q8959n0686p8767L9323R1511K2856M267j9133
$$ 82265 271077 302390 276882 199922 110963 60277 -18490 20833 112344 135200 139467 120334
23667A20334n4664j7050M6179J63799q5999j8189O2294j25338l7713k2422k8282
$$ 120334 65670 48620 94799 258598 172599 154410 216704 91366 53653 31231 2949
23656B949j55519J9012N6014M0659k783J4409j3500J407k8033P118k3100R3021
$$ 2949 -152570 -133558 -77544 -36885 -39668 -25259 -38759 -37352 -65385 -58267 -81367 11654
23644A1654q2119p4091l5112O3005N1374o3328O4313l459q988n2329J5395J112
$$ 11654 -70465 -144556 -179668 -116663 -65289 -128617 -64304 -67763 -76751 -129080 -113685 -112573
23632a12573N8693J7350L9820o0068n0266Q7328j0663M4849M9574j28178j8135
$$ -112573 -53880 -36530 3290 -56778 -107044 -19716 -30379 14470 64044 -64134 -82269
23621h2269J10678J03862r0417k12020n1422K848O9148R9471J03307J15477o4140
$$ -82269 28409 132271 41854 -170166 -221588 -218740 -149592 -50121 53186 168663 104523
23610A04523r2705m7850M7243j7329J07432J54090j9795j14966o766J00977o1067
$$ 104523 11818 -36032 11211 -6118 101314 255404 235609 120643 113877 214854 153787
23599A53787j02419K1143N2246n8170j13683j55423Q443N6656M6789o670j71144
$$ 153787 51368 72511 124757 66587 -47096 -202519 -194076 -137420 -90631 -97301 -268445
23588b68445m2998K06400J67145P0797n5472j1546p6625O8439J57066q9176m2339
$$ -268445 -311443 -105043 62102 132899 77427 65881 -10744 57695 214761 125585 83246
23577H3246m8957p4545L2276Q4618P4678l6949n5283J6911o1524r1117M3245K3386
$$ 83246 34289 -40256 -7980 76638 151316 114367 59084 75995 14471 -76646 -33401 -10015
23565a0015n7464r1023K6487R1803p7819j6188J3571j1620q380J14116K3043j6609
$$ -10015 -67479 -158502 -132015 -40212 -118031 -134219 -120648 -132268 -140648 -26532 -3489 -20098
23553b0098j26225m5970J36200P207n9203P3343Q3886N5994M9253m0821j51972
$$ -20098 -146323 -192293 -56093 -48886 -108089 -34746 49140 105134 154387 113566 -38406
23542c8406n336J66315J02673J2395j6026r7084j49478o1391n3095M7460J21351
$$ -38406 -43742 122573 225246 237641 221615 124531 -24947 -86338 -139433 -91973 29378
23531B9378L4438l1377j17247n3453j2425k1898j89838k9081J04981L5921J91399
$$ 29378 63816 32439 -84808 -138261 -150686 -172584 -362422 -391503 -286522 -250601 -59202
23520e9202N8356n9796j38976Q5497K36499M5551n4114M8509j29216m7433j9960
$$ -59202 -846 -60642 -199618 -114121 122378 167929 113815 162324 33108 -14325 -34285
23509c4285p2836m0067Q7631k347J1696J17349J0798k2368M2725L9030l5030o9085
$$ -34285 -107121 -147188 -59557 -61904 -50208 67141 77939 55571 98296 137326 102296 33211
23497C3211o9609j13262P8726J05J8128O6411o4785l6585l8361J76886j889K593
$$ 33211 -36398 -149660 -70934 -70829 -52701 13710 -51075 -87660 -126021 50865 48976 51569
23485E1569M2736k20273j68037l6386J55618J20676J6820j26575p632P4762P4287
$$ 51569 94305 -125968 -294005 -330391 -174773 -54097 -37277 -163852 -171484 -96722 -22435
23474b2435J37325j227j5794n3673J3197r4124j36442L4753L9691M6095k9911
$$ -22435 114890 113663 97869 44196 57393 -36731 -173173 -138420 -98729 -52634 -82545
23463h2545n5416k3579Q2474J9475Q3334L6308P5131K7643j49959k766N5306J22365
$$ -82545 -137961 -161540 -79066 -59591 23743 60051 135182 162825 12866 10100 65406 187771
23451A87771j42350M5958n423P3536o3722l2573M2980j5256k4235j29486n4359
$$ 187771 45421 91379 85956 159492 95770 63197 106177 90921 66686 -62800 -117159
23440a17159J55571j72j2831J17448j14230j40996o7416J02936N356m2123J26992
$$ -117159 38412 38240 25409 142857 28627 -112369 -179785 -76849 -71493 -113616 13376
23429A3376J21012L7424j02565k978k1484O7578J16637n899M6013j6168j19060
$$ 13376 134388 171812 69247 66269 44785 112363 229000 223101 269114 252946 133886
23418A33886j31059N1004O9617p8973q9122P9396N6547j35901j18045J36293J66520
$$ 133886 2827 53831 123448 44475 -44647 34749 91296 -44605 -162650 -26357 140163
23407A40163m7182Q4154R4449l9222M320j29109r1885Q6499m3359k4259M7560
$$ 140163 92981 177135 271584 232362 236682 107573 15688 102187 58828 34569 82129
23396H2129M6870N3693o0033m1204p8332J8384N493j05181m012P6694J8156J690
$$ 82129 128999 182692 122659 81455 3123 21507 27000 -78181 -82193 -5499 12657 14347
23384A4347K3253N5163j0254m747L2244P9830J2813m2941k02432r1977J22020
$$ 14347 37600 92763 82509 77762 110006 189836 202649 159708 -42724 -134701 -12681
23373a2681K7547R9510n2133p3230o1043j13753l7588R1126J2047R3543M2024
$$ -12681 14866 114376 62243 -10987 -72030 -185783 -223371 -132245 -120198 -26655 15369
23362A5369n8408p9341K1156J11672K6041K3497K562m5073j0676J40919K851M9257
$$ 15369 -43039 -122380 -101224 10448 36489 59986 62548 17475 6799 147718 150569 199826
23350A99826J32999m2469k03407o8598J8726n7008K8906K16597j1856j44757j44956
$$ 199826 332825 290356 86949 18351 37077 -19931 8975 225572 213716 68959 -75997
23339g5997p0015K4898j3862J51q8569N079M4949L9648J40758J04893o4907j63196
$$ -75997 -146012 -121114 -134976 -134825 -223394 -218315 -173366 -133718 7040 111933 47026 -116170
23327a16170J674N4360m1124n7512O8144L0374J35415o400p6970n1326M7527m5485
$$ -116170 -114496 -60136 -101260 -158772 -90628 -60254 75161 68761 -8209 -59535 -12008 -57493
23315e7493J3502k9836l8567O080J13495l8923o4091m7465Q4863J03821n4015
$$ -57493 -43991 -73827 -112394 -106314 7181 -31742 -95833 -143298 -58435 45386 -8629
23304h629j75825m2218J18884O9372J49997K3591j22949k844J05356n5359p6376
$$ -8629 -184454 -226672 -107788 -38416 111581 135172 12223 9379 114735 59376 -17000
23293a7000J22309N1026m425J8306j35656j91733j8861M0186M8982l4593n9061
$$ -17000 105309 156335 151910 170216 34560 -157173 -176034 -135848 -86866 -121459 -180520
23282a80520J20804J30903K4696j20109o6401p9766J09322K3860k3587P0404j6490
$$ -180520 -59716 71187 95883 -24226 -90627 -170393 -61071 -37211 -60798 9606 -6884
23271f884J36185m699k9199o5015p7016n7338K842l6729P3447J95088N3349n8520
$$ -6884 129301 124602 95403 30388 -46628 -103966 -101124 -137853 -64406 130682 184031 125511
23259A25511j32777N6217K1117K9292O0817q8173p6539J37960P1779r920Q181
$$ 125511 -7266 48951 70068 99360 160177 72004 -4535 133425 205204 195284 203465
23248B03465M7629j01233j62252l1293L400P6129l1283J2887j16549o7063R9314
$$ 203465 251094 149861 -12391 -43684 -40284 35845 4562 17449 -99100 -166163 -66849
23237f6849K2733m5366L4980o5523k08537M2512L074j0825N7051K381K6399j098
$$ -66849 -44116 -89482 -54502 -120025 -328562 -286050 -282976 -293801 -236750 -234369 -207970 -209068
23225b09068P8998K0208R1069K2902q517o9042K1529J78949r6816j93379O8852
$$ -209068 -130070 -109862 -18793 4109 -4408 -73450 -51921 127028 30212 -163167 -94315
23214i4315R5142n8672n5659M9033Q7197o943J20205M2433m5247o8374n7112J65003
$$ -94315 827 -57845 -113504 -64471 22726 15783 135988 178421 133174 64800 7688 172691
23202A72691j9912j05452K3197M1679n250m0021L3682j7933N5688l5578r4228
$$ 172691 152779 47327 70524 112203 106953 66932 100614 82681 138369 102791 8563
23191H563l8422j09289m5076J76668n4924N850J6852L5611L922J10011K5888o6138
$$ 8563 -29859 -139148 -184224 -7556 -62480 -56630 -39778 -4167 -245 109766 135654 69516
23179F9516m500l3540j250j1558P1153M5087j49335k33071R0458K14385l9179
$$ 69516 65016 31476 30226 18668 89821 134908 -14427 -247498 -157040 57345 18166
23168A8166m1346l6530K2233r444k9511L3504j7803l3819o337O9116M6674j40670
$$ 18166 -23180 -59710 -37477 -46921 -76432 -42928 -60731 -94550 -100887 -31771 14903 -125767
23156a25767R1509r182r4417J12776l0084R4344N3591j47218r8275l9285N4573
$$ -125767 -34258 -43440 -137857 -25081 -55165 39179 92770 -54448 -152723 -192008 -137435
23145a37435Q8863o0298L4317N5601M5163j06530J12235L22j2457O0593M3326
$$ -137435 -48572 -108870 -74553 -18952 26211 -80319 31916 32238 19781 80374 123700
23134A23700J08268n8610l7962p0577n5794P893K5436k74716k08120J22377O0579
$$ 123700 231968 173358 135396 64819 9025 16918 42354 -232362 -440482 -318105 -257526
23123b57526M1879K4048o8627J58749L8131j29998K9565o8043R95P7112N5316
$$ -257526 -215647 -191599 -260226 -101477 -63346 -193344 -163779 -231822 -230827 -153715 -98399
23112i8399l9342n4812J45526P8512n8133j24320q8499j35944n1826J57935J23651
$$ -98399 -137741 -192553 -47027 31485 -26648 -150968 -239467 -375411 -427237 -269302 -145651
23101a45651O1085n459q0628Q5528J59599K1184j00662j01992Q1938n220k5394
$$ -145651 -84566 -90025 -170653 -85125 74474 95658 -5004 -106996 -25058 -30278 -55672
23090e5672o9607J6J12070P0088R7674k2343j86765M4534J77960j06360r2964
$$ -55672 -125279 -125263 -13193 56895 154569 132226 -54539 -10005 167955 61595 -31369
23079c1369j17200j47901K40090J07090k9582j37379O9526J1676l6947M7352P8308
$$ -31369 -148569 -296470 -56380 50710 21128 -116251 -46725 -35049 -71996 -24644 53664
23068E3664m2100o8596N0816K1953l8595o5504j37667K4188K00870M3459k2637
$$ 53664 11564 -57032 -6216 15737 -22858 -88362 -226029 -201841 -971 42488 19851
23057A9851j972l969m3928Q7550K98477P2450j51184j83667j73440k4636R334
$$ 19851 17879 13910 -30018 57532 356009 428459 277275 93608 -79832 -104468 -95134
23046i5134J3461J81373P2660K5971k1618L774o0701j41877K0945P5932p9502
$$ -95134 -81673 99700 172360 198331 176713 180487 119786 -22091 -1146 74786 -4716
23035d716n9012J36091N5007N4568j17385j48719L6947n5293N2964J02970L4647
$$ -4716 -63728 72363 127370 181938 64553 -84166 -47219 -102512 -49548 53422 88069
23024H8069j5764K9250m6153q1079j16506R2627R2730o4784j11184K0133P3681
$$ 88069 72305 101555 55402 -25677 -142183 -49556 43174 -21610 -132794 -112661 -38980
23013c8980n4720N852R9694j25553M0916Q964j09662k2510O0792O9935N0030L0062
$$ -38980 -93700 -87848 11846 -113707 -72791 -63827 -173489 -195999 -135207 -65272 -15242 14820
23001A4820P8093j03602p1527P1009N5092j01352R1540P5311Q1507L5541k4409
$$ 14820 92913 -10689 -82216 -11207 43885 -57467 34073 109384 190891 226432 202023
22990B02023p2434l0101k1257Q3174R0150O1592k7931p4826m8457j29357j30347
$$ 202023 129589 99488 78231 161405 251555 313147 285216 210390 161933 32576 -97771
22979i7771n7485J3335J32816Q7186L4769q9033q4514l6901K6338Q4376N9640
$$ -97771 -155256 -141921 -9105 78081 112850 23817 -60697 -97598 -71260 13116 72756
22968G2756q0147P645K2254j26799O4513J47913R453r524P7613j1323M2521N5973
$$ 72756 -7391 254 22508 -104291 -39778 108135 117588 108064 185677 174354 216875 272848
22956B72848n8032j21221M2154Q2663n9650j15455k8469j61684j25792K7165K71021
$$ 272848 214816 93595 135749 218412 158762 43307 14838 -146846 -272638 -245473 25548
22945B5548k7957j51537N9033L6058l6859k1059J34645J38230M4053j063n8782
$$ 25548 -2409 -153946 -94913 -58855 -95714 -116773 17872 156102 200155 199092 140310
22934A40310o1508P0925O1957O2096j13816j71757l4M4671O9309o3327l1912R2808
$$ 140310 78802 149727 211684 273780 159964 -11793 -11827 32844 102153 38826 6914 99722
22922I9722m7095k2816m393R4420k635m7746J3269J25522Q5654O1212j18038j10611
$$ 99722 52627 29811 25418 119838 117203 69457 82726 208248 293902 355114 237076 126465
22910A26465K9005J7429j08600q9778K5752l9751R110p4930p2504J36734P9315
$$ 126465 155470 172899 64299 -25479 273 -39478 -30368 -105298 -177802 -41068 38247
22899C8247j4685q7206n3317n8460L3518j14006J9441o9326M4041J04661Q2890
$$ 38247 23562 -63644 -116961 -175421 -141903 -255909 -236468 -305794 -261753 -157092 -74202
22888g4202J05467j68737N8892R3790J07911j18026k06002k3751M0638k7777R3975
$$ -74202 31265 -137472 -78580 15210 123121 5095 -200907 -224658 -184020 -211797 -117822
22877a17822K2744l5520K706N3476n521M6930L363j4662j08464R6762J63092p84
$$ -117822 -95078 -130598 -127892 -74416 -79937 -33007 -29644 -44306 -152770 -56008 107084 106300
22865A06300m3077m9959J4609j5263n6753J6614k1482K4150o7795O6962M6637
$$ 106300 63223 13264 27873 12610 -44143 -27529 -49011 -24861 -92656 -25694 20943
22854B0943q9787j08025Q202K8566J330J12860K0501L6502J09426J9379p0672
$$ 20943 -68844 -176869 -168667 -140101 -138771 -25911 -5410 31092 140518 159897 89225
22843H9225j11368K1602j24425n4504R9801J42493j62793j24070J1858r335j01074
$$ 89225 -22143 -541 -124966 -179470 -79669 62824 -99969 -224039 -212181 -221516 -322590
22832c22590j13370j4698J46845J12803J25547J10307j11610n1928L0521r674
$$ -322590 -435960 -450658 -303813 -191010 -65463 44844 -66766 -118694 -88173 -97847
22822i7847K929N7315N7627l2021n2639R868n1649J48375k7171n8374N7604p2193
$$ -97847 -94918 -37603 20024 -11997 -64636 -54768 -106417 41958 14787 -43587 14017 -58176
22810e8176j8524J38974k3461r8533n0445J65004l6322M2614P4098m1578n7198
$$ -58176 -76700 62274 38813 -59720 -110165 54839 18517 61131 135229 93651 36453
22799C6453J1417Q519M3839n2199j14870J3025o5655j21113Q3369J27367j77244
$$ 36453 47870 56389 100228 48029 -66841 -53816 -119471 -240584 -157215 -29848 -207092
22788b07092N0043Q4841L7959P758P0820J30111r5955o2911O3171J16369j1128
$$ -207092 -157049 -72208 -34249 -26491 44329 174440 78485 15574 78745 195114 183986
22777A83986M364j72119k575r443j11055m8116M575L5818j24492Q7739J35019
$$ 183986 188350 16231 13656 4213 -106842 -154958 -150383 -114565 -239057 -151318 -16299
22766a6299l5625O198j4345L5922N6666O5170j20929Q8379P9217k031L4737j15488
$$ -16299 -51924 -45726 -60071 -24149 32517 97687 -23242 65137 144354 142323 177060 61572
22754F1572m6003Q8929J4596N3958m3678j35306Q30P4758l0120j6040p0238j59174
$$ 61572 15569 104498 119094 173052 129374 -5932 -5102 69656 39536 23496 -46742 -205916
22742b05916l2250R3882J09405J00760j3584N177p4275j6883q0227n6836o3773
$$ -205916 -238166 -144284 -34879 65881 52297 57474 -16801 -33684 -113911 -170747 -234520
22731b34520k19186j55909J05086K61970N1707N2360R9615m9034O0794N1510R09
$$ -234520 -453706 -609615 -504529 -242559 -190852 -138492 -38877 -87911 -27117 24393 25302
22720B5302l3356j3168p6864o6634O1339p8754k5026J07157J23213Q7862M6799
$$ 25302 -8054 -21222 -98086 -164720 -103381 -182135 -207161 -100004 23209 111071 157870
22709A57870o8475K9810L4994j18138m356o3107k6665l5251L4617P2902k8969
$$ 157870 89395 119205 154199 36061 31705 -31402 -58067 -93318 -58701 14201 -14768
22698a4768J02291K1736M5253j5266k2075j43185l8948k7368M7740K894O7794
$$ -14768 87523 109259 154512 139246 117171 -26014 -64962 -92330 -44590 -41696 26098
22687B6098j04247q5283M0913P2012J1809r032j1317J1302j38068k9237J37257
$$ 26098 -78149 -163432 -122519 -50507 -38698 -47730 -59047 -47745 -185813 -215050 -77793
22676g7793J46600k3698j00397l0162O233P487P9787J9432M7335n1998M4639l8771
$$ -77793 68807 45109 -55288 -85450 -79217 -71730 8057 27489 74824 22826 67465 28694
22664B8694M7961o0555N8266N9770K3236j10809j82839q748M581j18827n2262
$$ 28694 76655 16100 74366 134136 157372 46563 -136276 -145024 -140443 -259270 -311532
22653c11532j8023J45386K6124K2484J26061O2534Q5604j7782r9445J08203K0043
$$ -311532 -329555 -184169 -158045 -135561 -9500 53034 138638 120856 21411 129614 149657
22642A49657n5026N1101j2118j65599n8597J08450P5706l519j2842j9711r4370
$$ 149657 94631 145732 133614 -31985 -90582 17868 93574 90055 77213 57502 -36868
22631c6868j45083J89205Q5872q836q662j07582Q932J6140O4590k3811J8083L8170
$$ -36868 -181951 7254 93126 84290 75628 -31954 -23022 -6882 57708 33897 51980 90150
22619I0150j25586j45579O8645M5158J9725j8461Q968j34O8280J3798p6028m1049
$$ 90150 -35436 -181015 -112370 -67212 -47487 -65948 -56980 -57114 11166 24964 -51064 -92113
22607i2113N9120j4463M2753m0398m8186p3191L572N2729Q6354L813m7887O8979
$$ -92113 -32993 -47456 -4703 -45101 -93287 -166478 -162906 -110177 -23823 -20010 -67897 1082
22595A082P0665m4345q3702R9038r836j16367K9869k7473K1456l5601l1998N3318
$$ 1082 71747 27402 -56300 42738 32902 -83465 -53596 -81069 -59613 -95214 -127212 -73894
22583g3894j0057l7108M5961J11323R9726J29059o2970k83558m4049P8354m7125
$$ -73894 -83951 -121059 -75098 36225 135951 265010 202040 -81518 -125567 -47213 -94338
22572i4338K0153j425M5320k7969o7809N3916R114L9773L0875r2126j53417O3549
$$ -94338 -74185 -75610 -30290 -58259 -126068 -72152 -63038 -23265 7610 -84516 -237933 -174384
22560a74384J84643n594N692o607q4978L6285J03811Q6491l4660j26475L8304
$$ -174384 10259 4665 10357 3750 -81228 -44943 58868 145359 110699 -15776 22528
22549B2528j2637M0968n3886M4046m4233q1710n3178P6107M2673N8414J00789
$$ 22528 9891 50859 -3027 41019 -3214 -84924 -138102 -61995 -19322 39092 139881
22538A39881J5274m3650r029k9879j3573N7643R0355q8426m8068o1090k1368L2866
$$ 139881 155155 111505 102476 72597 59024 116667 207022 118596 70528 9438 -11930 20936
22526B0936M1599j47652K4744J00184l9936o3737R8286l7512P5974n6848j01710
$$ 20936 62535 -85117 -60373 39811 -125 -63862 34424 -3088 72886 16038 -85672
22515h5672L2334N1604m4837o3064j03788O5472N1137q477l5559j1642J43239
$$ -85672 -53338 -1734 -46571 -109635 -213423 -147951 -96814 -105291 -140850 -152492 -9253
22504i253l3501j1249Q7024K581r336O5134O98n7639K5144o7890j32129N4950
$$ -9253 -42754 -54003 33021 35602 26266 91400 92098 34459 59603 -8287 -140416 -85466
22492h5466J14662j01755R673K08331m6893l8995m3198J0339M0112l1641k452
$$ -85466 29196 -72559 -62886 145445 98552 59557 16359 26698 66810 35169 32717
22481C2717N2628J46674P2261j57858j18906J14356P6139j03749j41905j32975
$$ 32717 85345 232019 304280 146422 27516 141872 218011 114262 -27643 -160618
22471a60618J814J8917l4764O397k7027R27Q1525N3951Q8524j7946p3572r211
$$ -160618 -158804 -139887 -174651 -168254 -195281 -194354 -112829 -58878 29646 11700 -61872 -71083
22459g1083l9645M6943N7687Q924j26757L5494J16625K4912j12699n2598O4241
$$ -71083 -110728 -63785 -6098 2826 -123931 -88437 28188 53100 -59599 -112197 -47956
22448d7956J01645q7906j04757k5097M3346n4389Q4424J07617J41255l6680j17217
$$ -47956 53689 -34217 -138974 -164071 -120725 -175114 -90690 16927 158182 121502 4285
22437D285R728k4015p8351M9149n2771o2730n4037J23768L4257q6131k7840J8531
$$ 4285 14013 -10002 -88353 -39204 -91975 -154705 -208742 -84974 -50717 -136848 -164688 -146157
22425a46157J11985k1334l473L7377l4771L53J7459J21296l5092q9156Q7679J19505
$$ -146157 -34172 -55506 -58979 -21602 -56373 -56020 -38561 82735 47643 -41513 46166 165671
22413A65671O1347O9897j08332p8728p9324q5116j094O6022J18227L8568r4436
$$ 165671 227018 296915 188583 109855 30531 -54585 -55679 10343 128570 167138 72702
22402G2702o0338L5049J19327j51801o0881p3921l1553K9667j17499J1861M9174
$$ 72702 12364 47413 166740 14939 -45942 -119863 -151416 -121749 -239248 -227387 -178213
22391a78213M4323K09921L2379l9490k2407p8943m1094j12965l9733O592J12593
$$ -178213 -133890 76031 108410 68920 46513 -32430 -73524 -186489 -226222 -219630 -107037
22380a07037L2187k5932r5451p0673J12521P8018J804k2706j05097l4425O0775
$$ -107037 -74850 -100782 -196233 -266906 -154385 -76367 -74563 -97269 -202366 -236791 -176016
22369a76016k0341O6820M5122l7909K9075Q2125j22305J0278N6670N8780J48471
$$ -176016 -196357 -129537 -84415 -122324 -93249 -11124 -133429 -123151 -66481 -7701 140770
22358A40770q0603K9442P055k3677R6871J1492n3457J08492J15298j60623n5305
$$ 140770 60167 89609 96664 72987 169858 181350 127893 236385 351683 191060 135755
22347A35755l3153j60541r8310K8502N0777O4320O2640P3469j35050j25079K4933
$$ 135755 102602 -57939 -156249 -127747 -76970 -12650 49990 123459 -11591 -136670 -111737
22336a11737J42188N6950o5614l9705j05491J7782N2051q3340M0791J0040J304
$$ -111737 30451 87401 21787 -17918 -123409 -105627 -53576 -136916 -96125 -86085 -84781
22325h4781j0851k2383Q9366Q3676n2878j62218j2246J1872Q6782Q635K7555L0306
$$ -84781 -95632 -118015 -28649 55027 2149 -160069 -172315 -160443 -73661 -65026 -37471 -7165
22313g165m3600p5563M1115j04220J8573N9089J9635j9015J40161j23586o4566
$$ -7165 -50765 -126328 -85213 -189433 -170860 -111771 -92136 -111151 29010 -94576 -159142
22302a59142P1402j5702O8626J21175N1912j24672r3611J4980k294O3270M150
$$ -159142 -87740 -103442 -34816 86359 138271 13599 -80012 -65032 -67326 -4056 94
22291I4J01330J47155L1590q3741j20374j7704l1456M2429m0240l2075n1178j56811
$$ 94 101424 248579 280169 196428 76054 58350 26894 69323 29083 -2992 -54170 -210981
22279b10981m6733J09308k6081P7271J02477k6648o9610q2315R37J9746M2584
$$ -210981 -257714 -148406 -174487 -97216 5261 -21387 -90997 -173312 -172375 -152629 -110045
22268a10045O9297l2734O1484p535N831O5001m0969m1776R8007M7185p5989o5970
$$ -110045 -40748 -73482 -11998 -19533 -13702 51299 10330 -31446 66561 113746 37757 -28213
22256b8213j9946j2295K0357O0976j09683k5862J9039J11220M5121M5068r5029
$$ -28213 -48159 -60454 -40097 20879 -88804 -114666 -95627 15593 60714 105782 10753
22245A0753j9124j0871K6343K2412l355l008M2480O2069P9825o634o8588P0408
$$ 10753 -8371 -19242 7101 29513 26158 23150 65630 127699 207524 200890 132302 202710
22233B02710q0110j33870L9864L9824j52563r0001J25111J36569M8005Q3523p6980
$$ 202710 122600 -11270 28594 68418 -84145 -174146 -49035 87534 135539 219062 142082
22222A42082q528J3049K6714o3698q0036j5418j319q7755N5770R7877J09789Q200
$$ 142082 133554 146603 173317 109619 29583 14165 12846 -74909 -19139 78738 188527 196727
22210A96727l6228O5594n5746j01336j75331J1543J17852j19442j21754l3334
$$ 196727 160499 226093 170347 69011 -106320 -94777 23075 -96367 -218121 -251455
22200b51455M3996L2401K8879k3886j06492K6482J15025M9836P3672l2948l4915
$$ -251455 -207459 -175058 -146179 -170065 -276557 -250075 -135050 -85214 -11542 -44490 -79405
22189g9405O6266J3289O3055j1131j7019n4690L827J20399M8608o0009P1503m4026
$$ -79405 -13139 150 63205 52074 35055 -19635 -15808 104591 153199 93190 164693 120667
22177A20667l4664j07017m6487j04942l4325P2896k9454k4958R9563j3284Q11
$$ 120667 86003 -21014 -67501 -172443 -206768 -133872 -163326 -188284 -88721 -102005 -101194
22166a01194l7875j3764J24290k5873J514Q258J24740P0363j60049m8591j31306
$$ -101194 -139069 -152833 -28543 -54416 -52902 -44644 80096 150459 -9590 -58181 -189487
22155a89487J2703k5350r229J87033k367p3812j1907Q030p1834r8194M5785n4129
$$ -189487 -176784 -202134 -211363 -24330 -26697 -100509 -112416 -104386 -176220 -274414 -228629 -282758
22143b82758k3736O3057M9367J02306N5809L7876j8798J6775J29765r1588R4415
$$ -282758 -306494 -243437 -194070 -91764 -35955 1921 -16877 -102 129663 38075 132490
22132A32490Q4641m8338j11035j9318j419l6686j38018Q3141J61014l2780q2476
$$ 132490 217131 168793 57758 38440 37021 335 -137683 -54542 106472 73692 -8784
22121h784j1103Q2782j05264k4996r1469M4109K4514L2115L9608m464o7125P6119
$$ -8784 -19887 62895 -42369 -67365 -158834 -114725 -90211 -58096 -18488 -22952 -90077 -13958
22109a3958M0820M0925k1812P2135k9505K6661k2836R3114l6178j29474O6688
$$ -13958 26862 67787 45975 118110 88605 115266 92430 185544 149366 19892 86580
22098H6580j8199m1640j96036j32101J12225O3039J344L5251k6844K3581O3389
$$ 86580 68381 26741 -169295 -301396 -189171 -126132 -124788 -89537 -116381 -92800 -29411
22087b9411n0588j75522n3151M2738M3092K8034J07251J65781k0289N4797P416
$$ -29411 -79999 -255521 -308672 -265934 -222842 -194808 -87557 78224 57935 112732 120148
22076A20148L024Q6985j14200j09415M185j2280K10046R3094j11082q9717K6058
$$ 120148 123172 210157 95957 -13458 -9273 -21553 188493 281587 170505 80788 106846
22065A06846l1524p0479J5295O4605j02661j3081o1587n8211J3150J22451k1531
$$ 106846 75322 4843 20138 84743 -17918 -30999 -92586 -150797 -137647 -15196 -36727
22054c6727l0640J7768n8026Q7447K8981Q4140k3529N0361k1810j26684j17735
$$ -36727 -67367 -49599 -107625 -20178 8803 92943 69414 119775 97965 -28719 -146454
22043a46454L9884K314J038L264k6495K02988J37905q2977j72100K7424J46965
$$ -146454 -106570 -104256 -103218 -99954 -126449 76539 214444 131467 -40633 -13209 133756
22032A33756Q9944q427o6997k12718K4886R8304Q9465j15368j09088J05542Q0891
$$ 133756 223700 215273 148276 -64442 -39556 58748 148213 32845 -76243 29299 110190
22021A10190L3301o6139N2793L4379q1041j10298k4082K4150n8540p0209J02395
$$ 110190 143491 77352 130145 164524 83483 -26815 -50897 -26747 -85287 -155496 -53101
22010e3101J55223K3808K0264L8773p4955j66270j10148k4663N3306J67752L4027
$$ -53101 102122 125930 146194 184967 110012 -56258 -166406 -191069 -137763 29989 64016
21999F4016j36489k8014J22723o611j44395O1384K8503J927J7953k2173Q0588
$$ 64016 -72473 -100487 22236 15625 -128770 -67386 -38883 -36956 -19003 -41176 39412
21988C9412N1021p6295o2401R3363p52k3447k0055k0557J6626j5077j01597L8272
$$ 39412 90433 14138 -48263 45100 44348 20901 846 -19711 -3085 -18162 -119759 -81487
21976h1487L4186J05579Q5234n9941o7896n7976j82735j3645O0390Q9834M2932
$$ -81487 -47301 58278 143512 83571 15675 -42301 -225036 -238681 -178291 -88457 -45525
21965d5525m669m8600K1736J36036j74587j67874Q3509K18181J75578J29740p4711
$$ -45525 -50194 -98794 -77058 58978 -115609 -283483 -199974 18207 193785 323525 248814
21954B48814m3921j62331K5192L3751m8294O1781p885j5452O0019k5481o9869
$$ 248814 204893 42562 67754 101505 53211 114992 107107 91655 151674 126193 56324
21943E6324p3381K328n3499L2010J88039Q4514j6226N2119K7140j45766M5779
$$ 56324 -17057 -14729 -68228 -36218 151821 236335 220109 272228 299368 153602 199381
21932A99381m5853K1826r0791j85972J38746L6049j4178n7768k3437J05094q4725
$$ 199381 153528 175354 84563 -101409 37337 73386 59208 1440 -21997 83097 -1628
21921a628l0251k6322j3363j939j8546j46706j27441m9245J44919P6091J68900
$$ -1628 -31879 -58201 -71564 -73503 -92049 -238755 -366196 -415441 -270522 -194431 -25531
21910b5531J66492J23392k2723l9817n5932j25911j11130j3182m0319J2916O1991
$$ -25531 140961 264353 241630 201813 145881 19970 -91160 -104342 -144661 -131745 -69754
21899f9754K3303p3635j08676J88753J31523R217j5267O592q9845m0371l1730
$$ -69754 -46451 -120086 -228762 -40009 91514 100731 85464 92056 2211 -38160 -69890
21888f9890q6262j17555P710K29687M7745o0924N3521K7634J14454K0865q3842
$$ -69890 -156152 -273707 -265997 -36310 11435 -49489 4032 31666 146120 166985 83143
21877H3143j8511Q101R8141n8536J10741N5866k03599j82257j2099J68808O8313
$$ 83143 64632 72733 170874 112338 223079 278945 75346 -106911 -119010 49798 118111
21866A18111R1973K6856o8806r1208m0936M5681J9731J6530L5286k4266q7508
$$ 118111 210084 236940 168134 76926 35990 81671 101402 117932 153218 128952 41444
21855D1444p4748J19611M7505k2125o1913l7742N1122q2014p2884K1257J04929
$$ 41444 -33304 86307 133812 111687 49774 12032 63154 -18860 -91744 -70487 34442
21844C4442J08309N0628m1184n3148o0743l5436l4517M0579K9720j301l2704l7605
$$ 34442 142751 193379 152195 99047 38304 2868 -31649 8930 38650 37349 4645 -32960
21832c2960O6990R8537K975n2842j71539k18463o7550K5875N081J35912J91524
$$ -32960 34030 132567 135542 82700 -88839 -307302 -374852 -348977 -343896 -207984 -16460
21821a6460O669r292N3309N4653L2534j00488j51675M0368J13437k9117R3923
$$ -16460 -9791 -19083 34226 88879 121413 20925 -130750 -90382 23055 -6062 87861
21810H7861q1464L684j06679q2189L3341l7699j2679J5887j4629k9749M2965j9078
$$ 87861 6397 10081 -96598 -178787 -145446 -183145 -195824 -179937 -194566 -224315 -181350 -200428
21798b00428q9132M938J01669N2610o4275O3781J6965m391N9723j1692m6612l4757
$$ -200428 -289560 -284622 -182953 -130343 -194618 -130837 -113872 -118263 -58540 -70232 -116844 -151601
21786a51601P1844o207L856o5287q416j37041O6011J11643o549o3656J46643J46073
$$ -151601 -79757 -85964 -82108 -147395 -155811 -292852 -226841 -115198 -121747 -185403 -38760 107313
21774A07313j2173M1615j8767J2379Q3824n6373l4696j17791l4553K2610j21053
$$ 107313 95140 136755 117988 130367 214191 157818 123122 5331 -29222 -6612 -127665
21763a27665n237O1551p4893j2191N7061Q2034O4373m0682r8111j80007L7963
$$ -127665 -132902 -71351 -146244 -158435 -101374 -19340 45033 4351 -93760 -273767 -235804
21752b35804J0294o1925O3585J88231O3071l441O5611L0598J24182M1292j24039
$$ -235804 -225510 -287435 -223850 -35619 27452 24011 89622 120220 244402 285694 161655
21741A61655j41013P2550K25306Q7252j02125j61820m8107N0918m8250m1358j994
$$ 161655 20642 93192 318498 405750 303625 141805 93698 144616 96366 55008 53014
21730E3014p5822O3014Q2562K5535j10040j47260j4086M3879P6384K2438j07329
$$ 53014 -22808 40206 122768 148303 38263 -108997 -123083 -79204 -2820 19618 -87711
21719h7711j12843O0978J56587N6280J3261J11267n7156j37980k20202l9261Q1540
$$ -87711 -200554 -139576 17011 73291 86552 197819 140663 2683 -217519 -256780 -175240
21708a75240Q6420L2409M0492P9455j56147p9748K4877R1262P8810l5317j22821
$$ -175240 -88820 -56411 -15919 63536 -92611 -172359 -147482 -56220 22590 -12727 -135548
21697a35548j06891l9412K33864l0552r8736l4651q0218L3493K5533L1483r8266
$$ -135548 -242439 -281851 -47987 -78539 -177275 -211926 -292144 -258651 -233118 -201635 -299901
21686b99901j852K22141K75537P736r2444J6120q1208j1799j62173K0934J98924
$$ -299901 -301753 -79612 195925 203661 111217 127337 46129 34330 -127843 -106909 92015
21675I2015N6807M2191l526q6076p7091j38764m0566L6332R3232K38747o6273
$$ 92015 148822 191013 187487 101411 24320 -114444 -155010 -118678 -25446 213301 147028
21664A47028n6760M635r1372k4337j54653M8597L7381q9511j84631n93M3924J4785
$$ 147028 90268 94903 3531 -20806 -175459 -126862 -89481 -178992 -363623 -364216 -320292 -305507
21652c05507J49962P8029j084O9957K6245r9773p5547n7681J5154o1668n9365
$$ -305507 -155545 -77516 -78600 -8643 17602 -82171 -157718 -215399 -200245 -261913 -321278
21641c21278L7781R4494j5534m4885J1900n6877q0034J63927J74465J75055j44303
$$ -321278 -283497 -189003 -204537 -249422 -237522 -294399 -374433 -210506 -36041 139014 -5289
21630e289j5851O4158M0852m9963r2092J1138R3935J52793P1584k7416O029q4913
$$ -5289 -21140 43018 83870 33907 -58185 -47047 46888 199681 271265 243849 249878 164965
21618A64965r681l8529k8546j14719j37L3326K2434n3921j6811o7784l5904q2128
$$ 164965 155284 116755 88209 -26510 -26647 6679 29113 -24808 -41619 -109403 -145307 -227435
21606b27435J27409N9668L6799o0375J9209j5321o520L8728p0418k9047M2496
$$ -227435 -100026 -40358 -3559 -63934 -44725 -60046 -66566 -27838 -98256 -127303 -84807
21595h4807P0160L9994l6366j5325r3040Q0871M579J8569n4700J3593K9342K5239
$$ -84807 -14647 25347 -11019 -26344 -119384 -38513 -33934 -15365 -70065 -56472 -27130 -1891
21583a891N4676n0397n6411M9704P5311k8832j858q6066M5362R2652l7874n3108
$$ -1891 52785 2388 -54023 -4319 70992 42160 40302 -45764 -402 92250 54376 1268
21571A268k2859K2681J8367P7551m9025l2364M0482n6001p345R716J23895R9394
$$ 1268 -21591 1090 19457 97008 47983 15619 56101 100 -7245 2471 126366 225760
21559B25760j28737m7267r7263m6836r6750j55888O0771M1485n0605K21622M3490
$$ 225760 97023 49756 -47507 -94343 -191093 -346981 -286210 -244725 -295330 -73708 -30218
21548c0218n4146o3562n9035j4011q5450O0669J15809J06562J9228J54384j59451
$$ -30218 -84364 -147926 -206961 -220972 -306422 -245753 -129944 -23382 -4154 150230 -9221
21537i221j82750j35757K0195Q1046O1718l4485J5060j5165J0339M7241Q4967
$$ -9221 -191971 -327728 -307533 -226487 -164769 -199254 -184194 -199359 -189020 -141779 -56812
21526e6812N892o2424J8052P6876O3135J55104r6167k36468j44611K01705J48205
$$ -56812 -50920 -113344 -95292 -18416 44719 199823 103656 -132812 -277423 -75718 72487
21515G2487J8636j02000k801J5956o8602j7190K6673J68905j05429n4362p5305
$$ 72487 91123 -10877 -13678 2278 -66324 -83514 -56841 112064 6635 -47727 -123032
21504a23032O7048M6321q0611j44407J98843Q0800O2601m7503j61304n1269Q2180
$$ -123032 -55984 -9663 -90274 -234681 -35838 44962 107563 60060 -101244 -152513 -70333
21493g0333M6491J2830j7683J0319K2185Q0401J11404O4568l7809J2127q0864
$$ -70333 -23842 -11012 -28695 -18376 3809 84210 195614 260182 222373 234500 153636
21482A53636j02199r9345n8130K8323l4835J6506r2577K5677J53203P2550Q6234
$$ 153636 51437 -47908 -106038 -77715 -112550 -96044 -188621 -162944 -9741 62809 149043
21471A49043o9340j2201N7545J02978p4429j86480M9718p7347K5468j60946M1563
$$ 149043 79703 67502 125047 228025 153596 -32884 16834 -60513 -35045 -195991 -154428
21460a54428Q6543Q9533m0976k1596j2908L4166P5112j8742m9247J619n5702L9662
$$ -154428 -67885 21648 -19328 -40924 -53832 -19666 55446 36704 -12543 -10924 -66626 -26964
21448b6964R6310j7281q5343o9437l7041m8563N41P7824K5639J15073J19297o2594
$$ -26964 69346 52065 -33278 -102715 -139756 -188319 -187778 -109954 -84315 30758 150055 87461
21436H7461m173m2577L8143N8165R1257r8673j48480O2783n902j5461k7508j03375
$$ 87461 83288 40711 78854 137019 228276 129603 -18877 43906 38004 22543 -4965 -108340
21424a08340r8143J8995J06218J4323M2741Q1553m6801q2096n593m5207R9284
$$ -108340 -206483 -187488 -81270 -66947 -24206 57347 10546 -71550 -77143 -122350 -23066
21413b3066l7886m1373J67226k2772j09694o1297O0152K6394Q4266J4813j65908
$$ -23066 -60952 -102325 64901 42129 -67565 -128862 -68710 -42316 41950 56763 -109145
21402a09145m2542l0338K4901J12386K8216r3470j5804n5618M4229J23930L4686
$$ -109145 -151687 -182025 -157124 -44738 -16522 -109992 -125796 -181414 -137185 -13255 21431
21391B1431J62864P877o4157j9337N0238O8649k0865j51101j10109R6657J59042
$$ 21431 184295 192172 128015 108678 158916 227565 206700 55599 -54510 42147 201189
21380B01189N5833m0776j05975n8157q6256r3040N4459l2577o9015N5973J52921
$$ 201189 257022 216246 110271 52114 -34142 -127182 -72723 -105300 -174315 -118342 34579
21369C4579k5220k7358n801l3340N0161J37499J00042j9938k9721r0996j72028
$$ 34579 9359 -17999 -23800 -57140 -6979 130520 230562 210624 180903 89907 -82121
21358h2121k2130Q0921Q665J04196M3321j48171p6538L9030P9040n516q1792j0230
$$ -82121 -104251 -23330 -14665 89531 132852 -15319 -91857 -52827 26213 20697 -61095 -71325
21346g1325q3410k425o1626J2625J12380L1702l018K3582L0350J3928n3553n0375
$$ -71325 -154735 -157160 -218786 -206161 -93781 -62079 -65097 -41515 -11165 2763 -50790 -101165
21334a01165m0865K2774R3100J08595l0894m4778J28506j50117q9489R1410m0296
$$ -101165 -142030 -119256 -26156 82439 51545 6767 135273 -14844 -104333 -12923 -53219
21323e3219r3430R0743J50754J3277M0218k36913j36899J18961O8792M7008L3937
$$ -53219 -146649 -55906 94848 108125 148343 -88570 -225469 -106508 -37716 9292 43229
21312D3229m8458J4860j7511K1603j30826n2079N4901p502Q2185L3905Q7270R217
$$ 43229 -5229 9631 -7880 13723 -117103 -169182 -114281 -121783 -39598 -5693 81577 90794
21300I0794k44451J0560M2235m2888j46287k9395J90984J95957q9817j33323n998
$$ 90794 -153657 -143097 -100862 -143750 -290037 -319432 -128448 67509 -22308 -155631 -161629
21289a61629R7152O0040j11680J01722K41307p5836j20275j23987q291k9832R0763
$$ -161629 -64477 -4437 -116117 -14395 226912 151076 30801 -93186 -101477 -131309 -40546
21278d0546J64304L2796n9968o5899l0808n9502q8707k5587N5745L7360N3820
$$ -40546 123758 156554 96586 30687 -121 -59623 -148330 -173917 -118172 -80812 -26992
21267b6992K5883R7625L9900j06328n6114l9936n3961j7437o654R7188k4680k9503
$$ -26992 -1109 96516 136416 30088 -26026 -65962 -119923 -137360 -144014 -46826 -71506 -101009
21255a01009m2073J03408M4179O002M2586l8229j48364k4506J17168P66p8920
$$ -101009 -143082 -39674 4505 10507 53093 14864 -133500 -158006 -40838 -40072 -118992
21244a18992n4890K2141O5833j65648M6801K2650O502O9300Q5897j7844P2183
$$ -118992 -173882 -151741 -85908 -251556 -204755 -182105 -175603 -106303 -20406 -38250 33933
21233C3933M4148M2344n5330j46805P9037R32l3676p7663J24082j7944o9939n874
$$ 33933 78081 120425 65095 -81710 -2673 -1741 -35417 -113080 11002 -6942 -76881 -82755
21221h2755m0628M732J75989J25268m51r3317K6540O6474k2888j966o3174K384
$$ -82755 -123383 -118651 57338 182606 182155 88838 115378 181852 158964 156998 93824 96208
21209I6208N6252m6425r9813o0008J7845J8436j24120J2734J83640j7970j35369
$$ 96208 152460 106035 6222 -53786 -35941 -17505 -141625 -128891 54749 36779 -98590
21198i8590p6929Q6549R6767n567j40914P4823J09077j29396n6570J28467J11558
$$ -98590 -175519 -88970 7797 2230 -138684 -63861 45216 -84180 -140750 -12283 99275
21187I9275l2780j24263q0516k557j4420J54542l2894K301N8696R1833m0579M317
$$ 99275 66495 -57768 -138284 -140841 -155261 -719 -33613 -31312 27384 119217 78638 82955
21175H2955N7190m5571j00916r5053m4205L5455M4873O5894R555P1020K6769L0199
$$ 82955 140145 94574 -6342 -101395 -145600 -110145 -65272 622 10177 81197 107966 138165
21163A38165J9771p6796q8910j07265K5905P1720Q0166J02110l066j9598j25011
$$ 138165 157936 81140 -7770 -115035 -89130 -17410 62756 164866 161800 142202 17191
21152A7191N9612O4665j67368l7502J36214r5070K8907k2643M2679R6329O1685
$$ 17191 76803 141468 -25900 -63402 72812 -22258 6649 -15994 26685 123014 184699
21141A84699j23777j17281R4354j0829j64168p2378j4067J19657p254p4872M3724
$$ 184699 60922 -56359 37995 27166 -137002 -209380 -223447 -103790 -111044 -185916 -142192
21130a42192K30852k1419j51864l453r485l4829K4353m1341n6080L7228J01826
$$ -142192 88660 67241 -84623 -88076 -97561 -132390 -108037 -149378 -205458 -168230 -66404
21119f6404Q7955L7841K5003j42118J9325O4157R4013m5661r612J10904r6316
$$ -66404 21551 59392 84395 -57723 -38398 25759 119772 74111 64499 175403 79087
21108G9087j68613o6249j10503l5196q5810R0809J18382P3413N0226K6427J08795
$$ 79087 -89526 -155775 -266278 -301474 -387284 -296475 -178093 -104680 -54454 -28027 80768
21097H0768m8160p4551k146M1397J68043L2281j70019j69616J50030K43524M9946
$$ 80768 32608 -41943 -44089 -2692 165351 197632 27613 -142003 8027 251551 301497
21086C01497j50143N1472k0531j01944l7116M9334j29308J2714J6579r7148m2609
$$ 301497 151354 202826 182295 80351 43235 92569 -36739 -24025 -7446 -104594 -147203
21075a47203J30755J74487P8683j3337j52600o8974o2122j12234l232P3128J18648
$$ -147203 -16448 158039 236722 223385 70785 1811 -60311 -172545 -175777 -102649 15999
21064A5999o412J9472Q9939j00100m3634N9997r746p619m5338l4304J8095K7861
$$ 15999 9587 29059 118998 18898 -24736 35261 25515 17896 -27442 -61746 -43651 -15790
21052a5790j10778j16560P2817O847L5741L5955P0026J03950L2194J7103j44452
$$ -15790 -126568 -243128 -170311 -163464 -127723 -91768 -21742 82208 114402 131505 -12947
21041a2947o4624M2067O1659j42834o7029J32095J63341j2237J8777m0180M8935
$$ -12947 -77571 -35504 26155 -116679 -183708 -51613 111728 99491 118268 78088 127023
21030A27023N1537j2937n9091L2494n6870J17863l8989r9046j35829o0573O91
$$ 127023 178560 165623 106532 139026 82156 200019 161030 61984 -73845 -134418 -133727
21019a33727L5332J62744J23083j44511j86907m2621R8457N0391J41576K8536
$$ -133727 -98395 64349 187432 42921 -143986 -186607 -88150 -37759 103817 132353
21009A32353q358J1969l5356K9539N4606n9618r1673O6573Q509o044j53818M081
$$ 132353 123995 135964 100608 130147 184753 125135 33462 100035 108544 102500 -51318 -47237
20997d7237P548j66092l1798R8769J35792L7200k4500J2259m2216J06757O5239
$$ -47237 -39689 -205781 -237579 -138810 -3018 34182 9682 21941 -20275 86482 151721
20986A51721p6472r7401j6411L1901l8691j60641J30381n8705l9374J32143J28026
$$ 151721 75249 -22152 -38563 -6662 -45353 -205994 -75613 -134318 -173692 -41549 86477
20975H6477K0236j13346m3660l2342J35532l4410p3374k4129o4596r1822J15123
$$ 86477 106713 -6633 -50293 -82635 52897 18487 -54887 -79016 -143612 -235434 -120311
20964a20311J78039j079K1317k2234j83409j6548l4899k9609o0153J25810K18137
$$ -120311 57728 56649 77966 55732 -127677 -144225 -179124 -208733 -268886 -143076 75061
20953G5061J9437k52734j19993K4287n4369N9214J20687K8782M7927R759n41o1793
$$ 75061 94498 -158236 -278229 -253942 -308311 -249097 -128410 -99628 -51701 -41942 -42483 -104276
20941a04276j64059L6747J39370J74019k1455j40386N5532P070J1238P6695p9859
$$ -104276 -268335 -231588 -92218 81801 60346 -80040 -24508 -17438 -6200 70495 -9364
20930i364J22872K2812j87946l07585j13023J11599Q8950K269o247P9925K0827
$$ -9364 113508 136320 -51626 -359211 -472234 -360635 -271685 -269416 -275663 -195738 -174911
20919a74911J12432m6791J19410K5330j57030L3388J24594j2134q4571n9572K850
$$ -174911 -62479 -109270 10140 35470 -121560 -88172 36422 24288 -60283 -119855 -117005
20908a17005J02215P5834j61813j39921j2440M8249l4966N5674K55877K6666j79755
$$ -117005 -14790 61044 -100769 -240690 -253130 -204881 -239847 -184173 71704 98370 -81385
20897h1385r6994j8115P649K8534J71867N3006j08982p3196J3010J4713K706j5065
$$ -81385 -178379 -196494 -188845 -160311 11556 64562 -44420 -117616 -104606 -89893 -87187 -102252
20885a02252o6123M1911J5784K3085R2720O3290o5949J7468K7425j9818k43379
$$ -102252 -168375 -126464 -110680 -87595 5125 68415 2466 19934 47359 27541 -215838
20874b15838n9605L5784L916Q5906J8317J20409M9193r5898p1899K3902J36204
$$ -215838 -275443 -239659 -235743 -149837 -131520 -11111 38082 -57816 -129715 -105813 30391
20863C0391K30921q2362m4997Q3067L0638m8098j13164r1166O5650J20961j66918
$$ 30391 261312 178950 133953 217020 247658 199560 86396 -4770 60880 181841 14923
20852A4923j90776k0990L6293O5586O3516n0329J9054P7487j19293K1621M2578
$$ 14923 -175853 -196843 -160550 -94964 -31448 -81777 -62723 14764 -104529 -82908 -40330
20841d0330M4613j28185L4285n0258n236L3135J14536J07892k6298k1121j6617
$$ -40330 4283 -123902 -89617 -139875 -145111 -111976 2560 110452 84154 63033 46416
20830D6416l7182K2944J53829r1094r6126m8822q1433j56970k1975p1225k1667
$$ 46416 9234 32178 186007 94913 -1213 -50035 -131468 -288438 -310413 -381638 -403305
20819d03305J32000K34189l9810J01342J26388k2389j75414r2836R6441M3720
$$ -403305 -271305 -37116 -76926 24416 150804 128415 -46999 -139835 -43394 326
20809C26J34066K0644r4464K0030R5426o739M4703j03631r2305r0242l3459P4834
$$ 326 134392 155036 60572 80602 176028 169289 213992 110361 18056 -72186 -105645 -30811
20797c0811K53717J14513j54061j47669r9372J8839n0319J4576J01907Q1376j35143
$$ -30811 222906 337419 183358 35689 -63683 -44844 -95163 -80587 21320 102696 -32447
20786c2447q6523R4635j3727n2455M0310O6306J4776r2069J9046Q5492K3760o8473
$$ -32447 -118970 -24335 -38062 -90517 -50207 16099 30875 -61194 -42148 43344 67104 -1369
20774a369O6O9668J6888O3864l5806j4869j8887j316n8803J07561K5944J17817
$$ -1369 -1303 68365 85253 149117 113311 98442 79555 78239 19436 126997 152941 270758
20762B70758k0795o2894K5336r0532j90048M7385J70286K6731M4400j04921j57772
$$ 270758 249963 187069 212405 121873 -68175 -20790 149496 176227 220627 115706 -42066
20751d2066O5394J17700j56467k53797p3675j01478N7171N6205J09201J74157
$$ -42066 23328 141028 -15439 -269236 -342911 -444389 -387218 -331013 -221812 -47655
20741d7655P0525J15452L4882j05373j83466J691L3088P9523J41874o5037J3672
$$ -47655 22870 138322 173204 67831 -115635 -113944 -80856 -1333 140541 75504 89176
20730H9176N354P0182K5481j53148q3245O2638N1836j15741J7894j51626Q2503
$$ 89176 94530 164712 190193 37045 -46200 16438 68274 -47467 -29573 -181199 -98696
20719i8696J18932N2063l929p4209K1946Q3927L7415m0702K5948Q5290J48613
$$ -98696 20236 72299 68370 -5839 16107 100034 137449 96747 122695 207985 356598
20708C56598N8877j02239k07824l0929p0699m2101N2124j06269o3965Q639J21325
$$ 356598 415475 313236 105412 74483 3784 -38317 13807 -92462 -156427 -147788 -26463
20697b6463M0639n0431N1384o419p8913p0970q264k2825L2129n091j03167R3009
$$ -26463 14176 -36255 15129 8710 -70203 -141173 -149437 -172262 -140133 -145224 -248391 -155382
20685a55382L920q721J7862K6882K0428K3448k0890L864j16928m2294L2741J88245
$$ -155382 -151462 -160183 -142321 -115439 -95011 -71563 -92453 -88589 -205517 -247811 -215070 -26825
20673b6825K0582l0456J2019J9487J1503l6396L9281Q881O4705k513n0589j10684
$$ -26825 -6243 -36699 -24680 -5193 6310 -30086 9195 18076 82781 80268 29679 -81005
20661h1005K6747R6765J2081k5708j05359K4140L6904N7363J15439O2427p8976
$$ -81005 -54258 42507 54588 28880 -76479 -52339 -15435 41928 157367 219794 140818
20650A40818o6348m7132J4108j29928k038j00931M636K5158j2245J8912J85483
$$ 140818 74470 27338 41446 -88482 -90520 -191451 -186815 -161657 -173902 -154990 30493
20639C0493J02581J2688q3191p8108o9575p1531O1369m25Q8429N7449K2117L8297
$$ 30493 133074 145762 62571 -15537 -85112 -156643 -95274 -95699 -7270 50179 72296 110593
20627A10593L2629m1075L6462Q2161j25603j21819j08380k3009J92201Q6078K9967
$$ 110593 143222 102147 138609 220770 95167 -26652 -135032 -158041 34160 120238 150205
20616A50205o3612r7841P655r383M2334N0023j46250K317l0763l6276N5908J62856
$$ 150205 86593 -11248 -3593 -12976 29358 79381 -66869 -64552 -95315 -131591 -75683 87173
20604H7173J46053o370j08434j09967p929n744j77881k1121J94167R6261m0907
$$ 87173 233226 226856 118422 8455 526 -5218 -183099 -204220 -10053 86208 45301
20593D5301R6958j7785j14233K0242N6561j10027k15836Q5121K51195N1980j65968
$$ 45301 142259 124474 10241 30483 87044 -22983 -238819 -153698 97497 149477 -16491
20582a6491O115n6085o0745k2366o8163O5434j4169J5261m130J24056N1537l3772
$$ -16491 -10376 -66461 -127206 -149572 -217735 -152301 -166470 -151209 -155339 -31283 20254 -13518
20570a3518J2401R1185j2165J24360M8637n8302n6845j58409k9706Q1614l680
$$ -13518 -1117 90068 77903 202263 250900 192598 135753 -22656 -52362 29252 25572
20559B5572N7303N325j20964j26444j9020P6679P2962J17929R3407p8023j15337
$$ 25572 82875 88200 -32764 -159208 -178228 -101549 -28587 89342 182749 104726 -10611
20548a0611k7227m9778j7982K5250L2552n8295L8436J6949J22099M6138j37337
$$ -10611 -37838 -87616 -105598 -80348 -47796 -106091 -67655 -50706 71393 117531 -19806
20537a9806l3586R0276J62317k31696j69464J60944q270n5219J5468m4066J7504
$$ -19806 -53392 36884 199201 -32495 -201959 -41015 -49285 -104504 -89036 -133102 -115598
20526a15598N4624l2924p3037J11334P0282M3601p7315j0754J31127J85037j41768
$$ -115598 -60974 -93898 -166935 -55601 14681 58282 -19033 -29787 101340 286377 144609
20515A44609n3001R5504l810q1470k8033j15734N708L5546m3827M089m4216L0560
$$ 144609 91608 187112 183302 101832 73799 -41935 -36227 -681 -44508 -40419 -84635 -54075
20503e4075Q2408j5336L0615J6773j61867L7430L4632p8337j1346J55669r4261
$$ -54075 28333 12997 43612 60385 -101482 -64052 -29420 -107757 -119103 36566 -57695
20492e7695p9062j71515o1530J91313J06502Q6681m2564L3745K8817p6060r9198
$$ -57695 -136757 -308272 -369802 -178489 -71987 14694 -27870 5875 34692 -41368 -140566
20481a40566J09948J28826J9056Q557r0660j9511J6219j23750m0356J16833N4045
$$ -140566 -30618 98208 117264 125821 35161 15650 31869 -91881 -132237 -15404 38641
20470C8641n7000m1433O0319j48431M0403J53618J6096J0648k544J6707k4562
$$ 38641 -18359 -59792 527 -147904 -107501 46117 62213 72861 70317 87024 62462
20459F2462O6771m7908r6599l0025N6694J05553j14872K3016M3151O0051J6501
$$ 62462 129233 81325 -15274 -45299 11395 116948 2076 25092 68243 128294 144795
20448A44795k04424j52055o7153Q7029Q7043L2738L2557r7996o203l9019K3435
$$ 144795 -59629 -211684 -278837 -191808 -104765 -72027 -39470 -137466 -143669 -182688 -159253
20437a59253R0967R1563M4407k9975M726L4779j20691L6960L3455R6274M9049
$$ -159253 -68286 23277 67684 37709 42435 77214 -43477 -6517 26938 123212 172261
20426A72261L3343j36664n7944J52957m8386j23235q8765L7377L6194l4450P9097
$$ 172261 205604 68940 10996 163953 115567 -7668 -96433 -59056 -22862 -57312 21785
20415B1785L1019J5044L4576m0844j45766p226R106Q2335L6959o9071k9992L7006
$$ 21785 52804 67848 102424 61580 -84186 -91412 -82306 29 36988 -32083 -62075 -25069
20403b5069k5525j2455j38006J699P6093O7415O0880R28K116K7918j4165n4892
$$ -25069 -50594 -63049 -201055 -199356 -123263 -55848 5032 5960 8076 35994 21829 -33063
20391c3063r0811N0369O4645j1890j22476N7507K8646j61209P8222J20791J48654
$$ -33063 -123874 -73505 -8860 -20750 -143226 -85719 -57073 -218282 -140060 -19269 129385
20380A29385J58599j08022j20987K9420j856o8657k2100j52657r068R5916J08940
$$ 129385 287984 179962 58975 88395 86539 17882 -4218 -156875 -165943 -70027 38913
20369C8913k1122n8269O5907P8827K3105o3612l9622j2895J3107J2674j19770
$$ 38913 17791 -40478 25429 104256 127361 63749 24127 11232 24339 37013 -82757
20358h2757j38625m5714Q5955j0264r8172J6667m2523m033Q7492R3619J00157
$$ -82757 -221382 -267096 -181141 -191405 -289577 -272910 -315433 -319466 -231974 -138355 -38198
20347c8198R8726J27258J0690p0552p7298j9469n9307J4326L1651o785Q7864p7890
$$ -38198 60528 187786 198476 127924 50626 31157 -28150 -13824 17827 11042 98906 21016
20335B1016j53506m904J1263R9679O4855j04011p226O8726K2725K1938M794k6791
$$ 21016 -132490 -137394 -126131 -26452 38403 -65608 -72834 -4108 18617 40555 45349 18558
20323A8558j18873j1568Q8172O6037R2181P9279r6090p7120j51314L5064J58487
$$ 18558 -100315 -111883 -23711 42326 134507 213786 117696 40576 -110738 -75674 82813
20312H2813N0613j56215l0766o6016k0007M4877J13216p9485m2264L0500J79304
$$ 82813 133426 -22789 -53555 -119571 -139578 -94701 18515 -60970 -103234 -72734 106570
20301A06570O2563j02055n0985P7084j8940J2054l9539j38461n7414J59446J07415
$$ 106570 169133 67078 16093 93177 74237 86291 46752 -91709 -149123 10323 117738
20290A17738n4189J1601o8085n0968J00091n2414l999Q567K4495l9873j13571
$$ 117738 63549 75150 7065 -43903 56188 3774 -225 8342 32837 -7036 -120607
20279a20607o7604L1377P091k7905j8657o0240j4972P6076J23682P6530M5333
$$ -120607 -188211 -156834 -149743 -177648 -196305 -256545 -271517 -195441 -71759 4771 50104
20268E0104j29165j28930J08856J11399r7500o302R0903K7923J70943O026P1684
$$ 50104 -79061 -207991 -99135 12264 -85236 -91538 -635 27288 198231 204257 275941
20257B75941j3214J9457r0526j46898O727J4698L4713N0859j41977r2216l4938
$$ 275941 262727 282184 191658 44760 51487 66185 100898 151757 9780 -82436 -117374
20246a17374R1459J60904n1496j179R3975j30289j54260r359O5964L8948j7056
$$ -117374 -25915 134989 83493 82314 176289 46000 -108260 -117619 -51655 -12707 -29763
20235b9763m5375K4100o177J46912m202n5269j07227m200j27414Q69J45495r700
$$ -29763 -75138 -51038 -57215 89697 85495 30226 -77001 -81201 -208615 -207746 -62251 -71951
20223g1951o1187m1834Q3407m2743q9650K7751L7695R7127M4221p5028L5221R9734
$$ -71951 -133138 -174972 -91565 -134308 -223958 -196207 -158512 -61385 -17164 -92192 -56971 42763
20211D2763k459n6696m8647n0381k2002Q091Q9006r3211J51801J49437j60380
$$ 42763 40304 -16392 -65039 -115420 -137422 -129331 -40325 -133536 18265 167702 7322
20200G322M308k1650k26009o8195R3212N3377J01300Q7227M1807N8678J4193L6310
$$ 7322 11630 -10020 -236029 -304224 -211012 -157635 -56335 30892 72699 131377 145570 181880
20188A81880o9530n8269j20851k3728L9642l797l2057K3244j31084P9002N0141
$$ 181880 112350 54081 -66770 -90498 -50856 -54653 -86710 -63466 -194550 -115548 -65407
20177f5407J8058J18895N1932R1292l6398o5213P693O9104P2851N9276j51179
$$ -65407 -47349 71546 123478 214770 178372 113159 120852 189956 262807 322083 170904
20166A70904j45217r4228n993o6197j07106N6147K9151K31247M3912O09J7604
$$ 170904 25687 -68541 -74534 -140731 -247837 -191690 -162539 68708 112620 113229 130833
20155A30833O9083m0742j49833o1633l4944P594Q9168J05230j22711J3906K5723
$$ 130833 199916 159174 9341 -52292 -87236 -79642 9526 114756 -7955 5951 31674
20144C1674k4571p1829L794r45J68447J15486j22070j36748m1776R3592J4946
$$ 31674 7103 -64726 -60932 -61877 106570 222056 99986 -36762 -78538 15054 30000
20133C0000L1546R5412o8167o5899l904p8099N6010p9311j45506p000M7803J92276
$$ 30000 61546 156958 88791 22892 18988 -59111 -3101 -82412 -227918 -234918 -187115 5161
20121E161J01664K6488M8556J1033p3950q4401k1718n983L799K6886K003p650
$$ 5161 106825 133313 181869 192902 118952 34551 12833 6850 10649 37535 39538 31888
20109C1888j32082p8363r843P3406O2806j6134K0088J26964J341L4323r8171l3174
$$ 31888 -100194 -178557 -188400 -114994 -52188 -68322 -48234 78730 80071 114394 16223 -16951
20097a6951k92275m6182o7727M3409O6792j1036R7109k3095j19965q578J45409
$$ -16951 -309226 -355408 -423135 -379726 -312934 -323970 -226861 -249956 -369921 -378499 -233090
20086b33090J32951l702P6041M0609j14087J3484j11232P2204J39951n1908j01233
$$ -233090 -100139 -103841 -27800 12809 -101278 -87794 -199026 -126822 13129 -38779 -140012
20075a40012m45k2068N9916P2844N6648J32354J74677J0755k17404K4442N8j33095
$$ -140012 -140457 -162525 -102609 -29765 26883 159237 333914 344669 127265 151707 151765 18670
20063A8670l5978l1533K3077N1435N5841K5166L2255j22611n2245N2258r0643
$$ 18670 -17308 -48841 -25764 25671 81512 106678 138933 16322 -35923 16335 -74308
20052g4308J65057Q8232m9964q7951j46493P4917N5842j47654P628J93345o7302
$$ -74308 90749 178981 129017 41066 -105427 -30510 25332 -122322 -114694 78651 11349
20041A1349l43853j03265P0771J24171O9345O2168m1498J85713J47612K9027K9212
$$ 11349 -332504 -435769 -364998 -240827 -171482 -109314 -150812 34901 182513 211540 240752
20030B40752o9987m1079r5340n7613n0064j13655M1711N290J43599o075j00954
$$ 240752 170765 129686 34346 -23267 -73331 -186986 -145275 -139985 3614 -2461 -103415
20019a03415l0757P9983N9956M0617P5085Q4447p9616j21407q4955j10402o5714
$$ -103415 -134172 -54189 5767 46384 121469 205916 126300 4893 -80062 -190464 -256178
20008b56178J01953L6636J3908J6703J60998Q2403j32909l2909q2355J4319o180
$$ -256178 -154225 -117589 -103681 -86978 74020 156423 23514 -9395 -91750 -77431 -83611
19997h3611J6342R015J68650M3144j49087j91031r754K17078j55348K0118K45914
$$ -83611 -67269 -58254 110396 153540 4453 -186578 -196332 20746 -134602 -114484 131430
19986A31430R5114j00075r7574j42419R3680J45504K4286m4666l0804m856q8892
$$ 131430 226544 126469 28895 -113524 -19844 125660 149946 105280 74476 69620 -19272
19975a9272J9319J38542o2857k0358k0445j07111Q9737Q3023r1651m243J17352
$$ -19272 47 138589 75732 55374 34929 -72182 17555 100578 8927 4684 122036
19964A22036m5130n583n1495l4096j3949N7086Q2959k3688k2853o9507o9297M7789
$$ 122036 76906 71323 19828 -14268 -28217 28869 111828 88140 65287 -4220 -73517 -25728
19952b5728R9279J3193R7395P0756L4314K1260n8952n9321r26J8373J94k12628
$$ -25728 73551 86744 184139 254895 289209 310469 251517 192196 191270 209643 209837 -2791
19940b791j34835m0718J44828J12997L5259p2254j13465M4040J702j32968J592
$$ -2791 -137626 -178344 -33516 79481 114740 42486 -70979 -26939 -25237 -158205 -156613
19929a56613N498J45154l5037j08715J77579M128j131K5083P2577k4405j98778
$$ -156613 -151115 -5961 -40998 -149713 27866 31994 30863 55946 128523 104118 -94660
19918i4660k1187P9172n5795o928R1154J06720O222j34647k6714L8243K502l0656
$$ -94660 -115847 -36675 -92470 -99398 -8244 98476 104698 -29949 -56663 -18420 -15918 -46574
19906d6574l0788K1241J13758q4167j02835p1508L0659M9580k5269K2993L7692
$$ -46574 -77362 -56121 57637 -26530 -129365 -200873 -170214 -120634 -145903 -122910 -85218
19895h5218K2159Q7688j1689p7878K7035m7276K14755K6727j85384p8480J54835
$$ -85218 -63059 24629 12940 -64938 -37903 -85179 129576 156303 -29081 -107561 47274
19884D7274J4475r1375L8904j53470n7263J06038J62231j0381r3249j18115K6231
$$ 47274 61749 -29626 9278 -144192 -201455 -95417 66814 56433 -36816 -154931 -128700
19873a28700N0242J7456j44954k9314O6074P6841N3549K9624r3016n874R8214
$$ -128700 -78458 -61002 -205956 -235270 -169196 -92355 -38806 -9182 -102198 -108072 -9858
19862i858K993Q2978o3467r4823m302N54k1447j78013m530J22621J90762J23092
$$ -9858 -6865 76113 12646 -82177 -86479 -85925 -107372 -285385 -289915 -167294 23468 146560
19850A46560L8788j16038j66990q9461J04284J60969L4359J58588j41289m0529
$$ 146560 185348 69310 -97680 -187141 -82857 78112 112471 271059 129770 89241
19840H9241J8546j0991q4318m4547M9230J83662O1469M0533q1903j15528o6851
$$ 89241 107787 96796 12478 -32069 17161 200823 262292 302825 220922 105394 38543
19829C8543l1365m533O9521m6971j10203L7606j10252p3976j02179P2896J31059
$$ 38543 7178 2645 72166 25195 -85008 -47402 -157654 -231630 -333809 -260913 -129854
19818a29854J19366J35092K64711m5128k28408j14643P0144J5855k887P5396n5523
$$ -129854 -10488 124604 389315 344187 115779 1136 71280 87135 84248 159644 104121
19807A04121o7851O3034q9856J14528L7134k15875j57116O44J81914Q9904O3676
$$ 104121 36270 99304 9448 123976 161110 -54765 -211881 -211237 -29323 60581 124257
19796A24257n1618j22508n0080N2912l4553J47459K554N1735P785k825n8397o9511
$$ 124257 72639 -49869 -99949 -47037 -81590 65869 68423 120158 127943 125118 66721 -2790
19784b790o5211O2016J04394M8212r4732q3578Q324M3774j0601L3109N5192n895
$$ -2790 -68001 -5985 98409 146621 51889 -31689 -23365 20409 9808 42917 98109 92214
19772I2214J5786o5355r0839L2048J05705J42282m5220J016J05466m2463p6106
$$ 92214 108000 42645 -48194 -16146 89559 231841 186621 187637 293103 250640 174534
19761A74534Q559r0306n1437n2269m3735k5402N1637P5435N9676m3024J0007j36140
$$ 174534 183093 92787 41350 -10919 -54654 -80056 -28419 47016 106692 63668 73675 -62465
19749f2465j02473M3783J31053K8714O8779j42787J1848l5128J3438J32498O2766
$$ -62465 -164938 -121155 9898 38612 107391 -35396 -23548 -58676 -45238 87260 150026
19738A50026k8653l4162m9462j4404M4719K5215o7321N0502R0137N8226j01279
$$ 150026 121373 87211 37749 23345 68064 93279 25958 76460 166597 224823 123544
19727A23544r4496K2677p4J24797l5456j53797L9829j823j12024J2659L3395J11063
$$ 123544 29048 51725 51651 176448 140992 -12805 27024 25201 -86823 -74164 -40769 70294
19715G0294J4088k2049k16348j14204Q7589O4587J53153J07347o4684j33144j40626
$$ 70294 84382 62333 -154015 -268219 -180630 -116043 37110 144457 79773 -53371 -193997
19704a93997J6675N9143J63070K2002o6936M75O4895J83639j64707o2601J33766
$$ -193997 -177322 -118179 44891 66893 -43 432 65327 248966 84259 21658 155424
19693A55424K26048j49373r4982J1799L9695L5334j10062j27079r3742J5202J28519
$$ 155424 381472 232099 137117 148916 188611 223945 113883 -13196 -106938 -91736 36783
19682C6783r2771P5929P5990O6914O8215j11588j39758j06327Q7505J01175k979
$$ 36783 -55988 19941 95931 162845 231060 119472 -20286 -126613 -39108 62067 59088
19671E9088M3434M3750n7492j07118R3019J08257r3864j08901j23567j72730l628
$$ 59088 102522 146272 88780 -18338 74681 182938 89074 -19827 -143394 -316124 -319752
19660c19752O4547J4879K2714L365j7160K5746L5811j2230P0137Q8280Q1412q7056
$$ -319752 -255205 -240326 -217612 -214247 -231407 -205661 -169850 -182080 -111943 -23663 57749 -29307
19648b9307J85717J38763j67155j21811q7120j04841q724R1495R4323k5605J15594
$$ -29307 156410 295173 128018 6207 -80913 -185754 -194478 -102983 -8660 -34265 81329
19637H1329j2118p6162n9504r0747K56053N5420j68002l4130J94137p7132o8451
$$ 81329 69211 -6951 -66455 -157202 98851 154271 -13731 -47861 146276 69144 693
19626F93r3103Q954O5596k9907P1339O1829P1920j17651j22204n8699r5860J51949
$$ 693 -92410 -83456 -17860 -47767 23572 85401 157321 39670 -82534 -141233 -237093 -85144
19614h5144J44342k6714l9627n3664p3963m463q3111N2528J52648R4565N5256
$$ -85144 59198 32484 -7143 -60807 -134770 -139233 -222344 -169816 -17168 77397 132653
19603A32653l1698k347J6755M234Q3681J9539m2037p6992J4023J73j4471q827
$$ 132653 100955 98608 115363 119597 203278 222817 180780 103788 117811 117984 103513 94686
19591I4686n0499Q2772l2900j17939N1477l531p525p5502J9881O0924O9808o5202
$$ 94686 44187 126959 94059 -23880 27597 24066 16541 -58961 -39080 21844 91652 26450
19579B6450L7300l665M3230m23r8134K95J7686n3398j47070j8870J01126Q8429
$$ 26450 63750 60085 103315 102892 4758 5053 22739 -30659 -177729 -196599 -95473 -7044
19567g044o0537m5364l55N7116r240N554K7398Q5477Q01p5842R0550N8954n0817
$$ -7044 -67581 -112945 -113300 -56184 -65424 -59870 -32472 53005 53806 -22036 68514 127468 76651
19554G6651J17439M1761k7182p7390J04975O8832r5350m5901L6718K7482Q1602
$$ 76651 194090 235851 208669 131279 236254 305086 209736 163835 200553 228035 309637
19543C09637P016p8975o4275O615l9615j56771o9707n7919K7070j4916P2483Q4389
$$ 309637 316653 237678 173403 180018 140403 -16368 -86075 -143994 -116924 -131840 -59357 25032
19531B5032k9504R720M6648J39424N7463m6966J11245j79026j19908l3703r147
$$ 25032 -4472 5248 51896 191320 248783 201817 313062 134036 14128 -19575 -28722
19520b8722l7674K4946p4751N0351R3971J6804O8211p7298p8114P5209N1363j27829
$$ -28722 -66396 -41450 -116201 -65850 28121 44925 113136 35838 -42276 32933 84296 -43533
19508d3533l8390j8070p9641K14797P9247j7128J9255q3830n5380P1905k6112
$$ -43533 -81923 -99993 -179634 35163 114410 97282 116537 32707 -22673 49232 23120
19497B3120m2176j07801o7589m33j04687J16993J48317Q2094o1532n9828p6922
$$ 23120 -19056 -126857 -194446 -194879 -299566 -182573 -34256 47838 -13694 -73522 -150444
19486a50444M8202J10007K6252o7071P0387O2421j42770q0118l8043L6202N3944
$$ -150444 -102242 7765 34017 -33054 37333 99754 -43016 -123134 -161177 -124975 -71031
19475g1031P228J38544J28532j38312M1865p9762q4464J46098L4006J7072K7021
$$ -71031 -63803 74741 203273 64961 106826 27064 -57400 88698 122704 139776 166797
19464A66797j62535p389N087J04454R2152Q3185P6963j72152k09516M712j06000
$$ 166797 4262 -3127 1960 106414 198566 281751 358714 186562 -22954 -18242 -124242
19453a24242J07605J79879M1301k5158j31754J5987O3255q100l2837q7270o5614
$$ -124242 -16637 163242 204543 179385 47631 63618 126873 118773 85936 -1334 -66948
19442f6948r6441J05263J05986R0380L9995q0397l0943P7193p2998J30363O0419
$$ -66948 -163389 -58126 47860 138240 178235 97838 66895 144088 71090 201453 261872
19431B61872L8312l6058j72130L0160j7574j06481p277L9834L3120j7283n154
$$ 261872 300184 264126 91996 122156 104582 -1899 -9176 30658 63778 46495 41341
19420D1341J4765n6622L8044J96284n1833j94680j06860J65614J40426J74212
$$ 41341 56106 -516 37528 233812 181979 -12701 -119561 46053 186479 360691
19410C60691j43300j28430p8505k1195J99919K0254m5971n8574l4498p5837l1556
$$ 360691 217391 88961 10456 -10739 189180 209434 163463 104889 70391 -5446 -37002
19399c7002Q6265J38001j2472k4220o3925L0391k9647P6054J68215p1564j99590
$$ -37002 49263 187264 174792 150572 86647 117038 87391 163445 331660 260096 60506
19388F0506Q0234n0176L9895P1398k8663j00698p4340r0214k8085K6652J29436
$$ 60506 140740 90564 130459 201857 173194 72496 -1844 -92058 -120143 -93491 35945
19377C5945K3319m4482l1194J28426k5785r2496R2690K3245O2300J7022q8885
$$ 35945 59264 14782 -16412 112014 86229 -6267 86423 109668 171968 188990 100105
19366A00105j77926j6693p4103k4619R419p152N9279M0199L5538J00574R1419
$$ 100105 -77821 -94514 -168617 -193236 -183817 -190969 -131690 -91491 -55953 44621 136040
19355A36040O3376k7674n0778j17555j0113P5560R8636J00199j01074j97204J5008
$$ 136040 199416 171742 120964 3409 -6704 68856 167492 267691 166617 -30587 -15579
19344a5579P1146J18520J33897l6155o2623Q212j1429j2646j61602j44298M0896
$$ -15579 55567 174087 307984 271829 209206 217418 205989 193343 31741 -112557 -71661
19333g1661P965q3936j03554N6271J64478Q1384Q1823k3128J40289N6895k458
$$ -71661 -63696 -147632 -251186 -194915 -30437 50947 132770 109642 249931 306826 304368
19322C04368J09088p1043j67820P2954K0167R8210O4632j47566j12859R5689L3152
$$ 304368 413456 342413 174593 247547 267714 365924 430556 282990 170131 265820 298972
19311B98972m9921K5305k3935j9036o1670k0108M6047K1813O1793O7934L1071
$$ 298972 249051 274356 250421 231385 169715 149607 195654 217467 279260 347194 378265
19300C78265j12192m2110j13221j31430n2670R5835k9966j66082M7582J4093m6499
$$ 378265 266073 223963 110742 -20688 -73358 22477 -7489 -173571 -125989 -111896 -158395
19289a58395O9046J47351j10296j3184M2400M9224J27327P5625J9006M728r169
$$ -158395 -89349 58002 -52294 -65478 -23078 26146 153473 229098 248104 252832 243663
19278B43663J41775n9907j47800r5380o7465J9967M609o9331J3541j9384j6841
$$ 243663 385438 325531 177731 82351 14886 34853 39462 -29869 -16328 -35712 -52553
19267e2553j7869J67243J41865j29953j88660R153N9046J38590J11377J54n6228
$$ -52553 -70422 96821 238686 108733 -79927 -70774 -11728 126862 238239 238393 182165
19256A82165j68576j09027K9756J45355J2963k20340L5375J13116J17891q4316
$$ 182165 13589 -95438 -65682 79673 92636 -127704 -92329 20787 138678 54362
19246E4362k80405j15607K09158J58392R2166O5108j78438j09178J20470j3839
$$ 54362 -226043 -341650 -132492 25900 118066 183174 4736 -104442 16028 2189
19236B189j75930k0380M4954N2747P5913J8048j9816j23375J53355N0752P4457
$$ 2189 -173741 -194121 -149167 -96420 -20507 -2459 -22275 -145650 7705 58457 132914
19225A32914o9736p7769n9764m1767K8289j1455R3992N0390j3769m258J4261j01830
$$ 132914 63178 -14591 -74355 -116122 -87833 -99288 -5296 45094 31325 27067 41328 -60502
19213f0502n5052J956L6395P7868p7327j27700Q3515M9528P3383N9900R8999M5289
$$ -60502 -115554 -113598 -77203 665 -76662 -204362 -120847 -71319 2064 61964 160963 206252
19201B06252q7862j0748K326k5881q9416p4663M7112r8685R0289J28618O0684
$$ 206252 118390 107642 109968 84087 -5329 -79992 -32880 -131565 -41276 87342 148026
19190A48026q992Q3232J2773j25721r9444R890L2581J59766n0469j14106L4463
$$ 148026 139034 222266 235039 109318 9874 19764 52345 212111 161642 47536 81999
19179H1999L9599j0307m6962q9951j87871j7288J92648M1250M2522M1131l0187
$$ 81999 121598 111291 64329 -25622 -213493 -230781 -38133 3117 45639 86770 56583
19168E6583O8390r202P7087j1957J07815m5348o0686j30168J774o7983J02110
$$ 56583 124973 115771 192858 180901 288716 243368 182682 52514 54288 -13695 88415
19157H8415J09573L9957l1052q7574n763P944k4887l3350q200j2565o1767q369
$$ 88415 197988 237945 206893 119319 113556 121500 96613 63263 55063 42498 -19269 -27638
19145b7638m5745J6773L1156n3244K3390K08952J23777r4490o9108K8245l3232
$$ -27638 -73383 -56610 -25454 -78698 -55308 153644 277421 182931 113823 142068 108836
19134A08836N3057O8921l1975K0713o3451j65370n4881J04521J95235j52234j26306
$$ 108836 161893 230814 198839 219552 156101 -9269 -64150 40371 235606 83372 -42934
19123d2934q9095J7154J8989O9226O5634J10614O2381n0132r9585M102O3107J14320
$$ -42934 -132029 -114875 -95886 -26660 38974 149588 211969 161837 62252 66354 129461 243781
19111B43781j31862o7868P142l9891q0779O4235N4305K1626J31439J26838J36029
$$ 243781 111919 44051 51193 11302 -69477 -5242 49063 70689 202128 328966 464995
19100D64995K4384j25216J70899K2771m6652J17347J18111o5705j80809m5792
$$ 464995 489379 364163 535062 557833 511181 628528 746639 680934 500125 454333
19090D54333J34957j9885Q3854Q6992q9414j5857R7662N3096P8327J8803j28534
$$ 454333 589290 569405 653259 740251 650837 634980 732642 785738 864065 882868 754334
19079G54334j22522L7968j95248j76425K7224J58010R2169j36636n3804n3971
$$ 754334 631812 669780 474532 298107 325331 483341 575510 438874 385070 331099
19069C31099l6715l5259M199J02610k9591n3162j31782p6772j52137k7028M4449
$$ 331099 294384 259125 263324 365934 336343 283181 151399 74627 -77510 -104538 -60089
19058f0089K3455Q6609N7304L7517J20746Q093m7812N2763N4826J57347J80294
$$ -60089 -36634 49975 107279 144796 265542 273635 225823 278586 333412 490759 671053
19047F71053R8663R818R8410K4156k10063k76480K14148K91545J60047J01265
$$ 671053 769716 779534 877944 902100 692037 415557 629705 921250 1081297 1182562
19037A182562O1425j0767k02025j88259p4605R9718l7523j44063k0237J47013
$$ 1182562 1243987 1233220 1031195 842936 768331 868049 830526 686463 666226 813239
19027H13239J75652j43557q6912k53393j01787q2616J4918J67069J52307j06053
$$ 813239 988891 845334 758422 505029 403242 320626 335544 502613 654920 548867
19017E48867j26931j11773n7477J6198n602J5572J8651k6170k2212m1104K17o7383
$$ 548867 421936 310163 252686 268884 263282 278854 297505 271335 249123 208019 208236 140853
19005A40853J0631R04j0913j9798O7533N9498J4737l4464K328q6951K3072k8745
$$ 140853 151484 152388 141475 121677 189210 248708 263445 228981 231309 144358 167430 138685
18993A38685L3742o0545Q8411P1960k9557q7087j07477J11220J38303K1651J53364
$$ 138685 172427 111882 200293 272253 242696 155609 48132 159352 297655 319306 472670
18982D72670J08766N3589k3331j80162r7886m6207J47552J94577O6715Q2325k1594
$$ 472670 581436 635025 611694 431532 333646 287439 434991 629568 696283 778608 757014
18971G57014j30933j84068j86489j29443j731n431L3910m2406P2137J39768J05020
$$ 757014 626081 442013 255524 126081 124350 118919 152829 110423 182560 322328 427348
18960D27348j85462j30584J47280J17035J69795J87356J35188L3388k3989q453
$$ 427348 241886 111302 258582 375617 545412 732768 867956 901344 877355 868902
18950H68902N6866R2594K5541o0184k6613q4102k27462k07400O527j6171J58J11586
$$ 868902 925768 1018362 1043903 983719 957106 873004 645542 438142 444669 428498 428656 540242
18938E40242J10798P1796n9165j57600j48540r837Q3354l8130K9702J66569p0024
$$ 540242 651040 722836 663671 506071 357531 347694 431048 392918 422620 589189 519165
18927E19165k6832q3103n6238q1642N409k57K0449M8914j84457k4758M0454J23767
$$ 519165 492333 409230 352992 271350 276759 276502 296951 345865 161408 136650 177104 300871
18915C00871L01111R4012p4184j26551k48599j16142P3050O9837N9477L5115J43712
$$ 300871 601982 695994 621810 495259 246660 130518 203568 273405 332882 367997 511709
18904E11709P8678P0530J67532J84506K7668O0509j5660n5369p7734p5749n4144
$$ 511709 590387 660917 828449 1012955 1040623 1101132 1085472 1030103 952369 876620 822476
18893H22476O0416J54960L1420r4188j05409p302L022j81883k20461j78158Q3546
$$ 822476 882892 1037852 1069272 975084 869675 862373 865395 683512 463051 284893 368439
18882C68439j07485j30667r6195n6951J32606J31386M9459N5118o8193M2954N9109
$$ 368439 260954 130287 34092 -22859 109747 241133 290592 345710 277517 320471 379580
18871C79580L5402P407N117R4630r2517q6880k7041p2689j01285K7597J23672
$$ 379580 414982 422389 427506 522136 429619 342739 315698 243009 141724 169321 292993
18860B92993O2681j67424n2303P1181K1445O0723J33175j3053j2579P1893R4233
$$ 292993 355674 188250 135947 207128 228573 289296 422471 409418 396839 468732 562965
18849E62965l0950j51377R6813M4977o236n152l884j38533j6506j1034l9115l2997
$$ 562965 532015 380638 477451 522428 516192 511040 507156 368623 352117 341083 301968 268971
18837B68971R1576Q6277j9797j11386n7051L9461l4163q6513J4047j17510N8118
$$ 268971 360547 446824 427027 315641 258590 298051 263888 177375 191422 73912 132030
18826A32030J87788K3326L8255L9289P9177l5018o4697P8965l3527n3545q8603
$$ 132030 319818 343144 381399 420688 499865 464847 400150 479115 445588 392043 303440
18815C03440j32755J07040K7771k7549L382m8354j00893P3913J4692o0192j04551
$$ 303440 170685 277725 305496 277947 281329 232975 132082 205995 220687 160495 55944
18804E5944J0804J06265Q8667J4704Q1514P3950r3798L9622p7177N8673J47756
$$ 55944 66748 173013 261680 276384 357898 431848 338050 377672 300495 359168 506924
18793E06924m4116m2689q2225j13948k7619p878R5245J43367J93686O7490p6216
$$ 506924 462808 420119 337894 223946 196327 188449 283694 427061 620747 688237 612021
18782F12021k5913j30245j09048l8746M5675O853o6473Q6177K2225J7274N2795
$$ 612021 586108 455863 346815 308069 353744 360597 294124 380301 402526 419800 472595
18771D72595J57305J77550K28548K81190J9418j77290j43340j69201j29910j67946
$$ 472595 629900 807450 1035998 1317188 1336606 1159316 1015976 846775 716865 548919
18761E48919m3633m3561l2310j19152O9166N7165N446K5345q2859M8148L3091
$$ 548919 505286 461725 429415 310263 379429 436594 442040 467385 384526 432674 465765
18750D65765L2775j24677M2139J49806O8805n7777p4097o6876o7697l7796J60707
$$ 465765 498540 373863 416002 565808 634613 576836 502739 435863 368166 330370 491077
18739D91077N2733m8470M135M3000N7796P6256L2698k28902P228J3718M2694L9017
$$ 491077 543810 495340 499475 542475 600271 676527 709225 480323 487551 501269 543963 582980
18727E82980O878r6849j14939r7160o4626O3107P7706J9117j18145K4043J41253
$$ 582980 589858 493009 378070 280910 216284 279391 357097 376214 258069 282112 423365
18716D23365L9128R630J3148n7402m6023R466J87944J7016k2498K4913K4469R4204
$$ 423365 462493 472123 485271 427869 381846 391312 579256 596272 573774 598687 623156 717360
18704G17360N8678l381k0477J8675p0300P6393J23426J01341M5734N0858M2655
$$ 717360 776038 772657 752180 770855 700555 776948 900374 1001715 1047449 1098307 1140962
18693A140962k9750n8282j6127j72914j89461q9846J90709R6403j08001r2526
$$ 1140962 1111212 1052930 1036803 863889 674428 584582 775291 871694 763693 671167
18683F71167J21108Q7839m1256M2229Q8221L1683J5742K1658P6049J59759P9225
$$ 671167 792275 880114 838858 881087 969308 1000991 1016733 1038391 1114440 1274199 1353424
18672A353424K97j56686j37428n1057p4944o2218J4342P7748p9867j16558Q7208
$$ 1353424 1353721 1197035 1059607 1008550 933606 871388 885730 963478 883611 767053 854261
18661H54261J84780L37632J89706m8399q6450j7698K5288N7140l6448m062n5064
$$ 854261 1039041 1376673 1566379 1517980 1431530 1413832 1439120 1496260 1459812 1455750 1400686
18650A400686r5012K7825L6054q2917K2293Q3241J10814Q1053j41073j84678j60847
$$ 1400686 1305674 1333499 1369553 1286636 1308929 1392170 1502984 1584037 1442964 1258286 1097439
18639A097439O3530J47679Q8990K9812N9100L7509J53339M9998j17992J22551
$$ 1097439 1160969 1308648 1397638 1427450 1486550 1524059 1677398 1727396 1609404 1731955
18629A731955M7430J03989J28377L4692q7516n1821l3248J59575J22225J80413
$$ 1731955 1779385 1883374 2011751 2046443 1958927 1907106 1873858 2033433 2155658 2336071
18619B336071J88210K92232J93361J77211P1236r2575O5267K03430L94218L48852
$$ 2336071 2524281 2816513 3009874 3187085 3258321 3165746 3231013 3434443 3828661 4177513
18609D177513L16157K19763L57635L81735J55361l8249k0161L7965J98928L45391
$$ 4177513 4493670 4713433 5071068 5452803 5608164 5569915 5549754 5587719 5786647 6132038
18599F132038L26483N01197O19552M37305M24684Q01567R80750J426951K098503
$$ 6132038 6458521 6959718 7579270 8016575 8441259 9242826 10223576 11650527 13749030
18590A3749030L093493M690794P005479R553718J0036228P432780M058687O930022
$$ 13749030 16842523 21533317 28538796 38092514 48128742 55561522 59620209 66550231
18582F6550231J6833939L0076879M0581022L7693780J8545704j4971917l5195623
$$ 66550231 83384170 113461049 154042071 191735851 210281555 195309638 160114015
18575A60114015k9853975j2319091J101598K394822q939059j8864193k1099725
$$ 160114015 130260040 117940949 119042547 121437369 112498310 93634117 72534392
18568G2534392j6806846j1584174p584002m967807l468239k496589j898492j485264
$$ 72534392 55727546 44143372 36559370 31591563 28123324 25626735 23728243 22242979
18560B2242979r91544q39286p75451p06215m96682k22694j9340q4179j45259k53925
$$ 22242979 21251435 20412149 19636698 18930483 18433801 18211107 18191767 18107588 17962329 17708404
18550A7708404k59338m185M88961O29726L72278L76903O68971J062197J768573
$$ 17708404 17449066 17444881 17933842 18563568 18935846 19312749 19981720 21043917 22812490
18541B2812490K460237L071109M041574N403735Q300375J3832682K4434287M2260080
$$ 22812490 25272727 28343836 32385410 37789145 46089520 59922202 84356489 126616569
18533A26616569O2330507O9461401M4271182j2002272m8991655m4952456j8348292
$$ 126616569 188947076 258408477 302679659 290677387 241685732 196733276 178384984
18526A78384984N436779J5745627R015657k905296j5625296k6124154k2664724
$$ 178384984 183821763 199567390 208583047 205677751 190052455 163928301 141263577
18519A41263577r795440k23019k900454j6107729k2617970k0115358j3829989
$$ 141263577 131468137 131245118 128344664 112236935 89618965 69503607 55673618
18512E5673618r209307o262869m470156l317300k568894j929679j809895j468316
$$ 55673618 46464311 40201442 35731286 32413986 29845092 27915413 26105518 24637202
18504B4637202j137557j044416q84763p73210p11182q00551p21653m69745k06015
$$ 24637202 23499645 22455229 21570466 20797256 20086074 19285523 18563870 18094125 17888110
18495A7888110k92062l0028K91166L83919N38062J087147J816895K534720M121873
$$ 17888110 17596048 17566020 17857186 18241105 18779167 19866314 21683209 24217929 28339802
18486B8339802O978798J1773837J9807819K8012953K9170624J5310173j1051449
$$ 28339802 35318600 47092437 66900256 94913209 124083833 139394006 128342557
18479A28342557k4425217k0618429q651165L717891J2681519J3490478K220315
$$ 128342557 103917340 83298911 74647746 78365637 91047156 104537634 106757949
18472A06757949j5370668k1549673j8209481j2097787p476804m660722l261808
$$ 106757949 91387281 69837608 51628127 39530340 32053536 27392814 24131006
18465B4131006k617847k093147j646112j328026j134736j072101q26914o36408
$$ 24131006 21513159 19420012 17773900 16445874 15311138 14239037 13412123 12775715
18457A2775715n70470l91318l95226l39271j67582K8488j7580M2677l2815j20938
$$ 12775715 12205245 11813927 11418701 11079430 10911848 10940336 10922756 10965433 10932618 10811680
18447A0811680l26274k44629j09690L6683L05085q9334j12383k04728r8044K72849
$$ 10811680 10485406 10240777 10131087 10167770 10472855 10383521 10271138 10066410 9968366 10241215
18437A0241215L71223M63594M63263N86323O55429R13455J055656J463633J977708
$$ 10241215 10612438 11076032 11539295 12125618 12781047 13694502 14750158 16213791 18191499
18428A8191499K622783L933052O267134J0309213J6502602K3105552K4442953
$$ 18191499 20814282 24747334 31014468 41323681 57826283 80931835 105374788
18421A05374788J6405777J585525k550029Q576059K7152334M0317776L4010684
$$ 105374788 121780565 123366090 120816061 129392120 156544454 196862230 230872914
18414B30872914N599680k9925921m7614918m2210577k7489922j4148258m239338
$$ 230872914 236472594 206546673 158931755 116721178 89231256 75082998 70843660
18407G0843660K704392N353372J273454q241656j3865031j3009135r162992n732537
$$ 70843660 73548052 78901424 80174878 71933222 58068191 45059056 35896064 30163527
18399C0163527l766107k597454k115615j987393j561717j120144r23761p68777
$$ 30163527 26397420 23799966 21684351 19696958 18135241 17015097 16091336 15322559
18391A5322559q35478p42956o48723n34237m59864l44945j75993j55185k48583
$$ 15322559 14487081 13744125 13095402 12561165 12101301 11756356 11580363 11425178 11176595
18382A1176595j52769J5448m429J76715L68194M46520O22397R91473J566267K607342
$$ 11176595 11023826 11039274 11034845 11211560 11579754 12026274 12648671 13640144 15206411 17813753
18372A7813753M290644P058523J0499062J2975723J1144107M626545J000174K619887
$$ 17813753 22104397 29162920 39661982 52637705 63781812 68408357 69408531 72028418
18364G2028418N078791L572532j903304r272303j0623863o028187R53407N897820
$$ 72028418 77107209 80679741 78776437 69504134 58880271 52852084 53805491 59703311
18356E9703311N379639j861173j0576581j2851107j0269009o557972m066438k747200
$$ 59703311 65082950 63221777 52645196 39794089 29525080 22967108 18900670 16153470
18348A6153470j946829j482700j263609j034399q18502n23775n77986m66017m90414
$$ 16153470 14206641 12723941 11460332 10425933 9607431 9083656 8505670 8039653 7549239
18339G549239k97080l40107l77208l91604l95238k14827k99317k27697j51410
$$ 7549239 7252159 6912052 6534844 6143240 5748002 5533175 5233858 5006161 4854751
18330D854751q1147j57462m2323j36089j63977j44091j59998m3019l8940j18763
$$ 4854751 4773604 4616142 4573819 4437730 4273753 4129662 3969664 3926645 3887705 3768942
18320C768942j97692k07199j00016o8499j17257j05145k58072K3009n5324l3346
$$ 3768942 3571250 3364051 3264035 3195536 3078279 2973134 2715062 2738071 2682747 2649401
18310B649401J30432M1779j15189J6529m3638K8552Q2867p4155p5926k41527q5278
$$ 2649401 2779833 2821612 2706423 2722952 2679314 2707866 2790733 2716578 2640652 2399125 2313847
18299B313847k2740j72185j41072m1628n7902k8300q7064J22808K13167K898k5070
$$ 2313847 2291107 2118922 1977850 1936222 1878320 1850020 1762956 1885764 2098931 2101829 2076759
18288B076759K1638o7991o2753j44629o2249j2657p3418q1003q9313L9017m0702
$$ 2076759 2098397 2030406 1967653 1823024 1760775 1748118 1674700 1593697 1504384 1543401 1502699
18277A502699Q932M2494j298O910l7483Q1278K7121N3823M4365P5984J3463m6162
$$ 1502699 1511631 1554125 1552827 1559737 1522254 1603532 1630653 1684476 1728841 1804825 1818288 1772126
18265A772126n6511L0225J8055j83442j37485O3378L1795l8673j83517k0923K9896
$$ 1772126 1715615 1745840 1763895 1580453 1442968 1506346 1538141 1499468 1315951 1295028 1324924
18254A324924m1235j16173P6282J53959j22713r623P1353j18213l27444l0590
$$ 1324924 1283689 1167516 1243798 1397757 1275044 1265421 1336774 1218561 891117 860527
18244H60527P9465J34303J53246M4115q852m0725M3232N989P3799O2271j31893
$$ 860527 939992 1074295 1227541 1271656 1262804 1222079 1265311 1271300 1345099 1407370 1275477
18233A275477l502j11598k1909M9146P5146O9517n9491M1529j9160l6926N9439
$$ 1275477 1271975 1160377 1138468 1187614 1262760 1332277 1272786 1314315 1295155 1258229 1317668
18222A317668q91K7881P3327m6461j86136n9812P012j6579K8686M3620J28176
$$ 1317668 1316777 1344658 1417985 1371524 1185388 1125576 1132588 1116009 1144695 1188315 1316491
18211A316491J32842q2231j28419n1366l3791j22278j22328N9946K8208L7788
$$ 1316491 1449333 1367102 1238683 1187317 1153526 1031248 908920 968866 997074 1034862
18201A034862q8605p4911M1622M6860K9325J98880K39095R5788j05453N803r4719
$$ 1034862 946257 871346 912968 959828 989153 1188033 1427128 1522916 1417463 1423266 1328547
18190A328547r8757R2697j0029j1918O1739J02205J65308J97272J79710J26698
$$ 1328547 1229790 1322487 1312458 1300540 1362279 1464484 1629792 1827064 2006774 2133472
18180B133472j5483J97329L26946K26226J98132J34635J01285L8040M4338J48922
$$ 2133472 2117989 2315318 2642264 2868490 3066622 3201257 3302542 3340582 3384920 3533842
18170C533842J19977P3534k8379p7307J88876L29152K46667L25874M56964N36270
$$ 3533842 3653819 3727353 3698974 3621667 3810543 4139695 4386362 4712236 5169200 5705470
18160E705470Q21886Q90701J083274J627673K439007L551643N438047R075732
$$ 5705470 6527356 7418057 8501331 10129004 12568011 16119654 21557701 30633433
18152C0633433J4534700J9972794K0154065R659930p418445j3828700q295416
$$ 30633433 45168133 65140927 85294992 94954922 87536477 73707777 65412361
18145F5412361K260720J0758742J1962466K352183j3228733j9156796j6235438
$$ 65412361 67673081 78431823 90394289 92746472 79517739 60360943 44125505
18138D4125505j0910186o855080m255476k792646k096062j419364j006471q48132
$$ 44125505 33215319 26360239 22104763 19312117 17216055 15796691 14790220 13942088
18130A3942088m38582m51123l44959k5663K64538L60460L18064L88864Q68737
$$ 13942088 13503506 13052383 12707424 12681761 12946299 13306759 13624823 14013687 14882424
18121A4882424J069815J382730J673177K104846K647899M301672P622296J3553910
$$ 14882424 15952239 17334969 19008146 21112992 23760891 28062563 35684859 49238769
18113D9238769K4426801M1393635N4896138M9524917R402771l8099181m5203048
$$ 49238769 73665570 115059205 169955343 219480260 228883031 190783850 145580802
18106A45580802k5098618j771897J2828476J4865231L756962o960572p930367
$$ 145580802 120482184 118710287 131538763 146403994 150160956 143200384 135270017
18099A35270017m742541p501188j1685308p649926N59517M314160L11489j1117180
$$ 135270017 130527476 123026288 111340980 103691054 104250571 108564731 108876220 97759040
18091I7759040j9462258j8996864j3779087q877167n884925m013751k890107k311957
$$ 97759040 78296782 59299918 45520831 36643664 30758739 26744988 23854881 21542924
18083B1542924j867433j473419r03663n56271o38794n70327n87437m78378m81001
$$ 21542924 19675491 18202072 17298409 16742138 16103344 15533017 14945580 14467202 13986201
18074A3986201n60223n01694m15320k19812j11895p9978j04310J50739L39567
$$ 13986201 13425978 12924284 12508964 12289152 12177257 12097279 11992969 12143708 12483275
18065A2483275Q14122J130331J317686J832845K756323M456004P755707J2023907
$$ 12483275 13297397 14427728 15745414 17578259 20334582 24790586 32546293 44570200
18057D4570200J3951744J0080714j357627r453591q335859j728891N195308Q482179
$$ 44570200 58521944 68602658 67245031 57791440 49455581 47726690 52921998 61404177
18049F1404177N202776n815171j2989884j2623271q701072n437466l422998k306183
$$ 61404177 66606953 60791782 47801898 35178627 26477555 21040089 17617091 15310908
18041A5310908j751792j579387j501658j015266q57518p42439o22488l76822m73887
$$ 15310908 13559116 11979729 10478071 9462805 8605287 7862848 7240360 6863538 6389651
18032F389651l59642j26842o5341p4152j21777j17546k13724l26477j86818k36709
$$ 6389651 6030009 5903167 5837826 5763674 5641897 5524351 5310627 4984150 4797332 4560623
18022D560623j74931j38185j19281r2217o3121k2251k76788k33535p9018j00436
$$ 4560623 4385692 4247507 4128226 4036009 3972888 3950637 3673849 3440314 3361296 3260860
18012C260860k7946Q5587J43029j2297M8429O3244r329J55626J25250J63062L69103
$$ 3260860 3232914 3318501 3461530 3449233 3497662 3560906 3551577 3707203 3832453 3995515 4364618
18001D364618J32619K720J52563K86468J33206J94476J07341R715m4876J2374
$$ 4364618 4497237 4499957 4652520 4938988 5072194 5266670 5374011 5383726 5338850 5351224
17991E351224l8688m1031j69401l02064k42363k04965l37883l45581l56419k59767
$$ 5351224 5312536 5271505 5102104 4800040 4557677 4352712 4014829 3669248 3312829 3053062
17981C053062j91395k83623k53715k24363p2943Q7669j04234j12438j63085m7479
$$ 3053062 2861667 2578044 2324329 2099966 2027023 2114692 2010458 1898020 1734935 1687456
17971A687456Q7407l7504q9577k45330j76949R3209J88258Q1127L1194K5702J0085
$$ 1687456 1774863 1737359 1647782 1402452 1225503 1318712 1506970 1588097 1619291 1644993 1655078
17960A655078M8774K8719J72306R6684m9239k2464J27101J67578P9728J44765
$$ 1655078 1703852 1732571 1904877 2001561 1952322 1929858 2056959 2224537 2304265 2449030
17950B449030n2161k18820o021K82862J15511k4763k8260J17475J6027o3289p7221
$$ 2449030 2396869 2178049 2172028 2454890 2570401 2545638 2517378 2634853 2650880 2587591 2510370
17939B510370p2858j80544j88886k37931j94392j62550J16181j4702k48239k32755
$$ 2510370 2437512 2256968 2068082 1830151 1635759 1473209 1589390 1574688 1326449 1093694
17929A093694k75464M359l3569k24808j89766J6212J43943p0153O1347J44389
$$ 1093694 818230 822589 789020 564212 374446 390658 534601 464448 525795 670184
17919F70184m1759p6433q2984J9643k3997L8493r366q9453O3557J28158j5582
$$ 670184 628425 551992 469008 488651 464654 503147 493781 404328 467885 596043 580461
17908E80461k5523L9250N1333K6939l6167r4201k8569N2906R6536K00909Q3727
$$ 580461 554938 594188 645521 672460 636293 542092 513523 566429 662965 863874 947601
17897I47601j62625N0841J63623M2886O1765O0084l9978L177J27574q200j76828
$$ 947601 784976 835817 999440 1042326 1104091 1164175 1124197 1127374 1254948 1246748 1069920
17886A069920k48915j55264J51798j7522k00077j06419j29245j00812o6179N8922
$$ 1069920 821005 665741 817539 800017 599940 493521 364276 263464 197285 256207
17876B56207J7116p6070k5557L2598O9165J01476m8490K8347j06578j37303N3281
$$ 256207 273323 197253 171696 204294 273459 374935 326445 354792 248214 110911 164192
17865A64192Q1284m4562r0693p0989l8342k0881J63319j077Q0349K5705o5334
$$ 164192 245476 200914 110221 39232 890 -19991 143328 142251 222600 248305 182971
17854A82971J19981M1238j08845m3190N4422j08429r4220J44314J36125J01213
$$ 182971 302952 344190 235345 192155 246577 138148 43928 188242 324367 425580
17844D25580J42045L001p0632K15835Q9113j57104N7240J51703Q2871Q1569j90568
$$ 425580 567625 570626 499994 715829 804942 647838 705078 856781 939652 1021221 830653
17833H30653j91832K5102J37405J04330j362n9036l1683r5187m6088o1440Q4771
$$ 830653 638821 663923 801328 905658 904296 845260 813577 718390 672302 610862 695633
17822F95633L7545L0998P010j8362j01115q6164n4448j03273j07590M7427Q6790
$$ 695633 733178 764176 771186 752824 651709 565545 511097 407824 300234 347661 434451
17811D34451J3368k6381j21489P687J44510k7727m6329M0417l5471M813p0498
$$ 434451 447819 421438 299949 307636 452146 424419 378090 418507 383036 387849 317351
17800C17351p7961j9846j85261K3265J16434M8904q7656l5802m535Q038O844n0912
$$ 317351 239390 219544 34283 57548 173982 222886 135230 99428 94893 102931 109775 58863
17788E8863k3511R1988o0628k10746O5491J44985J67738L2530r5179l7405O9628
$$ 58863 35352 127340 66712 -144034 -78543 66442 234180 266710 171531 134126 203754
17777B03754J91986O0856Q316j72448r4806J43110O9897k7679p6927N7323l2625
$$ 203754 395740 456596 464912 292464 197658 340768 410665 382986 306059 363382 330757
17766C30757j24757j37809K0793J02753J9668M7951M7702r1589L0787j98451o3683
$$ 330757 206000 68191 88984 191737 211405 259356 307058 215469 246256 47805 -15878
17755a5878Q435M0935m383N5790J31780k9862j17249q2535m9330J00011O3486
$$ -15878 -7443 33492 29109 84899 216679 186817 69568 -12967 -62297 37714 101200
17744A01200p6610q6728q889O7886P4166r332q8209k6239J227J4370Q0184j0574
$$ 101200 24590 -62138 -71027 -3141 71025 61693 -26516 -52755 -51528 -37158 43026 32452
17732C2452o0332p092l5378O2133Q4973k104l6060o0331Q236M5923m3174j45105
$$ 32452 -27880 -34972 -70350 -8217 76756 74652 38592 -21739 -13503 32420 -10754 -155859
17720a55859M4212O2239P9332Q2381L3776N2848j61515n226j14843O5353R6239
$$ -155859 -111647 -49408 29924 112305 146081 198929 37414 32188 -82655 -17302 78937
17709G8937L7209j5984o299p3604l7371q226j05842n7836J7767o381M6407J2467
$$ 78937 116146 100162 93863 20259 -17112 -25338 -131180 -189016 -171249 -177630 -131223 -118756
17697a18756m4750k6914J7721P8963K0264k0287L1612R5538J34219l691M9431
$$ -118756 -163506 -190420 -172699 -93736 -73472 -93759 -62147 33391 167610 163919 213350
17686B13350M3821O5753N5728j11506M3070R6488k8301p1450r8311r6170L9066
$$ 213350 257171 322924 378652 267146 310216 406704 378403 306953 208642 112472 151538
17675A51538L9623q3039j71377r9475J05074K9586n828l6350N7247L5642R1076
$$ 151538 191161 108122 -63255 -162730 -57656 -28070 -33898 -70248 -13001 22641 113717
17664A13717N1811J6123j15314j54278N2846J63220R7909L0255j26198j98911
$$ 113717 165528 181651 66337 -87941 -35095 128125 226034 256289 130091 -68820
17654f8820l7031P6057O8955L6952k17297J24103J01363r4955L6855J36078N7474
$$ -68820 -105851 -29794 39161 76113 -141184 -17081 84282 -10673 26182 162260 219734
17643B19734L7829R993l6326k3316j5124L7493Q4621K62304L51069J92045j8906
$$ 219734 257563 267556 231230 207914 192790 230283 314904 577208 928277 1120322 1101416
17632A101416j56314k41953j15479P9545J18808J08419q4727j85737j40246j83539
$$ 1101416 945102 703149 587670 667215 786023 894442 809715 623978 483732 300193
17622C00193L3510M2717k10774k6990J08270J27893j1050j64538p6002j03374
$$ 300193 333703 376420 165646 138656 246926 374819 363769 199231 123229 19855
17612A9855n0511R4752Q6979O2577O5134k454j12055n3228o4209n9114m2481P213
$$ 19855 -30656 64096 151075 213652 278786 276332 164277 111049 46840 -12274 -54755 -47542
17600d7542M4390M478J92983J56397L7966O4741Q1997n7598j42656j31921N781
$$ -47542 -3152 1326 194309 350706 388672 453413 535410 477812 335156 203235 209016
17589B09016N1944K21351J39586J12078M2741R5987O6331M940q8855j13826o2814
$$ 209016 260960 482311 621897 733975 776716 872703 939034 943974 855119 741293 678479
17578F78479r6924j54345j13087j03517q4660J10314O400J2972j5589j52348p2300
$$ 678479 581555 427210 314123 210606 125946 236260 242660 255632 240043 87695 15395
17567A5395Q3358j8787j3438l8717k546M3826N4024l7876p8169n3652N2601L7047
$$ 15395 98753 79966 66528 27811 25265 69091 123115 85239 7070 -46582 6019 43066
17555D3066R4336j5799q9705p2924L4297J0610n5303l8877K7832J04302J35064
$$ 43066 137402 121603 31898 -41026 -6729 3881 -51422 -90299 -62467 41835 176899
17544A76899N8798j6841J16420J7669o0835r6302J6642j38M49Q2662L7706P8434
$$ 176899 235697 218856 335276 352945 292110 195808 212450 212312 212761 295423 333129 411563
17532D11563K2116j15639j29307j15557o3549O0141P6766J00960o221r0256n4494
$$ 411563 433679 318040 188733 73176 9627 69768 146534 247494 241273 151017 96523
17521I6523K007n0069q5084J436Q3802m4359M2919L6313o5121n8880O135p0591
$$ 96523 98530 48461 -36623 -35187 48615 4256 47175 83488 18367 -40513 -34378 -104969
17509a04969j49989o5010J8194K1135N6262K18345J17843K7937l137j59570L9662
$$ -104969 -254958 -319968 -301774 -280639 -224377 -6032 111811 139748 136611 -22959 16703
17498A6703N5344J03822k2199j4109l0646J1372j3670J72216J35723j57398j67676
$$ 16703 72047 175869 153670 139561 108915 120287 106617 278833 414556 257158 89482
17487H9482j5907L2418q6392M180J01426P6K3028j30217j33917J87075J97581
$$ 89482 73575 105993 19601 23781 125207 125283 148311 18094 -115823 71252 268833
17476B68833N034p1018j83390k45817L8116M4703K7591q4938J14296R5506j4037
$$ 268833 273867 202849 19459 -226358 -188242 -143539 -115948 -200886 -86590 8916 -5121
17465e121Q4132l7123O2895M3878r0754J25917J63987j28900j31247k21035q1806
$$ -5121 79011 41888 104783 148661 57907 183824 347811 218911 87664 -133371 -215177
17454b15177J25759J86727J87347r062P4052p0890o2178q9313J72919K97614L86011
$$ -215177 -89418 97309 284656 275594 349646 278756 216578 127265 300184 597798 983809
17443I83809J55419q0549l23410k95075j29700j33805J35445l2501j12752j24116
$$ 983809 1139228 1058679 735269 440194 310494 176689 312134 279633 166881 42765
17433D2765K098q682k4391m3829r498M6328n8413N0845m6113l3190m2499J3654
$$ 42765 44863 36181 11790 -32039 -41537 4791 -53622 -2777 -48890 -82080 -124579 -110925
17421a10925R9640K9640L800j0338l7327Q2741J51185K7985j5282J16808L3159
$$ -110925 -11285 18355 22155 11817 -25510 57231 208416 236401 221119 337927 371086
17410C71086j11043k30037p9154R03J26019O0380k1846j24731m3094L8435P067
$$ 371086 260043 30006 -49148 -48245 77774 138154 116308 -8423 -51517 -13082 -6015
17399f015L1411O3175N1079m2762Q7882N647j84992j33206L6865l0287R1172J81780
$$ -6015 25396 88571 139650 96888 184770 190417 5425 -127781 -90916 -121203 -30031 151749
17387A51749K8125k52866j17831N9164R1485J6591n6332p4612J9044P93r9852
$$ 151749 179874 -72992 -190823 -131659 -40174 -23583 -79915 -154527 -135483 -134690 -234542
17376b34542J11647P4318j2728o7181Q3770o7324k4288M1289l9329J2502J119
$$ -234542 -122895 -48577 -61305 -128486 -44716 -112040 -136328 -95039 -134368 -121866 -120747
17365a20747N772P5725J0758j44939O1055J94874m0137j33729J12421J27684N6006
$$ -120747 -114975 -39250 -28492 -173431 -112376 82498 42361 -91368 21053 148737 204743
17354B04743j07433j4175k6935j24841N2279Q228j395O035J02991m0895j04304
$$ 204743 97310 83135 56200 -68641 -16362 -8134 -9529 -3494 99497 58602 -45702
17343d5702J250L536J12353m4987n5445J31794n1925k2136n0696R7181J3077N2917
$$ -45702 -44452 -40916 71437 26450 -28995 102799 50874 28738 -21958 75223 88300 141217
17331A41217K0725K7996q4501q7703j14990o0916K24151J94168j56898j15929
$$ 141217 161942 189938 105437 17734 -97256 -158172 65979 260147 103249 -12680
17321a2680n1138M1415M9618n9885J4244j25153m9871k4930M9650J32196O2080
$$ -12680 -63818 -22403 27215 -32670 -18426 -143579 -193450 -218380 -168730 -36534 25546
17310B5546J82249J8922j70851m0624O9863O6665j01751p5811l8088O8225J07108
$$ 25546 207795 226717 55866 15242 85105 151770 50019 -25792 -63880 4345 111453
17299A11453l7124j5608j38191q5243n0381R3672M6029K8962J5953j24910k6654
$$ 111453 74329 58721 -79470 -164713 -215094 -121422 -75393 -46431 -30478 -155388 -182042
17288a82042J59810J62641j39802P96n0989J0411P5952m2066l6689l738P147k4669
$$ -182042 -22232 140409 607 1403 -49586 -39175 36777 -5289 -41978 -45716 -38569 -63238
17276f3238j19911j3561R5900K30318L2785j07825L1970m300j49735O1215l8814
$$ -63238 -183149 -196710 -100810 129508 162293 54468 86438 82138 -67597 -6382 -45196
17265d5196q0363L9513J4290M2180k4073k8533J7830j1270L7833N2289j48275
$$ -45196 -125559 -86046 -71756 -29576 -53649 -82182 -64352 -75622 -37789 14500 -133775
17254a33775M9405P9101Q725j09588M3402J0728J7052M4489j60611j21994J64140
$$ -133775 -84370 -5269 3456 -106132 -62730 -52002 -34950 9539 -151072 -273066 -108926
17243a08926Q8877R9099j340p4237p2160M1068m3949p1469K022l7975q3908P6106
$$ -108926 -20049 79050 77710 3473 -68687 -27619 -71568 -143037 -141015 -178990 -262898 -186792
17231a86792O8482J5610J04292k8379j29083p8307M893J05879k1199k1063Q3200
$$ -186792 -118310 -102700 1592 -26787 -155870 -234177 -229284 -123405 -144604 -165667 -82467
17220h2467J6162N551O4233m1240l698L6689P351l0038n2182J04806j3209j18220
$$ -82467 -66305 -60754 3479 -37761 -41459 -4770 2581 -27457 -79639 25167 11958 -106262
17208a06262n285L6857o7789M2986N3849R0094m7919N4051J82268k0992j22217
$$ -106262 -111547 -74690 -142479 -99493 -45644 44450 -3469 50582 232850 211858 89641
17197H9641j06501N7667p0397p6601P1064L2505l5151k8588J9449k7781j91093
$$ 89641 -16860 40807 -29590 -106191 -35127 -2622 -37773 -66361 -46912 -74693 -265786
17186b65786N4631J02645J00563j08964j75607J89285M8092m5977m3230K9838
$$ -265786 -211155 -108510 -7947 -116911 -292518 -103233 -55141 -101118 -144348 -114510
17176a14510m8188J51599O0235Q2789q1438j06044j75172Q7105l703l6211O4029
$$ -114510 -162698 -11099 49136 131925 50487 -55557 -230729 -143624 -147327 -183538 -119509
17165a19509q6440n8660n4880J13544J76127Q7089l5274M3249P4488K6988q7321
$$ -119509 -205949 -264609 -319489 -205945 -29818 57271 21997 65246 139734 166722 79401
17154G9401p0015j18987j25524M6992Q6142m2890j2239L7924l535M5937j308J5813
$$ 79401 9386 -109601 -235125 -188133 -101991 -144881 -157120 -119196 -122731 -76794 -78102 -62289
17142f2289J90201o596l2280N9848L8294j44868q5663j4408o2928k3662q5377
$$ -62289 127912 121316 89036 148884 187178 42310 -43353 -57761 -120689 -144351 -229728
17131b29728O6456N316l9825j07954K1657L32827R4276m1990r3947o9758R2772
$$ -229728 -163272 -157956 -197781 -305735 -284078 48749 143025 101035 7088 -62670 30102
17120C0102n59M2225j89407j00969O8789O1768n3918L9807P5888M4241j68728
$$ 30102 29543 71768 -117639 -218608 -149819 -88051 -141969 -102162 -26274 17967 -150761
17109a50761o3538L2597l7057O7316J27071l0465q752J2018J55005L6400j86641
$$ -150761 -214299 -181702 -218759 -151443 -24372 -54837 -63589 -51571 103434 139834 -46807
17098d6807k31052J19588J87120R4627j11881j10053M7613J29076L3145o6867
$$ -46807 -277859 -158271 28849 123476 11595 -98458 -50845 78231 111376 44509
17088D4509j28147l0846P6146L2992j53301o9183P7025J51524J02143q9652n5880
$$ 44509 -83638 -114484 -38338 -5346 -158647 -227830 -150805 719 102862 13210 -42670
17077d2670N5672j6954j04911K3499O7299k3282J0964o0875O557K0147J70156
$$ -42670 13002 -3952 -108863 -85364 -18065 -41347 -30383 -91258 -84701 -64554 105602
17066A05602M7421l225o7688r0816L5416R248q4520l6924J8390J980r625k191
$$ 105602 153023 149798 82110 -8706 26710 35958 -48562 -85486 -67096 -65116 -74741 -76932
17054g6932M0888K9230q1423N988L85m7267Q9291J6704J03036J30820o364j31123
$$ -76932 -36044 -6814 -88237 -82249 -81864 -129131 -39840 -23136 79900 210720 204356 73233
17042G3233j15793m8882l881k0851j035M463p227n4845P0875P7182n5331k5598
$$ 73233 -42560 -91442 -95323 -116174 -117209 -112746 -119973 -174818 -103943 -26761 -82092 -107690
17030a07690k4457M875N1022J5441L5256L5150k7452j37346O2264O3161m1605
$$ -107690 -132147 -127272 -76250 -60809 -25553 9597 -17855 -155201 -92937 -29776 -71381
17019g1381j27698j11479K2828N5713K0678m9755L8086J07054L8085l6101N3403
$$ -71381 -199079 -310558 -287730 -232017 -211339 -261094 -223008 -115954 -77869 -113970 -60567
17008f0567O7806o124J6540O0277Q627K5877m6330j50689K4809p719R4611j22373
$$ -60567 7239 1115 17655 77932 86559 112436 66106 -84583 -59774 -67493 27118 -95255
16996i5255M7029L5074K4744o4901j67462J5452Q0865l7399J21423J97843r1146
$$ -95255 -48226 -13152 11592 -53309 -220771 -205319 -124454 -161853 -40430 157413 66267
16985F6267M444j32646O9925o656k9019J6596P7243Q0875k9420j39614j32672
$$ 66267 70711 -61935 7990 1334 -27685 -11089 66154 147029 117609 -22005 -154677
16974a54677m9328m2772R32j4125P3456L1571o2891n1750O1452J09860O3014j16938
$$ -154677 -204005 -246777 -245845 -259970 -186514 -154943 -217834 -269584 -208132 -98272 -35258 -152196
16962a52196o1381J69098J39435R805j22498m7489l8602J08363O409J50284J58137
$$ -152196 -213577 -44479 94956 104761 -17737 -65226 -103828 4535 10944 161228 319365
16951C19365J0334q1181N6305M118p6607o7564k6554O332M2920l7525m9579n5042
$$ 319365 329699 248518 304823 308941 232334 164770 138216 144548 187468 149943 100364 45322
16939D5322r5160l8058r6112J49219j10851j01223Q4075K62841N6973L2105j07367
$$ 45322 -49838 -87896 -184008 -34789 -145640 -246863 -162788 100053 157026 189131 81764
16928H1764k8519J18286K155j65046m5773L4241N69p0220J9558j21388j64473
$$ 81764 53245 171531 173686 8640 -37133 -2892 -2323 -72543 -52985 -174373 -338846
16917c38846O5671J88575O0094m8538o020j3035k0378k9397Q7985O1985j61375
$$ -338846 -273175 -84600 -24506 -73044 -79064 -92099 -112477 -141874 -53889 8096 -153279
16906a53279j02470J4473R2375J6848p739j02385q80J03741K16617R8771j41857
$$ -153279 -255749 -241276 -148901 -132053 -139792 -242177 -243057 -139316 77301 176072 34215
16895C4215o9738L8946J0337j50970m899K20320J41460o8571L5319L4196r5320
$$ 34215 -35523 3423 13760 -137210 -142109 78211 219671 151100 186419 220615 125295
16884A25295j17220j63046O7319O4219J76715J0261j09762P8802P0092R5847K4104
$$ 125295 8075 -154971 -87652 -23433 153282 163543 53781 132583 202675 298522 322626
16873C22626j10719K7165l7243q7847o1120P444J75353q153n7509r4626k22227
$$ 322626 211907 239072 201829 113982 52862 60306 235659 227506 169997 75371 -146856
16862a46856n8369J58137Q0521J37157J60029j34676k11242p607N7450j1596m9990
$$ -146856 -205225 -47088 33433 170590 330619 195943 -15299 -22906 34544 22948 -27042
16851b7042p2496l6520Q843J9021j5536R7962j7745P4178o0548j42668n1885J15427
$$ -27042 -99538 -136058 -127215 -108194 -123730 -25768 -43513 30665 -29883 -172551 -224436 -109009
16839a09009M6738m9194j6415j26105O082n0149j2905N4608R2720j0886M7906
$$ -109009 -62271 -111465 -127880 -253985 -247903 -298052 -310957 -256349 -163629 -174515 -126609
16828a26609j15411l2764R2965O5670M8137k0776J1001l9513O7296Q9362k3506
$$ -126609 -242020 -274784 -181819 -116149 -68012 -88788 -77787 -117300 -50004 39358 15852
16817A5852j37380o7865l5920N2969R4053l6447q298K5756K9307J2656Q2784J41068
$$ 15852 -121528 -189393 -225313 -172344 -78291 -114738 -123036 -97280 -67973 -55317 27467 168535
16805A68535R963j75053j57541O0164J50671k0666K4677l4608j19569p7631q4864
$$ 168535 178498 3445 -154096 -93932 56739 36073 60750 26142 -93427 -171058 -255922
16794b55922R9347O5540o776L4789K32345K7185p4948j2208j20742N757m8007
$$ -255922 -156575 -91035 -97811 -63022 169323 196508 121560 109352 -11390 -5633 -53640
16783e3640l0155J31072l8239q8895M9230j0164K7947L9534j0022j38938N8731
$$ -53640 -83795 47277 9038 -79857 -30627 -40791 -12844 26690 16668 -122270 -63539
16772f3539M5785J46658R2427n1700k6143j18850l8636L1438m55N504m0910M8063
$$ -63539 -17754 128904 221331 169631 143488 24638 -13998 17440 16985 22489 -18421 29642
16760B9642J71491J7328j5371j63595j43985J18243N8805L0573n7546j39383k3271
$$ 29642 201133 218461 203090 39495 -104490 13753 72558 103131 45585 -93798 -117069
16749a17069O0219n3831K520J90351k6537j6482M0414K3033n5765j58371J51697
$$ -117069 -56850 -110681 -108161 82190 55653 39171 79585 102618 46853 -111518 40179
16738D0179J01909j11247j18234p4241J21832l4634Q910M3528q4119j20875l9690
$$ 40179 142088 30841 -87393 -161634 -39802 -74436 -65526 -21998 -106117 -226992 -266682
16727b66682l58J21053J41862o7285o2358j6939O8330K6810o1616k533R2010L8812
$$ -266682 -267040 -145987 -4125 -71410 -133768 -150707 -82377 -55567 -117183 -119716 -27706 11106
16715A1106m4685J2484J00320J673q443J7012j22318n8264n9307l2647M5566p387
$$ 11106 -33579 -21095 79225 80898 72455 89467 -32851 -91115 -150422 -183069 -137503 -144890
16703a44890l3337J3743K0937J4972O4339p3254k4142L4224J6323K8269O0105
$$ -144890 -178227 -164484 -143547 -128575 -64236 -137490 -161632 -127408 -111085 -82816 -22711
16692b2711L427r1280j38365l6336J46134M1978R9874L8630j42812n8466M0980
$$ -22711 -19284 -110564 -248929 -285265 -139131 -97153 2721 41351 -101461 -159927 -118947
16681a18947j1447J04343n504k31513j49351J32820J83285o243Q4487N0976j2080
$$ -118947 -130394 -26051 -31555 -263068 -412419 -279599 -96314 -102557 -18070 32906 20826
16670B0826o4979m5047K835p240q3366p0868N5892J39477N226l5454O1164k9143
$$ 20826 -44153 -89200 -86365 -93605 -176971 -247839 -191947 -52470 -47244 -82698 -21534 -50677
16658e0677r9786j38052K2371k295J31214K0602o5569l729m4977j0428Q0952J85119
$$ -50677 -150463 -288515 -266144 -268439 -137225 -116623 -182192 -185921 -230898 -241326 -160374 24745
16646B4745N3530K1787K6539k191q6362n2347m4859p7908J1661O4310J4041o2552
$$ 24745 78275 100062 126601 124410 38048 -14299 -59158 -137066 -125405 -61095 -47054 -109606
16634a09606k1929o1076k5702P6893k324n8839q1356J7283o0909j5255M3246J4543
$$ -109606 -131535 -192611 -218313 -141420 -143744 -202583 -283939 -266656 -327565 -342820 -299574 -285031
16622b85031n6106J2529J90740J38415n376O9941J12542R6266j34739k21343j23085
$$ -285031 -341137 -328608 -137868 547 -4829 65112 177654 273920 139181 -82162 -205247
16611b05247q040J38118n2603o5760l3032L6182J2184j3555L4638J31976l5661
$$ -205247 -213287 -75169 -127772 -193532 -226564 -190382 -178198 -191753 -157115 -25139 -60800
16600f0800r002O8978R9703k6181j44526j31270J11299m5699P8363k8482j64447
$$ -60800 -69802 -824 98879 72698 -71828 -203098 -91799 -137498 -59135 -87617 -252064
16589b52064q4637N5417J82914L7534L5534k5392J8058j22962P8868K38500k532
$$ -252064 -336701 -281284 -98370 -60836 -25302 -50694 -32636 -155598 -76730 161770 159238
16578A59238j62968n4175k522R6838m6969j6460o7070p3076M6913Q8072o6164
$$ 159238 -3730 -57905 -60427 36411 -10558 -27018 -94088 -167164 -120251 -32179 -98343
16567i8343n3914j04704j788N4363q4797q126K5808M0524N8435l6794J21465J67447
$$ -98343 -152257 -256961 -258749 -204386 -289183 -297309 -271501 -230977 -172542 -209336 -87871 79576
16555G9576J38850o6544j34845m986l2180r1291l9247O5436P8341O1218M5847
$$ 79576 218426 151882 17037 12051 -20129 -111420 -150667 -85231 -6890 54328 100175
16544A00175k3298p6441Q5956q8789j31878J08103k0406N954j7830j56740j17524
$$ 100175 76877 436 86392 -2397 -134275 -26172 -46578 -40624 -58454 -215194 -332718
16533c32718J5423J17668j0636j17532n8886J47270M5074J4828J14702J5508K6095
$$ -332718 -317295 -199627 -210263 -327795 -386681 -239411 -194337 -179509 -64807 -49299 -23204
16522b3204J0476n0261q9273M7803P8326M635o2427j484j24248j16822K7692Q2238
$$ -23204 -12728 -62989 -152262 -104459 -26133 -21498 -83925 -85409 -209657 -326479 -298787 -216549
16510b16549J30210N2205L3514K1598K891j77198j57832q3083J47973J74236J51898
$$ -216549 -86339 -34134 -620 20978 23869 -153329 -311161 -394244 -246271 -72035 79863
16499G9863Q1215J0972L0312J8847o2739j24930j08970j9900q0660j04820r616
$$ 79863 161078 172050 202362 221209 158470 33540 -75430 -95330 -175990 -280810 -290426
16488b90426J02333J32747L3162N653K6013j9252j7218q3826n1628K068k803J31508
$$ -290426 -188093 -55346 -22184 -16531 9482 -9770 -26988 -110814 -162442 -160374 -163177 -31669
16476c1669L476m3154M5206l0262J07232J07298N7803j13120j03736R5217j6916
$$ -31669 -28193 -71347 -26141 -56403 50829 158127 215930 102810 -926 94291 77375
16465G7375N9218j45004j23220J3552M2309J9979m8471J05948J10115L6626o6315
$$ 77375 136593 -8411 -131631 -118079 -75770 -55791 -104262 1686 111801 148427 82112
16454H2112j28349k8730J58466j9822N6248L2798J397j97772j12829L0348N2593
$$ 82112 -46237 -74967 83499 63677 119925 152723 154120 -43652 -156481 -126133 -73540
16443g3540L1875O8032P126j537j87051q6250J26571O6619K6155p082J01720O728
$$ -73540 -41665 26367 33493 31956 -155095 -241345 -114774 -48155 -22000 -29082 72638 79366
16431G9366q1655M0124R4236q8984k29589m1787O3103J58665Q4661o6490o1303
$$ 79366 -2289 37835 132071 43087 -186502 -228289 -165186 -6521 78140 11650 -49653
16420d9653j16955O6608J38086J53518j53896k31678R4052K503j17137Q3981J82902
$$ -49653 -166608 -100000 38086 191604 37708 -193970 -99918 -97415 -214552 -130571 52331
16409E2331o4187l9045n9283p2042l8353P0409J96260r1188j90431j571J49915
$$ 52331 -11856 -50901 -110184 -182226 -220579 -150170 46090 -45098 -235529 -237100 -87185
16398h7185J06778q632N513L9485M75k1328o2729q892J6812P9432j5240m9651
$$ -87185 19593 10961 16474 55959 56434 35106 -27623 -36515 -19703 59729 44489 -5162
16386e162J23576k1297n6487k2513J8260J04435K7148m9111j6955J9624m5048
$$ -5162 118414 97117 40630 18117 36377 140812 167960 118849 101894 121518 76470
16375G6470N2013m9995j57117q2737R91P1954L4323p4215k5447m226J05493p8209
$$ 76470 128483 78488 -78629 -161366 -160375 -88421 -54098 -128313 -153760 -157986 -52493 -130702
16363a30702m4051J6830M5774k8530k1965n6292m2148j21966M1748M1062m4036
$$ -130702 -174753 -157923 -112149 -140679 -162644 -218936 -261084 -383050 -341302 -300240 -344276
16352c44276j303J56225j829J7019L9630L8161M759o4803P7737o741l260J21004
$$ -344276 -345579 -189354 -191183 -174164 -134534 -96373 -91614 -156417 -78680 -85421 -88681 32323
16340C2323Ol5017Q2146Q182j9935j7771l2130j29006j05126J363l3435J643K7533
$$ 32323 32329 -2688 79458 87640 67705 49934 17804 -111202 -216328 -214965 -248400 -246757 -219224
16327b19224K60024P3588p9143J5582J1856o2194K162l6409j13446J3230J10110
$$ -219224 40800 114388 35245 50827 62683 489 2651 -33758 -147204 -133974 -23864
16316b3864J078O3586m8851P6444o0014K9851N2081o3489m0156j34644J9784P228
$$ -23864 -22786 40800 -8051 68393 8379 38230 90311 26822 -13334 -147978 -128194 -120966
16304a20966N9867J15284O465p3332K885n6755K0778M2024J80872P349j51837
$$ -120966 -61099 54185 60650 -12682 -9797 -66552 -45774 -3750 177122 184471 32634
16293C2634n7210M4300n34J15614K7793J0902o7079l8609L9044Q4338l2018o1661
$$ 32634 -24576 19724 19190 134804 162597 173499 106420 67811 106855 191193 159175 97514
16281I7514M6365J5216j66841n5374M5912J21474j6230M7814N3909n4353N2365
$$ 97514 143879 159095 -7746 -63120 -17208 104266 88036 135850 189759 135406 187771
16270A87771N3340j1201r9352p6634N5686j6901n5396J18780L9101p6231k7550
$$ 187771 241111 229910 130558 53924 109610 92709 37313 156093 195194 118963 91413
16259I1413k13141o1195O4912R7400r2344R446P6513j42785n7804n239M4874k2514
$$ 91413 -121728 -182923 -118011 -20611 -112955 -103509 -26996 -169781 -227585 -232824 -187950 -210464
16247b10464o0739m2574R3877N5653j7429R0399j4245J67767o8059r8776l3827
$$ -210464 -271203 -313777 -219900 -164247 -181676 -91277 -105522 62245 -5814 -104590 -138417
16236a38417p596M6722l1610l7163J0612M7910l390j6091K1226r1390M7063j7699
$$ -138417 -146013 -99291 -130901 -168064 -157452 -109542 -112932 -129023 -107797 -199187 -152124 -169823
16224a69823J02420j8649p0555k0222M5489M2831J27603J12027q2275q3726J37031
$$ -169823 -67403 -86052 -156607 -176829 -131340 -88509 39094 151121 68846 -14880 122151
16213A22151J0700k05287k10542k0100Q7808O1347J16677N1113j04152K149n6618
$$ 122151 132851 -72436 -282978 -303078 -215270 -153923 -37246 13867 -90285 -88136 -144754
16202a44754K0184L1216j75211M3395K10314J46323J2287P9453k4933m405q3674
$$ -144754 -124570 -93354 -268565 -225170 -14856 131467 143754 223207 198274 193869 110195
16191A10195j54650j9207Q7981P606m23j14685p7862k6806N1687J2212N8241J08300
$$ 110195 -44455 -63662 24319 31925 31502 -83183 -161045 -187851 -136164 -123952 -65711 42589
16179D2589P0793m5126l7792j2323j2214M111M8583p1610j53132J48627J37496
$$ 42589 113382 68256 30464 18141 5927 10038 58621 -12989 -166121 -17494 120002
16168A20002j91J1418l3050j13353j37860J06143Q5000Q5222p3144p8160p0569
$$ 120002 119811 131229 98179 -15174 -153034 -46891 38109 123331 50187 -27973 -98542
16157i8542l7523l5370J0916M3587O4202J48815K7354L7929j38717j91396j3604
$$ -98542 -136065 -171435 -160519 -116932 -52730 96085 123439 161368 22651 -168745 -182349
16146a82349J32607k7808J27578J020m2854m100J10749P2216k4768K8685J13003
$$ -182349 -49742 -77550 50028 51048 8194 4094 114843 187059 162291 190976 303979
16135C03979j3010j45435j53050j57345r56M5768o0113o4473J3243J02125J61747
$$ 303979 290969 145534 -7516 -164861 -165817 -120049 -180162 -244635 -231392 -129267 32480
16124C2480Q927q0797R431l8668J33549J32776l6639m2875j5772m629j5526j10345
$$ 32480 41407 -39390 -29959 -68627 64922 197698 161059 118184 102412 97783 82257 -28088
16112b8088j5301J46981J39419K354j52267p5354l1133J40217O551n3039q2433
$$ -28088 -43389 103592 243011 245365 93098 17744 -13389 126828 133379 80340 -2093
16101b093o510K4251n8394j32918o9640r7846J1350P2070O1063O5845j4905j56555
$$ -2093 -8603 15648 -42746 -175664 -245304 -343150 -331800 -259730 -198667 -132822 -147727 -304282
16089c04282j761R6090J18452N2839n2564j648M0608J06793j1597p0749k9943
$$ -304282 -306043 -209953 -91501 -38662 -91226 -92874 -52266 54527 42930 -27819 -57762
16078e7762k7674P2603J06187p9317K1207l9602m7055j65355p750Q5091J13730
$$ -57762 -85436 -12833 93354 14037 35244 -4358 -51413 -216768 -224518 -139427 -25697
16067b5697n7078j61165l4966n330k626O8813K14942J8505j00668N1786L5895
$$ -25697 -82775 -243940 -278906 -284236 -286862 -218049 -3107 15398 -85270 -33484 2411
16056B411r1993q1820J17466K8348o051Q0302L9296Q4679Q9002j55471l4235O2489
$$ 2411 -89582 -171402 -53936 -25588 -31639 48663 87959 172638 261640 106169 71934 134423
16044A34423n3327L3378K5192Q252N0047o2488j32334j8271l1971o6303j6388
$$ 134423 81096 114474 139666 147918 197965 135477 3143 -15128 -47099 -113402 -129790
16033a29790O9780P4444P6698j17916q0035k679j2624J09692K884J05880o067
$$ -129790 -60010 14434 91132 -26784 -106819 -109498 -122122 -12430 -9546 96334 90267
16022I0267j02887n4339o4604q128K79Q9859L9505j3861J4562N7806J62158Q4735
$$ 90267 -12620 -66959 -131563 -139691 -139412 -49553 -10048 -23909 -9347 48459 210617 295352
16010B95352j24422k04235J0075r2358j1253J60056M0422M3911N4343j18128P8548
$$ 295352 170930 -33305 -23230 -115588 -126841 33215 73637 117548 171891 53763 132311
15999A32311J46431r9784p3194p4187l5494j2932J497n9120j71305M3186J37676
$$ 132311 278742 178958 105764 31577 -3917 -16849 -15352 -74472 -245777 -202591 -64915
15988f4915P386r7879M4624K16675M1187K1836n0294j17370J8470K3685M9070
$$ -64915 -57529 -155408 -110784 105891 147078 168914 118620 1250 19720 43405 92475
15977I2475j9120k16242N1819J40189j2073q5106m5638M0174L8692k4952M9734
$$ 92475 73355 -142887 -91068 49121 37048 -48058 -93696 -53522 -14830 -39782 9952
15966I952o6633m3378P8517r0232j72092L6328M6882M0189M1518J1398L3246J32549
$$ 9952 -56681 -100059 -21542 -111774 -283866 -247538 -200656 -160467 -118949 -107551 -74305 58244
15954E8244j46686q2685m8749J21509Q2435k2084M937K5315l2261o7809q2397
$$ 58244 -88442 -171127 -219876 -98367 -15932 -38016 -33079 -7764 -40025 -107834 -190231
15943a90231o0702j15779M331J43746J72596J0347n5184J2253K2373p7631j20755
$$ -190231 -250933 -366712 -362381 -218635 -46039 -35692 -90876 -78623 -56250 -133881 -254636
15932b54636N7930o166J4972r5477m9468J54168q32Q8564J14297n19p6569k5956
$$ -254636 -196706 -202872 -187900 -283377 -332845 -178677 -179509 -90945 23352 22833 -53736 -79692
15920g9692P3050p379j09942R1865j6816j50972M9107J68132N0809O7489N3977
$$ -79692 -6642 -14021 -123963 -32098 -48914 -199886 -150779 17353 68162 135651 189628
15909A89628m3963j28774o4921K3741j07771P859J41524O8501P4085j83960j50342
$$ 189628 145665 16891 -48030 -24289 -132060 -124201 17323 85824 159909 -24051 -174393
15898a74393q9260q5751r299L7281P9545J19505R5617j07948n9202J18417P4426
$$ -174393 -263653 -349404 -358703 -321422 -241877 -122372 -26755 -134703 -193905 -75488 -1062
15887a062P1312j0265j98126j91658j40913J68485J38130L9152j5538K1858m3946
$$ -1062 70250 59985 -138141 -329799 -470712 -302227 -164097 -124945 -140483 -118625 -162571
15876a62571O5351O4175O3596m3002O8530o9563O5247k8305j67143J54260J40971
$$ -162571 -97220 -33045 30551 -12451 56079 -13484 51763 23458 -143685 10575 151546
15865A51546o058j28434j29204P9409o7463M9520m2274K4096k5646m0171J5521
$$ 151546 145488 17054 -112150 -32741 -100204 -50684 -92958 -68862 -94508 -134679 -119158
15854a19158n6715K4920K2252P9282R3231J13386q5043j66729j1173O8190L6948
$$ -119158 -175873 -150953 -128701 -49419 43812 157198 72155 -94574 -105747 -37557 -609
15843f09k1519O1917o7430o2220M3815k5551L9952N6552p670l6522J10947J07016
$$ -609 -22128 39789 -27641 -89861 -46046 -71597 -31645 24907 17237 -19285 91662 198678
15831A98678j38514m4616r8806O91j19156j4958Q3239k9603j21327J57535J78859
$$ 198678 60164 15548 -83258 -82567 -201723 -216681 -133442 -163045 -284372 -126837 52022
15820E2022J0893l6407j42422j03363O1735q5962j31034K1554J29287N9923j978
$$ 52022 62915 26508 -115914 -219277 -157542 -243504 -374538 -352984 -223697 -163774 -165752
15809a65752K3562o465P5508J92J9965J1825k4871m6691L8879J32747M0661O612
$$ -165752 -142190 -148655 -73147 -72955 -52990 -41165 -66036 -112727 -73848 58899 99560 106172
15797A06172J08171m9936j64589j10291l1562O0838J31656k9652p3815o1900k0018
$$ 106172 214343 164407 -182 -110473 -142035 -81197 50459 20807 -53008 -114908 -134926
15786a34926N3925M3327l8184k25073p5837J16368m775o633P8251R891M1333p8814
$$ -134926 -81001 -37674 -75858 -300931 -376768 -260400 -265175 -271808 -193557 -183666 -142333 -221147
15774b21147L0893J08384J0038p8365n7692Q4250Q3750j1698m7282N0792J4892
$$ -221147 -190254 -81870 -71832 -150197 -207889 -123639 -39889 -51587 -98869 -48077 -33185
15763c3185l666m0786j4690m0812n226M2335k2345J64426M0438l597J646K9053
$$ -33185 -36851 -77637 -92327 -133139 -138365 -96030 -118375 46051 86489 82892 84538 113591
15751A13591P8828l5769L4968N2396j55553o3382j81359q4069p240p5303l1762
$$ 113591 192419 156650 191618 244014 88461 25079 -156280 -240349 -247589 -322892 -354654
15740c54654K13976K16614n0011m6931j0417j63866n4877Q0285L9793R3830K8447
$$ -354654 -140678 75936 25925 -21006 -31423 -195289 -250166 -169881 -130088 -36258 -7811
15729g811K9056M1859l6543K3156L0992j26718j98334K7963k0638j6606Q1863
$$ -7811 21245 63104 26561 49717 80709 -46009 -244343 -216380 -237018 -253624 -171761
15718a71761m7973R5580Q2858K0045m4714O1507L3684j1676m104o2692m3783j4223
$$ -171761 -219734 -124154 -41296 -21251 -65965 -4458 29226 17550 13446 -49246 -93029 -107252
15706a07252q2698k4488J90166O2137Q8655q0758j04595n5210P008J16982R4105
$$ -107252 -189950 -214438 -24272 37865 126520 45762 -58833 -114043 -107035 9947 104052
15695A04052N3741p3633J1365k382k9844p0823j69458K9128n0827P2811J15649
$$ 104052 157793 84160 95525 93143 63299 -7524 -176982 -147854 -198681 -125870 -10221
15684a0221L4569O641J08001J64430n1108j26751r7580r2540o9223o9906m7235
$$ -10221 24348 30989 138990 303420 252312 125561 27981 -64559 -133782 -203688 -250923
15673b50923J57335J25046k5517k0742J30383J13743k2089j891n0885q1738m2260
$$ -250923 -93588 31458 5941 -14801 115582 229325 207236 205345 154460 72722 30462
15662C0462l5547r9560j20585P848p8417L9653M9310p9336N1151J81502O7924
$$ 30462 -5085 -104645 -225230 -217382 -295799 -256146 -206836 -286172 -235021 -53519 14405
15651A4405q8551m1354L2400j5696J00731N6010O2544J8552Q338K4743j66279
$$ 14405 -74146 -115500 -83100 -98796 1935 57945 120489 139041 147379 172122 5843
15640E843l6728M6926M8581p9550M0176M9432J3048l6715K2294j79548r7055K20656
$$ 5843 -30885 16041 64622 -14928 25248 74680 87728 51013 73307 -106241 -203296 17360
15628A7360O0729r1225o3145j41774j6594J76000R9022j006M8774p1647j28213
$$ 17360 78089 -13136 -76281 -218055 -234649 -58649 40373 39367 88141 16494 -111719
15617a11719j3458J01341R0732j52326j02767K7530j237p4660M4092L3482j02129
$$ -111719 -125177 -23836 66896 -85430 -188197 -160667 -161904 -236564 -192472 -158990 -261119
15606b61119N2404N0755k2050L2851O9967L0430O6530L561r8246n6957Q966n6758
$$ -261119 -208715 -157960 -180010 -147159 -77192 -46762 19768 23329 -74917 -131874 -122908 -179666
15594a79666O3721J83544R5698o6097j10330q2026M8682m4718M6995J48976J2847
$$ -179666 -115945 67599 163297 97200 -13130 -95156 -46474 -91192 -44197 104779 117626
15583A17626p9364L6277l115L0130J3268j6038K4650j33639j02911n9193L3384
$$ 117626 38262 74539 71424 101554 114822 98784 123434 -10205 -113116 -172309 -138925
15572a38925L8823Q2387R402L7994R7372K1035l0051m8714j28803m2585O8830
$$ -138925 -100102 -17715 -8313 29681 127053 148088 118037 69323 -59480 -102065 -33235
15561c3235J9606m8157l4355Q4712r9493r3630J48806R8625k8120l4717p8346
$$ -33235 -13629 -61786 -96141 -11429 -110922 -204552 -55746 42879 14759 -19958 -98304
15550i8304q878n5391l0643Q5296M9573M3761P7018l8794J07833l5243j09499
$$ -98304 -107182 -162573 -193216 -107920 -58347 -14586 62432 23638 131471 96228 -13271
15539a3271J8077n9380R8794l4548m0320N7065m6060p1669m0848j4268L8406J34106
$$ -13271 4806 -54574 44220 9672 -30648 26417 -19643 -91312 -132160 -146428 -108022 26084
15527B6084L2547L024M0858Q1095l07o0913j18681j59829P470o90L1689k5651
$$ 26084 58631 61655 102513 183608 183301 122388 3707 -156122 -148652 -149342 -117653 -143304
15515a43304n6932j32165k5925P6867J15370o743r3366N0296N6320n7894L3347
$$ -143304 -200236 -332401 -358326 -281459 -166089 -172832 -266198 -215902 -159582 -217476 -184129
15504a84129J38937K7220q819n3914j5590n9610n0672k8711J40535N1064j0242
$$ -184129 -45192 -17972 -26791 -80705 -96295 -155905 -206577 -235288 -94753 -43689 -53931
15493e3931R1173m2238j21702n201N6255j8906R9443o4188j6501Q2124P150m499
$$ -53931 37242 -4996 -126698 -131899 -75644 -94550 4893 -59295 -75796 6328 13478 8979
15481H979J05125J2686N3764k8076j26245m8905k2320r396O5550K7768j16849
$$ 8979 114104 126790 180554 152478 26233 -22672 -44992 -54388 11162 38930 -77919
15470g7919n6641R8564q9540o9433K1648J24842J31676k2518M063q5088q2536
$$ -77919 -134560 -35996 -125536 -194969 -173321 -48479 83197 60679 64742 -20346 -102882
15459a02882n9458o7144L0443o0490j613P2395P612p271n044N6870J61619K7433
$$ -102882 -162340 -229484 -199041 -259531 -261144 -188749 -181137 -188408 -193452 -136582 25037 52470
15447E2470p9504o3276J67648j6514j85283j07053O1891P5798O7438O6038J12739
$$ 52470 -27034 -90310 77338 60824 -124459 -231512 -169621 -93823 -26385 39653 152392
15436A52392j06739j56713m4017q4742K9512J21219p811P9010J48418j07159j33824
$$ 152392 45653 -111060 -155077 -239819 -210307 -89088 -96899 -17889 130529 23370 -110454
15425a10454j43533r2408J54650J10077Q7311R2214r2550m1610k4235R1019m6408
$$ -110454 -253987 -346395 -191745 -81668 5643 97857 5307 -36303 -60538 30481 -15927
15414a5927q2594j25022R7740P8831k038o8160o1885J58839Q7722p8949O5010
$$ -15927 -98521 -223543 -125803 -46972 -49010 -117170 -179055 -20216 67506 -11443 53567
15403E3567K8734M3044o8098R2081J20585m400p1132j38649n9003J0178l7051
$$ 53567 82301 125345 57247 149328 269913 265513 194381 55732 -3271 6907 -30144
15392c0144r1769j52750j08081O7219M0002J50642J06902k9498j56904j09481
$$ -30144 -121913 -274663 -382744 -315525 -275523 -124881 -17979 -47477 -204381 -313862
15382c13862Q8962J39337Q6212J49601j1922J175j3295r5965j582P3867m6869
$$ -313862 -224900 -85563 649 150250 138328 139503 126208 30243 28661 102528 55659
15371E5659j3976L1552q3728o0451Q602k7407l3758K9265j2060K7980P00L1300
$$ 55659 41683 73235 -10493 -70944 -62342 -89749 -123507 -94242 -106302 -78322 -77622 -46322
15359d6322J32789J91238L7640o3420m4350J0627p8894j26881j35048J5153r9562
$$ -46322 86467 277705 315345 251925 207575 218202 139308 12427 -122621 -107468 -207030
15348b07030J7796P2808P5964J7644n3073j5725n0573m2194o0851j04635J66924
$$ -207030 -189234 -116426 -40462 -22818 -75891 -91616 -142189 -184383 -245234 -349869 -182945
15337a82945j338J0259J40442J37688n0457J05034K4404J0898M1422j60028j09447
$$ -182945 -184283 -174024 -33582 104106 53649 158683 183087 193985 235407 75379 -34068
15326c4068K6544P4996n125q486q0050L1225m8672J510L6859P6387N5711m0911
$$ -34068 -7524 67472 62347 53861 -26189 5036 -43636 -42126 -5267 71120 126831 85920
15314H5920j36543R630K7701n1734j305O5330L4230J23502k809j8165m5360j24548
$$ 85920 -50623 -40993 -13292 -65026 -66331 -1001 33229 156731 153922 135757 90397 -34151
15302c4151p1093j6062J51076N9307j6818q7594L4594J44150j01496k04162j35222
$$ -34151 -105244 -121306 29770 89077 72259 -15335 19259 163409 61913 -142249 -277471
15291b77471N1420l9407j43949j2434Q9152J23146K6983L1979Q4265J45312K2094
$$ -277471 -226051 -265458 -409407 -421841 -332689 -209543 -182560 -150581 -66316 78996 101090
15280A01090K726L1569r6370j18466n9128Q9968M7778Q9634l4371j07100q9648
$$ 101090 103816 135385 39015 -79451 -138579 -48611 -833 88801 54430 -52670 -142318
15269a42318q1214L903j7588n1726J85328l2444L4149M4390j1191n9552k2097
$$ -142318 -223532 -219629 -237217 -288943 -103615 -136059 -101910 -57520 -68711 -128263 -150360
15258a50360O3921J04518O7155K0436Q0229k9714o4547P5979n9265p0135K6616
$$ -150360 -86439 18079 85234 105670 185899 156185 91638 167617 108352 38217 64833
15247F4833j2008r8226k9165j2455N7944o0376P4041J83644K758j5052r4076P7943
$$ 64833 52825 -45401 -74566 -87021 -29077 -89453 -15412 168232 170990 155938 61862 139805
15235A39805J02088n0919j16247k1161o4267j35469R3028O0679K868r2063j2864
$$ 139805 241893 190974 74727 53566 -10701 -146170 -53142 7537 10405 -81658 -94522
15224i4522M7327L0721q8546j2101L660M7234o1184j03119J68517J68581l1313
$$ -94522 -47195 -16474 -105020 -117121 -113461 -66227 -127411 -230530 -62013 106568 75255
15213G5255l5944j6830j25535n9402m7928L6999j7569O7170j0818l6823N8210
$$ 75255 39311 22481 -103054 -162456 -210384 -173385 -190954 -123784 -134602 -171425 -113215
15202a13215Q40P2229M428P7287n2718n5139K7667Q6716j06086l3712N436O5319
$$ -113215 -112375 -40146 -35718 41569 -11149 -66288 -38621 48095 -57991 -91703 -86267 -20948
15190b0948o7450M8388Q0441j12047M5069l2253j3233K8992J30329L0907j26467
$$ -20948 -88398 -40010 40431 -71616 -26547 -58800 -72033 -43041 87288 118195 -8272
15179h272R1340n4772L2921l809j18329K8853N3257M2692p5141j07812n4643L1279
$$ -8272 83068 28296 61217 57408 -60921 -32068 21189 63881 -11260 -119072 -173715 -142436
15167a42436J94524J00082m280R243J3502L5083n6763N5135q466p6018K5585M2391
$$ -142436 52088 152170 147890 157133 170635 205718 148955 204090 195624 119606 145191 187582
15155A87582j72199p7963P7411N9709q4791l5649j55052l828J09353J63312Q4490
$$ 187582 15383 -62580 14831 74540 -10251 -45900 -200952 -204780 -95427 67885 152375
15144A52375q2956q879J78677l1229j10792J50097p7737j21197o0153O2591p3069
$$ 152375 69419 60540 239217 207988 97196 247293 169556 48359 -11794 50797 -22272
15133b2272L1964n0500K8893r0520j6504j55481O524K17709J6239J9511J04076
$$ -22272 9692 -40808 -11915 -102435 -118939 -274420 -267896 -50187 -33948 -14437 89639
15122H9639o4953j7403Q3944j4199m8944r6793n9027N4120N504L671K665K52720
$$ 89639 24686 7283 91227 77028 28084 -68709 -127736 -73616 -68112 -64441 -61776 190944
15110A90944N1879n9301j5670N0707K2982n6057M3517M9003q0599k15586o2963
$$ 190944 242823 183522 167852 218559 241541 185484 229001 278004 197405 -18181 -81144
15099h1144J67628k6863r7478K3068j91762M0549J81469O3643L4650M5049l9345
$$ -81144 86484 59621 -37857 -14789 -206551 -166002 15467 79110 113760 158809 119464
15088A19464o1598m1454m1168K8569P5741k5475j9568J25463k7088k9981M9140
$$ 119464 57866 16412 -24756 3813 79554 54079 34511 159974 132886 102905 152045
15077A52045M0811m0665j75367j18047J40411Q4621O3143n4891L4704J15722j92000
$$ 152045 192856 152191 -23176 -141223 -812 83809 146952 92061 126765 242487 50487
15066E0487j33916R1049R8837j08382o3854k7731O4737R4211l2425j72027m6169
$$ 50487 -83429 7620 106457 -1925 -65779 -93510 -28773 65438 33013 -139014 -185183
15055a85183n7671m005O7522O5251N98Q1372O5116M4936J09852o5761r4659j5022
$$ -185183 -242854 -246859 -179337 -114086 -113488 -32116 33000 77936 187788 122027 27368 12346
15043A2346R2985j72007k35977R9473K08304N1310m4033J15389Q8j13752m2761
$$ 12346 105331 -66676 -302653 -203180 5124 56434 12401 127790 127878 14126 -28635
15032b8635m2807J9114k847J65737K3018j57416r3693J38045J53924L5146o2309
$$ -28635 -71442 -52328 -55175 110562 133580 -23836 -117529 20516 174440 209586 147277
15021A47277L1001j33476k12702j57535P9083R1161J39576P1452k4288m2908L4630
$$ 147277 178278 44802 -167900 -325435 -246352 -155191 -15615 55837 31549 -11359 23271
15010B3271j01325n7283j1219J01068r350l9358R2038J63457J82347O9576k86008
$$ 23271 -78054 -135337 -146556 -45488 -54838 -94196 -2158 161299 343646 413222 127214
14999A27214j84940j43337j6088M3818o6241O369J43454J54110o5955k8262j2859
$$ 127214 -57726 -201063 -217151 -173333 -239574 -233205 -89751 64359 -1596 -29858 -42717
14988d2717j05072L1667J37102P516j19426j37206J1419J60724L1641j9219P4601
$$ -42717 -147789 -116122 20980 28496 -90930 -228136 -216717 -55993 -24352 -43571 31030
14977C1030o7277k18789K1283J70371K34563N6868j3552r37r8584q1337j21151
$$ 31030 -36247 -255036 -233753 -63382 171181 228049 214497 213560 114976 33639 -87512
14966h7512m586J14445j2065J79j6578k5803L7193O6364o1278q3602N9215n103
$$ -87512 -92098 22347 10282 10461 -6117 -31920 5273 71637 10359 -73243 -14028 -19131
14954a9131K8844M0091J9223r6385q7962l8874J04621L7449l9962j13936Q4550
$$ -19131 9713 49804 69027 -27358 -115320 -154194 -49573 -12124 -52086 -166022 -81472
14943h1472J77764k0433M876K8230p7368j46466r7773J06429J77571o022j13249
$$ -81472 96292 75859 80735 108965 31597 -114869 -212642 -106213 71358 65336 -47913
14932d7913N209J8393P602j849M4877J10614M8853J02593j56865k20259p7300
$$ -47913 -42704 -24311 -16709 -18558 26319 136933 185786 288379 131514 -88745 -166045
14921a66045P6823M5979O7635J32191L3826j27267j17524l6657m1774n3807M9897
$$ -166045 -89222 -43243 24392 156583 190409 63142 -54382 -91039 -132813 -186620 -136723
14910a36723o7239J9568J6883M0149Q7718j3685k9628k1161J5765P1615l9425
$$ -136723 -203962 -184394 -167511 -127362 -39644 -53329 -82957 -104118 -88353 -16738 -56163
14899e6163J2792Q5749q1064j18952J13922J75248M6331O7842o1481r8132K7611
$$ -56163 -43371 42378 -38686 -157638 -43716 131532 177863 245705 184224 86092 113703
14888A13703M5436n8295k9234L9074J3729K516P2416N6497j36600j67682O6514
$$ 113703 159139 100844 71610 110684 124413 126929 199345 255842 119242 -48440 18074
14877A8074m4587J0176R1225K8714O558P8857k6869l1706N0484J01895j36914
$$ 18074 -26513 -16337 74888 103602 110160 189017 162148 130442 180926 282821 145907
14866A45907j70816m712J33192j2588o7308J14017R3568K380j40108L7333K9341
$$ 145907 -24909 -29621 103571 90983 23675 137692 231260 233640 93532 130865 160206
14855A60206k7425J0051n371p3634J7983o4742P4455M7977l7717m0694O1867Q0151
$$ 160206 132781 142832 137461 63827 81810 17068 91523 139500 101783 61089 122956 203107
14843B03107j5911K6178O3180r1826j13601n8757N3312N8388q7970n3419k439
$$ 203107 187196 213374 276554 184728 71127 12370 65682 124070 36100 -17319 -19758
14832a9758L0311m9367K6083J44559J31009n1890r130r8180R088M8952k0200K9739
$$ -19758 10553 -38814 -12731 131828 262837 210947 201817 103637 112725 161677 141477 171216
14820A71216P806j16670l3152M8036l9968j90148k3732J67615j4542n6461L5433
$$ 171216 179022 62352 29200 77236 37268 -152880 -176612 -8997 -23539 -80000 -44567
14809d4567R6486l0645L3566R9186j6578q8926j17598n9821q285N1490J10075
$$ -44567 51919 21274 54840 154026 137448 48522 -69076 -128897 -137182 -85692 24383
14798B4383o518q1747m0707O3204P0493Q7222p2697m8179K2685n0813p1423O7480
$$ 24383 17865 -63882 -104589 -41385 29108 116330 43633 -4546 18139 -32674 -104097 -36617
14786c6617J10000j3666j40116R752N0135J23835P2073l8508j6968l3782o0831
$$ -36617 73383 59717 -80399 -70647 -20512 103323 175396 136888 119920 86138 25307
14775B5307n745O082n3426J03306J3732J12142o8900q4264j1661Q2027K293J9129
$$ 25307 19562 25644 -27782 75524 89256 201398 132498 48234 36573 118600 120893 140022
14763A40022n2470r5624l9588J1274j8903M6018R8175j28522n97p4342p691J80475
$$ 140022 87552 -8072 -47660 -36386 -55289 -9271 88904 -39618 -40215 -114557 -122248 58227
14751E8227M5818J06888l8630j72519L8201J864n8568r6728J24971J47279M2537
$$ 58227 104045 210933 172303 -216 37985 39849 -18719 -115447 9524 156803 199340
14740A99340R493j96319j46894o436N0125o473r522J60205k6506L1994J1898j50532
$$ 199340 208833 12514 -134380 -140816 -90691 -97164 -106686 53519 27013 59007 70905 -79627
14728g9627O4376L7747L4127R0751O0260K768r6347n6959J51539J23349j40254
$$ -79627 -15251 22496 56623 147374 207634 210402 114055 57096 208635 331984 191730
14717A91730N4004L2168p2612j794n0961p3294m9987k8147m2222R6819J02938
$$ 191730 245734 277902 205290 203496 152535 79241 29254 1107 -41115 55704 158642
14706A58642l2105l9788O5627J67388O043N246k6399k2767q122q3703j98198p1979
$$ 158642 126537 86749 152376 319764 325807 331053 304654 281887 273765 190062 -8136 -80115
14694h0115Q6040J94520J9229l457j17055n1674J56408l099j20541j57711j5040
$$ -80115 5925 200445 219674 216217 99162 47488 203896 200797 80256 -77455 -92495
14683i2495J25348M9645l4784q178L5468J22028k8065q7241p7576j48195m6694
$$ -92495 32853 82498 47714 39536 75004 197032 168967 81726 4150 -144045 -190739
14672a90739J16755L3436P9025O8588J03431J3324m023K6066L9262o9017r1269
$$ -190739 -73984 -40548 38477 107065 210496 223820 219797 245863 285125 216108 124839
14661A24839j07673J43572L2314l1914l5673K4485R810J9394J20439l1474j48424
$$ 124839 17166 160738 193052 161138 125465 149950 159760 179154 299593 268119 119695
14650A19695j98314l3353J29761J2650l055K1420K6866O1588j29396j70850P4036
$$ 119695 -78619 -111972 17789 30439 27384 48804 75670 137258 7862 -162988 -88952
14639h8952M2585O9573P2868K7589J15187M2883j90125p6660K2240M1246j12024
$$ -88952 -46367 23206 96074 123663 238850 281733 91608 14948 37188 78434 -33590
14628c3590L8517J0804P1953j42143N9218O2958o9061P898R7508N8368N6802n4099
$$ -33590 4927 15731 87684 -54459 4759 67717 -1344 6554 104062 162430 219232 165133
14616A65133q3938L9405N943j2972R2819p4307r5097j08274j2394R2487J03259
$$ 165133 81195 120600 126543 113571 206390 132083 36986 -71288 -83682 8805 112064
14605A12064N4359P7080n121q2640q6451m6217J43494o1329k9390p55M4933J0448
$$ 112064 166423 243503 238382 155742 69291 23074 166568 105239 75849 75094 120027 130475
14593A30475n9031m1124Q3199Q4764j1311j00361j0646p1666q310R3099J65744
$$ 130475 71444 30320 113519 198283 186972 86611 75965 4299 -4011 89088 254832
14582B54832n6566O1082M8689q7052r2752j16629n9512J14544R6141j0618q358
$$ 254832 198266 259348 308037 220985 128233 11604 -47908 66636 162777 152159 143801
14571A43801j06672P2099R1369k8996p4594q0406J45449l0295j01104j6807r2936
$$ 143801 37129 109228 200597 171601 97007 16601 162050 131755 30651 13844 -79092
14560g9092R4994O5547p7530J0025J04921m4632M979M4068J1286n4261j82574
$$ -79092 15902 81449 3919 13944 118865 74233 79212 123280 134566 80305 -102269
14549a02269P7045j5932j9438n0835J1850Q9581P3924j36389l581N9034J31429
$$ -102269 -25224 -41156 -60594 -111429 -99579 -9998 63926 -72463 -76044 -17010 114419
14538A14419p2516p3915L1988M0451J36874j890r4057O9120l3196N0588O4061
$$ 114419 41903 -32012 -24 40427 177301 175411 81354 150474 117278 167866 231927
14527B31927K8998n4029j46096J5698k5902o0564j87147J34827R9530j00264N420
$$ 231927 260925 206896 60800 76498 50596 -9968 -197115 -62288 37242 -63022 -57602
14516e7602M2768J4247k5702k8151O9682m2039q9860o5033J82773J96329l5560
$$ -57602 -14834 -587 -26289 -54440 15242 -26797 -116657 -181690 1083 197412 161852
14505A61852m9308j23654o4835M7123J7030K7109L9327o6545R1458J26005K2317
$$ 161852 112544 -11110 -75945 -28822 -11792 15317 54644 -11901 79557 205562 227879
14494B27879j88691P4549O2186p7854j85699K7353J73160M3942k7690P2474O2588
$$ 227879 39188 113737 175923 98069 -87630 -60277 112883 156825 129135 201609 264197
14483B64197j02525N7707k3506P3056L4452j28822j13447j0367J1189K4506J35528
$$ 264197 161672 219379 195873 268929 303381 174559 61112 50745 61934 86440 221968
14472B21968P4809o6777K1315p7310o3590J40647j0631q629m9638M6904k1657
$$ 221968 296777 230000 251315 174005 110415 251062 240431 231802 182164 229068 207411
14461B07411j55683j79595J7722K03190P6017k5610j4485J9433Q370l6816r3556
$$ 207411 51728 -127867 -110145 93045 169062 143452 128967 148400 156770 119954 26398
14450B6398L0679m8038o7159K3216R5895J36064K5998L846K9869p0578R2675J16931
$$ 26398 57077 9039 -58120 -34904 60991 197055 223053 226899 256768 186190 278865 395796
14438C95796p8734j00194M6640k5241o8347r0959M3358J86654K9041r3708k1975
$$ 395796 317062 216868 263508 238267 169920 78961 122319 308973 338014 244306 222331
14427B22331j22377r3086N6361J63309n142p489L5623p7437j35107M7672J18129
$$ 222331 99954 6868 63229 226538 221396 213907 249530 172093 36986 84658 202787
14416B02787K0583M6427J358J56093r7916j01392j5481L677M1623o9026m8489
$$ 202787 223370 269797 271155 427248 329332 227940 212459 216136 257759 188733 140244
14405A40244j76855j01944R508R9732J62354n1628O6910p5978k17663J29206Q8923
$$ 140244 -36611 -138555 -129047 -29315 133039 81411 148321 72343 -145320 -16114 72809
14394G2809J471p2174l5246L6525J13314J93005j0306j04816L1005L8410J53607
$$ 72809 74280 2106 -33140 3385 116699 309704 299398 194582 225587 263997 417604
14383D17604K8870j86296j04538l700O4047L4229P031j05694k9933K3609J85722
$$ 417604 446474 260178 155640 151940 215987 250216 257247 151553 121620 145229 330951
14372C30951N4702r2139q7253m7766l8680r758L9640R3870P119K5927K0563N0845
$$ 330951 385653 293514 206261 158495 119815 110057 149697 243567 250686 276613 297176 348021
14360C48021m812j88551p8829Q3416J86336J00811j7713j04536q868J0266K3817
$$ 348021 343209 154658 75829 159245 345581 446392 428679 324143 315275 325541 349358
14349C49358J9679r3781l4540O1375k1271k1863q9910R955M4149m4211j01017
$$ 349358 369037 275256 240716 302091 280820 258957 169047 179002 223151 178940 77923
14338G7923J869Q6963K4681q0777r291L9456P6754j21370N2777N6371M9220J94254
$$ 77923 79792 166755 191436 110659 101368 140824 217578 96208 148985 205356 254576 448830
14326D48830p0881k667O7902o5793j07257l5562R0513P4028n1348J8770J19223
$$ 448830 377949 375282 443184 377391 270134 234572 325085 399113 347765 366535 485758
14315D85758J40208j49166j45168j20031q2211Q3793K11913O0352k5413j58443
$$ 485758 625966 476800 331632 211601 129390 213183 425096 485448 460035 301592
14305C01592n2909m2253l8844Q5941L5148J21513l2692j10852K0398l6621L4952
$$ 301592 248683 206430 167586 253527 288675 410188 377496 266644 287042 250421 285373
14294B85373j24408O6174J56062K6734J037P2886n7455r0549N3161K8771L792
$$ 285373 160965 227139 383201 409935 410972 483858 426403 335854 389015 417786 421578
14283D21578J32158R6958q6431r5197J14500J32842n1784L1168o2835o3911k06123
$$ 421578 553736 650694 564263 469066 583566 716408 664624 695792 632957 569046 362923
14272C62923p7676K6420J5400j06493q0538j8329J9701Q7123L3868O8684L2753
$$ 362923 285247 311667 327067 220574 140036 121707 141408 228531 262399 331083 363836
14261C63836m7475J7211L1348P6294K2398o2776p3478o8820j3561K7358J05526
$$ 363836 316361 333572 364920 441214 463612 400836 327358 258538 244977 272335 377861
14250C77861r7686R9178o6011l2970j12405l8584j3886J07674o2035k22473Q60
$$ 377861 280175 379353 313342 280372 167967 129383 115497 223171 161136 -61337 -60477
14239f0477J41758K944M0155r220J3845Q3409l8139P8058m1845j7195J55372N9431
$$ -60477 81281 84225 124380 115160 129005 212414 174275 252333 210488 193293 348665 408096
14227D08096r858L1891m4450n5097L1414M132l7491Q3403q1743n687J93486J17676
$$ 408096 398238 430129 385679 330582 361996 366128 328637 412040 330297 324610 518096 635772
14215F35772r1598l2279j35327r7113J25175J29703J0888q5231j6443R6517R1520
$$ 635772 544174 511895 376568 279455 404630 534333 545221 459990 443547 540064 631584
14204F31584n4259l5461K5187j22526j76225n3282J04688K2181J22853o1900Q7721
$$ 631584 577325 541864 567051 444525 268300 215018 319706 341887 464740 402840 490561
14193D90561L4926q1275J21354J00634p5338n9115J4884N0m807J3900p3219J5901
$$ 490561 525487 444212 565566 666200 590862 531747 546631 546681 541874 555774 482555 498456
14181D98456Q135J26256P736j81896j0328Q3020l8534O3952P4208n7523m3202
$$ 498456 506591 632847 640583 458687 448359 531379 492845 556797 631005 573482 530280
14170E30280l9691J2122r9699o6944J6122q030L1913R1222N9813P9383m3327j48574
$$ 530280 490589 502711 403012 336068 352190 344160 376073 467295 527108 606491 563164 414590
14158D14590r7645r3758J5642J67419J9461j13759Q5098M5920j9054L5212k2691
$$ 414590 316945 223187 238829 406248 425709 311950 397048 442968 423914 459126 436435
14147D36435k6896M0217l6196L2131N2346k1677J4829q689N8937J02236P5638
$$ 436435 409539 449756 413560 445691 498037 476360 491189 482500 541437 643673 719311
14136G19311L1604K1331m5737k5113q7365J3671q4889O1057L5801M5165P0965
$$ 719311 750915 772246 726509 701396 614031 627702 542813 603870 639671 684836 755801
14125G55801m086r5663r3000J9232J0203M4958Q7424J31788j21146M2473J42499
$$ 755801 751715 656052 563052 582284 592487 637445 724869 856657 735511 777984 920483
14114I20483p8863j37104p3185m8021j1336p401J79601J33748N0184q21j9275
$$ 920483 841620 704516 631331 583310 571974 564573 744174 877922 928106 927285 908010
14103I08010j00294j0093n09P3781k7502l6610L1348J291r6668J9926J354l2465
$$ 908010 807716 797623 797114 870895 843393 806783 838131 839422 742754 762680 764034 731569
14091G31569j2424K8162l7528j039J32116R0196J013o6728Q3765J8860p4489l1966
$$ 731569 719145 747307 709779 708740 840856 931052 932065 865337 949102 967962 893473 861507
14079H61507O3584O0249P4103M9166j24193j0114n6144J3328K3498k9548J7623
$$ 861507 925091 985340 1059443 1108609 984416 974302 918158 931486 954984 925436 943059
14068I43059l4254o5151j4511J40447O7178k3152j77927k1412Q2747m6732J2713
$$ 943059 908805 843654 829143 969590 1036768 1013616 835689 814277 897024 850292 863005
14057H63005p8595n4689J78678j04076j00434l7826l1978p2455J0122j8712J83074
$$ 863005 784410 729721 908399 804323 703889 666063 634085 561630 571752 553040 736114
14046G36114J15999j33306j04086j8265R5544M8105L7375P1647p5443j19036J02099
$$ 736114 852113 718807 614721 596456 692000 740105 777480 849127 773684 654648 756747
14035G56747J88534r313j41073J45462J27149M7777P7101j81732o4942J8145p0628
$$ 756747 945281 935968 794895 940357 1067506 1115283 1192384 1010652 945710 963855 893227
14024H93227j62385J14083k006J47082Q8960O9304K3440j5939m0629j18771m3466
$$ 893227 730842 844925 842919 990001 1078961 1148265 1171705 1155766 1115137 996366 952900
14013I52900Q6586M9369J01304L6697k804o0178j44655p6446R2055J32425K0920
$$ 952900 1039486 1088855 1190159 1226856 1224052 1163874 1019219 942773 1034828 1167253 1188173
14002A188173n160m3537K1475n124L9900J051M0512J4117J826k6351j6145J3599
$$ 1188173 1183013 1139476 1160951 1155827 1195727 1196778 1237290 1251407 1253233 1226882 1210737 1224336
13990A224336p1732j5575l7984m9031n4390n8388r2921M4550J57952k5084L5441
$$ 1224336 1152604 1137029 1099045 1050014 995624 937236 844315 888865 1046817 1021733 1057174
13979A057174p2404n3962O2910L5285Q3544J39661k4784p104O7303L2842J90402
$$ 1057174 984770 930808 993718 1029003 1112547 1252208 1227424 1220320 1287623 1320465 1510867
13968A510867J73077J8013q3122l0778J2043p5874n37M8978r5360j2862P1498
$$ 1510867 1683944 1701957 1618835 1588057 1600100 1524226 1523689 1572667 1477307 1464445 1535943
13957A535943M2629r661q1700j11771m0299N3786l8184M8121Q3755J16855j49491
$$ 1535943 1578572 1568911 1487211 1375440 1335141 1388927 1350743 1398864 1482619 1599474 1449983
13946A449983n1016J37848K3794M7604P0212o5790J2358j7157m784n9392k13P0412
$$ 1449983 1398967 1536815 1560609 1608213 1678425 1612635 1624993 1607836 1603052 1543660 1543447 1613859
13934A613859q9102L8777L6953L9697O8000J28490J67357q7972r0155k2247j32628
$$ 1613859 1524757 1563534 1600487 1640184 1708184 1836674 2004031 1916059 1825904 1803657 1671029
13923A671029j6962L6170J46571R2898P5955L1809l1680l1747P0139j57687P6325
$$ 1671029 1654067 1690237 1836808 1929706 2005661 2037470 2005790 1974043 2044182 1886495 1962820
13912A962820K9358P0470K1343o7649j26084l4738j6764J46893L0286J65457J79646
$$ 1962820 1992178 2062648 2083991 2016342 1890258 1855520 1838756 1985649 2015935 2181392 2361038
13901B361038j47152j57104n1572J35883n0324O4867L0078J54400Q8430M8322
$$ 2361038 2213886 2056782 2005210 2141093 2090769 2155636 2185714 2340114 2428544 2476866
13891B476866N1401J95188K43674K29542L12646L60673J65938k24750m03432k89467
$$ 2476866 2528267 2723455 2967129 3196671 3509317 3869990 4035928 3811178 3407746 3118279
13881C118279o8177j95727j59189k3078Q0694m0452K2544R2112J0970r8879j16806
$$ 3118279 3050102 2854375 2695186 2672108 2752802 2712350 2734894 2827006 2837976 2739097 2622291
13870B622291K6827L0115n6425R5194K18903R6337o2089j30277q5346J23698M9765
$$ 2622291 2649118 2679233 2622808 2718002 2936905 3033242 2971153 2840876 2755530 2879228 2928993
13859B928993k1476j9650j4293K01729J97991p0306j77908n5821Q301P1250J20879
$$ 2928993 2907517 2887867 2873574 3075303 3273294 3202988 3025080 2969259 2977560 3048810 3169689
13848C169689Q9104O5037K9369N3529j552q1680j5113K7615N3020K96740N7664
$$ 3169689 3258793 3323830 3353199 3406728 3405176 3323496 3308383 3335998 3389018 3685758 3743422
13837C743422j39664R125N7817m1823J32543R1729o6129l6867N6726J2785L8105
$$ 3743422 3603758 3612883 3670700 3628877 3761420 3853149 3787020 3750153 3806879 3819664 3857769
13826C857769p9923J8315P4455l391K45685k937O8275m3374k1683Q0643J00526
$$ 3857769 3777846 3796161 3870616 3867225 4112910 4109973 4178248 4134874 4113191 4193834 4294360
13815D294360P4700o4788j6963K6365J39812J13399Q8949J077L2047N5211Q2009
$$ 4294360 4369060 4304272 4287309 4313674 4453486 4566885 4655834 4656911 4688958 4744169 4826178
13804D826178j29419k1601J36698O7533L1362L3355P4737j6730l245p329L7725
$$ 4826178 4696759 4675158 4811856 4879389 4910751 4944106 5018843 5002113 4998868 4991539 5029264
13793E029264J13844N6790P3374J07315Q6516J48439J16504q9620J01087J92265
$$ 5029264 5143108 5199898 5273272 5380587 5467103 5615542 5732046 5642426 5743513 5935778
13783E935778P8599L0554O2658K24804L03961M3304j92327k01796K6526J40661
$$ 5935778 6014377 6044931 6107589 6332393 6636354 6679658 6487331 6285535 6312061 6452722
13773F452722k3657Q0424R9131J03804J89360J40304L48J2282J17087J53046J71038
$$ 6452722 6429065 6509489 6608620 6712424 6901784 7042088 7042436 7054718 7171805 7324851 7495889
13762G495889J66470J24322j7862J93890J84285M4092q9818J67166J82278K41884
$$ 7495889 7662359 7786681 7768819 7962709 8146994 8191086 8101268 8268434 8450712 8692596
13752H692596P3474R2511J27778K03047R36Q5540J27464K38512M3018L3207J41913
$$ 8692596 8766070 8858581 8986359 9189406 9190342 9275882 9403346 9641858 9684876 9718083 9859996
13741I859996K29658K45293J45661O7524J96320K70125K17893J48815J68649K05269
$$ 9859996 10089654 10334947 10480608 10548132 10744452 11014577 11232470 11381285 11549934 11755203
13731A1755203K35434R7523j428J91245J96756J23973J45870J78508K49594L90528
$$ 11755203 11990637 12088160 12086732 12277977 12474733 12598706 12744576 12923084 13172678 13563206
13721A3563206K33112K21768L33657R2298J66369K45754J75620K60479K43879
$$ 13563206 13796318 14018086 14351743 14444041 14610410 14856164 15031784 15292263 15536142
13712A5536142K79106K09250K95385L71204K70232K14886K47025J75401K92946
$$ 15536142 15815248 16024498 16319883 16691087 16961319 17176205 17423230 17598631 17891577
13703A7891577L50038K69206M22475M26521L86287L81014K66071L30201K83652
$$ 17891577 18241615 18510821 18933296 19359817 19746104 20127118 20393189 20723390 21007042
13694B1007042L35629M01243L49950L76976N97362N60237N67082L99086L66233
$$ 21007042 21342671 21743914 22093864 22470840 23068202 23628439 24195521 24594607 24960840
13685B4960840L91385M02387L09724M08469O44955O49979O34557N54646M72727
$$ 24960840 25352225 25754612 26064336 26472805 27117760 27767739 28402296 28956942 29429669
13676B9429669O55371O60078O00122N48168N03441N24612O12350N30456N46843
$$ 29429669 30085040 30745118 31345240 31893408 32396849 32921461 33533811 34064267 34611110
13667C4611110O35462O26910P79654P34521O24463N75987O26394P31409P31443
$$ 34611110 35246572 35873482 36653136 37387657 38012120 38588107 39214501 39945910 40677353
13658D0677353P73108O90487O30022Q57516P30517O69030O93577O91347O80885
$$ 40677353 41450461 42140948 42770970 43628486 44359003 45028033 45721610 46412957 47093842
13649D7093842O52813N31766O83371P04023P65766P12949O03754O05294N85790
$$ 47093842 47746655 48278421 48961792 49665815 50431581 51144530 51748284 52353578 52939368
13640E2939368N73911N54107N02497M46900O38291N24296L60750M02971M69260
$$ 52939368 53513279 54067386 54569883 55016783 55655074 56179370 56540120 56943091 57412351
13631E7412351K46855L23351K66641K95194K99231J18719Q0460J22174J23856
$$ 57412351 57659206 57982557 58249198 58544392 58843623 58962342 59042802 59164976 59288832
13622E9288832O5735r0042k21468o8090m8374j72901k53096j94073j98289k75593
$$ 59288832 59354567 59264525 59043057 58974967 58926593 58753692 58500596 58306523 58108234 57832641
13612E7832641k54015k05812l97666n00533n20344m96520n90960n57106n63899
$$ 57832641 57578626 57372814 56975148 56474615 55954271 55457751 54866791 54309685 53745786
13603E3745786m34822n47794o53670o29938p98019p83507o23832n41396o80403
$$ 53745786 53310964 52763170 52109500 51479562 50681543 49898036 49274204 48732808 48052405
13594D8052405n67042o97251p35438o59495o99184o49200n68976p79971o23391
$$ 48052405 47485363 46788112 46052674 45393179 44693995 44044795 43475819 42695848 42072457
13585D2072457n12574n94895q12656o81522o61591n54793n96828p26813p55249
$$ 42072457 41559883 40964988 40152332 39470810 38809219 38254426 37657598 36930785 36175536
13576C6175536n25767o39229n18111m07095m84833o55156o52787n40599n77821
$$ 36175536 35649769 35010540 34492429 34085334 33600501 32945345 32292558 31751959 31174138
13567C1174138m02092n29284n55673m64470m46622m02533m74640m89655m88588
$$ 31174138 30772046 30242762 29687089 29222619 28775997 28373464 27898824 27409169 26920581
13558B6920581n43587l76727n02790n03385m41967m53712l18003m36221m59530
$$ 26920581 26376994 26000267 25497477 24994092 24552125 24098413 23780410 23344189 22884659
13549B2884659l40095m05396k89878m67781l31788l57248k82421k41678k21771
$$ 22884659 22544564 22139168 21849290 21381509 21049721 20692473 20410052 20168374 19946603
13540A9946603k81676l78654m02798m81349k79711k05936j41241k73662k13607
$$ 19946603 19664927 19286273 18883475 18402126 18122415 17916479 17775238 17501576 17287969
13531A7287969j65432l54977m53015k91860o8637k68116k64704j77983j27854
$$ 17287969 17122537 16767560 16314545 16022685 15954048 15685932 15421228 15243245 15115391
13522A5115391k36093j31786j99560k10893j92247l12895l88137r7787k15094
$$ 15115391 14879298 14747512 14547952 14337059 14144812 13831917 13443780 13345993 13130899
13513A3130899j75092j97680l05374k00395j75441j68359j26108k20095j71440
$$ 13130899 12955807 12758127 12452753 12252358 12076917 11908558 11782450 11562355 11390915
13504A1390915r2143l6038j54072k63651j30323J19580n2849k49259k97986l00539
$$ 11390915 11298772 11262734 11108662 10845011 10714688 10834268 10781419 10532160 10234174 9933635
13494I933635j54548j96677j60404n4342r8310j11761J09652k6946p5233k37187
$$ 9933635 9779087 9582410 9422006 9367664 9269354 9157593 9267245 9240299 9165066 8927879
13484H927879j28249j9289j39202k22686Q7895N6353j9404j25921k81690j95782
$$ 8927879 8799630 8780341 8641139 8418453 8506348 8562701 8543297 8417376 8135686 7939904
13474G939904r0023j39087j14772Q6188j93107j59972j17755o6044q5603n6851
$$ 7939904 7849881 7710794 7596022 7682210 7489103 7329131 7211376 7145332 7059729 7002878
13464G002878q9370k3162j48965q5046J628j8167M1906j55879j71421j50943j2211
$$ 7002878 6913508 6890346 6741381 6656335 6657963 6639796 6681702 6525823 6354402 6203459 6191248
13453F191248J48695o7732k02066j03161K7240j13622k49543j03752r8848J07572
$$ 6191248 6339943 6272211 6070145 5966984 5994224 5880602 5631059 5527307 5428459 5536031
13443E536031P9616j23970j38839q4423o1016o3490K8795p0782k6022m2574o0333
$$ 5536031 5615647 5491677 5352838 5268415 5207399 5143909 5172704 5101922 5075900 5033326 4972993
13432D972993j74507l3261J25492l0240r1934j34718j94453K4870r3643o7870
$$ 4972993 4798486 4765225 4890717 4860477 4768543 4633825 4439372 4464242 4370599 4302729
13422D302729J8841j5245q340j5914r8146r6617N6362m4243K2170P1179o9732
$$ 4302729 4321570 4306325 4297985 4282071 4183925 4087308 4143670 4099427 4121597 4192776 4123044
13411D123044l3489q2699o1662o4921j92019r4965K21P3242m597J97788j1187
$$ 4123044 4089555 4006856 3945194 3880273 3688254 3593289 3593510 3666752 3662155 3859943 3848756
13400C848756k21759r5550Q9597l1452o3349p3424J04964J16278p1992j89135
$$ 3848756 3626997 3531447 3621044 3589592 3526243 3452819 3557783 3674061 3602069 3412934
13390C412934j52249o5189P1931j02930k7589K1767k7810J6066K3585q2908n8115
$$ 3412934 3260685 3195496 3267427 3164497 3136908 3158675 3130865 3146931 3170516 3087608 3029493
13379C029493p3079j05816o0401M4811J12687M7184J44434P1487p4864q3794j29488
$$ 3029493 2956414 2850598 2790197 2835008 2947695 2994879 3139313 3210800 3135936 3052142 2922654
13368B922654K0934k5303j28484K09070K51299K28039K85296R8448K02196N8231
$$ 2922654 2943588 2918285 2789801 2998871 3250170 3478209 3763505 3861953 4064149 4122380
13358D122380l37657l99868k01613k41066m9293r1847n4511M9922o4218o2152
$$ 4122380 3784723 3384855 3183242 2942176 2892883 2801036 2746525 2796447 2732229 2670077
13348B670077m1496n0786m5151j46144Q4932O5338L111p2093p677N4856L5162
$$ 2670077 2628581 2577795 2532644 2386500 2471432 2536770 2539881 2467788 2460111 2514967 2550129
13337B550129m2129K1629L4116k48327j63128k8615o607m4420r6020p1207j284
$$ 2550129 2508000 2529629 2563745 2315418 2152290 2123675 2117068 2072648 1976628 1905421 1904137
13326A904137k2574P8086m8973j12747r8168k9458J34712Q8271k1036L4531J6743
$$ 1904137 1881563 1959649 1910676 1797929 1699761 1670303 1805015 1893286 1872250 1906781 1923524
13315A923524r2787M3757O7257o6395O8511J0209j6947j12538k02364q0903J22892
$$ 1923524 1830737 1874494 1941751 1875356 1943867 1954076 1937129 1824591 1622227 1541324 1664216
13304A664216O1201j1946p6272n8895J09624J86904k4928j24448j07168j29941
$$ 1664216 1725417 1713471 1637199 1578304 1687928 1874832 1849904 1725456 1618288 1488347
13294A488347J4651k3418P0923q9080j00515n3059o0506J09571J5729o2124k5556
$$ 1488347 1502998 1479580 1550503 1461423 1360908 1307849 1247343 1356914 1372643 1310519 1284963
13283A284963N4216L9729n0838P8639L6999J39212m7754j41338o7654k2924J0695
$$ 1284963 1339179 1378908 1328070 1406709 1443708 1582920 1535166 1393828 1326174 1303250 1313945
13272A313945n3953m931m690J1285k2134J21521N9791l9846r3258O1076J30731
$$ 1313945 1259992 1255061 1250371 1261656 1239522 1361043 1420834 1380988 1287730 1348806 1479537
13261A479537l0823m6943l2989P2597r3192L5234L6300o274j19643p6562o0495
$$ 1479537 1448714 1401771 1368782 1441379 1348187 1383421 1419721 1413447 1293804 1217242 1156747
13250A156747k1013J58733J10102K1767q9318j75730m5283r8302j08319l6683
$$ 1156747 1135734 1294467 1404569 1426336 1337018 1161288 1116005 1017703 909384 872701
13240H72701J4324J40420m556o0990r2264J2904p2947o1957J25014k0869o203
$$ 872701 887025 1027445 1022889 961899 869635 882539 809592 747635 872649 851780 845577
13229H45577J3348K39051J27690j10703K7367j15085p3256J25966l4533r7928
$$ 845577 858925 1097976 1225666 1114963 1142330 1027245 953989 1079955 1045422 947494
13219I47494j08593L9252J6886P3886J25445J7865j56467l9151P6723R7160j41385
$$ 947494 838901 878153 895039 968925 1094370 1112235 955768 916617 993340 1090500 949115
$$ [...]
##END NTUPLES=NMR SPECTRUM
##END=
