##TITLE=Analysis number 323166
Compound Code mo 00667
Project Code adrs
Chemist Name endeavour
##JCAMPDX= 6.0         $$ Bruker NMR JCAMP-DX V2.0
##DATA TYPE= NMR SPECTRUM
##DATA CLASS= NTUPLES
##ORIGIN= Bruker BioSpin GmbH
##OWNER= nmr
$$ XWIN-NMR		Version 3.5
$$ Tue Oct 17 19:27:41 2006 GMT Daylight Time (UT+1h)  MAYBRIDGE\nmr@NMR_250MHZ
##.OBSERVE FREQUENCY= 250.131544655141
##.OBSERVE NUCLEUS= ^1H
##.ACQUISITION MODE= SIMULTANEOUS (DQD)
##.ACQUISITION SCHEME= undefined
##.AVERAGES= 16
##.DIGITISER RES= 18
##SPECTROMETER/DATA SYSTEM= dpx250
##.PULSE SEQUENCE= zg30
##.SOLVENT NAME= CDCl3
##.SHIFT REFERENCE= (INTERNAL, CDCl3, 0, 16.522)
##AUDIT TRAIL= $$ (NUMBER, WHEN, WHO, WHERE, WHAT)
$$ ##TITLE= Audit trail, XWIN-NMR		Version 3.5
$$ ##JCAMPDX= 5.01
$$ ##ORIGIN= Bruker BioSpin GmbH
$$ ##OWNER= nmr
$$ C:\u/data/dgb/nmr/ADRS/790/pdata/1/auditp.txt
$$ ##AUDIT TRAIL=  $$ (NUMBER, WHEN, WHO, WHERE, WHAT)
(   1,<2006-10-17 19:27:15.21 +100>,<MAYBRIDGE\nmr>,<NMR_250MHZ>,
      <created by zg, POWCHK disabled, PULCHK disabled
       configuration hash MD5:
       49 4B E0 1D 92 C2 6B 37 9F E6 65 BC 52 41 86 1D
       data hash MD5: 64K
       7E 21 C6 B0 7A B3 C9 D2 E3 A3 EB C3 DB 92 E8 80>)
(   2,<2006-10-17 19:27:30.93 +100>,<MAYBRIDGE\nmr>,<NMR_250MHZ>,
      <Start of raw data processing
       ef LB = 0.3 FT_mod = 6 PKNL = 1 SI = 32K 
       data hash MD5: 32K
       44 9F 0D E5 AC 6D C3 E2 14 59 64 00 36 E2 BB 9E>)
(   3,<2006-10-17 19:27:32.93 +100>,<MAYBRIDGE\nmr>,<NMR_250MHZ>,
      <apk 
       data hash MD5: 32K
       19 60 26 95 B8 9F FB E9 00 E5 3B 96 01 76 96 21>)
(   4,<2006-10-17 19:27:33.68 +100>,<MAYBRIDGE\nmr>,<NMR_250MHZ>,
      <abs ABSG = 5 
       data hash MD5: 32K
       C3 64 BB 2D 44 FB 58 C4 B6 5A 22 62 57 7A 2A DC>)
$$ ##END=
$$ 
$$ hash MD5
$$ A5 63 8D 78 45 F9 C9 F6 8D 70 F0 CB 9E 35 8F 8B
##$RELAX= 
##$RELAX= 
##$RELAX= 
##$RELAX= 
##$RELAX= 
##$RELAX= 
##$RELAX= 
$$ Bruker specific parameters
$$ --------------------------
##$DU= <C:\u>
##$EXPNO= 790
##$NAME= <ADRS>
##$PROCNO= 1
##$TYPE= <nmr>
##$USER= <dgb>
##$AMP= (0..31)
100 100 100 100 100 100 100 100 100 100 100 100 100 100 100 100 100 100 
100 100 100 100 100 100 100 100 100 100 100 100 100 100 
##$AQSEQ= 0
##$AQ_mod= 3
##$AUNM= <au_zg>
##$AUTOPOS= <27 >
##$BF1= 250.13
##$BF2= 250.13
##$BF3= 250.13
##$BF4= 250.13
##$BF5= 500.13
##$BF6= 500.13
##$BF7= 500.13
##$BF8= 500.13
##$BYTORDA= 1
##$CFDGTYP= 0
##$CFRGTYP= 5
##$CHEMSTR= <none>
##$CNST= (0..31)
1 1 145 1 1 1 1 1 1 1 1 1 1 1 1 1 1 1 1 1 1 1 1 1 1 1 1 1 1 1 1 1 
##$CPDPRG= <>
##$CPDPRG1= <>
##$CPDPRG2= <>
##$CPDPRG3= <>
##$CPDPRG4= <mlev>
##$CPDPRG5= <mlev>
##$CPDPRG6= <mlev>
##$CPDPRG7= <mlev>
##$CPDPRG8= <mlev>
##$CPDPRGB= <>
##$CPDPRGT= <>
##$D= (0..31)
0 1 0 0 0 0 0 0 0 0.06 0 0 0 0 0 0 0.0002 0 0 0 0 0 0 0 0 0 0 0 0 0 0 
0 
##$DATE= 1161109633
##$DBL= (0..7)
120 120 120 120 120 120 120 120 
##$DBP= (0..7)
150 150 150 150 150 150 150 150 
##$DBP07= 0
##$DBPNAM0= <>
##$DBPNAM1= <>
##$DBPNAM2= <>
$$ [...]
##$SUBNAM7= <"">
##$SUBNAM8= <"">
##$SUBNAM9= <"">
##$SW= 20.6930455092707
##$SWIBOX= (0..15)
0 0 3 0 0 0 0 0 0 0 0 0 0 0 0 0 
##$SW_h= 5175.983436853
##$TD= 65536
##$TD0= 1
##$TE= 683.16
##$TE2= 300
##$TE3= 300
##$TEG= 300
##$TL= (0..7)
0 120 120 120 120 120 120 120 
##$TP= (0..7)
150 150 150 150 150 150 150 150 
##$TP07= 0
##$TPNAME0= <>
##$TPNAME1= <>
##$TPNAME2= <>
##$TPNAME3= <>
##$TPNAME4= <>
##$TPNAME5= <>
##$TPNAME6= <>
##$TPNAME7= <>
##$TPOAL= (0..7)
0.5 0.5 0.5 0.5 0.5 0.5 0.5 0.5 
##$TPOFFS= (0..7)
0 0 0 0 0 0 0 0 
##$TUNHIN= 0
##$TUNHOUT= 0
##$TUNXOUT= 0
##$USERA1= <user>
##$USERA2= <user>
##$USERA3= <user>
##$USERA4= <user>
##$USERA5= <user>
##$V9= 5
##$VALIST= <valist>
##$VCLIST= <CCCCCCCCCCCCCCC>
##$VD= 0
##$VDLIST= <DDDDDDDDDDDDDDD>
##$VPLIST= <PPPPPPPPPPPPPPP>
##$VTLIST= <TTTTTTTTTTTTTTT>
##$WBST= 1024
##$WBSW= 4
##$XGAIN= (0..3)
0 0 0 0 
##$XL= 0
##$YL= 0
##$YMAX_a= 659569
##$YMIN_a= -569134
##$ZGOPTNS= <>
##$ZL1= 120
##$ZL2= 120
##$ZL3= 120
##$ZL4= 120
##$ABSF1= 16.522
##$ABSF2= -4.171173
##$ABSG= 5
##$ABSL= 3
##$ALPHA= 0
##$AQORDER= 0
##$ASSFAC= 0
##$ASSFACI= 0
##$ASSFACX= 0
##$ASSWID= 0
##$AUNMP= <proc_1d>
##$AZFE= 0.1
##$AZFW= 0.1
##$BCFW= 0
##$BC_mod= 0
##$BYTORDP= 0
##$COROFFS= 0
##$CY= 12.5
##$DATMOD= 1
##$DC= 0
##$DFILT= <>
##$DTYPP= 0
##$F1P= 14.0000005364418
##$F2P= -0.99999901652339
##$FCOR= 0.5
##$FTSIZE= 32768
##$FT_mod= 6
##$GAMMA= 0
##$GB= 0
##$INTBC= 1
##$INTSCL= 1
##$ISEN= 128
##$LB= 0.3
##$LEV0= 0
##$LPBIN= 0
##$MAXI= 10000
##$MC2= 0
##$MEAN= 0
##$ME_mod= 0
##$MI= 0
##$NCOEF= 0
##$NC_proc= -2
##$NLEV= 6
##$NOISF1= 0
##$NOISF2= 0
##$NSP= 0
##$NTH_PI= 0
##$NZP= 0
##$OFFSET= 16.522
##$PC= 1
##$PHC0= -54.32782
##$PHC1= 7.138256
##$PH_mod= 1
##$PKNL= yes
##$PPARMOD= 0
##$PSCAL= 4
##$PSIGN= 0
##$REVERSE= no
##$SF= 250.13
##$SI= 32768
##$SIGF1= 0
##$SIGF2= 0
##$SINO= 400
##$SIOLD= 32768
##$SREGLST= <1H.CDCl3>
##$SSB= 0
##$STSI= 32768
##$STSR= 0
##$SW_p= 5175.98343685301
##$SYMM= 0
##$S_DEV= 0
##$TDeff= 65536
##$TDoff= 0
##$TI= <Analysis number 999999
Compound Code 99
Book Reference 9
Project Code 9>
##$TILT= no
##$TM1= 0
##$TM2= 0
##$TOPLEV= 0
##$USERP1= <user>
##$USERP2= <user>
##$USERP3= <user>
##$USERP4= <user>
##$USERP5= <user>
##$WDW= 1
##$XDIM= 32768
##$YMAX_p= 340504900
##$YMIN_p= -120308
$$ End of Bruker specific parameters
$$ ---------------------------------
##NTUPLES= NMR SPECTRUM
##VAR_NAME=  FREQUENCY,     SPECTRUM/REAL,   SPECTRUM/IMAG
##SYMBOL=    X,             R,               I
##VAR_TYPE=  INDEPENDENT,   DEPENDENT,       DEPENDENT
##VAR_FORM=  AFFN,          ASDF,            ASDF
##VAR_DIM=   32768,         32768,           32768
##UNITS=     HZ,            ARBITRARY UNITS, ARBITRARY UNITS
##FACTOR=    0.157963299565203, 1,           1
##FIRST=     4132.6476996994, 0,             0
##LAST=      -1043.33573715361, 0,           0
##MIN=       -1043.33573715361, -120308,     0
##MAX=       4132.6476996994, 340504900,     0
$$ Real data points
##PAGE= N=1
##DATA TABLE= (X++(R..R)), XYDATA
$$ [...]
$$ plain form
19931 106175 107651 108298 113619 113690 112375 111294 112321 112054 113790 125593 126075 129341 141537 148939 149997
19916 149997 151943 154294 155124 159769 166820 170398 176419 179712 181149 188751 202317 209569 204484 208296
19902 208296 209181 215566 218572 221214 218916 214602 215576 217144 218528 226911 228575 224495 217195 214201 211704
19887 211704 208859 208400 206978 207064 205789 206526 209564 214127 220409 230122 229371 226031 224267 227058 229997
19872 229997 227937 223583 227471 235443 249414 264185 269451 274313 282664 290231 301494 318381 328555
19859 328555 344835 366654 391653 416308 442354 470756 501448 537917 577709 624244 693952
19848 693952 783751 898022 1036136 1189830 1372284 1586330 1857220 2168038 2468536 2722463
19838 2722463 2961330 3263782 3637875 3995443 4248513 4472262 4788198 5210880 5687316
$$ packed form
19931A06175J476O47N321P1j315j081J027k67J736J1803M82L266J2196P402J058
19916A49997J946K351Q30M645P051L578O021L293J437P602J3566P252n085L812
19902B08296Q85O385L006K642k298m314R74J568J384Q383J664m080p300k994k497
19887B11704k845m59j422Q6j275P37L038M563O282R713p51l340j764K791K939
19872B29997k060m354L888P972J3971J4771N266M862Q351P567J1263J6887J0174
19859C28555J6280K1819K4999K4655K6046K8402L0692L6469L9792M6535O9708
19848F93952Q9799J14271J38114J53694J82454K14046K70890L10818L00498K53927
19838B722463K38867L02452L74093L57568K53070K23749L15936M22682M76436
$$ plain form
19829 5687316 6087120 6386823 6564907 6798921 7168655 7490815 7531992 7279902 7070018 7024804
19819 7024804 7027621 6873551 6557457 6235176 5955735 5793961 5682296 5471647 5083745 4627034
19809 4627034 4293480 4030657 3710557 3295397 2896693 2601797 2397324 2244439 2164491 2182519
19799 2182519 2286926 2472811 2719076 3009864 3317159 3599315 3819394 4001961 4180936
19790 4180936 4307435 4397994 4510543 4637088 4688182 4674926 4646068 4555365 4339841 4072905
19780 4072905 3834745 3608009 3367026 3167447 3025629 2885941 2717886 2550177 2375629
19771 2375629 2158560 1921940 1712555 1539071 1388070 1260217 1164845 1096217 1051163 1020577
19761 1020577 993859 977976 973762 971800 973201 984223 1016133 1063158 1123407 1217005 1351976 1546550
$$ packed form
19829E687316L99804K99703J78084K34014L69734L22160M1177k52090k09884m5214
19819G024804K817j54070l16094l22281k79441j61774j11665k10649l87902m56711
19809D627034l33554k62823l20100m15160l98704k94896k04473j52885p9948J8028
19799B182519J04407J85885K46265K90788L07295K82156K20079J82567J78975
19790D180936J26499R0559J12549J26545N1094j3256k8858r0703k15524k66936
19780D072905k38160k26736k40983j99579j41818j39688j68055j67709j74548
19771B375629k17069k36620k09385j73484j51001j27853r5372o8628m5054l0586
19761A020577k6718j5883m214j962J401J1022L1910M7025O0249R3598J34971J94574
$$ plain form
19749 1546550 1799839 2100637 2431713 2787374 3138643 3444397 3685322 3894506 4090510
19740 4090510 4225459 4350756 4518447 4676833 4760306 4814984 4855226 4799368 4615487 4402698
19730 4402698 4219447 4016529 3799573 3628265 3498914 3340294 3127202 2917625 2695773
19721 2695773 2410007 2107063 1854028 1633045 1440025 1294228 1194278 1137886 1097825 1068677
19711 1068677 1044607 1026430 1019684 1008606 1002212 994047 998993 1005067 1010862 1018452 1029605 1030788 1040013
19698 1040013 1048653 1062143 1082840 1100060 1117388 1146160 1170701 1198555 1232034 1274553 1319140
19687 1319140 1366922 1427610 1499273 1572266 1656071 1752410 1863024 1977665 2116168 2274543
19677 2274543 2452497 2638303 2843538 3085010 3389121 3772610 4270859 4936807 5816378
$$ packed form
19749A546550K53289L00798L31076L55661L51269L05754K40925K09184J96004
19740D090510J34949J25297J67691J58386Q3473N4678M0242n5858j83881k12789
19730D402698j83251k02918k16956j71308j29351j58620k13092k09577k21852
19721B695773k85766l02944k53035k20983j93020j45797r9950n6392m0061k9148
19711A068677k4070j8177o746j1078o394q165M946O074N795P590J1153J183R225
19698A040013Q640J3490K0697J7220J7328K8772K4541K7854L3479M2519M4587
19687A319140M7782O0688P1663P2993Q3805R6339J10614J14641J38503J58375
19677B274543J77954J85806K05235K41472L04111L83489M98249O65948Q79571
$$ plain form
19668 5816378 6911337 8181562 9602840 11265981 13341647 15644005 17794453 19572235
19660 19572235 21321166 23609772 26205835 28373813 29829732 31350343 33533869 36391369
19652 36391369 39311261 41652988 43307481 44416500 46088697 48324134 49664879 48896220
19644 48896220 46972359 45772279 45342544 44556725 42577276 40232433 38110950 36406790
19636 36406790 35290904 34138721 32202523 29367419 26682440 24686903 22752043 20123058
19628 20123058 17123459 14600592 12649236 10984061 9440134 8105795 7093640 6340844
19620 6340844 5761354 5302798 4948248 4650293 4398601 4181404 3982585 3814599 3669081
19611 3669081 3562134 3469837 3384192 3330124 3297630 3293423 3312822 3366599 3429669 3497710 3561764
$$ packed form
19668E816378J094959J270225J421278J663141K075666K302358K150448J777782
19660A9572235J748931K288606K596063K167978J455919J520611K183526K857500
19652C6391369K919892K341727J654493J109019J672197K235437J340745p68659
19644D8896220j923861j200080m29735p85819j979449k344843k121483j704160
19636C6406790j115886j152183j936198k835104k684979j995537j934860k628985
19628B0123058k999599k522867j951356j665175j543927j334339j012155p52796
19620F340844n79490m58556l54550k97955k51692k17197j98819j67986j45518
19611C669081j06947r2297q5645n4068l2494m207J9399N3777O3070O8041O4054
$$ plain form
19600 3561764 3632702 3726277 3824396 3903812 3965451 4048752 4170267 4322038 4488581 4659811
19590 4659811 4835611 5033450 5299990 5631859 6026154 6527234 7279776 8387798 9828148
19581 9828148 11517419 13422563 15470334 17514575 19350308 20756668 22011828 23246910
19573 23246910 24156886 24902280 25918997 27006060 27624118 27853823 28054905 27841840 26657124
19564 26657124 25191780 24006004 22735221 21277523 20137515 19330046 18379958 17127420
19556 17127420 15890579 14624715 12969630 11174750 9652812 8352957 7213325 6321748
19548 6321748 5697014 5278885 4990734 4790537 4664095 4594948 4573325 4596196 4662932 4785028
19538 4785028 4973424 5262553 5696509 6357663 7357750 8715583 10395311 12380130 14592225
$$ packed form
19600C561764P0938R3575R8119P9416O1639Q3301J21515J51771J66543J71230
19590D659811J75800J97839K66540L31869L94295N01080P52542J108022J440350
19581I828148J689271J905144K047771K044241J835733J406360J255160J235082
19573B3246910R09976P45394J016717J087063O18058K29705K01082k13065j184716
19564B6657124j465344j185776j270783j457698j140008q07469r50088j252538
19556A7127420j236841j265864j655085j794880j521938j299855j139632q91577
19548F321748o24734m18129k88151k00197j26442o9147k1623K2871O6736J22096
19538D785028J88396K89129M33956O61154J000087J357833J679728J984819K212095
$$ plain form
19529 14592225 16896383 19114422 20937046 22387247 23848150 25193901 26181114 27273650
19521 27273650 28676795 29925058 30645288 31159965 31517405 31025250 29677031 28385750 27236746
19512 27236746 25774392 24322814 23273632 22328231 21004816 19444900 17903234 16064189
19504 16064189 13807616 11670900 9858318 8257647 6912726 5894286 5162523 4631079
19496 4631079 4207733 3845090 3544469 3292168 3069271 2869360 2700169 2553284 2422672
19487 2422672 2311124 2205273 2116468 2031803 1948864 1872685 1795812 1727193 1668892 1615277 1582416
19476 1582416 1566930 1555869 1560500 1579890 1610660 1651113 1691061 1721544 1740970 1761862 1787190
19465 1787190 1801311 1811422 1832802 1854468 1865322 1870017 1882031 1866909 1816138 1767037 1718118
$$ packed form
19529A4592225K304158K218039J822624J450201J460903J345751R87213J092536
19521B7273650J403145J248263P20230N14677L57440m92155j348219j291281j149004
19512B7236746j462354j451578j049182r45401j323415j559916j541666j839045
19504A6064189k256573k136716j812582j600671j344921j018440p31763n31444
19496D631079m23346l62643l00621k52301k22897j99911j69191j46885j30612
19487B422672j11548j05851q8805q4665q2939p6179p6873o8619n8301n3615l2861
19476A582416j5486j1061M631J9390L0770M0453L9948L0483J9426K0892K5328
19465A787190J4121J0111K1380K1666J0854M695J2014j5122n0771m9101m8919
$$ plain form
19454 1718118 1648677 1580907 1538955 1501674 1444168 1363265 1293531 1216724 1127035 1038810 960825
19443 960825 887990 819860 764618 719569 677657 650473 620714 588808 564666 537942 514953
19432 514953 505148 492378 487430 479915 462094 439956 426200 416408 407939 402570 393499 387386 382101
19419 382101 382405 378661 373330 367894 358047 359328 359153 357001 359802 366572 370442 376660 386719 401178
19405 401178 401090 405042 410405 418924 428501 432901 431660 420454 408324 399306 389537 378244 351703 331392
19391 331392 311778 292425 279207 259109 245066 239865 232703 222772 207509 192068 177029 175337
19379 175337 176682 178278 171314 165796 166700 164070 158113 152867 153016 153890 153026 148429 145718 143490 143905
19364 143905 141659 139559 135385 138064 137823 136943 131806 131132 134278 133766 124333 121596 123510 127929 133438
$$ packed form
19454A718118o9441o7770m1952l7281n7506q0903o9734p6807q9689q8225p7985
19443I60825p2835o8130n5242m5049m1912k7184k9759l1906k4142k6724k2989
19432E14953r805j2770m948p515j7821k2138j3756r792q469n369r071o113n285
19419C82101L04l744n331n436r847J281j75k152K801O770L870O218J0059J4459
19405D01178q8L952N363Q519R577M400j241j1206j2130r018r769j1293k6541k0311
19391C31392j9614j9353j3218k0098j4043n201p162r931j5263j5441j5039j692
19379A75337J345J596o964n518R04k630n957n246J49Q74q64m597k711k228M15
19364A43905k246k100m174K679k41q80n137o74L146n12r433k737J914M419N509
$$ plain form
19349 133438 137532 134091 129821 131585 132237 130301 126263 126236 129395 125865 123724 130922 133770 133084 136461
19334 136461 142347 138679 131074 127577 115418 110140 113043 121856 126489 128575 123993 126013 128622 126236
19320 126236 124179 123631 118871 112631 106269 108090 115807 121277 126939 124054 120958 121806 123820 127395 135847
19305 135847 148093 162024 170551 189009 205416 215499 225913 235290 239230 244051 245629 239308 234036
19292 234036 224505 220433 212289 207332 198496 191124 185139 181586 175545 169840 164665 166038 161122 162680
19278 162680 163174 162146 165283 176746 181207 180574 185170 178516 173761 171646 169949 163699 163811 160460 161097
19263 161097 160722 159652 162657 166495 161104 162403 184820 204735 214302 213716 231328 257114 281748
19250 281748 292509 303305 309551 315302 315564 314530 304813 288998 277767 257706 237161 219813 206617
$$ packed form
19349A33438M094l441m270J764O52j936m038k7L159l530k141P198K848o86L377
19334A36461N886l668p605l497j2159n278K903Q813M633K086m582K020K609k386
19320A26236k057n48m760o240o362J821P717N470N662k885l096Q48K014L575Q452
19305A35847J2246J3931Q527J8458J6407J0083J0414R377L940M821J578o321n272
19292B34036r531m072q144m957q836p372n985l553o041n705n175J373m916J558
19278A62680M94j028L137J1463M461o33M596o654m755k115j697o250J12l351O37
19263A61097l75j070L005L838n391J299K2417J9915R567n86J7612K5786K4634
19250B81748J0761J0796O246N751K62j034r717j5815j1231k0061k0545j7348j3196
$$ plain form
19237 206617 193399 182770 172442 169816 167765 171348 173904 182260 183839 188771 195759 193683 194724
19224 194724 196315 195677 194639 199934 206362 220090 218370 212291 211355 212219 215362 220353 223677 215872 210328
19209 210328 210989 220399 227438 237614 249142 257634 270081 279790 290025 294731 292750 298779 303451
19196 303451 302038 290047 277403 272236 265680 251288 243896 239849 237864 236394 240519 233124 223742
19183 223742 227455 229050 231937 236566 243040 249903 250357 246031 254083 261308 264788 263770 267805 274154
19169 274154 279429 285679 290090 298466 305224 311785 313003 317017 321159 330119 348666 370145 379721 386664
19155 386664 393591 400877 409651 425603 442562 459556 481186 503573 531189 555730 582888 612925
19143 612925 651672 694000 742777 807980 895030 1003935 1152151 1325614 1511746 1698746
$$ packed form
19237B06617j3218j0629j0328k626k051L583K556Q356J579M932O988k076J041
19224A94724J591o38j038N295O428J3728j720o079r36Q64L143M991L324p805n544
19209B10328O61R410P039J0176J1528Q492J2447R709J0235M706j981O029M672
19196C03451j413j1991j2644n167o556j4392p392m047j985j470M125p395r382
19183B23742L713J595K887M629O474O863M54m326Q052P225L480j018M035O349
19169B74154N275O250M411Q376O758O561J218M014M142Q960J8547K1479R576O943
19155C86664O927P286Q774J5952J6959J6994K1630K2387K7616K4541K7158L0037
19143F12925L8747M2328M8777O5203Q7050J08905J48216J73463J86132J87000
$$ plain form
19133 1698746 1926407 2194494 2471877 2708434 2887881 3090848 3324073 3549151 3723465
19124 3723465 3869508 4009158 4089224 4176993 4315944 4421436 4394668 4291459 4253677 4251493
19114 4251493 4201770 4107388 4029950 3923679 3776573 3675061 3616093 3545497 3416886 3312785
19104 3312785 3289570 3348767 3488448 3758104 4225365 4932739 5841705 6861572 7962419
19095 7962419 9261197 10872913 12580976 14094173 15186530 16331370 17781491 19256310
19087 19256310 20492862 21524061 22566789 23306428 23885759 24819871 25808465 26080263 25411419
19078 25411419 24945638 24916073 24747013 24034716 23176789 22381534 21228662 20046913 19153483
19069 19153483 18240835 16766709 14941133 13468601 12348966 11260221 10134005 9158137
$$ packed form
19133A698746K27661K68087K77383K36557J79447K02967K33225K25078J74314
19124C723465J46043J39650Q0066Q7769J38951J05492k6768j03209l7782k184
19114D251493m9723r4382p7438j06271j47106j01512n8968p0596j28611j04101
19104C312785k3215N9197J39681K69656M67261P07374R08966J019867J100847
19095G962419J298778J611716J708063J513197J092357J144840J450121J474819
19087A9256310J236552J031199J042728P39639N79331R34112R88594K71798o68844
19078B5411419m65781k9565j69060p12297q57927p95255j152872j181749q93430
19069A9153483r12648j474126j825576j472532j119635j088745j126216r75868
$$ plain form
19061 9158137 8373219 7752800 7290112 6943248 6620363 6297661 6065598 5955965 5968626 6130367
19051 6130367 6507101 7185330 8177600 9397532 10739072 12225391 14092015 16279744 18420691
19042 18420691 20072947 21299844 22836629 24601236 26178243 27253027 28186688 29063055
19034 29063055 29477022 30012679 30896278 31533603 30961614 29707498 29029302 28641288 27786458
19025 27786458 26306992 24899287 23478677 21687072 20025821 18642385 17160676 15097327
19017 15097327 12932318 11236442 9886083 8602537 7376743 6391566 5683034 5174506
19009 5174506 4774407 4462610 4225908 4028903 3839527 3641360 3464291 3324860 3187427
19000 3187427 3039243 2909596 2788284 2653562 2518574 2396979 2280259 2150877 2005890
$$ packed form
19061I158137p84918o20419m62688l46864l22885l22702k32063j09633J2661J61741
19051F130367L76734O78229R92270J219932J341540J486319J866624K187729K140947
19042A8420691J652256J226897J536785J764607J577007J074784R33661Q76367
19034B9063055M13967N35657Q83599O37325n71989j254116o78196l88014q54830
19025B7786458j479466j407705j420610j791605j661251j383436j481709k063349
19017A5097327k165009j695876j350359j283546j225794r85177p08532n08528
19009E174506m00099l11797k36702j97005j89376j98167j77069j39431j37433
19000C187427j48184j29647j21312j34722j34988j21595j16720j29382j44987
$$ plain form
18991 2005890 1873354 1769079 1674228 1578633 1499351 1432930 1376072 1327846 1288686 1249712 1212897
18980 1212897 1185195 1158450 1138956 1120393 1109563 1116372 1130585 1150505 1177165 1205879 1255221
18969 1255221 1310421 1351551 1366366 1388996 1426275 1468216 1496468 1517540 1539406 1544875 1538816 1551951
18957 1551951 1577307 1574999 1533314 1491088 1465916 1441481 1389891 1329321 1280097 1220110 1153898
18946 1153898 1090744 1039915 986776 898636 815187 759462 710863 669564 628082 595029 568003
18935 568003 545230 528200 524127 515072 504615 500489 501396 502699 508123 513338 522786 537538 549493
18922 549493 562607 583287 605145 619692 627933 638466 648861 642980 624088 609441 600446 586851
18910 586851 568609 550371 539809 532778 519111 503728 487801 475238 466904 453669 435302 419228
$$ packed form
18991B005890j32536j04275r4851r5595p9282o6421n6858m8226l9160l8974l6815
18980A212897k7702k6745j9494j8563j0830O809J4213J9920K6660K8714M9342
18969A255221N5200M1130J4815K2630L7279M1941K8252K1072K1866N469o059J3135
18957A551951K5356k308m1685m2226k5172k4435n1590o0570m9224n9987o6212
18946A153898o3154n0829n3139q8140q3449n5725m8599m1299m1482l3053k7026
18935E68003k2773j7030m073r055j0457m126R07J303N424N215R448J4752J1955
18922E49493J3114K0680K1858J4547Q241J0533J0395n881j8892j4647q995j3595
18910E86851j8242j8238j0562p031j3667j5383j5927j2563q334j3235j8367j6074
$$ plain form
18898 419228 407931 384268 368041 356705 341835 330479 317712 311553 310318 302922 296480 294423
18886 294423 292279 292152 291781 288495 291293 287780 287458 283350 284759 294961 301472 304572 311362 330299
18872 330299 342520 355092 367381 386992 403993 420587 443398 459567 465749 458269 447707 445693
18860 445693 446430 447806 436628 420297 413316 414964 410692 399839 390675 385246 383732 382099 376297 360048
18846 360048 357983 362127 369196 366414 361120 358377 359428 358043 359318 362051 362345 368534 381668 392406
18832 392406 408588 427242 437303 450255 459632 472084 487793 502373 514959 528152 541465 558662
18820 558662 570997 597704 623262 644804 676457 720701 767831 831024 917064 1032064 1191125
18809 1191125 1396137 1632759 1888795 2175640 2536930 2981187 3420549 3765139 3981768
$$ packed form
18898D19228j1297k3663j6227j1336j4870j1356j2767o159j235p396o442k057
18886B94423k144j27l71l286K798l513l22m108J409J0202O511L100O790J8937
18872C30299J2221J2572J2289J9611J7001J6594K2811J6169O182p480j0562k014
18860D45693P37J376j1178j6331o981J648m272j0853r164n429j514j633n802j6249
18846C60048k065M144P069k782n294k743J051j385J275K733K94O189J3134J0738
18832C92406J6182J8654J0061J2952R377J2452J5709J4580J2586J3193J3313J7197
18820E58662J2335K6707K5558K1542L1653M4244M7130O3193Q6040J15000J59061
18809A191125K05012K36622K56036K86845L61290M44257M39362L44590K16629
$$ plain form
18800 3981768 4215566 4524906 4766340 4771094 4569119 4382221 4289966 4186743 3947889 3644032
18790 3644032 3435424 3361522 3382990 3481952 3718669 4166604 4918561 6012806 7367630 8884207
18780 8884207 10555687 12605850 15196215 17873088 20040753 21392039 22546118 24160420
18772 24160420 25551900 25556862 24102438 22414117 21262571 20103003 18033785 15269229
18764 15269229 12859478 11108495 9742608 8477001 7370791 6624026 6238491 6116565
18756 6116565 6222255 6566979 7068729 7557071 7886145 8102976 8437464 8851461 9074313
18747 9074313 8875474 8436006 8119077 7920002 7627712 7112425 6568869 6220512 6091687
18738 6091687 6107560 6279854 6724227 7589006 8984822 10884065 13135432 15624018 18459457
$$ packed form
18800C981768K33798L09340K41434M754k01975j86898r2255j03223k38854l03857
18790C644032k08608p3902K1468R8962K36717M47935P51957J094245J354824J516577
18780H884207J671480K050163K590365K676873K167665J351286J154079J614302
18772B4160420J391480M962j454424j688321j151546j159568k069218k764556
18764A5269229k409751j750983j365887j265607j106210p46765l85535j21926
18756F116565J05690L44724N01750M88342L29074K16831L34488M13997K22852
18747I074313j98839m39468l16929j99075k92290n15287n43556l48357j28825
18738F091687J5873J72294M44373Q64779J395816J899243K251367K488586K835439
$$ plain form
18729 18459457 22102206 26395210 30362593 33194147 34949792 37072439 39678502 41028345
18721 41028345 39780453 36935288 34552004 32847560 30456161 26412034 22010494 18570805
18713 18570805 16046869 13847700 11662448 9783292 8458927 7612742 7094178 6784914
18705 6784914 6624242 6547304 6494366 6414468 6335926 6301605 6275473 6148934 5864509 5550676
18695 5550676 5313235 5099495 4824386 4483447 4181001 3980092 3872044 3833002 3873721 4063534
18685 4063534 4455369 5082467 5897088 6831415 7870154 9143861 10789692 12524066 13950097
18676 13950097 14839306 15537665 16554395 17492793 17553121 16588692 15409629 14600333 13863349
18667 13863349 12569614 10755339 9122608 7941060 7057616 6209071 5362555 4669967 4186161
$$ packed form
18729A8459457L642749M293004L967383K831554J755645K122647K606063J349843
18721D1028345j247892k845165k383284j704444k391399m044127m401540l439689
18713A8570805k523936k199169k185252j879156j324365q46185n18564l09264
18705F784914j60672p6938n2938p9898p8542l4321k6132j26539k84425l13833
18695E550676k37441k13740k75109l40939l02446k00909j08048l9042M0719J89813
18685D063534L91835O27098Q14621R34327J038739J273707J645831J734374J426031
18676A3950097Q89209O98359J016730R38398O0328r64429j179063q09296p36984
18667A3863349j293735j814275j632731j181548q83444q48545q46516o92588m83806
$$ plain form
18658 4186161 3881526 3666364 3449081 3203526 2986939 2820500 2666703 2481739 2272120
18649 2272120 2084345 1933337 1796721 1664172 1541872 1433216 1337636 1250489 1175553 1112174
18639 1112174 1068233 1027122 986072 942583 907329 868279 836017 799608 773907 753734 743552
18628 743552 738234 722006 696053 680552 666680 645945 631025 621541 622335 629184 642780 661024
18616 661024 682012 710813 745979 790258 829818 853108 870708 890837 908172 913343 884189 835469
18604 835469 805853 780014 735508 676870 625291 574744 535895 501245 471049 438879 417259
18593 417259 402769 388659 377522 368911 356371 347741 341646 335811 330597 322633 324304 318950 306212
18580 306212 297144 289220 279644 271595 262790 253754 252534 249521 242619 239627 239234 243928 239491 239067 242910
$$ packed form
18658D186161l04635k15162k17283k45555k16587j66439j53797j84964k09619
18649B272120j87775j51008j36616j32549j22300j08656r5580q7147p4936o3379
18639A112174m3941m1111m1050m3489l5254l9050l2262l6409k5701k0173j0182
18628G43552n318j6228k5953j5501j3872k0735j4920r484P94O849J3596J8244
18616F61024K0988K8801L5166M4279L9560K3290J7600K0129J7335N171k9154m8720
18604H35469k9616k5839m4506n8638n1579n0547l8849l4650l0196l2170k1620
18593D17259j4490j4110j1137q611j2540q630o095n835n214p964J671n354j2738
18580C06212r068p924r576q049q805r036j220l013o902k992l93M694m437m24L843
$$ plain form
18565 242910 245999 250373 249544 249479 253377 258339 262917 271296 283200 295889 295923 296498 301456 300883 290460
18550 290460 288184 285783 280459 276182 266247 257246 241725 229064 223540 223015 209597 189931 182298
18537 182298 186597 183420 178464 173670 171849 172257 168626 160799 147535 142083 137630 135847 130719 126253
18523 126253 117930 101486 96777 94391 96377 105416 116387 124884 133017 131378 130306 134129 138798 140601
18509 140601 148017 155406 163994 164905 167105 172758 175241 165720 160992 162055 156291 148244 143676 137228
18495 137228 137952 136303 129374 125967 124969 126248 129000 124927 120626 114416 106527 108242 104667 98999 92998
18480 92998 86457 77875 80696 81730 73335 68643 62920 59236 63457 63289 64285 58667 54076 54631 51272
18465 51272 43846 44792 44443 40473 42320 41584 39037 40363 38418 34813 26665 22916 18814 13056 10102
$$ packed form
18565B42910L089M374q29o5L898M962M578Q379J1904J2689L4N75M958n73j0423
18550B90460k276k401n324m277r935r001j5521j2661n524n25j3418j9666p633
18537A82298M299l177m956m794j821M08l631p827j3264n452m453j783n128m466
18523A26253q323j6444m709k386J986R039J0971Q497Q133j639j072L823M669J803
18509A40601P416P389Q588R11K200N653K483r521m728J063n764q047m568o448
18495A37228P24j649o929l407r98J279K752m073m301o210p889J715l575n668o001
18480I2998o541q582K821J034q395m692n723l684M221j68R96n618m591N55l359
18465E1272p426R46l49l970J847p36k547J326j945l605q148l749m102n758k954
$$ plain form
18450 10102 14323 19670 23389 20729 18728 19005 26585 27999 29470 31222 34324 38184 37168 37605 35598
18435 35598 34300 31163 30724 29522 28258 28360 23386 26521 21982 16244 17404 26588 30422 34074 33150
18420 33150 33670 34402 28284 18309 14983 11063 10737 11370 14000 12869 8612 7236 11983 9533 -1197
18405 -1197 -2418 -3120 1408 3152 8156 2636 -11486 -17595 -12011 -13022 -11600 -13181 -12810 -3750 -2985
18390 -2985 -1814 2975 -2793 -5437 -7385 -7239 -14784 -15164 -5708 -4815 -9560 -9866 -10213 -6747 -6356 -6677
18374 -6677 -6709 -6748 -7868 -2467 -1315 788 8374 5504 -102 1533 6583 3040 -2101 -651 -5713 -10514
18358 -10514 -11444 -10282 -17110 -23209 -15304 -12496 -17050 -20174 -19737 -23253 -23537 -19068 -19039 -16923 -21415 -27026
18342 -27026 -26570 -23233 -23657 -19900 -16733 -15983 -22340 -27649 -24428 -22475 -25822 -22001 -10271 -10050 -19107
$$ packed form
18450A0102M221N347L719k660k001K77P580J414J471J752L102L860j016M37k007
18435C5598j298l137m39j202j264J02m974L135m539n738J160R184L834L652r24
18420C3150N20P32o118r975l326l920l26O33K630j131m257j376M747k450j0730
18405a197j221p02M528J744N004n520j4122o109N584j011J422j581L71R060P65
18390b985J171M789n768k644j948J46p545l80R456Q93m745l06l47L466L91l21
18374f677l2l9j120N401J152K103P586k870n606J635N050l543n141J450n062m801
18358a0514r30J162o828o099P905K808m554l124M37l516k84M469K9K116m492n611
18342b7026M56L337m24L757L167P50o357n309L221J953l347L821J1730K21r057
$$ plain form
18327 -19107 -26933 -22559 -18639 -14188 -11363 -12117 -6027 -4245 -615 1430 282 -4129 -6503 -18616
18313 -18616 -27137 -25217 -20598 -18139 -16220 -15096 -11627 -5704 -7771 -16169 -12930 688 5862 -2964
18299 -2964 -6899 -4786 -6383 -9496 -6766 -9238 -12785 -16532 -19111 -15479 -11486 -8619 -7786 -7742 -6704
18284 -6704 -4373 -6884 -10075 -6982 -1293 -242 3008 1032 3691 3812 2632 3536 5360 -641 366
18269 366 -133 6143 11921 10713 10473 10966 5375 2159 3989 8992 11252 15878 23218 26250 30178 30137
18253 30137 43267 63108 79522 88824 92927 101453 106047 104243 103119 95452 91581 87686 74860
18240 74860 60864 47695 40203 34898 30302 21445 20038 21076 24393 23887 18379 11938 15718 31587
18226 31587 32259 27216 28573 30977 30229 30133 29099 32212 31761 33617 37840 36537 28759 21829 23403 28127
$$ packed form
18327a9107p826M374L920M451K825p54O090J782L630K045j148m411k374j2113
18313a8616q521J920M619K459J919J124L469N923k067q398L239J3618N174q826
18299b964l935K113j597l113K730k472l547l747k579L632L993K867Q33M4J038
18284f704K331k511l191L093N689J051L250j976K659J21j180R04J824o001J007
18269C66m99O276N778j208k40M93n591l216J830N003K260M626P340L032L928m1
18253C0137J3130J9841J6414R302M103Q526M594j804j124p667l871l895j2826
18240G4860j3996j3169p492n305m596q857j407J038L317n06n508o441L780J5869
18226C1587O72n043J357K404p48r6j034L113m51J856M223j303p778o930J574M724
$$ plain form
18210 28127 27737 36003 53865 65214 83575 99602 118709 141226 160330 170126 179069 192120 211794
18197 211794 226845 223466 204053 184900 171971 158509 137958 110052 91805 74952 62606 49013
18185 49013 39510 35513 35261 25739 23495 22960 27683 23685 16179 17915 22926 29607 28635 26565 23943
18170 23943 27442 29800 32357 34005 30942 32790 35690 38014 34321 30831 28306 31781 37715 46054
18156 46054 55170 57113 67707 89536 100620 105495 109783 115694 117917 117684 112725 110109 107606 108750
18142 108750 107151 105745 101534 96664 94742 86234 81567 81792 85048 90251 95009 99386 101154 114228
18128 114228 123107 138538 152324 162953 180534 211483 244542 274333 305419 351468 412288 496406
18116 496406 618805 803077 1084848 1541081 2373070 3944951 6206999 8040226 8787254
$$ packed form
18210B8127l90Q266J7862J1349J8361J6027J9107K2517J9104R796Q943J3051J9674
18197B11794J5051l379j9413j9153j2929j3462k0551k7906j8247j6853j2346j3593
18185D9013r503l997k52r522k244n35M723l998p506J736N011O681r72k070k622
18170B3943L499K358K557J648l063J848K900K324l693l490k525L475N934Q339
18156D6054R116J943J0594K1829J1084M875M288N911K223k33m959k616k503J144
18142A08750j599j406m211m870j922q508m667K25L256N203M758M377J768J3074
18128A14228Q879J5431J3786J0629J7581L0949L3059K9791L1086M6049O0820Q4118
18116D96406J22399J84272K81771M56233Q31989J571881K262048J833227P47028
$$ plain form
18107 8787254 7029485 4330575 2689235 1832981 1341408 1036242 821661 663224 554643
18098 554643 471617 408574 355016 314315 292672 264884 241565 222516 213125 206363 190977 179947
18086 179947 174934 165595 154584 140288 126476 121536 118069 114124 112853 107988 107208 97359 82970
18073 82970 75792 77658 71487 67984 73217 78493 85228 80602 72890 70772 65227 60603 50798 47559
18059 47559 49836 47664 41324 47654 52445 50413 47809 43690 31898 26803 21264 18176 14503 16580
18045 16580 18203 23431 24698 27615 28257 20851 21754 26409 21162 15821 16953 17920 18247 18984 17375 12266
18029 12266 8503 6972 5541 8347 15427 19206 17815 12961 7929 11233 9068 8702 10067 3271 1677
18014 1677 39 -935 2886 8485 7544 5272 1669 788 3416 3009 3191 6952 2017 -1189 -2905 -5022
$$ packed form
18107H787254j757769k698910j641340q56254m91573l05166k14581j58437j08581
18098E54643q3026o3043n3558m0701k1643k7788k3319j9049r391o762j5386j1030
18086A79947n013r339j1011j4296j3812m940l467l945j271m865p80r849j4389
18073H2970p178J866o171l503N233N276O735m626p712k118n545m624r805l239
18059D7559K277k172o340O330M791k032k604m119j1792n095n539l088l673K077
18045A6580J623N228J267K917O42p406R03M655n247n341J132R67L27P37j609n109
18029A2266l763j531j431K806P080L779j391m854n032L304k165l66J365o796j594
18014A677j638r74L821N599r41k272l603q81K628m07J82L761m935l206j716k117
$$ plain form
17998 -5022 -5344 -8627 -7887 -10889 -12365 -12102 -8678 -6500 -9641 -6168 -3865 -3188 -5227 -8349 -14921 -15403
17982 -15403 -7930 -9057 -9641 -11871 -13676 -15037 -6446 3716 2579 -2312 -10986 -18022 -19966 -13727
17968 -13727 -8800 -9760 -9308 -6800 -6767 -11949 -22542 -23337 -15741 -18539 -22831 -22122 -24520 -24750 -20210 -21238
17952 -21238 -22111 -16369 -11759 -11145 -12105 -3412 -423 -9548 -11699 -8086 -1639 -5717 -8888 -6071 -5458
17937 -5458 -6418 -5930 -9727 -11949 -9884 -6996 -7903 -16366 -15912 -10634 -11951 -16666 -19483 -20051 -18297 -19147
17921 -19147 -16133 -13503 -13375 -11373 -10483 -10981 -16797 -15135 -13058 -11096 -4603 -1793 -1614 -8828 -10074
17906 -10074 -9850 -10862 -13263 -12768 -3479 4836 -1205 -4801 -12659 -13612 -11843 -8952 -7415 -8797 -12108
17891 -12108 -14431 -5894 3287 967 -10711 -21687 -19176 -16567 -17752 -17192 -14143 -7736 -6815 -8563
$$ packed form
17998e022l22l283P40l002j476K63L424K178l141L473K303O77k039l122o572m82
17982a5403P473j127n84k230j805j361Q591J0162j137m891q674p036j944O239
17968a3727M927r60M52K508L3n182j0593p95P596k798m292P09k398k30M540j028
17952b1238q73N742M610O14r60Q693K989r125k151L613O447m078l171K817O13
17937e458r60M88l797k222K065K888r07q463M54N278j317m715k817n68J754q50
17921a9147L014K630J28K002Q90m98n816J662K077J962O493K810J79p214j246
17906a0074K24j012k401M95R289Q315o041l596p858r53J769K891J537j382l311
17891a2108k323Q537R181k320j1678j0976K511K609j185N60L049O407R21j748
$$ plain form
17877 -8563 -9553 -10303 -12600 -12547 -9496 -8784 -10384 -13070 -19593 -15511 -13317 -14723 -14971 -11391 -14885 -11958
17861 -11958 -8922 -9603 -136 -1757 -10413 -14361 -17617 -16120 -6425 -4322 -17338 -18004 -19311 -20635 -19006
17846 -19006 -13978 -10989 -6700 1062 -103 -5806 -10935 -11622 -15685 -21070 -17117 -14364 -15020 -17521 -15566
17831 -15566 -12954 -11891 -9381 -15487 -14864 -19956 -28313 -25412 -21228 -13976 -6770 -5998 -7986 -6270 -11496
17816 -11496 -11971 -5667 -255 -4154 -12874 -11718 -12271 -14994 -13567 -5833 -4120 -8373 -16943 -8331 -4114
17801 -4114 -6214 -13875 -9667 -7500 -6146 -6775 -11628 -14261 -7931 -8467 -15457 -21586 -24574 -20510 -18666
17786 -18666 -14297 -11738 -12127 -14690 -17499 -15929 -17149 -18603 -15523 -14534 -6747 -6239 -13839 -16691 -15051
17771 -15051 -12837 -14645 -12891 -6488 -2468 -5290 -12896 -19804 -24326 -24242 -16410 -14841 -18903 -20773 -21732
$$ packed form
17877h563r90p50k297N3L051P12j600k686o523M082K194j406k48L580l494K927
17861a1958L036o81R467j621q656l948l256J497R695K103j3016o66j307j324J629
17846a9006N028K989M289P762j165n703n129o87m063n385L953K753o56k501J955
17831a5566K612J063K510o106O23n092q357K901M184P252P206P72j988J716n226
17816a1496m75O304N412l899q720J156n53k723J427P734J713m253q570Q612M217
17801d114k100p661M208K167J354o29m853k633O330n36o990o129k988M064J844
17786a8666M369K559l89k563k809J570j220j454L080R89P787N08p600k852J640
17771a5051K214j808J754O403M020k822p606o908m522Q4P832J569m062j870r59
$$ plain form
17756 -21732 -16152 -18577 -24995 -27140 -17347 -16234 -14831 -13838 -11741 -11429 -9713 -11583 -11500 -1896 2717
17741 2717 -7475 -10787 -8424 -9339 -5652 -5474 -4882 -11225 -19785 -12151 -2582 900 2897 0 -2472
17726 -2472 -401 4966 2060 9175 18789 30357 48414 75426 105779 120510 109763 80170 55254
17713 55254 34597 24105 21549 21137 15598 12093 5611 -4773 -7815 -8242 -11191 -14033 -7634 -3961
17699 -3961 -6285 -1825 4573 -341 -10326 -12734 -13347 -10621 -10106 -11878 -14336 -21254 -13768 2019 4133
17684 4133 -8783 -11715 -8622 -5377 -11122 -13139 -3718 -5884 -10736 -7796 -1876 -6084 -11580 -7679
17670 -7679 -5346 1930 5758 4814 3065 3808 -443 -3914 -9485 -7174 -2678 -7362 -9441 -14940 -11557
17655 -11557 -10164 -7806 -14303 -13837 -10731 -12470 -14273 -9110 -5559 -9573 -5265 -8619 -8871 -2720 1185
$$ packed form
17756b1732N580k425o418k145R793J113J403R93K097L12J716j870Q3R604M613
17741B717j0192l312K363r15L687J78N92o343q560P634R569L482J997k897k472
17726b472K071N367k906P115R614J1568J8057K7012L0353J4731j0747k9593k4916
17713E5254k0657j0492k556m12n539l505o482j0384l042m27k949k842O399L673
17699c961k324M460O398m914r985k408o13K726N15j772k458o918P486J5787K114
17684D133j2916k932L093L245n745k017R421k166m852K940N920m208n496L901
17670g679K333P276L828r44j749P43m251l471n571K311M496m684k079n499L383
17655a1557J393K358o497M66L106j739j803N163L551m014M308l354k52O151L905
$$ plain form
17640 1185 -2905 -8259 -10179 -6758 -7859 -4567 -2898 -4771 -8584 -15917 -14817 -11591 -9539 -8927 -10476
17625 -10476 -3842 -8030 -4583 855 -7764 -12415 -13376 -15831 -10229 -9541 -9001 -12118 -7901 -12371 -19416
17610 -19416 -13792 -9006 -9543 -13245 -18477 -17078 -14674 -12368 -5509 -5547 -8392 -11826 -7873 -5236 -9380
17595 -9380 -17006 -21474 -17203 -18375 -17254 -18722 -17176 -13822 -16448 -16764 -8333 -5332 -7622 -14215 -17801
17580 -17801 -15228 -9432 -10409 -11418 -9653 -14466 -16857 -10844 -6892 -15513 -16329 -19278 -17427 -13280 -5359
17565 -5359 2112 175 -2046 1635 -3130 -4419 -205 -3064 -14610 -13778 -4225 -3047 -5724 -11455 -9109
17550 -9109 -5738 -10392 -7498 -5618 -10785 -6796 -5763 -92 -5276 -12048 -20882 -23798 -16178 -9457 -3967
17535 -3967 5601 4182 -5293 -11537 -12625 -8777 -10673 -17462 -16696 -15067 -11922 -12391 -9585 -7078 -1249
$$ packed form
17640A185m090n354j920L421j101L292J669j873l813p333J100L226K052O12j549
17625a0476O634m188L447N438q619m651r61k455N602O88N40l117M217m470p045
17610a9416N624M786n37l702n232J399K404K306O859l8k845l434L953K637m144
17595i380p626m468M271j172J121j468J546L354k626l16Q431L001k290o593l586
17580a7801K573N796r77j009J765m813k391O013L952q621q16k949J851M147P921
17565e359P471j937k221L681m765j289M214k859j1546Q32R553J178k677n731K346
17550i109L371m654K894J880n167L989J033N671n184o772q834k916P620O721N490
17535c967R568j419r475o244j088L848j896o789P66J629L145m69K806K507N829
$$ plain form
17520 -1249 -2495 -7925 -12004 -14630 -11421 -9164 -9939 -6724 -1741 312 2521 3440 -840 -3022 -9028
17505 -9028 -11385 -15405 -14120 -15495 -15844 -7997 -3940 -14389 -14366 -15336 -13287 -10377 -6704 73 2065
17490 2065 660 5289 13810 17501 14115 13452 16168 14024 5309 357 -416 732 -4991 -6826 -6651
17475 -6651 -236 4416 2987 -3363 -8897 -12974 -21325 -27266 -21396 -14537 -11120 -11261 -9527 -8668 -8553
17460 -8553 -6483 -6799 -13375 -19867 -11312 -7282 -3096 2910 4951 2087 -5280 -6027 -4626 -2880 -5207
17445 -5207 -7947 2089 16462 38110 38785 22753 6548 -730 -7878 -5716 312 2073 -5314 818
17431 818 6255 -4643 -3265 -177 1282 -1957 -1878 -2869 -2325 378 4238 7652 3206 2275 4200 9331
17415 9331 14295 19039 15080 6661 1926 -3776 -8185 -9492 -15418 -24985 -25759 -19683 -20782 -22024 -20331
$$ packed form
17520a249j246n430m079k626L209K257p75L215M983K053K209R19m280k182o006
17505i028k357m020J285j375l49P847M057j0449K3r70K049K910L673O777J992
17490B065j405M629Q521L691l386o63K716k144q715m952p73J148n723j835J75
17475f651O415M652j429o350n534m077q351n941N870O859L417j41J734Q59J15
17460h553K070l16o576o492Q555M030M186O006K041k864p367p47J401J746k327
17445e207k740J0036J4373K1648O75j6032j6205p278p148K162O028J761p387O132
17431H18N437j0898J378L088J459l239P9r91N44K703L860L414m446r31J925N131
17415I331M964M744l959q419m735n702m409j307n926r567p74O076j099j242J693
$$ plain form
17400 -20331 -18744 -10603 -9162 -3698 -3061 -4705 -5926 -11487 -19629 -22960 -20785 -14332 -10196 -4102 -8132
17385 -8132 -7787 -2036 -5102 -8965 -2568 2172 -5002 -6421 -5779 -14093 -12222 -17860 -21922 -18524 -19496
17370 -19496 -13317 -9694 -9593 -17268 -20725 -10835 -5437 -5853 -11397 -9256 -1657 482 4621 13367 5194
17355 5194 -1805 4124 7016 2458 521 482 -2658 -1175 3529 8913 12440 12542 5995 1025 1980 5585
17339 5585 24 120 2674 8182 11393 9383 5962 1333 3562 9541 8568 1128 -2134 -601 -10190
17324 -10190 -2074 1437 3814 7469 2263 3922 5427 2544 -533 2516 5419 8252 10380 5570
17310 5570 1759 5376 13645 13746 9405 11012 14034 12525 11969 9257 2047 -5530 -8138 -7893 -2359
17295 -2359 1984 5655 4648 10165 15966 18130 21067 24855 29692 28300 26833 28310 23454 18941 8263
$$ packed form
17400b0331J587Q141J441N464O37j644j221n561q142l331K175O453M136O094m030
17385h132L45N751l066l863O397M740p174j419O42q314J871n638m062L398r72
17370a9496O179L623J01p675l457R890N398m16n544K141P599K139M139Q746q173
17355E194o999N929K892m558j937l9l140J483M704N384L527J02o547m970R55L605
17339E585n561R6K554N508L211k010l421m629K229N979r73p440l262J533r589
17324a0190Q116L511K377L655n206J659J505k883l077L049K903K833K128m810
17310E570l811L617Q269J01m341J607L022j509n56k712p210p577k608K45N534
17295b359M343L671j007N517N801K164K937L788M837j392j467J477m856m513j0678
$$ plain form
17280 8263 6052 9242 14047 16666 13774 14764 6220 2094 -177 -3928 -5137 -5616 -4606 -3747 6088
17265 6088 9471 6992 9629 7949 9155 12587 11527 8871 7517 9891 15943 25519 30897 33571 34071
17250 34071 37695 31322 22629 17857 16314 18300 17669 19875 18145 17234 13446 16678 28553 28965 30212
17235 30212 27754 27329 27463 33860 39394 42275 39903 37356 45392 49472 45550 46104 50060 57890 66569
17220 66569 67256 70421 72462 76667 73183 64300 67018 68208 73799 74977 67890 68558 76347 80377 85796
17205 85796 93809 100100 102943 101726 100642 104954 113946 120309 126629 138825 151186 158761 161113 169040
17191 169040 180838 191414 205422 219478 238752 254635 273999 292306 313825 348196 379182
17180 379182 408568 457216 512481 568451 629923 705790 794933 910101 1044611 1204943 1395522
$$ packed form
17280H263k211L190M805K619k892R90q544m126k271l751j209m79J010Q59R835
17265F088L383k479K637j680J206L432j060k656j354K374O052R576N378K674N00
17250C4071L624o373q693m772j543J986o31K206j730r11l788L232J1875M12J247
17235C0212k458m25J34O397N534K881k372k547Q036M080l922N54L956P830Q679
17220F6569O87L165K041M205l484q883K718J190N591J178p087O68P789M030N419
17205H5796Q013O291K843j217j084M312Q992O363O320J2196J2361P575K352P927
17191A69040J1798J0576J4008J4056J9274J5883J9364J8307K1519L4371L0986
17180C79182K9386M8648N5265N5970O1472P5867Q9143J15168J34510J60332J90579
$$ plain form
17169 1395522 1662157 2067078 2681984 3618130 5147898 7855488 12698244 19469042 25457613
17160 25457613 27936735 23685771 15637524 9814099 6617593 4784079 3653700 2923177
17152 2923177 2423595 2051815 1756211 1503021 1289091 1130576 1017731 928915 849345 778767
17142 778767 721330 676637 629516 597253 567453 543172 512850 481773 451343 438414 423447
17131 423447 405495 390439 371812 362452 356296 345760 324807 308098 304378 292630 287259 280270
17119 280270 271728 265088 256066 241163 232128 223350 210617 199683 186904 178039 162063 157245 158418
17106 158418 153904 147867 141442 136892 131853 125408 118486 116169 113022 118821 118595 113580 106772 105336
17092 105336 100177 97769 93414 91585 85332 79344 82087 82111 75707 67129 62535 68296 67511 64893 55285
$$ packed form
17169A395522K66635M04921O14906R36146J529768K707590M842756O770798N988571
17160B5457613K479122m250964q048247n823425l196506j833514j130379p30523
17152B923177m99582l71780k95604k53190k13930j58515j12845q8816p9570p0578
17142G78767n7437m4693m7121l2263k9800k4281l0322l1077l0430j2929j4967
17131D23447j7952j5056j8627r360o156j0536k0953j6709l720j1748n371o989
17119B80270q542o640r022j4903r035q778j2733j0934j2779q865j5976m818J173
17106A58418m514o037o425m550n039o445o922k317l147N799k26n015o808j436
17092A05336n159k408m355j829o253n988K743K4o404q578m594N761p85k618r608
$$ plain form
17077 55285 47977 47189 49561 52932 55684 53721 47393 52721 51935 50650 46064 42806 41048 43676 43428
17062 43428 31386 20482 20839 27624 31051 30099 28806 28864 24227 21203 23805 30011 33282 38234 37885
17047 37885 39919 39460 32685 32157 34876 33653 31266 25267 25207 29237 31323 34771 36249 37820 27430
17032 27430 17495 15463 13466 13045 14803 14343 15401 12333 3201 1915 3886 6939 10 -2947 6085
17017 6085 11087 6156 -1375 -347 -1100 4772 3188 -1115 -3895 -2191 3947 266 1052 10805 12699
17002 12699 10851 7945 6839 4418 5251 7291 9060 12912 10019 8300 13923 8569 4341 5675 3774
16987 3774 5258 1343 -2698 -1105 -1205 -3792 -3362 -2079 -6039 -7943 -10901 -9290 -8011 -7506 -4044
16972 -4044 -7018 -1151 6384 10715 4164 305 -5722 -7355 -11037 -17069 -13648 -13845 -11542 -7192 -9981
$$ packed form
17077E5285p308p88K372L371K752j963o328N328p86j285m586l258j758K628k48
17062D3428j2042j0904L57O785L427r52j293N8m637l024K602O206L271M952l49
17047C7885K034m59o775n28K719j223k387n999o0M030K086L448J478J571j0390
17032B7430r935k032j997m21J758m60J058l068r132j286J971L053o929k957R032
17017F085N002m931p531J028p53N872j584m303k780J704O138l681P86R753J894
17002A2699j848k906j106k421Q33K040J769L852k893j719N623n354m228J334j901
16987C774J484l915m041J593j00k587M30J283l960j904k958J611J279N05L462
16972d044k974N867P535M331o551l859o027j633l682o032L421j97K303M350k789
$$ plain form
16957 -9981 -9843 -6915 -3213 -2138 -41 -4470 -6218 -7160 -11126 -7956 -1805 -344 -4640 -9316 -12785
16942 -12785 -9574 -8921 -15984 -13535 -12508 -10942 -8102 -10087 -8204 2623 3454 4046 2206 772 -1389
16927 -1389 -1873 -2590 -5666 -8680 -13230 -5823 -7039 -8599 -7514 -4934 -5084 -9872 -10237 -10427 -15473 -13084
16911 -13084 -13861 -11114 -11643 -12722 -11872 -7923 -1771 -1699 118 -3658 -7812 2079 180 -6126 -8156 -10889
16895 -10889 -11356 -10490 -5493 725 140 148 -6562 -13684 -10986 -6911 -7083 -6410 -6483 -3817 -4675 -12652 -14273
16878 -14273 -15091 -15721 -17338 -18098 -18574 -17887 -10010 -12585 -9485 -8195 -3351 -940 -9532 -15801 -8094 -5102
16862 -5102 -9624 -11013 -10171 -4800 -4884 -4648 4202 6590 572 -708 828 -2561 713 -2413 -3172 -2291
16846 -2291 -465 -2144 -5027 -5336 -4642 -6279 -6937 -7044 -10577 -10998 -10535 -18717 -21666 -20314 -17677 -18431
$$ packed form
16957i981J38K928L702J075K097m429j748r42l966L170O151J461m296m676l469
16942a2785L211O53p063K449J027J566K840j985J883J0827Q31N92j840j434k161
16927a389m84p17l076l014m550P407j216j560J085K580j50m788l65j90n046K389
16911a3084p77K747n29j079Q50L949O152P2J817l776m154R891j899o306k030k733
16895a0889m67Q66M997O218n85Qo710p122K698M075j72O73p3K666q58p977j621
16878a4273q18o30j617p60m76O87P877k575L100J290M844K411q592o269P707K992
16862e102m522j389Q42N371q4K36Q850K388o018j280J536l389L274l126p59Q81
16846b291J826j679k883l09O94j637o58j07l533m21M63q182k949J352K637p54
$$ plain form
16830 -18431 -21801 -20520 -15985 -16026 -14649 -15129 -18477 -14074 -15353 -16497 -19411 -13887 -10974 -12478 -15694
16815 -15694 -11897 -6711 -8077 -14069 -16530 -16503 -14510 -12541 -9851 -4296 -5131 -3248 -535 314 765 1029
16799 1029 -2434 -5045 -1231 -5556 -5589 -6588 -6328 -5670 -3998 -2950 -2542 -8154 -8752 -8640 -9216 -7179 -5411
16782 -5411 -12750 -20784 -19019 -15417 -14418 -10294 -8634 -7898 -9328 -9549 -8882 -7861 -12267 -14011 -4124 2468
16766 2468 3316 -8898 -15995 -10088 -10562 -10124 -16012 -12714 -8279 -12902 -13688 -16624 -16645 -15196 -6763 -4469
16750 -4469 -7729 -4525 -2991 -5877 -6893 -11000 -18856 -16546 -14715 -16976 -17898 -12605 -6896 -10963 -13389
16735 -13389 -5390 307 2762 591 -1283 -6628 -9226 -2938 1952 4056 4420 929 -1320 -1638 3285
16720 3285 77 -9696 -12936 -13082 -11887 -14842 -11642 -12676 -13496 -8684 -2818 8554 9632 7376 2070
$$ packed form
16830a8431l370J281M535m1J377m80l348M403j279j144k914N524K913j504l216
16815a5694L797N186j366n992k461K7J993J969K690N555q35J883K713Q49M51K64
16799A029l463k611L814m325l3r99K60O58J672J048M08n612n98J12n76K037J768
16782e411p339q034J765L602R99M124J660P36j430k21O67J021m406j744R887O592
16766B468Q48j2214p097N907m74M38n888L298M435m623p86k936k1J449Q433K294
16750d469l260L204J534k886j016m107p856K310J831k261r22N293N709m067k426
16735a3389P999N697K455k171j874n345k598O288M890K104L64l491k249l18M923
16720C285l208r773l240j46J195k955L200j034q20M812N866J1372J078k256n306
$$ plain form
16705 2070 -5888 -15410 -15666 -13238 -6326 27 2318 -41 -8334 -10365 -3770 1811 -1312 -1521 -7002
16690 -7002 -15003 -20098 -16198 -6086 -1646 2201 1527 -2888 -1160 -1605 -8141 -6766 -9716 -15689 -11694
16675 -11694 -9669 -7430 -2032 -521 -4837 -9442 -12820 -19844 -17764 -9178 -5101 -5062 -7688 -9937 -4930
16660 -4930 -4904 -11657 -11805 -11116 -12068 -12215 -11209 -17512 -18059 -22744 -23290 -15107 -5681 -2615 1457 389 -6195
16643 -6195 -5807 -6108 -4728 -6941 -7354 -9415 -5561 -4310 -6559 -3626 -4766 -3506 254 -173 422 -2423
16627 -2423 -3087 -2614 -3691 -2051 -4264 -11285 -3455 4206 6455 7304 5731 -3226 -3891 -4509 -3017 -3440
16611 -3440 -4307 -7479 -7546 -1859 7390 13103 7806 7005 9455 8398 9861 27265 56068 82891 107426
16596 107426 116647 99643 76231 45129 27591 22068 17587 10390 8549 -1538 -11854 -3478 1119
$$ packed form
16705B070p958r522k56K428O912O353K291k359q293k031O595N581l123k09n481
16690g002q001n095L900J0112M440L847o74m415J728m45o536J375k950n973L995
16675a1694K025K239N398J511m316m605l378p024K080Q586M077L9k626k249N007
16660d930K6o753j48O89r52j47J006o303n47m685n46Q183R426L066M072j068o584
16643f195L88l01J380k213m13k061L854J251k249K933j140J260L760m27N95k845
16627b423o64M73j077J640k213p021P830P661K249Q49j573q957o65o18J492m23
16611c440q67l172o7N687R249N713n297q01K450j057J463J7404K8803K6823K4535
16596A07426R221j7004k3412l1102j7538n523m481p197j841j0087j0316Q376M597
$$ plain form
16583 1119 -1261 -3872 -6549 -7391 -5620 -1235 7684 12206 7840 -495 -8107 -11867 -12932 -13522 -15772
16568 -15772 -16190 -10993 -6675 -1689 10329 4520 -5560 -5828 -2005 -2240 -5424 924 -3119 -6988 -9233
16553 -9233 -7705 -1301 7160 7903 12519 14895 8472 -702 -6654 -1555 -458 976 -2720 -7816 -9172
16538 -9172 -10659 -10944 -6729 -2522 -4249 -11791 -9594 -5815 -3376 -7606 -6395 -611 -2102 -3408 -1642
16523 -1642 -6994 -11108 -15658 -16826 -14000 -13407 -15508 -13341 -8302 -12601 -19302 -17401 -16464 -20154 -19234
16508 -19234 -13691 -10884 -8233 -5615 -4445 -5673 -9329 -9767 -12510 -8079 -2324 -6925 -12379 -10311 -16511
16493 -16511 -16363 -13086 -10882 -7216 -3360 272 -1280 -8291 -14530 -17141 -15457 -16170 -14925 -4882 -4241
16478 -4241 -5686 -8020 -6111 -2923 -4429 -7752 -7529 -11959 -5778 -1406 -5324 -1212 -4473 -6481 -3521
$$ packed form
16583A119k380k611k677q42J771M385Q919M522m366q335p612l760j065n90k250
16568a5772m18N197M318M986J2018n809j0080k68L823k35l184O348m043l869k245
16553i233J528O404Q461P43M616K376o423r174n952N099J097J434l696n096j356
16538i172j487k85M215M207j727p542K197L779K439m230J211N784j491j306J766
16523a642n352m114m550j168K826N93k101K167N039m299o701J901R37l690R20
16508a9234N543K807K651K618J170j228l656m38k743M431N755m601n454K068o200
16493a6511J48L277K204L666L856L632j552p011o239k611J684p13J245J0043O41
16478d241j445k334J909L188j506l323K23m430O181M372l918M112l261k008K960
$$ plain form
16463 -3521 1697 3975 1855 -5493 -4108 -6666 -3955 -1286 -1289 -3541 -4204 -1493 -4597 -11059 -14196 -14030
16447 -14030 -12187 -16176 -15522 -15037 -7473 -1321 4649 -1237 -10985 -8717 1641 1165 -7453 -20909 -16976
16432 -16976 -13655 -13859 -14791 -11299 -9044 -6678 -6139 -7005 -12021 -7785 5638 6012 -741 -871 -2130 399
16416 399 -5397 -10091 -8703 -4849 -3431 6322 10470 4207 -1346 -5966 4318 8687 -1686 -12281
16402 -12281 -10101 -9390 -5503 -1471 -2696 -6360 -5679 -2863 2323 1256 -1513 -4229 -10359 -13087 -15399
16387 -15399 -21304 -13241 -3531 -1157 -669 -730 -8565 -14534 -14467 -12437 -6547 -5532 -5980 -5593 -1038 6308
16371 6308 7547 -2838 -12783 -12925 -9768 -10509 -10257 -6119 -9104 -10164 -9104 -6757 -10537 -14592 -18593
16356 -18593 -23998 -16099 -9710 -8037 -7578 -8120 -10212 -11905 -13444 -7183 -6305 -4589 -7492 -11333 -11611
$$ packed form
16463c521N218K278k120p348J385k558K711K669lk252o63K711l104o462l137J66
16447a4030J843l989O54M85P564O152N970n886r748K268J0358m76q618j3456L933
16432a6976L321k04r32L492K255K366N39q66n016M236J3423L74o753j30j259K529
16416C99n796m694J388L854J418R753M148o263n553m620J0284M369j0373j0595
16402a2281K180P11L887M032j225l664O81K816N186j067k769k716o130k728k312
16387a5399n905Q063R710K374M88o1p835n969O7K030N890J015m48L87M555P346
16371F308J239j0385r945j42L157p41K52M138k985j060J060K347l780m055m001
16356a8593n405P899O389J673M59n42k092j693j539O261Q78J716k903l841k78
$$ plain form
16341 -11611 -8188 -14833 -14826 -16521 -16341 -11757 -7177 -6533 -3139 -7037 -9165 -11329 -12836 -2938 7381
16326 7381 5576 3467 8583 2422 -698 4138 4926 1041 -2158 -1363 -3144 -14589 -17995 -13517 -10197
16311 -10197 -7519 -4441 -7867 -12454 -8949 -3209 -3642 -5264 -6476 -9021 -3476 -1302 -15037 -16076
16297 -16076 -13545 -7988 -7890 -12053 -9297 -6987 -2914 1512 -1338 -8967 -8885 -3927 889 -5712 -7355
16282 -7355 -10751 -10506 -4393 -11931 -11111 -10596 -9937 -11927 -14070 -14256 -10476 -7676 -11370 -13937 -16094 -8177
16266 -8177 2763 -1638 -6867 -8906 -14497 -9281 -7109 -14448 -18512 -20517 -16992 -15856 -13182 -8498
16252 -8498 -7163 -6029 -8773 -9701 -4048 -5694 -9776 -12470 -13477 -13283 -6393 -9869 -15371 -20123 -14464
16237 -14464 -14301 -24421 -17226 -2217 -2557 -12580 -14463 -13262 -12670 -9935 -10506 -3894 -3659 -481 3516
$$ packed form
16341a1611L423o645Pj695J80M584M580O44L394l898k128k164j507R898J0319
16326G381j805k109N116o161l120M836P88l885l199P95j781j1445l406M478L320
16311a0197K678L078l426m587L505N740m33j622j212k545N545K174j3735j039
16297a6076K531N557R8m163K756K310M073M426k850p629Q2M958M816o601j643
16282g355l396K45O113p538Q20N15O59j990k143j86L780K800l694k567k157P917
16266h177J0940m401n229k039n591N216K172p339m064k005L525J136K674M684
16252h498J335J134k744r28N653j646m082k694j007J94O890l476n502m752N659
16237a4464J63j0120P195J5009l40j0023j883J201N92K735n71O612K35L178L997
$$ plain form
16222 3516 4462 157 -3870 -7278 -8001 -8426 -11123 -14836 -14935 -17963 -18710 -16993 -14848 -5239 -8 167
16206 167 666 -6069 -6251 -2489 1836 -4382 -5836 -9254 -12327 -9969 -7018 -6062 -4848 -8032 -9342 -5647
16190 -5647 -5294 -7198 -4548 -5026 -7099 -10826 -11152 -1512 1794 -1363 -4894 -5400 -6694 -2967 -3346 -7625
16174 -7625 -4256 -1978 -4855 -6997 -7507 -5522 -1610 -2840 -2305 -6821 -9205 -6082 -7510 -14004 -13462
16159 -13462 -10649 -7763 -2525 893 1660 1606 1417 3545 -4267 -3755 -3899 -8109 -6730 -4611 -8775 -17617
16143 -17617 -15000 -11987 -8438 -3622 -4108 -3407 -14 242 -5457 -6919 -6495 -4034 24 452 -2756 -6204
16127 -6204 -8957 -12091 -8699 -3150 -1812 -10160 -13864 -15747 -16298 -13466 -6642 -6130 -3957 -10407 -14564
16112 -14564 -15020 -8200 -6206 -10343 -6717 -4785 -3893 1558 5829 2829 3081 5399 5026 -4888 -8936
$$ packed form
16222C516R46m305m027l408p23m25k697l713r9l028p47J717K145R609N231J75
16206A67M99o735j82L762M325o218j454l418l073K358K951R56J214l184j310L695
16190e647L53j904K650m78k073l727l26R640L306l157l531n06j294L727l79m279
16174g625L369K278k877k142n10J985L912j230N35m516k384L123j428o494N42
16159a3462K813K886N238L418P67n4j89K128p812N12j44m210J379K119m164q842
16143a7617K617L013L549M816m86P01L393K56n699j462M24K461M058M28l208l448
16127f204k753l134L392N549J338q348l704j883n51K832O824N12K173o450m157
16112a4564m56O820J994m137L626J932Q92N451M271l000K52K318l73r914m048
$$ plain form
16097 -8936 -10950 -9851 -3712 -5527 -11179 -7866 -9305 -10474 -8566 -8252 -6681 -6750 -9557 -6902 -7199 -7155
16081 -7155 -1192 -5416 -6979 -8857 -7386 -4107 -3038 -6037 -4170 -3285 -5917 -9112 -13631 -17037 -15054
16066 -15054 -13590 -14741 -13837 -12638 -9061 -8029 -6831 -9485 -8722 -5430 -8185 -8307 -6114 -11398 -9912
16051 -9912 -5853 86 -3943 -2803 -3976 -11495 -2101 1740 -1750 -2389 -5151 -8782 -11755 -4644 2399
16036 2399 1091 -846 -5039 -10691 -11796 -5048 -7839 -12603 -9314 -7771 -3046 -7721 -10511 -10603 -8251
16021 -8251 3036 4778 -1135 -6872 -5998 -4671 -6001 -12641 -17099 -18810 -7718 -1452 -1244 -2116 6166
16006 6166 5937 8476 11240 7021 2601 -1563 638 780 -6996 -14395 -14755 -11332 -13840 -13096 -14778 -14630
15990 -14630 -16499 -14505 -10295 -13945 -15928 -13724 -13834 -3875 -3999 -11136 -16917 -19832 -18756 -16427 -15236
$$ packed form
16097h936k014J099O139j815n652L313j439j169J908L14J571o9k807K655k97M4
16081g155N963m224j563j878J471L279J069k999J867Q85k632l195m519l406J983
16066a5054J464j151R04J199L577J032J198k654P63L292k755j22K193n284J486
16051i912M059N939m029J140j173p519R394L841l490o39k762l631k973P111P043
16036B399j308j937m193n652j105O748k791m764L289J543M725m675k790r2K352
16021h251J1287J742n913n737Q74J327j330o640m458j711J1092O266K08q72Q282
16006F166k29K539K764m219m420m164K201J42p776p399l60L423k508P44j682J48
15990a4630j869J994M210l650j983K204j10R959j24p137n781k915J076K329J191
$$ plain form
15975 -15236 -11922 -7918 -5213 -443 712 4759 9461 9387 10540 6483 7469 9332 4261 1262 -3456
15960 -3456 -9446 -11625 -9645 -15936 -14096 -13496 -12510 -11669 -11848 -11782 -16513 -18247 -16593 -13057 -13611 -14238 -10714
15943 -10714 -11708 -11671 -9203 -7920 -9273 -2614 3024 6380 6905 2824 -1888 -10041 -3820 -3297 -1245 -7513
15927 -7513 -9910 -3543 -4792 -4824 -2989 -277 720 721 -2092 -6532 -6298 -1736 3334 2123 -963 -5998
15911 -5998 -6237 -4319 2314 7299 4758 -3874 -3876 1691 1681 6663 8514 1811 -6237 -3924 -605 6410
15895 6410 4162 1010 -1445 -448 -4495 -12824 -11574 -6674 1799 4460 3962 1302 1122 -6184 -11087
15880 -11087 -5534 -5648 -5859 -11639 -14838 -6843 -11324 -14664 -10031 -9610 -13493 -10167 -6083 -6038 -9145 -9810
15864 -9810 -10875 -12898 -14461 -16979 -18414 -15936 -11687 -11540 -14841 -15141 -11894 -7415 -3449 -919 -7540
$$ packed form
15975a5236L314M004K705M770J155M047M702p4J153m057R86J863n071k999m718
15960c456n990k179J980o291J840O00R86Q41j79O6m731j734J654L536n54o27L524
15943a0714r94L7K468J283j353O659N638L356N25m081m712q153O221N23K052o268
15927g513k397O367j249l2J835K712R97Jk813m440K34M562N070j211l086n035
15911e998k39J918O633M985k541q632kN567j0M982J851o703q048K313L319P015
15895F410k248l152k455R97m047q329J250M900Q473K661m98k660j80p306m903
15880a1087N553j14k11n780l199P995m481l340M633M21l883L326M084M5l107o65
15864i810j065k023j563k518j435K478M249J47l301l00L247M479L966K530o621
$$ plain form
15849 -7540 -10779 -7450 -6794 -8822 -13592 -10584 634 -974 -6404 -5932 -10402 -14759 -11000 -8649 -6260
15834 -6260 -9901 -4197 6564 13826 16859 7254 -2740 -10406 -8580 -3516 -5356 -4330 -5026 -6071 -15574
15819 -15574 -19061 -21648 -18630 -18776 -14012 -8866 -10497 -12662 -10988 -14388 -10214 -6295 -3522 24 5279
15804 5279 -3230 -11253 -17638 -19526 -14440 -17073 -20317 -18260 -14482 -17068 -8187 -3268 -2135 -2994 -8305
15789 -8305 -12796 -13228 -11036 -11665 -8514 -1819 -3126 -6554 3209 6975 4556 2964 -1218 -5770 -10470
15774 -10470 -7115 -5373 -4392 -10542 -18048 -15159 -6277 -3408 -13166 -16929 -15693 -18090 -7425 -2365
15760 -2365 350 4962 8113 6459 1450 -2080 -2767 -7963 -7163 -9184 -10922 -15393 -17106 -11461 -5658
15745 -5658 227 1584 3891 2869 -4695 -1526 -2635 -7200 -8877 -4783 -5519 -6301 -7447 -5824 -8348
$$ packed form
15849g540l239L329O56k028m770L008J1218j608n430M72m470m357L759K351K389
15834f260l641N704J0761P262L033r605r994p666J826N064j840J026o96j045r503
15819a5574l487k587L018j46M764N146j631k165J674l400M174L919K773L546N255
15804E279q509q023o385j888N086k633l244K057L778k586Q881M919J133q59n311
15789h305m491m32K192o29L151O695j307l428R763L766k419j592m182m552m700
15774a0470L355J742R81o150p506K889Q882K869r758l763J236k397J0665N060
15760b365K715M612L151j654n009l530o87n196Q00k021j738m471j713N645N803
15745e658N885J357K307j022p564L169j109m565j677M094p36p82j146J623k524
$$ plain form
15730 -8348 -4606 -1773 -1249 -2917 -8623 -11586 -11415 -11471 -9607 -7991 -8626 -5821 -3151 -1463 -9388 -16939
15714 -16939 -16882 -13022 -10084 -4448 -1566 -3738 -8059 -4731 -590 -2646 -5857 -3945 -197 4993 4825
15699 4825 -922 -5786 -2389 5000 4072 -348 833 2618 5030 4838 4649 7429 8250 6326 1472 3226
15683 3226 3121 6361 1892 -11430 -11476 -10547 -13604 -17988 -8467 -2037 1418 1128 1775 7682 6763 276
15667 276 -2730 -5412 -6914 -4935 5363 5822 1577 -14121 -19549 -8257 -1870 3235 6593 3091
15653 3091 -1462 -551 -656 -730 -2880 -176 3170 3562 -2470 -3901 -3030 3069 4642 3913 2530 963
15637 963 -2924 -11223 -11062 -2255 1373 5078 7045 7053 7871 12056 7728 5679 3706 1176 1485 -2686
15621 -2686 -8194 -11040 -9575 -9887 -2235 925 2639 8038 10908 7199 -823 -1925 2742 2006 8285
$$ packed form
15730h348L742K833N24j668n706k963J71n6J864J616o35K805K670J688p925p551
15714a6939N7L860K938N636K882k172m321L328M141k056l211J912L748N190j68
15699D825n747m864L397P389r28m420J181J785K412j92j89K780Q21j924m854J754
15683C226j05L240m469j3322m6R29l057m384R521O430L455k90O47N907r19o487
15667B76l006k682j502J979J0298M59m245j5698n428J1292O387N105L358l502
15653C091m553R11j05p4k150K704L346L92o032j431Q71O099J573p29j383j567
15637I63l887q299J61Q807L628L705J967QQ18M185m328k049j973k530L09m171
15621b686n508k846J465l12P652L160J714N399K870l709q022j102M667p36O279
$$ plain form
15606 8285 6145 2108 -143 2352 3434 5316 -1858 -7357 -7588 -3945 -3811 3826 4556 2575 -4920
15591 -4920 -6244 -2844 -2418 -9930 -13999 -12506 -5759 -2146 -2560 -5335 -6899 -8470 -5154 -2023 -3118
15576 -3118 -3801 -7101 -7790 -4514 -3327 -1522 -857 3549 3275 3494 -2228 -6633 -9104 -5903 -4142 -8211
15560 -8211 -14344 -3752 144 -8653 -16680 -21624 -22040 -11931 -1214 -1665 -4485 928 -1058 -349 1250
15545 1250 8439 11137 4971 -5780 -13501 -12080 -4691 -4142 -6173 -9499 -7858 -7141 -6367 -2620 -3851
15530 -3851 -9733 -7466 -6612 -6421 -9706 -13659 -9985 -5155 -3974 -1412 4488 5898 5939 1520 -6138 -8326
15514 -8326 -7553 -5793 -7492 -7963 -2851 -699 -4353 -12097 -9016 -410 1855 -1649 -346 -2429 -6460
15499 -6460 -2647 -6209 -7779 -626 5867 11914 8161 8825 7803 6480 4974 568 1140 -1342 1327
$$ packed form
15606H285k140m037k251K495J082J882p174n499k31L643J34P637P30j981p495
15591d920j324L400M26p512m069J493O747L613m14k775j564j571L316L131j095
15576c118o83l300o89L276J187J805O65M406k74K19n722m405k471L201J761m069
15560h211o133J0592L896q797q027m944m16J0109J0717m51k820N413j986P09J599
15545A250P189K698o166j0751p721J421P389N49k031l326J641P17P74L747j231
15530c851n882K267Q54J91l285l953L674M830J181K562N900J410M1m419p658k188
15514h326P73J760j699m71N112K152l654p744L081Q606K265l504J303k083m031
15499f460L813l562j570P153O493O047l753O64j022j323j506m406N72k482K669
$$ plain form
15484 1327 -2302 -1463 2651 6712 13632 19015 28593 33217 37805 36778 30435 20256 13662 4837 3028
15469 3028 7396 6372 -1802 -2362 -7644 -13411 -18797 -12972 -5239 3748 354 349 2422 -4082 -6368 -4251
15453 -4251 -1258 3032 7453 12621 14790 7209 2353 3243 9194 8770 10118 9203 17007 13144 16301
15438 16301 24228 19273 19450 17497 13287 10840 12840 7139 660 6749 9277 -2940 -5889 -8793
15424 -8793 -13848 -10971 -8628 -537 8058 10952 10275 8597 -767 -6214 -14290 -18887 -7871 -5953 -1389
15409 -1389 2112 8228 126 -5276 -5280 -6387 -3380 -2093 -2910 -4094 -7242 -10591 -10397 -2361 -3273 -17036
15393 -17036 -14083 -6662 -7756 -4944 -757 -472 -5223 -3192 -4576 -7507 -5517 -2188 -3499 2058 9152
15378 9152 10909 9553 116 -10069 -8591 1424 5977 4372 2370 -1424 1782 9848 10857 5253
$$ packed form
15484A327l629Q39M114M061O920N383R578M624M588j027o343j0179o594q825j809
15469C028M368j024q174n60n282n767n386N825P733Q987l394nK073o504k286K117
15453d251K993M290M421N168K169p581m856Q90N951m24J348r15P804l863L157
15438A6301P927m955J77j953m210k447K000n701o479O089K528j2217k949k904
15424h793n055K877K343Q091Q595K894o77j678r364n447q076m597J1016J918M564
15409a389L501O116q102n402mj107L007J287q17j184l148l349J94Q036r12j3763
15393a7036K953P421j094K812M187K85m751K031j384k931J990L329j311N557P094
15378I152J757j356r437j0185J478J0015M553j605k002l794L206Q066J009n604
$$ plain form
15364 5253 -282 -1037 -3598 1025 7690 8127 2930 -3456 -3635 -5670 -6880 -6063 -12681 -13001 -4671 -5112
15348 -5112 -3013 -146 -4876 -8528 -10335 -5285 -4566 -5276 -1164 1238 990 2986 1777 3091 1229
15333 1229 -1089 2351 1664 903 -5216 -9933 -8127 -6408 -9455 -6048 918 4822 2947 1114 3817
15318 3817 8438 10680 7715 3786 -506 -6447 -3083 -273 258 -242 161 -4660 -6518 -4419 864
15303 864 7113 1128 -4835 -3884 -10182 -6498 -10350 -18210 -17723 -5653 -4683 -5771 -5207 -4839 -5779 -1243
15287 -1243 452 -2998 -9229 -10752 -10428 -5537 -5784 -5926 -3799 -639 162 951 231 3995 942 -11638
15271 -11638 -14372 -15388 -11334 -7441 816 2706 451 -1906 -7140 -10027 -19586 -21006 -18181 -9487
15257 -9487 917 3914 767 5481 4457 2707 1329 7567 4715 2827 889 -2263 -1848 -137 -6336
$$ packed form
15364E253n535p55k561M623O665M37n197o386j79k035j210Q17o618l20Q330m41
15348e112K099K867m730l652j807N050P19p10M112K402k48J996j209J314j862
15333A229k318L440o87p61o119m717J806J719l047L407O966L904j875j833K703
15318C817M621K242k965l929m292n941L364K810N31n00M03m821j858K099N283
15303H64O249n985n963R51o298L684l852p860M87J2070R70j088N64L68r40M536
15287a243J695l450o231j523L24M891k47j42K127L160Q01P89p20L764l053j2580
15271a1638k734j016M054L893Q257J890k255k357n234k887r559j420K825Q694
15257i487J0404K997l147M714j024j750j378O238k852j888j938l152M15J711o199
$$ plain form
15242 -6336 -14773 -8406 -5631 -3503 -9486 -8017 -5802 -1572 -2674 1075 545 -2622 -3881 -5260 -3109
15227 -3109 -1107 -341 -4495 -3104 -1937 -7531 -6340 -4523 -6718 -9283 -8106 -3651 -1466 -3424 -1005
15212 -1005 2470 3422 6012 7048 8106 5864 2023 1000 4343 4021 -102 -8719 -7854 -8013 -10065 -13402
15196 -13402 -11930 -10362 -10283 -6769 -22 -6073 -11353 -4900 482 4389 9385 5610 4084 3933 7709
15181 7709 13178 12346 13240 19437 11461 6139 8151 6062 -1665 -3752 -74 2324 4675 11743 7017
15166 7017 3222 -2239 1360 7545 5707 5523 4526 6789 4033 -256 1139 10355 9283 2193 -7485
15151 -7485 -10375 -3639 -643 1952 -118 -3741 -7746 -9818 -6412 -3766 -1685 7443 9200 2018 -605
15136 -605 -1391 1688 2029 4035 5491 10063 7501 2597 -2348 -1851 -5761 -8316 -8330 -10846 -5793 -5655
$$ packed form
15242f336q437O367K775K128n983J469K215M230j102L749n30l167j259j379K151
15227c109K002P66m154J391J167n594J191J817k195k565J177M455K185j958K419
15212a005L475R52K590J036J058k242l841j023L343l22m123q617Q65j59k052l337
15196a3402J472J568P9L514O747o051n280O453N382L907M996l775j526j51L776
15181G709N469q32Q94O197p976n322K012k089p727k087L678K398K351P068m726
15166G017l795n461L599O185j838j84r97K263k756m289J395R216j072p090r678
15151g485k890O736K996K595k070l623m005k072L406K646K081R128J757p182k623
15136f05p86L079L41K006J456M572k562m904m945M97l910k555j4k516N053J38
$$ plain form
15120 -5655 -10365 -2949 614 3917 4201 3216 1762 1357 660 -4958 -5217 889 4691 804 3005 2270
15104 2270 -862 -2190 -5483 -8793 -6347 -7599 -10573 -2389 -7963 -7508 -7334 -826 8956 8222 6600
15089 6600 431 -167 2336 8072 7353 -3474 -8496 -7275 -7360 -16 6184 10082 4852 4983 8956 6969
15073 6969 6779 476 698 7711 -212 -4164 -2183 1806 3373 -1906 -11318 -2499 3201 6454 6602
15058 6602 204 -5693 -6402 -8098 -4126 3151 11942 18480 9350 4743 4665 4743 8179 2920 -249 989
15042 989 3635 5732 4000 -4437 -4440 -1418 392 2854 13 -7443 -8332 -6762 -301 9295 11587 3253
15026 3253 1370 1953 1015 -2312 -3322 -5447 -2622 -4256 -7809 -7737 -1827 -149 716 3647 10240 11699
15010 11699 5045 -1 -5420 -14729 -16663 -16056 -8831 -5995 -8697 -7708 -3450 795 -2865 -4545 -7688
$$ packed form
15120e655m710P416L563L303K84r85j454m05o97n618k59O106L802l887K201p35
15104B270l132j328l293l310K446j252k974Q184n574M55J74O508R782p34j622
15089F600o169n98K503N736p19j0827n022J221q5P344O200L898n230J31L973j987
15073F969j90o303K22P013p923l952J981L989J567n279r412Q819N700L253J48
15058F602o398n897p09j696L972P277Q791O538r130m607p8P8L436n259l169J238
15042I89K646K097j732q437lL022J810K462k841p456q89J570O461R596K292q334
15026C253j883N83r38l327j010k125K825j634l553P2N910J678Q65K931O593J459
15010A1699o654n046n419r309j934O07P225K836k702R89M258M245l660j680l143
$$ plain form
14995 -7688 -4783 3343 6960 10505 10940 7810 4885 -1939 483 5579 4490 3731 2063 -1509 -5571
14980 -5571 -7283 -3258 1155 2573 2702 -3266 -298 58 -3483 -2688 2537 123 -2802 553 -1858
14965 -1858 -107 7473 10796 1657 -4030 1704 3448 -1558 -5779 -2843 -1585 -6658 -5725 -4249 -2186
14950 -2186 -5356 -5376 3677 5973 8169 12778 13547 1449 2764 9951 5582 4928 10472 6917 6540 4005
14934 4005 3258 2552 5418 3863 505 -208 1298 512 -376 2566 9695 16202 19265 18381 14587 8568
14918 8568 8018 6350 5682 9626 8091 6875 5817 1140 3918 3223 -895 -7075 -1172 11221 15350
14903 15350 14234 14816 8445 8028 14146 14965 10765 1519 -4752 -7054 2984 5902 -261 -1130 -1747
14888 -1747 -4645 -6410 533 3733 478 -2525 -4110 -2128 4066 12111 5173 9378 14311 8623 79
$$ packed form
14995g688K905Q126L617L545M35l130k925o824K422N096j089p59j668l572m062
14980e571j712M025M413J418J29n968K968L56l541P95N225k414k925L355k411
14965a858J751P580L323r139n687N734J744n006m221K936J258n073R33J476K063
14950b186l170k0R053K296K196M609P69j2098J315P187m369o54N544l555l77k535
14934D005p47p06K866j555l358p13J506p86q88K942P129O507L063q84l794o019
14918H568n50j668o68L944j535j216j058m677K778o95m118o180N903J2393M129
14903A5350j116N82o371m17O118Q19m200r246o271k302J0038K918o163q69o17
14888a747k898j765O943L200l255l003j585J982O194Q045o938M205M933n688q544
$$ plain form
14873 79 -6941 -8511 -1811 5078 160 -5124 -8110 -2561 1624 305 251 3456 9698 6338 -2685 -7763
14857 -7763 -7255 -7185 -9921 -7588 -3993 -882 -3165 -5017 -3288 -5444 -11627 -7001 2167 1527 -2856 -967
14841 -967 1218 3007 2718 -3072 -6826 -4369 3955 10898 11826 5198 -2667 -824 -2667 -1600 4131
14826 4131 2873 8485 11231 7245 1434 2812 5866 5996 1299 -1177 -1430 -1218 1404 4484 1230
14811 1230 -4667 -4249 -1655 -1029 6609 8429 10374 17988 13448 7001 9496 12534 10326 13626 13709 10416
14795 10416 9613 15743 17496 18105 20289 18285 13792 13115 4593 7662 17362 18104 13724 13803 21555 21889
14779 21889 10885 4733 6287 5309 3197 -219 2244 3124 -860 635 835 1418 4484 6362 4194
14764 4194 6223 12412 13455 3030 -6608 -9269 -5091 -3862 -1105 -421 2715 2352 4166 233 -1
$$ packed form
14873G9p020j570O700O889m918n284k986N549M185j319n4L205O242l360r023n078
14857g763N08P0k736K333L595L111k283j852J729k156o183M626R168o40m383J889
14841i67K185J789k89n790l754K457Q324O943R28o628p865J843j843J067N731
14826D131j258N612K746l986n811J378L054J30m697k476k53K12K622L080l254
14811A230n897M18K594O26P638J820J945P614m540o447K495L038k208L300Q3l293
14795A0416q03O130J753O09K184k004m493o77q522L069R700P42m380P9P752L34
14779B1889j1004o152J554r78k112l416K463Q80l984J495K00N83L066J878k168
14764D194K029O189J043j0425r638k661M178J229K757O84L136l63J814l933k34
$$ plain form
14749 -1 8404 5497 3269 6017 13308 16295 11053 9890 5135 2307 2973 1545 -1211 -662 -386 -17
14733 -17 855 7067 7426 5482 1206 -3735 -5559 -5810 -6197 -2751 1889 -4748 -5467 381 2800 -552
14717 -552 2197 3698 3545 7768 11089 10197 5923 3124 -577 -655 2599 4015 4967 6403 6344 453 -5387
14700 -5387 -4203 -4060 -1741 2171 5807 7034 5512 1959 -6257 -1454 1219 1156 3229 6458 4958
14685 4958 6388 2950 -515 -653 22 1864 -4285 -5758 -79 -2246 -562 -145 -5664 -7991 -10600
14670 -10600 -3825 -676 5376 8959 6362 7373 7746 11459 9500 10151 11071 8892 12868 9745 8563
14655 8563 9142 7946 778 -2109 -3637 -2036 -69 766 1495 3175 4933 2877 7276 11097 10949 11086
14639 11086 9160 6807 6928 10574 15273 14252 12068 13792 14715 4365 5118 11645 16015 15483 15233
$$ packed form
14749aQ405k907k228K748P291K987n242j163m755k828O66j428k756N49K76L69
14733a7Q72O212L59j944m276m941j824k51l87L446M640o637p19N848K419l352
14717e52K749J501j53M223L321q92m274k799l701p8L254J416R52J436n9n891n840
14700e387J184J43K319L912L636J227j522l553q216M803K673o3K073L229j500
14685D958J430l438l465j38O75J842o149j473N679k167J684M17n519k327k609
14670a0600O775L149O052L583k597J011L73L713j959O51R20k179L976l123j182
14655H563N79j196p168k887j528J601J967Q35P29J680J758k056M399L821j48J37
14639A1086j926k353J21L646M699j021k184J724R23j0350P53O527M370n32k50
$$ plain form
14624 15233 19115 11696 10781 10633 11999 3135 7657 10242 12106 14873 12015 8751 4541 2507 6807
14609 6807 14245 13798 8661 11009 15295 7253 4114 569 2934 6425 7390 9651 6634 11635 14008
14594 14008 16868 12284 9707 15500 15987 10253 13285 11502 6538 3244 2418 2187 4334 7082 5215
14579 5215 -300 416 -6157 -2952 -694 400 -3773 3863 8789 10202 5814 -531 969 -510 5861
14564 5861 8903 8163 8501 11558 8948 6567 3839 2185 326 -573 3497 11656 15334 10744 9391
14549 9391 9523 9990 8965 11111 9910 5996 8370 8658 8223 10931 11501 11677 16879 7716 4893 5219
14533 5219 10573 10547 11708 7022 4062 6626 2007 1876 3605 7013 7313 8702 13082 13002 8635 2477
14517 2477 5053 8041 10272 11042 7886 5271 516 530 -5393 -6826 -2768 142 5784 5256 2353 -1389
$$ packed form
14624A5233L882p419r15j48J366q864M522K585J864K767k858l264m210k034M300
14609F807P438m47n137K348M286q042l139l545K365L491R65K261l017N001K373
14594A4008K860m584k577N793M87n734L032j783m964l294q26k31K147K748j867
14579E215n515P16o573L205K258J094m173P636M926J413m388o345J500j479O371
14564E861L042p40L38L057k610k381k728j654j859q99M070Q159L678m590j353
14549I391J32M67j025K146j201l914K374K88m35K708N70J76N202r163k823L26
14533E219N354k6J161m686k960K564m619j31J729L408L00J389M380q0m367o158
14517B477K576K988K231P70l156k615m755J4n923j433M058K910N642n28k903l742
$$ plain form
14501 -1389 -6106 -6380 485 -1909 312 -334 -1203 3806 5580 4722 4163 4190 4084 1681 2905 4044 3552
14484 3552 107 -3313 3898 4633 4765 9385 11738 14542 17052 18278 16979 17312 16383 17623 19051 17667
14468 17667 17569 11497 10433 9426 15100 12807 5750 3543 9086 12442 10250 12354 13432 10066 9665
14453 9665 10097 14231 13871 13773 10541 6573 2447 12944 20311 21948 18846 12981 10536 17792 17815 13739
14437 13739 10180 10612 15146 17925 16294 14325 14537 5687 450 3033 8556 7711 1927 459 6629
14422 6629 7910 4862 6750 4005 5788 5998 10701 7336 4980 6731 4131 5802 7302 7529 8781
14407 8781 10913 8940 12290 10345 5030 1679 10029 17497 19246 15698 16513 15928 16880 12718 7156
14392 7156 3931 4856 2550 6908 7701 4133 1137 3381 530 1621 2114 3312 3695 8761 9205 7241
$$ packed form
14501a389m717k74O865k394K221o46q69N009J774q58n59K7j06k403J224J139m92
14484C552l445l420P211P35J32M620K353K804K510J226j299L33r29J240J428j384
14468A7667r8o072j064j007N674k293p057k207N543L356k192K104J078l366m01
14453I665M32M134l60r8l232l968m126J0497P367J637l102n865k445P256K3m076
14437A3739l559M32M534K779j631j969K12q850n237K583N523q45n784j468O170
14422F629J281l048J888k745J783K10M703l365k356J751k600J671J500K27J252
14407H781K132j973L350j945n315l351Q350P468J749l548Q15n85R52m162n562
14392G156l225R25k306M358P93l568k996K244k851J091M93J198L83N066M44j964
$$ plain form
14376 7241 9743 14629 11630 12236 15054 12853 17612 21274 21236 21903 19818 12429 14856 14025 13155 14772
14360 14772 15274 12048 587 -1222 4934 9219 15025 14989 12620 5682 12337 11422 7824 5919 2269
14345 2269 6121 10186 7150 1399 1749 11002 13219 16551 20136 20758 17561 12313 8296 9606 8782
14330 8782 6971 9483 14983 26400 27287 23366 16617 12954 7310 -1106 943 6630 6861 9237 6317
14315 6317 4233 7006 8232 9232 14011 12510 13063 15057 15068 18175 18498 14443 8320 5493 11467 10947
14299 10947 11869 12112 11656 11632 18764 26804 27428 26200 25824 28050 26759 23081 26252 20804 11348 6874
14283 6874 7785 19551 22433 24231 14367 12076 22015 25670 31897 30725 22087 15134 18117 23195 22184
14268 22184 22682 19164 23317 24219 25683 24748 20015 15444 10187 15214 15375 13309 17529 18238 23535 28311
$$ packed form
14376G241K502M886k999O06K818k201M759L662l8O67k085p389K427q31q70J617
14360A4772N02l226j1461j809O156M285N806l6k369o938O655r15l598j905l650
14345B269L852M065l036n751L50R253K217L332L585O22l197n248m017J310q24
14330H782j811K512N500J1417Q87l921o749l663n644q416K049N687K31K376k920
14315F317k084K773J226J000M779j501N53J994J1L107L23m055o123k827N974n20
14299A0947R22K43m56k4P132Q040O24j228l76K226j291l678L171n448r456m474
14283F874R11J1766K882J798r864k291R939L655O227j172q638o953K983N078j011
14268B2184M98l518M153R02J464r35m733m571n257N027J61k066M220P09N297M776
$$ plain form
14252 28311 29578 28923 22541 25608 30526 34236 35761 36988 34362 28617 25921 21870 17375 12069 17447
14237 17447 20073 20641 23320 22160 22845 26700 30536 30764 32142 30142 35021 32178 23516 21049 32204
14222 32204 37406 30513 31794 29776 32535 30089 30741 29302 31101 22604 19366 27190 33565 30758 30556
14207 30556 39458 36871 29883 32829 34674 32612 28014 20703 19527 19481 22569 29540 30545 32607 32527
14192 32527 30183 28283 37597 49105 50211 51426 50907 43507 38121 36601 36206 38540 43226 45572 47659
14177 47659 47273 51505 58010 56988 56744 55850 57362 64472 78053 93416 104777 121397 133250 151123
14163 151123 179135 223031 283139 386143 557992 835582 1221428 1589320 1773146 1603665
14153 1603665 1157725 779560 553291 415842 323623 259058 220757 197858 175859 156283
$$ packed form
14252B8311J267o55o382L067M918L710J525J227k626n745k696m051m495n306N378
14237A7447K626N68K679j160O85L855L836K28J378k000M879k843q662k467J1155
14222C2204N202o893J281k018K759k446O52j439J799q497l238P824O375k807k02
14207C0556Q902k587o988K946J845k062m598p311j176m6L088O971J005K062q0
14192C2527k344j900R314J1508J106J215n19p400n386j520l95K334M686K346K087
14177D7659l86M232O505j022k44q94J512P110J3581J5363J1361J6620J1853J7873
14163A51123K8012M3896O0108J03004J71849K77590L85846L67892J83826j69481
14153A603665m45940l78165k26269j37449r2219o4565l8301k2899k1999j9576
$$ plain form
14143 156283 145779 132376 122333 115010 101236 89836 86138 80588 77568 77587 74710 73540 70961
14130 70961 70462 67816 66992 70102 61807 56836 54955 56349 53826 55902 61027 63173 65388 61932 54148
14115 54148 46351 41392 38267 40545 40807 41020 49612 54092 52619 43358 41225 36591 37037 49922 48096
14100 48096 48588 49983 49449 47683 45985 45992 40623 41842 47916 48267 57141 66631 73297 70249 74126 82433
14084 82433 69697 57477 58096 55521 53448 49899 45966 43012 49007 52898 54699 51070 55099 52340
14070 52340 50509 52886 49259 41621 37753 37323 45929 42398 42365 47275 48505 46464 46155 48031 42123
14055 42123 39888 46451 47203 41686 38502 47027 55033 52544 48839 41096 45593 46768 45327 47998 43942
14040 43942 42976 47737 49705 47765 49691 46840 43647 47309 49482 51745 49525 53730 52726 47478 44231
$$ packed form
14143A56283j0504j3403j0043p323j3774j1400l698n550l020J9k877j170k579
14130G0961m99k646q24L110q295m971j881J394k523K076N125K146K215l456p784
14115E4148p797m959l125K278K62K13Q592M480j473r261k133m634M46J2885j826
14100D8096M92J395n34j766j698Pn369J219O074L51Q874R490O666l048L877Q307
14084H2433j2736j2220O19k575k073l549l933k954N995L891J801l629M029k759
14070E2340j831K377l627p638l868m30Q606l531l3M910J230k041l09J876n908
14055D2123k235O563P52n517l184Q525Q006k489l705p743M497J175j441K671m056
14040D3942r66M761J968j940J926k851l193L662K173K263k220M205j004n248l247
$$ plain form
14025 44231 45861 53350 52805 53484 61261 62303 57271 56234 52417 54637 52686 45873 44227 45563 53943
14010 53943 58409 60128 65777 68848 70714 70819 69637 69434 70240 75028 70580 70406 68360 73526 77680
13995 77680 79356 80571 75979 81315 79755 57770 15920 -38342 -98253 -120308 -100213 -68581 -36401
13982 -36401 -15771 -5273 -1709 3891 3035 2022 8128 6795 1976 -5400 -4204 1845 13335 17038
13968 17038 19303 25249 22647 18377 20349 29517 34789 45072 51940 55498 52657 51609 48983 41212
13954 41212 36767 35778 48298 54524 55843 55873 57494 59734 61694 61214 66101 71024 72628 76239 93106
13939 93106 108041 125280 151542 194037 265209 360795 431323 440946 404987 332292 249704 181625
13927 181625 142361 124076 111859 103191 96975 92759 98073 94203 89434 78225 74680 71485 74655
$$ packed form
14025D4231J630P489n45O79P777J042n032j037l817K220j951o813j646J336Q380
14010E3943M466J719N649L071J866J05j182k03Q06M788m448j74k046N166M154
13995G7680J676J215m592N336j560k1985m1850n4262n9911k2055K0095L1632L2180
13982c6401K0630J0498L564N600q56j013O106j333m819p376J196O049J1490L703
13968A7038K265N946k602m270J972R168N272J0283O868L558k841j048k626p771
13954D1212m445r89J2520O226J319L0J621K240J960m80M887M923J604L611J6867
13939I3106J4935J7239K6262M2495P1172R5586P0528R623l5959p2695q2588o8079
13927A81625l9264j8285j2217q668o216m216N314l870m769j1209l545l195L170
$$ plain form
13914 74655 85107 89429 89384 85464 91042 86811 83392 82807 82004 76750 69807 66886 65298 64215 57225
13899 57225 60877 66690 69228 63176 56141 53255 55851 57932 68759 78662 86882 95377 102475 92484
13885 92484 80545 75904 69244 66221 74330 75758 80351 99876 105775 109872 114738 109888 107907 101639
13871 101639 93339 90563 86748 89982 84188 81991 93010 105648 125564 135358 144003 150093 156039
13858 156039 156904 145762 126186 113451 110584 111997 116007 126386 131796 137567 140696 144733 151130
13845 151130 160874 169442 173466 171630 178629 181186 173963 172063 180609 187916 182820 179080 182863 194609
13831 194609 200392 203921 213018 230642 239882 255538 269567 261520 247432 246547 244373 243241 243194 245076
13817 245076 253875 265547 277393 290630 301390 315732 329442 350266 383940 436514 507819 571390
$$ packed form
13914G4655J0452M322m5l920N578m231l419n85q03n254o943k921j588j083o990
13899E7225L652N813K538o052p035k886K596K081J0827R903Q220Q495P098r991
13885I2484j1939m641o660l023Q109J428M593J9525N899M097M866m850j981o268
13871A01639q300k776l815L234n794k197J1019J2638J9916R794Q645O090N946
13858A56039Q65j1142j9576j2735k867J413M010J0379N410N771L129M037O397
13845A51130R744Q568M024j836O999K557p223j900Q546P307n096l740L783J1746
13831A94609N783L529R097J7624R240J5656J4029q047j4088q85k174j132m7J882
13817B45076Q799J1672J1846J3237J0760J4342J3710K0824L3674N2574P1305O3571
$$ plain form
13805 571390 590327 533648 443387 370741 324857 286214 254199 238397 238074 242614 245506 247662
13793 247662 244818 248096 255952 261998 273157 288432 305998 308732 312125 324435 339538 354191 360303
13780 360303 363771 369118 366445 367929 372317 377561 380741 399670 420297 434531 454723 466354 468484
13767 468484 473145 475679 476767 483414 491995 506561 524427 536790 537808 533547 534227 541277 554454
13754 554454 573043 589737 609580 637927 655655 670078 693953 710483 732594 758099 783578
13743 783578 806212 825818 857227 890705 919027 954711 1012611 1067409 1113909 1166297 1209265
13732 1209265 1240444 1259609 1257501 1254551 1268726 1313544 1373520 1426416 1474428 1509504 1542955 1596738
13720 1596738 1674814 1766391 1863008 1965661 2060226 2165615 2284606 2409393 2539065 2693438
$$ packed form
13805E71390J8937n6679r0261p2646m5884l8643l2015j5802l23M540K892K156
13793B47662k844L278P856O046J1159J5275J7566K734L393J2310J5103J4653O112
13780C60303L468N347k673J484M388N244L180J8929K0627J4234K0192J1631K130
13767D68484M661K534J088O647Q581J4566J7866J2363J018m261O80P050J3177
13754E54454J8589J6694J9843K8347J7728J4423K3875J6530K2111K5505K5479
13743G83578K2634J9606L1409L3478K8322L5684N7900N4798M6500N2388M2968
13732A209265L1179J9165k108k950J4175M4818N9976N2896M8012L5076L3451N3783
13720A596738P8076R1577R6617J02653R4565J05389J18991J24787J29672J54373
$$ plain form
13710 2693438 2871075 3055090 3241060 3434688 3640801 3862721 4119442 4410265 4746276
13701 4746276 5139424 5592051 6105043 6701257 7410854 8237742 9186959 10302880 11703991
13692 11703991 13521798 15796832 18384531 21205522 24358945 28668156 35345478 45616711
13684 45616711 61670964 88044888 133361016 205467696 285441851 339691352 340504900
13677 340504900 265130271 175689605 117492767 83561970 62918801 49758616 40838422
13670 40838422 34378173 29508836 25684167 22614385 20009866 17625815 15608435 13975458
13662 13975458 12671594 11645732 10806751 10076475 9444447 8902610 8432632 8012635 7627749
13653 7627749 7269766 6943613 6641988 6341554 6074857 5843662 5619688 5397666 5187076
$$ packed form
13710B693438J77637J84015J85970J93628K06113K21920K56721K90823L36011
13701D746276L93148M52627N12992N96214P09597Q26888R49217J115921J401111
13692A1703991J817807K275034K587699K820991L153423M309211O677322J0271233
13684D5616711J6054253K6373924M5316128P2106680P9974155N4249501Q13548
13677C40504900p5374629q9440666n8196838l3930797k0643169j3160185q920194
13670D0838422o460249m869337l824669l069782k604519k384051k017380j632977
13662A3975458j303864j025862q38981p30276o32028n41837m69978m19997l84886
13653G627749l57983l26153l01625l00434k66697k31195k23974k22022k10590
$$ plain form
13644 5187076 4992447 4799722 4607039 4438582 4286892 4157035 4047788 3934459 3812240
13635 3812240 3674842 3522159 3371948 3243815 3144077 3048228 2938876 2820244 2692422 2569099
13625 2569099 2467032 2378930 2303303 2237040 2183808 2128334 2074309 2028052 1966052 1903545 1851687
13614 1851687 1801015 1747678 1704179 1657184 1601985 1551563 1498974 1463274 1432792 1394646 1356712
13603 1356712 1326043 1299176 1271314 1234908 1187246 1143945 1102073 1071376 1048394 1027061 997806
13592 997806 960043 926691 899778 886575 870713 857135 845515 834692 816806 790089 766686
13581 766686 747540 730278 712553 690400 669698 649809 640009 628808 619359 610409 596940 591268
13569 591268 591429 582741 575286 567404 559120 548497 540712 531170 530147 528855 525203 517509 510042 508718
$$ packed form
13644E187076j94629j92725j92683j68457j51690j29857j09247j13329j22219
13635C812240j37398j52683j50211j28133r9738r5849j09352j18632j27822j23323
13625B569099j02067q8102p5627o6263n3232n5474n4025m6257o2000o2507n1858
13614A851687n0672n3337m3499m6995n5199n0422n2589l5700l0482l8146l7934
13603A356712l0669k6867k7862l6406m7662m3301m1872l0697k2982k1333k9255
13592I97806l7763l3352k6913j3203j5862j3578j1620j0823j7886k6717k3403
13581G66686j9146j7262j7725k2153k0702j9889r800j1201r449q950j3469n672
13569E91268J61q688p455p882q284j0623p785r542j023j292l652p694p467j324
$$ plain form
13555 508718 522991 543589 569346 573426 513657 448398 408428 380888 370827 356443 348444 340894
13543 340894 336560 327550 325567 324672 321273 305137 290012 271548 244115 218504 201370 186504 180182
13530 180182 184364 192048 188209 182274 183764 198132 193014 183760 176147 180198 181101 168150 153480 141909
13516 141909 136366 136363 139150 142274 143720 146715 153310 161863 167275 171172 173431 177277 173842 172425 168977
13501 168977 161695 150205 144137 149145 151553 151706 151283 158985 179574 180163 162590 151829 142352 136779
13487 136779 133776 130636 118417 105472 96495 95396 94727 94632 99999 103087 107884 108987 117859 114745
13473 114745 102511 94523 84965 76184 79468 86522 89899 95780 100552 94480 86249 84304 84780 83760
13459 83760 81656 80863 81953 85122 85527 79283 66440 59558 56573 58598 60817 58479 55441 56624 51135
$$ packed form
13555E08718J4273K0598K5757M080n9769o5259l9970k7540j0061j4384p999p550
13543C40894m334r010j983q95l399j6136j5125j8464k7433k5611j7134j4866o322
13530A80182M182P684l839n935J490J4368n118r254p613M051R03j2951j4670j1571
13516A41909n543lK787L124J446K995O595Q553N412L897K259L846l435j417l448
13501A68977p282j1490o068N008K408J53m23P702K0589N89j7573j0761r477n573
13487A36779l003l140j2219j2945q977j099o69r5N367L088M797J103Q872l114
13473A14745j2234p988r558q781L284P054L377N881M772o072q231j945M76j020
13459H3760k104p93J090L169M05o244j2843o882k985K025K219k338l038J183n489
$$ plain form
13444 51135 49100 54418 74151 90383 96742 99503 107061 116481 124479 123308 119317 121346 130024 145594
13430 145594 155088 149381 130798 116387 102494 100417 102634 97552 92270 87226 79700 71811 77350
13417 77350 72564 65151 59552 54646 52567 48130 40191 37888 35595 37247 39494 42565 42479 41000 41805
13402 41805 38632 31903 27871 34516 35081 40451 50706 50379 45581 39045 45211 47231 46838 43836 49792
13387 49792 63260 64908 58880 62301 61883 59088 50101 41212 42669 50131 58282 75933 92014 111302
13373 111302 146677 177814 183136 153458 105992 44829 1268 -13719 -15608 -17464 -19445 -13605
13361 -13605 -2395 -1037 -5104 -6707 -7380 -11722 -15648 -14604 -18678 -26271 -24819 -24984 -20865 -10582
13347 -10582 -7286 -6085 -3997 -4064 -6382 -4482 -1666 -970 -4203 -5930 -7958 -10938 -13500 -10175 -5927
$$ packed form
13444E1135k035N318J9733J6232O359K761P558R420P998j171l991K029Q678J5570
13430A45594R494n707j8583j4411j3893k077K217n082n282n044p526p889N539
13417G7350m786p413n599m906k079m437p939k303k293J652K247L071q6j479Q05
13402D1805l173o729m032O645N65N370J0255l27m798o536O166K020l93l002N956
13387D9792J3468J648o028L421m18k795q987q889J457P462Q151J7651J6081J9288
13373A11302L5375L1137N322k9678m7466o1163m3561j4987j889j856j981N840
13361a3605J1210J358m067j603o73m342l926J044m074p593J452j65M119J0283
13347a0582L296J201K088o7k318J900K816O96l233j727k028k980k562L325M248
$$ plain form
13332 -5927 -5730 -3821 -6369 -7915 -5941 -2171 -460 -5352 -7734 -10185 -13982 -5435 -3888 -8906 -1667
13317 -1667 -2129 -846 -6046 -12549 -6898 950 3769 2926 2038 3130 4484 -3668 -13260 -14810 -16267
13302 -16267 -17521 -13938 -10621 -8108 -7974 518 7438 6503 -1830 -7987 -8060 -12084 -17111 -13577 -9060
13287 -9060 -5899 -2799 -5942 -7029 -1780 -5511 -13609 -16813 -18906 -19251 -19204 -18571 -10548 -9786 -15484 -15402
13271 -15402 -4550 -2200 -2731 -2453 -2746 -3009 -4348 -5600 -1937 -299 -2179 5225 3618 -5296 -4033
13256 -4033 -968 4674 9470 10691 9299 5841 4861 5811 6044 7256 8294 7176 491 -651 2364
13241 2364 36 -4561 -8922 -10443 -4285 8122 14897 18076 17385 14260 4211 -58 63 5296 9970
13226 9970 9025 -1254 -9135 -4330 4353 3838 0 -1937 8338 17682 20381 25413 28338 26663 27738
$$ packed form
13332e927J97J909k548j546J974L770J711m892k382k451l797Q547J547n018P239
13317a667m62J283n200o503N651P848K819q43q88J092J354q152r592j550j457
13302a6267j254L583L317K513J34Q492O920r35q333o157p3m024n027L534M517
13287i060L161L100l143j087N249l731q098l204k093l45M7O33Q023P62n698Q2
13271a5402J0852K350n31K78k93k63j339j252L663J638j880P404j607q914J263
13256d033L065N642M796J221j392l458r80R50K33J212J038j118o685j142L015
13241B364k328m597m361j521O158J2407O775L179o91l125j0049m269J21N233M674
13226I970r45j0279p881M805Q683n15l838j937J0275R344K699N032K925j675J075
$$ plain form
13211 27738 35440 44812 60141 75526 85161 101690 123764 146544 183822 241780 318216 450833
13199 450833 675276 1027338 1429641 1719857 1728970 1372225 926937 625530 450962 357862
13189 357862 294940 249814 214097 205164 220186 249778 283602 288396 258604 203731 153813 132964
13177 132964 125810 119221 111630 97069 78741 66181 59805 55612 52289 51005 43343 35562 33458
13164 33458 28348 27428 28508 26487 23828 24327 28614 26330 25022 18798 18232 19765 21393 25341 24218
13149 24218 18630 12534 8542 5675 3363 8198 6876 -454 -7027 -6000 1701 2877 1676 3173
13135 3173 15935 21611 10809 792 -3677 -3663 6883 12969 21629 26652 21734 19489 15715 17079
13121 17079 19747 32663 59279 89897 119712 134428 115846 75915 50033 35781 24483 18489
$$ packed form
13211B7738P702R372J5329J5385R635J6529K2074K2780L7278N7958P6436J32617
13199D50833K24443L52062M02303K90216R113l56745m45288l01407j74568r3100
13189C57862o2922m5126l5717q933J5022K9592L3824M794k9792n4873m9918k0849
13177A32964p154o589p591j4561j8328j2560o376m193l323j284p662p781k104
13164C3458n110r20J080k021k659M99M287k284j308o224n66J533J628L948j123
13149B4218n588o096l992k867k312M835j322p330o573J027P701J176j201J497
13135C173J2762N676j0802j0017m469J4J0546O086Q660N023m918k245l774J364
13121A7079K668J2916K6616L0618K9815J4716j8582l9931k5882j4252j1298n994
$$ plain form
13109 18489 13484 6129 5869 8261 11341 8153 10627 6350 8277 8781 7199 3808 1703 2275 2417
13094 2417 -1542 727 1036 1823 -2173 -4510 -613 3412 4046 6304 3349 6344 6619 6370 4441 4470
13078 4470 -2067 -88 7205 4684 228 -12 -4908 -1656 4154 7362 4754 3875 6114 2257 336
13063 336 -305 -1386 6138 4876 8674 6631 6581 5446 1706 2206 -2978 -8779 -7152 -2040 -1246 -832
13047 -832 -3810 -12094 -19664 -19760 -10582 -5207 -2968 -1425 -4670 -221 3247 3276 2900 2812 9632 10340 4817
13030 4817 2442 -731 -2392 -7173 -6098 -6766 -5173 -7750 -11397 -13161 -7150 -4258 -739 1088 -3481
13015 -3481 -2688 -9688 -16290 -16247 -13658 -14128 -7348 479 -2827 -1360 2701 5590 -274 -3128 -1382 -90
12999 -90 2730 895 3306 1176 -5697 -4858 -6104 -12593 -8544 -7087 -8634 -12516 -16036 -11113 -8823
$$ packed form
13109A8489n005p355k60K392L080l188K474m277J927N04j582l391k105N72J42
13094B417l959K269L09P87l996k337L897M025O34K258k955K995K75k49j929K9
13078D470o537J979P293k521m456k40m896L252N810L208k608q79K239l857j921
13063C36o41j081P524j262L798k043n0j135l740N00n184n801J627N112P94M14
13047h32k978q284p570r6R178N375K239J543l245M449L468K9l76q8O820P08n523
13030D817k375l173j661m781J075o68J593k577l647j764O011K892L519J827m569
13015c481P93p000o602M3K589m70O780P827l306J467M061K889n864k854J746J292
12999i0K820j835K411k130o873Q39j246o489M049J457j547l882l520M923K290
$$ plain form
12984 -8823 -8022 -5909 -7179 -7990 -4447 534 372 -3267 -768 -3918 -5001 -8556 -14068 -17740 -14173
12969 -14173 -11632 -14371 -18272 -14163 -12510 -9358 -7747 -11077 -10281 -11913 -11296 -10271 -11159 -11810 -11347 -9232
12953 -9232 -5374 3331 6657 4113 4629 1024 -8725 -8264 -3712 -3275 -2528 -3368 -6725 -5270 -5035 -4379
12937 -4379 6092 5365 -4854 -1301 9971 8445 -3674 -8646 -10253 -9013 -8189 -7501 -8241 -14334 -9364
12922 -9364 -4274 -7603 -2170 800 -1296 -7162 -13876 -7919 -8237 -14831 -14803 -15140 -7778 -564 570 -3166
12906 -3166 -8767 -11664 -12474 -8002 -6826 -12975 -8385 -824 0 1355 -1168 -1090 1381 2639 6021 4014
12890 4014 -4381 -8147 -6646 -8882 -10693 -15070 -6551 -1300 -8447 -14541 -14966 -10343 -4448 -59 -326
12875 -326 -5850 -14969 -12887 -4778 -9774 -18572 -21376 -24274 -12596 -794 778 3166 5912 2435
$$ packed form
12984h823Q01K113j270q11L543M981j62l639K499l150j083l555n512l672L567
12969a4173K541k739l901M109J653L152J611l330P96j632O17J025q88o51M63K115
12953i232L858Q705L326k544N16l605r749M61M552M37P47q40l357J455K35O56
12937d379J0471p27j0219L553J1272j526j2119m972j607J240Q24O88p40o093M970
12922i364N090l329N433K970k096n866o714N957l18o594K8l37P362P214J134l736
12906c166n601k897q10M472J176o149M590P561Q24J355k523P8K471J258L382k007
12890D014q395l766J501k236j811m377Q519N251p147o094m25M623N895M389k67
12875c26n524r119K082Q109m996q798k804k898J1678J1802J572K388K746l477
$$ plain form
12861 2435 1585 -439 -5871 -11772 -16125 -15286 -11800 -7898 -6860 -3029 -7425 -7610 -5289 -3847 -3013 -5695
12845 -5695 -7240 -7212 -10424 -8680 -4481 984 6490 4884 -2331 -971 714 4023 5254 1901 2508
12830 2508 5283 -3248 -7306 -9391 -2583 -4926 -8827 -13114 -12973 -1320 1994 7025 5728 6882 2184
12815 2184 -6328 -12237 -13594 -11812 -5840 -8124 -4529 -2328 -9616 -13420 -11741 -10607 689 -1901
12801 -1901 -5245 -12287 -6398 -987 -1582 -5286 -8971 -14912 -21349 -21536 -12793 -12943 -18335 -20633 -18639
12786 -18639 -20456 -22691 -21200 -13578 -12032 -13816 -12709 -11154 -9986 -8524 -5724 -3657 -625 7358
12772 7358 1795 -2484 -4902 -865 -1309 -153 2222 733 -3651 -12413 -20122 -19315 -15524 -11618 -5431
12757 -5431 -9559 -9382 -15930 -18570 -16965 -13514 -13512 -16644 -16943 -12416 -13142 -13592 -12466 -4142 -2294 -7130
$$ packed form
12861B435q50k024n432n901m353Q39L486L902J038L831m396j85K321J442Q34k682
12845e695j545K8l212J744M199N465N506j606p215J360J685L309J231l353O07
12830B508K775q531m058k085O808k343l901m287J41J1653L314N031j297J154m698
12815B184q512n909j357J782N972k284L595K201p288l804J679J134J1296k590
12801a901l344p042N889N411n95l704l685n941o437j87Q743j50n392k298J994
12786a8639j817k235J491P622J546j784J107J555J168J462K800K067L032P983
12772G358n563m279k418M037m44J156K375j489m384q762p709Q07L791L906O187
12757e431m128J77o548k640J605L451Kl132k99M527p26m50J126Q324J848m836
$$ plain form
12741 -7130 -9339 -12523 -17392 -16878 -11590 -9031 -12705 -10454 -7224 -7063 -9833 -17394 -19269 -6793 3378
12726 3378 7293 5535 7998 7571 3847 2973 4275 5748 7057 -592 -1492 -2375 -7555 -5675 -2368 -88
12710 -88 2696 -2171 -7993 -7432 -5544 -7376 -9874 -10433 -8417 -3148 -7770 -12129 -17658 -24173 -19893 -12762
12694 -12762 -8671 -12670 -5559 -2770 -3827 -3673 -4032 -13502 -9044 -10175 -9590 -9573 -8445 -4147 -6143 -11269
12678 -11269 -11783 -9794 -8658 -11981 -13913 -6957 -2635 -4509 -6587 -7870 -8694 -9999 -7286 -6275 -10171
12663 -10171 -7596 -8628 499 4947 1690 796 -682 2621 10556 11850 4797 1352 -1361 -8483 -14525
12648 -14525 -14177 -9152 -11996 -5788 486 4393 9849 10940 4763 -2691 -10921 -14034 -11290 -2987 578
12633 578 -6756 -7081 -8966 -9203 -13930 -15597 -12105 -3507 1241 -2289 -5706 -8796 -6603 -493 1209
$$ packed form
12741g130k209l184m869N14N288K559l674K251L230J61k770p561j875J2476J0171
12726C378L915j758K463m27l724q74J302J473J309p649r00q83n180J880L307K280
12710h8K784m867n822N61J888j832k498n59K016N269m622m359n529o515M280P131
12694a2762M091l999P111K789j057J54l59r470M458j131N85J7J128M298j996n126
12678a1269n14J989J136l323j932O956M322j874k078j283q24j305K713J011l896
12663a0171K575j032R127M448l257q94j478L303P935J294p053l445k713p122o042
12648a4525L48N025k844O208O274L907N456J091o177p454q230l113K744Q303L565
12633E78p334l25j885k37m727j667L492Q598M748l530l417l090K193O110J702
$$ plain form
12618 1209 -229 -2827 -329 4159 5481 1890 -1662 -3672 -2955 -7694 -7469 -11058 -18488 -24927 -14785
12603 -14785 -8399 -5171 -3425 -7667 -2686 2292 -757 -3728 5210 2884 2355 -2856 -6955 -7586 -3208
12588 -3208 1712 6668 5306 -1358 -6642 -9365 -11935 -16152 -17648 -8140 1895 4915 -1319 -1129 -3080
12573 -3080 -8423 -6221 -5059 -7837 -2406 -4395 -8777 -7561 -5962 -532 5021 1480 430 -6902 -11626
12558 -11626 -17379 -16989 -20958 -15362 -8471 -8807 -11576 -9508 -10350 -8020 -11896 -12659 -6507 -7566 -4883
12543 -4883 -8586 -14752 -15721 -8820 -11828 -16900 -17604 -17298 -12623 830 9406 9253 6502 2267 129
12528 129 3361 9525 13735 18918 18586 15780 6998 7594 13353 16521 9585 8320 11087 7432 9727
12513 9727 9470 6939 7814 14252 22380 28416 29869 27234 21441 12697 3364 1002 -218 -3982 1975
$$ packed form
12618A209j438k598K498M488J322l591l552k010P17m739K25l589p430o439J0142
12603a4785O386L228J746m242M981M978l049k971Q938k326n29n211m099o31M378
12588c208M920M956j362o664n284k723k570m217j496R508J0035L020o234J90j951
12573c080n343K202J162k778N431j989m382J216J599N430N553l541j050p332m724
12558a1626n753L90l969N596O891l36k769K068q42K330l876p63O152j059K683
12543d883l703o166r69O901l008n072p04L06M675J3453Q576j53k751m235k138
12528A29L232O164M210N183l32k806q782N96N759L168o936j265K767l655K295
12513I727k57k531Q75O438Q128O036J453k635n793q744r333k362j220l764N957
$$ plain form
12498 1975 -291 592 3805 3559 1182 589 -1531 -4731 -4685 -4812 -5679 -6184 -698 2450 4702 6839 8086
12481 8086 6566 7124 6295 2131 -4669 -8744 -6547 -4999 -139 -521 -6272 -7681 -8090 -16105 -11441 -6435
12465 -6435 -8444 -3526 -2279 2368 4813 1224 -7469 -6389 -3154 -2204 1227 -1318 1840 -1094 3583
12450 3583 1234 -643 1972 2248 -2879 -5268 -4559 -2455 -1544 -2847 -4210 -86 2334 -3369 -8773
12435 -8773 -4339 5694 8130 6927 5847 594 -4241 -6131 -3120 -3229 -2891 2941 -4119 -8337 4090
12420 4090 4377 6813 7974 3811 -489 -9337 -13116 -10167 56 4437 -2820 -3696 -325 -5353 -13425
12405 -13425 -13766 -12198 -12785 -9689 -1294 -5864 -7320 -3920 -6603 -886 2053 -2588 -7342 -8933 -12080
12390 -12080 -12463 -6832 -9435 -10992 -15395 -16036 -13564 -7916 -9786 -12825 -11063 -16399 -14131 -8427 -13412
$$ packed form
12498A975k266Q83L213k46k377n93k120l200M6j27q67n05N486L148K252K137J247
12481H086j520N58q29m164o800m075K197J548M860l82n751j409m09q015M664N006
12465f435k009M918J247M647K445l589q693J080L235R50L431k545L158k934M677
12450C583k349j877K615K76n127k389P09K104R11j303j363M124K420n703n404
12435h773M434J0033K436j203j080n253m835j890L011j09L38N832p060m218J2427
12420D090K87K436J161m163m300q848l779K949J0223M381p257q76L371n028q072
12405a3425l41J568n87L096Q395m570j456L400k683N717K939m641m754j591l147
12390a2080l83N631k603j557m403o41K472N648j870l039J762n336K268N704m985
$$ plain form
12375 -13412 -18110 -22892 -9668 -4738 -9855 -9042 -863 2800 903 -1869 453 -3343 -6425 -2568
12361 -2568 -7452 -8766 -6332 -1514 -551 4655 7367 5292 -4323 -6666 -4876 -921 -3195 -13006 -9495
12346 -9495 -11989 -9962 -8778 -11277 -15502 -13137 -5014 2614 -1885 2187 5987 7719 6705 2747 -2835
12331 -2835 -14082 -12790 -9285 -9264 -18242 -16452 -8539 -5117 -4271 -2443 -2059 -5361 -8295 -5264 -2381
12316 -2381 -42 2723 -6765 -11093 -5687 -11172 -15047 -19789 -20943 -16587 -17620 -14347 -10117 -9739 -10840
12301 -10840 -3918 2031 222 -3831 -4106 3677 2561 -566 -5840 -10761 -10528 -5533 -9755 -10541 -9344
12286 -9344 -6820 -3495 -2649 -7332 -10206 -10363 -8415 552 2726 -1945 -2706 -6668 -7371 -4357 -1801 -3536
12270 -3536 -3218 7327 10333 8811 3465 222 -6204 -8856 -6273 -2814 -3873 5976 7273 -455 -1164
$$ packed form
12375a3412m698m782J3224M930n117Q13Q179L663j897k772K322l796l082L857
12361b568m884j314K434M818R63N206K712k075r615k343J790L955k274r811L511
12346i495k494K027J184k499m225K365Q123P628m499M072L800J732j014l958n582
12331b835j1247J292L505K1q978J790P913L422Q46J828L84l302k934L031K883
12316b381K339K765r488m328N406n485l875m742j154M356j033L273M230L78j101
12301a0840O922N949j809m053k75P783j116l127n274m921K33M995m222p86J197
12286i344K524L325Q46m683k874j57J948Q967K174m671p61l962p03L014K556j735
12270c536L18J0545L006j522n346l243o426k652K583L459j059R849J297p728p09
$$ plain form
12255 -1164 2278 -405 -6769 -6857 -7190 -8236 -7309 -8642 -15240 -16592 -18645 -17123 -16782 -13586 -11454 -3981
12239 -3981 2611 707 -4549 -3905 -9609 -10975 -9592 -11546 -5781 -866 -3650 -4017 -3978 -5869 -5226 -4523
12223 -4523 -10411 -15610 -12659 -1641 -329 -4921 -9143 -10723 -13084 -11308 -4260 -2118 2618 2109 4671
12208 4671 4414 -6581 -4249 -5425 -20340 -20705 -12541 -7717 -6083 -1632 1507 7297 4041 -4932 -7149
12193 -7149 -4386 2291 3482 2050 919 -3597 -10869 -9567 -5987 -4897 943 -1103 -4163 -1231 5221
12178 5221 4476 2408 3600 6090 3799 -4830 -12213 -7757 -8845 -6159 -607 2971 298 -1643 702
12163 702 2912 4040 332 3615 3807 1624 -1963 -5203 -5203 -2870 -2306 -1453 -6688 -7373 -4241 -5066 -8441
12146 -8441 -4491 2218 16 -1118 -2381 -3699 -3071 2739 2393 -1183 -6138 -9647 -12629 -16290 -1773
$$ packed form
12255a164L442k683o364q8l33j046R27j333o598j352k053J522L41L196K132P473
12239c981O592j904n256O44n704j366J383j954N765M915k784l67L9j891O43P03
12223d523n888n199K951J1018J312m592m222j580k361J776P048K142M736n09K562
12208D671k57j0995K332j176j4915l65Q164M824J634M451L139N790l256q973k217
12193g149K763O677J191j432j131m516p272J302L580J090N840k046l060K932O452
12178E221p45k068J192K490k291q629p383M456j088K686N552L578k673j941K345
12163G02K210J128l708L283J92k183l587l240%K333N64Q53n235o85L132q25l375
12146h441L950O709k202j134j263j318O28N810l46l576m955l509k982l661J4517
$$ plain form
12131 -1773 872 -2848 -4015 -583 1526 -429 -4589 -10911 -10291 -12622 -13167 -9845 -8507 -2786 -2440
12116 -2440 1196 -4787 -8660 -9755 -9556 -7237 -13706 -13562 -9478 -3556 -6518 -12400 -12722 -11203 -11930 -17755
12100 -17755 -21147 -18181 -14890 -14185 -9847 -5708 -8836 -11547 -7881 -3969 5197 7645 2880 2971 5154
12085 5154 86 -5163 -8583 -9594 -6603 -2014 -292 -5612 -4015 -5312 -6044 -13301 -16883 -12928 -8497
12070 -8497 -15065 -23836 -19990 -8952 -7623 -6404 -5967 -7145 -9651 -10448 -8938 -9986 -9996 -4391 -1311
12055 -1311 975 3780 3898 5573 3747 8613 8336 7466 4331 -3685 -5767 -3456 -3412 -1093 911 -3016
12039 -3016 423 5306 3012 -1964 -10157 -9243 -4810 -4264 -3636 -5875 -1080 7650 4519 -6111 -1594
12024 -1594 -1414 -4943 -921 -372 -5750 -10525 -9002 -8626 -12235 -7619 -1928 -5254 -4750 -5481 -7088 -2964
$$ packed form
12131a773K645l720j167L432K109j955m160o322O20k331n45L322J338N721L46
12116b440L636n983l873j095J99K319o469J44M084N922k962n882l22J519p27n825
12100a7755l392K966L291P05M338M139l128k711L666L912R166K448m765R1K183
12085E154n068n249l420j011K991M589J722n320J597j297p32p257l582L955M431
12070h497o568q771L846J1038J329J219M37j178k506p97J510j048j0N605L080
12055a311K286K805J18J675j826M866k77q70l135q016k082K311M4K319K004l927
12039c016L439M883k294m976q193R14M433N46O28k239M795Q730l131j0630M517
12024a594J80l529M022N49n378m775J523L76l609M616N691l326N04p31j607M124
$$ plain form
12008 -2964 3625 4035 4266 4655 3666 -2420 -729 833 -2592 -6953 -5982 -4722 -8877 -9101 -14541 -11473
11992 -11473 -4169 -7462 -14310 -10751 -8406 -14483 -17511 -7323 -5804 -10060 -6497 5523 11877 8860
11978 8860 3071 1388 -5487 -9190 -10869 -7028 -4152 -5272 -294 1179 30 -11016 -20696 -24204
11964 -24204 -25879 -26313 -20307 -14328 -12419 -6541 -1414 -752 -3604 -1255 -3283 -3558 -3080 -7675 -10258
11949 -10258 -7774 -2717 -148 -1688 3207 1281 -2378 -5688 1306 1422 -1630 -3227 -1355 -934 856
11934 856 2970 1085 6003 9641 7378 -1807 -12286 -11806 -10354 -6786 -9235 -9324 -8428 -10606 -9006 353
11918 353 -2464 -1324 -2316 -6015 -6231 1083 -1152 -488 3491 -548 -1857 -6320 -5212 -1405 -1397 -2489
11902 -2489 -7040 -11230 -7391 -4283 -3376 -1667 -3270 -4567 -7623 -558 5322 -1070 -1691 -375 -4518
$$ packed form
12008b964O589M10K31L89r89o086J691J562l425m361R71J260m155k24n440L068
11992a1473P304l293o848L559K345o077l028J0188J519m256L563J2020O354l017
11978H860n789j683o875l703j679L841K876j120M978J473j149j1046r680l508
11964b4204j675m34O006N979J909N878N127O62k852K349k028k75M78m595k583
11949a0258K484N057K569j540M895j926l659l310O994J16l052j597J872M21J790
11934H56K114j885M918L638k263r185j0479M80J452L568k449q9Q96k178J600R359
11918C53k817J140r92l699k16P314k235O64L979m039j309m463J108L807Qj092
11902b489m551m190L839L108R07J709j603j297l056P065N880o392o21J316m143
$$ plain form
11887 -4518 -7689 -4055 -3651 -7899 -6540 -13440 -19347 -17388 -16842 -12312 -11715 -18194 -16638 -15150 -11524
11872 -11524 -6604 -11730 -14728 -13459 -16953 -10857 -4714 -2234 -845 956 882 -3098 -8521 -6120 1993
11857 1993 -2483 -2882 2386 1332 -2326 1798 2836 -1973 -127 -1696 -7555 -11064 -5752 321 2293
11842 2293 601 -3602 -2274 -18 -4386 -3748 -4330 -6692 -8703 -8200 -3795 -2775 -5401 -3032 -803
11827 -803 4192 9866 8495 4929 5871 9340 13256 9088 1932 -4265 -1784 545 -7536 -13119 -6094
11812 -6094 2138 -671 -3543 -6607 -10917 -11053 -16622 -21270 -21448 -18782 -14910 -10951 -4886 -4680 1089
11797 1089 9426 6018 -271 2700 5643 -413 1416 1818 4783 1612 503 -1185 1697 1841 -952
11782 -952 -5212 -5466 -9488 -9652 -6703 -8984 -10742 -10238 -10379 -12000 -8270 -5538 -6508 -3759 259 372
$$ packed form
11887d518l171L634M04m248J359o900n907J959N46M530N97o479J556J488L626
11872a1524M920n126k998J269l494O096O143K480J389J801p4l980n423K401Q113
11857A993m476l99N268j054l658M124J038m809J846j569n859l509N312O073J972
11842B293j692m203J328K256m368O38n82k362k011N03M405J020k626K369K229
11827h03M995N674j371l566R42L469L916m168p156o197K481K329q081n583P025
11812f094Q232k809k872l064m310j36n569m648j78K666L872L959O065K06N769
11797A089Q337l408o289K971K943o056J829M02K965l171j109j688K882J44k793
11782i52m260k54m022j64K949k281j758N04j41j621L730K732r70K749M018J13
$$ plain form
11766 372 3203 9482 5332 2598 10200 8867 4452 2039 -1266 4645 -1543 -161 -3158 -2373 -5110
11751 -5110 -9887 -5625 -5879 -3808 -6014 -9641 -4737 3003 4010 4255 511 -1250 5830 9383 3350
11736 3350 382 -8354 -10193 -8963 -2409 -1646 -1507 -10893 -15952 -11576 -8905 -2374 1667 663 4174
11721 4174 2892 6818 5765 3114 -557 -3589 2743 4415 -1268 349 -2254 -4820 -3659 -582 -2256
11706 -2256 -4286 -3167 -7401 -8601 -7353 -10375 -8878 -4461 -4749 -7024 -5562 -392 350 -2380 -3770
11691 -3770 -1263 -3548 -2768 -5555 -5992 -4905 363 1801 -898 -6809 -11105 -12026 -8083 2143 2001
11676 2001 -2806 -4111 -5611 -6011 -3128 2749 8450 6068 5898 7918 3230 5166 6350 7347 7267 -1245
11660 -1245 -2031 2356 560 -4226 -6300 291 6802 1772 1182 -95 -324 -273 -2754 -920 -4264 -6034
$$ packed form
11766C72K831O279m150k734P602j333m415k413l305N911o188J382k997P85k737
11751e110m777M262k54K071k206l627M904P740J007K45l744j761P080L553o033
11736C350k968q736j839J230O554P63J39r386n059M376K671O531M041j004L511
11721D174j282L926j053k651l671l032O332J672n683J617k603k566J161L077j674
11706b256k030J119m234j200J248l022J497M417k88k275J462N170P42k730j390
11691c770K507k285P80k787m37J087N268J438k699n911m296r21L943J0226j42
11676B001m807j305j500m00K883N877N701k382j70K020m688J936J184R97q0q512
11660a245p86M387j796m786k074O591O511n030n90j277k29N1k481J834l344j770
$$ plain form
11644 -6034 -2670 -5274 -9699 -10974 -5935 1121 -697 73 -1539 -46 1645 -7133 -15323 -17586 -14822
11629 -14822 -13738 -8272 -11588 -13724 -14214 -7362 -3006 -4283 -4387 2181 4362 6437 2423 5880 2799
11614 2799 -1937 3460 1239 1063 7268 4136 -4921 -2804 583 4257 8033 3802 -649 -1179 1740
11599 1740 -1417 -5324 -12726 -8081 -4456 -5621 -9741 -9971 -9056 -8057 -10721 -7457 -4104 -6919 -12875
11584 -12875 -9077 -1751 7451 24389 18253 10776 6231 8286 6658 -87 -1991 -3177 2380 -5464
11570 -5464 -8782 -6024 -3053 -1670 515 -3449 -10320 -16580 -7194 -10300 -16534 -14584 -15380 -9465 -1863
11555 -1863 2081 8040 3408 -1626 -6085 -7533 -6098 -1726 3206 2900 669 7093 4962 -1597 -8131
11540 -8131 -8901 -730 1348 -2808 -3908 -6288 -4960 -5754 -10651 -12043 -5153 771 1335 -3001 -830
$$ packed form
11644f034L364k604m425j275N039P056j818P70j612J493J691q778q190k263K764
11629a4822J084N466l316k136m90O852M356j277j04O568K181K075m014L457l081
11614B799m736N397k221j76O205l132r057K117L387L674L776m231m451n30K919
11599A740l157l907p402M645L625j165m120k30R15R99k664L264L353k815n956
11584a2875L798P326R202J6938o136p477m545K055j628o745j904j186N557p844
11570e464l318K758K971J383K185l964o871o260R386l106o234J950p96N915P602
11555a863L944N959m632n034m459j448J435M372M932l06k231O424k131o559o534
11540h131p70Q171K078m156j100k380J328p94m897j392O890N924N64m336K171
$$ plain form
11525 -830 3151 11120 9917 584 -2516 -3662 -6689 -9490 -8112 -5891 -706 808 1358 2867 7919
11510 7919 6072 2639 -3104 -5270 -766 -5367 -6559 -3881 1447 812 -5776 -2484 -2087 -709 5696
11495 5696 1060 -3205 -6549 -11379 -8087 -4117 -1910 -6775 -10498 -7967 2398 3923 -3664 -6570
11481 -6570 -8694 -12356 -5919 1401 -4049 -10849 -10847 -5388 -6621 -9280 -7751 -9559 -12133 -10347 -4870
11466 -4870 -500 -2983 -1892 -4936 -6258 -8579 -5084 2436 11574 6215 -1245 -1585 -3050 3447 8902
11451 8902 6822 4221 2025 -4019 -9036 -5654 -2063 -4445 -1746 -862 1863 1000 2108 6782 6523
11436 6523 6301 4239 4526 1136 -1674 -1164 -1514 -785 -3157 -11751 -5898 -1453 -4222 -383 4319 5329
11420 5329 -2465 -2262 -1244 -8063 -6412 -6561 -2506 -3172 -7849 -6825 -8656 -3245 5107 3985 1422
$$ packed form
11525h30L981P969j203r333l100j146l027k801J378K221N185J514N50J509N052
11510G919j847l433n743k166M504m601j192K678N328o35o588L292L97J378O405
11495E696m636m265l344m830L292L970K207m865l723K531J0365J525p587k906
11481f570k124l662O437P320n450o800KN459j233k659J529j808k574J786N477
11466d870M370k483J091l044j322k321L495P520R138n359p460l40j465O497N455
11451H902k080k601k196o044n017L382L591k382K699Q84K725q63J108M674k59
11436F523k22k062K87l390k810N10l50P29k372q594N853M445k769L839M702J010
11420E329p794K03J018o819J651j49M055o66m677J024j831N411Q352j122k563
$$ plain form
11405 1422 5283 1893 -807 -6264 -10780 -14130 -11202 -7111 -6115 -6068 -6163 -7196 -10498 -15839 -14230 -10924
11389 -10924 -11622 -12348 -6207 -10682 -12056 -11558 -8581 -3312 -7334 -10295 -11024 -9199 -8563 -7362 -4780 -7018
11373 -7018 -14886 -11935 -8632 -10722 -9326 -9098 -4408 -10309 -15599 -15929 -14318 -13938 -7166 7141 9410
11358 9410 7310 -3966 -13158 -11960 -10015 -5271 -775 -1057 60 3414 473 2712 2478 932 -6149
11343 -6149 -7207 -7693 -8741 -9083 -3572 -5841 -2625 -1445 -2572 -688 2801 159 -864 1262 -4584
11328 -4584 -2414 -7864 -7926 -1900 636 3097 123 -507 -4427 -2200 -3303 -1797 2745 -1944 -6704
11313 -6704 -2336 194 699 1755 1489 3179 4094 2560 -469 -512 5374 -1251 -2485 3566 3969 6774
11297 6774 7136 -296 -4751 -5749 -1606 5617 -86 -3670 285 6035 4871 6566 8056 9556 9748
$$ packed form
11405A422L861l390k700n457m516l350K928M091R96M7r5j033l302n341J609L306
11389a0924o98p26O141m475j374M98K977N269m022k961p29J825O36J201K582k238
11373g018p868K951L303k090J396K28M690n901n290l30J611L80O772J4307K269
11358I410k100j1276r192J198J945M744M496k82J117L354k941K239k34j546p081
11343f149j058m86j048l42N511k269L216J180j127J884L489k642j023K126n846
11328d584K170n450o2O026K536K461k974o30l920K227j103J506M542m689m760
11313f704M368K530N05J056k66J690R15j534l029m3N886o625j234O051M03K805
11297F774L62p432m455r98M143P223n703l584L955N750j164J695J490J500J92
$$ plain form
11282 9748 3816 1339 1757 2355 1985 6714 3528 3482 9220 5935 164 -3148 -6167 -6517 -6408 -8201
11266 -8201 -3901 -1649 1511 -463 -3158 -2310 -2748 189 175 -2024 -2321 -2834 -13450 -18730 -16285 -13884
11250 -13884 -1827 2918 379 -2016 -5632 -4853 -2205 8527 9830 3197 -3868 -3691 -4954 -2878
11236 -2878 -860 3406 5469 5220 266 -1664 1566 1709 -134 -4746 -12447 -11719 -12805 -16343 -12972
11221 -12972 -7039 196 4230 4873 9264 14458 12677 10221 6244 9646 12349 7557 3694 1328 2419
11206 2419 6901 6135 2441 6256 7907 9423 12735 29881 59648 83860 99198 102753 79545 51916
11192 51916 38523 23994 21172 23341 17770 12483 7780 7637 2138 3943 7006 5796 5443 -657
11178 -657 -1877 -5090 -3822 1100 6247 5349 4560 9149 4165 -1797 -7319 -1962 6848 4805 8110
$$ packed form
11282I748n932k477M18N98l70M729l186m6N738l285n771l312l019l50J09j793
11266h201M300K252L160j974k695Q48m38K937j4k199k97n13j0616n280K445K401
11250a3884J2057M745k539k395l616P79K648J0732J303o633p065J77j263K076
11236b878K018M266K063k49m954j930L230J43j843m612p701P28j086l538L371
11221a2972N933P235M034O43M391N194j781k456l977L402K703m792l863k366J091
11206B419M482p66l694L815J651J516L312J7146K9767K4212J5338L555k3208k7629
11192E1916j3393j4529k822K169n571n287m703j43n499J805L063j210l53o100
11178f57j220l213J268M922N147q98p89M589m984n962n522N357Q810k043L305
$$ plain form
11163 8110 7451 5178 3260 3599 4531 -1163 -4542 -8483 -8054 -6641 -7336 -8558 -8158 -16647 -18697 -12826
11147 -12826 -9668 -6423 -1943 3433 4607 7191 8086 6307 -3146 -6087 -4927 -2025 -6857 -3046 4727
11132 4727 6793 3668 1345 5593 5514 6106 4437 -3688 -4917 -6211 -3533 -2037 -5288 -12006 -13746
11117 -13746 -14014 -11076 -6359 -3604 2161 8216 2596 -2572 1215 5106 2201 -8527 -8964 -11842 -18454
11102 -18454 -17444 -15933 -11408 -3759 -4527 -5308 -5774 -10097 -1529 -1677 -6245 -9998 -9528 -11466 -14044 -14875
11086 -14875 -9133 -6503 -147 -922 -7181 -6635 -2557 -2479 -4242 -6527 -4601 -6888 -6996 -4534 1895 6322
11070 6322 5698 4878 9947 7163 1317 1882 756 1201 -1638 -7635 -15793 -12456 -6878 -5842 -3602 1104
11054 1104 4637 7268 8756 20064 29628 24378 18871 19814 19616 13753 8499 -2160 -3007 -129 1308
$$ packed form
11163H110o59k273j918L39R32n694l379l941M29J413o95j222M00q489k050N871
11147a2826L158L245M480N376J174K584Q95j779r453k941J160K902m832L811P773
11132D727K066l125k323M248p9N92j669q125j229j294K678J496l251o718j740
11117a3746k68K938M717K755N765O055n620n168L787L891k905j0728m37k878o612
11102a8454J010J511M525P649p68p81m66m323Q568j48m568l753M70j938k578q31
11086a4875N742K630O356p75o259N46M078P8j763k285J926k287j08K462O429M427
11070F322o24q20N069k784n846N65j126M45k839n997q158L337N578J036K240M706
11054A104L533K631J488J1308R564n250n507R43j98n863n254j0659q47K878J437
$$ plain form
11039 1308 -1295 1063 3121 1923 -4180 -5678 3774 5278 1329 -131 -622 -970 -2465 -2121 -374
11024 -374 -1266 -3136 -5513 -1813 -490 6171 7570 9111 3323 4032 959 -1140 -1155 -206 -1948 -3846
11008 -3846 -9516 -5871 -5671 -7109 -9370 -6802 1018 4580 1511 -2864 -6584 -10878 -12966 -8357 -668
10993 -668 3452 3334 -2719 -9554 -7790 -2273 1923 -387 -1953 28 -6663 -6900 719 6746 6102 10159
10977 10159 13977 10257 1764 3270 2139 3160 -1735 -824 5268 7510 3050 -2136 -5821 155 6061
10962 6061 7853 11924 9563 14243 16636 11379 7839 6982 4302 -541 1960 3153 1096 6549 10830
10947 10830 9157 10792 9243 7633 7304 11596 15136 15810 13095 12841 15149 9876 3010 -307 -7609
10932 -7609 -7961 -1770 -2340 2190 10522 13998 14365 10864 12967 22019 25967 24712 16176 19656 19974 14827
$$ packed form
11039A308k603K358K058j198o103j498R452J504l949j460m91l48j495L44J747
11024c74q92j870k377L700J323O661J399J541n788P09l073k099j5R49j742j898
11008c846n670L645K00j438k261K568P820L562l069m375l720m294k088M609P689
10993f68M120j18o053o835J764N517M196k310j566J981o691k37P619O027o44M057
10977A0159L818l720q493J506j131J021m895R11O092K242m460n186l685N976N906
10962F061J792M071k361M680K393n257l540q57k680m843K501J193k057N453M281
10947A0830j673J635j549j610l29M292L540O74k715k54K308n273o866l317p302
10932g609l52O191n70M530Q332L476L67l501K103R052L948j255q536L480L18n147
$$ plain form
10916 14827 8255 7791 11508 12092 13437 15298 11998 6624 3884 1416 2854 7052 17964 35435
10902 35435 40739 39709 40002 42002 35239 25988 21033 15999 20098 19228 20282 18268 17702 3647 758
10887 758 7359 16653 14642 12810 12275 11033 15607 21825 21537 23055 26022 23820 19179 15777 14990 13368
10871 13368 21972 22283 23152 23613 28467 29923 28055 35678 37466 29430 20187 11790 14111 22629 30606
10856 30606 32217 43611 45898 39390 33050 38346 50024 48955 50347 51958 61978 68514 65462 67669
10842 67669 66674 60376 56586 52927 59566 66207 72193 78017 87774 92682 91262 90012 92004 101937 108444
10827 108444 112320 120001 123676 134512 143067 153299 161992 178750 199563 210357 227013 254423
10815 254423 293833 347969 393395 436432 470672 485708 495217 528976 595004 675446 767677 885584
$$ packed form
10916A4827o572m64L717N84J345J861l300n374k740k468J438M198J0912J7471
10902C5435N304j030K93K000o763r251m955n034M099q70J054k014n66j4055k889
10887G58O601R294k011j832n35j242M574O218k88J518K967k202m641l402p87j622
10871A3368Q604L11Q69M61M854J456j868P623J788q036r243q397K321Q518P977
10856C0606J611J1394K287o508o340N296J1678j069J392J611J0020O536l052K207
10842F7669r95o298l790l659O639O641N986N824R757M908j420j250J992R933O507
10827A08444L876P681L675J0836Q555J0232Q693J6758K0813J0794J6656K7410
10815B54423L9410N4136M5426M3037L4240J5036R509L3759O6028Q0442R2231J17907
$$ plain form
10803 885584 1042093 1272380 1605022 2101091 2878495 4147513 6394838 10214486 14735945
10794 14735945 17933104 18061786 13563290 8647269 5694709 4037938 3027913 2369637
10786 2369637 1906707 1573992 1327209 1138573 985211 861103 774852 710641 653330 614787
10776 614787 596367 575224 550249 519037 479482 449628 425243 397741 370752 348359 332111
10765 332111 317562 300003 270372 259831 253402 244539 240032 233222 219439 212515 210113 209389 203280
10752 203280 196321 189362 177429 166199 162356 164742 160978 151129 147698 147404 141241 128873 122566 112868
10738 112868 101654 89054 93168 100055 100025 102635 99308 90005 85210 81265 78818 79769 75466 67989
10724 67989 67693 69912 70704 68770 63702 52500 53547 58256 59868 58965 57504 51383 45774 46474 50886
$$ packed form
10803H85584J56509K30287L32642M96069P77404J269018K247325L819648M521459
10794A4735945L197159J28682m498496m916021k952560j656771j010025o58276
10786B369637m62930l32715k46783j88636j53362j24108q6251o4211n7311l8543
10776F14787j8420k1143k4975l1212l9555k9854k4385k7502k6989k2393j6248
10765C32111j4549j7559k9631j0541o429q863m507o810j3783o924k402p24o109
10752B03280o959o959j1933j1230l843K386l764r849l431k94o163j2368o307r698
10738A12868j1214j2600M114O887l0K610l327r303m795l945k447R51m303p477
10724F7989k96K219P92j934n068j1202J047M709J612r03j461o121n609P00M412
$$ plain form
10709 50886 45867 39828 42663 38763 41609 43875 42172 31602 30620 32010 36313 34907 40283 35341
10695 35341 30358 31209 25411 22291 28202 30616 24724 24885 24901 34416 36825 27764 25737 25052 26367 31025
10679 31025 30398 26505 26248 20655 21220 22595 19405 22135 27656 29491 35671 43710 49280 47468 40394
10664 40394 41192 35364 34828 35689 31888 30719 30344 24246 18435 19903 21910 22068 16042 12383 13735 15536
10648 15536 12295 15390 19127 18638 15091 7307 5434 3957 4181 3748 1697 3340 13180 16354 12918
10633 12918 10290 11205 12227 14737 15672 14012 12596 8837 9348 10421 3155 -2313 5520 9220 5618
10618 5618 6131 6261 2061 -243 7812 16427 18407 11495 15946 18423 12976 16959 18097 14852 15131
10603 15131 7060 4804 6083 2570 1619 -1536 283 6204 13922 8262 2520 5670 3366 4206 9412
$$ packed form
10709E0886n019o039K835l900K846K266j703j0570r82J390M303j406N376m942
10695C5341m983Q51n798l120N911K414n892J61J6R515K409r061k027o85J315M658
10679C1025o27l893k57n593N65J375l190K730N521J835O180Q039N570j812p074
10664D0394P98n828n36Q61l801j169l75o098n811J468K007J58o026l659J352J801
10648A5536l241L095L737m89l547p784j873j477K24m33k051J643R840L174l436
10633A2918k628R15J022K510R35j660j416l759N11J073p266n468P833L700l602
10618E618N13J30m200k304Q055Q615J980o912M451K477n447L983J138l245K79
10603A5131q071k256J279l513r51l155J819N921P718n660n742L150k304Q40N206
$$ plain form
10588 9412 12380 6740 8582 12902 9118 6998 9531 11049 9308 11254 10538 5453 5010 3952 7223
10573 7223 9293 11273 11698 5835 7055 7497 10472 14433 8194 3479 -5255 -11172 -11214 -11512 -16666 -8195
10557 -8195 2483 -3307 -2565 3111 7274 12367 14113 13832 5487 4180 5662 1685 -2441 -1753 -4060
10542 -4060 -6622 -6444 -2507 5779 3800 488 966 -731 2899 -2653 -3635 2887 4546 44 258 4792
10526 4792 6191 3487 -4259 -265 -605 -1166 -4380 -1229 -2334 -1650 3880 1346 -303 -1914 2564
10511 2564 3360 1880 57 1163 1930 1382 -4168 -5628 2385 675 -486 9440 7416 9391 11680
10496 11680 8498 10308 9450 5403 -297 4765 5011 -2997 -7442 -887 4846 5085 6974 -852 6381
10481 6381 9351 7582 1538 4617 11261 13006 7106 2888 -2842 -4531 -1608 -4475 -6759 -9323 -10106
$$ packed form
10588I412K968n640J842M320l784k120K533J518j741J946p16n085m43j058L271
10573G223K070J980M25n863J220M42K975L961o239m715q734n917m2k98n154Q471
10557h195J0678n790P42N676M163N093J746k81q345j307J482l977m126O88k307
10542d060k562J78L937Q286j979l312M78j697L630n552r82O522J659m502K14M534
10526D792J399k704p746L994l40n61l214L151j105O84N530k534j649j611M478
10511B564P96j480j823J106P67n48n550j460Q013j710j161R926k024J975K289
10496A1680l182J810q58m047n700N062K46q008m445O555N733K39J889p826P233
10481F381K970j769o044L079O644J745n900m218n730j689K923k867k284k564p83
$$ plain form
10466 -10106 -9723 -10359 -7716 2601 138 -5297 -4431 168 1984 6492 3626 13709 12445 4311 5809
10451 5809 3544 3750 3363 853 4096 5201 4050 6935 2102 932 1677 2236 3183 2078 6031 12342
10435 12342 10102 7840 5382 4445 7947 14114 24863 30192 38675 47674 48627 50092 52533 56658 58911
10420 58911 58191 49574 39900 26428 19574 20002 16609 12772 11371 14208 13915 6016 1736 2739 532
10405 532 2000 4769 5730 13227 17716 16174 12042 8902 6529 3283 348 7217 17842 27494 29526
10390 29526 37571 55407 75219 92038 103870 84389 57226 45583 34733 28516 20352 13679
10378 13679 10594 11816 12056 13883 13760 13527 5886 6445 5840 6605 8201 3685 3888 4803 12204 15267
10362 15267 6942 -195 3199 1210 1931 2092 7758 10349 8267 4368 4519 2632 5982 9010 9035 13267
$$ packed form
10466a0106L83o36K643J0317k463n435Q66M599J816M508k866J0083j264q134J498
10451E809k265K06l87k510L243J105j151K885m833j170P45N59R47j105L953O311
10435A2342k240k262k458r37L502O167J0749N329Q483Q999R53J465K441M125K253
10420E8911p20q617r674j3472o854M28l393l837j401K837k93p899m280J003k207
10405E32J468K769R61P497M489j542m132l140k373l246k935O869J0625R652K032
10390B9526Q045J7836J9812J6819J1832j9481k7163j1643j0850o217q164o673
10378A3679l085J222K40J827j23k33p641N59o05P65J596m516K03R15P401L063
10362A5267q325p137L394j989P21J61N666K591k082l899J51j887L350L028K5M232
$$ plain form
10346 13267 14659 14726 8793 3082 12010 11319 10179 6118 7180 5901 2554 1985 7231 6063 5659 4592
10330 4592 8900 13587 18641 23652 18668 22874 29212 33757 39172 54078 64855 76376 81706 91378
10316 91378 97373 113411 139256 166770 208367 277762 373738 471893 530543 536707 522244 524249
10304 524249 538325 531463 483340 383697 287595 225411 177432 135814 111884 100358 86964 79666
10292 79666 76679 69473 65074 59347 48874 37574 41573 36238 30846 33803 36103 28365 29636 33458
10278 33458 34948 40771 41546 36512 30867 28947 27040 26958 26171 29293 23954 16720 22933 26984 20748
10263 20748 16091 15693 20677 17500 15054 16947 13312 3601 -1738 4405 11755 9020 4498 2008 8152
10248 8152 9633 6307 6791 3263 2177 8475 10069 10097 2830 2622 4860 5353 5785 10929 10390 3133
$$ packed form
10346A3267J392O7n933n711Q928o91j140m061J062j279l347n69N246j168m04j067
10330D592M308M687N054N011m984M206O338M545N415J4906J0777J1521N330R672
10316I1378N995J6038K5845K7514M1597O9395R5976R8155N8650O164j4463K005
10304E24249J4076o862m8123r9643r6102o2184m7979m1618k3930j1526j3394p298
10292G9666k987p206m399n727j0473j1300L999n335n392K957K300p738J271L822
10278C3458J490N823P75n034n645j920j907q2p87L122n339p234O213M051o236
10263B0748m657l98M984l177k446J893l635r711n339O143P350k735m522k490O144
10248H152J481l326M84l528j086O298J594K8p267k08K238M93M32N144n39p257
$$ plain form
10232 3133 -713 -3514 -5785 -3372 -3796 -386 -255 -1915 -2814 -638 3389 7367 8757 9495 9719 10090
10216 10090 3292 802 3316 11329 10075 8069 8321 7152 8062 10189 11048 12354 19960 14825 4975
10201 4975 -813 5183 11766 13830 8521 7253 1020 -3813 652 2320 9673 12275 -1957 -6489
10187 -6489 576 5376 2126 1822 5197 4746 6556 10359 9346 10427 4429 -3123 -5273 -3933 -1626
10172 -1626 -401 966 6927 7630 11534 10922 11406 16844 17712 13464 9890 3720 5076 7244 8302 5112
10156 5112 9015 12251 10586 14875 14661 14594 22541 24976 20661 10684 7148 7516 8985 16162 23459 27988
10140 27988 23581 19686 12488 11795 19029 19514 15508 20651 25282 23329 20256 16847 14118 4824 3308
10125 3308 11652 22935 24506 24874 24866 28164 27955 27533 32250 31890 26895 25983 32683 30564 28687 28521 36286
$$ packed form
10232C133l846k801k271K413m24L410J31j660q99K176M027L978J390P38K24L71
10216A0090o798k490K514Q013j254k006K52j169R10K127Q59J306P606n135r850
10201D975n788N996O583K064n309j268o233m833M465J668P353K602j4232m532
10187f489P065M800l250l04L375m51J810L803j013J081n998p552k150J340K307
10172a626J225J367N961P03L904o12M84N438Q68m248l574o170J356K168J058l190
10156E112L903L236j665M289k14o7P947K435m315r977l536L68J469P177P297M529
10140B7988m407l895p198o93P234M85m006N143M631j953l073l409k729r294j516
10125C308Q344J1283J571L68qL298k09m22M717l60m995r12O700k119j877j66P765
$$ plain form
10108 36286 38461 35684 31847 30555 28214 23299 17105 19418 19747 20432 17861 23591 26958 25040 19903
10093 19903 20728 16115 14794 27019 38778 44550 44353 47815 56340 58596 61233 71138 73711 65696
10079 65696 58176 55823 52596 47829 46959 51895 53283 53423 52447 55842 62269 70332 74677 74699 73015 72795
10063 72795 80064 83387 94913 102651 104477 107051 110865 110217 120747 130970 143069 150950 163323
10050 163323 178956 193343 201155 214803 237507 256485 274284 305212 350455 402527 446573 466707
10038 466707 474976 505493 561353 640814 730428 840293 973521 1168714 1461175 1895002 2554792
10027 2554792 3653403 5721085 9635487 14674739 18348767 19091881 13976830 8418033
10019 8418033 5378269 3776273 2838514 2239823 1822103 1507758 1270654 1091162 952120
$$ packed form
10108C6286K175k777l837j292k341m915o194K313L29O85k571N730L367j918n137
10093A9903Q25m613j321J2225J1759N772j97L462Q525K256K637R905K573q015
10079F5696p520k353l227m767q70M936J388J40r76L395O427Q063M345K2j684k20
10063G2795P269L323J1526P738J826K574L814o48J0530J0223J2099P881J2373
10050A63323J5633J4387P812J3648K2704J8978J7799L0928M5243N2072M4046K0134
10038D66707Q269L0517N5860P9461Q9614J09865J33228J95193K92461M33827O59790
10027B554792J098611K067682L914402N039252L674028P43114n115051n558797
10019H418033l039764j601996r37759n98691m17720l14345k37104j79492j39042
$$ plain form
10010 952120 838394 758057 692873 641023 608312 593716 591856 569191 520321 460136 418476
9999 418476 391534 368173 354412 334475 321045 299162 283792 278029 270545 257292 243435 239044
9987 239044 234943 230763 222327 211764 209501 205577 200725 192328 181166 165590 157312 152600 148125 146229
9973 146229 138709 132856 132790 132446 127788 120435 122340 112555 106669 103921 101227 102355 102755 94807 82701
9958 82701 81728 77093 73866 74070 80386 75628 75495 72553 75433 73651 73870 71570 58987 55295 55700 50027
9942 50027 42202 41204 36818 35232 39949 36058 24433 28562 38089 46949 48320 48341 44562 43244 37167
9927 37167 41183 38631 36220 39678 38629 41486 38179 35972 39453 40731 34605 24744 26885 28932 31503
9912 31503 36798 39007 43497 37815 26920 26924 36431 37373 33796 27678 22846 20153 27881 30296 30114 35020
$$ packed form
10010I52120j13726q0337o5184n1850l2711j4596j860k2665m8870o0185m1660
9999D18476k6942k3361j3761j9937j3430k1883j5370n763p484j3253j3857m391
9987B39044m101m180q436j0563k263l924m852q397j1162j5576q278m712m475j896
9973A46229p520n853o6l44m658p353J905r785n886k748k694J128M00p948j2106
9958H2701r73m635l227K04O316m758j33k942K880j782K19k300j2583l692M05n673
9942E0027p825r98m386j586M717l891j1625M129R527Q860J371K1l779j318o077
9927C7167M016k552k411L458j049K857l307k207L481J278o126r861K141K047K571
9912C1503N295K209M490n682j0895MR507R42l577o118m832k693P728K415j82M906
$$ plain form
9896 35020 38753 30566 26296 27554 24374 24319 23024 19556 20152 19086 16850 18361 19577 18546 14517
9881 14517 11691 13373 12859 1859 -2544 -479 5198 10411 3308 -231 1145 -2311 -1268 5755 4649
9866 4649 -917 -920 5372 8133 9691 11688 10828 16215 16098 8738 2152 -1337 -3965 1330 2406 5686
9850 5686 9320 7436 3289 4793 4518 5677 2275 8072 3732 3527 11501 11827 14744 18918 15797 15853
9834 15853 17786 16414 12750 12935 11794 6600 187 -2602 -4830 -3572 6016 8807 13171 19135 15175
9819 15175 16250 14980 2817 -3236 -2362 -2039 5680 7190 6202 11113 11130 9650 4799 1171 -2200 -4786
9803 -4786 -5294 -882 -5188 -5763 -801 -2690 -1899 -732 -4659 -12770 -13567 -3604 6621 5796 6189 5856
9787 5856 4736 8467 8552 10564 3507 2624 3201 3300 3307 8679 11119 11292 14120 9115 10522 15219 13968
$$ packed form
9896C5020L733q187m270J258l180n5j295l468N96j066k236J511J216j031m029
9881A4517k826J682n14j1000m403K065N677N213p103l539J376l456J043P023j106
9866D649n566lO292K761J558J997q60N387j17p360o586l489k628N295J076L280
9850E686L634j884m147J504k75J159l402N797m340k05P974L26K917M174l121N6
9834A5853J933j372l664J85j141n194o413k789k228J258R588K791M364N964l960
9819A5175J075j270j2163o053Q74L23P719J510r88M911J7j480m851l628l371k586
9803d786n08M412m306n75M962j889P91J167l927q111p97R963J0225q25L93l33
9787E856j120L731Q5K012p057q83N77R9PN372K440J73K828n005J407M697j251
$$ plain form
9770 13968 16308 17503 9614 10234 7030 4764 1896 -6861 -10435 -5290 -2869 579 1755 -4375 -11130
9755 -11130 -11188 -3908 -7695 -12140 -7500 -4722 -4682 -6562 -1061 3688 3184 3348 4181 3270 4542 3519 286
9738 286 -2608 889 6459 5470 2489 284 4679 5366 8510 21354 18157 7040 4110 -2346 -1939
9723 -1939 3229 1885 4254 9741 8753 13416 17826 18498 15789 12534 14051 16850 11552 7193 3874
9708 3874 1387 3040 3634 -32 -3910 -5450 -2349 1697 2317 10353 11102 -3577 -3941 -2784 -3173 -2320
9692 -2320 692 5577 3963 4424 -1433 -3699 -8200 -10634 -5520 -7375 -11576 -14828 -14806 -6210 -4815 -5179
9676 -5179 -5494 -5814 3325 2040 -3102 698 12244 17261 14632 20665 24192 25196 31938 25966 13173
9661 13173 585 -3678 -5709 -12201 -12127 -3771 393 6639 8391 4257 3201 -2347 -4535 90 6028
$$ packed form
9770A3968K340J195p889O20l204k266k868q757l574N145K421L448J176o130o755
9755a1130n8P280l787m445M640K778M0j880N501M749n04J64Q33r11J272j023l233
9738B86k894L497N570r89k981k205M395O87L144J2844l197j1117k930o456M07
9723a939N168j344K369N487r88M663M410O72k709l255J517K799n298m359l319
9708C874k487J653N94l666l878j540L101M046O20Q036P49j4679l64J157l89Q53
9692b320L012M885j614M61n857k266m501k434N114j855m201l252K2Q596J395l64
9676e179l15l20R139j285n142L800J1546N017k629O033L527J004O742n972j2793
9661A3173j2588m263k031o492P4Q356M164O246J752m134j056n548k188M625N938
$$ plain form
9646 6028 10734 11495 7317 2855 840 392 52 1814 7379 15700 16191 2604 -1182 -4143 -4026 2536
9630 2536 12638 12331 10720 11439 23859 39861 56592 59161 55225 54264 54009 53948 52384 54057 49450
9615 49450 39256 25537 20168 22561 19340 10964 3245 3486 -592 510 89 -263 -376 3580 3744
9600 3744 2810 5465 3851 5663 1551 372 359 -3380 -2089 27 -7362 -13270 -5480 564 -3856 -5526
9584 -5526 -1627 281 -2868 -3911 372 11954 12444 11664 2194 -6091 -5051 -1361 1193 2679 4478
9569 4478 7613 2671 -4924 -8756 -8044 -4748 -2089 -3215 367 1302 4251 6446 5430 5007 6158 10212
9553 10212 12699 18938 14226 1605 6980 13834 7414 3670 7297 5536 2772 -1802 -2974 -6080
9539 -6080 -3088 -3949 -6783 -4304 -2501 -4115 -2190 927 -1209 -675 -1849 -10044 -6722 -3956 -3760 1854
$$ packed form
9646F028M706P61m178m462k015m48l40J762N565Q321M91j3587l786k961J17O562
9630B536J0102l07j611P19J2420J6002J6731K569l936r61k55o1j564J673m607
9615D9450j0194j3719n369K393l221q376p719K41m078J102m21l52j13L956J64
9600C744r34K655j614J812m112j179j3l739J291K116p389n908P790O044m420j670
9584e526L899J908l149j043M283J1582M90p80r470q285J040L690K554J486J799
9569D478L135m942p595l832P12L296K659j126L582R35K949K195j016m23J151M054
9553A0212K487O239m712j2621N375O854o420l744L627j761k764m574j172l106
9539f080K992q61k834K479J803j614J925L117k136N34j174q195L322K766J96N614
$$ plain form
9523 1854 9129 3602 -6173 -3450 933 1299 5197 8731 11464 9548 10006 4657 3374 -885 -6377
9508 -6377 -3442 2178 4641 1586 953 6781 5996 2886 5148 6423 2627 6248 4173 -1572 -7795
9493 -7795 -3285 543 -4330 -2312 3110 5353 3282 3285 6033 9780 9417 9407 8532 3724 1753 11257 10558
9476 10558 4981 5342 6231 7897 6508 5205 5958 5624 4089 -3413 -10065 -7894 -11267 -14702 -6240 -1682
9460 -1682 -986 1391 395 -4585 1375 4189 4178 -2717 -4583 -1873 2113 -4088 -10204 -3000 3265 148
9444 148 -3287 -536 511 -694 -2726 -3275 341 3975 274 -6570 -5432 -5460 -4119 1040 953 -1656
9428 -1656 -4930 261 982 -4345 -1538 2568 -1300 -618 3501 3056 4165 10060 17216 14950 7930 636
9412 636 1267 6278 9565 5762 998 -4587 -609 3356 8224 11385 7868 9132 11002 9150 6763
$$ packed form
9523A854P275n527r775K723M383L66L898L534K733j916M58n349j283m259n492
9508f377K935N620K463l055o33N828p85l110K262J275l796L621k075n745o223
9493g795M510L828m873K018N422K243k071LK748L747l63j0q75m808j971R504o99
9476A0558n577L61Q89J666j389j303P53l34j535p502o652K171l373l435Q462M558
9460a682O96K377r96m980N960K814j1o895j866K710L986o201o116P204O265l117
9444A48l435K751J047j205k032n49L616L634l701o844J138k8J341N159q7k609
9428a656l274N191P21n327K807M106l868O82M119m45J109N895P156k266p020p294
9412F36O31N011L287l803m764n585L978L965M868L161l517J264J870j852k387
$$ plain form
9397 6763 2547 390 460 4392 4075 2005 2381 11467 9812 883 3115 8849 15633 19477 18414 19816
9381 19816 15335 11268 8927 7728 -3132 -3949 -1650 746 3743 -1170 -3319 3917 6296 -575 2252
9366 2252 1885 3571 4798 8768 15434 13091 11234 5500 5398 8528 6795 6472 9889 12837 10016 11236
9350 11236 15119 10310 9850 11636 10613 12395 16254 21658 21434 15953 11438 7416 3261 744 1104
9335 1104 5049 13360 15725 4162 6876 14642 10090 12844 16538 13569 10810 5523 6677 8232 10898
9320 10898 15816 15811 16837 13156 12375 12573 16382 26679 24413 15430 11958 17835 23304 16690 8355 12966
9304 12966 22501 25925 27501 28654 24136 24633 28961 43996 53735 67065 78107 93514 103700 108114
9290 108114 106960 93920 74608 59505 54765 52879 50307 51028 47300 46767 50583 50457 54720 49122
$$ packed form
9397F763m216k157P0L932l17k070L76R086j655q929K232N734O784L844j063J402
9381A9816m481m067k341j199j0860q17K299K396K997m913k149P236K379o871K827
9366B252l67J686J227L970O666k343j857n734j02L130j733l23L417K948k821J220
9350A1236L883m809m60J786j023J782L859N404k24n481m515m022m155k517L60
9335A104L945Q311K365j1563K714P766m552K754L694k969k759n287J154J555K666
9320A0898M918nJ026l681p81J98L809J0297k266q983l472N877N469o614q335M611
9304A2966R535L424J576J153m518M97M328J5035R739J3330J1042J5407J0186M414
9290A08114j154j3040j9312j5103m740j886k572P21l728n33L816j26M263n598
$$ plain form
9276 49122 51255 57720 66229 61599 61902 61881 64021 65909 69164 72990 78955 81424 86923 94856 101125
9261 101125 102785 110485 109480 119092 122354 126351 138917 144806 160412 182873 203313 215734 230730
9248 230730 255976 299573 339618 368774 400017 447324 511747 592001 691993 813221 972923
9237 972923 1201083 1515426 1959459 2588275 3483378 4647895 5875478 6749823 6865692
9228 6865692 6077761 4821392 3657755 2782358 2165935 1726059 1404442 1166855 986812
9219 986812 844823 741939 662580 588808 523927 470284 432351 395541 363622 339141 319080
9208 319080 298846 278750 263318 250397 233370 219263 218043 208264 192212 179415 175138 168773
9196 168773 160375 152502 152356 146910 141080 137450 135315 128643 121437 118361 112691 103329 102792 112343 111101
$$ packed form
9276D9122K133O465Q509m630L03k1K140J888L255L826N965K469N499P933O269
9261A01125J660P700j005R612L262L997J2566N889J5606K2461K0440J2421J4996
9248B30730K5246M3597M0045K9156L1243M7307O4423Q0254R9992J21228J59702
9237I72923K28160L14343M44033O28816Q95103J164517J227583Q74345J15869
9228F865692p87931j256369j163637q75397o16423m39876l21617k37587j80043
9219I86812j41989j02884p9359p3772o4881n3643l7933l6810l1919k4481k0061
9208C19080k0234k0096j5432j2921j7027j4107j220r779j6052j2797m277o365
9196A68773q398p873j46n446n830l630k135o672p206l076n670r362n37R551j242
$$ plain form
9181 111101 101431 89397 85803 79027 83504 82518 77670 71455 62916 69706 73216 62854 62904 59275 56454
9166 56454 55848 53503 51742 54607 52948 52006 53141 52082 50308 43711 43747 48167 51746 52478 49325 47044
9150 47044 46478 44050 38386 30437 30494 39274 43827 36365 29113 26017 28821 26786 20157 15304 21902
9135 21902 29351 22475 14406 13550 18542 19474 17704 14682 16177 20677 23254 14531 6233 -1461 1649
9120 1649 2828 6584 10822 12571 13759 11491 10471 11355 4913 2978 3980 9355 16094 16303 11643
9105 11643 8726 7015 -290 -5064 -8053 -5763 2356 6128 9863 10834 6543 3525 7343 3645 1962
9090 1962 -106 -4901 -8751 -2701 5553 13825 13213 7483 7177 6322 4213 12681 16766 14200 5560 3376
9074 3376 198 895 5439 5902 10209 8626 4558 7332 11474 8711 2027 329 1419 7023 10882
$$ packed form
9181A11101r670j2034l594o776M477r86m848o215q539O790L510j0362N0l629k821
9166E6454o06k345j761K865j659r42J135j059j774o597L6M420L579P32l153k281
9150D7044n66k428n664p949N7Q780M553p462p252l096K804k035o629m853O598
9135B1902P449o876q069q56M992R32j770l022J495M500K577q723q298p694L110
9120A649J179L756M238J749J188k268j020Q84o442j935J002N375O739K09m660
9105A1643k917j711p305m774k989K290Q119L772L735R71m291l018L818l698j683
9090A962k068m795l850O050Q254Q272o12n730l06q55k109Q468M085k566q640k184
9074C376l178O97M544M63M307j583m068K774M142k763o684j698J090N604L859
$$ plain form
9059 10882 8694 13780 8468 10324 10595 3185 -3860 -1809 1196 5953 11015 5507 3201 7729 3644
9044 3644 2981 6374 -718 -4020 7912 6405 1900 -1185 -5482 -8617 -3923 6606 4616 2492 752
9029 752 1800 -479 -709 -916 -1718 787 -780 -2609 -977 -4588 -5808 -4402 -6438 -6089 -3815 -2386
9013 -2386 -1323 -4570 -437 3636 2500 3154 -1515 -4129 -6819 -4400 -2115 -1718 -7133 -2897 2015
8998 2015 4034 -213 -2602 -5007 -6326 -4286 5098 1269 -1816 -4239 1095 2368 1911 557 -3649
8983 -3649 -3987 -1410 -7149 -5533 -343 3060 -3590 -9927 -11173 -10392 -10250 -11615 -10084 -6551 -5162 -3851
8967 -3851 11 740 6518 11606 8270 2471 2134 1743 5639 4743 3925 664 649 1256 1627 -3445 -10850
8950 -10850 -12931 -11090 -11626 -9999 -8502 -2931 5590 2417 -2544 -2570 -17 1646 1691 1964 6182 3785
$$ packed form
9059A0882k188N086n312J856K71p410p045K051L005M757N062n508k306M528m085
9044C644o63L393p092l302J1932j507m505l085m297l135M694J0529j990k124j740
9029G52J048k279k30k07q02K505j567j829J632l611j220J406k036L49K274J429
9013b386J063l247M133M073j136O54m669k614k690K419K285L97n415M236M912
8998B015K019m247k389k405j319K040R384l829l085k423N334J273m57j354m206
8983c649l38K577n739J616N190L403o650o337j246P81J42j365J531L533J389J311
8967c851L862P29N778N088l336n799l37l91L896q96q18l261j5O07L71n072p405
8950a0850k081J841n36J627J497N571Q521l173m961k6K553J663M5K73M218k397
$$ plain form
8934 3785 -230 -8873 -11151 -80 5111 508 3017 3729 21 -6656 -4539 5553 9538 13214 6653
8919 6653 -1006 -5004 -2631 273 373 -4002 -4992 -10379 -10487 -7065 1792 8962 8724 3285 -177 947
8903 947 -101 43 -1232 59 -4088 -5496 1134 7789 4690 8749 11175 995 -1362 1341 4672
8888 4672 4047 6574 11441 13143 12879 6792 -3220 699 2045 -10 -2795 -12189 -9440 -3323 -370
8873 -370 -4315 -8714 -5553 -1893 -3252 -5792 -5186 -1342 -398 -3340 -1471 652 -1479 -7148 -9939 -2860
8857 -2860 -1462 -4265 -6226 -1673 1595 990 11155 15852 14485 13862 5946 6557 8116 7557 13825 11530
8841 11530 9186 15715 19115 17686 13761 19585 23408 16934 15454 11162 4121 301 127 5135 12247
8826 12247 12782 2902 1142 19 -133 5159 11360 5756 980 -1569 2165 1256 -4130 -4885 -325 3568
$$ packed form
8934C785m015q643k278J1071N191m603K509P12l708o677K117J0092L985L676o561
8919F653p659l998K373K904J00m375r90n387j08L422Q857P170k38n439l462J124
8903I47j048J44j275J291m147j408O630O655l099M059K426j0180k357K703L331
8888D672o25K527M867J702k64o087j0012L919J346k055k785r394K749O117K953
8873c70l945m399L161L660j359k540O06L844R44k942J869K123k131n669k791P079
8857b860J398k803j961M553L268o05J0165M697j367o23p916O11J559n59O268k295
8841A1530k344O529L400j429l925N824L823o474j480m292p041l820j74N008P112
8826A2247N35r880j760j123j52N292O201n604m776k549L734r09n386p55M560L893
$$ plain form
8810 3568 1821 7623 16025 12997 4679 1137 3137 1238 -2985 959 4845 10884 10441 5640 4377
8795 4377 9123 18406 23792 17933 12197 7930 2395 4143 6230 3770 8108 11003 9554 6623 8346
8780 8346 6752 4146 8289 9584 2819 -1869 -6255 -7586 -10764 -8770 -8476 -6132 -3256 -151 9471
8765 9471 8783 6262 579 -1649 -3744 -394 3345 4230 -1675 -10019 -9972 -6627 1819 2416 2496 3371 5896
8748 5896 3793 2643 -3387 -655 4102 1151 -6963 -8481 -7099 2134 -86 -2941 2225 5605 4434
8733 4434 -2100 -7142 -5132 -866 15 8077 2563 -5595 -9950 -8701 -9138 -3331 11904 16667 11641
8718 11641 8154 10205 8820 452 343 2960 3304 5591 10466 7298 -5361 -6778 -2473 3009 6659
8703 6659 5728 3963 5957 4048 1480 6026 17579 15207 7878 9007 13059 15961 13828 11274 17840
$$ packed form
8810C568j747N802Q402l028q318l542K000j899m223L944L886O039m43m801j263
8795D377M746R283N386n859n736m267n535J748K087k460M338K895j449k931J723
8780H346j594k606M143J295o765m688m386j331l178J994K94K344K876L105R622
8765I471o88k521n683k228k095L350L739Q85n905q344M7L345Q446N97Q0Q75K525
8748E896k103j150o030K732M757k951q114j518J382R233k220k855N166L380j171
8733D434o534n042K010M266Q81Q062n514q158m355J249m37N807J5235M763n026
8718A1641l487K051j385q368j09K617L44K287M875l168j2659j417M305N482L650
8703F659r31j765J994j909k568M546J1553k372p329J129M052K902k133k554O566
$$ plain form
8688 17840 16402 8615 7500 7603 2959 -3414 -2590 -3621 3279 4827 9914 6681 6332 4439 7237
8673 7237 9983 12951 12698 11720 6844 9326 4702 6590 5158 1491 6784 15033 11310 3897 -967
8658 -967 -1142 -7045 -4460 1940 506 404 -7 -4802 -137 7909 5791 -3853 -8787 -3025 -2431 -1719
8642 -1719 1156 10163 11644 5066 7743 14885 17062 20195 17722 8260 4981 8800 6852 5681 5028
8627 5028 13819 25735 27498 24443 29431 29183 21409 16540 18708 11901 6091 -1341 -3772 -3152 1147
8612 1147 3944 2715 2741 2295 6571 8374 12164 13569 15538 15411 11707 8233 14505 15831 11987 10260
8596 10260 15932 23159 22579 18051 18384 21328 27950 28458 24546 22105 30137 40671 44653 46627 48873
8581 48873 42175 34544 27481 26131 26077 26037 17310 16455 15333 16691 18156 22698 25621 19201 15658 11371
$$ packed form
8688A7840j438p787j115J03m644o373Q24j031O900J548N087l233l49j893K798
8673G237K746K968k53r78m876K482m624J888j432l667N293Q249l723p413m864
8658i67j75n903K585O400j434j02m11m795M665Q046k118r644m934N762N94P12
8642a719K875R007J481o578K677P142K177L133k473r462l279L819j948j171o53
8627E028Q791J1916J763l055M988k48p774m869K168o807n810p432k431O20M299
8612A147K797j229K6m46M276J803L790J405J969j27l704l474O272J326l844j727
8596A0260N672P227n80m528L33K944O622N08l912k441Q032J0534L982J974K246
8581D8873o698p631p063j350n4m0q727q55j122J358J465M542K923o420l543m287
$$ plain form
8565 11371 12261 14865 11309 13022 16532 15344 13627 10409 7509 6432 8845 5176 -941 -3347 -6782
8550 -6782 -3753 -1239 3278 2891 8848 7522 5814 5233 10086 15030 8387 5996 2698 1018 4378
8535 4378 8223 5170 -593 -425 -4550 -1625 -6816 -6703 -6077 -1905 2505 -3497 -591 4335 2487 7338
8519 7338 10288 5867 5691 7006 7123 3124 -1710 -1572 -4629 -5525 -799 1531 1581 -5274 -6892 -2046
8503 -2046 -3202 -637 6465 7065 5998 4781 7462 9645 11769 15154 14703 14004 13145 11494 6931 9036
8487 9036 12758 15417 10966 5594 7284 7961 5012 2597 6562 6956 1125 -350 -5877 -4144 3917
8472 3917 7996 8985 14558 17715 11287 7607 5560 6171 3068 -2504 -4084 -5463 -12111 -11842 -3811 -2559
8456 -2559 -7230 -7281 -8165 -2043 8453 13130 12307 12492 4882 3723 9370 12496 7240 3265 -366 -294
$$ packed form
8565A1371Q90K604l556J713L510j188j717l218k900j077K413l669o117k406l435
8550f782L029K514M517l87N957j326j708n81M853M944o643k391l298j680L360
8535D378L845l053n763J68m125K925n191J13O26M172M410o002K906M926j848M851
8519G338K950m421j76J315J17l999m834J38l057q96M726K330N0o855j618M846
8503b046j156K565P102O00j067j217K681K183K124L385m51o99q59j651m563K105
8487I036L722K659m451n372J690O77k949k415L965L94n831j475n527J733Q061
8472C917M079R89N573L157o428l680k047O11l103n572j580j379o648K69Q031J252
8456b559m671n1q84O122J0496M677q23J85p610j159N647L126n256l975l631P2
$$ plain form
8440 -294 3996 5045 1427 -3370 786 -1798 -2171 3113 2856 -400 -4564 -2690 -1434 2965 2684 -2415
8424 -2415 -2838 1958 4901 -1756 766 10905 8531 2169 2811 9564 11675 11378 6900 729 1208 4872
8408 4872 6211 5340 212 -1719 3564 2882 4885 5775 6647 6841 594 -2115 -2306 -5168 -441 1561
8392 1561 -2062 -7182 -1368 303 219 702 -1660 -3174 -3793 -7828 -4948 2772 8852 1580 -3760 1362
8376 1362 1419 7478 5949 3975 10442 9225 5870 5280 5450 4386 2858 -5504 -4594 -5041 -6153 -5254 -4305
8359 -4305 -3798 -2831 -3163 -6781 771 596 -1673 -4251 500 4652 3297 418 1197 -3943 828 9294
8343 9294 10030 7773 9261 14343 9105 2331 4168 7280 1091 5616 2300 -2505 5398 11101 6682
8328 6682 12218 13812 6135 -5202 -11278 -6995 -3465 -3512 -6268 -5488 -733 -883 494 1988 166 5462
$$ packed form
8440b94M290J049l618m797M156k584l73N284k57l256m164J874J256M399k81n099
8424b415m23M796K943o657K522J0139k374o362O42O753K111k97m478o171M79L664
8408D872J339q71n128j931N283o82K003Q90Q72J94o247k709j91k862M727K002
8392A561l623n120N814J671q4M83k362j514o19m035K880P720O080p272n340N122
8376A362N7O059j529j974O467j217l355n90J70j064j528q362R10m47j112Q99R49
8359d305N07R67l32l618P552j75k269k578M751M152j355k879P79n140M771Q466
8343I294P36k257J488N082n238o774J837L112o189M525l316m805P903N703m419
8328F682N536J594p677j1337o076M283L530m7k756P80M755j50J377J494j822N296
$$ plain form
8312 5462 8370 9649 9569 4700 518 -4074 -4029 -4234 -5945 -3848 -3748 -2766 -851 1351 1383 -5975 -6200
8295 -6200 650 4323 2711 383 5701 2996 -5593 -5948 -6334 -3990 -1172 1423 7116 5693 3163
8280 3163 6708 11095 7027 13192 12429 12274 16603 13392 5434 2530 -279 -2284 2483 10338 7870
8265 7870 -682 2660 10694 9822 7360 1737 -2042 -6240 -415 6269 1349 7459 13863 13953 17841 14588
8249 14588 5146 119 -1021 -374 1585 11112 14899 7279 -933 -5427 239 5154 -2799 -593 850
8234 850 987 -8006 -8463 -5948 -4268 -1924 -3081 -2085 -2935 -8393 -12443 -15436 -11480 -8553 -7241 -3686
8218 -3686 -4417 -11730 -7961 71 -3371 998 8811 4296 -3762 -9331 -14911 -16695 -9085 -2820 -9
8203 -9 79 6799 4205 4853 10884 11672 3431 759 -246 4162 5004 3730 5204 2159 -719 1425 266
$$ packed form
8312E462K908J279q0m869m182m592M5k05j711K097J00R82J915K202L2p358k25
8295f200O850L673j612k328N318k705q589l55l86K344K818K595N693j423k530
8280C163L545M387m068O165p63j55M329l211p958k904k809k005M767P855k468
8265G870q552L342Q034q72k462n623l779m198N825O684m920O110O404R0L888l253
8249A4588r442n027j140O47J959R527L787p620q212m494N666M915p953K206J443
8234H50J37q993m57K515J680K344j157R96q50n458m050k993L956K927J312L555
8218c686p31p313L769Q032l442M369P813m515q058n569n580j784P610O265K811
8203iQ8O720k594O48O031P88q241k672j005M408Q42j274J474l045k878K144j159
$$ plain form
8186 266 2027 -345 1140 7182 9381 7220 6038 12789 7450 1100 -921 -5031 -12630 -6031 -3838
8171 -3838 1563 3709 -3523 -5260 777 3193 5882 3076 1395 3380 -3085 -5882 4201 3236 -6418
8156 -6418 -5885 -6353 -3467 -8346 -11031 -8054 -3178 -117 -1421 -285 -5037 -6805 -7158 -4049 3804 782
8140 782 466 -2055 -678 -3017 -2414 -1673 -2077 3901 -279 -1277 5566 6149 1930 2263 -3307 -790 -2080
8123 -2080 -484 6425 11402 13897 4398 251 2990 2100 6238 5409 3202 2670 -4832 -3756 563 2298
8107 2298 48 1143 3269 -746 -11239 -8532 26 2222 187 -5700 -7538 -6179 -6561 -4722 4258
8092 4258 9736 14007 11835 9047 10953 4339 6687 8009 4184 5053 5085 -6261 -10072 -10258 -9036 -3566
8076 -3566 -2383 -3748 72 1982 400 4320 -440 -721 1378 2459 -2783 -3424 -5154 -104 10263
$$ packed form
8186B66J761k372J485O042K199k161j182O751n339o350k021m110p599O599K193
8171c838N401K146p232j737O037K416K689k806j681J985o465k797J0083r65r654
8156f418N33m68K886m879k685K977M876L061j304J136m752j768l53L109P853l022
8140G82l16k521J377k339O03P41m04N978m180r98O843N83m219L33n570K517j290
8123b080J596O909M977K495r499m147K739q90M138q29k207n32p502J076M319J735
8107B298k250J095K126m015j0493K707Q558K196k035n887j838J359l82J839Q980
8092D258N478M271k172k788J906o614K348J322l825Q69L2j1346l811j86J222N470
8076c566J183j365L820J910j582L920m760k81K099J081n242o41j730N050J0367
$$ plain form
8061 10263 13571 15116 15461 12853 12861 4877 -275 -6678 -11091 -9590 -11817 -13760 -7108 -3136 -701 2250
8045 2250 -920 -3017 872 -3585 -4354 -7124 -5058 -4033 -207 4706 722 1008 7114 8089 1212 -493
8029 -493 6775 10483 5078 2063 51 2566 4171 4097 -129 -7184 -8959 -3950 -4519 -4449 -4134 -5174 -5079
8012 -5079 -4421 -3498 -3191 -4338 -1446 2188 2807 3224 57 -7426 -1535 693 4440 7715 8721 2686
7996 2686 3485 9728 8448 8276 10816 6914 2690 7847 13737 17722 19287 14501 13930 11730 1092
7981 1092 -1998 202 7434 10817 13137 8384 5869 4421 13123 11418 9428 16431 11637 11173 13602
7966 13602 5666 2237 5621 2392 5421 4778 6152 4367 6599 5715 2919 4631 2223 4095 4410
7951 4410 2546 6206 11224 15472 9159 2847 3674 -408 -2197 4854 8970 4899 1341 5117 6359
$$ packed form
8061A0263L308J545L45k608Qp984n152o403m413J501k227j943O652L972K435K951
8045B250l170k097L889m457p69k770K066J025L826M913l984K86O106R75o877j705
8029d93P268L708n405l015k012K515J605p4m226p055j775N009n69P0L15j040R5
8012e079O58R23L07j147K892L634O19M17l167p483N891K228L747L275J006o035
7996B686P99O243j280j72K540l902m224N157N890L985J565m786n71k200j0638
7981A092l090K200P232L383K320m753k515j448Q702j705j990P003m794m64K429
7966A3602p936l429L384l229L029o43J374j785K232q84k796J712k408J872L15
7951D410j864L660N018M248o313o312Q27m082j789P051M116m071l558L776J242
$$ plain form
7936 6359 4486 4898 -3114 3 5474 3232 5693 6963 2899 -2871 -2118 -1275 1712 8830 13082 15330
7920 15330 11570 11159 1481 5945 14722 18423 20303 15860 9202 5290 6685 1157 400 2660 6797
7905 6797 11635 11532 7461 5211 2144 -2059 1619 11898 9664 2638 5672 10177 10118 10826 12868 11930
7889 11930 7753 4617 6884 4239 522 2487 3419 354 -3899 -5674 -1753 1245 -3863 -5425 -4902
7874 -4902 3609 3892 -4018 -11136 -8916 -386 3531 7367 7273 2416 1577 -3264 -14720 -13647 -4261 243
7858 243 3909 6174 3750 474 1027 1278 4334 -263 -1985 -488 -5063 -3934 -217 1398 -4358 -8561
7842 -8561 -8350 -2670 1010 686 -3710 -3641 -5236 -2401 4578 5792 1414 -1722 4321 6668 2205 -346
7826 -346 -4634 -2235 2446 -1484 2333 1773 1754 -4024 -8764 -9076 -13135 -11476 -13265 -13069 -7219 -3819
$$ packed form
7936F359j873M12q012L117N471k242K461J270m064n770P53Q43K987P118M252K248
7920A5330l760m11r678M464Q777L701J880m443o658l912J395n528p57K260M137
7905F797M838j03m071k250l067m203L678J0279k234p026L034M505n9P08K042r38
7889A1930m177l136K267k645l717J965R32l065m253j775L921K998n108j562N23
7874d902Q511K83p910p118K220Q530L917L836r4m857q39m841j1456J073R386M504
7858B43L666K265k424l276N53K51L056m597j722J497m575J129L717J615n756m203
7842h561K11N680L680l24m396O9j595K835O979J214m378l136O043K347m463k551
7826c46m288K399M681l930L817n60j9n778m740l12m059J659j789J96N850L400
$$ plain form
7810 -3819 -455 511 -5465 -617 5529 8781 8814 8668 12625 12445 11028 10896 10346 7510 6000 6118 4718
7793 4718 -1697 -5619 -2897 -9096 -9042 -7511 -5060 -1895 -1659 -8703 -3488 8088 9357 -299 -2330
7778 -2330 -2432 -4228 -1263 1489 -311 2214 8612 9019 7694 1549 236 2210 3883 3387 -3755 -7622
7762 -7622 -7321 -3187 -252 -3451 -6076 -5597 -5326 -8762 -2334 3072 -1770 -10182 -12715 -9182 -7763 -3872
7746 -3872 -5333 -4084 -5253 -3573 3168 4135 597 -1692 392 4631 5387 3016 -2500 -3307 -1460 -1993
7730 -1993 544 2545 4856 7619 6700 3138 -1448 3443 4871 9710 11195 5658 3038 3202 7578
7715 7578 1139 5152 11337 13739 12209 13360 12893 3575 1127 4424 6465 8901 5285 931 3335
7700 3335 542 2355 2526 -6343 -10952 -16203 -19068 -13862 -5595 2090 3499 -1085 -2222 1990 1662
$$ packed form
7810c819L364R66n976M848O146L252L3j46L957j80j417j32n50k836j510J18j400
7793D718o415l922K722o199N4J531K451L165K36p044N215J1576J269r656k031
7778b330j02j796K965K752j800K525O398M07j325o145j313J974J673m96p142l867
7762g622L01M134K935l199k625M79K71l436O428N406m842q412k533L533J419L891
7746c872j461J249j169J680O741R67l538k289K084M239P56k371n516q07J847n33
7730a993K537K001K311K763r19l562m586M891J428M839J485n537k620J64M376
7715G578o439M013O185K402j530J151m67r318k448L297K041K436l616m354K404
7700C335k793J813J71q869m609n251k865N206Q267P685J409m584j137M212l28
$$ plain form
7685 1662 2830 -4588 -2358 -6867 -6685 -2182 2927 -596 -110 5364 7143 7104 7343 13435 8763 2918
7669 2918 4119 356 -7078 -8267 -2199 886 9227 10677 7898 3520 -4274 -5227 -3251 4375 12454
7654 12454 13274 7169 2550 1532 -698 1966 5195 162 -3684 -214 -311 4233 3248 -3355 -4397 -9810
7638 -9810 -5313 123 6404 7358 2022 -1439 -3818 -2099 -1163 -7374 -8426 -3670 -3314 -3089 -7077 -5795
7622 -5795 608 3958 8094 4811 1645 2545 -1618 -8950 -6327 -6866 -2706 -774 -392 -7233 -15620 -12574
7606 -12574 -7996 -3354 -3233 1909 3836 -5472 -4867 1386 5850 2886 -2402 -1594 -1270 -6585 -2844 -4490
7590 -4490 -4973 -10592 -15042 -13630 -6296 115 3170 7236 4454 6622 6157 9136 9538 11569 10153 8674
7574 8674 5928 -122 -5478 -4522 1789 7637 3176 -4151 -6077 262 3420 4577 6091 4485 3299
$$ packed form
7685A662J168p418K230m509J82M503N109l523M86N474J779l9K39O092m672n845
7669B918J201l763p434j189O068L085Q341J450k779m378p794r53J976P626Q079
7654A2454Q20o105m619j018k230K664L229n033l846L470r7M544r85o603j042n413
7638i810M497N436O281R54n336l461k379J719R36o211j052M756L56K25l988J282
7622e795O403L350M136l283l166R00m163p332K623n39M160J932L82o841q387L046
7606a2574M578M642J21N142J927r308O05O253M464k964n288Q08L24n315L741j646
7590d490m83n619m450J412P334O411L055M066k782K168m65K979M02K031j416j479
7574H674k746o050n356R56O311N848m461p327j926O339L158J157J514j606j186
$$ plain form
7559 3299 1953 -703 -7041 -9626 -6388 -2398 3616 6671 5349 4530 -9284 -12786 -761 9015 11989
7544 11989 12238 10559 702 3413 3153 2196 -886 -460 619 2709 3797 734 5056 3283 957 10023
7528 10023 19407 10636 3280 274 -1222 1275 4871 -555 -8507 -9354 -7113 -7691 -4037 -717 -1552
7513 -1552 -696 2191 -2048 -1119 -1717 7136 11689 7282 3668 2421 2247 -1069 -1020 -3066 -928 4041
7497 4041 2883 -3987 -4042 -5247 -6734 -1609 -2383 356 -1865 -7108 -3022 -437 -837 -5338 -8154 -10304
7481 -10304 -6756 -6892 -2404 -809 -2860 1127 -3037 -4552 -1279 -1995 546 2126 -2302 -10119 -8877
7466 -8877 -6935 -7258 -8440 -2272 -1851 1317 5725 7522 11078 3048 349 295 2562 5379 802 -2419
7450 -2419 -1466 -1376 -4337 -8134 -6575 -8955 -7045 -5428 -1140 -5817 -9454 -7728 -3540 951 -4143 -6934
$$ packed form
7559C299j346k656o338k585L238L990O014L055j322q19j3814l502J2025R776K974
7544A1989K49j679r857K711k60r57l082M26J079K090J088l063M322j773k326R066
7528A0023R384q771p356l006j496K497L596n426p952q47K241n78L654L320q35
7513a552Q56K887m239R29n98Q853M553m407l614j247j74l316M9k046K138M969
7497D041j158o870n5j205j487N125p74K739k221n243M086K585m00m501k816k150
7481a0304L548j36M488J595k051L987m164j515L273p16K541J580m428p817J242
7466h877J942l23j182O168M21L168M408J797L556q030k699n4K267K817m577l221
7450b419R53R0k961l797J559k380J910J617M288m677l637J726M188M491n094k791
$$ plain form
7434 -6934 -4867 -500 1654 -605 -594 2138 -613 1003 9075 3204 -1263 -470 5007 1901 -3975 -2564
7418 -2564 2014 5691 3473 2049 3675 3454 970 -695 3521 4722 5712 2292 -2956 -283 5815
7403 5815 4667 -1161 -892 1143 -2200 -2736 665 24 -2279 -4024 -5740 -9208 -9137 -5906 -1106 -671
7387 -671 -7267 -5084 -6712 -8267 -9791 -11643 -9163 -10472 -17174 -15825 -11164 -8206 2793 5553 -826
7372 -826 -1150 6265 10478 5351 1249 1843 499 -1143 -8738 -13776 -9110 -4827 -7893 -16566 -21356 -17123
7356 -17123 -14755 -14816 -13293 -10550 -5736 593 163 -7404 -7792 -14911 -12582 -11263 -5392 -9312 -13364 -11892
7340 -11892 -6946 -5517 -5122 -1628 2092 1027 2336 6012 8613 11794 9460 8021 11330 3563 -5403
7325 -5403 -3799 -2675 -5186 -5030 -3619 2207 8998 9781 5878 -4505 641 436 -251 -8273 -7785 -5429
$$ packed form
7434f934K067M367K154k259J1K732k751J616Q072n871m467P93N477l106n876J411
7418b564M578L677k218j424J626k21k484j665M216J201R90l420n248K673O098
7403E815j148n828K69K035l343n36L401o41k303j745j716l468P1L231M800M35
7387f71o596K183j628j555j524j852K480j309o702J349M661K958J0999K760o379
7372h26l24P415M213n127m102N94j344j642p595n038M666M283l066q673m790M233
7356a7123K368o1J523K743M814O329m30p567l88p119K329J319N871l920m052J472
7340a1892M946J429L95L494L720j065J309L676K601L181k334j439L309p767q966
7325e403J604J124k511J56J411N826O791P83l903j0383N146k05o87q022M88K356
$$ plain form
7309 -5429 -8194 -6448 -4556 1865 -2784 -2815 -2645 -5687 -9623 -8483 -9257 -12240 -20655 -22865 -15862 -6469
7293 -6469 -6504 -7647 -11653 -8861 -8994 -10709 971 1746 -3431 -705 -5115 -6556 -3748 -378 -658 -3763
7277 -3763 401 -2908 -5718 -5253 -7242 -6999 -3954 3666 1439 -47 665 -3017 -1953 3162 10039 14140
7261 14140 8674 -1104 -3463 193 4551 345 -3578 -6239 -5984 -5141 -6568 -8312 -7168 -8693 -13108
7246 -13108 -10846 -3763 6643 8072 -198 -4617 -11397 -15615 -17701 -5196 5998 5255 838 -3650
7232 -3650 -7457 -2287 977 -1204 -5797 -9952 -13183 -16680 -12080 -2170 -161 5415 10856 9896 9761
7217 9761 3776 1871 -1601 5146 4734 -510 -3569 -4928 -6749 -8534 -6421 -1292 726 577 -817
7202 -817 -3802 5942 14856 12597 10441 8639 7864 12440 8815 4141 7432 5765 2959 4174 9445
$$ packed form
7309e429k765J746J892O421m649l1J70l042l936J140p74k983q415k210P003R393
7293f469l5j143m006K792j33j715J1680P75n177K726m410j441K808L370k80l105
7277c763M164l309k810M65j989K43L045P620k227j486P12l682J064N115O877M101
7261A4140n466r778k359L656M358m206l923k661K55Q43j427j744J144j525m415
7246a3108K262P083J0406J429q270m419o780m218k086J2505J1194p43m417m488
7232c650l807N170L264k181m593m155l231l497M600R910K009N576N441r60j35
7217I761n985j905l472O747m12n244l059j359j821j785K113N129K018j49j394
7202h17k985R744Q914k259k156j802p75M576l625m674L291j667k806J215N271
$$ plain form
7187 9445 11172 6497 1494 -1741 -3865 -6236 -4160 -4294 2157 5574 -1632 1142 -1663 541 5615
7172 5615 4261 296 1667 -847 2380 -300 -4798 -2773 3334 9906 13413 7473 713 -3416 -848
7157 -848 -868 -3903 -1826 -3399 -5292 2466 465 -8615 -7946 -4115 -7278 -11350 -9289 -4644 -5365 -3928
7141 -3928 2932 2678 -2930 -10340 -5416 647 7365 10736 12641 10828 5982 5008 5823 -499 -1255 -75
7125 -75 -3579 -2630 -6593 -8527 -3200 -1776 1897 9344 6854 341 -7076 -5563 -4542 -5847 -10801 -13529
7109 -13529 -13979 -11965 -7508 -5964 128 -2243 -5042 -4713 -5090 -4859 -4050 -3069 2517 1511 531 495 9
7092 9 -4347 -5671 -5944 -1184 1675 4356 1330 -2741 -4137 -2744 -402 596 6662 3021 1091 1106 3552
7075 3552 -459 -8385 -16112 -13198 -6161 -4667 -877 6475 11169 7631 2443 -3465 955 4400 7472
$$ packed form
7187I445J727m675n003l235k124k371K076j34O451L417p206K774k805K204N074
7172E615j354l965J371k514L227k680m498K025O107O572L507n940o760m129K568
7157h48k0l035K077j573j893P758k001r080O69L831l163m072K061M645p21J437
7141c928O860k54n608p410M924O063O718L371J905j813m846r74Q15o322p56J180
7125g5l504R49l963j934N327J424L673P447k490o513p417J513J021j305m954k728
7109a3529m50K014M457J544O092k371k799L29l77K31Q09R81N586j006r80l6m86
7092Im356j324k73M760K859K681l026m071j396J393K342R98O066l641j930J5K446
7075C552m011p926p727K914P037J494L790P352M694l538n188n908M420L445L072
$$ plain form
7060 7472 58 2825 9147 7557 -1653 -11080 -9971 -12695 -8323 -7477 -2308 -3351 -1676 2763 377
7045 377 -6679 -9378 -5505 -8897 -10175 -274 11501 10320 10748 9629 3836 -412 -3892 1098 13689
7030 13689 9823 10646 11633 5606 625 -6808 -8402 -10679 -5044 -3982 -8956 -5637 -2787 718 -350
7015 -350 -1648 4432 13964 11364 -105 -4588 828 6763 3810 -855 -6194 -7300 -8383 -7375 3214
7000 3214 4502 -4595 -5949 -2892 -1320 -1782 3720 8096 1260 -310 -1214 -777 -2922 -828 -6424 -9973
6984 -9973 -5020 139 2569 6640 11176 7930 2595 -376 -5760 1485 2440 -6961 -12349 -11111 -2107
6969 -2107 5566 5083 322 2292 -2606 -11658 -9315 -143 6756 9178 6240 9178 4985 5380 11314
6954 11314 10781 12853 8132 2380 744 -414 -1059 -1492 -4102 1243 8799 5953 6859 11175 8664 15406
$$ packed form
7060G472p414K767O322j590r210r427J109k724M372Q46N169j043J675M439k386
7045C77p056k699L873l392j278R901J1775j181M28j119n793m248l480M990J2591
7030A3689l866Q23R87o027m981p433j594k277N635J062m974L319K850L505j068
7015c50j298O080R532k600j1469m483N416N935k953m665n339j106j083J008J0589
7000C214J288r097j354L057J572m62N502M376o836j570r04M37k145K094n596l549
6984i973M953N159K430M071M536l246n335k971n384P245R55r401n388J238R004
6969b107P673m83m761J970m898r052K343R172O899K422k938K938m193L95N934
6954A1314n33K072m721n752j636j158o45m33k610N345P556k846R06M316k511O742
$$ plain form
6938 15406 13470 8979 2181 -1625 -3578 -9326 -7882 -112 2848 2400 -1350 -1107 -3428 1063 2318
6923 2318 2434 2908 2779 -785 -5312 -5514 -9274 -11854 -9156 -1995 -4770 -4455 -2187 -2534 903 1464 1486
6906 1486 -3825 -3788 -1471 48 4444 1314 -5386 -12723 -14259 -5863 4274 2250 -879 -1947 -3000
6891 -3000 -4117 -6131 -6035 428 -2031 -3436 -1823 -4248 -12481 -6948 -3032 -2068 1013 1037 -1873 2764
6875 2764 1144 -8784 -6572 -2953 -5021 -2225 -1172 7278 10619 3739 -2996 -8907 -7423 -5235 -4479
6860 -4479 1993 1723 -1090 -6551 -6605 -9114 -7951 -4804 -1981 -1004 -4519 -7950 -3303 -4348 -3746 -6806
6844 -6806 -5347 -4578 -7228 1315 8079 8854 5572 8326 6608 4858 2716 1481 -5774 -11019 -9465
6829 -9465 -7763 -3712 4457 7101 8953 14954 6294 -764 -2390 -57 2179 2345 -1729 -3472 1975
$$ packed form
6938A5406j936m491o798l806j953n748J444P770K960m48l750K43k321M491J255
6923B318J16M74j29l564m527k02l760k580K698P161k775L15K268l47L437N61K2
6906A486n311L7K317J519M396l130o700p337j536Q396J0137k024l129j068j053
6891c000j117k014R6O463k459j405J613k425q233N533L916R64L081K4k910M637
6875B764j620r928K212L619k068K796J053Q450L341o880o735n911J484K188P56
6860d479O472k70k813n461n4k509J163L147K823R77l515l431M647j045O02l060
6844f806J459P69k650Q543O764P75l282K754j718j750k142j235p255n245J554
6829i465J702M051Q169K644J852O001q660p058j626K333K236J66m074j743N447
$$ plain form
6814 1975 2293 -5523 -10959 -9948 -11281 -11263 1320 9535 9789 9664 7263 -694 -8250 -4164 -2758 -1143
6798 -1143 2137 -2845 -8808 -17618 -10994 -11058 -20048 -19851 -15287 -12096 -15841 -13969 -13212 -8505 -6980 -9002
$$ packed form
6814A975L18p816n436J011j333J8J2583Q215K54j25k401p957p556M086J406J615
6798a143L280m982n963q810O624o4q990J97M564L191l745J872P57M707J525k022
$$ [...]
##END NTUPLES=NMR SPECTRUM
##END=
