##TITLE=Analysis number 322921
Compound Code mo 01258
Project Code adrs
Chemist Name chemcon
##JCAMPDX= 6.0         $$ Bruker NMR JCAMP-DX V2.0
##DATA TYPE= NMR SPECTRUM
##DATA CLASS= NTUPLES
##ORIGIN= Bruker BioSpin GmbH
##OWNER= nmr
$$ XWIN-NMR		Version 3.5
$$ Mon Oct 16 10:54:43 2006 GMT Daylight Time (UT+1h)  MAYBRIDGE\nmr@NMR_250MHZ
##.OBSERVE FREQUENCY= 250.131544655141
##.OBSERVE NUCLEUS= ^1H
##.ACQUISITION MODE= SIMULTANEOUS (DQD)
##.ACQUISITION SCHEME= undefined
##.AVERAGES= 16
##.DIGITISER RES= 18
##SPECTROMETER/DATA SYSTEM= dpx250
##.PULSE SEQUENCE= zg30
##.SOLVENT NAME= DMSO
##.SHIFT REFERENCE= (INTERNAL, DMSO, 0, 16.522)
##AUDIT TRAIL= $$ (NUMBER, WHEN, WHO, WHERE, WHAT)
$$ ##TITLE= Audit trail, XWIN-NMR		Version 3.5
$$ ##JCAMPDX= 5.01
$$ ##ORIGIN= Bruker BioSpin GmbH
$$ ##OWNER= nmr
$$ C:\u/data/dgb/nmr/ADRS/510/pdata/1/auditp.txt
$$ ##AUDIT TRAIL=  $$ (NUMBER, WHEN, WHO, WHERE, WHAT)
(   1,<2006-10-16 10:54:15.38 +100>,<MAYBRIDGE\nmr>,<NMR_250MHZ>,
      <created by zg, POWCHK disabled, PULCHK disabled
       configuration hash MD5:
       49 4B E0 1D 92 C2 6B 37 9F E6 65 BC 52 41 86 1D
       data hash MD5: 64K
       58 2A 9D 9C FE 7F 8E 29 C5 A2 41 8E 47 07 46 27>)
(   2,<2006-10-16 10:54:32.64 +100>,<MAYBRIDGE\nmr>,<NMR_250MHZ>,
      <Start of raw data processing
       ef LB = 0.3 FT_mod = 6 PKNL = 1 SI = 32K 
       data hash MD5: 32K
       88 FB 94 52 CF 52 17 72 A2 DE D5 4D 2E 3B 6E 8E>)
(   3,<2006-10-16 10:54:34.77 +100>,<MAYBRIDGE\nmr>,<NMR_250MHZ>,
      <apk 
       data hash MD5: 32K
       C7 28 65 AB 37 55 B2 BB 05 48 30 D2 4C 92 8E BD>)
(   4,<2006-10-16 10:54:35.60 +100>,<MAYBRIDGE\nmr>,<NMR_250MHZ>,
      <abs ABSG = 5 
       data hash MD5: 32K
       71 6F 5E B5 BF 57 AB FA C4 62 25 01 A6 76 29 8E>)
$$ ##END=
$$ 
$$ hash MD5
$$ 3A 66 3E 83 23 47 20 79 EC 49 C6 46 0A 71 5B 1B
##$RELAX= 
##$RELAX= 
##$RELAX= 
##$RELAX= 
##$RELAX= 
##$RELAX= 
##$RELAX= 
$$ Bruker specific parameters
$$ --------------------------
##$DU= <C:\u>
##$EXPNO= 510
##$NAME= <ADRS>
##$PROCNO= 1
##$TYPE= <nmr>
##$USER= <dgb>
##$AMP= (0..31)
100 100 100 100 100 100 100 100 100 100 100 100 100 100 100 100 100 100 
100 100 100 100 100 100 100 100 100 100 100 100 100 100 
##$AQSEQ= 0
##$AQ_mod= 3
##$AUNM= <au_zg>
##$AUTOPOS= <37 >
##$BF1= 250.13
##$BF2= 250.13
##$BF3= 250.13
##$BF4= 250.13
##$BF5= 500.13
##$BF6= 500.13
##$BF7= 500.13
##$BF8= 500.13
##$BYTORDA= 1
##$CFDGTYP= 0
##$CFRGTYP= 5
##$CHEMSTR= <none>
##$CNST= (0..31)
1 1 145 1 1 1 1 1 1 1 1 1 1 1 1 1 1 1 1 1 1 1 1 1 1 1 1 1 1 1 1 1 
##$CPDPRG= <>
##$CPDPRG1= <>
##$CPDPRG2= <>
##$CPDPRG3= <>
##$CPDPRG4= <mlev>
##$CPDPRG5= <mlev>
##$CPDPRG6= <mlev>
##$CPDPRG7= <mlev>
##$CPDPRG8= <mlev>
##$CPDPRGB= <>
##$CPDPRGT= <>
##$D= (0..31)
0 1 0 0 0 0 0 0 0 0.06 0 0 0 0 0 0 0.0002 0 0 0 0 0 0 0 0 0 0 0 0 0 0 
0 
##$DATE= 1160992454
##$DBL= (0..7)
120 120 120 120 120 120 120 120 
##$DBP= (0..7)
150 150 150 150 150 150 150 150 
##$DBP07= 0
##$DBPNAM0= <>
##$DBPNAM1= <>
##$DBPNAM2= <>
##$DBPNAM3= <>
$$ [...]
##$SUBNAM7= <"">
##$SUBNAM8= <"">
##$SUBNAM9= <"">
##$SW= 20.6930455092707
##$SWIBOX= (0..15)
0 0 3 0 0 0 0 0 0 0 0 0 0 0 0 0 
##$SW_h= 5175.983436853
##$TD= 65536
##$TD0= 1
##$TE= 683.16
##$TE2= 300
##$TE3= 300
##$TEG= 300
##$TL= (0..7)
0 120 120 120 120 120 120 120 
##$TP= (0..7)
150 150 150 150 150 150 150 150 
##$TP07= 0
##$TPNAME0= <>
##$TPNAME1= <>
##$TPNAME2= <>
##$TPNAME3= <>
##$TPNAME4= <>
##$TPNAME5= <>
##$TPNAME6= <>
##$TPNAME7= <>
##$TPOAL= (0..7)
0.5 0.5 0.5 0.5 0.5 0.5 0.5 0.5 
##$TPOFFS= (0..7)
0 0 0 0 0 0 0 0 
##$TUNHIN= 0
##$TUNHOUT= 0
##$TUNXOUT= 0
##$USERA1= <user>
##$USERA2= <user>
##$USERA3= <user>
##$USERA4= <user>
##$USERA5= <user>
##$V9= 5
##$VALIST= <valist>
##$VCLIST= <CCCCCCCCCCCCCCC>
##$VD= 0
##$VDLIST= <DDDDDDDDDDDDDDD>
##$VPLIST= <PPPPPPPPPPPPPPP>
##$VTLIST= <TTTTTTTTTTTTTTT>
##$WBST= 1024
##$WBSW= 4
##$XGAIN= (0..3)
0 0 0 0 
##$XL= 0
##$YL= 0
##$YMAX_a= 579566
##$YMIN_a= -343759
##$ZGOPTNS= <>
##$ZL1= 120
##$ZL2= 120
##$ZL3= 120
##$ZL4= 120
##$ABSF1= 16.522
##$ABSF2= -4.171173
##$ABSG= 5
##$ABSL= 3
##$ALPHA= 0
##$AQORDER= 0
##$ASSFAC= 0
##$ASSFACI= 0
##$ASSFACX= 0
##$ASSWID= 0
##$AUNMP= <proc_1d>
##$AZFE= 0.1
##$AZFW= 0.1
##$BCFW= 0
##$BC_mod= 0
##$BYTORDP= 0
##$COROFFS= 0
##$CY= 12.5
##$DATMOD= 1
##$DC= 0
##$DFILT= <>
##$DTYPP= 0
##$F1P= 14.0000005364418
##$F2P= -0.99999901652339
##$FCOR= 0.5
##$FTSIZE= 32768
##$FT_mod= 6
##$GAMMA= 0
##$GB= 0
##$INTBC= 1
##$INTSCL= 1
##$ISEN= 128
##$LB= 0.3
##$LEV0= 0
##$LPBIN= 0
##$MAXI= 10000
##$MC2= 0
##$MEAN= 0
##$ME_mod= 0
##$MI= 0
##$NCOEF= 0
##$NC_proc= -4
##$NLEV= 6
##$NOISF1= 0
##$NOISF2= 0
##$NSP= 0
##$NTH_PI= 0
##$NZP= 0
##$OFFSET= 16.522
##$PC= 1
##$PHC0= -75.72105
##$PHC1= 38.02476
##$PH_mod= 1
##$PKNL= yes
##$PPARMOD= 0
##$PSCAL= 4
##$PSIGN= 0
##$REVERSE= no
##$SF= 250.13
##$SI= 32768
##$SIGF1= 0
##$SIGF2= 0
##$SINO= 400
##$SIOLD= 32768
##$SREGLST= <1H.DMSO>
##$SSB= 0
##$STSI= 32768
##$STSR= 0
##$SW_p= 5175.98343685301
##$SYMM= 0
##$S_DEV= 0
##$TDeff= 65536
##$TDoff= 0
##$TI= <Analysis number 999999
Compound Code 99
Book Reference 9
Project Code 9>
##$TILT= no
##$TM1= 0
##$TM2= 0
##$TOPLEV= 0
##$USERP1= <user>
##$USERP2= <user>
##$USERP3= <user>
##$USERP4= <user>
##$USERP5= <user>
##$WDW= 1
##$XDIM= 32768
##$YMAX_p= 423677114
##$YMIN_p= -2204663
$$ End of Bruker specific parameters
$$ ---------------------------------
##NTUPLES= NMR SPECTRUM
##VAR_NAME=  FREQUENCY,     SPECTRUM/REAL,   SPECTRUM/IMAG
##SYMBOL=    X,             R,               I
##VAR_TYPE=  INDEPENDENT,   DEPENDENT,       DEPENDENT
##VAR_FORM=  AFFN,          ASDF,            ASDF
##VAR_DIM=   32768,         32768,           32768
##UNITS=     HZ,            ARBITRARY UNITS, ARBITRARY UNITS
##FACTOR=    0.157963299565203, 1,           1
##FIRST=     4132.6476996994, 0,             0
##LAST=      -1043.33573715361, 0,           0
##MIN=       -1043.33573715361, -2204663,    0
##MAX=       4132.6476996994, 423677114,     0
$$ Real data points
##PAGE= N=1
##DATA TABLE= (X++(R..R)), XYDATA
$$ [...]
19958H95511J5617j1728J0580M2517l7873l1003J91J3907N5350L4109n3909n6807
19946H76462j0265j7828K0056K9876J9350L9702n598l7861j0532m3032m4485m123
19934H11722j24k5533L6853M6292J6881N6959J5921j6498n5532L5750Q910o148
19922I25453j1314O692M5830m3271O07k3154J5287L6989k326o048J1428J8962
19910I75135k2970l2403J8670K3312L8697L607j110N2428O3120j065o5363r485
19898A042573l4742k5172M7370L9471J4763k0640J8641O0906J4062j539q957l168
19886A143568M2240J4279N5461M5230Q1987l133o0219k8215j567K8009J5661l8545
19874A294756k1346j3769j1580l5891J1462j9454R979l4497p1982j6610L24Q843
$$ y = [895511, 911128, 899400, 909980, 952497, 914624, 883621, 883812, 897719, 953069, 987178, 933269, 876462, 866197, 848369, 868425, 898301, 917651, 957353, 951755, 913894, 903362, 860330, 815845, 811722, 811598, 786065, 822918, 869210, 886091, 943050, 958971, 942473, 886941, 922691, 931601, 925453, 914139, 920831, 966661, 923390, 923997, 900843, 916130, 953119, 950793, 944745, 956173, 975135, 952165, 919762, 938432, 961744, 1000441, 1004048, 1002938, 1055366, 1118486, 1117421, 1052058, 1042573, 1007831, 982659, 1030029, 1069500, 1084263, 1063623, 1082264, 1143170, 1157232, 1155693, 1146736, 1143568, 1185808, 1200087, 1255548, 1300778, 1382765, 1379632, 1319413, 1291198, 1289631, 1317640, 1333301, 1294756, 1273410, 1259641, 1248061, 1212170, 1223632, 1204178, 1214157, 1179660, 1107678, 1091068, 1091392, 1100235]
19862A100235J0631O7468L1230k6725j3775J3402N1367N3167n867p3487m9645
19851A158001l6391J0674Q4397K3368j2017L985J5785l4782j7293l2134O4889
19840A228482P831K6449L7416J9511l2189l9529P649L7343K6703L5117M8812j5621
19828A387974k3023L8407K9097m63p478j1926k7107J7850K0896K0889j6003k5733
19816A403380N1077K2218J6920q060n7148m3087J8532L0382Q265j4915j987J0502
19804A436079L3440L8211L5247M5645N8227j2160J0160n3203k8370j7778K7498
19793A572996l0481J6904J8644O0667p1956j2947K4257K6477n0313M5567L5638
19782A635453J3429K9176N8449k1944o1406l811K3667L2145l913J719J7834J2527
$$ y = [1100235, 1110866, 1178334, 1209564, 1182839, 1169064, 1182466, 1233833, 1287000, 1281133, 1207646, 1158001, 1121610, 1132284, 1216681, 1240049, 1228032, 1232017, 1247802, 1213020, 1195727, 1163593, 1228482, 1236313, 1262762, 1300178, 1319689, 1287500, 1247971, 1255620, 1292963, 1319666, 1354783, 1403595, 1387974, 1364951, 1403358, 1432455, 1431992, 1424514, 1412588, 1385481, 1403331, 1424227, 1445116, 1429113, 1403380, 1454457, 1476675, 1493595, 1485535, 1428387, 1385300, 1403832, 1434214, 1442479, 1427564, 1425577, 1436079, 1469519, 1507730, 1542977, 1588622, 1646849, 1634689, 1644849, 1591646, 1563276, 1545498, 1572996, 1542515, 1559419, 1578063, 1638730, 1566774, 1553827, 1578084, 1604561, 1554248, 1599815, 1635453, 1648882, 1678058, 1736507, 1714563, 1653157, 1649346, 1673013, 1705158, 1701245, 1702964, 1720798, 1733325]
19770A733325j9918M9279k5084J4633O5333P0319N4269M6239M1900r005L4734
19759B056024J04285L0109m137O5687O6904K6224k6022l5006k7638l7668l5198
19748B183564j4817k4813o8174K3473K7658N3844l311K1809P1228n02l2556M0830
19736B278233J9614K468l169O5333P3550O8601k4338J0175M151j9386k7708N5990
19724B503514L9440j33o518J2801O1748P9971J3626j2121Q1888K6680J5360K0252
19712B836508J8943K6907N3590j504O2417P0839K6150M8480P7762O3208J5055
19701C298355Q9150O4471J30034J33899L6656j3298L9755O1185N0598Q5647L4009
19690D010461N792M3408J24605M2090L859O9704J30306J92224J93491J34546O6475
$$ y = [1733325, 1713407, 1762686, 1737602, 1752235, 1817568, 1887887, 1942156, 1988395, 2030295, 2021290, 2056024, 2160309, 2190418, 2186281, 2251968, 2318872, 2345096, 2319074, 2284068, 2256430, 2218762, 2183564, 2168747, 2143934, 2075760, 2099233, 2126891, 2180735, 2177424, 2199233, 2270461, 2269959, 2237403, 2278233, 2297847, 2300315, 2297146, 2362479, 2436029, 2504630, 2480292, 2490467, 2494618, 2475232, 2447524, 2503514, 2542954, 2542821, 2536303, 2549104, 2610852, 2690823, 2704449, 2692328, 2774216, 2800896, 2816256, 2836508, 2855451, 2882358, 2935948, 2934444, 2996861, 3067700, 3093850, 3142330, 3220092, 3283300, 3298355, 3387505, 3451976, 3582010, 3715909, 3752565, 3739267, 3779022, 3840207, 3890805, 3976452, 4010461, 4016253, 4059661, 4184266, 4226356, 4230215, 4299919, 4430225, 4622449, 4815940, 4950486, 5016961]
19679E016961O3963P0251J19917J30774J98647J68465J71922K01485K58167K52341
19669F652893L20348K83257L46410L63139L72768L51619L12576K64018K66018
19660I533046K10673K68703L23614K59496L12354L39383L34622L73077M72516
19651A2427484N85756O54234P83870R02014J041831J184944J371422J582337J820911
19642B2354803K184007K507275K976056L696293M511680N654256P303427R432219
19634F0620016J2140115J5465248J8912024K1760699K3072799K1894573J8243199
19627A92108673J2753780O607239Q74270m046218q193635j2415403j7179699k1832144
19619A48676863k4863531k5134097k2533355j8235792j3740839r995749p209083
$$ y = [5016961, 5080924, 5151175, 5271092, 5401866, 5600513, 5768978, 5940900, 6142385, 6400552, 6652893, 6973241, 7256498, 7602908, 7966047, 8338815, 8690434, 9003010, 9267028, 9533046, 9743719, 10012422, 10336036, 10595532, 10907886, 11247269, 11581891, 11954968, 12427484, 13013240, 13667474, 14451344, 15353358, 16395189, 17580133, 18951555, 20533892, 22354803, 24538810, 27046085, 30022141, 33718434, 38230114, 43884370, 51187797, 60620016, 72760131, 88225379, 107137403, 128898102, 151970901, 173865474, 192108673, 204862453, 211469692, 212343962, 208297744, 200104109, 187688706, 170509007, 148676863, 123813332, 98679235, 76145880, 57910088, 44169249, 34173500, 26964417]
19612B6964417n214869l835357k910727k243769j781285j455975j286352j093102
19604G142981q86702p05021n81944n05537m16271l13712k48669j81342j36524
19595C167259j52913j27967r3645r9177p6843p9947n2733r2536j31651j19268
19585B140579j95779j78307j94756k49940k06212j93583j75333j58190k01027
19576C87452j92352r6105p3129o2634m0435o8119m7348p2466l8099N0967Q10j4799
19564b66257K2388k1730l7805n4249k6778m4531L3m3458k1909q520K2289K7389
19552d53138j4061N5621M6627K4983M1124O2810J08936J01215J24009J16344N1715
19541B66185J7337o8981m9291l1511j1561r901j73709j84390j23884r4038m4828
$$ y = [26964417, 21749548, 17914191, 15003464, 12759695, 10978410, 9522435, 8236083, 7142981, 6256279, 5551258, 4969314, 4463777, 4047506, 3733794, 3485125, 3303783, 3167259, 3014346, 2886379, 2792734, 2693557, 2616714, 2536767, 2484034, 2391498, 2259847, 2140579, 1944800, 1766493, 1571737, 1321797, 1115585, 922002, 746669, 588479, 387452, 195100, 98995, 25866, -36768, -77203, -145322, -192670, -265136, -303235, -252268, -251458, -266257, -243869, -265599, -303404, -357653, -384431, -428962, -428929, -472387, -494296, -502816, -480527, -453138, -467199, -411578, -364951, -339968, -298844, -236034, -127098, -25883, 98126, 214470, 266185, 283522, 214541, 165250, 133739, 122178, 112277, -61432, -245822, -369706, -463744, -508572]
19530e08572n5987l027m8146j6159p0142P449J8769J1023O7182j4866K380M288
19518f05808j8903K0300J7294j327O4070N6995k2748J4341J1713j598L7851J7804
19506d10016J7679J1980J7416L5717K7491N6969j2220l3971j8991l9211k075J4596
19494c34636j5890m5216n4869K5040J9637k3637j9909j2786k7859J7181M9111
19483d23833O8278o719J3277M9180R4626N0845M7852L812L9642O5702O413L3861
19471D2936P113k3134k3991m731l0433k8627m3783k6964n2134j03228p0777m3110
19459d00863m6497l499O5854l0382m516m0912L4485O4694L9417m5435l0890L9211
19447c59333L2306M802K5667P4448J177j3770N787O347k4154l4025l2996M5254
$$ y = [-508572, -564559, -567586, -615732, -631891, -702033, -694584, -675815, -664792, -597610, -612476, -610096, -605808, -624711, -604411, -587117, -588444, -524374, -467379, -490127, -475786, -464073, -465671, -427820, -410016, -392337, -380357, -362941, -327224, -299733, -242764, -254984, -288955, -307946, -347157, -349232, -334636, -350526, -395742, -450611, -425571, -405934, -429571, -449480, -462266, -490125, -472944, -423833, -355555, -362274, -348997, -299817, -205191, -154346, -106494, -102682, -63040, 2662, 9075, 42936, 50049, 26915, 2924, -1807, -32240, -60867, -104650, -131614, -183748, -286976, -357753, -400863, -447360, -450859, -385005, -415387, -419903, -460815, -426330, -361636, -322219, -367654, -398544, -359333, -327027, -322225, -296558, -222110, -220933, -234703, -228916, -222569, -246723, -280748, -313744, -268490]
19435b68490L8739k396j2549l1364k6758k6125M4599L3654j0004m5700l5306R939
19423c31761N8702J0022k7021m2806R705J7059K6026Q024J0009j3667O0526M5269
19411a69913K3961m5171m4454K839N600k5482L432M9310N5006q800j6784j5431
19399a85887o0287l6031K240j0694N2755L2989J6522O5844O4101j3554m9085j7078
19387a38165K1055m823o3045O808O2175m996l3337J275L5137j395J4805P8745
19375b5761O6345l3363q153K6665L6139o1189j12703k2072L1820k3726p356M8802
19363h4552L2029M1340K2383j6291J4588m2765l2046P8992M3421L3449J0677p0525
19351C0700l8789K575k8527J9742L6029L4693j8497m9066l0914q598K4668K8291
$$ y = [-268490, -229751, -232147, -244696, -276060, -302818, -328943, -284344, -250690, -260694, -306394, -341700, -331761, -273059, -263037, -290058, -332864, -323159, -306100, -280074, -272050, -262041, -275708, -215182, -169913, -145952, -191123, -235577, -232738, -227138, -252620, -249188, -199878, -144872, -153672, -170456, -185887, -246174, -282205, -279965, -290659, -237904, -204915, -188393, -122549, -58448, -72002, -121087, -138165, -117110, -121933, -184978, -178170, -115995, -120991, -154328, -153053, -117916, -119311, -104506, -25761, 40584, 7221, -932, 25733, 61872, 683, -112020, -134092, -102272, -125998, -133354, -84552, -52523, -11183, 11200, -5091, 9497, -33268, -65314, 13678, 57099, 90548, 101225, 30700, -8089, -5514, -34041, -14299, 21730, 56423, 37926, -11140, -42054, -50652, -25984, 2307]
19339B307O1067l54j8098j4442m8768l4144K8789O2965O6042J7640M809J0371
19327A38184O264j4821O0M9992J8871k7278K2471K9474o488m5359J9319M9799
19315B40488l6240O1704K785l5468O999j080O2704N0624l3582L3033N7389L7858
19303D47214P6056j3237J1378k0039M1003M0415K7788l1827o2514n1529k2634
19292D42074K871K5496K5442P44j4196J6927j4177n3076m7939J4740k068m0303
19280C56535k8718m9953l2099N9808O8742Q4972k5338p5627K6203M6192N6870
19269D87587j7885K922j2794m369m882m4471J9053O7522k1200K9469R9215M9751
19257F49918l762N4530J5324P7940M5102m4782n3639K3882K3758l8171J1191J13665
$$ y = [2307, 63374, 63020, 44922, 30480, -18288, -52432, -23643, 39322, 105364, 123004, 127813, 138184, 144448, 129627, 129687, 179679, 198550, 171272, 193743, 223217, 216729, 171370, 190689, 240488, 204248, 265952, 268737, 233269, 240268, 239188, 301892, 352516, 318934, 351967, 409356, 447214, 523270, 510033, 521411, 501372, 542375, 582790, 610578, 578751, 516237, 464708, 442074, 444945, 470441, 495883, 496627, 482431, 499358, 485181, 432105, 384166, 398906, 396838, 356535, 327817, 277864, 245765, 305573, 374315, 459287, 433949, 358322, 384525, 430717, 487587, 469702, 472624, 459830, 455461, 450579, 406108, 425161, 492683, 471483, 500952, 600167, 649918, 646156, 700686, 716010, 793950, 839052, 794270, 740631, 764513, 788271, 750100, 761291, 874956]
19245H74956O9727J916J1516K2996m4139O6304J00090R6068J8986P3978J04289
19234A396687R1753J19690J39199Q2265J60005J26436J15401M3616K7618m8800
19224B253870o8909o2498j17041j66695j35184j24732j25464j36517j57538q3646
19214A075646q7676q9384n9508p9075o6359q4322o3995p5080n3589n3449k6649
19203C36560J9469M7410L8857M5282j844p626J5218L4233k0933p1351K1465L810
19191D60550N383N5185L013j7700m3229l9131q349o064L891j0262J4061L0108
19179D47456O920J8820k8208k5760O4911q2807n5609K6525K7201M9458J3335N0898
19167E13140N955j7267m086l2627K4174L6263Q062k0861K3426K3465m65m6127
$$ y = [874956, 944683, 946599, 958115, 981111, 936972, 1003276, 1103366, 1199434, 1218420, 1292398, 1396687, 1488440, 1608130, 1747329, 1829594, 1989599, 2116035, 2231436, 2275052, 2302670, 2253870, 2184961, 2122463, 2005422, 1838727, 1703543, 1578811, 1453347, 1316830, 1159292, 1075646, 987970, 898586, 839078, 760003, 693644, 609322, 545327, 470247, 416658, 363209, 336560, 356029, 403439, 442296, 487578, 485734, 478108, 493326, 527559, 506626, 435275, 456740, 460550, 465933, 521118, 524131, 506431, 463202, 424071, 415722, 409658, 413549, 403287, 417348, 447456, 454376, 473196, 444988, 419228, 484139, 401332, 345723, 372248, 399449, 448907, 462242, 513140, 519095, 501828, 497742, 465115, 489289, 525552, 533614, 512753, 536179, 559644, 559179, 513052]
19155E13052J087k1672n2553M3511L1676K7254Q407K6811K7896M540m754m9150
19143E56105P276M2783K4196j1394k0238n301O607k839K0087l3279K9762M0634
19131F54399K4768n7131O249K4851L4878K9508k9100j5829j8021L8212o697J3949
19119G00036P7178M2560J186r003K0088L2289L2976K5459j9956m3141J7976J4406
19107H92054o1664k9145l619Q119K5719M9606P6138k4768L3928o012K6384K2256
19095A008996m0791M0817L5790J2282n761m2776n5851j5452k6433j5574l5265
19084H59982J2254K1483M841p968L9777M437P144k0989M8210l410o5258P43J5582
19071I16828L7968K3920j7471J4898J5217O6113K7900K6914k0765K0319o892K4952
$$ y = [513052, 514139, 492467, 439914, 483425, 515101, 542355, 550762, 577573, 605469, 610009, 605255, 556105, 563381, 606164, 630360, 618966, 598728, 593427, 600034, 597195, 617282, 584003, 613765, 654399, 679167, 622036, 628285, 653136, 688014, 717522, 688422, 672593, 654572, 692784, 686087, 700036, 777214, 819774, 820960, 811957, 832045, 864334, 897310, 922769, 902813, 859672, 877648, 892054, 830390, 801245, 797626, 805745, 831464, 881070, 957208, 932440, 966368, 960356, 986740, 1008996, 968205, 1009022, 1044812, 1057094, 1051333, 1008557, 952706, 937254, 910821, 895247, 859982, 872236, 893719, 898560, 890592, 930369, 934806, 941950, 920961, 969171, 965761, 900503, 901246, 916828, 954796, 978716, 961245, 976143, 991360, 1057473, 1085373, 1112287, 1091522, 1111841, 1104949, 1129901]
19059A129901N4322J4255K8544K8116k7597L075N6998L3525m2085o2758j5613
19048A200683J0247j2202k6285m2080P85j6098n5750k3146j7430l4152k7065l2840
19036I24667N0762O2126j5591M7107L7462l5617n6250l0950j4114P918K2181q565
19024I91136J9916k5536L0617P6520L1162k3001n4745K582K5151L2194l954l563
19012A098479J95O4726J4429l6526J312J9129m6196j0212O8890K6149k4489o368
19000A169518N6314J2477n3858M4788N1145l7221J3496M856j0904k830k8712J3814
18988A232883L2665p364K3309J8625K935k0121K2870K5099K3602M2608N7948K3493
18976A478552j3587m550K7120J3590M0435L9006J08470J12091J07092R8883R9964
$$ y = [1129901, 1184223, 1198478, 1227022, 1255138, 1227541, 1230616, 1287614, 1321139, 1279054, 1216296, 1200683, 1210930, 1198728, 1172443, 1130363, 1131148, 1115050, 1059300, 1036154, 1018724, 984572, 957507, 924667, 975429, 1037555, 1021964, 1069071, 1106533, 1070916, 1014666, 983716, 969602, 977520, 999701, 991136, 1011052, 985516, 1016133, 1092653, 1123815, 1100814, 1046069, 1048651, 1073802, 1105996, 1102042, 1098479, 1098674, 1163400, 1177829, 1141303, 1142615, 1161744, 1115548, 1105336, 1174226, 1200375, 1175886, 1169518, 1225832, 1238309, 1184451, 1229239, 1280384, 1243163, 1256659, 1261515, 1250611, 1247781, 1219069, 1232883, 1265548, 1258184, 1281493, 1300118, 1303053, 1282932, 1305802, 1330901, 1354503, 1397111, 1455059, 1478552, 1464965, 1460415, 1487535, 1501125, 1541560, 1580566, 1689036, 1801127, 1908219, 2007102, 2107066]
18965B107066O6517P7153L0709K7406J9475o1220k6105m6485o5626r9469j01784
18954A927637j08963n1222m7737l0248K985J0311p3719n1489k3516k5631r701
18943A518707j1950O4189K6179m848J0387K8797J3030J6067j8974j8434k8783
18932A594367k3739p861P24L0774J2082M0018j6954k1878K3929M1588L6909K4960
18920A734919J691k323k5478J6077M1948K9519L9548L4453k5975O536L1462k3862
18908A858515k099O3051L4640M238l3398j2126J6684l1785k2853R809K4997O4261
18896A973934K3489L2835K7707N1225k799j4039k2990J7130L4802P3102K2127
18885B216523O3960R0439J6705j8604O589M2792l61L0962M2306M6007P0268m598
$$ y = [2107066, 2173583, 2250736, 2281445, 2308851, 2328326, 2267106, 2241001, 2194516, 2128890, 2029421, 1927637, 1818674, 1767452, 1719715, 1689467, 1692452, 1702763, 1629044, 1577555, 1554039, 1528408, 1518707, 1506757, 1570946, 1597125, 1592277, 1602664, 1631461, 1644491, 1660558, 1641584, 1623150, 1594367, 1570628, 1562767, 1563491, 1594265, 1606347, 1646365, 1629411, 1607533, 1631462, 1673050, 1709959, 1734919, 1736610, 1734287, 1708809, 1724886, 1766834, 1796353, 1835901, 1870354, 1844379, 1850915, 1882377, 1858515, 1856416, 1919467, 1954107, 1958345, 1924947, 1912821, 1929505, 1897720, 1874867, 1884676, 1909673, 1973934, 1997423, 2030258, 2057965, 2109190, 2106391, 2092352, 2069362, 2086492, 2121294, 2194396, 2216523, 2280483, 2370922, 2387627, 2369023, 2375612, 2418404, 2418043, 2449005, 2491311, 2537318, 2607586, 2602988]
18873B602988p4980L9574J27671O0659O0190O9831R3828O0860M8122P9085K994
18862C170822j7273O13M3121J2844L4417k2603q903K8322J5475M2083J0641N5331
18850C364890K6599O197N4425Q9670K9254P7626Q6717O6905P0032N7394O3240
18839C992949J19813O1860O5582J38425K28789K22563K54042K72534K96347L60857
18829F013761M56886M84227N32519L30053J93589J40299J46115J19277O5656m1416
18819H440966l0572R2736J12300K47597L58142L39256M08276N35223O74209Q29766
18809A2007899R98415J327465J737426K295315L071682M085913N047511N725808
18801C6297434N758514N561765N352597N144402M695527L824644K496281J129513
$$ y = [2602988, 2528008, 2567582, 2695253, 2755912, 2816102, 2885933, 2979761, 3040621, 3088743, 3167828, 3170822, 3153549, 3154162, 3197283, 3210127, 3244544, 3221941, 3213038, 3241360, 3256835, 3298918, 3309559, 3364890, 3391489, 3397686, 3452111, 3541781, 3571035, 3648661, 3735378, 3802283, 3872315, 3929709, 3992949, 4112762, 4174622, 4240204, 4378629, 4607418, 4829981, 5084023, 5356557, 5652904, 6013761, 6470647, 6954874, 7487393, 7817446, 8011035, 8151334, 8297449, 8416726, 8482382, 8440966, 8410394, 8503130, 8615430, 8863027, 9221169, 9560425, 9968701, 10503924, 11178133, 12007899, 13006314, 14333779, 16071205, 18366520, 21438202, 25524115, 30571626, 36297434, 42055948, 47617713, 52970310, 58114712, 62810239, 66634883, 69131164, 70260677]
18793G0260677J13204m08008j035503k188602l852440n134127m922482l736967
18785D9095752k684163k297475j980700j136144k66039P8898l61033j048883j541421
18776C7858792j705474j772342k334944l417259m138881l886166k873259j769481
18768A5960986r40237l99117j0260K75634M58794Q04804J074435J503370K180856
18759B0909265L015929M216256N833711P581768Q752580Q392810O549601M040895
18751F9292815J758573L15532k47820n50948j459029k743477l127770j963500
18743F1274376k46598J050897J823368K099719J857777P91186j002940l502981
18735F4144804n817155o747593o588233o217122o342707o583506o086162m814146
$$ y = [70260677, 70373881, 69965873, 68930370, 66741768, 62889328, 57755201, 52832719, 49095752, 46411589, 44114114, 42133414, 40997270, 40731231, 40810129, 40449096, 39400213, 37858792, 36153318, 34380976, 32046032, 28628773, 24489892, 20603726, 17730467, 15960986, 15020749, 14621632, 14611372, 14887006, 15345800, 16150604, 17225039, 18728409, 20909265, 23925194, 28141450, 33975161, 41556929, 50309509, 58702319, 65251920, 69292815, 71051388, 71366920, 71119100, 70568152, 69109123, 66365646, 63237876, 61274376, 61027778, 62078675, 63902043, 66001762, 67859539, 68650725, 67647785, 64144804, 58327649, 51580056, 44991823, 38774701, 32431994, 25848488, 19762326, 14948180]
18727A4948180l408442k321043j545055j123746q11940n40669l49874l01901k40540
18718D304970j67067j40689j33837r7391j30225o3796q563O6893J54000K17234
18708D001529L01515L36472J96731O5522r8954j80930j82103k21223l07840m51335
18698C459384n16029m65830l03746k40393j53009j34038o2404n7697o5786L64
18688A460816m2324j2944Q056L8397N8364M6825K1441K4627J16749J26584R0835
18677A937426N2277O9035Q4605M7411l7642m7284j7030p6397q6997o5340q4423
18666A775641J1072L5707Q7301Q4006K269k5128R0496M8170K3428l0773k6516
18655B075673M3680L9250L5912N6018Q1241J0130j2142k948M2393L4166J13962
$$ y = [14948180, 11539738, 9218695, 7673640, 6549894, 5737954, 5197285, 4847411, 4545510, 4304970, 4137903, 3997214, 3863377, 3765986, 3635761, 3571965, 3563402, 3630295, 3784295, 4001529, 4303044, 4639516, 4836247, 4901769, 4802815, 4621885, 4439782, 4218559, 3910719, 3459384, 2943355, 2477525, 2173779, 1933386, 1780377, 1646339, 1583935, 1526238, 1460452, 1460816, 1418492, 1405548, 1413604, 1452001, 1510365, 1557190, 1578631, 1603258, 1720007, 1846591, 1937426, 1989703, 2058738, 2143343, 2190754, 2153112, 2105828, 2088798, 2012401, 1925404, 1860064, 1775641, 1786713, 1822420, 1909721, 1993727, 1995996, 1970868, 2061364, 2109534, 2132962, 2102189, 2075673, 2119353, 2158603, 2194515, 2250533, 2331774, 2341904, 2329762, 2326814, 2369207, 2403373, 2517335]
18644B517335J22856J84049J50938J93238K13930L23924M14502L79227L90468
18635D890467L16608K00494J16809L3923J03954R0596k4084r1495r5641o1288
18625E480343K4526K11873K50517K40213K90671K50498K77870L54370M47648M73203
18615H301732M68264O11953P81877R96955J226474J644891K211254L027690M013798
18606B3284888N078043N680351N555165N120813M674024M402294L713471K462354
18598E9971403P68566j224584k568944k465485j399044k64465Q34516K103582
18590E5755545L288070L258598J892914J7660j563869k516010l122783m131908
18582E2878217n989276p700650p881522o638730m728955l134911j954262j173420
$$ y = [2517335, 2640191, 2824240, 2975178, 3168416, 3382346, 3706270, 4120772, 4499999, 4890467, 5207075, 5407569, 5524378, 5558301, 5662255, 5752851, 5728767, 5637272, 5541631, 5480343, 5504869, 5716742, 5967259, 6207472, 6498143, 6748641, 7026511, 7380881, 7828529, 8301732, 8769996, 9381949, 10163826, 11160781, 12387255, 14032146, 16243400, 19271090, 23284888, 28362931, 34043282, 39598447, 44719260, 49393284, 53795578, 57509049, 59971403, 60739969, 59515385, 56946441, 54480956, 53081912, 52817447, 53651963, 55755545, 59043615, 62302213, 64195127, 64212787, 62648918, 60132908, 57010125, 52878217, 46888941, 39188291, 31306769, 24668039, 19939084, 16804173, 14849911, 13676491]
18574A3676491o64353k99902j69841Q5657L11600N71807Q37295J305470J919979
18565A7574203K823426L863179M877685N058786M132302K818433J537895P49052
18557D3434961O93071R07425Q60689M57818P20411K059449L305249L721867L894450
18548F0055390M168644M714974M865603L992289K207403n7603j505019k004420
18540G6437261k676776m117489o195156p583629p535025o886277o579807o791456
18532B8071646o536949n389003l916166k710876j887621j336990r33022o46065
18524D714954m71216l76553l12846j92343j69012j05273M786J23604K45901K87014
18514C749016K02180J17264n533j33886j94598k44261k91182m34061n68952n88694
$$ y = [13676491, 13012138, 12712236, 12542395, 12628052, 12939652, 13511459, 14348754, 15654224, 17574203, 20397629, 24260808, 29138493, 34197279, 38329581, 41148014, 42685909, 43434961, 44128032, 45035457, 45896146, 46353964, 47074375, 49133824, 52439073, 56160940, 60055390, 64224034, 68939008, 73804611, 77796900, 80004303, 79946700, 78441681, 76437261, 73760485, 69642996, 63447840, 55864211, 48329186, 41442909, 34863102, 28071646, 21534697, 16145694, 12229528, 9518652, 7631031, 6294041, 5361019, 4714954, 4243738, 3867185, 3554339, 3361996, 3192984, 3087711, 3092497, 3216101, 3462002, 3749016, 3951196, 4068460, 4062927, 3929041, 3734443, 3490182, 3199000, 2764939, 2195987, 1607293]
18504A607293m96883l77453k74535j75175j41685q9943j08362j14038j18976j8096
18494c07853p6033p5998j6560o0693m1420l130m0543j9348J8777L1123N6418K7139
18482e08121J797N4189L3682R1274J02866J11551P2983L0711K3798k8568k9715
18471d3553j5928n1229r1123k8985j11338o8067l2425m8006j5933j4467J8025
18460e03029l6775m1296m1438K2736K5835r196n4017n7780j1766n1747n637L5171
18448g28939L3196o9046j1735P417l5655l4654p046L7567L8444Q6656N2256j8980
18436f50519J4553n6728m811L1688L8293l1506m9318M429L7494P863K394l380
18424f59548Q346M4229P0504J0958l1259K6141L5274O112K4208Q335K6221M8465
$$ y = [1607293, 1110410, 732957, 458422, 283247, 141562, 51619, -56743, -170781, -289757, -307853, -383886, -459884, -476444, -537137, -578557, -581687, -622230, -641578, -622801, -591678, -535260, -508121, -506324, -452135, -418453, -327179, -224313, -112762, -39779, -9068, 14730, -13838, -43553, -59481, -110710, -201833, -230818, -342156, -410223, -442648, -490654, -506587, -521054, -503029, -539804, -581100, -622538, -599802, -573967, -583163, -637180, -694960, -706726, -758473, -764110, -728939, -695743, -764789, -776524, -769107, -804762, -839416, -846462, -808895, -770451, -683795, -631539, -650519, -635966, -692694, -697505, -665817, -627524, -659030, -708348, -703919, -666425, -658562, -656168, -659548, -651202, -606973, -536469, -525511, -556770, -530629, -495355, -489243, -465035, -456700, -430479, -382014]
18412c82014L5021n2109k9884q334o3862J4269O260J2531K4144K5281O592K436
18400d09669J4318P883l6456m0338o415J2796J2983L7752k3868o3645j5577K8530
18388d81706K4746M2645P8427k5688o4702K9595n432M6146L7423M2464P1622L8584
18376a65876M3478M581K5576K7948j2661n5191l5677L5912K2721l5676l472N7075
18364i1262J6831O076k929l5517L012Q8K4711j3626L961K3728j0386M406J4702
18351e6205j2931p832M0672J7235k357K4888Q9130L7966m5507j4565N2673K3612
18339A46779J306k331N7073K5908o912K6944L6911L1853K55J2979R884l3435p2171
18326B35043k6551K9987K0783L0367M5792O3638m8793k6924K0726k8967m4381
$$ y = [-382014, -346993, -399102, -428986, -437320, -501182, -486913, -480653, -468122, -443978, -418697, -412105, -409669, -395351, -387468, -423924, -464262, -470677, -457881, -444898, -407146, -431014, -494659, -510236, -481706, -456960, -414315, -335888, -361576, -426278, -396683, -402115, -355969, -318546, -276082, -204460, -165876, -122398, -117817, -92241, -64293, -76954, -132145, -167822, -131910, -109189, -144865, -148337, -91262, -74431, -68355, -71284, -106801, -103789, -103701, -78990, -92616, -88655, -64927, -75313, -70907, -56205, -69136, -76968, -36296, -19061, -21418, 3470, 92600, 130566, 85059, 70494, 123167, 146779, 148085, 145754, 202827, 228735, 221823, 248767, 285678, 317531, 317786, 330765, 340649, 307214, 235043, 208492, 238479, 259262, 289629, 335421, 399059, 350266, 323342, 344068, 315101, 270720]
18315B70720J3303j3296K5227M7398j227P803R427J8621L9950M5567Q6184L4019
18303E83696K8724N2239p834J8512m212J3531k1723j2184M6232k4190J9807J4886
18291G07484O1851O9959P4437N8357k7392l8809K1684M9827k8928k2546n307k3151
18279H97466K071j4344M7452K3616k1274k9921L7363N1240L336l9845n6774L962
18267I04348O9991J09715J6242J6845p435J2579M0728J5107K6633M0160k3743
18256A221170J9923K3999J7407N1805L065L4612O9323L415O7604O1422L7087L7813
18244A648645o739M4591m230l0712J9892R102K7688P2133L3373m0503l6879P5833
18232A812194Q4138Q3222L9435J1253j8470L976O3866J571m1373R519K1068j6513
$$ y = [270720, 284023, 270727, 295954, 343352, 342125, 349928, 359355, 377976, 417926, 463493, 549677, 583696, 612420, 664659, 656825, 675337, 671125, 684656, 662933, 650749, 696981, 672791, 692598, 707484, 769335, 839294, 913731, 972088, 944696, 905887, 927571, 977398, 948470, 925924, 920617, 897466, 899537, 885193, 932645, 956261, 934987, 905066, 942429, 993669, 997005, 957160, 900386, 904348, 974339, 1084054, 1100296, 1117141, 1109706, 1122285, 1163013, 1178120, 1204753, 1244913, 1221170, 1241093, 1265092, 1282499, 1334304, 1337369, 1371981, 1441304, 1444719, 1512323, 1573745, 1610832, 1648645, 1641906, 1686497, 1682267, 1651555, 1671447, 1680549, 1708237, 1780370, 1813743, 1773240, 1736361, 1812194, 1896332, 1979554, 2018989, 2030242, 2011772, 2015748, 2079614, 2081185, 2039812, 2049331, 2070399, 2053886]
18220B053886j3191J6637N8001J1983J1563L6216R3964L2134M7011P706J5168
18209B371078Q5448Q3854J08567Q9292P0570J9469J3402N4502M9905P8362J12770
18198C137219N3335P9438J53865Q8126J14440J00830R6603J62295P3153J27943
18188D187247J51494K06604J08199J30425J64483L02186L66010M02312M96231
18179F515191P00339R88486J289847J786418K237753K356356K182732J663747
18171A9720869J193580Q48740P30522P90702Q04002Q85345J143488J334712J202427
18162B8654387P04261K167n92075r47810j367632j928356k595953l110308l032975
18153A5785706k441016j690463j092646n90509l28518k17118n8643J29078K15043
$$ y = [2053886, 2040695, 2057332, 2115333, 2127316, 2138879, 2175095, 2269059, 2301193, 2348204, 2355910, 2371078, 2456526, 2540380, 2648947, 2738239, 2808809, 2828278, 2841680, 2896182, 2946087, 3024449, 3137219, 3190554, 3269992, 3423857, 3511983, 3626423, 3727253, 3823856, 3986151, 4059304, 4187247, 4338741, 4545345, 4653544, 4783969, 4948452, 5250638, 5616648, 6018960, 6515191, 7215530, 8204016, 9493863, 11280281, 13518034, 15874390, 18057122, 19720869, 20914449, 21763189, 22493711, 23284413, 24088415, 24973760, 26117248, 27451960, 28654387, 29358648, 29360815, 28768740, 27820930, 26453298, 24524942, 21928989, 18818681, 15785706, 13344690, 11654227, 10561581, 9971072, 9642554, 9425436, 9366793, 9495871, 9710914]
18144I710914K43552K88736L24517M83143N45752P54127R02091J067143J405036
18135A5725011J859167K461804L285638M451615O022440P815875R004689Q716252
18127E9342491O957489M552293K579414J338980P95656K04172n21692r80545q03545
18118G3464713j50115L76863K12358m43129j375398k370560l601770n159743o285944
18109E4667275o688534o057873m657246l093035j441359L87830K339974M500541
18101C9957573O690019Q327067Q076130O001514L371219J309471O8000o16313
18093G3184680j328683k841304m171172l632344n22968L963435Q701041J2609817
18085H5962502J4654640J3842143J0198683N199975O40049k791314n539229q528524
$$ y = [9710914, 9954466, 10243202, 10567719, 11050862, 11596614, 12350741, 13252832, 14319975, 15725011, 17584178, 20045982, 23331620, 27783235, 33805675, 41621550, 50626239, 59342491, 66299980, 70852273, 73431687, 74770667, 75566323, 75770495, 75248803, 74268258, 73464713, 73314598, 73691461, 73903819, 73460690, 72085292, 69714732, 66112962, 60953219, 54667275, 47978741, 41920868, 37263622, 34170587, 32729228, 33117058, 35457032, 39957573, 46647592, 54974659, 63050789, 69052303, 72423522, 73732993, 73800993, 73184680, 71855997, 69014693, 64843521, 61211177, 60688209, 64651644, 73352685, 85962502, 100617142, 114459285, 124657968, 129857943, 130497992, 127706678, 122167449, 113638925]
18077A13638925j1633925j4192657j4615409j2000518p584232k867792R11077
18070E1655469L000334L291819K223511N87232q32405j776773k651272l771546
18062E1726369n052304n978616n787492m375820k410628m24296J550956L473485
18054C2721654N153681O386401P030334O426292M611546K528957Q67773l01401
18046F5425237j039880j430016j498062j225414k15793N71263J07585j083274
18038E9611646k196847k875671l286024m006134n589689p560727q166073o929017
18030A9001464n013272l465136k372293j629786j067521p53921n37045l97399
18022C765091k33956k03042j43160j54643j05831n7631l6100K3926J96970K99185
$$ y = [113638925, 102005000, 87812343, 73196934, 61196416, 53612184, 50744392, 51655469, 54655803, 57947622, 60171133, 60758365, 59925960, 58149187, 55497915, 51726369, 46674065, 40695449, 34907957, 30532137, 28121509, 27697213, 29248169, 32721654, 37875335, 44261736, 51292070, 57718362, 62329908, 64858865, 65726638, 65425237, 64385357, 62955341, 61457279, 60231865, 60016072, 60587335, 60694920, 59611646, 57414799, 54539128, 51253104, 47246970, 41657281, 34096554, 25930481, 19001464, 13988192, 10523056, 8150763, 6520977, 5453456, 4699535, 4162490, 3765091, 3531135, 3328093, 3184933, 3030290, 2924459, 2866828, 2830728, 2854654, 3051624, 3350809]
18012C350809M15703O07212R51711J401217K029152K692338K982441K440249J484826
18003A8355658O22894K7550j32863j67801m68424r81499j184179r37472p08423
17994A4425441p08957q38082r22382r51266r71310j330210j825614k165374j874510
17985B837736j327574r44509o16250l83168k69792k08901k18637j77328o7920
17976a376343O074k980o2158o0812j02598l5493P717N7576L7909p3726l6542j6114
17964a657490l5096q0835j01388P507P626j640p557j2884n4209J159J4772m2396
17952a962431L2780K9296q8085n0025j2106j7529M538l8607n8600j1054M548K1876
17940b145399M7003K1965O209j03821l0620P721n837J6900P5610n8l8602K3283
$$ y = [3350809, 3766512, 4373724, 5325435, 6726652, 8755804, 11448142, 14430583, 16870832, 18355658, 18978552, 19006102, 18873239, 18705438, 18237014, 17255515, 16071336, 15133864, 14425441, 13716484, 12878402, 11956020, 11004754, 10033444, 8703234, 6877620, 4712246, 2837736, 1510162, 565653, -50597, -433765, -703557, -912458, -1131095, -1308423, -1376343, -1370269, -1373249, -1435407, -1496219, -1598817, -1634310, -1626593, -1569017, -1531108, -1604834, -1641376, -1657490, -1692586, -1773421, -1874809, -1867302, -1859676, -1861316, -1868873, -1881757, -1935966, -1934807, -1920035, -1962431, -1929651, -1900355, -1988440, -2038465, -2050571, -2068100, -2063562, -2102169, -2160769, -2171823, -2167275, -2145399, -2098396, -2076431, -2070222, -2174043, -2204663, -2196942, -2202779, -2185879, -2110269, -2110327, -2148929, -2125646]
17928b125646J4204L9747j663k0909j1056k9256p273J6191K394Q3573n14j5532
17916b055740P822k1026p2268L5477J26535N8765k90l5135j5023J074j5700n48
17904a986057M8084l950o491j9472M2678K332j2292n8146p276O1262J02092J4968
17892a822268m1533p9363J5047R385q605J5431R867O102k4454O991K3661M4200
17880a845539j227O665O009J1928m04m0263m1232M1574O8426J1608k8028j241
17868a811724j6543n957K3437J2486M734J9131O7612k305k8300n4891p2236J1499
17856a853057O3615Q651j0875M0806K8502j3723o793n638j6530p748O706j623
17844a767707L5956Q306n8483M1870K6458k4008K9911l118k2561R5k615J0192
$$ y = [-2125646, -2111442, -2071695, -2073358, -2094267, -2105323, -2134579, -2141852, -2125661, -2123267, -2039694, -2040208, -2055740, -2047918, -2068944, -2141212, -2105735, -1979200, -1920435, -1920725, -1955860, -1970883, -1969809, -1985509, -1986057, -1937973, -1941923, -1948414, -1967886, -1925208, -1922876, -1935168, -1993314, -2000590, -1939328, -1837236, -1822268, -1863801, -1943164, -1928117, -1918732, -1927337, -1911906, -1902039, -1895937, -1920391, -1913400, -1889739, -1845539, -1846766, -1840101, -1834092, -1822164, -1822568, -1862831, -1904063, -1862489, -1794063, -1782455, -1810483, -1811724, -1828267, -1834224, -1810787, -1798301, -1793567, -1774436, -1706824, -1709129, -1737429, -1792320, -1864556, -1853057, -1789442, -1780791, -1791666, -1750860, -1722358, -1736081, -1742874, -1748512, -1765042, -1772790, -1766084, -1767707, -1731751, -1723445, -1781928, -1740058, -1713600, -1737608, -1707697, -1710815, -1733376, -1733281, -1735896, -1725704]
17832a725704L9169r675k1360q20N4270N2647k4150l0686m2735L3566Q8269P2750
17820a514459n879k4957n1055m8477L870J8322L6586m646j6179m6719M115N3131
17808a596347l1661J27k6735J5285P986k3527k1533M0216L4985L0689L7867J7398
17796a515250m898q260J4228K3358k2900k9785K7749O9582L035n2137o001K2784
17784a478495N681J3127K6119l8315K6338L7033O7824K7435M206j8571m6427j6820
17772a390865L1682O9831n1288l1846l5401o0522N589J7179M9196J2881m1268
17761a424832O767J2401K0330J6175r468o0214J6487O4130L4049R238r74J1437
17749a304474j4447k4449k5213k324k9950q989j235J5659o868o3957l2458M0417
$$ y = [-1725704, -1686535, -1696210, -1717570, -1718390, -1664120, -1611473, -1635623, -1666309, -1709044, -1675478, -1587209, -1514459, -1520338, -1545295, -1596350, -1644827, -1640957, -1622635, -1586049, -1590695, -1606874, -1653593, -1649478, -1596347, -1628008, -1627881, -1654616, -1639331, -1631345, -1654872, -1676405, -1636189, -1601204, -1570515, -1532648, -1515250, -1520148, -1528408, -1514180, -1490822, -1513722, -1543507, -1515758, -1446176, -1443141, -1495278, -1501279, -1478495, -1472814, -1459687, -1433568, -1471883, -1445545, -1408512, -1340688, -1313253, -1309047, -1327618, -1374045, -1390865, -1359183, -1289352, -1340640, -1372486, -1407887, -1468409, -1462820, -1445641, -1396445, -1383564, -1424832, -1418065, -1405664, -1385334, -1369159, -1378627, -1438841, -1422354, -1358224, -1324175, -1314937, -1315911, -1304474, -1318921, -1343370, -1368583, -1370907, -1400857, -1409846, -1411081, -1395422, -1402290, -1466247, -1498705, -1458288]
17737a458288P5906P9289M4980j6487n5784j0183K6246K4686R084j4330j5581
17726a310462J5418q724M9901K1571o8821k5444J0940J4940N0337m4290k32o733
17714a301599P0234K4706p918l870j1377q216L721L9624K8941J597q6377k3245
17702a273779k5939K6918o306N0605M7760M4013J6486m9829q105k7547J6140N0409
17690a139174O5876l7404j00093m5004K6910Q0222M1630o200k512j2610k8996
17679a157355n658l0194J7198M1970L7656J8842j0312m2886l736K4859M8386o410
17667a067640J0476J991m1086j1062O9647J8763J1372j1787K5092O1902J12470
17656h19862K6886L5827j5533j4604J3168L583n6521N471j723k0345k5652q25
$$ y = [-1458288, -1382382, -1303093, -1258113, -1274600, -1330384, -1340567, -1314321, -1289635, -1280551, -1294881, -1310462, -1295044, -1303768, -1253867, -1232296, -1301117, -1326561, -1315621, -1300681, -1250344, -1294634, -1294866, -1301599, -1231365, -1206659, -1214577, -1218447, -1229824, -1238040, -1234319, -1194695, -1165754, -1164157, -1250534, -1273779, -1299718, -1272800, -1279106, -1228501, -1180741, -1136728, -1120242, -1170071, -1178176, -1205723, -1189583, -1139174, -1073298, -1110702, -1210795, -1255799, -1228889, -1148667, -1107037, -1113237, -1115749, -1128359, -1157355, -1163013, -1193207, -1176009, -1134039, -1096383, -1077541, -1087853, -1130739, -1134475, -1109616, -1061230, -1067640, -1057164, -1055173, -1096259, -1107321, -1037674, -1018911, -1007539, -1019326, -994234, -932332, -819862, -792976, -757149, -772682, -787286, -774118, -770535, -827056, -821585, -823308, -843653, -869305, -870130]
17644h70130o574j5214j376l5266m8057j8814k4700K0781n061j1664j8659J2163
17632a022571q796m6511l691P9665L1665l7509j770L0340k5240K7033L294l58
17620i74449J9208O6557K2832n9933l2768L4954J9681n077P5670N9063K6978M552
17608g42732N0561N8677O8215L9248K677L5275O4850j6047o0761J600R2560q123
17596d14000n7572j3637k1621k5462l9418k3013J8998o4456o0167j9801l5518
17585g55667l8332l2515K5922j9703o9389p599K8745j2370o9381k7435J2767L7677
17573i27280N238K920K542j1208N1799K8721m7165J2977P792M9495M0608K6244
17561g57317K8864K732P294K0384J8733M2906P1908P0363O7387Q613j5383m9444
$$ y = [-870130, -876704, -891918, -893294, -928560, -976617, -995431, -1020131, -999350, -1004411, -1016075, -1034734, -1022571, -1031367, -1077878, -1081569, -1001904, -970239, -1007748, -1009518, -979178, -1004418, -977385, -974091, -974449, -955241, -888684, -865852, -925785, -958553, -923599, -903918, -908995, -833325, -774262, -747284, -742732, -692171, -633494, -565279, -526031, -523354, -488079, -423229, -439276, -500037, -498437, -405877, -414000, -471572, -485209, -506830, -532292, -571710, -594723, -575725, -640181, -700348, -720149, -755667, -793999, -826514, -800592, -820295, -889684, -897283, -868538, -880908, -950289, -977724, -964957, -927280, -922042, -919122, -916580, -927788, -875989, -847268, -894433, -881456, -873664, -824169, -783561, -757317, -728453, -725721, -718427, -698043, -679310, -636404, -564496, -494133, -426746, -418133, -433516, -482960]
17549d82960L7199K8221K6822l1774J2234j5339l2256J87l7313q5905n4207k1226
17537f56317J0277k972l0821k6479l6149j8759n7845p9307p652L9103k7366l7789
17525i32076l721P8246P27n9003L4870M2519n5317n7079m639K8140K9763R164
17513h88406K781j5223N9579J6911k8223J6070k0995L1606N5502K4517L8812J6325
17501f90744j7204j3336L9261N5218j5661k2744o507K2704k3047o9198o1091J7894
17489g84455k4188m8002j4220L2686K6050j7481j9827n288L4667L5421n810n6403
17477h46850p9837m345K0086O0641J1898o3039j6258O7745O027k2293k5742l3322
17465i25289K1958N9283k1242O232M0462N8695n5685L472L7723l5071n5222J2054
$$ y = [-482960, -445761, -417540, -390718, -422492, -410258, -425597, -457853, -457666, -494979, -580884, -635091, -656317, -646040, -649012, -679833, -706312, -742461, -761220, -819065, -898372, -906024, -866921, -894287, -932076, -935797, -857551, -856824, -915827, -880957, -838438, -893755, -950834, -955473, -927333, -897570, -888406, -885625, -900848, -841269, -824358, -852581, -836511, -857506, -825900, -770398, -745881, -707069, -690744, -707948, -721284, -682023, -626805, -642466, -665210, -671717, -649013, -672060, -741258, -802349, -784455, -808643, -856645, -870865, -838179, -812129, -829610, -849437, -854725, -820058, -784637, -790447, -846850, -926687, -931032, -910946, -850305, -838407, -901446, -917704, -849959, -843932, -866225, -891967, -925289, -903331, -844048, -865290, -859058, -818596, -759901, -815586, -812114, -774391, -809462, -864684, -852630]
17453h52630J4056K4318K7567K3688l7617k9030L9236L1827l189N93o5471n5847
17441h82499o948M7999R557k1477j4686L6746N9545N1982j5729n7170m1004j4173
17429h47857m1724J3457M1471J5487J1379K1712l2714r62L1460K0243j4763M593
17417g78218J3076J7030K988m2999j7846l6361L385N3820j638N374j4635k1129
17405h17153N1270l5303n5645K3089M5155L6978M7062j965n257p4940p6969K6814
17393h36864K2445L233l649q273J7771j8743j0494L3721k0073k1249O8128K0428
17381g53619l7960K5234k4314J7012Q8566K3619l7434o4933l2546Q160o538O5979
17369g28774K3840K6494k7659k9928k2153j6428J7764K5599N9270K9161q0136
$$ y = [-852630, -838574, -814256, -786689, -763001, -800618, -829648, -790412, -758585, -761774, -761181, -826652, -882499, -889447, -841448, -831891, -853368, -868054, -831308, -771763, -719781, -735510, -792680, -833684, -847857, -889581, -876124, -834653, -819166, -807787, -786075, -818789, -819751, -788291, -768048, -782811, -778218, -765142, -748112, -745124, -788123, -805969, -842330, -838945, -785125, -786763, -781389, -796024, -817153, -765883, -801186, -856831, -833742, -788587, -751609, -704547, -706512, -711769, -786709, -863678, -836864, -814419, -811186, -814835, -823108, -805337, -824080, -834574, -800853, -820926, -842175, -774047, -753619, -791579, -766345, -790659, -773647, -685081, -661462, -698896, -763829, -796375, -788215, -794753, -728774, -704934, -678440, -706099, -736027, -758180, -774608, -756844, -731245, -671975, -642814, -722950]
17358g22950k4093R1043R997L427l2390k549J5952j3701k3504k9339M8238m3104
17346g22973l6937k3668K8717M6638K9927j1030N8097J7226l8826p7883M568Q555
17334g17589O387o1195j0639L9259K106j4160k7401k2919N7847N2472K320o195
17322f99707J938P392m4323L3964N2395K0693j5340K944K0417K9457r058Q816
17310e90412j8812l206j0058p3026n7587r059N0876j2227M9639l1351o3602L939
17298g64886m27k1953j7479J4963P4957M5215N1268M5125j0893j5087j548K0655
17286e80090m5192k5764j2611n1991l111n674P042l3025M2172O427j1350J5851
17274f97316n391O2674K8892o948j7773J0300K1349l2137j4537m6228L1248L8305
$$ y = [-722950, -747043, -656000, -646003, -642576, -674966, -677515, -661563, -675264, -698768, -728107, -679869, -722973, -759910, -783578, -754861, -708223, -678296, -689326, -631229, -614003, -652829, -730712, -726144, -717589, -711202, -772397, -783036, -743777, -741671, -755831, -783232, -806151, -748304, -695832, -693512, -699707, -697769, -690377, -734700, -700736, -648341, -627648, -642988, -640044, -619627, -590170, -599228, -590412, -609224, -612430, -622488, -695514, -753101, -762160, -711284, -723511, -673872, -705223, -768825, -764886, -765313, -787266, -804745, -789782, -714825, -669610, -618342, -573217, -584110, -599197, -600745, -580090, -625282, -651046, -663657, -715648, -718759, -724433, -717391, -750416, -708244, -701817, -713167, -697316, -702707, -640033, -611141, -618089, -635862, -625562, -604213, -636350, -650887, -697115, -665867, -627562]
17262f27562q304m7979k9846P6153m1578m0286J0924M3893k998k5398K0612K722
17250f69647j1897m0787J4098L7622N0007k9631j5102K4057j8598j9076L8462
17239f40492K4198R129o8507j5703N6047J8267p2819l1921L7974J0954P1142M1125
17227e60606r153K0429M0772j6712n7412m9868o843M3342K7811l6652m8207J4642
17215f38457L6373k4052m0458N6719r447o1173l3563K8864L9597k8883p296K042
17203f79734L3240K189P310K9140Q477r995J5738l5898l9502K390p012k9283P170
17190f95770l3255l028N3171L9518L2133J6842P395l1707K0592K1365j1328m3690
17178f27762j6801l1645o834R443M4517M9366M3427L0043j6484k371k5928k5780
$$ y = [-627562, -635866, -683845, -713691, -637538, -679116, -719402, -708478, -664585, -667583, -692981, -672369, -669647, -681544, -722331, -708233, -670611, -620604, -650235, -665337, -641280, -659878, -678954, -640492, -616294, -607165, -675672, -691375, -635328, -617061, -689880, -721801, -683827, -672873, -601731, -560606, -569759, -549330, -508558, -525270, -582682, -632550, -639393, -596051, -568240, -604892, -653099, -638457, -602084, -626136, -666594, -609875, -619322, -680495, -714058, -685194, -645597, -674480, -681776, -679734, -646494, -644305, -636995, -607855, -599378, -609373, -593635, -629533, -669035, -666645, -673657, -702940, -695770, -729025, -732053, -678882, -639364, -607231, -590389, -582994, -614701, -594109, -572744, -584072, -627762, -644563, -676208, -683042, -673599, -629082, -579716, -536289, -506246, -522730, -525101, -551029, -576809]
17166e76809j1065j4030r618l2701K0618M5127P735J3725j5328k5778r714K5242
17154e82596L4172M0016Q119m1273k1047j9672k3948J2286r7o2330j7063N5151
17142f18282J5356K1099K4024n2685m6467l3998L5227L1794K1163R2941K7926
17131d81902r358k4178l139m3997n5158O7642K1956K1198J5227k8800j9592N5111
17119d84990N0170m3902r0643m0811K4506K2700o509O7118Q463q812k209M1257
17107d63662n486m5185p777P3803j9713q7557n2518R183N6843L1736K3806K2851
17095d63676M5460j0136l7471j4876M3794L2224j2391o0703j7743l2880n2886
17084e81284k3991K3J8506k0744J9995O3524q85k1337K6504m201r840N0724m7218
$$ y = [-576809, -587874, -601904, -611522, -644223, -623605, -578478, -570743, -557018, -572346, -598124, -607838, -582596, -548424, -508408, -500289, -541562, -562609, -582281, -606229, -593943, -594040, -656370, -673433, -618282, -602926, -581827, -557803, -610488, -656955, -690953, -655726, -623932, -602769, -509828, -481902, -491260, -515438, -518577, -562574, -617732, -550090, -528134, -506936, -491709, -520509, -540101, -484990, -434820, -478722, -569365, -610176, -585670, -562970, -569479, -502361, -493898, -502710, -504919, -463662, -469148, -514333, -522110, -448307, -468020, -555577, -608095, -598912, -542069, -510333, -486527, -463676, -418216, -428352, -465823, -480699, -436905, -404681, -417072, -477775, -495518, -528398, -581284, -605275, -605252, -586746, -607490, -587495, -523971, -524856, -546193, -519689, -523890, -533730, -483006, -530224]
17071e30224m0308O7539K1212J4212k6653m6002j4249J8533O354k4067J113L6205
17059e16335L77o9403l1425M7154M2236o961r304k8952O0256L3043K845r054j9599
17046e05122n8200J9652Q198m372J9457k4584J6088O8582J6594k6076q121J9236
17034d58668m9374k8002j4606k7644K9544K3780p1872j6447L9091M6647j18j0413
17022e38082K5047J2512K1013q997l5636p64k2829N0126L8256L597m909R641k6255
17009d77280K4093K1742m7821j9401j9003k8845O033k6116m5265L4628O4821L6226
16997d76188M2229j8922l9290j9054N6272l9451l8609P744N935k0478M6954j6432
16985e09290J5289K0732k4543j7249o979r926N918K6127n66J1225j3924J7887
$$ y = [-530224, -570532, -502993, -481781, -467569, -494222, -540224, -554473, -535940, -529586, -553653, -552540, -516335, -515958, -585361, -616786, -569632, -527396, -534357, -543661, -572613, -512357, -479314, -476469, -485523, -505122, -563322, -543670, -535472, -539844, -520387, -544971, -528883, -460301, -443707, -469783, -477904, -458668, -508042, -536044, -550650, -578294, -548750, -524970, -596842, -613289, -574198, -527551, -527669, -538082, -513035, -500523, -479510, -488507, -524143, -524907, -547736, -497610, -459354, -455757, -460666, -451025, -477280, -453187, -431445, -479266, -498667, -517670, -546515, -540482, -566598, -611863, -577235, -512414, -476188, -433959, -452881, -492171, -511225, -454953, -494404, -533013, -525269, -519334, -539812, -492858, -509290, -494001, -473269, -497812, -515061, -522040, -531966, -526048, -499921, -500487, -489262, -503186, -485299]
16973d85299M0641L241N985N448l9280o491o964k0829K8252O9746L9580l670J051
16960c68589K9520k795j1349j0480L0248k0359o9212k6421K840Q354M5852j9118
16948d11509J8756L4087k8893o282J7899l3622n0945L9663M5906L327K2286n5322
16936d04649m1766L646K696m9838n3721R368N0516j4628j1435M4601K8398K8106
16924d08706o893j8032P732j213m789j1484K0181m571L2K7687k5263o1999L7573
16911d49745K0729j8773j1006L0613P414k0021m4210M7820J4405k7080o692j0760
16899d67306L8107M7112J5783J3268m0796J3877L6323J5939k3707k5214J460o733
16887c81887k6749P040m2595K7577O1507J7880K4993j9122m0817J3865R095m8465
$$ y = [-485299, -444658, -441417, -435432, -429984, -469264, -475755, -482719, -503548, -475296, -405550, -365970, -369640, -368589, -339069, -341864, -353213, -363693, -333445, -353804, -423016, -449437, -446597, -438243, -392391, -411509, -392753, -358666, -387559, -393841, -375942, -409564, -460509, -420846, -374940, -371613, -349327, -404649, -446415, -442769, -440073, -489911, -543632, -534264, -483748, -498376, -509811, -465210, -436812, -408706, -415599, -433631, -425899, -427112, -431901, -443385, -423204, -427775, -427743, -400056, -425319, -487318, -449745, -429016, -447789, -458795, -428182, -420768, -440789, -484999, -437179, -422774, -449854, -456546, -467306, -429199, -382087, -366304, -353036, -393832, -379955, -343632, -327693, -351400, -376614, -375154, -381887, -408636, -401596, -444191, -416614, -355107, -337227, -312234, -331356, -372173, -358308, -349213, -397678]
16875c97678l3980L8762M8619p9745l6075k601J0123O7485L9400O7108k8884p0480
16863c77946j8452j8308J3942N4415k0668m7087J47M6463l231m7439k2527M882
16851d35809J2187O657L1991L823j9808L440j0082l0020K0992L3985M2345k3321
16839c63620J6854m5986L1601l2190l7231n2987N208R8083J9231l0102j773M536
16827c88376k9423K2740l134P131l6937r258L8155l7300O8508J561n0000j2312
16815d28645O250K2271L6159K0189R59m9035m334o633r269o09j0800k0178j5903
16802d59578j9783L4615N4207l43j6958j5845k5021L44L546N3651O5323J5661
16790c10181j6923l7073j9035Q083N167K2720J3039m3952j3744L4012J5697J8613
$$ y = [-397678, -431658, -392896, -344277, -424022, -460097, -462698, -452575, -385090, -345690, -278582, -307466, -377946, -396398, -414706, -400764, -346349, -367017, -414104, -413957, -367494, -370725, -418164, -440691, -435809, -423622, -416965, -384974, -381151, -400959, -397519, -407601, -437621, -416629, -382644, -340299, -363620, -346766, -392752, -361151, -393341, -430572, -483559, -478351, -380268, -361037, -391139, -392912, -388376, -417799, -395059, -398193, -391062, -427999, -437257, -399102, -436402, -367894, -366333, -416333, -428645, -422395, -400124, -363965, -343776, -342817, -391852, -396186, -402819, -412088, -412697, -423497, -443675, -459578, -479361, -444746, -390539, -390882, -407840, -423685, -448706, -448362, -444816, -391165, -325842, -310181, -327104, -364177, -383212, -375129, -369962, -347242, -334203, -378155, -391899, -357887, -342190, -323577]
16778c23577k0670L014J1251N330m418k428k2942n1814r377J9001l7389L2178
16766d01841M3318K5730L2077K81l1906J139K2386n062L2106K041N4563Q398o9012
16753b85782q0703P279J3273p981o904K2666L4503J7245M2644l8642n3362j6308
16741c52072k8415L2308L8221K7057L0369m1040j1442l03n5623k9034Q6287Q30
16729c02857n045K3117l1715k9383j7530R019k3782k2545K2819M3000J2889J7732
16717c04281R846O740K7104l7325j6703L2177M2352J2193l1617k8511K8472M4406
16705b15147o0814q115M430o8898J7192J8060M699N3587O1392j5276l3520l1208
16693b73618K3636k4373j8012J8001M2827L6824n2539r4238K3697M9831J7848
$$ y = [-323577, -344247, -341233, -329982, -324652, -329070, -331498, -354440, -406254, -415631, -396630, -434019, -401841, -358523, -332793, -300716, -300435, -332341, -331202, -308816, -313878, -281772, -279731, -225168, -216770, -285782, -366485, -359206, -345933, -353914, -360818, -338152, -303649, -286404, -243760, -282402, -335764, -352072, -380487, -348179, -309958, -282901, -252532, -293572, -305014, -305317, -360940, -389974, -303687, -302857, -307902, -284785, -316500, -345883, -363413, -354394, -378176, -400721, -377902, -334902, -322013, -304281, -294435, -287695, -260591, -297916, -314619, -282442, -240090, -227897, -259514, -288025, -259553, -215147, -275961, -284076, -279646, -348544, -331352, -313292, -308593, -255006, -193614, -208890, -242410, -273618, -249982, -274355, -292367, -274366, -231539, -194715, -247254, -341492, -317795, -267964, -250116]
16682b50116K6342l3949L0594j5503j6118K0605M0372j9684J4293k0895o9442
16671b93501p0664k5696N9977K8478k0215K7981R697L9270K7478k1755q5310k7331
16659c51591M7510J5213j2700n0145J8736n112P482j4249L6048o216m0033R966
16647c45091k0057M3433K8999m2832n2060q776M1981r598K647L3110N1799N6244
16635b20201J5459K7371o2211k3986m8015p170J2310m7569j7310k3081M2070K1877
16623c30456N2596K6091J575k5022J777L6980J1278n888R315m9342Q254j3467
16611b76309j02439m3460K7021L4675Q4086J9351n5433j8956L0199j9117l978
16600c24360J34566L359m0330J2376J2596n2135p5576l7162L9920O8750O304j781
$$ y = [-250116, -223774, -257723, -227129, -242632, -258750, -238145, -197773, -217457, -203164, -224059, -293501, -364165, -389861, -329884, -301406, -321621, -293640, -283943, -244673, -217195, -238950, -324260, -351591, -304081, -288868, -301568, -351713, -332977, -338089, -330607, -344856, -308808, -315024, -355057, -345091, -365148, -321715, -292716, -335548, -387608, -396384, -354403, -364001, -361354, -328244, -276445, -220201, -204742, -177371, -239582, -263568, -311583, -318753, -306443, -354012, -371322, -394403, -352333, -330456, -277860, -251769, -250194, -275216, -273439, -236459, -225181, -231069, -221754, -271096, -262842, -276309, -378748, -422208, -395187, -360512, -276426, -257075, -312508, -331464, -301265, -320382, -324360, -189794, -186435, -226765, -214389, -201793, -253928, -329504, -366666, -326746, -257996, -251692, -253473]
16588b53473K8293q002p696L8902l0624J6309M4657j5081j1583K24O393m5316
16576b36997j90J3826O092M1145O0518r8760j11173k6724N0852j7817J3624J7371
16564b88233L8033J5612R469l0200j1913J7439J7745J1900n1600j8283r413L5702
16552b63742j1005k990L0478m67K4683j7201J7384M676m1580j3065K6936j292
16540b47185q840K3928M701K3803M0398K4172K58k6985K7372J0503o1760n3684
16528b43319K4797K3236l9941n6297j453k160l5964J9378O9639l6845l3176j5060
16516c27165k1337m801P0695j7960M2083K6916j5193j4559l1360q721M4726M6813
16504b09863k67k7502j8502K069k447p913K5218P750Q980K9859P452l0421j6503
$$ y = [-253473, -225180, -233182, -240878, -201976, -232600, -216291, -171634, -186715, -198298, -198074, -191681, -236997, -237187, -223361, -217269, -176124, -115606, -214366, -325539, -352263, -301411, -319228, -305604, -288233, -250200, -234588, -225119, -255319, -267232, -249793, -232048, -220148, -271748, -290031, -299444, -263742, -274747, -277737, -247259, -247726, -223043, -240244, -222860, -218184, -259764, -272829, -245893, -247185, -256025, -232097, -227396, -203593, -163195, -139023, -138765, -165750, -138378, -127875, -189635, -243319, -218522, -195286, -235227, -291524, -292977, -295137, -331101, -311723, -242084, -278929, -312105, -327165, -348502, -353303, -282608, -300568, -258485, -231569, -246762, -261321, -292681, -301402, -256676, -209863, -210130, -237632, -256134, -254065, -256512, -264425, -239207, -231457, -222477, -192618, -185166, -215587, -232090]
16491b32090K0738J1541K5873L7575n6025k36L9590R863Q339j8021Q795k6255
16479a70313l1029J0176L4170j2060n1631k1781j8669O7777j2212l7810K3841
16468b19541M8k9116o0742j975O0782M4200j4510J0179K2370j0462k4611Q72q04
16455b23310L2315J7365j873P180K1345j5122J7676j0012J8800m5534k4194K1612
16443a83752J1900K3605k0606m167k3718J1700K4640p591n695k6003Q4k6556P887
16430b18272L8651K7485q166l612k2055J1896K6058J6922j3835n444m2827m5112
16418b38311m6535M1591n141K8601O0971K3622j0649k5703k2656M2284K9958m913
16406a26881L636k6531j6351O0914J4756m8145o1341M8132P183L0089M675m7193
$$ y = [-232090, -211352, -199811, -173938, -136363, -192388, -192624, -153034, -143171, -134832, -152853, -144058, -170313, -201342, -191166, -156996, -169056, -220687, -242468, -261137, -193360, -205572, -243382, -219541, -219493, -248609, -309351, -311326, -250544, -206344, -220854, -210675, -188305, -198767, -223378, -222506, -223310, -190995, -173630, -175503, -168323, -146978, -162100, -144424, -154436, -135636, -181170, -205364, -183752, -171852, -148247, -168853, -173020, -196738, -185038, -160398, -167989, -173684, -199687, -199603, -226159, -218272, -179621, -152136, -160302, -163914, -185969, -174073, -148015, -131093, -144928, -150372, -193199, -238311, -284846, -243255, -248396, -219795, -158824, -135202, -145851, -171554, -194210, -151926, -121968, -126881, -123245, -149776, -166127, -105213, -90457, -138602, -199943, -151811, -144628, -114539, -109864, -157057]
16394a57057j4141l8795k3137Q398m3668R262p380r927k368L5375M1939K7457
16382a74042N6232R710m8537k2500k4588N733K8642O0222k8094k4592M3538J540
16370a16736j1459j1931k3241Q481L7884j5334J9528j4755m5837r68K0329j4193
16358a68232j5172M9729K275n141j1679j5841N744k852m2368L2065M4463K2675
16346a04334m465j6373m4777l0624j6724k6970k4547N0214J8560o5612M3169N6927
16334a65556j4156l7611L4469L6346J8480k7614l5846k5453M7930K6601N6451
16323h5959j850M1043l2832k0992M305k2513K4209n7540j4652P293N4636N1001
16311e3851O560K8549k1553m9105N345J0980M0932J8002J5799l0072k5914o2733
$$ y = [-157057, -171198, -209993, -233130, -224732, -268400, -259138, -266518, -276445, -278813, -243438, -201499, -174042, -117810, -108100, -156637, -179137, -203725, -197992, -169350, -109128, -137222, -161814, -118276, -116736, -128195, -140126, -163367, -154886, -117002, -132336, -112808, -127563, -173400, -174368, -154039, -168232, -183404, -133675, -131400, -136541, -148220, -164061, -158317, -161169, -203537, -171472, -127009, -104334, -108799, -125172, -169949, -200573, -217297, -244267, -268814, -218600, -200040, -265652, -222483, -165556, -179712, -217323, -182854, -146508, -128028, -155642, -191488, -216941, -169011, -142410, -85959, -87809, -46766, -79598, -100590, -96285, -118798, -94589, -152129, -166781, -159488, -104852, -53851, -47291, -18742, -40295, -89400, -84055, -73075, -32143, -14141, 1658, -28414, -54328, -117061]
16299a17061l5363J6319j3150K9063L2154m4461J3330O1173L3151j4322l95l2705
16287g2267k8184j9306j3077L381j2848J1650N9641J0222J7950k4991k1640L0593
16275e8876K9278p2670p1278O461K4784L3847k8705J0714l9661J7592l5725m2803
16263b27042j2430M0226k3819n512q043L2426P0193J9519l4398j02927k2410j2655
16251b86872R1228K9849M485q058j3840J1929O3128l0855L0461J1669P298l9302
16239a28880r711j3235q856j7039K406M6355m438l259m386J6450j5490k8317k6252
16226a94652N1262N494N1293L2795L1482j6579p6684j5969k68K2061L2463R899
16214f7403j5481l9560O137J153K687K1104J8653l5013J5031L9381m7651o0757
$$ y = [-117061, -152424, -136105, -149255, -120192, -88038, -132499, -119169, -57996, -24845, -39167, -39562, -72267, -100451, -119757, -132834, -129453, -142301, -130651, -71010, -60788, -42838, -67829, -89469, -58876, -29598, -102268, -173546, -167085, -142301, -108454, -137159, -126445, -166106, -148514, -184239, -227042, -239472, -199246, -223065, -228577, -236620, -204194, -134001, -114482, -148880, -251807, -274217, -286872, -195644, -165795, -161310, -169368, -183208, -171279, -108151, -139006, -108545, -96876, -89578, -128880, -138591, -151826, -160682, -177721, -175315, -128960, -133398, -136657, -141043, -124593, -140083, -168400, -194652, -143390, -137896, -86603, -53808, -22326, -38905, -115589, -131558, -131826, -109765, -77302, -67403, -82884, -122444, -116307, -115154, -112467, -91363, -72710, -107723, -92692, -53311, -100962, -161719]
16202a61719j2738J7411R041J8999K0351K5823k0650j4942K8686q15L7358K847
16190e0348n2490r0303M191K0765J0401l663J9471L4184K5227J5500j3606l3610
16178a14281m3199j8013N9713L6074k1905K6645M9523N8834m2002k1473M6395
16167A6311k7550o3533l6672j6622L5313p981J6086K8097L1637l9603R747l1387
16155h6157J9282L9965L3498m7500n7554n7075O8470L9960L445L570J1120l7979
16143f6955l22L3393J8276n608k4889m561m3780J1505q107j0022K3721K8217M6304
16130b828k8264l3242J1167M9700L5235J2738m5629o8948k1176N9818j3345l6770
16118h1544p448M3781m78m0679K018m2895J0166L8337K6474L0820o693r483J4589
$$ y = [-161719, -174457, -157046, -148005, -129006, -108655, -82832, -103482, -118424, -89738, -90553, -53195, -50348, -102838, -193141, -188950, -168185, -157784, -161447, -141976, -107792, -82565, -67065, -80671, -114281, -157480, -175493, -115780, -79706, -101611, -74966, -25443, 33391, -8611, -30084, 16311, -11239, -74772, -111444, -128066, -92753, -100734, -84648, -56551, -24914, -64517, -54770, -86157, -66875, -26910, 6588, -40912, -98466, -155541, -87071, -47111, -43666, -40096, -28976, -66955, -67277, -33884, -15608, -21216, -46105, -50666, -94446, -82941, -91048, -101070, -77349, -49132, -2828, -31092, -64334, -53167, -3467, 31768, 44506, -1123, -70071, -91247, -31429, -44774, -81544, -88992, -45211, -45689, -86368, -84350, -127245, -117079, -78742, -52268, -21448, -28141, -37624, -23035]
16105b3035o095j6001m587r729j4453l1884J807N8382N8100o2750j3087Q710n255
16092e9877J1997K6364O0348m7365n6409j4523k698L1239J1130k5148p846n678
16080g8466M5445L0368j5597j0898m8997q6321L8650M7311L3589K2437l5151J419
16068e6211r71o441J0775j1804J5306n8479k1236R3582K8652j5625j8794k682
16056d3928k5836j9226K7736K050R090L4609k6063k4047J4495J3648j2179M6950
16044b701p083K5077M2015R807n4582m7908j5387j2102K4192Q6108M4775m9813
16032D2398p8256j3187K5911j8806l7887j0621J1567O42K9019N1862l981m1291
16020d2630k7136M0577N2787l2123l9941m801P48J4641J5886o375M5200K6709
$$ y = [-23035, -29130, -45131, -49718, -59447, -73900, -105784, -103977, -45595, 12505, -50245, -63332, -54622, -59877, -47880, -21516, 38832, -8533, -64942, -79465, -82163, -50924, -39794, -64942, -72788, -78466, -33021, -2653, -18250, -29148, -78145, -164466, -125816, -78505, -44916, -22479, -57630, -56211, -57182, -63623, -52848, -64652, -49346, -107825, -129061, -35479, -6827, -22452, -41246, -43928, -69764, -88990, -61254, -59204, -50114, -15505, -41568, -65615, -51120, -37472, -49651, -2701, -9784, 15293, 57308, 67115, 12533, -35375, -50762, -62864, -38672, 47436, 92211, 42398, -35858, -49045, -23134, -41940, -79827, -90448, -78881, -78239, -49220, 2642, -1339, -42630, -69766, -29189, 23598, -8525, -48466, -53267, -52519, -37878, -21992, -28367, 16833, 43542]
16008D3542l9109k5523M0479N3553j1983n2982k7896j0154O7899L1940j6281l2264
15996B1221j2251L6064J4083J416K4818n153m2091k154l4673l205R774J8633J8047
15983D4529N1729K2297o8284k4310L1159L5534m375p890n5497K8254J8087m9853
15971B1380o331m0135P537j613M2173j3601m412k7207j90P0783K2182J1841L2056
15958A14463k8052k2206m7230M3932n705L511j9311r965l4110l6247J1769L6720
15946G569O294l651O7743J8942J0274o4555P555Q5876o557k1607m0060n4551M8365
15933F1637Q195p576r875j434j4456J4535R557J7878K5848l4655K4015K0678K7406
15920A41753l0754K570J1956m3004j853k2155N036j6884m915N5730L6911o92K0492
$$ y = [43542, 4433, -21090, 19389, 72942, 60959, 7977, -19919, -30073, 37826, 69766, 53485, 21221, 8970, 45034, 59117, 60533, 85351, 80198, 38107, 35953, 1280, -1925, 7849, 26482, 44529, 96258, 118555, 50271, 25961, 57120, 92654, 88279, 80389, 24892, 53146, 71233, 21380, 15049, -25086, -17549, -19162, 23011, 9410, 4998, -22209, -22399, 48384, 70566, 82407, 114463, 86411, 64205, 16975, 60907, 55202, 58713, 39402, 29437, -4673, -40920, -29151, 7569, 13863, 10212, 77955, 96897, 107171, 42616, 50171, 136047, 129490, 107883, 67823, 13272, 61637, 69832, 62256, 52381, 50947, 36491, 51026, 60583, 78461, 104309, 69654, 93669, 114347, 141753, 110999, 113569, 125525, 82521, 80668, 58513, 63549, 46665, 41750, 97480, 134391, 133699, 154191]
15907A54191o3600n6555m421K3445j6213K678O563k1659J1912L3988K4053L0994
15895A25376l1379N1424L960p486j6380n9786k6415K0272K402L1909P714l6321
15883F5290j6504m4N156Q9276j4130m3754k2529m5373k25k5072k7810M0048M6220
15870E0549m5095j0202K5859Q3j4435r07K3346L8712J3748K3916L5633o1513m7084
15857C2610j7004K0870p182k5999J2484L5460M9929j5123j7721J0602m9470m0675
15845a1219K6766L6628L522J2819l22K4916P940j3080m8856j0632j2365N6157
15833G2274J4651k259p6001l5508L1079O3076n156L1355p679K995L6355k5739
15821I9443j6077k3629l1882j6710j8210M574q880K8909R1207J3075J1164k7082
$$ y = [154191, 90591, 34036, 29615, 53060, 36847, 39525, 46088, 24429, 36341, 70329, 94382, 125376, 93997, 145421, 149381, 141895, 125515, 65729, 39314, 59586, 61988, 93897, 101611, 65290, 48786, 48742, 53898, 143174, 129044, 85290, 62761, 17388, 17163, -7909, -35719, 4329, 50549, 5454, -4748, 21111, 21194, 6759, 5852, 29198, 67910, 81658, 105574, 141207, 79694, 32610, 15606, 36476, 29294, 3295, 15779, 51239, 101168, 86045, 68324, 78926, 29456, -11219, 15547, 52175, 55697, 68516, 68194, 93110, 101050, 87970, 39114, 28482, 16117, 72274, 86925, 84666, 8665, -26843, 4236, 67312, 62156, 93511, 85832, 88827, 125182, 99443, 83366, 59737, 27855, 11145, -7065, -2491, -11371, 17538, 108745, 121820, 132984, 105902]
15809A05902j522n516J5668J0882m0030J7075M4814j0460m3215m1639J7995p769
15797F2185n7435j1277M8657O7371J5532L214l7620j6391j9266m840j3704L478
15785C9904N4874L7459k0441j8016M2964k2451o694q429j6920r953L0459K6950
15773A29706Q303k3494k7097L4879J5372J3315r439O210L9223j9902o1635k2235
15761H3206K2462K1480k147m0175k2428K6740L1268j5724J085k5103j6844j9398
15749D4422l2381L9786J0689J5365J3628m161K6518O334K5801o622l1455o1973
15737D5951l758j2751K0936Q1470R2824K0292j449k5964P38O1559m6339m2704
15725A90805n3929n4072L2129O9655l2302J5049q4l0602K5971M570l949K3656
$$ y = [105902, 104380, 98864, 114532, 125414, 85384, 102459, 147273, 136813, 93598, 51959, 69954, 62185, 4750, -6527, 42130, 109501, 125033, 128247, 90627, 74236, 54970, 50130, 36426, 39904, 94778, 132237, 111796, 93780, 136744, 114293, 107599, 99170, 82250, 72297, 102756, 129706, 138009, 114515, 87418, 122297, 137669, 150984, 141545, 147755, 186978, 167076, 105441, 83206, 105668, 127148, 125001, 84826, 62398, 89138, 120406, 104682, 105767, 80664, 63820, 44422, 12041, 51827, 62516, 77881, 91509, 87348, 113866, 120200, 146001, 139379, 107924, 45951, 42193, 29442, 50378, 131848, 224672, 244964, 243515, 217551, 218289, 279848, 233509, 190805, 136876, 82804, 114933, 184588, 152286, 167335, 167251, 136649, 162620, 167190, 163241, 186897]
15713A86897K3008m2734m1840k231J8974N433k1882K4708j6827J668J3157l2986
15701A15345M787L9511L864j4357l4724j3925k5087l0562O4766K1793r3386j5737
15689B2288Q4664O1188K51l2808K5793J6924k6524k271L1991K2704k0512r388
15677A74300j9579j3853O7587N3224L7o628l3494j6597j9927K1173L5438j9403
15665B22278k2170k16p3719K2294J06425Q1761m0904j19413p9177K5503N2703
15654A75365l4044J4606o876J744l432j434L5783L8583m2875n8000L476N7196
15642A80092L8605l3739k3116J2122J3050M3751l8609j7238O113L5956j2494j4415
15630A90078J6087Q1900K7884R831K610n70j2033m4007p2510j0507M6017J3176
$$ y = [186897, 209905, 167171, 125331, 123100, 142074, 147507, 125625, 150333, 133506, 135174, 148331, 115345, 120132, 159643, 163507, 149150, 114426, 100501, 75414, 44852, 109618, 131411, 38025, 22288, 106952, 168140, 168391, 135583, 161376, 178300, 151776, 149505, 181496, 204200, 183688, 174300, 154721, 140868, 208455, 261679, 261716, 255088, 221594, 204997, 185070, 206243, 241681, 222278, 200108, 199892, 126173, 148467, 254892, 336653, 295749, 176336, 97159, 122662, 175365, 141321, 155927, 149051, 150795, 147363, 145929, 181712, 220295, 177420, 119420, 122896, 180092, 218697, 184958, 161842, 173964, 187014, 230765, 192156, 174918, 181031, 216987, 204493, 190078, 206165, 288065, 315949, 325780, 328390, 327820, 315787, 271780, 199270, 188763, 234780, 247956]
15618B47956L3519L0426l9491p179K8141p999J7891k0783n3775k2003j870l5679
15606A69154L721R458j2545N2809N4321Q555k7877n6739r976M6445L503P324r890
15593B38263J5026j7915l9153k0556k7243J970K1662K4823L8168l7132n3457R1765
15581B36221P7328j4813o0203l9658M2425K578o3716l8218N9958N0320o010Q088
15569B54300M0718N801l4886k3360J3858J2159k5631m535k1308k2111m808L2913
15557B23110J8490n098J7631J0532K3679j6011k7617L7343N714k4838k9212l382
15545B30341K7609P89K7818L7421J3359m2434n8183n0231k2773P3246O1782j3891
15533B84853P20j491k6238j8192j956L2606J6217m9320m5790Q446K2206L6408
$$ y = [247956, 281475, 311901, 272410, 265231, 293372, 285373, 303264, 282481, 228706, 206703, 204833, 169154, 172875, 182333, 169788, 222597, 276918, 285473, 257596, 200857, 190881, 237326, 240829, 248153, 238263, 253289, 235374, 196221, 175665, 148422, 150392, 172054, 196877, 235045, 197913, 144456, 236221, 313549, 298736, 238533, 198875, 241300, 243878, 180162, 141944, 201902, 252222, 246212, 254300, 295018, 300819, 265933, 242573, 256431, 268590, 242959, 238424, 217116, 195005, 190197, 223110, 241600, 236502, 254133, 264665, 288344, 272333, 244716, 282059, 287773, 262935, 233723, 230341, 257950, 258739, 286557, 323978, 337337, 294903, 236720, 186489, 163716, 236962, 298744, 284853, 285573, 284082, 257844, 239652, 237696, 270302, 286519, 237199, 191409, 199855, 222061, 258469]
15521B58469j3463J0497M9613m0101p7923m795K0775M0998M8962L8353j5485K3851
15509C39751J6583J6640j0061l6555k0604m5793K8995M5523L0673j9554J2832
15498C58430N039j9818l5351P92l7077k4831L1392J1682l7702k9964l377N509
15486B24724N58L1209R396L5105N3618M328k002r4263o4539j8947P849J0254M3495
15473B40785N8757n548J0149m562k0587j8570K635J193J2635l4470K8479K1315
15461B92211P8856J7873k0954j4468k3212m6146L3204N7750l6443j0953l883l7604
15449B86231K2000O7747K4929J198J2991p735j1176j9859r833k9360l0615o674
15437B99844R809K4098j6393L8738J4789N623l9757l5492r836o653j55j1026r982
$$ y = [258469, 245006, 255503, 305116, 265015, 187092, 182297, 203072, 244070, 293032, 331385, 315900, 339751, 356334, 372974, 362913, 326358, 305754, 259961, 288956, 334479, 365152, 345598, 358430, 363469, 343651, 308300, 309092, 272015, 247184, 278576, 290258, 252556, 222592, 219215, 224724, 225282, 256491, 265887, 300992, 354610, 358938, 356936, 262673, 198134, 179187, 187036, 197290, 240785, 299542, 293994, 304143, 299581, 278994, 260424, 263059, 264252, 276887, 242417, 270896, 292211, 371067, 388940, 367986, 353518, 330306, 284160, 317364, 375114, 338671, 327718, 323835, 286231, 308231, 375978, 400907, 402105, 415096, 407361, 396185, 376326, 366493, 337133, 306518, 299844, 309653, 333751, 317358, 356096, 370885, 376508, 336751, 301259, 291423, 284770, 284615, 273589, 263607]
15424B63607M7417K7860p285j4626k3055J856L0312L4315L7405K9064m2607p311
15412C76952k7260k4891P116n073j1432l6171j4169k3465M4338Q704k9395L3082
15400B98336K355K408K5200N7289K6473j8241P137j9430m392K9825k4374L9089
15388D21675P397K6460q566k6568m2081M738P3221o216o4823J0772L8050o788
15376D27271k3451j9326N311j2862K9121j9887j4535J1771j3772n7439J0676n3180
15364B69698O339R536O1242M5257j312K8439j8493k1633K4094K3194l6496K6099
15352D15964M3048m973k8625N074J626j1142K3905n344J2797j8978K1074m8777
15340D05649K375P552m4787j5214L7189K5839M1905k756K582m3862l8124R019
$$ y = [263607, 311024, 338884, 331599, 316973, 293918, 295774, 326086, 360401, 397806, 426870, 384263, 376952, 349692, 324801, 331917, 326844, 315412, 279241, 265072, 241607, 285945, 294649, 265254, 298336, 300691, 303099, 328299, 385588, 412061, 393820, 400957, 381527, 377135, 406960, 382586, 421675, 429072, 455532, 446966, 420398, 378317, 383055, 456276, 450060, 385237, 396009, 434059, 427271, 403820, 384494, 389805, 376943, 406064, 386177, 371642, 383413, 369641, 312202, 322878, 269698, 276037, 285573, 346815, 392072, 390760, 419199, 400706, 379073, 403167, 426361, 389865, 415964, 459012, 454039, 425414, 430488, 432114, 420972, 444877, 439533, 452330, 433352, 454426, 405649, 408024, 415576, 370789, 355575, 392764, 418603, 460508, 457752, 460334, 416472, 378348, 387367]
15328C87367J3578j1467p7504J0304O167j9873N0507Q3619K919j9417Q937M161
15316D39298K9433j1736n9303j9517L0584j5858k9416k7886R1147m587L7235O7548
15304E26942M4684M310l5649n3612p774j6342l2850L20L0423J6979J5744k1290
15292D71885n328M993j9404l226j2505l2188m1678J8372K409N8884O9610P8194
15280E90018M8269q088l2212n9103n1578k5900J4543k7386q420L0947M8711r821
15268E09980l188K9409J9374L6642k3745n1113o512J1054P3456K5168M5827m0906
15256F25446q2330j9084K6324k1973L4360K2444K0275N1345M6988K4555j2328
15245G16022n3062J9222o5868k5022J2060M2424K7793N7513R465P167r411P178
$$ y = [387367, 400945, 389478, 311974, 322278, 328445, 308572, 359079, 442698, 445617, 426200, 435137, 439298, 468731, 456995, 397692, 378175, 408759, 392901, 363485, 335599, 426746, 422159, 459394, 526942, 571626, 575936, 540287, 486675, 478901, 462559, 429709, 430029, 460452, 477431, 493175, 471885, 466557, 471550, 452146, 448920, 436415, 404227, 362549, 380921, 383330, 442214, 511824, 590018, 638287, 630199, 597987, 538884, 487306, 461406, 475949, 448563, 440143, 471090, 519801, 509980, 506792, 536201, 555575, 592217, 568472, 517359, 510847, 521901, 595357, 620525, 666352, 625446, 543116, 524032, 550356, 528383, 562743, 585187, 605462, 656807, 703795, 728350, 716022, 662960, 682182, 616314, 591292, 603352, 645776, 673569, 731082, 740547, 747714, 738303, 745481]
15233G45481N7232O0655K5194J5838J7556K0288P6882Q1909J38714J15655R7364
15222A452768J40042J11099J79481J41880J77892J01931M2135K1092n5796n1376
15212B261148r3680j76264j53014j28544j33572j82760j39235o2609m3803n8521
15202A089146j8550q6550j00979r752n4489o9329k3969P7028K3529K546j9640
15191H08991p3016n3802n3902j3059L5767j388j955N6796O7442l834m0167m8228
15179F79645m4250L3572L3143m0260k2189j6639L0746O5251O38m2381l2243m4219
15167F00814K5877L2547P265K3301k3400Q529K6582q770L448l3661L85k2122L6287
15154F77082N8927k81J3177p155J575m239k2595m4723o718P923J4895L4284O707
$$ y = [745481, 802713, 863368, 888562, 904400, 921956, 942244, 1019126, 1101035, 1239749, 1355404, 1452768, 1592810, 1703909, 1883390, 2025270, 2203162, 2305093, 2347228, 2368320, 2312524, 2261148, 2167468, 1991204, 1838190, 1709646, 1576074, 1393314, 1254079, 1191470, 1147667, 1089146, 1070596, 984046, 883067, 873315, 818826, 749497, 725528, 802556, 826085, 828631, 808991, 735975, 682173, 628271, 615212, 650979, 649591, 647636, 704432, 771874, 768040, 727873, 679645, 635395, 668967, 702110, 661850, 639661, 623022, 653768, 719019, 719657, 677276, 645033, 600814, 626691, 659238, 666503, 689804, 666404, 674933, 701515, 692745, 696193, 662532, 662917, 640795, 677082, 736009, 735728, 748905, 741750, 743325, 739086, 716491, 671768, 665050, 672973, 687868, 722152, 728859]
15141G28859k5917J8271l5104o5778K1608L2295K4249k1941N1292J3959l1406
15130G10387j101n4116m1738K0149L2167K524k7720K6820k701L3215J3652J044
15118G12582o725L2339K4161p096j0340J606q7545j5803N9778M2468K6557l935
15106G68047j8254J3911p2339J9765R5663K0734M668M883M5100p3667l8770N8968
15094H28709M743j9185m0546l4595J4649K5097P7144J351q891J6534j7591k7402
15082H20017k4822k9206K0950q066j5572L5661M9491j5498M85J3201k9652j2422
15070H04567J0486k3353j7575K6662L6449L3798K7883M2978j5134j3494J4571
15059I27838o052o4743m3013M2519J1180L8875P2132K4935k1942k2426J0723k9055
$$ y = [728859, 702942, 721213, 686109, 620331, 641939, 674234, 698483, 676542, 727834, 741793, 710387, 709286, 655170, 613432, 633581, 665748, 668272, 640552, 667372, 664671, 697886, 711538, 712582, 705857, 738196, 762357, 755261, 744921, 746527, 658982, 643179, 702957, 745425, 771982, 768047, 749793, 763704, 691365, 711130, 806793, 827527, 832195, 837078, 882178, 808511, 769741, 828709, 833452, 814267, 773721, 739126, 753775, 778872, 856016, 857367, 848476, 865010, 847419, 820017, 795195, 765989, 786939, 778873, 763301, 798962, 848453, 832955, 833440, 846641, 816989, 804567, 815053, 791700, 774125, 800787, 837236, 871034, 898917, 941895, 926761, 913267, 927838, 921786, 857043, 814030, 856549, 867729, 906604, 978736, 1003671, 981729, 959303, 970026, 940971]
15047I40971m9703J0706K2726J8082K9511O5M5671K2996L2930q190J9245L5827
15035A120837K6155q897Q08L0438O4979P2879J18771O1728k9212J8339P6397l830
15023A549392k0044n2906q765r8275q9143r4933N106N5565Q620J8798n4952j6046
15011A202417J315k507m2999M0723n181k8790P524l1540n644J9803N8061j5034
14999A198148J6265J0204k0515m159j3593j5327j5599N953K7646k86n733J9669
14987A202673P1500M5901N4154M8530P0986K5937j3028K2656N5612R7354J25916
14976A808191J38121J40675J32101R1331R5755R9773L2187L6178n2662k448m8155
14965B471047p3508r5855j72770j50186q3812o7299r6520j26874o5767M165l0441
$$ y = [940971, 891268, 901974, 924700, 942782, 972293, 972358, 1018029, 1041025, 1073955, 1065765, 1085010, 1120837, 1146992, 1138095, 1138903, 1169341, 1234320, 1307199, 1425970, 1487698, 1458486, 1476825, 1553222, 1549392, 1529348, 1476442, 1467677, 1369402, 1280259, 1185326, 1190432, 1245997, 1254617, 1273415, 1218463, 1202417, 1203732, 1201225, 1158226, 1198949, 1193768, 1164978, 1172502, 1140962, 1135318, 1155121, 1213182, 1198148, 1214413, 1224617, 1204102, 1199943, 1186350, 1171023, 1155424, 1161377, 1189023, 1188737, 1183004, 1202673, 1274173, 1320074, 1374228, 1422758, 1493744, 1519681, 1506653, 1529309, 1584921, 1682275, 1808191, 1946312, 2086987, 2219088, 2310419, 2406174, 2505947, 2538134, 2574312, 2521650, 2519202, 2471047, 2397539, 2301684, 2128914, 1978728, 1894916, 1827617, 1731097, 1604223, 1538456, 1542621, 1512180]
14954A512180j6836o311j9387m5895o6475j9634K8101M0639K1474J2521j2991
14943A427386M8734R3881M1233j3284J663m088n128k4870M4715O82j0270o572
14931A594082N2667N5633J4933J7882m9843k9526k4556j2439O2008M6530M2300
14920A769671k126q937J2931M6726L9369O9552O2067J8083J8092J219O6585N6271
14908B149503k4171M5321J10481K6420M6676P8455O9725J2920J5115n499L2093
14897B557039M9930n4969q2790m4915K62l9062k2655l3863L1921J3398j5871J6517
14885B374942J1355Q679O159L9224O5475L0210l9273j6747M7778N8949L2731M1725
14873B661207k1112J6642L0625K390K4085K0292k2480O2808N1354M4858K3277
$$ y = [1512180, 1495344, 1489033, 1469646, 1423751, 1357276, 1337642, 1365743, 1406382, 1427856, 1440377, 1427386, 1476120, 1570001, 1611234, 1597950, 1599613, 1595525, 1590397, 1565527, 1610242, 1610924, 1600654, 1594082, 1646749, 1702382, 1717315, 1735197, 1685354, 1655828, 1631272, 1618833, 1680841, 1727371, 1769671, 1767545, 1758608, 1771539, 1818265, 1857634, 1927186, 1989253, 2007336, 2025428, 2026647, 2093232, 2149503, 2125332, 2170653, 2281134, 2307554, 2354230, 2432685, 2502410, 2515330, 2530445, 2524946, 2557039, 2606969, 2552000, 2469210, 2424295, 2424557, 2385495, 2362840, 2328977, 2360898, 2374296, 2358425, 2374942, 2386297, 2394976, 2401135, 2440359, 2505834, 2536044, 2496771, 2480024, 2527802, 2586751, 2619482, 2661207, 2640095, 2656737, 2687362, 2689752, 2713837, 2734129, 2711649, 2774457, 2825811, 2870669, 2893946]
14862B893946K0289J0492Q9860J13556J8559L5087N6339O9383L3635R2955P6300
14851C510401M0455R3318J00364P2699n218M8632Q5095O6112P9026L1035O9383
14840D191302J43220Q5337J31210J70292J15392R2144M9665J02357J72939J30180
14830E384038J15796Q8853J28001J42884K00268K44692J36113J32619J44361K20995
14820F938620K35555K74602K66210K63228K76060K69670K83128L23884L64923
14811I495880M07860M45012N13916N08239N86985N44350N93546O75505Q75181
14802A4646474Q84633R38557J054338J086366J284041J523789J756149J989706
14794B5164053K181040K481054K823023L098993L610856M143263M724886N565855
$$ y = [2893946, 2914235, 2924727, 3014587, 3128143, 3146702, 3181789, 3238128, 3307511, 3341146, 3434101, 3510401, 3550856, 3644174, 3744538, 3817237, 3812019, 3860651, 3945746, 4011858, 4090884, 4121919, 4191302, 4334522, 4419859, 4551069, 4721361, 4836753, 4928897, 4978562, 5080919, 5253858, 5384038, 5499834, 5588687, 5716688, 5859572, 6059840, 6304532, 6440645, 6573264, 6717625, 6938620, 7174175, 7448777, 7714987, 7978215, 8254275, 8523945, 8807073, 9130957, 9495880, 9903740, 10348752, 10862668, 11370907, 11957892, 12502242, 13095788, 13771293, 14646474, 15531107, 16469664, 17524002, 18610368, 19894409, 21418198, 23174347, 25164053, 27345093, 29826147, 32649170, 35748163, 39359019, 43502282, 48227168, 53793023]
14786E3793023O586021P892331R623161J2067528J5476235K0101214K6140536
14779A51680049L3475948M1257984M7313536M8605590M3472967L2799975J9218126
14772D17824175N852939n777241j6016624k6314895l6914614m5376751m8673832
14765B44603157m5847192l8900084l0698394k3365197j7592130j3377082j0324544
14758F4498534q085632o508247n433984m620703m001202l503233l024348k672417
14750B6648768k399925k097918j918105j738356j524421j308503j172969j074046
14742A3414525r20830q17287p58979p01334o46657n73452m57647l97606m28937
14733G711796m23380l84013k82575l49736l39641l16917k26600j78016k50801
$$ y = [53793023, 60379044, 68271375, 77894536, 89962064, 105438299, 125539513, 151680049, 185155997, 226413981, 273727517, 322333107, 365806074, 398606049, 417824175, 423677114, 417899873, 401883249, 375568354, 338653740, 293276989, 244603157, 198755965, 159855881, 129157487, 105792290, 88200160, 74823078, 64498534, 56412902, 49904655, 44470671, 39849968, 35848766, 32345533, 29321185, 26648768, 24248843, 22150925, 20232820, 18494464, 16970043, 15661540, 14488571, 13414525, 12493695, 11676408, 10917429, 10216095, 9569438, 8995986, 8538339, 8140733, 7711796, 7288416, 6904403, 6621828, 6272092, 5932451, 5615534, 5388934, 5210918, 4960117]
14724D960117k36504k53520j83606k05655k05164k14915j78514j11218j07752
14715C263269j29963j19698j30046j52817j30678p3422j24895r4182o3553j19936
14705B124079j00383j04812j01525n8846n5765j05204m8010l3464j13327n9276
14695A343467m5694j0781j4943j6590n9823k9994r9697q8217n6986l1644o0923
14684H28175k6522j4814j0481o554K6439m6748p8554l7883m3854r775L2279j190
14672F10518o0002n5158n7572J0377K9459m963k7564l7711n2759M2563k502l0365
14660C64321l5060P1860k397m4770j5748q665K3900M7878P5693O2121M9725L6659
14648F25517k5249l0316j3432K9781m6175q5877k4777m1586q9961k5033l5351
$$ y = [4960117, 4723613, 4470093, 4286487, 4080832, 3875668, 3660753, 3482239, 3371021, 3263269, 3133306, 3013608, 2883562, 2730745, 2600067, 2526645, 2401750, 2307568, 2244015, 2124079, 2023696, 1918884, 1817359, 1758513, 1702748, 1597544, 1549534, 1516070, 1402743, 1343467, 1297773, 1286992, 1272049, 1255459, 1195636, 1165642, 1065945, 977728, 920742, 889098, 828175, 801653, 786839, 776358, 769804, 796243, 749495, 670941, 633058, 589204, 579429, 611708, 610518, 550516, 495358, 437786, 448163, 477622, 472659, 445095, 407384, 354625, 397188, 394686, 364321, 329261, 401121, 398724, 353954, 338206, 329541, 353441, 401319, 477012, 539133, 588858, 625517, 600268, 569952, 556520, 586301, 540126, 454249, 429472, 387886, 297925, 272892, 237541]
14637B37541m6149k8195l3691k6301N877m0983p5500l713k0194q5644l5160N1291
14625a00821J0920j720k5654j7125l0997k3960L7020j8734J625L8317j0721M7353
14613i4497O99k3957k3845k1341l9335j716k5212p2795J6676M6427Q020L015L2665
14600a95196O0333j0056K2779R824j6338N1719J9790K2167M1371L6503j5006k5653
14588B237O69o2454K4880K7099m9989o422K669j9316L1017M2058n8884o9084l1839
14575a67359J5614m2932j5527K6000K9525m352K2482K331r123L4855K4552j1969
14563i5903J9304L5854J0555n0750O5830l2486m8092j9632K3865N194l7297K1882
14551a01676J5559L5077k7037p346n7301l9866J6215n2439k0564L7439K7367k0518
$$ y = [237541, 191392, 163197, 129506, 103205, 109082, 68099, -7401, -11114, -31308, -116952, -152112, -100821, -89901, -91621, -117275, -134400, -165397, -189357, -152337, -171071, -169446, -131129, -141850, -94497, -93798, -117755, -141600, -162941, -202276, -203992, -229204, -301999, -285323, -238896, -230876, -227861, -195196, -134863, -144919, -122140, -112316, -128654, -76935, -57145, -34978, 6393, 42896, 27890, 2237, 2906, -59548, -34668, -7569, -57558, -63980, -61311, -80627, -49610, -7552, -66436, -135520, -167359, -151745, -194677, -210204, -184204, -154679, -159031, -136549, -134218, -143341, -108486, -83934, -95903, -76599, -40745, -30190, -80940, -15110, -47596, -95688, -115320, -91455, -86261, -123558, -101676, -86117, -51040, -78077, -85423, -142724, -182590, -166375, -218814, -239378, -201939, -174572, -195090]
14539a95090k1365K0336N2133J0847K0765p1334l4512j2833K6314K7707j8562
14528a95594L4172Q5507m587j0367j5399M7918J7830m6104o160M4721j3044o3146
14516a24253N7609L0262o4803J3995M2411N0380j1792l5835k8525l0658o0375
14505a61584O5269r37n3658l4838M7368p30k8741k490N7728O9644K6647l5779
14493e2101p4149n5060j1499Q4364O6448l3431j5988k2683k8254l8460l7792K2797
14481a95808N5527N4669O0409J5867m1315k0623M0302K214k504l069L6625K9931
14469C2225J2699j096k2171k7667L09j6205L11k2913o715J7773M2905p616j5487
14456a3648k0454j9003N147R0220L5431n6546j0555K9794K013K737J1377k8185
$$ y = [-195090, -216455, -196119, -143986, -133139, -112374, -183708, -218220, -231053, -204739, -177032, -195594, -161422, -75915, -80502, -90869, -106268, -58350, -40520, -86624, -92784, -48063, -61107, -124253, -66644, -36382, -101185, -87190, -44779, 5601, -6191, -42026, -70551, -101209, -161584, -96315, -97252, -150910, -185748, -138380, -139110, -167851, -170341, -112613, -42969, -16322, -52101, -126250, -181310, -192809, -108445, -41997, -75428, -91416, -114099, -142353, -180813, -218605, -195808, -140281, -85612, -25203, -9336, -50651, -71274, -30972, -28758, -31262, -34331, 2294, 32225, 44924, 43828, 21657, -6010, -5701, -21906, -21595, -44508, -51223, -33450, 9455, 1839, -13648, -34102, -53105, -47958, 42262, 77693, 21147, 10592, 40386, 42399, 45136, 56513, 28328]
14444B8328k2820l627j6426l6249k3711K8992J0025n1106j8554L2120J2147N494
14432e5387R262J1388M6185j6266o489j33M020j8000k616K4267n156l3013J0898
14419c1040K2116o6593m9032M947K0550M1294N6030q466j4945M6615M9055k5804
14407D4727J3592m470m120j7025P776r355K9187n1099n893K8973m1545R901n512
14394d863l936J2271L4601Q927K5796j1073L5197O4P495N1863k2787l8443l5187
14381E9925l7022J1966P8746P2700L0045m3998k6733k3163k4995N287p5326o546
14369B0886N7432K3437l1209o2159J6595N9908Ol7711L1867M1399j3968M8690
14357A55173r381k2862J8679j9571j5971J8282J1360L7601j2828l0527P384j0923
$$ y = [28328, 5508, 1881, -14545, -50794, -74505, -45513, -35488, -86594, -105148, -73028, -60881, -55387, -46125, -34737, 11448, -4818, -11307, -11440, -7420, -25420, -28036, -3769, -8925, -41938, -31040, -8924, -75517, -124549, -119602, -99052, -57758, -1728, -10194, -25139, 21476, 70531, 44727, 58319, 53849, 49729, 32704, 40480, 31125, 60312, 9213, 3320, 32293, -9252, 649, -4863, -8799, 3472, 38073, 47000, 72796, 61723, 96920, 96984, 104479, 156342, 133555, 95112, 59925, 22903, 34869, 113615, 186315, 216360, 172362, 145629, 122466, 97471, 102758, 27432, 20886, 78318, 101755, 70546, 8387, 24982, 84890, 84896, 47185, 79052, 120451, 106483, 155173, 145792, 122930, 141609, 122038, 106067, 124349, 135709, 173310, 160482, 129955, 137339, 126416]
14345A26416M4891K3343M0238M6348K9155M2276o926j451N0837J03509N8538K9300
14333E86474N4035O9703J40957J24839J23102J59392J67362J74175J38433M5107
14323A783579P4326K8726j7586q7259j49458j52568j79659r3027j41285j75642
14313H90147j52467r2048q6020n9448o0128m4834l5350j7111Q810n2346n6549
14302B42656l765J769j7654l1059k2429K1276l022j7839n8642j8148p852k1513
14290F3778j4679R805j545N0284j376O2230M6994k6911J2434J2853J0386%k0724
14277B03529N938k2911L36K615j7612K1687M1069k8867K7674l6094j5813P5211
14265B56762l124k6321k3209J84k3224o4854K7254M4815r267m9919k4390o2010
$$ y = [126416, 171307, 194650, 234888, 281236, 310391, 352667, 345741, 344290, 395127, 498636, 557174, 586474, 640509, 710212, 851169, 976008, 1099110, 1258502, 1425864, 1600039, 1738472, 1783579, 1857905, 1886631, 1869045, 1781786, 1632328, 1479760, 1300101, 1207074, 1065789, 890147, 737680, 645632, 559612, 500164, 440036, 395202, 359852, 342741, 351551, 299205, 242656, 238891, 240660, 223006, 191947, 169518, 190794, 187772, 169933, 111291, 93143, 85291, 63778, 49099, 58904, 57359, 107643, 106267, 168497, 215491, 188580, 201014, 213867, 224253, 224253, 203529, 209467, 186556, 186892, 189507, 171895, 193582, 234651, 205784, 233458, 197364, 181551, 256762, 253638, 227317, 204108, 204292, 181068, 116214, 143468, 188283, 179016, 129097, 104707, 42697]
14253D2697k7200M122M1456Q1746R665k8754j4302k7718L7742M5754q330m9317
14241A07561L0744L9440M4669k0916j0045j5980K4336N12m1787j1204J81J3388
14229A60899L0672j7902J2377l728J0477N629K1659l7245j4911j5759j6694N7896
14217A93370L7897l2969n9316L0142J3080l9239L543L8846j9239J7168L1776J6341
14205B31400m3417k1364l0164r833J7873M4166l3444p0255n952J6214K7983l1352
14193I1855n526P3163j1707j9799K5665j5352Q547j4174M6886K4307K7046j4118
14181B16793q025K2735k6569o1409m0861L8498m3093l8332J9714M6041O4629K9790
14169B19911K0657J294J6723j7564j7975j5933l3117l6605j3901N2901K4766K9271
$$ y = [42697, 15497, 19619, 61075, 142821, 152486, 123732, 109430, 81712, 119454, 165208, 156878, 107561, 138305, 177745, 222414, 201498, 191453, 175473, 199809, 200321, 158534, 147330, 147511, 160899, 191571, 173669, 186046, 182318, 192795, 198424, 220083, 182838, 167927, 152168, 135474, 193370, 231267, 198298, 138982, 169124, 182204, 142965, 146508, 185354, 166115, 183283, 215059, 231400, 187983, 166619, 136455, 126622, 144495, 188661, 155217, 84962, 79010, 95224, 123207, 91855, 86329, 159492, 147785, 127986, 153651, 138299, 146846, 132672, 179558, 203865, 230911, 216793, 208768, 231503, 204934, 143525, 102664, 141162, 98069, 59737, 79451, 125492, 190121, 219911, 240568, 241862, 258585, 241021, 223046, 207113, 173996, 137391, 123490, 176391, 201157, 230428]
14157B30428j2071k4009j9841L3562j1265j6050J6642R490K1168O4822j1964l4972
14145B45940p0887l8990m9694O9117J00001K0479n5468o8109K8470K1506M632
14134B06997P36N7313J3702m0185l1379Q780P7641L3352J2032j9994m8932K1965
14122B92028M5949m2033l7197k0460o3660j5113M3227M2184l219l3470l5089L1524
14110B04671K5788o0082j9196k0706K2130L2530L3708q015l5633J3110L7031o505
14098B18831q639L1379N3529L9023o8357n8896L1722J3150r697J509P325k220
14086B48659J1076m8095n3706L4482J4871j472l8525j9465O7406J1554L790l9946
14074A90629l6421L8600L9310L1515k4698N2269k3510m0832K567J2773k2480k4553
$$ y = [230428, 218357, 194348, 174507, 208069, 196804, 180754, 197396, 206886, 228054, 292876, 280912, 245940, 175053, 136063, 86369, 155486, 255487, 275966, 220498, 152389, 180859, 202365, 206997, 207733, 265046, 278748, 238563, 207184, 215964, 293605, 326957, 338989, 318995, 270063, 292028, 337977, 295944, 258747, 238287, 174627, 159514, 202741, 244925, 241706, 208236, 173147, 204671, 230459, 170377, 151181, 130475, 152605, 185135, 218843, 210828, 175195, 188305, 225336, 218831, 210192, 241571, 295100, 334123, 265766, 206870, 238592, 251742, 242045, 243554, 250879, 248659, 259735, 211640, 157934, 192416, 207287, 205815, 167290, 147825, 215231, 226785, 230575, 190629, 154208, 192808, 232118, 263633, 238935, 291204, 267694, 226862, 229429, 242202, 219722, 195169]
14062A95169P3581m149n7719n2218M7728K6084K5100k3162p1783j0092k792N3414
14050A99161k2068K1950L5186K7361P434J8568n687l6497N7790P887l971m8163
14038B58951n8810k0673K784n1815m9926P2770J6048N180O0550m8496L3934J9501
14026B39998k5133j5664k4534J3531L5299L659k6110j2291P8435k1232Q889M4227
14014B99074k417J661J6149m7436k5245K0696P0283K9394m2340n4681O983m980
14002B67141l0614n8591l653P3936l4086o4804J806R958Q9548J4294n3341k1851
13990A89743l0308j3801k584L4858K6153K2340j0057q398J2953J8635K8493p357
13978B60670o949M4438L6815k6688J5061j9921R929R128L5617K1979J8791j2109
$$ y = [195169, 268750, 264601, 206882, 154664, 202392, 228476, 253576, 230414, 158631, 148539, 145747, 199161, 177093, 199043, 234229, 261590, 269024, 287592, 281905, 245408, 303198, 311085, 307114, 258951, 200141, 179468, 182252, 130437, 80511, 153281, 169329, 174509, 235059, 186563, 220497, 239998, 214865, 199201, 174667, 188198, 223497, 227156, 201046, 188755, 267190, 245958, 254847, 299074, 296657, 298318, 314467, 267031, 241786, 262482, 332765, 362159, 319819, 265138, 272121, 267141, 236527, 177936, 174283, 248219, 214133, 149329, 151135, 161093, 250641, 264935, 211594, 189743, 159435, 145634, 143050, 177908, 204061, 226401, 216344, 207946, 220899, 239534, 268027, 260670, 253721, 298159, 334974, 308286, 323347, 303426, 313355, 322483, 358100, 380079, 398870, 386761]
13966C86761p91j7143K5987J4651K176o9506m725P048l9433l9553l3407l9968
13954A92097M948M1771O2298k4401j6205k98J7475J4922j7935L7155K6782k4521
13942C14088N5846L0918o8148m9106p774p888O34L028r863l1169L958K6541M3321
13929C04386K0452M0395p9j6274l1785N921l5174n5212J1526M1325M6305k1855
13917C09931j6456J3769l718m1587j8281J2752l5863N361N7511l1483k5298M8526
13905B75164r601K3778K3628L8392n1670l9243P473K1098j4700j085K4759j3280
13893B84713o3228M1178M8932l861K2973m5152n0106N8231L5123r101m215J6247
13881C31734N3091N6501n5370j19442l3256K3609P1473M1158j7074O45J0795k9745
$$ y = [386761, 385970, 368827, 394814, 409465, 411641, 342135, 337410, 344458, 305025, 265472, 232065, 192097, 197045, 238816, 301114, 276713, 260508, 260210, 277685, 292607, 274672, 311827, 338609, 314088, 369934, 400852, 332704, 283598, 275824, 267936, 268570, 271598, 261735, 230566, 234524, 261065, 304386, 324838, 365233, 365154, 348880, 317095, 323016, 287842, 232630, 244156, 285481, 331786, 309931, 293475, 307244, 303526, 261939, 243658, 256410, 220547, 225908, 283419, 251936, 226638, 275164, 265563, 289341, 312969, 351361, 299691, 260448, 267921, 289019, 274319, 273234, 297993, 284713, 221485, 262663, 311595, 307734, 330707, 285555, 235449, 293680, 328803, 319702, 315487, 331734, 384825, 441326, 385956, 266514, 233258, 256867, 328340, 369498, 352424, 353069, 363864, 334119]
13869C34119j2901p031J2150J6077j0858j9973L3716n8454j7530M2906J7438J0478
13857C40137m7983q441n9983L9285K1797l6189m5191K2341J1557j7671M6023M6931
13845C12613j983R143J9260k3620m081l1280K4022M6851N9728O0286k3308n3732
13833C93899L32l1769m6406m441m7848m5065k443k2365L4403L7343r363l312J6539
13820B69504M645k1620L7953Q2510L6031n4448j5980L419K7351J2897n3196k5349
13808C03717K403j9425k515K9370K3031r933j6004m1750m3616J9720J9719L4585
13796B99302L3273j284j402j0662l6772N2658K0468J878o8925o9496j3854K8073
13784B33257K9537L6185M2233k3456n556k1391k3366N413n5685J7355J05267K2149
$$ y = [334119, 321218, 314187, 326337, 342414, 331556, 311583, 345299, 286845, 269315, 312221, 329659, 340137, 292154, 283713, 223730, 263015, 284812, 248623, 203432, 225773, 237330, 219659, 265682, 312613, 310630, 319773, 339033, 315413, 311332, 280052, 304074, 350925, 410653, 470939, 447631, 393899, 394231, 362462, 316056, 311615, 263767, 218702, 216259, 193894, 228297, 265640, 256277, 252965, 269504, 274149, 252529, 290482, 372992, 409023, 354575, 338595, 342014, 369365, 382262, 329066, 303717, 306120, 286695, 284180, 313550, 336581, 326648, 310644, 268894, 225278, 244998, 264717, 299302, 332575, 331291, 329889, 319227, 282455, 335113, 355581, 357459, 288534, 219038, 205184, 233257, 262794, 298979, 341212, 317756, 312200, 290809, 267443, 272856, 217171, 234526, 339793, 361942]
13772C61942p130o612m5111j5033m8408n5310J8319M6201J4154P256Q0489J5679
13760C66436J2098J1768l758O286K658m2071j5175m879j6714L7261N0433N355
13748D09698J942q935l8744o9919j9909J0709N5945N722q506m0132k1176M377
13736B81072K7673M0514K1668K4449o7221l2309k794n3417M04L8371J8186L3948
13724C30544j8095o1396j0069J01081M8164P72l7515k1571J3981k6872J7707j3684
13712C23047l7811j0262K0588O1915K3603k9422M317K0948k451m7728r394j831
13700C15519j4797q2N3973L6584p4646k5854K4632K3323J5421m829K0491N1402
13688D21137N164q801l3758p0657L9698l2251o6330J4687p51l303K2305l5087
$$ y = [361942, 354812, 348200, 303089, 288056, 239648, 184338, 202657, 248858, 263012, 270268, 350757, 366436, 378534, 390302, 386544, 392830, 395488, 353417, 338242, 333363, 316649, 353910, 404343, 409698, 411640, 402705, 363961, 294042, 274133, 284842, 340787, 346509, 338003, 297871, 276695, 281072, 308745, 349259, 370927, 395376, 328155, 295846, 293052, 239635, 240039, 278410, 296596, 330544, 312449, 251053, 240984, 342065, 390229, 391001, 353486, 331915, 345896, 319024, 336731, 323047, 285236, 274974, 295562, 357477, 381080, 351658, 355975, 376923, 374472, 326744, 317350, 315519, 300722, 300640, 354613, 391197, 316551, 290697, 315329, 338652, 354073, 349244, 369735, 421137, 426301, 417500, 383742, 313085, 352783, 320532, 254202, 268889, 268138, 264835, 287140, 252053]
13676B52053j8726M3039N1514k1613k7402O5303J3907K7769J0523k4086K387k3076
13664C51592K321r140J0541r797n7044J0210m130J3858L8022L955L3346k1937
13652C61797l0650N809l9004j0620L3997l0621J331J8626O5864O7730L0193J263
13640D75715o3331q5264P675J5010j1528P937q56L3597R542j742r646m4779J6002
13627C48332j9071n990N117k5603J9362O9745n5772l0688k1712J1746n276J3352
13615C03542M210J6985O6148k8826m4629J9315M4582J0697r639l1017k4556j1770
13603C15042j0308L7619K5722p6797m2048O1026J5674p169J7583j3643l1243L4557
13591C26015j798p278j743M9884k2895j9818N48j6041R82J1678M6118K0481J5755
$$ y = [252053, 233327, 276366, 327880, 306267, 278865, 344168, 358075, 385844, 396367, 372281, 374668, 351592, 353913, 344773, 355314, 345517, 288473, 298683, 294553, 308411, 346433, 350388, 383734, 361797, 331147, 336956, 297952, 287332, 321329, 290708, 292039, 310665, 376529, 444259, 474452, 475715, 412384, 327120, 334795, 349805, 338277, 346214, 345358, 378955, 388497, 386755, 377109, 332330, 348332, 329261, 323271, 328388, 302785, 322147, 391892, 336120, 305432, 283720, 295466, 290190, 303542, 307752, 324737, 390885, 362059, 317430, 336745, 381327, 392024, 382385, 351368, 326812, 315042, 304734, 342353, 368075, 291278, 249230, 310256, 325930, 318761, 336344, 322701, 291458, 326015, 324217, 316939, 315196, 365080, 342185, 322367, 322915, 306874, 307856, 319534, 365652, 386133, 401888]
13578D01888l7808p4854K3517J5894k983l3091k0287J6677J1411L529M4805J7639
13566C66337L4402l5698j6451M3520Q104l2440L7061k3939m8057m5118j7605J7387
13554B87503J6640n522K482p2351j045k0512P2381K0499q140k311k32L5206J4983
13541C39581M4371K6358l1543n720j9090k0932j8385J4045k0965j3441j775K7281
13529C19785P81O027J8865J084K7495K5939J9572l0443K0316M0493l3176n3633
13517C63105j0240Q466M4869k826o9131r029L1555l1589j2664M096J9352q35Q398
13504C43527j5616K4904J3461K2414N8813n1674m7276K6759L29k7159m0466n7977
13492B50039l236O0217K8786k4800J8104J8197J1918l3848k4085M4244K6912p594
$$ y = [401888, 364080, 289226, 312743, 328637, 325654, 292563, 272276, 288953, 300364, 303893, 348698, 366337, 400739, 365041, 348590, 392110, 400214, 367774, 404835, 380896, 332839, 287721, 270116, 287503, 304143, 298621, 301103, 228752, 227707, 207195, 279576, 300075, 291935, 289624, 289392, 324598, 339581, 383952, 410310, 378767, 373047, 353957, 333025, 314640, 328685, 307720, 294279, 292504, 319785, 320566, 326593, 345458, 346542, 374037, 399976, 419548, 389105, 409421, 449914, 416738, 363105, 352865, 361331, 406200, 403374, 334243, 325214, 356769, 325180, 312516, 316612, 335964, 335129, 343527, 327911, 352815, 366276, 388690, 447503, 395829, 348553, 375312, 375641, 348482, 308016, 250039, 246803, 307020, 335806, 311006, 329110, 347307, 359225, 325377, 301292, 345536, 372448, 364854]
13480C64854o845n6194P988k651k9731L8550J1241j6629Q974K8226O5237j1070
13468D01950p302O481p0068j5964K5857L5145p663J0397K2051M7188J6900n1526
13456D13446m0216J3973q085k6344N298J3466m4115j2783K0396m802M281l3225
13444C01290Q218K8505K5731L2489J0814j0048J7485J7310l2308p7632m195K9150
13432C46809o137M390O00k2189m7260N5958N958p439k1170K6077L1513j5419j2136
13419C39555J2883L8689L4889P420K2851M580j0831R101m0467K2834j2409j9036
13407D10059J5979l8841K0647l5166J46p202K3348K7047J7295K0655K6667m1077
13395D39557m090k343n6570r717o484j0586r570L5400j6458M2024M7631K9287
$$ y = [364854, 358009, 301815, 309803, 307152, 277421, 315971, 327212, 310583, 319557, 347783, 413020, 401950, 394648, 401129, 331061, 315097, 340954, 376099, 368436, 378833, 400884, 448072, 464972, 413446, 373230, 387203, 379118, 352774, 358072, 371538, 327423, 314640, 335036, 330234, 334515, 301290, 309508, 338013, 363744, 396233, 407047, 396999, 414484, 431794, 399486, 321854, 317659, 346809, 340672, 345062, 345662, 323473, 276213, 332171, 338129, 330690, 309520, 335597, 367110, 351691, 339555, 352438, 391127, 426016, 433436, 456287, 460867, 450036, 459137, 418670, 441504, 429095, 410059, 426038, 387197, 407844, 372678, 372824, 365622, 388970, 416017, 433312, 453967, 480634, 439557, 435467, 433124, 376554, 366837, 360353, 349767, 340197, 375597, 359139, 401163, 448794, 478081]
13383D78081m6235n3423N1153K0955q453k2805l0903r56l3976l1876O06J3429
13371C35597J9108J855K2794K6812k9308m5257j4188L6059j9480n4241P666K3558
13359C10975K5753M3334K3747p022j7835R983k2776j6008m4858K0620k564n3105
13347B70244m376N5308m553J5631N2824O0996J2068Q502K5420Q175p4957m9530
13335C75752J5845k5807N635K4014j9574K9412l312o5914o326N991L9641M1473
13323D16830M9732j9061j3343j7853q203O79L5788Q74n37k9305m4636l5136k0300
13310C15529j1476K7475N0187L5022k4037o881N2384o8647l0125j596j9938M4479
13298C62376O800k8965o373J2179J6055o4414k7025J6291O6232M8947J3254l5059
$$ y = [478081, 431846, 378423, 429576, 450531, 442078, 419273, 388370, 387414, 353438, 321562, 322168, 335597, 354705, 356560, 379354, 406166, 376858, 331601, 317413, 353472, 333992, 279751, 287417, 310975, 336728, 380062, 403809, 396787, 378952, 388935, 366159, 350151, 305293, 325913, 323349, 270244, 265868, 321176, 316623, 332254, 385078, 446074, 458142, 466644, 492064, 500239, 425282, 375752, 391597, 365790, 371425, 395439, 375865, 405277, 401965, 336051, 329725, 335716, 375357, 416830, 466562, 447501, 434158, 416305, 408102, 408781, 444569, 445443, 444906, 415601, 370965, 335829, 315529, 304053, 331528, 381715, 416737, 392700, 385819, 438203, 369556, 339431, 337835, 317897, 362376, 369176, 340211, 333838, 346017, 362072, 297658, 270633, 286924, 353156, 402103, 415357, 380298]
13286C80298l5724L2381R975l5520J6459L5479j9807k0650k816j1355p864J9805
13274C60661R397L1231r093L218K5434m6323K5090J7519k1724J3544J107M8748
13262D58809o110j15601j4404M1850J860j0323L984J14M6293j4508j7391j5777
13250C58796m1511o416R3662K7205M161m4947j0949J4452J316k8637L34k2278
13238C45188n589J6155K6344l1615q47K3823K3695l2250J880K8273j3823P975
13226C89209j0812j0193l290l0715k191K4979J3602L3940J6482l5665l7171N14
13214C48689M2372K712M9669o6790j1886L3832J9107q1369k1454K1704k1591m3484
13202B71511L020M1868M5957N0689r378P870o3993r593q926N3367J699l3041m8539
$$ y = [380298, 344574, 376955, 386930, 351410, 367869, 403348, 383541, 362891, 360075, 348720, 340856, 360661, 370058, 401289, 392196, 395414, 420848, 374525, 399615, 417134, 395410, 408954, 410061, 458809, 452699, 337098, 322694, 364544, 366404, 356081, 360065, 360179, 406472, 391964, 374573, 358796, 317285, 310869, 404531, 431736, 435897, 390950, 380001, 394453, 395769, 367132, 367466, 345188, 339599, 355754, 382098, 350483, 349636, 373459, 397154, 364904, 366784, 395057, 381234, 389209, 378397, 368204, 364914, 334199, 332008, 356987, 370589, 404529, 421011, 385346, 348175, 348689, 391061, 393773, 443442, 376652, 364766, 398598, 417705, 336336, 314882, 336586, 314995, 271511, 274531, 316399, 362356, 413045, 403667, 411537, 347544, 337951, 329025, 382392, 384091, 351050, 302511]
13189C02511K3826q00M8966K0849n0545l2782J4772L8335K4524l4690l7806L5443
13177C52603Q4404K0318n1291j6864k3065j6798j1573j4318M006L6932O4208J4067
13165D42629k0449n2478Q819k1958r392k0127J170L2545N924J7351k3602k7251
13153C33181l221K4391R2994J3697k686l53k9249J1582j6117J5444J9347l1492
13141D27518o898o0539O159L8533J061j6765l222M488L9557j5016n3270o4674
13129B96932l0996L9041K9407K4105m9742K3814L1152l4749K460J8967j451m072
13117C44868j5332J5571L5785L8993K8371J5367l4330n0388M477m918K8199m4859
13105C61804k5429K8839N3619K0207l3296k2141J225N1569l0627k3343P2698N6416
$$ y = [302511, 326337, 325537, 374503, 395352, 344807, 312025, 326797, 365132, 389656, 354966, 317160, 352603, 437007, 457325, 406034, 389170, 366105, 349307, 337734, 323416, 327422, 364354, 428562, 442629, 422180, 369702, 378521, 356563, 347171, 327044, 328214, 360759, 366683, 384034, 360432, 333181, 329960, 354351, 447345, 461042, 458356, 458003, 428754, 440336, 424219, 439663, 459010, 427518, 420620, 360081, 366240, 404773, 405834, 389069, 385847, 390335, 429892, 414876, 361606, 296932, 265936, 304977, 334384, 358489, 308747, 332561, 363713, 328964, 331424, 350391, 348940, 344868, 329536, 345107, 380892, 419885, 448256, 463623, 429293, 378905, 383382, 378464, 406663, 361804, 336375, 365214, 418833, 439040, 405744, 383603, 384828, 436397, 405770, 382427, 455125, 511541]
13093E11541n275l2405k8309L6954k3111k3105r055j9177R859N3195k230m6440
13081D22442L199J1210n9114o679N0238N1160R691l366k2694m0022O437M6331
13069D68833k3932l5714M118K6506m9694L176M4655l3867k1964N675K4501L6639
13057D48932M7767M967o2750J9459J1882k4175m0332m3436k976J3271j3578p456
13045C51575m5920O118j9267L2508M1790O6332P9767P486k6683J1335J2527j6019
13033E01549m4837j4425j6474k0381K0598j5788n8892K7926K9431L7831k6347
13022D20191n4264k7577p933n7271K187L9846Q754J3477O0917J6656j9118n7233
13010C38632Q907K5432J4846j5612q6165k7150j7276K9081N9101L9694M2298J0667
$$ y = [511541, 506266, 473861, 445552, 482506, 459395, 436290, 427235, 408058, 417917, 471112, 468882, 422442, 425641, 436851, 377737, 371058, 421296, 472456, 482147, 478781, 456087, 416065, 422502, 468833, 444901, 409187, 413305, 439811, 390117, 393293, 437948, 404081, 382117, 387792, 412293, 448932, 496699, 501666, 438916, 458375, 470257, 446082, 405750, 362314, 359338, 372609, 359031, 351575, 305655, 311773, 292506, 325014, 366804, 433136, 512903, 520389, 493706, 505041, 517568, 501549, 456712, 442287, 425813, 405432, 426030, 410242, 351350, 379276, 408707, 446538, 420191, 365927, 338350, 330417, 273146, 275333, 315179, 323933, 337410, 398327, 414983, 395865, 338632, 347539, 372971, 387817, 372205, 286040, 258890, 241614, 270695, 329796, 369490, 411788, 422455]
12998D22455J1522n8957o8324J04J4532L0094N1074O613m9165k0852o3132O687
12986B82651P7193N6749n003j7859O954l6177j4552K4907r87j1399j8522K0425
12974C64380k487m5980m5516P2509P0476L7155l4218l5973l062k391j4672M0356
12962D00577P271n3050j8605N0104j5722m68k1869l1317j9696k4299J8077O5722
12950C56725K4826N870m344J5598O108J6995J7432L7588L34p6115n6379j2622
12938C32016J2171L5414L8279Q78l0877J114o021l6580l9786l4921L172M7279
12926C22138J3932O152K763J4194K2587K2324L0200m1450l8003K9349l3831k2054
12914C28301M4723J8654k041k1585m7920M1396M9932n466m2867p9888n8697l1392
$$ y = [422455, 433977, 375020, 306696, 306800, 321332, 351426, 402500, 409113, 359948, 339096, 275964, 282651, 359844, 416593, 411590, 393731, 400685, 364508, 349956, 374863, 373876, 362477, 343955, 364380, 361893, 315913, 270397, 342906, 413382, 450537, 416319, 380346, 377284, 374893, 360221, 400577, 407848, 354798, 336193, 386297, 370575, 370107, 348238, 316921, 297225, 272926, 291003, 356725, 381551, 387421, 383077, 398675, 404783, 421778, 439210, 476798, 477132, 401017, 344638, 332016, 344187, 379601, 417880, 418758, 387881, 388995, 382974, 346394, 306608, 271687, 274859, 322138, 336070, 342222, 344985, 359179, 381766, 404090, 434290, 392840, 354837, 384186, 350355, 328301, 373024, 391678, 389637, 368052, 320132, 361528, 411460, 405994, 363127, 283239, 224542, 193150]
12902A93150N4819M4010O283M1891M5425M5755k0855p1315l9628M3610J0300L1545
12890C84990m3758j5942M7574K1540K8513k6362j7116J1762m5998j2232j1865
12879C21106J7594P1443N4031o5277K322l4187P3007N4395m441l4869o185j7542
12867D31397N9230M4165J0914J0825K3950j3478p6294m6705l3822J3084j9490
12856D03776K1362j3968N653L1601O839J7556J9888O1220Q5087M7298p899J04794
12844G83207J11095J27056K53049L62488L14651J63123R4655K4656j8895p7283
12834B137802p9878r2111k03336l03628k36333k38352j90964j07486n5330n5050
12824E75334l2209j2865L8026n423o0970m3993m6974l291J0554k5161l8303M285
$$ y = [193150, 247969, 291979, 298262, 340153, 385578, 431333, 410478, 339163, 299535, 343145, 353445, 384990, 341232, 325290, 372864, 394404, 422917, 396555, 379439, 391201, 345203, 332971, 321106, 338700, 410143, 464174, 398897, 401219, 367032, 440039, 494434, 489993, 455124, 448939, 431397, 490627, 534792, 545706, 556531, 580481, 567003, 490709, 444004, 410182, 423266, 403776, 425138, 411170, 416823, 448424, 455263, 472819, 492707, 553927, 639014, 686312, 678413, 783207, 894302, 1021358, 1274407, 1636895, 1951546, 2114669, 2209324, 2233980, 2215085, 2137802, 2057924, 1965813, 1762477, 1458849, 1222516, 984164, 793200, 685714, 630384, 575334, 543125, 530260, 568286, 562863, 501893, 457900, 410926, 407635, 418189, 393028, 354725, 359010]
12812C59010O467p3k4988K7902N1701M712k2225l9133J4751N4853j9244j7105
12800C96628o035p6811M4999N5091L3864L6260J3771n0858n7761m8681j7241L820
12788C27046L9117L6707P70K421k2565j106m2577o9895L6423K1430R653j6965
12776C20459o780K210L977M970l8006K586j8782J5076j8723l6261K8526L0450
12764B89702k0601O781Q193j631K0189l5001Q037K0952K4847J5979m2188K7202
12752C22461k6719J8688K0605J5494j4501N713k4052n044j2041J4219M3780M9733
12740D08336l982j9236J1431L5886N2968P2030M9667j1861k7437o7870l065L2429
12728E29296O723p638n5155q5646p2774L2089P9228M562k4021l2863m354k9506
$$ y = [359010, 365477, 365404, 340416, 368318, 420019, 424731, 402506, 363373, 378124, 432977, 413733, 396628, 390593, 313782, 358781, 413872, 447736, 483996, 497767, 446909, 389148, 340467, 323226, 327046, 366163, 402870, 403640, 406061, 383496, 382390, 339813, 269918, 306341, 327771, 337424, 320459, 313679, 315889, 319866, 324836, 286830, 289416, 270634, 285710, 266987, 230726, 259252, 289702, 269101, 275882, 284075, 282444, 302633, 267632, 275669, 296621, 321468, 337447, 295259, 322461, 295742, 314430, 335035, 350529, 336028, 341741, 317689, 312645, 300604, 314823, 358603, 408336, 404354, 385118, 396549, 432435, 485403, 557433, 607100, 595239, 567802, 499932, 496867, 529296, 536019, 528381, 473226, 387580, 314806, 346895, 426123, 430685, 406664, 373801, 369447, 339941]
12716C39941J413L9756J5438l384P531j3623q841P745K5098K7326R41J5405J1724
12703D66470J9814l8495P677R3693R1551J67019K31609K01597J43434R2562K1809
12692A498740j804J2623k6757j06976j85884k35354j31503n8476q301J9423j0615
12681G65116r1516p5814k3913N6110o177p485J9709m2811r6100m3854J5038M8632
12669E16935L507N1302J3204M9565Q9974O6804P4007J02887J63435K30224L57721
12658A719565M64097M82124L61420J62643n5141k7036n6971j06983k07037m24930
12648B311751n03966l95429k55015j91163r2242o7993j4594J9094r3497l6344
12638F80602o1202q998P283q1573q207K6054L2006K9424L8828K5217M8621N0384
$$ y = [339941, 341354, 381110, 396548, 393164, 400695, 387072, 378231, 385976, 411074, 438400, 439341, 454746, 466470, 486284, 447789, 455466, 549159, 640710, 807729, 1039338, 1240935, 1384369, 1476931, 1498740, 1496936, 1509559, 1482802, 1375826, 1189942, 954588, 823085, 764609, 756308, 775731, 765116, 673600, 597786, 573873, 629983, 623806, 616321, 636030, 593219, 497119, 453265, 468303, 516935, 520442, 571744, 584948, 634513, 724487, 791291, 865298, 968185, 1131620, 1361844, 1719565, 2183662, 2665786, 3027206, 3189849, 3134708, 3107672, 3050701, 2943718, 2736681, 2311751, 1807785, 1412356, 1157341, 966178, 873936, 805943, 791349, 810443, 716946, 680602, 619400, 610402, 617685, 536112, 527905, 553959, 585965, 615389, 654217, 679434, 728055, 778439]
12626G78439K9166N5479J17751J71925K61933L90812N58729O60222N75304L56087
12616C955847J55621j4277j50410j11263j68611l90455o11554n92181m80328l53604
12606A238785k45041j19184j25683o4041l7549k925k1159l7707K9933q424K2122
12595F29127m6871m0389l2914K2936j759O5292L9395L4453Q0455N5969O4512J36077
12583A006283K17864L95808N26792M51003L56636J99638J0582l7956j28630j13189
12573B884831j65479l59160n33391m47332k85319j67825j80684j06854n3738o549
12563E78500j5975l7019m7126L6610M5714k3082o7392Q918M1340J00k1613M7068
12551E46043O3274p470n1752k8835N5793K8190R2492J73563J58563J41605J58749
$$ y = [778439, 807605, 863084, 980835, 1152760, 1414693, 1805505, 2364234, 3024456, 3599760, 3955847, 4111468, 4097191, 3946781, 3835518, 3666907, 3276452, 2664898, 2072717, 1592389, 1238785, 993744, 874560, 748877, 684836, 647287, 644362, 623203, 585496, 615429, 607005, 629127, 582256, 541867, 508953, 531889, 530130, 595422, 634817, 669270, 749725, 805694, 870206, 1006283, 1224147, 1619955, 2146747, 2597750, 2954386, 3154024, 3164606, 3126650, 2998020, 2884831, 2719352, 2360192, 1826801, 1379469, 1094150, 926325, 745641, 638787, 585049, 578500, 562525, 525506, 478380, 514990, 560704, 537622, 470230, 479148, 520488, 520588, 498975, 546043, 609317, 601847, 550095, 521260, 577053, 605243, 697735, 871298, 1029861, 1171466, 1330215]
12540A330215J65924O1786J0855r8316q273q6083j32537j43891j70023k07544
12530G22113j42207n1276m2670q9963l2631L2868n2817l455K0418m3932l676K604
12518C15376K2206J5626k1868j0482q836m2986J5762K9008r035O7610K5285o0079
12506C37587j2367P7508K5815K2073J1001L0076L5428N0651m567j2872m3088n8058
12494D59187q8082l0526K114l0551l0898M004m392O4750L2615m664k5939j8490
12482C29128j1898L653m2351p086K7004J3279l3643p261L7416M3112M542J0745
12470C66640j4372n6445l9473L1018k8440L1137O282l1758P768j9064j9602M1866
12458B75557J6072l7944J3125Q110Q386j2228m777k4959l427M4768J16654N83
$$ y = [1330215, 1496139, 1557925, 1568780, 1470464, 1462191, 1376108, 1243571, 1099680, 929657, 722113, 579906, 528630, 485960, 395997, 363366, 396234, 343417, 339962, 360380, 316448, 312772, 315376, 337582, 353208, 331340, 320858, 312022, 269036, 284798, 313806, 304771, 372381, 397666, 337587, 325220, 402728, 428543, 450616, 461617, 491693, 527121, 577772, 573205, 560333, 517245, 459187, 371105, 340579, 342693, 312142, 281244, 285248, 280856, 345606, 378221, 373557, 347618, 329128, 317230, 320883, 278532, 271446, 298450, 311729, 278086, 270825, 308241, 351353, 355895, 366640, 352268, 295823, 256350, 287368, 258928, 290065, 296347, 264589, 272357, 253293, 233691, 275557, 291629, 253685, 266810, 274920, 283306, 271078, 266301, 241342, 237915, 282683, 399337, 399920]
12446C99920r7606p7125O320P141L133K6402k0926k2493q467P0490m172j1256
12434B71361j5523K5455j4303k6850J7079K5876J2996N163l1766o2717M0750K7916
12422B75437l7877N885L9285K7519j5753m9433o1271J0291J2946n0550k0689J7371
12410A53161M0381L5311l6152j8104L6061M8685q179r036N9161M959O518k6045
12398B86721o9949l0072j5966k4618O1593M4024j3072l5418O2123Q161k2793K6581
12386B77315K7666K9814j6418n9728l9478p843j3232k3156k4362L942K5916k6200
12374A54236K2335J9526N769L7443L9334m0162J4380m8112j7678J2905P1259K473
12362B73708l1282m9503K2759q547M027K5188Q6646j7737q246L310m157j4800
$$ y = [399920, 302314, 225189, 231509, 238650, 241783, 268185, 247259, 224766, 216299, 286789, 282617, 271361, 255838, 281293, 266990, 240140, 257219, 283095, 296091, 301254, 269488, 206771, 247521, 275437, 237560, 243445, 282730, 310249, 294496, 245063, 183792, 194083, 207029, 156479, 135790, 153161, 193542, 228853, 192701, 174597, 210658, 259343, 251164, 242128, 301289, 306248, 312766, 286721, 216772, 186700, 170734, 146116, 207709, 251733, 238661, 203243, 265366, 273527, 250734, 277315, 304981, 334795, 318377, 258649, 219171, 211328, 198096, 174940, 150578, 154520, 180436, 154236, 176571, 196097, 201866, 239309, 278643, 238481, 252861, 204749, 187071, 199976, 271235, 273708, 242426, 192923, 215682, 207135, 211162, 236350, 322996, 305259, 297013, 300323, 296166, 281366]
12350B81366L0022o0518l8079J7884k662j0235j4503K4234O693O27J1994N1342
12338B98165k7169q0363r914L1130N0868L1016K9l8463J9656l1026l4159M8553
12326B58323R45K7802n947k4782K488o893J5081o2917k6977N2802L5362J5439
12314B80726J3090n9880j7809j9130n8704m8251P06Q6101K7654M072m1005R265
12302A76835m1581K777L5740L1447R0L3150L1614L028k6631j092r813J7155k2933
12289B29786J1744L834K1184j8510m2185K2619k5210k1841L6134M846Q681m75
12277B30607J3174k3658m0062J8227k2805J3638J3550k1351J034P904M866K7903
12265B23027N6J0814K9071K0926K4758K6891k6880j257j3160N31L7059k4262l5493
$$ y = [281366, 311388, 250870, 212791, 230675, 228013, 217778, 203275, 227509, 234202, 234829, 246823, 298165, 270996, 190633, 180719, 211849, 262717, 293733, 293762, 255299, 274955, 243929, 209770, 258323, 259268, 287070, 281123, 256341, 258829, 251936, 267017, 204100, 177123, 229925, 265287, 280726, 293816, 233936, 216127, 196997, 138293, 90042, 90748, 176849, 204503, 208575, 167570, 176835, 135254, 138031, 173771, 205218, 205308, 238458, 270072, 273100, 246469, 245377, 235564, 252719, 229786, 241530, 245364, 266548, 248038, 205853, 228472, 203262, 181421, 217555, 222401, 231082, 230607, 243781, 220123, 180061, 198288, 175483, 189121, 202671, 181320, 182354, 190258, 195124, 223027, 223083, 233897, 262968, 283894, 308652, 335543, 308663, 307406, 294246, 294777, 331836, 307574, 272081]
12252B72081j1779K7905l213J0525j6020J1506j261o7300o492K6356K2257j6224
12240B48341k4932j7486K841o223m3501j1060j5884j0810J0692K9692M3915p701
12228A97884r234Q067k4372K528l6244L3563M8860j1346Q224q680L5814J4733
12216B59797k4441k6469k8100J9271N9157j9518n3106m6N8603J1925l419L6529
12204B90183J5392l1859M130l342p853o55l229o0854M572n805m462J3397J5253
12191B24868N531N0726L220m8126j8692J6352l7210J8634P460o2673M49j335k4955
12178A34249j6138L3654j7241M6849K5772j3387J5029L5243J135m0569r867l348
12166A91381P44k7945m9291j2407Q2601k5989k6522L3520j0057p9M2224M1519
$$ y = [272081, 260302, 288207, 284994, 295519, 279499, 291005, 289744, 222444, 215952, 242308, 264565, 248341, 223409, 205923, 208764, 202541, 159040, 147980, 132096, 121286, 131978, 161670, 205585, 197884, 188650, 196717, 172345, 174873, 138629, 172192, 221052, 209706, 217930, 209250, 245064, 259797, 235356, 208887, 180787, 200058, 259215, 239697, 186591, 186545, 245148, 257073, 253654, 290183, 305575, 273716, 277846, 274504, 266651, 265996, 262767, 201913, 206485, 200680, 196218, 209615, 224868, 230399, 281125, 284345, 236219, 217527, 233879, 196669, 215303, 222763, 160090, 160539, 159204, 134249, 118111, 151765, 134524, 181373, 207145, 193758, 208787, 244030, 245165, 204596, 194729, 191381, 192125, 164180, 114889, 102482, 185083, 159094, 132572, 166092, 156035, 155956, 198180, 239699]
12154B39699M5774k3604r6204m3365L5273L7000q953l0940M6716N3014r687k8904
12142B15819J168l3147l0154n5680L9664N790L9789O4905K3102l5432J1325m4918
12130B02231R812L7332J4629n155j8326n8333q4797p100L5648M3550r98J3110
12118A81603q825m253L0786j326l183L0072k4795l6703l88K5232J686R5r027J4442
12104A95416O421m855j0850j512m235J5908k2516L9048l2784J4260K2330m2224
12092A74407M7867M746p7753l5914K216M2754k2516n0198Q8464K9034J091N422
12080B09620n8284n3005J595K8153o841r288j6470Q5149M3570l0542n3860K0284
12068A60081k3458o893M2905J0327K7501l534k1835l8462M4350P137J9378j3729
$$ y = [239699, 285473, 261869, 165665, 122300, 157573, 194573, 185620, 154680, 201396, 254410, 244723, 215819, 216987, 183840, 153686, 98006, 137670, 143460, 183249, 248154, 271256, 235824, 247149, 202231, 212043, 249375, 264004, 258849, 240523, 182190, 97393, 90293, 125941, 169491, 168493, 181603, 172778, 168525, 199311, 197985, 194802, 224874, 200079, 163376, 162988, 188220, 189906, 190001, 180974, 195416, 201837, 196982, 186132, 184620, 180385, 196293, 173777, 212825, 180041, 194301, 216631, 174407, 222274, 227020, 149267, 113353, 115569, 158323, 135807, 85609, 174073, 203107, 204198, 209620, 151336, 98331, 99926, 128079, 121238, 111950, 95480, 180629, 224199, 193657, 139797, 160081, 136623, 129730, 172635, 182962, 210463, 206929, 185094, 146632, 190982, 198119, 217497, 203768]
12056B03768j3124j8660N3918O0539k2453m1092m0867m2376m2583l272O2059K3040
12044A78897J6849L620l6170k4184k1092j4452p378N087O4679M8134K7271k8286
12032B12975j594l524k1020m5217n7551N210M5078K6478k0228r568M3687K1102
12020A95828l6907n6690J0516L1129M552N995P2715O4302j8531m9813n4430M095
12008A72761J9065K7424k7963n2955M0354L5323j1305m7063j789M9500K4533K5732
11996B53617R730o5464n7622k012k8453j3945M2191M917J7332j9887k6447K5243
11984A39200M9754N9734j0734l3803l853l3464L3283k0016n9999j9200O7799L7830
11972B06531M963n221M5226q973k6451k6973k4164L4459q245J2541l329O658J4371
$$ y = [203768, 190644, 171984, 225902, 286441, 263988, 222896, 182029, 139653, 97070, 93798, 155857, 178897, 195746, 199366, 163196, 139012, 117920, 103468, 96090, 101177, 165856, 213990, 241261, 212975, 211381, 207857, 186837, 141620, 84069, 89279, 134357, 160835, 140607, 131039, 174726, 195828, 158921, 102231, 112747, 143876, 148428, 154423, 227138, 291440, 272909, 223096, 168666, 172761, 191826, 219250, 191287, 138332, 178686, 214009, 202704, 155641, 153852, 203352, 227885, 253617, 263347, 197883, 140261, 138249, 109796, 95851, 138042, 142959, 160291, 140404, 113957, 139200, 188954, 248688, 237954, 204151, 200298, 166834, 200117, 180101, 120102, 100902, 168701, 206531, 211494, 206273, 251499, 242526, 216075, 189102, 164938, 199397, 191152, 203693, 200364, 207022, 221393]
11959B21393l1489k7023l0425k1054K458M1014K6630K7759K266o2517j8945j4089
11947A15978Q228P223L9326J072M876J2111M1083l3756J3177o6300k6701K4109
11935A40426J7677M784L4821J2509k2082j8046M777p722m069J9018j2593O282
11923A75782J4124p689K4510P309j1915M3832K9249j8653o3570k747K0282l7790
11911A72724j5350M0974N7976L1516p3633p0442m4499L1690L169p089K4126n164
11899A45998o3859L6259P530k4512M2084N026K4870k5372j8880J6638k1711J6036
11887A40107J2486p913K7838Q33o055N5041L0553k4655j1665k6136l7471m065
11875A48898N414q531L1471p1466l0462J8429L8184M7952k4213L8475l0466j3208
$$ y = [221393, 189904, 162881, 132456, 111402, 113860, 154874, 181504, 209263, 211529, 149012, 130067, 115978, 124206, 131429, 170755, 171827, 176703, 188814, 229897, 196141, 209318, 143018, 116317, 140426, 158103, 162887, 197708, 210217, 188135, 170089, 174866, 167144, 163075, 182093, 169500, 175782, 189906, 182217, 206727, 214036, 202121, 245953, 275202, 256549, 192979, 190232, 210514, 172724, 157374, 198348, 256324, 287840, 214207, 143765, 99266, 130956, 134125, 127036, 151162, 145998, 82139, 118398, 125928, 101416, 143500, 148526, 173396, 148024, 129144, 145782, 124071, 140107, 152593, 144680, 172518, 173351, 167296, 222337, 252890, 228235, 216570, 190434, 152963, 148898, 154312, 145781, 177252, 105786, 75324, 93753, 131937, 179889, 155676, 194151, 163685, 150477]
11863A50477n4585m3084J8157L6608K2906L306j0646P480o6k1218M7636Q122P9
11850A65172K3082k5520q2201K0860O809Q256j6720k255K425P58K6389M4516j551
11837A70020j7595r5493k8998j0399R7730k173M90J3829j4769m7268O3871K0955
11825A50200k3255R076r506k2432L3875N357P549L2529K1597l7432m6159m582
11813A16817O3978M461k1985k6023m0607L7443M7164O695n5640J2513P2171J2883
11801B29870j6589p872J3426l757l3513l4684L0078J6597j70p4670o1692l0623
11789B6401M9762P9581J4989J1494r471m0331l2069P714k4646q8015J8930R6939
11777A11278N5007M2765N5275m9886o9557L8804j4545m2152k2476M7773J234q515
$$ y = [150477, 95892, 52808, 70965, 107573, 130479, 133785, 123139, 130619, 130553, 109335, 156971, 165093, 165172, 188254, 162734, 80533, 101393, 108202, 116458, 99738, 97483, 99908, 100666, 127055, 171571, 170020, 152425, 56932, 27934, 17535, 115265, 113092, 113582, 127411, 112642, 65374, 129245, 150200, 126945, 136021, 126515, 104083, 137958, 143315, 150864, 183393, 204990, 167558, 121399, 116817, 180795, 185256, 163271, 137248, 96641, 134084, 181248, 187943, 132303, 144816, 216987, 229870, 213281, 205409, 218835, 215078, 181565, 146881, 176959, 193556, 193386, 118716, 57024, 26401, 76163, 155744, 170733, 182227, 172756, 132425, 100356, 108070, 83424, -4591, 14339, 111278, 166285, 209050, 264325, 214439, 144882, 183686, 169141, 126989, 104513, 152286, 153520, 145005]
11765A45005p7066m3083J6443J2580J3858J2509J3931R04K9939k9495Q669K0666
11753A24860m1634l433J6614M6442j1117K039j0451j7825k5189l0865K3882N2954
11741A26277J4346o6220O517Q956m9510L6327Q1397p38l0004L4386M2750l5928
11729A68556n8011j9348M068l551K2719L1753n4217j3220J8176j6310J492k2442
11717E9665J3101k3842L7346L6116o68l9477L985L0767P6901j6929l203j2877
11705A60885m1983k217K5900K4600n9123K706J8576k2309l0319M576j2333P846
11693G6805J7242K0962j1240j2837J2042L0716m0163n4446P384N0790k1973l2402
11681D2880J9459k4789M688L6010l0880J5958M3478j5848j4684k4132L5719L5422
$$ y = [145005, 67939, 24856, 41299, 53879, 67737, 80246, 94177, 95081, 125020, 95525, 104194, 124860, 83226, 79793, 96407, 142849, 131732, 133771, 123320, 105495, 80306, 49441, 73323, 126277, 140623, 74403, 80920, 89876, 40366, 76693, 158090, 157352, 127348, 161734, 204484, 168556, 110545, 91197, 95265, 91714, 114433, 146186, 91969, 78749, 96925, 80615, 82107, 59665, 72766, 48924, 86270, 122386, 121718, 82241, 86226, 116993, 193894, 176965, 173762, 160885, 118902, 116685, 142585, 167185, 108062, 110768, 129344, 107035, 76716, 81292, 68959, 76805, 94047, 115009, 103769, 90932, 102974, 133690, 93527, 39081, 46465, 97255, 75282, 42880, 62339, 37550, 42238, 78248, 47368, 63326, 106804, 90956, 76272, 52140, 87859, 123281]
11669A23281j9086l5626l8056P9587M637P912K3236k753K7766l6633N79R770k1530
11656A23084K6196k1714m182k0557l881M9124q146m4142J3316L0873k0640K0572
11644A39903k3826p5023l8211L4903N6294L4854j2847j0887n26K2515M5008Q550
11632A80707j3631m8561m5619J0143M036J0966L0288N4380K7173Q716L1007j2638
11620B36967r0347j21115K6807O9927N4259N584o5158k7193k3479k2901J1365
11609E4716L7155j6946l2598l5145m116L4894M1014N917J0088L3154P144K5625
11597A60902K8663m0990k3860M6672L5222j458j0789l869K0348n1402K1268L4626
11585B15333J9662N7646O9927P2634N2607P4509J11635K67296K73438L43485M12000
$$ y = [123281, 104195, 68569, 30513, 110100, 114737, 122649, 145885, 143132, 170898, 134265, 134844, 144614, 123084, 149280, 127566, 123384, 102827, 98946, 148070, 139924, 95782, 109098, 139971, 119331, 139903, 116077, 41054, 2843, 37746, 94040, 128894, 116047, 105160, 104634, 127149, 172157, 180707, 167076, 118515, 72896, 83039, 87075, 98041, 128329, 182709, 209882, 218598, 249605, 236967, 146620, 25505, 52312, 122239, 176498, 182082, 116924, 89731, 66252, 43351, 54716, 91871, 74925, 42327, 7182, 3066, 37960, 78974, 84891, 94979, 128133, 135277, 160902, 189565, 148575, 124715, 171387, 206609, 205151, 194362, 190493, 210841, 159439, 180707, 215333, 234995, 292641, 362568, 435202, 487809, 562318, 673953, 941249, 1214687, 1558172, 1970172]
11574A970172K86430J07409P9751M7599j6742j18283k44787l79471l48033k77530
11564A106515k05761j19805j18242j77089j51181m0021N6086N0417p5713n0972
11554B74234K3337j8187J1790k0725l4177k7658M183J1046k9212o1921N409J5969
11542A54088N7440L3439p126o6309J8653J3670l1046o1699m9582L2332K8696j3489
11530A09067m2650L3622P198k879k7917k5708J8325O4119L4516k3824p707n1043
11518H5119r3082k2304K5937M3572o634K4718N6244N2187p691j0166o236j8773
11506A22891p6819R91O386k5855J0000J9436N2873M0701K7868K8833K1485k5424
11494B03366o6951n0610M196L8148J4526l3024k2216N2402J3693j6059k7394p3536
$$ y = [1970172, 2256602, 2364011, 2443762, 2491361, 2474619, 2356336, 2111549, 1732078, 1384045, 1106515, 900754, 780949, 662707, 485618, 334437, 294416, 350502, 400919, 325206, 274234, 297571, 279384, 291174, 270449, 236272, 208614, 212797, 223843, 194631, 132710, 138119, 154088, 211528, 244967, 237841, 171532, 190185, 203855, 172809, 111110, 61528, 93860, 122556, 109067, 66417, 100039, 107237, 104358, 76441, 50733, 69058, 133177, 167693, 143869, 136162, 85119, -7963, -30267, -4330, 39242, 32608, 57326, 113570, 165757, 158066, 147900, 141664, 122891, 46072, 47063, 53449, 27594, 37594, 57030, 109903, 150604, 178472, 207305, 228790, 203366, 136415, 85805, 90001, 128149, 142675, 109651, 87435, 139837, 153530, 137471, 110077, 36541]
11482C6541l67k1395j539K8273N5705J9558J4066k8435l770P118J8999o0917m9439
11469A4398L8140N1888l181p093k9023L3541M3355j8548j0194K5946l6077k3433
11457G9719M1958k3435k6894m8204k7722M0719N2265L8691J8930k891o3805o0840
11445A8491O904J3197M1629N4107R583j3071l9021o5450j3418K7604O3656K4011
11433A28222k3103k1699L413K0628l855k4910l7551L86K0393L0470J0619n2252
11421E0761n540k2350j4992M0481O7080K4242k7101k2355M258K9683J5781m6238
11409I3710n6616j2663P1815J5598k3013j7028M9514j3838J915l1633k0292r927
11397D7542J3026l383K1864p918J0052m7551M5333L4692J9609K2342l6287k7696
$$ y = [36541, 36174, 14779, 13240, 41513, 97218, 116776, 130842, 102407, 98637, 105755, 124754, 63837, 14398, 52538, 104426, 101245, 94152, 65129, 98670, 142025, 123477, 113283, 139229, 103152, 79719, 121677, 98242, 71348, 23144, -4578, 36141, 88406, 127097, 146027, 143136, 79331, 18491, 25395, 38592, 80221, 134328, 143911, 130840, 91819, 26369, 12951, 40555, 104211, 128222, 105119, 83420, 86833, 107461, 103606, 78696, 41145, 41531, 61924, 92394, 103013, 50761, 45221, 22871, 7879, 48360, 115440, 139682, 112581, 90226, 94484, 124167, 139948, 93710, 37094, 24431, 96246, 111844, 88831, 71803, 121317, 107479, 109394, 77761, 57469, 47542, 60568, 57185, 79049, 71131, 81183, 33632, 78965, 113657, 133266, 155608, 119321, 91625]
11385I1625l459l202N0714o2025r8896j5306k3931L9149R958l3809M4886L3852
11373B9556j4081Q280J9996K4766k8276O347J9235o2773K9768K0057l7467J8387
11361C3795L1743k5759J509Q106L8898l5872k8377k8833K55K9011k4218K6316
11349B6574M7474J7725j7365l5282P616n067J1941P463j9529l3735L5495L0987
11337G4297J94K1004L038k5158k0984J6613m00K071K3090L1909k1258j444p5670
11324B7302p7858L8079L7820l2734p689R013k211j2843K4042L0129K3753p753
11312D9050o9771N0038j903l0962M9978J3882p313J4245J1735j1817R799l868
11300G3093k7558m7484L2682K2343j1363l6596j3835l1985M5449K8541m4018j4734
$$ y = [91625, 88166, 84964, 135678, 73653, -25243, -40549, -64480, -25331, -15373, -49182, -4296, 29556, 15475, 23755, 43751, 68517, 40241, 46588, 65823, 3050, 32818, 52875, 15408, 33795, 65538, 39779, 41288, 49394, 88292, 52420, 24043, -4790, -4535, 24476, 258, 26574, 74048, 91773, 74408, 39126, 46742, 41675, 53616, 61079, 41550, 7815, 43310, 74297, 74491, 95495, 98533, 73375, 52391, 69004, 68604, 70675, 93765, 125674, 104416, 102972, 27302, -50556, -12477, 25343, -7391, -15080, -6067, -8278, -21121, 2921, 33050, 56803, 49050, -20721, 29317, 27414, -3548, 46430, 60312, 52999, 67244, 78979, 67162, 76961, 73093, 45535, -1949, 30733, 53076, 41713, 5117, -8718, -40703, 4746, 33287, -10731, -25465]
11288b5465R0712M6033J2531n1959M397M8250k7828o5868n061M0572M3102p2122
11276C7294o4460K086K7393L802q057n108p418M9341M1616j6436l2614L3707P28
11263F1874k0656J2305N278j2646j728o005O694J6415J0873J0646J3205l8558
11251E7697n305M199L3138J0585j1458J4409J6010p2426l1600J3173J0971p17
11239C8676J5543L0754j2057o3410m8626k927L3494N2642M2007j1851j3639j6216
11227D4390M9936j872k4211k657l032O688k179M345M5808K1948P4196P0550l117
11214B80793O814M9044Q8113P7783N9437J55180J22898J87678K35867L57071N56429
11203B177107Q33795J266484J523436J571606J396943J224393Q23105K68115l14528
$$ y = [-25465, 65247, 111280, 123811, 71852, 76249, 124499, 96671, 30803, 25742, 66314, 109416, 37294, -27166, -25080, 2313, 6115, -1942, -7050, -14468, 34873, 76489, 60053, 27439, 61146, 61874, 41218, 53523, 58801, 46155, 44427, 38422, 45116, 61531, 72404, 83050, 96255, 57697, 52392, 56591, 89729, 100314, 88856, 103265, 119275, 46849, 15249, 28422, 39393, 38676, 54219, 84973, 72916, 9506, -39120, -42047, -8553, 44089, 86096, 74245, 60606, 44390, 94326, 92454, 68243, 65586, 62554, 69242, 67063, 71408, 117216, 139164, 213360, 283910, 280793, 287607, 336651, 424764, 502547, 561984, 717164, 840062, 1027740, 1263607, 1620678, 2177107, 3010902, 4277386, 5800822, 7372428, 8769371, 9993764, 10816869, 11084984, 10770456]
11194A0770456q98349j229974j340868j517549j461667j143177p92267m73974
11186A912631k78618k48644j23628n5664p0555o0798o5514J14499K07445K55635
11176A586789K51436K32873J78529J28721K6355N5405N5112j11741j68662k15837
11166B018980l30805l40765k31560j64686j43440j49169r7894o9238n1439k8612
11156D11372k9701m0838l0623j4720N8716m2530p7560j4556n2287n0337k5844
11145I1092N2213M5074O4629K7371l9541j8499n4374n514m1474j549K986l0582
11133I1832n3816M2182K7675q522N1921J1553l4109m7758K2780l3389P985L9640
11121A17974k2153m5479m7355O019N764N3595L2034N403n8025K991Q3750J0499
$$ y = [10770456, 9872107, 8642133, 7301265, 5783716, 4322049, 3178872, 2386605, 1912631, 1634013, 1385369, 1261741, 1206077, 1135522, 1074724, 1009210, 1123709, 1331154, 1586789, 1838225, 2071098, 2249627, 2378348, 2404703, 2460108, 2515220, 2403479, 2234817, 2018980, 1688175, 1347410, 1115850, 951164, 807724, 658555, 560661, 491423, 439984, 411372, 381671, 340833, 310210, 295490, 354206, 311676, 234116, 219560, 167273, 116936, 91092, 143305, 188379, 253008, 280379, 240838, 222339, 167965, 162451, 120977, 119428, 122414, 91832, 38016, 80198, 107873, 99351, 151272, 162825, 128716, 80958, 103738, 70349, 78334, 117974, 95821, 50342, 2987, 9006, 14770, 68365, 100399, 105802, 47777, 50768, 134518, 145017]
11109A45017o4714r853j3603J4771l3518k275K821M8605k3961J2537J1930K6727
11097A14484J2670J7557l9752l4427M0476k6330P160M182j5130N387L2712L6540
11085A55529O951l2968j5579O455J1725J0785o509k9998r766l8045L7991K4016
11073A20587k2081J6452j6367j6308k4592K2610J5003p6057m6401P2783M8859
11062I4488O859j5285L400k1742m7918L0738O9295j5997m9584j4078N432J3343
11050E8951J1612P13L1594R113K0786K9177N0889J2038L3041l3973n316K7545
11038B46170J3045L4457J6297k3537q003o0038k7219j2139K4874L3284r637M3650
11026B71204J7947L4733l5435K2528M4755j2328q3752q2776K6456J2436K2849
$$ y = [145017, 80303, 70450, 56847, 71618, 38100, 35825, 38646, 87251, 63290, 75827, 87757, 114484, 127154, 144711, 104959, 70532, 111008, 84678, 91838, 96020, 80890, 86277, 118989, 155529, 162480, 129512, 113933, 120388, 132113, 142898, 136389, 106391, 96625, 58580, 96571, 120587, 98506, 114958, 98591, 82283, 57691, 80301, 95304, 19247, -27154, 45629, 94488, 101347, 86062, 89462, 67720, 19802, 50540, 119835, 103838, 54254, 40176, 45608, 58951, 70563, 71276, 102870, 111983, 132769, 161946, 212835, 224873, 257914, 223941, 218625, 246170, 259215, 293672, 309969, 286432, 278429, 218391, 191172, 179033, 203907, 237191, 227554, 271204, 289151, 323884, 288449, 310977, 355732, 343404, 259652, 176876, 203332, 215768, 238617]
11015B38617K6298K0137m060o173R943j2395o8020l5781R489o76n171o9683N0702
11002A53227K9606k8282o7247j4144J7280o720P71k9618j5555M9053J2945j5938
10990H5378k3048j2552J8006L2499k5120k4347K4141R3072N449j6642j6467O2742
10978B03111K3001l2861L5053O3694l7246o6900l8297J6452M5577M7077P5759
10967C34420M6417J48203L9207Q5231J67947K88544L72829N91920R81402J256367
10957D312487J347295J173540R90511J098945J035320N32610j94398q32471j147639
10948H316200j029407r53224j130309j294812j134313p71780m73649k88364k21370
10939A018972j38844q9869j05483m3825r4411p3481j8226m0817k3608k4255k3769
$$ y = [238617, 264915, 285052, 280992, 274819, 284762, 272367, 204347, 168566, 178055, 177379, 172208, 102525, 153227, 182833, 154551, 87304, 73160, 90440, 83720, 84491, 54873, 39318, 88371, 101316, 85378, 62330, 49778, 67784, 100283, 75163, 50816, 74957, 168029, 173478, 156836, 140369, 203111, 226112, 193251, 228304, 291998, 254752, 187852, 149555, 166007, 211584, 258661, 334420, 380837, 529040, 568247, 653478, 821425, 1109969, 1482798, 2074718, 3056120, 4312487, 5659782, 6833322, 7823833, 8922778, 9958098, 10490708, 10296310, 9463839, 8316200, 7286793, 6333569, 5203260, 3908448, 2774135, 2002355, 1528706, 1240342, 1018972, 880128, 790259, 684776, 640951, 546540, 473059, 454833, 414016, 390408, 366153, 342384]
10928C42384k7168m8901r136L525m3663q8482k231R412M6193N547J26j7888j7579
10915A52139m9463j1878j4111l3756m6807P32O4485M6076m846q3559k1500M6306
10903D3818k3471j9462J8393M775K8308M8921m6088P205J5569k3001o571K1139
10891F9535J3541J6524k5969j9308r777J5976j5518j9383K6529L5315k6923l6970
10879B3572j2427l9091J2651J6712p908R595P3365Q5831j7540m1467o5416k5855
10867A2022K8151j0155J8113J6025n685k8366q95l927j3060L3387Q1497J6172
10855A43279j0193q504p487k8940L7300J1390j5591j8437k9430N225N3279L5027
10843A66918o2853m9991j2071J8454N3849J8202Q972j2034p4616m7983n33Q5571
$$ y = [342384, 315216, 266315, 257179, 260704, 217041, 128559, 126328, 135740, 181933, 187480, 187606, 169718, 152139, 102676, 90798, 76687, 42931, -3876, -3144, 61341, 107417, 102571, 19012, -2488, 43818, 20347, 885, 19278, 24053, 52361, 101282, 55194, 62399, 77968, 54967, 48396, 69535, 83076, 99600, 73631, 54323, 44546, 60522, 45004, 25621, 52150, 87465, 60542, 23572, 11145, -27946, -15295, 1417, -6491, 3104, 76469, 162300, 144760, 103293, 37877, 12022, 40173, 30018, 48131, 64156, 58471, 30105, 29210, 25283, 12223, 45610, 127107, 143279, 133086, 124582, 117095, 88155, 125455, 136845, 121254, 102817, 73387, 78612, 131891, 166918, 104065, 54074, 42003, 60457, 114306, 132508, 141480, 129446, 54830, 6847, 6314, 91885]
10831I1885J4507k4450r353j3278K2198L1171q3984o2955L370j1197m0931K448
10819h0569O2349k5435P564N5955k3078k8008J2255J8729n24K6817k497k7484
10807c926M556R616m4198k214M0196M6265m795m7239n3569J6031j733k0392k4753
10794h6155l1910L2573N0996K4404j6415n13k8236j4581k2508J2789J9768P1959
10782A2171p433K0508j6168O068m8122l0662L9883K2197n8348l0335K6093L9675
10770b4473j0529K5515M5076K7667j1764o0903q281k3708M3226M2809J0352M3950
10758I8937n588m7219L2894P400j3665k1623Q329k9788r695K076o722m241L4465
10745D5560n621K888l1636L7806Q539k818J7172K1438l0010l6603j3653K7452
$$ y = [91885, 106392, 81942, 72589, 59311, 81509, 112680, 28696, -34259, -30889, -42086, -83017, -80569, -18220, -43655, -36091, 19864, -3214, -31222, -18967, -238, -762, 26055, 23558, -3926, 630, 10246, -33952, -36166, 4030, 50295, 45500, -1739, -55308, -39277, -41010, -61402, -86155, -118065, -85492, -34496, -10092, -26507, -27020, -55256, -69837, -92345, -79556, -59788, 12171, 4738, 25246, 9078, 15146, -32976, -63638, -23755, -1558, -59906, -90241, -64148, -24473, -35002, -9487, 35589, 63256, 51492, -9411, -17692, -41400, 1826, 44635, 54987, 98937, 93349, 46130, 79024, 86424, 72759, 51136, 59465, 29677, 19982, 22058, 15336, 11095, 45560, 39939, 42827, 11191, 48997, 57536, 54718, 71890, 93328, 63318, 26715, 13062, 40514]
10733D0514L9408K3245m9451j9092l3127j1421M9362j3880K2732M945k1335N5929
10721H7829J375J648j7685N621J7797K1560p2126L676o09K8029J6827o3802Q318
10708C8458l834n1127l7011J1547M5519J7177P018N4708l847j7069l1703J2869
10696D2705l2665m8397j9045j1341K5240j7170L4937M8973J8084k2707m286j0858
10684C470J0198P2484j9379o0417k3512O9151L5334P993K5446K9593j0012M0355
10672A80704J7607j2470J8730K8110L9010J4845m8646K9003L311M5251P9711M6501
10660D41667O6879R4168N4450L3584O3409Q626N2942P4485J14976R1303P3094
10649A169583M1252J00805N1113J6929K8310N1113M1855L7872Q3629R6299L0369
$$ y = [40514, 79922, 103167, 53716, 34624, 1497, -9924, 39438, 25558, 48290, 53235, 31900, 87829, 89204, 90852, 73167, 78788, 96585, 118145, 46019, 49695, 49086, 77115, 93942, 30140, 38458, 34624, -16503, -53514, -41967, 3552, 20729, 27747, 82455, 78608, 61539, 29836, 42705, 10040, -38357, -57402, -68743, -43503, -60673, -25736, 23237, 41321, 18614, 14328, 3470, 13668, 86152, 66773, 6356, -17156, 51995, 87329, 95322, 120768, 150361, 140349, 180704, 198311, 185841, 204571, 232681, 271691, 286536, 237890, 266893, 270204, 315455, 395166, 441667, 508546, 602714, 657164, 690748, 754157, 762783, 815725, 890210, 1005186, 1096489, 1169583, 1210835, 1311640, 1362753, 1379682, 1407992, 1459105, 1500960, 1538832, 1622461, 1718760, 1749129]
10638A749129K0551M2498M7553M7095Q4835J14384J55099J38270K02801K88545
10628B890760L75610M76996P27075J023405J323734J648946K020458K277872K163001
10619A4927857J911084J580445J344660J132227R63357R37163R62500J346268
10611B5105561K183621L136985L615040L448526K813464K049167J475825R22799
10603D4750988M26180p9496k51557L19713J533874K985604L789499L413454K264043
10594E9152302J138182J02902o99328j642373k675496l371858l143335j926131
10586D6934865m62255L68722L36615k32531q20278j253039j770127k389746l024721
10577C7687505l468256l272665k477270j600884j031347q51604r70856j167649
$$ y = [1749129, 1769680, 1812178, 1859731, 1906826, 1991661, 2106045, 2261144, 2399414, 2602215, 2890760, 3266370, 3743366, 4470441, 5493846, 6817580, 8466526, 10486984, 12764856, 14927857, 16838941, 18419386, 19764046, 20896273, 21859630, 22796793, 23759293, 25105561, 27289182, 30426167, 34041207, 37489733, 40303197, 42352364, 43828189, 44750988, 45177168, 45097672, 44846115, 45165828, 46699702, 49685306, 53474805, 56888259, 59152302, 60290484, 60393386, 59694058, 58051685, 55376189, 52004331, 48860996, 46934865, 46472610, 46841332, 47177947, 46945416, 46125138, 44872099, 43101972, 40712226, 37687505, 34219249, 30946584, 28469314, 26868430, 25837083, 24985479, 24014623, 22846974]
10569B2846974j340867j530861j860482k076788k181896k132008j859316j534673
10561H330083j227242r27941p36987n76739m76436l56260k78042k30654k19259
10552C300523j72751j71482j65956j05498j66145j43155j71474r5891m7811m2760
10542B017600p1001o5418o7496o9793p2791m6360n3302k1726r2930j04266l3902
10531A318615o7812k1272P681j04509n9026k3518Q561J7833m2053o4462k2343
10520I47695m1078n2170L0209l3601m1756J5619J9633m9106m1029m8461j583n9878
10508F44494m9482L311l9820N541l2047k1942L2517J8543k9672m6540K1410L9097
10496E45410n9833m0518l9485J8850j0124M015l5147l026o802M3603J2686j4636
$$ y = [22846974, 21506107, 19975246, 18114764, 16037976, 13856080, 11724072, 9864756, 8330083, 7102841, 6174900, 5437913, 4861174, 4384738, 4028478, 3750436, 3519782, 3300523, 3127772, 2956290, 2790334, 2684836, 2518691, 2375536, 2204062, 2108171, 2060360, 2017600, 1946599, 1881181, 1813685, 1743892, 1671101, 1624741, 1571439, 1549713, 1456783, 1352517, 1318615, 1250803, 1229531, 1237212, 1132703, 1073677, 1050159, 1058720, 1076553, 1034500, 970038, 947695, 906617, 854447, 884656, 851055, 809299, 824918, 844551, 795445, 754416, 705955, 704372, 644494, 595012, 598323, 558503, 564044, 531997, 510055, 542572, 561115, 531443, 484903, 506313, 545410, 485577, 445059, 405574, 424424, 414300, 418315, 383168, 380142, 373340, 416943, 429629, 414993]
10484D14993m9427k9370m906m645J0819N0075j7567q7756l6267N0544R481J4296
10472C20270K096o015j2527O640l1201n4618q591Q755j7770l6964l5477k4612
10460A09986K3105l4315R286J18566J04226l481j9943n8159n1383l740J5612k7032
10448A82728j7981j6300O5890k6582j082l6255m6960k9948m16l9113k1454K4036
10436C6563O8748J5723k1714j7765j1264m8882j5552O9552k507M5221m287o0830
10424E3006l5411K1302J1501J3110m658M506P493j1919K24K7363m6558n7747L6151
10411A8363m9807L513J4920j2395N139J4641M5429L6220K9724k4426l7219j094
10399D3008j2485m0845m692O635J0746N4975l0623l1883k045M1478K5253k6210
$$ y = [414993, 365566, 336196, 331290, 326645, 337464, 387539, 369972, 282216, 245949, 296493, 305974, 320270, 322366, 316351, 303824, 310464, 279263, 224645, 216054, 224809, 207039, 170075, 134598, 109986, 133091, 98776, 108062, 226628, 330854, 327373, 307430, 249271, 197888, 194148, 209760, 182728, 164747, 148447, 214337, 187755, 186673, 150418, 103458, 73510, 73094, 33981, 12527, 36563, 105311, 121034, 99320, 81555, 70291, 21409, 5857, 75409, 72902, 118123, 113836, 53006, 17595, 38897, 50398, 63508, 58850, 63356, 70849, 58930, 59154, 86517, 39959, -17788, 18363, -31444, -27931, -13011, -25406, -20267, -5626, 39803, 76023, 105747, 81321, 44102, 43008, 30523, -10322, -15014, -8379, 2367, 57342, 26719, -5164, -7209, 34269, 59522, 33312]
10387C3312m9421k1468J9989q950J9578J5644M8509k2138j4557l5913m8425j9242
10375h3082J2598O8797O336R396K891M310m1033k0193K9219k7712p9046R211N240
10362a03068k4237M2604k346l2743j9944M77J3216O1183O5836M828n4251m4474
10350i2919L0318P3572L4875K9409o8258j7324J473k7837L1236J5854l1763l8300
10338e9664O88N5273k0028o541O6154k1134k3928o1415j3648j9298m7206k2915
10326a73662R544j343M4478L6746o393M8362L4339l7363q817n802L5237K254l6481
10313e8901K5272P2208P142k4271l4275o5768n3819n707p850L6156L1459L0187
10301d8167L0640o275l5669M6640n4751l837l473J5036j3081n2248n4128L2043
$$ y = [33312, -16109, -37577, -17588, -26538, -6960, 8684, 57193, 35055, 20498, -15415, -63840, -83082, -70484, -1687, 4649, 14045, 16936, 21246, -19787, -39980, -10761, -38473, -117519, -108308, -103068, -127305, -84701, -87047, -119790, -139734, -139257, -126041, -64858, 978, 5806, -48445, -92919, -62601, 10971, 45846, 75255, 6997, -10327, -8854, -36691, -5455, 10399, -21364, -59664, -58976, -3703, -23731, -30272, 35882, 14748, -9180, -70595, -84243, -103541, -150747, -173662, -164118, -165461, -120983, -84237, -90630, -42268, -7929, -45292, -54109, -59911, -24674, -22420, -58901, -33629, 38579, 45721, 21450, -12825, -78593, -132412, -138119, -145969, -109813, -78354, -48167, -17527, -23802, -59471, -12831, -67582, -71419, -74892, -59856, -72937, -125185, -179313, -147270]
10289a47270L7423J0687k498k076j7630K1701K9010J418L3873K965l1914j097
10277f5408L7741R1423m6000r5402p774k8658j350J6725L7333J3963M673p560
10265e0294J5379J2758m6752k1573m3150q823J8430O5817K7108k3525K0585p305
10253d1345o2663K0376j1284N939P5091j3800m8368k3639j834K5332k26k5842
10241a02263J4858p113j3724J1149N8338J6406J4644L751l2580J2327K1899O7513
10229F5205K3923q5399k3580k2625l9335l8158n623N0859N625M9150k6713J1041
10217c5630k2327m5331m1903J3257K2489l0392j2436L6774L83j2106j7323L6294
10205a08251J5883K1008k323L0784J4077j7037k2670j1183j42J0366N5458M2106
$$ y = [-147270, -109847, -99160, -101658, -103734, -121364, -99663, -70653, -69235, -35362, -32397, -64311, -65408, -27667, 63756, 17756, -77646, -85420, -114078, -115428, -98703, -61370, -47407, -42734, -50294, -34915, -22157, -68909, -90482, -133632, -142455, -124025, -58208, -31100, -54625, -34040, -41345, -104008, -83632, -94916, -88977, -13886, -27686, -76054, -99693, -101527, -76195, -76421, -102263, -87405, -94518, -108242, -97093, -38755, -22349, -7705, -3954, -36534, -24207, -2308, 65205, 89128, 3729, -19851, -42476, -81811, -119969, -125592, -74733, -69108, -19958, -46671, -35630, -57957, -103288, -145191, -131934, -109445, -139837, -152273, -115499, -115116, -127222, -144545, -108251, -92368, -71360, -73683, -42899, -28822, -45859, -68529, -79712, -79854, -69488, -14030, 28076]
10193B8076q8106n0758O8228Q5872K475j5583p927J6046L4249n449k9939J476
10181C8660m42L550k3603M1429M2751K292j2674k2417L0378o661j7438j668j990
10168G2167J263O2472K8684j4041J3362K4320k4582l3999j217J7046N6213M6500
10156B48188K9683K4818j0660p8955m9065N2143J0749k5351p722k2115j2268J4301
10144A73746M400k9509l2481k3994L2993J5121j0404n8530n7865j6108p953K689
10132g895M7452P4155j9215m7553p4296k0421k2537k1839j2383l7799j4383K3596
10120a33118L5932K239l5663k4752L9507P2519j0487m2674k9133J1391R8141L9695
10108B3597J837m6818m5314n694J9944N5170m5843n2251J4001K9972j0597L3355
$$ y = [28076, -60030, -110788, -42560, 43312, 45787, 30204, 22277, 38323, 72572, 67123, 37184, 38660, 38218, 41768, 18165, 59594, 102345, 104637, 91963, 69546, 99924, 93263, 75825, 74157, 72167, 73430, 135902, 164586, 150545, 163907, 188227, 163645, 129646, 128429, 145475, 201688, 248188, 277871, 302689, 292029, 213074, 164009, 216152, 226901, 201550, 193828, 171713, 159445, 173746, 178146, 148637, 116156, 92162, 125155, 140276, 129872, 71342, 13477, -2631, -10584, -7895, 39557, 113712, 94497, 46944, -27352, -47773, -70310, -92149, -104532, -142331, -156714, -133118, -97186, -94947, -130610, -155362, -115855, -43336, -53823, -96497, -125630, -114239, -16098, 23597, 25434, -21384, -66698, -72392, -52448, 2722, -43121, -95372, -81371, -51399, -61996, -28641]
10096b8641j5578R054J0988J9488M2587l8008o3817o6405L210J3104M7101K7049
10084c9868l1456p2128L0404R2378L3624j2617l7313o2549o548N1409n607n262
10072f5533l262j6217J1236r532j587Q726l426K2729r3095j2249N0435J16221
10060D446L8167m3809l6800n0031l819J4320o0452p0446O7273R5564J6473k8569
10048e7683j8198k4256L0808M9062K6551j4593n3744k6776K2609r696l353M9467
10036b9802J5584p5762k8101j6359j0961K0375J9171j3484o6078j4128L3044Q3234
10024h3267O3490O2569p811n5486m3193k0800j4192m7654J7464M5317j4465k5059
10012a23087K4215O132K9669n5689k8115P092l506L789R779M1390P5598R341k2538
$$ y = [-28641, -44219, -35165, -24177, -4689, 37898, -110, -63927, -130332, -127122, -114018, -66917, -39868, -71324, -143452, -113048, -20670, 12954, 337, -36976, -99525, -106073, -54664, -60271, -65533, -68795, -85012, -73776, -83308, -84895, -76169, -79595, -56866, -149961, -162210, -111775, 4446, 42613, -1196, -37996, -88027, -91846, -77526, -137978, -208424, -141151, -45587, -29114, -57683, -75881, -100137, -69329, -20267, 6284, -8309, -62053, -88829, -66220, -75916, -79269, -29802, -14218, -89980, -118081, -134440, -145401, -125026, -105855, -119339, -185417, -199545, -166501, -83267, -19777, 42792, 34981, -20505, -63698, -84498, -98690, -146344, -128880, -83563, -98028, -123087, -98872, -92740, -63071, -118760, -146875, -139783, -143289, -139500, -129721, -88331, -12733, -3392, -25930]
9999b5930L776j3999l9826k8732j9539N0033o513l1156J681J1900M6860l308j7057
9986g1810j1598k3687K40n0286J7285j3962K1590M0011k4258J5243j4533L2001
9974h3764J8547o610P994K0635j6623j6138K2668n1520j9364J7672J7655R0015
9962A167m0787j2208L7708j4370n4656l3164J1976K5392J2697L2370L0588j1574
9950a4861n6934m5403O591P604j6191P801j2336m348n775K0449K3912l3891Q856
9937a14526M1841j075l4881j9686O0917N7551N745M1047K9901l736j9569l3625
9925I904n2349K3605K2442P9238L441n3668J6049k910n0635j3041o530j312m6803
9912g2569j2340j2601J1478k1801n5776j1028m3766R990L6164N2059M8753r1080
$$ y = [-25930, -22154, -36153, -75979, -104711, -124250, -74217, -80730, -111886, -110205, -98305, -51445, -54753, -71810, -83408, -107095, -106855, -157141, -139856, -153818, -132228, -92217, -116475, -101232, -115765, -83764, -65217, -71827, -63833, -43198, -59821, -75959, -53291, -104811, -124175, -106503, -88848, 1167, -39620, -51828, -14120, -28490, -83146, -116310, -104334, -78942, -66245, -33875, -3287, -14861, -71795, -117198, -110607, -103003, -119194, -111393, -123729, -128077, -133852, -113403, -89491, -123382, -114526, -72685, -73760, -108641, -128327, -67410, -9859, -4114, 36933, 66834, 63098, 43529, 9904, -42445, -18840, 3602, 82840, 86281, 32613, 48662, 45752, -4883, -17924, -24454, -25766, -72569, -84909, -97510, -86032, -107833, -163609, -174637, -218403, -208413, -172249, -120190, -71437, -162517]
9900a62517j4414k235M2039K9159k9928O4216L5021l7675j5347k1963K8785K6025
9888e8834K275J0339m8872k2829k3719J8434N0327K8216J9418p154K691p5676
9876a05384M4102o002m2449j9568P31p9682J6700L6232j170R897J5550K9158K1699
9863h0186k1748N3467n836l6514q7341L1020J6449K6022K2098j5947j725l4501
9851a34742j0562L8782L5722j2667J1654j9603J2997k923r2870o0171j6741P7365
9839a73759Q9108k9362k8426k3919L3544K5114J6624j2872j9705M1925P437k5947
9827a00238l1641O146J9802J9812J139k1626K5859M2786k7456j5234M7263j2835
9815d6223K8484r094k3095l028j6544K5254Q481k7968P457j7425p1428k1364K1578
$$ y = [-162517, -176931, -179166, -137127, -107968, -137896, -73680, -38659, -76334, -91681, -113644, -84859, -58834, -56559, -46220, -95092, -117921, -141640, -123206, -72879, -44663, -25245, -32399, -29708, -105384, -61282, -67284, -109733, -129301, -128570, -208252, -191552, -155320, -156490, -146593, -131043, -101885, -80186, -101934, -48467, -54303, -90817, -178158, -147138, -130689, -104667, -82569, -98516, -100241, -134742, -145304, -106522, -70800, -83467, -71813, -91416, -78419, -81342, -174212, -234383, -251124, -173759, -84651, -114013, -142439, -166358, -132814, -107700, -91076, -103948, -123653, -81728, -74291, -100238, -131879, -125733, -105931, -86119, -84980, -106606, -80747, -37961, -65417, -80651, -33388, -46223, -17739, -26833, -49928, -52956, -69500, -44246, -35765, -63733, -56276, -73701, -145129, -166493, -144915]
9802a44915O429j446O0134M0042J3317J659o0061m0248k4216l0001N6598N1924
9790g0784r407n2718K7117N444K5334o12n0961o4134j4642Q617L5296M9711N3246
9777e8493P6143L754n1841k2834J6793j4376j8485K487k3770k3034p436k4108
9765a45200J0322J8199K3549O0380j0970L011o819j9656Q897l5614k9053O507
9753a16447M0709K4160l5665k6287K4005l8406P721M1324j2872J785q504l1936
9741a30413l0892M0584L8507l98k7886m5827q664O7389N4581P286k8905l1956
9729i6594M9229J9008n4920L5322n2284l0781R66j2130L24J9610J6277K8681J1945
9716f5347l160m4613J6895J2683M7443J7397l5699j3037M827J8707o9o26N832
$$ y = [-144915, -138486, -139932, -79798, -39756, -26439, -24780, -84841, -125089, -149305, -179306, -122708, -70784, -80191, -132909, -105792, -100348, -75014, -75626, -126587, -190721, -205363, -196746, -161450, -111739, -58493, 17650, 21404, -30437, -53271, -36478, -50854, -69339, -66852, -90622, -113656, -121092, -145200, -134878, -116679, -93130, -32750, -43720, -40709, -47528, -67184, -58287, -93901, -122954, -116447, -75738, -51578, -87243, -113530, -89525, -127931, -120210, -78886, -91758, -89973, -98477, -130413, -161305, -120721, -82214, -82612, -110498, -156325, -164989, -97600, -43019, -35733, -64638, -96594, -47365, -28357, -83277, -47955, -100239, -131020, -130054, -142184, -141860, -122250, -105973, -77292, -65347, -68507, -113120, -96225, -83542, -36099, -18702, -54401, -67438, -62611, -43904, -43973, -44599, -38767]
9703c8767p808O6j2734K0331K5511k1218j8777o3455M950N3753n4766q2232m192
9690a99338Q5037J5344J7364j6305k6149m3920n926K0347M0529k8217J3599l2890
9678a60525L0626J9505O0677J4163m0402l1498J3981L8485mj6850o2035J2564
9666a21313O2345K1288K1564m347K2510k9707K153j4581k2928n0119L7496K1968
9654e3671l0262p6080J6727J18148J8603n606J9704k6320l1627l5205r97k3157
9642a09743l5829Q882j9395k825K6051K734k9637N6513K9517k2576k8426j8995
9630a43729k3106n887J4834M1487N0649K3266J5248j1123k5486J3105p173k5817
9618h3732J3905j1603J469J9935j7809n3193j3225O3619M0895k6289k708p684
$$ y = [-38767, -46575, -46509, -59243, -38912, -13401, -34619, -53396, -116851, -111901, -58148, -112914, -195146, -199338, -114301, -98957, -81593, -97898, -124047, -167967, -173893, -153546, -113017, -141234, -127635, -160525, -129899, -110394, -49717, -35554, -75956, -107454, -93473, -54988, -54992, -71842, -133877, -121313, -58968, -37680, -16116, -20463, 2047, -27660, -25507, -40088, -63016, -113135, -75639, -53671, -83933, -160013, -143286, -25138, -6535, -12141, 7563, -18757, -50384, -85589, -86586, -109743, -145572, -136690, -156085, -158910, -132859, -130125, -159762, -103249, -73732, -96308, -124734, -143729, -166835, -172722, -157888, -116401, -65752, -42486, -27238, -38361, -63847, -50742, -57915, -83732, -69827, -81430, -79961, -60026, -77835, -131028, -144253, -80634, -39739, -66028, -68736, -76420]
9606g6420q518K5679J9031j1066l0019j6324l607M264p527j7047n276L0236K816
9593i3778k3937l0427l0162k9904K7016N1044M5221N4759K6682j6397j8168m7496
9581h5547k4301k0767M4619L892j5344K6192l9705K319M346L5267j4948m9441
9569a33418j9072m047J7659O8061K1060l2898n7438l0234J7933K4386M7241K3240
9557e7527L5069J3455j5479j44164n4923M6268L8948M1195K4272j5688j2275J801
9545i9048l0715k5955n4945k9281J3486O8550L9847J7226M2018L6416J73J2485
9533i743k6921n454o6159K982K413k7444l421l514p3Q56L6239Q101k2850m3426
9519a58414j1908L1869M7249J1353l7640j8915K2121q64l8579k372K5444L8440
$$ y = [-76420, -84938, -59259, -40228, -51294, -81313, -97637, -101244, -96980, -104507, -121554, -126830, -96594, -93778, -117715, -148142, -178304, -208208, -181192, -130148, -84927, -30168, -3486, -19883, -38051, -85547, -109848, -130615, -85996, -82104, -97448, -71256, -110961, -108642, -104296, -69029, -83977, -133418, -152490, -156537, -138878, -70817, -49757, -82655, -140093, -170327, -152394, -128008, -80767, -57527, -22458, -9003, -24482, -168646, -223569, -177301, -138353, -97158, -72886, -88574, -100849, -99048, -129763, -155718, -210663, -239944, -226458, -157908, -118061, -100835, -58817, -22401, -22228, -9743, -36664, -42118, -108277, -105295, -102882, -130326, -133747, -137261, -137334, -136478, -100239, -92138, -114988, -158414, -170322, -138453, -91204, -79851, -117491, -136406, -114285, -115149, -153728, -156100, -130656, -92216]
9507i2216K2442n692j11679l391Q848j5320N9884K8858L7094O211j2735R908l6379
9494a04167l5869M8074Q174l0769n7687J4374o287l9850P665Q2676p144m2374
9482a63184j9996O5O3828P4217J8096n5338r999N274L2321j7369M975L0727J9609
9469a6774K2406j5980l7393j4251K5884J2707K94p1687j12537K012P7060N1919
9457g6340K7318P893j2125k35l9567J0216q538O3147l9080m1761o843J3102k7974
9444a30787j2412k732K7790K8801J8662O982n3250L9712j9603q2101K1199J6546
9432a41193k1725k6078K1735L7621K1087j5988j9400M6439k825n4381j6105M6515
9420a24298k9777k6064P0017N169o1068J7217k667o5512j3363K6152M0749L2957
$$ y = [-92216, -69774, -75466, -187145, -190536, -181688, -197008, -137124, -108266, -71172, -64961, -77696, -67788, -104167, -140036, -91962, -83788, -114557, -172244, -157870, -164157, -204007, -196342, -113666, -120810, -163184, -183180, -183115, -119287, -45070, -26974, -82312, -92311, -87037, -54716, -72085, -67110, -36383, -16774, 5632, -10348, -47741, -61992, -36108, -23401, -23107, -94794, -207331, -205319, -128259, -76340, -49022, -41129, -53254, -53489, -93056, -82840, -91378, -28231, -67311, -109072, -115915, -102813, -130787, -143199, -145931, -118141, -89340, -70678, -63696, -116946, -77234, -96837, -178938, -157739, -141193, -162918, -188996, -167261, -129640, -108553, -124541, -143941, -97502, -100327, -154708, -170813, -124298, -154075, -180139, -110122, -104953, -166021, -148804, -151471, -216983, -230346, -204194, -163445, -130488]
9408a30488K951K4224J9529K7245J2362k3115K2J4130k2858Q991P043k4653m5461
9395a30078m5424M1348J9543J6120r552j4102j505K726L6828L2569q630l0566
9383i0723N3060K5751k1385K1267Q02j7082p756L075n2129n6434m0509K0196P739
9370a54128M1028J8249k1687k6611m6170L1385M5774j7819p426J5637K53J8228
9358a03287k5666K5964J7910N547l2133L4445k1336r227k3356J37M0480L125j9041
$$ y = [-130488, -127537, -103313, -83784, -56539, -44177, -67292, -67270, -53140, -75998, -67007, -59964, -84617, -130078, -175502, -134154, -114611, -98491, -108043, -122145, -123650, -120924, -84096, -51527, -60157, -90723, -37663, -11912, -33297, -12030, -11228, -28310, -36066, -32991, -85120, -141554, -182063, -161867, -154128, -113100, -94851, -116538, -143149, -189319, -157934, -112160, -129979, -137405, -121768, -121515, -103287, -128953, -102989, -85079, -79532, -111665, -77220, -98556, -107783, -131139, -131002, -90522, -87397, -106438]
$$ [...]
##END NTUPLES=NMR SPECTRUM
##END=
