##TITLE=Analysis number 322661
Compound Code mo 07016
Project Code adrs
Chemist Name spectrum
##JCAMPDX= 6.0         $$ Bruker NMR JCAMP-DX V2.0
##DATA TYPE= NMR SPECTRUM
##DATA CLASS= NTUPLES
##ORIGIN= Bruker BioSpin GmbH
##OWNER= nmr
$$ XWIN-NMR		Version 3.5
$$ Fri Oct 13 09:34:13 2006 GMT Daylight Time (UT+1h)  MAYBRIDGE\nmr@NMR_250MHZ
##.OBSERVE FREQUENCY= 250.131544655141
##.OBSERVE NUCLEUS= ^1H
##.ACQUISITION MODE= SIMULTANEOUS (DQD)
##.ACQUISITION SCHEME= undefined
##.AVERAGES= 16
##.DIGITISER RES= 18
##SPECTROMETER/DATA SYSTEM= dpx250
##.PULSE SEQUENCE= zg30
##.SOLVENT NAME= CDCl3
##.SHIFT REFERENCE= (INTERNAL, CDCl3, 0, 16.522)
##AUDIT TRAIL= $$ (NUMBER, WHEN, WHO, WHERE, WHAT)
$$ ##TITLE= Audit trail, XWIN-NMR		Version 3.5
$$ ##JCAMPDX= 5.01
$$ ##ORIGIN= Bruker BioSpin GmbH
$$ ##OWNER= nmr
$$ C:\u/data/dgb/nmr/ADRS/150/pdata/1/auditp.txt
$$ ##AUDIT TRAIL=  $$ (NUMBER, WHEN, WHO, WHERE, WHAT)
(   1,<2006-10-13 09:33:53.35 +100>,<MAYBRIDGE\nmr>,<NMR_250MHZ>,
      <created by zg, POWCHK disabled, PULCHK disabled
       configuration hash MD5:
       49 4B E0 1D 92 C2 6B 37 9F E6 65 BC 52 41 86 1D
       data hash MD5: 64K
       5B 59 25 D5 7B 3D BC 2C 52 78 92 52 FB 0C CB 17>)
(   2,<2006-10-13 09:34:06.02 +100>,<MAYBRIDGE\nmr>,<NMR_250MHZ>,
      <Start of raw data processing
       ef LB = 0.3 FT_mod = 6 PKNL = 1 SI = 32K 
       data hash MD5: 32K
       BA 55 66 7D DC 2A 21 18 A7 A5 5A 8D 3B B3 8F F6>)
(   3,<2006-10-13 09:34:07.62 +100>,<MAYBRIDGE\nmr>,<NMR_250MHZ>,
      <apk 
       data hash MD5: 32K
       8C 49 C3 7B 93 3F CD 72 4F A9 CE 7A A1 8E 8A CA>)
(   4,<2006-10-13 09:34:08.40 +100>,<MAYBRIDGE\nmr>,<NMR_250MHZ>,
      <abs ABSG = 5 
       data hash MD5: 32K
       25 65 C9 D0 B2 9C 9D 5D 21 DB 9B 15 5C 95 A9 1A>)
$$ ##END=
$$ 
$$ hash MD5
$$ 99 2A 3E DA 75 49 8C E8 11 CB E9 A6 1E 03 9C 87
##$RELAX= 
##$RELAX= 
##$RELAX= 
##$RELAX= 
##$RELAX= 
##$RELAX= 
##$RELAX= 
$$ Bruker specific parameters
$$ --------------------------
##$DU= <C:\u>
##$EXPNO= 150
##$NAME= <ADRS>
##$PROCNO= 1
##$TYPE= <nmr>
##$USER= <dgb>
##$AMP= (0..31)
100 100 100 100 100 100 100 100 100 100 100 100 100 100 100 100 100 100 
100 100 100 100 100 100 100 100 100 100 100 100 100 100 
##$AQSEQ= 0
##$AQ_mod= 3
##$AUNM= <au_zg>
##$AUTOPOS= <11 >
##$BF1= 250.13
##$BF2= 250.13
##$BF3= 250.13
##$BF4= 250.13
##$BF5= 500.13
##$BF6= 500.13
##$BF7= 500.13
##$BF8= 500.13
##$BYTORDA= 1
##$CFDGTYP= 0
##$CFRGTYP= 5
##$CHEMSTR= <none>
##$CNST= (0..31)
1 1 145 1 1 1 1 1 1 1 1 1 1 1 1 1 1 1 1 1 1 1 1 1 1 1 1 1 1 1 1 1 
##$CPDPRG= <>
##$CPDPRG1= <>
##$CPDPRG2= <>
##$CPDPRG3= <>
##$CPDPRG4= <mlev>
##$CPDPRG5= <mlev>
##$CPDPRG6= <mlev>
##$CPDPRG7= <mlev>
##$CPDPRG8= <mlev>
##$CPDPRGB= <>
##$CPDPRGT= <>
##$D= (0..31)
0 1 0 0 0 0 0 0 0 0.06 0 0 0 0 0 0 0.0002 0 0 0 0 0 0 0 0 0 0 0 0 0 0 
0 
##$DATE= 1160728432
##$DBL= (0..7)
120 120 120 120 120 120 120 120 
##$DBP= (0..7)
150 150 150 150 150 150 150 150 
##$DBP07= 0
##$DBPNAM0= <>
##$DBPNAM1= <>
##$DBPNAM2= <>
$$ [...]
##$SUBNAM7= <"">
##$SUBNAM8= <"">
##$SUBNAM9= <"">
##$SW= 20.6930455092707
##$SWIBOX= (0..15)
0 0 3 0 0 0 0 0 0 0 0 0 0 0 0 0 
##$SW_h= 5175.983436853
##$TD= 65536
##$TD0= 1
##$TE= 683.16
##$TE2= 300
##$TE3= 300
##$TEG= 300
##$TL= (0..7)
0 120 120 120 120 120 120 120 
##$TP= (0..7)
150 150 150 150 150 150 150 150 
##$TP07= 0
##$TPNAME0= <>
##$TPNAME1= <>
##$TPNAME2= <>
##$TPNAME3= <>
##$TPNAME4= <>
##$TPNAME5= <>
##$TPNAME6= <>
##$TPNAME7= <>
##$TPOAL= (0..7)
0.5 0.5 0.5 0.5 0.5 0.5 0.5 0.5 
##$TPOFFS= (0..7)
0 0 0 0 0 0 0 0 
##$TUNHIN= 0
##$TUNHOUT= 0
##$TUNXOUT= 0
##$USERA1= <user>
##$USERA2= <user>
##$USERA3= <user>
##$USERA4= <user>
##$USERA5= <user>
##$V9= 5
##$VALIST= <valist>
##$VCLIST= <CCCCCCCCCCCCCCC>
##$VD= 0
##$VDLIST= <DDDDDDDDDDDDDDD>
##$VPLIST= <PPPPPPPPPPPPPPP>
##$VTLIST= <TTTTTTTTTTTTTTT>
##$WBST= 1024
##$WBSW= 4
##$XGAIN= (0..3)
0 0 0 0 
##$XL= 0
##$YL= 0
##$YMAX_a= 519691
##$YMIN_a= -290114
##$ZGOPTNS= <>
##$ZL1= 120
##$ZL2= 120
##$ZL3= 120
##$ZL4= 120
##$ABSF1= 16.522
##$ABSF2= -4.171173
##$ABSG= 5
##$ABSL= 3
##$ALPHA= 0
##$AQORDER= 0
##$ASSFAC= 0
##$ASSFACI= 0
##$ASSFACX= 0
##$ASSWID= 0
##$AUNMP= <proc_1d>
##$AZFE= 0.1
##$AZFW= 0.1
##$BCFW= 0
##$BC_mod= 0
##$BYTORDP= 0
##$COROFFS= 0
##$CY= 12.5
##$DATMOD= 1
##$DC= 0
##$DFILT= <>
##$DTYPP= 0
##$F1P= 14.0000005364418
##$F2P= -0.99999901652339
##$FCOR= 0.5
##$FTSIZE= 32768
##$FT_mod= 6
##$GAMMA= 0
##$GB= 0
##$INTBC= 1
##$INTSCL= 1
##$ISEN= 128
##$LB= 0.3
##$LEV0= 0
##$LPBIN= 0
##$MAXI= 10000
##$MC2= 0
##$MEAN= 0
##$ME_mod= 0
##$MI= 0
##$NCOEF= 0
##$NC_proc= -3
##$NLEV= 6
##$NOISF1= 0
##$NOISF2= 0
##$NSP= 0
##$NTH_PI= 0
##$NZP= 0
##$OFFSET= 16.522
##$PC= 1
##$PHC0= -44.11053
##$PHC1= 6.39685
##$PH_mod= 1
##$PKNL= yes
##$PPARMOD= 0
##$PSCAL= 4
##$PSIGN= 0
##$REVERSE= no
##$SF= 250.13
##$SI= 32768
##$SIGF1= 0
##$SIGF2= 0
##$SINO= 400
##$SIOLD= 32768
##$SREGLST= <1H.CDCl3>
##$SSB= 0
##$STSI= 32768
##$STSR= 0
##$SW_p= 5175.98343685301
##$SYMM= 0
##$S_DEV= 0
##$TDeff= 65536
##$TDoff= 0
##$TI= <Analysis number 999999
Compound Code 99
Book Reference 9
Project Code 9>
##$TILT= no
##$TM1= 0
##$TM2= 0
##$TOPLEV= 0
##$USERP1= <user>
##$USERP2= <user>
##$USERP3= <user>
##$USERP4= <user>
##$USERP5= <user>
##$WDW= 1
##$XDIM= 32768
##$YMAX_p= 259247559
##$YMIN_p= -307094
$$ End of Bruker specific parameters
$$ ---------------------------------
##NTUPLES= NMR SPECTRUM
##VAR_NAME=  FREQUENCY,     SPECTRUM/REAL,   SPECTRUM/IMAG
##SYMBOL=    X,             R,               I
##VAR_TYPE=  INDEPENDENT,   DEPENDENT,       DEPENDENT
##VAR_FORM=  AFFN,          ASDF,            ASDF
##VAR_DIM=   32768,         32768,           32768
##UNITS=     HZ,            ARBITRARY UNITS, ARBITRARY UNITS
##FACTOR=    0.157963299565203, 1,           1
##FIRST=     4132.6476996994, 0,             0
##LAST=      -1043.33573715361, 0,           0
##MIN=       -1043.33573715361, -307094,     0
##MAX=       4132.6476996994, 259247559,     0
$$ Real data points
##PAGE= N=1
##DATA TABLE= (X++(R..R)), XYDATA
$$ [...]
$$ plain form
18467 214063 197862 201975 216927 226741 221643 200818 176283 137258 98838 100333 104408 118449
18455 118449 146782 173626 184406 182459 183453 171213 179803 203272 214432 206305 203125 167590 147545
18442 147545 181942 238613 238388 210365 166540 167950 139524 149554 222255 257484 259529 208763
18430 208763 237564 225014 236512 295072 363490 370234 310208 328194 388720 406082 406966 431686
18418 431686 486650 511934 443907 386179 340182 328424 267983 245036 216872 180645 140117
18407 140117 82771 124606 129468 87779 110974 116777 148703 139011 145087 100922 105374 74659
18395 74659 22117 19317 118046 148972 152429 168845 136686 156266 152978 186926 177629 95931
18383 95931 46993 131567 200502 199430 218640 229325 288571 321548 344095 306562 318751 361719
$$ packed form
18467B14063j6201M113J4952R814n098k0825k4535l9025l8420J495M075J4041
18455A18449K8333K6844J0780j947R94j2240Q590K3469J1160q127l180l5535k0045
18442A47545L4397N6671k25k8023m3825J410k8426J0030P2701L5229K045n0766
18430B08763K8801j2550J1498N8560O8418O744o0026J7986O0526J7362Q84K4720
18418D31686N4964K5284o8027n7728m5997j1758o0441k2947k8164l6227m0528
18407A40117n7346M1835M862m1689K3195N803L1926r692O076m4165M452l0715
18395G4659n2542k800R8729L0926L457J6416l2159J9580l288L3948r297q1698
18383I5931m8938Q4574O8935j072J9210J0685N9246L2977K2547l7533J2189M2968
$$ plain form
18371 361719 353959 361469 374826 352537 375313 309892 280518 282635 274681 273543 244659 221144
18359 221144 210103 229688 195828 157543 203635 224874 197249 186965 174302 109710 73752
18348 73752 41501 62573 35012 63183 60382 11428 43998 99410 92444 105343 72573 97561
18336 97561 99061 31669 -32276 -57865 -52955 -14006 77550 165776 205500 167407 148135 160350
18324 160350 165058 189231 196350 124019 136040 241276 261771 240009 294222 248218 180268 98106
18312 98106 123319 110341 85387 144790 232288 298609 318857 378457 368725 266535 258520 260283
18300 260283 322022 351430 406904 516749 532008 466336 479139 509480 563111 648621 736241
18289 736241 803267 904363 973831 968407 967580 958079 944094 977753 1049397 1099100 1228213 1439284
$$ packed form
18371C61719p760P510J3357k2289K2776o5421k9374K117p954j138k8884k3515
18359B21144j1041J9585l3860l8285M6092K1239k7625j0284j2663o4592l5958
18348G3752l2251K1072k7561K8171k801m8954L2570N5412o966J2899l2770K4988
18336I7561J500o7392o3945k5589M910L8949R1556Q8226L9724l8093j9272J2215
18324A60350M708K4173P119p2331J2021J05236K0495k1762N4213m6004o7950q2162
18312I8106K5213j2978k4954N9403Q7498O6321K0248N9600r732j02190q015J763
18300B60283O1739K9408N5474J09845J5259o5672J2803L0341N3631Q5510Q7620
18289G36241O7026J01096O9468n424q27r501j3985L3659P1644M9703J29113K11071
$$ plain form
18277 1439284 1793434 2377373 2925876 3180164 3243390 3341755 3501135 3666485 3387375 2350022
18267 2350022 1545710 1150196 934401 758080 622729 518479 463394 449764 489777 444009
18257 444009 349906 287796 273392 259212 249950 292297 260407 266320 251831 204859 227453 230772
18245 230772 195030 244081 288761 258991 257390 277618 251186 162310 139253 190305 255248 274037
18233 274037 300931 278988 260501 302132 353458 321174 287912 322075 357521 339709 328072
18222 328072 276396 196305 148263 98935 127247 146676 150071 211559 257394 257003 267188 288233
18210 288233 271862 257015 245224 230249 220329 237855 199216 171798 135110 179623 140186 46210
18198 46210 120684 175576 232693 261604 295149 294425 274860 310159 314098 321594 330414 292756 284535
$$ packed form
18277A439284L54150N83939N48503K54288O3226R8365J59380J65350k79110j037353
18267B350022q04312l95514k15795j76321j35351j04250n5085j3630M0013m5768
18257D44009r4103o2110j4404j4180r262M2347l1890N913j4489m6972K2594L319
18245B30772l5742M9051M4680k9770j601K0228k6432q8876k3057N1052O4943J8789
18233B74037K6894k1943j8487M1631N1326l2284l3262L4163L5446j7812j1637
18222C28072n1676q0091m8042m9328K8312J9429L395O1488M5835l91J0185K1045
18210B88233j6371j4847j1791j4975r920J7526l8639k7418l6688M4513l9437r3976
18198D6210P4474N4892N7117K8911L3545p24j9565L5299L939P496Q820l7658q221
$$ plain form
18185 284535 267982 272908 208244 205931 181991 198982 270698 276277 251067 257812 290989 358104
18173 358104 316200 300094 339845 378789 364160 353551 400876 438444 442003 456419 496269 519369
18161 519369 552396 563394 578371 588051 560129 594316 703279 804533 871575 935996 1030714
18150 1030714 1087923 1112002 1073532 1111596 1264367 1394256 1434805 1483709 1579177 1798789 1947979
18139 1947979 2031691 2101324 2201136 2343876 2491615 2643746 2860548 3139802 3508518 3964852
18129 3964852 4495156 5166056 6051235 6811704 7518897 8069143 8453487 8638803 8614013 8707540
18119 8707540 8763315 9021874 9517866 10362466 12113430 15427959 20597945 27082586 33058176
18110 33058176 36136390 36911914 37994380 40343607 42120889 36216639 22883755 13395973
$$ packed form
18185B84535j6553M926o4664k313k3940J6991P1716N579k5210O745L3177O7115
18173C58104m1904j6106L9751L8944j4629j0609M7325L7568L559J4416L9850K3100
18161E19369L3027J0998J4977R680k7922L4187J08963J01254O7042O4421R4718
18150A030714N7209K4079l8470L8064J52771J29889M0549M8904R5468K19612J49190
18139A947979Q3712O9633R9812J42740J47739J52131K16802K79254L68716M56334
18129C964852N30304O70900Q85179P60469P07193N50246L84344J85316k4790R3527
18119H707540N5775K58559M95992Q44600J750964L314529N169986O484641N975590
18110C3058176L078214P75524J082466K349227J777282n904250j3332884r487782
$$ plain form
18102 13395973 8902964 6634975 5293711 4401440 3761936 3348070 3023828 2784626 2510263
18093 2510263 2286015 2097031 1900374 1755055 1581702 1431068 1318923 1230250 1174466 1190783
18083 1190783 1183194 1155448 1060871 1029529 1027640 1011295 922045 878372 933684 887255 791734 738882
18071 738882 744114 703820 631759 666148 648236 591846 578308 540802 540952 516566 460801 425547
18059 425547 340285 385086 448175 440769 448550 509534 524216 537171 486182 416071 406745 370006
18047 370006 347337 288588 229403 236261 253105 247901 227278 196997 214555 239885 296277 306584
18035 306584 294504 275482 275869 244585 202683 206625 239101 242354 282126 338004 310309 301531
18023 301531 316358 355865 331799 338422 311741 264932 237955 240273 283384 359195 329189 258448
$$ packed form
18102A3395973m493009k267989j341264q92271o39504m13866l24242k39202k74363
18093B510263k24248j88984j96657j45319j73353j50634j12145q8673n5784J6317
18083A190783p589k7746r4577l1342j889j6345q9250m3673N5312m6429r5521n2852
18071G38882N232m0294p2061L4389j7912n6390j3538l7506J50k4386n5765l5254
18059D25547q5262M4801O3089p406P781O0984J4682J2955n0989p0111r326l6739
18047C70006k2669n8749n9185O858J6844n204k0623l0281J7558K5330N6392J0307
18035C06584j2080j9022L87l1284m1902L942L2476L253L9772N5878k7695q778
18023C01531J4827L9507k4066O623k6681m6809k6977K318M3111P5811l0006p0741
$$ plain form
18011 258448 244842 265491 231430 269428 222427 143696 91368 93134 77924 73935 101961 133923
17999 133923 152322 113485 88475 125634 148557 219232 227571 197775 170440 159258 153547 176509
17987 176509 172292 191152 231708 210608 212075 189342 214167 212922 210726 230966 188825 195599
17975 195599 228679 248405 214638 189414 259252 238996 153836 131370 139460 137473 168713 198375
17963 198375 182583 168273 156355 193710 197568 180855 159996 146999 171114 132905 57405 29700
17951 29700 16978 31223 69885 77429 74137 86469 114089 102725 106017 115947 111942 118564 79475
17938 79475 49095 24291 25435 29484 53468 66642 142080 118860 97952 144634 122689 148246
17926 148246 151545 104927 71477 102785 141275 171660 220592 227066 119100 98587 173884 212442
$$ packed form
18011B58448j3606K0649l4061L7998m7001p8731n2328J766j5210l989K8026L1962
17999A33923J8399l8837k5010L7159K2923P0675Q339k9796k7335j1182n711K2962
17987A76509m217J8860M0556k1100J467k2733K4825j245k196K0240m2141O774
17975A95599L3080J9726l3767k5224O9838k0256q5160k2466Q090j987L1240K9662
17963A98375j5792j4310j1918L7355L858j6713k0859j2997K4115l8209p5500k7705
17951B9700j2722J4245L8662P544l292J2332K7620j1364L292R930m005O622l9089
17938G9475l0380k4804J144M049K3984J3174P5438k3220k0908M6682k1945K5557
17926A48246L299m6618l3450L1308L8490L0385M8932O474j07966k0513P5297L8558
$$ plain form
17914 212442 171892 123189 114326 143717 131069 136019 99779 137189 119784 121992 139640 128393
17902 128393 90024 88343 96861 113785 156836 110023 158552 241412 251890 227923 172940 175637
17890 175637 220907 218179 216175 210856 156529 195135 211981 213150 237415 234940 228315 211964 243834
17877 243834 246727 252812 311964 314229 209341 167008 219756 255417 253856 235143 270499 299789
17865 299789 261172 222337 239896 279826 306432 323949 310648 366888 427464 456003 437544
17854 437544 470072 466541 446399 439376 472476 498850 497765 513237 552735 553294 572866 633427
17842 633427 613474 619966 645454 735808 773302 799698 838363 823130 789939 812155 831058 919394
17830 919394 932516 988546 1064182 1099284 1131403 1255742 1341053 1356886 1430804 1565101 1692027
$$ packed form
17914B12442m0550m8703q863K9391j2648M950l6240L7410j7405K208J7648j1247
17902A28393l8369j681Q518J6924M3051m6813M8529Q2860J0478k3967n4983K697
17890A75637M5270k728k004n319n4327L8606J6846J169K4265k475o625j6351L1870
17877B43834K893O085N9152K265j04888m2333N2748L5661j561j8713L5356K9290
17865B99789l8617l8835J7559L9930K6606J7517j3301N6240O0576K8539j8459
17854D37544L2528l531k0142p023L3100K6374j085J5472L9498N59J9572O0561
17842F33427j9953O492K5488R0354L7494K6396L8665j5233l3191K2216J8903Q8336
17830I19394J3122N6030P5636L5102L2119J24339Q5311J5833P3918J34297J26926
$$ plain form
17819 1692027 1835016 1922047 1986708 2109868 2266065 2419825 2576047 2786822 3086093 3428787
17809 3428787 3703685 3922850 4171575 4481509 4769620 5110062 5446413 5771907 6211141
17800 6211141 6814403 7521585 8284415 9273189 10496085 11866176 13139938 14427642 15809103
17791 15809103 17199358 18321524 18997440 19111883 18939228 18820379 18937708 19232322 19825426
17782 19825426 20753579 22409622 25172628 29471053 35653310 43242531 51099964 57818509
17774 57818509 62814933 66720473 69773916 70624131 66568287 57502533 47050852 37958247
17766 37958247 30973734 26255595 23803728 23045282 23176941 23464352 23419945 23227379 22979095
17757 22979095 22384016 20911332 18272073 15357131 13084189 11616506 10825670 10467130
$$ packed form
17819A692027J42989Q7031O4661J23160J56197J53760J56222K10775K99271L42694
17809C428787K74898K19165K48725L09934K88111L40442L36351L25494M39234
17800F211141O03262P07182P62830R88774J222896J370091J273762J287704J381461
17791A5809103J390255J122166O75916J14443j72655j18849J17329K94614N93104
17782A9825426R28153J656043K763006M298425O182257P589221P857433O718545
17774E7818509M996424L905540L053443Q50215m055844r065754j0451681r092605
17766C7958247o984513m718139k451867p58446J31659K87411m4407j92566k48284
17757B2979095n95079j472684k639259k914942k272942j467683p90836l58540
$$ plain form
17749 10467130 10353158 10391372 10590875 10795853 10929760 11147169 11482761 11806740 12123154
17740 12123154 12655485 13438937 14567998 16058833 17985743 20387868 23017254 25428404
17732 25428404 27345356 28749945 29753318 30471532 30636560 29979310 28768299 28089330 28905558
17723 28905558 31533158 35867263 41313022 47313561 52816255 56761762 58531640 58432569
17715 58432569 56808597 53228055 46275535 36108450 26012934 18843368 14519513 11896100
17707 11896100 10223912 9119407 8359111 7881840 7643160 7614107 7698384 7823178 7905739
17698 7905739 7871390 7742498 7614368 7401664 6856587 5839775 4855464 4156715 3640208
17689 3640208 3220251 2929472 2746951 2610614 2465733 2328310 2169706 1997166 1923531 1881026
$$ packed form
17749A0467130j13972L8214J99503K04978J33907K17409L35592L23979L16414
17740A2123154N32331P83452J129061J490835J926910K402125K629386K411150
17732B5428404J916952J404589J003373P18214J65028o57250j211011o78969Q16228
17723B8905558K627600M334105N445759O000539N502694L945507J769878r9071
17715E8432569j623972l580542o952520j0167085j0095516p169566m323855k623413
17707A1896100j672188j104505p60296m77271k38680k9053Q4277J24794Q2561
17698G905739l4349j28892j28130k12704n45077j016812r84311o98749n16507
17689C640208m19957k90779j82521j36337j44881j37423j58604j72540p3635m2505
$$ plain form
17679 1881026 1825611 1747129 1667158 1604378 1560532 1461047 1399551 1391347 1391095 1397871 1367253 1285079
17667 1285079 1209865 1122191 1150556 1126252 1060778 1085992 1040133 998013 999142 971649 933546
17656 933546 924049 909825 878513 797900 755908 744473 748839 745953 751496 741400 724590 750391
17644 750391 767361 742986 720510 728276 716318 666554 613338 584671 555000 521251 530938 548246
17632 548246 561575 515612 535312 536758 544716 543731 494637 366123 416820 461186 484983 481885
17620 481885 389070 397897 397079 408544 429846 430889 312221 281799 302937 303130 321693 372190
17608 372190 398670 405465 387335 339217 295953 249522 289415 274939 229302 246177 247462 217318
17596 217318 195780 212036 219138 211439 216556 200047 161307 180611 123152 184568 238550 143109
$$ packed form
17679A881026n5415p8482p9971o2780m3846r9485o1496q204k52O776l0618q2174
17667A285079p5214q7674K8365k4304o5474K5214m5859m2120J129k7493l8103
17656I33546r497j4224l1312q0613m1992j1435M366k886N543j0096j6810K5801
17644G50391J6970k4375k2476P766j1958m9764n3216k8667k9671l3749R687J7308
17632E48246J3329m5963J9700J446P958r85m9094j28514N0697M4366K3797l098
17620D81885r2815Q827q18J1465K1302J043j18668l0422K1138J93J8563N0497
17608C72190K6480O795j8130m8118m3264m6431L9893j4476m5637J6875J285l0144
17596B17318k1538J6256P102p699N117j6509l8740J9304n7459O1416N3982r5441
$$ plain form
17584 143109 44983 16466 85956 116650 73495 63358 36061 18800 34651 93102 194391
17573 194391 222417 95384 33282 84396 101994 48804 9262 81933 107982 129522 167916
17562 167916 137652 115648 110219 150911 154173 180933 120156 40598 12807 30737 66369 21465
17550 21465 -10498 19350 51749 46842 105745 113724 95182 43173 37582 34247 67965 73878 44167
17537 44167 21854 16321 31014 -10275 -60908 -85414 -78776 -60266 -48223 -86762 -93821 -29893
17525 -29893 -43705 -29001 37879 118034 119915 38233 66784 102964 90620 -1021 -36756 40018
17513 40018 53552 49237 60745 87922 29416 -29736 -18769 8393 63934 26697 -5627 8617
17501 8617 23771 62390 20995 2137 2225 18954 17392 23797 39612 32038 -23804 -29576 -33151
$$ packed form
17584A43109r8126k8517O9490L0694m3155j0137k7297j7261J5851N8451J01289
17573A94391K8026j27033o2102N1114J7598n3190l9542P2671K6049K1540L8394
17562A67916l0264k2004n429M0692L262K6760o0777p9558k7791J7930L5632m4904
17550B1465l1963K9848L2399m907N8903P979j8542n2009n591l335L3718N913k9711
17537D4167k2313n533J4693m1289n0633k4506O638J8510J2043l8539p059O3928
17525b9893j3812J4704O6880Q0155J881q1682K8551L6180j2344r1641l5735P6774
17513D0018J3534m315J1508K7177n8506n9152J0967K7162N5541l7237l2324J4244
17501H617J5154L8619m1395j8858Q8J6729j562O405J5815p574n5842n772l575
$$ plain form
17488 -33151 -4835 -9753 21864 33553 -16340 -31621 -7198 -34817 -82800 -32444 10675 20075
17476 20075 -2023 -3973 -7880 -24513 -36229 4784 23649 -16469 26344 28602 63172 98783
17464 98783 30528 -14666 -9794 28899 -34487 -30037 26319 -13534 -3986 7339 -13005 -3107
17452 -3107 35062 59327 165452 231468 227535 217020 230868 186213 231508 268976 245365 190751
17440 190751 134964 110763 51555 -5543 10421 25963 30722 -313 17930 22467 1003 39961
17428 39961 56058 70032 44780 50943 40851 17316 40511 57071 74875 25744 11496 26357
17416 26357 48769 43745 117075 159745 114160 108455 87551 42812 55094 40886 26974 47152
17404 47152 70189 98766 103975 67666 99393 59843 95341 99446 45200 7369 -12048 -61605
$$ packed form
17488c3151K8316m918L1617J1689m9893j5281K4423k7619m7983N0356M3119R400
17476B0075k2098j950l907j6633j1716M1013J8865m0118M2813K258L4570L5611
17464I8783o8255m5194M872L8693o3386M450N6356l9853R548J1325k0344R898
17452c107L8169K4265J06125O6016l933j0515J3848m4655M5295L7468k3611n4614
17440A90751n5787k4201n9208n7098J5964J5542M759l1035J8243M537k1464L8958
17428C9961J6097J3974k5252O163j0092k3535K3195J6560J7804m9131j4248J4861
17416B6357K2412n024P3330M2670m5585n705k0904m4739J2282j4208j3912K0178
17404D7152K3037K8577N209l6309L1727l9550L5498M105n4246l7831j9417m9557
$$ plain form
17392 -61605 -75438 -32147 -11074 13111 75844 -3002 -4885 73956 47603 1690 43983 108841
17380 108841 120684 103639 -2370 -35983 -3443 31074 71115 11896 -40520 -17924 17198
17369 17198 11964 27112 50159 37158 26062 94653 120103 104278 97301 17494 12305 -4591
17357 -4591 -13345 61104 109677 155734 96060 73971 15387 9785 34609 36756 -14794 -51097
17345 -51097 -19056 -22660 -93910 -88879 -45110 -62119 -61588 34577 54478 -16662 -91482 -26141
17333 -26141 -1369 -22792 -11095 77638 18751 -18775 -32738 26315 31575 26351 63529 91270
17321 91270 -15358 -54279 -45065 -12454 83393 80972 -5331 -41180 -19432 -36243 -277 52849
17309 52849 51385 88689 164613 147174 110068 79185 18565 23007 -17569 18129 55548 25662
$$ packed form
17392f1605j3833M3291K1073K4185O2733p8846j883P8841k6353m5913M2293O4858
17380A08841J1843j7045j06009l3613L2540L4517M0041n9219n2416K2596L5122
17369A7198n234J5148K3047j3001j1096O8591K5450j5825o977p9807n189j6896
17357d591q754P4449M8573M6057n9674k2089n8584n602K4824K147n1550l6303
17345e1097L2041l604p1250N031M3769j7009N31R6165J9901p1140p4820O5341
17333b6141K4772k1423J1697Q8733n8887l7526j3963N9053N260n224L7178K7741
17321I1270j06628l8921R214L2611R5847k421q6303l5849K1748j6811L5966N3126
17309E2849j464L7304P5924j7439l7106l0883o0620M442m0576L5698L7419k9886
$$ plain form
17297 25662 -1202 -27369 31603 78309 81835 67617 85097 139857 143406 131662 110093 95487
17285 95487 102761 86187 88906 93461 90680 93699 89418 68798 114824 243743 282021 230076 206744
17272 206744 188323 214516 219196 204216 160677 119916 166436 245760 256065 317995 327939 270985
17260 270985 167191 138023 135325 177928 169721 125834 145516 196226 207084 259297 179773 100629
17248 100629 55058 98774 134886 130255 130179 142216 129957 89729 77308 65660 35750 48352
17236 48352 51543 74153 63078 54185 38827 93713 131647 81359 98383 116357 64876 62779
17224 62779 64850 103109 116951 84688 136839 181316 251840 332720 306382 355255 291404 159342
17212 159342 176028 169177 95533 98502 112494 99047 131976 179975 182053 141998 137700 158652
$$ packed form
17297B5662k6864k6167N8972M6706L526j4218J7480N4760L549j1744k1569j4606
17285I5487P274j6574K719M555k781L019m281k0620M6026J28919L8278n1945k3332
17272B06744j8421K6193M680j4980m3539m0761M6520P9324J0305O1930R944n6954
17260B70985j03794k9168k698M2603q207m3887J9682N0710J0858N2213p9524p9144
17248A00629m5571M3716L6112m631p6J2037j2259m0228j2421j1648k9910J2602
17236D8352L191K2610j1075q893j5358N4886L7934n0288J7024J7974n1481k097
17224F2779K071L8259J3842l2263N2151M4477P0524Q0880k6338M8873o3851j32062
17212A59342J6686o851p3644K969J3992j3447L2929M7999K078m0055m298K0952
$$ plain form
17200 158652 132103 130332 168128 184574 101841 84337 133425 159548 121147 77651 61461 38483
17188 38483 39673 14224 28959 77013 106334 2091 -43388 -37183 -22900 -67753 -131640 -138935
17176 -138935 -69311 -26438 7962 43591 2005 26522 57626 72563 85028 93744 18323 -26878
17164 -26878 -23409 -17025 -35201 -31684 -67565 -42402 2518 6788 -20642 -9519 63146 112303
17152 112303 54419 -27160 -49254 -48425 1276 -13108 -3677 18823 10008 31089 57642 37495
17140 37495 73217 97153 90610 62378 83409 95768 106526 104947 67475 33308 64169 17099
17128 17099 -6767 -8879 11337 61333 44074 18968 21917 108554 100474 66834 52815 96276
17116 96276 93168 103956 118635 101925 102043 -6060 -27786 -45457 -12073 -14658 -30133 -55865
$$ packed form
17200A58652k6549j771L7796J6446q2733j7504M9088K6123l8401m3496j6190k2978
17188C8483J190k5449J4735M8054K9321j04243m5479O205J4283m4853o3887p295
17176a38935O9624M2873L4400L5629m1586K4517L1104J4937J2465Q716p5421m5201
17164b6878L469O384j8176L517l5881K5163M4920M270k7430J1123P2665M9157
17152A12303n7884q1579k2094Q29M9701j4384R431K2500q815K1081K6553k0147
17140C7495L5722K3936o543k8232K1031J2359J0758j579l7472l4167L0861m7070
17128A7099k3866k112K0216M9996j7259k5106K949Q6637q080l3640j4019M3461
17116I6276l108J0788J4679j6710J18j08103k1726j7671L3384k585j5475k5732
$$ plain form
17104 -55865 -56617 -19316 34135 75311 40232 4442 27267 92495 145856 101591 79747 15735
17092 15735 -12837 -59136 -63736 -33130 -59338 -61670 -44256 -38429 -15241 -38619 -32816 52845
17080 52845 18305 -50054 -3932 -46827 -48252 19763 24866 38337 51334 88342 107565 129602
17068 129602 124720 100191 15609 -23865 24542 22146 47074 96454 61611 17990 -5023 -31759
17056 -31759 -21152 5855 10632 -9075 -27583 -43565 39570 69558 17272 20409 15755 3845
17044 3845 -24225 -46361 -31744 -42821 8315 29046 45836 46668 35022 47908 53079 9805
17032 9805 -34009 -41145 -75967 -33505 39576 43719 67548 46805 93237 126833 70595 32365
17020 32365 10112 -2485 -17822 16719 22611 35893 11356 -1592 -28650 -59833 -15727 -50913
$$ packed form
17104e5865p52L7301N3451M1176l5079l5790K2825O5228N3361m4265k1844o4012
17092A5735k8572m6299m600L0606k6208k332J7414N827K3188k3378N803Q5661
17080E2845l4540o8359M6122m2895j425O8015N103J3471J2997L7008J9223K2037
17068A29602m882k4529q4582l9474M8407k396K4928M9380l4843m3621k3013k6736
17056c1759J0607K7007M777j9707j8508j5982Q3135K9988n2286L137m654j1910
17044C845k8070k2136J4617j1077N1136K0731J6790Q32j1646J2886N171m3274
17032I805m3814p136l4822M2462P3081M143K3829k0743M6432L3596n6238l8230
17020C2365k2253j2597j5337L4541N892J3282k4537j2948k7058l1183M4106l5186
$$ plain form
17008 -50913 -40222 -35205 -25809 -29272 -21715 10566 3735 53481 17633 32029 39409 -15074 -21266
16995 -21266 -11953 -2891 -16475 60336 119349 139065 107404 44441 14964 -6229 788 29007
16983 29007 39480 -45191 -52493 3386 2803 17799 50746 38968 -24651 -53247 -19120 49062
16971 49062 34858 -9795 -13353 10969 73889 114375 27624 37578 53246 29095 -28282 -256
16959 -256 -2009 -1909 27781 -9265 -56137 -17240 3820 9682 -5847 -29983 -20418 8077 20021
16946 20021 57490 92379 53047 -20483 -94568 -91296 -48605 -47999 -50922 -91456 -31307 12774
16934 12774 18004 -19095 -66346 -107955 -51781 -1203 -20222 1997 15064 -2281 -12292 18342
16922 18342 -57603 -121367 -75163 -48712 -25821 -4183 9377 15500 -37437 -23489 -32466 -104522
$$ packed form
17008e0913J0691N017R396l463P557L2281o831M9746l5848J4396P380n4483o192
16995b1266R313R062j3584P6811N9013J9716l1661o2963k9477k1193P017K8219
16983B9007J0473q4671p302N5879n83J4996L2947j1778o3619k8596L4127O8182
16971D9062j4204m4653l558K4322O2920M0486q6751R954J5668k4151n7377K8026
16959b56j753J00K9690l7046m6872L8897K1060N862j5529k4136R565K8495J1944
16946B0021L7469L4889l9332p3530p4085L272M2691O06k923m0534O0149M4081
16934A2774N230l7099m7251m1609N6174N0578j9019K2219J3067j7345j0011L0634
16922A8342p5945o3764M6204K6451K2891K1638J3560O123n2937J3948q977p2056
$$ plain form
16910 -104522 -97558 -109528 -73508 -44098 -63936 -5372 -13602 -60191 -49342 -10699 -9302 -18794
16898 -18794 -17379 19031 6493 52310 112393 65282 -21856 -52676 -41853 7341 46752 12458
16886 12458 -2624 3328 23636 55421 10889 -24174 27689 37400 46725 14490 -28342 -65625
16874 -65625 -21063 -4212 21039 29512 37846 -14307 20742 48936 44603 35243 23755 12635
16862 12635 42239 70154 139616 109374 111546 129027 131308 145247 146721 145689 95823 39295
16850 39295 15054 -21384 -63657 -45504 -25793 64926 112900 92841 53691 12835 17282 33552
16838 33552 52978 34715 -20210 -10968 -67868 -48648 -41953 -62424 -65016 -95859 -62815 -28429
16826 -28429 -59505 -9925 -26566 -21203 6102 5360 24054 40775 31712 843 -1599 -29463 19381
$$ packed form
16910a04522O964j1970L6020K9410j9838N8564q230m6589J0849L8643J397r492
16898a8794J415L6410j2538M5817O0083m7111q7138l0820J0823M9194L9411l4294
16886A2458j5082N952K0308L1785m4532l5063N1863R711R325l2235m2832l7283
16874f5625M4562J6851K5251Q473Q334n2153L5049K8194m333r360j1488j1120
16862A2635K9604K7915O9462l0242K172J7481K281J3939J474j032m9866n6528
16850C9295k4241l6438m2273J8153J9711R0719M7974k0059l9150m0856M447J6270
16838C3552J9426j8263n4925R242n6900J9220O695k0471k592l0843L3044L4386
16826b8429l1076M9580j6641N363K7305p42J8694J6721r063l0869k442k7864M8844
$$ plain form
16813 19381 28676 10455 2155 12503 2802 66363 115923 75800 46136 -7109 -73965 -53259
16801 -53259 10283 13579 20186 25013 8458 7805 -552 -2465 31359 -3191 63718 53127 3181
16788 3181 17533 48614 37971 28491 49780 90442 94995 26407 -6901 -9767 -2985 3827 -28619
16775 -28619 728 41091 37114 -2322 -12977 2430 27907 -815 -12676 10302 52073 79736
16763 79736 68570 9956 -46989 -28422 76641 43289 35141 36478 61790 92776 48359 21513
16751 21513 31414 31346 28125 -19852 -13824 41595 77919 54761 -20873 -36145 -79292 -88940 -47227
16738 -47227 -9585 -1221 -33367 -46776 -2448 4023 -13274 -68724 -64503 -84488 -66063 -57862
16726 -57862 -60002 -16116 39513 -13573 -64550 -102276 -45813 47218 43002 17788 -31481 -73131
$$ packed form
16813A9381R295j8221q300J0348r701O3561M9560m0123k9664n3245o6856K0706
16801e3259O3542L296O607M827j6555o53q357j913L3824l4550O6909j0591m9946
16788C181J4352L1081j0643r480K1289M0662M553o8588l3308k866O782O812l2446
16775b8619K9347M0363l977l9436j0655J5407K5477k8722j1861K2978M1771K7663
16763G9736j1166n8614n6945J8567J05063l3352q148J337K5312L0986m4417k6846
16751B1513R901o8l221m7977O028N5419L6324k3158p5634j5272m3147r648M1713
16738d7227L7642Q364l2146j3409M4328O471j7297n5450M221j9985J8425Q201
16726e7862k140M3886N5629n3086n0977l7726N6463R3031m216k5214m9269m1650
$$ plain form
16714 -73131 -77225 -43914 -81159 -97261 -82019 -76111 -15790 3262 44089 -33802 -116515 -99382
16702 -99382 -38426 -13145 -74343 -60392 39170 46425 -8779 -17309 -9795 -24447 -8685 55324
16690 55324 54115 38199 36867 17943 35503 79770 73779 36597 -26088 -80401 -10373 29291
16678 29291 12882 5636 53469 66101 41137 19395 -34922 -41437 26792 47351 32682 -1929
16666 -1929 -7107 16184 39944 -30517 -53150 34925 92082 42953 28339 15430 -22767 -43646
16654 -43646 -24977 -31461 -83473 -141660 -92107 -46841 7563 116144 123590 71871 38034 57909
16642 57909 50990 3687 -40890 -45510 6608 -30465 11780 77966 71945 22567 -21003 -35921
16630 -35921 19717 20541 -15033 -60621 -75830 -67697 -105554 -125464 -88217 -63418 -18020 27254
$$ packed form
16714g3131m094L3311l7245j6102J5242N908O0321J9052M0827p7891q2713J7133
16702i9382O0956K5281o1198J3951R9562P255n5204q530P514j4652J5762O4009
16690E5324j209j5916j332j8924J7560M4267n991l7182o2685n4313P0028L9664
16678B9291j6409p246M7833J2632k4964k1742n4317o515O8229K0559j4669l4611
16666a929n178K3291K3760p0461k2633Q8075N7157m9129j4614j2909l8197k0879
16654d3646J8669o484n2012n8187M9553M5266N4404J08581P446n1719l3837J9875
16642E7909o919m7303m4577m620N2118l7073M2245O6186o021m9378m3570j4918
16630c5921N5638Q24l5574m5588j5209Q133l7857j9910L7247K4799M5398M5274
$$ plain form
16618 27254 24003 542 13846 -24536 -36007 -12812 -7862 -19543 -48710 -15947 13830 31441
16606 31441 9491 -31296 -68707 -51887 -36453 -18492 45565 62301 105028 58315 63164 26347
16594 26347 52527 93998 78600 37456 6585 -57175 -61339 -92914 -99009 -104210 -46648 -59412
16582 -59412 -68023 -86202 -73066 -25708 -4078 -6710 -8820 25316 44157 70750 71686 29728 -28158
16569 -28158 -45402 -15570 -4632 22696 87860 91909 35547 -9103 -10782 13513 51758 23057
16557 23057 27306 -1579 -39604 7017 13257 -40317 -55367 41505 88804 94285 58467 26522
16545 26522 16195 -14146 -87870 -135132 -136073 -160493 -129367 -84969 -63675 -61626 -49617 -49424 -51105
16532 -51105 2304 -24375 -72329 -57704 -2336 16979 205 -34215 -22648 -21828 -41799 303
$$ packed form
16618B7254l251k3461J3304l8382j1471K3195M950j1681k9167L2763K9777J7611
16606C1441k1950m0787l7411J6820J5434J7961O4057J6736M2727m6713M849l6817
16594B6347K6180M1471j5398m1144l0871o3760m164l1575o095n201N7562j2764
16582e9412q611j8179J3136M7358K1630k632k110L4136J8841K6593R36m1958n7886
16569b8158j7244K9832J0938K7328O5164M049n6362m4650j679K4295L8245k8701
16557B3057M249k8885l8025M6621O240n3574j5050R6872M7299N481l5818l1945
16545B6522j0327l0341p3724m7262r41k4420L1126M4398K1294K049J2009J93j681
16532e1105N3409k6679m7954J4625N5368J9315j6774l4420J1567Q20j9971M2102
$$ plain form
16520 303 -14813 23208 -22447 -98846 -114171 -110671 -93319 -60466 1 -656 -2931 -18292 35881
16507 35881 49402 27377 -19029 -82547 -140499 -149245 -115994 -69401 -51549 -28050 15946 94097
16495 94097 102167 56452 46566 37990 49767 61222 35450 34319 28813 -34769 -115390 -122053 -96515
16482 -96515 -57991 20785 32435 -17952 -63051 23901 89264 99320 73439 12442 -22848 58239
16470 58239 65203 56783 80855 53414 -8941 -9428 -828 -2289 -55881 -26220 -5837 -50529 -37008
16457 -37008 -37999 -49480 -69369 -112187 -117353 -64669 -16885 -190 -1695 13281 -65056 -78045
16445 -78045 -58617 -14148 8560 -21646 -6099 -9893 -30297 29831 36347 2501 -26905 -66852
16433 -66852 -96707 -68723 16228 55085 -8466 -70268 -105431 -107359 -83203 -8907 56599 63957
$$ packed form
16520C03j5116L8021m5655p6399j5325L500J7352L2853O0467o57k275j5361N4173
16507C5881J3521k2025m6406o3518n7952q746L3251M6593J7852K3499M3996P8151
16495I4097Q070m5715r886q576J1777J1455k5772j131n506o3582q0621o663K5538
16482i6515L8524P8776J1650n0387m5099Q6952O5363J0056k5881o0997l5290Q1087
16470E8239O964q420K4072k7441o2355m87Q600j461n3592K9661K0383m4692J3521
16457c7008r91j1481j9889m2818n166N2684M7784J6695j505J4976p8337j2989
16445g8045J9428M4469K2708l0206J5547l794k0404O0128O516l3846k9406l9947
16433f6852k9855K7984Q4951L8857o3551o1802l5163j928K4156P4296O5506P358
$$ plain form
16421 63957 60873 -15832 -39350 -43615 -17454 2870 42717 23495 -77384 -128690 -70444 -5927
16409 -5927 -35104 -41981 -43026 -17799 -11378 -55950 -63892 -72414 -42832 -32922 -59706 -91618 -86753
16396 -86753 -91603 -47694 -63266 -102349 -89426 -91792 -66282 -21137 -24774 -39770 -418 -36408
16384 -36408 -50181 -68829 -100817 -176561 -207158 -205962 -184907 -118430 -86707 -69292 -32035 3632
16372 3632 -47644 -159834 -183926 -168944 -97172 -53143 -72806 -79783 -83247 -53621 -68731 -78773
16360 -78773 -140302 -94149 -103316 -113023 -90068 -84545 -78790 -98231 -80211 -93115 -52113 -6534
16348 -6534 -62551 -33927 54740 44273 7274 -7388 -150 21043 30576 -29280 -85945 -49774
16336 -49774 -16583 -11702 24677 27196 29790 3299 -53275 -53927 -42707 11791 91472 112536 102391
$$ packed form
16421F3957l084p6705k3518m265K6161K0324L9847j9222j00879n1306N8246O4517
16409e927k9177o877j045K5227O421m4572p942q522K9582R910k6784l1912M865
16396h6753m850M3909j5572l9083J2923k366K5510M5145l637j4996L9352l5990
16384c6408j3773j8648l1988p5744l0597J196K1055O6477L1723J7415L7257L5667
16372C632n1276j12190k4092J4982P1772M4029j9663o977l464K9626j5110j0042
16360g8773o1529M6153r167r707K2955N523N755j9441J8020j2904M1002M5579
16348f534n6017K8624Q8667j0467l6999j4662P238K1193R533n9856n6665L6171
16336d9774L3191M881L6379K519K594k6491n6574o52J1220N4498P9681K1064j0145
$$ plain form
16323 102391 52307 50073 91494 119131 45809 -6453 -46534 -57675 25722 28531 -10405 -14313
16311 -14313 41563 80203 104003 121639 121877 3988 -37387 -12919 -47502 -72931 -29329 2524
16299 2524 -23913 -57741 -123324 -131677 -102534 -77848 -32229 -75619 -62175 -33616 -15416 -27151
16287 -27151 -1405 38629 34163 71396 103229 58416 63770 32937 75072 72852 55907 55497 65068
16274 65068 96182 72814 53858 30773 5026 5364 -9928 -26775 -50300 -64502 -23503 -16788
16262 -16788 22063 37393 84267 110807 120835 90209 81417 -9436 -66293 -62301 -15908 86697
16250 86697 38531 -67006 -71493 -73948 -76528 -90996 -61681 24911 77301 47110 19039 14765
16238 14765 -420 18588 -11339 -50990 -7316 33432 79066 130705 136049 142985 135325 39064
$$ packed form
16323A02391n0084k234M1421K7637p3322n2262m0081j1141Q3397K809l8936l908
16311a4313N5876L8640K3800J7636K38j17889m1375K4468l4583k5429M3602L1853
16299B524k6437l3828o5583q353K9143K4686M5619m3390J3444K8559J8200j1735
16287b7151K5746M0034m466L7233L1833m4813N354l0833M2135k220j6945m10R571
16274F5068L1114k3368j8956k3085k5747L38j5292j6847k3525j4202M0999O715
16262a6788L8851J5330M6874K6540J0028l0626q792r0853n6857L992M6393J02605
16250H6697m8166j05537m487k455k580j4468K9315Q6592N2390l0191k8071m274
16238A4765j5185J9008k9927l9651M3674M0748M5634N1639N344O936p660r6261
$$ plain form
16226 39064 4421 -56124 -59923 5309 61099 36100 12168 -28768 -15136 12827 -21226 -16984
16214 -16984 12198 16028 43616 28332 -11576 3749 41429 98714 74246 14055 -54665 -30748
16202 -30748 33543 -15244 -47764 -44310 -43717 -12545 40563 -8992 -49115 10482 51562 -19498
16190 -19498 -32053 9005 -24175 12468 29814 4280 -61174 -55217 19283 80977 110207 115828
16178 115828 90187 42839 -24130 -43485 -78571 -94799 -75609 -53576 -59056 -38199 -34538 -5448
16166 -5448 42857 7829 -51301 -44210 35535 22943 35594 -23872 -50785 -44000 -77644 -81823
16154 -81823 -44253 -19326 -15412 40988 25352 -43364 -53240 -10665 -5221 -34173 -16474 4700
16142 4700 1862 -77095 -122161 -82283 -32547 -28192 -24385 -46939 -15780 -36912 -108540 -153001
$$ packed form
16226C9064l4643o0545l799O5232N5790k4999k3932m0936J3632K7963l4053M242
16214a6984K9182L830K7588j5284l9908J5325L7680N7285k4468o0191o8720K3917
16202c0748O4291m8787l2520L454N93L1172N3108m9555m0123N9597M1080p1060
16190a9498j2555M1058l3180L6643J7346k5534o5454N957P4500O1694K9230N621
16178A15828k5641m7348o6969j9355l5086j6228J9190K2033n480K0857L661K9090
16166e448M8305l5028n9130P091P9745j2592J2651n9466k6913O785l3644m179
16154h1823L7570K4927L914N6400j5636o8716r876M2575N444k8952J7699K1174
16142D700k838p8957m5066L9878M9736M355L807k2554L1159k1132p1628m4461
$$ plain form
16130 -153001 -128785 -83998 -67184 -39433 16754 47470 52352 23255 -51653 -36711 -38114 -49008
16118 -49008 -3262 25620 -1340 -17513 -41169 -34043 11225 35407 140764 105356 65097 23352
16106 23352 40218 48434 -33038 -79399 -88996 -42344 8552 43873 46130 50984 62767 92574
16094 92574 2983 12378 17710 8000 43463 65439 -4030 -41826 6116 50940 45621 28728
16082 28728 56627 79477 87534 45971 51697 89149 89365 50668 26558 21455 57153 37654 39606
16069 39606 38104 43486 31386 -13452 -50035 -113345 -77878 -89663 -95293 -124653 -78479 -59701
16057 -59701 -86801 -99176 -58403 -35525 -66111 -60484 15791 1899 -57482 -54852 -76266 -89050
16045 -89050 -81067 -65776 -88001 -105740 -43372 -30227 -90446 -71717 -42495 9378 17794 8613
$$ packed form
16130a53001K4216M4787J6814K7751N6187L0716M882k9097p4908J4942j403j0894
16118d9008M5746K8882k6960j6173k3656P126M5268K4182J05357l5408m0259m1745
16106B3352J6866Q216q1472m6361r597M6652N0896L5321K257M854J1783K9807
16094I2574q9591R395N332r710L5463K1976o9469l7796M7942M4824n319j6893
16082B8728K7899K2850Q057m1563N726L7452K16l8697k4110n103L5698j9499J952
16069C9606j502N382j2100m4838l6583o3310L5467j1785n630k9360M6174J8778
16057e9701k7100j2375M0773K2878l0586N627P6275j3892n9381K630k1414j2784
16045h9050P983J5291k2225j7739O2368J3145o0219J8729K9222N1873Q416r181
$$ plain form
16033 8613 -14087 -77008 -119341 -55064 -73174 -109308 -104377 -36665 36507 56375 78225 78759
16021 78759 30080 -6774 -1246 28040 -24111 -127909 -138222 -110682 -79130 -32662 -20772 9360
16009 9360 42559 29499 -18708 -74063 -77662 -69700 -37103 -10654 1604 -15648 8295 27318
15997 27318 -16894 -54503 -69785 -61473 -58661 -49824 -5714 10687 -59971 -91201 -44394 -19165
15985 -19165 -62981 -76422 -70976 -66129 -90996 -128796 -131206 -88025 -90306 -74219 -24442 -18293 -28438
15972 -28438 -4372 27916 -9702 -46452 -45105 -28298 -62680 -111084 -80396 -52767 -42699 -74973
15960 -74973 -71536 -32904 8023 18448 11017 29333 76278 95672 88576 35288 -23224 -37120
15948 -37120 -701 -34386 -61041 5255 61605 72739 43371 16028 39326 19839 -17633 -57514
$$ packed form
16033H613k2700o2921m2333O4277j8110l6134M931O7712P3172J9868K1850N34
16021G8759m8679l6854N528K9286n2151j03798j0313K7540L1552M6468J1890L0132
16009I360L3199j3060m8207n5355l599P962L2597K6449J2258j7252K3943J9023
15997B7318m4212l7609j5282Q312K812Q837M4110J6401p0658l1230M6807K5229
15985a9165m3816j3441N446M847k4867l7800k410M3181k281J6087M9777O149j0145
15972b8438K4066L2288l7618l6750J347J6807l4382m8404L0688K7629J0068l2274
15960g4973L437L8632M0927J0425p431J8316M6945J9394p096n3288n8512j3896
15948c7120L6419l3685k6655O6296N6350J1134k9368k7343K3298j9487l7472l9881
$$ plain form
15936 -57514 -32731 9658 -4620 -28870 -56657 -46946 1499 -36878 -17869 73625 81866 56811
15924 56811 29485 25024 22035 -2133 -3937 21563 47118 21538 16808 -25290 24370 75521
15912 75521 22640 -25974 -71324 -4824 30081 41235 489 3698 36776 22944 51640 66372
15900 66372 70732 11826 4335 -13750 -49439 -75309 -68646 -32565 52255 69879 70545 137453 156948
15887 156948 159711 130291 108599 71248 65639 38600 17254 -21781 -46833 -336 -68389 -57477
15875 -57477 -18734 -31188 -14582 24695 64312 46209 7586 -19172 -61949 -96111 -51888 -68748
15863 -68748 -81565 -64053 -19098 39580 23695 -11010 -20873 -6387 -2584 20086 46440 50549
15851 50549 31846 39762 31281 29338 -12050 -16897 -7320 -21743 -6368 -18434 -105794 -90677 -55191
$$ packed form
15936e7514K4783M2389j4278k4250k7787R711M8445l8377J9009R1494Q241k5055
15924E6811k7326m461k989k4168j804K5500K5555k5580m730m2098M9660N1151
15912G5521n2881m8614m5350O6500L4905J1154m0746L209L3078j3832K8696J4732
15900F6372M360n8906p491j8085l5689k5870O663L6081Q4820J7624O66O6908J9495
15887A56948K763k9420k1692l7351n609k7039k1346l9035k5052M6497o8053J0912
15875e7477L8743j2454J6606L9277L9617j8103l8623k6758m2777l4162M4223j6860
15863f8748j2817J7512M4955N8678j5885l4705r863J4486L803K2670K6354M109
15851E0549j8703P916q481j943m1388m847R577j4423J5375j2066q7360J5117L5486
$$ plain form
15838 -55191 -69961 4664 -4272 -54770 -33104 -11065 -26278 -3795 -43338 -34498 3396 22709
15826 22709 14279 833 -43112 -11674 33664 33613 -43738 -70797 -57476 -44150 -49375 -31587 -39228
15813 -39228 -79668 -53511 -1522 -33377 -73843 -62697 44494 61626 32333 1308 555 -6307
15801 -6307 -27196 -76073 -122353 -127936 -49336 1870 20051 54850 -10208 -51057 -35888 24936
15789 24936 92918 66826 69522 46973 -64072 -164108 -184309 -104006 -68063 -77880 -121500 -89617
15777 -89617 -59844 36178 115065 86392 -5499 4145 -4237 17075 -8083 31687 83814 62238
15765 62238 80640 58150 51579 44551 15157 18141 -9239 -43504 -28603 -32184 -100657 -97867 -80846
15752 -80846 -95776 -25417 2182 22021 -13429 39461 56352 24981 -2581 -15168 -26926 -58554
$$ packed form
15838e5191j4770P4625q936n0498K1666K2039j5213K2483l9543Q840L7894J9313
15826B2709q430j3446m3945L1438M5338n1p7351k7059J3321J3326n225J7788p641
15813c9228m0440K6157N1989l1855m0466J1146J07191J7132k9293l1025p53o862
15801f307k0889m8877m6280n583P8600N1206J8181L4799o5058m0849J5169O0824
15789B4936O7982k6092K696k2549j11045j00036k0201Q0303L5943r817m3620L1883
15777h9617K9773R6022P8887k8673r1891R644q382K1312k5158L9770N2127k1576
15765F2238J8402k2490o571p028k9394K984k7380l4265J4901l581o8473K790J7021
15752h0846j4930P0359K7599J9839l5450N2890J6891l1371k7562j2587j1758l1628
$$ plain form
15740 -58554 -17354 17383 -16043 -45527 -14180 2203 36335 -2404 -30242 -1229 9831 -60757
15728 -60757 -35530 -1087 44235 56157 15504 1136 -9339 -39089 -15000 -46116 -60653 -36629
15716 -36629 -92425 -70345 -40555 -13633 -22574 -87447 -15355 31613 57074 24944 19361 -43003
15704 -43003 -78553 -43068 25257 57879 68607 126853 209874 199840 124659 112155 157482 102776
15692 102776 5165 -17726 -7147 9959 25598 -6380 35950 69171 35981 25330 17509 23342
15680 23342 -27775 -65166 -43674 36284 8459 -29032 -31454 -53851 -22149 -29190 -65678 -42671
15668 -42671 -27885 -2492 -552 -29438 23444 64840 16861 55863 80642 65387 35472 9775
15656 9775 2530 -9506 -5408 26964 70692 89148 47871 7169 6140 -66726 -136564 -89002
$$ packed form
15740e8554M1200L4737l3426k9484L1347J6383L4132l8739k7838K9013J1060p0588
15728f0757K5227L4443M5322J1922m0653j4368j0475k9750K4089l1116j4537K4024
15716c6629n5796K2080K9790K6922q941o4873P2092M6968K5461l2130n583o2364
15704d3003l5550L5485O8325L2622J0728N8246Q3021j0034p5181j2504M5327n4706
15692A02776r7611k2891J0579J7106J5639l1978M2330L3221l3190j0651p821N833
15680B3342n1117l7391K1492P9958k7825l7491k422k2397L1702p041l6488K3007
15668d2671J4786K5393J940k8886N2882M1396m7979L9002K4779j5255k9915k5697
15656I775p245j2036M098L2372M3728J8456m1277m0702j029p2866o9838M7562
$$ plain form
15644 -89002 -36671 -33058 -1181 -5854 -15845 -32766 -75077 -102261 -143409 -148063 -126592 -124001 -53757
15631 -53757 -39798 -68151 -29852 -43792 -48337 -14602 -14209 -31134 -18309 12813 27813 4953
15619 4953 7509 27915 47004 43268 37524 31062 43717 26028 6833 -5693 2265 -55560 -70400
15606 -70400 -73344 -69832 -4022 62824 62462 36329 3927 -33079 -11331 -32855 -97141 -65021
15594 -65021 -19403 81554 144053 128090 41065 4334 -9908 -49801 -104007 -86991 -83707 -107560
15582 -107560 -100235 -105927 -100489 -83947 -68389 -8623 -13964 52423 102116 76284 15865 -12518
15570 -12518 -37669 -59451 -78912 -47310 27606 55154 21026 -14962 -12307 -40927 -49895 -27754
15558 -27754 -32158 -58518 -47832 6176 13620 -102 -5740 -5521 26122 11906 -7587 26441 -6215
$$ packed form
15644h9002N2331L613L1877m673r991j6921m2311k7184m1148m654K1471K591P0244
15631e3757J3959k8353L8299j3940m545L3735L93j6925J2825L1122J5000k2860
15619D953K556K0406J9089l736n744o462J2655j7689j9195j2526P958n7825j4840
15606g0400k944L512O5810O6846l62k6133l2402l7006K1748k1524o4286L2120
15594f5021M5618J00957O2499j5963q7025l6731j4242l9893n4206J7016L284k3853
15582a07560P325n692N438J6542J5558N9766n341O6387M9693k5832o0419k8383
15570a2518k5151k1782j9461L1602P4916K7548l4128l5988K655k8620q968K2141
15558b7754m404k6360J0686N4008P444j3722n638K19L1643j4216j9493L4028l2656
$$ plain form
15545 -6215 -17488 29868 23347 -5168 -71277 -119089 -106516 -93092 -87041 -75853 -76849 -65566 -39553
15532 -39553 -50398 -18081 -26311 -37769 -59271 -38707 11454 37965 18268 14004 22716 30251
15520 30251 -1412 6617 -9684 -17586 13255 35448 41033 23323 57655 37990 11779 31605
15508 31605 -38969 -55690 48572 11668 -35464 -112232 -112813 -88262 -49598 -39390 -38579 -14568
15496 -14568 -33032 -56768 -82778 -63126 -19711 -17534 -8922 60796 13005 -11458 41064 56579
15484 56579 54370 9075 -52306 -73970 -10803 55717 19696 2499 14205 36741 36212 -11207
15472 -11207 4334 3720 -24290 4566 14841 -23672 -63433 -63202 -54245 -43446 1299 1494 -7073
15459 -7073 -80283 -98618 -88666 -117733 -109879 -104775 -117112 -116147 -98242 -131734 -221241 -183790 -44114
$$ packed form
15545f215j1273M7356o521k8515o6109m7812J2573J3424O051J1188r96J1283K6013
15532c9553j0845L2317q230j1458k1502K0564N0161K6511j9697m264Q712P535
15520C0251l1663Q029j6301p902L0841K2193N585j7710L4332j9665k6211J9826
15508C1605p0574j6721J04262l6904m7132p6768n81K4551L8664J0208Q11K4011
15496a4568j8464k3736k6010J9652M3415K177Q612O9718m7791k4463N2522J5515
15484E6579k209m5295o1381k1664O3167O6520l6021j7197J1706K2536n29m7419
15472a1207J5541o14k8010K8856J0275l8513l9761K31Q957J0799M4745J95q567
15459g073p3210j8335R952k9067P854N104j2337R65J7905l3492q9507L7451J39676
$$ plain form
15446 -44114 34566 6702 -37207 -101454 -108426 -88605 -94201 -51202 -13075 13298 -7685 15610
15434 15610 43918 38069 6049 -193 -28485 -25168 -8763 11244 21454 18871 29445 23463 17366
15421 17366 29353 41853 5117 24820 64420 89115 69750 70611 36367 10633 2813 -5100
15409 -5100 8275 -1153 -30956 -64036 -56973 4565 11656 -28110 -37253 -29685 23522 -13856 -79394
15396 -79394 -26891 -42599 -76858 -84461 -50562 -101054 -170130 -187952 -93010 18094 34465 -5294
15384 -5294 -61005 -115333 -56553 36304 88967 66373 29159 6861 -48700 -71107 -68144 -53140
15372 -53140 -96354 -75057 -43922 -30752 -89234 -97073 -80742 -87762 -77417 -36011 -958 -1284
15360 -1284 -24308 1699 -46484 -81253 -63877 -50503 -97046 -54560 19089 -17330 6575 -38211
$$ packed form
15446d4114P8680k7864m3909o4247o972J9821n596M2999L8127K6373k0983K3295
15434A5610K8308n849l2020o242k8292L317J6405K0007J0210k583J0574n982o097
15421A7366J1987J2500l6736J9703L9600K4695j9365Q61l4244k5734p820p913
15409e100J3375r428k9803l3080P063O1538P091l9766r143P568N3207l7378o5538
15396g9394N2503j5708l4259p603L3899n0492o9076j7822R4942J11104J6371l9759
15384e294n5711n4328N8780R2857N2663k2594l7214k2298n5561k2407K963J5004
15372e3140m3214K1297L1135J3170n8482p839J6331p020J0345M1406L5053l26
15360a284k3024K6007m8183l4769J7376J3374m6543M2486P3649l6419K3905m4786
$$ plain form
15348 -38211 -24625 -15286 32426 39659 915 9431 42693 16013 -44395 -49320 -45523 -41122 21076
15335 21076 71220 35198 -9442 -23597 -28344 9336 -7179 45636 68493 54504 30893 28003
15323 28003 16379 30771 21327 35797 29292 -856 -39017 -28221 4141 33979 -89 -38759
15311 -38759 -43805 3756 27721 52832 16912 12567 -10889 -65487 -45507 -67791 -51802 -47566
15299 -47566 -69155 -52903 -891 5189 -10830 -44790 -11268 -12502 8433 15917 5932 18401
15287 18401 9346 -35591 -32514 -64496 -76306 -49779 -67014 -106498 -75187 -57806 -74252 -17240
15275 -17240 30893 -23748 -102205 -99774 -64785 -102454 -60360 24091 102162 138660 67465 42912
15263 42912 50163 76313 61958 75307 81163 62424 7386 9102 3363 -6935 12235 -16361
$$ packed form
15348c8211J3586R339M7712P233l8744Q516L3262k6680o0408m925L797M401O2198
15335B1076N0144l6022m4640j4155m747L7680j6515N2815K2857j3989k3611k890
15323B8003j1624J4392r444J4470o505l0148l8161J0796L2362K9838l4068l8670
15311c8759n046M7561K3965K5111l5920m345k3456n4598J9980k2284J5989M236
15299d7566k1589J6252N2012O080j6019l3960L3522j234K0935P484r985J2469
15287A8401r055m4937L077l1982j1810K6527j7235l9484L1311J7381j6446N7012
15275a7240M8133n4641p8457K431L4989l7669M2094Q4451P8071L6498p1195k4553
15263D2912P251K6150j4355J3349N856j8739n5038J716n739j0298J9170k8596
$$ plain form
15251 -16361 -1822 -19519 45864 93519 69725 30407 -3835 38374 50761 40838 98633 111261
15239 111261 107218 79216 71716 32565 -2924 18787 27639 41321 10435 -17812 59336 23461
15227 23461 -18318 -19892 69440 63350 15385 10559 -32219 -23215 -31088 -32696 -15499 -61589 -107830
15214 -107830 -74378 -9213 12019 15079 -11371 -48202 -82252 -76008 -40286 -70170 -34173 -57817
15202 -57817 -43224 -255 26640 15148 -23401 -26624 -4156 21453 24785 54559 44855 9342
15190 9342 6845 23887 27953 9926 -24167 -19889 -1340 -18123 31231 27436 5537 -10929 -41093
15177 -41093 -1085 21872 74194 35867 -32064 -88132 -83760 -62280 -14191 -22658 -54554 -1192
15165 -1192 41676 75512 49320 17045 -12495 -6756 -24798 -64367 -76766 10488 86575 43074
$$ packed form
15251a6361J4539j7697O5383M7655k3794l9318l4242M2209J2387r923N7795J2628
15239A11261m043k8002p500l9151l5489K1711Q852J3682l0886k8247P7148l5875
15227B3461m1779j574Q9332o090m7965m826m2778R004p873j608J7197m6090m6241
15214a07830L3452O5165K1232L060k6450l6831l4050O244L5722k9884L5997k3644
15202e7817J4593M2969K6895j1492l8549l223K2468K5609L332K9774r704l5513
15190I342k497J7042M066j8027l4093M278J8549j6783M9354l795k1899j6466l0164
15177d1093M0008K2957N2322l8327o7931n6068M372K1480M8089q467l1896N3362
15165a192M2868L3836k6192l2275k9540N739j8042l9569j2399Q7254P6087m3501
$$ plain form
15153 43074 -31668 -42950 30365 48145 16795 9893 11834 -5753 28786 66386 52818 25009
15141 25009 -12721 8563 17799 21706 51025 8926 -13991 -35530 -9677 40805 17020 18917
15129 18917 -255 -8547 -67008 -43800 18690 27216 13061 -13591 -10660 4862 -47207 -45467
15117 -45467 -10736 -28780 -36295 -61001 -108487 -91023 -31108 -4988 4023 -21643 -48776 3977
15105 3977 42411 73158 24414 24987 -11275 -20263 -26816 -48775 -111038 -141570 -84782 -77622 -78861
15092 -78861 -26107 -13382 -26761 -23916 -8380 -70633 -67321 5938 1193 22014 -47637 -52606
15080 -52606 -55972 -15061 41516 71674 55514 -7431 -60720 -21239 1548 10673 -47625 -79399
15068 -79399 -60813 5722 11068 -10797 -24259 -51991 -43066 -37356 -63974 -90355 -41257 -25695
$$ packed form
15153D3074p4742j1282P3315J7780l1350o902J941j7587L4539L7600j3568k7809
15141B5009l7730K1284R236L907K9319m2099k2917k1539K5853N0482k3785J897
15129A8917j9172q292n8461K3208O2490Q526j4155k6652K931J5522n2069J740
15117d5467L4731j8044p515k4706m7486J7464N9915K6120R011k5666k7133N2753
15105C977L8434L0747m8744N73l6262q988o553k1959o2263l0532N6788P160j239
15092g8861N2754J2725j3379K845J5536o2253L312P3259m745K0821o9651m969
15080e2606l366M0911N6577L0158j6160o2945n3289L9481K2787R125n8298l1774
15068g9399J8586O6535N346k1865j3462k7732Q925N710k6618k6381M9098J5562
$$ plain form
15056 -25695 13242 90820 72835 -10614 -52445 -29522 -65235 468 -12763 -46721 -82603 -171274
15044 -171274 -172293 -56799 12427 10453 44770 16466 14455 -8143 6621 5574 -57796 -34719
15032 -34719 -23810 18011 252 -38345 -66560 -51861 -46394 -13127 7991 58703 62783 -119
15020 -119 -29818 -31071 -50412 587 50568 41614 53606 81508 48080 -52336 -90729 -95180
15008 -95180 -41862 9705 -24504 -91440 -30702 -68456 -159060 -142531 -66801 -30569 -24252 -38011
14996 -38011 7281 53978 30044 -46134 2345 11843 13302 -36182 -44803 17772 21278 -63566
14984 -63566 -111958 -113910 -82596 -63646 -77328 -77274 -46143 -75683 -60398 -10968 -34260 17768
14972 17768 37718 45640 18188 -1046 4518 40135 -19299 -116834 -117000 -50814 -29350 -50464
$$ packed form
15056b5695L8937P7578j7985q3449m1831K2923l5713O5703j3231l3958l5882q8671
15044a71274j019J15494O9226j974L4317k8304k011k2598J4764j047o3370K3077
15032c4719J0909M1821j7759l8597k8215J4699N467L3267K1118N0712M080o2902
15020a19k9699j253j9341N0999M9981q954J1992K7902l3428j00416l8393m451
15008i5180N3318N1567l4209o6936O0738l7754r0604J6529P5730L6232O317j3759
14996c8011M5292M6697k3934p6178M8479R498J459m9484q621O2575L506q4844
14984f3566m8392j952L1314J8950j3682N4L1131k9540J5285M9430k3292N2028
14972A7768J9950P922k7452j9234N564L5617n9434r7535j66O6186K1464k1114
$$ plain form
14960 -50464 -2066 51863 22293 -30740 -1572 21681 -33380 -77184 -44196 11315 45392 89587
14948 89587 39683 18076 -29842 -28045 16257 -16542 -22641 -16304 -29973 -11610 8354 -12360
14936 -12360 -93698 -59299 -23908 47648 63507 69141 118498 77439 55601 73036 90751 87496
14924 87496 97737 20017 21752 68998 59241 59945 -2183 -58142 -47487 -4352 -27662 -2133
14912 -2133 9149 40535 68008 20770 5274 55698 52643 -11024 -25106 44321 37485 -4159
14900 -4159 -43542 -75354 -77902 -36340 -42586 -84424 -93805 -85595 -44183 32513 32004 6758 -1952
14887 -1952 -5184 -25718 -62294 -62885 -43263 -26648 -31122 -66143 -60290 -70912 -66841 -46535 -29167
14874 -29167 5762 21309 -25395 -20765 11699 5034 -11267 -5846 80248 98402 45852 48470
$$ packed form
14960e0464M8398N3929k9570n3033K9168K3253n5061m3804L2988N5511L4077M4195
14948H9587m9904k1607m7918J797M4302l2799o099O337j3669J8363J9964k0714
14936a2360q1338L4399L5391P1556J5859N634M9357m1059k1838J7435J7715l255
14924H7496J0241p7720J735M7246r757P04o2128n5959J0655M3135k3310K5529
14912b133J1282L1386K7473m7238j5496N0424l055o3667j4082O9427o836m1644
14900d159l9383l1812k548M1562o246m1838r381Q210M1412P6696n09k5246q710
14887a952l232k0534l6576n91J9622J6615m474l5021N853j0622M071K0306J7368
14874b9167L4929J5547m6704M630L2464o665j6301N421Q6094J8154n2550K618
$$ plain form
14862 48470 44811 3175 -5469 -36929 -2089 -22102 -27396 -60047 -50514 3117 -13227 -55096
14850 -55096 -89082 -29668 -2737 11056 53418 9914 2672 -15627 -39805 4698 1049 -91625
14838 -91625 -142803 -71963 -46840 -54696 -45171 -48000 -64813 -84505 -79959 -96106 -46946 -75276
14826 -75276 -112981 -56646 -46867 -8657 11071 24466 -894 -6025 267 28471 72741 45470
14814 45470 37501 55699 1221 -27203 -53741 -33175 46801 77222 64739 78767 70659 17331
14802 17331 -28465 -18832 23075 30455 -9098 -9992 13512 3879 -9225 49373 88953 95315 85074
14789 85074 49136 81151 27387 -47128 -77879 -37891 20478 70997 24642 -22770 -29872 -72337
14777 -72337 -68507 -19224 13619 24182 3900 -55065 -12303 51533 76409 78298 43951 -29883
$$ packed form
14862D8470l659m1636q644l1460L4840k0013n294l2651R533N3631j6344m1869
14850e5096l3986N9414K6931J3793M2362m3504p242j8299k4178M4503l649r2674
14838i1625n1178P0840K5123p856R525k829j6813j9692M546j6147M9160k8330
14826g5276l7705N6335R779L8210J9728J3395k5360n131O292K8204M4270k7271
14814D5470p969J8198n4478k8424k6538K0566P9976L0421j2483J4028q108n3328
14802A7331m5796R633M1907P380l9553q94K3504r633j3104N8598L9580O362j0241
14789H5074l5938L2015n3764p4515l0751L9988N8369N0519m6355m7412p102m2465
14777g2337L830M9283L2843J0563k0282n8965M2762O3836K4876J889l4347p3834
$$ plain form
14765 -29883 -109089 -117106 -83351 -18455 20401 21601 -18654 -42194 -19508 -23331 -38845 -56900
14753 -56900 -27889 18125 -13293 -8239 -13115 -12045 71853 63851 18930 4539 34684 42613 38044
14740 38044 27680 26972 -15975 -60491 -40955 -75960 -57300 18715 8193 -49641 -64382 -87947
14728 -87947 -82227 -88593 -40153 -14914 -44007 -62247 -47786 -287 29767 -33071 -75022 -66084
14716 -66084 -52853 17265 65594 89916 48032 58313 38094 55255 49309 -10709 -53007 -64712
14704 -64712 -28790 8696 23409 49399 54460 -14858 -45001 -21925 11041 60651 57966 52622
14692 52622 1113 18911 63009 57263 33955 -3686 12353 67062 107656 80310 86611 61467
14680 61467 64886 97962 129441 111903 42926 18370 1756 -28395 12439 46365 70164 87107
$$ packed form
14765b9883p9206q017L3755O4896L8856J200m0255k3540K2686l823j5514j8055
14753e6900K9011M6014l1418N054m876J070Q3898q002m4921j4391L0145P929m569
14740C8044j0364p08m2947m4516J9536l5005J8660P6015j0522n7834j4741k3565
14728h7947N720o366M8440K5239k9093j8240J4461M7499L0054o2838m1951Q938
14716f6084J3231P0118M8329K4322m1884J0281k0219J7161n946o0018m2298j1705
14704f4712L5922L7486J4713K5990N061o9318l0143K3076L2966M9610k685n344
14692E2622n1509J7798M4098n746k3308l7641J6039N4709M0594k7346O301k5144
14680F1467L419L3076L1479j7538o8977k4556j6614l0151M0834L3926K3799J6943
$$ plain form
14668 87107 103710 110764 61826 9176 43944 34739 7857 -31389 -55359 -73461 -75693 -48668
14656 -48668 -18583 11167 -28388 -5301 -26515 -42967 15991 44761 9765 -20178 20210 -24624
14644 -24624 -10989 -5480 1561 -11718 -12254 -28838 -34892 -2852 37935 43585 20651 -37763 -46902
14631 -46902 22704 5992 -21886 -3882 10802 3395 10140 -26899 21649 117530 69176 -18492
14619 -18492 -35908 -29893 -38805 -32265 -33118 -64504 -38851 -8327 -14669 -12987 -25043 -75003 -64433
14606 -64433 -21027 -34943 -42293 -4401 5787 54874 40109 4158 25834 75768 47001 57916
14594 57916 28151 6603 19823 15537 10497 -11934 12586 24143 7109 -43085 7487 61451
14582 61451 27455 -23200 7209 -12095 -10589 56170 36652 -268 19602 46436 48376 23637
$$ packed form
14668H7107J6603P054m8938n2650L4768r205k6882l9246k3970j8102k232K7025
14656d8668L0085K9750l9555K3087k1214j6452N8958K8770l4996k9943M0388m4834
14644b4624J3635N509P041j3279n36j6584o054L2040M0787N650k2934n8414r139
14631d6902O9606j6712k7878J8004J4684p407O745l7039M8548R5881m8354q7668
14619a8492j7416O015q912O540q53l1386K5653L0524o342J682j2056m9960J0570
14606f4433M3406j3916p350L7892J0188M9087j4765l5951K1676M9934k8767J0915
14594E7916k9765k1548J3220m286n040k2431K4520J1557j7034n0194N0572N3964
14582F1451l3996n0655L0409j9304J506O6759j9518l6920J9870K6834J940k4739
$$ plain form
14570 23637 -35712 -104261 -70510 -91516 -76935 -24511 -5592 -45817 -72280 51917 107485
14559 107485 75702 32117 38805 70567 51128 24157 -50270 -45814 10374 45084 44340 20108
14547 20108 -50387 -57488 -35106 -25274 -18924 -31724 -45837 -55623 -75497 -115975 -71249 -69576 -46457
14534 -46457 -22196 -13936 31856 47893 44077 12533 -28529 -50126 -76598 -8194 -50435 -68893
14522 -68893 -35028 -59923 9370 78622 27863 662 16253 -5658 -27109 -12828 -14201 -35441
14510 -35441 -60779 -29219 15538 3416 -8218 9740 52443 49292 -47134 -81611 -59007 -42182
14498 -42182 -15256 -6663 -39829 25086 88617 65303 93074 83367 11018 -14547 -11108 70596
14486 70596 65313 -28130 -87857 -90324 -34717 38010 19402 37994 30714 -8370 10776 12081
$$ packed form
14570B3637n9349o8549L3751k1006J4581N2424J8919m0225k6463J24197N5568
14559A07485l1783m3585O688L1762j9439k6971p4427M456N6188L4710p44k4232
14547B0108p0495p101K2382R832O350j2800j4113r786j9874m0478M4726J673K3119
14534d6457K4261Q260M5792J6037l816l1544m1062k1597k6472O8404m2241j8458
14522f8893L3865k4895O9293O9252n0759k7201J5591k1911k1451J4281j373k1240
14510c5441k5338L1560M4757j2122j1634J7958M2703l151r6426l4477K2604J6825
14498d2182K6926Q593l3166O4915O3531k3314K7771r707p2349k5565L439Q1704
14486G0596n283r3443n9727k467N5607P2727j8608J8592p280l9084J9146J305
$$ plain form
14474 12081 11762 9884 11746 40165 69926 30184 -28158 -71317 -32215 -23622 -5803 -12961 -84004
14461 -84004 -39555 2091 -18278 -41705 -3286 70925 73164 72196 71984 61126 70349 54087 89415
14448 89415 85549 48822 9599 28388 303 -40037 -70292 -71629 -71505 -25573 -26760 4815 -6903
14435 -6903 -24013 -29980 -103973 -96537 -78021 -57570 -63800 -57938 -66681 -111528 -114161 -59794 28483
14422 28483 50095 -30023 -62458 -27490 15236 -13220 -1919 -11544 6930 -27904 22552 35534
14410 35534 -9300 -32501 -14236 -40058 -63952 -21219 16668 73690 38643 7561 -54134 -101388
14398 -101388 -68284 -43245 -14809 17271 -14751 -44692 12887 16792 56129 73269 111692 83799
14386 83799 38884 27457 33568 59455 63251 524 -40247 26903 13889 -64968 -62529 -64915
$$ packed form
14474A2081l19j878J862K8419K9761l9742n8342m3159L9102Q593J7819p158p1043
14461h4004M4449M1646k0369k3427L8419P4211K239r68k12j0858R223j6262L5328
14448H9415l866l6727l9223J8789k8085m0340l0255j337J24M5932j187L1575j1718
14435f903j7110n967p3993P436J8516K0451o230N862q743m4847k633N4367Q8277
14422B8483K1612q0118l2435L4968M2726k8456J1301r625J8474l4834N0456J2982
14410C5534m4834k3201J8265k5822k3894M2733L7887N7022l5047l1082o1695m7254
14398a01388L3104K5039K8436L2080l2022k9941N7579L905L9337J7140L8423k7893
14386H3799m4915j1427O111K5887L796o2727m0771O7150j3014p8857K439k386
$$ plain form
14374 -64915 7566 19798 -39612 -63257 -58130 -61062 -6883 60702 54598 69257 64107 11972
14362 11972 13851 -18150 14403 61353 16467 14801 56034 90096 31617 11288 -19840 -44979
14350 -44979 -63599 -34526 18308 15041 -10609 -46572 -25928 -11981 -106 56538 52464 51871
14338 51871 78926 87588 109269 52643 -4335 481 24511 38529 9018 -38951 -52370 -23161
14326 -23161 5082 5491 -15184 -18392 -11302 41143 20044 -1088 13694 72290 28774 -28055
14314 -28055 2003 46765 70009 32500 -21796 -38832 17843 19667 35280 -7013 -27967 -20670
14302 -20670 20824 22880 9819 11114 -10222 35726 -41465 -126569 -141657 -146681 -56775 -36183
14290 -36183 -46412 -21593 28376 4287 -3523 -35731 -49851 -55214 -35127 -29016 -10552 59623
$$ packed form
14374f4915P2481J2232n9410k3645N127k932N4179O7585o104J4659n150n2135
14362A1972J879l2001L2553M6950m4886j666M1233L4062n8479k0329l1128k5139
14350d4979j8620K9073N2834l267k5650l5963K0644J3947J1875N6644m074n93
14338E1871K7055Q662K1681n6626n6978M816K4030J4018k9511m7969j3419K9209
14326b3161K8243M09k0675l208P090N2445k1099k1132J4782N8596m3516n6829
14314b8055L0058M4762K3244l7509n4296j7036N6675J824J5613m2293k0954P297
14302b0670M1494K056j3061J295k1336M5948p7191q5104j5088n024Q9906K0592
14290c6183j0229K4819M9969k4089p810l2208j4120n363K0087O111J8464P0175
$$ plain form
14278 59623 19979 -14744 -105641 -112738 -123624 -118897 -92507 -72519 -108724 -136924 -51640 -67354
14266 -67354 -37259 -10342 -998 23654 77466 106972 61462 43858 84938 123012 105134 42038
14254 42038 22139 35796 27701 57750 78856 85074 9802 -16967 17676 3786 -38151 -28308
14242 -28308 -22614 -52851 -45892 -45119 -14029 -25833 -93800 -81172 -3473 7620 5296 -9724 35213
14229 35213 61719 -8859 -88703 -106301 -94287 -47443 -66779 -89580 -93701 -92490 -17090 -27690
14217 -27690 -92999 -57760 -35954 -29323 21117 -7665 -68690 -39737 -9018 -37663 -44137 7789
14205 7789 63162 68311 18485 -39963 -6369 30925 23660 7483 40476 23704 5346 9606
14193 9606 30224 -37619 -81608 -69924 -40210 -90475 -58376 -14420 -53113 -73459 -39329 -12590
$$ packed form
14278E9623l9644l4723r0897p097j0886M727K6390J9988l6205k8200Q5284j5714
14266f7354L0095K6917R344K4652N3812K9506m5510j7604M1080L8074j7878o3096
14254D2038j9899J3657q095L0049K1106O218p5272k6769L4643j3890m1937R843
14242b8308N694l0237O959P73L1090j1804o7967J2628P7699J1093k324j5020M4937
14229C5213K6506p0578p9844j7598J2014M6844j9336k2801m121J211P5400j0600
14217b7690o5309L5239K1806O631N0440k8782o1025K8953L0719k8645o474N1926
14205G789N5373N149m9826n8448L3594L7294p265j6177L2993j6772j8358M260
14193I606K0618o7843m3989J1684K9714n0265L2099M3956l8693k0346L4130K6739
$$ plain form
14181 -12590 -12223 -15111 -42134 -74301 -62845 -57518 -31313 9201 53437 48774 61900 51548 29056
14168 29056 -24128 -58431 -76961 -71027 -72513 -79343 -64895 -57280 -17109 21793 29254 -17090 -38717
14155 -38717 -61352 -108826 -36779 -1052 600 883 -69375 -127256 -62084 -38243 -54547 -36989
14143 -36989 -52215 -18159 24570 29198 -1163 -4204 -9475 23510 19952 55771 41453 24111
14131 24111 82224 112228 40368 -47119 -8490 19147 77835 100522 82437 43859 43940 -7532
14119 -7532 -25028 -34823 -41861 -41438 -62555 -17233 -5097 -26257 -70255 -45138 -46416 -56438 -42573
14106 -42573 -8321 13323 -10227 -3982 -7668 32525 73163 44699 15420 -34012 -45335 -86667
14094 -86667 -60564 23410 41923 49436 46927 17834 29487 46010 22027 -7322 -11189 -3914
$$ packed form
14181a2590L67k888k7023l2167J1456N327K6205M0514M4236m663J3126j0352k2492
14168B9056n3184l4303j8530N934j486o830J4448P615M0171L8902P461m6344k1627
14155c8717k2635m7474P2047L5727J652K83p0258n7881O5172K3841j6304J7558
14143c6989j5226L4056M2729M628l0361l041n271L2985l558L5819j4318j7342
14131B4111N8113L0004p1860q7487L8629K7637N8688K2687j8085l8578Q1n1472
14119g532j7496r795p038M23k1117M5322J2136k1160m3998K5117j278j0022J3865
14106d2573L4252K1644k3550O245l686M0193M0638k8464k9279m9432j1323m1332
14094h6667K6103Q3974J8513P513k509k9093J1653J6523k3983k9349l867P275
$$ plain form
14082 -3914 10047 -3063 -10271 -6364 -9114 -8855 -21062 -21588 11115 -1477 5499 -17935 -16129 -26419
14068 -26419 -33613 -39992 -47036 12709 -19292 -61707 -35311 -70693 -85316 -58672 -47540 -6339
14056 -6339 12153 15355 95426 114928 143366 128257 98594 53824 57334 132033 156785 111392
14044 111392 72261 -1633 -21967 17483 -7678 -32710 -93987 -70026 -27421 24284 52379
14033 52379 113830 118517 55541 43806 88874 29493 -14484 -15432 2290 -52534 -46460 -31208
14021 -31208 17617 47039 33398 35349 47445 -11069 -86264 -60161 21530 -4285 -87872 -77730
14009 -77730 5239 -9650 -62443 -32429 -30761 -30960 -22266 -48429 -54129 -53460 -61866 -65138 -141713
13996 -141713 -146892 -61533 -20387 -35165 -19161 9528 61801 54719 23299 -17601 -39576 -28182
$$ packed form
14082c914J3961j3110p208L907k750K59j2207n26L2703j2592O976k3434J806j0290
14068b6419p194o379p044N9745l2001m2415K6396l5382j4623K6644J1132M1201
14056f339J8492L202Q0071J9502K8438j5109k9663m4770L510P4699K4752m5393
14044A11392l9131p3894k0334L9450k5161k5032o1277K3961M2605N1705K8095
14033E2379O1451M687o2976j1735M5068n9381m3977r48J7722n4824O074J5252
14021c1208M8825K9422j3641J951J2096n8514p5195K6103Q1691k5815q3587J0142
14009g7730Q2969j4889n2793L0014J668j99Q694k6163n700O69q406l272p6575
13996a41713n179Q5359M1146j4778J6004K8689N2273p082l1420m0900k1975J1394
$$ plain form
13984 -28182 -20495 10668 20851 -31396 -33579 -7237 -860 26080 -5390 -57774 -95285 -23454
13972 -23454 18661 34687 72072 62806 56361 72099 110681 97881 24370 -9898 -30254 -78713
13960 -78713 -70274 -79310 -75980 -118317 -99480 -19052 -12528 -15255 -21066 -31065 -37256 -54700 -123904
13947 -123904 -124210 -108286 -84124 -54846 -3248 17268 -23121 -28097 -54090 -95469 -91783 -47521
13935 -47521 -30704 10685 48015 85522 84968 -12572 -17303 -22405 -29064 7329 23718 5205 -36336
13922 -36336 -75388 -27432 -30274 -8365 12906 -15061 12842 2372 1551 -16163 -16126 4192 39137
13909 39137 27049 -15196 -21236 -6985 -42709 -86103 -57255 -23893 -57405 -42950 -22823 5026
13897 5026 41152 -8588 -25750 83111 72776 47048 58071 25058 29245 3954 35915 -163
$$ packed form
13984b8182P687L1163J0183n2247k183K6342O377K6940l1470n2384l7511P1831
13972b3454M2115J6026L7385r266o445J5738L8582j2800p3511l4268k0356m8459
13960g8713Q439r036L330m2337J8837Q0428O524k727n811r999o191j7444o9204
13947a23904l06J5924K4162K9278N1598K0516m0389m976k5993m1379L686M4262
13935d7521J6817M1389L7330L7507n54r7540m731n102o659L6393J6389j8513m1541
13922c6336l9052M7956k842K1909K1271k7967K7903j0470q21j7714L7K0318L4945
13909C9137j2088m2245o040J4251l5724m3394K8848L3362l3512J4455K0127K7849
13897E026L6126m9740j7162J08861j0335k5728J1023l3013M187k5291L1961l6078
$$ plain form
13885 -163 1280 52317 78543 74261 30054 -42368 -53213 38890 20343 -35232 -17269 -23111 -317
13872 -317 -7372 -35964 -27501 -92831 -96256 -80085 -43119 -9333 4453 10157 -66600 -147480 -181000
13859 -181000 -111291 -49894 43831 85943 68982 53573 44996 37157 54050 37940 -8199 -27582
13847 -27582 -14817 2717 -3084 -9364 10731 30846 51729 100320 114218 84554 18643 -2052
13835 -2052 -7837 -1969 -70442 39258 55243 -22407 -36847 44220 49436 -79634 -143204 -72910
13823 -72910 -50944 -8400 -4660 -65974 -55055 23566 31824 92664 121482 66005 5900 -699
13811 -699 24848 3139 -89110 -64034 -10209 -36552 -64123 -92271 -104443 -61857 -40621 -99013
13799 -99013 -62596 -13765 7196 -41715 -46736 -16886 -6999 -33898 5572 32595 -13118 -16620
$$ packed form
13885a63J443N1037K6226m282m4207p2422j0845R2103j8547n5575J7963n842K2794
13872c17p055k8592Q463o5330l425J6171L6966L3786J3786N704p6757q0880l3520
13859a81000O9709O1397R3725M2112j6961j5409q577p839J6893j6110m6139j9383
13847b7582J2765J7534n801o280K0095K0115K0883M8591J3898k9664o5911k0695
13835b052n785N868o8473J09700J5985p7650j4440Q1067N216j29070o3570P0294
13823g2910K1966M2544L740o1314J0919P8621Q258O0840K8818n5477o0105o599
13811f99K5547k1709r2249K5076N3825k6343k7571k8148j2172M2586K1236n8392
13799i9013L6417M8831K0961m8911n021K9850R887k6899L9470K7023m5713l502
$$ plain form
13787 -16620 -8429 -53967 -47509 -10963 -58197 -37645 -8729 16081 30264 80653 78534 81325
13775 81325 29397 13866 2824 -37602 -64919 -80931 -103932 -145229 -130599 -82914 -19641 20752
13763 20752 41081 30906 32134 64361 55436 63599 38667 2627 22935 3219 -16815 48397
13751 48397 73425 42688 44307 51809 44695 39728 -39572 -95049 -73053 -22404 29667 38300 103284
13738 103284 109406 34426 17849 15541 30088 26657 68429 15838 -9502 -26096 -34630 -13523
13726 -13523 -36035 -5428 15368 -33645 -11982 -73551 -60058 -23740 -63158 -92417 -64342 -19130
13714 -19130 -14887 -29142 -20325 -70144 -78641 -55452 -38016 30707 32109 25609 97179 108550 86350
13701 86350 85555 62356 31236 29196 18657 -5669 -28657 -76616 -109387 -85753 -58838 -63891
$$ packed form
13787a6620Q191m5538O458L6546m7234K0552K8916K4810J4183N0389k119K791
13775H1325n1928j5531j1042m0426k7317j6012k3001m1297J4630M7685O3273M0393
13763B0752K0329j0175J228L2227q925Q163k4932l6040K0308j9716k0034O5212
13751D8397K5028l0737J619P502p114m967p9300n5477K1996N0649N2071Q633O4984
13738A03284O122p4980j6577k308J4547l431M1772n2591k5340j6594q534K1107
13726a3523k2512L0607K0796m9013K1663o1569J3493L6318l9418k9259K8075M5212
13714a9130M243j4255Q817m9819q497K3189J7436O8723J402o500P1570J1371k2200
13701H6350p95k3199l1120k040j0539k4326k2988m7959l2771K3634K6915n053
$$ plain form
13689 -63891 -92211 -66865 -21408 -35956 -33620 4272 -5904 42170 79469 23843 -29858 -51787
13677 -51787 -91257 -66410 -54970 -22981 7140 18524 -25538 -26686 -28384 -50922 -39647 -35445
13665 -35445 -44396 -88049 -62082 -73255 -125015 -101186 -86960 -17547 -12836 39973 70809 54265
13653 54265 7083 -8200 12207 9187 -6548 43608 30533 20336 44147 93857 157842 158379
13641 158379 145872 111774 -19912 -106067 -156837 -124242 -69896 -26956 52002 38176 16459
13630 16459 11750 -42182 -17419 -11541 -47372 -96953 -55084 -13702 -80327 -128764 -87348 -92424
13618 -92424 -129227 -94178 -78112 -9272 -7341 -1553 -65039 -63866 1750 7841 3257 21051 8126
13605 8126 50599 90220 131181 93266 46657 -11649 -48518 -30919 -35903 17062 54339 -5228
$$ packed form
13689f3891k8320K5346M5457j4548K336L7892j0176M8074L7299n5626n3701k1929
13677e1787l9470K4847J1440L1989L0121J1384m4062j148j698k2538J1275M202
13665c5445q951m3653K5967j1173n1760K3829J4226O9413M711N2809L0836j6544
13653E4265m7182j5283K0407l020j5735N0156j3075j0197K3811M9710O3985N37
13641A58379j2507l4098j31686q6155n0770L2595N4346M2940P8958j3826k1717
13630A6459m709n3932K4763N878l5831m9581M1869M1382o6625m8437M1416n076
13618i2424l6803L5049J6066O8840J931N788o3486J173O5616O091m584J7794j2925
13605H126M2473L9621M0961l7915m6609n8306l6869J7599m984N2965L7277n9567
$$ plain form
13593 -5228 -49337 -37659 -10399 80715 60054 4424 -56678 -64360 -55420 -38847 -29376 -28227 -48207
13580 -48207 -61062 -80919 -50339 -64381 -52162 9574 69754 100543 54166 34454 49323 -2179
13568 -2179 -4910 42507 42085 24901 49843 29075 -59702 -77218 -83795 -39198 10016 39215 36640
13555 36640 64693 33377 2428 -17675 -40142 -56465 -71933 -125371 -198736 -170729 -99702 -33626
13543 -33626 -17641 -3174 27121 -13052 -59102 1233 20665 28618 32260 66241 77071 61326
13531 61326 50446 40969 22661 -32693 -51402 -59533 -19269 7069 52712 118926 96880 56856
13519 56856 40876 -5137 11443 7352 -14656 -38544 -59074 -84198 -60191 -7631 -14631 -26967
13507 -26967 -18631 -15562 7294 -10102 2793 20585 39280 17878 55 33318 14236 -16092
$$ packed form
13593e228m4109J1678K7260R1114k0661n5630o1102p682Q940J6573R471J149j9980
13580d8207j2855j9857L0580j4042J2219O1736O0180L0789m6377j9712J4869n1502
13568b179k731M7417m22j7184K4942k0768q8777j7516o577M4597M9214K9199k575
13555C6640K8053l1316l0949k0103k2467j6323j5468n3438p3365K8007P1027O6076
13543c3626J5985J4467L0295m0173m6050O0335J9432P953L642L3981J0830j5745
13531F1326j0880r477j8308n5354j8709q131M0264K6338M5643O6214k2046m0024
13519E6856j5980m6013J6580m091k2008k3888k0530k5124K4007N2560p000j2336
13507b6967Q336L069K2856j7396J2895J7792J8695k1402j7823L3263j9082l0328
$$ plain form
13495 -16092 548 38341 11178 -19458 -33704 -13377 2259 -3058 -35835 -11323 47223 39559
13483 39559 -35082 -43063 -10366 -124462 -120424 -27631 -36909 -43081 -31110 -3957 -43700 -35846
13471 -35846 -27926 -20821 -17015 19764 -22732 10705 -43 -23470 -17049 -10808 -47818 -64892 -81298
13458 -81298 -108603 -49511 -28062 -9502 -31886 -39132 5354 -23630 3807 35904 56757 51776
13446 51776 74912 1444 -76577 -10024 32340 24503 57820 36414 -108898 -99964 -88868 -81461
13434 -81461 -49972 -49514 -11176 19497 -12593 -4494 39472 112409 143797 87897 14862 -10215
13422 -10215 -16976 29871 39970 33950 21738 704 4714 -12235 8679 44827 -16232 -64708
13410 -64708 -72846 13941 44642 51101 72191 82222 78680 46250 22564 49146 95073 57424
$$ packed form
13495a6092J6640L7793k7163l0636j4246K0327J5636n317l2777K4512N8546p664
13483C9559p4641p981L2697j14096M038R2793r278o172J1971K7153l9743P854
13471c5846P920P105L806L6779m2496L3437j0748k3427O421O241l7010j7074j6406
13458h1298k7305N9092K1449J8560k2384p246M4486k8984K7437L2097K0853m981
13446E1776K3136p3468p8021O6553M2364p837L3317k1406j45312Q934J1096P407
13434h1461L1489M58L8338L0673l2090Q099M3966P2937L1388n5900p3035k5077
13422a0215o761M6847J0099o020j2212k1034M010j6949K0914L6148o1059m8476
13410f4708q138Q6787L0701O459K1090J0031l542l2430k3686K6582M5927l7649
$$ plain form
13398 57424 4694 -39449 -3778 -20218 -381 41249 41028 49799 56335 37549 67375 17385
13386 17385 -67866 -62093 -27680 59531 80958 51596 41245 -8745 -24475 -26223 -25276 -9844
13374 -9844 -83333 -73182 -106895 -96853 5248 54814 91985 88785 83939 68993 53819 6703
13362 6703 -5438 -25687 -9013 -44189 -30660 4168 16235 21788 23391 50941 57852 49081 30399
13349 30399 -16327 5216 -14595 -17348 -11126 -38402 -28883 -56068 -82929 -52899 -28838 -39128
13337 -39128 -12704 -6425 -17420 -45224 -52847 -37459 864 22717 6430 42681 57741 43312
13325 43312 83886 57272 98 -51897 -28071 16070 8651 59500 77149 30508 -10215 21794
13313 21794 14779 15976 20877 24225 46939 -972 -11318 -1379 29494 19788 58428 59915 15984
$$ packed form
13398E7424n2730m4143L5671j6440J9837M1630k21Q771O536j8786K9826m9990
13386A7385q5251N773L4413Q7211K1427k9362j0351m9990j5730j748R47J5432
13374i844p3489J0151l3713J0042J02101M9566L7171l200m846j4946j5174m7116
13362F703j2141k0249J6674l5176J3529L4828J2067N553J603K7550O911q771j8682
13349C0399m6726K1543j9811k753O222k7276R519k7185k6861L0030K4061j0290
13337c9128K6424O279j0995k7804p623J5388L8323K1853j6287L6251J5060j4429
13325D3312M0574k6614n7174n1995K3826M4141p419N0849J7649m6641m0723L2009
13313B1794p015J197M901L348K2714m7911j0346R939L0873r706L8640J487m3931
$$ plain form
13300 15984 43469 36200 19662 3566 -6656 27158 48177 6370 -39913 -27858 32802 -6518
13288 -6518 -21848 -12805 13070 27037 423 -37217 15383 18959 42518 27896 -9211 -16733
13276 -16733 -10489 -19455 -24406 -15337 -52777 -62853 7392 34733 21485 49079 121419 141570
13264 141570 119036 72690 6389 -4693 18453 43847 102281 60963 -26693 -5108 -738 27418
13252 27418 16554 2893 24948 98022 102706 88676 97518 37898 -29168 -72393 -34812 20416
13240 20416 29958 15664 75957 103584 140525 118609 94279 168933 244567 254932 233324 268201
13228 268201 280464 300463 296793 250105 306136 277140 250214 265208 304039 354750 367920 394851
13216 394851 503218 611939 687009 864259 1025883 1159983 1232783 1253652 1293778 1298057 1169872
$$ packed form
13300A5984K7485p269j6538j6096j0222L3814K1019m1807m6283J2055O0660l9320
13288f518j5330R043K5875J3967k6614l7640N2600L576K3559j4622l7107p522
13276a6733O244q966m951R069l7440j0076P0245K7341j3248K7594P2340K0151
13264A41570k2534m6346o6301j1082K3146K5394N8434m1318q7656K1585M370K8156
13252B7418j0864j3661K2055P3074M684j4030Q842n9620o7066m3225L7581N5228
13240B0416R542j4294O0293K7627L6941k1916k4330P4654P5634J0365k1608L4877
13228B68201J2263J9999l670m6688N6031k8996k6926J4994L8831N0711J3170K6931
13216C94851J08367J08721P5070J77250J61624J34100P2800K0869M0126M279j28185
$$ plain form
13205 1169872 974188 714013 491448 348740 277991 226478 172157 92042 34079 13206
13195 13206 30558 40172 75853 90837 112796 124255 106897 95307 78228 90474 112663 137269
13183 137269 109192 95857 140153 170270 176288 118675 148620 97669 -18899 -18596 105360 123659
13171 123659 39524 64742 116752 85783 117927 124276 21485 12606 10981 -41026 -27773 37376
13159 37376 6311 12740 15603 -29107 10326 75921 119561 122809 93674 84680 39927 -8753
13147 -8753 37243 118540 150179 160988 157626 175547 95747 71999 85701 65697 72606 108036
13135 108036 111227 60592 40412 22285 -4040 -47254 -41749 -7289 -17124 -19671 -8025 -14692
13123 -14692 16507 69783 106537 81853 -7704 32550 60771 89878 74251 74551 68993 73390
$$ packed form
13205A169872j95684k60175k22565j42708p0749n1513n4321q0115n7963k0873
13195A3206J7352R614L5681J4984K1959J1459j7358j1590j7079J2246K2189K4606
13183A37269k8077j3335M4296L0117O018n7613K9945n0951j16568L03J23956J8299
13171A23659q4135K5218N2010l0969L2144O349j02791q879j625n2007J3253O5149
13159C7376l1065O429K863m4710L9433O5595M3640L248k9135q994m4753m8680
13147h753M5996Q1297L1639J0809l362J7921p9800k3748J3702k0004O909L5430
13135A08036L191n0635k0180j8127k6325m3214N505L4460r835k547J1646o667
13123a4692L1199N3276L6754k4684q9557M0254K8221K9107j5627L00n558M397
$$ plain form
13111 73390 19885 8787 -14714 16655 71806 70811 116962 101945 127331 168937 99295 34849
13099 34849 59611 44864 28430 51851 61671 129879 122859 111251 25036 -21413 -39473 -25179
13087 -25179 -53813 -75875 -47299 -22852 2654 62648 64899 51965 41827 36954 45422 42472
13075 42472 77352 -3630 -19936 -59790 -107601 -69301 -13069 21402 48935 52980 56563 102104
13063 102104 85680 72814 49065 32042 5978 -7559 34670 25852 18476 -24170 -56775 5038
13051 5038 27472 10825 42174 50262 65611 36372 -27405 -29713 -23817 -31603 -18046 37798 73093
13038 73093 -5307 3166 36399 4757 -3072 -47801 -72504 -78682 -25873 27305 75392 98567
13026 98567 48826 34167 66858 65173 49565 77624 132936 189873 218832 199736 209347 231794
$$ packed form
13111G3390n3505j1098k3501L1369N5151r95M6151j5017K5386M1606o9642o4446
13099C4849K4762j4747j6434K3421R820O8208p020j1608q6215m6449j8060J4294
13087b5179k8634k2062K8576K4447K5506N9994K251j2934j0138m873Q468k950
13075D2472L4880q0982j6306l9854m7811L8300N6232L4471K7533M045L583M5541
13063A02104j6424j2866k3749j7023k6064j3537M2229q818p376m2646l2605O1813
13051E038K2434j6647L1349Q088J5349k9239o3777k308N896p786J3557N5844L5295
13038G3093p8400Q473L3233l1642p829m4729k4703o178N2809N3178M8087K3175
13026I8567m9741j4659L2691j685j5608K8059N5312N6937K8959j9096R611K2447
$$ plain form
13014 231794 226327 256526 342629 412054 400122 372878 375449 261677 214648 249601 193628 127014
13002 127014 106302 75588 98207 110178 106498 86971 96162 20032 -13422 -36021 -15795 -12675
12990 -12675 4515 36365 64503 86017 134637 115921 98100 126397 172530 173839 159953 132617
12978 132617 137438 197558 172039 133143 134116 109984 96872 80713 69860 70035 59155 75485
12966 75485 127034 123257 166763 176344 220831 207633 193267 206911 217504 226096 276026 276479 226795
12953 226795 256520 246563 200169 234399 322994 377161 429394 450895 415290 418514 390043 345129
12941 345129 225247 151464 158987 142091 110334 135224 150256 148181 95042 91788 165044 224665
12929 224665 259927 277959 256641 296515 301959 243708 235154 300630 351512 403018 350479 319829
$$ packed form
13014B31794n467L0199Q6103O9425j1932k7244K571j13772m7029L4953n5973o6614
13002A27014k0712l0714K2619J1971l680j9527R191p6130l3454k2599K0226L120
12990a2675J7190L1850K8138K1514M8620j8716j7821K8297M6133J309j3886k7336
12978A32617M821O0120k5519l8896R73k4132j3112j6159j0853J75j0880J6330
12966G5485N1549l777M3506R581M4487j3198j4366J3644J0593Q592M9930M53m9684
12953B26795K9725r957m6394L4230Q8595N4167N2233K1501l5605L224k8471m4914
12941C45129j19882p3783P523j6896l1757K4890J5032k075n3139l254P3256N9621
12929B24665L5262J8032k1318L9874N444n8251q554O5476N0882N1506n2539l0650
$$ plain form
12917 319829 363869 461129 579911 727661 822960 894336 975308 908015 885861 834902 763886
12906 763886 623596 500291 397884 389312 333197 342473 326939 253310 261734 256064 228614 260671
12894 260671 325218 315899 333778 311305 322383 358402 341581 332275 406423 440451 495286 499656
12882 499656 444580 448096 444676 417589 426177 422403 430536 422738 398881 378439 388840 400418 460097
12869 460097 479882 504511 475027 486438 496382 527446 505816 527377 562884 568550 553216 534688
12857 534688 574926 591807 593287 556294 504352 525986 623252 628078 611915 606137 605022 649102
12845 649102 778768 832960 844124 906470 913571 923084 945610 986116 985775 965133 1028248 1091664
12833 1091664 1117882 1195240 1289224 1337415 1345999 1406815 1533913 1630846 1670254 1692502 1723917
$$ packed form
12917C19829M4040R7260J18782J47750R5299P1376Q0972o7293k2154n0959p1016
12906G63886j40290j23305j02407q572n6115R276j5534p3629Q424n670k7450L2057
12894B60671O4547r319J7879k2473J1078L6019j6821r306P4148L4028N4835M370
12882D99656n5076L516l420k7087Q588l774Q133p798k3857k0442J0401J1578N9679
12869D60097J9785K4629k9484J1411R944L1064k1630K1561L5507N666j5334j8528
12857E34688M0238J6881J480l6993n1942K1634R7266M826j6163n778j115M4080
12845F49102J29666N4192J1164O2346P101R513K2526M0506l41k0642O3115O3416
12833A091664K6218P7358R3984M8191Q584O0816J27098R6933L9408K2248L1415
$$ plain form
12822 1723917 1734994 1793921 1811990 1833226 1882368 1962548 2085565 2230262 2307285 2387179 2460256
12811 2460256 2633657 2798592 2937693 3045280 3181749 3304094 3414783 3594075 3857414
12802 3857414 4130525 4389350 4628864 4910970 5189056 5558714 5989883 6498352 6920144
12793 6920144 7426711 8140815 8919980 9737140 10629821 11580823 12521712 13546080 14615966
12784 14615966 15731234 16949648 18374513 20001044 21891273 24219208 27150049 30903423
12776 30903423 35496280 40651582 45645887 50161608 53945412 56817375 58574295 59652624
12768 59652624 60719227 62267619 64859077 69381800 77409201 91298764 113622958 144808467
12760 144808467 180723533 212343886 232257953 242680605 251216244 259247559 253889459
$$ packed form
12822A723917J1077N8927J8069K1236M9142Q0180J23017J44697P7023P9894P3077
12811B460256J73401J64935J39101J07587J36469J22345J10689J79292K63339
12802C857414K73111K58825K39514K82106K78086L69658M31169N08469M21792
12793F920144N06567P14104P79165Q17160Q92681R51002R40889J024368J069886
12784A4615966J115268J218414J424865J626531J890229K327935K930841L753374
12776C0903423M592857N155302M994305M515721L783804K871963J756920J078329
12768E9652624J066603J548392K591458M522723Q027401J3889563K2324194L1185509
12760A44808467L5915066L1620353J9914067J0422652Q535639Q031315n358100
$$ plain form
12753 253889459 217092934 157133196 104056103 70793769 51873916 40516274 33203821
12746 33203821 28238221 24683490 21910218 19738822 18051384 16519714 15119314 13776645
12738 13776645 12466752 11387539 10397894 9642966 9031652 8575693 8209352 7940721 7559322
12729 7559322 7172694 6878145 6620552 6421595 6152845 5847230 5590418 5353771 5174631
12720 5174631 5055290 4899218 4739702 4677576 4678840 4620347 4547417 4439141 4257871 4158384
12710 4158384 4125818 3970877 3733136 3441001 3218714 3080892 2953512 2805464 2779164 2723634
12700 2723634 2658902 2599451 2452046 2375633 2300935 2117195 1967532 1870316 1725835 1682605
12690 1682605 1640168 1573932 1538286 1530356 1522830 1469260 1479433 1421301 1338606 1322802 1282143 1256531
$$ packed form
12753B53889459l6796525n9959738n3077093l3262334j8919853j1357642p312453
12746C3203821m965600l554731k773272k171396j687438j531670j400400j342669
12738A3776645j309893j079213r89645p54928o11314m55959l66341k68631l81399
12729G559322l86628k94549k57593j98957k68750l05615k56812k36647j79140
12720E174631j19341j56072j59516o2126J264n8493p2930j08276j81270r9487
12710D158384l2566j54941k37741k92135k22287j37822j27380j48048k6300n5530
12700B723634o4732n9451j47405p6413p4698j83740j49663r7216j44481m3230
12690A682605m2437o6236l5646p930p526n3570J0173n8132q2695j5804m0659k5612
$$ plain form
12678 1256531 1268675 1275846 1277514 1246574 1162771 1161791 1102587 1038792 957591 934216 959075 970752
12666 970752 928657 905727 914233 870243 818248 815039 860945 820332 774492 700427 691055 735288
12654 735288 790065 793974 762129 782410 741909 776593 758151 748507 749140 736301 690168 614994
12642 614994 576717 538987 501533 439402 459239 444354 411616 366200 352340 359577 390007 410934
12630 410934 436424 477738 486378 477359 473430 434866 442935 457788 439476 444270 473282 475006 450077
12617 450077 412798 351834 345616 325567 308481 345007 324663 382829 421374 389471 338496 321131
12605 321131 350176 318338 323781 296925 232214 162317 153589 257034 258353 261042 288228 311777
12593 311777 307591 267929 208380 202021 210634 199164 188299 215331 223072 211561 115869 113897
$$ packed form
12678A256531J2144P171J668l0940q3803r80n9204o3795q1201k3375K4859J1677
12666I70752m2095k2930Q506m3990n1995l209M5906m0613m5840p4065r372M4233
12654G35288N4777L909l1845K0281m0501L4684j8442r644O33j2839m6133p5174
12642F14994l8277l7730l7454o2131J9837j4885l2738m5416j3860P237L0430K0927
12630D10934K5490M1314Q640r019l929l8564Q069J4853j8312M794K9012J724k4929
12617D50077l7279o0964o218k0049j7086L6526k0344N8166L8545l1903n0975j7365
12605C21131K9045l1838N443k6856o4711o9897q728J03445J319K689K7186K3549
12593C11777m186l9662n9549o359Q613j1470j0865K7032P741j1511r5692j972
$$ plain form
12581 113897 194110 213925 168082 172062 137762 136644 121889 92428 23598 -44313 -84862 -72355
12569 -72355 -108630 -128777 -226883 -307094 -289191 -184016 -103156 -114559 -97430 -68081 -45619
12558 -45619 -13131 7432 31704 20511 6979 -11277 -86917 -9989 67217 28176 25820 42320
12546 42320 38778 53190 109462 160594 176167 181143 162579 113297 90550 8725 -45906 -50725
12534 -50725 4255 50140 -3508 -18376 -38122 -54363 11469 59328 60519 30853 38037 62370
12522 62370 67516 41300 54935 19395 10071 13117 -752 -43337 -76051 -69600 -4926 80675
12510 80675 133620 108731 101108 98739 132031 118573 85852 92928 138024 129318 70553 47837
12498 47837 -202 -64765 -69738 -29448 41291 33359 66418 101047 110918 80418 70592 95972
$$ packed form
12581A13897Q0213J9815m5843L980l4300j118j4755k9461o8830o7911m0549J2507
12569g2355l6275k0147r8106q0211J7903J05175Q0860j1403J7129K9349K2462
12558d5619L2488K0563K4272j1193j3532j8256p5640P6928P7206l9041k356J6500
12546D2320l542J4412N6272N1132J5573M976j8564m9282k2747q1825n4631m819
12534e0725N4980M5885n3648j4868j9746j6241O5832M7859J191k9666P184K4333
12522F2370N146k6216J3635l5540r324L046j3869m2585l2714O451O4674Q5601
12510H0675N2945k4889p623k369L3292j3458l2721P076M5096q706n8765k2716
12498D7837m8039o4563m973M0290P0739p932L3059L4629R871l0500r826K5380
$$ plain form
12486 95972 119022 80647 80036 35231 12683 37827 32606 24527 82220 136519 113279 114968 138600
12473 138600 114358 63818 28363 59625 74511 110936 162042 136967 108383 76404 25824
12462 25824 35331 11840 3501 -26473 -3762 46672 34887 56457 83950 68850 26480 -18205
12450 -18205 -77608 -113339 -100164 -57667 -17685 11758 -4170 3797 48642 94911 99714 77098
12438 77098 61922 47012 64369 99910 88780 78220 123215 91822 69628 58034 24914 49631
12426 49631 62330 -27108 -39509 -31775 -29276 1896 7549 -26179 -18455 -58187 18093 92561
12414 92561 116974 87518 -13450 -2849 47001 95615 124716 113075 120882 91627 67020 69111
12402 69111 59950 35723 52569 50345 14837 24273 9113 25235 77216 50833 20330 84966
$$ packed form
12486I5972K3050l8375o11m4805k2548K5144n221q079N7693N4299k3240J689K3632
12473A38600k4242n0540l5455L1262J4886L6425N1106k5075k8584l1979n0580
12462B5824R507k3491q339k9974K2711N0434j1785K1570K7493j5100m2370m4685
12450a8205n9403l5731J3175M2497L9982K9443j5928P967M4845M6269M803k2616
12438G7098j5176j4910J7357L5541j1130j0560M4995l1393k2194j1594l3120K4717
12426D9631J2699q9438j2401P734K499L1172N653l3728P724l9732P6280P4468
12414I2561K4413k9456j00968J0601M9850M8614K9101j1641P807k9255k4607K091
12402F9111r161k4227J6846k224l5508R436j5160J6122N1981k6383l0503O4636
$$ plain form
12390 84966 71662 19014 6582 60922 88769 86690 86446 78136 89578 51147 -16592 -82098
12378 -82098 -58820 3083 67486 49790 4863 -3801 18141 4244 -67079 -103319 -109155 -85821
12366 -85821 -40418 8388 44322 102439 84888 55172 816 -15225 31276 32226 49279 27450
12354 27450 -11155 -14906 28504 15529 15499 40783 59800 27109 7924 33907 96964 95962 84862
12341 84862 35765 36116 -802 32549 10604 -27401 -16398 11929 17500 39159 44068 114665
12329 114665 99531 52599 76902 81575 71649 65081 73404 92089 108706 139005 152863 174011
12317 174011 145595 146696 214075 287051 331381 340870 320935 270713 290908 342198 349545 424220
12305 424220 486326 462129 529665 584060 686479 834171 1020331 1184887 1257251 1306401 1330389
$$ packed form
12390H4966j3304n2648j2432N4340K7847k079k44q310J1442l8431o7739o5506
12378h2098K3278O1903O4403j7696m4927q664K1942j3897p1323l6240n836K3334
12366h5821M5403M8806L5934N8117j7551k9716n4356j6041M6501R50J7053k1829
12354B7450l8605l751M3410j2975l0K5284J9017l2691j9185K5983O3057j002j1100
12341H4862m9097L51l6918L3351k1945l8005J1003K8327N571K1659M909P0597
12329A14665j5134m6932K4303M673r926o568Q323J8685J6617L0299J3858K1148
12317A74011k8416J101O7379P2976M4330R489j9935n0222K0195N1290P347P4675
12305D24220O2106k4197O7536N4395J02419J47692J86160J64556P2364M9150K3988
$$ plain form
12294 1330389 1373254 1205145 911750 630955 420718 305343 257636 221471 146438 157591
12284 157591 169846 167687 193085 176769 209657 205807 77334 -1610 -19189 971 49431 49846
12272 49846 75564 51523 3818 17455 83696 99268 87254 146213 96064 -5131 -32374
12261 -32374 -15930 27880 13684 1708 -24696 -70598 -109649 -82535 -37124 -27923 -50643 -11375
12249 -11375 11619 1290 -40384 -38510 -5586 10383 29731 84983 115633 91839 52380 55300
12237 55300 56212 68026 42762 32436 25484 -15413 -5417 1448 2293 -53051 -60265 -15388 23158
12224 23158 -18291 -493 5483 53229 13199 -69652 -43576 -43817 -94554 -20613 -10187 39149
12212 39149 45413 22808 30078 32907 30721 37089 56372 62582 59445 38772 -18997 -3277 36296
$$ packed form
12294A330389M2865j68109k93395k80795k10237j15375m7707l6165p5033J1153
12284A57591J2255k159K5398j6316L2888l850j28473p8944j7579K0160M8460M15
12272D9846K5718k4041m7705J3637O6241J5572j2014N8959n0149j01195k7243
12261c2374J6444M3810j4196j1976k6404m5902l9051K7114M5411R201k2720L9268
12249a1375K2994j0329m1674J874L2924J5969J9348N5252L0650k3794l9459K920
12237E5300R12J1814k5264j0326o952m0897R996O865Q45n5344p214M4877L8546
12224B3158m1449J7798N976M7746m0030q2851K6076k41n0737P3941J0426M9336
12212C9149O264k2605P270K829k186O368J9283O210l137k0673n7769J5720L9573
$$ plain form
12199 36296 70148 90107 127622 146510 140077 143017 94597 23536 -30791 2909 26171 8604
12187 8604 -35643 -46258 22647 37881 5957 -10267 5697 36720 -23700 -47534 -13000 23064
12175 23064 -1003 -17910 2761 -3680 -48413 -87867 -66107 -48944 -23744 -18810 432 49751
12163 49751 49716 28137 656 -4951 -12689 13035 -44961 -13140 35380 60808 35071 43415 40303
12150 40303 42216 31966 37610 46627 54565 20695 16749 -21956 -60373 -42742 -48249 39723 95134
12137 95134 86407 62362 52890 50287 -10784 -34610 -59046 -76190 -64352 -48804 -11288 16379
12125 16379 -1535 -43160 39023 88324 63047 40850 -5170 17406 63121 22054 24800 -24652
12113 -24652 -32033 2695 4949 -44766 -9817 27290 60010 92746 90809 52323 62970 18349
$$ packed form
12199C6296L3852J9959L7515J8888o433K940m8420p1061n4327L3700K3262j7567
12187H604m4247j0615O8905J5234l1924j6224J5964L1023o0420k3834L4534L6064
12175B3064k4067j6907K0671o441m4733l9454K1760J7163K5200M934J9242M9319
12163D9751l5k1579k7481n607p738K5724n7996L1821M8520K5428k5737Q344l112
12150D0303J913j0250N644R017P938l3870l946l8705l8417J7631n507Q7972N5411
12137I5134q727k4045r472k603o1071k3826k4436j7144J1838J5548L7516K7667
12125A6379j7914m1625Q2183M9301k5277k2197m6020K2576M5715m1067K746m9452
12113b4652p381L4728K254m9715L4949L7107L2720L2736j937l8486J0647m4621
$$ plain form
12101 18349 -8473 1391 -57121 -66648 -9410 -44058 -70999 -120895 -73701 23515 23791 -13696
12089 -13696 -15146 -42152 -74470 -26944 -35035 -103260 -62340 -54786 -68577 -69755 -65243 -22434 20615
12076 20615 38018 69488 90760 43587 -9476 2330 481 -17683 -831 -6734 -18013 -13374
12064 -13374 -19498 -25566 -866 44904 32760 38829 58436 86328 74908 88514 132247 140348
12052 140348 145240 56805 -5325 21567 -15842 1122 63484 97649 83600 60788 91456 69226
12040 69226 66968 99790 145742 97936 37135 -5806 2702 15766 -3576 39308 43737 27551
12028 27551 22443 45192 59499 24002 45286 66270 56217 47562 33353 3833 52040 116162
12016 116162 151774 165202 134458 116426 110213 89990 35176 3131 20382 62265 110200 122402
$$ packed form
12101A8349k6822R864n8512r527N7238l4648k6941m9896M7194R7216K76l7487
12089a3696j450k7006l2318M7526q091o8225M0920P554j3791j178M512M2809M3049
12076B0615J7403L1470K1272m7173n3063J1806j849j8164J6852n903j1279M639
12064a3374o124o068K4700M5770j2144O069J9607K7892j1420J3606M3733Q101
12052A40348M892q8435o2130K6892l7409J6964O2362L4165j4049k2812L0668k2230
12040F9226k258L2822M5952m7806o0801m2941Q508J3064j9342M2884M429j6186
12028B7551n108K2749J4307l5497K1284K0984j0053q655j4209k9520M8207O4122
12016A16162L5612J3428l0744j8032o213k0223n4814l2045J7251M1883M7935J2202
$$ plain form
12004 122402 90650 53355 65964 70600 89617 59857 2067 -1247 30588 84195 69564 92692
11992 92692 159038 113008 56577 50013 26481 38924 9172 -13631 35382 35069 7665 31399
11980 31399 11749 23192 48217 62763 56278 -11413 6779 -17140 16209 62094 48162 20588
11968 20588 63279 66386 95651 143763 121997 57263 30617 -9651 -8079 25311 39938 -6221
11956 -6221 13651 66354 56696 -1904 -2830 2533 41281 42186 19207 -10369 -16324 21654 68692
11943 68692 57839 -27235 39465 19857 -10995 42713 110905 140557 112500 124063 108909 77881
11931 77881 64314 32134 -26582 -53150 -77966 -49466 -34470 31524 -8709 -47025 -52622 -56482
11919 -56482 -36140 -14475 43047 114882 93047 38183 -23656 -2190 75382 43909 -2692 2716
$$ packed form
12004A22402l1752l7295J2609M636J9017k9760n7790l314L1835N3607j4631K3128
11992I2692O6346m6030n6431o564k3532J2443k9752k2803M9013l13k7404K3734
11980C1399j9650J1443K5025J4546o485o7691J8192k3919L3349M5885j3932k7574
11968B0588M2691L107K9265M8112k1766o4734k6646m0268J572L3390J4627m6159
11956f221J9872N2703r658n8600r26N363L8748R05k2979k9576n955L7978M7038
11943F8692j0853q5074O6700j9608l0852N3708O8192K9652k8057J1563j5154l1028
11931G7881j3567l2180n8716k6568k4816K8500J4996O5994m0233l8316n597l860
11919e6482K0342K1665N7522P1835k1835n4864o1839K1466P7572l1473m6601N408
$$ plain form
11907 2716 2484 -8694 35987 2010 -33632 11940 54619 -5564 -27029 -68981 -90337 -76937
11895 -76937 -59631 -104134 -57589 -25455 -18656 7986 26094 38860 94681 82539 25156 21064
11883 21064 17588 -56064 -41834 -34475 -100052 -93803 -60514 -32365 -57855 -55646 -74280 -30384
11871 -30384 -66914 -100741 -73783 -94666 -74536 -67504 -80792 -100750 -123219 -69139 -13336 32991
11859 32991 -2760 20030 72460 55332 -12996 -7404 -43087 -76446 -97099 -89155 -44299 -39518
11847 -39518 -48878 -8107 -648 -5105 -2721 -11708 11662 3806 -10083 -9878 2387 30768 96046
11834 96046 122258 143920 121579 59166 9293 23569 69973 80222 19243 11029 24635 22872
11822 22872 7470 20885 60853 84017 53921 6443 -11625 42631 92327 110092 89255 44657
$$ packed form
11907B716k32j1178M4681l3977l5642M5572M2679o0183k1465m1952k1356J3400
11895g6937J7306m4503M6545L2134O799K6642J8108J2766N5821j2142n7383m092
11883B1064l476p3652J4230P359o5577O249L3289K8149k5490K209j8634M3896
11871c0384l6530l3827K6958k0883K0130P032j3288j9958k2469N4080N5803M6327
11859C2991l5751K2790N2430j7128o8328N592l5683l3359k0653P944M4856M781
11847c9518r360M0771P459m457K384q987K3370p856j3889K05J2265K8381O5278
11834I6046K6212K1662k2341o2413m9873J4276M6404J0249o0979q214J3606j763
11822B2872j5402J3415L9968K3164l0096m7478j8068N4256M9696J7765k0837m4598
$$ plain form
11810 44657 41497 70591 10495 -34531 -4176 16002 34270 43683 46992 85465 63614 25545
11798 25545 -30070 -9381 12703 10430 -6037 -42899 -3090 46953 68679 70868 69669 35778
11786 35778 3542 23095 6170 -11493 -54449 -45852 -43856 -48187 -11638 15754 -5835 -10193
11774 -10193 23945 24530 -23679 -47529 -17990 26283 26424 66113 66558 71883 91803 61930 54318
11761 54318 26864 -36653 -108979 -127395 -21688 70980 39492 6195 58739 48477 17201
11750 17201 -36849 -52403 -20218 -32757 11932 -30240 -66855 -36851 -35621 -29007 -33179 -60710
11738 -60710 -84510 -28279 2856 -9570 11700 834 -22318 -17431 73248 101068 80767 50894
11726 50894 38681 89707 34310 -43970 -65608 -53167 -46006 -39560 -39198 11272 56356 81935
$$ packed form
11810D4657l160K9094o0096m5026L0355K0178J8268R413L309L8473k1851l8069
11798B5545n5615K0689K2084k273j6467l6862L9809N0043K1726K189j199l3891
11786C5778l2236J9553j6925j7663m2956Q597J996m331L6549K7392k1589m358
11774a0193L4138N85m8209k3850K9539M4273J41L9689M45N325J9920k9873p612
11761E4318k7454o3517p2326j8416J05707R2668l1488l3297N2544j0262l1276
11750A7201n4050j5554L2185j2539M4689m2172l6615L0004J230O614m172k7531
11738f0710k3800N6231L1135j2426K1270j0866k3152M887R0679K7820k0301k9873
11726E0894j2213N1026n5397p8280k1638J2441P161O446L62N0470M5084K5579
$$ plain form
11714 81935 100881 103519 21583 -36445 -73045 -73089 -68396 -44409 2032 -2652 3500 -11755 -18183
11701 -18183 -3320 -7070 -5868 -33215 32682 49714 5353 -3989 6011 53299 60864 -1537
11689 -1537 -18772 -30096 -55487 14914 67870 94273 78613 48299 99371 124985 83133 37276
11677 37276 6497 -15543 -1939 -24908 -68788 -55624 22052 78730 35475 -5377 70953 60199
11665 60199 -30805 -122679 -97334 -30140 -38796 -11938 20855 -2599 -19516 -13039 19960 255
11653 255 -28189 -15044 22407 27222 -11822 22883 64952 67674 26356 1016 -49490 -79144
11641 -79144 -27457 -2945 24660 46627 69740 87445 47862 11945 6838 23429 314 -24197
11629 -24197 -47191 -67647 -86070 -100252 -63280 -79065 -34802 28748 23387 -17208 -49289 -16760
$$ packed form
11714H1935J8946K638q1936n8028l6600m4M693K3987M6441m684O152j5255o428
11701a8183J4863l750J202k7347O5897J7032m4361r342J0000M7288P565o2401
11689a537j7235j1324k5391P0401N2956K6403j5660l0314N1072K5614m1852m5857
11677C7276l0779k2040J3604k2969m3880J3164P7676N6678m3255m0852P6330j0754
11665F0199r1004r1874K5345O7194q656K6858L2793k3454j6917O477L2999j9705
11653B55k8444J3145L7451M815l9044L4705M2069K722m1318k5340n0506k9654
11641g9144N1687K4512K7605K1967K3113J7705l9583l5917n107J6591k3115k4511
11629b4197k2994k0456j8423j4182L6972j5785M4263O3550n361m0595l2081L2529
$$ plain form
11617 -16760 -54121 -23433 -7734 -543 -54201 -63105 -92914 -74606 -41990 -17080 -631 42728
11605 42728 22145 4009 77474 117247 67524 44409 67579 88779 80364 94182 120289 143548
11593 143548 139055 91827 64437 28234 13947 1086 -47918 5236 33330 4272 -43397 -82396
11581 -82396 -23990 -6217 6080 28143 -50815 -82785 -56112 -16072 -21073 -51329 -32273 -20187
11569 -20187 -33391 -47193 -11461 19407 46714 32897 31740 40466 18097 -6846 -30068 -62672
11557 -62672 -64367 -66291 -11205 31872 43588 18250 11545 56114 55817 27106 -7588 24783 2277
11544 2277 -12793 21613 7732 -865 -302 6377 -16994 -90562 -26193 -4268 35831 4694 -64651
11531 -64651 -17931 21075 -12605 -77005 -65279 -119113 -131164 -48451 -27723 44940 41079 14614
$$ packed form
11617a6760l7361L0688J5699P191n3658q904k9809J8308L2616K4910J6449M3359
11605D2728k0583j8136P3465L9773m9723k3115K3170K1200q415J3818K6107K3259
11593A43548m493m7228k7390l6203j4287j2861m9004N3154K8094k9058m7669l8999
11581h2396N8406J7773J2297K2063p8958l1970K6673M0040n001l0256J9056J2086
11569b0187j3204j3802L5732L0868K7307j3817j157Q726k2369k4943k3222l2604
11557f2672j695j924N5086M3077J1716k5338o705M4569k97k8711l4694L2371k2506
11544B277j5070L4406j3881q597N63O679k3371p3568O4369K1925M0099l1137o9345
11531f4651M6720L9006l3680o4400J1726n3834j2051Q2713K0728P2663l861k6465
$$ plain form
11519 14614 6731 -19110 -29336 -47658 -48370 -50176 -71055 -52453 -118896 -129449 -79789 -40495
11507 -40495 -3044 61942 33403 36230 -3482 -35331 3689 56581 110398 79363 36598 34707
11495 34707 41274 29257 -32567 1165 51312 86121 92413 97306 51952 42560 5893 -22290
11483 -22290 -69371 -70575 -33624 -13531 12298 48 6293 -30151 -1518 16238 10322 43678
11471 43678 109293 100340 53246 15919 -26288 -63273 -83416 -54629 -6484 -6838 -33382 -16120
11459 -16120 -26711 -35107 -41924 -58593 -117855 -119352 -46763 25711 18424 13845 -10777 -22268 -47992
11446 -47992 -38514 -4457 -23161 -59859 -57728 -3557 -11400 20292 -7594 -35824 -106723 -118893
11434 -118893 -18874 51274 50106 -8735 11728 -18238 16496 59921 60334 30482 -5471 -8911
$$ packed form
11519A4614p883k5841j0226j8322p12j806k0879J8602o6443j0553M9660L9294
11507d0495L7451O4986k8539K827l9712l1849L9020N2892N3817l1035m2765j891
11495C4707O567j2017o1824L3732N0147L4809O292M893m5354r392l6667k8183
11483b2290m7081j204L6951K0093K5829j2250O245l6444K8633J7756n916L3356
11471D3678O5615q953m7094l7327m2207l6985k0143K8787M8145l54k6544J7262
11459a6120j0591q396o817j6669n9262j497P2589P2474p287m579k4622j1491k5724
11446d7992R478L4057j8704l6698K131N4171p843L1692k7886k8230p0899j2170
11434a18893J00019P0148j168n8841K0463k9966L4734M3425M13k9852l5953l440
$$ plain form
11422 -8911 15167 -16394 -93083 -118878 -79493 -66020 -98586 -138404 -94927 -110579 -81974 -62683
11410 -62683 -36146 -5346 -11344 -27200 -56013 -72664 -77696 -61188 -7449 48271 48235 12423 -18790
11397 -18790 -14237 53575 94657 56961 38446 11686 -6377 -18219 -5826 -11739 -35588 -78328
11385 -78328 -65654 -56610 -29762 -5734 -11759 6373 9194 -23948 -46335 -72460 -46744 16098
11373 16098 -45861 -46245 -6507 -1956 33450 28202 42243 9988 4745 -47229 -91494 -117480 -115392
11360 -115392 -85928 -44573 -34775 -919 32200 31959 -35 -56994 -52974 -4578 -42290 -56018
11348 -56018 -79983 -106348 -79057 -26081 -33134 -34067 -53403 -58660 -37839 -29683 -1961 38093 9303
11335 9303 -44405 -17844 24545 30417 -33002 -80082 -106893 -87321 -55621 -61520 -34979 -7678
$$ packed form
11422h911K4078l1561p6689k5795L9385J3473l2566l9818M3477j5652K8605J9291
11410f2683K6537L0800n998j5856k8813j6651n032J6508N3739N5720l6l5812l1213
11397a8790M553O7812M1082l7696j8515k6760j8063j1842J2393n913k3849m2740
11385g8328J2674R044K6848K4028o025J8132K821l3142k2387k6125K5716O2842
11373A6098o1959l84L9738M551L5406n248J4041l2255n243n1974m4265k5986K088
11360a15392K9464M1355R798L3856L3119k41l1994n6959M020M8396l7712j3728
11348e6018k3965k6365K7291N2976p053r33j9336n257K0821Q156K7722M0054k8790
11335I303n3708K6561M2389N872o3419m7080k6811J9572L1700n899K6541K7301
$$ plain form
11323 -7678 17470 -2524 -17343 -2617 -28262 -14190 56185 22235 -30036 -5151 -18994 -71606
11311 -71606 -41110 -19120 -26676 -47895 -27924 24432 83923 82436 97643 100959 130536 121736
11299 121736 72243 49135 76217 61097 77854 52473 40695 68372 74358 63284 18800 -6773
11287 -6773 -79184 -85048 -92428 -77063 -29359 -22329 -44655 -48896 -13571 -4737 -8679 -39699 -55158
11274 -55158 -41420 -24769 -44016 -85980 -55770 6887 41635 26227 2799 -18965 -6506 -15968
11262 -15968 -38528 -41077 -32075 -2547 -12967 7469 38841 30081 14703 52868 73669 89870
11250 89870 46395 -9913 -5571 28016 41188 36630 44846 100376 155361 123621 169650 158847
11238 158847 132912 109427 136237 112967 33066 22024 37152 25762 39399 79969 124919
$$ packed form
11323g678K5148j9994j4819J4726k5645J4072P0375l3950n2271K4885j3843n2612
11311g1606L0496K1990p556k1219J9971N2356N9491j487J5207L316K9577q800
11299A21736m9493k3108K7082j5120J6757k5381j1778K7677N986j1074m4484k5573
11287f773p2411n864p380J5365M7704P030k2326m241L5325Q834l942l1020j5459
11274e5158J3738J6651j9247m1964L0210O2657L4748j5408k3428k1764J2459r462
11262a5968k2560k549R002K9528j0420K0436L1372q760j5378L8165K0801J6201
11250H9870m3475n6308M342L3587J3172m558Q216N5530N4985l1740M6029j0803
11238A58847k5935k3485K6810k3270p9901j1042J5128j1390J3637M0570M4950
$$ plain form
11227 124919 121276 138254 154840 85856 38234 -4696 3949 16844 -56740 -115860 -131598 -154419
11215 -154419 -97647 -3503 12320 14027 48631 76388 102663 95116 89536 87670 72867 -815
11203 -815 -48110 -31780 -24850 32788 36749 25956 -63196 -30832 8859 6802 73034 76137 28777
11190 28777 -28795 -67756 -94622 -68560 24043 30843 4057 -15904 6664 45622 46391 60339
11178 60339 62440 75290 45977 11172 36345 2267 -41584 -8012 31923 96546 44745 35872
11166 35872 15919 -48654 -104361 -94291 -11178 -3852 -65558 -18706 26164 24973 -30023 560
11154 560 46125 37269 25211 21879 -12093 5512 45679 51730 22647 17429 -7505 -36420 -4452
11141 -4452 29821 41244 63246 26606 11109 82917 96316 57292 48097 43975 -9781 -10956
$$ packed form
11227A24919l643J6978J6586o8984m7622m2930Q645J2895p3584n9120j5738k2821
11215a54419N6772R4144J5823J707L4604K7757K6275p547n580j866j4803p3682
11203h15m7295J6330O930N7638L961j0793q9152L2364L9691k057O6232L103m7360
11190B8777n7572l8961k6866K6062R2603O800k6786j9961K2568L8958P69J3948
11178F0339K101J2850k9313l4805K5173l4078m3851L3572L9935O4623n1801q873
11166C5872j9953o4573n5707J0070Q3113P326o1706M6852M4870j191n4996L0583
11154E60M5565q856j2058l332l3972J7605M0167O051k9083n218k4934k8915L1968
11141d452L4273J1423K2002l6640j5497P1808J3399l9024r195m122n3756j175
$$ plain form
11129 -10956 -15519 2234 -57665 -43713 12971 14862 48573 43453 69016 55583 99028 96247
11117 96247 15260 -22411 67712 89422 58220 69296 35048 -19725 -46652 12035 30604 20440
11105 20440 -4756 1381 -6048 -22984 10604 35335 -19562 -75724 -49082 35406 7888 2145
11093 2145 38332 -2177 9688 30493 22585 34745 28153 40473 73920 95456 112656 99520
11081 99520 69329 69613 61550 18430 17049 65726 106904 29632 3708 -16842 -42287 -89287
11069 -89287 -87446 -68870 -42534 -1910 8207 -12599 -42693 -23904 26739 4579 26682 18586
11057 18586 800 -65805 -61349 -49935 -21544 -38340 -31879 -57048 -137755 -32792 72978 62459
11045 62459 20422 66587 93018 68141 72917 73527 46400 14671 60758 10632 -30785 -50079
$$ packed form
11129a0956m563J7753n9899J3952N6684J891L3711n120K5563j3433M3445k781
11117I6247q0987l7671R0123K1710l1202J1076l4248n4773k6927N8687J8569j0164
11105B0440k5196O137p429j6936L3588K4731n4897n6162K6642Q4488k7518n743
11093B145L6187m0509J1865K0805p908J2160o592J2320L3447K1536J7200j3136
11081I9520l0191K84q063m3120j381M8677M1178p7272k5924k0550k5445m7000
11069h9287J841J8576K6336M0624J0117k0806l0094J8789N0643k2160K2103q096
11057A8586j7786o6605M456J1414K8391j6796O461k5169q0707J04963J05770j0519
11045F2459m2037M6165K6431k4877M776O10k7127l1729M6087n0126m1417j9294
$$ plain form
11033 -50079 -72255 -83946 -27590 -21578 -25965 -76700 -98351 -60552 -15404 -42796 -96440 -131924
11021 -131924 -145228 -130098 -89974 12695 59316 38568 12500 28437 25860 8592 8924 10807
11009 10807 -855 -21864 8903 -18578 8543 27309 4653 -28803 -32943 -73225 -102214 -55375
10997 -55375 1337 -22288 -1302 11484 -43312 -49063 -24198 -3763 -60580 -92966 -73437 -68180
10985 -68180 -66236 -27673 53048 110988 68508 51402 91208 43400 33068 -10271 -36190 -16359
10973 -16359 -57004 -104291 -65720 -73497 -93371 -19548 32010 62922 39163 -25110 29721 39471
10961 39471 18913 -26616 -61309 -30756 14501 -10787 -27477 -26136 -28513 -24659 -23216 -46623
10949 -46623 -57718 -58659 -34150 -25623 -9772 -45190 -52973 -84564 -96395 -56669 -60559 -56897 -60551
$$ packed form
11033e0079k2176j1691N6356O012m387n0735k1651L7799M5148k7392n3644l5484
11021a31924j3304J5130M0124J02669M6621k0748k6068J5937k577j7268L32J883
11009A0807j1662k1009L0767k7481K7121J8766k2656l3456m140m0282k8989M6839
10997e5375N6712k3625K0986J2786n4796n751K4865K0435n6817l2386J9529N257
10985f8180J944L8563Q0721N7940m2480j7106L9806m7808j0332m3339k5919J9831
10973a6359m0645m7287L8571p777j9874P3823N1558L0912k3759o4273N4831R750
10961C9471k0558m5529l4693L0553M5257k5288j6690J341k377L854J443k3407
10949d6623j1095r41K4509Q527J5851l5418p783l1591j1831L9726l890L662l654
$$ plain form
10936 -60551 -113533 -158843 -134513 -97462 -99502 -110586 -125082 -80500 -60825 -69490 -49202 -43624
10924 -43624 -53074 -106808 -81569 -45995 -21262 66798 88386 43250 37321 59037 33148 32871
10912 32871 -1468 -92635 -90079 8732 112527 138029 137308 96409 19270 -923 6803 12630
10900 12630 -5279 -48940 -67100 -29274 64941 91109 124235 78514 8320 -13041 44072 58075
10888 58075 10486 -18776 -53049 -36106 -11452 -49123 -53656 -9773 3995 7308 62176 101625
10876 101625 51444 -16724 -25173 -10801 3805 -1998 11206 7651 -73 16361 -7968 386
10864 386 1646 64538 39842 60024 11952 -6497 -74328 -107166 -80244 -19372 7427 -12972
10852 -12972 -90469 -131635 -117319 -68824 -40418 14460 56842 81442 127942 156245 158091 92539
$$ packed form
10936f0551n2982m5310K4330L7051k040j1084j4496M4582J9675q665K0288N578
10924d3624r450n3734K5239L5574K4733Q8060K1588m5136n929K1716k5889k77
10912C2871l4339r1167K556R8811J03795K5502p21m0899p7139k0193P726N827
10900A2630j7909m3661j8160L7826R4215K6168L3126m5721p0194k1361N7113J4003
10888E8075m7589k9262l4273J6943K4654l7671m533M3883J3768L313N4868L9449
10876A01625n0181o8168q449J4372J4606n803J3204l555p724J6434k4329Q354
10864C86J260O2892k4696K0182m8072j8449o7831l2838K6922O0872K6799k0399
10852a2972p7497m1166J4316M8495K8406N4878M2382K4600M6500K8303J846o5552
$$ plain form
10840 92539 8886 -63521 -14226 30913 33670 72259 97309 57395 9133 10022 45646 23376
10828 23376 -21903 -119986 -108028 -33880 -69483 -45099 -77494 -101761 -105448 -64025 21479 37264
10816 37264 51551 2164 -82882 -100063 -75852 -68817 -80979 -113943 -115829 -81639 -81042 -32306
10804 -32306 38197 7288 -44486 -87818 -79483 -69833 -79136 -28950 -28142 -35093 -48371 -47064 12950
10791 12950 2814 24899 -67299 -131961 -83020 -8513 -21354 -83725 -101268 -76381 -80289 -75904
10779 -75904 -5187 20010 28431 -4417 41101 66195 81719 104156 84405 76663 155303 221725
10767 221725 135336 -29187 -64832 26861 104529 109339 42302 8467 45277 32167 37066 43446
10755 43446 31468 20978 14181 -61701 -100141 -43472 -25202 -25124 -46145 -49955 -33299 46904 40708
$$ packed form
10840I2539q3653p2407M9295M5139K757L8589K5050l9914m8262Q89L5624k2270
10828B3376m5279r8083J1958P4148l5603K4384l2395k4267l687M1423Q5504J5785
10816C7264J4287m9387q5046j7181K4211P035j2162l2964j886L4190N97M8736
10804c2306P0503l0909n1774m3332Q335R650r303N0186Q08o951j3278J307O0014
10791A2950j0136K2085r2198o4662M8941P4507j2841o2371j7543K4887l908M385
10779g5904P0717K5197Q421l2848M5518K5094J5524K2437j9751p742P8640O6422
10767B21725q6389j64523l5645R1693P7668M810o7037l3835L6810j3110M899O380
10755D3446j1978j0490o797p5882l8440N6669J8270P8k1021l810J6656Q0203o196
$$ plain form
10742 40708 -32346 -87506 -104858 -102694 -51181 39671 49520 8341 -59028 -136726 -68452 -2191
10730 -2191 -41993 -75427 -75282 -23403 -4270 -27667 -56742 -122103 -123271 -58522 -59587 -27008 -8265
10717 -8265 -8765 -34163 29680 64139 -18461 -45187 -24479 6202 34897 45025 67222 78966
10705 78966 70509 40934 -50300 -47058 -9309 34806 47526 72095 5886 -53265 -83561 -35018
10693 -35018 -18033 -46905 -87424 -101142 -78382 -53615 -4992 2814 -25537 1956 37913 36215
10681 36215 61096 59350 67997 80192 97446 70581 33551 34161 9074 -3793 -48135 -62627
10669 -62627 8461 18085 21650 54893 61548 74947 74706 42065 -2153 -45651 -25736 8212 38194
10656 38194 15504 118 34616 21481 24105 6037 -37062 -36508 -4513 -7518 20450 32695
$$ packed form
10742D0708p3054n5160j7352K164N1513R0852R849m1179o7369p7698O8274O6261
10730b191l9802l3434J45N1879J9133k3397k9075o5361j168O4749j065L2579J8743
10717h265n00k5398O3843L4459q2600k6726K0708L0681K8695J0128K2197J1744
10705G8966q457k9575r1234L242L7749M4115J2720K4569o6209n9151l0296M8543
10693c5018J6985k8872m0519j3718K2760K4767M8623P806k8351K7493L5957j698
10681C6215K4881j746Q647J2195J7254k6865l7030O10k5087j2867m4342j4492
10669f2627P1088R624L565L3243O655J3399k41l2641m4218m3498J9915L3948K9982
10656C8194k2690j5386L4498j3135K624j8068m3099N54L1995l005K7968J2245
$$ plain form
10644 32695 20602 -18538 5172 8952 -4825 -8620 -23158 -38702 -11145 -45929 -75356 -92716
10632 -92716 -64197 8132 -30964 -19258 -21014 -40548 -26400 9900 -39773 -64998 -75976 -72802
10620 -72802 -105673 -52737 17183 -15828 25332 5375 -4394 -10169 29931 39314 -13434 -97708
10608 -97708 -140482 -144226 -83489 -24340 -25022 23978 69588 29428 -66989 -75061 -44239 -10503
10596 -10503 -20823 -54207 -46764 -19989 22200 41924 28474 32260 -3837 221 -42197 -64989
10584 -64989 -32978 -27658 -26911 2752 -19182 -65413 -27739 -25142 -55105 -112821 -143996 -104546
10572 -104546 -71299 -80033 -78779 -15147 -67760 -78216 5518 -15652 -5106 61045 58488 -27890
10560 -27890 9874 9129 -44889 -63449 -15190 -208 -21390 -75554 -84963 -57659 14774 74802
$$ packed form
10644C2695j2093l9140K3710L780j3777l795j4538j5544K7557l4784k9427j7360
10632i2716K8519P2329l9096J1706j756j9534J4148L6300m9673k5225j0978L174
10620g2802l2871N2936O9920l3011M1160j9957r769n775M0100R383n2748q4274
10608i7708m2774l744O0737N9149o82M9000M5610m0160r6417q072L0822L3736
10596a0503j0320l3384P443K6775M2189J9724j3450L786l6097M058m2418k2792
10584f4989L2011N320P47K9663k1934m6231L7674K597k9963n7716l1175L9450
10572a04546L3247q734J254O3632n2613j0456Q3734k1170J0546O6151k557q6378
10560b7890L7764p45n4018j8560M8259J4982k1182n4164r409K7304P2433O0028
$$ plain form
10548 74802 -28465 -46537 -38115 -52546 -16044 -11553 24045 5089 -20331 32396 97905 72258
10536 72258 27609 22321 51129 44770 27246 18691 -43065 -70964 -40425 2590 73987 65181
10524 65181 7141 8176 89450 27533 -17338 -50180 -66737 -28144 -2262 6658 -7402 5576
10512 5576 37815 77051 21175 -28966 -29068 -42947 -56670 -40 30019 -6008 -19851 -16500
10500 -16500 16608 3859 -1629 19615 70238 87646 15133 -55196 -38631 30768 36439 32697
10488 32697 -3504 -70804 -129180 -100351 -14135 39983 39963 30154 56276 69854 40720 50277 75513
10475 75513 10070 -57329 -37722 -7820 -17825 -70134 -59765 -6913 60323 91002 50379 28029
10463 28029 73392 47531 32097 42470 28633 21278 3223 25938 -10312 6403 30581 51689
$$ packed form
10548G4802j03267j8072Q422j4431L6502M491L5598j8956k5420N2727O5509k5647
10536G2258m4649n288K8808o359j7524q555o1756k7899L0539M3015P1397q806
10524F5181n8040J035Q1274o1917m4871l2842j6557L8593K5882Q920j4060J2978
10512E576L2239L9236n5876n0141j02j3879j3723N6630L0059l6027j3843L351
10500a6500L3108j2749n488K1244N0623J7408p2513p0329J6565O9399N671l742
10488C2697l6201o7300n8376K8829Q6216N4118k0r809K6122J3578k9134R557K5236
10475G5513o5443o7399J9607K9902j0005n2309J0369N2852O7236L0679m0623k2350
10463B8029M5363k5861j5434J0373j3837p355j8055K2715l6250J6715K4178K1108
$$ plain form
10451 51689 76728 89333 71567 42848 72475 68170 36970 26763 45128 68961 14988 -25430
10439 -25430 34319 76358 79262 66904 61151 55614 75600 123904 93316 43915 16615 36289
10427 36289 -11015 -32242 -7787 21101 -14146 -76647 -34644 6824 -55207 -57174 -86454 -106017
10415 -106017 -25245 10787 -39722 -59917 -17244 -30112 -38871 -33096 8635 -6179 -104566 -73781
10403 -73781 -64433 -11828 23993 -30933 13461 6994 31321 -14043 -40475 -61797 -47620 -33731
10391 -33731 -35248 11136 -11237 -3591 8228 49978 15834 -23250 -62671 9711 90744 18428
10379 18428 -42874 -53780 -46268 5637 33752 86598 38281 9719 9128 -22997 -52789 -82126
10367 -82126 -31805 30416 53078 15522 -138 5423 -37183 -88049 -45795 39463 78351 16847
$$ packed form
10451E1689K5039J2605j7766k8719K9627m305l1200j0207J8365K3833n3973m0418
10439b5430N9749M2039K904j2358n753n537J9986M8304l0588m9401k7300J9674
10427C6289m7304k1227K4455K8888l5247o2501M2003M1468o2031j967k9280j9563
10415a06017Q0772L6032n0509k0195M2673j2868q759N775M1731j4814r8387L0785
10403g3781R348N2605L5821n4926M4394o467K4327m5364k6432k1322J4177J3889
10391c3731j517M6384k2373P646J1819M1750l4144l9084l9421P2382Q1033p2316
10379A8428o1302j0906P512N1905K8115N2846m8317k8562n91l2125k9792k9337
10367h2126N0321O2221K2662l7556j5660N561m2606n0866M2254Q5258L8888o1504
$$ plain form
10355 16847 -2051 26829 58887 61445 11418 -72158 -72160 -36947 -71167 -74799 -43905 -28645 -23192
10342 -23192 12716 74171 37905 -11656 -22898 5157 3353 -39119 -42269 -92018 -94324 -63635
10330 -63635 -69298 -88287 -73034 -41084 23163 -22017 -23976 -40049 -56948 -44711 -57350 -76941
10318 -76941 -67056 -6091 37801 34250 9050 777 17059 3104 -47736 -41548 -7686 1020 3972
10305 3972 -37347 -41343 -53555 -68080 -67836 -88858 -72937 7783 87030 52961 6520 -7054
10293 -7054 -2306 -12617 -14237 -49516 -22508 43734 57967 75880 70120 9357 13938 24616 22497
10280 22497 2481 -25012 -57321 -82575 -46533 -32040 -23048 -43330 -78669 -44778 -53901 -25265
10268 -25265 6433 51366 60834 18876 -6112 -41193 -60337 -75231 -66176 -67755 -84271 -83868 -75655
$$ packed form
10355A6847j8898K8880L2058K558n0027q3576kL5213l4220l632L0894J5260N453
10342b3192L5908O1455l6266m9561j1242K8055j804m2472l150m9749k306L0689
10330f3635n663j8989J5253L1950O4247m5180j959j6073j6899J2237j2639j9591
10318g6941R885O0965M3892l551k5200q273J6282j3955n0840O188L3862Q706K952
10305C972m1319l996j2212j4525K44k1022J5921Q0720P9247l4069m6441j3574
10293g054M748j0311j620l5279K7008O6242J4233J7913n760o0763M581J0678k119
10280B2497k0016k7493l2309k5254L6042J4493Q992k0282l5339L3891r123K8636
10268b5265L1698M4933R468m1958k4988l5081j9144j4894R055j579j6516M03Q213
$$ plain form
10255 -75655 -46287 -7750 -25415 -50828 6788 18842 -36898 -55797 -81389 -49287 30399 75585
10243 75585 -1476 -11806 22037 2437 -12794 1665 -34461 -55583 -53674 -22264 -18404 -35984
10231 -35984 -53674 -57364 -63460 -79711 -105079 -120448 -80706 -26666 -58743 -117148 -109346 -100153
10219 -100153 -101642 -65144 -33249 -47216 -118227 -146904 -135367 -108961 -66379 -22977 -23351 -57029
10207 -57029 -56277 -35429 15123 17199 7895 -14437 34680 38307 36897 -15251 -12049 -9099 -1666
10194 -1666 31767 -18207 -65095 -67126 -50945 -15279 -23572 -40383 -36275 -12302 -88748 -82644 -48721
10181 -48721 -28895 -12625 40255 56540 71441 65335 2917 42499 53165 55664 14276 27624
10169 27624 50550 93525 93136 86918 88771 83573 40381 46292 27527 10239 -363 -44941 -35217
$$ packed form
10255g5655K9368L8537j7665k5413N7616J2054n5740j8899k5592L2102P9686M5186
10243G5585p7061j0330L3843j9600j5231J4459l6126k1122J909L1410L860j7580
10231c5984j7690l690o096j6251k5368j5369L9742N4040l2077n8405P802R193
10219a00153j489L6498L1895j3967p1011k8677J1537K6406M2582M3402l74l3678
10207e7029P52K0848N0552K076r304k2332M9117L627j410n2148L202K950P433
10194a666L3433m9974m6888k031J6181L5666q293j6811M108K3973p6446O104L3923
10181d8721J9826J6270N2880J6285J4901o106o2418L9582J0666K499m1388J3348
10169B7624K2926M2975l89o218J853n198m3192N911j8765j7288j0602m4578R724
$$ plain form
10156 -35217 -34839 -47139 -59518 -30616 -12607 -29643 2117 10199 26136 20808 -30073 -89209
10144 -89209 -54748 -42341 -88763 -76125 -113086 -154856 -145871 -65589 -44273 -24246 -10260 4424
10132 4424 20891 38426 20163 -24559 -44179 -59851 -41230 -1516 -44853 -110522 -119499 -53309
10120 -53309 -14535 -48921 -65251 -54891 -41671 -33641 -6140 -31151 -66798 -65004 -32856 -56775
10108 -56775 -85651 -58780 2262 -4443 -7681 -18292 -59816 -94812 -61002 -59496 -27557 3876
10096 3876 -17359 19855 -4756 -21670 -9242 -34491 -55652 -37709 -17124 -15774 18957 7988
10084 7988 -19234 -4861 -6880 11264 19100 42013 26454 46 -22252 79039 115733 67625
10072 67625 21017 5415 4940 -852 -11107 -8157 -85924 -72201 -18664 -41089 -70446 -69233 -46035
$$ packed form
10156c5217L78j2300j2379K8902J8009j7036L1760Q082J5937n328n0881n9136
10144h9209L4461J2407m6422J2638l6961m1770Q985Q0282K1316K0027J3986J4684
10132D424J6467J7535j8263m4722j9620j5672J8621L9714m3337o5669q977O6190
10120e3309L8774l4386j6330J0360J3220Q030K7501k5011l5647J794L2148k3919
10108e6775k8876K6871O1042o705l238j0611m1524l4996L3810J506L1939L1433
10096C876k1235L7214k4611j6914J2428k5249k1161J7943K0585J350L4731j0969
10084G988k7222J4373k019J8144P836K2913j5559k6408k2298J01291L6694m8108
10072F7625m6608j5602m75n792j0255K950p7767J3723N3537k2425k9357J213K3198
$$ plain form
10059 -46035 21790 25028 59816 90772 106154 74516 31087 26300 18892 54725 67646 59180
10047 59180 94875 47504 36976 2135 4387 -35398 6835 16838 25843 15805 25032 56270
10035 56270 84200 93865 1813 -12227 14351 22434 56298 74567 107254 98400 49268 71804
10023 71804 92292 35766 30046 62230 30110 -21037 -50569 -35907 -51254 -23531 -38283 -77402
10011 -77402 -51527 -61033 -11963 18642 -23689 -25924 -7048 15305 16261 65361 24511 11470
9999 11470 42774 30474 3866 -22139 -53005 -90063 -71843 -21025 8332 -60021 -38246 -35768
9987 -35768 -88792 -96467 -46262 -33595 -50316 -36127 -17712 -28767 -59584 9412 9982 -20066
9975 -20066 -10754 -10357 2080 -9481 -45055 -70954 -23124 -35050 -13299 15431 -7306 -9415 51040
$$ packed form
10059d6035O7825L238L4788L0956J5382l1638m3429m787p408L5833J2921q466
10047E9180L5695m7371j0528l4841K252l9785M2233J0003R005j0038R227L1238
10035E6270K7930R665r2052j4040K6578Q083L3864J8269L2687q854m9132K2536
10023G1804K0488n6526n720L2184l2120n1147k9532J4662j5347K7723j4752l9119
10011g7402K5875r506M9070L0605m2331k235J8876K2353R56M9100m0850j3041
9999A1470L1304j2300k6608k6005l0866l7058J8220N0818K9357o8353K1775K478
9987c5768n3024p675N0205J2667j6721J4189J8415j1055l0817O8996N70l0048
9975b0066R312L97J2437j1561l5574k5899M7830j1926K1751K8730k2737k109O0455
$$ plain form
9962 51040 72791 60446 56716 90734 39383 15965 52084 71192 47863 37716 -14613 -68055
9950 -68055 -49989 -9406 34948 116429 122767 57736 6787 27518 42874 13309 65155 69349
9938 69349 29859 1565 -11888 -42711 10859 -5341 13288 68612 73285 40683 17177 -8345
9926 -8345 -29380 -56331 -39694 71102 129819 105224 47463 32522 -34835 -34153 44199 86933
9914 86933 31117 26521 -39058 -106867 -37131 20850 -3841 -1436 14308 -23900 -80239 -69737
9902 -69737 -38786 -19304 -76873 -52167 26343 72839 -9693 -21194 -3314 7523 4232 -85781
9890 -85781 -89260 -100348 -88549 -17706 6408 17038 20033 21495 18327 -48660 -52916 -39823 -27123
9877 -27123 -47353 11749 21272 17227 -22971 -22284 -36488 -66613 -6824 42838 57310 71163 42638
$$ packed form
9962E1040K1751j2345l730L4018n1351k3418L6119J9108k3329j0147n2329n3442
9950f8055J8066M0583M4354Q1481O338o5031n0949K0731J5356k9565N1846M194
9938F9349l9490k8294j3453l0823N3570j6200J8629N5324M673l2602k3506k5522
9926h345k1035k6951J6637J10796N8717k4595n7761j4941o7357O82P8352M2734
9914H6933n5816m596o5579o7809O9736N7981k4691K405J5744l8208n6339J0502
9902f9737L0951J9482n7569K4706P8510M6496q2532j1501J7880J0837l291r0013
9890h5781l479j1088J1799P0843K4114J0630K995J462l168o6987m256J3093J2700
9877b7123k0230N9102R523m045m0198O87j4204l0125N9789M9662J4472J3853k8525
$$ plain form
9864 42638 8857 -21589 22381 24329 -66523 -38025 13128 18908 636 20517 48841 44387
9852 44387 -67557 -128637 -82306 -20655 -25998 -49887 -46243 -36545 12517 6089 -72660 -82590 -83222
9839 -83222 -79901 -49320 -60232 -78121 -25179 9995 -5379 -22452 -27045 -34487 2688 -3915 24828
9826 24828 21836 -19453 -57647 -40249 -21419 -31764 8784 62239 76650 85604 93559 55048
9814 55048 3682 11350 15190 30095 63630 27010 -22633 -46447 -12111 -2463 -5475 -7560 -20584
9801 -20584 -21723 -11436 -42033 30629 76157 35738 57971 65228 118703 81742 -7234 -36321
9789 -36321 -29362 -2537 -20179 636 22363 -6673 -66193 -99472 -99014 -105583 -78543 -48125 -69246
9776 -69246 -74974 19424 65047 133137 59484 -14030 -7943 44299 28412 -22977 -33956 -11234
$$ packed form
9864D2638l3781l0446M3970J948r0852K8498N1153N780j8272J9881K8324m454
9852D4387j11944o1080M6331O1651n343k3889L644R698M9062o428p8749r930o32
9839h3222L321L0581j0912j7889N2942L5174j5374j7073m593p442L7175o603K8743
9826B4828k992m1289l8194J7398J8830j0345M0548N3455J4411Q954P955l8511
9814E5048n1366P668L840J4905L3535l6620m9643k3814L4336R648l012k085j3024
9801b0584j139J0287l0597P2662M5528m0419K2233P257N3475l6961q8976k9087
9789c6321O959K6825j7642K0815K1727k9036n9520l3279M58o569K7040L0418k1121
9776f9246n728R4398M5623O8090p3653p3514O087N2242j5887n1389j0979K2722
$$ plain form
9764 -11234 -31595 -65492 -46424 -102471 -107498 -65688 8283 47834 65491 47843 30523 36213
9752 36213 16552 -3233 30180 7243 40222 13612 -29764 -32418 -44140 -2489 35309 13868
9740 13868 62149 29448 -24529 -88679 -95720 -64430 -6983 -49054 -88740 -42193 -35994 37107
9728 37107 52400 -9841 -49599 -43368 -12449 28136 24234 -23606 -37628 -42164 7173 43705
9716 43705 -50288 -104848 -75514 -4947 46978 54448 35884 48898 99624 111410 49407 -16717
9704 -16717 -3295 29617 40043 62805 74266 55413 23249 29654 54360 22857 -37772 -66863
9692 -66863 -62622 -75454 -47422 -13177 -52810 -63910 -10990 18970 -18104 -25764 15810 31976
9680 31976 38239 46397 33134 39851 -887 -51999 -41562 -7293 34435 56498 59198 57927 7109
$$ packed form
9764a1234k0361l3897J9068n6047n027M1810P3971L9551J7657j7648j7320N690
9752C6213j9661j9785L3413k2937L2979k6610m3376k654j1722M1651L7798k1441
9740A3868M8281l2701n3977o4150p041L1290N7447m2071l9686M6547O199P3101
9728C7107J5293o2241l9758O231L0919M0585l902m7840j4022m536M9337L6532
9716D3705r3993n4560K9334P0567N1925P470j8564J3014N0726J1786o2003o6124
9704a6717J3422L2912J0426K2762J1461j8853l2164O405K4706l1503o0629k9091
9692f6863M241j2832K8032L4245l9633j1100N2920K9960l7074p660M1574J6166
9680C1976O263Q158j3263O717m0738n1112J0437L4269M1728K2063K700j271n0818
$$ plain form
9667 7109 -60448 -87208 -48336 5319 23722 -19660 3649 -32665 -40340 16673 20032 -9990
9655 -9990 -10163 -24105 -14053 -28078 -19872 15990 15727 -12121 -10268 -38335 -94775 -75751 -68696
9642 -68696 -84777 -63479 -39072 -6244 -14639 -75845 -64754 -96570 -49480 -10825 -10663 -24655
9630 -24655 -41638 -48752 -4072 57839 128740 84314 35353 21752 6885 13280 -10367 -73437
9618 -73437 -93328 -95494 -71385 -20021 -8317 -8405 7377 16856 19214 50888 25031 -43504 -68367
9605 -68367 -37815 -87657 -147675 -107224 11946 2098 -21570 26962 2712 -13875 25831 41728
9593 41728 33130 46168 21800 -39084 -81314 -106492 -131651 -144765 -112370 -23197 1652 -3813
9581 -3813 -2407 31863 29606 -22873 -79067 -117670 -51303 -51415 -48735 -2730 55253 51541 15227
$$ packed form
9667G109o7557k6760L8872N3655J8403m3382K3309l6314p675N7013L359l0022
9655i990j73j3942J0052j4025Q206L5862k63k7848J853k8067n6440J9024P055
9642f8696j6081K1298K4407L2828q395o1206J1091l1816M7090L8655J62j3992
9630b4655j6983p114M4680O1911P0901m4426m8961j3601j4867O395k3647o3070
9618g3437j9891k166K4109N1364J1704q8J5782R479K358L1674k5857o8535k4863
9605f8367L0552m9842o0018M0451J19170r848k3668M8532k4250j6587L9706J5897
9593D1728q598J3038k4368o0884m2230k5178k5159j3114L2395Q9173K4849n465
9581c813J406L4270k257n2479n6194l8603O6367j12K680M6005N7983l712l6314
$$ plain form
9568 15227 32061 64101 62485 86429 68806 85550 147336 173115 114179 44358 -4098 -18194
9556 -18194 -24162 -65173 -94824 -89606 -135390 -69786 2691 -18486 -42227 -23924 15108 53298
9544 53298 58543 70672 -7563 -9686 30223 -4426 -63681 -71674 -21860 67815 92533 71404
9532 71404 61315 18670 -34265 -48564 -38688 -56184 -17490 -5478 -47369 -25142 20853 8264
9520 8264 -49628 -36027 -28202 -12609 41068 56700 18158 -12107 -26416 -34187 9030 60420
9508 60420 27955 -35786 -94696 -144484 -94793 -67396 -34976 -30957 -14185 -26935 -32723 -63165
9496 -63165 -35219 -37301 -64411 -47609 -30797 18470 31732 -19689 -98276 -62216 -10624 -60742
9484 -60742 -143947 -181915 -61495 -20564 -73713 -79120 -61675 -60187 -33379 28640 35319 25907
$$ packed form
9568A5227J6834L2040j616K3944j7623J6744O1786K5779n8936o9821m8456j4096
9556a8194n968m1011k9651N218m5784O5604P2477k1177k3741J8303L9032L8190
9544E3298N245J2129p8235k123L9909l4649n9255p993M9814Q9675K4718k1129
9532G1404j0089m2645n2935j4299R876j7496L8694J2012m1891K2227M5995j2589
9520H264n7892J3601P825J5593N3677J5632l8542l0265j4309p771M3217N1390
9508F0420l2465o3741n8910m9788M9691K7397L2420M019J6772j2750n788l0442
9496f3165K7946k082k7110J6802J6812M9267J3262n1421p8587L6060N1592n0118
9484f0742q3205l7968J20420M0931n3149n407J7445J488K6808O2019O679r412
$$ plain form
9472 25907 -29544 -55192 -43647 -30923 -14625 -13594 -28067 -9325 16268 2873 22355 58440
9460 58440 -9975 -21681 -34908 -45025 -66470 3939 61099 51554 1309 -3801 -32738 -37964
9448 -37964 15928 17047 -9879 -13205 63296 92197 45158 -41251 -50576 -55847 -35072 -25054 -90306
9435 -90306 -65737 -53109 -1150 6150 -49154 -20673 -19978 -62284 -29040 -4173 -12341 -59124 -14238
9422 -14238 -27482 5555 8239 34176 -19885 -61008 -77243 -89253 -95205 -7147 31178 -10794
9410 -10794 -18349 -35761 -41177 -73665 -44053 -18531 34018 28537 16135 -28964 -90760 -87130 -87973
9397 -87973 -31650 9951 -22422 -118053 -95675 -37821 -66049 -75823 -21408 -16400 -30034 -69401
9385 -69401 -38660 45148 54038 45642 75597 114829 122225 73420 73132 97596 74807 57330 -20036
$$ packed form
9472B5907n5451k5648J1545J2724J6298J031j4473J8742K5593j3395J9482L6085
9460E8440o8415j1706j3227j0117k1445P0409N7160r545n0245n110k8937n226
9448c7964N3892J119k6926l326P6501K8901m7039q6409r325n271K0775J0018o5252
9435i0306K4569J2628N1959P300n5304K8481O95m2306L3244K4867q168m6783M4886
9422a4238j3244L3037K684K5937n4061m1123j6235j2010n952Q8058L8325m1972
9410a0794p555j7412n416l2488K9612K5522N2549n481j2402m5099o1796L630q43
9397h7973N6323M1601l2373r5631K2378N7854k8228r774N4415N008j3634l9367
9385f9401L0741Q3808Q890q396K9955L9232P396m8805k88K4464k2789j7477p7366
$$ plain form
9372 -20036 -36262 -12972 -20663 7642 77614 125651 118018 85670 18962 -16580 -63162 -74655
9360 -74655 -12108 -4621 -12882 -18017 -8958 -4993 -30851 -43878 -48349 -32304 -19436 -43983 -97427
9347 -97427 -54265 -25655 15491 43304 50485 19944 21680 43723 65835 2753 -14825 4985
9335 4985 86865 135417 131426 107363 87200 103323 126174 67950 4236 54 16549 36984
9323 36984 67843 41878 14512 -26200 -66950 -41557 -46213 -54779 -53567 -10705 4413 11511 13598
9310 13598 48357 109882 110732 62722 19444 36826 -16104 -43204 16202 -9523 10722 7004
9298 7004 -10043 35057 10372 -39029 -65077 -27630 -35935 -28289 -2220 35632 74556 45507
9286 45507 87470 83482 59728 110937 51966 10746 -23089 -39925 -42291 -22389 -4972 58832
$$ packed form
9372b0036j6226K3290p691K8305O9972M8037p633l2348o6708l5542m6582j1493
9360g4655O2547P487q261n135R059L965k5858j3027m471J6045J2868k4547n3444
9347i7427M3162K8610M1146K7813P181l0541J736K2043K2112o3082j7578J9810
9335D985Q1880M8552l991k4063k0163J6123K2851n8224o3714m182J6495K0435
9323C6984L0859k5965k7366m0712m0750K5393m656q566J212M2862J5118P098K087
9310A3598L4759O1525Q50m8010m3278J7382n2930k7100N9406k5725K0245l718
9298G004j7047M5100k4685m9401k6048L7447q305P646K6069L7852L8924k9049
9286D5507M1963l988k3754N1209n8971m1220l3835j6836k366J9902J7417O3804
$$ plain form
9274 58832 99600 108463 128522 123138 85514 147249 186094 139474 122177 152729 145892 127381
9262 127381 141685 141834 62874 4287 13046 48447 44379 46060 47611 13584 25818 1960 50886
9249 50886 31569 7841 -13787 -54254 -71146 15549 15386 -42188 -46663 -10433 18266 11933 -27722
9236 -27722 13304 68137 70329 42671 40844 56925 111123 91087 79429 91239 81430 47371
9224 47371 -19080 -32536 1932 -23140 -9548 37709 49695 59487 15179 13068 19818 90515
9212 90515 112747 141443 118745 65761 47094 17417 -20637 -26951 -29594 61060 67537 90023
9200 90023 123101 99161 97505 117320 53994 28664 11189 82614 138364 139014 112108 69008
9188 69008 6931 36329 74465 98367 111222 43981 84664 139122 107510 121146 130493 124631
$$ packed form
9274E8832M0768Q863K0059n384l7624O1735L8845m6620j7297L0552o837j8511
9262A27381J4304J49p8960n8587Q759L5401m068J681J551l4027J2234k3858M8926
9249E0886j9317k3728k1628m0467j6892Q6695j63n7574m475L6230K8699o333l9655
9236b7722M1026N4833K192k7658j827J6081N4198k0036j1658J1810r809l4059
9224D7371o6451j3456L4468k5072J3592M7257J1986R792m4308k111O750P0697
9212I0515K2232K8696k2698n2984j8667k9677l8054o314k643R0654O477K2486
9200I0023L3078k3940j656J9815o3326k5330j7475P1425N5750O50k6906m3100
9188F9008o2077K9398L8136K3902J2855o7241M0683N4458l1612J3636R347n862
$$ plain form
9176 124631 54103 44733 50326 120572 131616 163013 118629 95226 74853 89835 86421 6248
9164 6248 2598 32868 75625 63028 36003 64408 84874 79392 124213 136020 197230 256258
9152 256258 197832 174120 145780 180888 265050 296090 310256 337377 358495 341051 332367 327391
9140 327391 325015 352826 342723 284073 240895 265463 255119 278935 251693 274724 369493 459531
9128 459531 459385 470641 542886 535723 493875 475383 530625 636362 699586 787739 821512 816281
9116 816281 868826 928520 998986 1096895 1212840 1356700 1464565 1516553 1578013 1719105 1905818
9105 1905818 2039262 2173724 2318150 2509743 2794388 2963723 3211605 3645385 4236993 4866330
9095 4866330 5607867 6360338 7051268 7600138 7985046 8219995 8343026 8458078 8638480 8924288
$$ packed form
9176A24631p0528r370N593P0246J1044L1397m4384k3403k0373J4982l414q0173
9164F248l650L0270M2757j2597k7025K8405K0466n482M4821J1807O1210N9028
9152B56258n8426k3712k8340L5108Q4162L1040J4166K7121K1118j7444q684m976
9140C27391k376K7811j0103n8650m3178K4568j0344K3816k7242K3031R4769R0038
9128D59531j46J1256P2245p163m1848j8492N5242J05737O3224Q8153L3773n231
9116H16281N2545N9694P0466R7909J15945J43860J07865N1988O1460J41092J86713
9105A905818J33444J34462J44426J91593K84645J69335K47882M33780N91608O29337
9095D866330P41537P52471O90930N48870L84908K34949J23031J15052J80402K85808
$$ plain form
9085 8924288 9406071 10283510 11787595 14491517 18824012 24644935 30580775 34212298 35438620
9076 35438620 36377813 38243803 39970575 35944609 24340481 14819749 9795308 7140122
9068 7140122 5577536 4623922 3934088 3398353 2966407 2581907 2301014 2141605 1984670
9059 1984670 1799551 1642693 1548318 1430320 1269778 1201119 1138873 1120248 1074170 1050501 997718
9048 997718 977180 966713 935541 885152 807004 786768 768098 688377 656044 670140 731421 713707
9036 713707 626037 507049 470548 492389 475997 415554 360265 441371 479537 459396 435447
9025 435447 427006 452211 443330 386936 330565 334386 340125 301400 302436 266968 236644 240937 241009
9012 241009 228389 334184 374597 295937 253872 217310 229959 265982 239912 194517 230090
$$ packed form
9085H924288M81783Q77439J504085K703922M332495N820923N935840L631523J226322
9076C5438620R39193J865990J726772m025966j1604128r520732n024441k655186
9068G140122j562586r53614o89834n35735m31946l84500k80893j59409j56935
9059A984670j85119j56858r4375j17998j60542o8659o2246j8625m6078k3669n2783
9048I97718k0538j0467l1172n0389p8148k0236j8670p9721l2333J4096O1281j7714
9036G13707q7670j18988l6501K1841j6392o0443n5289Q1106L8166k0141k3949
9025D35447q441K5205q881n6394n6371L821N739l8725J036l5468l0324M293P2
9012B41009j2620J05795M0413p8660m2065l6562J2649L6023k6070m5395L5573
$$ plain form
9001 230090 243742 183784 174290 214442 207342 162343 119945 122427 201389 300165 285093 215883
8989 215883 253398 320906 309214 245361 270853 286277 229150 212248 229830 196883 225254 227334
8977 227334 181121 151705 124753 150944 170705 152310 185818 197284 186996 132840 104481 69346
8965 69346 51607 6629 -2619 -31339 5849 47469 89435 96074 127963 127333 118063 131182 150050
8952 150050 134342 41025 -7217 44921 118078 122129 89886 68536 103451 94180 62055 44244
8940 44244 52303 71175 63580 24221 44647 89613 101434 86764 83539 88536 47023 -31105 -54907
8927 -54907 -3542 5653 13131 94928 189892 167541 72907 46874 78672 27640 -17502 -19850
8915 -19850 -61153 -59850 -49565 -6274 -33012 -56236 -48792 4393 53600 42059 -2776 31733
$$ packed form
9001B30090J3652n9958r494M0152p100m4999m2398K482P8962R8776j5072o9210
8989B15883L7515O7508j1692o3853K5492J5424n7127j6902J7582l2947K8371K080
8977B27334m6213k9416k6952K6191J9761j8395L3508J1466j0288n4156k8359l5135
8965F9346j7739m4978r248k8720L7188M1620M1966O639L1889o30r270J3119J8868
8952A50050j5708r3317m8242N2138P3157M051l2243k1350L4915r271l2125j7811
8940D4244Q059J8872p595l9359K0426M4966J1821j4670l225M997m1513p8128k3802
8927e4907N1365R195P478Q1797R4964k2351r4634k6033L1798n1032m5142k348
8915a9850m1303J303J0285M3291k6738k3224P444N3185M9207j1541m4835L4509
$$ plain form
8903 31733 34894 12481 -23704 2611 59381 120232 95630 22508 41052 81755 106532 59826
8891 59826 26688 26099 8719 -43086 -57293 -94023 -60708 -28738 -14848 12734 95813 128406
8879 128406 56763 11242 37260 36227 -10812 -21115 -44864 -43317 -10585 -15798 -4874 51727
8867 51727 58147 38796 39081 65636 1161 -54920 -63906 -20389 17149 -15988 -41257 -108290 -89546
8854 -89546 -10655 -3719 -44640 -24862 11450 33606 27889 47398 49924 45684 28909 -7734 24970
8841 24970 -14982 10403 54900 74676 96653 128421 144991 130514 106821 36027 -5258 -48729
8829 -48729 -26747 -44740 -79560 -67671 -72673 -52046 -29065 -36790 -72284 -95894 -54588 -32714
8817 -32714 53242 97339 140386 175239 196646 137189 55643 64699 75844 56932 14022 9323
$$ packed form
8903C1733L161k2413l6185K6315N6770O0851k4602p3122J8544M0703K4777m6706
8891E9826l3138n89j7380n1805j4207l6730L3315L1970J3890K7582Q3079L2593
8879A28406p1643m5521K6018j033m7039j0303k3749J547L2732n213J0924N6601
8867E1727O420j9351K85K6555o4475n6081q986M3517L7538l3137k5269o7033J8744
8854h9546P8891O936m0921J9778L6312K2156n717J9509K526m240j6775l6643L2704
8841B4970l9952K5385M4497J9776K1977L1768J6570j4477k3693p0794m1285m3471
8829d8729K1982j7993l4820J1889n002K0627K2981p725l5494k3610M1306K1874
8817c2714Q5956M4097M3047L4853K1407n9457q1546R056J1145j8912m2910m699
$$ plain form
8805 9323 34263 -34790 -62967 -52803 -49541 -48261 -53286 -98586 -75866 -26230 -8748 -21656 -68109
8792 -68109 -49955 -8061 4102 -56850 -73581 -48627 -90600 -112469 -51327 25468 16780 -52606
8780 -52606 -82396 -64840 -73371 -25330 -1916 -14130 -56157 -57366 -26799 -15494 -29301 -37520
8768 -37520 1481 -7747 -21990 -43909 32745 62621 41794 27439 44241 83073 68553 60838
8756 60838 72050 44012 35792 8946 -25330 20917 11275 27033 44954 45917 54515 101258 97198
8743 97198 62575 23258 27880 35174 -28266 -8354 -53637 -50590 -14036 -16696 -45013 -62201 -33034
8730 -33034 -47920 -29368 -11513 -12629 21713 24248 51446 8138 4910 -22561 -47437 -32775
8718 -32775 58924 76162 77246 69359 69112 48474 38425 36166 15206 64043 35617 13260 -62568
$$ packed form
8805I323K4940o9053k8177J0164L262J280n025m5300K2720M9636J7482j2908m6453
8792f8109J8154M1894J2163o0952j6731K4954m1973k1869O1142P6795q688o9386
8780e2606k9790J7556q531M8041K3414j2214m2027j209L0567J1305j3807q219
8768c7520L9001r228j4243k1919P6654K9876k0827j4355J6802L8832j4520p715
8756F0838J1212k8038q220k6846l4276M6247r642J5758J7921R63Q598M6743m060
8743I7198l4623l9317M622P294o3440J9912m5283L047L6554k660k8317j7188K9167
8730c3034j4886J8552J7855j116L4342K535K7198m3308l228k7471k4876J4662
8718c2775R1699J7238J084p887k47k0638j0049k259k0960M8837k8426k2357p5828
$$ plain form
8705 -62568 -43725 22040 61577 88646 118849 75861 74967 21129 -29497 -1000 7030 41455
8693 41455 96802 64105 74865 116431 121113 85985 67574 73601 31794 -3006 -104592 -114558
8681 -114558 -161251 -185878 -89073 -24981 5596 -13132 -95475 -15665 80064 4741 -18559 13322
8669 13322 51301 103744 136328 153400 159436 186444 170548 146305 93365 67798 -3870 -31943
8657 -31943 25194 76285 -9161 55308 116997 126799 121512 82074 83116 60197 38718 23204
8645 23204 1174 22390 44059 6649 31058 27721 1654 4568 28614 2281 11912 92107
8633 92107 130248 148332 136050 83310 -11014 -1431 40493 30285 -1039 -9036 34192 124371
8621 124371 121466 44964 29711 77557 122833 94589 77865 94502 97141 36305 9177 -7818
$$ packed form
8705f2568J8843O5765L9537K7069L0203m2988q94n3838n0626K8497Q030L4425
8693D1455N5347l2697J0760M1566M682l5128j8411O027m1807l4800j01586r966
8681a14558m6693k4627R6805O4092L0577j8728q2343P9810R5729p5323k3300L1881
8669A3322L7979N2443L2584J7072O036K7008j5896k4243n2940k5567p1668k8073
8657c1943N7137N1091q5446O4469O1689R802n287l9438J042k2919k1479j5514
8645B3204k2030K1216K1669l7410K4409l337k6067K914K4046k6333R631Q0195
8633I2107L8141J8084j2282n2740r4324R583M1924j0208l1324p997M3228R0179
8621A24371k905p6502j5253M7846M5276k8244j6724J6637K639o0836k7128j6995
$$ plain form
8609 -7818 8524 72503 130588 80434 46798 82869 83612 19293 23547 93133 118880 102156 82084
8596 82084 64499 100175 134097 156198 92093 100844 79486 15015 5389 21266 -13524 68850
8584 68850 89006 57563 50950 32999 3843 13778 51683 111796 84102 66996 76241 108057
8572 108057 143722 81729 96058 83124 21148 40975 13276 22187 52196 38278 34678 54011
8560 54011 50874 32379 5203 70226 122762 132713 89695 72712 -29650 -49769 -16882 -40441
8548 -40441 -85483 -34956 16079 67009 123717 159723 171746 116873 63641 46641 121033 98865
8536 98865 47161 49905 75686 86871 31949 -11889 -63322 -62472 -32388 19659 32459 7126
8524 7126 -86175 -148552 -173220 -105379 -46962 -25972 4223 11831 19165 54076 35605 22979
$$ packed form
8609g818J6342O3979N8085n0154l3636L6071P43o4319M254O9586K5747j6724k0072
8596H2084j7585L5676L3922K2101o4105Q751k1358o4471r626J5877l4790Q2374
8584F8850K0156l1443o613j7951k9156R935L7905O0113k7694j7106R245L1816
8572A08057L5665o1993J4329j2934o1976J9827k7699Q911L0009j3918l600J9333
8560E4011l137j8495k7176O5023N2536R951m3018j6983j02362k0119L2887k3559
8548d0441m5042N0527N1035N0930N6708L6006J2023n4873n3232j7000P4392k2168
8536I8865n1704K744K5781J1185n4922m3838n1433Q50L0084N2047J2800k5333
8524G126r3301o2377k4668O7841N8417K0990L0195P608P334L4911j8471j2626
$$ plain form
8512 22979 26882 57860 70733 77714 27220 31798 18764 -1729 8089 37339 17960 -62739 -47297
8499 -47297 -38442 -14412 18029 20023 -403 4511 -26427 -53053 -60768 -80924 -11743 -11636 -62757
8486 -62757 -1835 30153 45686 59412 114708 156617 119132 13512 -11865 42013 57014 31687
8474 31687 -20102 -42516 -51519 2523 58501 59216 50116 22441 2203 14555 -7270 -21353 8740
8461 8740 15441 8147 -20889 -9220 19737 86502 100494 78023 29510 1706 24901 37280
8449 37280 30910 17790 15005 19686 77894 82038 55523 -3571 -27299 -16129 -26642 -19363 -22217
8436 -22217 40153 99769 121716 101509 77615 53421 -27139 -22451 8913 43628 60553 24462
8424 24462 -38882 -59199 -46029 5364 -25859 57039 124740 149190 58796 21497 66889 95983
$$ packed form
8512B2979L903L0978J2873O981n0494M578j3034k0493R818K9250j9379q0699J5442
8499d7297Q855K4030L2441J994k0426M914l0938k6626p715k0156O9181J07n1121
8486f2757O0922L1988J5533J3726N5296M1909l7485j05620k5377N3878J5001k5327
8474C1687n1789k2414r003N4042N5978P15r100k7675k0238J2352k1825j4083L0093
8461H740O701p294k9036J1669K8957O6765J3992k2471m8513k7804K3195J2379
8449C7280o370j3120k785M681N8208M144k6515n9094k3728J1170j0513P279k854
8436b2217O2370N9616K1947k0207k3894k4194q0560M688L1364L4715J6925l6091
8424B4462o3344k0317J3170N1393l1223Q2898O7701K4450r0394l7299M5392K9094
$$ plain form
8412 95983 97960 41718 31201 56670 19156 68989 116586 106076 122671 113186 113682 95678 157150
8399 157150 150370 105412 34301 -31982 -2358 33715 32012 -47025 -22598 4310 7617 -23075
8387 -23075 -9893 -32043 -36855 13802 36717 71166 85590 98208 22823 -1814 25735 -402
8375 -402 -3868 -14993 519 -11580 16153 42686 -15985 -51914 -32584 -19243 -22269 -30458 -4617
8362 -4617 -6199 8233 17843 22280 111248 137766 114025 118088 55500 -46158 -47982 6024 37566
8349 37566 -23876 -10021 -33914 -27852 52156 98482 91937 88926 41446 11346 66539 81082
8337 81082 110675 101090 69138 13505 7937 43514 106833 59789 12656 9145 13029 -2704 -42655
8324 -42655 -58547 -22001 -9135 6108 4194 -5173 -57024 -30724 6893 6021 -21013 -15329 -77023
$$ packed form
8412I5983J977n6242j0517K5469l7514M9833M7597j0510J6595r485M96j8004O1472
8399A57150o780m4958p1111o6283K9624L6073j703p9037K4427K6908L307l0692
8387b3075J3182k2150m812N0657K2915L4449J4424J2618p5385k4637K7549k6137
8375d02l466j1125J5512j2099K7733K6533n8671l5929J9330J3341l026q189K5841
8362d617j582J4432R610M437Q8968K6518k3741M063o2588j01658j824N4006L1542
8349C7566o1442J3855k3893O062Q0008M6326o545l011m7480l0100N5193J4543
8337H1082K9593r585l1952n5633n568L5577O3319m7044m7133l511L884j5733l9951
8324d2655j5892L6546J2866J5243j914r367n1851K6300L7617q72k7034N684o1694
$$ plain form
8311 -77023 -122379 -120316 -50042 -5903 19824 37286 25828 23361 -25178 -33077 45987 74584
8299 74584 27430 -8851 -2507 4471 3869 15388 12096 12994 23166 31904 54638 41861 50642 67579
8285 67579 49044 11225 44708 59346 50661 49888 7869 54066 58929 40698 19056 -17365 7084
8272 7084 23160 51079 -6282 -58817 -22828 -12825 -11285 28905 19259 -4057 8314 46684
8260 46684 27170 -13945 -20132 -7203 -25113 -27217 27613 74941 45606 -17210 -23173 -3880
8248 -3880 -13478 -21100 -80155 -60061 -7101 -40400 -86095 -32133 14888 50679 68582 60571 19393
8235 19393 6365 -8082 -60390 -3241 47897 3430 -16457 -6621 42073 60679 15255 14120
8223 14120 -20679 -13406 -35984 -34411 -32432 -2967 -896 -38746 7602 10256 -13234 -45867 -49070
$$ packed form
8311g7023m5356K063P0274M4139K5727J7462j1458k467m8539p899P9064K8597
8299G4584m7154l6281O344O978o02J1519l292Q98J0172Q738K2734j2777Q781J6937
8285F7579j8535l7819L3483J4638q685p73m2019M6197M863j8231k1642l6421K4449
8272G084J6076K7919n7361n2535L5989J0003J540M0190r646k3316J2371L8370
8260D6684j9514m1115o187J2929j7910k104N4830M7328k9335o2816n963J9293
8248c880r598p622n9055K0094N2960l3299m5695N3962M7021L5791J7903q011m1178
8235A9393j3028j4447n2308N7149N1138m4467j9887R836M8694J8606m5424j135
8223A4120l4799P273k2578J573J979K9465K071l7850M6348K654k3490l2633l203
$$ plain form
8210 -49070 -44007 26062 77598 43067 -20009 -14011 4141 -3196 -4046 -18845 -66137 -103722 -78886
8197 -78886 -24455 -8764 3882 26301 22532 57944 115042 140555 119034 92500 95983 103170
8185 103170 81069 67187 55082 24144 7876 19391 19812 23098 -20622 30133 30906 91326 75266
8172 75266 -54506 -95815 -27716 -25992 -49048 -6800 26275 61726 -20289 -71207 -92283 -1811
8160 -1811 52653 49562 35870 9751 2420 -11747 -7929 -23281 -20850 -7199 -40657 -7963 20948
8147 20948 -46118 -47892 -58940 -66253 -52721 -76001 -83412 -76902 -38831 230 9861 39163 63853
8134 63853 77655 49258 -2315 -25905 -76496 -92451 -95758 -66858 -72817 -121348 -52690 62091
8122 62091 110371 100802 21020 -21763 -38784 -48228 -44853 -62201 -61079 -74294 -67103 -61310 -95460
$$ packed form
8210d9070N063P0069N1536l4531o3076N998J8152p337q50j4799m7292l7585K4836
8197g8886N4431J5691J2646K2419l769L5412N7098K5513k1521k6534L483P187
8185A03170k2101j3882j2105l0938j6268J1515M21L286m3720N0755P73O0420j6060
8172G5266j29772m1309O8099J724k3056M2248L3075L5451q2015n0918k1076R0472
8160a811N4464l091j3692k6119p331j4167L818j5352K431J3651l3458L2694K8911
8147B0948o7066j774j1048p313J3532k3280p411O510L8071L9061R631K9302K4690
8134F3853J3802k8397n1573k3590n0591j5955l307K8900n959m8531O8658J14781
8122F2091M8280r569p9782m2783j7021r444L375j7348J122j3215P191N793l4150
$$ plain form
8109 -95460 -42370 -20671 -114820 -168589 -167532 -127367 -85959 -58698 37119 67889 16807 -13538
8097 -13538 -35907 -36735 -29512 42408 81995 117223 162426 135980 94523 20768 -59231 -59385 -22075
8084 -22075 -7697 -6988 -16236 31285 89026 62277 -18352 -12536 -1538 11509 -21931 13043 9833
8071 9833 14884 64024 20057 -1696 21687 38913 15688 14485 2301 26463 44918 60034
8059 60034 12428 -14727 -21575 17670 12179 35914 35392 -1963 -8288 24637 38530 33881 65548
8046 65548 91488 54154 77631 112926 124043 152191 185101 92832 78038 103495 17537 46935
8034 46935 81614 64459 87871 113558 89336 117664 104893 115824 127911 69577 51510 2478
8022 2478 23513 54761 138294 174422 161824 170704 213510 233587 228884 223762 258672 244800 212464
$$ packed form
8109i5460N3090K1699r4149n3769J057M0165M1408K7261R5817L0770n1082l0345
8097a3538k2369q28P223P1920L9587L5228M5203k6446m1457p3755p9999j54L7310
8084b2075J4378P09r248M7521N7741k6749q0629N816J0998J3047l3440L4974l210
8071I833N051M9140m3967k1753K3383J7226k3225j203j2184K4162J8455J5116
8059F0034m7606k7155o848L9245n491K3735n22l7355o325L2925J3893m649L1667
8046F5548K5940l7334K3477L5295J1117K8148L2910r2269j4794K5457q5958K9398
8034D6935L4679j7155K3412K5687k4222K8328j2771J0931J2087n8334j8067m9032
8022B478K1035L1248Q3533L6128j2598Q880M2806K0077m703n122L4910j3872l2336
$$ plain form
8009 212464 215572 275965 258741 266875 277373 265459 259120 287528 285573 284472 311510 401005 350721
7996 350721 319310 327876 309234 242929 142341 131829 203636 178489 121560 101475 119480 100791
7984 100791 128455 138631 191306 194699 85425 62735 114412 102984 107030 110292 81333 116149
7972 116149 131805 110774 117460 111766 153893 178597 206387 208612 242949 185036 139101 174692
7960 174692 206724 277800 297421 303743 342638 403930 379798 271983 213501 190214 153450 104628
7948 104628 129857 119282 125073 145158 65452 49520 133864 138820 97918 61837 54248 38074
7936 38074 27656 84696 124017 136039 63136 81207 104956 84412 77269 80428 85632 110488
7924 110488 191745 200798 134865 30801 18572 94758 129649 134930 157815 173478 159970 195901
$$ packed form
8009B12464L108O0393j7224Q134J0498j1914o339K8408j955j101K7038Q9495n0284
7996C50721l1411Q566j8642o6305j00588j0512P1807k5147n6929k0085J8005j8689
7984A00791K7664J0176N2675L393j09274k2690N1677j1428M046L262k8959L4816
7972A16149J5656k1031O686n694M2127K4704K7790K225L4337n7913m5935L5591
7960A74692L2032P1076J9621O322L8895O1292k4132j07815n8482k3287l6764m8822
7948A04628K5229j0575N791K0085p9706j5932Q4344M956m0902l6081p589j6174
7936C8074j0418N7040L9321J2022p2903J8071K3749k0544p143L159N204K4856
7924A10488Q1257R053o5933j04064j2229P6186L4891N281K2885J5663j3508L5931
$$ plain form
7912 195901 228601 208894 163981 146615 161652 194120 138421 41716 -28654 -39043 -29693 -25632
7900 -25632 -54421 -49885 -9349 77413 112027 81760 60078 33140 23366 77471 80292 67295
7888 67295 104967 123094 106854 87517 55354 39446 50959 87814 91029 32858 -37910 31253
7876 31253 52923 10905 -10645 20840 35402 22927 -47334 -74750 -36722 64624 55511 -1085
7864 -1085 -28027 6885 3430 -13117 19608 21724 43422 51108 33771 18105 -8774 -101336 -142246
7851 -142246 -112847 -21633 5989 -28110 -98128 -85578 -59390 -54169 -56091 -39662 19424 -27304
7839 -27304 -85209 -83736 -25883 -52679 -41124 -24319 13673 -8642 -13139 21406 9371 34344
7827 34344 78538 78353 93960 80050 36923 16663 -23804 -74249 -87560 -57390 -54935 -55597 -88580
$$ packed form
7912A95901L2700j9707m4913j7366J5037L2468n5699r6705p0370j0389R350M061
7900b5632k8789M536M0536Q6762L4614l0267k1682k6938r774N4105K821j2997
7888F7295L7672J8127j6240j9337l2163j5908J1513L6855L215n8171p0768O9163
7876C1253K1670m2018k1550L1485J4562j2475p0261k7416L8028J01346r113n6596
7864a085k6942L4912l455j6547L2725K116K1698P686j7337j5666k6879r2562m0910
7851a42246K9399R1214K7622l4099p0018J2550K6188N221j922J6429N9086m6728
7839b7304n7905J473N7853k6796J1555J6805L7992k2315m497L4545j2035K4973
7827C4344M4194j85J5607j3910m3127k0260m0467n0445j3311L0170K455o62l2983
$$ plain form
7814 -88580 -78059 -71279 -67978 -16077 23715 -4427 33930 67560 29400 -36082 -32580 -30498 -41369
7801 -41369 -51082 -41851 -67426 -45660 -7262 -31461 -64405 -101242 -86610 -46200 -73959 -70430
7789 -70430 -15486 -31104 -44680 -9594 -6995 6472 -29227 -12217 -46569 -50615 -77369 -24090
7777 -24090 -12977 8233 19236 34084 22114 54756 83252 82579 21520 38896 50003 15057
7765 15057 2701 42346 9643 6280 28278 34509 60096 42754 29679 45543 35920 61095
7753 61095 62493 33512 4997 44481 44970 19799 -8636 -15917 -39758 14212 25338 40351 57705
7740 57705 33121 27926 -32060 -38788 16237 117659 89183 16462 1872 30226 57259 29688
7728 29688 48326 -8463 -50866 -97938 -116373 -52186 18406 57234 -8384 -20636 -7143 -34128
$$ packed form
7814h8580J0521O780L301N1901L9792k8142L8357L3630l8160o5482L502K082j0871
7801d1369r713R231k5575K1766L8398k4199l2944l6837J4632M0410k7759L529
7789g0430N4944j5618j3576L5086K599J3467l5699J7010l4352m046k6754N3279
7777b4090J1113K1210J1003J4848j1970L2642K8496o73o1059J7376J1107l4946
7765A5057j2356L9645l2703l363K1998O231K5587j7342j3075J5864r623K5175
7753F1095J398k8981k8515L9484M89k5171k8435p281k3841N3970J1126J5013J7354
7740E7705k4584n195n9986o728N5025J01422k8476p2721j4590K8354K7033k7571
7728B9688J8638n6789m2403m7072j8435O4187P0592L8828o5618j2252J3493k6985
$$ plain form
7716 -34128 -19082 -6394 -16758 2390 53036 84443 69190 31085 -10142 -12816 -3068 -4721
7704 -4721 28029 56368 68910 80638 86765 28714 -13079 12367 81682 117383 89949 71736
7692 71736 105373 97603 92466 53207 2660 -29933 -52754 -41192 -64883 -116112 -136766 -84195
7680 -84195 -64736 -31558 -13554 52331 79819 -3347 -42046 -46529 -83535 -84371 -180176 -219355
7668 -219355 -154366 -112161 -71179 -19430 71990 27292 -29238 -26470 31931 36783 73747 90685
7656 90685 70509 33281 45430 78951 80415 55777 99678 104575 46221 23326 63102 29664
7644 29664 -87007 -100174 -89075 -87672 -65593 -41395 -31122 20104 46678 -9536 -88330 -73349
7632 -73349 -25473 28203 -45668 -72962 5319 10999 -1870 12676 47313 50464 67649 57194
$$ packed form
7716c4128J5046J2688j0364J9148N0646L1407j5253l8105m1227k674R748j653
7704d721L2750K8339J2542J1728O127n8051m1793K5446O9315L5701k7434j8213
7692G1736L3637p770n137l9259n0547l2593k2821J1562k3691n1229k0654N2571
7680h4195J9459L3178J8004O5885K7488q3166l8699m483l7006q36r5805l9179
7668b19355O4989M2205M0982N1749R1420m4698n6530K768N8401M852L6964J6938
7656I0685k0176l7228J2149L3521J464k4638M3901M897n8354k2895L9776l3438
7644B9664j16671j3167J1099J403K2079K4198J0273N1226K6574n6214p8794J4981
7632g3349M7876N3676p3871k7294P8281N680j2869J4546L4637L151J7185j0455
$$ plain form
7620 57194 33906 -13598 -26726 -19781 -43687 -44523 -44264 -11875 -7183 7522 27685 44465 12973
7607 12973 -15156 1574 38221 38431 60928 26903 43660 56072 32705 -14508 32262 58046
7595 58046 111852 153953 115140 35848 13842 -50327 -105871 -77808 -9837 41874 53111 -8688
7583 -8688 -9005 -12302 -10038 -11271 754 1518 -14101 10276 3970 2374 -15579 -42477 -59595 -46698
7569 -46698 -60895 -69688 -69714 12805 41723 53919 32746 11954 -19228 -27319 -44578 -71952 -80998
7556 -80998 -64122 -58968 -60603 -106627 -99094 -49532 -33027 -27072 -38773 -33917 -24380 39758 86590
7543 86590 19127 -42897 -73099 -22364 -6365 6985 24077 15672 -22241 -29345 20740 -1418
7531 -1418 60964 69805 45827 37726 24848 54773 107098 114353 83583 59017 -16512 -44624 -48198
$$ packed form
7620E7194k3288m7504j3128O945k3906q36K59L2389M692J4705K0163J6780l1492
7607A2973k8129J6730L6647K10K2497l4025J6757J2412k3367m7213M6770K5784
7595E8046N3806M2101l8813p9292k2006o4169n5544K8063O7971N1711J1237o1799
7583h688l17l297K264j233J2025P64j5619K4377o306j596j7953k6898j7118J2897
7569d6698j4197q793k6Q2519K8918J2196k1173k0792l1182q091j7259k7374r046
7556h0998J6876N154j635m6024P533M9562J6505N955j1701M856R537O4138M6832
7543H6590o7463o2024l0202N0735J5999J3350J7092q405l7913p104N0085k2158
7531a418O2382Q841k3978q101j2878K9925N2325P255l0770k4566p5529k8112l574
$$ plain form
7518 -48198 -3881 8976 3269 -13107 -31377 -75069 -137812 -127157 -49518 -17278 6677 15766
7506 15766 37014 27938 5406 1457 -26944 -35157 -3859 32862 58651 49930 20606 -30001 -37624
7493 -37624 11260 22118 -7538 24039 91110 89855 48728 -19071 -88523 -128856 -77137 -60881
7481 -60881 -90781 -109867 -120796 -161455 -124846 -76340 -67566 3126 21806 5381 -18472 -71366
7469 -71366 -52461 -4366 -25698 19438 18824 16656 10428 49337 65257 67212 50054 12227 38432
7456 38432 81944 101651 26038 -17012 -62480 -83444 -112984 -32781 22832 -29131 -94305 -84479
7444 -84479 -56681 -33280 -11347 560 -26303 23381 53374 27333 -27384 -33787 -38980 -67385
7432 -67385 -67053 -61435 -24909 17461 -4553 -74217 -77962 -12126 32159 83216 95254 19333 8271
$$ packed form
7518d8198M4317J2857n707j6376j8270m3692o2743J0655P7639L2240K3955R089
7506A5766K1248r076k2532l949k8401q213L1298L6721K5789q721k9324n0607p623
7493c7624M8884J0858k9656L1577O7071j255m1127o7799o9452m0333N1719J6256
7481f0881k9900j9086j0929m0659L6609M8506Q774P0692J8680j6425k3853n2894
7469g1366J8905M8095k1332M5136o14k168o228L8909J5920J955j7158l7827K6205
7456C8432M3512J9707p5613m3050m5468k0964k9540Q0203N5613n1963o5174R826
7444h4479K7798K3401K1933J1907k6863M9684K9993k6041n4717o403n193k8405
7432f7385L32N618L6526M2370k2014o9664l745O5836M4285N1057J2038p5921j1062
$$ plain form
7419 8271 34920 53975 54800 -7077 -9063 31398 63501 57751 69396 92138 41909 -21661 -27865
7406 -27865 -44139 -72758 -71522 -71454 -11781 20155 45614 78483 52730 -8308 -28757 -48741 2890
7393 2890 -675 -35292 -39430 -35772 -43650 -43029 -38235 -94682 -111772 -69324 -46380 -26345 -14197
7380 -14197 -32278 -43808 -52853 19837 22042 495 22530 24337 44564 18118 10525 47018 60784
7367 60784 71560 -27022 -14668 16956 50889 29095 -46572 -79281 -70925 -50530 -50119 -44151 -52356
7354 -52356 -86133 -34325 -64632 -29689 11943 12376 6118 -13216 -6846 -67073 -103748 -117482 -131835
7341 -131835 -87325 -8233 18148 -25832 -73649 -75670 -42580 -23805 -13973 38901 -3557 -79138
7329 -79138 -56372 26122 26098 65779 146377 109115 3156 -25254 -68515 -82090 -95067 -89726
$$ packed form
7419H271K6649J9055Q25o1877j986M0461L2103n750J1645K2742n0229o3570o204
7406b7865j6274k8619J236O8N9673L1936K5459L2869k5753o1038k0449j9984N1631
7393B890l565l4617m138L658p878O21M794n6447j7090M2448K2944K0035J2148
7380a4197j8081j1530r045P2690K205k1547K2035J807K0227k6446p593L6493J3766
7367F0784J0776r8582J2354L1624L3933k1794p5667l2709Q356K0395M11N968q205
7354e2356l3777N1808l0307L4943M1632M33o258j9334O370o0227l6675j3734j4353
7341a31835M4510P9092K6381m3980m7817k021L3090J8775R832N2874m2458p5581
7329g9138K2766Q2494k4L9681Q0598l7262j05959k8410m3261j3575j2977N341
$$ plain form
7317 -89726 -62401 -63879 -22743 -28097 -26704 -10411 43621 44004 52706 76382 34340 13359 47088
7304 47088 22461 -20952 -37488 -37651 9432 -2743 5004 11506 10284 12066 -10502 -22544 25738
7291 25738 78366 99148 100139 50482 29787 7153 15180 53925 -22499 -64019 -73154 -39512 -32964
7278 -32964 18761 -9848 21353 16364 28656 15072 -8170 -5567 -17656 -7675 -22499 -47149
7266 -47149 -103649 -135724 -107094 -89927 -94941 -74134 -115618 -144946 -156297 -131218 -58209 -73791
7254 -73791 -66340 -50136 -49450 15221 -6721 -23666 -51459 1202 80400 136525 99299 5034
7242 5034 8672 11774 53034 71916 19456 -47470 -34592 -17189 -18537 -23394 27666 3528 -76633
7229 -76633 -158094 -177098 -103291 -14444 -12313 -8826 21802 19722 29174 1859 23551 -13984 -47395
$$ packed form
7317h9726K7325j478M1136n354J393J6293N4032L83Q702K3676m2042k0981L3729
7304D7088k4627m3413j6536j63M7083j2175P747O502j222J782k2568j2042M8282
7291B5738N2628K0782R91m9657k0695k2634Q027L8745p6424m1520r135L3642O548
7278c2964N1725k8609L1201m989J2292j3584k3242K603j2089R981j4824k4650
7266d7149n6500l2075K8630J7167n014K0807m1484k9328j1351K5079P3009j5582
7254g3791P451J6204O86O4671k1942j6945k7793N2661P9198N6125l7226r4265
7242E034L638L102M1260J8882n2460o6926J2878J7403j348m857N1060k4138q0161
7229g6633q1461j9004P3807Q8847K131L487L0628k080R452k7315K1692l7535l3411
$$ plain form
7216 -47395 54432 90005 69053 583 -10127 -523 -56122 -90082 -52984 -44188 1972 84675
7204 84675 99220 83859 76585 32995 9315 40332 56737 -9567 -57985 -38581 247 -6330
7192 -6330 15103 12204 1561 26577 49523 23545 71407 73694 99313 62278 69997 50971 50125
7179 50125 36023 -4813 6114 67335 52041 43545 97853 118663 65591 -10626 -29000 -56017
7167 -56017 -86000 -29591 33500 21038 -72957 -155756 -75217 20008 117175 72849 -36553 -31368
7155 -31368 12435 42676 48263 72220 81416 52812 40924 20169 826 -5757 9598 39188
7143 39188 38373 18487 104878 104404 60895 15245 -13631 -27009 -18899 4332 46673 102545 80831
7130 80831 93663 59715 30151 12265 26734 33432 41840 61105 38698 51486 53340 3255
$$ packed form
7216d7395J01827L5573k0952o8470j0710R604n5599l3960L7098Q796M6160Q2703
7204H4675J4545j5361p274m3590k3680L1017J6405o6304m8418J9404L8828o577
7192f330K1433k899j0643K5016K2946k5978M7862K287K5619l7035P719j9026q46
7179E0125j4102m0836J0927O1221j5294q496N4308K0810n3072p6217j8374k7017
7167e6017k9983N6409O3091j2462r3995q2799Q0539R5225R7167m4326j09402N185
7155c1368M3803L0241N587K3957R196k8604j1888k0755j9343o583J5355K9590
7143C9188q15j9886Q6391m74m3509m5650k8876j3378Q110K3231M2341N5872k1714
7130H0831J2832l3948k9564j7886J4469O698Q408J9265k2407J2788J854n0085
$$ plain form
7118 3255 -5585 -13314 -68469 -89717 -79612 -38402 64 -23073 -58644 -109802 -138627 -156285
7106 -156285 -131791 -61343 -20244 -44755 -46693 14731 61346 31657 7931 -10744 5043 -4291
7094 -4291 -9660 -55900 -67347 -50709 -65865 1736 38634 73237 22095 -12834 -27550 -3322
7082 -3322 -2889 67234 116038 86597 14536 -39345 -45714 -29236 -55068 -74192 -51382 15614 10272
7069 10272 -25678 -87282 -66761 -59190 -76492 8933 63243 12791 12884 14237 -40815 -107594 -106551
7056 -106551 -100146 -78831 -30520 8180 -9297 -11072 -30505 -17230 23544 84376 79053 4715
7044 4715 -50648 -64535 -27103 -36130 -107464 -136731 -98187 -59113 -31656 -27841 -40186 -65947
7032 -65947 -49912 -35303 -52688 -75194 -13847 -40913 -107278 -124481 -117572 -65246 -37223 -3017
$$ packed form
7118C255q840p729n5155k1248J0105M1210L8466k3137l5571n1158k8825j7658
7106a56285K4494P0448M1099k4511j938O1424M6615k9689k3726j8675J5787r334
7094d291n369m6240j1447J6638j5156O7601L6898L4603n1142l4929j4716K4228
7082c322M33P0123M8804k9441p2061n3881o369J6478k5832j9124K2810O6996n342
7069A0272l5950o1604K0521P571j7302Q5425N4310n0452R3J353n5052o6779J043
7056a06551O405K1315M8311L8700j7477j775j9433J3275M0774O0832n323p4338
7044D715n5363j3887L7432r027p1334k9267L8544L9074K7457L815j2345k5761
7032f5947J6035J4609j7385k2506O1347k7066o6365j7203O909N2326K8023L4206
$$ plain form
7020 -3017 -22613 7705 27001 -19637 -87400 -99642 -54909 3767 -28216 -54551 -2638 5420
7008 5420 -12149 -30339 -47619 -67947 -56023 -31073 -31392 -11319 10757 -15892 -32963 -59289
6996 -59289 -43758 15462 10444 -23856 -46324 -32675 -81320 -84860 -39674 -10654 -20785 -45714
6984 -45714 -90093 -98714 -59832 -17104 14058 23037 66755 82826 55982 -33579 -108546 -52282
6972 -52282 14057 -15182 -6703 29341 -4187 -77323 -101181 -98803 -87848 -99612 -130105 -115761
6960 -115761 -36177 44381 65329 48594 65433 95327 116415 157176 145579 142162 90163 109110
6948 109110 136351 99009 46780 -13618 -31030 -34356 -25941 -25174 -25633 -46068 -32799 83938 93917
6935 93917 78777 56870 15799 -1851 -16430 -25060 -5764 45057 66250 51784 1132 15136
$$ packed form
7020c017j9596L0318J9296m6638o7763j2242M4733N8676l1983k6335N1913Q058
7008E420j7569j8190j7280k0328J1924K4950l19K0073K2076k6649j7071k6326
6996e9289J5531N9220n018l4300k2468J3649m8645l540M5186K9020j0131k4929
6984d5714m4379q621L8882M2728L1162Q979M3718J6071k6844q9561p4967N6264
6972e2282O6339k9239Q479L6044l3528p3136k3858K378J0955j1764l0493J4344
6960a15761P9584Q0558K0948j6735J6839K9894K1088M0761j1597l417n1999J8947
6948A09110K7241l7342n2229o0398j7412l326Q415P67m59k0435J3269J16737R979
6935I3917j5140k1907m1071j7650j4579q630J9296N0821K1193j4466n0652J4004
$$ plain form
6923 15136 65919 97254 115376 63523 38298 29172 51344 -6458 -29075 -37437 -8457 -11776
$$ packed form
6923A5136N0783L1335J8122n1853k5225r126K2172n7802k2617q362K8980l319
$$ [...]
##END NTUPLES=NMR SPECTRUM
##END=
