##TITLE=Analysis number 323008
Compound Code mo 07679
Book Reference 407/129
Project Code adrs
Chemist Name andyw
##JCAMPDX= 6.0         $$ Bruker NMR JCAMP-DX V2.0
##DATA TYPE= NMR SPECTRUM
##DATA CLASS= NTUPLES
##ORIGIN= Bruker BioSpin GmbH
##OWNER= nmr
$$ XWIN-NMR		Version 3.5
$$ Mon Oct 16 20:08:06 2006 GMT Daylight Time (UT+1h)  MAYBRIDGE\nmr@NMR_250MHZ
##.OBSERVE FREQUENCY= 250.131544655141
##.OBSERVE NUCLEUS= ^1H
##.ACQUISITION MODE= SIMULTANEOUS (DQD)
##.ACQUISITION SCHEME= undefined
##.AVERAGES= 16
##.DIGITISER RES= 18
##SPECTROMETER/DATA SYSTEM= dpx250
##.PULSE SEQUENCE= zg30
##.SOLVENT NAME= DMSO
##.SHIFT REFERENCE= (INTERNAL, DMSO, 0, 16.522)
##AUDIT TRAIL= $$ (NUMBER, WHEN, WHO, WHERE, WHAT)
$$ ##TITLE= Audit trail, XWIN-NMR		Version 3.5
$$ ##JCAMPDX= 5.01
$$ ##ORIGIN= Bruker BioSpin GmbH
$$ ##OWNER= nmr
$$ C:\u/data/dgb/nmr/ADRS/610/pdata/1/auditp.txt
$$ ##AUDIT TRAIL=  $$ (NUMBER, WHEN, WHO, WHERE, WHAT)
(   1,<2006-10-16 20:07:46.35 +100>,<MAYBRIDGE\nmr>,<NMR_250MHZ>,
      <created by zg, POWCHK disabled, PULCHK disabled
       configuration hash MD5:
       49 4B E0 1D 92 C2 6B 37 9F E6 65 BC 52 41 86 1D
       data hash MD5: 64K
       48 0C 02 D7 3A 6C EA 56 B3 C8 82 B4 73 12 FE 70>)
(   2,<2006-10-16 20:07:58.31 +100>,<MAYBRIDGE\nmr>,<NMR_250MHZ>,
      <Start of raw data processing
       ef LB = 0.3 FT_mod = 6 PKNL = 1 SI = 32K 
       data hash MD5: 32K
       B1 15 47 3C A9 37 6D 49 6F E9 88 C2 61 CA 38 FE>)
(   3,<2006-10-16 20:08:00.06 +100>,<MAYBRIDGE\nmr>,<NMR_250MHZ>,
      <apk 
       data hash MD5: 32K
       3F A1 97 5B 8F F6 65 BE 78 ED 19 B0 58 ED 90 FB>)
(   4,<2006-10-16 20:08:00.88 +100>,<MAYBRIDGE\nmr>,<NMR_250MHZ>,
      <abs ABSG = 5 
       data hash MD5: 32K
       2E 0C 61 C0 87 10 BC AC 17 3E A9 00 18 A3 4D BA>)
$$ ##END=
$$ 
$$ hash MD5
$$ 8D 41 E2 04 43 DE 46 73 DC 52 27 7F 20 1D BA 0F
##$RELAX= 
##$RELAX= 
##$RELAX= 
##$RELAX= 
##$RELAX= 
##$RELAX= 
##$RELAX= 
$$ Bruker specific parameters
$$ --------------------------
##$DU= <C:\u>
##$EXPNO= 610
##$NAME= <ADRS>
##$PROCNO= 1
##$TYPE= <nmr>
##$USER= <dgb>
##$AMP= (0..31)
100 100 100 100 100 100 100 100 100 100 100 100 100 100 100 100 100 100 
100 100 100 100 100 100 100 100 100 100 100 100 100 100 
##$AQSEQ= 0
##$AQ_mod= 3
##$AUNM= <au_zg>
##$AUTOPOS= <45 >
##$BF1= 250.13
##$BF2= 250.13
##$BF3= 250.13
##$BF4= 250.13
##$BF5= 500.13
##$BF6= 500.13
##$BF7= 500.13
##$BF8= 500.13
##$BYTORDA= 1
##$CFDGTYP= 0
##$CFRGTYP= 5
##$CHEMSTR= <none>
##$CNST= (0..31)
1 1 145 1 1 1 1 1 1 1 1 1 1 1 1 1 1 1 1 1 1 1 1 1 1 1 1 1 1 1 1 1 
##$CPDPRG= <>
##$CPDPRG1= <>
##$CPDPRG2= <>
##$CPDPRG3= <>
##$CPDPRG4= <mlev>
##$CPDPRG5= <mlev>
##$CPDPRG6= <mlev>
##$CPDPRG7= <mlev>
##$CPDPRG8= <mlev>
##$CPDPRGB= <>
##$CPDPRGT= <>
##$D= (0..31)
0 1 0 0 0 0 0 0 0 0.06 0 0 0 0 0 0 0.0002 0 0 0 0 0 0 0 0 0 0 0 0 0 0 
0 
##$DATE= 1161025665
##$DBL= (0..7)
120 120 120 120 120 120 120 120 
##$DBP= (0..7)
150 150 150 150 150 150 150 150 
##$DBP07= 0
##$DBPNAM0= <>
##$DBPNAM1= <>
$$ [...]
##$SUBNAM7= <"">
##$SUBNAM8= <"">
##$SUBNAM9= <"">
##$SW= 20.6930455092707
##$SWIBOX= (0..15)
0 0 3 0 0 0 0 0 0 0 0 0 0 0 0 0 
##$SW_h= 5175.983436853
##$TD= 65536
##$TD0= 1
##$TE= 683.16
##$TE2= 300
##$TE3= 300
##$TEG= 300
##$TL= (0..7)
0 120 120 120 120 120 120 120 
##$TP= (0..7)
150 150 150 150 150 150 150 150 
##$TP07= 0
##$TPNAME0= <>
##$TPNAME1= <>
##$TPNAME2= <>
##$TPNAME3= <>
##$TPNAME4= <>
##$TPNAME5= <>
##$TPNAME6= <>
##$TPNAME7= <>
##$TPOAL= (0..7)
0.5 0.5 0.5 0.5 0.5 0.5 0.5 0.5 
##$TPOFFS= (0..7)
0 0 0 0 0 0 0 0 
##$TUNHIN= 0
##$TUNHOUT= 0
##$TUNXOUT= 0
##$USERA1= <user>
##$USERA2= <user>
##$USERA3= <user>
##$USERA4= <user>
##$USERA5= <user>
##$V9= 5
##$VALIST= <valist>
##$VCLIST= <CCCCCCCCCCCCCCC>
##$VD= 0
##$VDLIST= <DDDDDDDDDDDDDDD>
##$VPLIST= <PPPPPPPPPPPPPPP>
##$VTLIST= <TTTTTTTTTTTTTTT>
##$WBST= 1024
##$WBSW= 4
##$XGAIN= (0..3)
0 0 0 0 
##$XL= 0
##$YL= 0
##$YMAX_a= 501421
##$YMIN_a= -422919
##$ZGOPTNS= <>
##$ZL1= 120
##$ZL2= 120
##$ZL3= 120
##$ZL4= 120
##$ABSF1= 16.522
##$ABSF2= -4.171173
##$ABSG= 5
##$ABSL= 3
##$ALPHA= 0
##$AQORDER= 0
##$ASSFAC= 0
##$ASSFACI= 0
##$ASSFACX= 0
##$ASSWID= 0
##$AUNMP= <proc_1d>
##$AZFE= 0.1
##$AZFW= 0.1
##$BCFW= 0
##$BC_mod= 0
##$BYTORDP= 0
##$COROFFS= 0
##$CY= 12.5
##$DATMOD= 1
##$DC= 0
##$DFILT= <>
##$DTYPP= 0
##$F1P= 14.0000005364418
##$F2P= -0.99999901652339
##$FCOR= 0.5
##$FTSIZE= 32768
##$FT_mod= 6
##$GAMMA= 0
##$GB= 0
##$INTBC= 1
##$INTSCL= 1
##$ISEN= 128
##$LB= 0.3
##$LEV0= 0
##$LPBIN= 0
##$MAXI= 10000
##$MC2= 0
##$MEAN= 0
##$ME_mod= 0
##$MI= 0
##$NCOEF= 0
##$NC_proc= -5
##$NLEV= 6
##$NOISF1= 0
##$NOISF2= 0
##$NSP= 0
##$NTH_PI= 0
##$NZP= 0
##$OFFSET= 16.522
##$PC= 1
##$PHC0= -51.18102
##$PHC1= -1.401767
##$PH_mod= 1
##$PKNL= yes
##$PPARMOD= 0
##$PSCAL= 4
##$PSIGN= 0
##$REVERSE= no
##$SF= 250.13
##$SI= 32768
##$SIGF1= 0
##$SIGF2= 0
##$SINO= 400
##$SIOLD= 32768
##$SREGLST= <1H.DMSO>
##$SSB= 0
##$STSI= 32768
##$STSR= 0
##$SW_p= 5175.98343685301
##$SYMM= 0
##$S_DEV= 0
##$TDeff= 65536
##$TDoff= 0
##$TI= <Analysis number 999999
Compound Code 99
Book Reference 9
Project Code 9>
##$TILT= no
##$TM1= 0
##$TM2= 0
##$TOPLEV= 0
##$USERP1= <user>
##$USERP2= <user>
##$USERP3= <user>
##$USERP4= <user>
##$USERP5= <user>
##$WDW= 1
##$XDIM= 32768
##$YMAX_p= 449580134
##$YMIN_p= -425422
$$ End of Bruker specific parameters
$$ ---------------------------------
##NTUPLES= NMR SPECTRUM
##VAR_NAME=  FREQUENCY,     SPECTRUM/REAL,   SPECTRUM/IMAG
##SYMBOL=    X,             R,               I
##VAR_TYPE=  INDEPENDENT,   DEPENDENT,       DEPENDENT
##VAR_FORM=  AFFN,          ASDF,            ASDF
##VAR_DIM=   32768,         32768,           32768
##UNITS=     HZ,            ARBITRARY UNITS, ARBITRARY UNITS
##FACTOR=    0.157963299565203, 1,           1
##FIRST=     4132.6476996994, 0,             0
##LAST=      -1043.33573715361, 0,           0
##MIN=       -1043.33573715361, -425422,     0
##MAX=       4132.6476996994, 449580134,     0
$$ Real data points
##PAGE= N=1
##DATA TABLE= (X++(R..R)), XYDATA
$$ [...]
23603A91437r0944k5899j2658l0482J05290m3127r6419L7222R302J2721O337k1154
$$ 191437 100493 74594 61936 31454 136744 93617 -2802 34420 43722 56443 62780 41626
23591D1626L4807p5860q0224M3621n8905o689N9708K8870j294L5530K743P747
$$ 41626 76433 573 -79651 -36030 -94935 -101624 -41916 -13046 -14340 21190 23933 31680
23579C1680L2721m4575k777l7066M9833k0450k0112O0079p4755n8070K7211K8159
$$ 31680 64401 19826 17049 -20017 29816 9366 -10746 49333 -25422 -83492 -56281 -28122
23567b8122J5362J20353j1505n8885j1010j4115k8647L3121K1442k7989l0602
$$ -28122 -12760 107593 96088 37203 26193 12078 -16569 16552 37994 10005 -20597
23556b0597J9071p3924l2417j0562o368L1203Q9326J23753k663r4721j02135q911
$$ -20597 -1526 -75450 -107867 -118429 -124797 -93594 -4268 119485 116822 22101 -80034 -88945
23544h8945L2768m5444j13575N1154Q5632N8643r7007n1244n685Q106J00671o3589
$$ -88945 -56177 -101621 -215196 -164042 -78410 -19767 -116774 -168018 -173703 -165597 -64926 -128515
23532a28515k1425j2066o881K0050L0793m786m165N8227k9413L3489p2951m6771
$$ -128515 -149940 -162006 -168887 -148837 -118044 -122830 -126995 -68768 -98181 -64692 -137643 -184414
23520a84414N4197P5154J18968p245m9900p1168J08455J07965k3904j1191n1149
$$ -184414 -130217 -55063 63905 56660 6760 -64408 44047 152012 128108 116917 65768
23509F5768K1987j3709j2482p7486k4160M5164j7483K2822P7295j12833J8003
$$ 65768 87755 74046 61564 -15922 -40082 5082 -12401 10421 87716 -25117 -7114
23498g114L2086O2559j45578q2612l4534J6318o329J5209N3069L195n8083n7296
$$ -7114 24972 87531 -58047 -140659 -175193 -158875 -165204 -149995 -96926 -93731 -151814 -209110
23486b09110l1475J6500L3395P8063N3967n2568o4955n8096k3288R1536N8045
$$ -209110 -240585 -224085 -190690 -112627 -58660 -111228 -176183 -234279 -257567 -166031 -107986
23475a07986k3320k0830L2454Q2367Q2377o732k4334n9762q2827r7126l3925Q3148
$$ -107986 -131306 -152136 -119682 -37315 45062 38330 13996 -45766 -128593 -225719 -259644 -176496
23463a76496N3970L8991L7272o1964l1141j15152m5555Q3797P3936R8043l7087
$$ -176496 -122526 -83535 -46263 -108227 -139368 -254520 -300075 -216278 -142342 -44299 -81386
23452h1386k3115J8271O6142o8667j194L1396l0789j7528J36421J22387k2044
$$ -81386 -104501 -86230 -20088 -88755 -89949 -58553 -89342 -106870 29551 151938 129894
23441A29894l8750l7366j5746K1971l1225q1276M6637R9575j6555q6757m5192
$$ 129894 91144 53778 38032 60003 28778 -52498 -5861 93714 77159 -9598 -54790
23430e4790P019k996Q850j9445N4746j7501m9525K5791j7996M3627j08833r5052
$$ -54790 -47771 -50767 -41917 -61362 -6616 -24117 -73642 -47851 -65847 -22220 -131053 -226105
23418b26105J2440k6181M4444M9609K2094l8322o497K6832P2849m9186J6557L0919
$$ -226105 -213665 -239846 -195402 -145793 -123699 -162021 -168518 -141686 -68837 -118023 -101466 -70547
23406g0547l4633j5610J1773j3826J0801Q1435J10114M4266q7200m6394j5873
$$ -70547 -105180 -120790 -109017 -122843 -112042 -30607 79507 123773 36573 -9821 -25694
23395b5694K5813m0679K8527P9829j32824n5336K3305n0860k1516K3847O4473
$$ -25694 119 -40560 -12033 67796 -65028 -120364 -97059 -147919 -169435 -145588 -81115
23384h1115O1521o8011l0682L7135L3678Q0647J6753p0259p0012j9386J12668
$$ -81115 -19594 -87605 -118287 -81152 -47474 33173 49926 -20333 -90345 -109731 2937
23373B937K3411L6595P2864M0901o6822m7108O3409k0368j29884k8192P1298k8027
$$ 2937 26348 62943 135807 176708 109886 62778 126187 105819 -24065 -52257 19041 -8986
23361h986q9471R9057l3574n3221L1732O947p540M5380j1678j44702O136l4905
$$ -8986 -98457 600 -32974 -86195 -54463 -47516 -55056 -9676 -21354 -166056 -159920 -194825
23349a94825J02256J64628q2789p3862j00011j4525N3842J51675N3955n1236l2957
$$ -194825 -92569 72059 -10730 -84592 -184603 -199128 -145286 6389 60344 9108 -23849
23338b3849o9402O864m4202L6637L8375m587K6004p2814N5543P6701m6465l7028
$$ -23849 -93251 -86387 -130589 -93952 -55577 -60164 -34160 -106974 -51431 25270 -21195 -58223
23326e8223r0234q4983J7358L5985J43080O7675k0212l286L3841p562n5889o7268
$$ -58223 -148457 -233440 -216082 -180097 -37017 30658 10446 7160 41001 33439 -22450 -89718
23314h9718L9090l3616p598j4061l7743M3411Q062K7446M6378M361O7263N4001
$$ -89718 -50628 -84244 -91842 -105903 -143646 -100235 -92173 -64727 -18349 -13988 53275 107276
23302A07276J06191K8554j45051j13393l5257p7162k4847J286J09498Q8380p6502
$$ 107276 213467 242021 96970 -16423 -51680 -128842 -153689 -152403 -42905 45475 -31027
23291c1027n9429l2125l8382M6757J2M5371J09928L5769n0204k3805p9739m8742
$$ -31027 -90456 -122581 -160963 -114206 -114194 -68823 41105 76874 26670 2865 -76874 -125616
23279a25616m3450M10J4012N8104q971K6517M2774K0500j7363p9692j16897M4601
$$ -125616 -169066 -168656 -154644 -96540 -105511 -78994 -36220 -15720 -33083 -112775 -229672 -185071
23267a85071R0480R4461j7995l062M1874J5975J950L0186P399k5204j8437l1326
$$ -185071 -94591 -130 -18125 -21187 20687 36662 38612 68798 76197 50993 32556 1230
23255A230n9639m0023O9860M82m4040M1063L0145j1996K3904P4534J1697l5077
$$ 1230 -58409 -98432 -28572 -28090 -72130 -31067 -922 -12918 10986 85520 97217 62140
23243F2140o3409k3818n4758J693N6654m1654p8252l4972n5371J176R4917N2488
$$ 62140 -1269 -25087 -79845 -78152 -21498 -63152 -141404 -176376 -231747 -230571 -135654 -83166
23231h3166P2588J01648M2955j16k7267q3382m6669J2799L1463P7171J9070j06160
$$ -83166 -10578 91070 134025 133909 106642 23260 -23409 -10610 20853 98024 117094 10934
23219A0934j05453m4497M5315J00016J22475O3530q0834j57942O7283m1472R186
$$ 10934 -94519 -139016 -93701 6315 128790 192320 111486 -46456 20827 -20645 -11459
23208a1459r518j10843m9152O389J99250R8531o5324m6030k4119L1487k3896n9850
$$ -11459 -20977 -131820 -180972 -174583 24667 123198 57874 11844 -12275 19212 -4684 -64534
23196f4534p6172N9732l758J15742l4167j09522O943O7863L9866n1084o6017j2631
$$ -64534 -140706 -80974 -84732 31010 -3157 -112679 -105736 -37873 1993 -49091 -115108 -127739
23184a27739P331k882l4238Q9116J19276o5271p1093R329L8467k5011M3727R3201
$$ -127739 -120408 -123290 -157528 -68412 50864 -14407 -85500 -76171 -37704 -62715 -18988 74213
23172G4213n8237j54799p5933N6504K2214M4620M8084M064m8816L1380l1987K4660
$$ 74213 15976 -138823 -214756 -158252 -136038 -91418 -43334 -39270 -88086 -56706 -88693 -64033
23160f4033L7495l468m8610r759r8606k7522J21676J15770n3469N4853q3843n5764
$$ -64033 -26538 -30006 -78616 -88375 -186981 -214503 -92827 22943 -30526 24327 -59516 -115280
23148a15280m2675j6758M1854P7179k3102N0083L837l6096q1898L7701o0191O6883
$$ -115280 -157955 -174713 -132859 -55680 -78782 -28699 -24862 -60958 -142856 -105155 -165346 -98463
23136i8463N0158k1506k4339J0005K3680J9168Q9343l3378l8671o0853J3422P1298
$$ -98463 -48305 -69811 -94150 -84145 -60465 -41297 48046 14668 -24003 -84856 -71434 -136
23124a36R1729j045l9234r0986n9244L8246M695M4854r838m9934p1563P3900M5543
$$ -136 91593 90548 51314 -39672 -98916 -60670 -55975 -11121 -20959 -70893 -142456 -68556 -23013
23111b3013L472n6416l5806m1621j4987N1629M2889J0735l6547k2243L3961q128
$$ -23013 -19541 -75957 -111763 -153384 -168371 -116742 -73853 -63118 -99665 -121908 -87947 -96075
23099i6075j18572j69061J28445J17037j3377N6185K4453M6102p345q4650q0159
$$ -96075 -214647 -383708 -255263 -138226 -151603 -95418 -70965 -24863 -32208 -116858 -197017
23088a97017l580J4345M4443K1288l752P9248R1795L4855m9632l5591l3248j2340
$$ -197017 -200597 -186252 -141809 -120521 -124273 -45025 46770 81625 31993 -3598 -36846 -49186
23076d9186o3945o2312k0205O0898M6638J1656k9594L866k3198l3098j6531N4862
$$ -49186 -113131 -175443 -195648 -134750 -88112 -76456 -106050 -102184 -125382 -158480 -175011 -120149
23064a20149P2861J8475m6931k2934Q114n5019l2197K8352O8517P9469K041M2350
$$ -120149 -47288 -28813 -75744 -98678 -90564 -145583 -177780 -149428 -80911 -1442 599 42949
23052D2949O5379K395M0524j20544l5961l976l1007n4419j6532O8954J7065j8509
$$ 42949 108328 110723 151247 30703 -5258 -9234 -40241 -94660 -111192 -42238 -25173 -43682
23040d3682j7532q0963l8123o7356K3663M9342J01644R1485j7364p9072j3464
$$ -43682 -61214 -142177 -180300 -247656 -223993 -174651 -73007 18478 1114 -77958 -91422
23029i1422K2028L2303K8279Q1753l6708j04874q2914l6918P5728n4745o6518
$$ -91422 -69394 -37091 -8812 72941 36233 -68641 -151555 -188473 -112745 -167490 -234008
23018b34008m2818M14p1469K9529Q8183k8745O8459K4479K2937R6237K5855j20089
$$ -234008 -276826 -276412 -347881 -318352 -230169 -258914 -190455 -165976 -143039 -46802 -20947 -141036
23006a41036l7585l0464M3684p70l0339Q637J6292n8966K5538j3774Ko3167J13212
$$ -141036 -178621 -209085 -165401 -166171 -196510 -187873 -171581 -230547 -205009 -218783 -218781 -281948 -168736
22993a68736J11961k9267J8754J8442N28L7846K740n6736r953N8263K5857o5406
$$ -168736 -56775 -86042 -67288 -48846 -48318 -10472 -7732 -64468 -74421 -16158 9699 -55707
22981e5707r0329J07016K0084j71404j0587P4841o055J6748J09569j9998n3810
$$ -55707 -146036 -39020 -18936 -190340 -200927 -126086 -132141 -115393 -5824 -25822 -79632
22970g9632m4965j22297N7718K2723j8881N3894J9420l5514n4280K9429M8901
$$ -79632 -124597 -246894 -189176 -166453 -185334 -131440 -112020 -147534 -201814 -172385 -123484
22959a23484K3820R7635Q6648r5602q0815k4907P6611O5320K2299p6518l5613
$$ -123484 -99664 -2029 84619 -10983 -91798 -116705 -40094 25226 47525 -28993 -64606
22948f4606p4136L3713N5937J0866R755j06107j4268O4913M2973n6807m4521j3699
$$ -64606 -138742 -105029 -49092 -38226 -28471 -134578 -148846 -83933 -40960 -97767 -142288 -155987
22936a55987k1025K1333j6178j7243m1904l1646j887j7871M7520O1451M6578J3741
$$ -155987 -177012 -155679 -171857 -189100 -231004 -262650 -264537 -282408 -234888 -173437 -126859 -113118
22924a13118l6149k3247P4909O3221k7913J390m2156q9508L2885J08356m6879
$$ -113118 -149267 -172514 -97605 -34384 -62297 -60907 -103063 -192571 -159686 -51330 -98209
22913i8209J394k2841m0680P1512K3760l8693Q429N5063j5834n9488j1037J36594
$$ -98209 -96815 -119656 -160336 -88824 -65064 -103757 -95328 -40265 -56099 -115587 -126624 9970
22901I970L8621j24405N359K4377j27394r700K452O7108J3727l0883m025J25300
$$ 9970 48591 -75814 -70455 -46078 -173472 -183172 -180720 -113612 -99885 -130768 -134793 -9493
22889i493l2701o6284J9377O6187M3754J8155Q583M7772K9667j25965o0758j7479
$$ -9493 -42194 -108478 -89101 -22914 20840 38995 47578 95350 125017 -948 -61706 -79185
22877g9185L1411O8415p7129j58346M0421O7858J7544O2435J0526N460j08761
$$ -79185 -47774 20641 -56488 -214834 -174413 -106555 -89011 -26576 -16050 -10590 -119351
22866a19351r5538L2992L3991r7791J22968J18725J26784l4010o8979j07919J4021
$$ -119351 -214889 -181897 -147906 -245697 -122729 -4004 122780 88770 19791 -88128 -74107
22855g4107J369O4630R448m3258O841k2335O221K2381j14231o6533J04935R7368
$$ -74107 -72738 -8108 1340 -41918 -35077 -57412 -51191 -28810 -143041 -209574 -104639 -7271
22843g271l3805j9176N5834N5728j06071j539K424r861J1626p6192j12384j3919
$$ -7271 -41076 -60252 -4418 51310 -54761 -56300 -53876 -63737 -52111 -128303 -240687 -254606
22831b54606L1810J05962N1926M6815m7455q3193K1283N5185N2217K1116k4716
$$ -254606 -222796 -116834 -64908 -18093 -65548 -148741 -127458 -72273 -20056 1060 -23656
22820b3656j09448K89K2196P1036r0146J4436O3366J2887j2326l9767J07164N632
$$ -23656 -133104 -132815 -110619 -39583 -129729 -115293 -51927 -39040 -51366 -91133 16031 21663
22808B1663m5250L6766O1329k9407k9137o6872p9186o5470K4452K8312K0498O4517
$$ 21663 -23587 13179 74508 45101 15964 -50908 -130094 -195564 -171112 -142800 -122302 -57785
22796e7785M0261n6085K9057M2726q2660o8363L8045J19886n0458M221K9911m8158
$$ -57785 -17524 -73609 -44552 -1826 -84486 -152849 -114804 5082 -45376 -41155 -11244 -59402
22784e9402j5977k1229N480L9104p4850N4826M4385K2648M974k4677k5710K7764
$$ -59402 -75379 -96608 -91128 -52024 -126874 -72048 -27663 -5015 -41 -24718 -50428 -22664
22772b2664M2977j1393k6912p1724K1331L6867m8266o0259n7292k8007R5641P4701
$$ -22664 20313 8920 -17992 -89716 -68385 -31518 -79784 -140043 -197335 -225342 -129701 -55000
22760e5000J20140L263q4320K3852M1424j5047k3744o2242k0184P792J5880p0761
$$ -55000 65140 68403 -15917 7935 49359 34312 10568 -51674 -71858 -64066 -48186 -118947
22748a18947p5382m9936M7789P6880k6353o5768l3034k2643k1277L3810k9401
$$ -118947 -194329 -244265 -196476 -119596 -145949 -211717 -244751 -267394 -288671 -254861 -284262
22737b84262Q8740P2827R625K8767J0529p0301J6317O8352j2080L4138N0301n0646
$$ -284262 -195522 -122695 -113070 -84303 -73774 -144075 -127758 -59406 -71486 -37348 12953 -37693
22725c7693n6053J2454l4989n3612o0012J6729J3859m7954n0444j7291P4673R7023
$$ -37693 -93746 -81292 -116281 -169893 -229905 -213176 -199317 -247271 -297715 -315006 -240333 -143310
22713a43310O1595M1442l1325l0357n0864J13631N5040n5714k6669K9927k623
$$ -143310 -81715 -40273 -71598 -101955 -152819 -39188 15852 -39862 -66531 -36604 -39227
22702c9227L0986R505K9220J4614n737m3767p0915p4810l5254L7417N5195J6054
$$ -39227 -8241 1264 30484 45098 39361 -4406 -75321 -150131 -185385 -147968 -92773 -76719
22690g6719J1219k4851n6727L9215M4100n3381l9339L4358Q5818L7520p527m5445
$$ -76719 -65500 -90351 -147078 -107863 -63763 -117144 -156483 -122125 -36307 1213 -6314 -51759
22678e1759N264Q1250K3869m7380q197j07947J0838J10528N4565o7937o0419l3713
$$ -51759 -46495 34755 58624 11244 3047 -104900 -94062 16466 71031 3094 -57325 -91038
22666i1038J6990Q3121K5696l4654r5516k0275k5001n6937P7961J25170j3924
$$ -91038 -74048 9073 34769 115 -95401 -115676 -140677 -197614 -119653 5517 -8407
22655h407j03025n4135K8980J15631J033k160j2955m5310q3051l234O41L8722
$$ -8407 -111432 -165567 -136587 -20956 -19923 -22083 -35038 -80348 -163399 -166633 -165992 -127270
22643a27270q531J4639M5904m8334m764J9653k0733l6784J07013K4264r5237L4627
$$ -127270 -135801 -121162 -75258 -123592 -128356 -108703 -129436 -166220 -59207 -34943 -130180 -95553
22631i5553l033k7339N1768l6388r0269K5882P9034N5503k4984L9311O2073j4939
$$ -95553 -98586 -125925 -74157 -110545 -200814 -174932 -95898 -40395 -65379 -26068 36005 21066
22619B1066j06733p6211m6354Q909Q373O9399J1137J3550l2291l9l491R7127k8619
$$ 21066 -85667 -161878 -208232 -199323 -190950 -121551 -110414 -96864 -129155 -129194 -132685 -35558 -64177
22606f4177l5779j6442n1406J4782k1752Q3691N38K2122L6694j6160J0984Q4112
$$ -64177 -99956 -116398 -167804 -153022 -174774 -91083 -90545 -68423 -31729 -47889 -36905 47207
22594D7207l8309n5805r883K4121J523L4675M6740O4774k5008m6303o2411j31869
$$ 47207 8898 -46907 -56790 -32669 -31146 3529 50269 115043 90035 43732 -18679 -150548
22582a50548M1055J03976l466m6112J598P4538N5017n7107l6313M1068o7585l3968
$$ -150548 -109493 -5517 -8983 -55095 -53497 21041 76058 18951 -17362 23706 -43879 -77847
22570g7847j2Q1536R2269Q4215p7151j38902k5515N6336n5953K0925L0130l3346
$$ -77847 -77859 3677 95946 180161 103010 -35892 -61407 -5071 -61024 -40099 -9969 -43315
22558d3315j8721j3422J1189J3169R6801j0308q7541r6644M8626R3337k0406K8458
$$ -43315 -62036 -75458 -64269 -51100 45701 35393 -52148 -148792 -100166 -6829 -27235 1223
22546A223l018k8964p2911M8415K8951l9836k1923o4842o2882r1857O0038m1949
$$ 1223 -1795 -30759 -103670 -55255 -26304 -66140 -88063 -152905 -215787 -307644 -247606 -289555
22534b89555O7432K0074J4852J7639J3955O0804J44209Q0618o0221n0623q8352
$$ -289555 -222123 -202049 -187197 -169558 -155603 -94799 49410 130028 69807 19184 -69168
22523f9168j25451n7273n4932j396N1208N9743P2501J0904m2957M3336R8349J7273
$$ -69168 -194619 -251892 -306824 -308220 -257012 -197269 -124768 -113864 -156821 -113485 -15136 2137
22511B137K3064M5642k0780m7498l1112N147l2334q4202q161k5609J4025M5166
$$ 2137 25201 70843 50063 2565 -28547 -23400 -55734 -139936 -148097 -173706 -159681 -114515
22499a14515M1951M3207l5832R2118j7291n5588k4269n3743k3949j150P0388k5425
$$ -114515 -72564 -29357 -65189 26929 9638 -45950 -70219 -123962 -147911 -149061 -78673 -104098
22487a04098n3125q2614q0156K5321N7998r614M2461O4858L0505P9290n9197m7797
$$ -104098 -157223 -239837 -319993 -294672 -236674 -246288 -203827 -138969 -108464 -29174 -88371 -136168
22475a36168l7624j946O6761J05176P2964m4906n0367p77M312K7523K6646J00497
$$ -136168 -173792 -175738 -108977 -3801 69163 24257 -26110 -26887 -22575 4948 31594 132091
22463A32091o9869r2626p4549p9104j9500R4470M59p096K0678M3712o2025L1294
$$ 132091 62222 -30404 -104953 -184057 -203557 -109087 -108628 -115724 -95046 -51334 -113359 -82065
22451h2065m0867m8106N941J8010K1763m0904K0300Q2927P5922k8302o7894n9437
$$ -82065 -122932 -171038 -165097 -147087 -125324 -166228 -145928 -63001 12921 -15381 -83275 -142712
22439a42712k8095J8662R6088J8687o811K1341n3955J6226o0772O7857K0990O5658
$$ -142712 -170807 -152145 -56057 -37370 -44181 -22840 -76795 -60569 -121341 -53484 -32494 33164
22427C3164M1041K1828j06938N0597K4622r584o1610r4133l7514K9191J45952
$$ 33164 74205 96033 -10905 39692 64314 54730 -6880 -101013 -138527 -109336 36616
22416C6616P0982j7788o1743j46436j03043O3442R4523N9478N3933M9143j6871
$$ 36616 107598 89810 28067 -118369 -221412 -157970 -63447 -3969 49964 99107 82236
22405H2236n1503k9294J4930J5819l2268l1185j32457j30754K8668J47720P9800
$$ 82236 30733 1439 16369 32188 -80 -31265 -163722 -294476 -265808 -118088 -38288
22394c8288N5092J8693p1456L7181O8241l8977p8226J26702Q8854j12982k0234
$$ -38288 16804 35497 -35959 1222 69463 30486 -47740 78962 167816 54834 34600
22383C4600O8040j2527o4324Q572j2760j07615q1121J14185J9788l0529R2592
$$ 34600 102640 90113 25789 34361 21601 -86014 -167135 -52950 -33162 -63691 28901
22372B8901L4944q6491N6882o153j41133j4565K4461K3856Q3635j616j7110l3229
$$ 28901 63845 -22646 34236 28083 -113050 -127615 -103154 -79298 4337 2721 -14389 -47618
22360d7618k7382j3586K1933k3958M8334P7808j00611j57298L358P5424N0004
$$ -47618 -75000 -88586 -66653 -90611 -42277 35531 -65080 -222378 -219020 -143596 -93592
22349i3592N9336p8661o5632O9623p947M4759o433L0536k7713j0051K6618J04626
$$ -93592 -34256 -112917 -178549 -108926 -116873 -72114 -78547 -48011 -75724 -85775 -59157 45469
22337D5469Q697k6475k4221o7228j26243j41838R3346J57867J9069J7014J7749
$$ 45469 54166 27691 3470 -63758 -190001 -331839 -238493 -80626 -61557 -44543 -26794
22326b6794J19408J3016j49185n3741o1566l8378k6638L5317N9965r8189m521
$$ -26794 92614 105630 -43555 -97296 -158862 -197240 -223878 -188561 -128596 -226785 -231306
22315b31306P3439J32886J09309q4804k6212K9312P8554j07066q5208n9915m6318
$$ -231306 -157867 -24981 84328 -476 -26688 2624 81178 -25888 -111096 -171011 -217329
22304b17329o8324m2013J23546J10249P112p811K0971O6039J3870k8321N0760
$$ -217329 -285653 -327666 -204120 -93871 -86759 -94570 -73599 -7560 6310 -22011 28749
22293B8749M0457j6691j02211l2304k7768j3442j3604k6005p032M2836R8191N8636
$$ 28749 69206 52515 -49696 -82000 -109768 -123210 -136814 -162819 -169851 -127015 -28824 29812
22281B9812p8010L1428L5779n0296J543J6301j2276k4277K0244K7758K0479j8949
$$ 29812 -48198 -16770 19009 -31287 -29744 -13443 -25719 -49996 -29752 -1994 18485 -464
22269d64j5645O5041o0478j29748m0236k6080L747K6678R1007J23760J06065n1686
$$ -464 -16109 48932 -11546 -141294 -181530 -207610 -203863 -177185 -86178 37582 143647 91961
22257I1961k13509Q684K2860k3296n7374r3540n5240K5891N9417J08461N0781
$$ 91961 -121548 -112864 -90004 -113300 -170674 -264214 -319454 -293563 -234146 -125685 -74904
22246g4904k5778n7944j0815L1921J8353J5582j03N1220R4720M8511o8983j2474
$$ -74904 -100682 -158626 -169441 -137520 -119167 -103585 -103688 -52468 42252 90763 21780 9306
22234I306j4336l1958j8132o9824q133L0924r530M5812N27J05729L9725m5124
$$ 9306 -5030 -36988 -55120 -124944 -133077 -102153 -111683 -65871 -65344 40385 80110 34986
22222C4986m6851n520k4281l1538n1376k5669r239n3945K2397j102L886K5869
$$ 34986 -11865 -17385 -41666 -73204 -124580 -150249 -159488 -213433 -191036 -192138 -188252 -162383
22210a62383Q5089J04700p5020p5833p3266j25924R9182J0740m6281j0835K4142
$$ -162383 -77294 27406 -47614 -123447 -196713 -322637 -223455 -212715 -258996 -269831 -245689
22199b45689J7258k9708l7917k0582k2408J47701J50483n6855j3706M8656R6653
$$ -245689 -228431 -258139 -296056 -316638 -339046 -191345 -40862 -97717 -111423 -62767 33886
22188C3886n0259k9232K5672R1535L3620k8540r3551p3367J4488M6320j6217o686
$$ 33886 -16373 -45605 -19933 71602 105222 76682 -16869 -90236 -75748 -29428 -45645 -52331
22176e2331k693j6822j8668m9832P9342j6268J6725l909n0462j9057j3148K4912
$$ -52331 -55024 -71846 -90514 -140346 -61004 -77272 -60547 -64456 -114918 -133975 -147123 -122211
22164a22211J2961N2547j5790M0749K6916O389K2472J8105j5110m7552k5818M40
$$ -122211 -109250 -56703 -72493 -31744 -4828 1561 24033 42138 27028 -20524 -46342 -45902
22152d5902l7739j09724O3840J00349J8368K7881J1509j31479j24622J9164O0585
$$ -45902 -83641 -193365 -129525 -29176 -10808 17073 28582 -102897 -227519 -208355 -147770
22141a47770R601J8028M3967J18482Q4867k6649j46660O6432N8q5503k0479O0680
$$ -147770 -138169 -120141 -76174 42308 127175 100526 -46134 20298 20356 -65147 -85626 -24946
22129b4946N9956j41706K1428N2817J138L4624o6492l6596n6719n9902j2522P657
$$ -24946 35010 -106696 -85268 -32451 -31313 3311 -63181 -99777 -156496 -216398 -228920 -221263
22117b21263J0851J860L0332k9858k86M4916L0227R2264J05767Q1193r2582r3451
$$ -221263 -210412 -208552 -178220 -208078 -208364 -163448 -133221 -40957 64810 146003 53421 -40030
22105d0030K2548m5359P119j1405m0624p914K2076k8627n9428N0542j7647j8936
$$ -40030 -17482 -62841 -55722 -67127 -107751 -115665 -93589 -122216 -181644 -131102 -148749 -167685
22093a67685o6283m1143N9550J06546m1991j1310N7284O4446k7253M4268j3261
$$ -167685 -233968 -275111 -215561 -109015 -151006 -162316 -105032 -40586 -67839 -23571 -36832
22082c6832k2252K1918k4909n0547n4580l0956n498k7989O8874j0428j7750N930
$$ -36832 -59084 -37166 -62075 -112622 -167202 -198158 -203656 -231645 -162771 -173199 -190949 -185019
22070a85019l6564l4830R0471J9712j0903L6650N4767R6577M776k550q9447K997
$$ -185019 -221583 -256413 -165942 -146230 -157133 -120483 -65716 30861 35637 33087 -56360 -53363
22058e3363Q8169N1154j1161J955j33259K7137K2076R898N1161j00478j39949
$$ -53363 34806 85960 74799 76754 -56505 -29368 -7292 2606 53767 -46711 -186660
22047a86660j5658R2951m6450j08689O0150K3745o804J9637J03795R918r4346
$$ -186660 -202318 -109367 -155817 -264506 -204356 -180611 -187415 -167778 -63983 -54065 -148411
22036a48411M218K7920j00362j2091J50478L9939R931j7988n7283K4250L0570
$$ -148411 -144193 -116273 -216635 -228726 -78248 -38309 -28378 -46366 -103649 -79399 -48829
22025d8829K9442j652o6624K1094r8459L7371J2446n587R932j2427j25067J17338
$$ -48829 -19387 -21039 -87663 -66569 -165028 -127657 -115211 -120798 -110866 -123293 -248360 -131022
22013a31022J12983q5127m0205J01073N4182J0240J8631p6663l7891j0676o4703
$$ -131022 -18039 -103166 -143371 -42298 11884 22124 40755 -35908 -73799 -84475 -149178
22002a49178l8287J25734l8616N5171l5486m4815p8696M0059J62849K8181j09614
$$ -149178 -187465 -61731 -100347 -45176 -80662 -125477 -204173 -164114 -1265 26916 -82698
21991h2698l3421N9218M457o6619K9584L9398k7217k4803O6267q1903l6223j054
$$ -82698 -116119 -56901 -52444 -119063 -89479 -50081 -77298 -102101 -35834 -117737 -153960 -155014
21979a55014K9007J8714o0650m5611L8998l855N4246n610p2636n8965J8738P5363
$$ -155014 -126007 -107293 -167943 -213554 -174556 -178411 -124165 -129775 -202411 -261376 -242638 -167275
21967a67275N0309j0514q61K4698o7441k3360K5890p048J0179J3512j5614m7281
$$ -167275 -116966 -127480 -128341 -103643 -171084 -194444 -168554 -175602 -165423 -151911 -167525 -214806
21955b14806K2345N2878q0072R6452P3554L2194o8498m2825l9910m8611J09417
$$ -214806 -192461 -139583 -219655 -123203 -49649 -17455 -85953 -128778 -168688 -217299 -107882
21944a07882N9755r2617n5838J01099R7324O6397r6667o6466r6507K2451M1104
$$ -107882 -48127 -140744 -196582 -95483 1841 68238 -28429 -94895 -191402 -168951 -127847
21933a27847o5775k7994l9785M6747J10154m8146m4775J721K1566j8390P2675
$$ -127847 -193622 -221616 -261401 -214654 -104500 -152646 -197421 -195700 -174134 -192524 -119849
21922a19849L2849m3659K3901N2331K1251N9948m194l6426j4270n4976j9498J5277
$$ -119849 -87000 -130659 -106758 -54427 -33176 26772 22578 -13848 -28118 -83094 -102592 -87315
21910h7315k7858o7928K605R091M7181R952P020M8296K5205j16380j04805j3919
$$ -87315 -115173 -183101 -180496 -171405 -124224 -114272 -107252 -58956 -33751 -150131 -254936 -268855
21898b68855n277k2252J06708J52889J7429j38481r3224j7303L2624M6712j7367
$$ -268855 -274132 -296384 -189676 -36787 -19358 -157839 -251063 -268366 -235742 -189030 -206397
21887b06397m5271p994P8441Q3946M3236N6553k6502m0297J0246J07117p6336
$$ -206397 -251668 -259662 -181221 -97275 -54039 2514 -23988 -64285 -54039 53078 -23258
21876b3258m3656j07820j64680N1234J83094m367j54588r2064J58847p786p7967
$$ -23258 -66914 -174734 -339414 -288180 -105086 -109453 -264041 -356105 -197258 -205044 -283011
21865b83011K9778L8503L1750k408P0239L3016k0039O7383N3118p1023m9304m2703
$$ -283011 -253233 -214730 -182980 -185388 -115149 -82133 -102172 -34789 18329 -52694 -101998 -144701
21853a44701k5758Q5931P1096k7955N0191J8724j8993k7356L2222l7825k2968
$$ -144701 -170459 -84528 -13432 -41387 8804 27528 8535 -18821 13401 -24424 -47392
21842d7392N9259R68j8242m8077j78567j4259J9764j5679J1008O2789k4974k888
$$ -47392 11867 12835 -5407 -53484 -232051 -246310 -226546 -242225 -231217 -168428 -193402 -196290
21830a96290Q2191L9250r3934O3317J3855o4123n3531r3695L9577J23832L2264
$$ -196290 -114099 -74849 -168783 -105466 -91611 -155734 -209265 -302960 -263383 -139551 -107287
21819a07287j02850k8081m3561J61624m5466k3114M8020M5211J32491o4537p8484
$$ -107287 -210137 -238218 -281779 -120155 -165621 -188735 -140715 -95504 36987 -27550 -106034
21808a06034l3944j0610O928l1273M605O2653k0675L5871P7521L3830M2895q0886
$$ -106034 -139978 -150588 -143660 -174933 -170328 -107675 -128350 -92479 -14958 18872 61767 -19119
21796a9119j07093k3435l1966p832J07586k1691R900k358p360n4031k3670J41415
$$ -19119 -126212 -149647 -181613 -189445 -81859 -103550 -93650 -96008 -103368 -157399 -181069 -39654
21784c9654L1391o8097m2347n2681n383K6135L0556j8526q4012N3554O0647O0722
$$ -39654 -8263 -76360 -118707 -171388 -176771 -150636 -120080 -138606 -222618 -169064 -108417 -47695
21772d7695m3081q6828O5244M1820L9193j7374J6886p2926j03848k1925N2166
$$ -47695 -90776 -177604 -112360 -70540 -31347 -48721 -31835 -104761 -208609 -230534 -178368
21761a78368N1391R3857J22246n9001p0689N0489J3450p6852q9734J024J66277
$$ -178368 -126977 -33120 89126 30125 -40564 9925 23375 -53477 -143211 -142187 24090
21750B4090M8614j73743j19335M5733M2841m4566K3139j6680p3591k0151N4755
$$ 24090 72704 -101039 -220374 -174641 -131800 -176366 -153227 -169907 -243498 -263649 -208894
21739b08894O4163K6180r148p5872j5761M5369O2464J57071j4254j08185o9791
$$ -208894 -144731 -118551 -127699 -203571 -219332 -173963 -111499 45572 31318 -76867 -146658
21728a46658K4594L4032j12779j10343J15031J40677O8579o1929o1351R821Q8446
$$ -146658 -122064 -88032 -200811 -311154 -196123 -55446 13133 -48796 -110147 -100326 -11880
21717a1880l1782l9008n9780r3772n3919J1006Q3934p736r087O0628J16344M2216
$$ -11880 -43662 -82670 -142450 -236222 -290141 -279135 -195201 -202937 -212024 -151396 -35052 7164
21705G164l2662K5802j3458J4787k5275l3438o5374j7471L5906m433R2990P6945
$$ 7164 -25498 304 -13154 1633 -23642 -57080 -122454 -139925 -104019 -108452 -15462 61483
21693F1483K9831R0422p8150j16575r8730O950k777m8283p73J8065J4919n6116
$$ 61483 91314 181736 103586 -12989 -111719 -104769 -107546 -155829 -156602 -138537 -123618 -179734
21681a79734r1963k5317L729Q951J72774J09689l4149n6877M4069j1775k8400
$$ -179734 -271697 -297014 -293285 -284334 -111560 -1871 -36020 -92897 -48828 -60603 -89003
21670h9003p0088R879P0071K9577k9396j5972l4187J8322q5475m9706J01216J18740
$$ -89003 -159091 -149212 -79141 -49564 -78960 -94932 -129119 -110797 -196272 -245978 -144762 -26022
21658b6022j5745K6238j9591o1540k6557M8578n6408m8316l8105R8448l913K3726
$$ -26022 -41767 -15529 -35120 -96660 -123217 -74639 -131047 -179363 -217468 -119020 -122933 -99207
21646i9207p701j0707J08001L5473k8985k6846m8410K3255j6932J1041l8912l6416
$$ -99207 -106908 -117615 -9614 25859 -3126 -29972 -78382 -55127 -72059 -61018 -99930 -136346
21634a36346M1834o7518N9278O8538J0094k5009L148j9062p4413j1436O5232j6025
$$ -136346 -94512 -162030 -102752 -34214 -24120 -49129 -45981 -65043 -139456 -150892 -85660 -101685
21622a01685k427l7585l9306O4229l228o7604m1983K8283Q0632l2880k8655m2809
$$ -101685 -104112 -141697 -181003 -116774 -120002 -187606 -229589 -201306 -120674 -153554 -182209 -225018
21610b25018j4583J208M4697J8111P1050l7701m7130K2683K5333N5948K3380n793
$$ -225018 -239601 -238393 -193696 -175585 -104535 -142236 -189366 -166683 -141350 -85402 -62022 -67815
21598f7815k7622q136r0520M3095N4564j9942N0598n6771L1125k9732K6873K4705
$$ -67815 -95437 -103573 -194093 -150998 -96434 -116376 -65778 -122549 -91424 -121156 -94283 -69578
21586f9578K8598n5198j25965l771N7468Q5757q5261j03846p5126M2495R1091
$$ -69578 -40980 -96178 -222143 -225914 -168446 -82689 -167950 -271796 -346922 -304427 -213336
21575b13336O7042J0146p0902K4722L0350P0395n161k2423M815q6072K4131r72
$$ -213336 -146294 -136148 -207050 -182328 -151978 -81583 -86744 -109167 -104352 -190424 -166293 -167265
21563a67265m164L1022K7079j1817j25296M2949Q5512p679k3842J556K0165n9512
$$ -167265 -171429 -140407 -113328 -125145 -250441 -207492 -121980 -129659 -153501 -151945 -131780 -191292
21551a91292p2175J15465J8248k3054j39698O898K5802j7029O7833k6841j2680
$$ -191292 -263467 -148002 -129754 -152808 -292506 -285608 -259806 -276835 -209002 -235843 -248523
21540b48523L96k6461K3635k1817l658N8291M0124O8051o6451K6672m3953K4269
$$ -248523 -248127 -274588 -250953 -272770 -276428 -218137 -178013 -109962 -176413 -149741 -193694 -169425
21528a69425R2158m4903K3033O1640K6516M0407k2410L3166q4432J716q3497l0869
$$ -169425 -77267 -122170 -99137 -37497 -10981 29426 7016 40182 -44250 -42534 -126031 -156900
21516a56900n025R0833p9093o6093K4168N700P1730J0204r284m4503Q4000M9083
$$ -156900 -161925 -71092 -150185 -216278 -192110 -186410 -114680 -104476 -113760 -158263 -74263 -25180
21504b5180n7111M3730L1953k8218Q2866l3912j22424l0994L5646J37854L9846
$$ -25180 -82291 -38561 -6608 -34826 48040 14128 -108296 -139290 -103644 34210 74056
21493G4056j7267n4270r1584j05371j07976k5975P7755P3781L3991N1552L4031
$$ 74056 56789 2519 -89065 -194436 -302412 -328387 -250632 -176851 -142860 -91308 -57277
21482e7277l1203j19169o874J7856M6740q845j22718m6880R4428R7765Q1730K9689
$$ -57277 -88480 -207649 -214523 -196667 -149927 -158772 -281490 -328370 -233942 -136177 -54447 -24758
21470b4758J38325r3577r8562j10259Q8071J39788l7733p4728k4229J02127o253
$$ -24758 113567 19990 -78572 -188831 -100760 39028 1295 -73433 -97662 4465 -1788
21459a788r0444m1500J0369O1157O511l5066q6226M724O041n3442K7458M9884
$$ -1788 -92232 -133732 -123363 -62206 -55695 -90761 -176987 -172263 -166222 -219664 -192206 -142322
21447a42322k0002M7849J03878n5833J2690p4309q5201J9793Q237n6801l1425
$$ -142322 -162324 -114475 -10597 -66430 -53740 -128049 -213250 -193457 -185220 -242021 -273446
21436b73446j14016O5513L0528N4833M1232N0750k7317j9120P8407k1533r3296
$$ -273446 -387462 -321949 -291421 -236588 -195356 -144606 -171923 -191043 -112636 -134169 -227465
21425b27465Q2898l172K426k2063j7508K8601l0907o279Q6588p2359o8633L0964
$$ -227465 -144567 -147739 -145313 -167376 -184884 -156283 -187190 -193469 -106881 -179240 -247873 -216909
21413b16909O014l1719q790O0756m204J55323J10735p6584j9904o9183m1125m0971
$$ -216909 -210895 -242614 -251404 -190648 -194852 -39529 71206 -5378 -25282 -94465 -135590 -176561
21401a76561l032J3231L4874K1675M5537j15789O075o1408k1850M725K3927O0430
$$ -176561 -179593 -166362 -131488 -109813 -64276 -180065 -173990 -235398 -257248 -252523 -228596 -168166
21389a68166M3642o8756o3532P9231L5466K6494J21245P939m0590k2165L243N1666
$$ -168166 -124524 -193280 -256812 -177581 -142115 -115621 5624 13563 -27027 -49192 -45949 5717
21377E717p6433m484J1690K1900n8964N4388k1063M6658M1888l777K1591n5351
$$ 5717 -70716 -75200 -63510 -41610 -100574 -46186 -67249 -20591 21297 17520 39111 -16240
21365a6240o6380P2476L1079k1504j2795n0629J8465O2208L4500n7266n9232p9558
$$ -16240 -82620 -10144 20935 -569 -13364 -63993 -45528 16680 51180 -6086 -65318 -144876
21353a44876q2144j2240K6074j7421L0383J04995N7715j04078K1932N2045l6355
$$ -144876 -227020 -239260 -213186 -230607 -200224 -95229 -37514 -141592 -119660 -67615 -103970
21342a03970K7390J07398n2450q4914j8926j3502q4577m6577l7546n4837M8165
$$ -103970 -76580 30818 -21632 -106546 -125472 -138974 -223551 -270128 -307674 -362511 -314346
21331c14346K0899K0024M3815l304J10845L8236j31820q0403q446P4399J7295
$$ -314346 -293447 -273423 -229608 -232912 -122067 -83831 -215651 -296054 -304500 -230101 -212806
21320b12806L0282O3367J02198l6512m5707l3970m2945l3008M2562m8063n2042
$$ -212806 -182524 -119157 -16959 -53471 -99178 -133148 -176093 -209101 -166539 -214602 -266644
21309b66644P0258J32626j29799J3531M3799k756M802L1093o650j4723O1345P8049
$$ -266644 -196386 -63760 -193559 -180028 -136229 -138985 -134183 -103090 -109740 -124463 -63118 14931
21297A4931O3981j25432j29659p6304l733K4733Q8688L6089J9580O0831L4757
$$ 14931 78912 -46520 -176179 -252483 -256216 -231483 -142795 -106706 -87126 -26295 8462
21286H462N589j13387j24692Q346L8667P984m5218l1861l2934j5170N9748R8583
$$ 8462 14051 -99336 -224028 -215682 -177015 -169031 -214249 -246110 -279044 -294214 -234466 -135883
21274a35883o97j36344k5512O0771K2359O676j1407j8062o7059n4980M1988Q4234
$$ -135883 -136580 -272924 -298436 -237665 -215306 -208630 -220037 -238099 -305158 -360138 -318150 -233916
21262b33916m1356M4803j0994m6046O2509Q1727K0580J4039l8212k7P9941K196
$$ -233916 -275272 -230469 -241463 -287509 -225000 -143273 -122693 -108654 -146866 -146893 -66952 -64756
21250f4756l399M7201j5202J0775o9439j21929J4451N051o8284P0245k9017k0353
$$ -64756 -68155 -20954 -36156 -25381 -94820 -216749 -202298 -197247 -265531 -195286 -224303 -244656
21238b44656M976J69963Q3982L6819o468j3851l6132L0055L8702o2589j12443
$$ -244656 -239680 -69717 14265 51084 44616 30765 -5367 24688 63390 801 -111642
21227a11642O4920m4831l0312m5786K2313L1239k0443K1700n1139o0364L9684
$$ -111642 -46722 -91553 -121865 -167651 -145338 -114099 -134542 -112842 -163981 -224345 -184661
21216a84661q468o9298L9670n5813j5362J02712J02581j122o8992n7541J4896
$$ -184661 -193129 -262427 -222757 -278570 -293932 -191220 -88639 -89761 -158753 -216294 -201398
21205b01398j0024p1924r855P7629M9941o346q536K1373O499P1528j878q9387
$$ -201398 -211422 -283346 -293201 -215572 -165631 -171977 -180513 -159140 -152641 -81113 -82991 -172378
21193a72378j32970M7771J21217J9781N3380J8689n6827R881j7309K0209P3453
$$ -172378 -305348 -257577 -136360 -116579 -63199 -44510 -101337 -91456 -108765 -88556 -15103
21182a5103k8318m9996J30806j23527p6256j2278J2452o1569q94J50964J2151
$$ -15103 -43421 -93417 37389 -86138 -162394 -174672 -162220 -223789 -224683 -73719 -61568
21171f1568p0229j4698J7701j3218q6434l7059m2178J01933J32436J0767k1904
$$ -61568 -131797 -146495 -128794 -142012 -228446 -265505 -307683 -205750 -73314 -62547 -84451
21160h4451O7917N6647q8388q3778N5653l2257n1514J0905j39175k1115L9020
$$ -84451 -16534 40113 -48275 -132053 -76400 -108657 -160171 -149266 -288441 -309556 -270536
21149b70536L4631J4741J7341o4892R0718K9299j4963j3267M826K7407j44712
$$ -270536 -235905 -221164 -203823 -268715 -177997 -148698 -163661 -176928 -172102 -144695 -289407
21138b89407k3254N3342O595o2134O2773M6684l38M3571L6420O2421n1620l2700
$$ -289407 -312661 -259319 -252724 -314858 -252085 -205401 -205739 -162168 -125748 -63327 -114947 -147647
21126a47647N1335P2316N3112l7300l6472r693n2285m2020k4834p3566P6144P9698
$$ -147647 -96312 -23996 29116 -8184 -44656 -54349 -106634 -148654 -173488 -247054 -170910 -91212
21114i1212p6275J8569k6167m9406l6468J8363K1339k1995n776j12780o3614J32193
$$ -91212 -167487 -148918 -175085 -224491 -260959 -242596 -221257 -243252 -249028 -361808 -425422 -293229
21102b93229O8659Q0554M9772p109R4507p8746o2769Q8606O380k9974j8699O3680
$$ -293229 -224570 -144016 -94244 -101353 -6846 -85592 -148361 -59755 -53375 -83349 -102048 -38368
21090c8368n2278l1270k6265n3513n1816N8875Q2480P9858J6324l3227l6658k7830
$$ -38368 -90646 -121916 -148181 -201694 -253510 -194635 -112155 -32297 -15973 -49200 -85858 -113688
21078a13688l0912K8670K6408M1145J2809m5783r3202n588J52140l5522m7906
$$ -113688 -144600 -115930 -89522 -48377 -35568 -81351 -174553 -180141 -28001 -63523 -111429
21067a11429R0645N092j20100l330L0302n4384K1140L2258L6891o0850j10390
$$ -111429 -20784 -15692 -135792 -139122 -108820 -163204 -142064 -109806 -72915 -133765 -244155
21056b44155J9893M5430q456J9751n712M7298k1261J814j6210N9859r2396m1282
$$ -244155 -224262 -178832 -187288 -167537 -173249 -125951 -147212 -145398 -161608 -101749 -194145 -235427
21044b35427k1764p3444O702n081K2728N834M6727J25066O2121l538l9079j84378
$$ -235427 -257191 -330635 -323933 -329014 -306286 -300452 -253725 -128659 -66538 -70076 -109155 -293533
21032b93533m9374J21746N8015l4122K7920K4670n223j7436Q249q7669J4471P7318
$$ -293533 -342907 -221161 -163146 -197268 -169348 -144678 -149901 -167337 -159088 -246757 -232286 -154968
21020a54968J0706P91l5200N819P4926O0949K1241p0337j07824o501K7070k1944
$$ -154968 -144262 -143471 -178671 -172852 -97926 -36977 -15736 -86073 -193897 -200398 -173328 -195272
21008a95272J4543p394P6913L8435K9201k5971j02485n5106J27475M6070j8712
$$ -195272 -180729 -188123 -111210 -72775 -43574 -69545 -172030 -227136 -99661 -53591 -72303
20997g2303R543j7138l4024m9499l7073n0275P1918O5912K5491M9173k3731J7944
$$ -72303 -62760 -79898 -113922 -163421 -200494 -250769 -178851 -112939 -87448 -38275 -62006 -44062
20985d4062M1514J2674j39750k1398l0994P3207L3980r5538l3980l3483L2059
$$ -44062 -2548 10126 -129624 -151022 -182016 -108809 -74829 -170367 -204347 -237830 -205771
20974b05771N0316P0627K9706K721m7494L5224O2091m5294l9618Q009l0036l6405
$$ -205771 -155455 -84828 -55122 -52401 -99895 -64671 -2580 -47874 -87492 -79483 -109519 -145924
20962a45924l4473o8125P4392n984N960o2750M6278M8950R1162o8999q7184l2269
$$ -145924 -180397 -248522 -174130 -180114 -174154 -236904 -190626 -141676 -50514 -119513 -206697 -238966
20950b38966o0301j6911M0552m9166R8387J47588J2661L5324J2496J0510r6691
$$ -238966 -299267 -316178 -275626 -324792 -226405 -78817 -66156 -30832 -18336 -7826 -104517
20939a04517k5850R9728L981j156m6662r2473j08492N5266O0456k6825k8370J21251
$$ -104517 -130367 -30639 -26658 -27814 -74476 -166949 -275441 -220175 -159719 -186544 -214914 -93663
20927i3663L7397K157m2980p6406k2023P1884J4902j4807l4111l2260O2901n1479
$$ -93663 -56266 -54109 -97089 -173495 -195518 -123634 -108732 -123539 -157650 -189910 -127009 -178488
20915a78488p4053O8906J13092J8536j36532j46889k5190m95O0594J42821k3458
$$ -178488 -252541 -183635 -70543 -52007 -188539 -335428 -360618 -361113 -300519 -157698 -181156
20904a81156p606K4065J0242L969O8610P789p5099m6514J06388N3945j17821o5426
$$ -181156 -188762 -164697 -154455 -150486 -81876 -74087 -149186 -195700 -89312 -35367 -153188 -218614
20892b18614J06723J61957R0195j26910j30741k5016M7534M049r1666m8201J52913
$$ -218614 -111891 50066 140261 13351 -117390 -142406 -94872 -90823 -182489 -230690 -77777
20881g7777K1288j20082o1267J701O4821M9658n2311P581L2231L2156q9851k7128
$$ -77777 -56489 -176571 -237838 -236137 -171316 -121658 -173969 -166388 -134157 -102001 -191852 -218980
20869b18980o5715N1051k0996P4020N3910q6312p6725K5410J40525M1131j3566
$$ -218980 -284695 -233644 -254640 -180620 -126710 -213022 -289747 -264337 -123812 -82681 -96247
20858i6247L3049o0243l5970K0454K3882R6686k055p998m3144o1387O786N7406
$$ -96247 -63198 -123441 -159411 -138957 -115075 -18389 -20444 -28442 -71586 -132973 -126187 -68781
20846f8781m3216l3407n5939J2611N0977k4177n9893j15091Q581O9586l119j3604
$$ -68781 -111997 -145404 -201343 -188732 -137755 -161932 -221825 -336916 -328335 -258749 -261868 -275472
20834b75472k4606q409N3038P3768N5176k7970L1079K1587L313Q6912K4391R207
$$ -275472 -300078 -308487 -255449 -181681 -126505 -154475 -123396 -101809 -98496 -11584 12807 22014
20822B2014p8117l0561o2249J1621L1051N1011j33820j1821Q6443m2554L514m044
$$ 22014 -56103 -86664 -148913 -137292 -106241 -55230 -189050 -200871 -114428 -156982 -153468 -157512
20810a57512m0565j6076L0059M2283L3861J7033o1864J0629J03679M4856q711
$$ -157512 -198077 -214153 -184094 -141811 -107950 -90917 -152781 -142152 -38473 6383 -2328
20799b328l8625j07132O0536J6636M0622o755m2778r5290M753M8086M7836j03218
$$ -2328 -40953 -148085 -87549 -70913 -30291 -37046 -79824 -175114 -170361 -122275 -74439 -177657
20787a77657p3442M4062J4476O744L9893O7653m2328o635O6964M420n3949j6214
$$ -177657 -251099 -207037 -192561 -185817 -145924 -78271 -120599 -127234 -60270 -55850 -109799 -126013
20775a26013O0200o8627j05368l4994L6645M3634L0185M4964L7005n556r8691
$$ -126013 -65813 -134440 -239808 -274802 -238157 -194523 -164338 -119374 -82369 -87925 -186616
20764a86616L6861J7966N7408k862k4275m866K7246k7791r946K5768P1356M738
$$ -186616 -149755 -131789 -74381 -77243 -101518 -106384 -79138 -106929 -116875 -91107 -19751 -15013
20752a5013j14657q9415k2787l521J7276L2058l0307j0199j1783r332L2193k7094
$$ -15013 -129670 -219085 -241872 -245393 -228117 -196059 -226366 -236565 -248348 -257680 -225487 -252581
20740b52581k9610j6979O3712K4463m0554l1213N9920R2758O1041O1626k5268
$$ -252581 -282191 -299170 -235458 -210995 -251549 -282762 -222842 -130084 -69043 -7417 -32685
20729c2685l4003m7384l1744l6704k9376L8631m7457n585m3154M4479R8723L3364
$$ -32685 -66688 -114072 -145816 -182520 -211896 -173265 -220722 -226307 -269461 -224982 -126259 -92895
20717i2895j9903n5556l5568j2650K2623R3418J22613k6515j20029N4887L1349
$$ -92895 -112798 -168354 -203922 -216572 -193949 -100531 22082 -4433 -124462 -69575 -38226
20706c8226L7438k392p6386q2993k0687K7640n9413k2365M5294J09810m3543r800
$$ -38226 -788 -3180 -79566 -162559 -183246 -155606 -215019 -237384 -192090 -82280 -125823 -135623
20694a35623k6039j09685K3492L3973N4180J09670Q9266j8042j04357r3239m782
$$ -135623 -161662 -271347 -247855 -213882 -159702 -50032 39234 21192 -83165 -176404 -181186
20683a81186R787j8216N3133R38j0576q0827J8596Q889J06811J2982p4980L9509
$$ -181186 -171399 -189615 -136482 -135544 -146120 -226947 -208351 -199462 -92651 -79669 -154649 -115140
20671a15140L2755K2838O3356n1404m1083J7512M0435K7198n1260j8621M9721
$$ -115140 -82385 -59547 3809 -47595 -88678 -71166 -30731 -3533 -54793 -73414 -23693
20660b3693j9115r5107k4773J6889j06018k5583N0999R0304m821k8660J27203
$$ -23693 -42808 -137915 -162688 -145799 -251817 -277400 -226401 -136097 -140918 -169578 -42375
20649d2375O6594K7437k2142m8760m7256N226o2115n6736o1773p1303N4750N6444
$$ -42375 24219 51656 29514 -19246 -66502 -61276 -123391 -180127 -241900 -313203 -258453 -202009
20637b02009K6407P0671O9916k8774j20768q3116L2045K241K9287L8511J03387
$$ -202009 -175602 -104931 -35015 -63789 -184557 -267673 -235628 -233387 -204100 -165589 -62202
20626f2202k0685n6348o6169m5694M5957J11550l805M9751q885q7879j2147l5278
$$ -62202 -82887 -139235 -205404 -251098 -205141 -93591 -97396 -47645 -56530 -144409 -156556 -191834
20614a91834J21629m3516r8651P1214K9089J597Q4382Q6680o9724j13962R9340
$$ -191834 -70205 -113721 -212372 -141158 -112069 -110472 -26090 60590 -9134 -123096 -23756
20603b3756k8656o3113J3302M1347J7023k1455k4727m7816J8037k3655m5118j2678
$$ -23756 -52412 -115525 -102223 -60876 -43853 -65308 -90035 -137851 -119814 -143469 -188587 -201265
20591b01265m6768L0608j0229m3419k1270Q4054P1823k8770M0396L7608N560J8492
$$ -201265 -248033 -217425 -227654 -271073 -292343 -208289 -136466 -165236 -124840 -87232 -81672 -63180
20579f3180Q9106j461j18434n4699q5814m0580P4305J11765n4050m136O301M8475
$$ -63180 25926 24465 -93969 -148668 -234482 -275062 -200757 -88992 -143042 -147178 -140877 -92402
20567i2402P4044p5682j2186P8113l048M3210l9637p5053R497j0553q3869J5952
$$ -92402 -18358 -94040 -106226 -28113 -31161 12049 -27588 -102641 -93144 -103697 -187566 -171614
20555a71614L2185l3452m9104j9673N764O6683J57338N5241l6587p8605j01428
$$ -171614 -139429 -172881 -221985 -241658 -235894 -169211 -11873 43368 6781 -71824 -173252
20544a73252l4239L0265L7981L2210k512J2838p0386L0580N9522J642l7358j6881
$$ -173252 -207491 -177226 -139245 -107035 -109547 -96709 -167095 -136515 -76993 -75351 -112709 -129590
20532a29590Q3619K4277p5805j39696k8253N7265J6096n5198L9711M0574l5437
$$ -129590 -45971 -21694 -97499 -237195 -265448 -208183 -192087 -247285 -207574 -167000 -202437
20521b02437J6497L8595l0359J0277l1734j268O8481Q4745O6392n423n6880j632
$$ -202437 -185940 -147345 -177704 -167427 -199161 -200429 -131948 -47203 19189 13766 -43114 -44746
20509d4746J2446p6508Q9601N8193n9345K1182p92o1696l2651k1399j9529O0998
$$ -44746 -32300 -108808 -19207 38986 -20359 823 31 -61665 -94316 -115715 -135244 -74246
20497g4246N488q1818J0793O2457P6082K8150j01782k585M0331Q9405P9145n4001
$$ -74246 -68758 -150576 -139783 -77326 -1244 26906 -74876 -77461 -37130 52275 131420 77419
20485G7419j04815k1693N086P8966l6832n6528j09985l266k542p1674N3522R5973
$$ 77419 -27396 -49089 -44003 34963 -1869 -58397 -168382 -171648 -174190 -245864 -192342 -96369
20473i6369O3029o321k744Q05O375J4975j23580m7832J10337P0984J00097n2566
$$ -96369 -33340 -39661 -42405 -41600 -35225 -20250 -143830 -191662 -81325 -10341 89756 37190
20461C7190N7421O773m3322j42722n5446J20803N6884j9762j45433K7172N907
$$ 37190 94611 101384 58062 -84660 -140106 -19303 37581 17819 -127614 -100442 -94535
20450i4535N032L5510M7396M7731j3884n6912q3345j32567L4538R6011K8992m0254
$$ -94535 -89503 -53993 -6597 41134 27250 -29662 -113007 -245574 -211036 -115025 -86033 -126287
20438a26287K5148O7017N4357j0712l2032o941K5651k2855j9128M46N1585n5976
$$ -126287 -101139 -34122 20235 9523 -22509 -29450 -3799 -26654 -45782 -45336 6249 -49727
20426d9727j4926j5707n6213n4226l8712K4644N1900O1198l8322P544O2350R34
$$ -49727 -64653 -80360 -136573 -190799 -229511 -204867 -152967 -91769 -130091 -122547 -60197 -59263
20414e9263n4669j634l9670l0602J33943L704o2700K6549j2334m1230P1845J08838
$$ -59263 -113932 -115566 -155236 -185838 -51895 -48191 -110891 -84342 -96676 -137906 -66061 42777
20402D2777r598o2699q914K1335Q0172k7170n2408M2499J47029j14491j72941
$$ 42777 33179 -29520 -38434 -17099 63073 35903 -16505 25994 173023 58532 -114409
20391a14409l0918M4958N8745j0841j9143r499o151O361K40P0226N7364J6918
$$ -114409 -145327 -100369 -41624 -52465 -71608 -81107 -87258 -80897 -80657 -10431 46933 63851
20379F3851m1649j3410j5845n8275m162j28273K082J44764L6596p215k4125p0429
$$ 63851 22202 8792 -7053 -65328 -69490 -197763 -195681 -50917 -14321 -21536 -45661 -116090
20367a16090q38N2260M6752l7511K4539J1321Q829m2765L856K4181K5408K9447
$$ -116090 -116928 -64668 -17916 -55427 -30888 -19567 -10738 -53503 -49647 -25466 -58 29389
20355B9389p0266n7260p564o0935m3174j8818M0126L540N6573M4097k2619O2309
$$ 29389 -40877 -98137 -105701 -166636 -209810 -228628 -188502 -184962 -128389 -84292 -106911 -44602
20343d4602J0192r8763J336N0207m2125R5461J6429l5331o499N225K4483O5525
$$ -44602 -34410 -133173 -131837 -81630 -123755 -28294 -11865 -47196 -53695 -48470 -23987 41538
20331D1538k0751J9175k6066M801L351j617n6547m3285O396K8388M1816N325O3922
$$ 41538 20787 39962 13896 18697 22048 20431 -36116 -79401 -73005 -44617 -2801 2524 66446
20318F6446K6479J7135l6203j8455j9630k4013p4484m8394j5953R5373J06367
$$ 66446 92925 110060 73857 55402 35772 11759 -62725 -111119 -127072 -31699 74668
20307G4668m3828n0281O90p3227M4866P2181Q1002j37135m2737j5374q0843o0556
$$ 74668 30840 -19441 -18751 -91978 -47112 25069 106071 -31064 -73801 -89175 -170018 -230574
20295b30574N8630M8743N0631Q5517O8388q8114j0475M434j13185m8644J2905
$$ -230574 -171944 -123201 -72570 12947 81335 -6779 -17254 -12820 -126005 -174649 -161744
20284a61744N0905J25804J4470j17703m0887k6792O4703Q9297o1096n617M0705
$$ -161744 -110839 14965 29435 -88268 -129155 -155947 -91244 -1947 -63043 -68660 -27955
20273b7955j4636K5364K7522j02876L4599Q7018Q270n4440k4543l9811J4896R6782
$$ -27955 -42591 -17227 10295 -92581 -57982 29036 37306 -17134 -41677 -81488 -66592 30190
20261C0190M819P3680j12200o5272K6951p9729J5661J15274k4788q1633k9340
$$ 30190 35009 108689 -3511 -68783 -41832 -121561 -105900 9374 -15414 -97047 -126387
20250a26387n079N5803k5935k0439J09964J47238p8977j35567n2950o8751k9252
$$ -126387 -131466 -75663 -101598 -122037 -12073 135165 56188 -79379 -132329 -201080 -230332
20239b30332Q8104J09531L4383J12862o2191q9762j3779Q0888P1506j3008n0819
$$ -230332 -142228 -32697 1686 114548 52357 -37405 -51184 29704 101210 88202 37383
20228C7383j38994j00674O479K5698R5121L0211l1299O0330l6236k7556O6531
$$ 37383 -101611 -202285 -195806 -170108 -74987 -44776 -76075 -15745 -51981 -79537 -13006
20217a3006n8901j2775J10096O8612q834L1036O8131n2959j47810j63640O5803
$$ -13006 -71907 -84682 25414 94026 85192 116228 184359 131400 -16410 -180050 -114247
20206a14247J20195M1329J4892J5733j47740n7885n363m3595K7483J44708Q5455
$$ -114247 5948 47277 62169 77902 -69838 -127723 -133086 -176681 -149198 -4490 80965
20195H0965j4636m9176k69R5930l9215n7316K967m9099L3690j6215j186K8466
$$ 80965 66329 17153 16884 112814 73599 16283 19250 -29849 3841 -12374 -13560 14906
20183A4906P640r5125r4199l951M3633R3696O3986o6861n3477j6610J06892O2653
$$ 14906 22546 -72579 -166778 -170729 -127096 -33400 30586 -36275 -89752 -106362 530 63183
20171F3183l1807p0833k1142p135K5479n770r8263J917Q5017K9763m4357q4213
$$ 63183 31376 -39457 -60599 -67734 -42255 -48025 -146288 -144371 -59354 -29591 -73948 -158161
20159a58161m0504J1588P8886n5039P8384Q9030O6773l7539j6725n8450m1320
$$ -158161 -198665 -187077 -108191 -163230 -84846 4184 70957 33418 16693 -41757 -83077
20148h3077O2809L9051q369R7362L5723P4959J4758q8110j54098J3895O6248k3100
$$ -83077 -20268 18783 10414 107776 143499 218458 233216 145106 -8992 4903 71151 48051
20136D8051k3914M6088jk803J8591N4244n0344m8865n1253m055J5656k7748k6479
$$ 48051 24137 70225 70224 67421 86012 140256 89912 41047 -10206 -14261 1395 -26353 -52832
20123e2832K1665j4699l6725j1739m4265J5949R3048O0379o5817j9745l1899l7659
$$ -52832 -31167 -45866 -82591 -94330 -138595 -122646 -29598 30781 -35036 -54781 -86680 -124339
20111a24339j6099K3978P0719P5556R359J5381J3961q6798q5762J5109J1879o8
$$ -124339 -140438 -116460 -45741 29815 39174 54555 68516 -18282 -104044 -88935 -77056 -77124
20099g7124o5333N560N65J4769P2797p612j9817m036M9789Q610J3851r357q4436
$$ -77124 -142457 -136897 -136332 -121563 -48766 -56378 -76195 -80231 -30442 -21832 -7981 -17338 -101774
20086a01774n7097r061O5424Q466K0173j1946j498j8133j7744P1851M5586J10124
$$ -101774 -158871 -167932 -102508 -94042 -73869 -85815 -87313 -105446 -123190 -51339 -5753 104371
20074A04371M9636j47481j43746l17Q7785J45246j9866j13710o3398J5705L7040
$$ 104371 154007 6526 -137220 -137537 -49752 95494 75628 -38082 -101480 -85775 -48735
20063d8735K0347J5890M5440P3245l2604l6075m4153j7763P2538J20672N7490
$$ -48735 -28388 -12498 32942 106187 73583 37508 -6645 -24408 48130 168802 226292
20052B26292J5369j28152j43169m7963o785K7208L1070l287O59J03335M9712j27730
$$ 226292 241661 113509 -29660 -77623 -84408 -57200 -26130 -29417 -28758 74577 124289 -3441
20040c441Q401M3073N8706J642p1490K0082L869m909M7284O5126k2768M6567q4033
$$ -3441 4960 48033 106739 108381 36891 56973 60842 55933 103217 168343 145575 192142 108109
20027A08109j3160m1745o2966J8246p910r8326j0839P9829Q5584l3173N973P0947
$$ 108109 94949 53204 -9762 8484 574 -97752 -108591 -28762 56822 23649 29622 100569
20015A00569K0631M9731O2672q4170m1090p9580j7206p1167o7886K9950Q3947
$$ 100569 121200 170931 233603 149433 108343 28763 11557 -59610 -127496 -97546 -13599
20004a3599r226m6445L7115L2558N5116l9987J4415O7168N5840M8364j200K0793
$$ -13599 -22825 -69270 -32155 403 55519 15532 29947 97115 152955 201319 200119 220912
19992B20912m244l0619Q478J2024j13985o3490M0645l4470k3861r8955q385L9595
$$ 220912 216668 186049 194527 206551 92566 29076 69721 35251 11390 -87565 -95950 -56355
19980e6355J03080k2832j18999J6170J7953J19322M8740K9873o3685p1808J2536
$$ -56355 46725 23893 -95106 -78936 -60983 58339 107079 136952 73267 1459 13995
19969A3995M6022j09138j15551L5697N5816J01846j6750M555M424R5140n6512
$$ 13995 60017 -49121 -164672 -128975 -73159 28687 11937 16492 20916 116056 59544
19958E9544k2151p2725P447M0716j5617K7807k6443n1113L1370R9098k5346l1150
$$ 59544 37393 -35332 -27885 12831 -2786 25021 -1422 -52535 -21165 77933 52587 21437
19946B1437k7630j04429o892R1171K0864L3210J60400O1820q9200o0347k8595
$$ 21437 -6193 -110622 -117514 -26343 -5479 27731 188131 249951 160751 100404 71809
19935G1809K5513J0484M5514q2039j32518l1576N9781P4663O2999L4072j43066
$$ 71809 97322 107806 153320 71281 -61237 -92813 -33032 41631 104630 138702 -4364
19924d364l6886R7534M3983O4405m0227M117o1424o2759N1537L1888k9066n2153
$$ -4364 -41250 56284 100267 164672 124445 128562 67138 4379 55916 87804 58738 6585
19912F585j64543m3178O8538O1770M7843r842m0529l6290J21529Q7132k2756m4359
$$ 6585 -157958 -201136 -132598 -70828 -22985 -32827 -73356 -109646 11883 99015 76259 31900
19900C1900k339Q3028p1097o0067O8849M048Q0304j1634j09383O594P6395m4473
$$ 31900 29561 112589 41492 -18575 50274 54322 134626 122992 13609 20203 96598 52125
19888E2125o2185o7713k7M5568J2992O5642N3078J18387l7905j59239p2645K6168
$$ 52125 -10060 -77773 -77800 -32232 -19240 46402 99480 217867 179962 20723 -51922 -25754
19876b5754J27028L4024m5096k8436L1725P6265R0571M7320l0740o9489J0960
$$ -25754 101274 135298 90202 61766 93491 169756 260327 307647 276907 207418 218378
19865B18378j1519n9428q9168l2944K861J6040k519N7504M5456p2011j6066J03544
$$ 218378 206859 147431 58263 25319 28180 44220 41701 99205 144661 72650 56584 160128
19853A60128J5916r925J8594N2467l2281k2493k2643j8716n591k5131r6862q1301
$$ 160128 176044 166119 184713 237180 204899 182406 159763 141047 135456 110325 13463 -67838
19841f7838L5794M8170j542k127k3317M0127J8696L1112Q3369n1050m7181O6214
$$ -67838 -32044 16126 14584 12457 -10860 29267 47963 79075 162444 111394 64213 130427
19829A30427M0462J0857j46930j7000Q6795n910N4047N6731J26575K8343L0595
$$ 130427 170889 181746 34816 17816 104611 98701 152748 209479 336054 364397 394992
19818C94992k04j0437k2922m8677O598l295m4803l175j0760n5032O5579k2961
$$ 394992 394788 384351 361429 312752 319350 316055 271252 268077 257317 202285 267864 244903
19806B44903p5709J6277R343m3642J9866n547o7705j43999K4357P5136N6337K7353
$$ 244903 169194 185471 194814 151172 171038 165491 97786 -46213 -21856 53280 109617 136970
19794A36970j5848M4377N5548L636J1928p531M5801p2947j05647K0187o8549R4782
$$ 136970 121122 165499 221047 224683 236611 229080 274881 201934 96287 116474 47925 142707
19782A42707N0140L5448K2941P91p6279K5165L9161L9706r3121J0879N8909m3113
$$ 142707 192847 228295 251236 252027 175748 200913 240074 279780 186659 197538 256447 213334
19770B13334l4585L167N4449l5527m6471N5354R4126J4299p3660m8645K3577p588
$$ 213334 178749 181916 236365 200838 154367 209721 303847 318146 244486 195841 219418 211830
19758B11830k7098R8659O2949r5364r6400L9392M0459J5199M1847O8482j4702
$$ 211830 184732 283391 346340 250976 154576 193968 234427 249626 291473 359955 345253
19747C45253j67132p6979M8649P2346l4828J2605O2581J1615l9486p7870p7222
$$ 345253 178121 101142 149791 222137 187309 199914 262495 274110 234624 156754 79532
19736G9532J131P1800L4141q530k9763N6969K8036j9502n3982K6620k0798q301
$$ 79532 80663 152463 186604 178074 148311 205280 233316 213814 159832 186452 165654 157353
19724A57353O8331O6520J12215Q7775r849o8205R670r9894j7406l6613M4641O2357
$$ 157353 225684 292204 404419 492194 482345 414140 423810 323916 306510 269897 314538 376895
19712C76895n9937k1617p8230O4805O4094l8705j16437k3936k6481N2271K1681
$$ 376895 316958 295341 217111 281916 346010 307305 190868 166932 140451 192722 214403
19701B14403p027N1474P0633n0537n3299m3771N2381M0521l0851R020R359m9013
$$ 214403 207376 258850 329483 278946 225647 181876 234257 274778 243927 252947 262306 213293
19689B13293J466r711M7070J9233L377k7030n235n0042j3728M7635P6557o2094
$$ 213293 214759 205048 252118 271351 274728 247698 242463 192421 178693 226328 302885 240791
19677B40791k2544n0565j8202Q4006O2061K6503l4166k2564L2127P795n856l6040
$$ 240791 218247 167682 149480 233486 295547 322050 287884 265320 297447 305242 299386 263346
19665B63346J01024K1288m3586m0469k3051r0961L314M3815j3522J64997O9723
$$ 263346 364370 385658 342072 301603 278552 187591 190905 234720 221198 386195 455918
19654D55918n2732r167O892k6717n0137M7097j036n9169J5540N1755m0341j0141
$$ 455918 403186 394019 400911 374194 324057 371154 370118 310949 326489 378244 337903 327762
19642C27762Q0706j3176k0097o4097O8062O052m3336k6823p655J3553N009k9419
$$ 327762 408468 395292 375195 311098 379160 385212 341876 315053 307398 320951 325960 296541
19630B96541m3211k3035J3582M3079r9930M9271J23505J3493o5252J5404M3845
$$ 296541 253330 230295 243877 286956 187026 236297 359802 373295 308043 323447 367292
19619C67292L2715o9761l6766k0159Q1192k6885J9293J711o3773m774k0027o7218
$$ 367292 400007 330246 293480 273321 354513 327628 346921 348632 284859 280085 260058 192840
19607A92840K435o567J31421K5650k7707M8247O8083L687r1828n5182r4792M0678
$$ 192840 195275 188708 320129 345779 318072 366319 434402 438089 346261 291079 196287 236965
19595B36965R2324k8489r2731j58130j481J48023Q7374q947l1777m7324L5260
$$ 236965 329289 300800 208069 49939 48458 196481 283855 274908 243131 195807 231067
19584B31067O0744K4656n4302R050o5364K6860K2781J8269J12156M5760M7211
$$ 231067 291811 316467 262165 271215 205851 232711 255492 273761 385917 431677 478888
19573D78888p8562K5598L107N0186N1516j09874p1506l888l1625r049J9516l1879
$$ 478888 400326 425924 429031 479217 530733 420859 349353 345465 313840 304791 324307 292428
19561B92428o2801N5403J2916l3154L1075o9135m2259J13025Q4241k9175l7078
$$ 292428 229627 285030 297946 264792 295867 226732 184473 297498 381739 352564 315486
19550C15486j04467o875r0537J17321J93715p837k9139l9427o615o0189q257N2355
$$ 315486 211019 204144 113607 230928 424643 416806 387667 348240 341625 281436 273179 325534
19538C25534L981M6618M4706k7434O9092M2258L5066N2293n7623o3753j1242l4020
$$ 325534 329515 376133 420839 393405 462497 504755 539821 592114 534491 470738 459496 425476
19526D25476j0631K3097O9359L7269j9798j22o4486q8978k4359J598J0582K5092
$$ 425476 414845 437942 507301 544570 524772 524650 460164 371186 346827 348425 359007 384099
19514C84099O3539Q922l5749j9233o3889K3219L655l4765O1322R853l7044k3092
$$ 384099 447638 456560 420811 401578 337689 360908 364563 329798 391120 400973 363929 340837
19502C40837Q0733o308k7557k7353o3831R507R9824j0515l0071o8172K4794j4087
$$ 340837 421570 415262 387705 360352 296521 306028 405852 395337 365266 297094 321888 307801
19490C07801M5759R2924P0651k0184p3077O9785j00402k9735Q2598P7510j9543
$$ 307801 353560 446484 517135 496951 423874 493659 393257 363522 446120 523630 504087
19479E04087o8723j4711K6523l4817l6902j7205q632m302R2766k5937j00853N4073
$$ 504087 435364 420653 447176 412359 375457 358252 349620 345318 438084 412147 311294 365367
19467C65367J7846k5391M9131k8002l1979R4670R1105O414J3262n2225j10696
$$ 365367 383213 357822 406953 378951 346972 441642 532747 539161 552423 500198 389502
19456C89502m1798K0945o5227m2036P0967J00665K6646l0600n0728k7285N532
$$ 389502 347704 368649 303422 261386 332353 433018 459664 429064 378336 351051 356583
19445C56583j2542Q0847P4126q9335j24778m8178k9811N061O0161J14591K5362
$$ 356583 344041 424888 499014 409679 284901 236723 206912 211973 272134 386725 412087
19434D12087k5960m71J169l5389J4546L5359P27j19157R242P503N410m9851P3860
$$ 412087 386127 385656 386825 351436 365982 401341 402068 282911 292153 299656 305066 255215 329075
19421C29075L9031L4807O5600N4777q9412j18812m9209k694J24441L7329K068
$$ 329075 368106 402913 468513 523290 433878 315066 265857 263163 387604 424933 427001
19410D27001l4874r8980q4642n9903M4799J01325M1791J102O8006l7632n3258
$$ 427001 392127 293147 208505 148602 193401 294726 336517 337619 405625 367993 314735
19399C14735Q068O8401N5515r677K489k8032M848M2258j5401k6897J508K1385
$$ 314735 322803 391204 446719 437042 439531 411499 416347 458605 443204 416307 417815 439200
19387D39200r2720o6335o6869N1233O4840K1922M1831N1044j1282j9434K2680
$$ 439200 346480 280145 213276 264509 329349 351271 393102 444146 432864 413430 436110
19376D36110k850p2069l1585J2861o3754K1876K3424M7043N9760n9521k5038m5679
$$ 436110 433260 361191 329606 342467 278713 300589 324013 371056 430816 371295 346257 300578
19364C00578K1439q1883n9288M8775N6473K4677j2845R9629L9797L6654r5656
$$ 300578 322017 240134 180846 229621 286094 310771 297926 397555 437352 474006 378350
19353C78350J0627N7432l3703R032l3595o828N4520M5888o9411j16281j4952j9947
$$ 378350 388977 446409 412706 421738 388143 381315 435835 481723 412312 296031 281079 261132
19341B61132L3191M3308l6350q3584J5478J5968L4495r607J04445J291j09573
$$ 261132 294323 337631 301281 217697 233175 249143 283638 274031 378476 379767 270194
19330B70194L0135O486m5644N3807M3513M2631o6031r3974o8711n9438R4969R0216
$$ 270194 300329 306815 261171 314978 358491 401122 335091 241117 172406 112968 207937 298153
19318B98153J14486l5653L3078Q2334k3235p9374k1451q1895q4974j8075J9526
$$ 298153 412639 376986 410064 492398 469163 389789 368338 286443 201469 183394 202920
19307B02920J17862Q6235k3237j02277q3312O414o070M1612K5475J09007J05449
$$ 202920 320782 407017 383780 281503 198191 204605 198535 240147 265622 374629 480078
19296D80078o0537N876n781O6895J9602m0835j24024K0155M9008J9909q851N8028
$$ 480078 419541 425417 419636 486531 506133 465298 341274 361429 410437 430346 421495 479523
19284D79523q7786k5646J09242M5582R574J12437J31894M9079R3140M8048J23472
$$ 479523 391737 366091 475333 520915 530489 642926 774820 823899 917039 965087 1088559
19273A088559R4854Q8420L8032K6416L9565p8632o1826j9930j34395j60388p6687
$$ 1088559 1183413 1271833 1309865 1336281 1375846 1297214 1235388 1215458 1081063 920675 843988
19262H43988q7174j25896O6022j7228j31191j9823M396j36819q5680L6853N3785
$$ 843988 756814 630918 696940 679712 548521 528698 533094 396275 310595 347448 401233
19251D01233k5022j1231J11954m2212j05709N169k1600m086k0595J8367l3350
$$ 401233 376211 364980 476934 434722 329013 334182 312582 308496 287901 306268 272918
19240B72918K9780Q747o4167M2977N0880k5994j9306k292j1167O0827M2319N6807
$$ 272918 302698 311445 247278 290255 341135 315141 295835 293543 282376 343203 385522 442329
19228D42329m1315n7297l4049m5071j8406o1661R901R3851O124N8378m7395r1409
$$ 442329 401014 343717 309668 264597 246191 184530 194431 288282 294406 352784 305389 213980
19216B13980M2675m9378Q9989j1851J8431p1646n942J07197J12268K1250j08161
$$ 213980 256655 207277 297266 285415 303846 232200 226258 333455 445723 466973 358812
19205C58812j11994K9823J5278q231M7202q0619p4423O633J26311j4391j88375
$$ 358812 246818 276641 291919 283688 330890 250271 175848 182481 308792 294401 106026
19194A06026n2239O6610K8467P1886M7958L6893p740J3340K1938k0607l8308j00954
$$ 106026 53787 120397 148864 220750 268708 305601 297861 311201 333139 312532 274224 173270
19182A73270R6296M5606M3496k006o1910r368L1730m3631M6427P2186q6840j0987
$$ 173270 269566 315172 358668 356662 294752 285384 317114 273483 319910 392096 305256 294269
19170B94269P1618P0056o6901p7037j5819M2084k4071J179J531l6650j02881J2781
$$ 294269 365887 435943 369042 292005 276186 318270 294199 295378 296909 260259 157378 170159
19158A70159J52784l7276j19557J05479N7649p9954k1483N8172j8254J1493o7874
$$ 170159 322943 285667 166110 271589 329238 249284 227801 285973 267719 279212 211338
19147B11338l7253M0692l7078L8964l6771q5644R522Q7478M7838N2265n1744J3712
$$ 211338 174085 214777 177699 216663 179892 94248 103770 191248 239086 291351 239607 253319
19135B53319J53257l0026l566J9709o8169j6401K029j8276L9661l3619k7352k0217
$$ 253319 406576 376550 372984 392693 324524 308123 310152 291876 331537 297918 270566 250349
19123B50349q8343m1511L9776J10467Q0967l0549p3795j9120r198J3814M1068
$$ 250349 162006 120495 160271 270738 351705 321156 247361 228241 219043 232857 273925
19112B73925L2186K7043J12779n7210n9407n3205K1537l4404P6394M9101m892
$$ 273925 306111 333154 445933 388723 329316 276111 297648 263244 339638 388739 383847
19101C83847k3924m3042r8614j79940O1713j3715m096n1595J49932M7403L1894
$$ 383847 359923 316881 218267 38327 100040 86325 82229 30634 180566 227969 259863
19090B59863n443k0576o1647J475n840J04959J658N1509L9489o0150p6269j44077
$$ 259863 254420 233844 172197 173672 167832 272791 274449 325958 365447 305297 229028 84951
19078H4951p1601K5386K5188L4476N8091j08452j01305J2264J12830Q6143K4767
$$ 84951 13350 38736 63924 98400 156491 48039 -53266 -41002 71828 157971 182738
19067A82738Q955K4123L9191l0023j942o568M6050k0016R135k1555o9961k1416
$$ 182738 191693 215816 255007 224984 223042 216474 262524 242508 251643 230088 160127 138711
19055A38711M4560K8696l799j4865L4906Q3330m6879p9110q9881n7558R384M1948
$$ 138711 183271 211967 208168 193303 228209 311539 264660 185550 95669 38111 47495 89443
19043H9443N341m3400j727j7021L055L5921n1350K7952R4204L2489M9821Q3833
$$ 89443 94784 51384 49657 32636 35691 71612 20262 48214 142418 174907 224728 308561
19031C08561k221n7166l9586j24754p7163J10145J03093k8772m1719j4199M6960
$$ 308561 306340 249174 209588 84834 7671 117816 220909 192137 150418 136219 183179
19020A83179r4029J9477n375p4338O7910L9402J8477J0536m8944l4916M988K3943
$$ 183179 89150 108627 103252 28914 96824 136226 154703 165239 116295 81379 86367 110310
19008A10310K467k1890M2232N2836Q7700n2191k5902N3744j7584J3818P7519l6607
$$ 110310 112777 90887 133119 185955 273655 221464 195562 249306 231722 245540 323059 286452
18996B86452j16486n345J408O5400n3500r9928m0406j3639J00522O2344r0469
$$ 286452 169966 164621 166029 231429 177929 78001 37595 23956 124478 186822 96353
18985I6353l2242n9076j22638R0548J59002m470p8343n8077Q0891J38583j459
$$ 96353 64111 5035 -117603 -27055 131947 127477 49134 -8943 71948 210531 209072
18974B09072J6060J2575j3740p376n3446O4857m9810J7688j19879l9562K9766
$$ 209072 225132 237707 223967 216591 163145 228002 178192 195880 76001 36439 66205
18963F6205K381P2451L7193o5562j00474O8250l8246n836j9464k2387p4551j2057
$$ 66205 68586 141037 178230 112668 12194 80444 42198 36362 16898 -5489 -80040 -92097
18951i2097N1388P5324m2613m3278k710l2685R863O1817L8831k0228k7592N7365
$$ -92097 -40709 34615 -7998 -51276 -53986 -86671 -76808 -14991 23840 3612 -23980 33385
18939C3385Q2984M842J9490L2204L5020O5365J3873o3861M372J7959m7668q1863
$$ 33385 116369 121211 140701 172905 207925 273290 287163 223302 227674 245633 197965 116102
18927A16102n6414Q427J1572j25922r237N2938n278N4291K0305l7404J523p1940
$$ 116102 59688 68115 79687 -46235 -55472 -2534 -7812 46479 66784 29380 30903 -41037
18915d1037K417m3541r7533k3105P3607R1176m9837J349R262J0883k6172J7111
$$ -41037 -38620 -82161 -179694 -202799 -129192 -38016 -87853 -86504 -77242 -66359 -92531 -75420
18903g5420J4791M1266M6216n9910k4003P9421P8880L1816N772p9205j409j7021
$$ -75420 -60629 -19363 26853 -33057 -57060 22361 101241 133057 138829 59624 58215 41194
18891D1194J4077n8217j1868k9546j5149L698l250J6212l2580M2507K7781M614
$$ 41194 55271 -2946 -14814 -44360 -59509 -55811 -59061 -42849 -75429 -32922 -5141 -527
18879e27Q3627J13130o5023o2946k2512o163r0974N827N7992n912J69877k2993
$$ -527 83100 196230 131207 68261 45749 39586 -51388 -45561 12431 6519 176396 153403
18867A53403n5195K515J3091k5895o2790J3655m5090R846N738p868Q231J14244
$$ 153403 98208 100723 113814 87919 25129 38784 -6306 3540 9278 1410 9641 123885
18855A23885p5111j04995k6482m9572O2397J07046J5837L4532K6102J3165n4028
$$ 123885 48774 -56221 -82703 -132275 -69878 37168 53005 87537 113639 126804 72776
18844G2776j2424q2200o6421r199K9728M6967J0882L5805o298J4131R283j792
$$ 72776 60352 -21848 -88269 -97468 -67740 -20773 -9891 25914 19616 33747 43030 41238
18832D1238p9135K7651r3381j4871J33540m0191N186K4668K3893p6084o6956N2100
$$ 41238 -37897 -10246 -103627 -118498 15042 -25149 -19963 4705 28598 -47486 -114442 -62342
18820f2342P4918J9395k6093k4406O2077m1526m2790N2884Q5216l5985l8880k536
$$ -62342 12576 31971 5878 -18528 43549 2023 -40767 12117 97333 61348 22468 19932
18808A9932l9350J3729N5043J49802J08586K9531N8127l0718n7805K2696O2304
$$ 19932 -19418 -5689 49354 199156 307742 337273 395400 364682 306877 329573 391877
18797C91877N5449m2851n6924N5479K8792n5334J717m5713l4430n1567l0809R2909
$$ 391877 447326 404475 347551 403030 431822 376488 378205 332492 298062 246495 215686 308595
18785C08595m92n9051j8151m5360n8147l5697p3061q0956L1358m48P3633l009
$$ 308595 308103 249052 230901 185541 127394 91697 18636 -62320 -30962 -31410 42223 39214
18773C9214K6476J15215J3975l4758o084J14840o9569o0187N4274r407n1041Q2960
$$ 39214 65690 180905 194880 160122 154038 268878 199309 139122 193396 183989 132948 215908
18761B15908J11420j1763O6416L4716k7254l4075M0049J15372O0131N5521M448
$$ 215908 327328 315565 381981 416697 389443 355368 395417 510789 570920 626441 630889
18750F30889n9261K0593M9636N3324m6118M7103r0160q3758q2304j26172m200
$$ 630889 571628 592221 641857 695181 649063 696166 606006 522248 439944 313772 309572
18739C09572K2959J2652j7313j3480m1858P4451J14273K9485O562L4569m336M2659
$$ 309572 332531 345183 327870 314390 272532 346983 461256 490741 497303 531872 527536 570195
18727E70195m887l2667M8879q478k959M9926R3555l756Q1356K3459j32742m1275
$$ 570195 565308 532641 581520 573042 570083 620009 713564 709808 791164 814623 681881 640606
18715F40606l9750N0683P7032L1856J56396J05966m6189k7896N1248j1311q7354
$$ 640606 600856 651539 728571 760427 916823 1022789 976600 948704 999952 988641 901287
18704I01287p3439o9930p4106n571l088J01579M7314o6027m1297J945l8361N9933
$$ 901287 827848 757918 683812 678241 675153 776732 824046 758019 716722 718667 680306 740239
18692G40239m8794M839m7247j4148J6944J4705j17585P4215J37387O1292j9573
$$ 740239 691445 696284 649037 634889 651833 666538 548953 623168 760555 821847 802274
18681H02274J8386o8966k5314r5185j03835J2654J01417P7902N5269k9543n866
$$ 802274 820660 751694 726380 631195 527360 540014 641431 719333 774602 745059 739193
18670G39193J8781j2245L5450j2250j4270o7374m8612j8317M7448p604k4545j45058
$$ 739193 757974 745729 781179 768929 754659 687285 638673 620356 667804 660200 635655 490597
18658D90597k2603k4399j48381p1651o3838N099m757P2129M1866M6720J3007q3573
$$ 490597 467994 443595 295214 223563 159725 164824 160067 232196 274062 320782 333789 250216
18646B50216p4960M1516K1118j9521l6468M9734j5810o8550m9961n4216N8812
$$ 250216 175256 216772 237890 218369 181901 231635 215825 147275 97314 43098 101910
18635A01910O6641O8513L1356j05430m6306L470Q3267J5549j4774K4931K8186
$$ 101910 168551 237064 268420 162990 116684 120154 203421 218970 204196 229127 257313
18624B57313m7947j4203r189N5373m1069N5350L4124k5766l9430j256n1535j9927
$$ 257313 209366 195163 185974 241347 200278 255628 289752 263986 224556 223300 171765 151838
18612A51838L3786K0P1195L7631j2945J7914m6984q6793j12750m7264M2368o263
$$ 151838 185624 185644 256839 294470 281525 299439 252455 165662 52912 5648 48016 41753
18600D1753j1993N0270N1299n763O6169P2947o9290j04926L2928o2135J077K8353
$$ 41753 29760 80030 131329 125566 191735 264682 195392 90466 123394 61259 62336 90689
18588I0689q699J08048K760r7229J03537M2633l2712p8093l3502j2260J7648l6940
$$ 90689 81990 190038 192798 95569 199106 241739 209027 130934 97432 85172 102820 65880
18576F5880j1505L9044k4022k1352k818J36705l071q4698j0565l5252J37334o731
$$ 65880 54375 93419 69397 48045 45227 181932 178861 94163 83598 48346 185680 178949
18564A78949J2857k1863R3565L5804m7400P378R6557l4691k3884j23683j12738
$$ 178949 191806 169943 263508 299312 251912 259290 355847 321156 297272 173589 60851
18553F0851o738K7246K8417j6029j42279m8995L3051l2024k3380n922O6363O3656
$$ 60851 54113 81359 109776 93747 -48532 -97527 -64476 -96500 -119880 -125802 -59439 4217
18541D217L245j6742N4871K5768M5565L0307k9012m7419j1601N8797O8983L2682
$$ 4217 7462 -9280 45591 71359 116924 147231 118219 70800 59199 117996 186979 219661
18529B19661r4862o1706R6402n3867L0248L4542N5301j5450n4054K4927R0336
$$ 219661 124799 63093 159495 105628 135876 170418 225719 210269 156215 181142 271478
18518B71478o2201l6428O3267m9256Q8501M5015l3326l1865M0423R044n0477o2550
$$ 271478 209277 172849 236116 186860 275361 320376 287050 255185 295608 304652 254175 191625
18506A91625m19M2118q1214K5150m2201p0537n4993M0132J44343N5411l9371R8723
$$ 191625 191206 233324 152110 177260 135059 64522 9529 49661 194004 249415 210044 308767
18494C08767l3634Q937J8965n9465J2009r7436l8955J16686R4738j6741J8312
$$ 308767 275133 284070 303035 243570 255579 158143 119188 235874 330612 313871 332183
18483C32183J88225J07364m2749j6662J30067R9101K8992j1817L2724O5390R3186
$$ 332183 520408 627772 585023 568361 698428 797529 826521 814704 847428 912818 1006004
18472A006004k2291n3136Q1120J487Q834J20913J12371L0760J3137q2317n4233
$$ 1006004 983713 930577 1011697 1013184 1022018 1142931 1255302 1286062 1299199 1216882 1162649
18461A162649k9502l6739k22028j26068Q948j4616K7094J1811J5098n067k921
$$ 1162649 1133147 1096408 874380 748312 757260 742644 769738 781549 796647 791580 788659
18450G88659J1069j370l1409O9360l5029K6959l9758j07627K2072K27656J17939
$$ 788659 799728 798358 766949 836309 801280 828239 788481 680854 702926 930582 1048521
18439A048521k2061j2202N2729L3932m1160o8386j9578j06932j4847R3792k294
$$ 1048521 1026460 1014258 1066987 1100919 1059759 991373 971795 864863 850016 943808 941514
18428I41514N7505N3847n664o9739r8943p2990N1377P4606K7446J6564q0967j06270
$$ 941514 999019 1052866 1047202 977463 878520 805530 856907 931513 958959 975523 894556 788286
18416G88286j2019k2025j06542o4017L6489N1851M8455n219L9846L1982L4765
$$ 788286 776267 754242 647700 583683 620172 672023 720478 715259 755105 787087 821852
18405H21852K1138R2588N1637M4749K8944L5686o9900j43741j23636Q636k7338
$$ 821852 842990 935578 987215 1031964 1060908 1096594 1026694 882953 759317 767953 740615
18394G40615P1274P6962k3154L4699J3617J23882P9628N8657n102j29670j08684
$$ 740615 811889 888851 865697 900396 914013 1037895 1117523 1176180 1171078 1041408 932724
18383I32724Q6464L8736n45l2712p678K3177l2348r7685J0564R415Q9756M9434
$$ 932724 1019188 1057924 1057379 1024667 1016989 1040166 1007818 910133 920697 930112 1019868 1069302
18371A069302l2171K751R6054J45009J44616L4801K5223J64713Q7031Q956p557
$$ 1069302 1037131 1039882 1135936 1280945 1425561 1460362 1485585 1650298 1737329 1746285 1738728
18360A738728p5420k3974J29715R2126j6751o903L6541M3386J77383J65779R2723
$$ 1738728 1663308 1639334 1769049 1861175 1844424 1837521 1874062 1917448 2094831 2260610 2353333
18349B353333J33125R1056P1622J30855M6727J07198J12804M3291N9129Q8702
$$ 2353333 2486458 2577514 2649136 2779991 2826718 2933916 3046720 3090011 3149140 3237842
18339C237842J05064J78744R2088L3675L4252L5588J46810N3085K1025O3461J46274
$$ 3237842 3342906 3521650 3613738 3647413 3681665 3717253 3864063 3917148 3938173 4001634 4147908
18328D147908K74603J95124K28622L33980L48255O63549R02302J228250J582440
$$ 4147908 4422511 4617635 4846257 5180237 5528492 6192041 7094343 8322593 9905033
18319I905033J953908K039764J723548J445991J056196O10682K52118N76049J089163
$$ 9905033 11858941 13898705 15622253 17068244 18124440 18735122 18987240 19563289 20652452
18310B0652452J509186J808838J802253J151575J90481q15757j439266k026146
$$ 20652452 22161638 23970476 25772729 26924304 27114785 26299028 24859762 22833616
18302B2833616k264042j624941p99303j33168K39181K02540p0735m83495o53522
$$ 22833616 20569574 18944633 18145330 18012162 18251343 18453883 18383148 17899653 17246131
18293A7246131q88225j057188p97001l57135j25955k7463K48669N27801O12606
$$ 17246131 16357906 15300718 14503717 14146582 14020627 13993164 14241833 14769634 15382240
18284A5382240P76253J186869J383515J501843J722161K049103K451655K676728
$$ 15382240 16158493 17345362 18728877 20230720 21952881 24001984 26453639 29130367
18276B9130367K842400L304645L540453L424481L200864L242800L786849M449314
$$ 29130367 31972767 35277412 38817865 42242346 45443210 48686010 52472859 56922173
18268E6922173N151911N439408N083784M174036L002018J634258R1469o15314
$$ 56922173 62074084 67513492 72597276 76771312 79773330 81407588 81499057 80883743
18260H0883743k08835J101338K457418L495720M318013N073432N118249L382738
$$ 80883743 80674908 81776246 84233664 87729384 92047397 97120829 102239078 105621816
18252A05621816n13685m159081o278158q058790q950072p780687n487278l605620
$$ 105621816 105108131 100949050 94670892 86612102 77662030 69881343 64394065 60788445
18244F0788445k484238j803763j268133p01283j55279M20745J493263K523662
$$ 60788445 58304207 56500444 55232311 54531028 54375749 54796494 56289757 58813419
18236E8813419L612196M907006O181081P840365R735762J2129566J5050066J8618900
$$ 58813419 62425615 67332621 73513702 81354067 91089829 103219395 118269461 136888361
18228A36888361K3133116K9268465L6512138M2525030M5650987M4942859M0153900
$$ 136888361 160021477 189289942 225802080 268327110 313978097 358920956 399074856
18221C99074856L0806494J6986652K712132p841165j3297320j4399674j0964531
$$ 399074856 429881350 446868002 449580134 441738969 428441649 414041975 403077444
18214D03077444m052053K857616P228824P281001L851798j739677j0073692j9077151
$$ 403077444 399025391 401883007 409111831 416392832 420244630 418504953 408431261 389354110
18206C89354110k5478326k8392235k9541845k8810400k5521247k0606351j5218921
$$ 389354110 363875784 335483549 305941704 277131304 251610057 231003706 215784785
18199B15784785j0443790o060152k624695L08890K872753N097496O756124Q129117
$$ 215784785 205340995 199280843 196656148 196965038 199837791 204935287 211691411 219820528
18191B19820528R610693J1386949J3195200J4975719J6235863J6380720J4690028
$$ 219820528 229431221 240818170 254013370 268989089 285224952 301605672 316295700
18184C16295700J1164468O517900J742321k289864m616268m813739l710813k394688
$$ 316295700 327460168 333978068 335720389 333430525 328814257 324000518 320289705 317895017
18176C17895017j864529k434210m012375o254928q923981j1278235j2837591j3443605
$$ 317895017 316030488 313596278 309583903 303328975 294404994 283126759 270289168 256845563
18168B56845563j3293900j2711121j1952558j0990052r957121r324798q955961
$$ 256845563 243551663 230840542 218887984 207897932 197940811 188616013 179660052
18161A79660052q599702q019733p048436n678474m074185k953070k296895k030248
$$ 179660052 171060350 163040617 155992181 150313707 146239522 143286452 140989557 138959309
18153A38959309k657925l908548m845288n757066o431063o307067n438939m254446
$$ 138959309 136301384 132392836 127547548 121790482 115359419 109052352 103613413 99358967
18145I9358967l282480k565402j977626j697890j556050j344389j030932l72418
$$ 99358967 96076487 93511085 91533459 89835569 88279519 86935130 85904198 85531780
18137H5531780O07460J379350K257756K988746L204913K444681R40553r24948
$$ 85531780 86139240 87518590 89776346 92765092 95970005 98414686 99355239 98430291
18129I8430291l260342n560372p057299p395086p122421o312217n184394l966062
$$ 98430291 95169949 89609577 82552278 75157192 68034771 61722554 56538160 52572098
18121E2572098l192304k531714k041627j782941j492986j120477p16786l37829
$$ 52572098 49379794 46848080 44806453 43023512 41530526 40410049 39693263 39355434
18113C9355434j8362L18996O83484Q38517P82365M54952L4594n11072j097605
$$ 39355434 39337072 39656068 40339552 41178069 41960434 42415386 42449980 41938908 40841303
18104D0841303j621426j963285j865458j642656j120786n21400j03776L23908
$$ 40841303 39219877 37256592 35391134 33748478 32627692 32106292 32002516 32326424
18096C2326424P58440R66561J140552P87289J31687o02916j260265j904810k203497
$$ 32326424 33084864 34051425 35191977 35979266 36110953 35508037 34247772 32342962 30139465
18087C0139465j981310j685281j293621q78232m78059j83275K0066J42907R2539
$$ 30139465 28158155 26472874 25179253 24301021 23822962 23639687 23659753 23802660 23895199
18078B3895199j75372m78994q36790j122754j279980j223003j091315q76334p86397
$$ 23895199 23719827 23240833 22404043 21281289 20001309 18778306 17686991 16810657 16024260
18069A6024260n38317m68521l26178l44397m75137m52987l07630k65589k69365
$$ 16024260 15485943 15017422 14691244 14346847 13871710 13418723 13111093 12845504 12576139
18060A2576139j84765k14184j85318j91716k64533k38732k48325k40522j51244
$$ 12576139 12391374 12177190 11991872 11800156 11535623 11296891 11048566 10808044 10656800
18051A0656800j50862p1670q5045j23715j20396p7831p8456j78662j83579j84334
$$ 10656800 10505938 10434268 10349223 10225508 10105112 10027281 9948825 9770163 9586584 9402250
18041I402250k42173j86690p8327m6063j36874j13906j59647j33887j13575p9565
$$ 9402250 9160077 8973387 8895060 8848997 8712123 8598217 8438570 8304683 8191108 8111543
18031H111543j93683j13594j03669j66036j03599j09431J3213j7588q0778o2329
$$ 8111543 7917860 7804266 7700597 7534561 7430962 7321531 7334744 7317156 7236378 7174049
18021G174049q0285j50838j62299j32079j33410k01925q2477n7074n538L3240
$$ 7174049 7093764 6942926 6780627 6648548 6515138 6313213 6230736 6173662 6168124 6201364
18011F201364l9749j40515j85048j9167k0836j3248n1852j36636p0781k8489j894
$$ 6201364 6161615 6021100 5836052 5816885 5796049 5782801 5730949 5594313 5523532 5495043 5493149
18000E493149J6077n3138j8988j24008m2103l8945n4981l5899k0359n7655j05344
$$ 5493149 5509226 5456088 5437100 5313092 5270989 5232044 5177063 5141164 5120805 5063150 4957806
17989D957806p3977k5412J7145q2924q8200l3314P4898j11848r1344o5686l4662
$$ 4957806 4883829 4858417 4875562 4792638 4704438 4671124 4746022 4634174 4542830 4477144 4442482
17978D442482j0854q3053k5137k3127o644p9924j04313o9847K2475J4621n8778
$$ 4442482 4431628 4348575 4323438 4300311 4293667 4213743 4109430 4039583 4062058 4076679 4017901
17967D017901j55153p7298J4487N7503Q7559j420j2625m4825k1775j06202k3354
$$ 4017901 3862748 3785450 3799937 3857440 3944999 3943579 3930954 3886129 3864354 3758152 3734798
17956C734798Q928l1711q3396m5622l9934j2863N5958J7078p5828j32495o9202
$$ 3734798 3743726 3712015 3628619 3582997 3543063 3530200 3586158 3603236 3527408 3394913 3325711
17945C325711J7139J0852J3734m3150L2607Q330p7891j02290m3128M0442R6847
$$ 3325711 3342850 3353702 3367436 3324286 3356893 3365223 3287332 3185042 3141914 3182356 3279203
17934C279203j7940j46141j65497N6300Q5324o6851m9286m4658n0895K7073R8635
$$ 3279203 3261263 3115122 2949625 3005925 3091249 3024398 2975112 2930454 2879559 2906632 3005267
17923C005267n6823k3051l6733M9648N0077p0319J0805m9739l8510n5010j18398
$$ 3005267 2948444 2925393 2888660 2938308 2988385 2918066 2928871 2879132 2840622 2785612 2667214
17912B667214Q4376J01243l3691O3012m5749p3816p6459k2850p3414l167j3719
$$ 2667214 2751590 2852833 2819142 2882154 2836405 2762589 2686130 2663280 2589866 2586699 2572980
17901B572980J2001k6331M6920O3047m5909j2408L7602P7515j1293q956L0956
$$ 2572980 2584981 2558650 2605570 2668617 2622708 2610300 2647902 2725417 2714124 2705168 2736124
17890B736124j4374o7682j4769N5013k6574k6028n2556o6502m9878p501K5062
$$ 2736124 2721750 2654068 2639299 2694312 2667738 2641710 2589154 2522652 2472774 2465273 2490335
17879B490335n00j1608j4768p10m9691k3887l9609o0795p7071k3156L8045l5085
$$ 2490335 2489835 2478227 2463459 2462749 2413058 2389171 2349562 2288767 2211696 2188540 2226585 2191500
17867B191500k1180J5768j6736m2349n9695K0981n302N0751j25l7306J5032K6139
$$ 2191500 2170320 2186088 2169352 2127003 2067308 2088289 2082987 2133738 2133613 2096307 2111339 2137478
17855B137478n9052K2908Q2091j0965q9331p0554m2670k0772n6577m1773o4758
$$ 2137478 2078426 2101334 2183425 2172460 2083129 2012575 1969905 1949133 1892556 1850783 1786025
17844A786025p1089o1754N7208Q5362J00106J6547r294j01103q2215L2249R1054
$$ 1786025 1714936 1653182 1710390 1795752 1895858 1912405 1903111 1802008 1719793 1752042 1843096
17833A843096l8749l4558o016p5885j00084k432O2109N0320K2629n9512k6004
$$ 1843096 1804347 1769789 1763773 1687888 1587804 1585372 1647481 1697801 1720430 1660918 1634914
17822A634914r4317J8266L6607M8316K2714l1316k2878L5117J06957k0211r7412
$$ 1634914 1540597 1558863 1595470 1643786 1666500 1635184 1612306 1647423 1754380 1734169 1636757
17811A636757L2677O5985K490N3476j71m2890j20059m2552J3782P3718J12352
$$ 1636757 1669434 1735419 1737909 1791385 1791214 1748324 1628265 1585713 1599495 1673213 1785565
17800A785565Q273o6496j5249M0134L9837Q4156M8531J7039L8126l2745j05055
$$ 1785565 1793838 1727342 1712093 1752227 1792064 1876220 1924751 1941790 1979916 1947171 1842116
17789A842116O1180m3283o6561J13793O4182m5878o6680n432p7056j28082o2702
$$ 1842116 1903296 1860013 1793452 1907245 1971427 1925549 1858869 1853437 1776381 1648299 1585597
17778A585597q7240l509L3166J4676k3047M3129P2811p5551k0299r1858j7143
$$ 1585597 1498357 1494848 1528014 1542690 1519643 1562772 1635583 1560032 1539733 1447875 1430732
17767A430732k2495J8681K6712j1431J14088N983j26222j27314M9126R3571R0501
$$ 1430732 1408237 1426918 1453630 1442199 1556287 1562270 1436048 1308734 1357860 1451431 1541932
17756A541932N7078l4092J0436N0462R2492J24265O0045J1812N470O4430M6102
$$ 1541932 1599010 1564918 1575354 1625816 1718308 1842573 1902618 1914430 1919900 1984330 2030432
17745B030432m0039N3166J24549N0396j5635n9753r5639l4930K6902M0103j778
$$ 2030432 1990393 2043559 2168108 2218504 2202869 2143116 2047477 2012547 2039449 2079552 2077774
17734B077774n209k9387K8678J09196L1646k120k1858p6829J0004N9541L5235
$$ 2077774 2072565 2043178 2071856 2181052 2212698 2210578 2188720 2111891 2121895 2181436 2216671
17723B216671q955o4712q0461k9230P757m0953K406k6397p4001K4546m500M2857
$$ 2216671 2207716 2143004 2062543 2033313 2041070 2000117 2002523 1976126 1902125 1926671 1922171 1965028
17711A965028q026j11203j43701J3213J4672n1114K4735L9059n8455j1617k2996
$$ 1965028 1957002 1845799 1702098 1715311 1729983 1678869 1703604 1742663 1684208 1672591 1649595
17700A649595M5705L8883l7657n0259Q0491K5546j5212k1184m7861P515J27583
$$ 1649595 1695300 1734183 1696526 1646267 1726758 1752304 1737092 1715908 1668047 1675562 1803145
17689A803145R0699M8698M6162L0482N8157J7491r1527L8833M8754j89k8921n538
$$ 1803145 1893844 1942542 1988704 2019186 2077343 2094834 2003307 2042140 2090894 2090705 2061784 2056246
17677B056246M0456M4168j5807m9036n5172O3783j1143j02388p5733Q6347Q3378
$$ 2056246 2096702 2140870 2125063 2076027 2020855 2084638 2073495 1971107 1895374 1981721 2065099
17666B065099n058j09327n3841J844m3092j9845m3707l371p6098l8597J4215o6381
$$ 2065099 2060041 1950714 1896873 1898717 1855625 1835780 1792073 1788702 1712604 1674007 1688222 1621841
17654A621841L0962K6609o1830J7505O3621Q0899J18133k2248m5617q6718p5540
$$ 1621841 1652803 1679412 1617582 1635087 1698708 1779607 1897740 1875492 1829875 1743157 1667617
17643A667617N4243N0239o4498m3071k2999J4035P0617O1240L4000R9449L8005
$$ 1667617 1721860 1772099 1707601 1664530 1641531 1655566 1726183 1787423 1821423 1920872 1958877
17632A958877l2692K9659j4484J1191j02007l286J17743J2553P5735M2877j14054
$$ 1958877 1926185 1955844 1941360 1952551 1850544 1847258 1965001 1977554 2053289 2096166 1982112
17621A982112K3722N7499N5722J4104j04746M1311Q9602k549J3787N0302J13846
$$ 1982112 2005834 2063333 2119055 2133159 2028413 2069724 2159326 2156777 2170564 2220866 2334712
17610B334712P3473Q715k0520j7471M1473N9228J27048P3222O0002J37129P6296
$$ 2334712 2408185 2416900 2396380 2378909 2420382 2479610 2606658 2679880 2739882 2877011 2953307
17599B953307K9648J16571J79110J54082O0579P3940J17698J69677J27661K12459
$$ 2953307 2982955 3099526 3278636 3432718 3493297 3567237 3684935 3854612 3982273 4194732
17589D194732K49925K46475J78534K32443K08396R1154J57860J78346K75637J82047
$$ 4194732 4444657 4691132 4869666 5102109 5310505 5401659 5559519 5737865 6013502 6195549
17579F195549K35134L45607K46382K02847L21170K44952L13870L38419J43195
$$ 6195549 6430683 6776290 7022672 7225519 7546689 7791641 8105511 8443930 8587125
17570H587125O3606R6190J54575N6901J35149Q1311M8707j5861j24450j13512
$$ 8587125 8650731 8746921 8901496 8958397 9093546 9174857 9223564 9207703 9083253 8969741
17560H969741j51303j67369k28892k23925k61968k38772k57593k51905k29822
$$ 8969741 8818438 8651069 8422177 8198252 7936284 7697512 7439919 7188014 6958192
17551F958192k04393k73737k41685k52141k68677k21388k44359k14953j50677
$$ 6958192 6753799 6480062 6238377 5986236 5717559 5496171 5251812 5036859 4886182
17542D886182j55276j61872k16345r9022j05001r8828j04242j90457r1744j01211
$$ 4886182 4730906 4569034 4352689 4253667 4148666 4049838 3945596 3755139 3663395 3562184
17532C562184j00414j64893r2349j16355j21760q9636o1866o3423r2063j03415
$$ 3562184 3461770 3296877 3204528 3088173 2966413 2876777 2814911 2751488 2659425 2556010
17522B556010j22640Q312q2992M4260m2340j41418r4377p1150q6074l4643J3023
$$ 2556010 2433370 2441682 2358690 2402950 2360610 2219192 2124815 2053665 1967591 1932948 1945971
17511A945971j24781J2590R9800L6032q6466q7942l8459m280K6486K0343p5188
$$ 1945971 1821190 1833780 1933580 1969612 1883146 1795204 1756745 1752465 1778951 1799294 1724106
17500A724106q3199O0224Q2814j15260q9330N0813L0530n9717o7352m3603p0945
$$ 1724106 1640907 1701131 1783945 1668685 1579355 1630168 1660698 1600981 1533629 1490026 1419081
17489A419081j3477n4960j7757q1103m9561J3627M0902R2885M3215m4480m2387
$$ 1419081 1405604 1350644 1332887 1251784 1202223 1215850 1256752 1349637 1392852 1348372 1305985
17478A305985m7880L3013K9246k7607M2932J7248j03598r1305m7812N5604J4123
$$ 1305985 1258105 1291118 1320364 1292757 1335689 1352937 1249339 1158034 1110222 1165826 1179949
17467A179949l4412M7695J9158p1530L771J276j10334j31016L080P7773p480l404
$$ 1179949 1145537 1193232 1212390 1140860 1144631 1145907 1035573 904557 907637 985410 977930 974526
17455I74526m963L0634R8158J00379j3975r7654m971P9546l5265m7676m206K8478
$$ 974526 969563 1000197 1098355 1198734 1184759 1087105 1082134 1161680 1126415 1078739 1074533 1103011
17443A103011J42941R048j84857q8767q4512k8335M3379K7173J3210N0861p3707
$$ 1103011 1245952 1255000 1070143 981376 896864 868529 911908 939081 952291 1003152 929445
17432I29445j01943j6427l8475Q4644N3063l7296K2978O4389q715N0877O1296
$$ 929445 827502 811075 772600 857244 910307 873011 895989 960378 951663 1002540 1063836
17421A063836p2364j36062J9090J0576q9683J3981L211P4469J25736P862k9931
$$ 1063836 991472 855410 874500 885076 795393 809374 812585 887054 1012790 1020652 990721
17410I90721r127k602j0896O2882J1547l6696o7982N4527l4557m8294m5771J2949
$$ 990721 981594 978992 968096 1030978 1042525 1005829 937847 992374 957817 909523 863752 876701
17398H76701J7476n8385r7580M4776N0290M9767p871l1552q1620O165p034k1496
$$ 876701 894177 835792 738212 782988 833278 883045 875174 843622 762002 768167 761133 739637
17386G39637J22912J0732J8277J5810k6029n9895P588K8293M8730m2453k2463
$$ 739637 862549 873281 891558 907368 881339 821444 829032 857325 906055 863602 841139
17375H41139M3903N6594J2971l1822M6521j419r4224N449K4199J5618j7946j3428
$$ 841139 885042 941636 954607 922785 969306 967887 873663 879112 903311 918929 900983 887555
17363H87555J3927J2616j8335k3002N2628K1359K3632O1062r5404n4127K6838
$$ 887555 901482 914098 895763 872761 925389 946748 970380 1031442 936038 881911 908749
17352I08749J10595l0469j7770k7024n0958p77m964o997M2686m2105r8943m0540
$$ 908749 1019344 988875 971105 944081 893123 892346 887382 880385 923071 880966 782023 741483
17340G41483J9385L3450K1406K0582l8476L4637J57594n1003j00339o066R1987
$$ 741483 760868 794318 815724 836306 797830 832467 990061 939058 838719 832653 924640
17329I24640Q5335j8205j7134l2679O938K1825p848n092N0592K5352n175j0741
$$ 924640 1009975 991770 974636 941957 948895 970720 962872 957780 1008372 1033724 1028549 1017808
17317A017808l9723J0905Q7991O9378o4022l9106L2051M2908J689j01330q1393
$$ 1017808 978085 988990 1076981 1146359 1082337 1043231 1075282 1118190 1119879 1018549 937156
17306I37156m6180M8525Q3217M4276J85437N7015p4074n449J1789n2134R9425
$$ 937156 890976 939501 1022718 1066994 1252431 1309446 1235372 1229923 1241712 1189578 1289003
17295A289003Q8683j0841K5285q134l8030l768L9082k9107P0358P6568L3041J21738
$$ 1289003 1377686 1366845 1392130 1383996 1345966 1342198 1381280 1352173 1422531 1499099 1532140 1653878
17283A653878j5057n4422J78654J76216J05659j0356q3534L4650J29471J09699
$$ 1653878 1638821 1584399 1763053 1939269 2044928 2034572 1951038 1985688 2115159 2224858
17273B224858J02007O4828J11168J46582J58439J03919J34171J29800J42593J45512
$$ 2224858 2326865 2391693 2502861 2649443 2807882 2911801 3045972 3175772 3318365 3463877
17263C463877K01913J72525Q3951K11613L00892K84564K80545K49446L19385K62256
$$ 3463877 3665790 3838315 3922266 4133879 4434771 4719335 4999880 5249326 5568711 5830967
17253E830967K58320L76738K89861K24538L13711M41709L27760J43080K12889
$$ 5830967 6089287 6466025 6755886 6980424 7294135 7735844 8063604 8206684 8419573
17244H419573J65981J08975J26833J61224q394j06152j19525j74965j02458k24972
$$ 8419573 8585554 8694529 8821362 8982586 8974192 8868040 8748515 8573550 8471092 8246120
17234H246120l13028k48916j82190k01569l45495l40097l07322k42341l25353
$$ 8246120 7933092 7684176 7501986 7300417 6954922 6614825 6307503 6065162 5739809
17225E739809k67947k21584l33373k19573j56809l07563j92897k30548r4503j71057
$$ 5739809 5471862 5250278 4916905 4697332 4540523 4232960 4040063 3809515 3715012 3543955
17215C543955j33453r9881j99975k04602j04611k3423p2876m4085m7716o5195
$$ 3543955 3410502 3310621 3110646 2906044 2801433 2778010 2705134 2661049 2613333 2548138
17205B548138p1146j09388J0017p9027j45493p0722r1583j7635M404q7436J7304
$$ 2548138 2476992 2367604 2377621 2298594 2153101 2082379 1990796 1973161 1977565 1890129 1907433
17194A907433o7886j61637o3986K7719K5122O6448K7878k917j20409l0816m7981
$$ 1907433 1839547 1677910 1613924 1641643 1666765 1733213 1761091 1758174 1637765 1606949 1558968
17183A558968j4011m2203m5322j1032o3789k8005j01672n851N2229q1587j7298
$$ 1558968 1544957 1502754 1457432 1446400 1382611 1354606 1252934 1247083 1299312 1217725 1200427
17172A200427m6440o7563P9171J64507l0674j62963r1842Q275M347m6645j14476
$$ 1200427 1153987 1086424 1165595 1330102 1299428 1136465 1044623 1052898 1057245 1010600 896124
17161H96124l0024N5928k107K8160o3728j4094J4702R8860N020j15093j2875O9054
$$ 896124 866100 922028 919921 948081 884353 870259 884961 983821 988841 873748 860873 929927
17149I29927n5016K1369P81M8716J6890n9746k1295J1958q3265j19033o2884M786
$$ 929927 874911 896280 897061 945777 962667 902921 881626 893584 810319 691286 628402 633188
17137F33188J06806L4160O3521P2529N6215L6262n2601j2945k7010m9480j5825
$$ 633188 739994 774154 837675 910204 966419 1002681 950080 937135 910125 860645 844820
17126H44820J6641k2161L1361K5927L074o3804K1760L8713J1239K9689j089L4221
$$ 844820 861461 839300 870661 896588 899662 835858 857618 896331 907570 937259 936170 970391
17114I70391m880m8224l7926j20713o3674J12502J63504k4630r6810l4754L1649
$$ 970391 965511 917287 879361 758648 694974 807476 970980 946350 849540 814786 846435
17103H46435Q4815N1680J7300o8747j6919L1010M6249J83997N0948m9482K084
$$ 846435 931250 982930 1000230 931483 914564 945574 991823 1175820 1226768 1177286 1179370
17092A179370l8857r4233K0279J08029o8058J4939L9811O8689M247Q3597O6666
$$ 1179370 1140513 1046280 1066559 1174588 1106530 1121469 1161280 1229969 1234216 1317813 1384479
17081A384479p588L3567Q4503J1194o9423k358M6110K5353L9596J01109N3579
$$ 1384479 1376891 1410458 1494961 1506155 1436732 1434374 1480484 1505837 1545433 1646542 1700121
17070A700121L5546J32737M2916k874J19535J20244n826l6517n8426O0027M2140
$$ 1700121 1735667 1868404 1911320 1908446 2027981 2148225 2142399 2105882 2047456 2107483 2149623
17059B149623R3778R5358K7724J34685N9998j5887R3417J40043J26894R9968Q7100
$$ 2149623 2243401 2338759 2366483 2501168 2561166 2545279 2638696 2778739 2905633 3005601 3092701
17048C092701K2574J0715j9744j7118n1652O1625N2882L5741k3185L8974o7073
$$ 3092701 3115275 3125990 3106246 3089128 3037476 3099101 3151983 3187724 3164539 3203513 3136440
17037C136440j88874o9360k2421J2544M3629K6j74623r8223p3609n1490j6904
$$ 3136440 2947566 2878206 2855785 2868329 2911958 2911984 2737361 2639138 2565529 2514039 2497135
17026B497135p3599j79698j16867n689m2151n9673n4129q9680k5850J9094o2106
$$ 2497135 2423536 2243838 2126971 2121282 2079131 2019458 1965329 1875649 1849799 1868893 1806787
17015A806787O413n4681k9819r0259n2839p3433j45338l0010J0619n6374n282
$$ 1806787 1813200 1758519 1728700 1638441 1585602 1512169 1366831 1336821 1347440 1291066 1285784
17004A285784L3150m5085M8096l6762j23441j18894m430K4633r6503n5613N5579
$$ 1285784 1318934 1273849 1321945 1285183 1161742 1042848 1038418 1063051 966548 910935 966514
16993I66514M9822J05460L6153p3196j36341L271k4101m5677J5568R7460P8519
$$ 966514 1016336 1121796 1157949 1084753 948412 951683 927582 881905 897473 994933 1073452
16982A073452j48880K6072k5863j22798p1541J1878j0334L9002K0895n6671O3864
$$ 1073452 924572 950644 924781 801983 730442 742320 731986 770988 791883 735212 799076
16971G99076o657l2289n2237N8247k1029o7709l4820k8973K1509k7244Q859O6193
$$ 799076 792419 760130 707893 766140 745111 677402 642582 613609 635118 607874 616733 682926
16959F82926j60593J5742K8130L1999j1665j00632l9356M9284O4305J04856N4233
$$ 682926 522333 538075 566205 598204 586539 485907 446551 495835 560140 664996 719229
16948G19229n4563j21853n7657l4434j6979J0395j0062o5844K9890J31498Q6198
$$ 719229 664666 542813 485156 450722 433743 444138 434076 368232 398122 529620 615818
16937F15818K532j36242l1512M1298O9246j8678m6822o694K1682O4223K7428M1577
$$ 615818 618350 482108 450596 491894 561140 542462 495640 488946 510628 574851 602279 643856
16925F43856l8238o7685m826k6554l1566l8998N924l546o537p3621k8193j1856
$$ 643856 605618 537933 533107 506553 474987 435989 441913 438367 431830 358209 330016 318160
16913C18160n0806L444J30863N5070o3609K9304j1149J3715J10042k5734j08446
$$ 318160 267354 270798 401661 456731 393122 422426 411277 424992 535034 509300 400854
16902D00854o8016R5607Q8322l9075l747K520k7354m704m6669r6054j35860j0486
$$ 400854 332838 428445 516767 477692 473945 476465 449111 444407 397738 301684 165824 155338
16890A55338j5711J10121Q5146P9501l0542p2946J9972l2870l9890n780k2750
$$ 155338 139627 249748 334894 414395 383853 310907 330879 298009 258119 252339 229589
16879B29589J51L9158J8913o8132n7700Q2930J09319L4318m5402n5871p1712M9
$$ 229589 229740 268898 287811 219679 161979 244909 354228 388546 343144 287273 215561 215610
16867B15610J01829N3603J4613j9992m1330o7318n9479j3849N8833Q0518M7886
$$ 215610 317439 371042 385655 365663 324333 257015 197536 183687 242520 323038 370924
16856C70924J7126m3715K9306m3358o8826j6284L4860K3486q6355l7956j7681
$$ 370924 388050 344335 373641 330283 261457 245173 280033 303519 217164 179208 161527
16845A61527m209P8282J5216l089K696n4504O5147L7753r2807j6441j2215j2863
$$ 161527 157318 235600 250816 247727 250423 195919 261066 298819 206012 189571 177356 164493
16833A64493Q851L8832O4778Q4028p5571P4278l2653m2960J7349o1973p1034n7646
$$ 164493 173344 212176 276954 360982 285411 359689 327036 284076 301425 239452 168418 110772
16821A10772j26703M2267J63241R1309L0141m9201q7730R243R2346j9261n037
$$ 110772 -15931 26336 189577 280886 311027 261826 174096 183339 275685 256424 251387
16810B51387J2389P7362Q8455K6751l6012m7062n7486O2292N8327q7181k4087
$$ 251387 263776 341138 429593 456344 420332 373270 315784 378076 436403 349222 325135
16799C25135J5046q0565n0805J16248N7238k2737q9085r0222L753n3008j00317
$$ 325135 340181 259616 208811 325059 382297 359560 270475 180253 184006 130998 30681
16788C0681j1187Q8694J57202M5038J197L3790q004j18127j08231o4768Q534J35657
$$ 30681 19494 108188 265390 310428 311625 345415 337411 219284 111053 46285 54819 190476
16776A90476J34854O7521o7572K2584k9766o5823K5907P7965j94Q46j8801k59
$$ 190476 325330 392851 325279 347863 318097 252274 278181 356146 355952 356798 337997 337738
16764C37738l0214n6631n6687p6752Q3935Q7450Q1393M4476n2805j03457p511
$$ 337738 307524 250893 194206 117454 201389 288839 370232 414708 361903 258446 250935
16753B50935M5019J8748n1540j7811M5752l5528l8260M2980j7795m1900K8351
$$ 250935 295954 314702 263162 245351 291103 255575 217315 260295 242500 200600 228951
16742B28951J5038j2690K9206O508Q0671M0643l242L496j07576m9215L9119l2342
$$ 228951 243989 231299 260505 267013 347684 388327 385085 388581 281005 231790 270909 238567
16730B38567o4076q6650m6160K6688J26545N1041J165N5614q7550k9937N427o3777
$$ 238567 174491 87841 41681 68369 194914 245955 247120 302734 215184 185247 190674 126897
16718A26897j3946J1365M2454L4780k3061r6255m6191n7847L8650P8953n053Q2997
$$ 126897 112951 124316 166770 201550 178489 82234 36043 -21804 16846 95799 90746 173743
16706A73743O6650r1927k6384j7534Q746N608j6863J521p119K928m7494O478L1220
$$ 173743 240393 148466 122082 104548 113294 118902 102039 103560 96441 99369 51875 58353 89573
16693H9573M7564l8715k0243q656L8690J897L2552M2939Q887J8873N5938n1693
$$ 89573 137137 98422 78179 69523 108213 110110 142662 185601 194488 213361 269299 217606
16681B17606l7131N6336Q3089l1675m1774k9767m1521j31224m8197J18965p2920
$$ 217606 180475 236811 319900 288225 246451 216684 175163 43939 -4258 114707 41787
16670D1787p6694L7660N7716J31447P1075Q0297N2019k2428m1907k8872p1587
$$ 41787 -34907 2753 60469 191916 262991 343288 395307 372879 330972 302100 230513
16659B30513l8633o1522J760N9034l5062q6415j06831j4016L6724L9017K4385
$$ 230513 191880 130358 132118 191152 156090 69675 -37156 -51172 -14448 24569 48954
16648D8954j5761M2633k4320m7777Q928n0701J20102P830k4544J29223J03915
$$ 48954 33193 75826 51506 3729 12657 -38044 82058 89888 65344 194567 298482
16637B98482O3947j03424r8340l7096J4896k7084L0230j4225L0956J3860O3612
$$ 298482 362429 259005 160665 123569 138465 111381 141611 127386 158342 172202 235814
16626B35814R980O290r4059j01595j860L0950n3881m4116K8879L4732J4731O3361
$$ 235814 245794 252084 158025 56430 54570 85520 31639 -12477 16402 51134 65865 129226
16614A29226R5221J0326l8212O6943k6870M1531j8544j9452L2398j9930q7455
$$ 129226 224447 234773 196561 263504 236634 278165 259621 240169 272567 252637 165182
16603A65182j06447n3306P7231N5474m0397k7613o4629L3038R1619M7104k2412
$$ 165182 58735 5429 82660 138134 97737 70124 5495 38533 130152 177256 154844
16592A54844R9246L7639p8789m5915K0065K9562M7102k5883O3111K0679o4218
$$ 154844 254090 291729 212940 167025 187090 216652 263754 237871 300982 321661 257443
16581B57443j09120l4440m1325P7250O6014L4292M4364p5647j03346R298l659
$$ 257443 148323 113883 72558 149808 215822 250114 294478 218831 115485 124783 121124
16570A21124N0878J408m5984J9300Q8451m5715N56R5477l6408o8060K9850p2362
$$ 121124 172002 173410 127426 146726 235177 189462 190018 285495 249087 181027 210877 138515
16558A38515k4720N2804P1276M6114m2562q8541N9320N9216q980p7791O0908M8114
$$ 138515 113795 166599 237875 283989 241427 152886 212206 271422 262442 184651 245559 293673
16546B93673p4939k9612m6159Q8624M9469o3919l8422N7125K6126n0305o3304
$$ 293673 218734 189122 142963 231587 281056 217137 178715 235840 261966 211661 148357
16535A48357r336J3430L6415l3403J3018L3365q6517R157K2494R6710M4237j38289
$$ 148357 139021 152451 188866 155463 168481 201846 115329 124486 146980 243690 287927 149638
16523A49638q1384Q530O2893n6749k6029K5002M7074n4122N0918K8578O0087N3954
$$ 149638 68254 76784 139677 82928 56899 81901 128975 74853 125771 154349 214436 268390
16511B68390N086q0660o0242r130N7407o7686q3049j6968M7893m0990J1469N3017
$$ 268390 273476 192816 132574 123444 180851 113165 30116 13148 61041 20051 31520 84537
16499H4537L1439O4218N7110P192p7179J1913L7159J6161l0338j39373l1474J2158
$$ 84537 115976 180194 237304 244496 167317 179230 216389 232550 202212 62839 31365 43523
16487D3523j39709m1714P4826P0982M8143n2789J507K4105m8N730K9360R9893
$$ 43523 -96186 -137900 -63074 7908 56051 3262 4769 28874 28826 34556 63916 163809
16475A63809m5079r1897L9452q5019N9424R9035J06749k8274j3705j4007J5632
$$ 163809 118730 26833 66285 -18734 40690 139725 246474 218200 204495 190488 206120
16464B06120L2721n2840k6265k0485k5447l7654n134o245l6145l4724K9482P3309
$$ 206120 238841 186001 159736 139251 113804 76150 71016 64771 28626 -6098 23384 96693
16452I6693O853n9335m7898l4664L1075K0580J45171o271m5908N771k0595O3880
$$ 96693 103546 44211 -3687 -38351 -7276 13304 158475 152204 106296 112067 91472 155352
16440A55352o35l693P55j1937q8027l2205O872m3785P9195N2166j22529p8560
$$ 155352 154717 151024 151779 139842 51815 19610 26482 -17303 61892 114058 -8471 -87031
16428h7031Q6188J25923J0600j04581p5911O8664P1224O2378l6714k5254k9423
$$ -87031 -843 125080 135680 31099 -44812 23852 95076 157454 120740 95486 66063
16417F6063N2457J03443l9581m9468p7486m9909L6787N2189K4017J0451P5230
$$ 66063 118520 221963 182382 132914 55428 5519 42306 94495 118512 128963 204193
16406B04193P4516N008j19998L0410n1208o4293N7862L0871J3369n1700j44447
$$ 204193 278709 283717 163719 194129 142921 78628 136490 167361 180730 129030 -15417
16395a5417p0812J31370L1191K0234n7475j7081R9840N4195m0085O610K4677O8302
$$ -15417 -86229 45141 76332 96566 39091 22010 121850 176045 135960 142570 167247 235549
16383B35549j6277j9830N820o9431j5162l2338l7476p2323R808K5243P7524k7386
$$ 235549 219272 199442 205262 135831 120669 88331 50855 -21468 -11660 13583 91107 63721
16371F3721l7677L6757K0898j5106l1673q3340o1553j0524L0083J3822L6563J71960
$$ 63721 26044 62801 83699 68593 36920 -46420 -107973 -118497 -88414 -74592 -38029 133931
16359A33931R5563k975m5007r4599k6990Q0070L3165R733j1699j35069J9605J8951
$$ 133931 229494 226519 181512 86913 59923 139993 173158 182891 171192 36123 55728 74679
16347G4679O3741m3782n7765N0025M3825m0149J188P0383k8682p497J08586M4724
$$ 74679 138420 94638 36873 86898 130723 90574 91762 162145 133463 125966 234552 279276
16335B79276j23531j0420L9103j391L9388Q2480m6211p2529P2949n3393l8104
$$ 279276 155745 145325 184428 183037 222425 304905 258694 186165 259114 205721 167617
16324A67617q920q9579j12096K9871j3728l4189l89K8125R4188N6083m9574q9260
$$ 167617 158697 69118 -42978 -13107 -26835 -61024 -61413 -33288 60900 116983 67409 -21851
16312b1851j16884L723J34719K7293j6762R5241k7286k1992N1634J0803O2066
$$ -21851 -138735 -135012 -293 27000 10238 105479 78193 56201 107835 118638 180704
16301A80704j7342J6924l1592j1211m0720M6929l2289n7775k7969R9298J01756
$$ 180704 163362 180286 148694 137483 96763 143692 111403 53628 25659 124957 226713
16290B26713K4237m2089j37108k0573R758o5797j569K6167j3462J6187j7068l1884
$$ 226713 250950 208861 71753 51180 60938 -4859 -6428 19739 6277 22464 5396 -26488
16278b6488L8252J15347m864r6504J1815j7880P6546J71877K9630j04910j975
$$ -26488 11764 127111 122247 25743 37558 19678 96224 268101 297731 192821 190846
16267A90846K76L2531N9082j8576o3564k7016o5866k8955L3124O7642q5678p3553
$$ 190846 191122 223653 282735 264159 200595 173579 107713 78758 111882 179524 93846 20293
16255B0293l665l3505k7701j2379J14246P2501L9534n7754j68078j3323N9903
$$ 20293 16628 -16877 -44578 -56957 57289 129790 169324 111570 -56508 -69831 -9928
16244i928O3985K6548O669J5056q0784o8511L7154p2289j7121J7197L3646M7984
$$ -9928 54057 80605 87274 102330 21546 -46965 -9811 -82100 -99221 -82024 -48378 -394
16232c94K2667m3254J3445J05784L4609m009r7805K0023j4739M0490L5313k3153
$$ -394 22273 -20981 -7536 98248 132857 128848 31043 51066 36327 76817 112130 88977
16220H8977K8774J11602O9876p3040j13747j14784K8925m3510J1864j8385J6843
$$ 88977 117751 229353 299229 226189 112442 -2342 26583 -16927 -5063 -23448 -6605
16209f605L4831O9358j4534K8295k9658p0318o6018J60035J78492l0074j10816
$$ -6605 28226 97584 83050 111345 81687 11369 -54649 105386 283878 253804 142988
16198A42988q1163j13384o0960J0492Q6570L1001L8993p057l0511n9466o9127
$$ 142988 61825 -51559 -112519 -102027 -15457 15544 54537 47480 16969 -42497 -111624
16187a11624j2680N9012n453j4969k531M8914J24295J27299o3035k1483k3801
$$ -111624 -124304 -65292 -70745 -85714 -88245 -39331 84964 212263 149228 127745 103944
16176A03944M2347k5470j6846L3495K2096m8943L3490l3338J2111J0804M8270
$$ 103944 146291 120821 103975 137470 159566 110623 144113 110775 122886 133690 181960
16165A81960j68m910p9163j04313M6962J10057Q9485J2170r2052j6987k2449R1477
$$ 181960 181792 176882 97719 -6594 40368 150425 239910 252080 160028 143041 120592 212069
16153B12069j7901l8460N3011P0724J0626q1748J770Q829J9868O8450l894l6526
$$ 212069 194168 155708 208719 279443 290069 208321 210091 218920 238788 307238 303344 266818
16141B66818q7080k0437j8367N5619j2356o6276l8613P0392L9180q7949j62828
$$ 266818 179738 159301 140934 196553 184197 117921 79308 149700 188880 100931 -61897
16130f1897j03307R4219O7713Q238N4969l4365M4766J7028l1696Q9890J7921r989
$$ -61897 -165204 -70985 -3272 4966 59935 25570 70336 87364 55668 145558 163479 153490
16118A53490P1068L2232k9731r4414q7113k340P7534Q3931K0986j7672L5642P1210
$$ 153490 224558 256790 227059 132645 45532 43192 120726 204657 225643 207971 243613 314823
16106C14823K4194k4598k9592K6508J9596L3810k7410p5375m263Q9123M8637l0245
$$ 314823 339017 314419 284827 311335 330931 364741 337331 261956 257693 346816 395453 365208
16094C65208N9235J489J03992Q1823j0500R825k3877p828o7809k5944O2269L0617
$$ 365208 424443 425932 529924 611747 601247 611072 587195 579367 511558 485614 547883 578500
16082E78500k1655M4374k2568j10743l3374M0347m614J9415j9556k7734J5622
$$ 578500 556845 601219 578651 467908 434534 474881 470267 489682 470126 442392 458014
16071D58014m4837o9841j3031K5779O0735O1030Q6587j890j529l4610m3447j1313
$$ 458014 413177 343336 330305 356084 416819 477849 564436 562546 561017 526407 482960 471647
16059D71647K4199k7109L5417Q3132M514J02088J07510o436P4984l0652J1250
$$ 471647 495846 468737 504154 587286 591800 693888 801398 794962 869946 839294 850544
16048H50544O6608j7272K6322J39251J96382J45860N2999L3060q625K10201K02278
$$ 850544 917152 899880 926202 1065453 1261835 1407695 1460694 1493754 1485129 1695330 1897608
16037A897608Q7565J35199J49455O3514K5373O2938J59286J54281J25522J24219
$$ 1897608 1985173 2120372 2269827 2333341 2358714 2421652 2580938 2735219 2860741 2984960
16027B984960R349l1545J210L0283o9564r8205j47502j64280p5117p7794j70796
$$ 2984960 2994309 2962764 2963974 2994257 2924693 2826488 2678986 2514706 2439589 2361795 2190999
16016B190999k28208j69298l8685m3191N2624n7951j62108j58781j24122o6582
$$ 2190999 1962791 1793493 1754808 1711617 1764241 1706290 1544182 1385401 1261279 1194697
16006A194697r0468r1515N6644K5627j24120o758j5666l4814m1635m410j8959
$$ 1194697 1104229 1012714 1069358 1094985 970865 964107 948441 913627 871992 867582 848623
15995H48623l2341p9547j26917L1880M7563m1779K3428o2960j36789o6287m9322
$$ 848623 816282 736735 609818 641698 689261 647482 670910 607950 471161 404874 355552
15984C55552j1222O8299O150k2406Q965J8677L7263j17292M4075L7418o0746j8442
$$ 355552 344330 412629 418779 396373 405338 424015 461278 343986 388061 425479 364733 346291
15972C46291R113j0041o1585m3875L6599L9597l5918l2367L6124L4306N1663k5894
$$ 346291 355404 345363 283778 239903 276502 316099 280181 247814 283938 318244 369907 344013
15960C44013j9416r5227l282p3870m109L9979l3842Q1476R9039K6880m7229n5700
$$ 344013 324597 229370 226088 152218 148109 188088 154246 235722 334761 361641 314412 258712
15948B58712o9876m4075M467J09886p3390o8513l0504l1866N7918R7120m9858
$$ 258712 188836 144761 149228 259114 185724 117211 86707 54841 112759 209879 160021
15937A60021m032K7326Q4777N3764j3037J4265o0955q2337J9469m062k4583J01215
$$ 160021 155989 183315 268092 321856 308819 323084 262129 179792 199261 195199 170616 271831
15925B71831N6701r4171l863O5974l2165r3675K197N3487r3687k0015k003k1057
$$ 271831 328532 234361 230498 296472 264307 170632 172829 226316 132629 112614 110611 89554
15913H9554n16O4290j6124p2239m1380P6076O8767q9550r6051J7733J06605L2477
$$ 89554 89038 153328 137204 64965 23585 99661 168428 78878 -17173 560 107165 139642
15901A39642k6087l3548n1077n7403P2211R7270OJ2680K5436J845M1769l2925
$$ 139642 113555 80007 28930 -28473 43738 141008 141014 153694 179130 180975 222744 189819
15889A89819k7729K9760o9728q0576K7699L7499j730L3974n7260p9057p6662Q3667
$$ 189819 162090 191850 122122 41546 69245 106744 105014 138988 81728 2671 -73991 9676
15877I676J00700L1955p1609p0704N2276J22485m3933o1281K3228j1653Q492M8636
$$ 9676 110376 142331 70722 18 52294 174779 130846 69565 92793 81140 89632 138268
15865A38268n6278q030K6427n5092j7119N9497J02691P030k443l0321N8690j7631
$$ 138268 81990 73960 100387 45295 28176 87673 190364 197394 194951 164630 223320 205689
15853B05689J4979R4427N4823j7867P5994l3578n0476m0456q3056j02766l7691
$$ 205689 220668 315095 369918 352051 428045 394467 343991 303535 220479 117713 80022
15842H0022J5820L7871R9350J7407n2011k6842j31811p760J16961P4242m3366
$$ 80022 95842 133713 233063 250470 198459 171617 39806 32046 149007 223249 179883
15831A79883o0759P3335M6020J440O1030n0018r2954o5583l1023J48040N6135
$$ 179883 119124 192459 238479 239919 300949 250931 157977 92394 61371 209411 265546
15820B65546j05938p8318r5338Q273N1053m555Q6439M3911o6595j69036j15862
$$ 265546 159608 81290 -14048 -5775 45278 40723 127162 171073 104478 -64558 -180420
15809a80420L9767J16601O1465L2488P7058K0384m724j0829q1307m2792J8739
$$ -180420 -140653 -24052 37413 69901 146959 167343 162619 151790 70483 27691 46430
15798D6430p9088K464L0654L1999K0087L419N9206l4294k5366L4322r0118r079
$$ 46430 -32658 -30194 460 32459 52546 55965 115171 80877 55511 89833 -285 -9364
15786i364k5290K783J12786J00028j290q3611J7927K8929mk9185q2690r858n0774
$$ -9364 -34654 -31871 80915 180943 179653 96042 113969 142898 142894 113709 31019 21161 -29613
15773b9613j04606P3883Q3461P4542O088j27172N0357M6492J7110l5099J762p756
$$ -29613 -134219 -60336 23125 97667 103755 -23417 26940 73432 90542 55443 57205 49449
15761D9449J9587k3840R273J8387m1822L2627N3878k1044L3619M1502j37575q6738
$$ 49449 69036 45196 54469 72856 31034 63661 117539 96495 130114 171616 34041 -52697
15749e2697Q2750J13253k888q2182n1712K3921O117N0912q7083m3821M5428K9275
$$ -52697 30053 143306 140418 58236 6524 30445 36562 87474 391 -43430 1998 31273
15737C1273j6797N1773p00O6603L0327n6849k0437N9250k95l3513M2328n9688
$$ 31273 14476 66249 65549 132152 162479 105630 85193 144443 144148 110635 152963 93275
15725I3275j35201O2033J44142O0220m1344l9619k8000k1768k0138J639J9879
$$ 93275 -41926 20107 164249 224469 183125 143506 115506 93738 73600 75239 95118
15714I5118m6453o2120P9912k7074n9715o662p9619l4155K9219J6966K6837N7569
$$ 95118 48665 -13455 66457 39383 -20332 -26994 -106613 -140768 -111549 -94583 -67746 -10177
15702a0177L1563n3052M253J01067K7214l5393k9484p5109o2344K8773o8660j1039
$$ -10177 21386 -31666 -27413 73654 100868 65475 35991 -39118 -101462 -72689 -141349 -152388
15690a52388O8244j9707R064L5339m0669J2230J03719M9656P7552L605j03768
$$ -152388 -84144 -103851 -94787 -59448 -100117 -87887 15832 65488 143040 146645 42877
15679D2877o3954l7539K4283l8296k7045j6789k5628M3225J02494N3178l9505
$$ 42877 -21077 -58616 -34333 -72629 -99674 -116463 -142091 -98866 3628 56806 17301
15668A7301j41954o3116j9001Q5321J05941O2543l2460J4659P995m6421J7618
$$ 17301 -124653 -187769 -206770 -121449 -15508 47035 14575 29234 37229 -9192 8426
15657H426K003l8934J8794M3359q537R4378m0948p3005K4261k2373J11460N3888
$$ 8426 10429 -28505 -9711 33648 25111 119489 78541 5536 29797 7424 118884 172772
15645A72772l2963m5292n7893m2009J23653K108p6367k6610l2132L4454R4889
$$ 172772 139809 94517 36624 -5385 118268 120376 44009 17399 -14733 19721 114610
15634A14610m8480K9300j2489M0019O5535l7418j32697L5267P7367n917K1470
$$ 114610 66130 95430 82941 122960 188495 151077 18380 53647 131014 125097 146567
15623A46567J8467k3221m1653K2025l0832j01613K2752M6543K6610p694K7335
$$ 146567 165034 141813 100160 122185 91353 -10260 12492 59035 85645 77951 105286
15612A05286j7867M6157j3335m1220p938M112J0937l0269n6282K5195L271m1687
$$ 105286 87419 133576 120241 79021 71083 75195 86132 55863 -419 24776 28047 -13640
15600a3640K8075L9441o6522L5465J8911k4054p7915J728Q1350j4044p5586k6192
$$ -13640 14435 53876 -12646 22819 41730 17676 -60239 -58511 22839 8795 -66791 -92983
15588i2983j444L6657K7759l8487k0096l3575P6835q6505k9409N2665J24608J963
$$ -92983 -94427 -57770 -30011 -68498 -88594 -122169 -45334 -131839 -161248 -108583 16025 17988
15576A7988j13531l6164L0397J8227J10676l032j20310K4169L9261L1558l9120
$$ 17988 -95543 -131707 -101310 -83083 27593 24561 -95749 -71580 -32319 -761 -39881
15565c9881O7998j03268L5052m3031k7031Q1260R7755K1459l8952j9976r0490
$$ -39881 28117 -75151 -40099 -83130 -110161 -28901 68854 90313 51361 31385 -59105
15554e9105j1726P5262N0817P403q9082o8110P0087j5609o530j1514L1434N4966
$$ -59105 -70831 4431 55248 62651 -26431 -94541 -24454 -40063 -46593 -58107 -26673 28293
15542B8293L6103k2932j5159l5444n0710j8742J01823J06636R0122j33849r8818
$$ 28293 64396 41464 26305 -9139 -59849 -78591 23232 129868 219990 86141 -12677
15531a2677J89L5848j30243K8274P2827K8442N1399j00379j16669J5648N6207
$$ -12677 -12488 23360 -106883 -78609 -5782 22660 74059 -26320 -142989 -127341 -71134
15520g1134P6752J6048m0669Q0203N8999m6253q3186o9067j3998K364n5449j2370
$$ -71134 5618 21666 -19003 61200 120199 73946 -9240 -78307 -92305 -89941 -145390 -157760
15508a57760L7700n8932P476P0113J1282K3506N4205K5794m066j7129M365R387
$$ -157760 -120060 -178992 -171516 -101403 -90121 -66615 -12410 13384 9318 -7811 -3446 5941
15496E941l6388J2594l4100n7999K1102J46468Q1211m3941j03482o1465l9377
$$ 5941 -30447 -17853 -51953 -109952 -88850 57618 138829 94888 -8594 -70059 -109436
15485a09436O8081K352k4679n6112n2556J2827L9761Q2837L3019Q884k7799k4080
$$ -109436 -41355 -39003 -63682 -119794 -172350 -159523 -119762 -36925 -3906 4978 -22821 -46901
15473d6901M0957L0119l3122j4665M220j0242k2937M1870K2214K0154l5559m5560
$$ -46901 -5944 24175 -8947 -23612 -19392 -29634 -52571 -10701 11513 31667 -3892 -49452
15461d9452J33357P3254m3291K8420J1084j09738l3384o1720l5068j195O1671
$$ -49452 83905 157159 113868 142288 153372 43634 10250 -51470 -86538 -87733 -26062
15450b6062J03626m943k2082o6071q7691M6789M487K729P6592N6648n0780q7084
$$ -26062 77564 72621 50539 -15532 -103223 -56434 -51947 -49218 27374 84022 33242 -53842
15438e3842L9119J51857k9158j38159n7202L4368M7688m9484j859Q2337k003o6475
$$ -53842 -14723 137134 107976 -30183 -87385 -53017 -5329 -54813 -56672 25665 23662 -42813
15426d2813J4207J7091k7866m5721L2483R2496L7609K2051m8286J2733J1536m3800
$$ -42813 -28606 -11515 -39381 -85102 -52619 39877 77486 99537 51251 63984 75520 31720
15414C1720r8530j3586J805m4616L2240l3706l3217J54355J19190j01473n2963
$$ 31720 -66810 -80396 -78591 -123207 -90967 -124673 -157890 -3535 115655 14182 -38781
15403c8781K3198p3327L9531J17653j2995j5276j8471J4710J2161l6607l2535
$$ -38781 -15583 -88910 -49379 68274 55279 40003 21532 36242 48403 11796 -20739
15392b0739r993l3920l088J2783Q7246k0126j626r3215k724O0575J46657K5090
$$ -20739 -30732 -64652 -67740 -54957 32289 12163 10537 -82678 -85402 -24827 121830 146920
15380A46920j15548m2933L5642J3783q6557L5963J4333q995O6296l732j8707j8782
$$ 146920 31372 -11561 24081 37864 -48693 -12730 1603 -7392 58904 55172 36465 17683
15368A7683k7758J381Q8882J06242k2939l9508m8604q437J7250j559k5864l8130
$$ 17683 -10075 -8694 80188 186430 163491 123983 75379 66942 84192 82633 56769 18639
15356A8639p1465P7402J9410l4920p204J8008L4163O9750J07336M352n0949j9242
$$ 18639 -52826 24576 43986 9066 1862 19870 54033 123783 231119 235471 184522 165280
15344A65280m6684o8111J6401O2378K9816j13062K4790Q6605r8712k9180m2750
$$ 165280 118596 50485 66886 129264 159080 46018 70808 157413 58701 29521 -13229
15333a3229k3869l0956N6831N9249P0116N0343r2332p9692J3728k3743l7743O141
$$ -13229 -37098 -68054 -11223 48026 118142 168485 76153 -3539 10189 -13554 -51297 -45156
15321d5156L2420o8765Q9362J36319r3614j3459p644q6374J6087Q2301K4815J4890
$$ -45156 -12736 -81501 7861 144180 50566 37107 29463 -56911 -40824 41477 66292 81182
15309H1182N0828L7389j1129k2536Q4307J6861j7439p4210o6048K7480J7230K8748
$$ 81182 132010 169399 158270 135734 220041 236902 219463 145253 79205 106685 123915 152663
15297A52663q5970j0662J16168P3327r5647m9068P881N6247J18952k2114j1548
$$ 152663 66693 56031 172199 245526 149879 100811 108692 164939 283891 261777 250229
15286B50229J869o915j3034J8740j8964j7370j4807O2053n8808k9494K8136M1762
$$ 250229 252098 245183 232149 250889 231925 214555 199748 261801 202993 173499 201635 243397
15274B43397O5228n1906j13113k1989R3244M1702M1954M6658l5168j08240m8651
$$ 243397 308625 256719 143606 121617 214861 256563 298517 345175 310007 201767 153116
15263A53116n0865K1343K8365O0477Q1649P7828j081q671j8959k9083m160j7781
$$ 153116 102251 123594 151959 212436 294085 371913 370832 362161 343202 314119 309959 292178
15251B92178O3136J02347M1759k1747m3974q0354O5743N1362P1731P2275R5144
$$ 292178 355314 457661 499420 477673 433699 353345 419088 470450 542181 614456 709600
15240G09600M8056n9304P8938P6139o8022m7199Q91P6335Q7745J0388k2983K5598
$$ 709600 757656 698352 777290 853429 785407 738208 739099 815434 903179 913567 890584 916182
15228I16182J22077M8988l0586j09965R6515R4351O804n868J8473K8997j3158
$$ 916182 1038259 1087247 1056661 946696 1043211 1137562 1144366 1138498 1156971 1185968 1172810
15217A172810m4705P6494P2847M6313Q3369Q5400J02023K7075l0528n0997p1223
$$ 1172810 1128105 1204599 1277446 1323759 1407128 1492528 1594551 1621626 1591098 1540101 1468878
15206A468878O2052P0914j10907j46891p9594N1115J2744m9968N232M7133o5657
$$ 1468878 1530930 1601844 1490937 1344046 1264452 1315567 1328311 1278343 1283575 1330708 1265051
15195A265051p9415p7757j3036m5880J8785j2429n0048q9551q0138K7093o265
$$ 1265051 1185636 1107879 1094843 1048963 1067748 1055319 1005271 915720 835582 862675 856410
15184H56410J0893l6932j9122J08174O15o8487q1759o829q3322K8513r4565j50103
$$ 856410 867303 830371 811249 919423 920038 851551 769792 762963 679641 708154 613589 463486
15172D63486L9702n387M021j1040K7025L4398m1198l0745O7462M8121o7669n6902
$$ 463486 503188 497801 501822 490782 517807 552205 511007 480262 547724 595845 528176 471274
15160D71274M6345k2067o0954M3705j2373r3485n4571m3560m6659j1427N3147
$$ 471274 517619 495552 434598 478303 465930 372445 317874 274314 227655 216228 269375
15149B69375K2045k6290j02464P064N7813K5763j7758k5372M437n8437k1568P8047
$$ 269375 291420 265130 162666 169730 227543 253306 235548 210176 214613 156176 134608 212655
15137B12655L650o5694L857r392j7289L8731l1015j01431k9000J9578P7431P6490
$$ 212655 216305 150611 154468 145076 127787 166518 135503 34072 5072 24650 102081 178571
15125A78571O0183J56185R8134j33020j58274j31603j29488K7308J17040J13338
$$ 178571 238754 394939 493073 360053 201779 70176 -59312 -32004 85036 198374
15115A98374L6709p019J5142J5651o2087l6919p1946p1667J7774P6012k3883n0132
$$ 198374 235083 228064 243206 258857 196770 159851 87905 16238 34012 110024 86141 36009
15103C6009l0223j3094l9316K1785N2802J16842l0031j5085L7593J07790k4285
$$ 36009 5786 -7308 -46624 -24839 27963 144805 114774 99689 137282 245072 220787
15092B20787k9223Q0496o3403j50463o6036q1864Q1911M6219K2987O3537l4561
$$ 220787 191564 272060 208657 58194 -7842 -89706 -7795 38424 61411 124948 90387
15081I0387L277o7291k0087K0956P3853q1612r5546m3925j1040L9948J71330M9261
$$ 90387 93664 26373 6286 27242 101095 19483 -76063 -119988 -131028 -91080 80250 129511
15069A29511p5582j04455p2096k3287j8562K005m5765Q6113O3438L7249L4059
$$ 129511 53929 -50526 -122622 -145909 -164471 -162466 -208231 -122118 -58680 -21431 12628
15058A2628O8680L9213k781o7472L672j06937o402O4779r3456r9225l4001K6382
$$ 12628 81308 120521 117740 50268 53940 -52997 -59399 5380 -88076 -187301 -221302 -194920
15046a94920R1917R2208m9423k7947K8899O20r9498p6084R8764M3916K9404N396
$$ -194920 -103003 -10795 -60218 -88165 -59266 -58646 -158144 -234228 -135464 -91548 -62144 -56748
15034e6748r5258n194K6744J9434O9796J37331j0295O7018j5416j23149K1331
$$ -56748 -152006 -157200 -130456 -111022 -41226 96105 85810 152828 137412 14263 35594
15023C5594L9854O0448j8707p8338j3459k0773j6917O349j1663m7271O3349q54
$$ 35594 75448 135896 117189 38851 25392 4619 -12298 -5949 -17612 -64883 -1534 -2388
15011b388L9152k4410p7947J0474J8445n7307l2035P0617O3560L7184l9710j1963
$$ -2388 36764 12354 -65593 -55119 -36674 -93981 -126016 -55399 8161 45345 5635 -6328
14999f328r774L3686N5861m2759q6485j1803m0897O1116Q926j24663k0457P782
$$ -6328 -16102 17584 73445 30686 -55799 -67602 -108499 -47383 -38457 -163120 -183577 -175795
14987a75795J04867J00797K5184n6350m8399M5017P251n2788j886j1006M0150
$$ -175795 -70928 29869 55053 -1297 -49696 -4679 2572 -50216 -52102 -63108 -22958
14976b2958K937L8465O3926k4281K346l868q7570q8821j3586Q7126j697j30263
$$ -22958 -20021 18444 82370 58089 60435 56567 -31003 -119824 -133410 -46284 -47981 -178244
14964a78244l8332J63804L9266n1506j5924J05373Q0912q1593k9165m6471k1054
$$ -178244 -216576 -52772 -13506 -65012 -80936 24437 105349 23756 -5409 -51880 -72934
14953g2934L6958M1527K1787n4951j45375n1140N8675J48037J11191m9519J1536
$$ -72934 -35976 5551 27338 -27613 -172988 -224128 -165453 -17416 93775 44256 55792
14942E5792k2799m2447L2472J9774K9157l8524l9006j1592o5061o6921j6225O1570
$$ 55792 32993 -9454 23018 42792 71949 33425 -5581 -17173 -82234 -149155 -165380 -103810
14930a03810j5076n2568N4738P6749O7180M4861j5920p8327j5530j3871N5833
$$ -103810 -118886 -171454 -116716 -39967 27213 72074 56154 -22173 -37703 -51574 4259
14919D259K5827O1107K926o5142n5275M6369o8736n4784J47535J10880j8011j39425
$$ 4259 30086 91193 94119 28977 -26298 20071 -48665 -103449 44086 154966 136955 -2470
14907b470p8733L2740P7061J4997q3510l7553N2148M3856J13904J6923r2781r658
$$ -2470 -81203 -48463 28598 43595 -39915 -77468 -25320 18536 132440 149363 56582 46924
14895D6924N9347o0223o9297L2328q2484j32471J01157R8362J9679P4809K004
$$ 46924 106271 46048 -23249 9079 -73405 -205876 -104719 -6357 13322 88131 90135
14884I0135p3784m2146l4387k3351j28648Q2306J36014K5123j08709L3918L4840
$$ 90135 16351 -25795 -60182 -83533 -212181 -129875 6139 31262 -77447 -43529 -8689
14873h689l2945n2383r1630o5633n8005P4619O3136N5897L8281k5275j21638l6528
$$ -8689 -41634 -94017 -185647 -251280 -309285 -234666 -171530 -115633 -77352 -102627 -224265 -260793
14861b60793R820N5436k8444m0840O1017J34574Q8081k3298k3113j02033l4445
$$ -260793 -250973 -195537 -223981 -264821 -203804 -69230 18851 -4447 -27560 -129593 -164038
14850a64038J17670r910j8919K8241N6282k256j15278p9197J9755Q7133J3771
$$ -164038 -46368 -56278 -75197 -46956 9326 7070 -108208 -187405 -167650 -80517 -66746
14839f6746k4481j0584m4589p1218L3199J22448K8087m0232k4639j13013m3564
$$ -66746 -91227 -101811 -146400 -217618 -184419 -61971 -33884 -74116 -98755 -211768 -255332
14828b55332J18748N5509k5023m4375r2070k1704N426N0763K3940J172k6212o835
$$ -255332 -136584 -81075 -106098 -150473 -242543 -264247 -258821 -208058 -184118 -182946 -209158 -215993
14816b15993N2004O0842O7355j00886k3322Q275K0801L2010L8778k0347k8316
$$ -215993 -163989 -103147 -35792 -136678 -160000 -151725 -130924 -98914 -60136 -80483 -108799
14805a08799J08728O5581j3471q4909n833M3875R791p9716r7486k4523j598O1598
$$ -108799 -71 65510 52039 -32870 -38703 5172 14963 -64753 -162239 -186762 -188360 -126762
14793a26762K9032k8350J607j00731M1424J19245m2252l4722N0585L9127Q9723
$$ -126762 -97730 -126080 -124473 -225204 -183780 -64535 -106787 -141509 -90924 -51797 37926
14782C7926n6225j09949m2237j3005J6143j3113p542Q2417k1029n2748N7688Q4448
$$ 37926 -18299 -128248 -170485 -183490 -167347 -180460 -188002 -105585 -126614 -179362 -121674 -37226
14770c7226N0106n9741k5990P8695P6913L193l4714l3663l078J5838j4695m9839
$$ -37226 12880 -46861 -72851 5844 82757 85950 51236 17573 14495 30333 15638 -34201
14758c4201l9862k8511N470Q4421k2640L2809M5514j7328R4865L9228k8222k9256
$$ -34201 -74063 -102574 -97104 -12683 -35323 -2514 43000 25672 120537 159765 131543 102287
14746A02287m1442p3445n56Q2428j7069j08866L8130n6340m8242N3625J87327
$$ 102287 60845 -12600 -13156 69272 52203 -56663 -18533 -74873 -123115 -69490 117837
14735A17837l2374j27021q7791k9925Q910j2379m0598O4321J0448J5286K1440
$$ 117837 85463 -41558 -129349 -159274 -150364 -162743 -203341 -139020 -128572 -113286 -91846
14724i1846o0250p5628o9189j9332P8123P5209M6118n6473O2787K3031j1483J4178
$$ -91846 -152096 -227724 -296913 -316245 -238122 -162913 -116795 -173268 -110481 -87450 -98933 -84755
14712h4755n0259m2292P4146N6549j9943l5240O5517L6002k3431j13261k01160
$$ -84755 -135014 -177306 -103160 -46611 -66554 -101794 -36277 -275 -23706 -136967 -338127
14701c38127l4220J81968J82344J6405j32440K4431k3090P8848N391J6701j9855
$$ -338127 -372347 -190379 -8035 8370 -124070 -99639 -122729 -43881 -38490 -21789 -41644
14690d1644Q397J7126k9264Q2425M9916q4733j40512m6784N8475M7095L055J1451
$$ -41644 -33247 -16121 -45385 37040 86956 2223 -138289 -185073 -126598 -79503 -76448 -64997
14678f4997K3209K5990j08090j38166p6884J8500N4358Q8848K616q4111K2454
$$ -64997 -41788 -15798 -123888 -262054 -338938 -320438 -266080 -177232 -174616 -258727 -236273
14667b36273K4395J8786j3699j1157J3547k7796l3570K6108O2667L4032Q2299
$$ -236273 -211878 -193092 -206791 -217948 -204401 -232197 -265767 -239659 -176992 -142960 -60661
14656f0661O957p6261L1997Q3047q6298n4759J02667J01086o5980j25298K4269
$$ -60661 -53704 -129965 -97968 -14921 -101219 -155978 -53311 47775 -18205 -143503 -119234
14645a19234P1675R549K493j23550L144R5709K306k4472k1260m6684J7069M6415
$$ -119234 -47559 -38010 -35517 -159067 -155923 -60214 -57908 -82380 -103640 -150324 -133255 -86840
14633h6840J19092R9987P2876l6121o0689o5519j01698M3362M4023m594m968k0055
$$ -86840 32252 132239 205115 168994 108305 42786 -58912 -15550 28473 23879 18911 -1144
14621a144k6670N766o1933n1727L1303k8871k6874J6393k3423k8150R3835K0810
$$ -1144 -27814 -22048 -83981 -135708 -104405 -133276 -160150 -143757 -167180 -195330 -101495 -80685
14609h0685m5282M8980N1533j5371N8185o843k1852q7982K0041k4059K1815k985
$$ -80685 -125967 -76987 -25454 -40825 17360 10517 -11335 -99317 -79276 -103335 -81520 -84505
14597h4505R85J8999J1239L0478K3583k9267m6762o3886j242p3203L7368R5396
$$ -84505 -83520 -64521 -53282 -22804 779 -28488 -75250 -139136 -140378 -213581 -176213 -80817
14585h0817N7312n1962j09144Q5827N5425q3751l6543j34m801j2631j5280L5889
$$ -80817 -23505 -75467 -184611 -98784 -43359 -127110 -163653 -163787 -168588 -181219 -196499 -160610
14573a60610L7713q946r2583l883M8190l5688N9538o8471N2135J30721P8210n3556
$$ -160610 -122897 -131843 -224426 -228309 -180119 -215807 -156269 -224740 -172605 -41884 36326 -17230
14561a7230j14614o0009j6799O1332J2740m555N3863L2846k3557o6111q5916J22787
$$ -17230 -131844 -191853 -208652 -147320 -134580 -139135 -85272 -52426 -75983 -142094 -228010 -105223
14549a05223R4099O8644M2139L919r1054q6038l3022k5042k9568m2255j0231Q5119
$$ -105223 -11124 57520 99659 103578 12524 -73514 -106536 -131578 -161146 -203401 -213632 -128513
14537a28513K7293q869j20649Q2466J622Q8424Q577l0672k0603n4631m0191J7440
$$ -128513 -101220 -110089 -230738 -148272 -146650 -58226 -49649 -80321 -100924 -155555 -195746 -178306
14525a78306J4194j4941k0030m9313j8423N8144M0001L8949l3681l9391L2618
$$ -178306 -164112 -179053 -199083 -248396 -266819 -208675 -168674 -129725 -163406 -202797 -170179
14514a70179Q1361j021l578J9958K9358K7260L8186o6235l4140L8664j1329L2740
$$ -170179 -88818 -89839 -93417 -73459 -44101 -16841 21345 -44890 -79030 -40366 -51695 -18955
14502a8955q473K6683o2928o0728N0271M1048P490m9341o1578l0393N7462O2796
$$ -18955 -27428 -745 -63673 -124401 -74130 -33082 -25592 -74933 -136511 -166904 -109442 -46646
14490d6646L3075J4528K2657j7165j36000j09277j3869K6770J6728N9224O2843
$$ -46646 -13571 957 23614 6449 -129551 -238828 -252697 -225927 -209199 -149975 -87132
14479h7132q759J18539K8844J6101p6962p503J0515p1450n9025N9877O5399l6798
$$ -87132 -95891 22648 51492 67593 -9369 -16872 -6357 -77807 -136832 -76955 -11556 -48354
14467d8354M3214l4858l5191O1846K9137n9466j20110J4101R0010q259J2214r866
$$ -48354 -5140 -39998 -75189 -13343 15794 -43672 -163782 -149681 -59671 -67930 -55716 -65582
14455f5582N3672m3491M6480L9705K2420q1269l1668Q6346m0541r4088L207P5523
$$ -65582 -11910 -55401 -8921 30784 53204 -28065 -59733 26613 -13928 -108016 -104809 -29286
14443b9286k840m9510Q883n5364l913K4600N6757P8018m0442j16255J8997K4919
$$ -29286 -32126 -81636 -72753 -128117 -132030 -107430 -50673 27345 -13097 -129352 -110355 -85436
14431h5436j7245J04751K8515K7475j9333n3879k9941J642J7821j4900o9374J4048
$$ -85436 -102681 2070 30585 58060 38727 -15152 -45093 -43451 -25630 -40530 -109904 -95856
14419i5856M8549m8733m7821L1593K7411J39425l4650j25117j1769j4867k0662
$$ -95856 -47307 -96040 -143861 -112268 -84857 54568 19918 -105199 -116968 -131835 -152497
14408a52497o2741j8194j2193O2488J1021l5450l6642J7602N6955l459L4250m8504
$$ -152497 -215238 -233432 -245625 -183137 -172116 -207566 -244208 -226606 -169651 -173110 -138860 -187364
14396a87364M26J10859l4367k8377Q4373O7324k0001m2952n4437k0532N5036M2953
$$ -187364 -186938 -76079 -110446 -138823 -54450 12874 -7127 -50079 -104516 -125048 -70012 -27059
14384b7059n0357p5342R2846K3866l6166r9091j9121J820J6466J3628k4960N023
$$ -27059 -77416 -152758 -59912 -36046 -72212 -171303 -190424 -188604 -172138 -158510 -183470 -178447
14372a78447P9093j0734m3042r87j0653J46340K4456j28673j2533J0171K6391
$$ -178447 -99354 -110088 -153130 -154117 -164770 -18430 6026 -122647 -135180 -125009 -98618
14361i8618J9741L5480n0721k9256p3865Q0148P1336j2314l7185m7958k5969k371
$$ -98618 -78877 -43397 -94118 -123374 -197239 -117091 -45755 -58069 -95254 -143212 -169181 -171552
14349a71552j6141j3782l0588j9350M6487n1577O9243L2118N7004K1821r587m4915
$$ -171552 -187693 -201475 -232063 -251413 -204926 -256503 -187260 -155142 -98138 -76317 -85904 -130819
14337a30819O303q5138M1038R1064J0940O1278Q6134l5097j3009L1383l8114p6525
$$ -130819 -124516 -209654 -168616 -77552 -66612 -5334 80800 45703 32694 64077 25963 -50562
14325e0562M781Q2420l7406p1998N898o510o1184k936M2448J7439l6108k4725
$$ -50562 -45781 36639 -767 -72765 -66867 -73377 -134561 -137497 -95049 -77610 -113718 -138443
14313a38443k9896l4128K5154p3246N7905M2177J6261o2427l1468j25265M363
$$ -138443 -168339 -202467 -177313 -250559 -192654 -150477 -134216 -196643 -228111 -353376 -349013
14302c49013J73774L7558N893M1934Q5339M1711o5910j40758m5613M7105K6652
$$ -349013 -175239 -137681 -131788 -89854 -4515 37196 -28714 -169472 -215085 -167980 -141328
14291a41328p0370l9270R8908J72770o4630l7001M64L9773L2930m5705j07499
$$ -141328 -211698 -250968 -152060 20710 -43920 -80921 -80457 -40684 -7754 -53459 -160958
14280a60958k7592R651m4128J6251J10719j5109R274R054Q0830O8182o0638k038
$$ -160958 -188550 -178899 -223027 -206776 -96057 -111166 -101892 -92838 -12008 56174 -4464 -6502
14268f502K1474P8008n7554k0247m3919r2372m5015K7184l8419j1592p670K9896
$$ -6502 14972 92980 35426 15179 -28740 -121112 -166127 -138943 -177362 -188954 -196624 -166728
14256a66728M7612r397k5573J8949L1611P6234m137m8685M8122N4606K8358l1095
$$ -166728 -119116 -128513 -154086 -135137 -103526 -27292 -31429 -80114 -31992 22614 50972 19877
14244A9877r7112q0202o7596K7870L5611J08076j0700J4133L7550N3737m4233
$$ 19877 -77235 -157437 -225033 -197163 -161552 -53476 -64176 -50043 -12493 41244 -2989
14233b989p334r8495k8655o807j2439k8051Q36k2587J0012q505N0789J24305R7612
$$ -2989 -10323 -108818 -137473 -144280 -156719 -184770 -183934 -206521 -196509 -205014 -154225 -29920 67692
14220F7692K3596j17494j58518k130j4899n7298l8460J0461L7509o4336n8602
$$ 67692 91288 -26206 -184724 -186854 -201753 -259051 -297511 -287050 -249541 -313877 -372479
14209c72479P1818Q2458K5028l6601o686k9890P3750O0963m6861j2185J33260
$$ -372479 -300661 -218203 -193175 -229776 -236462 -266352 -192602 -131639 -178500 -190685 -57425
14198e7425O8281p1755p9171J00085N0103O6860K2396k4598l1592k0159j27583
$$ -57425 10856 -60899 -140070 -39985 10118 76978 99374 74776 43184 23025 -104558
14187a04558l4403J0922J6981j8142K0597k9976P5489k921k3160m963J2970k5268
$$ -104558 -138961 -128039 -111058 -129200 -108603 -138579 -63090 -66011 -89171 -94134 -81164 -106432
14175a06432n4568R950P9622L0053l5810k8908K2684k6824L277j47713q5682J15831
$$ -106432 -161000 -151050 -71428 -41375 -77185 -106093 -83409 -110233 -106956 -254669 -340351 -224520
14163b24520J73710M1039l7029l8733J7995L1526K02l1906m011q4659j2745O2793
$$ -224520 -50810 -9771 -46800 -85533 -67538 -36012 -35810 -67716 -71727 -156386 -169131 -106338
14151a06338L7381L4565l2571n0309Q2066n7060q510P2139m9p7988r9889K2357
$$ -106338 -68957 -34392 -66963 -117272 -35206 -92266 -100776 -28637 -28686 -106674 -206563 -184206
14139a84206J810j5615L081N0930J8513k9829O9036l4796j06460R364J02258n536
$$ -184206 -182396 -198011 -194930 -144000 -125487 -155316 -86280 -121076 -227536 -218172 -115914 -121450
14127a21450l5564o7005r580N3868k43O6585O5978l4690K9649m0453o9178K4289
$$ -121450 -157014 -224019 -233599 -179731 -179974 -113389 -47411 -82101 -52452 -92905 -162083 -137794
14115a37794K8986l436J4273L5079Q0322L3723m3428j64064q6850P9103Q9393
$$ -137794 -108808 -112244 -97971 -62892 17430 51153 7725 -156339 -243189 -164086 -74693
14104g4693R4251N2020k1085k2203n9619p4615K0199o8521m2565j2046Q9569M6983
$$ -74693 19558 71578 50493 28290 -31329 -105944 -85745 -154266 -196831 -208877 -119308 -72325
14092g2325P0416N8119l9778j221N4379p2562l2426L4027n3900m0225K9897K4250
$$ -72325 -1909 56210 16432 15211 69590 -2972 -35398 -1371 -55271 -95496 -65599 -41349
14080d1349j01053j7967j0534K2890M9088l9173m9170J7674Q2071L5333L6961
$$ -41349 -142402 -160369 -170903 -148013 -98925 -138098 -187268 -169594 -87523 -52190 -15229
14069a5229k6125l9497j05662m427J17263p0590j2303R4930m878m0125j16937
$$ -15229 -41354 -80851 -186513 -190940 -73677 -144267 -156570 -61640 -66518 -106643 -223580
14058b23580N4993O7974L7411l3074l2589p5257J09061R4777N9329K172M7690
$$ -223580 -168587 -100613 -63202 -96276 -128865 -204122 -95061 -284 59045 61217 108907
14047A08907P882n5385M2767l0561j09667p051J1810l271K7767m2119p8655o3179
$$ 108907 116789 61404 104171 73610 -36057 -43108 -31298 -34569 -6802 -48921 -127576 -190755
14035a90755P5289J17648N8182p7788k1765r0828k4228N1307j802J718J5740Q1097
$$ -190755 -115466 2182 60364 -17424 -39189 -130017 -154245 -102938 -104740 -103022 -87282 -6185
14023f185K8293n9236o9896J1458K4115R604m3431M9565L6643l647n0898L3743
$$ -6185 22108 -37128 -107024 -95566 -71451 -61847 -105278 -55713 -19070 -22717 -73615 -39872
14011c9872k504n130p1195j19550J0428M6607M0051N8293J06326M0363L230k3106
$$ -39872 -42376 -47506 -118701 -238251 -227823 -181216 -141165 -82872 23454 63817 67047 43941
13999D3941K7908j02525j79661m3733L4826J01556L7868j7731r408l2327m8225
$$ 43941 71849 -30676 -210337 -254070 -219244 -117688 -79820 -97551 -106959 -139286 -187511
13988a87511K7854j4496o4716j83Q0964K7138l2766P2226O7959n7746P3711Q1326
$$ -187511 -159657 -174153 -238869 -239052 -158088 -130950 -163716 -91490 -23531 -81277 -7566 73760
13976G3760n5048l0901m633L9684j2368L0630m4733p5672N0041O9981P3630K3121
$$ 73760 18712 -12189 -16822 22862 10494 41124 -3609 -79281 -29240 40741 114371 137492
13964A37492k8773R145J526k3469k6333j00740k4401m2352M9581L56N3280l4997
$$ 137492 108719 117864 119390 95921 69588 -31152 -55553 -97905 -48324 -47968 5312 -29685
13952b9685p0429L3894m9152k7366o0618j459L0378P3709l907K5246N8304l4412
$$ -29685 -100114 -66220 -115372 -142738 -203356 -204815 -174437 -100728 -104635 -79389 -21085 -55497
13940e5497m2280k2444J3450m3995J20265Q766l2835N6495J422q4076J8771K478
$$ -55497 -97777 -120221 -106771 -150766 -30501 -21735 -54570 1925 3347 -80729 -61958 -59480
13928e9480K2385N0930n9197q7229l6493J2245K6866k593k6343M153P0547L5977
$$ -59480 -37095 13835 -45362 -132591 -169084 -156839 -129973 -132566 -158909 -154756 -84209 -48232
13916d8232K6549Q821l707q2718N0422Q83M6134J0593l2913N437L2033j22823
$$ -48232 -21683 -12862 -16569 -99287 -48865 -47982 -1848 8745 -24168 -18731 13302 -109521
13904a09521l9122Q7785O4210N5157j1898n8876k5221J08420J11980n4644r4692
$$ -109521 -148643 -60858 3352 58509 46611 -12265 -37486 70934 182914 128270 33578
13893C3578m4650R087J355j3005k3508K1742n5187l7141J5693k4321k7113Q841
$$ 33578 -11072 -1985 -630 -13635 -37143 -15401 -70588 -107729 -92036 -116357 -143470 -134629
13881a34629N4546K4180N256M487J1913L4318K8776o108L1881j3137J4105P716
$$ -134629 -80083 -55903 -50647 -46160 -34247 71 28847 22739 54620 41483 55588 63304
13869F3304M3779k3523j44823p4811m8607O1779K0515n9611n215K9512K8637L131
$$ 63304 107083 83560 -61263 -136074 -184681 -122902 -102387 -161998 -167213 -137701 -109064 -105933
13857a05933n1568J8409J8058m7380l8479q507l538J404N5074Q4570O7925r166
$$ -105933 -157501 -139092 -121034 -168414 -206893 -215400 -218938 -217534 -162460 -77890 -9965 -19131
13845a9131o9603M1748P1410N4919K2485m7104j33316p6593M4364k381N0467m0113
$$ -19131 -88734 -46986 24424 79343 101828 54724 -78592 -155185 -110821 -113202 -62735 -102848
13833a02848o0066M7940Q1641q244p3634L989P2343L0818J1459L3161l3943r5047
$$ -102848 -162914 -114974 -33333 -41577 -115211 -111222 -38879 -8061 3398 36559 2616 -92431
13821i2431k3576O010j0467Q60K4051R8702P51o2279k4550M2084q322o3981K0275
$$ -92431 -116007 -109997 -120464 -119604 -95553 3149 3900 -58379 -82929 -40845 -49167 -113148 -92873
13808i2873J04687o5927p5793K2739M2615L87o1999M0874m7807m2230Q4698J06794
$$ -92873 11814 -54113 -129906 -107167 -64552 -64165 -126164 -85290 -133097 -175327 -90629 16165
13796A6165J339k9584L3483O0192j3365j90195k4153k0064r4J66124K6391n4330
$$ 16165 17504 -12080 21403 81595 68230 -121965 -146118 -166182 -166276 -152 26239 -28091
13784b8091l6850n2620j6000J48427J2118q1457Q3984Q0222j33001k0863L1429
$$ -28091 -64941 -117561 -133561 14866 26984 -54473 29511 109733 -23268 -44131 -12702
13773a2702l2942n4793J08744Q8717n7377o3101L2897o2730n2285J0565J4916
$$ -12702 -45644 -100437 8307 97024 39647 -23454 9443 -53287 -105572 -95007 -80091
13762h0091J1045R5918m688o6236L455J3748N3689J47649J9609J298o845J9655
$$ -80091 -69046 26872 22184 -44052 -40597 -26849 26840 174489 194098 195396 188551 208206
13750B08206j29731j07641m3460q552l2570p4501n6280J6301J41910M5041k2520
$$ 208206 78475 -29166 -72626 -81178 -113748 -188249 -244529 -228228 -86318 -41277 -63797
13739f3797M494p4069K4071K5773o4798p0967J2671J332P8407j811j2303P8532
$$ -63797 -59303 -133372 -109301 -83528 -148326 -219293 -206622 -205290 -126883 -128694 -140997 -62465
13727f2465M5561j6544j9436k4821q4493r6795j5944J03452O1966P2046O9858
$$ -62465 -16904 -33448 -52884 -77705 -162198 -258993 -274937 -171485 -109519 -37473 32385
13716C2385K4079n2316K9743J3733p3942l7289l0146J1832M0670l1993M0253P0558
$$ 32385 56464 4148 33891 47624 -26318 -63607 -93753 -81921 -41251 -73244 -32991 37567
13704C7567R9772j16181j58288o9790J65148j3436K7690J5141j0768j2854R569
$$ 37567 137339 21158 -137130 -206920 -41772 -55208 -27518 -12377 -23145 -35999 -26430
13693b6430Q834N522L3249L7878j46862n8173l5887P672Q5297l8824n612j3586
$$ -26430 -17596 -12074 21175 59053 -87809 -145982 -181869 -174197 -88900 -127724 -133336 -146922
13681a46922o2803p315J22539R9608L9181o364r4054k8119J3319K9619o3384m1387
$$ -146922 -209725 -217040 -94501 5107 44288 37924 -56130 -84249 -70930 -41311 -104695 -146082
13669a46082q5059p5163O3709M8914J4702N2579P319r757J3753J627L8990N2429
$$ -146082 -231141 -306304 -242595 -193681 -178979 -126400 -119081 -128838 -115085 -113458 -74468 -22039
13657b2039J5667P7710M2559m7710k5710p2488n5386j1449n7178J19872M5200
$$ -22039 -6372 71338 113897 66187 40477 -32011 -87397 -98846 -156024 -36152 9048
13646I048m7091j6680k3797l1126K15J9915M9089k4511n6314N6617J29518j4158
$$ 9048 -38043 -54723 -78520 -109646 -109431 -89516 -40427 -64938 -121252 -64635 64883 50725
13634E0725o6848L2332J07718n6645k5289P2400r7057r2526M9686L5985Q989P606
$$ 50725 -16123 16209 123927 67282 41993 114393 17336 -75190 -25504 10481 19470 27076
13622B7076l271o182P3923m3834j01521p0568m3251J9745j8687O4049N2788N3151
$$ 27076 23805 17623 91546 47712 -53809 -124377 -167628 -147883 -166570 -102521 -49733 3418
13610C418J03846l8912o2267N5631M3795j19507j37437m5838P390J07073J41171
$$ 3418 107264 68352 6085 61716 105511 -13996 -151433 -197271 -189881 -82808 58363
13599E8363n4010j00974O0730P2171o6435j49127K079N3450R6137k1257n4289
$$ 58363 4353 -96621 -35891 36280 -30155 -179282 -177203 -123753 -27616 -48873 -103162
13588a03162O0541J8227l9946k7382Q5187j228j17471K4709R2258J12529q672
$$ -103162 -42621 -24394 -64340 -91722 -6535 -7763 -125234 -100525 -8267 104262 95590
13577I5590p2795r334m927k4454K0782R8033Q8314l6448r9950l999L6409l0834
$$ 95590 22795 13461 8534 -15920 4862 102895 191209 154761 54811 50812 87221 56387
13565E6387o0681k8317O5048m0800J8694k3964q136N5627J2545k8532l6700o8612
$$ 56387 -4294 -32611 32437 -8363 10331 -13633 -21769 33858 46403 17871 -18829 -87441
13553h7441P2403J95373p3502j7715o7592m6201J26316K2244n4668j0284O2394
$$ -87441 -15038 180335 106833 89118 21526 -24675 101641 123885 69217 58933 121327
13542A21327M454k9106j9323n4466n6461K6241K6462L8192P7204m378m276p673
$$ 121327 125781 96675 77352 22886 -33575 -7334 19128 57320 134524 130146 125870 118197
13530A18197q0530j3212R676K0794N8074Q7124K405k4083N5289M0606k3530q031
$$ 118197 37667 24455 34131 54925 112999 200123 202528 178445 233734 274340 250810 242779
13518B42779j05923o6194L0371K4271M762J7042R4043J2005j21378L3296q55k9107
$$ 242779 136856 70662 101033 125304 130066 147108 241151 253156 131778 165074 164219 135112
13506A35112J0205M4851k8041K8481m6469O568N4503M9857j3053r8194M1428M6087
$$ 135112 145317 190168 162127 190608 144139 150707 205210 255067 242014 143820 185248 231335
13494B31335n1632m9673J0696m6446q7669q3459J6610R5802k0293O5602M0942
$$ 231335 179703 130030 140726 94280 6611 -76848 -60238 35564 15271 80873 121815
13483A21815L1051M0718l2889J6924o6473n0383m5748n797l5503k5171Q6974O2341
$$ 121815 152866 193584 160695 177619 111146 60763 15015 9218 -26285 -51456 35518 97859
13471I7859J1753q939J5549J5058j25505l0061m6338N1778O4751L7970L2983j7472
$$ 97859 109612 100673 116222 131280 5775 -24286 -70624 -18846 45905 83875 116858 99386
13459I9386q2129R691J4848m8918m4311N6607J6880O0692Q3138K983j4128o691
$$ 99386 17257 26948 41796 -7122 -51433 5174 22054 82746 165884 168867 154739 148048
13447A48048l7991j803l1079o804Q455l5591n0785l2287M3346o593M3400O398
$$ 148048 110057 108254 77175 70371 78826 43235 -7550 -39837 3509 -3084 40316 46714
13435D6714q366R9500j0517r5462K797o07N9094K4776J9549l1272r9352p2905
$$ 46714 38348 137848 127331 31869 34666 34059 93153 117929 137478 106206 6854 -66051
13423f6051o2518l5915k6655l532O9351J13481J04144m369l9400o7758o5862O4054
$$ -66051 -128569 -164484 -191139 -194671 -125320 -11839 92305 87936 48536 -19222 -85084 -21030
13411b1030N4401j8603p3465l8134J21625Q9364j1748J9227k5793M2647j36147
$$ -21030 33371 14768 -58697 -96831 24794 114158 102410 121637 95844 138491 2344
13400B344r0553J61371N4604m4193j23164j32237M1240J16930k7194m7075K7859
$$ 2344 -88209 73162 127766 83573 -39591 -171828 -130588 -13658 -40852 -87927 -60068
13389f0068j1462L3317R3632K8814n761j56114n0496l6049Q280N2799P0474N5559
$$ -60068 -71530 -38213 55419 84233 78472 -77642 -128138 -164187 -155907 -103108 -32634 22925
13377B2925O657q7087o2696p7646L4840N7884j0875M455P2824J007l1538N7132
$$ 22925 29582 -57505 -120201 -197847 -163007 -105123 -115998 -111543 -38719 -37712 -69250 -12118
13365a2118L604j07870q9154L3817q926L0701J317J46767l6480j8423J528K3060
$$ -12118 -8514 -116384 -205538 -171721 -180647 -149946 -148629 -1862 -38342 -56765 -55237 -32177
13353c2177J9920m496p6794O0583N4995n8379P53N9323K9477k5419l0894q7430
$$ -32177 -12257 -16753 -93547 -32964 22031 -36348 -35595 23728 53205 27786 -3108 -90538
13341i0538j9295P3700N4056o9296Q849O6653l0098J6323j821M0155Q5633p2434
$$ -90538 -109833 -36133 17923 -51373 -42524 24129 -5969 10354 8533 48688 134321 61887
13329F1887r4147P1859k571m7428P678L4822m8837l8667j9208J1138j2020O3117
$$ 61887 -32260 39599 37028 -10400 -2722 32100 -16737 -55404 -74612 -63474 -75494 -12377
13317a2377m946j08343q2054O5666J09357J4176j32875J4683K7326k3637L6246
$$ -12377 -17323 -125666 -207720 -142054 -32697 -18521 -151396 -136713 -109387 -133024 -96778
13306i6778N0854m8222q7910J4078J1867m5623k4476k3080M4063K2215k2150k4209
$$ -96778 -45924 -94146 -182056 -167978 -156111 -201734 -226210 -249290 -205227 -183012 -205162 -229371
13294b29371K714J1173N7077N4612j712P8463J32777j4275m8255j2041o2695J7535
$$ -229371 -226657 -215484 -158407 -103795 -105507 -27044 105733 91458 43203 31162 -31533 -13998
13282a3998Q7094Q9956j19056j29146k8560q3416P295Q2953K450J6890L9000N0910
$$ -13998 73096 163052 43996 -85150 -113710 -197126 -189831 -106878 -104428 -87538 -48538 2372
13270B372N3479n5286o2984o9590L7948P9629L3484j3108o0969o5848k761j5085
$$ 2372 55851 565 -62419 -132009 -94061 -14432 19052 5944 -55025 -120873 -123634 -138719
13258a38719l9008n2341P1831J43283K9535N5123Q444q0231m2052j1186N4531
$$ -138719 -177727 -230068 -158237 -14954 14581 69704 78148 -2083 -44135 -55321 -790
13247g90J6504K9786j2556R588O4891J0163m3412j41824r4992J7569P2094J7793
$$ -790 15714 45500 32944 42532 107423 117586 74174 -67650 -162642 -145073 -72979 -55186
13235e5186K1964N9391l364N5920K1676j0222p5723n3362j4153n5533J0996J18942
$$ -55186 -33222 26169 22805 78725 100401 90179 14456 -38906 -53059 -108592 -97596 21346
13223B1346m9938o0225j6276p0436O3704N5124O6368M8350m496p4172m2855L9351
$$ 21346 -28592 -88817 -105093 -175529 -111825 -56701 9667 58017 53521 -20651 -63506 -24155
13211b4155o821J7887l0768k0085N6151L3951R8092r1328o7174Q099p8844j9387
$$ -24155 -30976 -13089 -43857 -63942 -7791 26160 124252 32924 -34250 -26151 -104995 -124382
13199a24382P0603k4115n758k044N2900K5078o8125p9486L4849l1119K2401J27712
$$ -124382 -53779 -77894 -83652 -85696 -32796 -7718 -75843 -155329 -120480 -151599 -129198 -1486
13187a486P0166p4110l9741m8082L3430L8080L4444J09317M7398J6929j8902p6869
$$ -1486 68680 -5430 -45171 -93253 -59823 -21743 12701 122018 169416 186345 167443 90574
13175I0574L0014j24946m1151O7885k8887p0191M173N3504K8557N2074M7335K3093
$$ 90574 120588 -4358 -45509 22376 -6511 -76702 -72529 -19025 9532 61606 108941 132034
13163A32034K6473Q1541r6877n7912l019K0492j07388m1966K9483j0320p6453
$$ 132034 158507 240048 143171 85259 82240 102732 -4656 -46622 -17139 -27459 -103912
13152a03912j9039O8497j0736j7638P859N0865J4542L7252P787j4744k210L498
$$ -103912 -122951 -54454 -65190 -82828 -74969 -24104 -9562 27690 35477 20733 18523 22021
13140B2021m0677m5071K886j7924Q5024J04268P702l7442o3962O9182k9394n3034
$$ 22021 -18656 -63727 -60841 -78765 6259 110527 118229 80787 16825 86007 56613 3579
13128C579J20354L076j39990j39064J12156N9351r7974R1726R9617P3484L4579
$$ 3579 123933 127009 -12981 -152045 -39889 19462 -78512 13214 112831 186315 220894
13117B20894L491l7674l2277q5315j0822O1867r1166l5768k7973K2249j9131M1888
$$ 220894 224385 186711 154434 69119 58297 120164 28998 -6770 -34743 -12494 -31625 10263
13105A0263n2981p1241l996q283Q2585N4401q160N9667K3007j23890q5138J26795
$$ 10263 -42718 -113959 -117955 -126238 -43653 10748 2588 62255 85262 -38628 -123766 3029
13093C029J27052n8754K0849O0218K8784O9476k0715p5415N9165j9897j70766
$$ 3029 130081 71327 92176 152394 181178 250654 229939 154524 213689 193792 23026
13082B3026j16874N7861Q7670N6091N387p6607j7052r9278j29313L6524J00119
$$ 23026 -93848 -35987 51683 107774 113161 36554 19502 -79776 -209089 -172565 -72446
13071g2446K4035k6869k895q0697j0103k4390M2141J40625Q8467r1030j05216
$$ -72446 -48411 -75280 -78175 -158872 -168975 -193365 -151224 -10599 77868 -13162 -118378
13060a18378l250k3267o604K3026O4091k9621J28639k4072j38736l529k4671M4338
$$ -118378 -121628 -144895 -151499 -128473 -64382 -94003 34636 10564 -128172 -131701 -156372 -112034
13048a12034K6965j4803O5078P2587m3971k3845o1754Q4189J46757N450k9563
$$ -112034 -85069 -99872 -34794 37793 -6178 -30023 -91777 -7588 139169 144619 115056
13037A15056J5126K1191n1812q1330K4411n5345k993J03940j540M7664j9687K4649
$$ 115056 130182 151373 99561 18231 42642 -12703 -15696 88244 86704 134368 114681 139330
13025A39330J580m9658j2267j425P664J6772n5890O0605R110J2120J03749r845
$$ 139330 140910 91252 78985 77560 85224 101996 46106 106711 115821 127941 231690 221845
13013B21845r5675L742n489m6907n8689q8912L1816L9021j8997J1279L4070K0561
$$ 221845 126170 129912 124423 77516 18827 -70085 -38269 752 -18245 -6966 27104 47665
13001D7665k4294L2032l1714q6362l364M8773L993o1456K8691J870K856O6794
$$ 47665 23371 55403 23689 -62673 -66037 -17264 -13271 -74727 -46036 -44166 -41310 25484
12989B5484K6428p513r6625k8760L2001j9772N6826Q1470r194m2068j02283m5774
$$ 25484 51912 44399 -52226 -80986 -48985 -68757 -11931 69539 60345 18277 -84006 -129780
12977a29780R0283N0588K8437M4983j3781j797P5269j036K257q236K9609l6845
$$ -129780 -39497 11091 39528 84511 70730 68933 144202 143166 145423 137187 166796 129951
12965A29951k1124j8711n1493k3783N0500j02892q6274J7450J11866O4766k6765
$$ 129951 108827 90116 38623 14840 65340 -37552 -123826 -106376 5490 70256 43491
12954D3491l3098O641l5813O0555n782o9711k9059M253m4149m3501L1492K7833
$$ 43491 10393 17034 -18779 41776 35994 -33717 -62776 -58523 -102672 -146173 -114681 -86848
12942h6848J41668J03951K8309j3327j0301p37l8542o0110r466N3751M6294p5446
$$ -86848 54820 158771 187080 173753 163452 162715 124173 64063 54597 108348 154642 79196
12930G9196n0456p9879n3923P6898Q3543K6360j56286n767k1542J5585J51927
$$ 79196 28740 -51139 -105062 -28164 55379 81739 -74547 -80314 -101856 -86271 65656
12919F5656p2680l2620O8721P2074J3492J5347j3739J6815O4296r9419n4668M4
$$ 65656 -7024 -39644 29077 101151 114643 129990 116251 133066 197362 97943 43275 43319
12907D3319L4952n4102k3799P4996l5512J8914K6119l6879l1376j09174o003R5280
$$ 43319 78271 24169 370 75366 39854 58768 84887 48008 16632 -92542 -98545 -3265
$$ [...]
##END NTUPLES=NMR SPECTRUM
##END=
