##TITLE=Analysis number 322810
Compound Code rh 00194
Project Code adrs
Chemist Name ugmt
##JCAMPDX= 6.0         $$ Bruker NMR JCAMP-DX V2.0
##DATA TYPE= NMR SPECTRUM
##DATA CLASS= NTUPLES
##ORIGIN= Bruker BioSpin GmbH
##OWNER= nmr
$$ XWIN-NMR		Version 3.5
$$ Mon Oct 16 09:20:44 2006 GMT Daylight Time (UT+1h)  MAYBRIDGE\nmr@NMR_250MHZ
##.OBSERVE FREQUENCY= 250.131544655141
##.OBSERVE NUCLEUS= ^1H
##.ACQUISITION MODE= SIMULTANEOUS (DQD)
##.ACQUISITION SCHEME= undefined
##.AVERAGES= 16
##.DIGITISER RES= 18
##SPECTROMETER/DATA SYSTEM= dpx250
##.PULSE SEQUENCE= zg30
##.SOLVENT NAME= CDCl3
##.SHIFT REFERENCE= (INTERNAL, CDCl3, 0, 16.522)
##AUDIT TRAIL= $$ (NUMBER, WHEN, WHO, WHERE, WHAT)
$$ ##TITLE= Audit trail, XWIN-NMR		Version 3.5
$$ ##JCAMPDX= 5.01
$$ ##ORIGIN= Bruker BioSpin GmbH
$$ ##OWNER= nmr
$$ C:\u/data/dgb/nmr/ADRS/410/pdata/1/auditp.txt
$$ ##AUDIT TRAIL=  $$ (NUMBER, WHEN, WHO, WHERE, WHAT)
(   1,<2006-10-16 09:20:20.24 +100>,<MAYBRIDGE\nmr>,<NMR_250MHZ>,
      <created by zg, POWCHK disabled, PULCHK disabled
       configuration hash MD5:
       49 4B E0 1D 92 C2 6B 37 9F E6 65 BC 52 41 86 1D
       data hash MD5: 64K
       94 E1 E1 13 11 BF 4F 7A 74 B4 46 87 04 25 31 95>)
(   2,<2006-10-16 09:20:35.46 +100>,<MAYBRIDGE\nmr>,<NMR_250MHZ>,
      <Start of raw data processing
       ef LB = 0.3 FT_mod = 6 PKNL = 1 SI = 32K 
       data hash MD5: 32K
       04 86 62 49 68 6F 21 8D 2F AA 9D 46 0D C3 6D 55>)
(   3,<2006-10-16 09:20:37.17 +100>,<MAYBRIDGE\nmr>,<NMR_250MHZ>,
      <apk 
       data hash MD5: 32K
       EF BB 33 39 14 73 CE 85 29 3E 1E BC D2 1A 20 CC>)
(   4,<2006-10-16 09:20:37.92 +100>,<MAYBRIDGE\nmr>,<NMR_250MHZ>,
      <abs ABSG = 5 
       data hash MD5: 32K
       F6 02 86 30 B5 1D 40 95 80 00 C9 A6 3A A7 63 94>)
$$ ##END=
$$ 
$$ hash MD5
$$ 4E 72 54 4A 7A AB 0C 77 E7 F8 FC B7 98 A8 56 70
##$RELAX= 
##$RELAX= 
##$RELAX= 
##$RELAX= 
##$RELAX= 
##$RELAX= 
##$RELAX= 
$$ Bruker specific parameters
$$ --------------------------
##$DU= <C:\u>
##$EXPNO= 410
##$NAME= <ADRS>
##$PROCNO= 1
##$TYPE= <nmr>
##$USER= <dgb>
##$AMP= (0..31)
100 100 100 100 100 100 100 100 100 100 100 100 100 100 100 100 100 100 
100 100 100 100 100 100 100 100 100 100 100 100 100 100 
##$AQSEQ= 0
##$AQ_mod= 3
##$AUNM= <au_zg>
##$AUTOPOS= <27 >
##$BF1= 250.13
##$BF2= 250.13
##$BF3= 250.13
##$BF4= 250.13
##$BF5= 500.13
##$BF6= 500.13
##$BF7= 500.13
##$BF8= 500.13
##$BYTORDA= 1
##$CFDGTYP= 0
##$CFRGTYP= 5
##$CHEMSTR= <none>
##$CNST= (0..31)
1 1 145 1 1 1 1 1 1 1 1 1 1 1 1 1 1 1 1 1 1 1 1 1 1 1 1 1 1 1 1 1 
##$CPDPRG= <>
##$CPDPRG1= <>
##$CPDPRG2= <>
##$CPDPRG3= <>
##$CPDPRG4= <mlev>
##$CPDPRG5= <mlev>
##$CPDPRG6= <mlev>
##$CPDPRG7= <mlev>
##$CPDPRG8= <mlev>
##$CPDPRGB= <>
##$CPDPRGT= <>
##$D= (0..31)
0 1 0 0 0 0 0 0 0 0.06 0 0 0 0 0 0 0.0002 0 0 0 0 0 0 0 0 0 0 0 0 0 0 
0 
##$DATE= 1160986819
##$DBL= (0..7)
120 120 120 120 120 120 120 120 
##$DBP= (0..7)
150 150 150 150 150 150 150 150 
##$DBP07= 0
##$DBPNAM0= <>
##$DBPNAM1= <>
##$DBPNAM2= <>
##$DBPNAM3= <>
$$ [...]
##$SUBNAM7= <"">
##$SUBNAM8= <"">
##$SUBNAM9= <"">
##$SW= 20.6930455092707
##$SWIBOX= (0..15)
0 0 3 0 0 0 0 0 0 0 0 0 0 0 0 0 
##$SW_h= 5175.983436853
##$TD= 65536
##$TD0= 1
##$TE= 683.16
##$TE2= 300
##$TE3= 300
##$TEG= 300
##$TL= (0..7)
0 120 120 120 120 120 120 120 
##$TP= (0..7)
150 150 150 150 150 150 150 150 
##$TP07= 0
##$TPNAME0= <>
##$TPNAME1= <>
##$TPNAME2= <>
##$TPNAME3= <>
##$TPNAME4= <>
##$TPNAME5= <>
##$TPNAME6= <>
##$TPNAME7= <>
##$TPOAL= (0..7)
0.5 0.5 0.5 0.5 0.5 0.5 0.5 0.5 
##$TPOFFS= (0..7)
0 0 0 0 0 0 0 0 
##$TUNHIN= 0
##$TUNHOUT= 0
##$TUNXOUT= 0
##$USERA1= <user>
##$USERA2= <user>
##$USERA3= <user>
##$USERA4= <user>
##$USERA5= <user>
##$V9= 5
##$VALIST= <valist>
##$VCLIST= <CCCCCCCCCCCCCCC>
##$VD= 0
##$VDLIST= <DDDDDDDDDDDDDDD>
##$VPLIST= <PPPPPPPPPPPPPPP>
##$VTLIST= <TTTTTTTTTTTTTTT>
##$WBST= 1024
##$WBSW= 4
##$XGAIN= (0..3)
0 0 0 0 
##$XL= 0
##$YL= 0
##$YMAX_a= 419165
##$YMIN_a= -327563
##$ZGOPTNS= <>
##$ZL1= 120
##$ZL2= 120
##$ZL3= 120
##$ZL4= 120
##$ABSF1= 16.522
##$ABSF2= -4.171173
##$ABSG= 5
##$ABSL= 3
##$ALPHA= 0
##$AQORDER= 0
##$ASSFAC= 0
##$ASSFACI= 0
##$ASSFACX= 0
##$ASSWID= 0
##$AUNMP= <proc_1d>
##$AZFE= 0.1
##$AZFW= 0.1
##$BCFW= 0
##$BC_mod= 0
##$BYTORDP= 0
##$COROFFS= 0
##$CY= 12.5
##$DATMOD= 1
##$DC= 0
##$DFILT= <>
##$DTYPP= 0
##$F1P= 14.0000005364418
##$F2P= -0.99999901652339
##$FCOR= 0.5
##$FTSIZE= 32768
##$FT_mod= 6
##$GAMMA= 0
##$GB= 0
##$INTBC= 1
##$INTSCL= 1
##$ISEN= 128
##$LB= 0.3
##$LEV0= 0
##$LPBIN= 0
##$MAXI= 10000
##$MC2= 0
##$MEAN= 0
##$ME_mod= 0
##$MI= 0
##$NCOEF= 0
##$NC_proc= -3
##$NLEV= 6
##$NOISF1= 0
##$NOISF2= 0
##$NSP= 0
##$NTH_PI= 0
##$NZP= 0
##$OFFSET= 16.522
##$PC= 1
##$PHC0= -43.0953
##$PHC1= 9.606373
##$PH_mod= 1
##$PKNL= yes
##$PPARMOD= 0
##$PSCAL= 4
##$PSIGN= 0
##$REVERSE= no
##$SF= 250.13
##$SI= 32768
##$SIGF1= 0
##$SIGF2= 0
##$SINO= 400
##$SIOLD= 32768
##$SREGLST= <1H.CDCl3>
##$SSB= 0
##$STSI= 32768
##$STSR= 0
##$SW_p= 5175.98343685301
##$SYMM= 0
##$S_DEV= 0
##$TDeff= 65536
##$TDoff= 0
##$TI= <Analysis number 999999
Compound Code 99
Book Reference 9
Project Code 9>
##$TILT= no
##$TM1= 0
##$TM2= 0
##$TOPLEV= 0
##$USERP1= <user>
##$USERP2= <user>
##$USERP3= <user>
##$USERP4= <user>
##$USERP5= <user>
##$WDW= 1
##$XDIM= 32768
##$YMAX_p= 409554310
##$YMIN_p= -518707
$$ End of Bruker specific parameters
$$ ---------------------------------
##NTUPLES= NMR SPECTRUM
##VAR_NAME=  FREQUENCY,     SPECTRUM/REAL,   SPECTRUM/IMAG
##SYMBOL=    X,             R,               I
##VAR_TYPE=  INDEPENDENT,   DEPENDENT,       DEPENDENT
##VAR_FORM=  AFFN,          ASDF,            ASDF
##VAR_DIM=   32768,         32768,           32768
##UNITS=     HZ,            ARBITRARY UNITS, ARBITRARY UNITS
##FACTOR=    0.157963299565203, 1,           1
##FIRST=     4132.6476996994, 0,             0
##LAST=      -1043.33573715361, 0,           0
##MIN=       -1043.33573715361, -518707,     0
##MAX=       4132.6476996994, 409554310,     0
$$ Real data points
##PAGE= N=1
##DATA TABLE= (X++(R..R)), XYDATA
$$ [...]
24380E0909q9395q6989k1569Q8646O9672L9586M4034Q2533L9533K2035p6845N579
$$ 50909 -38486 -125475 -147044 -58398 11274 50860 94894 177427 216960 238995 162150 167729
24368A67729o8745n7229L1567k1058J1271o4518o2799j12471M389P7021Q1892
$$ 167729 98984 41755 73322 52264 63535 -983 -63782 -176253 -171864 -94843 -12951
24357a2951m8315J11185J16107J4384j06245j50043r001J33266J6267q2212m7769
$$ -12951 -61266 49919 166026 180410 74165 -75878 -84879 48387 64654 -17558 -65327
24346f5327Q1132k3518k5978M4563j2516k6635Q0631j03745n4690l5751q672O9191
$$ -65327 15805 -7713 -33691 10872 -1644 -28279 52352 -51393 -106083 -141834 -150506 -81315
24334h1315K60K5127R7225K1523n6410m4492k9417j11761O2021O4294p652j07761
$$ -81315 -81055 -55928 41297 62820 6410 -38082 -67499 -179260 -117239 -52945 -60597 -168358
24322a68358J07672Q1820q5649o7041L4595j6337K4413M6614K0893J18587K5789
$$ -168358 -60686 21134 -64515 -131556 -96961 -113298 -88885 -42271 -21378 97209 122998
24311A22998j03934j63055k8465L6160Q8724J36966L5744j12418O730j13633R3415
$$ 122998 19064 -143991 -172456 -136296 -47572 89394 125138 12720 19450 -94183 -768
24300g68P1185m840L4465R0587O7022j5160j39724j49833L0949Q4996r9448l2524
$$ -768 70417 65577 100042 190629 257651 242491 102767 -47066 -16117 68879 -30569 -63093
24288f3093K0835l2062n4279Q2879M4155N945m2373k764k8236M6969m0414M2449
$$ -63093 -42258 -74320 -128599 -45720 -1565 4380 -37993 -40757 -68993 -22024 -62438 -19989
24276a9989o7633J2044M5597o6389M2300J16120j26000r8087k0336J07664J21244
$$ -19989 -87622 -75578 -29981 -96370 -54070 62050 -63950 -162037 -182373 -74709 46535
24265D6535P1148O6252R698o5517j16622L7100J7932K0984n8170K3277k3931j25671
$$ 46535 117683 183935 193633 128116 11494 48594 66526 87510 29340 52617 28686 -96985
24253i6985n7204M1152J02477Q8645J7525j6193Q29k3264q0853J4213j00023q0422
$$ -96985 -154189 -113037 -10560 78085 95610 79417 80246 56982 -23871 -9658 -109681 -190103
24241a90103n314K836l018M4164K5982k2380P6270j25714K702r008o5319J0752
$$ -190103 -195417 -192581 -195599 -151435 -125453 -147833 -71563 -197277 -194575 -203583 -268902 -258150
24229b58150R80J31039O3020O6818J34542P8425k8977o9434q1391j21467J39091
$$ -258150 -257170 -126131 -63111 3707 138249 216674 187697 118263 36872 -84595 54496
24218E4496r768r8571o8393J627j2494L5320O1887J13079L096j8966p587n585
$$ 54496 44728 -53843 -122236 -120609 -133103 -97783 -35896 77183 80279 61313 53726 48141
24206D8141l2078j75200j9939M9840N1944J0501M578Q8274M2618l629m3333m1099
$$ 48141 16063 -159137 -179076 -129236 -77292 -66791 -62213 26061 68679 65050 21717 -19382
24194a9382k7704m0302m7312r591Q632L3589J48711j03689j03381P3900P728J11358
$$ -19382 -47086 -87388 -134700 -144291 -135659 -102070 46641 -57048 -160429 -86529 -78801 32557
24182C2557l0045j04148p2818j2282O9232M7297L7511Q2453J17281R8328j30754
$$ 32557 2512 -101636 -174454 -186736 -117504 -70207 -32696 49757 167038 265366 134612
24171A34612j02529M3626K08723l2754p2502n2630k08412r4935j1424j5070J02247
$$ 134612 32083 75709 284432 251678 179176 126546 -81866 -176801 -188225 -203295 -101048
24160a01048J5189p3731l0232r5673N0500O5000K08680j1556L305n4066N804J8667
$$ -101048 -85859 -159590 -189822 -285495 -234995 -169995 38685 27129 30434 -23632 -17828 839
24148H39J52510j939n308k8403j52730r0776k6023O7594J52388l0258k0326r3629
$$ 839 153349 151410 146102 117699 -35031 -125807 -151830 -84236 68152 37894 17568 -76061
24136g6061R800M5615N1157J221J3509p8691r3077R2627J40721l6418k02270J27590
$$ -76061 -66261 -20646 30511 31732 45241 -33450 -126527 -33900 106821 70403 -131867 -4277
24124d277J2239o3177p5596K14304n361o5302J6531p62P2752J5149j8605m5443
$$ -4277 7962 -55215 -130811 83493 78132 12830 29361 28599 101351 116500 97895 52452
24112E2452r4909k01690k0993J03648K0662P78m332J05239J42654m9353n2692
$$ 52452 -42457 -244147 -265140 -161492 -140830 -140052 -144384 -39145 103509 54156 1464
24101A464N8466N5981Q389p3879j4413j23778M4139K09998p2675q0816j22833
$$ 1464 59930 115911 124300 50421 36008 -87770 -43631 166367 93692 12876 -109957
24090a09957m4290j9053N5278n728Q3171K2122k6881j33990n0202Q4009Q661P0213
$$ -109957 -154247 -173300 -118022 -123750 -40579 -18457 -45338 -179328 -229530 -145521 -136860 -66647
24078f6647k0020M9594J5280J8227J26357M2246p2464n2165j5155P2532r6332
$$ -66647 -86667 -37073 -21793 -3566 122791 165037 92573 40408 25253 97785 1453
24067A453Q7830L5739k214K7247n5279J55375L209j68133m187J13666J06412l5388
$$ 1453 89283 125022 122808 150055 94776 250151 253360 85227 81040 194706 301118 265730
24055B65730r6287n156j20256O81J6285J9001q060J22406P3356n7046o9871j6168
$$ 265730 169443 164287 44031 44712 60997 79998 71938 194344 267700 210654 140783 124615
24043A24615l5012m8745J2418j02662R9082k0060j41594j17124M7498J69311Q8135
$$ 124615 89603 40858 53276 -49386 49696 29636 -111958 -229082 -181584 -12273 75862
24032G5862R8034m8466j61262J2829J06943J23529N3841r2947r6812j6951r98
$$ 75862 173896 125430 -35832 -23003 83940 207469 261310 168363 71551 54600 53602
24021E3602k1543o8395N7743J13763J1993l8567j51544J3601P6322k6856j21031
$$ 53602 32059 -36336 21407 135170 147163 108596 -42948 -29347 46975 20119 -100912
24010a00912j0264R9455q8554j2279k1035R5278J38129q2544j74756m2341K2490
$$ -100912 -111176 -11721 -100275 -112554 -133589 -38311 99818 17274 -157482 -199823 -177333
23999a77333j51068j37957M1718J73447l4405R6694J31802P7249n4432J38150
$$ -177333 -328401 -466358 -424640 -251193 -285598 -188904 -57102 20147 -34285 103865
23989A03865J13880M3927Q207j34499j28123j11035M2094R8936p4550m8298q3242
$$ 103865 217745 261672 269879 135380 7257 -103778 -61684 37252 -37298 -85596 -168838
23978a68838j2288J34374j104P0951q427R6149M4709l7725n7285J4245R786O8119
$$ -168838 -181126 -46752 -47856 23095 14668 110817 155526 117801 60516 74761 84547 152666
23966A52666J9801O5546n1236j35497K4968J2156J20271l8029j25872O2148R4898
$$ 152666 172467 238013 186777 51280 76248 88404 208675 170646 44774 106922 201820
23955B01820j809k7547j02394N7901M9377j46144N3442j63087n1875R2903K870
$$ 201820 200011 172464 70070 127971 177348 31204 84646 -78441 -130316 -37413 -34543
23944c4543j8542N8270N2246m1171m760r5293p5433o9013J13535J50592j56375
$$ -34543 -53085 5185 57431 16260 11500 -83793 -159226 -228239 -114704 35888 -120487
23933a20487p7848M5807Q146L6384K3879O7708j35597l9276l231j45151P249K06958
$$ -120487 -198335 -152528 -144382 -107998 -84119 -16411 -152008 -191284 -194515 -339666 -332417 -125459
23921a25459J49090j8691j32563j6814J35492j46155M3299J71081L9078l9650
$$ -125459 23631 4940 -127623 -144437 -8945 -155100 -111801 59280 98358 58708
23911E8708j24503j68594L7182K6885R2851K791l0903L7956m0915O2559J07464
$$ 58708 -65795 -234389 -197207 -170322 -77471 -74680 -105583 -67627 -108542 -45983 61481
23900F1481j17267n6474o5907O1093J21755r262l4095J02880j01185p7055R9022
$$ 61481 -55786 -112260 -178167 -117074 4681 -4581 -38676 64204 -36981 -114036 -15014
23889a5014J766M3512O3076J7029o6737m0235M6349L8959k1086p3136k2125O6302
$$ -15014 -13248 30264 93340 110369 43632 3397 49746 88705 67619 -5517 -27642 38660
23877C8660J99878l536j03116j51896m2352K2241J22336M5429q1754J00540o0705
$$ 38660 238538 235002 131886 -20010 -62362 -40121 82215 127644 45890 146430 85725
23866H5725k6960Q2517n4110n1634J34047O9768j87254j27452N3801J03902l5654
$$ 85725 58765 141282 87172 35538 169585 239353 52099 -75353 -21552 82350 46696
23855D6696Q37N6095K0364m8425k9635o7457O7676o038o499q8579j0122Q1739
$$ 46696 47533 103628 123992 75567 45932 -21525 46151 40113 33614 -54965 -65087 16652
23843A6652Q7557O1187K3944o1027k27513k6322Q2606r1382k9428q494J6006M9350
$$ 16652 104209 165396 189340 128313 -99200 -125522 -42916 -134298 -163726 -172220 -156214 -106864
23831a06864N4662Q962j2590r896K1816J3286K544o3029N326K9852n5477M701
$$ -106864 -52202 -43240 -55830 -65726 -43910 -30624 -28080 -91109 -85783 -55931 -111408 -106707
23819a06707J49238N0364L5886m882k3312M9513M9223j91211m7303M1152O2506
$$ -106707 42531 92895 128781 123899 100587 150100 199323 8112 -39191 1961 64467
23808F4467O2395O982L5249p5077j38816n7690P3994L37N9153k0039j39424j34729
$$ 64467 126862 133844 169093 94016 -44800 -102490 -28496 -28159 30994 10955 -128469 -263198
23796b63198N6439J36191J48065l3530k30818j00302Q6389l211K2330l9833P2558
$$ -263198 -206759 -70568 77497 43967 -186851 -287153 -200764 -203975 -181645 -221478 -148920
23785a48920J38379K8780j19377j80653Q1614P898J8669R1435Q6156l365J5128
$$ -148920 -10541 18239 -101138 -281791 -200177 -192279 -173610 -82175 3981 616 15744
23774A5744R0739j23989k8735j9697q082l9199p8579J54823K72888m6637q1482
$$ 15744 106483 -17506 -46241 -65938 -74020 -113219 -191798 -36975 235913 189276 107794
23763A07794p5047O051l9310P923m1953J5878q5651n8559L0992l2084q4763O3319
$$ 107794 32747 38798 -512 7411 -34542 -18664 -104315 -162874 -131882 -163966 -248729 -185410
23751a85410J70206J32713l8386k1534J07231n330J5496N147k37809l4150N8092
$$ -185410 -15204 117509 79123 57589 164820 159490 174986 180133 -57676 -91826 -33734
23740c3734m6344n4384n4315o2887J34689K4307j5223M8378m2751N597M1355N9026
$$ -33734 -80078 -134462 -188777 -251664 -116975 -92668 -107891 -59513 -102264 -96667 -55312 3714
23728C714L9535M1235P0757L8470l0084l1282m2254j00866p249j2247r6298n5817
$$ 3714 43249 84484 155241 193711 163627 132345 90091 -10775 -18024 -30271 -126569 -182386
23716a82386M1887R6200k4381K1670M2832R0197J7517O904p9559m8908j9368j31354
$$ -182386 -140499 -44299 -68680 -47010 -4178 86019 103536 110440 30881 -18027 -37395 -168749
23704a68749J7599J71866p5007n2134p1954N1176M6675N6294o4454q3618j76369
$$ -168749 -151150 20716 -54291 -106425 -178379 -127203 -80528 -24234 -88688 -172306 -348675
23693c48675n0125J62598K6893J18683J63629j37037l9245J05440j51832O222
$$ -348675 -398800 -236202 -209309 -90626 73003 -64034 -103279 2161 -149671 -143449
23683a43449k6379l9349q237Q1245Q0747o0873j11426J60906J70760j13790K2151
$$ -143449 -169828 -209177 -217414 -136169 -55422 -116295 -227721 -66815 103945 -9845 12306
23672A2306j1588j24167j73269k9341K28319J54661j01541j52135O9774R1776
$$ 12306 718 -123449 -296718 -326059 -97740 56921 -44620 -196755 -126981 -35205
23662c5205K8974K8492k8092K32o5202j4878p6868n0505J82859K07852l1598j53125
$$ -35205 -6231 22261 -5831 -5599 -70801 -85679 -162547 -213052 -30193 177659 146061 -7064
23650g064m2507O6364q9617j64836O0368P9196M6745K8663K492k9774l0851N6350
$$ -7064 -49571 16793 -72824 -237660 -177292 -98096 -51351 -22688 -20196 -49970 -80821 -24471
23638b4471K7721L9649R8910j20068K1132M7587k9527n1761o9322n2409j29287
$$ -24471 3250 42899 141809 21741 42873 90460 60933 9172 -60150 -112559 -241846
23627b41846n0949J23741n080q1529m567J73617J82879o3282p1187K7155n7506
$$ -241846 -292795 -169054 -174134 -255663 -260230 -86613 96266 32984 -38203 -11048 -68554
23616f8554J01790J37068J03456j21215j90527q6867l2961J7117o1488l6899M3663
$$ -68554 33236 170304 273760 152545 -37982 -124849 -157810 -140693 -202181 -239080 -195417
23605a95417O1321l3767Q4177J92014M4058l3064j0890m891N2699j39386J3899
$$ -195417 -134096 -167863 -83686 108328 152386 119322 108432 103541 156240 16854 30753
23594C0753K0452J3064q9787j37624P4474J18920n4691p8305j0194k5821K07776
$$ 30753 51205 64269 -25518 -163142 -88668 30252 -24439 -102744 -112938 -138759 69017
23583F9017J53159j0009k055J26609j6003K686J25604j74639k16116J8836k4452
$$ 69017 222176 212167 210112 336721 320718 323404 449008 274369 58253 77089 52637
23572E2637k4103q6493n6442Q7334J11631L6958l3023m6804j40002J14337j313
$$ 52637 28534 -57959 -114401 -27067 84564 121522 88499 41695 -98307 16030 14717
23561A4717P8668R1690r5136j56607P3050R184j16548q8365k072k7257L1457J8996
$$ 14717 93385 185075 89939 -66668 6382 15566 -100982 -189347 -191419 -218676 -187219 -168223
23549a68223o4599P9053J07477q5964L498Q699n9249Q8164J57279R455N2938K04229
$$ -168223 -232822 -153769 -46292 -132256 -128758 -120059 -179308 -91144 66135 75590 128528 332757
23537C32757q8670j56344j45272j16379M788j21559o4178K37464l3136q5687N1177
$$ 332757 244087 87743 -57529 -173908 -169120 -290679 -354857 -117393 -150529 -236216 -185039
23526a85039O4988J05099N6977J08731j5725K0431P5065J9831p6946q4059M8769
$$ -185039 -120051 -14952 42025 150756 135031 155462 230527 250358 173412 89353 138122
23515A38122m5621K5079j9486j76403l5465R9202J69502L3718m5070r6416r7467
$$ 138122 92501 117580 98094 -78309 -113774 -14572 154930 188648 143578 47162 -50305
23504e0305R6160n7015n7306M782j09740R4300J13944O8485R7104n9530j80238
$$ -50305 45855 -11160 -68466 -63684 -173424 -79124 34820 103305 200409 140879 -39359
23493c9359j16867Q7236N5208k9972n813Q3562K2070n0633q8421L364J24196j17770
$$ -39359 -156226 -68990 -13782 -43754 -49567 33995 56065 5432 -82989 -79625 44571 -73199
23481g3199j30886K3201J03144k618k627J3313j9533k4716j08732m6935N9402
$$ -73199 -204085 -180884 -77740 -80358 -82985 -69672 -89205 -113921 -222653 -269588 -210186
23470b10186j9240J0222L4730J07087O4453J33690j9403q7668j86606N0828P6004
$$ -210186 -229426 -219204 -184474 -77387 -12934 120756 101353 13685 -172921 -122093 -46089
23459d6089J4653m256J61073M1299j1197l9456K8056O4255n1426j40247J3107
$$ -46089 -31436 -35692 125381 166680 155483 116027 144083 208338 156912 16665 29772
23448B9772r7887j46452R5214K63705K1180r4779j01551P8963L0950j42857j9524
$$ 29772 -68115 -214567 -119353 144352 165532 70753 -30798 48165 79115 -63742 -83266
23437h3266j06372J4337m0254J08745J85512L1802p490o825k6398n3665j9015
$$ -83266 -189638 -175301 -215555 -106810 78702 110504 103014 96189 69791 16126 -2889
23426b889k6605O49m2912K9679J7328k4271k3643n2605k9676P229R2417K07221
$$ -2889 -29494 -28845 -71757 -42078 -24750 -49021 -72664 -125269 -154945 -147716 -55299 151922
23414A51922J2323q0184j62492l5026J2855J45171J11862p2513p3288R5784J31801
$$ 151922 164245 84061 -78431 -113457 -100602 44569 156431 83918 10630 106414 238215
23403B38215p5196o7492L3417j51757m5253l071J62934J47168R2406o8583q4991
$$ 238215 163019 95527 128944 -22813 -68066 -71137 91797 238965 331371 262788 177797
23392A77797j06092q8615K8730k3890l7789J76896k2968j05932p6310L8961l138
$$ 177797 71705 -16910 11820 -12070 -49859 127037 104069 -1863 -78173 -39212 -42350
23381d2350J3383J72317L6983p5070p5304M0380j6702j79809l6499l44P4338R8021
$$ -42350 -28967 143350 180333 105263 29959 70339 53637 -126172 -162671 -163015 -88677 9344
23369I344l9787K05608L553j01908j2547o1207K5891n2658j8918M286q7759j83680
$$ 9344 -30443 175165 178718 76810 64263 3056 28947 -23711 -42629 -38343 -126102 -309782
23357c09782Q0931J49490O7476j00028J38492J36590n0124j19777L6125m458j51362
$$ -309782 -228851 -79361 -11885 -111913 26579 163169 113045 -6732 29393 24935 -126427
23346a26427r9163r752J49225n3278p5172J61580N6015p9417j14177q0026M9715
$$ -126427 -225590 -235342 -86117 -139395 -214567 -52987 3028 -76389 -190566 -270592 -220877
23335b20877J79634L2006Q104m7197l07196R4282K34577L7026j61304n130R1864
$$ -220877 -41243 -9237 -1133 -48330 -355526 -261244 -26667 10359 -150945 -156075 -64211
23324f4211J27656J71349j801j87580q0703l8073q8895N294J50648R2460o1340
$$ -64211 63445 234794 232993 45413 -35290 -73363 -162258 -156964 -6316 86144 24804
23313B4804j49175Q250K36650n3786o0624M7441o6225o1544q3017O741M7207R1988
$$ 24804 -124371 -116121 120529 66743 6119 53560 -12665 -74209 -157226 -150485 -103278 -11290
23301a1290M1308M8535K1697J5968j21347n4642N7150j9645p2791l654P0396J21987
$$ -11290 30018 78553 100250 116218 -5129 -59771 -2621 -22266 -95057 -98711 -28315 93672
23289I3672J63651j05445j36457L931n9462r2710j2712K9889J42616L0300l5496
$$ 93672 257323 151878 15421 19352 -40110 -132820 -145532 -115643 26973 57273 21777
23278B1777J8203l6552L099Q4360O7693k6426J5891J0528k37874K1571J39280
$$ 21777 39980 3428 6527 90887 158580 132154 148045 158573 -79301 -57730 81550
23267H1550N8764j57032p2519r094r4051m0473J87518N4790M5258j00039K6752
$$ 81550 140314 -16718 -89237 -98331 -192382 -232855 -45337 9453 54711 -45328 -18576
23256a8576J679j7180k3953o284N9501L6279j07p2983J6800R106N0485k8372j08176
$$ -18576 -16897 -34077 -58030 -64314 -4813 31466 31359 -41624 -24824 -15718 34767 6395 -101781
23243a01781j29302L548J00732J37140K3023m9194N4102J6817J060m3090J15729
$$ -101781 -231083 -227535 -126803 10337 33360 -15834 38268 55085 56145 13055 128784
23232A28784J47147n8643l0632j00607j36796K4567j11027R9483K4933J0253Q5834
$$ 128784 275931 217288 186656 86049 -50747 -26180 -137207 -37724 -12791 -2538 83296
23221H3296n4699o7409j06815o2327Q4075N0704l7772q8516P1598M402O8516N4237
$$ 83296 28597 -38812 -145627 -207954 -123879 -73175 -110947 -199463 -127865 -123463 -54947 -710
23209g10o7r0007k9547N7022J51764O7241n0762q2702m4053j6865r1211K6550
$$ -710 -777 -90784 -120331 -63309 88455 155696 104934 22232 -21821 -38686 -129897 -103347
23197a03347Q8464m4078o0625O6805J02337n2968R651O3582N109K0294j3146n5143
$$ -103347 -14883 -58961 -119586 -52781 49556 -3412 6239 69821 74930 95224 82078 26935
23185B6935k4789n1439j08371J38084k9716m5526J30964P862o2413L7985n0880
$$ 26935 2146 -49293 -157664 -19580 -49296 -94822 36142 44004 -18409 19576 -31304
23174c1304n0936N7657j00666J36353K3354J2580p3406r9826q4670N1835K9587
$$ -31304 -82240 -24583 -125249 11104 34458 47038 -26368 -126194 -210864 -159029 -129442
23163a29442R459r7022L9623R3439M6964l3431M4460R1652L237k0709N4745p303
$$ -129442 -119983 -217005 -177382 -83943 -36979 -70410 -25950 65702 68939 48230 102975 95672
23151I5672O1041o2742m6892j9305l7353j48854O0091J62942K38087l1321j66192
$$ 95672 156713 93971 47079 27774 -9579 -158433 -98342 64600 302687 271366 105174
23140A05174j03467q6937k8266P5941J01429j5735j07248N7494O454R5724Q4551
$$ 105174 1707 -85230 -113496 -37555 63874 48139 -59109 -1615 4839 100563 185114
23129A85114n5762l8553J1061j0443J19503M3847j45760r410n5909r7440J75011
$$ 185114 129352 90799 101860 91417 210920 254767 109007 99597 43688 -53752 121259
23118A21259J20421l7155j61517l0105J02250J1866N613o4077J0535k7358L1552
$$ 121259 241680 204525 43008 12903 115153 127019 132632 68555 79090 51732 83284
23107H3284P7621p6260l1480M1785o1339j01257m4421l8296O6226K6566K4051
$$ 83284 160905 84645 53165 94950 33611 -67646 -112067 -150363 -84137 -57571 -33520
23096c3520J9214J12378K0637j6023k323j1347n3724j18568o2873K141m5070p5353
$$ -33520 -14306 98072 118709 102686 100363 89016 35292 -83276 -146149 -144008 -189078 -264431
23084b64431K5769Q0446l6671J60127j7518J32479J4275L5429n0055J05920P1279
$$ -264431 -238662 -158216 -194887 -34760 -52278 80201 94476 129905 79850 185770 257049
23073B57049l3636O9179o5099p4858k08506m890R6403j421j65753R7522J38047
$$ 257049 223413 292592 227493 152635 -55871 -60761 35642 34221 -131532 -34010 104037
23062A04037N2184j10464q7990J6549O8832K7467O6183J34386m1289o8110M1928
$$ 104037 156221 45757 -42233 -25684 43148 70615 136798 271184 229895 161785 203713
23051B03713J2207o2947m1601q1698l0529n6879J6883J24984J3692m5148O1034
$$ 203713 215920 152973 111372 29674 -855 -57734 -40851 84133 97825 52677 113711
23040A13711r2320K461J3923j1165J6824n5443o8830j6990L5940j39594R9837
$$ 113711 21391 23852 37775 26610 43434 -12009 -80839 -97829 -61889 -201483 -101646
23029a01646M7600j2597Q2224P3947p1919j32301M1013J0707o163R1148J04403
$$ -101646 -54046 -66643 15581 89528 17609 -114692 -73679 -62972 -69135 22013 126416
23018A26416l082P4835L1748j24664k7684J4900m269j26877j3188N6493J02721
$$ 126416 123334 198169 229917 105253 77569 92469 88200 -38677 -51865 4628 107349
23007A07349j37480r1602j9756n284m8324l1134Q6212P8545M8196m1055M500J129
$$ 107349 -30131 -121733 -141489 -146773 -195097 -226231 -140019 -61474 -13278 -54333 -49833 -48704
22995d8704l2273N3106l3303j26428J26245O274j7348r6019k3051n3014j62380
$$ -48704 -80977 -27871 -61174 -187602 -61357 -55083 -72431 -168450 -191501 -244515 -406895
22984d06895L2089J79221R011m6358k1107L7443j15341Q1197K47684J47715q045
$$ -406895 -374806 -195585 -186574 -232932 -254039 -216596 -331937 -250740 -3056 144659 136614
22973A36614l5853j31278l2144J17232O6629j7428k1872R2095j22773r5237k6129
$$ 136614 100761 -30517 -62661 54571 121200 103772 81900 173995 51222 -44015 -70144
22962g0144K4637J13717o0143K1385r9403M4354R3998J8525o8645m5703M4212
$$ -70144 -45507 68210 8067 29452 -69951 -25597 68401 86926 18281 -27422 16790
22951A6790k8327o5182P057o5075R0464N9945N5823o3937j7209O2247N68j19935
$$ 16790 -11537 -76719 -69662 -134737 -44273 15672 71495 7558 -9651 52596 53164 -66771
22939f6771j37098J23356m2983P000P3279l7487R0361j7414N7497L8242J6812
$$ -66771 -203869 -80513 -123496 -116496 -43217 -80704 9657 -7757 49740 87982 104794
22928A04794k9045p4124r721N5334L8198N7546n0878J15616P4336j1631j6926
$$ 104794 75749 1625 -8096 47238 85436 142982 92104 207720 282056 270425 253499
22917B53499j00486m2785O0886R15m8633j85404k4818O7467k0987k347J5040m499
$$ 253499 153013 110228 171114 172029 123396 -62008 -86826 -19359 -40346 -42693 -27653 -32152
22905c2152K5272m6409L5223o6501N356L6209J34098J1642l707p5653n5212k9800
$$ -32152 -6880 -53289 -18066 -84567 -79211 -43002 91096 102738 99031 23378 -31834 -61634
22893f1634k4128L498o7005n62O8337p3811N6918k7230k6871M8968J52146Q6830
$$ -61634 -85762 -82264 -149269 -149831 -81494 -155305 -98387 -125617 -152488 -103520 48626 135456
22881A35456L4229L3994j43590j21881Q7320p7595k1734L8932p9394j1052O696
$$ 135456 169685 203679 60089 -61792 25528 -52067 -73801 -34869 -114263 -125315 -118619
22870a18619P0135L4885N809J0702J03677R7360k13533j38334l1601o5342R6500
$$ -118619 -48484 -13599 -7790 2912 106589 203949 -9584 -147918 -179519 -244861 -148361
22859a48361R4180J88349P4679j6401n3996j9561p6990j17242J7162R2518J6983
$$ -148361 -54181 134168 208847 192446 138450 118889 41899 -75343 -58181 34337 51320
22848E1320M5920r359R7858M3929N9992K4822k9971j36471p0726j4456N0628J23475
$$ 51320 97240 87881 185739 229668 289660 314482 284511 148040 77314 62858 113486 236961
22836B36961L1990j03996j5124j15706O8223R842o7764j14463p0262L1510J11548
$$ 236961 268951 164955 149831 34125 102348 112190 44426 -70037 -140299 -108789 2759
22825B759K09083M1178l0328j05932j06405p1847p0823M3326Q1584J5758M2570
$$ 2759 211842 253020 222692 116760 10355 -61492 -132315 -88989 -7405 8353 50923
22814E0923l5493M7526Q2584L826q2512j41229P2578P4863j36038m817O3379Q9158
$$ 50923 15430 62956 145540 149366 66854 -74375 -1797 73066 -62972 -67789 -4410 84748
22802H4748l6089k8751J7097j1018J5446O2791J2584o8460q0536n3566j1194P8516
$$ 84748 48659 19908 37005 25987 41433 104224 116808 48348 -32188 -85754 -96948 -18432
22790a8432j39373L1911O3117J26756J27653L0275r9351j37484P2413J41729r5435
$$ -18432 -157805 -125894 -62777 63979 191632 221907 122556 -14928 57485 199214 103779
22779A03779J3101P644j07589o856R4126M0231j13372K5523J3405p0J8345O4249
$$ 103779 116880 124524 16935 10079 104205 144436 31064 56587 69992 69922 88267 152516
22767A52516l5103j04878N4819O9224N9504r6476j49616r0815j27285R419L1968
$$ 152516 117413 12535 67354 136578 196082 99606 -50010 -140825 -268110 -258691 -226723
22756b26723N3766R8555N6178J4002J21094l149j63655K3766k5761O631j8331
$$ -226723 -172957 -74402 -18224 -4222 116872 113723 -49932 -26166 -51927 -45296 -63627
22745f3627L4706J01576r0791m7482n3212r4215j7164r695j8267J4595N5027J43042
$$ -63627 -28921 72655 -18136 -65618 -118830 -213045 -230209 -239904 -258171 -243576 -188549 -45507
22733d5507p3128J6963N7882L5990m9962M9006R6215o0018j32369R001J78783
$$ -45507 -118635 -101672 -43790 -7800 -57762 -8756 87459 27441 -104928 -95927 82856
22722H2856O1379l2835R2472N4169M5275o301o8774M8503J780K04519K31957J40519
$$ 82856 144235 111400 203872 258041 303316 297015 228241 276744 278524 483043 715000 855519
22710H55519O2587J03499K4122q2632j12757j86005j99349j47696P2696o1733
$$ 855519 918106 1021605 1045727 963095 850338 664333 464984 317288 389984 328251
22700C28251o9088J12556p1463j06325J3715J68085n558q2458L252q7340j68010
$$ 328251 259163 371719 300256 193931 207646 375731 370173 287715 290967 203627 35617
22689C5617o6501k7887l206p1406J06088J61210L351p6654k0237J88381L038k53557
$$ 35617 -30884 -58771 -61977 -133383 -27295 133915 137266 60612 40375 228756 231794 -21763
22677b1763j49541o608P3916R9634M8187l7275j47574N8063J51776L8360N5596
$$ -21763 -171304 -177912 -103996 -4362 43825 6550 -141024 -82961 68815 107175 162771
22666A62771m898o6479P3151j05483R537R7232n8418M000J8478p1921K429L5748
$$ 162771 157873 91394 164545 59062 68599 165831 107413 111413 129891 57970 60399 96147
22654I6147m7891L0639O0938j00255o0860l8119P497Q1319K8586N821j19824k3310
$$ 96147 48256 78895 139833 39578 -21282 -59401 -51904 29415 58001 63822 -56002 -79312
22642g9312J86612R0653l612K2621J1780K5850j09016j32207r9005K8028K9796
$$ -79312 107300 197953 194341 216962 228742 254592 145576 13369 -85636 -57608 -27812
22631b7812q6408o2757R0185M5371L6017O031j53682N4997J6461q4919J3960P2813
$$ -27812 -114220 -176977 -86792 -41421 -5404 627 -153055 -98058 -81597 -166516 -152556 -79743
22619g9743j5829P3978J53779j9101j1676L7303j10412k60248J45865J22737N4996
$$ -79743 -95572 -21594 132185 113084 101408 138711 28299 -231949 -86084 36653 91649
22608I1649J20549j19319j21569l2874j7273M7597K7300p60K1214k8694o2243
$$ 91649 212198 92879 -28690 -61564 -78837 -31240 -3940 -4700 16514 -12180 -74423
22597g4423K8475L6878n8808L0801j3142j2165J71985L1157M9626l0173m6239
$$ -74423 -45948 -9070 -67878 -37077 -50219 -62384 109601 140758 190384 160211 113972
22586A13972j9668m2462j11057j51462P9446j6547N614O6231l3892l2290o0560
$$ 113972 94304 51842 -59215 -210677 -131231 -147778 -142164 -75933 -109825 -142115 -202675
22575b02675J03887J0043L8228P5689l3375P4634n1342P261j8194j03382L9384
$$ -202675 -98788 -88745 -50517 25172 -8203 66431 15089 22350 4156 -99226 -59842
22564e9842Q0392p0278r157J2788j16088j37284M4227P7703O6752N0075K6025
$$ -59842 20550 -49728 -58885 -46097 -162185 -299469 -255242 -177539 -110787 -60712 -34687
22553c4687K1118m717K2878p8536j23598N1234p6589q2417P002j8966J14144Q3395
$$ -34687 -13569 -18286 4592 -73944 -197542 -146308 -222897 -305314 -298312 -317278 -203134 -119739
22541a19739J8430L8542j0877j05609j37255l7797J31267J69747O6436j2857l4683
$$ -119739 -101309 -62767 -73644 -179253 -316508 -354305 -223038 -53291 13145 288 -34395
22530c4395k103J24787j5181p1482K4347q8857j32513J27597M8539K8893q2029
$$ -34395 -36498 88289 73108 1626 25973 -62884 -195397 -67800 -19261 9632 -72397
22519g2397o1854L0052J23871M150l172j58560L6014O1643M0872n9332J04405
$$ -72397 -134251 -104199 19672 23822 20650 -137910 -101896 -40253 619 -58713 45692
22508D5692M7931m9209P8820O7259j77820N3886K02994L0428l3792J0074N3670
$$ 45692 93623 44414 123234 190493 12673 66559 269553 299981 266189 276263 329933
22497C29933R7650k4991k16641n9985Q7730j10341j0398k3091m2833l3589J31736
$$ 329933 427583 402592 185951 125966 213696 103355 92957 69866 27033 -6556 125180
22486A25180o1204R86M7231J49072m9155o6280j8045k889r705p6665M10J0414
$$ 125180 63976 64962 112193 261265 212110 145830 127785 124896 115191 38526 38936 49350
22474D9350J8297l5020J84413K05265j75197r2820K3259q6771k1472J5979j3496
$$ 49350 67647 32627 217040 422305 247108 154288 177547 90776 69304 85283 71787
22463G1787P5709j3330R7451q784r0281r2756J00442r6301j2259p4745k4330j30981
$$ 71787 147496 134166 231617 222833 132552 39796 140238 43937 31678 -43067 -67397 -198378
22451a98378J02845J48931n2969j27832l1726Q7453K7860L2565K467P13R889n756
$$ -198378 -95533 53398 429 -127403 -159129 -71676 -43816 -11251 -8784 -8071 1818 -3938
22439c938m100o287q769P003P4901K9296L5141L3945m1785k456J14738J8357k1248
$$ -3938 -8038 -14325 -23094 -16091 58810 88106 123247 157192 115407 112951 227689 246046 224798
22426B24798P2829m1648j08222l9616P5228l5601k21874J05705K08073l3657k4899
$$ 224798 297627 255979 147757 108141 183369 147768 -74106 31599 239672 206015 181116
22415A81116M4288L6345p0930j1060Q9901m0091j05838m7477J9036J6698Q1057
$$ 181116 225404 261749 190819 179759 269660 229569 123731 76254 95290 111988 193045
22404A93045l8064r3132j5283J51680o0702j74457R889j4630N1644m1003j60093
$$ 193045 154981 61849 46566 198246 137544 -36913 -27024 -41654 9990 -31013 -191106
22393a91106L4222R0260m080P4591n1974K1131M9488J8573m8815j46493J3456
$$ -191106 -156884 -66624 -70704 3887 -48087 -26956 22532 41105 -7710 -154203 -140747
22382a40747K33924M8188p323j26347l37L5941o690K15521m6798j72575j1966
$$ -140747 93177 141365 134042 7695 7358 43299 36609 252130 205332 32757 20791
22371B0791M8424J22905J15769j93008N33J07550q1314j29247P4125q907j49601
$$ 20791 69215 192120 307889 114881 115414 222964 141650 12403 86528 77621 -71980
22360g1980j00028P3950L2677J01630P7491j22717j87257J1985J08890J37662
$$ -71980 -172008 -98058 -65381 36249 113740 -8977 -196234 -184249 -75359 62303
22350F2303M1204K658J3122k8345R1273q8727k2561L0255M2550O0985k7485J7006
$$ 62303 103507 106165 119287 90942 182215 93488 70927 101182 143732 204717 177232 194238
22338A94238j01604j01375o6023M1068j2842R0135N8324m5678m012j0335L3191
$$ 194238 92634 -8741 -74764 -33696 -46538 43597 101921 56243 52231 41896 75087
22327G5087k9763r9776j82655o9523J82799J67154Q1956N7625m2827j4443m3323
$$ 75087 45324 -54452 -237107 -306630 -123831 43323 125279 182904 140077 125634 82311
22316H2311M6043q3270p7383N3898J8830m372J785P0263J12416m8826L834N7106
$$ 82311 128354 45084 -32299 21599 40429 36057 37842 108105 220521 171695 175529 232635
22304B32635m8942j49557j14991J4118l3659L1590K19825O7843K9300Q8289j57858
$$ 232635 183693 34136 -80855 -66737 -100396 -68806 151019 218862 248162 336451 178593
22293A78593j85721r2741J0645J01287J68521k9296l0598L7604O0532j42953l0154
$$ 178593 -7128 -99869 -89224 12063 180584 151288 120690 158294 218826 75873 45719
22282D5719N4591j29305Q8292N4529j4223P5211J24246Q0707j00770j00294j8500
$$ 45719 100310 -28995 59297 113826 99603 174814 299060 379767 278997 178703 160203
22271A60203p219K4827N4789Q842j2835j18118j08771j24922Q5173J70268J13699
$$ 160203 152984 177811 232600 241442 228607 110489 1718 -123204 -38031 132237 245936
22260B45936N6711p0854k1142L0116k202n7077M1419m3241n0134J9003R7841J03736
$$ 245936 302647 231793 210651 240767 238565 181488 222907 179666 129532 148535 246376 350112
22248C50112K021M9402N5682K9616p0113K9640J23648M7462m4867m9283Q8508
$$ 350112 352133 401535 457217 486833 416720 446360 570008 617470 572603 523320 611828
22237F11828J49772R8244R2999J57565J18202K04974J78898P172m19069n45945
$$ 611828 761600 859844 952843 1110408 1228610 1433584 1612482 1619654 1200585 654640
22227F54640q6798k3883j083r680j24893n6572M4098J07759J31757M9757N0559
$$ 654640 567842 543959 542876 533196 408303 351731 395829 503588 635345 685102 735661
22216G35661p0488P6955J86591J00451K75538N23537Q27456J046121J168399J169854
$$ 735661 665173 742128 928719 1029170 1304708 1828245 2655701 3701822 4870221 6040075
22206F040075J094403Q31683L87923m46366j139325r46814j358504j238429o02177
$$ 6040075 7134478 7966161 8354084 7907718 6768393 5821579 4463075 3224646 2622469
22197B622469l86759l17962k13494k59989k3607l2024j11377j19629K062J50010
$$ 2622469 2235710 1917748 1704254 1444265 1420658 1388634 1277257 1157628 1159690 1309700
22187A309700J69973n3062q3600j14935J08994k2051l4960J17146k6541R560K0924
$$ 1309700 1479673 1426611 1343011 1228076 1337070 1315019 1280059 1397205 1370664 1380224 1401148
22176A401148j9937J10497K38952L17351J50774K04308L26181L30367L79845L48276
$$ 1401148 1381211 1491708 1730660 2048011 2198785 2403093 2729274 3059641 3439486 3787762
22166C787762M02288O80398Q67657J261157J833469K597238L444017N067538Q109995
$$ 3787762 4190050 4870448 5738105 6999262 8832731 11429969 14873986 19941524 28051519
22157B8051519J3512952K3532254L6374906M3552095L5358556J9989311P251423
$$ 28051519 41564471 65096725 101471631 145023726 180382282 200371593 207623016
22150B07623016M807699j1073900n6281171n3402636k7404687j5421614r769606
$$ 207623016 212430715 201356815 145075644 91673008 64268321 48846707 39077101
22143C9077101n995765m128287l455341k591175k034827j803832j702446j402166
$$ 39077101 33081336 28953049 25497708 22906533 20871706 19067874 17365428 15963262
22135A5963262j443277j633042j510867j205001j089341r18079q71136p13297
$$ 15963262 14519985 12886943 11376076 10171075 9081734 8163655 7292519 6579222
22127F579222n89403n59018n06462n08225l40747l70239l21792k24808j16773
$$ 6579222 5989819 5430801 4924339 4416114 4075367 3705128 3383336 3158528 3041755
22118C041755o3818m7383j64191j68115j66753j52006j32062j28328q4850q2736
$$ 3041755 2977937 2930554 2766363 2598248 2431495 2279489 2147427 2019099 1934249 1851513
22108A851513R9975m0190j01966p7571p3869p0442K3527o7589J9359r8750j30914
$$ 1851513 1951488 1911298 1809332 1731761 1657892 1587450 1610977 1543388 1562747 1463997 1333083
22097A333083r9378k36304J03585o5739m498m3346n383K1449n16M8556k01453
$$ 1333083 1233705 997401 1100986 1035247 1030749 987403 982020 1003469 1002953 1051509 850056
22086H50056o9959j6182o5513p3411q3552K7598N3008J34274P0028j30225O5294
$$ 850056 780097 763915 698402 624991 541439 569037 622045 756319 826347 696122 761416
22075G61416j0763Q8408J00970J61492K61238J77614J12007n5505q2739j04202
$$ 761416 750653 839061 940031 1101523 1362761 1540375 1652382 1596877 1514138 1409936
22065A409936k63261k41848j28417j31857r5224m441m6110m4719P1313p6646p4882
$$ 1409936 1146675 904827 776410 644553 549329 544888 498778 454059 525372 448726 373844
22054C73844j00669j35399J2974J08146k4559k2935K7041Q203N7493P0388J47845
$$ 373844 273175 137776 150750 258896 234337 211402 238443 246646 304139 374527 522372
22043E22372Q2119j25233j94004o3830j44536r6531J19443R1861p8667p6628L3403
$$ 522372 604491 479258 285254 221424 76888 -19643 99800 191661 112994 36366 69769
22032F9769K212J20621L8858J13611J13060p9253k09079p1884L1312K5369n9574
$$ 69769 71981 192602 231460 345071 458131 378878 169799 97915 129227 154596 95022
22021I5022J5553J49616n4420j29035N5526J45141r9543j96743j1211Q7447J4213
$$ 95022 110575 260191 205771 76736 132262 277403 177860 -18883 -30094 57353 71566
22010G1566n082K6037J10748M4238k3520Q7069p3454j338J705O4385p343J07425
$$ 71566 66484 92521 203269 247507 223987 311056 237602 236264 237969 302354 295011 402436
21998D02436N6305M1369K39391L88053K15403K66840K49208R5147k58833n91097
$$ 402436 458741 500110 739501 1127554 1342957 1609797 1859005 1954152 1695319 1104222
21988A104222k86854j65561j35399j33275j7293P084r3809q5304J00315m2789
$$ 1104222 817368 651807 516408 383133 365840 372924 279115 193811 294126 251337
21978B51337j11371L6344p3138k08R4363J67650J00233j9576k7354k04865j30497
$$ 251337 139966 176310 103172 102964 197327 364977 465210 445634 418280 213415 82918
21967H2918r9414k8011o2085J11777N2512j64288N5926k0733K8855k1707J32043
$$ 82918 -16496 -44507 -106592 5185 57697 -106591 -50665 -71398 -42543 -64250 67793
21956F7793J90062P7090j27020j67661p4047m6238m5625O5205P962m8459j67953
$$ 67793 257855 334945 207925 40264 -33783 -80021 -125646 -60441 -52479 -100938 -268891
21945b68891J24845P0099Q362M4192j59328K5877L7762Q605O5694Q9038J1085
$$ -268891 -144046 -73947 -65585 -21393 -180721 -154844 -117082 -108477 -42783 46255 57340
21934E7340J0657j01141j93089K3481J39237L8029M1705L2058Q1992K3074j93558
$$ 57340 67997 -33144 -226233 -202752 -63515 -25486 16219 48277 130269 153343 -40215
21923d0215j35994q1456N5160J19122J6436o5541K3506M1770p3555m4041J42037
$$ -40215 -176209 -257665 -202505 -83383 -66947 -132488 -108982 -67212 -140767 -184808 -42771
21912d2771r566m6513Q7680O5588K2123j48387M4497M801n9997k149L6064O0576
$$ -42771 -52337 -98850 -11170 54418 76541 -71846 -27349 -22548 -82545 -84694 -48630 11946
21900A1946K3328N604J8231o2176l6348j5876j33574o5896P7987J83803J35139
$$ 11946 35274 40878 59109 -3067 -39415 -55291 -188865 -254761 -176774 7029 142168
21889A42168Q0332O1809L4914k08475k71455j47685P1428L2383R6925J87040m2387
$$ 142168 222500 284309 319223 110748 -160707 -308392 -236964 -204581 -107656 79384 36997
21878C6997r2827p1601P1194O8826R7557M2244l1184j6524o6816p2070j1518o9987
$$ 36997 -55830 -127431 -56237 12589 110146 152390 121206 104682 37866 -34204 -45722 -115709
21866a15709Q2704R9021L7043N560m0614k6148o4490k5100j889o4341j67680o4349
$$ -115709 -33005 66016 103059 108619 68005 41857 -22633 -47733 -49622 -113963 -281643 -345992
21854c45992K5916Q9684l9279l3797P7195j15376j19929P7255J11499N6152K4711
$$ -345992 -320076 -230392 -269671 -303468 -226273 -341649 -461578 -384323 -272824 -216672 -191961
21843a91961J24316k9965j0042K3295J1092l7509J01515J41964q3809K1383J03741
$$ -191961 -67645 -97610 -107652 -84357 -73265 -110774 -9259 132705 48896 70279 174020
21832A74020q9212o5962k6085N1389J2530J0881L1702L315o5678j3262R860K6143
$$ 174020 84808 18846 -7239 44150 56680 67561 99263 102578 36900 23638 33498 59641
21820E9641l8865k3927R2241P8467m8042q3597k8152J2868J148j5442l1645L4940
$$ 59641 20776 -3151 89090 167557 119515 35918 7766 20634 21782 6340 -25305 9635
21808I635J3536j76574j4893M3420j29882p6117L7537P9407j10645k8376J00397
$$ 9635 23171 -153403 -168296 -124876 -254758 -330875 -293338 -213931 -324576 -352952 -252555
21797b52555L5791N8745M9515J06734l9305O3427n8398j804K13836m5234r3446
$$ -252555 -216764 -158019 -108504 -1770 -41075 22352 -36046 -37850 175986 130752 37306
21786C7306j71269O9926R3132j1284R1132k1186j25573J463m1575N5554q9939
$$ 37306 -133963 -64037 29095 17811 108943 87757 -37816 -36353 -77928 -22374 -112313
21775a12313L9754K09091n8896k0791l6911j1203O8159m5142r9554j24486k0103
$$ -112313 -72559 136532 77636 56845 19934 8731 76890 31748 -67806 -192292 -212395
21764b12395M4595N7391O4696L6302Q250o4154n1243j07963R9353J4571j2017
$$ -212395 -167800 -110409 -45713 -9411 -1161 -65315 -116558 -224521 -125168 -110597 -122614
21753a22614J5852Q3236J4034J03615o5470r5284q1850J33087R8713j7831k5164
$$ -122614 -106762 -23526 -9492 94123 28653 -66631 -148481 -15394 83319 65488 40324
21742D0324k01734j59221p875J08931J65817N2352j04989r9013M815n0889j6211
$$ 40324 -161410 -320631 -328506 -219575 -53758 -1406 -106395 -205408 -200593 -251482 -267693
21731b67693N7500r197N5446N6244k8004L6162m4169j12441k4049k6980j03352
$$ -267693 -210193 -219390 -163944 -107700 -135704 -99542 -143711 -256152 -280201 -307181 -410533
21720d10533R7367J78703P4474j79297J49984M2153o4288j3940J2059m3513J1521
$$ -410533 -313166 -134463 -59989 -239286 -89302 -47149 -111437 -125377 -113318 -156831 -145310
21709a45310j5457P9531p65l6218Q1484q6964L2004Q9589k3104K6160q3142o1154
$$ -145310 -160767 -81236 -82001 -118219 -36735 -123699 -91695 -2106 -25210 950 -82192 -143346
21697a43346n6556l2410J27360J4825j05301r1054m5413O895J07511r6411P2429
$$ -143346 -199902 -232312 -104952 -90127 -195428 -286482 -331895 -325000 -217489 -313900 -241471
21686b41471J81999J717K7813j1501m2594j51458N0975q460q3623P22R3377l0185
$$ -241471 -59472 -57755 -29942 -41443 -84037 -235495 -184520 -192980 -276603 -275881 -182504 -212689
21674b12689O1710R8538L1797m5691l070P0934o495l5154j03957L0316J21321
$$ -212689 -150979 -52441 -20644 -66335 -69405 1529 -4966 -40120 -144077 -113761 7560
21663G560J3156j91504q3572j520J11091R5245l9989j15337L4143m6439n7698
$$ 7560 20716 -170788 -254360 -255880 -144789 -49544 -89533 -204870 -170727 -217166 -274864
21652b74864O7205J95514k2549m4097l7446j5557J8432M6524J43696J46336J4890
$$ -274864 -207659 -12145 -34694 -78791 -116237 -131794 -113362 -66838 76858 223194 238084
21641B38084r2007n3505p5127J64774p3010j29356P5582k8248r1034k8212l7464
$$ 238084 146077 92572 17445 182219 109209 -20147 55435 27187 -63847 -92059 -129523
21630a29523J3415O0011M0523J5541J06926l4268M304j00427p3630J8664L7277
$$ -129523 -116108 -56097 -15574 -33 106893 72625 76929 -23498 -97128 -78464 -41187
21619d1187q868O5334J20056P6554m0955j06638m5163O1957k8860p4650L491l0916
$$ -41187 -50055 15279 135335 211889 170934 64296 19133 81090 52230 -22420 -18929 -49845
21607d9845q3574N3945J44515o7340m8576o0975P9423J52500k5377j04288p6550
$$ -49845 -133419 -79474 65041 -2299 -50875 -111850 -32427 120073 94696 -9592 -86142
21596h6142j28953K4540J56703k8526R5023P0657Q4519P0607K76539K42864J37803
$$ -86142 -215095 -190555 -33852 -62378 32645 103302 187821 258428 534967 777831 915634
21585I15634P6060J45864p1561l05786k91927j42527K4692j03836j78281n4367
$$ 915634 991694 1137558 1065997 760211 468284 325757 350449 246613 68332 13965
21575A3965O2385n1132m5983n2033M37J46647m4419o247J9032j04227p078O2165
$$ 13965 76350 25218 -20765 -72798 -72361 74286 29867 23620 42652 -61575 -68653 -6488
21563f488l2443J228J9023r3095J7857O4506L1523L2965j03601q3259K6391J429
$$ -6488 -38931 -37703 -18680 -111775 -93918 -29412 2111 35076 -68525 -151784 -125393 -123964
21551a23964q876o6691j5397J45818J26921P2999k4107k5643R5427J4443q2910
$$ -123964 -132840 -199531 -214928 -69110 57811 130810 106703 81060 176487 190930 108020
21540A08020L4390O778q3433r0900m0682k3712r3694J63097J3598j69499k1112
$$ 108020 142410 149188 65755 -25145 -65827 -89539 -183233 -20136 -6538 -176037 -197149
21529a97149J24079Q6915O0316j9296M728J0671J18644n3618k21346j74496o6474
$$ -197149 -73070 13845 74161 54865 59593 70264 188908 135290 -86056 -260552 -327026
21518c27026l8771L9198J06876M1714J02267J9729K6218N9421J10292j31156j05929
$$ -327026 -365797 -326599 -219723 -178009 -75742 -56013 -29795 29626 139918 8762 -97167
21507i7167O1926N7575K4479O9243O2391J46331m1920N7248o7548j53496j46333
$$ -97167 -35241 22334 46813 116056 178447 324778 282858 340106 272558 119062 -27271
21496b7271j342o0371j96596M6262J24801N7216J22951O3616r0669k1930J20519
$$ -27271 -28613 -88984 -285580 -239318 -114517 -57301 65650 129266 38597 16667 137186
21485A37186M7664r5663m4950n5210K4448N2053k7381n8779j32044k9967M6613
$$ 137186 184850 89187 44237 -10973 13475 65528 38147 -20632 -152676 -182643 -136030
21474a36030K0758k3746k349M8432o2k5888n5587q1321M3140Q4136J16601J7774
$$ -136030 -115272 -139018 -141367 -92935 -92997 -118885 -174472 -255793 -212653 -128517 -11916 5858
21462E858p3995k2293R1031J2172j18714n5482J24646R9469o9275n7627J00137
$$ 5858 -68137 -90430 601 12773 -105941 -161423 -36777 62692 -6583 -64210 35927
21451C5927M6590n537K4436j40545j53602O5115P061J00399N4469l7137j11356
$$ 35927 82517 76980 101416 -39129 -192731 -127616 -120555 -20156 34313 -2824 -114180
21440a14180o6445l9393N0120Q8996K7905l3350o4378N5801R541j2560m121K8888
$$ -114180 -180625 -220018 -169898 -80902 -52997 -86347 -150725 -94924 -85383 -97943 -102064 -73176
21428g3176J21684M8758N1446K6457j73959j83625o3439J18750M7348K05084J81003
$$ -73176 48508 97266 148712 175169 1210 -182415 -245854 -127104 -79756 125328 306331
21417C06331q287n1741k13666r8345n9493J21455Q6483n7987m9642K9228l5267
$$ 306331 298044 246303 32637 -65708 -125201 -3746 82737 24750 -24892 4336 -30931
21406c0931m9213J91385R1841p3734j18947j79118n089J5430L6464o4255M1343
$$ -30931 -80144 111241 203082 129348 10401 -168717 -173806 -158376 -121912 -186167 -144824
21395a44824N432o3627N4128L8145P9125J96150r6079j13665p0109o8921O7664
$$ -144824 -139392 -203019 -148891 -110746 -31621 164529 68450 -45215 -115324 -184245 -116581
21384a16581J12874K7862L5255r209k4232k737j06132q0482J70016J25677p1585
$$ -116581 -3707 24155 59410 50201 25969 23232 -82900 -163382 6634 132311 60726
21373F0726m2170R0940r4218J1032K8850l7991M972n5214j1380m3430M8096K7746
$$ 60726 18556 109496 15278 26310 55160 17169 22141 -33073 -44453 -87883 -39787 -12041
21361a2041p2350j27927K9944J38116Q9297J44572p3462j21330n6364j4370j03329
$$ -12041 -84391 -212318 -182374 -44258 45039 189611 116149 -5181 -61545 -75915 -179244
21350a79244o8671N2316k4278j6188Q0239M911Q0529p0656O0395J04056q615r4849
$$ -179244 -247915 -195599 -219877 -236065 -155826 -150915 -70386 -141042 -80647 23409 14794 -80055
21338h0055K5734P9178O2907p8425p3515J00981o3055L2984m3083O4611k7643
$$ -80055 -54321 24857 87764 9339 -64176 36805 -26250 6734 -36349 28262 619
21327F19K651q1432n8881m762P5799R0542n6594o8101J52894R4386o5328m7929
$$ 619 3270 -78162 -137043 -141805 -66006 24536 -32058 -100159 52735 147121 81793 33864
21315C3864k5058j05534j8454n9933m8158J57309K14538m067j95615j01163j01680
$$ 33864 8806 -96728 -115182 -175115 -223273 -65964 148574 144507 -51108 -152271 -253951
21304b53951J14539O4164N4492m1928o9410L950J00968J36998j3284l6172o5129
$$ -253951 -139412 -75248 -20756 -62684 -132094 -128144 -27176 109822 96538 60366 -4763
21293d763o7439o6490l0195Q0421M7529L4186q0080l5359q098M3920m1451n9707
$$ -4763 -72202 -138692 -168887 -88466 -40937 -6751 -86831 -122190 -130288 -86368 -127819 -187526
21281a87526j8385Q6452j1487l5173J4575k3005q4314l4661P3924J16015J55631
$$ -187526 -205911 -119459 -130946 -166119 -151544 -174549 -258863 -293524 -219600 -103585 52046
21270E2046J42199j276j940j2261k762j02976j26752j07915r0675K7053l3694
$$ 52046 194245 192969 191029 178768 176006 73030 -53722 -161637 -252312 -225259 -258953
21259b58953P6842L0827j10451j08599j1336R0588Q3422l758M3355J09421r5213
$$ -258953 -182111 -151284 -261735 -370334 -381670 -291082 -207660 -211418 -168063 -58642 -153855
21248a53855J8186M8383J02225M6982n2695m1444Q1609J35883j18998o1687K880
$$ -153855 -135669 -87286 14939 61921 9226 -32218 49391 185274 66276 4589 7469
21237G469k1897L2952L445j12424j62597N3039N9834L6229l455J45615N1574j04074
$$ 7469 -14428 18524 21969 -90455 -253052 -200013 -140179 -103950 -107405 38210 89784 -14290
21225a4290J16076J183K4442m9134m8583j09326j6606K5952r2978j78418Q0379
$$ -14290 101786 102969 127411 78277 29694 -79632 -96238 -70286 -163264 -341682 -261303
21214b61303K7707k8812O0380O4971R5245J09630p9242o6350O5159q5059J5154
$$ -261303 -233596 -262408 -202028 -137057 -41812 67818 -11424 -77774 -12615 -97674 -82520
21203h2520R1787N8111J027K0741j04165j36948n5642J80917J63805j42927o8419
$$ -82520 9267 67378 68405 89146 -15019 -151967 -207609 -26692 137113 -5814 -74233
21192g4233J20699r4484O5322J902n7962j06361J65668p7780l0648J8563J6253
$$ -74233 46466 -48018 17304 19206 -38756 -145117 20551 -57229 -87877 -69314 -53061
21181e3061K5123K1238m4736k8313J23089k6684k27495j54348N6322J20594J28320
$$ -53061 -27938 -6700 -51436 -79749 43340 16656 -210839 -365187 -308865 -188271 -59951
21170e9951N7290O1235J3874j47013r0758K07O3786P0851q494N1973o2152k1441
$$ -59951 -2661 58574 72448 -74565 -165323 -165116 -101330 -30479 -38973 13000 -49152 -70593
21158g0593m2232N1567q025J4502O5140q4665r1919K0036R8478O524p2352o2678
$$ -70593 -112825 -61258 -69283 -54781 10359 -74306 -166225 -146189 -47711 -41187 -113539 -176217
21146a76217L3638N794M5190o3680n80J45110J9511k293N3121n3224k822j741
$$ -176217 -142579 -136785 -91595 -155275 -155855 -10745 8766 6473 59594 6370 3548 1807
21134A807o1445k14704k0424P0281J17118k2026j1687m0620J03915M0125j99271
$$ 1807 -59638 -274342 -294766 -224485 -107367 -129393 -141080 -181700 -77785 -37660 -236931
21123b36931K7707Q0069O0806o1441j14717J3216L5833l8041j9010J54396K56682
$$ -236931 -209224 -129155 -68349 -129790 -244507 -231291 -195458 -233499 -252509 -98113 158569
21112A58569J57895j2919M5543k6647j23103j14966J43512p7294k2758l823j71836
$$ 158569 316464 303545 349088 322441 199338 84372 227884 150590 127832 124009 -47827
21101d7827r6255L6198O7454p65m2770J2795K9540L7439M0780k3240n6053j89851
$$ -47827 -144082 -107884 -40430 -41195 -83965 -71170 -41630 -4191 36589 13349 -42704 -232555
21089b32555k8222K03938O2866M6624J41901L2487n6579j5663J7564k8556K4391
$$ -232555 -260777 -56839 6027 52651 194552 227039 170460 154797 172361 143805 168196
21078A68196j5809k8362l7284p1674r1671R0963j36717M6585R4490M4990o1264
$$ 168196 152387 124025 86741 15067 -76604 14359 -122358 -75773 18717 63707 2443
21067B443j38129l1841P9321O9134R0143P5174J57187M1757j36734N6052M4561
$$ 2443 -135686 -167527 -88206 -19072 71071 146245 303432 345189 208455 264507 309068
21056C09068R383j35041j09747j47285k5517R7513O3577J2563O7090q2320o2439
$$ 309068 318451 183410 73663 -73622 -99139 -1626 61951 74514 141604 59284 -3155
21045c155J36502k1582J3426j10638k02746p5621O2013J8957N3351O8708J26613
$$ -3155 133347 111765 125191 14553 -188193 -263814 -201801 -182844 -129493 -60785 65828
21034F5828r8381j63387J77554L8904o0541m6828M8882O5867q2604q9187Q4102
$$ 65828 -32553 -195940 -18386 20518 -40023 -86851 -37969 27898 -54706 -143893 -59791
21023e9791O3671M3507o5768o3510J74988R4493j14259o545O7262r8232j54828
$$ -59791 3880 47387 -18381 -81891 93097 187590 73331 66786 134048 35816 -119012
21012a19012P3060J23526N3777J4483m7206O837j03187p1666J09217J667P4081
$$ -119012 -45952 77574 131351 145834 98628 105465 2278 -69388 39829 41496 115577
21001A15577L8584l5451q8875J3776j27911l7402J17068J30715R433j06148k0874
$$ 115577 154161 118710 29835 43611 -84300 -121702 -4634 126081 135514 29366 8492
20990H492r9387N018K8793J07563N5931r7334j5723P4701N524p4337j55766m2587
$$ 8492 -90895 -85877 -57084 50479 106410 9076 -6647 68054 73578 -759 -156525 -199112
20978a99112L1194Q6931J79180n677q1135L5681p02k9053o5723M2748m7491q4203
$$ -199112 -167918 -80987 98193 92516 11381 47062 46360 17307 -48416 -5668 -53159 -137362
20966a37362L8450m1373L2758k9209n4313M1288P6292P0908j95m3999Q8654J76898
$$ -137362 -98912 -140285 -107527 -136736 -191049 -149761 -73469 -2561 -2756 -46755 41899 218797
20954B18797j54275K919J0145p4556k4639K307Q441q203q1193K3882O9107J9667
$$ 218797 64522 67441 77586 3030 -21609 -19302 -10861 -19064 -100257 -76375 -7268 12399
20942A2399P9861j07843k04462J66271J08692l2771M1476n5938q3100j3262J78303
$$ 12399 92260 -15583 -220045 -53774 54918 22147 63623 7685 -75415 -88677 89626
20931H9626k010o7429Q8390K4257m6077j00030q7958O4718r534N306N4418M7004
$$ 89626 87616 20187 108577 132834 86757 -13273 -101231 -36513 -46047 -40741 13677 60681
20919F0681P766j18370n7030R2545J80190M1160q992m251j19973n5573j3852J711
$$ 60681 68447 -49923 -106953 -14408 165782 206942 197950 193699 73726 18153 4301 6012
20907F012r1776j12054O6656Q785m5321O8369J31482K3706N7098O566q560J75766
$$ 6012 -85764 -197818 -131162 -122377 -167698 -99329 32153 55859 112957 119523 110963 286729
20895B86729j07415j72763m1533n7431L4640J24102K739o6853m379N3216P1017
$$ 286729 179314 6551 -34982 -92413 -57773 66329 69068 2215 -2164 51052 122069
20884A22069O9180p428m3150m0814r6360m3298k5982p725J0825M924m9045L6618
$$ 122069 191249 183821 140671 99857 3497 -39801 -65783 -73508 -62683 -57759 -106804 -70186
20872g0186L880j1918J68369N7240M9827P083j05211L0032k7421k5724J5018R643
$$ -70186 -66306 -78224 90145 147385 197212 204295 99084 129116 101695 75971 90989 100632
20860A00632o0961l7277j6684J33765K0123j90298j15877k4284o5561r7696P3150
$$ 100632 39671 2394 -14290 119475 139598 -50700 -166577 -190861 -256422 -354118 -280968
20849b80968J64267J8490P2985L8281L6945j67571R071J04705J00998O5081O9242
$$ -280968 -116701 -98211 -25226 13055 50000 -117571 -108500 -3795 97203 162284 231526
20838B31526j85979j5214m5151j6107l2735N1896n3759m9674O2019M2812M1204
$$ 231526 45547 30333 -14818 -30925 -63660 -11764 -65523 -115197 -53178 -10366 30838
20827C0838n3785n4830L2406j9856J2085j44930j5768P5218Q544J07042j5030
$$ 30838 -22947 -77777 -45371 -65227 -53142 -198072 -213840 -138622 -130078 -23036 -38066
20816c8066p4245p5232O4287K8952m4325O5045m8412L893O7570K457r2861m8802
$$ -38066 -112311 -187543 -123256 -94304 -138629 -73584 -121996 -118103 -50533 -48076 -140937 -189739
20804a89739K4962K01691J5860q8612p9100n6143J31653K74278J35072r0879r1600
$$ -189739 -164777 36914 52774 -35838 -114938 -171081 -39428 234850 369922 279043 187443
20793A87443o0133p8469j70891L6541m9251N0762J14245j5253o3068j14036j13630
$$ 187443 127310 48841 -122050 -85509 -134760 -83998 30247 14994 -48074 -162110 -275740
20782b75740J71280M2931J4328J9653m8198M2582p1297k5274N5468q2730p7624
$$ -275740 -104460 -61529 -47201 -27548 -75746 -33164 -104461 -129735 -74267 -156997 -234621
20771b34621q8316j2312J24176Q6307N1840r0737L1758N4678J803O386n8693R3079
$$ -234621 -322937 -335249 -211073 -124766 -72926 -163663 -131905 -77227 -75424 -69038 -127731 -34652
20759c4652Q4173n482M7211j6145o4268P7195O322L0505j04371k3079J08927p7536
$$ -34652 49521 44039 91250 75105 10837 88032 94354 124859 20488 -2591 106336 28800
20747B8800q9174M0887j2187r7451K5225l7377j7008Q5075N4587m478L3744P6936
$$ 28800 -60374 -19487 -31674 -129125 -103900 -141277 -158285 -73210 -18623 -23101 10643 87579
20735H7579O4502k29582m7378j09695J9691K38694L419j19762p1608j7138j9765
$$ 87579 152081 -77501 -124879 -234574 -214883 23811 27230 -92532 -164140 -181278 -201043
20724b01043R8592M4478j1909J01015N5538L2793j2303M0621r1330j1838j8778
$$ -201043 -102451 -57973 -69882 31133 86671 119464 107161 147782 56452 44614 25836
20713B5836J3570J5515l2616L3107q6663L2045P7469m1518o9639K3479M4528L0334
$$ 25836 39406 54921 22305 55412 -31251 794 78263 36745 -32894 -9415 35113 65447
20701F5447l5451j06756j52824P9422J95731J56534o8634r2794k3139k7463n6532
$$ 65447 29996 -76760 -229584 -150162 45569 202103 133469 40675 17536 -9927 -66459
20690f6459m3460J80444M8777J3205j44N5063r1438k8455q5745N7009K208P9628
$$ -66459 -109919 70525 119302 132507 132363 187426 95988 67533 -18212 38797 41005 120633
20678A20633o2683m6412j26984j7810r1846J0957P4855M7909K25086L6992j68843
$$ 120633 57950 11538 -115446 -133256 -225102 -214145 -139290 -91381 133705 170697 1854
20667A854j9206J9569k9714n3816r85Q442J8661K116N2929O715M3328Q9610q3030
$$ 1854 -17352 2217 -27497 -81313 -82298 -73856 -55195 -53079 -150 6565 49893 139503 56473
20654E6473j42993j5664N0933m2742p3283J4604M3765k7972J21480P3013J522
$$ 56473 -86520 -102184 -51251 -93993 -167276 -152672 -108907 -136879 -15399 57614 59136
20643E9136K9015N2008o2654l2339m6463r4261j17989L9563j4995J54255J71251
$$ 59136 88151 140159 77505 45166 -1297 -95558 -213547 -173984 -188979 -34724 136527
20632A36527l1505K3406L9191j45478j18169q0642J12095j00737M0032L2866J14600
$$ 136527 105022 128428 167619 22141 -96028 -176670 -64575 -165312 -125280 -92414 22186
20621B2186J52271L8246r6663o7881M0137N7364o2606m7156m8619k8669R3069
$$ 22186 174457 212703 116040 48159 88296 145660 83054 35898 -12721 -41390 51679
20610E1679M170o1148j19774q4235P5581Q5974k5203n1579K6631L9038j30762
$$ 51679 55849 -5299 -125073 -209308 -133727 -47753 -72956 -124535 -97904 -58866 -189628
20599a89628M6304N6013j3148O780R738r9849n5809N218O8495M5504O8242p5143
$$ -189628 -143324 -87311 -100459 -93679 -83941 -183790 -239599 -234381 -165886 -120382 -52140 -127283
20587a27283j14560J27952n602q6558N8292j09739M5281L769Q0099N3417N0260
$$ -127283 -241843 -113891 -119493 -206051 -147759 -257498 -212217 -208448 -128349 -74932 -24672
20576b4672R1113K37828J03663k8110j23516j28760r6782k8638P8476K5394j7884
$$ -24672 66441 304269 407932 379822 256306 127546 30764 2126 80602 105996 88112
20565H8112M256m4765n8019r4596N2346J2952J11282j36116p5089k3156R9856
$$ 88112 92368 47603 -10416 -105012 -52666 -39714 71568 -64548 -139637 -162793 -62937
20554f2937J550M5921J08282M4124r549j95588n8841j1876K2302l2757O3111L9776
$$ -62937 -61387 -15466 92816 136940 127391 -68197 -127038 -138914 -116612 -149369 -86258 -46482
20542d6482k0232n1637Q5389J02236J95203o8608J1923r0282m2000o4896q4222
$$ -46482 -66714 -118351 -32962 69274 264477 195869 207792 117510 75510 10614 -73608
20531g3608O832J59785L1061j8896m9903j0358K1005O7673j25848j53306k8370
$$ -73608 -66776 93009 124070 105174 55271 44913 65918 133591 7743 -145563 -173933
20520a73933N1011J1566j13035r8387l11o9175J01987N3045m9586O1280J1540
$$ -173933 -122922 -111356 -224391 -322778 -323089 -392264 -290277 -237232 -286818 -225538 -213998
20509b13998J54345M0294o4977j995M8426P1197o6321q7102K0695j3342n6149
$$ -213998 -59653 -19359 -84336 -86331 -37905 33292 -33029 -120131 -99436 -112778 -168927
20498a68927M0153o5498K6607J38289O114o6414L8811J21662o2895j04785o4410
$$ -168927 -128774 -194272 -167665 -29376 -23262 -89676 -50865 70797 7902 -96883 -161293
20487a61293K7077m4184j7546P0111p7549P7785K7630J08614J51784L4171K593
$$ -161293 -134216 -178400 -195946 -125835 -203384 -125599 -97969 10645 162429 196600 199193
20476A99193o1869j86674j86945l1457n4815O7k2452o2566J86683O4506k8879
$$ 199193 137324 -49350 -236295 -267752 -322567 -322500 -344952 -407518 -220835 -156329 -185208
20465a85208P8653L1084M3811O7398q2276o1262J01510J35642j41443j00658n7860
$$ -185208 -106555 -75471 -31660 35738 -46538 -107800 -6290 129352 -12091 -112749 -170609
20454a70609O1661N324J15233O0272n1581j07930l858J45095L8338q1656q3263
$$ -170609 -108948 -103624 11609 71881 20300 -87630 -91488 53607 91945 10289 -72974
20443g2974j9858J09027J3939o6564j04346o996q9574l3754R4160P2812J81244
$$ -72974 -92832 16195 30134 -36430 -140776 -147772 -237346 -271100 -176940 -104128 77116
20432G7116J658J740q4030L9803J07220l4334j37149K3467m6533q6941M6099J0097
$$ 77116 78774 80514 -3516 36287 143507 109173 -27976 -4509 -51042 -137983 -91884 -81787
20420h1787M35l635m1726J82622M2067P1275J07306j15178j20834o6569j12503
$$ -81787 -81352 -84987 -126713 55909 97976 169251 276557 161379 40545 -26024 -138527
20409a38527N1487m2850j3441K709l483n2283m7929L9343P3111L0493j11098o3839
$$ -138527 -87040 -129890 -143331 -140622 -144105 -196388 -244317 -204974 -131863 -101370 -212468 -276307
20397b76307J09505R3702J54747m2392o2321q6465p8169L6783o820k9994Q6981
$$ -276307 -166802 -73100 81647 39255 -23066 -109531 -187700 -150917 -157737 -187731 -100750
20386a00750L2131J11578j00315J4347J61731K143j7383L2820p0176p5910o6006
$$ -100750 -68619 42959 -57356 -43009 118722 120865 103482 136302 66126 -9784 -75790
20375g5790Q0082m3439o0509k8800P1500J17655M3436J7490j3247O8792q750j58098
$$ -75790 4292 -39147 -99656 -128456 -56956 60699 104135 121625 108378 177170 168420 10322
20363A0322m3111K185k8460P8291N4080P7627P9617k10125k96069J33160J64659
$$ 10322 -32789 -30604 -59064 19227 73307 150934 230551 20426 -275643 -142483 22176
20352B2176O8222O596Q166J1821n8115q7492j34442j01426K854K6P8841O0552
$$ 22176 90398 96994 105160 116981 58866 -28626 -163068 -264494 -261640 -261614 -182773 -122221
20340a22221K9894p311m6013L9627K3594j2479l0799r0401K8697K18470P0468
$$ -122221 -92327 -99638 -145651 -106024 -82430 -94909 -125708 -216109 -187412 31058 101526
20329A01526n540k7427k7676m9628j10672L2320O7920N3174j97922j29204P4630
$$ 101526 95986 68559 40883 -8745 -119417 -87097 -19177 33997 -163925 -293129 -218499
20318b18499K45109N4206l9142O29P9060M6479j9352L2585J2802K2702M4406L889
$$ -218499 26610 80816 41674 42303 121363 167842 148490 181075 193877 216579 260985 264874
20306B64874j76058j39632O3708P3306J23138q4836j20566Q5998N7907J96013
$$ 264874 88816 -50816 12892 86198 209336 124500 3934 89932 147839 343852
20296C43852p9648j08092r0231m9304j27081j89815m5908L4297J16457R9714P318
$$ 343852 264204 156112 65881 16577 -110504 -300319 -346227 -311930 -195473 -95759 -88441
20285h8441Q7741l5584j4219J8156m423q2943P0008n298j46461m5776q154L0568
$$ -88441 -700 -36284 -50503 -32347 -36770 -119713 -49705 -55003 -201464 -247240 -255394 -224826
20273b24826J18228J11136K1810p4838R519J97632N5845j02211j3466l4852k9846
$$ -224826 -106598 4538 26348 -48490 -38971 158661 214506 112295 98829 63977 34131
20262C4131J0023p1126j2796P1315l6576m7525k003j00169o9515l3741O8762J62465
$$ 34131 44154 -26972 -39768 31547 -5029 -52554 -54557 -154726 -224241 -257982 -189220 -26755
20250b6755q4389l0093K16941o8551l9951k3758q1384J3884J29373Q2600j0766
$$ -26755 -111144 -141237 75704 7153 -32798 -56556 -137940 -124056 5317 87917 77151
20239G7151n6382Q2272L197m3194J8457O6748P429k05865j36817J1870J12298
$$ 77151 20769 103041 106238 63044 81501 148249 155678 -50187 -187004 -175134 -62836
20228f2836N9335K8345l1602N4199R8373Q6756j38240j4623o8276N551j48754
$$ -62836 -3501 24844 -6758 47441 145814 232570 94330 79707 11431 16982 -131772
20217a31772Q6121J32762o3990L6201M0274j68083k1091M4095j03108j09403P9914
$$ -131772 -45651 87111 23121 59322 99596 -68487 -89578 -45483 -148591 -257994 -178080
20206a78080J16765J5178p1225J12230K7184l7674N9637R7873L922j04104p7697
$$ -178080 -61315 -46137 -117362 -5132 22052 -15622 44015 141888 145810 41706 -35991
20195c5991k349P036n2203j14816k1766J27701K622m7267p3006J5825K7869r3279
$$ -35991 -38340 -31304 -83507 -198323 -220089 -92388 -89766 -137033 -210039 -194214 -166345 -259624
20183b59624M7653M3064k1070k7681J3551J47619k1771m2973L8791n2508n8608
$$ -259624 -211971 -168907 -189977 -217658 -204107 -56488 -78259 -121232 -82441 -134949 -193557
20172a93557R6802J08721r677L9363p498j73336j62789l1256r4141N45J25272
$$ -193557 -96755 11966 2289 41652 34154 -139182 -301971 -333227 -427368 -426823 -301551
20161c01551J51495K5866J3262J5036j57496N3720K04775l533R5264O6700n3624
$$ -301551 -150056 -124190 -110928 -95892 -253388 -199668 5107 1574 96838 163538 109914
20150A09914P2915N3208j81039k6190m5285J8812k2505P726o0007j90512P2798
$$ 109914 182829 236037 54998 28808 -16477 2335 -20170 -12444 -72451 -262963 -190165
20139a90165J93953o3003j7823j7255J16695L5374O1448o8073l3726p2182n0654
$$ -190165 3788 -59215 -77038 -94293 22402 57776 119224 51151 17425 -54757 -105411
20128a05411L4980J6555m491m6621q1819r0741L0158O4877Q5598r1867k0191J63271
$$ -105411 -70431 -53876 -58367 -104988 -186807 -277548 -247390 -182513 -96915 -188782 -208973 -45702
20116d5702P8752n0881j0848J56306Q5484j97363j84013j5596J0578K3622J39799
$$ -45702 33050 -17831 -28679 127627 213111 15748 -168265 -183861 -173283 -149661 -9862
20105i862J12178K6432M71o7747j9276J4543J04521j98486l2940O576o0612n152
$$ -9862 102316 128748 129219 61472 42196 56739 161260 -37226 -70166 -63590 -124202 -129354
20093a29354p930J38188J8738p2036M1144m1202j28832K9829J90140m0467n8516
$$ -129354 -137284 904 19642 -52394 -11250 -52452 -181284 -151455 38685 -1782 -60298
20082f0298K8646n3401P49l281j16499l7301n7769P9917J45003k8613N8198K1624
$$ -60298 -31652 -85053 -84304 -87585 -204084 -241385 -299154 -219237 -74234 -102847 -44649 -23025
20070b3025R3635r102k0804j8481J03724N4681l6803o2915q8664K6815J28598
$$ -23025 70610 61508 40704 22223 125947 180628 143825 80910 -7754 19061 147659
20059A47659n2825l8171Q4637l3181j3248j55094o9411j2164o5332j13874P8639
$$ 147659 94834 56663 141300 108119 94871 -60223 -129634 -141798 -207130 -321004 -242365
20048b42365J21225o1268K4652J4244P8101o3205j41941J9765P5197k3263L0007
$$ -242365 -121140 -182408 -157756 -143512 -65411 -128616 -270557 -250792 -175595 -198858 -168851
20037a68851O6461o1648L8838R5942J83857p4413m3266Q8898O3639j3802m8088
$$ -168851 -102390 -164038 -125200 -29258 154599 80186 36920 125818 189457 175655 127567
20026A27567j24252m1607l8312p022J64413J47407j00681r4207O2947j01726j3985
$$ 127567 3315 -38292 -76604 -83626 80787 228194 127513 33306 96253 -5473 -19458
20015a9458l5872O4147N1214j8768j20194n926K0685J08329Q0943J17572p7856
$$ -19458 -55330 8817 60031 41263 -78931 -84857 -64172 44157 125100 242672 164816
20004A64816N5606m8154j80862K2031p0007m2988p6741O3739K33565J2810j29772
$$ 164816 220422 172268 -8594 13437 -56570 -99558 -176299 -112560 121005 133815 4043
19993D043K0411K18388r3711n4924R0864M821N946P08k7382j35517p2932M0231
$$ 4043 24454 242842 149131 94207 185071 189892 195838 196546 169164 33647 -39285 946
19981I46J9546p1525p4400q289L1429j1379q570Q518m6391j4117l1076n2071J00538
$$ 946 20492 -51033 -125433 -133722 -102293 -113672 -122242 -113724 -160115 -174232 -205308 -257379 -156841
19968a56841K03840P3837j88376j19168M4620J53950L9019q9676j59391p7285
$$ -156841 46999 120836 -67540 -186708 -142088 11862 50881 -38795 -198186 -275471
19958b75471l9892R1963P1420l2036j4517J41876Q1408J3681J4552P357L8660
$$ -275471 -315363 -223400 -151980 -184016 -198533 -56657 24751 38432 52984 60341 99001
19947I9001j1260J49352j7014j35929n9291J97n5858L9328l5436J3448L3675k4865
$$ 99001 87741 237093 220079 84150 24859 25056 -30802 8526 -26910 -13462 20213 -4652
19935d652M1508L4768j28246n7530m3108k811K4829O3729J94033k1972r7746N738
$$ -4652 36856 71624 -56622 -114152 -157260 -160071 -135242 -71513 122520 100548 2802 8540
19923H540k5581N5988M5285r2778o1009J9365r6327k7406m4300K5374K01272n2698
$$ 8540 -17041 38947 84232 -8546 -69555 -50190 -146517 -173923 -218223 -192849 8423 -44275
19911d4275J684q789r556M8685j12422m7639Q9719l4709K2942k9878n2624M3707
$$ -44275 -42591 -51380 -60936 -12251 -124673 -172312 -82593 -117302 -94360 -124238 -176862 -133155
19899a33155O0798J89156N8536q4975j74108q0694J14371R0702j05831l3096J145
$$ -133155 -72357 116799 175335 90360 -83748 -164442 -50071 40631 -65200 -98296 -97151
19888i7151J2419L1555k1028N7452m760K9407L5492l8659o4744J39669J15183
$$ -97151 -84732 -53177 -74205 -16753 -21513 7894 43386 4727 -60017 79652 194835
19877A94835q3071k41127p440P7153J0999N4515l6329p1844J9613J25775k4492
$$ 194835 111764 -129363 -136803 -59650 -48651 5864 -30465 -102309 -82696 43079 18587
19866A8587m9900j77590L3355K65711P0919l6267r970n012M106J8753p1469q8783
$$ 18587 -31313 -208903 -175548 90163 161082 124815 114845 109833 113939 132692 61223 -27560
19854b7560r0606m3740J28131K01610M9225m326M2795j64540j82248L371M1330
$$ -27560 -118166 -161906 -33775 167835 217060 212734 255529 90989 -91259 -87888 -46558
19843d6558R7347L0902P3317J11465j14790o5723j8007L1532J84675j00685q1997
$$ -46558 50789 81691 155008 266473 151683 85960 67953 99485 284160 183475 101478
19832A01478j2975r2231p5265O4j05606o8655l132j27434N5506J54444O1638N2840
$$ 101478 88503 -3728 -78993 -78929 -184535 -253190 -256322 -383756 -328250 -173806 -112168 -59328
19820e9328J33493J62687n4689p8415K715l7752j04574j9234k3634n11j639K07
$$ -59328 74165 236852 182163 103748 106463 68711 -35863 -55097 -78731 -79242 -80881 -80674
19808h0674j3088P2736k6278j05619M5776n961J8004r970j24993m6964J27497
$$ -80674 -93762 -21026 -47304 -152923 -107147 -113108 -95104 -105074 -230067 -277031 -149534
19797a49534Q5837J30454O6643j8513m6018J06976j09708j23516k2997J67510
$$ -149534 -63697 66757 133400 114887 68869 175845 66137 -57379 -80376 87134
19787H7134J33072o9974m2330Q70j01589o8723o4984r7857J8187K61136K30967
$$ 87134 220206 150232 107902 108772 7183 -61540 -126524 -224381 -206194 54942 285909
19776B85909l6916o9313o5246p9298j01334K430K9820p199r1942j42N1494K1337
$$ 285909 248993 179680 114434 35136 -66198 -63768 -33948 -41147 -133089 -133231 -81737 -60400
19764f0400p6794P037q3887J3738j8887Q4652J84852K18105K9625n8237j67509
$$ -60400 -137194 -130157 -214044 -200306 -219193 -134541 50311 268416 298041 239804 72295
19753G2295p0196j6725N8607J8283M5250K3419j17441j86474k2841n505K15196
$$ 72295 2099 -14626 43981 62264 107514 130933 13492 -172982 -195823 -201328 13868
19742A3868J02111K3460j72390j68217L2658J51816j4429l569o1451l1040j54967
$$ 13868 115979 139439 -32951 -201168 -168510 -16694 -31123 -34692 -96143 -127183 -282150
19731b82150J80155L7969m1081K4829k3936P9976m644J2136m5329L4799j6330
$$ -282150 -101995 -64026 -105107 -80278 -104214 -24238 -28882 -16746 -62075 -27276 -43606
19720d3606o9267J33180J32655k7815l1511R7936k1423j50614j10532O7835L2080
$$ -43606 -112873 20307 152962 125147 93636 191572 170149 19535 -90997 -23162 8918
19709H918j6504J15843l8027l1864l0092N8592o2579N2595R0443J9278L7381O171
$$ 8918 -7586 108257 70230 38366 8274 66866 4287 56882 147325 166603 203984 210155
19697B10155j00399Q9257J8630j80856n8050n298p2685L5582j4999n3166J2568
$$ 210155 109756 199013 217643 36787 -21263 -26561 -99246 -63664 -78663 -131829 -119261
19686a19261k7777j2303N3337J23316R2645k9348p1911j31348n2603J60199O9442
$$ -119261 -147038 -159341 -106004 17312 109957 80609 8698 -122650 -175253 -15054 54388
19675E4388R2590O1679j4525p8439J6135L2297r1281q2292R639j5192L5689J11363
$$ 54388 146978 208657 194132 115693 131828 164125 72844 -9448 191 -15001 20688 132051
19663A32051L9152o8349Q7938N3197j03839j11824j29319j08455J465n553J18010
$$ 132051 171203 102854 190792 243989 140150 28326 -100993 -209448 -207983 -213536 -95526
19652i5526J1967J76876J62640m0645j37880l1474j46939j91912L2496J44430
$$ -95526 -83559 93317 255957 215312 77432 45958 -100981 -292893 -260397 -115967
19642a15967P7855p9244K7889J13870m4813j41515L0676P5980j44m7700L2551
$$ -115967 -38112 -117356 -89467 24403 -20410 -161925 -131249 -55269 -55413 -103113 -70562
19631g0562P864Q4593J38522J66569j5719l4511o779m4359j82841r4645j00726
$$ -70562 -62698 21895 160417 326986 311267 276756 269977 225618 42777 -51868 -152594
19620a52594L1229M2635J40n3678J27984M9740r5638p686L4153J00454j12029
$$ -152594 -121365 -78730 -78590 -132268 -4284 45456 -50182 -57868 -23715 76739 -35290
19609c5290k2529L5966J45369l0730l8707P1888k9885J08630j35j00895p9193
$$ -35290 -57819 -21853 123516 92786 54079 125967 96082 204712 204577 103682 24489
19598B4489J9089l5412J8134J2457j9322l6261k1074o0349p5901P4215J4850P0087
$$ 24489 43578 8166 26300 38757 19435 -16826 -37900 -98249 -174150 -99935 -85085 -14998
19586a4998K7649n1143n1375L9463L9649J4969q2877q3923j33573J7734P2999
$$ -14998 12651 -38492 -89867 -50404 -10755 4214 -78663 -162586 -296159 -278425 -205426
19575b05426Q3029p5091l0239p8480J30245J85174j58042K2974K01086K0722o2925
$$ -205426 -122397 -197488 -227727 -306207 -175962 9212 -148830 -125856 75230 95952 33027
19564C3027r6357K0690P7355J39399l0258j20121N2175K06715R300q6743j95908
$$ 33027 -63330 -42640 34715 174114 143856 23735 75910 282625 291925 205182 9274
19553I274r1536O542P8749J73981L2814L9478j9988j05587O5221L4056o5092L9882
$$ 9274 -82262 -75720 3029 177010 209824 249302 229314 123727 188948 223004 157912 197794
19541A97794K09420K33988K61524Q2859Q8914j3132p4949k21504j90601n745R3939
$$ 197794 407214 641202 902726 985585 1074499 1061367 986418 764914 574313 568568 662507
19530F62507M3368J40459O8024o721O9205J31877P3987J2916p6971k74362k15157
$$ 662507 705875 846334 914358 907637 976842 1108719 1182706 1195622 1118651 844289 629132
19519F29132k6060j30589r7158O2250R6544p1639j34237j22170L1515M6852p4215
$$ 629132 603072 472483 375325 437575 534119 462480 328243 206073 237588 284440 210225
19508B10225P7230N2499o8160l7488j24660J16175K7475q8434l8072j22508j25605
$$ 210225 287455 339954 271794 234306 109646 225821 253296 164862 126790 4282 -121323
19497a21323J16500P080M1041k3423o991L9959K3253J08084j47197l8882j49083
$$ -121323 -4823 2257 43298 19875 12884 52843 76096 184180 36983 -1899 -150982
19486a50982j41712J41083N8476K4479l4816m7398O6171J2120M6501Q2209K3557
$$ -150982 -292694 -151611 -93135 -68656 -103472 -150870 -84699 -72579 -26078 56131 79688
19475G9688J13905j29620N4308p901q5432J0353o87r6107j24686J63920O6166
$$ 79688 193593 63973 118281 110380 24948 35301 34614 -61493 -186179 -22259 43907
19464D3907K5666p3825p7932J47680j5286K1188l9533j69324l1217O0663L0317
$$ 43907 69573 -4252 -82184 65496 50210 71398 31865 -137459 -168676 -108013 -77696
19453g7696j7433J73168n851j82232j69776M8332K43771J26802k9838n4406P7517
$$ -77696 -95129 78039 72188 -110044 -279820 -231488 12283 139085 109247 54841 132358
19442A32358O0270p0617j2834K7313p0951l1740J17344q9284J8252L6248N5169
$$ 132358 192628 122011 109177 136490 65539 33799 151143 61859 80111 116359 171528
19431A71528P4450j0917r0403j05920k8086K8465J4769j651J27444j9370r2199
$$ 171528 245978 235061 144658 38738 10652 39117 53886 52235 179679 160309 68110
19420F8110M0754J16585o9412j7099j27829k9545q034o486J3081O6810K8060Q0001
$$ 68110 108864 225449 156037 138938 11109 -18436 -26470 -32956 -19875 46935 74995 154996
19408A54996P1014J14561Q393j21968m6466n3966m4589R0109O8125o941k9215
$$ 154996 226010 340571 348964 226996 180530 126564 81975 172084 240209 233268 204053
19397B04053j82876q2834K5238K5620j03162j48325q9405J00761R7329m7061K6222
$$ 204053 21177 -61657 -36419 -10799 -113961 -262286 -351691 -250930 -153601 -200662 -174440
19386a74440k2198L9534Q8084Q7571P2526Q9303N2595m313K9401r3823q1287J62
$$ -174440 -196638 -157104 -69020 18551 91077 180380 232975 228662 258063 164240 82953 83115
19374H3115q5716O536J41147K19228j1450m8050j78198j3258P3524o5945k3767
$$ 83115 -2601 3935 145082 364310 352860 304810 126612 113354 186878 120933 97166
19363I7166P4380J40760K9291k40828Q2879l1194n6194j9319J07166L4752O2360
$$ 97166 171546 312306 341597 100769 183648 152454 96260 76941 184107 218859 281219
19352B81219n0983j45297j4068N918O9123M5158p7824q4002j6489N7384j09935
$$ 281219 230236 84939 70871 76789 145912 191070 113246 29244 12755 70139 -39796
19341c9796j42109R846P443n827J23974J0924n7423J9635L195p5190K7995R6390
$$ -39796 -181905 -172059 -164616 -170443 -46469 -35545 -92968 -73333 -70138 -145328 -117333 -20943
19329b0943N9921J0422l8361m140Q8335n507L1398j52377k6959j6095o7842J28391
$$ -20943 38978 49400 11039 6899 95234 89727 121125 -31252 -58211 -74306 -142148 -13757
19317a3757Q4336M3883k4893o7344q969j23907j06371o2807J21991J75501J48202
$$ -13757 70579 114462 89569 22225 13256 -110651 -217022 -279829 -157838 17663 165865
19306A65865J31974L1268j19998j64211J8547l6667p5113J26240J88049K33096
$$ 165865 297839 329107 209109 44898 63445 26778 -48335 77905 265954 499050
19296D99050P9748j7146K0103O7158J78552K8156q2490M3008n2796j27505k32659
$$ 499050 578798 561652 581755 648913 827465 855621 773131 816139 763343 635838 403179
19285D03179l43799j15415J42255J34237J20694m4975k6137j30995n2900P1414
$$ 403179 59380 -56035 86220 220457 341151 296176 270039 139044 86144 157558
19275A57558p4560K9409N993J0280Q523o269p4141J4698J2939N090O7907j9311
$$ 157558 82998 112407 118400 128680 137203 130934 56793 71491 84430 89520 157427 138116
19263A38116q3519j40507J84922K13006K4637j6584J11983L333k2231M2800j02328
$$ 138116 54597 -85910 99012 312018 336655 320071 432054 435387 413156 455956 353628
19252C53628j0181k6158j23562q703l5868M9383p8313N346J78206j0668p7053
$$ 353628 343447 317289 193727 185024 149156 198539 120226 125572 303778 293110 216057
19241B16057k5496K7318L0036L7163J23611N6006j10825n1446m9491J6943K1627
$$ 216057 190561 217879 247915 285078 408689 464695 353870 302424 252933 269876 291503
19230B91503j36334k09814J32787K44733K011j9386M390M672J1053Q2217J0296
$$ 291503 155169 -54645 78142 322875 324886 305500 309890 314562 325615 407832 418128
19219D18128p8687M6046l4264N6359P9439j32673j27321M0549m9965L1582P6204
$$ 418128 339441 385487 351223 407582 487021 354348 227027 267576 217611 249193 325397
19208C25397J7092O6898l5720r2453K7790k4349l8452j69557j20165o4359Q1153
$$ 325397 342489 409387 373667 281214 309004 284655 246203 76646 -43519 -107878 -26725
19197b6725J70919J13468K58040M7866m3476r8449K0086L8309J02281J5252j51472
$$ -26725 144194 257662 515702 563568 520092 421643 441729 480038 582319 597571 446099
19186D46099j47276p1240r9954j26416P342n3938M4488R1213J14906j6018q0801
$$ 446099 298823 227583 127629 1213 8555 -45383 -895 90318 205224 189206 108405
19175A08405n5628L8724J4757L9555L6216O967J33587j9856r1144j71483P3922
$$ 108405 52777 91501 106258 145813 182029 188996 322583 302727 211583 40100 114022
19164A14022P4785l5394J0663K4853m9192L9842J15146j887p8044R2895L8455
$$ 114022 188807 153413 164076 188929 139737 179579 294725 292838 214794 307689 346144
19153C46144n0263j24745q7215N302Q0040N9401L5202P6344k8130k31315O8210
$$ 346144 295881 171136 83921 89223 169263 228664 263866 340210 312080 80765 148975
19142A48975J87995J17791M3810Q5695K32581L53924O79350P50005O46863M10389
$$ 148975 336970 454761 498571 584266 816847 1170771 1850121 2600126 3246989 3657378
19132C657378L19913P2155j23571m04645p13720o04518j95157K4921M50714O38522
$$ 3657378 3977291 4049446 3925875 3521230 2807510 2202992 2007835 2032756 2483470 3121992
19122C121992N45375O04126N18230K50567k37116o53873p96878q45830n90512
$$ 3121992 3667367 4271493 4789723 5040290 4803174 4149301 3352423 2506593 1916081
19113A916081k94378k06702k15574j40201l5470j0283p3710k10661J04548Q6438
$$ 1916081 1621703 1415001 1199427 1059226 1023756 1013473 939763 729102 833650 920088
19103I20088j43404J30j49062p3381O7711k0821j73302J24088K18001n1827j66773
$$ 920088 776684 776814 627752 554371 622082 601261 427959 552047 770048 718221 551448
19092E51448j32268J5513P7648q992k8148j19895j20514r2463J19730j7060J05655
$$ 551448 419180 434693 512341 503349 475201 355306 234792 142329 262059 244999 350654
19081C50654J50149p7666r4167n5300p0683P7915K7410m2397O3529Q3832M3313
$$ 350654 500803 423137 328970 273670 202987 280902 308312 265915 329444 413276 456589
19070D56589M2847J4312m3344k2188J35064J54352J57640J21535p9249L6261J36244
$$ 456589 499436 513748 470404 448216 583280 737632 895272 1016807 937558 973819 1110063
19059A110063J19768j05439j76059n3129K6150M8413l4977j18398J4793J92472
$$ 1110063 1229831 1124392 948333 895204 921354 969767 934790 816392 831185 1023657
19049A023657J34524R2301L4079j08629l7597j52962m638J99178O0501N0360J59281
$$ 1023657 1158181 1250482 1284561 1175932 1138335 985373 980735 1179913 1240414 1290774 1450055
19038A450055L01315K25237L55681K84350K87632L18062M32031N82434O16234
$$ 1450055 1751370 1976607 2332288 2616638 2904270 3222332 3654363 4236797 4853031
19029D853031M18044K79660P7632L97625K85323m1799L29125R88635J011885P76946
$$ 4853031 5271075 5550735 5628367 6025992 6311315 6269516 6598641 7587276 8599161 9376107
19019I376107O16902Q12969Q86337J082739J700493K647119L722738N172943P375985
$$ 9376107 9993009 10805978 11692315 12775054 14475547 17122666 20845404 26018347 33394332
19010C3394332J1655769J9618931L4989677N9850150Q3277232P9731901N2593065
$$ 33394332 45050101 64669032 99658709 159508859 242786091 322517992 375111057
19003C75111057K2964007J0571198R08048p3591669j23383270p2080421l6686232
$$ 375111057 398075064 408646262 409554310 335962641 212579371 140498950 103812718
18996A03812718k1910141j3689790q818847o245712m657852l693137l121363l024244
$$ 103812718 81902577 68212787 59393940 53148228 48490376 44797239 41675876 38651632
18988C8651632k907538k669703k649460k895608l143718k659222k026565j434002
$$ 38651632 35744094 33074391 30424931 27529323 24385605 21726383 19699818 18265816
18980A8265816j308284j213157j135330r03203j167301j342498j045081p49819
$$ 18265816 16957532 15744375 14609045 13705842 12538541 11196043 10150962 9401143
18972I401143o61511q06958o71063m92521m01590k71759l82295l89371k79248
$$ 9401143 8739632 7932674 7261611 6769090 6367500 6095741 5713446 5324075 5044827
18963E044827j33095j41848l01918l64092j46728K148j21765j45669j8574j56196
$$ 5044827 4911732 4769884 4467966 4103874 3957146 3959294 3837529 3691860 3673286 3517090
18953C517090l44040k44688p3272j67524n6245j35k21075o6724M4013q7032j36898
$$ 3517090 3173050 2928362 2855090 2687566 2631321 2631186 2410111 2343387 2387400 2300368 2163470
18942B163470p2510o2328n6770j05185K8344L1226p6400k47465j77326R0826P8391
$$ 2163470 2090960 2028632 1971862 1866677 1895021 1926247 1849847 1602382 1425056 1515882 1594273
18931A594273j27651m409l4108o0623n4783p8027Q3990o9773m2282N1005M21j38755
$$ 1594273 1466622 1462213 1428105 1367482 1312699 1234672 1318662 1248889 1206607 1257612 1258033 1119278
18919A119278m1292K4109K0350r344J63178J78082N0356P2007M16111L77148L9639
$$ 1119278 1077986 1102095 1122445 1113101 1276279 1454361 1504717 1576724 1992835 2369983 2409622
18908B409622J39481J97133n5578m01574m58859m28792k54524q2618K58316M27077
$$ 2409622 2549103 2746236 2690658 2289084 1830225 1401433 1146909 1064291 1322607 1749684
18898A749684L48878K49376n4671L0174N252j77976l83341k94705k91453j54202
$$ 1749684 2098562 2347938 2293267 2323441 2328693 2150717 1767376 1472671 1181218 1027016
18888A027016n2872j44870j09701q3064M5858Q2483p0636l382P503n4809j23199
$$ 1027016 974144 829274 719573 636509 682367 764850 694214 690832 698335 643526 520327
18877E20327m7326O7663J49884P8005j3959P2258k2149j23719N9838M7750m7092
$$ 520327 473001 540664 690548 768553 754594 826852 804703 680984 740822 788572 741480
18866G41480l5386n7838r522o1725n8349J08816M19704M38083M93431L14182K00424
$$ 741480 706094 648256 638734 577009 518660 627476 1047180 1485263 1978694 2292876 2493300
18855B493300P6090M7000N3036k91442n91765l44506r8768p7683J71298L22687
$$ 2493300 2569390 2616390 2669426 2377984 1786219 1441713 1342945 1265262 1436560 1759247
18845A759247L53534L92261J40769O6940n0128k60147o92563n64999l07622q4414
$$ 1759247 2112781 2505042 2645811 2712751 2662623 2402476 1709913 1144914 837292 752878
18835G52878p0603o1134m8424p292N6104j40463j62779j27328j45969J8250P2624
$$ 752878 682275 621141 572717 565425 621529 481066 318287 190959 44990 63240 135864
18824A35864O9131j4623m0161O9693J30373K2710J6526p6626m450p1981j39873
$$ 135864 204995 190372 150211 219904 350277 372987 389513 312887 308437 236456 96583
18813I6583q4897l4925k7527J2115J411o0303J01837J39946l9474k58878j30221
$$ 96583 11686 -23239 -50766 -38651 -37240 -97543 4294 144240 104766 -154112 -284333
18802b84333K2407J8158K09536K3428q359J49407p893r4366J7112M2201m5760
$$ -284333 -261926 -243768 -34232 -10804 -19163 130244 122351 27985 45097 87298 41538
18791D1538k47875n3581O7578O1932L37084K10984M2976o8475j02128m2443q4497
$$ 41538 -206337 -259918 -192340 -130408 206676 417660 460636 392161 290033 247590 163093
18780A63093J2404K2311J15328M2983j29185k22685J07071R8788m9938J14027
$$ 163093 175497 197808 313136 356119 226934 4249 111320 210108 160170 274197
18770B74197K61000L0527P7130N3348l7564j68831k16446j50833M6456J09734
$$ 274197 535197 565724 642854 696202 658638 489807 273361 122528 168984 278718
18760B78718j25879j15176K78N8693P6535p1876J5621J11038m5749N0530j13178
$$ 278718 152839 37663 37941 96634 173169 101293 116914 227952 182203 232733 119555
18749A19555j43716M9728N6540o8713J6136J66088J8725j5723j28093j24698o1182
$$ 119555 -24161 25567 82107 13394 29530 195618 214343 198620 70527 -54171 -115353
18738a15353j3548K7691J76494J09313r2949k0896p4155j94270o1748P9823J87969
$$ -115353 -128901 -101210 75284 184597 91648 70752 -3403 -197673 -259421 -179598 8371
18727H371M5942J1724P5787m0339J664O7335l6170k6871N5712n2306k1280r881
$$ 8371 54313 66037 141824 101485 103149 170484 134314 107443 163155 110849 89569 79688
18715G9688J5646q730K1181M9079J30879j18392j93025l3233M5173N4380j53264
$$ 79688 95334 86604 107785 156864 287743 169351 -23674 -56907 -11734 42646 -110618
18704a10618L6453Q3440j2496k0633j8933K3392l1330p3638J73858q061p0157
$$ -110618 -74165 9275 -3221 -23854 -42787 -19395 -50725 -124363 49495 41434 -28723
18693b8723M546j57093n6957o611J14622K02063R1942j71151q5531K56433Q6061
$$ -28723 -24177 -181270 -238227 -244838 -130216 71847 163789 -7362 -92893 163540 249601
18682B49601q9740j28235p1649j2628p2388k345P5522L2659l9847o0535K6738
$$ 249601 159861 31626 -40023 -52651 -125039 -127384 -51862 -19203 -59050 -119585 -92847
18671i2847m1083J06025j8004K7548N1662k1312o556J18333n4082l1237j1138
$$ -92847 -133930 -27905 -45909 -18361 33301 11989 5433 123766 69684 38447 27309
18660B7309J1567j00150R8247J68800m7177r6451l2224J38137L4435j18601k8152
$$ 27309 38876 -61274 36973 205773 158596 62145 29921 168058 202493 83892 55740
18649E5740J93960N669o9382m8256q2184q911j12568k9243n2389j23284j03947
$$ 55740 249700 255369 185987 137731 55547 46636 -65932 -95175 -147564 -270848 -374795
18638c74795J30238K85903M0443j51586O7672J18751K5793o9955r017j47379q7937
$$ -374795 -244557 41346 81789 -69797 -2125 116626 142419 72464 63447 -83932 -171869
18627a71869J3549m387J3911R3780J54018n5064K2407J23099L1735O3146L7172
$$ -171869 -158320 -162707 -148796 -55016 99002 43938 66345 189444 221179 284325 321497
18616C21497n4277o6281j21098r8440l0060P25j8152J138p4829m669O8287j11533
$$ 321497 267220 200939 79841 -18599 -48659 -47934 -66086 -64948 -139777 -144446 -76159 -187692
18604a87692M9610R1433P4247J03555L8377j85081j9188L7362O8655n1214M328
$$ -187692 -138082 -46649 27598 131153 169530 -15551 -34739 2623 71278 20064 24392
18593B4392m3488q5830m890J69273P7516J4460Q543M3284l8483r7319o3326j9886
$$ 24392 -19096 -104926 -109816 59457 136973 151433 159976 203260 164777 67458 4132 -15754
18581a5754P9105O8116q8381n3604K4354J11263n0877m8186J15035p2187j53897
$$ -15754 63351 131467 43086 -10518 13836 125099 74222 26036 141071 68884 -85013
18570h5013m653j01914J3801J64535K9648J2111j79880O682o2095O28J43874M9036
$$ -85013 -89666 -191580 -177779 -13244 16404 28515 -151365 -144683 -206778 -206150 -62276 -13240
18558a3240j24160J7406R7261k2081o879J15230L0614r1860J12912K09775l4803
$$ -13240 -137400 -119994 -22733 -44814 -51693 63537 94151 2291 115203 324978 290175
18547B90175j19525o0876k6662M0206P7975j69775j73264J6562Q9502J0613J74180
$$ 290175 170650 109774 83112 123318 201293 31518 -141746 -125184 -35682 -25069 149111
18536A49111J23133l3318O4264Q373j21053Q1488O7271n1627j01534k16369j57821
$$ 149111 272244 238926 303190 311563 190510 271998 339269 287642 186108 -30261 -188082
18525a88082q1867J45639M6903Q8636J27910J39198J44758L13187K99484L07471
$$ -188082 -269949 -124310 -77407 11229 139139 278337 423095 736282 1035766 1343237
18515A343237K31338M1037J21110K4167j68856n42786l60428j42672n6078j05373
$$ 1343237 1574575 1615612 1736722 1760889 1592033 1049247 688819 546147 490069 384696
18505C84696k74453r644M6738O8484L4740R3555j46509k30724M508l8552l5586
$$ 384696 110243 100599 147337 215821 250561 344116 197607 -33117 -28609 -67161 -102747
18494a02747N9760J22535J07664P7443N5964L8026r9145r8768N1164O798m5965
$$ -102747 -42987 79548 187212 264655 320619 358645 259500 160732 211896 218694 172729
18483A72729m5939o4078k2269R1912K60226K38776K47377K42749J6029j43605
$$ 172729 126790 62712 40443 132355 392581 631357 878734 1121483 1137512 993907
18473I93907p3580j55292j79213j65192n3485Q6642K26431K16526K41173Q7294
$$ 993907 920327 765035 585822 420630 367145 453787 680218 896744 1137917 1225211
18463A225211r917L8228k9040l32460m32843k97496r3606P8699J3343q1122l5572
$$ 1225211 1215294 1253522 1224482 892022 459179 161683 68077 146776 160119 78997 43425
18452D3425K1370N1292l486j0829k0952N0114r7261Q123J31679j5171J6162j30079
$$ 43425 64795 116087 112601 101772 80820 130934 33673 41796 173475 158304 174466 44387
18440D4387K3962k1848K0907P2963R9099k3193j13084J01467q536n7107j07730
$$ 44387 68349 46501 67408 140371 239470 216277 103193 204660 196124 139017 31287
18429C1287m9352o6807n0221M7531O8908J77139m2108J2853n5920j47950J971
$$ 31287 -18065 -84872 -135093 -87562 -18654 158485 116377 129230 73310 -74640 -72669
18418g2669j981R5960n3206p0708j56927j3140R4202J10461J8550N1906O3018
$$ -72669 -74650 21310 -31896 -102604 -259531 -272671 -178469 -68008 -49458 2448 65466
18407F5466j56679m3951J39282J44881n7881p2452n7764p9926n687N7698K0674
$$ 65466 -91213 -135164 4118 148999 91118 18666 -39098 -119024 -124711 -67013 -46339
18396d6339P0319j3898l4382M8986j11467L2312R1009J1161j72777J01431J79474
$$ -46339 23980 10082 -24300 24686 -86781 -54469 36540 47701 -125076 -23645 155829
18385A55829Q1175n46q0890o8230k11031j07892n4761R7791L7921r371O4225J16177
$$ 155829 237004 236458 155568 87338 -123693 -231585 -286346 -188555 -150634 -160005 -95780 20397
18373B0397K6605j31094n3995P5628J81241N8114J1965P2626n0437j4780r0494
$$ 20397 47002 -84092 -138087 -62459 118782 176896 188861 261487 211050 196270 105776
18362A05776l6840J3355o7844j72652M5483P9936j04152j05253Q2139O7085Q161
$$ 105776 68936 82291 14447 -158205 -112722 -32786 -136938 -242191 -160052 -92967 -84806
18351h4806M3818K0028j6148o7951J16475L0880k3162J7800J07200K9993O289
$$ -84806 -40988 -20960 -37108 -105059 11416 42296 19134 36934 144134 174127 180416
18340A80416j19105j52736o5834p4391L4017N9594R5323n7018j4462M9307J8521
$$ 180416 61311 -91425 -157259 -231650 -197633 -138039 -42716 -99734 -114196 -64889 -46368
18329d6368m6212J10147J77066p48k03853M883J15167J10953J09372m5907j42941
$$ -46368 -92580 17567 194633 193885 -9968 -5085 110082 221035 330407 284500 141559
18318A41559q4750P1038j6192j6187M2142l4358j38203j11828N7655Q9860J63444
$$ 141559 56809 127847 111655 95468 137610 103252 -34951 -146779 -89124 736 164180
18307A64180M9885j0925J9818l5414j6905j19299M3602r2286o8023o1919K2048
$$ 164180 214065 203140 222958 187544 170639 51340 94942 2656 -65367 -127286 -105238
18296a05238N4907J16185J26692R49j86942j43134N9856J13831P0134K1394R2481
$$ -105238 -50331 65854 192546 193495 6553 -136581 -76725 37106 107240 128634 221115
18285B21115r6772j1288R9599j0848j15525j39361m2004J06057q2844o5711k5853
$$ 221115 124343 113055 212654 201806 86281 -53080 -95084 10973 -71871 -137582 -163435
18274a63435n5628o096J11351J12304p7069n373N3387N3050j5458J8777l3123
$$ -163435 -219063 -225159 -113808 -1504 -78573 -83946 -30559 22491 7033 25810 -7313
18263g313R0720J1199m0489N7042M2249p7875q5991j35604Q2445K15789J8149
$$ -7313 83407 94606 54117 111159 153408 75533 -10458 -146062 -63617 152172 170321
18252A70321o1346n8670n8243L9945J26929m906J438j03497m6493n8298K1686
$$ 170321 108975 50305 -7938 32007 158936 154030 155468 51971 5478 -52820 -31134
18241c1134J14112J35168q367j76865n00M7648j12665m7775R9605K3253m1469
$$ -31134 82978 218146 209779 32914 32414 80062 -32603 -80378 19227 42480 1011
18230A011N6Q0966j1719J44249j14397j8475R044L0387N1700m1568o7081l6212
$$ 1011 1067 82033 70314 214563 100166 81691 90735 121122 172822 131254 64173 27961
18218B7961k33216J27705J83604p4138P00n1138n8754l6014J32880J18663O6112
$$ 27961 -205255 -77550 106054 31916 32616 -18522 -77276 -113290 19590 138253 204365
18207B04365n3347j53998j34285J6447J35060n8105k8937k8334R2727M0755q615
$$ 204365 151018 -2980 -137265 -120818 14242 -43863 -72800 -101134 -8407 32348 23733
18196B3733P2665P8059q865j09555j6646K9012m3635J43653L0369j50037n8380
$$ 23733 96398 174457 165592 56037 39391 68403 24768 168421 198790 48753 -9627
18185i627J63961Q1925j09403p4635K3726P3397Q3941L3169p5299j43933o4326
$$ -9627 154334 236259 126856 52221 75947 149344 233285 266454 191155 47222 -17104
18174a7104j0209M8646R9035k568j0410R4007q9642j4721l2888J69312P8063L4461
$$ -17104 -27313 21333 120368 117800 107390 201397 111755 97034 64146 233458 311521 345982
18162C45982j22766r6923L1255L8438R9p7689J03527O8110O6306J0311K8754m0847
$$ 345982 223216 126293 157548 195986 196085 118396 221923 290033 356339 366650 395404 354557
18150C54557l685L6865J0642K44103L04260M05069M62614L09757K78175K73296
$$ 354557 350872 387737 398379 642482 946742 1351811 1814425 2124182 2402357 2675653
18140B675653K3548o0877n44440n24413k34642j28160P9536L0794J00356J287
$$ 2675653 2699201 2638324 2093884 1569471 1334829 1206669 1286205 1316999 1417355 1418642
18130A418642N2115Q8958K40502J66946K55534K48015J92385L43366L90163P05463
$$ 1418642 1470757 1559715 1800217 1967163 2222697 2470712 2663097 3006463 3396626 4102089
18120D102089J043683J504046K297086L576281O238611J0960808J8866445K7162485
$$ 4102089 5145772 6649818 8946904 12523185 18761796 29722604 48589049 75751534
18112G5751534K7300650J8786098Q903402L605575J266803j9931741m1315990
$$ 75751534 103052184 121838282 130741684 134347259 135614062 115682321 74366331
18105G4366331k6498422j3513459p642078m770484l064032k246793j645769j201723
$$ 74366331 47867909 34354450 26712372 21941888 18877856 16631063 14985294 13783571
18097A3783571j223268j000444j164861r60074q15899p84464r78798p37236o48451
$$ 13783571 12560303 11559859 10394998 9434924 8619025 7834561 6855763 6118527 5470076
18088E470076n67769l77953l18741m98325k88940k54848k06604j74808k60219
$$ 5470076 4902307 4524354 4205613 3707288 3418348 3163500 2956896 2782088 2521869
18079B521869k02942q4247k33264j30809j11320o0929j37378j23096n4040K2418
$$ 2521869 2318927 2234680 2001416 1870607 1759287 1698358 1560980 1437884 1383844 1406262
18069A406262K5735J2468m9743j04960r9484m5317j30791J41202J35944k05p5776
$$ 1406262 1431997 1444465 1394722 1289762 1190278 1144961 1014170 1155372 1291316 1291111 1215335
18058A215335n7758j1166o0766k0355j18557p1320K5872L7509J4378k61319k46314
$$ 1215335 1157577 1146411 1085645 1065290 946733 875413 901285 938794 953172 691853 445539
18047D45539P818M0740Q0137p66J9100k4929j7474o0749j60162K5681K9163j6767
$$ 445539 453357 494097 574234 573468 592568 567639 550165 489416 329254 354935 384098 367331
18035C67331J73676J57296j77082j3468l193p8444O889o1238J6941L2513n5396
$$ 367331 541007 698303 521221 507753 504560 426116 433005 371767 388708 421221 365825
18024C65825n8070j42557r4201O3930m1812J1075O0541N8965J50186K27704k9958
$$ 365825 307755 165198 70997 134927 93115 104190 164731 223696 373882 601586 571628
18013E71628j65841r9647j69220M244M5405n1487J10181M7804J49181J5573j35420
$$ 571628 405787 306140 136920 141164 186569 135082 245263 293067 442248 457821 322401
18002C22401r2199L6717m3425k7698O535J08772Q5212n3272o2405N0200j5819
$$ 322401 230202 266919 223494 195796 202331 311103 396315 343043 280638 330838 315019
17991C15019M7068k9523O2384Q7556K180Q4655J25610J97693K53227M39322N27954
$$ 315019 362087 332564 394948 482504 484684 569339 694949 892642 1145869 1585191 2113145
17980B113145M60724M34044N88298M66479J71662j42214m19877o91820p64525
$$ 2113145 2573869 3007913 3596211 4062690 4234352 4092138 3672261 2980441 2215916
17971B215916n98912l43988k23769r7555J9277j08837K015m4142j55036r5444
$$ 2215916 1617004 1273016 1049247 951692 970969 862132 864147 820005 664969 569525
17961E69525j27173r1782P938K6538J07135N0710J25730q3500j11749o5570j26693
$$ 569525 442352 350570 358508 385046 492181 542891 668621 585121 473372 407802 281109
17950B81109n4037K4008l183r647M0110K32436R8566p8043j26568K4155p0545
$$ 281109 227072 251080 247897 238250 278360 510796 609362 531319 404751 428906 358361
17939C58361l6305O8931o9589J5429q50l900R2659J92764j2903K44884K62252
$$ 358361 322056 390987 321398 336827 335977 332077 424736 617500 604597 849481 1111733
17928A111733L28620N43956P55666M73752L14724M7141j20586k51988m81004o67386
$$ 1111733 1440353 1984309 2739975 3213727 3528451 3575592 3455006 3203018 2722014 2054628
17918B054628n40662m78332k91481j22383N3418O8739r0083j26238m9024n1030
$$ 2054628 1513966 1035634 744153 621770 675188 743927 653844 527606 478582 427552
17908D27552Q218J08774m2136m4647l8079j56369J4251k0034j01524j01420M3707
$$ 427552 435770 544544 502408 457761 419682 263313 277564 257530 156006 54586 98293
17897I8293L3286K1376P3066j37901r6611M6376J69418J03344N7085j34194l5668
$$ 98293 131579 152955 226021 88120 -8491 37885 207303 310647 367732 233538 197870
17886A97870m2830q5471M6840p5683r8621r6781J20646J25474K0344r5218q5301
$$ 197870 155040 69569 116409 40726 -57895 -154676 -34030 91444 111788 16570 -68731
17875f8731m2002Q8348O3670j27801K6129M0891r0591q9245Q0108R4155O0926
$$ -68731 -110733 -22385 41285 -86516 -60387 -19496 -110087 -199332 -119224 -25069 35857
17864C5857p2516r1316O0702P6237L7646k1810o6019M0080m8048j29858N0435
$$ 35857 -36659 -127975 -67273 8964 46610 24800 -41219 -1139 -49187 -179045 -128610
17853a28610J08292k2151J4573m477k7595m827j11631j3879o9803N7846M6931
$$ -128610 -20318 -42469 -27896 -32373 -59968 -64795 -176426 -190305 -260108 -202262 -155331
17842a55331k7949N2337J39399K3867O800k7612M9471Q1269J3547k4982Q3845
$$ -155331 -183280 -130943 8456 32323 39123 11511 60982 142251 155798 130816 214661
17831B14661j56752N2920Q1785L9808O8050P5846m0335n8993o0329k8391k3297
$$ 214661 57909 110829 192614 232422 300472 376318 335983 276990 216661 188270 164973
17820A64973q6169k5921N1569J3417k55729j13873L6830m6227m8299P717J35202
$$ 164973 78804 52883 104452 117869 -137860 -251733 -214903 -261130 -309429 -301712 -166510
17809a66510J70847N6940L2579N4912K1177n2345p9681K4443J9199n3241m1393
$$ -166510 4337 61277 93856 148768 169945 117600 37919 62362 81561 28320 -13073
17798a3073R4746n64Q2120K4982q310j83579K5175Q5342K9082J6261j53120q3928
$$ -13073 81673 81109 163229 188211 179901 -3678 21497 106839 135921 152182 -938 -84866
17786h4866K5693K6348Q0747j14565j4230J31297R9889K2844M3933o2431j08812
$$ -84866 -59173 -32825 47922 -66643 -80873 50424 150313 173157 217090 154659 45847
17775D5847l6080l5066Q6150Q2646o4130j1534k4584m2886j04833R6802Q8131
$$ 45847 9767 -25299 60851 143497 79367 67833 43249 363 -104470 -7668 80463
17764H0463o7311j97015m4219J35084Q4100M6406n5865j067N1631J2869K9907
$$ 80463 13152 -183863 -228082 -92998 -8898 37508 -18357 -19424 32207 45076 74983
17753G4983M5345o1651k8675p1504r5889j17490J05618K7103l7228J42444J12519
$$ 74983 120328 58677 30002 -41502 -137391 -254881 -149263 -122160 -159388 -16944 95575
17742I5575p6148N0177J2732j2081J4069j7470j2234j11837j08777p117L0436
$$ 95575 19427 69604 82336 70255 84324 66854 54620 -57217 -165994 -173111 -142675
17731a42675Q8861k4913k4828j06462Q3078J45742O5416m161m0510k2644Q8806
$$ -142675 -53814 -78727 -103555 -210017 -126939 18803 84219 80058 39548 16904 105710
17720A05710J661n4427o1322J58598k4184j6652j90609n2119m4492M7245J30367
$$ 105710 107371 52944 -8378 150220 126036 109384 -81225 -133344 -177836 -130591 -224
17709b24J4530n8885n3791R3633m9540K0206m0925N5390k6079q1732J27192n686
$$ -224 14306 -44579 -98370 -4737 -54277 -34071 -74996 -19606 -45685 -127417 -225 -5911
17697e911K1624r1684K4113Q49M8221J18899o4967l1762r4948j6307Q3126J17444
$$ -5911 15713 -75971 -51858 -51009 -2788 116111 51144 19382 -75566 -91873 -8747 108697
17685A08697p9508j16114P3614J27321Q3381P3558j50302j12803M7347r0756O6765
$$ 108697 29189 -86925 -13311 114010 197391 270949 120647 7844 55191 -35565 31200
17674C1200o5752q7484p2347K6849Q2282J60892L823o7318j39532k7358J2995
$$ 31200 -34552 -122036 -194383 -167534 -85252 75640 79463 12145 -127387 -154745 -141750
17663a41750J28225J04874M8264j07603j0052J08784m6124m2508O3265K6770R334
$$ -141750 -13525 91349 139613 32010 21958 130742 84618 42110 105375 132145 141479
17652A41479n7202j25372p7226L4278j10948P7598k4192L6242R6471L5774R0284
$$ 141479 84277 -41095 -118321 -84043 -194991 -117393 -141585 -105343 -8872 26902 117186
17641A17186J026n7556J7349n5603q0519n886J26821r7385j9750j19783O3659
$$ 117186 118212 60656 78005 22402 -58117 -64003 62818 -34567 -54317 -174100 -110441
17630a10441N4920q9349j04996M6775M8498O4538Q5363r6081J48218J10367o3991
$$ -110441 -55521 -144870 -249866 -203091 -154593 -90055 -4692 -100773 47445 157812 93821
17619I3821o9779J14471m4886r6028j9570j6794p8946J58359n4675Q4837j36117
$$ 93821 24042 138513 93627 -2401 -21971 -38765 -117711 40648 -14027 70810 -65307
17608f5307j72749J9951O9984R5633K6083r3094m1053J2336O319P1905O1143K1465
$$ -65307 -238056 -218105 -148121 -52488 -26405 -119499 -160552 -148216 -141897 -69992 -8849 12616
17596A2616k1257j9031N8938p2763q1552J31690R561o3252j04169k9045L2731
$$ 12616 -8641 -27672 31266 -41497 -123049 8641 18202 -45050 -149219 -178264 -145533
17585a45533L674J67278O3953p3049o1573J4166L0577R7919L9872j26678p3696
$$ -145533 -141859 25419 89372 16323 -45250 -31084 -507 97412 137284 10606 -63090
17574f3090o2702P5025L4753k04318J73024J00916k6643l1229k34746J50447K44215
$$ -63090 -125792 -50767 -16014 -220332 -47308 53608 26965 -4264 -239010 -88563 155652
17563A55652k776l7517L9257M749r7906j05625R286J34859K5508n6353j3921J5758
$$ 155652 152876 115359 154616 159365 61459 -44166 -34880 99979 125487 69134 55213 70971
17551G0971Q1506Q271m3760n2780L1675r5986K4277J50575M3000p9804J8726j9732
$$ 70971 152477 160748 116988 64208 95883 -103 24174 174749 217749 137945 156671 136939
17539A36939k05976p1985P6936R6153q6608m9581O9079l3326l3188K0245J7205
$$ 136939 -69037 -141022 -64086 32067 -54541 -104122 -35043 -68369 -101557 -81312 -64107
17528f4107k06863j81702J44546K15088L7460r9829K4497J84787Q2058N6160n8107
$$ -64107 -270970 -452672 -308126 -93038 -55578 -155407 -130910 53877 135935 192095 133988
17517A33988m0902n7074n4456j6404R8957J06246K8360J3006j26237r1748N2167
$$ 133988 93086 36012 -18444 -34848 64109 170355 198715 211721 85484 -6264 45903
17506D5903J38931o0547m762j4107o7224J9943j01161j13033l1958L1752r059
$$ 45903 184834 124287 119525 105418 38194 58137 -43024 -156057 -188015 -156263 -165322
17495a65322J15474R4381N3923L9009p9440p9902L0273l7181l0157l4021j02273
$$ -165322 -49848 44533 98456 137465 58025 -21877 8396 -28785 -58942 -92963 -195236
17484a95236K0013R2581j9320N0454J12396r71n181k5759m2976P77J0235j6425
$$ -195236 -175223 -82642 -101962 -51508 60888 59917 54736 28977 -13999 -13222 -2987 -19412
17472a9412j5296q5247J55404J29478n5220K7586q2205p0479L0533l6816Q1993
$$ -19412 -34708 -119955 35449 164927 109707 137293 55088 -15391 15142 -21674 60319
17461F0319J28412J6567m5000k1141k8712j06212j23644l392J81930R4387o3373
$$ 60319 188731 205298 160298 139157 110445 4233 -119411 -122803 59127 153514 90141
17450I0141r50m4441k195J48143J88915L13684R1161j49653k6585k06645k92041
$$ 90141 89191 44750 42555 190698 379613 693297 784458 634805 608220 401575 109534
17439A09534m110k6622q963r058p0547n9256R7462r1475m3073M0325M6536m7994
$$ 109534 105424 78802 69839 60781 -9766 -69022 28440 -63035 -106108 -65783 -19247 -67241
17427f7241M8684J32254Q3808j3676n6571p4409J9514J06148o0336j36886j3686
$$ -67241 -18557 113697 197505 183829 127258 52849 72363 178511 118175 -18711 -32397
17416c2397J05195k5097k1909m9569j70492j18978k4478O4247J42595Q1397m5753
$$ -32397 72798 47701 25792 -23777 -194269 -313247 -337725 -273478 -130883 -49486 -95239
17405i5239J7299r529o1184L8260J2979J25769L4260l4186k1913Q1590K8729j61562
$$ -95239 -77940 -87469 -148653 -110393 -97414 28355 62615 28429 6516 88106 116835 -44727
17393d4727o4132K4215q6395N6308O2185P8959J01615k9516r386j05806q0551
$$ -44727 -108859 -84644 -171039 -114731 -52546 26413 128028 98512 89126 -16680 -97231
17382i7231o2095L9039r915N3469n1632o5581R4666K69838o3481k04655n3142
$$ -97231 -159326 -120287 -130202 -76733 -128365 -193946 -99280 170558 107077 -97578 -150720
17371a50720J85661J25036o1790p9615j9962R9534O1184P3138l7483l6101o7073
$$ -150720 34941 159977 98187 18572 -1390 98144 159328 232466 194983 158882 91809
17360I1809r2587N4435m4380j4364m0002J23918J15511n6009j6759K3473m3843
$$ 91809 -778 53657 9277 -5087 -45089 78829 194340 138331 121572 145045 101202
17349A01202o6736M1788L6151m1236k2621J08319r2071p5093l7520R851j09471
$$ 101202 34466 76254 112405 71169 48548 156867 64796 -10297 -47817 -37966 -147437
17338a47437N538J68068J8864k190J30003Q2419m2727K7876k5067p7645n2608
$$ -147437 -141899 26169 45033 42843 172846 255265 212538 240414 215347 137702 85094
17327H5094k8447K6788n1562K1672P3884r1035j05064m0218m2732p2795L2569
$$ 85094 56647 83435 31873 53545 127429 36394 -68670 -108888 -151620 -224415 -191846
17316a91846O8628p8590j11093j7862J02448o0433o3682J39429J28634J79924
$$ -191846 -123218 -201808 -312901 -330763 -228315 -288748 -352430 -213001 -84367 95557
17306I5557M8337q1971q6459r7784l5747J29969J45233J22519K2741m4938m5596
$$ 95557 143894 61923 -24536 -122320 -158067 -28098 117135 239654 262395 217457 171861
17295A71861m0597n5575j57456j10508L1945N8740M5279J11512Q3780j8030p7472
$$ 171861 131264 75689 -81767 -192275 -160330 -101590 -56311 55201 138981 120951 43479
17284D3479J3797N0202R330r6312p6399q0095J09436l1187J26434R6710N055m4495
$$ 43479 57276 107478 116808 20496 -55903 -135998 -26562 -57749 68685 165395 170450 125955
17272A25955j53879M7779J27021R2107l6306o273N3309n01j074k7498j86604N0988
$$ 125955 -27924 19855 146876 238983 202677 196404 249713 249212 248138 220640 34036 85024
17260H5024p7350N6574N4960o5798O0728p470P3947m9180o2683o2068M4825O3597
$$ 85024 7674 64248 119208 53410 114138 106668 180615 131435 68752 6684 51509 115106
17248A15106n1270N1618N5907n1497p207q2414j4010J08009P0423m2363k20478
$$ 115106 63836 115454 171361 119864 112657 30243 16233 124242 194665 152302 -68176
17237f8176K9736N573O113J4853R0628L0507M0936O007j24026j0064J21957N6784
$$ -68176 -38440 -32867 -26754 -11901 78727 109234 150170 156177 32151 22087 144044 200828
17225B00828r7083j76106j05105k213J36665J88039k9089J5876J22569L3787j1338
$$ 200828 103745 -72361 -177466 -179679 -43014 145025 115936 131812 254381 288168 276830
17214B76830q7081r8144J9706J0608J13789J06049k2319j23622l4458K6978j53206
$$ 276830 189749 91605 111311 121919 235708 341757 319438 195816 161358 188336 35130
17203C5130j13066J67133R3008j68167j01328m9802P9702l7594j7642j2486n4734
$$ 35130 -77936 89197 182205 14038 -87290 -137092 -57390 -94984 -112626 -125112 -179846
17192a79846K6783K5807l6452N7953J96755r9078P9512L2399j16697J24505Q4802
$$ -179846 -153063 -127256 -163708 -105755 91000 -8078 71434 103833 -12864 111641 196443
17181A96443m7061n2538m7806J6355L5765q0104O3831M6507J21796l8275j06621
$$ 196443 149382 96844 49038 65393 101158 21054 84885 131392 253188 214913 108292
17170A08292L6736j036j17285P2928J01274J1619J37513J11337o6591o9188p4496
$$ 108292 145028 143992 26707 99635 200909 212528 350041 461378 394787 325599 251103
17159B51103j3629M9476N9689r8770m1741O4161O4629J2142Q8489P985l4464k7728
$$ 251103 237474 286950 346639 247869 206128 270289 334918 347060 435549 443534 409070 381342
17147C81342l9175L393L8831l5019M4506o7264N4613j57824Q181j0569k05285
$$ 381342 342167 345560 384391 349372 393878 326614 381227 223403 231584 221015 15730
17136A5730M2885O2452L9286o1200j15722N3334Q1049J12301O0099J6956p828
$$ 15730 58615 121067 160353 99153 -16569 36765 117814 230115 290214 307170 299342
17125B99342n4060l941n2614J15965m47j13479n7006J76379K6750j16542k2967
$$ 299342 245282 241341 188727 304692 304245 190766 133760 310139 336889 220347 197380
17114A97380J6183r1168j7602J52827M7230r6971P0896N2132k870j2257j07795
$$ 197380 213563 122395 104793 257620 304850 207879 278775 330907 328037 315780 207985
17103B07985N3653j08572j19451R2095J54555k556R1207K0420p9393j11357j24801
$$ 207985 261638 153066 33615 125710 280265 277709 368916 389336 309943 198586 73785
17092G3785n5373K02748N5200j37749O2412N9789p1134n7665J31696l4410j41290
$$ 73785 18412 221160 276360 138611 201023 260812 189678 132013 263709 229299 88009
17081H8009K4774J98960Q8527k2703R6708p641m3479j12570o6862M4883J2083
$$ 88009 112783 311743 400270 377567 474275 466634 423155 310585 243723 288606 300689
17070C00689M5076n745P177m9311j69916m0221J3534O4088J52970j3139k0535
$$ 300689 345765 340020 347197 297886 127970 87749 101283 165371 318341 305202 284667
17059B84667O065j37019K8818k1708K7931J15673P3027o1967k376o9759j01347
$$ 284667 290732 153713 182531 160823 188754 304427 377454 315487 313111 243352 142005
17048A42005R7317J31008J2728k8759M6005j0604j30226q9283j04638J26088J11563
$$ 142005 239322 370330 383058 354299 400304 389700 259474 170191 65553 191641 303204
17037C03204N2088n5839R6335M6420m8857K4251j5267j59943o3334K5119m450
$$ 303204 355292 299453 395788 442208 393351 417602 402335 242392 179058 204177 199727
17026A99727K4162N8690J2877j57612r5255p8464J82124J88012n5706J04899p729
$$ 199727 223889 282579 295456 137844 42589 -35875 146249 334261 278555 383454 375725
17015C75725R7089K3217p3163Q6280n1781p2390j3750K4446o5570J03823J9724
$$ 375725 472814 496031 422868 509148 457367 384977 371227 395673 330103 433926 453650
17004D53650r3960o1859J6765R8854M7976l7858j24450k3704l1131N9568l2536
$$ 453650 359690 297831 314596 413450 461426 423568 299118 275414 244283 303851 271315
16993B71315j37686L7406J10801J15664R9627R3631m1846j12467O8146L6888J8278
$$ 271315 133629 171035 281836 397500 497127 590758 548912 436445 504591 541479 559757
16982E59757k5044l2562m0503L9180K0253R9524J36932L9337r0508p0545j72879
$$ 559757 534713 502151 461648 500828 521081 620605 757537 796874 706366 635821 462942
16971D62942j27242J03242J09487R553l7903r4273N2583J06918J8618r7654P1590
$$ 462942 335700 438942 548429 557982 520079 425806 478389 585307 603925 506271 577861
16960E77861J37642M8155j51539j82343k0781k7002J34595J50864J12905J2015
$$ 577861 715503 763658 612119 429776 408995 381993 516588 667452 780357 792372
16950G92372j35969k1425M0530J75204N9001k24656o6525J28974J3692j4266M0534
$$ 792372 656403 634978 675508 850712 909713 685057 618532 747506 761198 746932 787466
16939G87466J6891m3135R6733J08344j1654j09346J1232M9943J6085r1949l7955
$$ 787466 804357 761222 857955 966299 954645 845299 856531 906474 922559 830610 792655
16928G92655Q7560L3367R2011K8934Q2278q4350o3677L7532J58764o6607p0666
$$ 792655 880215 913582 1005593 1034527 1116805 1032455 968778 1006310 1165074 1098467 1027801
16917A027801J10840J03145J22142L4386j52411J58793J29146J34971j58458j89607
$$ 1027801 1138641 1241786 1363928 1398314 1245903 1404696 1533842 1668813 1510355 1320748
16907A320748K9405M8177M7016Q4364Q3781j7457P786K41247L4933j21370o084
$$ 1320748 1350153 1398330 1445346 1529710 1613491 1596034 1603820 1845067 1880000 1758630 1752546
16896A752546J48869J21282l3367O9846M7865J29450J21110N4630K9585R8821
$$ 1752546 1901415 2022697 1989330 2059176 2107041 2236491 2357601 2412231 2441816 2540637
16886B540637j0656o12K08402J26119r557j107Q7814j12582J86386K43779K27251
$$ 2540637 2529981 2529369 2737771 2863890 2854333 2853226 2941040 2828458 3014844 3258623 3485874
16875C485874L16234R5468l9370J4990j7974J83084L84390J81558J90290K51962
$$ 3485874 3802108 3897576 3858206 3873196 3855222 4038306 4422696 4604254 4794544 5046506
16865E046506K22536L9733J85520K85624L12667L74535J47428J51811K91263K60611
$$ 5046506 5269042 5308775 5494295 5779919 6092586 6467121 6614549 6766360 7057623 7318234
16855G318234L22041M73537M90138M53663K52513M08016M42105O79904P52534
$$ 7318234 7640275 8113812 8603950 9057613 9310126 9718142 10160247 10840151 11592685
16846A1592685P16843O94934P15544P87817P88477R30789R53600J058343R34998
$$ 11592685 12309528 13004462 13720006 14507823 15296300 16227089 17180689 18239032 19174030
16837A9174030J129795J198924J307489J348699J336948J421201J224907J210329
$$ 19174030 20303825 21502749 22810238 24158937 25495885 26917086 28141993 29352322
16829B9352322J375197J437087J447881J368134J320438R56412O65494N55197
$$ 29352322 30727519 32164606 33612487 34980621 36301059 37257471 37922965 38478162
16821C8478162M85839M37989J188l17654n42713p50461o07533q63960r71344j064432
$$ 38478162 38964001 39401990 39403178 39085524 38542811 37792350 37184817 36320857 35349513 34285081
16811C4285081j270950j260779j182443j263770j300366j222514j297529j162621
$$ 34285081 33014131 31753352 30570909 29307139 28006773 26784259 25486730 24324109
16803B4324109j008271j091302j107921j049989r39981q17006q30724q16961p09422
$$ 24324109 23315838 22224536 21116615 20066626 19126645 18309639 17478915 16661954 15952532
16794A5952532o91630p51033p25110n32350o53772q21314n92509m83277l44473
$$ 15952532 15260902 14509869 13784759 13252409 12598637 11777323 11184814 10701537 10357064
16785A0357064k94458l51577m74811m70637l53768l38967k56041k89363l44966
$$ 10357064 10062606 9711029 9236218 8765581 8411813 8072846 7816805 7527442 7182476
16776G182476j60889j41493j71620j79331k32280k05220k70992l10427j49913
$$ 7182476 7021587 6880094 6708474 6529143 6296863 6091643 5820651 5510224 5360311
16767E360311j71361j70896j86832k05274j78056j56368j24664o0611j33783r8670
$$ 5360311 5188950 5018054 4831222 4625948 4447892 4291524 4166860 4106249 3972466 3873796
16757C873796j02785j94863j78915O6470j14824q6672R3643j17885j84584q7809
$$ 3873796 3771011 3576148 3397233 3463703 3348879 3262207 3355850 3237965 3053381 2965572
16747B965572o8440r8313m9156j35883K0999j06471k4391l0961k40811K8513P7776
$$ 2965572 2897132 2798819 2749663 2613780 2634779 2528308 2503917 2472956 2232145 2260658 2338434
16736B338434m0388j47958k3069l394N313j14832k10409L4589N3423j8162n7748
$$ 2338434 2298046 2150088 2127019 2123625 2128938 2014106 1803697 1838286 1891709 1873547 1815799
16725A815799j4115q2455j6610j6296q775Q0j8119n7086q9356J1976O477r6549
$$ 1815799 1801684 1719229 1702619 1686323 1677548 1677628 1659509 1602423 1513067 1525043 1531520 1434971
16713A434971r8896N8604J4822l5718r2670J02583K0566p1821j02293j3117M1835
$$ 1434971 1336075 1394679 1409501 1373783 1281113 1383696 1404262 1332441 1230148 1217031 1258866
16702A258866J6124J0258q1543j5978k107l093j34717k71660q4189J91840J0359
$$ 1258866 1274990 1285248 1203705 1187727 1185620 1182527 1047810 776150 691961 883801 894160
16691H94160N2131l6628p5091M1983q5261j4642p5713k4734N1579M299l7531n7290
$$ 894160 946291 909663 834572 876555 791294 776652 700939 676205 727784 732083 694552 637262
16679F37262L8308k362j21702N9392p2482K5190R1293J30634J87323j27485m5307
$$ 637262 675570 673208 551506 610898 538416 563606 654899 785533 972856 845371 800064
16668H00064o0771N3692L1003K1192l5411J5101l6505j18712l3190R6014j4085
$$ 800064 739293 792985 823988 845180 809769 824870 788365 669653 636463 732477 718392
16657G18392r5699L3531J02985r6903n5118Q2418M865l5812m3647r5104k4281
$$ 718392 622693 656224 759209 662306 607188 689606 694471 658659 615012 519908 495627
16646D95627Q6171o6090n578O3766p598j26430N8288r900N417j05287N1587J15802
$$ 495627 581798 515708 510130 573896 566298 439868 498156 488256 493673 388386 439973 555775
16634E55775j31574r1309m1556M4639j5892R500q3265M993M7827Q9152K102M8711
$$ 555775 424201 332892 291336 335975 320083 329583 246318 251311 299138 388290 390392 439103
16622D39103m0535n0160J56275M7137j93386j00471r6929L4076O5846R3789O1013
$$ 439103 398568 348408 504683 551820 358434 257963 161034 195110 260956 354745 415758
16611D15758r2830j43119R136m562k3387Q061Q6956R2590o2554M6403N0728r2140
$$ 415758 322928 179809 188945 184383 160996 169057 256013 348603 286049 332452 383180 291040
16599B91040q5075Q0181o9496j13907P079J141q2597J2711P8463Q1331o5700J26744
$$ 291040 205965 286146 216650 102743 109822 110963 28366 41077 119540 200871 135171 261915
16587B61915R5890m1951m1777M3594r156J61775K0287j05185q7342n7324r1520
$$ 261915 357805 315854 274077 317671 308515 470290 490577 385392 298050 240726 149206
16576A49206m7191N8640M2471Q9910o9385k25170K701J67436R7360l9130J3531
$$ 149206 102015 160655 203126 293036 223651 -1519 1182 168618 265978 226848 240379
16565B40379J2007K2287P8832n7165j87001k5085j5896J01514J0468K6839j8214
$$ 240379 252386 274673 353505 296340 109339 84254 68358 169872 180340 207179 188965
16554A88965O4986R662j34201k7157O6979J22525N1246j4117J04727q190M1337
$$ 188965 253951 263613 129412 102255 169234 291759 343005 328888 433615 425425 466762
16543D66762O9912Q3179n9582j69171O7684j51456l87489j87132R5869J20762
$$ 466762 536674 619853 560271 391100 458784 307328 -80161 -267293 -171424 -50662
16533e0662J27181n1487K1741N367j4634O0917O1904l7276m7826o063M4590O4424
$$ -50662 76519 25032 46773 52140 37506 98423 160327 123051 75225 69162 113752 178176
16521A78176J90130m963j00399L9388O3919o1553q8211j18072P0818J66156K4534
$$ 178176 368306 363343 262944 302332 366251 304698 216487 98415 169233 335389 359923
16510C59923j21259j71543l203p738j75501P1310J26979M502R9523n3089l9981
$$ 359923 238664 67121 63918 56180 -119321 -48011 78968 83470 182993 129904 89923
16499H9923P8579Q8097n7651j18950r6346R9771N2149R1426m3526L331l1214k7848
$$ 89923 168502 256599 198948 79998 -16348 83423 135572 226998 183472 186803 155589 127741
16487A27741k2342M2296p3588K3157J05961Q8725J15670N5319J445r0191l8938
$$ 127741 105399 147695 74107 97264 203225 291950 407620 462939 464384 374193 335255
16476C35255r3905o7199J55762P3736r8132l6955L320L4896J3992n2631N4385
$$ 335255 241350 174151 329913 403649 305517 268562 271882 306778 320770 268139 322524
16465C22524M9583n2940n8505j49226m0136n9193K1722L1533N246K3795J1615
$$ 322524 372107 319167 260662 111436 71300 12107 33829 65362 70608 94403 106018
16454A06018l3555L9260N6226l2013M8232L6289q3120L6605o1801O4233J05702
$$ 106018 72463 111723 167949 135936 184168 220457 137337 173942 112141 176374 282076
16443B82076L9394r2465j12397J58246J66431J8692j65769j26278j5488n1187
$$ 282076 321470 229005 116608 274854 441285 459977 294208 167930 152442 101255
16433A01255p3575l9660K7309m69J22988q143K0223J7828K0409M0027K9293k198
$$ 101255 27680 -11980 15329 14860 137848 129705 149928 167756 188165 228192 257485 255287
16421B55287N6022K5366m7942M9540R1534k00855k769Q288n1204n8395J7282J57156
$$ 255287 311309 336675 288733 338273 429807 228952 226183 234471 183267 124872 142154 299310
16409B99310O3110n0399j30749o9069O0481J3823P3677P485m1838R9052K4136
$$ 299310 362420 312021 181272 112203 172684 186507 260184 267669 225831 324883 349019
16398C49019j22480j21242J20609K9518j8395J84004J06553j27705j83879j33775
$$ 349019 226539 105297 225906 255424 237029 421033 527586 399881 216002 82227
16388H2227j76542M7884J64037J08058N0424j01377J5831L4471M4617r419J52233
$$ 82227 -94315 -46431 117606 225664 276088 174711 190542 225013 269630 260211 412444
16377D12444Q4222j4652J08320J65721M8682p6863J7041L2797j987J5038M1690
$$ 412444 496666 482014 590334 756055 804737 727874 744915 777712 775725 790763 832453
16366H32453J23049p8449J05007L0180L6564J20403N3566r8029l9809J45031O8251
$$ 832453 955502 877053 982060 1012240 1048804 1169207 1222773 1124744 1084935 1229966 1298217
16355A298217p835l355L3384M1117L0748k4921J6374r3107r354N773n302j9699
$$ 1298217 1290382 1287027 1320411 1361528 1392276 1367355 1383729 1290622 1281268 1287041 1281739 1262040
16343A262040o1044r9364M1848r6562p8531j2580J41860o2088k280J11035j86644
$$ 1262040 1200996 1101632 1143480 1046918 968387 955807 1097667 1035579 1033299 1144334 957690
16332I57690j94522p0349m4793j30270K9474J4968N0800j56379K1762J46042l1508
$$ 957690 763168 692819 648026 517756 547230 562198 612998 456619 478381 624423 592915
16321E92915p828l9113m3590o8569j16346J50529Q0203m0702j00179k77019j23730
$$ 592915 585087 545974 502384 433815 317469 467998 548201 507499 407320 130301 6571
16310F571R3325M2995M8173l7270k016O8174K8470o9744j48281j551J91587J16382
$$ 6571 99896 142891 191064 153794 151778 219952 248422 178678 30397 28846 220433 336815
16298C36815l7597j09320n8080q0184k4407J59772P4923k6065o0930p246Q2169
$$ 336815 299218 189898 131818 51634 27227 186999 261922 235857 174927 167681 249850
16287B49850K739j25768L5728r3909N4640J03038l8221r409j04258L4634q7184
$$ 249850 252589 126821 162549 68640 123280 226318 188097 178688 74430 109064 21880
16276B1880l8137J08853n3773j54960O6919J36293L5015j06869j02504N8710J3908
$$ 21880 -16257 92596 38823 -116137 -49218 87075 122090 15221 -87283 -28573 -14665
16265a4665J25251J49745P4703l9133K254N0743J1754j30288j22279j27196N6700
$$ -14665 110586 260331 335034 295901 298155 348898 360652 230364 108085 -19111 37589
16254C7589L3020p8428j22673j2614M3287N1650J41167k8986K7167N952k3990
$$ 37589 70609 -7819 -130492 -143106 -99819 -48169 92998 64012 91179 97131 73141
16243G3141K6178J45353J1477j20607n634k8174Q9613n4281j23226J6976P1723
$$ 73141 99319 244672 256149 135542 129908 101734 191347 137066 13840 30816 102539
16232A02539M2479M2207j18877J5837m2706q804N5101P224R1226J29611j3825
$$ 102539 145018 187225 68348 84185 41479 32675 87776 95000 186226 315837 302012
16221C02012j47473l2140j4776N0757j49451j17181k1486j1759j8378L6712Q7436
$$ 302012 154539 122399 107623 158380 8929 -108252 -129738 -141497 -159875 -123163 -35727
16210c5727Q2763J77725O3637j2834n0300r6880j03367l3264K4326K1654K22K7223
$$ -35727 47036 224761 288398 275564 225264 128384 25017 -8247 16079 37733 37955 65178
16198F5178L9172l1910k89m1384k1439k8295p3784R7650o4553n5846J03461R0593
$$ 65178 104350 72440 72151 30767 9328 -18967 -92751 4899 -59654 -115500 -12039 78554
16186G8554N60k4532N3655j64377j7556J04797L944R1538M880j10154j16573N7982
$$ 78554 79114 54582 108237 -56140 -73696 31101 35045 126583 131463 21309 -95264 -37282
16174c7282o9872O6698m421M2823o250J9509J29388k6162k9080o7271j30759M699
$$ -37282 -107154 -40456 -44877 -2054 -8304 11205 140593 114431 85351 18080 -112679 -107980
16162a07980L3456L5709O4500M3486J5106j2671l9016O9279k1850M0546j3453
$$ -107980 -74524 -38815 25685 69171 84277 71606 32590 101869 80019 120565 107112
16151A07112j22943j66998p2112J21461N8716O9563p6395j42922Q2260M5944P1268
$$ 107112 -15831 -182829 -254941 -133480 -74764 -5201 -81596 -224518 -142258 -96314 -25046
16140b5046L1592K175J543N1779J27690K1171r2141n1584K8607p3013J1376K0068
$$ -25046 6546 8721 10264 62043 189733 210904 118763 67179 95786 22773 34149 54217
16128E4217R9164m2554j08679q1665p7279K1376o5631J90493j5002p4267J6592
$$ 54217 153381 110827 2148 -79517 -156796 -135420 -201051 -10558 -25560 -99827 -83235
16117h3235L8873n5008P2060N7454O3909q4317j83778p2780P5287J14063J2074
$$ -83235 -44362 -99370 -27310 30144 94053 9736 -174042 -246822 -171535 -57472 -45398
16106d5398M2926o5838j16383J68758O2272n8223J4385n3440J569O3350R311j3283
$$ -45398 -2472 -68310 -184693 -15935 46337 -11886 2499 -50941 -49372 13978 23289 10006
16094A0006k5334L0161o6304l424N9397k6159q5634r6252J23523J12891N176n4964
$$ 10006 -15328 14833 -51471 -54895 4502 -21657 -107291 -203543 -80020 32871 38047 -16917
16082a6917m9793l1867J67370J49300m0439k2351o4243j42493m0945O8701O6612
$$ -16917 -66710 -98577 68793 218093 177654 155303 91060 -51433 -92378 -23677 42935
16071D2935O9921p087n678K204m1596O0660L6208J3427N7963j28539j7787m5416
$$ 42935 112856 105769 100091 102295 60699 121359 157567 170994 228957 100418 82631 37215
16059C7215m3254J60157J68778k7091j40325r9560m8845k7447O2622K5809q7087
$$ 37215 -6039 154118 322896 295805 155480 55920 7075 -20372 42250 68059 -19028
16048a9028r5047J15876k3473j3361L5260M3074P7187o180k9805L2748j30186
$$ -19028 -114075 1801 -21672 -35033 227 43301 120488 114308 84503 117251 -12935
16037a2935j43061m5781N0187k6848P2459j4796R1011J4345p4424P6558L7216
$$ -12935 -155996 -201777 -151590 -178438 -105979 -120775 -29764 -15419 -89843 -13285 23931
16026B3931p9156q1445L0354Q916P956O3180J27759k6579n2486o2118K8373P0541
$$ 23931 -55225 -136670 -106316 -97400 -89444 -26264 101495 74916 22430 -39688 -11315 59226
16014E9226R498j15537J90405j0115j8328n5896K4776O4243Q4668q1145j27260
$$ 59226 68724 -46813 143592 133477 115149 59253 84029 148272 232940 151795 24535
16003B4535j14636Q0099Q0143k9204K7958N9576j18763l3777M4188N344q6902
$$ 24535 -90101 -10002 70141 40937 68895 128471 9708 -24069 20119 25463 -61439
15992f1439P4488q6468j51404J309L5093N1167O4571j4506M0364M1735o5870M4679
$$ -61439 13049 -73419 -224823 -223514 -188421 -137254 -72683 -87189 -46825 -5090 -70960 -26281
15980b6281J6181l3690l7629j10950N388Q2751J03861r620O2732n9292J29247
$$ -26281 -10100 -43790 -81419 -192369 -186981 -104230 -369 -9989 52743 -6549 122698
15969A22698j7420n9405L2700J20542j33592r8151K5379j4404Q4883l582N4061
$$ 122698 105278 45873 78573 199115 65523 -32628 -7249 -21653 63230 59648 113709
15958A13709N9878k2778j20368k43257M2420K21101J48280K8041q1058n6802j06464
$$ 113709 173587 150809 30441 -212816 -170396 50705 198985 227026 145968 89166 -17298
15947a7298q3093o6516L8372j5921J16767Q0140J7540k2145J5015m7723P1170
$$ -17298 -100391 -166907 -128535 -144456 -27689 52451 69991 47846 62861 15138 86308
15936H6308K5512m4644j29718P1929J04345J5171M8764L047J7548P666K7914l59
$$ 86308 111820 67176 -62542 9387 113732 128903 177667 180714 198262 205928 233842 233483
15924B33483N235o7551o9075q146j8105J660J33996J4941K3483k1669p2264l3420
$$ 233483 238718 171167 102092 93946 75841 77501 211497 226438 249921 228252 155988 122568
15912A22568J8637O7817J03814R1720p9861j73549J1952J31165o3456J80505J27068
$$ 122568 141205 209022 312836 404556 324695 151146 163098 294263 230807 411312 538380
15901E38380q1608r4616m4460j12082M1855k936K334n6047K098O2411K5407j5839
$$ 538380 456772 362156 317696 205614 247469 244533 246867 190820 192918 255329 280736 264897
15889B64897m4596l3718m8209P9501R8217r7973j35043K9271J07882m0865j63181
$$ 264897 220301 186583 138374 217875 316092 218119 83076 112347 220229 179364 16183
15878A6183n9764O0544n2819j45776o4932q8403m5602K34847J64614P2804M7262
$$ 16183 -43581 16963 -35856 -181632 -246564 -334967 -380569 -145722 18892 91696 138958
15867A38958O4181q4069l1517j43363P9787O7739M2727j31444O808J571k6696
$$ 138958 203139 119070 87553 -55810 23977 91716 134443 2999 9807 11378 -15318
15856a5318K9589l2295p818L1716J12723M8949J9649o5163O3779M4177P2066J84278
$$ -15318 14271 -18024 -25842 5874 118597 167546 187195 122032 185811 229988 302054 486332
15844D86332j16007n5593m7004m5291j73298O885K508k2790j0632o4793N374j8202
$$ 486332 370325 314732 267728 222437 49139 56024 58532 35742 25110 -39683 -34309 -52511
15832e2511N2052O2829m3639P2407N5630j2868n3237m9125n8894j1565Q878j22478
$$ -52511 -459 62370 18731 91138 146768 133900 80663 31538 -27356 -38921 -30043 -152521
15820a52521P7916L9125P8618Q6967k5394p1039j26000j96996J58708M2405J56111
$$ -152521 -74605 -35480 43138 130105 104711 33672 -92328 -289324 -130616 -88211 67900
15809F7900M1800l1705j02483j10198K8630J73423m7904j13021j8511q3931q3463
$$ 67900 109700 77995 -24488 -134686 -106056 67367 19463 -93558 -112069 -196000 -279463
15798b79463R7402J20177p4083k1480K9440N3784O0892L7796J7572j6067p1251
$$ -279463 -182061 -61884 -135967 -157447 -128007 -74223 -13331 24465 42037 25970 -45281
15787d5281j13148J9670m7609Q6365Q5974J00322J19998M0134j43673n3235j4098
$$ -45281 -158429 -138759 -186368 -100003 -14029 86293 206291 246425 102752 49517 35419
15776C5419j5290k0705p188n3786j08093q8183m2784L9032K2930J77211K40777
$$ 35419 20129 -576 -7764 -61550 -169643 -257826 -300610 -261578 -238648 -61437 179340
15765A79340j8737m9488j39756j00300L8723l1136J07256M6178o0449j0603o8362
$$ 179340 160603 111115 -28641 -128941 -90218 -121354 -14098 32080 -28369 -38972 -107334
15754a07334M161O0455K37600q9706M8618R6637Q0704q8478j11917l3004j4265
$$ -107334 -103173 -42718 194882 105176 153794 250431 331135 242657 130740 97736 83471
15743H3471K0142o0915J2984j83545J0066O7147M4440L0768O9352J3873k7734
$$ 83471 103613 42698 55682 -127863 -117797 -50650 -6210 24558 93910 107783 80049
15732H0049j73413j2171J53697P554n9713N5039M1551K6783j35776j88455m3240
$$ 80049 -93364 -105535 48162 55716 -3997 51042 92593 119376 -16400 -204855 -248095
15721b48095O0899K16553M7609j9725r8161n5734J35699J3189L9747n9730p5423
$$ -248095 -187196 29357 76966 57241 -40920 -96654 39045 52234 91981 32251 -43172
15710d3172o3772K5798K11800R1522j42680j18937r5162l7822l874k9644n011
$$ -43172 -106944 -81146 130654 222176 79496 -39441 -134603 -172425 -176299 -205943 -210954
15699b10954J89559R3125j24466J9323r9791m8418K27417J43275j17869J2539
$$ -210954 -21395 71730 -52736 -33413 -133204 -181622 45795 189070 71201 83740
15689H3740J08407l266o1566j53207m8972O4644r4348J0571J08377K18131k9523
$$ 83740 192147 188881 127315 -25892 -74864 -10220 -104568 -93997 14380 232511 202988
15678B02988j66050k3046m0969k8233j45899N6014J40462J5789q5354j10733j4172
$$ 202988 36938 13892 -27077 -55310 -201209 -145195 -4733 11056 -74298 -185031 -199203
15667a99203R72O5501J42330M6200q157j54237n6122O7890P9180m8066r8952j9353
$$ -199203 -198231 -132730 9600 55800 47643 -106594 -162716 -94826 -15646 -63712 -162664 -182017
15655a82017O3668l2663O5379l6702q2921J20050K44505N6212p2450l5342p0205
$$ -182017 -118349 -151012 -85633 -122335 -205256 -85206 159299 215511 143061 107719 37514
15644C7514j08001J8941K5605j7269j90552o837J11566J1144N4804M0173J24280
$$ 37514 -70487 -51546 -25941 -43210 -233762 -240599 -129033 -117889 -63085 -22912 101368
15633A01368J65153k4289j84155k8763P1327j04245j0926l7703O9593n2440O5641
$$ 101368 266521 242232 58077 29314 100641 -3604 -14530 -52233 17360 -35080 30561
15622C0561J10864j7922o5426j6070J38058L0755q904q7825o7598K7180l2160
$$ 30561 141425 123503 58077 42007 180065 210820 201916 114091 46493 73673 41513
15611D1513j20897M5696O5332j98080o6873J34139m1046j31154n8847P4724J23965
$$ 41513 -79384 -33688 31644 -166436 -233309 -99170 -140216 -271370 -330217 -255493 -131528
15600a31528J74759J75056Q971p4907n8261j62581n0242l4025P4328J54722m7521
$$ -131528 43231 218287 227258 152351 94090 -68491 -118733 -152758 -78430 76292 28771
15589B8771n9285j15291J97676K24136j62497j26673M4627L4504O910k5884m8483
$$ 28771 -30514 -145805 51871 276007 113510 -13163 31464 65968 72878 46994 -1489
15578a489n1186K2763J10380n1914n556J53005r1345j22655K2698q2792q7624
$$ -1489 -52675 -29912 80468 28554 22998 176003 84658 -37997 -15299 -98091 -185715
15567a85715M9167O4289Q485J05757k2212m6993M8776m0223l4337q354J0859l4854
$$ -185715 -136548 -72259 -63774 41983 19771 -27222 21554 -18669 -53006 -61360 -50501 -85355
15555h5355K7388P2422O6206j12948l6085J6772j494p7521p9718l6644N86l5763
$$ -85355 -57967 14455 80661 -32287 -68372 -51600 -53094 -130615 -210333 -246977 -246391 -282154
15543b82154K3464J1082Q689L2478J1195n1957J59622K1905l9419m8143r6313
$$ -282154 -258690 -247608 -238919 -206441 -195246 -247203 -87581 -65676 -105095 -153238 -249551
15532b49551k5092J42727M9078j25349o267J33214M916P5835Q8359K5670j27355
$$ -249551 -274643 -131916 -82838 -208187 -214454 -81240 -76324 -489 87870 113540 -13815
15521a3815j1667O0786L5286M2671k7731j56844j34234k5682o6734J21232J41383
$$ -13815 -25482 35304 70590 113261 85530 -71314 -205548 -231230 -297964 -176732 -35349
15510c5349N9468l22L4493l644o3639j19005l5147P164O0353r5030q3352J60138
$$ -35349 24119 23797 58290 54646 -8993 -127998 -163145 -155981 -95628 -190658 -274010 -113872
15498a13872O9683o4178K6097Q1972P4524J25157J0871p3335R6027n5876j13031
$$ -113872 -44189 -108367 -82270 -298 74226 199383 210254 136919 232946 177070 64039
15487F4039j09770m9245n5263j1177p9978n2629K27J2067N1514L028O7892J56945
$$ 64039 -45731 -94976 -150239 -161416 -241394 -294023 -293796 -281729 -230215 -227187 -159295 -2350
15475b350k8490l4557k5601Q0091j4822j19661m3608o1004R3351J50486J17155
$$ -2350 -30840 -65397 -90998 -10907 -25729 -145390 -188998 -250002 -156651 -6165 110990
15464A10990O0557n4843k0847K5445j82187j09972R6135J21093O7228k00880o7078
$$ 110990 171547 116704 95857 121302 -60885 -170857 -74722 46371 113599 -87281 -154359
15453a54359J00834J88294N6774k5822j39047o7106J00031o6708j31445K4974
$$ -154359 -53525 134769 191543 165721 26674 -40432 59599 -7109 -138554 -113580
15443a13580M6764r6181R8338J5738m4583n1499j01957J27686J59122j5164l9569
$$ -113580 -66816 -162997 -64659 -48921 -93504 -145003 -246960 -119274 39848 24684 -14885
15432a4885M6223P98q9035p2171L1465J23306n2765l512J05066J4880J00757k4152
$$ -14885 31338 32136 -56899 -129070 -97605 25701 -27064 -30576 74490 89370 190127 165975
15420A65975j04541N4774j31094j86997k4504m2430j3799J91632J32063P0272
$$ 165975 61434 116208 -14886 -201883 -226387 -268817 -282616 -90984 41079 111351
15410A11351K6045j08846n2660n7783l371m9431K50597J61478j947k30390j16911
$$ 111351 137396 28550 -24110 -81893 -85264 -134695 115902 277380 275433 45043 -71868
15399g1868k868l2799N4651J38239r8802K9997R2229L7981p5608q8698p3836j70166
$$ -71868 -74736 -107535 -52884 85355 -13447 16550 108779 146760 71152 -17546 -91382 -261548
15387b61548p6116p7586L5654K59013m6824M5708Q9849N4508L0381L6834n3677
$$ -261548 -337664 -415250 -379596 -120583 -167407 -121699 -31850 22658 53039 89873 36196
15376C6196o033r8476q8945J6743J63974Q5975n5003p9330j20537j33995q7041
$$ 36196 30163 -68313 -157258 -140515 23459 109434 54431 -24899 -145436 -279431 -366472
15365c66472J43172J0376O5071O1570O7321j8488N7697r4726k0453L6829n008
$$ -366472 -223300 -212924 -147853 -86283 -18962 -37450 20247 -74479 -94932 -58103 -63111
15354f3111r26J92227l4921J14976J00163O5489j32470r5722L538l4276k5902
$$ -63111 -64037 128190 93269 208245 308408 373897 241427 145705 149243 114967 89065
15343H9065J690j25764J03247N7650l9968l3479j28077L2594O6531R5726L9288
$$ 89065 90755 -35009 68238 125888 85920 52441 -75636 -43042 23489 119215 158503
15332A58503l1979L1899p0713j38788o6396j3774J5359j2412p8460O1485J02912
$$ 158503 126524 158423 87710 -51078 -117474 -131248 -115889 -128301 -206761 -145276 -42364
15321d2364j01830J47014L5298j21836o8124j9039M7973J01660n476L1489R8174
$$ -42364 -144194 2820 38118 -83718 -151842 -170881 -122908 -21248 -26724 4765 102939
15310A02939L2658p74l2815K5670Q1028n5299r3660j00381L932O7087O9965q8478
$$ 102939 135597 134823 102008 127678 208706 153407 59747 -40634 -36702 30385 100350 11872
15298A1872r0102q1512k2057J6067J3258k0565q5225m377l936N1255O7757M8034
$$ 11872 -78230 -159742 -181799 -165732 -152474 -173039 -258264 -262641 -266577 -215322 -147565 -99531
15286i9531m5956j323P5518L7811n8235J04199O6495K8885j6327N3605J34130
$$ -99531 -145487 -146810 -71292 -33481 -91716 12483 78978 107863 91536 145141 279271
15275B79271L7998j88753k52576p2126J36970J34269J7083M3545J30964M9550
$$ 279271 317269 128516 -124060 -196186 -59216 75053 92136 135681 266645 316195
15265C16195j80594J5634N67j04326K3175M0187o8278n4317J1264K9952J31716
$$ 316195 135601 151235 151802 47476 70651 110838 42560 -11757 -493 29459 161175
15254A61175n38q9611r4918M5523k09258O0821N3914k9851l4706j868J77538J7043
$$ 161175 160637 71026 -23892 21631 -187627 -126806 -72892 -102743 -137449 -139317 38221 55264
15242E5264L8027o7508q4411l294K2546J1188L6854J10684L0612p6412q1508M4087
$$ 55264 93291 25783 -58628 -61922 -39376 -28188 8666 119350 149962 73550 -7958 36129
15230C6129J32890l7619r9639J06232R5684N196l319j45493N7179j5490p9948
$$ 36129 169019 131400 31761 137993 233677 238873 235554 90061 147240 131750 51802
15219E1802j9677p7747j2750J94366P3836J7231j02006j79993N3164N6293p6813
$$ 51802 32125 -45622 -58372 135994 209830 227061 125055 -54938 -1774 54519 -22294
15208b2294l9543L5708J37531J29176j47406r5608l9787J15193n0861o3369Q8044
$$ -22294 -61837 -26129 111402 240578 93172 -2436 -42223 72970 22109 -41260 46784
15197D6784Q3138K3287J03146J1065m9723j27379r4202o4540m6555o2292M2220
$$ 46784 129922 153209 256355 267420 217697 90318 -3884 -68424 -114979 -177271 -135051
15186a35051M4560j32929q1824M9657N0607J25808q062m5506o9262L4896O6527
$$ -135051 -90491 -223420 -305244 -255587 -204980 -79172 -87234 -132740 -202002 -167106 -100579
15175a00579J8183k4436J11458J21759r8224l8689n1822N3848j07893N7339R6699
$$ -100579 -82396 -106832 4626 126385 28161 -10528 -62350 -8502 -116395 -59056 37643
15164C7643j3246J45553k326j19876j87748K0906J11385q9115n7256K2755K36810
$$ 37643 24397 169950 167624 47748 -140000 -119094 -7709 -96824 -154080 -131325 105485
15153A05485O9667r4170P137M0982l0653j42941j2600K1398P174p650j8464J2925
$$ 105485 175152 80982 88119 129101 98448 -44493 -57093 -35695 -28521 -36171 -54635 -41710
15141d1710L4634J17056l1934j49820l3437Q749p8014R0407O788N9557p3679j33739
$$ -41710 -7076 109980 78046 -71774 -105211 -96462 -174476 -84069 -77281 -17724 -91403 -225142
15129b25142J08434J08936J04414P4172n0300q1238k9574j01344j20049N3506
$$ -225142 -116708 -7772 96642 170814 120514 39276 9702 -91642 -211691 -158185
15119a58185J52532n725n9773O4156N1965r6225j71862r6311P9020J85872O3536
$$ -158185 -5653 -11378 -71151 -6995 44970 -51255 -223117 -319428 -240408 -54536 9000
15108I000j08428m8629k592J27438M870J04659l8680p1933R7512k110n179n2218
$$ 9000 -99428 -148057 -150649 -23211 -18341 86318 47638 -24295 73217 71107 65928 13710
15096A3710n3671N1855L4947o7956r1893M4091o848P1873p875j13039q9049J10213
$$ 13710 -39961 11894 46841 -21115 -113008 -68917 -75765 -3892 -11767 -124806 -213855 -103642
15084a03642J0680l0508j17695j7586J10317J2103R4262N1518m5773o8530r0429
$$ -103642 -92962 -123470 -241165 -258751 -148434 -136331 -42069 9449 -36324 -104854 -195283
15073a95283M0732K23575N2145q6124j9354o894p3878k1772L5602J69823J12767
$$ -195283 -154551 69024 121169 35045 15691 8797 -65081 -86853 -51251 118572 231339
15062B31339L9684l6542j01399n4228j89521o4852K8226Q1069J81225l4113K4894
$$ 231339 271023 234481 133082 78854 -110667 -175519 -147293 -66224 115001 80888 105782
15051A05782M5553j25045m8916J6093J14900m0294j09705N6708K942j46131L2811
$$ 105782 151335 26290 -22626 -6533 108367 68073 -41632 15076 18018 -128113 -95302
15040i5302j1293J19644J10634N0530Q0561j22549p6417N4750n2220r9975j25684
$$ -95302 -106595 13049 123683 174213 254774 132225 55808 110558 58338 -41637 -167321
15029a67321r1964J5633k839r3403K8894K10466O9284J3312K5849P541l0295o0374
$$ -167321 -259285 -243652 -246491 -339894 -311000 -100534 -31250 -17938 7911 15452 -14843 -75217
15017g5217r9699L5495k6018N0208R7931M3451j05227o138N3140l1494q8747J28076
$$ -75217 -174916 -139421 -165439 -115231 -17300 26151 -79076 -85214 -32074 -63568 -152315 -24239
15005b4239K2908q6382n3738j5482P9276J70993R3065K9257p678p6438j21474
$$ -24239 -1331 -87713 -141451 -156933 -77657 93336 186401 215658 207980 131542 10068
14994A0068R073P7600J9343N2480j02015Q25J69219J03510k416n8622M8987L5810
$$ 10068 19141 96741 116084 168564 66549 67374 236593 340103 337687 279065 328052 363862
14982C63862j8228J703L6330j8953j48749j36912r6671o7283P2715O9099N6530
$$ 363862 345634 347337 383667 364714 215965 79053 -17618 -84901 -12186 56913 113443
14971A13443j1112m6353p2609J2782J21J2730k1799Q3751P1173r1686J22766R3224
$$ 113443 102331 55978 -16631 -3849 -3728 9002 -12797 70954 142127 50441 173207 266431
14959B66431n3672j08671j59586j73793r133K45885J5009o1892j3629L5371J9837
$$ 266431 212759 104088 -55498 -229291 -238424 7461 22470 -39422 -53051 -17680 2157
14948B157j7381q3811q2036J51596J80458J72634o7264r9348j84247j73703p7795
$$ 2157 -15224 -99035 -181071 -29475 150983 323617 256353 157005 -27242 -200945 -278740
14937b78740M6104M0361J15381J08935N1652n0835K1644J05779J9850k4390N9932
$$ -278740 -232636 -192275 -76894 32041 83693 32858 54502 160281 180131 155741 215673
14926B15673k1530J7002j63976P7620M2722J952o1829j2507Q8608l1148M1987
$$ 215673 194143 211145 47169 124789 167511 169463 107634 95127 183735 152587 194574
14915A94574j6946l2485j02088N4086N2470k288k1981M5584j00203j11350K51843
$$ 194574 177628 145143 43055 97141 149611 147323 125342 170926 70723 -40627 211216
14904B11216o3951j84285j60749p9420m4235M0207J49322n6712m9373P1211O9294
$$ 211216 147265 -37020 -197769 -277189 -321424 -281217 -131895 -188607 -237980 -166769 -97475
14893i7475K20167l6024k9744j22002M9444J11099K4266J5599K6235P1875j24509
$$ -97475 122692 86668 56924 -65078 -15634 95465 119731 135330 161565 233440 108931
14882A08931q0379j63765J593Q4227L9234j19770r5973j4682o4632K10506J09617
$$ 108931 28552 -135213 -133620 -49393 -10159 -129929 -225902 -240584 -305216 -94710 14907
14871A4907j48416r4206m2388Q3945J90339Q2879q4262K61P1796n5864K7439o145
$$ 14907 -133509 -227715 -270103 -186158 4181 87060 2798 3059 74855 18991 46430 40285
14859D0285j17636r0634M0283R7136J03563P6145k5321j46833M295J35200J32784
$$ 40285 -77351 -167985 -127702 -30566 72997 149142 123821 -23012 -18717 116483 249267
14848B49267R2268j11879j24734p7687J17576M4800q6067m497P6492o8617m650
$$ 249267 341535 229656 104922 27235 144811 189611 103544 99047 175539 106922 102272
14837A02272m3645n9142j17957R935j19130J5802J66747l0910K0655J09986j3323
$$ 102272 58627 -515 -118472 -108537 -227667 -211865 -45118 -76028 -55373 54613 41290
14826D1290q7291N0760k9987l039J0183j4965q2193J46002P5493k2926K9677R4221
$$ 41290 -46001 4759 -25228 -28267 -18084 -33049 -115242 30760 106253 83327 113004 207225
14814B07225L4429L7667k02996j22927J03839l1844k3779k06007j02782M8867
$$ 207225 241654 279321 76325 -46602 57237 25393 1614 -204393 -307175 -258308
14804b58308J48701j7709N5162K15614J35170o2368j21180k08417o3098q8796
$$ -258308 -109607 -127316 -72154 143460 278630 216262 95082 -113335 -176433 -265229
14794b65229P8929K8927J49463K06733J1888m2127j37869j5257J46419L4269n6683
$$ -265229 -186300 -157373 -7910 198823 210711 168584 30715 15458 161877 196146 139463
14783A39463o2025M7627J28541L8300j12466p1419K916K3220J49651j5566j34410
$$ 139463 77438 125065 253606 291906 179440 108021 110937 134157 283808 268242 133832
14772A33832q7281p4832n7809m8440L6054M3211L9237O9297M1669K4581K084L2959
$$ 133832 46551 -28281 -86090 -134530 -98476 -55265 -16028 53269 94938 119519 121603 154562
14760A54562j0593m1549j3720N6958j20996o0707j02484M1174n4136n4761J7648
$$ 154562 143969 102420 88700 145658 24662 -36045 -138529 -97355 -151491 -206252 -188604
14749a88604J86037O0927n1327o6074j11426J46030J91335J38j25620j11610j9247
$$ -188604 -2567 58360 7033 -59041 -170467 -24437 166898 167036 41416 -70194 -89441
14738h9441Q8504j5025n4123K0438j20321K4106P9696p4806l9258M8352J33235
$$ -89441 -937 -15962 -70085 -49647 -169968 -145862 -66166 -140972 -180230 -131878 1357
14727A357P4378o1784k7455Q3296j21893j62882M4237k665P5042J12041o6044
$$ 1357 75735 13951 -13504 69792 -52101 -214983 -170746 -173411 -98369 13672 -52372
14716e2372r5152q6262O8480J6298j215Q2667j1791N476K3760o458L4635K122
$$ -52372 -147524 -233786 -165306 -149008 -150223 -67556 -79347 -73871 -50111 -56569 -21934 -19812
14704a9812P6648M1020j1408q0806R6280k0806j51424J58568j9677l8445q9162
$$ -19812 56836 97856 86448 5642 101922 81116 -70308 88260 68583 30138 -59024
14693e9024K5288K070Q7683O1183N048j17239o0614n1292R6541J19873j2306O4098
$$ -59024 -33736 -31666 56017 117200 122248 5009 -55605 -106897 -10356 109517 97211 161309
14681A61309q341K09270R1563j74878j50582q1467p18k9800M8357L3587m3069
$$ 161309 152968 362238 453801 278923 128341 46874 46156 16356 64713 98300 55231
14670E5231n6770k1338M2386J1759O1014p9394p7955j5346r7570l0621K22329
$$ 55231 -1539 -22877 19509 31268 92282 12888 -65067 -80413 -177983 -208604 13725
14659A3725k8294r7585k628J06345o4977M8895L7533N6648J9762M5803j76591
$$ 13725 -14569 -112154 -114782 -8437 -73414 -24519 13014 69662 89424 135227 -41364
14648d1364p0086R0805L6313j60227l3084Q5272O5962j47709o6100J67332M1942
$$ -41364 -111450 -20645 15668 -144559 -177643 -92371 -26409 -174118 -240218 -72886 -30944
14637c0944j46510r6711J84738M2459j28624p0278L3901Q6944P318O0201N4329
$$ -30944 -177454 -274165 -89427 -46968 -175592 -245870 -211969 -125025 -117707 -57506 -3177
14626c177j094k5840k5748L3025K7301K986K070r8002K6130l2738l3511L1067
$$ -3177 -4271 -30111 -55859 -22834 4467 7453 9523 -88479 -62349 -95087 -128598 -97531
14614i7531n894Q0285J37651r958Q352r5594j11623l8364l0074Q5829Q0520L0086
$$ -97531 -103425 -23140 114511 104553 112905 17311 -94312 -132676 -162750 -76921 3599 33685
14602C3685l3466j0851K6984o1074O1490K5902O759j10066n167q4773k1174J03758
$$ 33685 219 -10632 16352 -44722 16768 42670 49429 -60637 -65804 -150577 -171751 -67993
14590f7993Q5961J44823j69512j33827l7042R173K4066J29085J67515j0431o5512
$$ -67993 17968 162791 -6721 -140548 -177590 -168417 -144351 -15266 152249 141818 76306
14579G6306j34619q0766j44J34780J79165j24559p6488n9202J07290J90465J42634
$$ 76306 -58313 -139079 -139223 -4443 174722 50163 -26325 -85527 21763 212228 354862
14568C54862q3979k53506k33616q2622K59956J51576r2759p214p0078p2340L7869
$$ 354862 270883 17377 -216239 -298861 -38905 112671 19912 12698 -57380 -129720 -91851
14557i1851J79818J26113j66371r8880N0814L994k1566o4213j38585N6403J33167
$$ -91851 87967 214080 47709 -51171 -357 3637 -17929 -82142 -220727 -164324 -31157
14546c1157n5321M9050O7077q2673J1507J19650m3167o0803O0264o7985o2796
$$ -31157 -86478 -37428 29649 -53024 -41517 78133 34966 -25837 34427 -33558 -96354
14535i6354M3369k91J9134R4836j4506o8276k6396q0456O1743Q9013j341Q4681
$$ -96354 -52985 -53276 -34142 60694 46188 -22088 -48484 -128940 -67197 21816 20475 105156
14523A05156M2362l9607P792p694j23092p2251l6154O8892R2970k9834r5538j3437
$$ 105156 147518 107911 115703 108009 -15083 -87334 -123488 -54596 38374 8540 -86998 -100435
14511a00435j56974j1946J01608q9073m348J66307K50136l7355n2413o091j04357
$$ -100435 -257409 -269355 -167747 -256820 -261168 -94861 155275 117920 65507 59416 -44941
14500d4941j7487J43746m6518m4493n891O7093M5202n3453j6322k7813n6251Q5881
$$ -44941 -62428 81318 34800 -9693 -15584 51509 96711 43258 26936 -877 -57128 28753
14488B8753L9485j05818K1119J22740L5887l1805j61601o9759k0049L6149L6395
$$ 28753 68238 -37580 -16461 106279 142166 110361 -51240 -120999 -141048 -104899 -68504
14477f8504K2224j6210K8877P9148N5231j34788p5348J15140O7841N9175O8838
$$ -68504 -46280 -62490 -33613 45535 100766 -34022 -109370 5770 73611 132786 201624
14466B01624q115j51365q4414m0044q3803M9387l8227M2638k6414K7575J10016
$$ 201624 193509 42144 -42270 -82314 -166117 -116730 -154957 -112319 -138733 -111158 -1142
14455a142L1577O962q2923j12967J14580J14147N3701o9690n7956k2908j8382
$$ -1142 30435 37397 -45526 -158493 -43913 70234 123935 54245 -3711 -26619 -45001
14444d5001Q4554J7452J067L2883r1304R43m2532O5559J39643j16687p7359O5430
$$ -45001 39553 57005 58072 90955 -349 594 -41938 23621 163264 46577 -30782 34648
14432C4648j9847K6506L246r0805l5319P3045P850O89J30546M5494l2386m8341
$$ 34648 14801 41307 44553 -46252 -81571 -8526 -676 13 130559 176053 143667 95326
14420I5326l0822O498Q4373J0911j39028j9299K01619J5844j23014j43133p8390
$$ 95326 64504 71002 155375 166286 27258 7959 209578 225422 102408 -40725 -119115
14409a19115J02895o5421r5670r6943J31070J06679R6855r1443N8684M8510k4203
$$ -119115 -16220 -81641 -177311 -274254 -143184 -36505 60350 -31093 27591 76101 51898
14398E1898r1883o2918J1051O8975J19124J08111j08008j31077M5602O9697Q599
$$ 51898 -39985 -102903 -91852 -22877 96247 204358 96350 -34727 10875 80572 89171
14387H9171J4624R3253J9499j500p3648j35891l2629k0410J7709K8486J2784p9536
$$ 89171 103795 197048 216547 215047 141399 5508 -27121 -47531 -29822 -1336 11448 -68088
14375f8088j05166L9670R0181p0435j49540n3642R7539L4308o5133K9281J49923
$$ -68088 -173254 -133584 -43403 -113838 -263378 -317020 -219481 -185173 -250306 -221025 -71102
14364g1102j3191m7061N3005K5975L0136j1426K8407J0073q8311l5437m4891j0204
$$ -71102 -84293 -131354 -78349 -52374 -22238 -33664 -5257 4816 -83495 -118932 -163823 -174027
14352a74027l8953j563L8123K97P6910J56330m5744J067Q6891M4001L5876K455
$$ -174027 -212980 -214543 -176420 -176123 -99213 57117 11373 12440 99331 143332 179208 181663
14340A81663j35097J08K10773R0940l3345o1721n0638j2355P9566l4474p1308
$$ 181663 46566 46674 257447 348387 315042 253321 202683 190328 269894 235420 164112
14329A64112k6124l9221m2964p7379k21875K0751O0720J46884J98182m1218n7359
$$ 164112 137988 98767 55803 -21576 -243451 -222700 -161980 -15096 183086 141868 84509
14318H4509j33385K0656M688J11614k0094O2425o6609j41313j253O7552k1501
$$ 84509 -48876 -28220 -23532 88082 67988 130413 63804 -77509 -78762 -11210 -32711
14307c2711k82p4470k0691n2602J82097k9342m0771L0281j63281n6664J28372
$$ -32711 -32993 -107463 -128154 -180756 1341 -28001 -68772 -38491 -201772 -258436 -130064
14296a30064N5355J31001J14795l446j26208N7235Q5193j23072q4788M310k2340
$$ -130064 -74709 56292 171087 167641 41433 98668 183861 60789 -23999 -19689 -42029
14285d2029l4665r440j08971l532P4111O9851R8610l9074o0930j3841M2541N8276
$$ -42029 -76694 -86134 -195105 -198637 -124526 -54675 43935 4861 -56069 -69910 -27369 30907
14273C0907o4526j22374N1233J37758j25106p6334L1540O2335J4710Q8985j52511
$$ 30907 -33619 -155993 -104760 32998 -92108 -168442 -136902 -74567 -59857 29128 -123383
14262a23383j39456P1922R9069J15722J30549P0316l6709j32184j23240K3302
$$ -123383 -262839 -190917 -91848 23874 154423 224739 188030 55846 -67394 -44092
14252d4092k2187N2141L3695p5995n5366J62623Q0446j16135j22488O7599J39776
$$ -44092 -66279 -14138 19557 -56438 -111804 50819 131265 15130 -107358 -39759 100017
14241A00017o7745j18139m5066J74355J04271l3871o1851q0463n3813L1496j19372
$$ 100017 32272 -85867 -130933 43422 147693 113822 51971 -28492 -82305 -50809 -170181
14230a70181P1433n2360k4327k2111P1866o0500k41698Q0325K72223J28006J41593
$$ -170181 -98748 -151108 -175435 -197546 -125680 -186180 -427878 -347553 -75330 52676 194269
14219A94269k539j47655l5959o073r0239M8946J06763R830k83525p7681M1375
$$ 194269 191730 44075 8116 2043 -88196 -39250 67513 77343 -206182 -283863 -242488
14208b42488J42805J107K0072Q7182O0536L8999j76751k0753J9939J21692j3770
$$ -242488 -99683 -98576 -78504 8678 69214 108213 -68538 -89291 -69352 52340 38570
14197C8570j539J27400K7412m8185o9699J11097l8912j36903p3499L9746N9911
$$ 38570 37031 164431 191843 143658 73959 185056 146144 9241 -64258 -24512 35399
14186C5399p7466r0098L1100O622N8881k3065k3830l6068n003n0534k9256k4964
$$ 35399 -42067 -132165 -101065 -94443 -35562 -58627 -82457 -118525 -123528 -174062 -203318 -228282
14174b28282M9988N4235m6440l832O1605p9508J43876O8277j88092q0958Q3036
$$ -228282 -178294 -124059 -170499 -174331 -112726 -192234 -48358 19919 -168173 -249131 -166095
14163a66095N3029R9170J112l0791O1038l3054m4698j5714J05838N4966j77422
$$ -166095 -113066 -13896 -12784 -43575 17463 -15591 -60289 -76003 29835 84801 -92621
14152i2621j96552l2177n6367L2721K29264J3141n0932R8803J82011q8860k20356
$$ -92621 -289173 -321350 -377717 -344996 -115732 -102591 -153523 -54720 127291 38431 -181925
14141a81925Q624O4948J34571L8781l9060l4684J8968j02183p9813L6922J99467
$$ -181925 -173301 -108353 26218 64999 25939 -8745 10223 -91960 -171773 -134851 64616
14130F4616L9613Q6943M0192M0825j42519r9645N6187L8915K9060j55563j06617
$$ 64616 104229 191172 231364 272189 129670 30025 86212 125127 154187 -1376 -107993
14119a07993M0637P1979R4085M6814j05327j3715l3424j4502M475Q9015M77j24387
$$ -107993 -67356 4623 98708 145522 40195 26480 -6944 -21446 -16971 72044 72521 -51866
14107e1866j4843r490J25574P9804l2216j10506m2412K0364O6583j20759k1736
$$ -51866 -66709 -76199 49375 129179 96963 -13543 -55955 -35591 30992 -89767 -111503
14096a11503r2802Q1726R1056k3710J51503P4403n3730o3226j9612P6995o8982
$$ -111503 -204305 -122579 -31523 -55233 96270 170673 116943 53717 34105 111100 42118
14085D2118j0034J11275O2605j42783j36102J7420j8360m710N0261j1260J8645
$$ 42118 32084 143359 205964 63181 -72921 -55501 -73861 -78571 -28310 -39570 -20925
14074b0925P3438J06810K8925o0824n1013m6314J5579Q4165o7718o5670j22468
$$ -20925 52513 159323 188248 127424 76411 30097 45676 129841 62123 -3547 -126015
14063a26015J7310O7798p2273r3901k6094Q6568O7171O3235m8679M8863O6311
$$ -126015 -108705 -40907 -113180 -207081 -233175 -146607 -79436 -16201 -64880 -16017 50294
14052E0294Q887j72908j78268J85033J20227o9285q1206o5238R3127P6877j69674
$$ 50294 59181 -113727 -291995 -106962 13265 -56020 -137226 -202464 -109337 -32460 -202134
14041b02134j59920j0536k193m9525r4399J05786N4953k6069J55364L6330K26884
$$ -202134 -362054 -372590 -374783 -424308 -518707 -412921 -357968 -384037 -228673 -192343 34541
14030C4541J207L3341M669P0097j13356j66814N3072K07912n1127q7628j12669
$$ 34541 35748 69089 73758 143855 30499 -136315 -83243 124669 73542 -14086 -126755
14019a26755q0078n0358l3857J09163J89640k0904j12655Q0356j50780k028N1368
$$ -126755 -206833 -257191 -291048 -181885 7755 -13149 -125804 -45448 -196228 -198256 -146888
14008a46888M2424o2431J73090O6919p6285m0545k788L3331L1832o2909q5989
$$ -146888 -104464 -166895 6195 73114 -3171 -43716 -46504 -13173 18659 -44250 -130239
13997a30239O8910J11393O0383j0192L3325m742k5348o0639r3592p0662K6309
$$ -130239 -61329 50064 110447 100255 133580 128838 103490 42851 -50741 -121403 -95094
13986i5094k7185J46579M8412M2834J77353j8924j38840k238q873q4661j8790
$$ -95094 -122279 24300 72712 115546 292899 273975 135135 132897 124024 39363 20573
13975B0573R620O2282k2790j8624j36145j32135j0494N9053R1815p1953J9209
$$ 20573 30193 92475 69685 51061 -85084 -217219 -227713 -168660 -76845 -148798 -129589
13964a29589P4430K7450N9030n7859o7358j7134N0264j3758O5590n1972j43125
$$ -129589 -55159 -27709 31321 -26538 -93896 -111030 -60766 -74524 -8934 -60906 -204031
13953b04031J06722M9922l813n1097J4555n953q2783j00142J16616Q8960K1595
$$ -204031 -97309 -47387 -51200 -102297 -87742 -93695 -176478 -276620 -160004 -71044 -49449
13942d9449p9835M8816R2525M8008O667R0896M280k40711k12885m695j385k3636
$$ -49449 -129284 -80468 12057 60065 66732 157628 161908 -78803 -291688 -296383 -297768 -321404
13930c21404J78721N2987J18448K03348p4233q7479P0152P5935k3090m0692P2520
$$ -321404 -142683 -89696 28752 232100 157867 70388 140540 216475 193385 152693 225213
13919B25213r7780q0625n9707j44516K2096K25438M0293p8791j80470r7715P1085
$$ 225213 127433 46808 -12899 -157415 -135319 90119 130412 51621 -128849 -226564 -155479
13908a55479R5510R8141P5047m1752K0642j63840m5157j7067l1299O9427R0741
$$ -155479 -59969 38172 113219 71467 92109 -71731 -116888 -133955 -165254 -95827 -5086
13897e086N2029q7490Q285r2322p0312J43986M5842j6634j07970K7295m2544k2721
$$ -5086 46943 -40547 -32262 -124584 -194896 -50910 -5068 -21702 -129672 -102377 -144921 -167642
13885a67642Q794J19132M586p3463J4164J13297J20840l461r9253n7728l5856
$$ -167642 -158848 -39716 -35130 -108593 -94429 18868 139708 136247 36994 -20734 -56590
13874e6590O9174n0277M5260q732j60086Q8843J08902R0590K6390j79923O186
$$ -56590 12584 -37693 7567 -1165 -161251 -72408 36494 127084 153474 -26449 -20263
13863b0263p2186M9506J49727J34271M2682j14078j89150n1580K5556r4697K1871
$$ -20263 -92449 -42943 106784 241055 283737 169659 -19491 -71071 -45515 -140212 -118341
13852a18341O4033J7821J59743j88240p1051J99458Q8039r3854K9076M8877r7071
$$ -118341 -54308 -36487 123256 -64984 -136035 63423 151462 57608 86684 135561 38490
13841C8490K614m6481O5191J3436q8259K5553m2152q4732r201J3455O9917K5457
$$ 38490 41104 -5377 59814 73250 -15009 10544 -31608 -116340 -125541 -112086 -42169 -16712
13829a6712L7392j54366j21384J45308R1700o0093o6339j7454j31790M7840k9061
$$ -16712 20680 -133686 -255070 -109762 -18062 -78155 -144494 -161948 -293738 -245898 -274959
13818b74959O6861J39519J16154o768r2060O842P9029K109o4684j25717J5413
$$ -274959 -208098 -68579 47575 40807 -51253 -44411 34618 36727 -27957 -153674 -138261
13807a38261l2670o2957R7781J49993M6537j6366K5814K335r8906j31421l5683
$$ -138261 -170931 -233888 -136107 13886 60423 44057 69871 72206 -26700 -158121 -193804
13796a93804k1672K07455J41342K8003R6263m7227p0160j48940r6238K2635Q3000
$$ -193804 -215476 -8021 133321 161324 257587 210360 140200 -8740 -104978 -82343 657
13785F57m5039j14285j2107J34682M4841J5392P5734k16941l113J09678P7187
$$ 657 -44382 -158667 -170774 -36092 8749 24141 99875 -117066 -120179 -10501 66686
13774F6686O9313N9764j17351r7716p8432J78452J27944L7974p8610r3467m7003
$$ 66686 135999 195763 78412 -19304 -97736 80716 208660 246634 168024 74557 27554
13763B7554r5918R5790L4880p4517L0781n3831n4996n2268j46601P9333J17676
$$ 27554 -68364 27426 62306 -12211 18570 -35261 -90257 -142525 -289126 -209793 -92117
13752i2117J98330j20703r1242J56700J23935m6099N0820n7650j48508j01431
$$ -92117 106213 -14490 -105732 50968 174903 128804 179624 121974 -26534 -127965
13742a27965P3367M1358Q2992j2943j32318o0172K22009J07037j52450k2787J9954
$$ -127965 -54598 -13240 69752 56809 -75509 -135681 86328 193365 40915 18128 38082
13731C8082l1323Q869l7890O9053N0914j12563n5245L1694n5664n1518L6916M4003
$$ 38082 6759 15628 -22262 46791 97705 -14858 -70103 -38409 -94073 -145591 -108675 -64672
13719f4672l433j09757N3344J55827k8386Q6283j5257o6332j39402L7397J73068
$$ -64672 -68105 -177862 -124518 31309 2923 89206 73949 7617 -131785 -94388 78680
13708G8680M289n3184K961K7041Q085l8613q7655o3921P8126J81347n7627j19324
$$ 78680 82969 29785 32746 59787 67872 29259 -58396 -122317 -44191 137156 79529 -39795
$$ [...]
##END NTUPLES=NMR SPECTRUM
##END=
