##TITLE=Analysis number 322585
Compound Code sb 02090
Project Code adrs
Chemist Name komarov
##JCAMPDX= 6.0         $$ Bruker NMR JCAMP-DX V2.0
##DATA TYPE= NMR SPECTRUM
##DATA CLASS= NTUPLES
##ORIGIN= Bruker BioSpin GmbH
##OWNER= nmr
$$ XWIN-NMR		Version 3.5
$$ Mon Oct  2 09:05:52 2006 GMT Daylight Time (UT+1h)  MAYBRIDGE\nmr@NMR_250MHZ
##.OBSERVE FREQUENCY= 250.131544655141
##.OBSERVE NUCLEUS= ^1H
##.ACQUISITION MODE= SIMULTANEOUS (DQD)
##.ACQUISITION SCHEME= undefined
##.AVERAGES= 16
##.DIGITISER RES= 18
##SPECTROMETER/DATA SYSTEM= dpx250
##.PULSE SEQUENCE= zg30
##.SOLVENT NAME= DMSO
##.SHIFT REFERENCE= (INTERNAL, DMSO, 0, 16.522)
##AUDIT TRAIL= $$ (NUMBER, WHEN, WHO, WHERE, WHAT)
$$ ##TITLE= Audit trail, XWIN-NMR		Version 3.5
$$ ##JCAMPDX= 5.01
$$ ##ORIGIN= Bruker BioSpin GmbH
$$ ##OWNER= nmr
$$ C:\u/data/dgb/nmr/ADRS/10/pdata/1/auditp.txt
$$ ##AUDIT TRAIL=  $$ (NUMBER, WHEN, WHO, WHERE, WHAT)
(   1,<2006-10-02 09:05:22.96 +100>,<MAYBRIDGE\nmr>,<NMR_250MHZ>,
      <created by zg, POWCHK disabled, PULCHK disabled
       configuration hash MD5:
       E2 DF 36 D8 04 B2 41 60 5A D7 A3 38 5A 4B D0 FE
       data hash MD5: 64K
       58 03 35 02 23 01 32 4E BF A7 74 58 0E F1 07 BB>)
(   2,<2006-10-02 09:05:39.71 +100>,<MAYBRIDGE\nmr>,<NMR_250MHZ>,
      <Start of raw data processing
       ef LB = 0.3 FT_mod = 6 PKNL = 1 SI = 32K 
       data hash MD5: 32K
       5E 69 50 6A D8 BD 57 09 33 88 DC 31 12 F4 CB E0>)
(   3,<2006-10-02 09:05:41.79 +100>,<MAYBRIDGE\nmr>,<NMR_250MHZ>,
      <apk 
       data hash MD5: 32K
       BF FC 51 5B 33 91 DA C1 AE 51 76 35 5F CD 44 FC>)
(   4,<2006-10-02 09:05:42.63 +100>,<MAYBRIDGE\nmr>,<NMR_250MHZ>,
      <abs ABSG = 5 
       data hash MD5: 32K
       79 9C FA 47 E4 D3 0E 98 2A 9C BF 41 A4 AA D5 CD>)
$$ ##END=
$$ 
$$ hash MD5
$$ 23 9D 7D 5E F1 25 89 F9 54 81 48 3E 1C 09 EB 3D
##$RELAX= 
##$RELAX= 
##$RELAX= 
##$RELAX= 
##$RELAX= 
##$RELAX= 
##$RELAX= 
$$ Bruker specific parameters
$$ --------------------------
##$DU= <C:\u>
##$EXPNO= 10
##$NAME= <ADRS>
##$PROCNO= 1
##$TYPE= <nmr>
##$USER= <dgb>
##$AMP= (0..31)
100 100 100 100 100 100 100 100 100 100 100 100 100 100 100 100 100 100 
100 100 100 100 100 100 100 100 100 100 100 100 100 100 
##$AQSEQ= 0
##$AQ_mod= 3
##$AUNM= <au_zg>
##$AUTOPOS= <12 >
##$BF1= 250.13
##$BF2= 250.13
##$BF3= 250.13
##$BF4= 250.13
##$BF5= 500.13
##$BF6= 500.13
##$BF7= 500.13
##$BF8= 500.13
##$BYTORDA= 1
##$CFDGTYP= 0
##$CFRGTYP= 5
##$CHEMSTR= <none>
##$CNST= (0..31)
1 1 145 1 1 1 1 1 1 1 1 1 1 1 1 1 1 1 1 1 1 1 1 1 1 1 1 1 1 1 1 1 
##$CPDPRG= <>
##$CPDPRG1= <>
##$CPDPRG2= <>
##$CPDPRG3= <>
##$CPDPRG4= <mlev>
##$CPDPRG5= <mlev>
##$CPDPRG6= <mlev>
##$CPDPRG7= <mlev>
##$CPDPRG8= <mlev>
##$CPDPRGB= <>
##$CPDPRGT= <>
##$D= (0..31)
0 1 0 0 0 0 0 0 0 0.06 0 0 0 0 0 0 0.0002 0 0 0 0 0 0 0 0 0 0 0 0 0 0 
0 
##$DATE= 1159776321
##$DBL= (0..7)
120 120 120 120 120 120 120 120 
##$DBP= (0..7)
150 150 150 150 150 150 150 150 
##$DBP07= 0
##$DBPNAM0= <>
##$DBPNAM1= <>
##$DBPNAM2= <>
##$DBPNAM3= <>
$$ [...]
##$SUBNAM6= <"">
##$SUBNAM7= <"">
##$SUBNAM8= <"">
##$SUBNAM9= <"">
##$SW= 20.6930455092707
##$SWIBOX= (0..15)
0 0 3 0 0 0 0 0 0 0 0 0 0 0 0 0 
##$SW_h= 5175.983436853
##$TD= 65536
##$TD0= 1
##$TE= 296.16
##$TE2= 300
##$TE3= 300
##$TEG= 300
##$TL= (0..7)
0 120 120 120 120 120 120 120 
##$TP= (0..7)
150 150 150 150 150 150 150 150 
##$TP07= 0
##$TPNAME0= <>
##$TPNAME1= <>
##$TPNAME2= <>
##$TPNAME3= <>
##$TPNAME4= <>
##$TPNAME5= <>
##$TPNAME6= <>
##$TPNAME7= <>
##$TPOAL= (0..7)
0.5 0.5 0.5 0.5 0.5 0.5 0.5 0.5 
##$TPOFFS= (0..7)
0 0 0 0 0 0 0 0 
##$TUNHIN= 0
##$TUNHOUT= 0
##$TUNXOUT= 0
##$USERA1= <user>
##$USERA2= <user>
##$USERA3= <user>
##$USERA4= <user>
##$USERA5= <user>
##$V9= 5
##$VALIST= <valist>
##$VCLIST= <CCCCCCCCCCCCCCC>
##$VD= 0
##$VDLIST= <DDDDDDDDDDDDDDD>
##$VPLIST= <PPPPPPPPPPPPPPP>
##$VTLIST= <TTTTTTTTTTTTTTT>
##$WBST= 1024
##$WBSW= 4
##$XGAIN= (0..3)
0 0 0 0 
##$XL= 0
##$YL= 0
##$YMAX_a= 499460
##$YMIN_a= -462439
##$ZGOPTNS= <>
##$ZL1= 120
##$ZL2= 120
##$ZL3= 120
##$ZL4= 120
##$ABSF1= 16.522
##$ABSF2= -4.171173
##$ABSG= 5
##$ABSL= 3
##$ALPHA= 0
##$AQORDER= 0
##$ASSFAC= 0
##$ASSFACI= 0
##$ASSFACX= 0
##$ASSWID= 0
##$AUNMP= <proc_1d>
##$AZFE= 0.1
##$AZFW= 0.1
##$BCFW= 0
##$BC_mod= 0
##$BYTORDP= 0
##$COROFFS= 0
##$CY= 12.5
##$DATMOD= 1
##$DC= 0
##$DFILT= <>
##$DTYPP= 0
##$F1P= 14.0000005364418
##$F2P= -0.99999901652339
##$FCOR= 0.5
##$FTSIZE= 32768
##$FT_mod= 6
##$GAMMA= 0
##$GB= 0
##$INTBC= 1
##$INTSCL= 1
##$ISEN= 128
##$LB= 0.3
##$LEV0= 0
##$LPBIN= 0
##$MAXI= 10000
##$MC2= 0
##$MEAN= 0
##$ME_mod= 0
##$MI= 0
##$NCOEF= 0
##$NC_proc= -3
##$NLEV= 6
##$NOISF1= 0
##$NOISF2= 0
##$NSP= 0
##$NTH_PI= 0
##$NZP= 0
##$OFFSET= 16.522
##$PC= 1
##$PHC0= 143.683
##$PHC1= 1.848289
##$PH_mod= 1
##$PKNL= yes
##$PPARMOD= 0
##$PSCAL= 4
##$PSIGN= 0
##$REVERSE= no
##$SF= 250.13
##$SI= 32768
##$SIGF1= 0
##$SIGF2= 0
##$SINO= 400
##$SIOLD= 32768
##$SREGLST= <1H.DMSO>
##$SSB= 0
##$STSI= 32768
##$STSR= 0
##$SW_p= 5175.98343685301
##$SYMM= 0
##$S_DEV= 0
##$TDeff= 65536
##$TDoff= 0
##$TI= <Analysis number 999999
Compound Code 99
Book Reference 9
Project Code 9>
##$TILT= no
##$TM1= 0
##$TM2= 0
##$TOPLEV= 0
##$USERP1= <user>
##$USERP2= <user>
##$USERP3= <user>
##$USERP4= <user>
##$USERP5= <user>
##$WDW= 1
##$XDIM= 32768
##$YMAX_p= 350189071
##$YMIN_p= -166358
$$ End of Bruker specific parameters
$$ ---------------------------------
##NTUPLES= NMR SPECTRUM
##VAR_NAME=  FREQUENCY,     SPECTRUM/REAL,   SPECTRUM/IMAG
##SYMBOL=    X,             R,               I
##VAR_TYPE=  INDEPENDENT,   DEPENDENT,       DEPENDENT
##VAR_FORM=  AFFN,          ASDF,            ASDF
##VAR_DIM=   32768,         32768,           32768
##UNITS=     HZ,            ARBITRARY UNITS, ARBITRARY UNITS
##FACTOR=    0.157963299565203, 1,           1
##FIRST=     4132.6476996994, 0,             0
##LAST=      -1043.33573715361, 0,           0
##MIN=       -1043.33573715361, -166358,     0
##MAX=       4132.6476996994, 350189071,     0
$$ Real data points
##PAGE= N=1
##DATA TABLE= (X++(R..R)), XYDATA
$$ [...]
15090A2686J4620N509l426j8235k2373r108r373K9120R485L281p903j1783K397
15077e103K1011J8043J5961j0626j3054j7416m2921J1628J9997p763K0953K4477
15065C5187M039l1051Q416L3106O543l0763o711J403k2176j7785R979P345J391
15052a077o475m2348j9201N5258J1836j3311j1408J0227L558m283j0153L148l888
15039b8117J0199L716J4597J4943Q402k9318l5576L563J2977n830P673J1492o0
15026a1339k737L8074m19n6545k3090l119L8879K8682L846n683l9748k811L1065
15013d945L2472J0705p943j9928J6526k8570j7228J7381K4199J5048l4412j3694
15001a0389J2941q519L396l193k1791R159K4052L7111l444j3816N269M19j065
$$ plain form
15090 12686 27306 32815 29389 11154 -11219 -20327 -29700 -580 8905 12186 4283 -7500 -5103
15077 -5103 15908 33951 49912 39286 26232 8816 -34105 -22477 -2480 -10243 10710 35187
15065 35187 39226 8175 16591 49697 56240 25477 18766 20169 -2007 -19792 -9813 -2468 -1077
15052 -1077 -7552 -49900 -69101 -13843 -2007 -15318 -26726 -16499 -12941 -17224 -27377 -24229 -28117
15039 -28117 -17918 -14202 395 15338 23740 -5578 -41154 -37591 -24614 -30444 -22771 -11279 -11339
15026 -11339 -14076 23998 23579 -32966 -56056 -59175 -20296 8386 12232 6549 -33199 -36010 -4945
15013 -4945 27527 38232 30289 10361 26887 -1683 -18911 -1530 22669 37717 3305 -10389
15001 -10389 2552 -5967 -2571 -5764 -27555 -18396 5656 42767 39323 25507 30776 31195 30130
14988C0130k0877J3926L118j1036O19J9616n951l0164j3400N1971K4597j9962
14976D2587l0910m134N795J8695J9081K2994n504K745J6477j2939k1098L977p932
14963D9834N887k4810j9783j8606l489j4347M0K7514p055M166R637k8904J4600
14950e316J6545k810k0278j453p996J0725J5179O261o027q188l8609J980J9796
14937b0191m823J4741m307J0979k1743n548J4509k2624Q936k44j7757m9728j0579
14924a08379K9720J4535K446K8730n045K2637P415K506J1715J497j4967J0149
14912B959j0510J6046j5292M466K8971J7369Q028k8556n4509k4596J5702K0581
14900a9341o344o452k8495J9887K4246M9534J9701j9253p188J1460J0802j5578
$$ plain form
14988 30130 9253 23179 26297 15261 15880 35496 29545 -619 -14019 37952 62549 42587
14976 42587 11677 7543 13338 32033 51114 74108 68604 71349 87826 74887 53789 57766 49834
14963 49834 55721 30911 11128 -7478 -10967 -25314 -25274 2240 -4815 -649 8988 -19916 -5316
14950 -5316 11229 8419 -11859 -13312 -21308 -10583 4596 10857 4830 -3358 -41967 -39987 -20191
14937 -20191 -25014 -10273 -14580 -3601 -25344 -30892 -16383 -39007 -30071 -30315 -48072 -97800 -108379
14924 -108379 -78659 -64124 -61678 -32948 -37993 -15356 -7941 -5435 6280 7777 -7190 2959
14912 2959 -7551 8495 -6797 -2331 26640 44009 52037 23481 -31028 -55624 -39922 -19341
14900 -19341 -25685 -32137 -60632 -40745 -16499 33035 52736 33483 26295 37755 48557 32979
14888C2979l5105l7588K9939O1208O187m3952j9900J3221J7571J4407L4m5817
14876f816k5753P199J1529j4157m709J4049J4292j3430l593j524M971J6451j1979
14863a3470k1049K6285J0476N309J6010K6337L625m3121l1857k8412J2887Q595
14851b8385J3850J4615J0487J5417R402k226k8586k7613J9248k240J4473q699
14839b57j6855J4774K8138L782r966O698j495l1748K9616J9649o413l9801m315
14826h193o68j8087K0411J3842j5804m6910N907M0287L2267P631k9135j6413p420
14813b2285J8084J5501O351l4989j3335K5418Q011o522L499j8893j6315K4482
14801a0993K6684R021j9817O918n008M6097J4922k7628k7090j5761k4413j7127
$$ plain form
14888 32979 -2126 -39714 -9775 51433 57620 13668 -6232 6989 24560 38967 39001 -6816
14876 -6816 -32569 -25370 -13841 -27998 -32707 -18658 -4366 -17796 -21389 -22913 -17942 -1491 -13470
14863 -13470 -34519 -8234 2242 7551 23561 49898 53523 10402 -21455 -49867 -36980 -28385
14851 -28385 -14535 80 10567 25984 35386 33160 4574 -23039 -3791 -6031 8442 -257
14839 -257 -17112 -2338 25800 29582 19616 26314 24819 -6929 22687 42336 35923 -3878 -8193
14826 -8193 -8861 -26948 -6537 7305 -8499 -55409 -49502 -9215 23052 30683 1548 -14865 -22285
14813 -22285 -4201 11300 17651 -17338 -30673 -5255 2756 -3766 -267 -19160 -35475 -10993
14801 -10993 15691 24712 4895 11813 6805 52902 67824 40196 13106 -2655 -27068 -44195
14789d4195o952Q002J8107L7424J8127j3193L88j5922j6501k2180R979K9089R808
14776A1981L434J0616J6970R131o015k4612l0180k0927K2596q409r052o194Q508
14763b2153J0605l050J4928r596J511J0659m182L213p26K5480J7001l7588r618
14750c516j8793M602J54j1524J605J8475K5290j523L0768J9977k769j9033j8736
14737B4977o657K6j6536j0940R816J066l889M096J9689Q961J0006L5600j4121
14724F2094o706j1090k0601j5290p989j5358J2600J5198p587n428m968R956k300
14711B531j870j1055q737N460k254K3230J4109j1537N839j1749J0074j1062l662
14698f83J7349j3461J6678K4082j2481L27q55k3333j951R311J390L4790O890l8646
$$ plain form
14789 -44195 -51147 -43145 -25038 12386 30513 17320 17708 1786 -14715 -36895 -26916 2173 11981
14776 11981 15415 26031 43001 52132 46117 21505 -8675 -29602 -7006 -15415 -24467 -30661 -22153
14763 -22153 -11548 -14598 330 -9266 -7755 2904 -1278 1935 1209 26689 43690 6102 -3516
14750 -3516 -22309 -17707 -17553 -29077 -27472 -8997 16293 14770 45538 65515 62746 43713 24977
14737 24977 18320 18346 1810 -9130 686 1752 -2137 1959 21648 30609 40615 76215 62094
14724 62094 55388 44298 23697 8407 418 -14940 -2340 12858 5271 -157 -5125 4831 2531
14711 2531 661 -10394 -19131 -13671 -15925 7305 21414 9877 15716 3967 14041 2979 -683
14698 -683 16666 3205 19883 43965 31484 31811 30956 7623 5672 14983 16373 51163 58053 19407
14684A9407q528J5184j0900l2871J0761L5141j4980k0832J64J9707j2k6339l4549
14671d8647O81J9763P64L740k1286M038j820J94K83j792O680r72K0318J5006M670
14656A620m78j4579j1374k217J64M4988N258j6902l5999M812n032l532k65J1239
14642b2297q279J4762L0552q84j5762j1378J6937l994L632o984m395N69m492J6022
14628D009N907P620n173K0961K510k8606j6457M198J4078J477q796r752K0704
14615A2680K960j2604m93J0101j1914J1239J3898j1036j9733l1414K9939K1112
14603A4735j2363O48j8449j8268r729J4792J2638j5235m339K2880j050l470N783
14590a1427N610k684j2241j783j7671J4743J9793q409L1018n948j682k5993j6032
$$ plain form
14684 19407 10879 26063 15163 -17708 -6947 28194 13214 -7618 -7454 12253 12241 -14098 -48647
14671 -48647 -47966 -28203 -27439 -23699 -44985 -40947 -42767 -42573 -42290 -44082 -37402 -38374 -18056 -3050 1620
14656 1620 1142 -13437 -24811 -27028 -26864 18124 23382 6480 -29519 -24707 -29739 -33271 -33536 -22297
14642 -22297 -30576 -15814 14738 13854 -1908 -13286 3651 -343 3289 -3695 -8090 -7521 -12013 4009
14628 4009 9916 17536 12363 33324 35834 7228 -9229 -5031 9047 10524 1728 -8024 12680
14615 12680 15640 3036 2543 12644 730 11969 25867 14831 -4902 -36316 -6377 14735
14603 14735 2372 3020 -15429 -33697 -43426 -28634 -15996 -31231 -35570 -12690 -13740 -17210 -11427
14590 -11427 -5817 -8501 -20742 -22525 -40196 -25453 -5660 -14069 16949 11001 9319 -16674 -32706
14577c2706R417L1240J0046J1487L253m2883k2015m721L6021j1017k0140j1469
14565d3487J0057L6454o688k2020k989K3470k2218o0M4859J7370j5783M763L4268
14552E7996j1395m0557r184J4596K3064K4798j0847l4345j9757r564j3274j6206
14540d4675j6651M758J5503K5591j4434p321J4022J5712R828J3463j3195k7272
14528b4671j7060J155N883M2376J5347o367k4611M731J2092j716j7832j0087J4565
14515f195q026j8407p360K461m702j1107L0393K7529P539j1107m480J5561j4079
14502a980l1833R22K9627O305J432j3885R309j5697k040K519o483j0100K0110
14489a1794m484m4368L674K9821j130l23J6776O945J9429J1384R431R305o262
$$ plain form
14577 -32706 -23289 7951 17997 29484 32737 -10146 -32161 -36882 -861 -11878 -32018 -43487
14565 -43487 -33430 3024 -3664 -25684 -28673 -5203 -27421 -27481 17378 34748 18965 23728 57996
14552 57996 46601 6044 -3140 11456 34520 59318 48471 14126 -5631 -15195 -28469 -44675
14540 -44675 -61326 -56568 -41065 -15474 -29908 -37229 -23207 -7495 2333 15796 2601 -24671
14528 -24671 -41731 -40576 -34693 7683 23030 16663 -7948 -3217 8875 7159 -10673 -20760 -6195
14515 -6195 -14221 -32628 -39988 -37527 -42229 -53336 -22943 4586 12125 1018 -3462 12099 -1980
14502 -1980 -33813 -32891 -3264 3041 4473 -9412 -103 -15800 -17840 -15321 -21804 -31904 -11794
14489 -11794 -16278 -60646 -56972 -27151 -28281 -28604 -11828 -4883 14546 25930 35361 44666 38404
14476C8404j7115k683l8884j3985J2991L5517J0293j279r344J2699j9108P220
14464A4726J0101N504j3203o835P278R795j1521j2634j7099Q701Q163j6459O867
14451f616J7721k3684m260j9347j7146J9637L5184J5258J9537M865Q383k7304
14439B2228l4724J267m066K8454m4055l2295r616p810K2804K2452J6582M5027
14427B6248J9212m1039k0984R123k506J0005P789l88P275j095k1000k5004K0286
14414a2078J4787k3838j8849j878K1274k7020k0488M598J4944J7579k44q103q708
14401d8024J819J789J9299J1191J4379j1662l1483k0625K5378O482k2023K6149
14389b7331L2452Q364j915j7406R83L68j5566l907N500p940L401k7229J2316J7481
$$ plain form
14476 38404 21289 18606 -20278 -34263 -21272 14245 24538 23259 13915 26614 7506 14726
14464 14726 24827 30331 17128 10293 17571 27366 15845 3211 -13888 -5187 2976 -13483 -6616
14451 -6616 11105 -12579 -16839 -36186 -53332 -33695 1489 16747 36284 41149 49532 22228
14439 22228 -12496 -11229 -15295 13159 -30896 -63191 -72807 -80617 -57813 -35361 -18779 26248
14427 26248 45460 4421 -16563 -7440 -9946 59 7848 7460 14735 13640 -7360 -32364 -12078
14414 -12078 2709 -21129 -39978 -41856 -20582 -47602 -68090 -63492 -48548 -30969 -31213 -39316 -48024
14401 -48024 -46205 -44416 -25117 -13926 453 -11209 -42692 -63317 -37939 -31457 -53480 -27331
14389 -27331 5121 13485 11570 -5836 -4853 -4485 -20051 -23958 -18458 -26398 -22997 -50226 -37910 -20429
14375b0429N923q879L0803M697k4046j745Q343k3744K514J8156j2458J0259K8098
14362A7492R510Q042k9116k6808K1076K2389J0631l374k0455N74n755k3980L718
14349a6056J1459K0612k136n751q295l57M32r712j0724r428J0315j4131O487l112
14335c0397J8198M782j7216l464J8731Q512J4339j9477J5376j477Q958J8959j825
14322C3999k4092P658O794p375k1680j8446j3443K4938J2209j0017p409j960j0568
14309b9392K5728L6357j3283K401O709J7949O642k8383j5917J4575O432K3853
14297E3671l0826j2685J8107j823k552j4246p428N803M365j7675r827J3564j6120
14284a7672K5368R813j7834k0158j5472j4453K667J5218p459L3617K9358J0316
$$ plain form
14375 -20429 -14506 -23385 7418 12115 -11931 -13676 -5333 -29077 -26563 -8407 -20865 -10606 17492
14362 17492 27002 35044 5928 -20880 196 22585 33216 29842 9387 9961 4206 -19774 -16056
14349 -16056 -4597 16015 13879 8128 -167 -524 -92 -9804 -20528 -29956 -19641 -33772 -27285 -30397
14335 -30397 -12199 -7417 -24633 -28097 -9366 -854 13485 -5992 9384 7907 16865 35824 33999
14322 33999 9907 17565 24359 16984 -4696 -23142 -36585 -11647 562 -9455 -16864 -18824 -29392
14309 -29392 -3664 32693 19410 21811 28520 46469 53111 24728 8811 23386 29818 53671
14297 53671 22845 10160 28267 26444 23892 9646 2218 8021 12386 -5289 -15116 -1552 -17672
14284 -17672 7696 17509 -325 -20483 -35955 -50408 -47741 -32523 -39982 -6365 22993 33309
14272C3309j2224n055J1854o993k0301K0j4861r742K9426K3353J233l2966j1638
14259a4585J8768J5008L600l1995j837J2591k7820m968J6135j0646J9938K5971
14247B0160m233j0923k1542J2278j872j0156J103l4430r374K5006L531j835j36
14234c2423l009q105J8457l736j5943J5663j045J0960q206j2363N506L8781J7317
14221B1854o969j3802j6752R21R406J5032J8393m7242m0155o374J9436K0219K4746
14208a287p139K1014k247k8616k5338J8820J9706r027r214J5828J0660J888j8520
14195a3472j1524l175j508Q628j8345J4860N98l1667L330M080J8674j7061P554
14182c9028L5131J5850M860j8851p254j2624l464j268J1270l335q31M466L085
$$ plain form
14272 33309 21085 16030 27884 20891 590 610 -14251 -23993 5433 28786 30019 -2947 -14585
14259 -14585 4183 19191 22791 -9204 -11041 1550 -26270 -31238 -15103 -25749 -5811 20160
14247 20160 15927 5004 -16538 -4260 -6132 -16288 -15185 -49615 -58989 -33983 -30452 -32287 -32423
14234 -32423 -35432 -43537 -25080 -28816 -44759 -29096 -30141 -19181 -27387 -39750 -34244 4537 21854
14221 21854 14885 1083 -15669 -14748 -5342 9690 28083 -19159 -59314 -65688 -46252 -26033 -1287
14208 -1287 -8426 12588 10341 -18275 -43613 -24793 -5087 -14114 -23328 -7500 3160 5048 -13472
14195 -13472 -24996 -28171 -29679 -21051 -39396 -24536 -23938 -55605 -52275 -48195 -29521 -46582 -39028
14182 -39028 -3897 11953 16813 -2038 -9292 -21916 -25380 -26648 -15378 -18713 -19544 -15078 -11993
14169a1993j6115K356K0788J3892J2162k942k0797k3776L83P401J0784K1639J2233
14156B6015j7971N35k5401j3854n661j4943P547L65q983O110K6041O35P101l0623
14142d3087k0265Q95J8292K6759Q846k1398k503K2412K8897P109l5927k8404K5854
14129a2520Q897J6564j912j1208J8643J105j1030J7981m03k6122k0188o376k599
14116b9168o450l11J2091J6443n101k6311J6520m809K0023l113m341L5546j5524
14103E495l3182j0338N2157r861j6207P15k7917J1005p2j2583J3963J034k631
14090b8422l1748p022M9251K8207j6288p047K4852j7418k9940J0578K2267j1747
14078a4477j4414j1824K05J1005L4532J6546J6558n990l5915j9168M608r381j0978
$$ plain form
14169 -11993 -28108 -25752 -4964 8928 21090 18148 -2649 -26425 -26042 -18641 -7857 13782 26015
14156 26015 8044 8579 -16822 -30676 -36337 -51280 -43733 -43368 -52351 -46241 -20200 -19565 -12464 -43087
14142 -43087 -63352 -62457 -44165 -17406 -8560 -29958 -32461 -10049 18848 25957 -9970 -38374 -12520
14129 -12520 -3623 12941 11029 -179 18464 19569 8539 26520 26117 -5 -20193 -26569 -29168
14116 -29168 -35618 -35929 -23838 -7395 -12496 -38807 -22287 -27096 -7073 -10186 -14527 21019 5495
14103 5495 -27687 -38025 14132 4271 -11936 -11221 -39138 -28133 -28205 -40788 -26825 -25791 -28422
14090 -28422 -60170 -67192 -17941 10266 -6022 -13069 11783 -5635 -35575 -24997 -2730 -14477
14078 -14477 -28891 -40715 -40510 -29505 5027 21573 38131 32141 -3774 -22942 -18334 -27715 -38693
14065c8693O936M6714K9953l632L205k1480l7438j481j932J5066j0035o609n16
14052a9942j5506j10N694j1062q925L5600J434j431j6314n04Q014J5090K3426
14039A5464k583J2458l0018J7672Q267k3281L180M370k3901k2570O148J0288J2279
14026a2227k4333J0567J001N827L010j4719Q081J8807L2946J1717r288n918Q72
14013B6343j1173j7L047N003k7409J0482O017l2019J3237Q710q163K0074J3251
14000B7383k0492k046J1293k3332P033M2956L606q900o913N88m7443j0162M1459
13987A5030M1394J1011O851l7959m5674O738M685j4492k3360J322j2460K2296
13975b4618K1538J1482J32l769K2101j5156j9823j7497r019J6551J3582l024j2582
$$ plain form
14065 -38693 -31757 14957 44910 41278 44483 23003 -14435 -15916 -17848 -2782 -12817 -19426 -19942
14052 -19942 -35448 -35558 -29864 -40926 -49851 -14251 -12817 -14248 -30562 -31066 -23052 -7962 15464
14039 15464 12881 25339 -4679 12993 21260 -2021 1159 5529 -18372 -40942 -34794 -24506 -12227
14026 -12227 -36560 -25993 -24992 -19165 -16155 -30874 -22793 -3986 28960 40677 31389 25471 26343
14013 26343 15170 15153 18200 23203 -4206 6276 12293 -19726 -6489 2221 -5942 14132 27383
14000 27383 6891 4845 16138 -7194 -161 42795 46401 37501 30588 31176 -16267 -26429 15030
13987 15030 56424 67435 74286 36327 -9347 -2609 2076 -12416 -35776 -34454 -46914 -24618
13975 -24618 -3080 8402 8534 4765 26866 11710 -8113 -25610 -34629 -18078 -4496 -7520 -20102
13962b0102j2319Q356J5616j747L71J2970K481R91P298J128N472p799k0442J4307
13948F581m571O259k1168J3991K4209l3047j2078K0343j8095j2175K753j934K0914
13935h018J8712L360j6260R425O091j8510K2891K2995j3440k0631n348p607j3324
13922a9664L211J0572j1110k8314J0558L66r757J1658L0783K4724o534j9415j9877
13909b2799j8905K687J2033O968j6823J1037J5152m396j1981p837q506K570J8170
13896b2630L3307K5547j0002j7466r429j4055L7967l971j365j2196o487p658K4239
13883A5801j925m6502j8612K8756J6260K134m1976L551O63L7216K3858k0962l1993
13870c3731R54J2804m93P788J720K0698J684k6375K642Q778j748l6321j2546L0061
$$ plain form
13962 -20102 -32421 -24065 -8449 -10196 -9825 3145 5626 6617 13915 15043 20515 12716 -7726 6581
13948 6581 2010 8269 -12899 1092 25301 -7746 -19824 519 -17576 -29751 -26998 -28932 -8018
13935 -8018 10694 14054 -2206 7219 13310 -5200 17691 40686 27246 6615 1267 -6340 -19664
13922 -19664 -16453 -5881 -16991 -45305 -34747 -34381 -44138 -32480 -1697 23027 16493 -2922 -22799
13909 -22799 -41704 -39017 -26984 -20016 -36839 -25802 -10650 -15046 -27027 -34864 -43370 -40800 -22630
13896 -22630 10677 36224 26222 8756 -673 -14728 23239 19268 17903 5707 -780 -8438 15801
13883 15801 13876 -32626 -51238 -22482 -6222 -4088 -46064 -42513 -41850 -4634 19224 -1738 -33731
13870 -33731 -32777 -19973 -20466 -12678 -10958 9740 11424 -14951 -12309 -3531 -5279 -41600 -54146 -24085
13856b4085L2782k3695l8520k660J7620J9404p25K1465n289K1956j5169j6513
13844a3429N37o47j3713r237J0658K9143M430K55J2241J2550j7254p807j0188
13831b461L094M612M896l565q056J2236j9570m627j139k5847k2443K0745J5945
13818b6180O471k5501P773K4310J0979o998j5056J51M2202M858j7105j8848j267
13805a4211j4466j3562K7366J3435K838k6518J1985P491K1190k815m477N648J0292
13792B4196k1914m1391J0175L9989J8942m684p920j5028q898K725m222j0826k4522
13779d3378k569K1337K3674j0596J1733M030p109o59L630J757P63J1354M36k6210
13765a1807q502K3637O897l7531l2461l433J9443M0377J723j0947j6171P846L8355
$$ plain form
13856 -24085 8697 -14998 -53518 -56178 -38558 -19154 -19879 1586 -3703 18253 3084 -13429
13844 -13429 -12892 -13539 -27252 -36489 -25831 3312 7742 7997 20238 32788 15534 7727 -2461
13831 -2461 633 5245 10141 6576 -1480 10756 -8814 -13441 -14580 -40427 -62870 -42125 -26180
13818 -26180 -19709 -45210 -37437 -13127 -2148 -9146 -24202 -24051 18151 23009 5904 -12944 -14211
13805 -14211 -28677 -42239 -14873 -1438 1400 -25118 -13133 -5642 15548 12733 8256 13904 24196
13792 24196 2282 -39109 -28934 11055 29997 25313 17393 2365 -6533 -3808 -8030 -18856 -43378
13779 -43378 -45947 -24610 -936 -11532 201 4231 -2878 -3537 93 1850 2613 13967 14403 -11807
13765 -11807 -20309 3328 10225 -27306 -59767 -63200 -43757 -3380 -1657 -12604 -28775 -20929 17426
13752A7426M750J6287J3758q189l8353j5562j2583j4618r305o928j0446K2344
13740d1419K7270J8022Q446l4311l9689k5981J4626P4112K3945l0518Q521K0768
13728B3792P990k7691j6123n573l3328J0626L2942J6533j0308m2589P774L866
13716c2089K5112Q758o018k0495j5441J9622k232J280K3098j5564R351R278j0568
13703e908J0294J8850j6427l1445j0783J2442J0850K1101j3894L693O49r185l768
13690a3531M0720m853k5697l5152O48J6205J8121P294n739q128j1689N130O788
13677i883j510K889J9298l585j5908k735K3082Q380o696J5224j0467m1457k8736
13664e2104j674J4320n045R742L4962j5786J2887K663m942L388P606j3147j9082
$$ plain form
13752 17426 22176 38463 52221 44032 5679 -9883 -22466 -37084 -46389 -53317 -63763 -41419
13740 -41419 -14149 3873 12319 -21992 -61681 -87662 -73036 1076 25021 -5497 3024 23792
13728 23792 31782 4091 -12032 -17605 -50933 -40307 -7365 9168 -1140 -43729 -35955 -32089
13716 -32089 -6977 1781 -4237 -24732 -40173 -20551 -22783 -21503 1595 -13969 -4618 4660 -5908
13703 -5908 4386 23236 6809 -24636 -35419 -22977 -12127 8974 -4920 -1227 -578 -9763 -13531
13690 -13531 27189 22336 -3361 -38513 -37865 -21660 -3539 3755 -1984 -10112 -21801 -16671 -9883
13677 -9883 -11393 -8504 10794 7209 -8699 -11434 11648 20028 13332 28556 18089 -23368 -52104
13664 -52104 -53778 -39458 -44503 -34761 201 -15585 -2698 -35 -4977 -1589 6017 -7130 -26212
13651b6212M8564K6466p612P412n131k7329J2278o349K1228p542k494k6311k2812
13638a5844j8899j0247L228K0578J4652k0398J03K0401j4575k4984p403J7184
13626c6204L1805K6081n089j498K140j3760N838j1667m070l6606k1695L0880Q4
13613c3761J1384O372l3991m686l286J1857j5973o009L357P481k396m100K8871
13600c4880K1727Q841k1128K903K0274K4484j0361j1324m262j8491k6174o375
13588e4766J2708K3777K3641K126K8687m181k259r19j0990j6465j44p207q663
13575a4655k7157L5461K1404k8716j2479k237J9041K6723M06k6209N198o600j1885
13562b1705k674n048k3865j9461Q817K6618J8047L1702K5046p609L57j8150l1944
$$ plain form
13651 -26212 22352 48818 41206 48618 43487 16158 28436 22087 43315 35773 33279 6968 -15844
13638 -15844 -34743 -44990 -41762 -21184 -6532 -26930 -26827 -6426 -21001 -45985 -53388 -36204
13626 -36204 -4399 21682 16593 15095 17235 3475 9313 -2354 -6424 -43030 -64725 -33845 -33761
13613 -33761 -22377 -16005 -49996 -54682 -57968 -46111 -62084 -68093 -64736 -57255 -59651 -63751 -34880
13600 -34880 -13153 -4312 -25440 -22537 -2263 22221 11860 536 -3726 -22217 -48391 -54766
13588 -54766 -42058 -18281 5360 7486 36173 31992 29733 28814 17824 1359 1215 -5992 -14655
13575 -14655 -41812 -6351 15053 -13663 -26142 -28379 -9338 17385 17791 -8418 -3220 -9820 -21705
13562 -21705 -24379 -29427 -53292 -72753 -63936 -37318 -19271 12431 37477 29868 30225 12075 -19869
13549a9869n812L4133O778J215J8110k5422l019m298k0545j3953K1914J5475J0138
13536A4845k0747j0681k1981k2453q938J9950K0732j3550J9715J2436k3027k217
13524c5916N592J0839J3010K1421j1877k4302o728j725J8520j8333p019K3064
13512a3454K2210j2296q824J823N847o845m043j9828j5269J4019J907K6671J6519
13499H437J5944k2571k4751J267j3251j9241K7760J6057j2006k4250K1458O191
13487a8956J5996J0491j1329p431J1476K812q218R938J0397k069k8655k2498J2582
13474b5464M496K2844K2136j0823k8313l7900k848L7488K9488l616J1218k8988
13462a0282k1871q116L801N331J1494Q709j2590J8246P725j2473j1259P368j0712
$$ plain form
13549 -19869 -25681 8452 15230 16445 34555 9133 6114 1816 -18729 -32682 -10768 4707 14845
13536 14845 -5902 -16583 -38564 -61017 -69955 -50005 -29273 -42823 -23108 -10672 -33699 -35916
13524 -35916 -30324 -19485 -6475 14946 3069 -21233 -27961 -29686 -11166 -29499 -36518 -13454
13512 -13454 8756 -3540 -12364 -10541 -4694 -11539 -15582 -35410 -50679 -36660 -34753 -8082 8437
13499 8437 24381 1810 -22941 -21674 -34925 -54166 -26406 -10349 -22355 -46605 -25147 -18956
13487 -18956 -2960 7531 -3798 -11229 247 3059 -5159 4779 15176 13107 -15548 -38046 -25464
13474 -25464 -20968 1876 24012 13189 -15124 -53024 -55872 -18384 11104 7488 18706 -10282
13462 -10282 -32153 -40269 -36468 -31137 -19643 -10934 -23524 -5278 2447 -10026 -21285 -13917 -24629
13449b4629P534R088J8784l0715j4585j5365j967J2829P64m4817j2652K4864L3774
13436c7093J2727p397o904p525j5595M9640M4001k2880k1910p295m600J0637R891
13423d303K180j2274R378N384k0014J4546J7662R448l866k9555J282P028l480
13410f584j7424l0315J7096J5772m758l466M570K5102n166j4067J5382J1695K965
13397A0802o532R234K354k860K5607k505j8483k5673J9362j6493J1512J0933j3594
13384C664M960Q404r302O848L9507J7097m2290j6497R185k5168k0210R201j4894
13371b9495M415L0451L597j3595k0903R632J9837J83J7717R548P382k439L41N057
13357D1728r611L1061J079j3855j149k0646l8422J4138K2192J8390j6859j5223
$$ plain form
13449 -24629 -17095 -8007 10777 -19938 -34523 -49888 -51855 -39026 -38262 -83079 -95731 -70867 -37093
13436 -37093 -24366 -31763 -38667 -46192 -61787 -12147 31854 8974 -12936 -20231 -24831 -14194 -4303
13423 -4303 -2123 -14397 -5019 365 -19649 -5103 12559 22007 18141 -11414 -10132 -3104 -6584
13410 -6584 -24008 -54323 -37227 -21455 -26213 -29679 -25109 -7 -5173 -19240 -3858 7837 10802
13397 10802 4270 13504 15858 12998 38605 36100 17617 -8056 11306 -5187 6325 17258 3664
13384 3664 8624 17028 7726 14574 54081 71178 28888 12391 21576 -3592 -23802 -14601 -29495
13371 -29495 -25080 5371 8968 -4627 -25530 -15898 3939 4122 21839 31387 38769 36330 36671 41728
13357 41728 32117 63178 64257 50402 49253 28607 -9815 4323 26515 44905 28046 12823
13345A2823j8930l835r795j7527k5023k775J5198J5052J4021n544j6656j393l109
13332d7493Q288K6772J478R018l9121j0130K746K3243L2310n064l2618J2746J6151
13319a674K527k2106j2216j3325l387O917K1127N282J8055J1401O097M011K7952
13306E0661l370j4283l3531k20k805l4224k980o523J2816r92j1881N087J1045
13293c1200K7921P787k6709J650L8390K2938j530o362r464j5110p795K4293m381
13280B0428k1751l840J425L592k1546Q499Q158j763j6502k0013K6012J5328Q371
13267F398K6961J529p820J9462p576o370j4037j0555l7903J814j7175n578P317
13254d3533L2251P192J8892l4q075k636J0807j7937k2799j4185J5445L2879R273
$$ plain form
13345 12823 -6107 -9942 -19737 -37264 -62287 -65062 -49864 -34812 -20791 -26335 -42991 -44384 -47493
13332 -47493 -39205 -12433 -10955 -1937 -41058 -51188 -48442 -25199 7111 2047 -30571 -17825 -1674
13319 -1674 853 -21253 -33469 -46794 -50181 -43264 -22137 -16855 1200 12601 18698 22709 50661
13306 50661 47291 33008 -523 -743 -3548 -37772 -40752 -47275 -34459 -35451 -47332 -42245 -31200
13293 -31200 -3279 4508 -22201 -20551 17839 40777 39247 32885 23421 8311 516 24809 20428
13280 20428 -1323 -5163 -3738 -146 -21692 -13193 -5035 -6798 -23300 -43313 -17301 -1973 6398
13267 6398 33359 34888 27068 46530 38954 32584 18547 7992 -29911 -28097 -45272 -50850 -43533
13254 -43533 -11282 -4090 14802 14768 6693 4057 14864 -3073 -25872 -40057 -24612 8267 17540
13241A7540K3933k7922j2330l6841k1374j0698k1966K0700N1415K5372j5681R855
13229B003m993R022J0203R167l0504k8867J3584L4829l982k5748o773P408j7250
13216c1901j5033P048J1707j2946o432o256R267K7722Q812j7232j0521J2546J3878
13203i341Q072K408o888J0280L2376k616l8567j5537K0797j8373j2192J1462j5035
13190c3154j1086J4877J6216j7619K322m769m610p078j7509L4260J7844m143l884
13177a8333J7368J154k3086Q254N39j4569L229J3211J559j4619k069j7714j708
13164d6784N365J3946J3440K5888K0745m6L904R128j8941l4429n052K4700J1207
13151B3071n977J0168j6885j3555J6821m687o251j3906J17m21Q190k3031K963
$$ plain form
13241 17540 41473 13551 1221 -35620 -56994 -67692 -89658 -68958 -17543 7829 -7852 2003
13229 2003 -2990 6032 16235 25402 -5102 -33969 -20385 14444 10462 -15286 -22059 -14651 -31901
13216 -31901 -46934 -39886 -28179 -41125 -47557 -53813 -44546 -16824 -8012 -25244 -35765 -23219 -9341
13203 -9341 -1269 1139 -5749 4531 36907 34291 -4276 -19813 984 -17389 -29581 -18119 -33154
13190 -33154 -44240 -29363 -13147 -30766 -28444 -33213 -37823 -44901 -62410 -28150 -10306 -14449 -18333
13177 -18333 -965 189 -22897 -14643 -14104 -28673 -25444 -12233 -10674 -25293 -27362 -45076 -46784
13164 -46784 -41419 -27473 -14033 11855 32600 32554 36458 45586 26645 -7784 -12836 11864 23071
13151 23071 17094 27262 10377 -3178 13643 8956 2705 -11201 -11084 -11505 -3315 -26346 -23383
13138b3383N412n909K3187r322p540M4916K6011k231j0014l1378j849j8268j7210
13125b7578j4380l936J3615j3801K2273J3192n569J4290J6883q824J8881j0692
13113A4354m064j8299k6162J2196J5953j7055j1958K8324j1758m888l77m555R638
13100a8651L920K6787j1519j7895J8227R64j2065L722J0359N0K6087K5488l0613
13087B4861m0271k2217m675J1892M1501J1113k462k0724n934R91j7366k582L5056
13074I183k4002j1966J4875K12L3865j2026K6351k006m3106m8521J6543L7614
13062b984j053p399K552J2211r637j4509J3014J2449K895k0558r324l434O833
13049a8944L0381J2120k3708M100j150K6551P409m580l2497Q584q573l98r605
$$ plain form
13138 -23383 -17971 -23880 -693 -10015 -17555 27361 53372 51141 41127 9749 7900 -10368 -27578
13125 -27578 -41958 -45894 -32279 -46080 -23807 -10615 -16184 -1894 14989 6165 25046 14354
13113 14354 10290 -8009 -34171 -21975 -6022 -23077 -35035 -6711 -18469 -23357 -23734 -28289 -18651
13100 -18651 -14731 12056 537 -17358 869 1833 -10232 -6510 3849 3899 29986 55474 24861
13087 24861 -15410 -37627 -42302 -30410 11091 22204 19742 -982 -6916 -5925 -23291 -25873 9183
13074 9183 -14819 -26785 -11910 -11698 22167 10141 36492 34486 -8620 -57141 -40598 -2984
13062 -2984 -4037 -11436 -8884 3327 -6310 -20819 -7805 4644 7539 -13019 -22343 -25777 -18944
13049 -18944 11437 23557 -151 3949 2799 29350 36759 32179 -318 8266 -307 -705 -10310
13036a0310N784J9244M987k3254L917Q97k461l2642k1538J7154K3901j9432j6385
13023e0138O531N908K829J8948p843K0931J2596j1154j0661l48j6125P732j486
13010b2280n394Q730j5090k3427J3810L2131O1l3373L190J3529J5633j5963J948
12997b6495l816q155j2531r767K9113L7008j4881k0713L4834K8474k7517q313
12985b759K4515k5704j1670M1602J7094k5799j2101j258m986j97j412O746O939
12972A1010m214l0081l723j6568o259L621N235K459L7408L8949j9232k9793p392
12959a8580M947J2553O446K1478k1327k384M114k7546K1613k3284j6171N280K0336
12946a2525j6297j6982P363O4649K8182j6497m7097K5198m731j2914o107k903
$$ plain form
13036 -10310 -4526 14718 19705 -3549 368 1265 -1196 -33838 -55376 -38222 -14321 -33753 -50138
13023 -50138 -43607 -37699 -34870 -15922 -23765 -2834 9762 -1392 -12053 -12401 -28526 -20794 -22280
13010 -22280 -27674 -18944 -34034 -57461 -43651 -11520 -11459 -44832 -41642 -28113 -12480 -28443 -26495
12997 -26495 -30311 -38466 -50997 -60764 -31651 5357 -9524 -30237 4597 33071 5554 -2759
12985 -2759 21756 -3948 -15618 25984 43078 17279 5178 3920 -1066 -1263 -2675 4071 11010
12972 11010 6796 -23285 -27008 -43576 -49835 -46214 -40979 -38520 -1112 37837 18605 -11188 -18580
12959 -18580 -13633 -1080 5366 26844 5517 3133 7247 -20299 1314 -21970 -38141 -32861 -12525
12946 -12525 -28822 -45804 -38441 26208 54390 37893 -9204 15994 11263 -1651 -7758 -10661
12934a0661o125m941Q702K5921J178j621O659j7945j4406j7324P394J6658m8296
12921e4807j7683L4310O690L200k211M2068L4195p105j3434j7115L097J2229J4978
12908C8412k3785j2617Q424k608m0441r219J5242J3866R867j1288J1523N933K1837
12895B5146K0873j5397l4072k5357N304K7890K2467p393J3199j3982l8495m5824
12883f5641K2289L9106J822j2588O696J8159j0882j9212J0605j633R200M94l031
12870d616r025M933J2071k8944P91J3918N377q972k1023J1355J9842j9862j9418
12857d3573o82J4201j7223l368J9444j1703N589p653J4118j4953j7022N769J6135
12844d0921J4977N57j0217R068J1794J4515q594k5909j5792l365K6544K2207R038
$$ plain form
12934 -10661 -16786 -21727 -13025 12896 14074 12453 19112 1167 -13239 -30563 -23169 -6511 -54807
12921 -54807 -72490 -38180 -31490 -28290 -30501 11567 45762 38657 25223 8108 11205 23434 38412
12908 38412 14627 2010 10434 7826 -32615 -41834 -26592 -12726 -2859 -14147 -2624 3309 25146
12895 25146 46019 30622 -3450 -28807 -23503 4387 26854 19461 32660 18678 -19817 -65641
12883 -65641 -43352 -4246 -2424 -15012 -8316 9843 -1039 -20251 -9646 -11279 -2079 -1585 -4616
12870 -4616 -13641 -8708 3363 -25581 -24790 -10872 -5495 -14467 -35490 -24135 -4293 -24155 -43573
12857 -43573 -44255 -30054 -47277 -50645 -31201 -42904 -37315 -44968 -30850 -45803 -62825 -57056 -40921
12844 -40921 -25944 -25387 -35604 -26536 -14742 -227 -8821 -34730 -50522 -53887 -27343 -5136 3902
12831C902L921pM1539K0562l2548j9435j1361J0840r864p489k1983l113M0560
12818A5524K6650l869M89k0566k5870J5067J5794j0808r044o588o087J2918J3089
12805A6699j1969r173j2817j1831M512k487k2326k0332j4948K2597N6803P837
12793B565l7077l767k3070N731L7265L783P807J2599l231k5133m857j4652m298
12780d6335J3025J2103j0446K959J3595m370J8959j608Q831l712K6249Q963l8612
12767c99l0373K64l679N775J5448J1425j1585j4555r193N3582Q988j0369j1323
12754D006l470p616j0832J2946l546j0076j7156l619j8225J2460L142q027L1570
12741a8443J0011m5160q629L4793J5246o086M999l782r609K8736k3076k938J462
$$ plain form
12831 3902 7823 7816 49355 69917 37369 17934 6573 17413 7549 60 -21923 -25036 15524
12818 15524 42174 38305 38794 18228 -7642 7425 23219 12411 3367 -3221 -9308 3610 16699
12805 16699 4730 -4443 -17260 -29091 -24579 -27066 -49392 -69724 -84672 -62075 -5272 2565
12793 2565 -34512 -38279 -61349 -55618 -18353 -14570 -6763 5836 2605 -22528 -27385 -42037 -46335
12780 -46335 -33310 -21207 -31653 -28694 -15099 -19469 -510 -2118 6713 3001 29250 38213 -399
12767 -399 -30772 -30508 -34187 -28412 -12964 -1539 -13124 -27679 -36872 16710 25698 15329 4006
12754 4006 536 -7080 -17912 -4966 -8512 -18588 -35744 -39363 -57588 -45128 -41986 -50013 -18443
12741 -18443 -8432 -53592 -62221 -27428 -12182 -18268 -13269 -17051 -26660 2076 -21000 -23938 -22476
12728b2476l0689j9351L834j8147k1533j234M2173L3756R368K0090j7947q258
12716c0414K3245Q122J5113P568k8699R417J1525r856J0426k4082r405j0245j1567
12703c8852o458K5621J2642k7367j783K4419J2226l385l2303j9770J1437K8074
12691a5499K6070K530j0713k1706m1394j0468J0736L5652L3184P930j934k8290
12679a3902m426j8242j1438L1065K4953o792j824p816j4988q655k2549o07M1955
12666a3266N8413J995k3222k0382j0076j8864R082l118J0491J3372l234J7695
12654A8886Q557j8898Q826n82j475q166l0215o953K7220J4553j5949k4386O481
12641b2101L8985k783j5506j8674n212J5383J826J2753j3305m4902j7757J1608
$$ plain form
12728 -22476 -53165 -72516 -68682 -86829 -108362 -109596 -67423 -33667 -24299 -4209 -22156 -30414
12716 -30414 -7169 953 16066 23634 -5065 4352 15877 6021 16447 -7635 -17040 -27285 -38852
12703 -38852 -45310 -19689 -7047 -34414 -36197 -11778 448 -2937 -35240 -55010 -43573 -15499
12691 -15499 10571 13101 2388 -19318 -60712 -71180 -60444 -24792 8392 16322 14388 -13902
12679 -13902 -18328 -36570 -48008 -16943 8010 1218 -606 -8422 -23410 -32065 -54614 -55221 -13266
12666 -13266 45147 47142 23920 3538 -6538 -25402 -16320 -19438 -8947 4425 1191 18886
12654 18886 27443 8545 17371 16789 15314 7148 -23067 -30020 -2800 11753 -4196 -28582 -22101
12641 -22101 16884 14101 -1405 -20079 -25291 -9908 -8082 4671 -8634 -53536 -71293 -59685
12629e9685K9426J1841p058j3354j5352K6718M0042m286k0284M477o503k532j6186
12616c2736L4268L2251P547j2429N57J1123l9960m6466m892L3781N1990K1911
12604E6945j294j9101j5630O98n134L162k073l056r793o690L251Q319r066j3312
12590a2774R900K2201J3026j5416k5296n990J2199M996L6535J4129k9122k3185
12578A203q148r154j1006j369M413N774k3833R73K0327J2850q588P442l803j2262
12564b5181q001K2809Q766N890p841L984J4054j5610J501j5542k3770n557N6139
12551A1641J5019q594J1052L78k7948J0300K172J2430J5582j8474j947n060l424
12538A3127J7922p02o709j0509k4349K817L307J7317J2876j1025k5847j4611m299
$$ plain form
12629 -59685 -30259 -18418 -25476 -38830 -54182 -27464 12578 8292 -11992 -7515 -14018 -16550 -32736
12616 -32736 1532 33783 41330 28901 29458 40581 621 -45845 -50737 -16956 35034 56945
12604 56945 55651 36550 20920 21618 16484 19646 17573 14517 4724 -1966 1285 9604 538 -12774
12590 -12774 -2874 19327 32353 16937 -8359 -14349 -2150 2846 39381 53510 24388 1203
12578 1203 -6945 -16099 -27105 -28474 -24061 -18287 -42120 -41147 -20820 -7970 -16558 -9116 -12919 -25181
12564 -25181 -33182 -10373 -1607 4283 -3558 426 14480 -1130 371 -15171 -38941 -44498 11641
12551 11641 26660 18066 29118 29496 1548 11848 14020 26450 42032 23558 21611 16551 13127
12538 13127 31049 30347 23638 13129 -11220 -8403 -5096 12221 25097 14072 -11775 -26386 -30685
12525c0685o52L4021m646k4925o970J9138p908L641J0041K592J4661J6792k4798
12512C02p58K0819J665l0443k3119J6644J1493k584k392J7090O058q145j4762
12499h132Q949N125R434o594j1235j5265N3K6175J0622M755j0427K887J3494J3228
12485D3069Q379l0062m4342J1095K470R458O580l801m175L772k075J3186L909
12472A7463J708J5168J3557J32k7593l3030k823J1543K5119j9424j4542J4756
12460B034j2092K587M69n05j5630j1843Q399J6439J5976k0285j6530Q499K166
12447b0316L2619P762j5413L1100K7913k0367k1127k1209j3457L5585K121j9619
12435E592j4831j9668L4977L6048r813l2737k5879O190J3618J7842K033q293O64
$$ plain form
12525 -30685 -31337 2684 -1962 -26887 -33857 -14719 -22627 -18986 -8945 -6353 8308 25100 302
12512 302 -456 20363 22028 -8415 -31534 -14890 -3397 -5981 -8373 8717 14775 6630 -8132
12499 -8132 817 5942 15376 8782 -2453 -17718 -17665 8510 19132 23887 13460 16347 29841 43069
12485 43069 51448 21386 -22956 -11861 -9391 67 6647 2846 -1329 2443 368 13554 17463
12472 17463 19171 34339 47896 48028 20435 -12595 -15418 -3875 21244 1820 -12722 2034
12460 2034 -10058 -7471 -7002 -7507 -23137 -34980 -26581 -10142 5834 -14451 -30981 -22482 -20316
12447 -20316 12303 20065 4652 35752 63665 43298 22171 962 -12495 23090 25211 5592
12435 5592 -9239 -28907 6070 42118 32305 -432 -26311 -20121 -6503 11339 13372 5079 5743
12422E743k0458O103L1338P524k1976L696j1362k4431K3577M268k2233j0169Q006
12409b0374J3789p835P623p744O586k3245O792J8118J2663L1334r205j4452N853
12396A9903n252j1222J6404K175j0225r75O984J3791k086P56j0806n8568l582
12383d2703K8199J242K98m560K6908K8000j4285K369M405k2582j233L942Q846
12370A8846r92J0300j223k7268P222J8517j8753j0803j51k9007k2480j8800P906
12357f6686J9161J6762J9335M730j0683r273J0794M7162j2856m2432q143L258
12345b8871L6617K858k4112r804k673K3460R067r013n670J8163R663P83j5844
12332D624Q381n185q328k962k345Q839j8085q309k3952J1018J3593J6025Q140
$$ plain form
12422 5743 -14715 -8612 22726 30250 8274 11970 608 -23823 -246 4022 -18211 -28380 -20374
12409 -20374 -6585 -14420 -6797 -14541 -7955 -31200 -24408 -6290 6373 37707 28502 14050 19903
12396 19903 14651 3429 19833 22008 11783 10808 17792 31583 29497 30253 19447 -39121 -42703
12383 -42703 -14504 -13262 -12964 -17524 9384 37384 23099 25468 29873 7291 6058 10000 18846
12370 18846 17854 28154 26931 -337 6885 25402 6649 -4154 -4305 -33312 -55792 -74592 -66686
12357 -66686 -47525 -30763 -11428 -6698 -17381 -26654 -15860 31302 18446 -23986 -32129 -28871
12345 -28871 7746 10604 -13508 -23312 -25985 -2525 6542 -2471 -8141 10022 19685 20468 4624
12332 4624 13005 7820 -508 -3470 -5815 3024 -15061 -23370 -47322 -36304 -22711 -6686 1454
12319A454K6425k7219k6158Q74J7947K5673J2471k5749q838j8072k3019J304L35
12306d2572k3893J4938M3925J654q156r208n258J3286r713R92K6472O89M965j1881
12292c760l7856r974K061N11J5897L3218J9615j5218j6767j5657k466n282l963
12279c9641M2209K3658O423j8462l8866J8356q642k1485j2338J5517L2735L5366
12267C4830j6901k7485j0687K039r67o363P166j460P400j1570k58M52J8322M3643
12253C8161r519k5573R727r376k2339j3708J0664j6754k7511r877Q316K9300K3102
12240a5387J5475N597j7529j7062K2286J9409j0560N026K2131p521l4201L477
12228h859P039P49K3665k917j9914R448n254k4352J125J8360M3301p064j7251
$$ plain form
12319 1454 27879 660 -25498 -24624 -6677 18996 31467 5718 -3120 -21192 -44211 -42907 -42572
12306 -42572 -66465 -51527 -7602 -5948 -14104 -23312 -28570 -15284 -24997 -24005 2467 3156 8121 -3760
12292 -3760 -41616 -51590 -49529 -49018 -33121 97 19712 4494 -12273 -27930 -30396 -35678 -39641
12279 -39641 2568 26226 32649 14187 -24679 -6323 -14965 -36450 -48788 -33271 -536 34830
12267 34830 17929 -9556 -20243 -18204 -19171 -25534 -18368 -19828 -12428 -23998 -24256 -23804 -5482 38161
12253 38161 28642 3069 12796 3420 -18919 -32627 -21963 -38717 -66228 -76105 -67789 -38489 -15387
12240 -15387 88 5685 -11844 -28906 -6620 12789 2229 7255 29386 21865 -12336 -8859
12228 -8859 -1820 -1071 22594 19677 -237 9211 3957 -20395 -19270 -910 42391 35327 18076
12215A8076p731Q134J9602J8323k8611R324K2582k2590K077J9822n940l2447l0200
12202i579J1587L240Q041J8681j8615j0376j6274k435P967J1674j5222j1776J6074
12189g013M3080N872j2828j9960j2463l921J7151q033K0050R61N516J2609J6486
12176E7507J5314m044k0250J1932R052o865n206L8544K1393l5841l2986n960n976
12163C6614k8832l503J1508N021K9597j8024l308j4772J70N36j6499n86M879N281
12149H082j4704j6962j4290P285P869K3634M0218j0593l433O657K0101J1442k2441
12136D2865j1318N558R594r935M91l3343l3977J9703J5217k189J0631j2182j8124
12123a7009M2575J8068p703p44L809J2729m800Q193k9630k9859J2851J3821L97
$$ plain form
12215 18076 10345 18479 38081 56404 27793 37117 59699 37109 39186 59008 53068 20621 -9579
12202 -9579 2008 5248 13289 31970 13355 2979 -13295 -15730 -7763 3911 -11311 -23087 -7013
12189 -7013 36067 41939 29111 9151 -3312 -7233 9918 1885 21935 22896 28412 41021 57507
12176 57507 72821 68777 48527 60459 69511 62646 57440 95984 117377 81536 48550 42590 36614
12163 36614 7782 4279 15787 20808 50405 32381 29073 14301 14471 15007 -1492 -2078 2801 8082
12149 8082 -6622 -23584 -37874 -30589 -22720 914 41132 30539 27106 33763 53864 65306 42865
12136 42865 31547 37105 46699 36764 37255 3912 -30065 -10362 4855 2666 13297 1115 -17009
12123 -17009 25566 43634 35931 35187 38996 51725 46925 55118 25488 -4371 8480 22301 22698
12110B2698k2010k354O283m7721K947M6103K5070j7534j8130J7446J0466j1034
12098A2230l737J6614k909k2462l245L6714K2610k5867p356J3644L2115j034k0462
12085D6855K4940j926K2531j6041p517o88j1239q008n532j8032j0552K2445K6613
12072F3849K4185k3147k8926l4080j9388J3105K1665M149P050Q163J618j1538
12060B6705K8325O2295P855n2265m8759N846o455L317K0679K6640J2502K7919
12048A14604N4812J4829j4047r054m745L812J5617l4416m5972k6238j4760M455
12036E8897K6662l297k0601O710K0580k2913p551M655K0301K7234k443J1377k2369
12023I7242J2459q146l2840J3736L3136k0313r345J370O933j6407K6976J1117
$$ plain form
12110 22698 688 -1666 4617 -43104 -40157 5946 31016 13482 -4648 12798 23264 12230
12098 12230 8493 25107 22198 -264 -3509 33205 55815 29948 22592 36236 68351 67317 46855
12085 46855 71795 69869 92400 76359 68842 68154 56915 48907 43375 25343 14791 37236 63849
12072 63849 88034 64887 35961 1881 -17507 -4402 17263 21412 28462 36625 38243 26705
12060 26705 55030 117325 125180 72915 24156 30002 23547 26864 47543 74183 86685 114604
12048 114604 169416 184245 170198 161144 156399 160211 175828 141412 95440 69202 54442 58897
12036 58897 85559 82262 61661 68371 88951 66038 58487 63142 83443 110677 108234 119611 97242
12023 97242 109701 101555 68715 82451 115587 95274 85929 87299 94232 77825 104801 115918
12011A15918n591k1416J9374j3692j7145J8704L720k856J2180K7410j1780j9194
11999A05632J4259P456J495K1460L9070L2158k8830q780K2907J6880K290M271
11987B30268K3619r413J4391K6104j6958k4591j1067k8661J8996K999j6951J2048
11975B20784K6062M4158M6101Q99j1798N458M519K0998L8668L4005K8210L8139
11963D96203r39Q624M0418J1353K8718K1921L6601M0609O3487O9044L8988M8021
11951I03048O2107L7315L5764J02904J02821J02325Q6846J23139J53706J40923
11941A850898J26045J43466J94272K60620K90901L05735L66712M26182N09635
11932D474466O71498R02052J124770J454837J962846K696388L820036N433538
$$ plain form
12011 115918 110327 88911 108285 94593 77448 96152 99872 97016 109196 136606 124826 105632
11999 105632 119891 127347 128842 150302 189372 221530 192700 183920 206827 223707 225997 230268
11987 230268 253887 244474 258865 284969 268011 243420 232353 203692 222688 225687 208736 220784
11975 220784 246846 291004 337105 338004 326206 331664 336183 357181 395849 429854 458064 496203
11963 496203 495264 503888 544306 555659 584377 606298 642899 683508 746995 816039 855027 903048
11951 903048 965155 1002470 1038234 1141138 1243959 1346284 1433130 1556269 1709975 1850898
11941 1850898 1976943 2120409 2314681 2575301 2866202 3171937 3538649 3964831 4474466
11932 4474466 5145964 6048016 7172786 8627623 10590469 13286857 17106893 22540431
11924B2540431P376692R197594R700922Q536962O961923O788975P888262Q141265
11916H7133026N069432k570255j2223352j6620965j4333929j0237593p030470
11909B9185894m879517l484641k632189k073566j636463j321038j090494r19562
11901A1148424p98915o86034o30955n75082m62975m12577m14281l22025k74371
11892F571209k76211k77560k73362k41852k12956k01638j91539j81473j94328
11883D520290j47865j37277j56581j53782j59862j39298q2972q2935p2075q1461
11873C306182n7196r1477p6451n6559o8520m5438k1601k3655n0210o7246r0681
11862B657148p1527n5142o3647r8057q3001o5929o3999o1787o4238m9944m5807
$$ plain form
11924 22540431 29917123 39114717 48815639 57352601 64314524 71103499 78991761 87133026
11916 87133026 92202458 89632203 77408851 60787886 46453957 36216364 29185894
11909 29185894 24306377 20821736 18189547 16115981 14479518 13158480 12067986 11148424
11901 11148424 10349509 9663475 9032520 8457438 7994463 7581886 7167605 6845580 6571209
11892 6571209 6294998 6017438 5744076 5502224 5289268 5087630 4896091 4714618 4520290
11883 4520290 4372425 4235148 4078567 3924785 3764923 3625625 3542653 3459718 3387643 3306182
11873 3306182 3248986 3157509 3081058 3024499 2955979 2910541 2888940 2865285 2815075 2747829 2657148
11862 2657148 2585621 2530479 2466832 2368775 2285774 2219845 2155846 2094059 2029821 1979877 1934070
11851A934070q8145n1641m0352q3383q3446k7045k5832m9165R261l6973n1894
11840A405455l6540n0725j7755J61j0153m9781o8018n2615l9986k7330k0136j3878
11828A018699l0863k8071j7633k9170l1799j736l314j8221n3604m4686K4643m147
11816G80098p7779m9897J7170L0102J4618q106k4043o1694p44O997k1199j6142
11804E89381l260m3466n869J0116J6982l584j9094M63p880k0908j6500m1015j7172
11791D38194K6233o112l9375n5023n147J9862L2859m0363k8205l4856L189K8048
11779C39304K8993m774l5836J454K0416j8127o2384j3485k1116J5999J7009j9541
11767B47912n590J2113P826l3310j2244j4968j5135j8579N03j5092k482q800J7209
$$ plain form
11851 1934070 1845925 1794284 1753932 1670549 1587103 1560058 1534226 1485061 1494322 1457349 1405455
11840 1405455 1368915 1318190 1300435 1300596 1290443 1240662 1172644 1120029 1080043 1052713 1032577 1018699
11828 1018699 987836 959765 942132 912962 881163 879427 876113 857892 804288 759602 784245 780098
11816 780098 702319 652422 669592 699694 714312 706206 682163 620469 619725 626722 605523 589381
11804 589381 586121 542655 536786 546902 563884 560300 541206 541669 533789 512881 496381 455366 438194
11791 438194 464427 458315 418940 363917 358770 378632 411491 371128 342923 308067 311256 339304
11779 339304 368297 363523 327687 329141 349557 331430 269046 255561 234445 250444 267453 247912
11767 247912 242322 254435 262261 228951 216707 201739 186604 168025 168528 153436 150954 142154 159363
11754A59363J3971j1759l1745J2172k1411l6146k6519K1797N970j2235j832O776
11742G8402K665k6079J3576K0415L4480J671l8968J4254K7805K2016j899K3107
11730A71445k4658p552R497p313K825o356L552K2401k2406l9225m4513o770p955
11717D2972J6773K3673K2336J7679j6259j6747k2580j1300j5939n980K8841L669
11705F7138j5689K1310J2633M629J154k1623J1472k6817L831K8011p152j7695
11693F1202K2849J7118o29M368k7446j4365k9578k2460J3836K0172K995j4874
11681C3188P817Q036m356o67j013L7214K0075k9611r199M685k53j7628j1461M198
11667D1025P174J7916j2613Q37P424k1294k4197j8790J7090J8181J9679n200r784
$$ plain form
11754 159363 173334 161575 129830 142002 120591 84445 57926 79723 85693 73458 71626 78402
11742 78402 81067 54988 68564 88979 123459 125130 86162 100416 128221 150237 148338 171445
11730 171445 146787 139235 148732 141419 144244 137888 141440 163841 141435 102210 57697 50927 42972
11717 42972 59745 83418 105754 123433 107174 90427 67847 56547 40608 34628 63469 67138
11705 67138 51449 72759 85392 90021 91175 69552 81024 54207 58038 86049 78897 61202
11693 61202 84051 101169 100540 104908 77462 63097 33519 11059 24895 45067 48062 33188
11681 33188 41005 49041 44685 44018 43005 80219 100294 70683 61484 66169 65916 48288 36827 41025
11667 41025 48199 66115 53502 54339 61763 40469 16272 -2518 14572 32753 52432 47232 37448
11654C7448j2373J3684K4393j6111J1802J3528o43k4120l005L7045K2946m0474
11642F4120l1167M517j691Q171K019J3660j792n233K6196j5497k8707j8848P172
11629B2920K5341K7844j6331k0360M437K0125J3161j0503l5834J526J9707K5038
11617G7071k5360M050l3110O516J6280j8894k5074j1971j4886j4945L6003K087
11605b233j0856K0086L538R046L701k2546K5048P933l6274p8L2805J3047K904
11592D6121q360M531q934K757p345J510j06J7059N908r917k7867J2600k6627j8439
11578a7109K6114J8332p701l6739j9160J649L8806q904l1925m313J2405K4142
11566d403J0670P733n177J5384N738k1929q812o383L870J1873j4355j0264J3066
$$ plain form
11654 37448 25075 38759 63152 47041 58843 72371 71728 47608 44603 81648 104594 64120
11642 64120 32953 37470 35779 43950 45969 59629 57837 52604 78800 63303 34596 15748 22920
11629 22920 48261 76105 59774 39414 43851 63976 77137 66634 30800 32326 52033 77071
11617 77071 51711 55761 22651 29167 45447 26553 1479 -10492 -25378 -40323 -4320 -2233
11605 -2233 -13089 6997 10535 19581 23282 736 25784 33717 -2557 -2635 30170 43217 46121
11592 46121 37761 42292 33358 36115 28770 30280 30174 47233 53141 43224 15357 27957 1330 -17109
11578 -17109 9005 27337 19636 -17103 -36263 -34614 4192 -4712 -36637 -40950 -28545 -4403
11566 -4403 6267 14000 8823 24207 29945 8016 -796 -7179 -3309 8564 -5791 -16055 -2989
11553b989r31l8325j6762n03K0580K1532O565j1500N938Q055K190q236k6156J1500
11539b9042L1272K6559n988j9312J0812j316l530p748k2550N180R653j0076J2857
11526c229P017P4R241j2658j20K5836K8514l6458J3091R668J2888M582j6188k6656
11512A5602j2337J1952k855j2940J6032J7801R656l3362J6060j7410l1370J261
11500b1910L240Q322J3939Q574K74j1507q62K6492L8346J7702l7369k9480J2389
11487B8150M705k626O425P761j1270k1855m512n930K1225L7893M223j9076l7844
11474G269k2287K4348J9067j2665m132J4470J8272k720m511k8387l7400j2365
11462d1041K2131j1863r920M2613J8517J3182q673P696M506J70M495j1544l4717
$$ plain form
11553 -2989 -3920 -42245 -59007 -59510 -38930 -17398 -10833 -22333 -16395 -8340 -6150 -14386 -40542 -29042
11539 -29042 2230 28789 22801 3489 14301 12985 9455 1707 -20843 -15663 -6010 -16086 -3229
11526 -3229 3788 3862 13103 445 325 26161 54675 18217 31308 40976 53864 58446 42258 15602
11512 15602 3265 15217 12362 -578 15454 33255 42911 9549 25609 8199 -23171 -21910
11500 -21910 -18670 -10348 3591 12165 12439 932 70 26562 64908 82610 45241 15761 28150
11487 28150 32855 30229 36654 44415 33145 11290 6778 848 22073 59966 64189 45113 7269
11474 7269 -15018 9330 28397 15732 11600 26070 44342 41622 37111 8724 -28676 -41041
11462 -41041 -18910 -30773 -40693 1920 20437 33619 24946 32642 37148 37318 41813 30269 -4448
11449d448k9600L4524L0812n271R171j5493p076n547P060Q627m5701J0164M7791
11436C5013Q281Q667n712j4899m800j3453k0415J3213j5004J4555J6412K5271
11424D7129J0314k9399M610J3925j063q008m0174j3502J8431L3461N078k9258
11412A1544j6379j7957J2639K1592M475O499l1331j0492O054Q500k9982k4544
11400e9382M805j5520O076J8356L7695M9842j2320k0165j4506r211P813Q520K6101
11387B8104J5510l6472j1448K307p617j1383p700O472J9487M28N907K929P276
11374A3800J1323k7253K472J0420k9297l4589K8454k526J3560L9576J0011j1400
11362B4551j9243K61j2457j006K647P579j4355j4370J2864L373k3149o309n7117
$$ plain form
11449 -4448 -34048 476 31288 26017 35188 19695 12619 7072 14132 22759 -22942 -12778 35013
11436 35013 43294 51961 46249 31350 26550 13097 -7318 5895 -9109 5446 21858 47129
11424 47129 57443 28044 32654 46579 45516 37508 -2666 -16168 2263 35724 40802 11544
11412 11544 -4835 -22792 -10153 11439 15914 22413 -8918 -19410 -13356 -4856 -34838 -59382
11400 -59382 -54577 -70097 -64021 -45665 -7970 41872 29552 9387 -5119 -14330 -6517 2003 28104
11387 28104 43614 7142 -4306 -1999 -9616 -20999 -28699 -22227 -2740 -2312 3595 6524 13800
11374 13800 25123 -2130 342 10762 -18535 -53124 -24670 -27196 -13636 25940 35951 24551
11362 24551 5308 5569 -6888 -7894 -5247 2332 -12023 -26393 -13529 -10156 -33305 -39614 -96731
11349i6731k6964L2722M5857J9463O400m42Q025j134q580J1655k0903j7566J8618
11336b9580K4561j1748o270m432R75J8181K5887L102K6167k3818j5969J612L2821
11323D1489O025k7855j7027J3656j5876j3785m093K9546K4673K9580J1451l6987
11311D0797n930j6172l7201j914P965J724J1189R494k5095k2133K8511J4149R26
11298F310K8200K013k6111j6437o376K2221q93l0690j8672l787J3901K3965J2354
11285E998m296J5610k7525j5630j3941l128K876j8691J3732J6375j3754j0462
11273e2836J1174L8771m612N298p269K4859L3579j7189j7510L389j1078j4937
11261h361P247k679r673m146K695J7376N427k3818k4183R712J8909L2166K2986
$$ plain form
11349 -96731 -123695 -90973 -45116 -25653 -19253 -19695 -11670 -12804 -21384 -9729 -30632 -48198 -29580
11336 -29580 -5019 -16767 -23037 -27469 -26494 -8313 17574 20676 46843 23025 7056 8668 41489
11323 41489 47514 19659 2632 16288 412 -13373 -17466 12080 36753 66333 77784 40797
11311 40797 34867 18695 -18506 -20420 -12455 -10731 458 9952 -15143 -37276 -8765 5384 6310
11298 6310 34510 36523 10412 -6025 -12401 9820 8927 -21763 -40435 -44222 -30321 -6356 5998
11285 5998 1702 17312 -10213 -25843 -39784 -42912 -40036 -58727 -44995 -28620 -42374 -52836
11273 -52836 -41662 -2891 -7503 -2205 -9474 15385 48964 31775 14265 17654 6576 -8361
11261 -8361 -1114 -3793 -13466 -17612 -14917 2459 7886 -15932 -40115 -30403 -11494 20672 43658
11248D3658k736J8434M260p754J3575J6409m7321n7968m436J0274p355n580O829
11235a9711J5004K0125j9728k6659K0389J847j839N479r702j8655J8034L7194
11223B1778n404l1008r131K8004j2915j7827R957R539p422l6099j8424J1015J417
11210e6520J0754N4087J3134p379R302O341M60M69Q007K287k2059k4848N145J8482
11196A7662J3797p615j4942R913M08p491j9842Q29J1012Q8J8559M46n0904k1068
11182d9148R216J422m1243j7928L1118L2346J4139K615k673J6031k4055n888K4009
11169a0039L4405M2998j7165l3157J41j3238L10J8776P06k3235q83j7079Q754
11156h706j0364J1330j376J9459l747j3800J4395k133Q989P26m4019J0196K2153
$$ plain form
11248 43658 40922 59356 63616 55862 69437 85846 38525 -19443 -23879 -13605 -20960 -26540 -19711
11235 -19711 -4707 15418 -4310 -30969 -10580 -8733 -10572 -5093 -14795 -33450 -15416 21778
11223 21778 16374 -14634 -23765 4239 -8676 -26503 -16546 -7007 -14429 -50528 -68952 -57937 -56520
11210 -56520 -45766 8321 21455 14076 23378 29719 30179 30648 38655 40942 18883 -5965 -820 17662
11196 17662 31459 23844 8902 18815 19223 11732 -8110 -7281 3731 3819 22378 22824 -28080 -49148
11182 -49148 -39932 -38510 -79753 -97681 -66563 -34217 -20078 -17463 -20136 -4105 -28160 -34048 -10039
11169 -10039 24366 67364 50199 17042 17183 3945 4255 23031 23737 502 -381 -17460 -8706
11156 -8706 -19070 -7740 -9116 10343 6596 -7204 7191 5058 14047 14773 -29246 -19050 3103
11143C103P615R451M586M041M752k1994O717j1960n913m3918l0960J2223L1774
11130c0483l320j383j6161L2832N012k5720J6800N846R518j1539k6415J0412M738
11117b9863P193M380j5037K8149O927n12J2317j5988j4318j6307J830k6950j4469
11104g2648K6205K4745M0123N409J6007M457k6565l0626l87P362L5283K6102l087
11091E2380Q59j5766l1855L390Q463O492k2250l3802j4663P946M241Q069j0564
11078c7060Q029j828j7263l2775M2126K4835j126m043k4640k507J0224J6273R760
11065i995O222j547R485M674K0416j4163J91m270J6871K3459J191r951O988J8353
11051F7924K3966k584o188K6329p231j7070k158p572J3941L7949K8113p713l1049
$$ plain form
11143 3103 10718 20169 24755 28796 33548 11554 18271 6311 398 -43520 -74480 -62257 -30483
11130 -30483 -33803 -35186 -51347 -18515 -13503 -39223 -22423 -16577 -7059 -18598 -45013 -34601 -29863
11117 -29863 -22670 -18290 -33327 -5178 1749 1237 13554 -2434 -16752 -33059 -31229 -58179 -72648
11104 -72648 -46443 -21698 18425 23834 39841 44298 17733 -12893 -13280 -5918 29365 55467 52380
11091 52380 53239 37473 5618 9008 17471 23963 1713 -32089 -46752 -38806 -34565 -26496 -37060
11078 -37060 -29031 -30859 -48122 -80897 -38771 -13936 -15062 -19105 -43745 -46252 -36028 -19755 -9995
11065 -9995 -3773 -5320 4165 8839 29255 15092 15283 11013 27884 51343 52534 42583 49571 67924
11051 67924 91890 89306 83118 109447 102216 85146 82988 75416 89357 127306 155419 147706 116657
11038A16657m7J5397J0672O597r673j0522j980k0859M525L2054J7494K7024k4489
11025A62850k1146J3018l199k0240j6452L2697K7191J4276k7373k659J8029M991
11013A81983P472J4841l2915l9343l7000m2762L477M211L660J5274M038j6466
11001F6470p761q846j1645K3562o662K8465n177l3734O250k325r05j7893J2827
10988D2626Q117R52J0620j025j5140P278j0578j2414N92j2930l15k014L1101O766
10974E3636K4310l4476k0306l972r402K5465M0898J9331k2297m5970k0382n613
10962A222M288j9995j5393J9721L2422l071O533K0431k8543M604M157n410M858
10949B5824N47O790q387j0616R407r274K475j3898j8245K028j4873O051J4972
$$ plain form
11038 116657 116610 132007 142679 149276 139603 129081 127101 106242 110767 142821 160315 187339 162850
11025 162850 141704 154722 151523 131283 114831 147528 174719 188995 161622 158963 176992 181983
11013 181983 189455 204296 171381 132038 95038 52276 55753 59964 63624 78898 82936 66470
11001 66470 58709 49863 38218 61780 55118 83583 78406 44672 50922 48597 47692 29799 42626
10988 42626 50743 51695 62315 61290 46150 53428 42850 30436 31028 18098 17783 15769 46870 53636
10974 53636 77946 43470 23164 19192 9790 35255 76153 95484 73187 27217 6835 1222
10962 1222 5510 -14485 -29878 -10157 22265 19194 25727 46158 17615 22219 26376 20966 25824
10949 25824 26371 33161 24774 14158 23565 14291 16766 2868 -15377 -13349 -28222 -22171 -7199
10936g199Q294N210k4393j7409P962K9091K350k7391k6393K7056L8876J2590K2918
10923E1562N619k0403K2668q325k710O068j1756r049P135q523j6407l3608r81
10910a8710L4409J2596K465L1918J1956j8958l1132q597J9718R604k6802j6850
10898A617j6437O5N345K3744l341l309J3572L378j6563J4587m036k7612j0925
10885a9915J5587J4664J0277k4121m320J1154j8826r200P004L1891K15J832O412
10872B2654j5987J2148Q765j2298P473J0440k9354M340J4941J0674J4116N351
10860E3263K0712k750k5473l3042l613k989K4728K1375k377j4280k5678j8254
10848h378m61J073j7124p269n423J3028k2476R598J0792J2057L8381L3049K2250
$$ plain form
10936 -7199 1095 6305 -18088 -35497 -27535 1556 3906 -23485 -49878 -22822 16054 28644 51562
10923 51562 57181 36778 59446 51121 48411 54479 42723 33674 40809 32286 15879 -17729 -18710
10910 -18710 15699 28295 30760 62678 74634 55676 24544 15947 35665 45269 18467 1617
10898 1617 -14820 -14755 -9410 14334 10993 7684 21256 24634 8071 22658 18622 -8990 -19915
10885 -19915 -4328 10336 20613 -3508 -7828 3326 -15500 -24700 -17696 14195 14410 16242 22654
10872 22654 6667 18815 27580 15282 22755 33195 3841 8181 23122 33796 47912 53263
10860 53263 73975 71225 45752 12710 9097 6108 30836 52211 49834 35554 9876 -8378
10848 -8378 -8839 -7766 -24890 -32159 -37582 -24554 -47030 -37432 -26640 -14583 23798 56847 79097
10835G9097p140k875j1776p663J011k5771k9602R694r036j6463K762k1679N898
10822c3543K4168J8673J9780J8853j1838l6852k436P667j1656j0803K1073N530
10810H616J3616j1227K1900J6694k8507j0158k3935o269J9862J4719m184q278
10798B849J4913K8625j2544k2608j7745J4838K9098M742k8705p938J7440R718
10786C2683j5451j5394n312K2814J7983k2662k5783j1556J5017R204R368J8301
10774B9212j4637j9445Q714J4843K3408m706K8279j0017l8640j6833K8521K8254
10762E6953l2180l8020n662L0859L0515j3595J546N85J5433o047j3523k4937K9069
10749C0996J790r123K0498L5584J1591K1344k645j710j0724l1132k32k343J0552
$$ plain form
10835 79097 71957 69082 57306 49643 50654 24883 -4719 4975 -4061 -20524 -17762 -39441 -33543
10822 -33543 -9375 9298 29078 47931 36093 -759 -3195 4472 -7184 -17987 3086 8616
10810 8616 22232 11005 32905 49599 21092 10934 -13001 -19270 592 15311 11127 2849
10798 2849 17762 46387 33843 11235 -6510 8328 37426 42168 13463 5525 22965 32683
10786 32683 17232 1838 -3474 19340 37323 14661 -11122 -22678 -7661 1543 10911 29212
10774 29212 14575 -4870 3844 18687 42095 37389 65668 55651 17011 178 28699 56953
10762 56953 24773 -13247 -18909 11950 42465 28870 30416 31001 46434 40387 26864 1927 30996
10749 30996 32786 23663 44161 79745 91336 112680 110035 108325 97601 66469 66237 63894 74446
10736G4446k7227j7794p103j3806K8565J3899J4720K7566k4956n882R729l335
10724F8822J0206n606M919l5093k5016j2769M0782M3488Q172J0587o850j2620
10712H9022j5173p51j2194o515k01J04K2188J3593k0405q940J5859m636k2191
10699D9760j1724L5761L6369O229j9343l0589j9800J2424M8027M497j0060j4450
10687H7101R848j139K6375n110k1059j3976j1076n701O214K3846J8149l554j3049
10674I6869N870J1247J5154J8975K414j1570O40J6445j155j1568j1041p628O608
10661A31260q909j5695L7406K0191q336K2399K2707q05J9624N322K5570K9626
10649B80360K1635K0013K8700J5806j2150J4131M9720R168K3619N0003L2879N0412
$$ plain form
10736 74446 47219 29425 22322 8516 37081 50980 65700 93266 68310 62428 72157 68822
10724 68822 79028 73422 78341 43248 18232 5463 46245 89733 97905 108492 101642 89022
10712 89022 73849 73098 60904 54389 54188 54292 76480 90073 69668 60728 76587 71951 49760
10699 49760 38036 73797 110166 116395 97052 66463 46663 59087 107114 111611 101551 87101
10687 87101 96949 95810 122185 117075 96016 82040 70964 65263 71477 95323 113472 109918 96869
10674 96869 102739 113986 129140 148115 150529 138959 139599 156044 154889 143321 132280 124652 131260
10661 131260 122351 106656 144062 164253 155917 178316 201023 200218 219842 225164 250734 280360
10649 280360 301995 322008 350708 366514 354364 368495 418215 427383 451002 501005 533884 584296
10637E84296R2080J06027R8002P3103J02883J83290K23268K77208L89832N46495
10627B676484P19404Q34542R45755R56367R22797R54032J003578J026861Q80219
10618A0920039N94863L49777L01286N74572R82632J273120J346155J386971J539963
10609A9269378J693522J715080J288829M20040n30473p94921j88355O96973J197274
10600B4767347J322155J382281J505712J723068J583344P54383p84086k303901
10592B9950303k720820k054886j043904l53132m9021J14075L49603N52188M13171
10583B5157577k31324j282210k223012k434342j955143j269519p89367m88309
10575A4484351l24886k27837j69743k77742n59094r91257j348634j419081j252830
$$ plain form
10637 584296 676376 782403 880405 953508 1056391 1239681 1462949 1740157 2129989 2676484
10627 2676484 3395888 4230430 5176185 6132552 7055349 8009381 9012959 10039820 10920039
10618 10920039 11514902 11864679 12165965 12740537 13723169 14996289 16342444 17729415 19269378
10609 19269378 20962900 22677980 23966809 24386849 23856376 23061455 22873100 23570073 24767347
10600 24767347 26089502 27471783 28977495 30700563 32283907 33038290 32254204 29950303
10592 29950303 27229483 25174597 24130693 23777561 23728540 23842615 24192218 24744406 25157577
10583 25157577 24926253 23644043 21421031 18986689 17031546 15762027 14972660 14484351
10575 14484351 14159465 13931628 13761885 13484143 12925049 11933792 10585158 9166077 7913247
10566G913247r72683p42867n80609m52472l32178k76383k34182j99273j65944
10557C956656j65030j38045j47578j26413j07434j01808j15892j32482r7316q3139
10547B741519j26423o1732l1677p7806o3990p4323o8532q2291m7931m8687o2066
10536A996061k9003k4549l8506j4841m2668o8044o6038m1604m0781k8993k6064
10525A574970l3393l0888l6588n0959k7855q789m8153o4825o1092n1319k4035
10514A137074k0576j8065l3380l6069R414j5592k0053l8747o4440l2041M572Q978
10502H81075m4447n9586M848j6854k9242j7692k1738p106k6490m2775l1761O770
10490E95002K8250m00k7411k5905p338j3609q885k0203L354j3748o15j6720k9927
$$ plain form
10566 7913247 6940564 6197697 5617088 5164616 4832438 4556055 4321873 4122600 3956656
10557 3956656 3791626 3653581 3506003 3379590 3272156 3170348 3054456 2921974 2824658 2741519
10547 2741519 2615096 2553364 2521687 2443881 2379891 2305568 2237036 2154745 2106814 2058127 1996061
10536 1996061 1967058 1942509 1904003 1889162 1846494 1778450 1712412 1670808 1630027 1601034 1574970
10525 1574970 1541577 1510689 1474101 1423142 1395287 1386498 1338345 1273520 1212428 1161109 1137074
10514 1137074 1116498 1098433 1065053 1028984 1038398 1022806 1002753 964006 899566 867525 872097 881075
10502 881075 836628 777042 781890 765036 735794 718102 696364 689258 662768 619993 588232 595002
10490 595002 623252 622852 595441 569536 562198 548589 539704 519501 522855 509107 508492 491772 461845
10477D61845j498J2347k957l433r465n0673R99J6729P19k4328m869j6036j7476
10464C61904L424k235j5683K1334j2899n7998j328J7216j2872k0297n804O960
10452B81722K278m520k0252p279J1055j4778j9386j9276R208J2601j3333q036
10440B10004o417l9787n216J8568k0260O243R286p236l3829n0285Q373M1914K3496
10427A54854J5666j0024j0397l4135j6199k9445m823J193J9721M347l4728j9931
10415C6099J0782m002J1783K9807K3644k1571m391J5065j454j596M493J4073n29
10402A12203j3793K0082R928k6164P741j253j9315k8878J0281L226K1086K7138
10390A22282k61k1748j9109k8300J76J0347K1786J7271K609o0994k5366Q40L271
$$ plain form
10477 461845 460347 472694 469737 466304 456839 406166 407165 423894 424613 400285 395416 379380 361904
10464 361904 365328 363093 347410 368744 355845 297847 296519 313735 300863 280566 274762 281722
10452 281722 284000 279480 259228 251949 263004 248226 228840 209564 218772 231373 218040 210004
10440 210004 203587 163800 158584 177152 156892 163135 172421 165185 131356 81071 89444 131358 154854
10427 154854 170520 160496 150099 115964 99765 70320 65497 66690 86411 90758 56030 36099
10415 36099 46881 42879 54662 84469 108113 86542 82151 97216 95762 94166 98659 112732 112203
10402 112203 98410 118492 128420 102256 109997 108744 89429 60551 70832 74058 95144 122282
10390 122282 122021 100273 81164 52864 53040 63387 85173 102444 105053 44059 18693 19533 22804
10377B2804M20L8489J0704j9840O706j2477j8468R014P936j8186K809J3735k326
10364D1320j8166K1886J7425J4266j6111j6078l741K4105q22m6863n0729Q834
10352b4674K8210L2726J7952k100J8733j2189k2050Q642J9991o036P254J211J0739
10339G8409l557r555L596l5917j8149K5481J5558K0987K547j2010K809J978M643
10326G6820J2814p550j9855k7648k3992J2865k343l0245J2185L4423l975J4626
10314D8125l003j5412j2142J4898K957j3707J9683J4869J3527j4189j0495J1410
10302E6521K4715o634j8910l794j3078j4814J9793o141p395J7448j5178j6377
10290A6156j2781m642j0608J8227P055k597O397R367J1354l21Q124O136l5973
$$ plain form
10377 22804 23224 61713 72417 52577 59283 46806 28338 37352 45288 27102 29911 43646 41320
10364 41320 23154 45040 62465 76731 60620 44542 40801 64906 64084 17221 -33508 -24674
10352 -24674 3536 36262 54214 52114 70847 58658 36608 45250 65241 59205 66459 67670 78409
10339 78409 74852 65297 68893 32976 14827 40308 55866 76853 79400 67390 70199 72177 76820
10326 76820 89634 82084 62229 34581 10589 23454 21111 -9134 3051 37474 33499 48125
10314 48125 45122 29710 17568 32466 35423 21716 41399 56268 69795 55606 45111 56521
10302 56521 81236 74602 55692 51898 38820 24006 43799 37658 30263 47711 32533 16156
10290 16156 3375 -1267 -11875 6352 13407 10810 17207 26574 37928 37607 45731 51867 15894
10277A5894k1022m048L0450L0631J3752p000l8153k4297j5458j8914q10L4776
10265d199L6829j874K486k646j1176J8430J2031n623o732J0124p619J2740m579
10252D8192j5068m0623j5025K8471K6606q256p565j395J5523k6601j2763R82J5822
10239H300j4586k4131K094J2105Q010N7214J4190K272P869j0142J5208l598q921
10226F5884k5131p917k7323r008N545O072R514L196k7661n343o487K3420o359
10213a598K563J631n204J8662l164J5556J3113L0478j8076k1779k256k358l173
10200B4395l706p613r203j0697n817j1444J0625K8540K8835j7617K912L6685L8306
10187A04201O723j711O073j291M036J871m8184m8179m291K0726o072M9046M3094
$$ plain form
10277 15894 -5128 -9176 21274 51905 65657 58657 20504 -3793 -19251 -38165 -38975 -4199
10265 -4199 32630 30756 33242 30596 19420 37850 49881 44258 37526 47650 40031 52771 48192
10252 48192 33124 -7499 -22524 5947 32553 24297 16732 15337 30860 4259 -8504 -7522 8300
10239 8300 -6286 -30417 -28323 -16218 -8208 49006 63196 65468 73337 63195 78403 74805 65884
10226 65884 40753 32836 5513 -3495 2050 8122 17636 20832 -6829 -12172 -18659 4761 -1598
10213 -1598 965 2596 -2608 16054 12890 28446 41559 72037 53961 32182 29926 27568 24395
10200 24395 20689 13076 3873 -6824 -12641 -24085 -13460 15080 43915 26298 29210 65895 104201
10187 104201 110924 109213 115286 113995 118031 119902 71718 23539 19248 39974 33902 82948 126042
10174A26042J6153K0652p829J7619P21l7831r969K140N115j4863J8131L0787j178
10161A65690O600j923n462j5070M5356J8318k2490l4281k2331j3920R870J2016
10149A42373L346k0347K1915J7717l2572j3573k1736m3690M442K9431M699N586
10137I7591M359M311j5049k2029J5110j8130m8518m644K565J1377J260l1807m7499
10124e1103L3870L2376K668L6881L5097k2912l3890J111L795P838j1674j5559
10112A8498O573J7893J2959l1652k8273L1861R503j496M4629j6158k8064J4914
10100E1187J5488n518l2136P81j858j3902j4022r399j1162J3432R538m215N508
10087C722L6372K2712r061j7230q349m773k362J480L0192J0661j3343n060K7710
$$ plain form
10174 126042 142195 162847 155018 172637 173358 135527 125558 127698 132813 117950 136081 166868 165690
10161 165690 172290 170367 164905 149835 195191 213509 191019 156738 134407 120487 130357 142373
10149 142373 145719 125372 147287 165004 132432 118859 97123 53433 57875 87306 92005 97591
10137 97591 101950 106261 91212 69183 84293 66163 17645 13001 15566 26943 28203 -3604 -51103
10124 -51103 -17233 15143 17811 54692 89789 66877 32987 34098 37893 45731 34057 18498
10112 18498 25071 42964 55923 24271 -4002 27859 37362 35866 80495 64337 36273 51187
10100 51187 66675 61157 29021 29802 27944 14042 20 -9379 -20541 -7109 2429 -1786 3722
10087 3722 40094 62806 53745 36515 28166 23393 21031 22511 52703 63364 50021 44961 72671
10074G2671Q135R75k3538J0417j8013q714q340k0060q575J6181K244j3741K046
10061A1688K9598J3664N962l2005J5160l9q016r681l804J7736M126j408R235j8177
10047C4039p943q95Q408j5220j7605j3812l089p16Q415J6260N82j843m1418O274
10033b8563J1595K0621J2380K4323R002l1157o191q623K705j9052K0115L6864
10021D4019p708r008k2481K4479P831j9921n293K2889P908k759k4343j6489j2278
10008a3154J7491J6731J0736l4131n795K612P511j5612J1228M471l6373k4177
9996e8462L4524L1393J9319K4124m174l0854k6696K0996M2034J3294r925K0905
9984G6478J6552k0711p589j7208j5568k5029k5119K7879j81j714L582J287K4927
$$ plain form
10074 72671 80806 81781 58243 68660 50647 41933 33593 13533 4958 21139 23383 9642 11688
10061 11688 41286 54950 60912 28907 44067 44028 36012 26331 22527 40263 44389 42981 52216 34039
10047 34039 26096 25201 33609 18389 784 -13028 -16117 -16833 -8418 7842 8424 6581 -34837 -28563
10033 -28563 -16968 3653 16033 40356 49358 18201 12010 3387 6092 -12960 7155 44019
10021 44019 36311 27303 4822 29301 37132 17211 11918 34807 42715 39956 15613 -876 -13154
10008 -13154 4337 21068 31804 -2327 -8122 -5510 2001 -13611 -2383 2088 -34285 -58462
9996 -58462 -23938 7455 26774 50898 46724 15870 -10826 10170 52204 65498 55573 76478
9984 76478 93030 72319 64730 47522 31954 6925 -18194 9685 9504 7790 11372 12659 37586
9971C7586K1912k4563k4877K8334L0803j6354m9480O648J5189m353Q427q195k2301
9958a224k7617o864m675M4198r421L0485k411M323q775j3652N950p956o899l622
9944h160M657J2911J3331J4272K6365J4322n010l8848j8844K3662L1183j3594
9932E6247O598j1739l7015l9130l839L0468J4699m963m651j6886k3690K0104J6646
9919B849J292Q355J0115K1585j5258K2779J0474N294J005q17j8370K6541J5838
9906I1682k2451k5660J0567j4800o395r574j1166M3634L101Q811l8127l0876P518
9893F264J4861K1464J3957j7577j6049J5885J6894j0017r096k6032N3J3757L721
9880B8085k251J8769J1597j2950l2140j7715j459j269R448L3286J6164l357j1601
$$ plain form
9971 37586 59498 34935 10058 38392 69195 52841 3361 10009 25198 20845 29272 21077 -1224
9958 -1224 -28841 -35705 -40380 3818 -5603 24882 22471 26794 18019 4367 10317 2361 -4538 -8160
9944 -8160 -3503 9408 22739 37011 63376 77698 72688 33840 14996 38658 69841 56247
9932 56247 62845 51106 14091 -25039 -28878 1590 16289 11326 6675 -10211 -33901 -13797 2849
9919 2849 4141 12496 22611 44196 28938 51717 62191 67485 68490 67673 49303 75844 91682
9906 91682 69231 43571 54138 39338 32943 23369 12203 55837 58938 67749 29622 -1254 6264
9893 6264 21125 42589 56546 38969 22920 38805 55699 45682 36586 10554 10607 24364 28085
9880 28085 25834 44603 56200 43250 11110 -6605 -8064 -9333 115 33401 49565 46208 34607
9867C4607k2522o845M0094J8403J2790K785k5932j2274j6171j0423n959J0976
9855A9529j9157k7086J8671K598J5146R020K184M47L2164Q556k5466j5624P737
9842B8719K689j2818n620N772n993J7398J0758j898j0365M673j213m283k377J7679
9828D3121M18j4730j5697R459k391k2604K3146k2936r041J1417q465K8375K3574
9815D3646r966l3664J1300L2872K0958l911Q613j0582Q309p132m667r247P790
9802E4319r350J3850p568j4901k9761P664Q356m444j946J7405K7335l3463j4072
9789A3424r075J0807K4419J7570o987r193R978L5494q32J748r537n258p887J3927
9775G8598K1391j8512k2830j1990J8932j9853j4494M428J8431Q910O418J2079
$$ plain form
9867 34607 12085 5240 45334 63737 76527 79312 53380 41106 24935 14512 8553 19529
9855 19529 372 -26714 -8043 -5445 9701 18721 20905 21352 53516 62072 36606 20982 28719
9842 28719 31408 18590 12970 18742 12749 30147 40905 39007 28642 33315 32102 27819 25442 43121
9828 43121 43539 28809 13112 22571 20180 -2424 20722 -2214 -11255 162 -8303 20072 43646
9815 43646 33680 16 11316 44188 65146 61235 69848 59266 67575 60443 55776 46529 54319
9802 54319 44969 58819 51251 36350 6589 14253 22609 18165 16219 33624 60959 27496 13424
9789 13424 4349 15156 39575 57145 50158 40965 50943 86437 85605 87353 77816 72558 64671 78598
9775 78598 99989 81477 58647 46657 65589 45736 31242 35670 54101 63011 69429 81508
9763H1508J4840O079k6822k133K6177J8962j6553K321n619J414o220m084J4980
9750A04850j7474J805J0223k2254l0745j1271J9320P612L915J9487J2345l5897
9738F1916j7380J6550K2431M417M092l4796l814P588q181j9145j4908j4019K0317
9725B5068J2374J0171R257L0852O238j8926m902J9422J267o172m303J2271j456
9712I1161k1625j6969o926J1117o685j511k710L0488K5886K0450K245l6277j326
9699H7318o394l375K1150R759J3140j4146J367K080J3799j2762l3404m5595J1506
9686D4443M4250l605j1521K17j454J946J6743J7008m347m4176q796J6716Q890
9673G6314O290m917j9338j9186M2386M880m559n933j0468L9184L0743q518J2608
$$ plain form
9763 81508 96348 102427 75605 73472 99649 118611 102058 104379 98760 100174 93954 89870 104850
9750 104850 87376 89181 99404 77150 46405 35134 54454 62066 65981 85468 97813 61916
9738 61916 44536 61086 83517 87934 92026 57230 53416 61004 52823 33678 18770 4751 25068
9725 25068 37442 47613 56870 87722 93960 75034 70132 89554 90821 84649 80346 92617 91161
9712 91161 69536 52567 45641 56758 50073 48562 45852 76340 102226 122676 124921 88644 87318
9699 87318 80924 77549 98699 108458 121598 107452 108819 110899 124698 111936 78532 32937 44443
9686 44443 88693 85088 73567 73784 72330 74276 91019 108027 103680 59504 50708 67424 76314
9673 76314 82604 77687 58349 39163 81549 86429 81870 75937 65469 104653 135396 126878 139486
9660A39486L106K9498L2204M376l540j7984K1264p937j1934k3621P91j7092p869
9647A40748j2430j3885m836r707L731j5030j8640k6791J9798J6344k2452j8030
9635C8820L5036J6006J9086K4010J3188j7575j670J1354r808Q834J904J9287l8147
9622A20325k0836K5234K0461K1705N398o353J7836O991J734l1551K4852j8810
9610A66986n059K5682m551j0075K737J8489j4981N039J4423k0857p83j8694J4186
9597A72542j0063R974J8563m63J1133j0841M671j4897l6490l7554k5826L0238
9585A10987J0653J7148N510L1753k243Q852R810R901R774R029J2969p469J3468
9572B40142P807k7170q785L1776M0762L1865K0920k307P307K9069K9414L1927
$$ plain form
9660 139486 142592 172090 204294 208670 205130 187146 208410 200473 188539 164918 165709 148617 140748
9647 140748 128318 114433 109597 99890 103621 88591 69951 43160 62958 79302 56850 38820
9635 38820 73856 89862 108948 132958 146146 128571 126901 138255 128447 137281 139185 158472 120325
9622 120325 99489 124723 145184 166889 172287 165934 183770 190761 192495 160944 185796 166986
9610 166986 161927 187609 183058 172983 175720 194209 179228 184267 198690 177833 177050 158356 172542
9597 172542 162479 172453 191016 190553 201686 190845 195516 180619 144129 106575 80749 110987
9585 110987 121640 138788 144298 176051 173808 182660 192470 202371 212145 221174 234143 226674 240142
9572 240142 247949 220779 211994 243770 284532 316397 337317 335010 342317 371386 400800 432727
9560D32727J6912L1393Q370K5278O8313L8743M6981P9484R4136J14880J13462
9549A070679J01488J00992N2986K2815P092R615l1291m5253n1980j01392r2803
9538A042948j03632p6056o6814r1054q5724l5495l9652M669k0688l5864r740p913
9526D74985l4263o189Q661K4600j2192l3788m475O238j4423j3503j8346K0344
9514C97649K3377J7773J6151j2386J3891M1833M4888N6845M8288Q7720R7769O6551
9502I00349R6355J20253J21519J13585Q1974O5604L9342J6908R885p3115p5602
9491A417057m8346r3693r8544q8255j10231j03493o0461p5729p0442m4901m6881
9480E76081l5843k5900m8712j7949l2579P718J9146M938J395k669k6121R755O791
$$ plain form
9560 432727 449639 481032 489402 514680 582993 621736 668717 748201 842337 957217 1070679
9549 1070679 1172167 1273159 1326145 1348960 1356052 1365667 1334376 1289123 1237143 1135751 1042948
9538 1042948 939316 863260 796446 705392 619668 584173 544521 549190 528502 492638 482898 474985
9526 474985 440722 434533 443194 467794 455602 421814 417339 423577 409154 395651 377305 397649
9514 397649 421026 438799 454950 442564 456455 498288 543176 600021 648309 736029 833798 900349
9502 900349 996704 1116957 1238476 1352061 1434035 1499639 1538981 1555889 1565774 1492659 1417057
9491 1417057 1368711 1275018 1176474 1088219 977988 874495 814034 738305 667863 622962 576081
9480 576081 540238 514338 465626 447677 415098 422816 441962 446900 448295 445626 419505 429260 436051
9467D36051l3147o610J8185m6453k8539n673m358L0608L7599K1820p580n974k4307
9454C81622k073N859k229P104Q358M867j6393l5230j1788p252J5363j4241j0297
9441C23670j5788J0413j3708k8112k215K1389o083k0719n643k641J6563O227L680
9428B87033k5545n6M7500M122m5355j2691P556K0668J2092P659j8253j041J2419
9415B96108J8841O798L0126L2397L3663J5346L1480J2243J9505L7034K8528j2458
9403E49611q279j850O402m022j9241k4181k5892j7298J248j9261r514k332r504
9390D15887M272J462k3602k351j2687m0160N013J7722J4669J2851K2166k475J859
9377D14626j0071L029L717j1475L394j7333j6184Q088R85m33R143P434k4119n138
$$ plain form
9467 436051 402904 396294 414479 368026 339487 333814 329456 360064 397663 419483 411903 405929 381622
9454 381622 379549 385408 383179 390283 398641 403508 387115 351885 340097 332845 348208 333967 323670
9441 323670 307882 318295 304587 276475 274260 295649 289566 268847 263204 260563 277126 283353 287033
9428 287033 261488 261432 308932 313054 267699 255008 262564 283232 295324 302983 284730 283689 296108
9415 296108 314949 321747 351873 384270 417933 433279 464759 477002 496507 533541 562069 549611
9403 549611 541332 539482 545884 541862 522621 498440 472548 455250 456498 437237 427723 425391 415887
9390 415887 420159 421621 398019 395668 382981 342821 347834 365556 380225 393076 415242 412767 414626
9377 414626 404555 407584 411301 399826 403220 385887 369703 377791 378776 378343 387486 394920 370801 365663
9363C65663P638k896M945J3663J6420L1828J9391J7798M7897L2053M161K0551
9351E79112J5678j3849q03j2590r697P493j1579l3025k0555J6789K1883o577o4743
9338D67537o2973j3763J75j140J6157R644q10j9653m8029J9999M4338K2647J355
9325D35484j4344j2671J0442J3515J8357L3411K1674Q502m882j5645j4858j5188
9313D63797K6665J5920O032O046K904N764k864K2486J6192J5515Q56J3310L4784
9300F27407K7603K1508p146K3393K6599j9922j3879J1533j3536k9551P694L0125
9288F91828N910Q677p816J0138K4550N8001Q3370M0399K6546N3424P9792Q7983
9276A162802L7541J2138R821N5k6343l7030m4868m6710n4243m1029j9837j5215
$$ plain form
9363 365663 373301 370405 375350 389013 405433 437261 456652 474450 522347 554400 558561 579112
9351 579112 594790 580941 580138 567548 557851 565344 553765 520740 500185 516974 538857 532280 467537
9338 467537 404564 390801 390976 389836 405993 415637 414827 395174 347145 367144 411482 434129 435484
9325 435484 421140 408469 418911 432426 450783 484194 505868 514370 509488 493843 478985 463797
9313 463797 490462 506382 512414 518460 521364 527128 524264 546750 562942 578457 579313 592623 627407
9300 627407 655010 676518 669372 692765 719364 699442 685563 697096 683560 654009 661703 691828
9288 691828 697738 706415 698599 708737 733287 791288 874658 915057 941603 995027 1074819 1162802
9276 1162802 1200343 1212481 1222302 1222357 1196014 1158984 1114116 1067406 1013163 972134 952297 937082
9264I37082L3072J7467L159N1449L7768M9484Q904k7127K2043L6284K567p178
9252A164974L3327O5610K0764l10J0677K0268M6640L5743L8627J1669J4508n89
9240A461908J8980N9160Q4966N3346K0817L9276O4267Q3425J06659P8057M5978
9229B116839O3130M1964M4349L2005M9903M0636j1267l3610j5156j02M937J6589
9217B350217J5017M1776K1212M4552K7644N3476R3915P9164O9541O9287N6635
9206B922436N6212L3152Q4976R2342P9585J18184J29014J38724J32116J25933
9196C912674J39545J37037J26441J39003J86869K18998K64956K27358K10014K16236
9186E779131K26087K94100L27859L47479L40893L67561L88403M59847N40956O17942
$$ plain form
9264 937082 970154 987621 990780 1042229 1079997 1129481 1138385 1111258 1133301 1169585 1172152 1164974
9252 1164974 1198301 1263911 1284675 1284365 1295042 1315310 1361950 1397693 1436320 1447989 1462497 1461908
9240 1461908 1480888 1540048 1625014 1678360 1699177 1738453 1802720 1886145 1992804 2070861 2116839
9229 2116839 2179969 2221933 2266282 2298287 2348190 2388826 2377559 2343949 2328793 2328691 2333628 2350217
9217 2350217 2365234 2407010 2428222 2472774 2500418 2553894 2647809 2726973 2796514 2865801 2922436
9206 2922436 2978648 3011800 3096776 3189118 3268703 3386887 3515901 3654625 3786741 3912674
9196 3912674 4052219 4189256 4315697 4454700 4641569 4860567 5125523 5352881 5562895 5779131
9186 5779131 6005218 6299318 6627177 6974656 7315549 7683110 8071513 8531360 9072316 9690258
9176I690258O45336O91150P90459R15429J044416J153482J279366J436748J659391
9167A9306035J937729K271073K591637K935455L412219L991010M720739N698142
9159D6864039O974141Q749779J1137086J4286332J8271623K2884965K7103196
9152A56271161K9341600K8625925K5836245K3145548K1284627J8283138J0677583
9145C13465827l250926k0898520l4791380l8991607l5179181k8431833k1989366
9138A29933014j6792569j2942584j0123688q089871o640899n478925m647361m025722
9130F1191395l542374l143553k747973k330500j918476j577244j206443q78318
9122D3846514o07480k95524N5348M11059P65056J095766J489061J925739K447329
$$ plain form
9176 9690258 10335594 11026744 11817203 12732632 13777048 14930530 16209896 17646644 19306035
9167 19306035 21243764 23514837 26106474 29041929 32454148 36445158 41165897 46864039
9159 46864039 53838180 62587959 73725045 88011377 106283000 129167965 156271161
9152 156271161 185612761 214238686 240074931 263220479 284505106 302788244 313465827
9145 313465827 310214901 289316381 254525001 215533394 180354213 151922380 129933014
9138 129933014 113140445 100197861 90074173 81984302 75343403 69864478 65217117 61191395
9130 61191395 57649021 54505468 51757495 49426995 47508519 45931275 44724832 43846514
9122 43846514 43239034 42943510 42998858 43409917 44174973 45270739 46759800 48685539 51132868
9113E1132868L033357L716505M636383N828536P532129J0015061J3545872J8306751
9105A17747462K4027861K9619161L2757321L1703431K7844741K4779440K4047585
9098C12527002K2583941J5078128j834281k5196363m3532088m7437954m0657809
9091A91530576l1275453k3240977j7331924j3118478j0210664q203700o748781
9084H1400599n695600n012990m579957m267073m035160l721497l383688l026987
9076D7677647k641236k323978k078537j878118j699489j613031j502872j384444
9068C2555942j281624j191643j092426r92898r59588r36774r08454q57410p86153
9059B3548972p17694o29238o30611n71619n28373m79057m02519l69201l96913
$$ plain form
9113 51132868 54166225 57882730 62519113 68347649 75879778 85894839 99440711 117747462
9105 117747462 141775323 171394484 204151805 235855236 263699977 288479417 312527002
9098 312527002 335110943 350189071 348354790 323158427 279626339 232188385 191530576
9091 191530576 160255123 137014146 119682222 106563744 96353080 88149380 81400599
9084 81400599 75704999 70692009 66112052 61844979 57809819 54088322 50704634 47677647
9076 47677647 45036411 42712433 40633896 38755778 37056289 35443258 33940386 32555942
9068 32555942 31274318 30082675 28990249 27997351 27037763 26100989 25192535 24335125 23548972
9059 23548972 22831278 22202040 21571429 20999810 20471437 19992380 19589861 19220660 18823747
9050A8823747l85547l96757l83350l46528l41159l43791l65230l71041l55156
9041A5535188l78645l71818l28229l28797l60820l17800k46019k78345k71350
9032A2653365k50715k75777k40751k27714k51168k86016l13995k94649k69316
9023A0243264k91968k78190k11700j96728j86563j63641j79793j46292j57604
9014H430785j53224j60980j41490j32515j34516j60296j66196j61542j49772j30379
9004F939875j14304j18534j00291o1595l2854l5317Q559N0245J02681J24985J64935
8993F928385K03626K70142K72804K21000J42058J18101Q3423O2860n4304k98355
8983G949740n69800o40242n34094m21201l66450l14853k49138k33910j72122j88855
$$ plain form
9050 18823747 18438200 18041443 17658093 17311565 16970406 16626615 16261385 15890344 15535188
9041 15535188 15156543 14784725 14456496 14127699 13766879 13449079 13203060 12924715 12653365
9032 12653365 12402650 12126873 11886122 11658408 11407240 11121224 10807229 10512580 10243264
9023 10243264 9951296 9673106 9461406 9264678 9078115 8914474 8734681 8588389 8430785
9014 8430785 8277561 8116581 7975091 7842576 7708060 7547764 7381568 7220026 7070254 6939875
9004 6939875 6825571 6707037 6606746 6545151 6512297 6476980 6485539 6535784 6638465 6763450 6928385
8993 6928385 7132011 7402153 7674957 7895957 8038015 8156116 8239539 8302399 8248095 7949740
8983 7949740 7379940 6739698 6205604 5784403 5417953 5103100 4853962 4620052 4447930 4259075
8973D259075j64846j12710j08287p7971p0479o4843n8473r587J2066L444j7920
8962C589469m0970J07J2483l5222q6913j13613j47346j38078j33196j92271j44580
8951B569870j26512q0340j08867p6414p4858p4789m7442k4135n1977m8690l7895
8940A817951n7740l2506k7256m6196k4298L184l3718m5115l1162m1360r953m1991
8928A429840o7674l1161Q363j3776k3398l0968r618k411K502o298k3077j0852
8916A221472l251o405j1578j5439J9995P062n265m1654l7881l9778k0797j8249
8904A048232k5559n4779l0799k0903q414k9295J1122O734J3249J8089n300O271
8892I28648J9175q409j1714l2103j1788j1930N70K6548O067k7863o728k6637m080
$$ plain form
8973 4259075 4094229 3981519 3873232 3795261 3724782 3659939 3601466 3591879 3603945 3607389 3589469
8962 3589469 3548499 3548606 3561089 3525867 3438954 3325341 3177995 3039917 2906721 2714450 2569870
8951 2569870 2443358 2363018 2254151 2177737 2102879 2028090 1980648 1956513 1904536 1855846 1817951
8940 1817951 1760211 1727705 1700449 1654253 1629955 1633139 1599421 1554306 1523144 1481784 1471831 1429840
8928 1429840 1362166 1331005 1339368 1325592 1302194 1271226 1261608 1259197 1261699 1255401 1232324 1221472
8916 1221472 1218221 1211816 1200238 1184799 1204794 1211856 1206591 1164937 1127056 1087278 1066481 1048232
8904 1048232 1022673 967894 937095 916192 907778 878483 889605 896339 909588 927677 922377 928648
8892 928648 947823 939414 927700 895597 883809 871879 872449 898997 905064 877201 870473 843836 839756
8879H39756Q389k7567j7471p722J516j7886j5099n4630j521K3549K0892R58k2257
8866G30907J798L939m0069q147j958p043o276L307n42l736M395l7939r775P563
8852F36424J8483m880j2021J3478J0202M76J0724j6677k8713k3287j9368P306
8840E92147J1058m1279k795P599J0503p352J9309K1962P117l2011j6584M822j5214
8827E59282l1950o0284P167J5452m783N27N35j3577R416P265l3991P306J6703
8814D79068J3787l6903o5751j4579R869J1355l8487k8064Q721q140k9788k1514
8802B79574k9324J0274j6960k879j084n143l2320j8775p618J1402J1186k354l7217
8789A58762j1456J965J1427L6604K0668J6613K1042j775K74J7152K2549J152j49
$$ plain form
8879 839756 848145 820578 803107 795385 796901 779015 763916 709286 707765 731314 752206 753164 730907
8866 730907 732705 736644 696575 688428 686470 679427 673151 676458 675916 672180 676575 638636 628861 636424
8852 636424 654907 650027 638006 651484 661686 662162 672886 656209 627496 604209 584841 592147
8840 592147 603205 561926 559131 566730 577233 569881 589190 611152 618269 586258 569674 574496 559282
8827 559282 527332 467048 474215 489667 484884 485411 485946 472369 481785 489050 455059 462365 479068
8814 479068 492855 455952 390201 375622 385491 396846 358359 330295 339016 330876 301088 279574
8802 279574 250250 260524 243564 240685 239601 234458 202138 183363 175745 187147 198333 195979 158762
8789 158762 147306 149271 160698 197302 217970 234583 255625 253850 254124 271276 293825 294977 294828
8776B94828P668k763K4210M621m7079j4790L1090J2921J280M9247L0203J9688
8764D11124J2573K2450K3519L9101O3337L4292O2988P9082K4258M3331L3097L6716
8752H85868R0446P2156M8748P0758Q8026P0413L1666K7418L7748O5783K2350l3672
8740A477708n1069q6614n3856r0565p3307p9693o8509m6235o0653o3303j6380
8729G87524j3653l2252m4145k3698L494K1463Q465r987k2551l708J8138j0426
8717F78664j1799k60K0143K7793Q518J1279q851m751K8424q386q432M5693Q5177
8704H63212K9777M6058R6778J14762J11259J32305Q6744Q2417P0003L1597K232
8693A667144j9365m1429r1290r5193j02181o3335p9741r1595j12168m0074p5100
$$ plain form
8776 294828 302496 299733 323943 328564 281485 266695 297785 310706 311986 361233 391436 411124
8764 411124 423697 446147 469666 508767 572104 606396 669384 748466 772724 816055 849152 885868
8752 885868 976314 1048470 1097218 1167976 1256002 1326415 1358081 1385499 1423247 1489030 1511380 1477708
8740 1477708 1426639 1340025 1286169 1195604 1122297 1042604 974095 927860 867207 803904 787524
8729 787524 773871 741619 697474 673776 677270 698733 707198 697211 674660 670952 689090 678664
8717 678664 666865 666605 686748 714541 723059 734338 725487 720736 749160 740774 732342 778035 863212
8704 863212 892989 939047 1035825 1150587 1261846 1394151 1480895 1563312 1633315 1664912 1667144
8693 1667144 1647779 1606350 1515060 1419867 1317686 1254351 1174610 1083015 970847 930773 855673
8682H55673q6550j09421q6176n8952j5274M426p663j5290k9975j6319j0276k6361
8670C97842m4133j3110k879k8384q320L2215J4377m1119l0948K2827q507k7427
8658B62434K033m769l535J8131j7814l046r658j6817k5364j8134p603L626J729
8645A81213k049J096N984j6670k2303k9967r555j4009R527O393L080l91J1701
8632A24050N35j2208j501K3625N25j2751j3857j9144Q061J7098J5353K143l3365
8619I8564j6981N3J9770J0389J027K1666J2041N399j1418n290K537K432J668L720
8605A45577Q278j4362m245O708J0279q330m5015r125K4864J2461J4029q388P99
8592A33530j4059p332J4967P831o951J575K8598p806l2940k832K6919J2466q508
$$ plain form
8682 855673 769123 659702 573526 514574 499300 503726 496063 480773 450798 434479 424203 397842
8670 397842 353709 340599 337720 309336 301016 333231 347608 306489 275541 298368 289861 262434
8658 262434 264467 259698 256163 274294 256480 253434 243776 226959 201595 183461 175858 179484 181213
8645 181213 179164 180260 186244 169574 147271 117304 107749 93740 103267 109660 112740 112349 124050
8632 124050 124585 112377 110876 134501 135026 122275 108418 89274 97335 114433 129786 131929 98564
8619 98564 81583 81636 101406 111795 112822 134488 146529 151928 140510 135220 137757 140189 141857 145577
8605 145577 153855 139493 135248 141956 152235 143905 98890 89765 114629 127090 141119 132731 133530
8592 133530 119471 112139 127106 134937 127986 129561 158159 150353 117413 114581 141500 153966 145458
8579A45458j7939k6170j2893N433o515J0420j9183L828M7660Q362k0191O350k0947
8566A03673k4975p646r494j9459k330K0185K534k0244J2969K1861j2103k9326
8554C5645K7587K3838l8187o440K8904L2414l5671j3528J521K736k1889L7608
8542G4538L5115P172k8093j0936J6205P72j3442j0072K0085J6559m0488j2609
8530E4806l5645M842K0336O780J6246R594p413j1075o596j7603j0251k84J0419
8517C4156P02R595P509K687j0300R987J9192M011l3266k5008j6850l7070K3394
8504a1261M2626r890l294r837M1242l535k2736J1303l464j2072J4900M1466J523
8491G6971K6284M633k2678m458k5071J574l061p258k1924J4521L962J5051P423
$$ plain form
8579 145458 127519 101349 88456 93889 87374 97794 78611 82439 130099 138461 118270 124620 103673
8566 103673 78698 71052 61558 42099 39769 59954 62488 42244 55213 77074 64971 35645
8554 35645 63232 87070 48883 42443 71347 103761 68090 54562 56083 58819 36930 74538
8542 74538 109653 116825 88732 77796 94001 94773 81331 71259 91344 107903 67415 54806
8530 54806 19161 24003 44339 51119 67365 76959 69546 58471 51875 34272 24021 23737 34156
8517 34156 34858 44453 51962 54649 44349 54336 73528 77539 44273 19265 2415 -34655 -11261
8504 -11261 31365 21475 18181 8344 49586 46051 23315 34618 31154 19082 33982 75448 76971
8491 76971 103255 107888 85210 80752 55681 57255 54194 46936 25012 39533 43495 58546 65969
8478F5969K608J7956j0613j1238r605l056J2153l456q507L1577K1246O630k3675
8465H7989l1009q009J6940J6050n300o737J1811p973j0432O557O891O658J1098
8452I4534J5731k480M920J5145j5766O504J0522q310k7141l7900J5969J0805L1300
8439A13833O376j5501J802k4860p824L9520J702P540j0369l1269l2578p013J1643
8426E3002k0399k9870k540M9888L2378J9726j6730k7406j8083P529o687o672L775
8413C7911j4327R003K2770J9887j501j3007j6535j806L1471J4746j5163q977j1173
8400E3299J2687L839j4381Q741j0501K0501L5056K206J2537J9315J0020p070O837
8387A53086q586j8198J454j4206m842j1808j7124j2470k1381N532K5618J2770
$$ plain form
8478 65969 68577 86533 75920 64682 55077 52021 64174 60718 52211 83788 105034 111664 87989
8465 87989 56980 48971 65911 81961 76661 69924 81735 73762 63330 69887 76778 83436 94534
8452 94534 110265 107785 112705 127850 112084 118588 129110 120800 93659 55759 71728 82533 113833
8439 113833 120209 104708 106510 81650 73826 113346 115048 122588 112219 80950 48372 41359 53002
8426 53002 32603 2733 193 50081 82459 102185 85455 58049 39966 47495 40808 34136 37911
8413 37911 23584 32587 55357 75244 73743 60736 44201 42395 73866 88612 73449 64472 53299
8400 53299 65986 69825 55444 64185 53684 74185 109241 111447 123984 143299 153319 146249 153086
8387 153086 144500 126302 127756 113550 108708 96900 79776 67306 45925 51457 77075 89845
8375H9845j3130l2124j5798K0484J2013P340m549k2722k812j7335j653q33l6794
8362a8068p77k236K6596J5838R959O785J8727j9822J8318K3935j1056k6002R830
8349E2027K1927J1563n044j9216M900M639k1475n6144k704M4115J5361N856k6027
8336B9778m2236j5797J101M2845M0632l1255j4164j4406j9072P629P111l562J1873
8323D77K1465J1098L9607p1L36k3134j8555p295j8039k4411N05K6479J1410M483
8309B4355j9820J0248R198J3718J2744R931k7254K3928O829K191p946k1677p710
8296B8735K6301l024J5266J8134r926l1784p413K8111k1042J091o802K192R846
8283D9685L3605M508l1267J2246j39k3112q658r301m014j9929k321m969j1637
$$ plain form
8375 89845 76715 44591 28793 49277 61290 68630 64081 41359 38547 21212 19559 18726 -18068
8362 -18068 -18845 -21081 5515 21353 31312 38097 56824 37002 55320 79255 68199 42197 52027
8349 52027 73954 85517 80473 61257 66157 70796 49321 -6823 -9527 34588 49949 55805 29778
8336 29778 -12458 -28255 -27154 15691 56323 25068 10904 -3502 -22574 -14945 -7834 -11396 477
8323 477 21942 33040 72647 72576 72912 49778 31223 23928 5889 -18522 -18017 8462 19872 24355
8309 24355 4535 14783 23981 37699 50443 60374 33120 57048 63877 66068 58122 36445 28735
8296 28735 55036 52012 67278 85412 75486 43702 36289 64400 43358 44449 37647 39839 49685
8283 49685 83290 87798 56531 68777 68638 45526 36868 27567 23553 3624 1303 -3666 -15303
8270a5303k0496k7982L4462O8269M8027l6734j5173J2301j3070j9864j0061K2295
8258B6671K7413P530j796N671j3728j5544k53l816j2507O37N081j0603j3211L388
8244D933M3826L834J3341R270l5442k397J0178j119j5590m1592l096J8980J0125
8231A5251J4700L2109Q370k7081j7787j338J0423j2100l1331J6757K4872j8735
8219A4110l3546J6566M004L777J3268Q633j7668O808J8293J4871J1967P924R446
8206G8453o311m5976k2364N523L834K3846j8314j3658k674k858j278J544L093
8193B860L6398o251k0527L7731N650m405q956l2957J539K0641p131r010J77j3223
8179B536q188J6223M456J2394J3331k2867R86L846k5065j2951R745J7329K1176
$$ plain form
8270 -15303 -35799 -63781 -29319 38950 86977 50243 35070 47371 34301 14437 4376 26671
8258 26671 54084 61614 59818 65489 51761 36217 35964 32148 19641 20278 25359 14756 1545 4933
8244 4933 48759 52593 65934 75204 39762 37365 47543 46424 30834 -10758 -13854 5126 15251
8231 15251 29951 62060 70430 43349 25562 24224 34647 22547 -8784 7973 32845 14110
8219 14110 -19436 -2870 1134 4911 18179 26812 9144 15952 34245 49116 61083 69007 78453
8206 78453 72142 26166 3802 9325 13159 37005 18691 5033 2359 -499 -1777 -233 2860
8193 2860 39258 33007 12480 50211 55861 51456 42500 9543 11082 31723 24592 15582 15759 2536
8179 2536 -5652 10571 15027 27421 40752 17885 18871 22717 -2348 -15299 -5554 11775 32951
8166C2951q256J940j3537k6455k0240L0109J0618o560p322J373L0887j0806r56
8153A3746Q379J6275k0903o564k2097K0030M710k3428O094K6333j29j5208K2472
8140B9710j791j1847j1313N530M138J7926P795N873M961N971j2328R527j9873
8127C4279n523J2428l957P708o334J6017j6288j0210M879k7891k7019J2304J4969
8114E362M636J227M1145K4903K426N543j2815j4516O145j543j4683l790j124j6494
8100B6422j343R533L188J9267K78k1002K387J7j971J5234J7131j0705J1589j1232
8086E8793l6204j9144Q987Q473j1170J1806J1982P748J0138q478k0556j2425q4
8073I866j2808j3192J9653L0229K7762j4109k6272j3538J9779l551j6301J5494
$$ plain form
8166 32951 24695 26635 13098 -13357 -33597 -3488 7130 570 -6752 -5379 25508 14702 13746
8153 13746 22125 38400 17497 10933 -11164 8866 13576 -9852 -3758 22575 22446 7238 29710
8140 29710 27919 16072 4759 10289 14427 32353 40148 46021 50982 56953 44625 54152 34279
8127 34279 28756 41184 37227 44935 38601 54618 38330 28120 32999 5108 -21911 -9607 5362
8114 5362 9998 11225 52370 77273 79699 85242 72427 57911 64056 62513 47830 44040 42916 26422
8100 26422 25079 34612 37800 57067 57345 36343 38730 38747 36776 52010 69141 58436 70025 58793
8086 58793 22589 3445 12432 20905 9735 21541 33523 41271 51409 42931 22375 9950 9866
8073 9866 -2942 -16134 3519 33748 61510 47401 21129 7591 27370 23819 7518 23012
8061B3012K6808K0148m019j5341l636p584J4197J3393k723j8987J6456o572J0000
8048F5152K1131J617L086l3826l1278j9725k1160N012M2051K367k8084R648K2355
8035C8346j078j851P60O911K60J059n474l416k024o6O511p487j3402j3369N565
8020A1245J7803K633L303J1778M1J3083k3769m0877j6847J9810j4704J4658J6138
8007A4295J1696k2733M634p778j2498k779J6264K3161Q912J3355J4623l873l5186
7994B2093n2218K664M8688L972j1097k7607n334J2739J1143j767J2723L8810R171
7981F3980j3097J4180m061l7785l1825K743L6397K7365K293j5694j9301r42L3003
7968E7256K0726k3882L520N684k3768k4987k0890K0273L8486K8369k9471m4984
$$ plain form
8061 23012 49820 69968 65949 50608 46972 39388 53585 66978 64255 45268 61724 55152 65152
8048 65152 86283 87900 90986 57160 25882 6157 -15003 -9991 32060 34427 6343 15991 38346
8035 38346 37268 35417 36177 43088 43348 44407 38933 35517 33493 33427 39938 32451 19049 5680 11245
8020 11245 29048 31681 34984 46762 46803 59886 36117 -4760 -21607 -1797 -16501 -1843 14295
8007 14295 25991 3258 7892 114 -12384 -15163 1101 24262 33174 46529 61152 57279 22093
7994 22093 -30125 -27461 21227 25199 14102 -13505 -18839 -6100 5043 3276 15999 54809 63980
7981 63980 50883 65063 61002 23217 -8608 -5865 30532 57897 60190 44496 25195 24253 57256
7968 57256 77982 54100 57620 63304 39536 14549 -6341 13932 52418 80787 51316 6332
7956F332j4903l25J1065J0236L0892J5498j2075l6092l0396j4637j5823l664L3512
7943b0380K1570k3006q772K5240K7296J6729O831J6133J0825p386n339j0287j9746
7930B9708k7078N143M397J667k807l1788m8196K1155O2767J3975j4863r987O24
7917D717j5954L2084k5866l2633J7692L1598L1518L65k5607J1741J1989Q75k0904
7904B1615k3775M999K6795J2749k2412j7575Q634j3747P618j218k0651J0892M0828
7891C4752j8770k760L976m0970k6659M574M0520j495J998j0039m703m108J5370
7878h314K0905O629k1380L0155J1658l2088q784P275L864p754j7969j8393J6196
7865a8000L1982J4751k306J9961L4020q070m090j6813o913j1783k0510L6634K161
$$ plain form
7956 6332 -8571 -8896 2169 12405 43297 58795 46720 10628 -19768 -34405 -50228 -53892 -20380
7943 -20380 1190 -21816 -30588 -5348 21948 38677 45508 61641 72466 65080 59741 49454 29708
7930 29708 2630 7773 12170 13837 11030 -20758 -68954 -47799 14968 28943 14080 4093 4717
7917 4717 -11237 20847 -5019 -37652 -19960 11638 43156 43521 17914 29655 41644 42519 21615
7904 21615 -2160 2839 29634 42383 19971 2396 11030 -2717 4901 3683 -16968 -6076 34752
7891 34752 15982 13222 17198 -23772 -50431 -45857 -5337 -6832 -4834 -14873 -19576 -23684 -8314
7878 -8314 12591 19220 -2160 27995 39653 7565 -1219 6056 9920 2166 -15803 -34196 -18000
7865 -18000 13982 28733 26427 46388 80408 72338 68248 51435 44522 32739 12229 48863 51024
7852E1024j8817k0506j5445J9871O024M50Q804k2738o331q476q573j8981R474
7839b4220L3764r449L959k081l513J6852J2695K0127j5267k5176J5633L530p303
7826A9551p780K5370J3180k0148j3895k4907J1932J318j3438l167J934k444j5700
7813b8194J4505J9280M734m675Q830n290J3791j4126N389j2715j865L254L0878
7800C3796J4522l8620j9057k3587j3047k5368J239J2515J2159J034L8510J3217
7788G313j4258J0292r739n059J3118k099L9577n943l3520l3057K7262M2932j4714
7775B2105L944l0293p398k653J104Q638j332Q08j115J3889N5265P193o956l2246
7761C0953l6723j301K6136j2040r469J4757K327q283m391j4595K1328K6497l3427
$$ plain form
7852 51024 32207 11701 -3744 16127 22151 22601 31405 8667 2336 -6140 -14713 -33694 -24220
7839 -24220 9544 95 4054 1973 -1540 15312 28007 48134 32867 7691 23324 26854 19551
7826 19551 11771 37141 50321 30173 16278 -8629 3303 4621 -8817 -11984 -10050 -12494 -28194
7813 -28194 -13689 5591 10325 5650 14480 9190 22981 8855 14244 1529 -336 2918 33796
7800 33796 48318 9698 -9359 -32946 -45993 -71361 -70122 -57607 -45448 -44414 -5904 7313
7788 7313 -6945 3347 -6392 -11451 1667 -432 39145 33202 -318 -33375 -6113 36819 22105
7775 22105 26049 -4244 -11642 -14295 -13191 -4553 -5885 -5077 -6192 7697 62962 70155 63199 30953
7761 30953 -5770 -7071 19065 7025 -2444 12313 14640 6357 1966 -12629 8699 35196 1769
7748A769m8773J00O2787K8704k5165L1117R500k0194n803L302O426p192m571j9910
7734A2097j0058p015M36j865q57N903K0818P342L132l674j740q29n195R930j2194
7719A6231n751K856j528M514N932J1082j8708j3400r522J8953j9589p205Q268
7706g867K5826K849Q351o658J6070M432j6454p291k66k0677j702J5769J0112j2037
7692A0457r326m032J2642N783j3167M754m883q792j2956L049Q550J2800J164j7879
7678a1836j6523Q157N968R263j3214N467K5723j0642j6453M0342P401l1497N540
7665G696j8846L370N4608L6168l6621l3871j8025j0636O360J8519o624o899J3995
7652I194j1209k0114O855n120j1864N129K1466j0121P315l800q747L2858J4126
$$ plain form
7748 1769 -47004 -46904 15883 44587 19422 50539 60039 39845 34042 37344 43770 36578 32007 12097
7734 12097 2039 -4976 -4540 -6405 -7262 -1359 19459 26801 29933 26259 24519 23690 18495 28425 16231
7719 16231 10480 13336 11808 16322 22254 33336 14628 1228 -8294 10659 -8930 -16135 -7867
7706 -7867 17959 20808 29159 22501 38571 43003 26549 19258 18992 -1685 -3387 12382 22494 10457
7692 10457 1131 -2901 9741 15524 2357 7111 2228 -6564 -19520 -16471 -7921 4879 6043 -11836
7678 -11836 -28359 -20202 -14234 -4971 -18185 -12718 13005 2363 -14090 26252 33653 2156 7696
7665 7696 -11150 -7780 46828 82996 46375 12504 -5521 -16157 -9797 8722 2098 -4801 9194
7652 9194 -2015 -22129 -15274 -20394 -32258 -27129 -5663 -15784 -8469 -12269 -21016 11842 25968
7639B5968j3100j9118j7841J6091l814k684O052j5813r076O910r620K971P85o803
7625c9092J9091K3468J0975l8737O327L1057k1890j1761j6499k9977K438N4396
7613a0204L8375K5660L918J5918j5905J654q617O515k2634k2114k2977N566K3988
7600A9143M1506K1318r081j0776J663j9125j8729k2704p245J5791K6273O238l799
7587D0473N497k9553L328k5116K3373J9723p573j5322n155j0285k1792O375L0517
7574A4490p501k3267k0071o151M3714R830k965J5823j6594m851k1741q790K0144
7561g930J026l0155J0880J6669R683n899J3441J2959O153j840J0314N731q276
7548C2756o465k5274O352J6128j3080j360k3461k8807m934L7231L0947J3568P128
$$ plain form
7639 25968 12868 -6250 -24091 -8000 -11814 -14498 -8446 -24259 -33335 -26425 -36045 -33074 -32289 -39092
7625 -39092 -20001 3467 14442 -24295 -17968 13089 -8801 -20562 -37061 -67038 -64600 -10204
7613 -10204 28171 53831 57749 73667 57762 59416 50799 57314 34680 12566 -10411 -4845 19143
7600 19143 60649 81967 72886 62110 63773 44648 25919 3215 -4030 11761 38034 44272 40473
7587 40473 45970 16417 19745 -5371 18002 37725 30152 14830 9675 -610 -22402 -16027 14490
7574 14490 6989 -16278 -36349 -42500 1214 11044 8079 23902 7308 2457 -19284 -28074 -7930
7561 -7930 -6904 -37059 -26179 -9510 173 -5726 7715 20674 26827 24987 35301 41032 32756
7548 32756 26291 1017 7369 23497 10417 9057 -14404 -43211 -48145 -10914 20033 33601 40729
7535D0729k3665J7544J6293J3478P256K443k2916k1719m544N190j628p64j5698
7522A1999j5663j1797l729K3758J6318j4283J3948j0645l3224R27J4972P270L4658
7509C4509M190l734p798k7245k5928j7137k3630P450J163O853L403N1637N346
7496I079j7885M903L3225n617j7869O149J0556j9411J0956K5381k8377k9054Q825
7483i139j2491K1248L2975K8304k328m670j7580P090j2966k8742j1237Q175K8746
7470B7385k908k9101R297p997q889q87J285j0715l881J8267K4588p745k391J3385
7456A9693O906m616j1839o391K5862R29J2431l7636j2624L7360M13l3281k8193
7443c0986k337J8421K968K558O557k4803j1274J0365k046J3887L348l1171L238
$$ plain form
7535 40729 17064 34608 50901 64379 71635 74078 51162 29443 24899 30089 28461 27697 11999
7522 11999 -3664 -15461 -19190 4568 20886 6603 20551 9906 -23318 -22391 -7419 -149 34509
7509 34509 38699 34965 27167 -78 -26006 -43143 -66773 -59323 -58160 -51307 -47904 3733 9079
7496 9079 -8806 -3903 29322 23705 5836 11985 22541 3130 14086 39467 11090 -17964 -9139
7483 -9139 -21630 -382 32593 60897 58569 53899 36319 43409 30443 1701 -9536 -1361 27385
7470 27385 24477 -4624 4673 -3324 -12213 -13100 -11815 -22530 -26411 -8144 16444 8699 6308 19693
7456 19693 26599 21983 10144 3753 29615 30544 42975 5339 -7285 30075 30488 -2793 -30986
7443 -30986 -33323 -14902 -11934 -9376 -2819 -27622 -38896 -28531 -30577 -16690 -13342 -44513 -41275
7430d1275L7670J0611j2137k1869m088j1693J9808L2206j719J722p185j3233l964
7417a5146j0132J5342J8855J0791J3321K1325k5264m7588j2648J8914l4900p745
7405e4875J6932K0346M1516k1556m1177N1937K3412n543k7189k1615k1828M785
7393c4855L5338L118j2401j1024j086k5415J3677o270l808q481j7211L62K5575
7380d2481K9865L085j00N791j0210Q32M300l444P671K5695J2915J7897J878m2480
7366A1214m2950n369q363M060J0930P206L582L6176r154j6067J5876K534n962
7353C713j8401p852L93M113L3300J7633j6889k1788J78P751k3448J951j3068j566
7339c3980O305j3390J2944L0014J3153j7529j4771k0102Q995M0600j7781O155
$$ plain form
7430 -41275 -3605 7006 -5131 -27000 -31088 -42781 -22973 9233 7514 9236 2051 -11182 -15146
7417 -15146 -25278 -9936 8919 19710 33031 54356 29092 -18496 -31144 -12230 -47130 -54875
7405 -54875 -37943 -17597 23919 2363 -38814 13123 36535 30992 3803 -17812 -39640 -34855
7393 -34855 483 3601 -8800 -19824 -20910 -46325 -32648 -38918 -42726 -51207 -68418 -68056 -42481
7380 -42481 -12616 -9531 -9631 -3840 -14050 -13218 -8918 -12362 -4691 21004 33919 51816 53694 11214
7366 11214 -31736 -37105 -45468 -41408 -30478 -23272 -19690 16486 7332 -8735 7141 9675 3713
7353 3713 -14688 -22540 -22147 -18034 15266 32899 16010 -5778 -5600 2151 -21297 -19346 -32414 -33980
7339 -33980 -27675 -41065 -28121 1893 15046 -2483 -17254 -37356 -28361 12239 -5542 613
7327F13N666J957K3362J2116l8527l2768J966R783l9972p277J7311j4793O622
7314e3941L2878L8023L862J8595j2692k1449n311O096k1071Q940K4584j9949j9303
7301b0738r775P070L087K6605J8346Q497l7971q606J4642R818M494k689k4714
7288a1934j5812p490j7017l8673l710J8059L836K0643M907J9315L1873o369p957
7275a0329k5429j4395j2756J485k425J6050K7300J7580L6030Q287J1151l0841
7263B1708p587L1494J5463j7899q776j6063j7998p769p380N347K5737k9651l7779
7250e1153O598K5571M6440m825o999j033k737o143K0310K120j056j6768k3061
7237a2736j6229L974L3743j1167l8204j1811K1006l666O533j2229j878J223J1229
$$ plain form
7327 613 6279 8236 31598 43714 5187 -27581 -25615 -15832 -55804 -63081 -45770 -60563 -53941
7314 -53941 -21063 16960 20822 39417 26725 5276 -35 6061 -15010 -6070 18514 -1435 -20738
7301 -20738 -30513 -23443 -20356 6249 24595 33092 -4879 -13485 1157 10975 15469 12780 -11934
7288 -11934 -27746 -35236 -52253 -90926 -94636 -76577 -72741 -52098 -47191 -27876 3997 -2372 -10329
7275 -10329 -35758 -50153 -62909 -61424 -63849 -47799 -20499 -2919 33111 41398 52549 21708
7263 21708 14121 45615 61078 43179 34403 18340 342 -7427 -14807 -9460 16277 -13374 -51153
7250 -51153 -44555 -18984 27456 22631 15632 14599 11862 5719 26029 28149 27093 10325 -12736
7237 -12736 -28965 -24991 8752 -2415 -40619 -52430 -31424 -35090 -28557 -40786 -42664 -41441 -30212
7224c0212P150j5952k041J7010L241q623K0164J1041n744K6872J662J9689O327
7211E0584j2317j6710L0549J4054l4329l6870q693L049j0403J9191Q573J4244
7199B0922q720k7619o994j6250N48L4014L3023M670k6700n877J3299k384q835
7186C097m75K2305J7324r483r316j0472j3152J2550J5470j1121J2672L0229L721
7173F3349j3601k5316k5362j8824M722k3588q880K3743O240R456K0128J1610n825
7160A7852k1150o900J7434j2938P42j9430j0335J2345J3978p321J6617L5915J8210
7147E5019k7433k3134K0314j6364l1943j2844J1661M846J3094M476r02l535k2927
7134b9672L036j830J7535j9653k009J4523L3942r360k9561J6259J7047j9142j9609
$$ plain form
7224 -30212 -23062 -39014 -41055 -24045 -20804 -29427 -9263 1778 -3966 22906 24568 44257 50584
7211 50584 38267 21557 52106 66160 31831 -5039 -13732 -10683 -21086 -1895 6678 20922
7199 20922 12202 -15417 -22411 -38661 -38113 -4099 28924 33594 6894 1017 14316 11932 3097
7186 3097 2622 24927 42251 32768 23452 12980 -172 12378 27848 16727 29399 59628 63349
7173 63349 49748 24432 -930 -19754 -15032 -38620 -47500 -23757 -17517 -8061 12067 23677 17852
7160 17852 -3298 -10198 7236 -5702 -4960 -24390 -34725 -22380 -8402 -15723 894 36809 55019
7147 55019 27586 4452 24766 8402 -23541 -36385 -24724 -19878 -6784 -2308 -3210 -6745 -29672
7134 -29672 -26636 -28466 -10931 -30584 -32593 -18070 15872 6512 -23049 -6790 10257 -8885 -28494
7121b8494K1450L0969R015l8746M92L126k6616j6348P611M7307P891n244J891
7108A4304M852J3108K975l6663j3966m2068o107J6636L3514o488k2453J5599L0473
7095C716J7146O102Q365K2715N208k096l3652l8409q48n064P237J5315n008k2789
7081b2062k6834p370J1397m897j3258P739K3385k523K3100L7830j2890N99j110
7068A3106K3312Q128l872k3273p893k240K4391M418k8073K196J7298J303M523
7055C3324K1026N406o123k3432k2578m058o413m125q162J3577j9889K4287n627
7042b787l2342J26K3783N828j5898o577k6801j5176l883L1097K4420Q692j5068
7029b4586K6481J863J2747J162n788k8634l1725p058K8938J9327N318O310j9569
$$ plain form
7121 -28494 -7044 23925 32940 -5806 -5314 -2188 -28804 -45152 -37541 9766 17657 12413 14304
7108 14304 19156 32264 35239 -1424 -15390 -57458 -63565 -46929 -13415 -19903 -42356 -26757 3716
7095 3716 20862 26964 35329 58044 63252 61156 27504 -10905 -11753 -16817 -9580 5735 727 -22062
7081 -22062 -48896 -56266 -44869 -49766 -63024 -55285 -31900 -34423 -11323 26507 13617 14216 13106
7068 13106 36418 44546 40674 17401 9508 7268 31659 36077 8004 10200 27498 28801 33324
7055 33324 54350 59756 53633 30201 7623 3565 -2848 -6973 -15135 -1558 -21447 2840 -2787
7042 -2787 -35129 -35003 -11220 -5392 -21290 -27867 -54668 -69844 -73727 -42630 -18210 -9518 -24586
7029 -24586 1895 3758 16505 17667 11879 -16755 -48480 -55538 -26600 -7273 -1955 4355 -15214
7016a5214L90J9411r750k2527j4432R590M555M6q862J6874J8042J6661M209j1463
7002G530K6682N3583r604m3735n2206m829M9572P512j8447j6460K5238J3079j0665
6989B7250j8535j1366j0445o161J1928J6585j4431K129J5248j0687j2747P341
6977c891r446k517l684j7896J1623R971J7938J9968L487n458j4885O277P458k6393
6963g448J8298J6546j7920J5775J2429k0018l7583R369k32K020q831j8759K4164
6950a2190K5168j7354Q284Q709j5515j3521o600L273R648J0472K3334n981k673
6937A5054l2680k2758J1543k20L2550M530j3310J2125J7332k743M106M461j3165
6924A6825k3169j5099J088r75K4776j278j3789J7032k1556l6005J0977L1372K133
$$ plain form
7016 -15214 -14824 4587 -5163 -27690 -42122 -32532 -27977 -27931 -36793 -19919 -1877 14784 18993 7530
7002 7530 34212 87795 78191 34456 -17750 -22579 26993 34505 16058 -402 24836 37915 27250
6989 27250 8715 -2651 -13096 -19257 -7329 9256 -5175 -3046 12202 1515 -11232 -3891
6977 -3891 -13337 -15854 -19538 -37434 -25811 -15840 2098 22066 25553 20095 5210 11487 18945 -7448
6963 -7448 10850 27396 9476 25251 37680 17662 -19921 -10552 -10784 -8764 -17595 -36354 -12190
6950 -12190 12978 -4376 3908 12617 -2898 -16419 -23019 -19746 -10098 374 23708 17727 15054
6937 15054 -17626 -40384 -28841 -29061 3489 8019 -5291 6834 24166 21423 25529 29990 16825
6924 16825 -6344 -21443 -20355 -21330 3446 2168 -11621 5411 -16145 -52150 -41173 -9801 -7668
6911g668N882L4800j2259p957r799J1355Q359m185l583P519R344k1504m759J7194
6897B2739k9336k5975m423j852J5401L5677L5495J0729M740l2736r180j2264j2822
6884c807P716n555o165O055q708l577j7698j6222Q292J7818l0796J2369K8103
6871a2175L176r970j9300k0263M812p422K5146J4655L504K3619J1845j7738k43
6858c54k677o613j2969r032j3368J3830L5994O371J389o766k0761J0749J800l288
6844e695J5161L095k5273j7780J2419n716n69J7793J2774K2268J5711l1743P139
6831A9584k7037q719K0941N955l408j2349J9327N11k5381K787L2532K1184K182
6818D8109l9341k2304p831n311L7613L9524p424r255j3704j4764Q69k4829j0335
$$ plain form
6911 -7668 -1786 33014 20755 12798 2999 14354 22713 18528 14945 22464 31808 10304 5545 22739
6897 22739 -6597 -32572 -36995 -38847 -23446 12231 47726 58455 63195 30459 21279 9015 -3807
6884 -3807 3909 -1646 -7811 -1756 -10464 -14041 -31739 -47961 -39669 -21851 -52647 -40278 -12175
6871 -12175 -8999 -18969 -38269 -58532 -53720 -61142 -35996 -21341 -17837 5782 17627 -111 -354
6858 -354 -3031 -9644 -22613 -31645 -45013 -31183 4811 11182 12571 5805 -14956 -4207 -2407 -5695
6844 -5695 9466 12561 -12712 -30492 -18073 -23789 -24358 -6565 6209 28477 44188 12445 19584
6831 19584 -7453 -16172 4769 10724 7316 -5033 14294 14805 -10576 -7789 24743 45927 48109
6818 48109 8768 -13536 -21367 -26678 10935 50459 43035 33780 20076 5312 6181 -18648 -28983
6805b8983Q892P159o864j830L49L2060J0508J5817l0149k2321j0217J8438q603
6792a5744j7530Q734J1587Q491R771L887M20R017l167J2661j1339q475J9168J301
6778B8782J7994k3235k4092K0016j2322j031J2976k5188O485N494j4326O44j3067
6765b0870J2097J7914K720j500J4853q412O511K4154j1155r296k1810k6923j9370
6752d1087L4022j576J3197j4097r718k0259J7451L6893j3254n398J2492M0756
6740D9422K4205l2425k7567l3350O482J1168N34J0584J1635O38R307K145k1934
6727A0844l4056o359K7759L765j2669J745j0817O564K5387J8881l56m776j8029
6714G883j6241j6829J687K7614j9154L720J9022L325m717l783L049n202j7897
$$ plain form
6805 -28983 -20091 -12932 -19796 -21626 -21277 10783 21291 37108 6959 -15362 -25579 -7141 -15744
6792 -15744 -33274 -24540 -12953 -4462 5309 9196 9616 18633 15466 28127 16788 8313 27481 28782
6778 28782 46776 23541 -551 19465 7143 6112 19088 -6100 385 5879 -8447 -7803 -20870
6765 -20870 -8773 9141 11861 10361 25214 16802 23313 47467 36312 27016 5206 -21717 -41087
6752 -41087 -7065 -8641 4556 -9541 -19259 -39518 -22067 14826 1572 -3826 8666 49422
6740 49422 73627 41202 13635 -19715 -13233 -2065 -1531 9053 20688 21326 30633 32778 10844
6727 10844 -23212 -29571 -1812 1953 -10716 -8971 -19788 -13224 12163 31044 30688 25912 7883
6714 7883 -8358 -25187 -23500 4114 -15040 -11320 7702 11027 6310 2527 5576 374 -17523
6701a7523n737J1266j9501J8135j0591l3388J03o288R945n914k38L3586K8085
6688A940J521K587J6378M38O888K0075K3654O33l1652j6365J966P575r883j1695
6674A4060o430k993K2633J0473p123l2002q924n338m604j295k1112l243J8262
6661b7636p586j2713J4213M5683L997r240M969j7173N548j0570j32J4098J82J6204
6647A9844j9501j9841k5475J6118K5760l069J7807J8708k3576k3601M7403K964
6635C3541m1378K3315J9577m346j1041P63l3473k0283K3465J7494l569r312j1177
6622a6424j4797j4787K2614K280J8010L3158j0930o243J303K4928J3862n606l0284
6609A7084O720j6014m1353R583K220K2594j3030j654L8315j4475l368J7919J1389
$$ plain form
6701 -17523 -23260 -11994 -31495 -13360 -23951 -57339 -57236 -63524 -53579 -59493 -59731 -26145 1940
6688 1940 3461 6048 22426 22864 29752 49827 73481 74114 42462 26097 28063 35638 25755 14060
6674 14060 7630 4637 27270 37743 30620 -1382 -10306 -15644 -20248 -21543 -42655 -45898 -27636
6661 -27636 -35222 -47935 -33722 11961 15958 6718 11687 -5486 62 -10508 -10640 3458 3640 19844
6647 19844 343 -19498 -44973 -28855 -3095 -6164 11643 30351 6775 -16826 30577 33541
6635 33541 -7837 15478 35055 30709 19668 20431 -13042 -33325 -9860 7634 4065 -5247 -16424
6622 -16424 -31221 -46008 -23394 -21114 -3104 30054 19124 12881 14184 39112 52974 47368 17084
6609 17084 23804 7790 -33563 -23980 -21760 834 -12196 -13850 24465 9990 6622 24541 35930
6596C5930k2739m0507LL1004K1209J2591j0565J3983o646l804k9605k2900j2641
6583c4687n788J154J1946L1568J4839m766k1782K3708M859K0935K06j8495k3869
6570a72K08O500j6272r058J4102n888N680O030j6507l1126O614M9320J6093l6703
6556a1179l976l225M895r06m524o929J9442K5336K7576j1546l4321l1901L558
6543b7700J227o378M309J3584L4520J9696n533k9726J9421L2932N236k9696l1626
6530B66j3821L8917l32J738L834R806j705m6250m759K1904o63k3066r634M702
6516a9063J2497J9636R642L913j9084k3372r185J3255K8952o616k2289P735j0279
6503a4258J5171o868j0661J7174J724k8101M2300N321J2304m639O647M890l7791
$$ plain form
6596 35930 13191 -27316 -27313 3691 24900 37491 26926 40909 34263 30459 854 -22046 -34687
6583 -34687 -40475 -39321 -27375 4193 19032 14266 -7516 16192 21051 41986 42192 23697 -172
6570 -172 36 6536 -9736 -18794 -4692 -10580 -4900 1130 -15377 -46503 -39889 9431 25524 -11179
6556 -11179 -15155 -18380 -13485 -14391 -18915 -25844 -6402 18934 46510 34964 643 -31258 -27700
6543 -27700 -26473 -32851 -28542 -14958 19562 39258 33725 3999 23420 56352 61588 31892 266
6530 266 -13555 25362 25030 26768 30602 40408 38703 -7547 -12306 9598 8935 -14131 -23765 -19063
6516 -19063 -6566 13070 22712 26625 7541 -15831 -25016 -11761 17191 10575 -11714 -3979 -14258
6503 -14258 913 -5955 -16616 558 2282 -25819 16481 21802 34106 29467 36114 41004 3213
6490C213j9556N914k866j6063K0086Q449O169r467M643J0069k1283R769P777k2213
6476a5359j5317K973L2866L6874p374o076P849l0800j4791j1728J0457K5050N199
6463A9823m2820j4441K1880K0645M170k643j0991j9395k5225J2661J5179r086
6451c0243J0404M335k026J0667O09j9184j4337J8147J6931J7276j3944k1113q687
6438c1165L4710J3306l389J8374k6185j641K2727j2430o091q52j6546j9053j5954
6425d4189J1061J3191K5931J3055p983J9562K963j2707K1688J8283j990j6316
6413D2549l6455k8489j548l6689J6118M4837L8193J6401K305K0686J7473l4596
6401F0785j8516p884j4206k7921j9680j156K2393K5840J0925O588J583J4967j0064
$$ plain form
6490 3213 -16343 -10429 -13295 -29358 -9272 -823 5346 -4121 522 10591 -10692 -923 6854 -15359
6476 -15359 -30676 -27703 5163 42037 34663 28587 36436 5636 -9155 -20883 -10426 14624 19823
6463 19823 -22997 -37438 -15558 5087 9257 6614 -4377 -23772 -48997 -36336 -21157 -30243
6451 -30243 -19839 -15504 -17530 -6863 -6254 -25438 -39775 -21628 -4697 12579 -1365 -22478 -31165
6438 -31165 3545 16851 13462 31836 5651 4010 26737 14307 8216 7364 -9182 -28235 -44189
6425 -44189 -33128 -19937 5994 19049 11066 30628 33591 20884 42572 60855 58865 42549
6413 42549 6094 -22395 -23943 -60632 -44514 323 38516 54917 57222 77908 95381 60785
6401 60785 42269 34385 20179 -7742 -27422 -28578 -6185 19655 30580 37168 38751 53718 43654
6388D3654k8179o939j4502k657M4225L7936k733q417n203j0996k9074m999J9070
6375C1186J0506K1948P63j8147j7013k6787j4982N981J5205k6614j8519J3842
6363b2631K1462J0415J5170q672l0632N421j6595J5452K5855k716k8955l1643
6351d8069J1983L1638J2224j4066l1186O787J7625k1389j5390K3835J9616J8626
6339A2234Q044R044l3137j6193K0686J3374k6133k2247J0659J5499P137j0557
6327a1590J9024N952J4030O182k740o109O531P04k0356J3976O421p016j9774n615
6313c80j151L5609J9617j7220n0357k8165q314K9066J3040N030o063k953j3096
6300b5337J2787n639M056K1197j3558k193l0793j0826L8282O475o122l166k1500
$$ plain form
6388 43654 15475 8536 -5966 -8623 35602 73538 70805 62388 57185 46189 17115 12116 31186
6375 31186 41692 63640 64403 46256 29243 2456 -12526 -6545 8660 -17954 -36473 -22631
6363 -22631 -1169 9246 24416 15744 -14888 -9467 -26062 -10610 15245 12529 -16426 -48069
6351 -48069 -36086 -4448 7776 -6290 -37476 -30689 -13064 -34453 -49843 -26008 -6392 12234
6339 12234 20278 29322 -3815 -20008 678 14052 -12081 -34328 -23669 -8170 -1033 -11590
6327 -11590 7434 13386 27416 33598 30858 24749 31280 31984 11628 25604 32025 25009 5235 -380
6313 -380 -1531 34078 53695 36475 -13882 -42047 -50361 -21295 -8255 -3225 -9288 -12241 -25337
6300 -25337 -12550 -18189 -14133 7064 -6494 -8687 -39480 -50306 -12024 -5549 -11671 -14837 -36337
6287c6337r78J4585K430J0984R146M621j0164N99K9791q802l5452Q066l5298P201
6273c9608j1078l7599L1765M4479j415j1455J8511P357l808L150L288k918J7456
6260A8125Q884k6304n744J2505j9571M750m520N836n430k181J9454J9917M362
6247C0083k7250l1919L492M0567L929l350Q986k251k3875j5436J5029Q581p779
6234a193Q490j0471j3305q291j7072J7025L4565R360k2612J2116L193O509j5330
6221B984j5874j5598L7870O847N941l4914p515K5147J7340J9626O160k3128k299
6208B2587n916j8089R834k1825q675j0242Q653m063J0816L2661K6352k3189k0134
6195a230L169r541q470K3593Q379k9257k2910J7983J5012N486J900q361J3631
$$ plain form
6287 -36337 -37315 -22730 -20300 -9316 -170 4451 -5713 -5114 24677 15875 -19577 -11511 -46809 -39608
6273 -39608 -50686 -88285 -56520 -12041 -13456 -24911 -6400 957 -2851 299 3587 669 18125
6260 18125 27009 705 -5039 7466 -12105 -7355 -11875 -6039 -11469 -13650 5804 25721 30083
6247 30083 2833 -29086 -25594 14973 18902 15552 24538 22287 -1588 -17024 -1995 6586 -1193
6234 -1193 7297 -3174 -16479 -24770 -41842 -24817 9748 19108 -3504 8612 11805 18314 2984
6221 2984 -12890 -28488 9382 16229 22170 -12744 -20259 4888 22228 41854 48014 24886 22587
6208 22587 16671 -1418 8416 -13409 -22084 -32326 -23673 -27736 -16920 15741 42093 18904 -1230
6195 -1230 1939 -7602 -16072 7521 15900 -13357 -36267 -18284 -3272 2214 4114 -4247 9384
6182I384j0879m796j6734p765N867r674J4494Q520k6947J5401K3171Q975j4236
6169e219K3432K008K240k0835m1413k146Q566P898K9996L2167K36k3794l8319
6156b5183p51N683p186k1181k379M4198K4960o908q096j0767J248j7357k0684
6143d4403L2524l781j9731J9118J6056r521O712P797q717P006K6635K4221l3036
6130B0880k0911K382k1090O388K4654m640P379k4732R389L3895J5400k0122j3818
6117A5054k490k108m186l533K0927j2079J0465p321k3800l9868j713K0714L79
6104b9559j3889k7335J532J0076L9366K0313q047k2084l3171J541K310K7193M488
6091b7266J005J1214K7079n713J2410J2265k4575j8474l760J3493J5758j2971
$$ plain form
6182 9384 -1495 -6291 -23025 -30790 -24923 -34597 -20103 -11583 -38530 -23129 42 9017 -5219
6169 -5219 18213 20221 22461 1626 -39787 -41933 -33367 -25469 4527 36694 36930 13136 -25183
6156 -25183 -25934 -20251 -27437 -48618 -50997 -6799 18161 11253 3157 -7610 -6362 -23719 -44403
6143 -44403 -11879 -15660 -35391 -16273 -217 -9738 -3026 4771 -3946 3060 29695 53916 20880
6130 20880 -31 2351 -18739 -12351 12303 7663 15042 -9690 -301 33594 48994 28872 15054
6117 15054 12564 10456 6270 2737 23664 11585 22050 14729 -9071 -48939 -50652 -29938 -29559
6104 -29559 -43448 -70783 -69251 -59175 -19809 504 -7543 -29627 -62798 -61257 -58947 -31754 -27266
6091 -27266 -26261 -15047 12032 6319 18729 30994 6419 -12055 -15815 -2322 13436 465
6079D65l8919q326K4152K146J8652k6858k7006L391K0177J0589J448J6025M045
6066a9k691j633N479m633r39O074K490l3651q405o830j1656J676N957J2858J3096
6051b2827L3298j5126l0892M58M0177L1547k2240q868p947L251J8106k6519j6945
6038b4527j7142N628k341J3265o0q251k1061K7067N2968J0099l5461k7606p790
6025c5212M8441M3240k2469l4177p809J5691q999l5822P060n391K396o178n561
6012d4790q189p419J2536K6613J2344Q142m850k0917n973L4404k590j5895P395
5999i189M763j2346q481J7111j1635m611L602j6465K0290N2253R167j0346J1513
5986D5626j3005m3513K259M122O278J4200J1750j6291K4149K345k9808j8938r924
$$ plain form
6079 465 -38454 -46780 -22628 -20482 -1830 -28688 -55694 -52303 -32126 -21537 -20089 -4064 -19
6066 -19 -2710 -4343 1136 -3497 -4436 1638 4128 -29523 -37928 -44758 -56414 -54738 -48781 -35923 -22827
6051 -22827 10471 -4655 -35547 -35089 5088 36635 14395 5527 -2420 831 18937 -7582 -24527
6038 -24527 -41669 -36041 -38382 -25117 -25177 -33428 -54489 -27422 25546 35645 184 -27422 -35212
6025 -35212 13229 56469 34000 -177 -7986 7705 -1294 -37116 -30056 -35447 -33051 -39229 -44790
6012 -44790 -52979 -60398 -47862 -21249 -8905 -763 -5613 -26530 -32503 1901 -689 -16584 -9189
5999 -9189 -4426 -16772 -25253 -8142 -19777 -24388 -20786 -37251 -16961 35292 44459 34113 45626
5986 45626 32621 -10892 -8633 -4511 1767 15967 27717 11426 35575 37920 8112 -10826 -20750
5973b0750o320P134K5279n584n1944k013R51k1621K294K6395L391J5995k452J6027
5959a3218J5366J7997J692k7033m6687j4581o436J281M3866L2589j8278k0710
5947c4152J1626L3961J3323k0428m3467o266J4760J6268J6521Q848j1072J4051
5935A3973r471j575M318J03k4673J5160J4235J039K2707k7400Q173K3006r920
5922B9675k0193J7818R437m9119l2313J0886j2874j226r88j0302L260K2649L5375
5909B085J8801M000l773O740j4534n866j4165j2010J0038j3661k4110j29O484
5896d0100k602J3776k307o959k809q620J6982J1062K4514j58k4302P937j409j0015
5882b5010n238j19Q854k2976R472N698J0907L183J2727R235P07J7504K1343j0575
$$ plain form
5973 -20750 -27070 -19936 5343 -241 -52185 -54198 -53247 -74868 -72574 -46179 -42788 -26793 -29245 -13218
5959 -13218 2148 20145 21837 -5196 -51883 -66464 -72900 -71619 -27753 4836 -13442 -34152
5947 -34152 -22526 11435 24758 4330 -39137 -45403 -30643 -14375 2146 10994 -78 13973
5935 13973 4502 2927 7245 7348 -17325 -2165 12070 13109 35816 8416 16589 39595 29675
5922 29675 9482 27300 36737 -12382 -44695 -33809 -46683 -47909 -48897 -59199 -55939 -33290 2085
5909 2085 20886 24886 21113 27853 13319 7453 -6712 -18722 -8684 -22345 -46455 -46584 -40100
5896 -40100 -42702 -28926 -31233 -38192 -41001 -49621 -32639 -21577 2937 2779 -21523 -13586 -14995 -25010
5882 -25010 -30248 -30367 -21513 -44489 -35017 -29319 -18412 -15229 -2502 6733 7440 24944 46287 35712
5868C5712r659j2027J2782m372j4540Q682N499K436j8160o270m948L423J348j5697
5854a5791M79K327R086J5077l3205n969P166J4842J1299j2401q492q548J1207
5841a2923J5324J3445M363j3321R144K1512M32r482j1928K6006K0192k7854m0334
5828e424k573j2635M519J2429r24L76j1236l246k951R31q39m851L2095O064j2521
5813g86p987K2261K2814n328j0171k6077J2673J8654R055J1335j2112l2521K228
5800D038K168p991k9108j2291K5591K5588J0927L769J4877q226o021Q757k1279
5787A0799Q883K3000j442O830J2047m1335k2013Q178o265K7131p455l1284j3655
5774b6581K681K496K1050J2050j7899R571J4960n807j8794J3240K5508L387k1890
$$ plain form
5868 35712 26053 14026 26808 22436 7896 16578 22077 24513 6353 83 -4865 -1442 -94 -15791
5854 -15791 -15312 -12985 -3899 11178 -22027 -27996 -20830 -5988 5311 -7090 -15582 -24130 -12923
5841 -12923 2401 15846 20209 6888 16032 37544 37976 28494 16566 42572 62764 34910 -5424
5828 -5424 -7997 -20632 -16113 -3684 -4608 -4232 -15468 -18714 -21665 -20734 -21573 -26424 5671 11735 -786
5813 -786 -8773 13488 36302 30974 20803 -5274 7399 26053 35108 46443 34331 1810 4038
5800 4038 6206 -1785 -30893 -43184 -17593 7995 18922 22691 37568 29342 23321 32078 10799
5787 10799 19682 42682 41240 48070 60117 18782 -3231 4947 -1318 25813 18358 -12926 -26581
5774 -26581 -23900 -21404 -354 11696 -6203 3368 18328 12521 -6273 6967 32475 35862 13972
5761A3972j4161l808M245l991k4798k8331k398l243p605K0177K6096J7371J0655
5748D181o59R406J6223r21k3808n743L5031j015k8299k5017K741K9063l581q222
5734f20K2953J4640P222r851J0756M145l3475j2556P043N922N953J204J3681m4818
5720g801j7426J0147J5309p09q109M01q932j2554K3445q141k122q340j3666J5964
5706b2534O188k6307N188M1175M166j3139j4375j6877K5590L6647p488l1407r524
5693b2697n98L7254L296K1972k1247k0636J6468O661K3729k7806n016q152J5550
5680A8778j4038j0236J0711O252k063j1942j435k1821J7773j9733j2109K2356
5668a7507J7514r100j0165q418K6105Q485k4183q123J9816J844q523q823K433
$$ plain form
5761 13972 -189 -3997 248 -3743 -28541 -56872 -59270 -62513 -70118 -49941 -23845 -6474 4181
5748 4181 3522 12928 29151 28230 4422 -1321 33710 32695 4396 -20621 -17880 11183 7602 -620
5734 -620 22333 36973 44195 34344 45100 49245 15770 3214 10257 16179 22132 23336 37017 -7801
5720 -7801 -25227 -15080 229 -480 -8589 -8188 -17120 -29674 -6229 -14370 -16492 -24832 -38498 -22534
5706 -22534 -16346 -42653 -37465 3710 7876 -5263 -19638 -36515 -10925 25722 18234 -13173 -22697
5693 -22697 -23295 13959 17255 39227 17980 -2656 13812 20473 44202 16396 11380 3228 18778
5680 18778 4740 -5496 5215 11467 9404 -2538 -3973 -25794 -8021 -27754 -39863 -17507
5668 -17507 7 -9093 -19258 -27676 -1571 6914 -17269 -25392 -5576 -3732 -12255 -21078 -18645
5655a8645J3679k0915J0488L3611l332K5897n345k7204k1053k6028P629K0031
5643a1187m390l757l2566n875L2903l277k38J1500r151k8378k2151j0476J6487
5630g0556K8006L8276p350J8085j4975j5203J8178N418j3646q227P186k4862J7541
5617b2129L2066j0384m9278J628K4216k74L6807J7030L90k1661j8546O296k4475
5604b8314l3625M1800L1267K5243K527k3159j9919j8384m605k052J1497o462J584
5591b2602P206k231j3039K1916j8133j2079J6502Q291r371L986k213J0744K0567
5578I544l0122j4271k169j100L4180J1698J021K7361k3649M62o836k2470k510
5565a8861k647M730Q765K6703j8210k4578L1498p303j6592J0455p633j7506o063
$$ plain form
5655 -18645 -4966 -25881 -15393 18218 14886 40783 35438 8234 -12819 -38847 -31218 -11187
5643 -11187 -15577 -19334 -51900 -57775 -24872 -28149 -28387 -16887 -26038 -54416 -76567 -87043 -70556
5630 -70556 -42550 -4274 -11624 6461 -8514 -23717 -5539 -121 -13767 -21994 -14808 -39670 -22129
5617 -22129 9937 -447 -49725 -48097 -23881 -24155 12652 29682 30072 8411 -10135 -3839 -28314
5604 -28314 -61939 -20139 11128 36371 38898 15739 -4180 -22564 -27169 -29221 -17724 -24186 -22602
5591 -22602 -15396 -17627 -30666 -8750 -26883 -38962 -22460 -14169 -23540 -19554 -21767 -11023 9544
5578 9544 -20578 -34849 -37018 -38118 -3938 7760 8781 36142 12493 12955 6119 -16351 -18861
5565 -18861 -21508 -16778 -8013 18690 480 -24098 7400 97 -16495 -6040 -13673 -31179 -37242
5552c7242K3209M505K0373K2220j2722j4429k6214k7883J9459L7490J8534j119
5540B6181J1296p444J309j3334k6874k4906K7189J1612L6804j4157j0091K3696
5528D1281k1498q417J3083r186j361l7704l4660J9567J8295Q597Q968J7425J1288
5515B5678k2716J8366l5022l2387J5865O788j444L4j559J2109J5308J0235K7255
5502C8510L071m1391m5150k0426J2295K504N077J0664K1594M6443K2146j7550
5490C7787k267q649k6310j5183j6631J3122j9449l973j6363k917K5945n989K0287
5477b0590J796n285M660J474k6883j1633K4890J340n48j663K2680j0070J2680
5464g152j7210n769M526K7702l187k5907P621J0560P25o609r368P124L0176j775
$$ plain form
5552 -37242 -14033 -9528 10845 33065 20343 5914 -20300 -48183 -28724 8766 27300 26181
5540 26181 37477 30033 31342 18008 -8866 -33772 -6583 5029 41833 27676 17585 41281
5528 41281 19783 11366 24449 15263 13902 -23802 -58462 -38895 -20600 -12003 -3035 14390 25678
5515 25678 2962 21328 -13694 -46081 -30216 -23428 -24872 -24838 -26397 -14288 1020 11255 38510
5502 38510 41581 190 -44960 -65386 -53091 -50587 -45510 -34846 -13252 33191 55337 37787
5490 37787 35520 26871 561 -14622 -31253 -18131 -37580 -41553 -57916 -60833 -34888 -40877 -20590
5477 -20590 -18794 -24079 -19419 -17945 -44828 -56461 -31571 -30231 -30779 -32442 -9762 -19832 -7152
5464 -7152 -24362 -30131 -25605 2097 -1090 -26997 -19376 -8816 -8091 -14700 -24068 -16944 13232 11457
5450A1457m9504R759J1521j4983k2447K5268L6888j6530J665O848N465K1069Q735
5437C5211o246j4597l1362o004R339j1647l707P258J0143O213p16k3949j2670
5424d2734J5219M1114K0086l5452m3615k1109j5937j3068K6623K5974m837j084
5412d8820J4839K6661J6896K268K1197k2965k2220j592K0308K1721j6395r252
5400B646J023p525J2281M57J6681q078k5630J327N987j8006j2948n026L1996N1226
5386D6411l42j1182k4451q148K0308K1476R634j7078l7047R969j06j2937M6j873
5372e320J4373R787J252o324n582q365o817j9544r346m619M6188K2543r504j6100
5358B622m00o74J1638J1361o771l121J3213K05m99j2585k0793j9123j873K39p972
$$ plain form
5450 11457 -38047 -28288 -16767 -31750 -54197 -28929 7959 -8571 -6906 -58 5407 26476 35211
5437 35211 28965 14368 -16994 -22998 -13659 -25306 -29013 -21755 -11612 -5399 -6115 -30064 -42734
5424 -42734 -27515 13599 33685 -1767 -45382 -66491 -82428 -95496 -68873 -42899 -47736 -48820
5412 -48820 -33981 -7320 9576 11844 33041 10076 -12144 -13736 6572 28293 11898 2646
5400 2646 3669 -3856 8425 8882 25563 17485 -8145 -6818 -831 -18837 -31785 -36811 -4815 46411
5386 46411 46069 34887 10436 2288 22596 44072 53706 36628 -419 9550 9444 -3493 -3447 -5320
5372 -5320 9053 18840 20092 13768 8186 -179 -6996 -26540 -35886 -40505 5683 28226 18722 2622
5358 2622 2222 1548 13186 24547 17776 14655 27868 28073 27574 14989 -5804 -24927 -26800 -26561 -34533
5343c4533J982K980Q811J5027J1077K9518k0970J3742k4035k6910J4122R978p971
5330g182J6310J2508q08J155k0976k5389R789n877k1512K255J1989K9131L4066
5317C5459j2632n0471k8486K319L725K0654P071j2434j377N505M1641O024l753
5304A3245k2140j7713P205K7459j0521j8632K2900J0113n9k25R362j7767o112
5291b885n911k9757R349j6638k8780M802K7901K5840J5644Q324o518k0137n9595
5278g8361Q021L7198k755J1008M889r56j6329j089m529j2405M3805J6821K922
5265H240J7735L337j6274L209k1455j6157K6067J9407K332l890K749l4716j5852
5252b5268r433Q894L840j9320K763l641m589K5286K5094K3225J5024k9730k7701
$$ plain form
5343 -34533 -32551 -29571 -20760 -5733 5344 34862 13892 27634 3599 -23311 -9189 789 -7182
5330 -7182 9128 21636 20828 21983 1007 -24382 -14593 -20470 -41982 -39727 -27738 1393 35459
5317 35459 22827 -27644 -56130 -53811 -50086 -29432 -22361 -34795 -36172 -30667 10974 16998 13245
5304 13245 -8895 -26608 -19403 8056 -2465 -21097 1803 11916 11857 11632 20994 3227 -2885
5291 -2885 -8796 -38553 -29204 -45842 -74622 -69820 -41919 -16079 -435 7889 1371 -18766 -78361
5278 -78361 -70340 -33142 -35897 -24889 -20000 -20956 -37285 -38374 -42903 -55308 -11503 5318 8240
5265 8240 25975 29312 13038 16247 -5208 -21365 4702 24109 26441 22551 25300 -9416 -25268
5252 -25268 -34701 -25807 -21967 -41287 -38524 -42165 -46754 -21468 3626 26851 41875 12145 -15556
5239a5556J4658k297j873l869q306k1055r977n193M4K7775J5818q240p43J9956
5225A142l5035R139K7436k647r803L060j263q509N892o3L961M76j9012L5795J8554
5210B9123J6342J798l2199P466J6262j7281M302J8454J729l2618k5076j106K566
5197a0238Q68P771J6434p952o515o099j1096J547j4804J5302J326j2407l292J1492
5183a7663P187k4306J5908L2431P505L4599K1827j0467j9102l0071m392J4345
5171B7801k3133l6100J9118O68K581O074j5256q681L3441j407k663K764j0780
5158e573o056N116k077m099k8751r069N353j7272K3174J1608p608o020K5892l308
5144a8690K923k7066m143k723M1775J6333j2063k351j8659K9495J036j7587J5729
$$ plain form
5239 -15556 -898 -3195 -5068 -8937 -17243 -38298 -48275 -53468 -53424 -25649 -9831 -18071 -18814 1142
5225 1142 -33893 -24754 2682 35 -9768 -6708 -7971 -16480 -10588 -10651 -6690 -6214 -25226 10569 29123
5210 29123 45465 47263 15064 22530 38792 21511 25813 44267 45996 13378 -11698 -12804 -10238
5197 -10238 -9370 -1599 14835 6883 368 -5731 -16827 -15280 -30084 -14782 -13456 -25863 -29155 -17663
5183 -17663 -10476 -34782 -18874 13557 21062 55661 77488 67021 47919 17848 13456 27801
5171 27801 4668 -31432 -12314 -11646 -9065 -2991 -18247 -26928 6513 5106 2443 5207 -5573
5158 -5573 -11629 -6513 -8590 -12689 -41440 -50509 -45156 -62428 -39254 -27646 -35254 -41274 -15382 -18690
5144 -18690 -15767 -42833 -46976 -49699 -7924 8409 -3654 -6005 -24664 4831 5867 -11720 4009
5131D009q822j3003j758J0054q490K2816j6213k8648L926R2R656J7634L619Q97
5117d231j1145R734J4294K5124J1648N571k1602L666k6500k8053J0217j0516l6161
5104e7954N548J485J3653R841r851K3551L267M35j5277J5262n27J5773K4753k6898
5090C061n247J9111J3266p133j8075j0958K2509J2042j4490j7915o806r886J6220
5077d301L2780K138m0505j2879R347k0244k9578N316M0909J7458j3708j045l475
5064a7787j2883j4496J4541O590r148J3055K3030r891j4680k717J7957J9221K3339
5051C6131p459l296n0428j5369L63M4128O351j9888j8013M187O50j216M423R852
5037i584L132J5328J252m050j3603n170j6242o970j2380L876Q570k0283J6359
$$ plain form
5131 4009 -4813 -17816 -19574 -9520 -18010 4806 -11407 -40055 -36129 -36037 -26381 -8747 -5128 -4231
5117 -4231 -15376 -5642 8652 33776 45424 50995 29393 33059 6559 -21494 -11277 -21793 -57954
5104 -57954 -52406 -50921 -37268 -27427 -37278 -13727 -10460 -10025 -25302 -10040 -10567 5206 29959 3061
5090 3061 -2186 16925 30191 23058 4983 -5975 16534 28576 14086 -3829 -10635 -20521 -4301
5077 -4301 28479 30617 -9888 -22767 -13420 -33664 -63242 -57926 -17017 441 -13267 -14312 -17787
5064 -17787 -30670 -45166 -30625 -24035 -33183 -20128 2902 -6989 -21669 -24386 -6429 12792 36131
5051 36131 28672 25376 -25052 -40421 -40058 4070 10421 -9467 -27480 -23293 -22643 -23859 -19436 -9584
5037 -9584 -6452 8876 10128 6078 -7525 -12695 -28937 -35907 -48287 -44411 -35841 -56124 -39765
5024c9765p91J4609K775j1556k5170q074P706J2905L7794Q811l565o922K1272
5011A0029p035j2155L43J0467K6279j19k5504j5346j2273J1592J7170J6274k0799
4998a077L138L742k775K7460K8979j244m3182m6041k5480r803R016j695P656m156
4984e5462J2654M2117Q908k9081p541j5406J4974Q057J9229P366P040j0967O087
4971G975j0347K1619j3258k150l199q291J27O489M821j598l455j6265k9571J9454
4957b7649K0907J3168L4563j6066r551k203R368l563k0072J4283K6304j817j952
4944C5720j3006j4772q082m754j0179M980R573Q736O311r407L874K250p472o742
4930b970j5686J0930j4777k594J8229l019J3546j2958J9296J5385J3201q645j5170
$$ plain form
5024 -39765 -40556 -25947 -23172 -34728 -59898 -67972 -60266 -47361 -9567 -756 -4321 -11243 10029
5011 10029 2994 -9161 -8818 1649 27928 27809 2305 -13041 -25314 -13722 3448 19722 -1077
4998 -1077 2061 5803 3028 30488 59467 58223 15041 -31000 -56480 -66283 -57267 -58962 -51306 -55462
4984 -55462 -42808 -691 8217 -20864 -28405 -43811 -28837 -20780 -1551 5815 12855 1888 7975
4971 7975 -2372 19247 5989 3839 640 -7651 -7524 -1035 3786 2188 -1267 -17532 -47103 -27649
4957 -27649 -6742 6426 40989 24923 15372 13169 22537 18974 -1098 13185 39489 37672 35720
4944 35720 22714 7942 -140 -4894 -15073 -10093 -520 8216 14527 5120 8994 11244 3772 -2970
4930 -2970 -18656 -7726 -22503 -25097 -6868 -9887 3659 -9299 9997 25382 38583 29938 14768
4917A4768k5772k6880j25K8898J6324j5811j5508j848J8495K0032K7207j5165
4905B4615k0435j0068J8106J2219K0112j6075j7851N7549J0792m0575k4039m677
4893I673k0850l5155j8130L2547J5586j2805k1397J5450L7549J2567K364l860
4881A3539M272m505j123j4747l075J1559K7731Q541M554j7864j4753q295K6382
4868C2216L321k0759P295l2Q95m568J4495q635k1691j7974o929n807K2343L1832
4854B6002K9770J2115m5051k8067r76M427J1512J8832n279j2896n067L733j4707
4841e652m829Q411J9920J3195p794k9207P34j8492L260J9875j4207J2482j5728
4828a8032k2998m705J0470k1812O614K6577L495j2302J5826L8868K086k0005n5876
$$ plain form
4917 14768 -11004 -37884 -38009 -9111 7213 -8598 -24106 -25954 -7459 12573 39780 24615
4905 24615 4180 -5888 12218 24437 44549 28474 10623 68172 78964 38389 14350 9673
4893 9673 -11177 -46332 -64462 -31915 -16329 -29134 -50531 -35081 2468 15035 17399 13539
4881 13539 17811 13306 12183 -2564 -5639 5920 33651 42192 46746 28882 14129 5834 32216
4868 32216 35537 14778 22073 22041 22936 18368 32863 24228 2537 -15437 -22366 -28173 -5830 26002
4854 26002 55772 67887 22836 -5231 -6207 -1780 9732 28564 23285 10389 5322 9055 -5652
4841 -5652 -10481 -2070 17850 31045 23251 -5956 -5222 -23714 -20454 -579 -14786 -2304 -18032
4828 -18032 -41030 -45735 -35265 -57077 -50463 -23886 -20391 -32693 -16867 22001 24087 4082 -51794
4815e1794k717L3233M434j2015k1519K757M8103j012l0831k6186J1220L3846K7954
4802A5473j6353j0731j5803K2191j2845j365N21K5979J0523r937j3665K1092J0869
4789B5949j9902j0309J2385J8416j3427n1306L298K4229K7899r151k6021l0196
4777d8136J3025K1215R529P012k7689j8371J3696J9806p049q310J8891M742n547
4764g186L7216R273q876k2587J2328R82j6424j0448J825M644k9642j598O601j0156
4750c4048l2124J8135J1039L6513K8548j7222n103j8259j621P877L3314K646j8721
4737A0974K221j7492J4663j6981k9512J2560J4745M836P47p410J0488J1050j6195
4724e306o821k5405J5329K8998J3770l360M911L2062K093J4315j102j1858k6662
$$ plain form
4815 -51794 -54511 -21278 -16844 -28859 -50378 -47621 482 -530 -31361 -57547 -46327 -12481 15473
4802 15473 -880 -11611 -27414 -5223 -18068 -19433 -18912 7067 17590 7653 -6012 15080 25949
4789 25949 6047 -4262 8123 26539 13112 -38194 -34896 -10667 17232 8081 -17940 -48136
4777 -48136 -35111 -13896 -4367 2645 -25044 -43415 -29719 -9913 -16962 -25272 -6381 -1639 -7186
4764 -7186 30030 39303 30427 7840 20168 21150 4726 -5722 -3897 747 -28895 -30493 -23892 -34048
4750 -34048 -66172 -48037 -36998 -485 28063 10841 5738 -12521 -14142 -6265 27049 29695 10974
4737 10974 13195 -4297 10366 -6615 -36127 -23567 -8822 -3986 -3239 -10649 -161 10889 -5306
4724 -5306 -12127 -37532 -22203 6795 20565 17205 22116 54178 56271 70586 69484 57626 30964
4711C0964o384j5138M878m963l0201q311J5769R316M894k0642J253J4919K0318
4698A6672r901j3082L774L20p688j3355j0683J3663J6908p48o413J656k7471j1124
4684d7472r853M513K6339p129J2671J8690k9447Q171m831J4927K5335j511k1464
4671a1061j0526J6853L939l6507J6278M1183N758R522l0467j3103P863l1861K454
4658b9675M0273K0511p199k3740L078J4522J0957k9552m405J2430K6290J1037
4646D4527N42m5078O992r267j4109J4915m38R74j3675j341K8240K0241J068k9025
4632D566j7184M985l528M733j0791J4060J8234k2080n814m653J3274K8817j2285
4619A2334j6199o768L8700R765J4087j9750k5402k2225J7115m33J4986p056j4781
$$ plain form
4711 30964 24580 9442 14320 9357 -20844 -29155 -13386 -4070 824 -19818 -18565 -3646 16672
4698 16672 6771 -6311 -2537 -2217 -9905 -23260 -33943 -20280 -3372 -4120 -10533 -8877 -36348 -47472
4684 -47472 -57325 -52812 -26473 -33602 -20931 -2241 -31688 -23517 -28348 -13421 11914 10403 -11061
4671 -11061 -21587 -4734 -795 -37302 -21024 20159 25917 35439 4972 -8131 -268 -32129 -29675
4658 -29675 10598 31109 23910 170 3248 17770 28727 -825 -5230 7200 33490 44527
4646 44527 45069 -9 6983 -2284 -16393 -1478 -1916 -942 -14617 -15958 12282 32523 33591 4566
4632 4566 -12618 -7633 -11161 -6428 -17219 -3159 15075 -7005 -12819 -17472 -4198 24619 12334
4619 12334 -3865 -10633 28067 37832 51919 32169 6767 -15458 1657 1224 16210 9154 -5627
4606e627n024k3605l6869J8205M0086l4235j4251R238K1508N624o266P954j2655
4593c5917o012J4380L8715J0225n451J6785n527o585r426k2633j1628K9395L258
4580I579m7709L11L1370J751j4305K613k370k83K328L2072j5669k4109J5378J5890
4566F847q607m155j3202l91j4338K6994L5794j5514l9615j3155n866J6233L4856
4553E881P308j8413o309j1436k6458j1153K2900J4494j437k3693k229L9572R520
4540a453l105K1370q468k2157j196r011m802N262l834P011o06k424K3736o686
4526f363k0913J2007J5045j6317l1422j3234J8360K1370m995M6139n655j9169
4514e147j8323K8787L3951l8938l172R642R657j4400j3214r659m020K8362J5708
$$ plain form
4606 -5627 -10651 -34256 -71125 -52920 -12834 -47069 -61320 -52082 -30574 -24950 -31216 -23262 -35917
4593 -35917 -41929 -27549 11166 21391 15940 32725 27198 20613 11187 -11446 -23074 6321 9579
4580 9579 -38130 -37819 -6449 -4698 -19003 -16390 -18760 -19043 -16715 15357 -312 -24421 -9043 6847
4566 6847 -1760 -5915 -19117 -19508 -33846 -6852 28942 13428 -26187 -39342 -45208 -28975 5881
4553 5881 13189 -5224 -11533 -22969 -49427 -60580 -37680 -23186 -24623 -48316 -50545 -10973 -1453
4540 -1453 -4558 16812 8344 -13813 -15009 -24020 -28822 -23560 -27394 -20383 -20989 -23413 323 -6363
4526 -6363 -27276 -15269 -224 -16541 -47963 -61197 -42837 -21467 -26462 19677 14022 -5147
4514 -5147 -23470 5317 39268 330 -2842 6800 16457 2057 -11157 -20816 -24836 3526 19234
4501A9234k643j4221k7665M3368J6896J2750k8535m0728j7443J6240M188j4368
4489c2927n259O333L6936q512p869K7832j4251k8658K7315L2894L659L81N021
4476D2895m175k8390j2225Q37J1172r590r061k0003R803L6330m28J2817N753j2449
4462B3286l3257J0151M3310P145p491m979j9774j6310l9186k269J0217m158O35
4449c2680K4520J0714k0532j1687K3931K4965j1969j0380k2193N881J4793n057
4437i694j943J4771O574J8269k4382k0183n272J311J4083j389K9j7082j8433J8924
4423b4417K8758l799j0888j2712l6008j5516N5583Q836J214j290q908J1376K7381
4410A9610m222J0933k0769j1606L737k5214k1756R242k273j043j8277L0657M0417
$$ plain form
4501 19234 16591 2370 -25295 18073 34969 47719 19184 -21544 -38987 -22747 -18559 -32927
4489 -32927 -38186 -31853 5083 -3429 -11298 16534 2283 -26375 940 33834 37493 37874 42895
4476 42895 38720 10330 -1895 -1058 10114 524 -8537 -28540 -18737 17593 17165 29982 35735 23286
4462 23286 -9971 180 43490 50635 43144 38165 18391 2081 -37105 -39374 -29157 -33315 -32680
4449 -32680 -8160 2554 -17978 -29665 -5734 19231 7262 -3118 -25311 -19430 -4637 -9694
4437 -9694 -11637 3134 9708 27977 3595 -16588 -21860 -20549 -6466 -7855 -7826 -24908 -43341 -24417
4423 -24417 4341 542 -10346 -23058 -59066 -74582 -18999 -10163 -8949 -10239 -19147 -7771 19610
4410 19610 15388 26321 5552 -6054 -2317 -27531 -49287 -40045 -42318 -43361 -61638 -30981 9436
4397I436J0474k2520j1786J1980L2116l6565k943L855l855n915r839L049N55j3031
4383c4989M472K7880K8283o871k090m638j7679l3507q792J7757M4320J137l3173
4370a7890l929o155l371J1455J2215Q369k9317q586J7924K7714j868k6319k0288
4357d0046r388L3669J9288q608M142o765O292j0768L1372K387k2825N575l68l833
4343A24N676p087k2999j7235J8932J1488j5308L176l499L81K7450L1865p421k2541
4329C002l1892K058L7852j5833j3407j9157M502R417K1790r167k9800l200J1892
4316c1943K1669j203K7910j3493j3207J0880Q262p235J1746O432k9258j1078N337
4303a5181j4590j1240K046j0722J6513R469K0294R309R337K2049J459l2232l691
$$ plain form
4397 9436 19910 -2610 -14396 -2416 29700 -6865 -9808 -5953 -9808 -15723 -25562 -22513 -21958 -34989
4383 -34989 -30517 -2637 25646 18775 16685 12047 -5632 -39139 -47931 -30174 14146 15283 -17890
4370 -17890 -21819 -27974 -31345 -19890 -7675 694 -28623 -37209 -19285 8429 6561 -19758 -40046
4357 -40046 -49434 -15765 3523 -5085 -943 -7708 -1416 -12184 19188 21575 -1250 4325 3957 124
4343 124 5800 -1287 -24286 -41521 -22589 -11101 -26409 -23233 -26732 -26351 1099 32964 25543 3002
4329 3002 -28890 -26832 11020 -4813 -18220 -37377 -32875 -23458 -1668 -10835 -40635 -43835 -31943
4316 -31943 -10274 -11477 16433 2940 -10267 613 8875 1640 13386 19818 -9440 -20518 -15181
4303 -15181 -29771 -41011 -38965 -49687 -33174 -23705 -3411 5898 15235 37284 38743 6511 2820
4290B820j7356k4915l709L6343K5894j4157k8441j4015K0143K4504k3190k7052
4278d3131J2388J0329j3915K5395R921k6476o769M301j9445k4786K7626L7283
4266g279L6333l1783k5115O687k476j3664J1051J2334J0312J0463m407R397O329
4253A8182n349q889j532N430j2805j6512k6632J9222j6369k8061K1322K7262J7074
4240g657L0142J7188j1879j1059l2529l4511n480K6842P705l895j4668m979j069
4227d5849K0889M831K1943M8875J8899j2546j4707j8315k0276k8871j5423j7665
4215e8215k727Q360K3492J7918J3696M6255K4263j9461R067o963l8428k249J332
4202A6340n100L338j1798M779K873k2091j2411j3099P153K8265q441R730j6546
$$ plain form
4290 2820 -14536 -39451 -43160 -6817 19077 4920 -23521 -37536 -17393 7111 -16079 -43131
4278 -43131 -30743 -20414 -34329 -8934 987 -25489 -32258 -27957 -47402 -72188 -44562 -7279
4266 -7279 29054 -2729 -27844 -21157 -23633 -37297 -26246 -13912 -3600 6863 2456 11853 18182
4253 18182 12833 3944 2412 7842 -4963 -21475 -48107 -28885 -45254 -73315 -51993 -24731 -7657
4240 -7657 22485 39673 27794 16735 -15794 -50305 -55785 -28943 -21238 -25133 -39801 -44780 -45849
4227 -45849 -24960 -20129 1814 50689 69588 57042 42335 24020 3744 -25127 -40550 -58215
4215 -58215 -60942 -52582 -29090 -11172 2524 48779 73042 53581 62648 55685 17257 15008 16340
4202 16340 11240 14578 2780 7559 10432 -11659 -24070 -37169 -30016 -1751 -10192 -462 -17008
4189a7008l721R416J097o530m832n17O29j3334l364P102L90j0083K269J6772K2033
4174C19R785r59l3703O689J4315l780n851L487J7316n485j2125q040q425J161
4160b5296M3676k9178j4743J7013J2071M3407J0734m9936k2514m490K9459k5176
4148a4973p077K5923j2424l540k000q751M385J9725l6935n6735q93L6722M1210
4135a5363N921J2098K8444k1339o588N150j8619j1167N550K9207q250k8199J390
4122b1765k260k821M7652J3074j3057o052L0002K4772l6981l9911r891q733M071
4109b1900K5858j763o507J5544K4530j1818j110K4466L085K0575O143l3356r635
4096C4112l5667k3189Q096J0639o479q393J37K1299K8048m035l1639j3176l395
$$ plain form
4189 -17008 -20729 -11313 -10216 -16746 -21578 -22095 -21466 -34800 -38164 -31062 -30672 -40755 -38486 -21714 319
4174 319 10104 9145 -24558 -17869 -3554 -7334 -13185 -9698 7618 2133 -9992 -18032 -26457 -25296
4160 -25296 18380 -10798 -25541 -8528 3543 46950 57684 7748 -14766 -19256 10203 -14973
4148 -14973 -22050 3873 -8551 -12091 -14091 -22842 -18457 1268 -35667 -92402 -93295 -56573 -15363
4135 -15363 -9442 2656 31100 9761 3173 8323 -10296 -21463 -15913 13294 5044 -23155 -21765
4122 -21765 -24025 -26846 20806 33880 20823 14771 44773 69545 32564 -7347 -17238 -25971 -21900
4109 -21900 3958 2195 -4312 11232 35762 23944 22834 47300 50385 70960 77103 43747 34112
4096 34112 -1555 -24744 -16648 -6009 -12488 -20881 -20744 555 28603 24568 -7071 -20247 -23642
4083b3642L2296O646k1434j4748p797M0725J648l0679l834J1455q482j1035M420
4070b4461J4406J0571m668o23K325j8174K5754K1788l8788k1073L256P383J4441
4057g863J6348J021j6097j5401J9060k973K089k536K0046J8814n432j2546k525
4044A2005k0013q331n791Q183j1895k4066Q450M1741O561J69L634l7562j7382
4031d4297J0680L4475J4251R815j3849m391Q771L179N774N127j624k2130k6392
4018b0611k2890j0118R361P382K492J8671L3971j6569k825M828k7913k0652j8111
4005f2984L4607N5826q158j0604O002q322l1622M693K6592p811k6280R233K0758
3992A930p746J782J8344j7621J4062J6988k7950l8196j8960J1078L8907Q496k1798
$$ plain form
4083 -23642 8654 15300 -6134 -20882 -28679 12046 13694 -16985 -20819 -9364 -17846 -28881 -24461
4070 -24461 -10055 516 -4152 -4775 -2450 -20624 5130 26918 -11870 -32943 -29687 -22304 -7863
4057 -7863 8485 9506 -6591 -21992 -2932 -5905 -3816 -6352 13694 32508 27076 14530 12005
4044 12005 -8008 -16339 -22130 -13947 -25842 -49908 -41458 283 6844 7013 10647 -26915 -44297
4031 -44297 -33617 858 15109 24924 11075 6684 15455 18634 24408 29535 27911 5781 -20611
4018 -20611 -43501 -53619 -44258 -36876 -34384 -15713 18258 1689 -1136 3692 -24221 -44873 -62984
4005 -62984 -28377 27449 19291 8687 14689 6367 -25255 -20562 6030 -1781 -28061 -18828 1930
3992 1930 -5816 -4034 14310 -3311 10751 27739 -211 -38407 -57367 -46289 -7382 1114 -20684
3979b0684J3440K4512k6693O446j8760j2363K5845k3321j6248J1142j5634J0614
3967d1704J5866l70M159L5402P435k0394K1576J9117k6416j5407K1668J4906J1852
3954D7690k2836j064j1479J272J3088J3723O315k869l582l034k3431k9911k3899
3941d0017K6488J6392j1126K2693K312k3386K0999M613j4167J373m555l5560q342
3928d2283k9600j5073M7603L5899r622n020J0922m869l4619r119J1757N0031K4596
3915C0603m2654q56l534J2010M031M159j672l651k866J2196O162j21o041q094
3901c28l3788K894K2637M0904J8979j8517k8406O869o001j9926N677j701m0171
3888e0878J9771K351R92k2681N9529K923k7076K59n953R828N59r637k2292k6886
$$ plain form
3979 -20684 -7244 17268 -9425 -2979 -21739 -34102 -8257 -31578 -47826 -36684 -52318 -41704
3967 -41704 -25838 -26208 -22049 13353 20788 394 21970 41087 14671 -736 20932 35838 47690
3954 47690 24854 23790 12311 13583 26671 40394 46709 43840 40258 37224 13793 -16118 -40017
3941 -40017 -13529 2863 -8263 14430 16742 -6644 14355 18968 4801 6174 1619 -33941 -42283
3928 -42283 -71883 -86956 -39353 -3454 -13076 -18096 -7174 -12043 -46662 -55781 -44024 6007 30603
3915 30603 -12051 -12907 -16441 -4431 -400 3759 2087 -1564 -4430 7766 13928 13807 7766 -328
3901 -328 -34116 -31222 -8585 32319 51298 32781 4375 11244 5243 -14683 -9006 -10707 -50878
3888 -50878 -31107 -28756 -27764 -50445 9084 12007 -15069 -14810 -20763 -10935 -10376 -20013 -42305 -69191
3874f9191L223L3576K7290J9090K8715J2906j6162l4610L778L7966J6061l274
3862E9368m4876j8737l0855o156l917k1643M217K5885j1357N641J0394R822n697
3849b7911j1568L7147K7395Q759k6927n4663k0757j5805Q462L4289R334R247o976
3836b9974j2353p243J9431L4921P794l5745m3320K3098M6047L2314o351l4320
3824e701k0946k1698k861J3640K2821L6161j0194l4884j5J1902J4245K1539m18
3811B3591k3626j1767J0271J4588Q555K1177J0803k2659l9495p47l789q474j1484
3798c3056M233M810o438L6693p552k050j6407L4279k834p746K2263R095j2354
3785B2936j8128l7456j6036K7716L5923n910m633m750j0948K049R689j2884j6835
$$ plain form
3874 -69191 -65968 -32392 -5102 13988 42703 55609 39447 4837 8615 46581 62642 59368
3862 59368 14492 -4245 -35100 -41256 -45173 -66816 -62599 -36714 -48071 -42430 -32036 -22214 -27911
3849 -27911 -39479 -2332 25063 33822 6895 -47768 -68525 -84330 -75868 -41579 -32245 -22998 -29974
3836 -29974 -42327 -49570 -30139 4782 12576 -23169 -66489 -43391 2656 34970 28619 -5701
3824 -5701 -26647 -48345 -51206 -37566 -14745 21416 11222 -23662 -23677 -11775 2470 24009 23591
3811 23591 -35 -11802 -1531 13057 21612 42789 53592 30933 -8562 -9309 -13098 -21572 -33056
3798 -33056 -28823 -24013 -30451 6242 -1310 -3360 -19767 14512 11678 3932 26195 35290 22936
3785 22936 4808 -32648 -48684 -20968 14955 9045 4412 -338 -11286 -9237 452 -12432 -29267
3772b9267J0646K3044P403N72p01k7209o172R102k1863K8277q080L646K0746J111
3758A1255j505r776j6672J2684O441r11K2502k8377j875r574j9862K2560K0122
3745G012M549j7745J5134j1454k49j97r934P157K0824r988n583j17n848m648M304
3730f783K1315K8469k977j327n141j5382k0117j4482j3524j9482J6612O994l343
3717b9168j0216n754n79j1320N742Q01L9265K6688j3870m6509k2068J3910O030
3704d7048J0674K4825J1141J375J6954j256m162p244j1664k6594R675L1555j6016
3691g785k1442k6781m363J7311L5823K8063L604j8530q366j8114K323L4616J3180
3678B9539l3320J7384o317m3286p841L0707j1219J2471k028M3108J1770L762m014
$$ plain form
3772 -29267 -18621 4423 11826 12398 11697 -15512 -21684 -12582 -34445 -6168 -14248 -10602 10144 11255
3758 11255 9750 -26 -16698 -4014 2427 1516 24018 -4359 -6234 -15808 -35670 -13110 7012
3745 7012 11561 -6184 8950 -2504 -2753 -2950 -12884 -5727 15097 5109 -474 -591 -6439 -11087 -6783
3730 -6783 14532 43001 40024 38697 33556 18174 -1943 -16425 -29949 -49431 -32819 -25825 -29168
3717 -29168 -39384 -45138 -45717 -57037 -51295 -50494 -11229 15459 1589 -44920 -66988 -53078 -47048
3704 -47048 -36374 -11549 -408 967 17921 16665 12503 5259 -6405 -32999 -23324 8231 -7785
3691 -7785 -29227 -56008 -60371 -43060 -7237 20826 24430 5900 -2466 -20580 -18257 16359 29539
3678 29539 -3781 13603 7286 -36000 -43841 -13134 -24353 -11882 -13910 29198 40968 44730 40716
3665D0716k5551P079k758J528R77l8529O104L0607l5840k8683J5605J9165o49
3652a0229j744j2147K444j672K8719l30l3506K3034M696o771k5364j0406j268
3639d4544m227M044O689J6304j4238J1578p74j0606M379Q449K6209R856L6629
3626D9748j059k1474J8370K6160o684l6021k0917j4028j83K847k625K2610n058
3613A1686j9722j1390l592R570J6562k9148K8441K9410J2301j4377k2610l2722
3601b5591P682L232j1554j274K738P753k580P923j3608k3022r14K2363p102J5737
3587a8217j1352j2004J8866K4308m849l487J9806P82j3026j873J7507k5549q522
3574a7610J2015K2041K3436l514j6555k0281j889N360q622l2368k1892J5445J0726
$$ plain form
3665 40716 15165 22244 19486 21014 21991 -16538 -10434 20173 -15667 -44350 -28745 -9580 -10229
3652 -10229 -11973 -24120 -21676 -23348 5371 5041 -28465 -5431 -735 -7506 -32870 -43276 -44544
3639 -44544 -48771 -44727 -38038 -21734 -35972 -24394 -25168 -35774 -31395 -22946 3263 13119 49748
3626 49748 48689 27215 45585 71745 65061 29040 8123 -5905 -6088 -3241 -5866 16744 11686
3613 11686 -8036 -19426 -23018 -13448 3114 -26034 2407 31817 44118 29741 7131 -25591
3601 -25591 -17909 -14677 -26231 -27505 -24767 -17014 -19594 -11671 -25279 -48301 -49215 -26852 -33954 -18217
3587 -18217 -29569 -41573 -22707 1601 -3248 -6735 13071 13853 827 -1046 16461 -9088 -17610
3574 -17610 -5595 16446 39882 36368 19813 -468 -2357 3003 -5619 -37987 -59879 -44434 -33708
3561c3708O502r378K2026K5378j958L7303j0328l987k9557j3457J8503k00o286
3548H53j4839j7267J1052J3322k372l0494l7313K8598N648l664n402J4520J7072
3535b0286K3373J4017m4768r135K3757M5513k2556m4876j666k51P566J7688o890
3522a8514q916J2545J1369K6639J0512k6257P239J49J2617k5108m385K5709O68
3509B4267j3080l0625j0314J439m757q69K7276K5905l2403k3050J7319j1251J365
3496b8778o666l658O355q470P873M9131j1209K6851j8148k5622L808Q77q936j9591
3482c6183K439O97K6546J0400j4783k4345K9097P529J0443J3003j5451j8059l1813
3469d0480Q377J1016o748J4354J7977J676J8786j9654k2690K723k404j3992J2556
$$ plain form
3561 -33708 -27206 -36584 -14558 10820 8862 46165 35837 31850 2293 -11164 7339 7139 853
3548 853 -13986 -31253 -20201 -6879 -9251 -39745 -77058 -48460 -42812 -46476 -51878 -37358 -20286
3535 -20286 3087 17104 -27664 -36799 -13042 32471 9915 -34961 -36627 -36878 -29312 -11624 -18514
3522 -18514 -27430 -14885 -3516 23123 33635 7378 14617 14766 27383 2275 -2110 23599 24267
3509 24267 11187 -19438 -29752 -28313 -33070 -33939 -6663 19242 -13161 -36211 -18892 -30143 -28778
3496 -28778 -35444 -39102 -32747 -41217 -33344 15787 4578 31429 13281 -12341 -8533 -7656 -16592 -36183
3482 -36183 -33744 -33047 -6501 3899 -10884 -35229 -6132 1397 11840 24843 9392 -8667 -40480
3469 -40480 -32103 -21087 -27835 -13481 4496 6172 24958 5304 -17386 -14663 -17067 -31059 -18503
3456a8503K1616L5159q900J4789N128j1357j4895n374j6996j26K244L6169o071
3443C2883l975q923l942l0335k4229M818r850J9821P992j7064j351K3718k468
3430a2905k5099r422M0660J5926j2884k887r465k6792M6165L3543l2827l5264
3418c1251k7853J7328L6317J5441J1029K2631M0906R278l8833j2178k8551m2361
3406b8097j6804M2504J863o48j6877J4370J5018m031N068o775K5393l9213q002
3393a6231L0704J2075J686j6270l08r920k6559j248K4066l285k644R702J7121
3380A8889j3912k0675o138J2407Q5J3498j2441k6223L2843K048k37P596k8104
3367b0364j0213N881L0254K9385N83k7536l916K031k4745j2410J4044Q530K2165
$$ plain form
3456 -18503 3113 38272 29372 44161 49289 37932 23037 17663 667 541 2785 38954 32883
3443 32883 28908 19985 16043 -14292 -38521 -33703 -43553 -23732 -15740 -32804 -34155 -10437 -12905
3430 -12905 -38004 -47426 -6766 9160 -3724 -6611 -16076 -42868 3297 36840 4013 -31251
3418 -31251 -59104 -41776 -5459 9982 21011 43642 84548 93826 54993 42815 14264 -28097
3406 -28097 -44901 -2397 -534 -1182 -18059 -3689 11329 7298 12366 5591 30984 -8229 -16231
3393 -16231 14473 26548 28234 11964 11656 1736 -24823 -26071 -2005 -5290 -7934 1768 18889
3380 18889 4977 -15698 -21836 -9429 -9344 4154 -8287 -34510 -1667 381 144 7740 -20364
3367 -20364 -30577 -24696 5558 34943 35526 7990 4074 6105 -18640 -31050 -17006 -8476 13689
3354A3689j5214l1164J3613M224k1385O32J7944k8418J8730N3629K4878l431j2518
3341C5209k6993l152K0135J6237j9563q088J3579m313k8590J588K125k8141n222
3328c5189O605J5231L8335j7451p431k1621P43L6803o164l337P954m0813Q871
3315a7464j9503r831L7346K8418j7923k4395j6151J0452K5615K6292N364k2917
3303E303k8484k7660K5514L8513R768l169M582j7162p240r833J288J6814P2k6431
3289a8125j3535K7302Q382N509m348l3121J1865K1547K337K0800p72j9751k6649
3276a8559J1544q483J4439K3294j1677k1758k2282j1240J6902j1344J8513L0736
3264A0085j3167j6611J6629N790k7572n302j7017j1572J5949L0401P818J672J3187
$$ plain form
3354 13689 -1525 -32689 -19076 -14852 -36237 -35605 -17661 -46079 -27349 26280 51158 47727 35209
3341 35209 8216 5064 25199 41436 21873 13785 27364 23051 -5539 -3951 -1826 -29967 -35189
3328 -35189 -28584 -13353 24982 7531 100 -21521 -20778 16025 9861 6524 14478 -26335 -17464
3315 -17464 -36967 -46798 -9452 18966 1043 -23352 -39503 -29051 -3436 22856 28220 5303
3303 5303 -23181 -50841 -25327 13186 22954 19785 24367 7205 -35 -9868 -8580 8234 8306 -18125
3289 -18125 -31660 -4358 4024 9533 5185 -27936 -16071 5476 7813 28613 27841 8090 -18559
3276 -18559 -7015 -15498 -1059 22235 10558 -11200 -33482 -44722 -27820 -39164 -20651 10085
3264 10085 -3082 -19693 -3064 2726 -24846 -30148 -47165 -58737 -42788 -12387 -4569 -2897 10290
3251A0290l5488q310J3883N940K679j450k5898Q856M413J9222R170j6862M031
3238i524J453K2357K7590K311k1586k6109k4491K3410N542k763j2435J7574K6175
3225B9504n884r343K3904J8755l588n511o493k2936m2661r054L9773K1009J800
3212B9275q384j1892o096M219K437j0368J347J6317m468J3836j6520q192q70L92
3198A033Q284L9726P081l8262j0410Q73k9324M99L1776J6601r573j3660P350j309
3184A0685l368K910K0722k9245j9220J7811K0569J506P451p388Q399j4375m313
3171A2144J1254r911j6627p991l988k5466j3600J0003K393J8415J2295j2979l1374
3158e5432J9957J0093J539M315r79K6384K1313L3786N542L520j7264j0899m4806
$$ plain form
3251 10290 -25198 -33508 -19625 -13685 -11006 -12456 -38354 -29498 -25085 -5863 3307 -13555 -9524
3238 -9524 -8071 14286 41876 44187 22601 -3508 -27999 -4589 953 -1810 -14245 3329 29504
3225 29504 23620 14277 38181 56936 53348 47837 41344 18408 -24253 -33307 6466 27475 29275
3212 29275 20891 8999 2903 7122 9559 -809 538 16855 12387 26223 9703 1511 641 1033
3198 1033 9317 49043 56124 17862 7452 8325 -20999 -20500 11276 27877 18304 4644 11994 10685
3184 10685 7317 10227 30949 1704 -17516 295 20864 22370 29821 22433 30832 16457 12144
3171 12144 23398 13487 -3140 -11131 -15119 -40585 -54185 -44182 -41789 -23374 -11079 -24058 -55432
3158 -55432 -35475 -25382 -23843 -19528 -20507 5877 27190 60976 66518 70038 52774 41875 -2931
3145b931k8768o226K8961m154J5719J7190J713l6071j0852M826L720L511L9182
3132B5820P58j3598K1705J3311j1206P025J0929J2108k2779j1007l832k9859j6161
3119a6786J9515J1335l1967L503L1882r221j6105m833J562M3724K7375J5541k1099
3106E4426q285m2189l2752R854Q629J1715J5009k057k7594L657M3925j7183O140
3093B3295o950j2944N215m446Q734L998J3695j8007j6924O449K6684p357l5088
3080a3646k1257k4126k762p452L8521K4422j4810j5231K6622L3301Q336l2149
3068b31k7072n375J3714P289Q014K1803J3092R528j4255j8785j7684L0456R846
3055C0340k3782k3909p658P185K1795J1438L7426j793j8354m445j5140j3213o735
$$ plain form
3145 -2931 -31699 -37925 -8964 -13118 2601 19791 21504 -14567 -25419 -20593 -16873 -13362 25820
3132 25820 26578 12980 34685 47996 36790 43815 54744 66852 44073 33066 29234 -625 -16786
3119 -16786 2729 14064 -17903 -14400 17482 8261 -7844 -12677 -11115 32609 59984 75525 54426
3106 54426 46141 3952 -28800 -18946 -10317 1398 16407 14350 -13244 -9587 34338 17155 23295
3093 23295 16345 3401 8616 4170 12904 16902 30597 12590 -4334 2115 28799 21442 -13646
3080 -13646 -34903 -59029 -61791 -69243 -30722 -6300 -21110 -36341 -9719 23582 31918 -231
3068 -231 -27303 -32678 -18964 -11675 -3661 18142 31234 40762 26507 7722 -9962 20494 30340
3055 30340 6558 -17351 -25009 -17824 3971 15409 52835 51042 32688 28243 13103 -110 -6845
3042f845n934L382J4549k767k5548k1566J3097J4306K2850J4198k2286K27J470
$$ plain form
3042 -6845 -12779 -9397 5152 2385 -23163 -44729 -31632 -17326 5524 19722 -2564 -2337 -867
$$ [...]
##END NTUPLES=NMR SPECTRUM
##END=
