##TITLE=Analysis number 322669
Compound Code spb 06434
Project Code adrs
Chemist Name new century
##JCAMPDX= 6.0         $$ Bruker NMR JCAMP-DX V2.0
##DATA TYPE= NMR SPECTRUM
##DATA CLASS= NTUPLES
##ORIGIN= Bruker BioSpin GmbH
##OWNER= nmr
$$ XWIN-NMR		Version 3.5
$$ Fri Oct 13 10:27:28 2006 GMT Daylight Time (UT+1h)  MAYBRIDGE\nmr@NMR_250MHZ
##.OBSERVE FREQUENCY= 250.131544655141
##.OBSERVE NUCLEUS= ^1H
##.ACQUISITION MODE= SIMULTANEOUS (DQD)
##.ACQUISITION SCHEME= undefined
##.AVERAGES= 16
##.DIGITISER RES= 18
##SPECTROMETER/DATA SYSTEM= dpx250
##.PULSE SEQUENCE= zg30
##.SOLVENT NAME= CDCl3
##.SHIFT REFERENCE= (INTERNAL, CDCl3, 0, 16.522)
##AUDIT TRAIL= $$ (NUMBER, WHEN, WHO, WHERE, WHAT)
$$ ##TITLE= Audit trail, XWIN-NMR		Version 3.5
$$ ##JCAMPDX= 5.01
$$ ##ORIGIN= Bruker BioSpin GmbH
$$ ##OWNER= nmr
$$ C:\u/data/dgb/nmr/ADRS/170/pdata/1/auditp.txt
$$ ##AUDIT TRAIL=  $$ (NUMBER, WHEN, WHO, WHERE, WHAT)
(   1,<2006-10-13 10:27:04.88 +100>,<MAYBRIDGE\nmr>,<NMR_250MHZ>,
      <created by zg, POWCHK disabled, PULCHK disabled
       configuration hash MD5:
       49 4B E0 1D 92 C2 6B 37 9F E6 65 BC 52 41 86 1D
       data hash MD5: 64K
       80 5D 9F 95 72 68 2B 65 8D F4 7F 95 8A ED AF 8A>)
(   2,<2006-10-13 10:27:17.82 +100>,<MAYBRIDGE\nmr>,<NMR_250MHZ>,
      <Start of raw data processing
       ef LB = 0.3 FT_mod = 6 PKNL = 1 SI = 32K 
       data hash MD5: 32K
       7A 25 A5 68 23 C2 99 BE E2 F4 AE 48 58 CD DE BE>)
(   3,<2006-10-13 10:27:19.52 +100>,<MAYBRIDGE\nmr>,<NMR_250MHZ>,
      <apk 
       data hash MD5: 32K
       48 B9 A7 20 40 08 BF BF 21 75 DE 5F 5F E6 D2 F6>)
(   4,<2006-10-13 10:27:20.34 +100>,<MAYBRIDGE\nmr>,<NMR_250MHZ>,
      <abs ABSG = 5 
       data hash MD5: 32K
       8A D9 75 04 03 1A A0 99 B4 27 EF 99 AD DE E9 0A>)
$$ ##END=
$$ 
$$ hash MD5
$$ 7B CB 4E 97 5C 5E 65 C3 B1 86 20 BD 4D 90 10 29
##$RELAX= 
##$RELAX= 
##$RELAX= 
##$RELAX= 
##$RELAX= 
##$RELAX= 
##$RELAX= 
$$ Bruker specific parameters
$$ --------------------------
##$DU= <C:\u>
##$EXPNO= 170
##$NAME= <ADRS>
##$PROCNO= 1
##$TYPE= <nmr>
##$USER= <dgb>
##$AMP= (0..31)
100 100 100 100 100 100 100 100 100 100 100 100 100 100 100 100 100 100 
100 100 100 100 100 100 100 100 100 100 100 100 100 100 
##$AQSEQ= 0
##$AQ_mod= 3
##$AUNM= <au_zg>
##$AUTOPOS= <17 >
##$BF1= 250.13
##$BF2= 250.13
##$BF3= 250.13
##$BF4= 250.13
##$BF5= 500.13
##$BF6= 500.13
##$BF7= 500.13
##$BF8= 500.13
##$BYTORDA= 1
##$CFDGTYP= 0
##$CFRGTYP= 5
##$CHEMSTR= <none>
##$CNST= (0..31)
1 1 145 1 1 1 1 1 1 1 1 1 1 1 1 1 1 1 1 1 1 1 1 1 1 1 1 1 1 1 1 1 
##$CPDPRG= <>
##$CPDPRG1= <>
##$CPDPRG2= <>
##$CPDPRG3= <>
##$CPDPRG4= <mlev>
##$CPDPRG5= <mlev>
##$CPDPRG6= <mlev>
##$CPDPRG7= <mlev>
##$CPDPRG8= <mlev>
##$CPDPRGB= <>
##$CPDPRGT= <>
##$D= (0..31)
0 1 0 0 0 0 0 0 0 0.06 0 0 0 0 0 0 0.0002 0 0 0 0 0 0 0 0 0 0 0 0 0 0 
0 
##$DATE= 1160731623
##$DBL= (0..7)
120 120 120 120 120 120 120 120 
##$DBP= (0..7)
150 150 150 150 150 150 150 150 
##$DBP07= 0
##$DBPNAM0= <>
##$DBPNAM1= <>
##$DBPNAM2= <>
$$ [...]
##$SUBNAM7= <"">
##$SUBNAM8= <"">
##$SUBNAM9= <"">
##$SW= 20.6930455092707
##$SWIBOX= (0..15)
0 0 3 0 0 0 0 0 0 0 0 0 0 0 0 0 
##$SW_h= 5175.983436853
##$TD= 65536
##$TD0= 1
##$TE= 683.16
##$TE2= 300
##$TE3= 300
##$TEG= 300
##$TL= (0..7)
0 120 120 120 120 120 120 120 
##$TP= (0..7)
150 150 150 150 150 150 150 150 
##$TP07= 0
##$TPNAME0= <>
##$TPNAME1= <>
##$TPNAME2= <>
##$TPNAME3= <>
##$TPNAME4= <>
##$TPNAME5= <>
##$TPNAME6= <>
##$TPNAME7= <>
##$TPOAL= (0..7)
0.5 0.5 0.5 0.5 0.5 0.5 0.5 0.5 
##$TPOFFS= (0..7)
0 0 0 0 0 0 0 0 
##$TUNHIN= 0
##$TUNHOUT= 0
##$TUNXOUT= 0
##$USERA1= <user>
##$USERA2= <user>
##$USERA3= <user>
##$USERA4= <user>
##$USERA5= <user>
##$V9= 5
##$VALIST= <valist>
##$VCLIST= <CCCCCCCCCCCCCCC>
##$VD= 0
##$VDLIST= <DDDDDDDDDDDDDDD>
##$VPLIST= <PPPPPPPPPPPPPPP>
##$VTLIST= <TTTTTTTTTTTTTTT>
##$WBST= 1024
##$WBSW= 4
##$XGAIN= (0..3)
0 0 0 0 
##$XL= 0
##$YL= 0
##$YMAX_a= 543449
##$YMIN_a= -385035
##$ZGOPTNS= <>
##$ZL1= 120
##$ZL2= 120
##$ZL3= 120
##$ZL4= 120
##$ABSF1= 16.522
##$ABSF2= -4.171173
##$ABSG= 5
##$ABSL= 3
##$ALPHA= 0
##$AQORDER= 0
##$ASSFAC= 0
##$ASSFACI= 0
##$ASSFACX= 0
##$ASSWID= 0
##$AUNMP= <proc_1d>
##$AZFE= 0.1
##$AZFW= 0.1
##$BCFW= 0
##$BC_mod= 0
##$BYTORDP= 0
##$COROFFS= 0
##$CY= 12.5
##$DATMOD= 1
##$DC= 0
##$DFILT= <>
##$DTYPP= 0
##$F1P= 14.0000005364418
##$F2P= -0.99999901652339
##$FCOR= 0.5
##$FTSIZE= 32768
##$FT_mod= 6
##$GAMMA= 0
##$GB= 0
##$INTBC= 1
##$INTSCL= 1
##$ISEN= 128
##$LB= 0.3
##$LEV0= 0
##$LPBIN= 0
##$MAXI= 10000
##$MC2= 0
##$MEAN= 0
##$ME_mod= 0
##$MI= 0
##$NCOEF= 0
##$NC_proc= -4
##$NLEV= 6
##$NOISF1= 0
##$NOISF2= 0
##$NSP= 0
##$NTH_PI= 0
##$NZP= 0
##$OFFSET= 16.522
##$PC= 1
##$PHC0= -47.72811
##$PHC1= 13.98966
##$PH_mod= 1
##$PKNL= yes
##$PPARMOD= 0
##$PSCAL= 4
##$PSIGN= 0
##$REVERSE= no
##$SF= 250.13
##$SI= 32768
##$SIGF1= 0
##$SIGF2= 0
##$SINO= 400
##$SIOLD= 32768
##$SREGLST= <1H.CDCl3>
##$SSB= 0
##$STSI= 32768
##$STSR= 0
##$SW_p= 5175.98343685301
##$SYMM= 0
##$S_DEV= 0
##$TDeff= 65536
##$TDoff= 0
##$TI= <Analysis number 999999
Compound Code 99
Book Reference 9
Project Code 9>
##$TILT= no
##$TM1= 0
##$TM2= 0
##$TOPLEV= 0
##$USERP1= <user>
##$USERP2= <user>
##$USERP3= <user>
##$USERP4= <user>
##$USERP5= <user>
##$WDW= 1
##$XDIM= 32768
##$YMAX_p= 418367898
##$YMIN_p= -443874
$$ End of Bruker specific parameters
$$ ---------------------------------
##NTUPLES= NMR SPECTRUM
##VAR_NAME=  FREQUENCY,     SPECTRUM/REAL,   SPECTRUM/IMAG
##SYMBOL=    X,             R,               I
##VAR_TYPE=  INDEPENDENT,   DEPENDENT,       DEPENDENT
##VAR_FORM=  AFFN,          ASDF,            ASDF
##VAR_DIM=   32768,         32768,           32768
##UNITS=     HZ,            ARBITRARY UNITS, ARBITRARY UNITS
##FACTOR=    0.157963299565203, 1,           1
##FIRST=     4132.6476996994, 0,             0
##LAST=      -1043.33573715361, 0,           0
##MIN=       -1043.33573715361, -443874,     0
##MAX=       4132.6476996994, 418367898,     0
$$ Real data points
##PAGE= N=1
##DATA TABLE= (X++(R..R)), XYDATA
$$ [...]
28212 153113 103658 81168 110529 27643 3829 -39080 11431 89236 62752 -59185 -223059
28201 -223059 -249746 -66910 -99274 57972 256164 159077 89876 10944 -9884 -18341 -66134
28190 -66134 8439 46529 39070 35116 9102 7617 -55862 -731 41274 21563 -11982 -41459
28178 -41459 21832 -10595 -33866 -31891 -19971 25715 36271 84490 78939 53222 147312 139300
28166 139300 54252 54561 123914 135245 73828 68046 84884 98347 141070 47367 -76747 -32047
28154 -32047 56853 47802 -5446 69826 113660 7656 -4104 -67665 -93559 -82811 -142649 -125394
28142 -125394 -155963 -212911 -222381 -156047 -65018 35739 8588 1076 23411 -21081 -3027 -30213
28130 -30213 72988 124825 59209 -2102 8933 55341 29173 -71045 -37428 -13224 5297
28119 5297 105744 222479 185210 89386 14989 95657 67233 37071 98251 147243 155542 51298
28107 51298 84434 170118 240710 223115 236444 260680 198070 99940 42157 81010 45954 101226
28095 101226 214369 236491 284029 304925 265639 152360 122534 114699 96264 -35695 -22787
28084 -22787 32399 -93491 -217231 -206815 -219256 -210062 -1645 117468 124731 163729 65967
28073 65967 16968 80102 59692 -93089 -16948 111096 59923 -30861 -55208 -3141 -102632
28062 -102632 -31747 65061 62806 -34658 -70530 7157 14875 61891 42700 -5253 -186417 -214109
28050 -214109 -205516 -188117 7222 -18158 77203 18975 37542 93188 89536 112469 116848 130858
28038 130858 151288 25051 -57543 13794 121735 224684 257400 183518 3525 -47448 -74312
28027 -74312 33387 53688 28003 69016 108836 160545 67082 -72366 -97957 -53226 4130
28016 4130 89164 130611 97492 24182 52426 79235 68282 10405 -25411 30030 55792 165550
28004 165550 123246 -1906 -117587 -126132 -130805 -53811 107824 130469 146941 246827 333941
27993 333941 124695 301 -6969 -27845 -127677 -174849 -177100 -194427 -182161 -107541 -153075
27982 -153075 -84038 12314 90745 153372 222637 219173 168495 115858 50192 52917 91013 117965
27970 117965 -69901 -84039 -27719 14472 63828 79277 -20962 -151448 -190017 -145122 -157888
27959 -157888 -196629 -162706 -63693 126789 121814 13819 60991 49348 64524 54262 75349
27948 75349 35203 54224 5466 -42750 -21792 48494 120814 103704 54121 45741 54766 43731
27936 43731 31678 32308 -49439 -155357 -200639 -224859 -227251 -248365 -255669 -218956 -119489 -64647
27924 -64647 -24012 -8723 -80390 -62976 -63752 -29556 111168 98900 26857 136062 -16011
27913 -16011 -77899 -84746 -142906 -213606 -63616 5500 12703 80910 114885 -42861 -42753 -73310
27901 -73310 -70431 -132729 -115641 -43678 -19409 31184 214455 285087 225403 92152 -79326
27890 -79326 3225 147834 60110 83811 148416 205838 125080 34107 8456 31333 -62977
27879 -62977 -49361 -44528 103640 43539 -30238 -30744 13820 81 -53182 -42050 -49012 -41821
27867 -41821 -81100 -80830 -12965 -3989 76326 175665 157174 304474 335557 247828 213526 141218
27855 141218 82325 148143 155143 126204 51295 108460 93518 46673 163425 199471 167841
27844 167841 71172 115175 82299 132969 106150 13023 -95606 -118320 8943 76755 114301
27833 114301 22143 -86315 -125001 44909 155685 50583 -36062 20802 2406 66146 37508
27822 37508 24922 -64123 -165171 -59962 -3103 63084 104702 140297 133076 161744 121257
27811 121257 80143 61096 -68228 -154523 -42764 79162 -28625 -54243 16165 81311 145328
27800 145328 139809 260237 244740 155181 148249 139870 98686 91935 3038 -35792 -57658 17846
27788 17846 141841 246614 279254 247706 92057 55455 -21883 -40011 67006 51142 34745
27777 34745 31709 95328 10073 -14732 84384 118380 21520 144610 136088 25544 -46189 117023
27765 117023 145554 71188 56912 52381 49490 -24501 -105071 -101704 -21051 -88862 -18691 16163
27753 16163 -161312 -142481 -62891 48023 64238 59309 89090 8864 52416 71293 62219 130614
27741 130614 6511 -96872 -25000 93514 96166 73174 -26748 72854 102770 155445 152391
27730 152391 131959 193519 168111 63188 21638 87196 71710 -69763 -1364 71162 -71362
27719 -71362 -88372 -94611 -98643 -13263 20742 186794 174459 199461 148102 118450 49188 -85427
27707 -85427 -254183 -175710 -47846 -13644 1153 -72830 -144076 -54248 23199 92508 185759
27696 185759 52665 -17599 -63529 -45755 105008 177088 151218 130202 101592 123933 142351
27685 142351 114554 80050 69326 95362 166056 84353 66047 116127 11581 -57639 -23161
27674 -23161 -9800 -49708 9485 -19537 20985 -11163 -135744 -140658 -61745 -41339 -43198 -9458
27662 -9458 -79341 -151830 -206619 -187503 -160097 -162905 -8285 43194 -5187 -2205 -37751 31494
27650 31494 47030 104495 196868 218818 186980 123725 -33711 -61436 -27772 4830 61120
27639 61120 81191 57238 110522 153989 110151 52720 17898 -60117 -135997 -190028 -122504 2549
27627 2549 68668 91083 81512 4259 -21744 -123345 -97725 -60412 -14969 -87801 -105931 32094
27615 32094 153000 127882 30669 -6076 55368 163759 115695 16634 -4536 -55608 -114504
27604 -114504 -80698 101223 219209 92037 84454 178750 255174 176422 110785 182311 126163
27593 126163 6524 -21010 -19198 50434 2986 -102566 -98771 -102420 4166 60523 155196
27582 155196 87000 47456 86396 161600 142715 161652 220515 136148 78353 68600 86372 13246
27570 13246 -54119 -5079 73688 84991 10058 -138316 -213223 -99615 -13746 457 -166253
27559 -166253 -95571 23641 4881 377 -116788 -40763 -49862 -136671 -144081 -51287 -11295 82283
27547 82283 107936 7382 -46550 1854 45670 -73947 -8127 99968 91352 195198 186995
27536 186995 160299 272180 273789 64452 -12566 -759 75527 41822 -109600 -22545 33363
27525 33363 7677 -96564 -65083 36780 -99424 -201995 -146226 -63707 25031 89379 113366
27514 113366 167947 165542 226410 211880 146283 162019 221966 142996 123293 51971 8770 40062
27502 40062 185416 229708 257228 263987 197263 96027 67165 12499 54216 -2264 -9998 -4319
27490 -4319 -63888 -66614 49443 32711 58983 82586 66142 -102183 -149723 -72933 37121
27479 37121 75200 64010 -37220 -205096 -262901 -285740 -105813 51168 -3904 -71137 -71782
27468 -71782 51967 38534 53705 -55207 -161162 -179260 -72249 -39696 -9391 -40342 -196936
27457 -196936 -179059 -143934 -154222 -218133 -175092 -91176 -41030 -75632 -135529 -86642 1326
27446 1326 2926 -138721 -191687 -202325 -127728 -108425 -62296 -24690 -59469 -57260 -64143 21612
27434 21612 84214 131383 250584 208019 60707 -9194 7221 11780 -51318 -90868 -144479
27423 -144479 -130608 -74166 -107812 -146682 -84873 36308 33863 71683 103939 98802 126580 169077
27411 169077 158030 67396 -9652 35316 112021 104427 83125 56869 23637 48570 -244 27501
27399 27501 -29991 -61989 -150501 -168147 -170644 -144872 -75931 -16918 38551 69747 196431 211214
27387 211214 93156 65186 10922 -33488 -7207 22870 39824 68481 92408 91513 61092 52871
27375 52871 42406 68129 98225 48020 -55121 -164090 -145657 -112153 -182142 -124373 -77270
27364 -77270 -42924 -25024 65479 77278 34246 -30352 75666 108434 -14389 -128657 -154110
27353 -154110 -151459 -229182 -219138 -206985 -187319 -184487 -112402 -109138 -88112 -56950 -78702 -48190
27341 -48190 -57060 -108126 -81110 -27841 48363 58708 53176 37976 -30325 4343 67443 -59244
27329 -59244 -70281 -35717 -41500 -87951 -100258 -16874 59662 60637 27367 1211 -101236 -144800
27317 -144800 -25640 54182 4175 -49350 -16020 18649 -91672 -95507 -61204 -64313 -151455
27306 -151455 -180547 -242135 -168445 -173467 -17757 101236 171605 154207 125280 18917 42849
27295 42849 126957 150028 96220 74635 111470 97809 33025 -34549 -69291 -82983 -129969 -71736
27283 -71736 -9118 -11001 50522 76646 4146 -39340 -40400 -33157 12021 6655 98128 57502
27271 57502 -55047 -13994 34897 106595 61621 31013 -50810 -122752 -63214 -40683 -182754
27260 -182754 -288724 -233876 -169924 -61572 -132526 -175182 -116342 -206040 -131227 -133522 -123844
27249 -123844 -139697 -139442 -248007 -199748 -154807 -219943 -180518 -168140 -112210 -60999 83969
27238 83969 55821 18198 -73324 -41803 131722 96181 32415 -940 -26704 10687 -18470
27227 -18470 -76445 21545 40968 -89233 -140083 -159415 -108901 -25540 20878 -37053 -2246
27216 -2246 -16560 2178 158611 241065 242690 142070 143452 101407 874 -10569 37657 -1783
27204 -1783 -13040 -29782 69121 121649 75431 475 -38591 -50518 -9561 30836 89135 66725
27192 66725 36057 77560 91983 44117 23458 144873 142103 90652 -22281 -96363 -86408 -51952
27180 -51952 -130324 -167363 -57595 87339 81366 4365 -26835 -4103 31135 -7590 -123845
27169 -123845 -121099 -21849 143958 253786 293842 114588 7067 605 49721 65934 -43385
27158 -43385 -59373 -31448 -120387 -114996 -74953 29057 -50143 -36649 -55120 -105070 -129452 -40572
27146 -40572 -19991 7421 11831 -2030 33683 8964 2975 -63503 -119226 62181 108136 -14362
27134 -14362 -65285 -110557 -62019 -14122 6229 57092 -24945 -27107 18658 34671 27835 39892
27122 39892 -117972 -98263 -71668 -124906 -87991 60546 149075 180582 92192 -12620 -82506
27111 -82506 -38538 -57816 -109329 -79473 -126426 -127804 -40934 164227 156452 107807 45022 -95148
27099 -95148 -175518 -129728 -26899 9766 131292 168730 70424 -25720 97526 159745 29628
27088 29628 -57925 -9234 -4678 10987 -40719 -20374 99870 185344 268005 311432 358192 314005
27076 314005 194294 126829 86042 51767 50357 -23347 -232 115728 121036 85319 185537
27065 185537 193944 22362 -85501 -34871 -57068 -28898 1992 -111086 -186605 -57895 -2474
27054 -2474 52399 124934 47190 21290 41927 -26629 -131825 -180976 -127126 -86325 -72055 -42747
27042 -42747 -32390 -15424 -85091 -114400 -49782 67966 14399 49714 142266 175015 154409
27031 154409 145198 66469 98805 228796 190911 21066 51609 59169 73182 19638 29711
27020 29711 -44722 -11500 75541 140964 91048 138286 48099 -84089 -13546 -50564 -42394 -146168
27008 -146168 -156168 -45437 -22748 6879 -16730 50925 119545 91054 132725 43207 -38419
26997 -38419 -22457 -100379 30949 51530 -223182 -335951 -292165 -200662 -41595 -74409 -206635
26986 -206635 -150269 -90081 -161019 -24373 106687 84514 14374 73861 110138 117070 63976
26975 63976 37347 188753 185498 118548 123470 64242 30235 10049 77491 92612 37905 -36498
26963 -36498 5419 18901 -4142 -58544 32196 46249 -7291 2411 29874 12566 -59332 67034
26951 67034 29079 69813 112229 104894 79174 -32037 -56414 -133155 -90914 -103215 -98071 26950
26939 26950 838 -82508 -223296 -143758 -109104 -85569 -126530 -132142 -124469 -205519 -235620 -220881
26927 -220881 -221131 -80889 36999 151170 169919 111206 61036 106711 100830 29516 -56592
26916 -56592 -84656 -121818 -28172 250 -133780 -153123 -136095 -77862 -34202 -6533 -18021
26905 -18021 -75605 -95213 -186587 -91316 -83845 -159893 -161743 -238263 -161138 -20601 70167 37118
26893 37118 -43630 -14515 -69543 -114457 -97240 -36461 81237 63061 14614 62501 48091
26882 48091 54025 888 58939 -29877 -149852 -149963 -107103 -5704 -21196 61429 71554 121757
26870 121757 90834 59789 118935 127821 178114 169812 110755 154914 134809 201649 184027 139004
26858 139004 141409 88279 -31138 -70233 -3284 -34673 -72541 -10837 53518 86176 96949
26847 96949 174036 195875 228922 96501 102002 121386 -95563 -282454 -237187 -68116 13081
26836 13081 -14850 9022 -63610 -160096 -156695 -178576 -75810 -74712 -86549 -123144 -90579 6424
26824 6424 102298 99486 124656 140607 122552 178924 83418 55455 59715 66351 -133456 -223169
26812 -223169 -168022 -60491 53157 94873 35055 87151 90744 20957 -48121 -93748 -97025
26801 -97025 -111069 -23009 123915 178648 91260 201096 153436 150786 136046 59904 -5056
26790 -5056 -97311 -132698 6251 35691 -53559 -155300 -134655 -118171 -103941 -89394 -109992
26779 -109992 -140905 -130233 -91868 -93586 2448 37528 40656 43945 58155 -116346 -126123 -23299
26767 -23299 74263 114834 161479 74025 -22164 -5755 49923 36850 139533 111588 107675 153389
26755 153389 134144 14123 29618 21732 -176093 -216269 -120832 3497 7042 -18078 -8615
26744 -8615 2885 83484 75795 20417 14139 76903 124752 164288 81010 -8377 -78461 -40937
26732 -40937 -72408 -86844 -74749 -110739 -126521 -146919 -80023 86272 185133 73760 -75442
26721 -75442 -114085 -148729 -126944 -133651 -30662 -37317 -31476 -113562 -15536 81309 111038 2743
26709 2743 -27540 -18776 -52313 -29630 -23215 149321 209938 164717 73471 -59601 -120541 -129041
26697 -129041 -11680 -80458 -133893 -132206 -64488 -26633 -38090 -10511 71914 114961 74588
26686 74588 2316 -86100 -46646 -537 38057 51888 -16722 -23808 -35597 -46384 68030 108139
26674 108139 138895 127090 100491 16391 -33660 -29435 -37079 -32248 28863 109054 100065 125686
26662 125686 55111 6293 70133 76818 -11511 16746 45182 49497 75199 51632 -85301 -147647
26650 -147647 -207348 -275165 -206001 -124351 -23545 2958 26593 57939 64605 17929 -21781
26639 -21781 15668 57582 51858 52278 -21366 40289 87672 80980 48340 54564 67282 -9373 52575
26626 52575 92910 -11872 -2310 30908 47161 12578 -112929 -50797 111343 113519 172503
26615 172503 268173 229155 103411 134825 96809 33250 -90376 -89266 1778 -33024 45253
26604 45253 68982 87450 107966 121378 89289 52236 26347 -13709 -80046 137346 145910 19205
26592 19205 -64333 -70690 9670 88640 29054 79083 -3755 24167 80596 90493 178042 234010
26580 234010 199424 110828 24388 44129 98876 76458 52907 156697 195975 188661 50745
26569 50745 -50172 -89167 -40924 -77480 -205898 -181911 -115285 54192 56176 8797 -5048
26558 -5048 44858 81577 39386 84042 100155 154142 128145 65846 80498 75802 -3483 -165532
26546 -165532 -167898 -115722 -74569 -37474 -121834 -114407 -116892 -84971 -76054 -65152 -23644 -39444
26534 -39444 -75630 -48777 58005 76195 -29796 46949 168513 108403 103023 -10465 -47225
26523 -47225 -28305 62692 144834 198397 214341 119679 66897 12518 1629 -95804 -107407 -26495
26511 -26495 -29464 12647 40740 88598 100601 33982 17885 -11294 -17684 -17108 36750 137989
26499 137989 84786 -13016 31858 -20781 -107465 -55509 22850 7284 -64579 -62457 -76674 -147801
26487 -147801 -159024 -93596 -37739 -16831 -62477 -40354 16306 128651 178484 154977 63719
26476 63719 -38190 -37364 -46353 38745 101218 86678 104836 -8436 -125911 -121580 -63801 -14881
26464 -14881 73031 198813 194238 130056 118634 104270 93207 61126 -50455 -64662 -74895
26453 -74895 -83909 -100507 -80486 -2361 -34602 84005 66734 59964 -91603 -107748 -117906 -105658
26441 -105658 -118410 -227833 -222823 -243891 -227803 -152787 -41441 -20919 35942 61438 62010 47656
26429 47656 51574 -64721 -229518 -267923 -201254 -214177 -197876 -107531 -148246 -210593 -155612
26418 -155612 -135128 -85494 -46367 -57090 -5338 -104762 -176039 -300032 -225715 -93291 -13225
26407 -13225 -1139 -27954 -57901 -165516 -57962 -56406 -47273 24284 96619 82922 89455 96870
26395 96870 25244 -43038 -7507 -22653 62595 118118 -34641 -61945 -1990 -50241 -33170
26384 -33170 24527 117511 194579 126228 43089 -17328 30846 17255 -63304 64421 75604
26373 75604 84667 108797 4100 -122232 -219942 -127170 -135411 -143472 -162446 -145221 -114159 -127116
26361 -127116 -74813 -3532 136507 151374 232526 277867 216564 23338 -45247 -15538 31877
26350 31877 2642 18105 -50597 -109702 -17463 92482 100306 16809 -129170 -42732 1324
26339 1324 21730 42020 95191 158110 115636 -49384 -84441 5590 3746 -79899 -203835 -235197
26327 -235197 -168879 -121548 -163985 -148115 -46173 116525 -28676 -51282 -14806 -73131 -34485
26316 -34485 19507 28339 -25817 -101957 -34693 -65591 -101502 -215237 -147502 -187308 -204589 -64024
26304 -64024 -133156 -32795 -98780 -93721 -91153 -106493 -110875 -83326 4846 73553 92760 60322
26292 60322 11748 -48908 -94608 -74845 -57082 142902 176421 86817 53276 -5212 -19433
26281 -19433 -66400 41314 11606 -32043 -72946 -158225 -88571 16630 -35007 -4296 14750
26270 14750 144004 155868 157628 176291 242679 136656 -21155 -150539 -161703 -117944 12439
26259 12439 119984 165534 197322 161029 163773 78771 -96362 -163014 -215756 -211275 -130240 -41172
26247 -41172 119290 131196 140308 80892 137274 163239 59529 -103549 -134294 -32586 -3733
26236 -3733 87041 12088 -52264 -10039 -18424 -26308 -40419 -119241 -155745 -155418 -22899 797
26224 797 82255 137804 187321 140186 57005 29911 17945 111901 71755 17623 18029 -7354
26212 -7354 1307 27366 120070 102999 20673 19016 33750 76420 41394 121552 67078 15835
26200 15835 14232 -29235 -49712 -19729 -76821 -44402 -22562 -173412 -248984 -115643 -18436
26189 -18436 33264 145258 79536 -32520 -74819 -75855 -54956 -38247 72743 3398 -87376
26178 -87376 -21341 29241 11216 67520 103399 183265 248616 281124 248172 180936 45684
26167 45684 41767 48066 2357 -127796 -87181 -67932 -48344 -46688 5665 -36061 -65081 86469
26155 86469 19927 -77569 -141997 -183151 -164646 -38932 79427 -13281 -58380 -107788 -73215
26144 -73215 22700 -49439 -49631 48291 75653 49368 58557 58792 78849 157973 172612 96955 120264
26131 120264 58036 -71779 -109060 -83606 -92455 9555 53651 114339 -8091 -55589 -13944
26120 -13944 -15800 43364 56608 -123183 -172187 -90892 -32236 -32911 39827 -45437 -70706 38472
26108 38472 -62609 -176651 -221762 -175271 -137629 -111628 -92381 -55213 1234 -2242 38515
26097 38515 14442 -33171 -59754 12079 81311 154118 129188 -62082 -81192 -47196 -84121
26086 -84121 -55876 57133 61948 68866 111473 3469 -17874 24156 87753 137748 123537 139953
26074 139953 60364 -8534 62722 213440 235597 142032 29245 -135250 -175741 -44203 -50771
26063 -50771 -16309 -13584 45614 112863 53137 74532 162155 195732 74380 41726 6496 -52892
26051 -52892 59428 116655 27562 1156 -17326 -7012 75332 152621 117974 -9462 -38422
26040 -38422 65860 101811 356 -238068 -298791 -172023 -137250 -190223 -254653 -155117 -88799
26029 -88799 27091 13193 -117154 -81589 1496 95635 39023 2833 15352 121787 152381
26018 152381 100044 128343 52615 -94003 -48652 -5935 7276 35712 -3290 42403 29081
26007 29081 -71095 -133580 -13530 28139 -53254 -63891 -20204 -43531 122304 197513 21999
25996 21999 -66452 -4393 -143448 -200163 -238898 -249570 -252563 -218103 -49839 -45487 91666
25985 91666 100845 10903 12768 -92415 -59149 -43160 -47880 -109664 -94241 -109392 -184830 -151974
25973 -151974 -82340 -64549 -119147 -76066 -67576 -5124 -51663 -12467 71317 9057 -49170 -57070
25961 -57070 -50904 78022 89192 157618 175780 149726 92226 11357 108409 167713 267691 243710
25949 243710 212611 152649 63724 -7652 -26925 11653 44941 100297 46481 22537 -117372
25938 -117372 -48546 33526 138854 188614 105002 9749 -37835 6807 79639 -56548 -135672
25927 -135672 -182473 -195959 -264387 -250480 -208430 -109718 35090 93998 47770 3043 12613
25916 12613 -123343 -98889 -7445 -79459 -84955 -21718 -61324 -203949 -205529 -191103 -132193 -82652
25904 -82652 -84019 -72729 -17760 29540 34497 11058 -11582 5212 -30880 24305 -11195 -55381
25892 -55381 -118542 -124294 -76549 -71344 15824 71163 145778 58904 -96935 -197540 -309688
25881 -309688 -375457 -291189 -208168 -146986 -154294 -223879 -230690 -160355 -33582 77383 104481
25870 104481 204630 155336 112733 145555 85776 -1762 -188358 -243100 -226728 -282021 -159523
25859 -159523 -11684 173064 225734 180128 202721 178871 -2781 -24415 110183 128913 79003
25848 79003 -3669 83611 75685 -21568 67507 33877 92303 57474 28384 49095 205043 193924
25836 193924 99140 5096 23425 25295 14731 -62354 -25009 45181 103326 95868 170879 210503
25824 210503 313222 422718 274425 116022 10170 -72959 -62140 41107 47983 14396
25814 14396 -21822 -35401 -74076 -111540 -144399 -66972 34353 58506 85146 -627 -3096 -25114
25802 -25114 -81708 -77962 -60525 -5644 -28810 -81605 -182717 -145466 -26743 21718 -89630
25791 -89630 -167190 -104391 -41624 -111533 -89583 27242 57139 20066 -59839 35620 92979
25780 92979 -12677 -21983 18394 14962 20969 48505 36250 10252 -99961 -110429 -119949 -28141
25768 -28141 68191 62272 38377 -44221 -8662 29619 12095 -170310 -288330 -189778 -101028
25757 -101028 -18373 -14753 -71441 -130720 -89750 -133859 -28829 105520 252244 196175 97831
25746 97831 -24909 -69584 -186139 -215920 -179131 -28767 -10999 -107167 -61034 105476 90697
25735 90697 78687 39549 -36518 -89241 -73165 -182145 -136135 -100443 -40892 -133568 -160816
25724 -160816 -70100 44973 93582 88589 46233 39488 180151 200608 263105 142489 44490
25713 44490 -121919 -270195 -197365 -70909 -168733 -86004 71641 69888 -2866 60846 44288
25702 44288 -15694 -60009 11561 67064 8131 -40692 96058 141662 48923 -40811 -85955
25691 -85955 -218395 -311287 -182617 -100006 -162477 -62662 51491 133534 114937 105107 139061
25680 139061 136315 44982 69283 163984 236396 176752 -1754 -104798 -116200 -126714 -65101
25669 -65101 -90979 -59874 -34216 -66585 -113731 -126615 -143842 -68318 50163 103945 81268
25658 81268 -5870 -12344 31893 86240 62310 111 -6280 -87955 -108273 -167088 -79078 -43000
25646 -43000 -78333 -54794 94218 11705 -73198 -993 45970 91938 100967 131331 130522 25024
25634 25024 -2804 29588 -35633 1074 35760 12913 59989 90154 159358 64804 -50365
25623 -50365 -62762 -148186 -124123 -89284 -45368 11918 8046 -24949 43379 72404 60402 94314
25611 94314 77127 6179 127355 109874 -44727 -108911 -3120 63619 73696 143801 114163
25600 114163 148318 133509 183766 274331 134726 48084 73924 -36944 -38287 -104537 -1943
25589 -1943 13730 10232 31613 43328 -97391 -127783 -121435 -91572 -37066 -24224 34805 192687
25577 192687 82942 -88619 -92716 -166428 -255232 -171501 -93553 -94456 55205 34150 67062
25566 67062 167908 70361 -44911 -80930 19622 77878 61132 143432 84907 -154648 -163595
25555 -163595 -20825 -46594 -74653 -159570 -101301 -37310 -118166 -136254 -114584 -161026 -159658
25544 -159658 -55776 59950 117295 49161 -50488 -27204 36669 49500 40989 -44336 -143957
25533 -143957 -133188 -221514 -134261 94655 162939 112995 38221 -8899 -44445 22924 7730
25522 7730 -38028 -3303 -106702 -158885 -91635 -38900 -37512 -52041 -81295 -108934 -118931 -95222
25510 -95222 -75513 -124082 -175344 -112730 -16965 94229 97374 155732 40252 -50074 -53230 49154
25498 49154 83546 79216 -32770 -141226 -216544 -306546 -302542 -226829 -97022 -79473 -63211
25487 -63211 9167 -103529 -103022 -111393 -72070 21331 8074 50632 107389 107547 86502 12017
25475 12017 18347 84305 48230 -32873 -146041 -125987 -51387 -90255 -172120 -190735 -104947 -36197
25463 -36197 39995 -13843 21356 32151 -4526 -42789 121565 143507 98960 -5996 -22889
25452 -22889 -91429 67008 29654 -62254 -2319 -46337 -80254 -20427 30304 85694 77181 5088
25440 5088 18375 -33270 -91523 -65002 18849 132003 148684 154822 201712 163575 179250 207071
25428 207071 138456 28755 21141 120839 148988 169979 136721 114861 98966 71361 53640
25417 53640 -10136 37067 33960 80148 -33007 -85348 -183044 -319100 -265023 -154168 -17656
25406 -17656 53397 165966 -4196 -101416 -42600 -86076 -77439 -126009 521 6693 846 24718
25394 24718 68088 11531 56749 88967 42168 8131 19121 -55396 -42923 -42537 -90056 -152236
25382 -152236 -230995 -196887 -62174 -47847 -160281 -94000 -115121 -147683 -245489 -163345 7322
25371 7322 187036 226040 97076 42193 88199 22590 29038 50619 -12923 161102 310497
25360 310497 248014 177315 52522 -9006 -17164 -134683 -156244 -236137 -269891 -185623 -59578
25349 -59578 -29676 -47226 -63138 36796 95758 185754 180814 86649 12443 -44617 -114124 -73920
25337 -73920 -86995 -38357 -84524 24568 18553 -17781 24831 21470 35734 59786 60395 18591
25325 18591 69466 132287 60778 -57361 -116301 -58519 45352 -14272 -57561 2606 31248
25314 31248 65235 49547 10394 -126788 -107761 -82044 2205 83426 18353 29162 46804
25303 46804 59520 26031 89954 67758 67276 73391 14595 55556 58788 95795 52497 31631
25291 31631 162049 193242 136911 55165 44469 115593 109930 221110 210475 66947 -25859
25280 -25859 -4644 -48355 -746 19688 -48171 -79816 42646 42672 -809 30558 52025 83341
25268 83341 72153 41625 8533 96 -80721 -217348 -197548 -95651 36708 74080 67905
25257 67905 70798 -99775 -189291 -88053 -43914 35885 88882 181943 56576 31420 51273
25246 51273 68284 55062 4146 21160 -11964 -227081 -187266 -124586 -106941 -22105 -10370
25235 -10370 -9464 -44279 -79190 -801 80071 32299 -40600 -33445 69659 3748 38339 92051
25223 92051 31409 -37972 -44182 -76625 -108636 -102441 -175713 -177465 -94406 -3443 -13442 -57067
25211 -57067 -51683 -54120 -36005 -46811 -112083 -165702 -49340 -85780 -72038 37339 45295 39569
25199 39569 12045 2580 122898 119190 50512 40078 8917 -59592 42984 113890 60740 -18291
25187 -18291 -34717 -104125 -121173 -77520 44148 48196 -4131 -77837 -145554 -161010 -1621
25176 -1621 -59792 -129877 -86193 104900 153160 169260 110002 46866 -16771 -18074 -91787 -32183
25164 -32183 27769 77988 -36630 -163839 -100115 2870 17882 -65547 -67557 -81034 -109156
25153 -109156 -132836 -153829 -253394 -231635 -241034 -203417 -51822 38112 81707 146066 140160 73737
25141 73737 73967 148205 30936 -51182 -38808 -17452 -19237 -121348 -174165 -88200 -136919 -252603
25129 -252603 -168796 -135531 -58283 74415 76852 67283 -11017 -122292 -104975 -117293 -81749
25118 -81749 5336 81589 115715 81931 37235 -20951 79766 119029 112562 97733 66963 -9909
25106 -9909 -31518 -1138 42440 -53499 -66975 -38892 6639 67310 60371 55458 131558 187063
25094 187063 165675 237402 240459 277117 267810 208261 89336 59776 54296 -53378 -87138 -245183
25082 -245183 -169814 -51053 18687 22686 98250 315 1003 -102308 2294 -11944 -169795
25071 -169795 -235987 -267329 -308925 -168645 -9900 55408 26129 -43644 1617 -28316 31887
25060 31887 76443 18252 -171138 -332323 -328440 -124923 -9164 -80773 -104529 -14199 52176
25049 52176 26471 17059 21651 -28454 12492 -50481 -37707 -32398 -96878 -87426 -7003 -27773
25037 -27773 53304 124342 -50681 -25757 40036 37383 -2394 -376 -19069 21136 137110 19631
25025 19631 -82667 -41700 29149 23291 -105555 -114979 -200543 -291423 -264547 -230673 -111220
25014 -111220 9942 -44737 -69901 1153 154579 198851 46559 -96429 -146929 -199583 -32668
25003 -32668 14239 -27321 21376 -5564 -44131 -81223 -72833 -14029 -55088 -9074 -39294 -161612
24991 -161612 -148594 -67585 -113035 -104905 -120142 -9298 21369 -13064 63573 79490 1292
24980 1292 9366 18282 -19024 84309 57073 -2407 41833 -81539 -186792 -208207 -259364 -165036
24968 -165036 -89654 -109144 -154965 2441 50364 45860 52270 101047 -14812 -181592 -110009
24957 -110009 -121426 -201779 -192370 -117875 -7518 -55633 -55695 86331 107296 -21589 -12006 28535
24945 28535 -38183 66323 101342 -50684 8687 98339 82439 48851 -119964 -50693 13429
24934 13429 -73174 -145796 -38178 44862 41956 25723 36778 75859 46262 8834 -15557 -58957
24922 -58957 -44452 24185 -24946 -87863 -180786 -256738 -188539 -20720 124940 162445 94626
24911 94626 37251 -6669 32433 -48542 -104168 -52134 67287 69508 63849 40004 -5557 19625
24899 19625 20875 -25798 -8752 153487 272953 148814 -99921 -236632 -126701 -129570 -152024
24888 -152024 -164850 -66766 -35355 -29620 -113067 -35954 26852 -102730 -267831 -293390 -154782
24877 -154782 16032 124885 68129 -31985 -144150 -188493 -148731 -203111 -220446 -129222 -63154
24866 -63154 -175159 -184391 -197118 -121288 22978 91871 1962 -196911 -189261 -118926 -57454
24855 -57454 43105 -7104 35732 32808 -47826 -10840 -46583 62757 -18475 -234189 -264763
24844 -264763 -198425 -185567 -103859 -84012 -4209 5115 98900 83194 96324 43574 60353 64513
24832 64513 -59373 -32599 97192 15425 12528 -91251 -108912 -17293 63366 125284 104511
24821 104511 167120 295925 205972 23784 20383 40345 51422 -71748 -111802 -115885 -18198
24810 -18198 17965 -117663 -74992 -20760 33678 106179 55714 -9093 -118960 -177846 -56856
24799 -56856 11462 1447 22962 14267 9836 -38380 5364 9781 -112888 -10492 97822 77996
24787 77996 23451 -96504 -25023 50459 27385 -35738 -102903 -108534 -11214 72972 33732 66297
24775 66297 205925 186625 73984 113097 91227 32503 -25625 -3957 -48625 -156260 -223521
24764 -223521 -130369 13383 33307 4159 -88523 -63733 3118 3403 99899 162013 127487 41711
24752 41711 -64053 -40114 56332 138295 102389 130296 45067 72650 111654 109167 154829 255490
24740 255490 135493 -2766 5606 54531 -38260 -20581 117502 104910 19119 48551 32032
24729 32032 6856 -34867 114571 201945 188961 126477 103235 92936 121762 111933 -35687
24718 -35687 -139726 -143503 -150358 -41769 45378 -36145 -175308 -175690 -224218 -131615 51873 78000
24706 78000 2336 -58488 -87957 -81218 -66779 -2068 -55266 -120903 8796 102485 7427 -59351
24694 -59351 -187360 -182132 -130112 19253 -7125 -30128 5402 -36320 -131135 -132268 -73033 -16491
24682 -16491 -8450 -76054 -135742 48665 119290 19220 -21793 -64446 -2384 75685 52400
24671 52400 -70109 -68536 -24978 -55181 -105516 -82745 -150670 -186199 -193629 -226778 -186359 -220819
24659 -220819 -120439 -122817 -98375 -97328 -117954 -134993 -11529 31399 55281 67392 83171
24648 83171 172209 225435 46516 73360 159616 109021 84956 278220 259512 139771 73484
24637 73484 -19894 161 -75438 -148679 -80530 5830 38570 -114653 -232180 -57202 5387
24626 5387 -24881 -84590 -163960 -97092 -99813 -81629 24938 45464 -15896 -89645 -49337 61114
24614 61114 48053 97304 61474 132468 150503 98827 59233 -39656 -94869 -37524 23849 -2626
24602 -2626 -21882 39583 62516 50498 -922 -25983 -137103 -105070 -49488 -200018 -195995 -138888
24590 -138888 -11237 86571 -30320 -163044 -151757 -120968 -78524 9337 111418 125352 42678
24579 42678 53703 -24256 34515 157243 71369 -107647 -77155 47800 25227 -52685 -50267
24568 -50267 -69088 -46423 -171936 -248246 -181650 -146462 -56262 14834 138798 190890 97330
24557 97330 172238 200474 100019 -68628 -124615 -47246 56486 175169 192041 99263 16510
24546 16510 71690 -55952 -144632 -137751 -48808 8175 37373 68074 134011 71293 36427 126543
24534 126543 80097 12117 11747 66485 87539 36618 19687 -51036 50801 140178 71504 157000
24522 157000 197751 176396 190877 180280 13592 -27075 -107990 -169436 -64003 -37944 95894
24511 95894 184745 75725 14645 -40208 89005 188993 111930 81436 17029 6652 15136
24500 15136 -34365 -48609 -13974 -16357 -91042 -21950 46070 -116809 -209028 -85637 -68954
24489 -68954 -112316 -48002 -32203 -17476 37745 101139 39629 -18681 -24361 -6159 -113312 -35769
24477 -35769 78998 145739 157882 -9713 -117251 -95943 50120 -18851 -115632 -114925 -42959
24466 -42959 57938 69759 78580 34799 -36710 -77745 -62987 26593 12863 -58097 -149560 -127625
24454 -127625 -78260 -82345 -62441 -40413 -97019 -207402 -225829 -155088 54280 177864 79898
24443 79898 111402 87851 -34828 -233321 -232357 -192474 -134979 -80102 -42745 56051 80199 -21062
24431 -21062 -172526 -174199 -117032 -103097 -162032 -210290 -143007 79854 116586 -25187 -1106
24420 -1106 -23474 -47226 -41903 -98052 -74259 -96932 -124737 -188261 -76356 12576 -24718 -59490
24408 -59490 -109721 -197367 -194959 -153339 -70466 -56153 14952 77713 32071 30631 27835 -19129
24396 -19129 -124639 -177395 -82861 -141409 -182031 -6025 71591 2394 -56673 -59783 -73766
24385 -73766 33982 121799 33370 -38623 -37664 -18022 -19707 10864 -43829 -111377 -153740 -71573
24373 -71573 37195 4740 -27230 -78727 -188511 -218519 -44427 106652 98996 36190 4125
24362 4125 -58680 -104405 -82577 -80403 -43109 74398 162304 144287 106046 82522 143872 157750
24350 157750 45553 153054 40282 -144323 -188433 -144114 -17091 15488 115147 105468 126338
24339 126338 162869 38978 16402 118319 116965 -92946 -175740 -151545 -30658 -75923 -159452
24328 -159452 -241322 -98539 54728 12419 -4903 -75080 -140719 -135980 -68378 -16773 54243
24317 54243 98769 51851 -70056 -161637 -151533 -23471 14356 -151873 -150491 -102002 -42742
24306 -42742 -79948 -79180 -28824 37460 20874 -138009 -144685 -163399 -136362 -56063 -109737 -17872
24294 -17872 -13208 -134121 -215541 -171083 -45476 21757 -61960 -137628 -70966 -69459 -48326 -141074
24282 -141074 -123480 -61705 -15748 27887 13558 115474 28100 166445 146076 24361 -72203
24271 -72203 -110483 -104576 -63497 -37313 -61804 7360 48292 16788 87239 59605 121714 160308
24259 160308 28608 40637 -34604 -246 17141 167299 113247 90799 36209 -52751 -16146
24248 -16146 51213 -8702 -164092 -297647 -257383 -112457 -44039 -96950 -67729 -1154 92321
24237 92321 46538 128431 154397 152916 76896 -93316 -29849 845 -52641 -137917 -14606
24226 -14606 16516 78319 -3293 -98474 -160309 -119384 -90344 -91594 -160296 -202364 -163198 -39365
24214 -39365 -122635 -178453 -77519 -11370 -174156 -117174 -46750 -100830 -211075 -176895 -31985
24203 -31985 -54017 -284733 -290862 -159890 -44058 -52302 -106717 -1755 63356 -26338 -107899
24192 -107899 -171237 -36554 54174 14498 -137963 -92770 -72513 -52143 -21650 -63375 833
24181 833 -33210 -80327 -71671 -70341 -35324 -45759 -125976 -74360 -19399 -167317 -159080 -68303
24169 -68303 -47260 -47305 -185213 -207111 -150771 -14810 12632 114722 122439 164332 -18846 -112567
24157 -112567 -113983 -62660 -98473 -110398 39002 95891 56827 -18159 -75317 -18971 -31298
24146 -31298 -21847 -42468 -28394 89019 220488 234270 108710 157242 100122 5004 -11694
24135 -11694 -95526 -178037 -187734 -166189 -222233 -207164 -88101 71648 61006 51148 33648 -2653
24123 -2653 38870 39260 44655 127484 71044 -51626 -89462 -98249 -143893 -208779 -201359 -198616 -151147
24110 -151147 -61071 -30449 98036 111867 -72306 -133396 14603 142785 91949 -24698
24100 -24698 -106636 -187097 -154345 -63349 -43490 -24200 16186 38905 122365 103774 81812 52740
24088 52740 -38051 -90734 -113024 -53533 28151 51812 11796 -9564 -24580 38946 39590 -66486
24076 -66486 -105367 -76206 -1658 39048 -140436 -100528 70465 46603 -35078 -69194 -32721
24065 -32721 -35457 -90804 -133329 -176854 -182328 -144462 -70887 -44089 -82636 -47004 -23770 24732
24053 24732 -7590 -48926 -36264 -36433 -63913 -143923 -167986 -20505 90028 -133792 -296660
24042 -296660 -246239 -40998 95930 77264 -37981 21446 63202 25581 -66935 -174283 -70992
24031 -70992 -76968 -105521 -21936 55842 156902 150397 101865 -50333 -18822 49018 70590 72316
24019 72316 31606 73353 125802 67342 -114599 -125791 28131 79010 83632 44027 289
24008 289 67244 90257 122024 129609 16784 -30125 -25345 -89523 -150824 -222885 -153587 -102906
23996 -102906 -61631 -132944 -217464 -12049 47470 1510 -52168 10761 -9455 -42555 -7117
23985 -7117 -35296 -28011 -17432 -40921 -90310 -131816 -50657 -96015 -71710 -55268 26529 99850
23973 99850 24343 -37579 -122606 -124645 -182230 -137043 -111549 -94389 -63544 -29940 -56708 -112977
23961 -112977 -166818 -169829 -128683 22316 38037 30774 -23079 -47790 77179 66177 138845
23950 138845 132792 135523 53768 -1953 -61664 -154590 -169150 -122457 -98886 27904 92457 16754
23938 16754 1905 -103650 -156840 -33884 -20103 32938 131257 181224 127636 142117 139073
23927 139073 166683 113951 112065 139440 67594 -8876 2906 -14405 195728 200454 129134 86538
23915 86538 100871 58100 17337 -93872 -175063 -106789 -92650 -93737 -114403 -101144 -119026 -137920
23903 -137920 13348 110685 64291 5597 4792 50613 56166 83428 12866 -145335 -197260 -106696
23891 -106696 -57191 -105625 1992 97962 7656 -68778 -44109 39568 6013 -76006 -74914
23880 -74914 -68643 38333 129910 8957 7467 -1170 -37878 -104210 -73596 -151609 -142456 -52845
23868 -52845 -38313 12719 9242 32943 45859 -51365 -86544 79393 170550 122784 140847 101166
23856 101166 -94566 -71625 -12697 -33872 -4214 -54879 18583 -157621 -192644 -174719 -80155
23845 -80155 -19416 -97995 -114985 -26276 -98000 -40546 -71786 -116854 -79073 -29348 -55510 -131486
23833 -131486 -179805 -165284 -170583 -130646 -26518 -62439 -221717 -259918 -163118 -38896 -31589
23822 -31589 38558 64788 22935 -40840 -10297 49660 50700 56972 -112395 -155995 -156197 10859
23810 10859 68274 47608 -7059 -52285 5888 -68342 -145697 -133334 -129287 -73434 -80719 74807
23798 74807 137035 223765 197368 184432 217078 158512 104833 72553 -55308 34484 -48832
23787 -48832 -225903 -193220 -64371 -16226 128891 107346 26060 33094 71505 94126 14207
23776 14207 110429 212001 91151 -11076 -60210 -105525 -116875 -78345 -131190 -126292 -7465
23765 -7465 -8314 -85154 -131629 -92848 -38351 -27695 43991 102251 77915 133003 65914 47992
23753 47992 -39174 -27946 -31661 -67931 86254 133974 86916 17401 -97481 -70883 -108635
23742 -108635 -61216 -148111 -233573 -272642 -180316 -130813 -287443 -313694 -162734 -155122 -182987
23731 -182987 -133421 -158410 -52315 -162432 -240214 -147478 -100452 -224674 -252232 -234217 -185838
23720 -185838 -107819 -69192 -82519 -47520 -46481 -66657 -186921 -179986 -120172 -111714 -83516 -21525
23708 -21525 -22083 76197 156649 59850 27242 63512 -29230 -27789 12003 114675 119207 56983
23696 56983 78527 -34054 -180777 -185101 -134989 -214972 -183176 -89983 -82902 -47205 -16051 -23685
23684 -23685 14527 -6854 97230 197501 259498 159953 118892 128022 104557 17988 29398
23673 29398 25339 71512 -36659 -39482 36594 76315 65833 108167 77148 -106308 -204308 -101065
23661 -101065 -32007 -4437 70375 54625 52279 -41242 -60822 -6200 70654 -9633 -61350 -77369
23649 -77369 -80054 90888 127054 52299 54268 -12788 -24711 36438 14772 -34122 41120 98332
23637 98332 29597 1636 -33595 -14642 83488 220133 186912 99365 28124 -92484 -75329
23626 -75329 -55184 -1739 72758 114360 48192 22089 60949 80027 38342 -13161 71863 74916
23614 74916 40866 79412 65308 -73122 -164797 -69368 -63988 -59304 9394 33548 122183 103281
23602 103281 -27409 -3132 35024 118804 104330 34020 79267 65238 -5096 -82530 -25985
23591 -25985 25487 89334 40021 -152431 -227364 -155503 -89139 -39181 7849 -99407 -120362
23580 -120362 -60994 -43882 -83221 -134188 -128068 -47643 -122924 -199442 -240784 -108134 -2437
23569 -2437 -63806 -89624 -29712 21482 10487 42586 -23475 -146642 -185028 -72162 103257
23558 103257 273204 205000 85885 66853 -16116 -78688 24322 -74650 -100265 -48299 28372
23547 28372 136375 56743 -60963 -22371 92701 139834 93270 -8956 15067 13339 -81228
23536 -81228 78968 60417 -10519 -23076 -38619 -17386 -14189 -107688 -97648 -90417 -129634 -22722
23524 -22722 82815 109912 119805 139730 218527 143667 -17366 -178693 -164714 -167376 -100232
23513 -100232 -83382 -54900 81716 97641 213996 156377 133278 88840 49168 -49371 56705
23502 56705 148107 100392 18689 82562 12489 -88874 -7165 85923 21783 -85716 -136300
23491 -136300 -173054 -159513 -59170 -45352 -83576 -136518 -85871 -11067 32219 -28220 -82564
23480 -82564 -6312 100223 57164 -189229 -211965 -180391 -68630 79238 87349 112316 114225
23469 114225 41494 103495 260933 110615 -176833 -183860 -116306 -20995 28197 19100 163350
23458 163350 226233 43392 -112597 -196432 -120540 -119741 -38488 -23213 -51124 -12196 -80075
23447 -80075 -150926 -108109 -57825 9755 73271 120531 88317 98381 -19661 20814 137000
23436 137000 136039 129312 216341 164330 35966 -56957 -94178 -63462 -58361 -65651 -2217 -20850
23424 -20850 34668 122589 176718 164053 96630 54315 67390 80688 175329 209012 248963 166623
23412 166623 168343 293532 262571 78467 43812 -5152 -602 68323 139047 204610 197034 196508
23400 196508 275759 254708 163291 95759 27117 -91937 -101594 -71680 -200258 -271848 -144899
23389 -144899 -63302 1818 -68062 -70080 -100773 -14696 49044 89853 157474 114467 168391 118150
23377 118150 -26842 -92926 -4134 115567 42068 12688 115074 83894 -54458 19341 49187
23366 49187 33930 58797 -8101 15888 124275 173147 183807 109966 111147 54671 50625 206120
23354 206120 183067 119549 155148 135588 -34638 -141216 14771 39231 -34527 1030 45275
23343 45275 27934 66097 26217 -13529 34250 89532 58510 -2725 87270 256987 336809
23332 336809 242011 97882 -43636 -148704 -119496 24901 -6106 62691 61116 109289 20079
23321 20079 24997 72349 70953 4172 -30442 -83429 -119724 -94981 -143390 -143654 -40708 -83599
23309 -83599 -110719 -105914 -5551 72292 54030 -2280 22836 -49487 -125544 -48584 -63650 -79950
23297 -79950 -115764 -72265 16652 23878 -26087 -68438 -101572 -75511 20371 205710 181106 160554
23285 160554 171670 75558 178861 181457 82777 82251 134488 141977 76508 66855 116912 117929
23273 117929 45978 23830 -61684 -12293 -25116 -92205 -90409 -69730 -21175 -1239 29639 118173
23261 118173 76841 77986 289 44486 168845 120013 -3650 -126469 -157285 -47926 -4933
23250 -4933 -37894 19580 19646 -80562 -79662 -86205 -99657 -68922 -17455 -57444 -64853 29553 119719
23237 119719 143828 113634 63618 20444 -3898 -15596 52283 9027 -78095 -24988 -92638
23226 -92638 -55233 -3648 37890 165545 328839 345588 329091 279572 140578 55253 10514
23215 10514 -120258 -154485 -135471 -29281 -43637 -21020 -57457 -121631 -30593 32248 -11198
23204 -11198 -91281 18731 56363 55788 35656 8426 -34292 28941 44133 22442 -22406 -97657
23192 -97657 -31277 -31341 1069 42320 77113 28959 -28663 -112405 -297533 -301254 -226145 -59212
23180 -59212 45669 56132 -40911 -43767 36093 16974 52335 185553 124212 107881 99613 36436
23168 36436 -115396 -65384 12154 -22471 24610 83085 19663 10293 3812 24123 93528 75406
23156 75406 19255 41217 41381 22479 -16550 -78240 -73364 -27477 6666 77407 -6169 38573
23144 38573 55957 -12176 -25055 -21636 -68188 -86000 742 -39816 -113826 -115702 -98804 -176560
23132 -176560 -150261 -70510 -7720 -82941 -134598 -71606 -103211 -123271 -52495 95330 86851
23121 86851 113708 92476 29442 59299 214710 110458 -46083 -25360 -97146 -27703 74191
23110 74191 114706 3348 -84941 -65918 -2796 -57101 -95937 -20786 57069 94241 55434
23099 55434 16602 42542 5925 34567 -26197 88134 254349 214206 198561 126354 145001
23088 145001 48224 -41355 -45403 -77973 -67019 -138086 -147768 -48864 6236 -52423 -84855 -72007
23076 -72007 -128612 -281628 -178831 -19820 113978 128940 -62584 -127141 -125456 -129422 -112964
23065 -112964 -131704 -104571 -22828 -107172 -185403 -246231 -133997 -151610 -171672 -187390 -146595
23054 -146595 -115107 -78333 -25460 23547 -33349 -71637 -116367 -148060 -153781 -185199 -102419 -32623
23042 -32623 -32344 -67497 -9181 -23034 -11919 54184 74145 36883 69106 13840 73892 273206
23030 273206 313607 229933 237130 25914 -105504 -78883 12846 -35039 -106629 -47154 44767
23019 44767 46571 -6465 -15823 -35317 -6571 56967 56498 -43855 -74025 -103261 -121624 -69520
23007 -69520 -108483 -176267 -228726 -198281 -144176 -138470 -153055 -188201 -118149 764 36220 -52905
22995 -52905 -199021 -122548 -47069 13917 -104966 -29180 89822 56021 -50392 -145289 -49752
22984 -49752 -19466 137913 125844 109035 35633 -3073 61237 -56494 -15956 -30127 39849
22973 39849 -18089 -132143 -182234 -108357 -61908 -104782 12843 7360 -57696 -118604 -133836
22962 -133836 -90599 -177426 -175756 -108080 -15102 44490 -68866 -153360 -117523 -48465 45907
22951 45907 86768 -37897 72604 119555 65657 96681 55041 1354 -96299 -129205 -92065
22940 -92065 -42187 -69276 -92105 -75730 59279 68725 -49938 -106873 -130299 -130399 -153347 -193249
22928 -193249 -140843 -163680 -158897 -96360 -184731 -151358 -107851 -100945 -77834 -47067 58986 26111
22916 26111 -39065 -114173 -142625 -88119 29693 10889 -8203 54088 132354 60437 49662
22905 49662 7699 25284 71579 54673 -56923 -32924 -70627 -181521 -36665 128806 87475
22894 87475 103477 8266 -116996 -172833 -116445 6882 134491 226147 191517 149255 -36773
22883 -36773 11929 20959 32482 73532 48169 25489 58018 -14803 16444 -50076 27761 99848
22871 99848 154801 171577 188489 165952 106583 46938 26517 26398 22169 129062 188163 29608
22859 29608 -27664 23507 -13439 -92667 -5125 -27912 -153896 -81362 12464 52843 5928
22848 5928 27731 57701 24745 -16087 -55035 -5484 50066 92704 27559 62832 176938 139984
22836 139984 110600 116741 165187 239093 231760 217521 250673 171662 18747 -67754 -65832 -1662
22824 -1662 -4006 -36912 -5873 25205 147354 139643 131312 -3830 -112677 -21179 49888 82255
22812 82255 69873 8716 94451 114686 101401 177044 231186 209848 121937 79219 71192 -23574
22800 -23574 -102837 -33893 -18701 -36548 17399 77275 73741 101472 120082 -11415 -88097 -21973
22788 -21973 81220 173373 138831 54412 -87318 -167451 -97200 -40028 -86692 -162340 -194474
22777 -194474 -111512 -171916 -137999 30095 -36896 10190 -81056 -241186 -181065 -46831 -55049
22766 -55049 -113117 -109456 17581 23035 99403 120098 42669 -8335 67909 119874 20906 -775
22754 -775 22960 -58250 -16429 21185 157459 224917 218805 216033 73790 -357 -28271 -96531
22742 -96531 24145 151523 200309 147787 120457 -69973 -194964 -160088 -109737 -87283 -154255
22731 -154255 -54929 121538 121472 164584 100525 80871 66525 -3414 -102743 -192128 -192273 -142029
22719 -142029 -106373 -126956 -112242 -146963 -107466 -59117 19373 -42687 -143458 -142023 -71664
22708 -71664 -16932 -83214 27188 172464 158294 92257 -9569 -60053 -91297 -83817 -90619
22697 -90619 -93125 11711 98442 135062 117066 38276 -136440 -134178 -17341 73840 119353
22686 119353 -4827 10049 -14612 -151456 -101469 1741 22527 -33553 18776 -9708 -52817
22675 -52817 6479 34129 188854 180914 150193 115194 81825 -45137 -206832 -298996 -186283
22664 -186283 -151749 -113799 -39900 42168 41183 -566 -45335 -81986 5184 21153 67493 90247
22652 90247 133801 115078 12358 -23632 21619 28178 -12782 23866 10132 -58311 -66715 -95967
22640 -95967 69404 132499 90750 131621 181629 106588 -14597 -7063 -26556 -97179 -141065
22629 -141065 -103471 4453 32613 -24984 -75238 -37118 13480 -120977 -165310 -222299 -75837
22618 -75837 -74870 -107778 -157669 -173878 -115620 68763 131472 116283 91690 84774 114507 36150
22606 36150 -136999 -55642 83283 134181 215934 194449 -44892 -122342 -165964 -88895 -8140
22595 -8140 -111006 -205783 -219331 -228093 -150664 -151889 -235657 -119233 -57203 -92116 -48085 11057
22583 11057 -64173 -189562 -103892 54729 26011 -50277 -23692 -6344 6053 5999 -38096 -11541
22571 -11541 -136318 -280612 -244065 -213251 -189752 -133165 -111224 -73330 -95154 -18526 -4965
22560 -4965 6729 -50026 -57007 -11627 127547 12750 41628 150725 220625 107781 -142499
22549 -142499 -224924 -150876 -145887 -63484 -49026 -118893 -178972 -162842 -134883 -133407 -197182 -96558
22537 -96558 99236 131124 -33475 -92125 -21215 -20994 29047 29394 -67779 -30310 -8067 17147
22525 17147 -7199 -18147 -147984 -163351 -234099 -196909 -51245 -103158 -98568 -154475 -212784
22514 -212784 -196187 -64838 -40502 -101087 -91685 -119445 30433 85543 111132 133809 102299
22503 102299 8750 -32463 15978 141497 100153 24514 -8633 -28294 -56455 -38544 -11836
22492 -11836 -24486 -81818 -111510 -70850 -89109 -132896 -186227 -107801 -81319 66578 104875
22481 104875 96447 38467 -8768 -39508 -106876 -120560 -18260 -27203 -107531 -49098 -47921 -88297
22469 -88297 -180992 -178154 -106054 37255 84518 61682 28292 27389 -46894 -73122 -42420 -46493
22457 -46493 -25729 -68969 -101181 40809 68824 108341 118344 -38978 -74712 -118411 -74809
22446 -74809 -14329 81151 130077 80174 -3387 49082 151295 129646 172155 141618 184297
22435 184297 226818 189985 144239 221585 284540 157708 166861 249878 181507 96439 113047
22424 113047 -19195 -21026 -19352 -78932 -193273 -220346 -138960 74323 169376 69348 48146
22413 48146 75740 75752 93941 103838 17290 -28338 29661 125145 155942 146078 -17260 -17849 -26365
22400 -26365 -33481 51058 136595 102500 7418 36476 -65934 -122173 -30647 13962 19476 72694
22388 72694 20120 -12107 -42755 35494 45006 91851 42704 -23915 -125487 -134219 -21956 -85743
22376 -85743 -5169 79165 42779 -78365 -198516 -179396 -141022 -138291 -104772 -94062 -41613
22365 -41613 -34309 -21045 -14050 -46613 -15234 -145236 -143048 -26925 7800 40314 -138753 -120061
22353 -120061 -33522 -72454 -147548 -91274 9327 12768 92651 41963 9736 -15838 -26093
22342 -26093 -75084 -105552 -73381 -70705 -140195 -142299 -53902 54036 115385 73424 28765 40533
22330 40533 -54232 -35544 105186 136461 13585 -73581 -65233 -55484 29095 -75821 -108164
22319 -108164 -60178 -10020 -59488 -206470 -304203 -270628 -152023 -76673 -50607 -34910 -117042
22308 -117042 -166830 -179408 -197801 -146557 -2011 13873 -73760 -87571 -158353 -79972 40864
22297 40864 -88052 -69996 -57608 -130854 -192605 -75693 73755 137811 11884 -28201 -35421
22286 -35421 -93701 -189301 -267525 -121561 54196 108114 37300 55167 37386 38778 46941 15442
22274 15442 46408 -37278 -90026 5912 9535 28547 -4018 -97369 -126952 -88323 -73099 24517
22262 24517 78334 19545 -162118 -111186 -56726 -68098 -29816 -69774 -105481 -63686 -101903
22251 -101903 -113343 -34210 9920 -779 -7655 -48129 38034 32555 78263 136340 117381 12226
22239 12226 56522 182481 153642 74323 25639 15139 -74104 -51063 82222 184374 157749
22228 157749 87625 -22972 -37062 -23647 -79979 -117389 -140303 -158697 6921 -909 -50699
22217 -50699 -149753 -227192 -88085 -42537 -21137 18257 1663 -46985 -36532 44147 66179
22206 66179 -61290 -85302 50846 95067 47503 3293 -32141 -173949 -163843 -42280 41633
22195 41633 41542 -92999 -123517 -145293 -43147 44622 2542 24688 -5120 9915 19628 -28540
22183 -28540 -78145 -224063 -180410 -144348 -166009 -141069 -157373 -220487 -241817 -125871 26761
22172 26761 132126 270332 256420 138549 82712 54757 88789 3377 -136298 -131825 26837
22161 26837 -56809 -110468 -178157 -154892 -85345 -129721 -193673 -133366 -84172 -25447 157761
22150 157761 155808 278397 347744 269010 167669 135237 134945 122214 167865 377 -17539
22139 -17539 -19295 -38271 -149853 -77583 85710 97465 30213 157843 235071 59604 6464
22128 6464 33681 81724 88600 38888 23413 -29574 -76904 -54677 -10923 -20573 -66496 -111050
22116 -111050 -18179 -55616 -95753 15189 154009 184882 168449 37001 -41221 -7835 -77722
22105 -77722 -24890 49680 35583 -3603 39985 81266 65641 77945 62514 21349 15440 -58265
22093 -58265 -13774 64659 128341 98031 83746 90456 116497 114778 97401 86316 -82686 -183596
22081 -183596 -154952 21799 117598 189367 148778 98297 103770 64957 120487 65983 6370
22070 6370 29695 54247 13707 31116 -10135 -48217 33072 26495 -18213 -86734 -81552 -39701
22058 -39701 -44013 -59161 -6060 -92992 -155860 -200951 -252971 -139707 -45631 -110591 -51979 88570
22046 88570 188845 138051 133508 50811 16520 -24457 -62175 59409 68015 -59395 -42175
22035 -42175 73632 121485 60888 -5148 -100167 -177312 -58232 76035 118644 60077 76050
22024 76050 96195 8325 4988 -69779 -32878 80649 -39599 -80567 8560 -21642 -52826
22013 -52826 7682 82304 171379 8784 -32086 72142 50589 -48982 -131240 -92075 -60647
22002 -60647 -23622 -40499 -98799 -141599 -135956 -130373 -81990 -13511 35773 36885 120443 99311
21990 99311 84800 102347 161574 93176 25076 83627 117568 150239 132969 44674 -38401 -8029
21978 -8029 -8459 102135 133955 4087 -111161 -30756 -146507 -82393 95149 200541 133295
21967 133295 187860 175117 171355 246616 277363 175381 90776 113943 152074 180387 184079 57244
21955 57244 20035 -42097 -21263 12334 140217 185326 147565 97033 92081 155779 195579 200901
21943 200901 149235 -3124 -42353 -6330 -62230 -50904 -51593 -103134 -155959 -18484 122239
21932 122239 234114 129928 195638 172102 70025 48039 -15586 -31749 -71149 -138168 -119565
21921 -119565 -68250 -135727 -175100 -80626 -53615 -67390 827 23774 34588 152021 162373
21910 162373 76784 -4300 -71535 -23654 90004 139926 66172 59358 230276 167929 -11242
21899 -11242 -16911 -50748 -32334 -76826 -137434 -80798 -128555 -120403 -26245 -39399 44779 -17757
21887 -17757 -47052 -90273 -133705 -70900 -33498 -18525 5147 -30407 15862 139034 64490
21876 64490 -28504 -48338 -49177 -64329 15083 -72464 -129028 30909 176791 178431 107785 64439
21864 64439 111836 82488 38098 72848 67078 52941 -80146 -50224 -133942 -166004 -161446 -175538
21852 -175538 -162150 32262 179907 256974 152970 63145 72743 147530 286807 198310 99260
21841 99260 64406 -48232 -160893 -122801 -118610 -129378 -172764 -217542 -101965 9665 100865
21830 100865 135560 55326 4899 28716 113252 97118 65529 7885 44830 -37558 -187261
21819 -187261 -173077 -32747 78481 86295 65031 85256 -8042 -32784 -12737 58576 27119
21808 27119 -125525 -78033 -83672 -107915 -100309 -130305 -83886 -41666 -422 1018 21109 131205
21796 131205 162089 187818 174623 153947 81265 -82467 -180779 -140217 -53017 -133468 -97896
21785 -97896 -105259 -7944 -80751 -137499 -61426 -75506 -89363 -114481 -78024 -107376 48472 109937
21773 109937 48053 30526 22045 116580 192998 152830 204621 334190 203155 40541 -84091
21762 -84091 -40505 -60259 -80595 -34984 -66100 -85833 -88574 -48486 -44577 -45617 -38971 -30434 -48337
21749 -48337 -4298 234298 279444 -739 -55578 -43207 -72061 31789 -87366 -28828 117228
21738 117228 82438 18706 21921 196529 274612 132427 -16152 -148161 -276838 -190216 -131834
21727 -131834 -116731 -119030 -186867 -158499 -136406 -170089 -116380 -148914 -187696 -147563 -49738 -23714
21715 -23714 -3296 38296 60365 113499 132603 235568 277122 194616 68005 -6852 -103086
21704 -103086 -9369 -6963 -62315 -81788 -137667 -83999 35601 57418 67350 100722 62231 122259
21692 122259 36805 26758 -113993 -271588 -159413 -30546 -25122 -18563 -52973 -100332 -84945
21681 -84945 19927 -18579 -28571 -57551 -119844 -187616 -94822 26589 40921 49185 69361 48042
21669 48042 -22741 -31538 -113339 -100939 55965 -23359 15187 86643 -38063 253 103511
21658 103511 95900 94066 14265 11901 -7139 -11045 26485 -17527 29136 154191 120794 25622
21646 25622 49389 97899 31546 51389 -6859 -31544 171 -4331 40272 51086 8846 49979
21634 49979 9259 -40719 18427 111069 84777 57031 30464 54554 65153 57633 136809 184064
21622 184064 136082 63132 21420 89234 192506 132298 41190 47123 63676 196243 147339
21611 147339 68912 150797 131931 107224 124037 60906 35643 95957 202509 181146 113593
21600 113593 100658 -23336 -28286 41452 55804 -2051 -70502 -37396 -9830 100639 167965
21589 167965 80760 -45953 26948 164068 210286 197285 109768 66357 14016 -4578 -20239
21578 -20239 33646 38550 -16912 -112814 2920 56599 7441 -66959 -94930 -3506 -37198 -52718
21566 -52718 5711 26887 -69691 -110874 -137261 -83811 -4149 109561 158164 90061 -48
21555 -48 -14620 -17748 51842 144115 213928 153648 131246 97556 38362 -99437 -204253 -184121
21543 -184121 -196555 -93206 84086 45819 74100 52590 4638 62459 -8134 -136957 -213004
21532 -213004 -214248 -177827 -99365 -39935 11074 30103 -19031 -42926 61582 144270 230095
21521 230095 229436 135816 598 -124712 -131345 -107898 -50579 -11711 -81542 -183006 -149970
21510 -149970 -78597 32999 2659 62764 -10755 -102524 -67445 -79734 -5163 -37554 -82687
21499 -82687 -59795 126487 222890 185438 137878 81069 73786 20283 53316 7417 10379 -52237
21487 -52237 -35756 -216 73897 71918 -72527 -102356 -91134 -154891 -219442 -203241 -141717 -107730
21475 -107730 -7526 68231 50286 5528 62437 -48438 -83733 -1712 48415 64167 24258
21464 24258 11959 -13079 -39582 93267 130785 249789 348625 282257 196324 139250 166342
21453 166342 188783 131179 87484 66823 116048 130798 17057 -142855 -153453 -207214 -207005
21442 -207005 -157613 -188820 -229971 -117995 -63204 -155472 -67562 152637 93090 105875 88671
21431 88671 -101061 -190602 -137802 -66103 -78486 -114668 -132063 -57389 93811 86244 57659
21420 57659 -21126 -94765 -79075 -122936 -12766 52488 -37365 -113132 -154064 -94198 -68459
21409 -68459 86260 126402 19747 17124 119545 61752 -4718 -39552 -152129 -122635 -154493
21398 -154493 -232490 -328430 -334896 -285481 -150641 -59094 -44710 -212644 -144301 -45798 107293
21387 107293 128962 78040 59358 22129 -78150 -102798 -134659 -197376 -164251 -136320 -183861
21376 -183861 -83053 49168 27941 -199386 -107128 165759 233493 182285 138001 23045
21366 23045 -15741 -37010 -127532 -155088 -65651 58520 134324 144156 120504 111663 17757 -29466
21354 -29466 -61883 -111584 -76982 26398 -22299 -3747 942 23739 -20130 90682 92429 13317
21342 13317 -5680 4137 -54070 -7098 -17486 -203143 -162319 -81770 14129 125768 157895
21331 157895 162512 188162 228141 133006 60746 -3614 -16152 56599 227054 290040 171706
21320 171706 -28760 -58067 8306 26271 12164 43359 85940 35387 9747 74965 58622
21309 58622 103114 53061 122322 277640 259418 153540 46595 27859 45704 62282 -48848
21298 -48848 -13601 22289 -56918 -242921 -238653 -103809 -188192 -219722 -185979 -110484 53813
21287 53813 97506 41688 41655 64155 58973 -6354 -101486 -99456 -58541 -65309 -133891 -195323 -164391
21274 -164391 -180216 -18224 56624 66080 -53334 -109635 -64564 -122484 -98991 5216 81074
21263 81074 66501 87532 139025 158666 202171 229856 167344 152183 122797 76897 86318 110780
21251 110780 59142 100595 221088 255844 68887 21402 44685 4636 40815 65315 8601
21240 8601 -19904 -30843 82086 48235 -37426 -12254 35720 -15718 2409 31933 7917 -77034
21228 -77034 -64348 84374 194389 94311 -45203 38295 13617 -20435 72526 47398 96195
21217 96195 91528 59584 64599 8712 5036 77506 150024 158258 51625 22218 6706 -17667
21205 -17667 50696 128410 97029 50185 88872 205874 59939 -2102 131575 178453 130725
21194 130725 96396 67700 137466 51507 5355 18499 13879 46292 63049 49350 71358 -28625
21182 -28625 -90369 -94813 -54020 35652 126678 222766 127824 63777 -59062 -79039 63728
21171 63728 83221 -93842 -118517 -79458 67131 54420 -46471 -17718 -105375 849 124357
21160 124357 114064 78786 41820 7858 95852 151789 130780 163299 178521 153096 32370
21149 32370 39493 41895 -12581 -53221 6751 60227 26575 42234 24984 -4993 -25399 -78415
21137 -78415 -27923 -16300 -9462 43351 28597 -108019 -59797 125390 162358 94026 10621
21126 10621 68584 27809 -1991 114850 173666 281941 256160 308929 372342 415815 364230
21115 364230 337604 181809 114187 131711 160780 222015 206664 82846 -51794 -81214 3897
21104 3897 10608 45164 57936 196703 235188 19963 -56102 6524 -34261 82786 106046
21093 106046 -5618 -15863 55697 107170 156359 228109 182850 107806 75913 29977 90130
21082 90130 171251 279046 213770 260538 158185 110676 168 -97238 -87110 4438 39508
21071 39508 -42975 -24150 -41709 -158533 -108552 -61182 -55023 -38510 -73443 -98352 -104406 -76403
21059 -76403 23856 48415 62424 12490 -25613 -32162 -99565 -89022 -47217 -89640 -137694 -8439
21047 -8439 1803 -101037 -144953 -116630 -39916 47362 14531 -85390 -85816 48045 107485 27766
21035 27766 -24814 98402 136230 77351 170068 176059 131067 139020 80988 31766 28144 52774
21023 52774 19424 -48971 -120594 -98229 -157151 -137979 -82013 -98155 -213669 -172890 -57717
21012 -57717 -5503 6932 -40786 -73366 -58102 -58896 -99989 -131287 -94297 -64344 -83619 16908
21000 16908 88790 -20707 -150402 -133700 -83837 -10004 18617 13798 55335 -23553 -39776
20989 -39776 -23886 -162452 -157847 -83720 -166438 -105287 -22750 -20411 -15287 -9627 -9659 -72450 -100403
20976 -100403 -86749 27116 103439 150832 184917 179050 26799 -80173 -97262 -121247 -127208
20965 -127208 -114360 -94285 -30534 -62396 -43298 64438 55071 109455 118724 169148 106392 103472
20953 103472 83995 -66734 -92945 25421 184998 277938 237468 142995 13435 -53070 -106675
20942 -106675 -196751 -232292 -172096 -105210 -25596 -33674 44178 28094 -59096 -2691 -20696 -179945
20930 -179945 -186111 -75885 41836 77717 133626 79491 3746 -7101 39157 139274 72304
20919 72304 63685 144101 169655 61711 21745 109503 99707 77553 133874 127841 133065 139433
20907 139433 -37407 -198767 -137534 -106161 -3127 -12138 68300 94176 38719 58995 -12601
20896 -12601 -3099 81998 129685 147766 81414 36907 66904 26921 13128 52489 -23897 24675
20884 24675 -21154 125085 168262 33533 120640 47457 -41131 -30770 25680 55133 10833
20873 10833 18549 -33247 13382 32827 76950 38568 81336 151088 123424 145233 171925 95021
20861 95021 103559 141957 130125 18042 -48818 -47861 24013 113135 122628 292782 355442 305689
20849 305689 241707 284838 257444 169433 256376 312950 469379 563328 562086 595512 748000
20838 748000 855863 819132 859558 946705 1086965 1189637 1157109 1149831 1204298 1194710 1137638
20827 1137638 1269165 1311068 1163159 1076107 924095 874296 854908 718622 643658 704172
20817 704172 730490 643081 490569 526112 578131 472021 443187 573583 642828 887443 938389
20806 938389 836920 857178 955948 1136347 1223543 1314065 1268313 1312844 1451688 1445209 1304236
20795 1304236 1246329 1075822 1060097 1112655 1093032 1002038 677393 454336 424918 370346 315133
20784 315133 138508 72361 110696 144344 58512 111673 103477 153422 32961 -8880 -35029
20773 -35029 21125 148054 179442 25053 -25138 26541 19067 13763 -58533 -81327 -90615 -12246
20761 -12246 158464 167900 18383 -86005 -163684 -165682 -85010 81715 211033 226175 58036
20750 58036 107014 281369 307050 224381 88670 109021 216734 325065 298146 226771 179690
20739 179690 191682 175338 131627 48845 28286 167934 114725 89448 149658 117309 113038
20728 113038 123160 28492 -96373 -72673 -13883 38970 86251 76071 86433 138378 100229
20717 100229 109896 109801 40100 -126610 -102072 -32423 -28902 81960 98888 84878 105565 150991
20705 150991 129899 194123 206722 192728 119656 18254 -49809 -13586 176 -3989 -66337
20694 -66337 -169626 -100826 31682 98202 166900 187182 60486 39245 -19383 42001 155379
20683 155379 230629 105134 19265 66872 21346 -117560 -39586 55928 46292 -15878 -53568
20672 -53568 -124719 -153468 -137814 -151208 -152498 32925 67816 65146 80481 171021 145645 -3097
20660 -3097 10092 -40443 -52601 -119010 -89650 47110 37916 66124 130951 130468 71704 149680
20648 149680 194984 119273 -4365 34175 -10300 8968 -107979 4608 150990 110946 100186
20637 100186 90886 115898 229859 232107 107264 4279 66457 108143 70675 81240 64673
20626 64673 93320 -52669 -118450 8729 -39866 -80149 -54224 -57315 -101718 -166141 -86594
20615 -86594 -46150 27871 95581 176411 256292 255624 279332 335503 257774 128849 127157 117190
20603 117190 27147 29145 193236 263678 172432 236394 229755 101941 21023 47772 122794
20592 122794 33973 43840 67916 26928 16616 154556 326110 244476 130062 42169 69505
20581 69505 48696 50759 87589 193737 194981 163153 135619 106147 54221 20011 7562 31221
20569 31221 33993 163763 274760 206277 160317 201394 58987 18389 81233 148456 50532
20558 50532 31410 101657 52447 75853 154354 91781 -60718 28310 47265 7021 44646
20547 44646 -19320 90397 171209 199011 123547 114896 13572 -84347 -83833 -5364 34696 -467
20535 -467 5075 21941 -26164 -71810 -196128 -96424 70788 258229 203916 83182 137562
20524 137562 189863 117414 121539 103230 137549 160600 268657 190498 83316 220062 266359
20513 266359 268262 312728 385935 323493 304508 260004 221346 260168 343381 367369 318556 345333
20501 345333 394898 383945 381320 439347 490436 697785 751170 742192 813399 689198 634658
20490 634658 658526 645556 616889 546987 507095 545281 454550 345236 347449 386069 272685
20479 272685 160085 110766 176632 270807 236507 147854 137011 91676 201124 345845 394258
20468 394258 469710 591375 577582 545274 489514 428021 486310 498856 460921 484880 544933
20457 544933 580856 458092 386289 480479 467294 263866 240222 320199 493614 560105 566676
20446 566676 581154 525366 540259 557522 489478 430644 397488 333617 403911 355486 370413
20435 370413 341679 409521 481249 456270 442904 524087 584502 680159 818163 794511 701854
20424 701854 644612 551127 622109 734222 699454 669522 703934 702129 624848 694951 796581
20413 796581 810763 727776 620555 710725 741637 604319 510334 624729 758017 844586 810561
20402 810561 709560 687205 636855 576334 571843 624968 638458 641524 657993 795594 846882
20391 846882 799691 901523 992031 1042013 1008795 896472 925402 905699 845386 829176 840727
20380 840727 789088 785022 865258 896036 983649 1025304 998465 1026732 997440 957971 1010838 976618
20368 976618 923080 851302 812289 821316 800941 752938 732283 780038 838879 788147 818995 1011461
20356 1011461 1052965 961935 855804 1043344 1164937 1281991 1215161 1167454 1049019 1066078
20346 1066078 1199090 1338639 1311982 1109076 1037821 1140160 1264394 1341171 1442730 1413244
20336 1413244 1356002 1304003 1342993 1265995 1283182 1324603 1341778 1446884 1522800 1551105 1663793
20325 1663793 1756239 1738715 1635467 1657014 1685395 1714924 1855684 1857581 1854610 1927603 2115065
20314 2115065 2199612 2262340 2376839 2345679 2389506 2363549 2445494 2444095 2403617 2542069 2750646
20303 2750646 2888746 2994328 3142828 3335641 3492454 3568461 3769460 4058143 4273651 4394852
20293 4394852 4558259 4800427 4998941 5137321 5477279 5823106 6179507 6587639 6945258
20284 6945258 7316956 7814920 8270190 8562104 8860745 9268708 9758387 10350073 10950580
20275 10950580 11618890 12416337 13260409 14186209 15088231 16088759 17257582 18490706 19935566
20266 19935566 21624474 23302058 25033676 27131664 29678158 32702850 36212468 40138454
20258 40138454 44644656 49807466 55649536 61936384 68615020 75155500 82429578 90738169
20250 90738169 99803899 110473161 124366022 143106967 166111748 188145508 204354115
20243 204354115 217778200 234576312 256243547 275952832 277137621 254169365 226286483
20236 226286483 208146806 197981888 183697295 154635117 120249873 95040904 80585050
20229 80585050 72849645 69045722 67880563 68722106 70992660 74449422 78835179 83793663
20221 83793663 89079016 95245343 102563677 110957390 121401174 135428686 154629355 177660604
20213 177660604 198950386 214009045 226887269 243758951 265269415 282810075 279337801
20206 279337801 252131802 222164828 202801558 190623336 172587844 139096248 101709946
20199 101709946 74510049 57838748 47417979 40056117 34582797 30502839 27427279
20192 27427279 24938920 23025968 21418357 19965345 18677169 17467790 16368833 15530495
20184 15530495 14921185 14495632 14026604 13643870 13168504 12644452 12266411 11845889 11327499
20175 11327499 10886598 10430333 9934245 9538745 9349913 9111019 8660186 8263179 8076407
20166 8076407 7916475 7750070 7577168 7140780 6782850 6502936 6299923 5981887 5530576
20157 5530576 5053371 4690708 4281549 4024560 3977304 3950150 3743976 3547100 3440496 3335024
20147 3335024 3224908 3215793 3157995 3067554 3100349 3106698 3014871 2868192 2760678 2556383 2511862
20136 2511862 2529137 2440184 2370086 2291865 2164543 2072057 1919535 1858849 1866830 1963215 1949933
20125 1949933 1766295 1605739 1529086 1529259 1567149 1579088 1603068 1540909 1428839 1332300 1305336
20114 1305336 1352889 1344221 1353114 1323765 1243444 1193910 1147275 1145044 1199329 1075310 1029371 976478
20102 976478 1004467 1072702 904708 854506 900976 866346 735626 647897 647887 670671 651033 718681
20090 718681 640600 670857 600553 589691 708659 739210 774609 779065 635337 563701 569771
20079 569771 524784 611873 690341 535212 377368 347167 431150 413849 375286 391979 292603
20068 292603 142741 122306 293197 272980 241088 249550 268119 291548 218311 202537 179633
20057 179633 140921 63321 21628 204568 303939 259851 219770 276633 287025 216075 249728
20046 249728 272344 258705 280652 286225 291176 327810 375300 268699 174326 196809 222875 120722
20034 120722 96991 210397 266043 181035 40931 -61511 -13984 70835 102331 64079 163882
20023 163882 158458 136823 249454 256283 320435 249511 182721 255634 232882 271624 336963 462728
20011 462728 581742 537592 481976 494850 404352 317263 358251 289962 252657 276568 189131
20000 189131 69410 134542 53554 69268 184583 83092 94536 91904 98017 148304 106467
19989 106467 93646 107731 14400 107525 115521 132802 137051 114473 56853 11152 112493 112676
19977 112676 100030 50550 69739 -49679 -184765 -164612 -16678 146838 108827 109639 167362
19966 167362 104508 2472 -17763 -66377 -8916 115711 56523 70906 200422 98688 99365
19955 99365 88396 92406 17881 -31949 30514 -23512 -69684 7435 52571 -66589 -167486
19944 -167486 -80433 -36521 -77850 -48400 -85625 -39445 -5567 -10603 106846 131905 84130
19933 84130 20632 24581 27125 36773 -19956 45515 78168 157336 39401 -24994 -29464 -5994
19921 -5994 92669 99968 79080 123465 -20568 -143659 -27761 96921 -33478 -208081 -222986
19910 -222986 -183395 50128 31772 19459 17235 29479 -1703 -11274 57943 154448 137289 120408
19898 120408 79256 27980 27260 131138 112797 -768 -91140 -27414 113911 163134 -31714
19887 -31714 -121528 -24658 43337 -38207 -72767 -49219 -81391 -186212 -327457 -178596 -156567
19876 -156567 -235906 -183922 -38595 37063 -5717 5324 88850 5894 -78819 -112684 -123946
19865 -123946 -8379 98831 127992 41128 32345 98984 27630 -79562 -18884 90595 86663
19854 86663 123959 197932 170264 140922 -34939 20797 -29231 -4529 39933 -32496 -100940
19843 -100940 596 58619 -45797 9599 -5824 -117874 -98702 -34195 -107250 -151878 -245821
19832 -245821 -219218 -88520 4932 16319 -31693 -83087 -18523 3879 55892 39651 -66406
19821 -66406 -89147 -55497 -14476 87432 82155 82967 146867 112993 26739 25722 -102484 -181433
19809 -181433 -166923 -35082 192814 160815 104676 188485 198271 207878 53600 -43424 4171
19798 4171 -45478 -96361 -138773 -36513 87589 -2936 -86258 -206439 -318497 -334188 -195736
19787 -195736 -116309 -139384 -113770 -186346 -130421 -130133 -182819 -120486 1040 41254 -15315 -2944
19775 -2944 -24291 -52093 11639 -5681 -29861 -70877 -30800 52983 73370 -9132 -349801 -443874
19763 -443874 -233581 -161524 -83946 80430 239664 215713 128201 11580 -67565 -60113 -138799
19752 -138799 -155358 -98420 -42868 7114 25006 14194 -71197 -16407 -71940 -7226 65445
19741 65445 56711 -9247 112777 192542 90786 -17597 -127763 -173920 -138268 -19517 47266
19730 47266 7888 -29467 -43508 -43657 -127699 -59934 15739 -20488 -39071 9569 16804 73898
19718 73898 118908 116317 96637 17985 89392 207566 149718 128576 119879 33657 103843 268571
19706 268571 233557 200625 180430 232665 199567 56638 38616 -34111 -6869 26097 -35437
19695 -35437 -12140 -43471 -43481 -88619 37328 103034 92970 121280 115530 27222 99670 62299
19683 62299 5316 34857 1069 13294 -120395 -136483 -56243 -48914 -101027 -74406 -52635 -91586
19671 -91586 -77168 122563 129405 88 11817 84379 165269 162771 139400 202675 209287 123173
19659 123173 54395 69740 213368 272000 401384 444981 496718 535479 620997 830419 977362
19648 977362 1039390 1095845 1157234 1326703 1436892 1453126 1345897 1197281 1076796 1020110
19638 1020110 1073551 1018862 829106 697919 606380 579124 687814 521932 400322 277273
19628 277273 388595 643012 707888 621769 508605 438808 565766 682213 716655 669125
19618 669125 645763 769787 1019022 1154202 1217844 1368422 1612014 1642944 1375140 1165293
19608 1165293 1126272 1114156 1019033 808862 568319 394186 281241 355141 384896 310224
19598 310224 143216 69457 55187 161538 266361 296586 208470 55326 -8803 39861 54481
19587 54481 214 -126948 -174092 -139792 -52965 -105738 -164651 -129035 -68344 -97582 19477
19576 19477 99426 105673 18417 -121427 -157448 -33218 -5066 -28442 -68432 -94302 -59899
19565 -59899 -13323 106317 239759 263086 192132 109840 92699 56502 88362 168661 153747
19554 153747 83080 -11869 -74153 -138850 -146091 -153394 -119104 -119942 -78422 -14186 -17476 28995
19542 28995 42557 60895 58025 -37906 -42966 23455 1771 3655 -149867 -123450 -49998 29486
19530 29486 46146 77299 145721 88423 31134 16705 -38032 -66599 -70963 -85271 -121805 -177150
19518 -177150 -50655 -21950 134271 168982 146612 162570 122972 67168 -12688 -54067 -31225
19507 -31225 -98357 -137270 -202901 -129386 4316 -1441 54287 146566 38289 52902 47533 76938
19495 76938 -14176 -92157 -83913 -182157 -142546 1912 65896 85648 1591 -172592 -196642
19484 -196642 -145127 -93538 -70760 -62126 -28305 42198 33874 -4675 -5166 -8052 -106424 -173346
19472 -173346 -152396 -14328 50459 60296 16544 53637 118863 135138 139328 218599 109582
19461 109582 101665 47514 35884 -5104 -46887 -76745 -113377 -102381 -199713 -197933 -156796 -118732
19449 -118732 -82279 -94296 5909 103074 -13931 -114913 -49764 -25454 26309 26607 -66273
19438 -66273 -31930 -11382 41981 88423 114864 97061 59536 19543 56566 -21833 -59130 -42856
19426 -42856 -81386 -81805 34428 129199 87957 5115 48522 76429 -19685 -42460 61003 66890
19414 66890 -206 11715 -60075 -151288 -113673 -85349 48273 224406 337166 305644 183832
19403 183832 209851 78965 -100308 -243123 -255167 -218602 -138946 -124901 -187788 -182522 -115313
19392 -115313 -64273 -24016 14654 -82588 -177898 -193095 -155079 -167835 -237335 -353519 -365278
19381 -365278 -285468 -174663 -19501 91221 24159 -77467 29351 113284 -88259 -268420
19371 -268420 -332183 -242765 -6286 171821 176445 81252 -40673 -121429 -65343 -50375 48001
19360 48001 85516 83146 121164 29415 -63272 24040 59665 61212 39294 114361 53570 4630
19348 4630 54534 73713 -14417 -26826 -36713 21584 61360 -4567 -177219 -198671 -145343 -124552
19336 -124552 -135685 -162694 -131267 -118605 -80219 -57099 8222 -63075 -58283 61056 68689 -12200
19324 -12200 -92675 -48512 93616 153835 88234 10991 59417 35376 3911 22666 49522
19313 49522 68526 19307 30481 89967 124750 44575 47988 130716 24743 120391 190067 161779
19301 161779 149811 159202 3432 30974 11681 -131992 -187921 -60683 10126 -51037 -100009
19290 -100009 -95474 -21988 -54966 -107635 -64538 138955 258194 205547 88996 94225 157587
19279 157587 134662 108071 25793 -174652 -184402 -15589 70196 66756 111970 205263 325428
19268 325428 323924 281065 314098 248519 130857 164047 22151 816 14255 -3712 77722
19257 77722 130964 68351 2371 -48104 -30154 -19338 62345 175974 194690 126350 159779
19246 159779 142362 214735 239208 217664 207073 107466 44973 -77381 -104639 -109745 -192036
19235 -192036 -114428 -19464 -74138 -71644 4758 -160626 -177788 -97043 -75367 -122410 -82659
19224 -82659 -72859 -98529 -60468 -13822 -39379 -65802 -94211 23103 95743 157233 146762 155353
19212 155353 146626 219707 442453 494069 488739 538872 612168 699526 711055 719508 772983 840221
19200 840221 987047 1178892 1354292 1449535 1527379 1765886 2041085 2308009 2501885 2376132
19190 2376132 2275311 2144472 2064721 2125869 2229392 2180991 2148373 1910300 1576721 1349375
19180 1349375 1237910 1116407 980449 753760 608772 394014 267826 118158 142019 235512
19170 235512 371988 433853 322570 146018 63239 3699 34561 36512 88336 155425 229994
19159 229994 118030 84333 155222 71932 61271 183396 111090 91079 23647 187283 169580
19148 169580 176328 217415 102046 138393 234050 210251 213956 186661 136821 90418 103052 15077
19136 15077 -94919 -14053 -11392 34263 80080 76714 54077 61062 6519 50263 174274 192811
19124 192811 168690 122874 84045 78909 78298 -38991 -75752 -27056 -12556 13274 83065 96335
19112 96335 105727 168098 224642 86170 -106888 -126364 -166766 -20197 43008 6246 -78370
19101 -78370 -87479 60541 178306 215198 282981 239504 181786 53006 126113 135392 108706
19090 108706 15774 -51674 22142 85424 179063 62762 51791 41265 98520 193170 248295
19079 248295 144041 135468 178323 233192 248047 213554 59494 -50122 -72558 -81511 -61252
19068 -61252 -35349 -15112 -6432 136575 192052 66157 9924 176113 255295 216188 198202
19057 198202 88512 -23195 -175388 -164622 -47065 153995 203570 261856 200761 121827
19047 121827 46480 66981 139337 -21753 -67493 -26608 -48077 25221 94300 57545 117603
19036 117603 142430 165295 116075 27375 144574 115924 195558 199364 123223 37534 23664
19025 23664 192592 259624 252357 369101 495844 479906 399069 451666 462867 448445 450651
19014 450651 523735 820256 1036311 1221715 1330329 1323233 1298298 1334628 1396590 1427045 1449592
19003 1449592 1497981 1432454 1359760 1236306 1205536 1198400 1198271 1107048 937500 673988 547866
18992 547866 483567 341085 427347 658641 770658 710254 585748 660405 788786 769490
18982 769490 606118 665962 853816 1085244 1175760 1162070 1235431 1213507 1127680 1090457 1111728
18971 1111728 1074748 1118670 1150474 1137568 1122284 913046 784575 658479 528447 337560
18961 337560 206419 254939 368216 324358 163504 152119 164149 259110 193644 110853 8367
18950 8367 68129 135969 60695 -23951 -4559 -40254 -33727 41799 108081 122259 169884 175833
18938 175833 153171 188134 210475 203582 54149 15178 26343 133582 83733 -92958 -164680
18927 -164680 -102266 -43168 -14515 22613 70040 111137 -4926 -40874 -34869 49207 84443
18916 84443 178120 223317 135145 59782 81151 181791 252312 364764 366037 341870 351273 364114
18904 364114 383364 413357 511999 509395 349043 421484 369422 327375 378794 489073 536369
18893 536369 522965 521636 516209 624271 635951 661020 765521 763581 674441 718326 641583 601391
18881 601391 522036 616373 541206 425697 377325 266144 166649 138889 -40158 -64032 -166710
18870 -166710 -154235 -84939 -28005 103775 61929 112372 96691 87713 94253 -15175 -86447
18859 -86447 87729 150889 140468 143759 169540 132390 184558 90369 -68787 -42314 7232
18848 7232 18408 47998 -7297 -3134 -3293 137028 137311 26914 49990 72526 121550 195677
18836 195677 293149 226451 154915 160152 69702 150318 279727 298465 293664 398699 546116
18825 546116 666764 713190 753542 752869 895066 854486 652040 672375 816236 841423 889923
18814 889923 861224 839473 848760 852034 857494 791067 795074 791366 795945 825991 842790 824603 679451
18801 679451 604469 682833 711203 743613 747562 775010 664097 570586 525702 544900 579866
18790 579866 581339 541567 573502 635490 629599 720402 749048 764419 800764 862990 842210 847562
18778 847562 908962 886337 895645 988892 1036733 1068278 1045987 1136445 1141206 1041473 935411 953779
18766 953779 1046822 1110592 1132439 1044754 960026 876895 928065 839053 741371 781957 810549
18755 810549 866197 886128 800266 760755 797317 810174 896245 902361 800080 789953 866984
18744 866984 866110 940006 1037830 1010632 937644 915599 1142434 1311795 1190025 1135943 1177629
18733 1177629 1154192 1216091 1294424 1311813 1197098 1267702 1456463 1541732 1561788 1610808 1693121
18722 1693121 1821264 1858485 1806083 1701036 1751685 1908232 1940769 1921223 1969313 2001998 2050704
18711 2050704 2156238 2217535 2336804 2337152 2202942 2184707 2324780 2412456 2487957 2631861 2685909
18700 2685909 2743452 2850144 3021005 3153174 3354438 3606305 3559835 3703423 3934554 4113426
18690 4113426 4354484 4561560 4754412 4971066 5130305 5337969 5701428 6120352 6385361
18681 6385361 6524045 6880518 7453618 7925943 8385849 8933516 9573828 10185839 10873584
18672 10873584 11791685 12782873 13752791 14883825 16144469 17645380 19318694 21203119
18664 21203119 23248105 25520935 28210666 31492861 35342138 39572191 44327780 50066071
18656 50066071 56496346 63514894 71360638 79854795 88598429 97310307 107439028 119332999
18648 119332999 132601614 148409248 168590812 196066358 229324418 258610595 278737274
18641 278737274 298804955 326930478 365151817 404450684 418367898 407105419 402252921
18634 402252921 405965966 412623897 413234445 397453769 386299046 372543359 326317552
18627 326317552 272345895 240003901 226279763 214313724 178678282 126812425 89273567
18620 89273567 68210852 55853358 47803413 42204595 38010968 34524536 31762149 29328174
18612 29328174 27060339 24839259 22885265 21144098 19627507 18254614 17002934 15745758
18604 15745758 14786611 13922484 13039415 12418520 12005186 11552785 11186548 10826973 10303264
18595 10303264 9883638 9553802 9224127 8938487 8688242 8419577 8021731 7788000 7617754
18586 7617754 7388370 7116183 6904735 6658072 6440473 6261788 6082344 5882253 5789883 5591751
18576 5591751 5341162 5226090 5067490 4972842 4963576 4858803 4695921 4510014 4431502 4363791
18566 4363791 4302130 4239305 4044562 3834767 3771931 3701231 3545265 3585214 3556857 3456528
18556 3456528 3491522 3417312 3428641 3328804 3241974 3296575 3269908 3146950 3090567 3130281 3109316
18545 3109316 3079457 3054246 3016944 3011632 2998242 3003066 3001921 2943247 3052812 3120149 3192446 3130740
18533 3130740 3090358 3117198 3166284 3173942 3214892 3285170 3441984 3502448 3601802 3560645 3538393
18522 3538393 3665522 3860375 3976689 4072725 4106825 4157875 4261097 4350613 4359198 4540259
18512 4540259 4715505 4837594 5078791 5259978 5403745 5561545 5682031 5875135 6212764
18503 6212764 6697000 7115120 7636481 8250976 8898166 9427782 9946367 10733972 11585257
18494 11585257 12574659 13615773 14706790 16047866 17621398 19520249 21697766 24295813
18486 24295813 27145038 30336035 34048021 38504564 43292041 48430922 54026285 59766624
18478 59766624 65019297 69955796 76515482 84394297 93314892 105291168 123199611 148211311
18470 148211311 177372069 199780826 209489544 214931671 223043580 237078042 252499688
18463 252499688 248021775 224426545 209033238 199757902 190991488 186491599 187841594 192991071
18455 192991071 186367617 151785177 112830441 90127357 79906877 75903575 75202359
18448 75202359 76424199 78986663 81923290 84877449 89499746 95448950 102558027 113091665
18440 113091665 129836739 153473896 180177260 198991078 206100679 210217116 217142926
18433 217142926 229780894 242295702 234081099 210311692 195608502 185427129 175687827
18426 175687827 170230054 170333549 172901170 161396710 122641333 82658839 58480294
18419 58480294 45240948 37259140 32049591 28314527 25712464 23652413 22067186 20505926
18411 20505926 18927191 17326942 16021624 15074234 14196401 13277085 12353644 11393648 10466408
18402 10466408 9807227 9156475 8690353 8405830 8176268 7862989 7408746 7118938 6888373
18393 6888373 6576043 6351452 6104568 5874399 5673395 5514402 5352539 5184567 4950368
18384 4950368 4751104 4612916 4575012 4485849 4412020 4371793 4151653 4006875 3853142 3765452
18374 3765452 3723719 3670496 3490310 3285824 3128816 3184407 3234519 3172875 3148379 3159432 2941314
18363 2941314 2731727 2603404 2575976 2476103 2443003 2402965 2346001 2307104 2219579 2096242 2078125
18352 2078125 2163910 2218967 2271904 2078756 1928206 1883355 1883341 1877265 1914063 1816093 1604130
18341 1604130 1494391 1405806 1364615 1387869 1329373 1327205 1334928 1357319 1324553 1213237 1163413
18330 1163413 1233529 1220240 1219415 1171983 1121658 1110149 1198625 1194032 1226342 1285780 1150317 1086128
18318 1086128 1132679 1192072 1192825 1116736 1088833 1074580 1049918 999885 967415 832353 833465 848424
18306 848424 841991 753109 655291 763499 692804 670746 706183 608279 598264 553546 530440
18295 530440 520064 565317 605665 568951 581248 588748 575525 642552 593384 489752 400824
18284 400824 359666 250843 196319 257821 318274 374438 277355 294910 441347 602986 485083
18273 485083 379270 289239 214716 237337 173770 259670 326475 356486 290021 389952 347587
18262 347587 337614 298007 212883 203351 132040 79259 72285 165409 292004 281398 243607 255254
18250 255254 222643 160144 73744 151624 182575 33917 85750 34455 6477 133895 315479
18239 315479 352024 299298 320854 411901 531308 516785 368127 321692 421465 435271 332087
18228 332087 290300 223524 153062 98331 102996 128866 152415 182436 291544 302361 297058 341004
18216 341004 331082 309737 291205 295716 377879 343350 288267 196436 175228 330561 325112 311368
18204 311368 403233 435325 420184 372941 333551 339963 261321 275333 495890 520671 465553
18193 465553 449440 373396 242967 201526 255133 313730 366792 392891 375254 402717 503141
18182 503141 467524 429137 346937 351093 432302 452654 395690 575847 529047 443631 421403
18171 421403 426457 453135 550722 554886 554364 627697 678387 609501 632288 722764 744297 750637
18159 750637 749507 798043 749183 718325 835253 931830 959797 984301 1053270 1115067 1240412
18148 1240412 1397355 1511961 1684212 1772652 1740240 1852504 1985892 2105868 2268203 2570104
18138 2570104 2898135 3103522 3349498 3647545 4048884 4491331 4898995 5403834 5931443
18129 5931443 6682380 7714367 8900315 10377966 11950799 13718200 15648354 17645849
18121 17645849 19696555 21654683 22780102 24329726 26515698 28866636 32347024 38726764
18113 38726764 48901673 62314775 73913050 78133128 78176327 78971023 82439518 86649399
18105 86649399 79613636 55437942 33377160 21294505 15140886 11664838 9552473 8179881
18097 8179881 7253140 6599154 5931561 5391981 4983721 4603391 4307535 4080774 4022202 3854167
18087 3854167 3572875 3496138 3440453 3486145 3480805 3462425 3485581 3533520 3571970 3616775 3737244
18076 3737244 3671236 3631604 3611432 3678306 3722762 3697395 3455994 3307521 3164298 2922982
18066 2922982 2730018 2513354 2425650 2286166 2101190 1683724 1477928 1330342 1267765 1212425
18056 1212425 1176837 1021971 957896 907172 946278 972790 868448 729754 674939 674081 676707
18045 676707 661579 724196 663311 690524 686471 489470 354518 325208 347142 352869 415635
18034 415635 496133 591743 708431 597520 590103 642479 611390 463664 420321 390577 293933
18023 293933 302482 327108 250657 218897 346687 292168 192001 222498 199569 240394 355753
18012 355753 424595 351495 333222 319797 379716 406560 355022 359017 305093 228747 163775 227706
18000 227706 268436 277199 260499 236523 322886 415878 390506 351495 345963 283647 299787 373601
17988 373601 379122 270726 199035 223053 133142 170506 102818 115345 188039 158293 151398 157406
17976 157406 234313 135362 131019 78047 79716 61975 94354 66463 47553 63016 193019 176540
17964 176540 121870 96186 154652 263205 250379 161409 157021 185192 202992 124185 196881
17953 196881 259109 208741 171042 176557 184575 108720 225534 229782 238844 211330 181826 144667
17941 144667 120440 159903 189487 177818 224671 294218 315330 201266 226763 238478 325883
17930 325883 466936 498285 491011 573848 735067 737413 816342 917897 992905 1114192 1211847
17919 1211847 1256106 1227706 1291517 1392915 1334189 1253176 1141633 1198171 1262794 1261881 1180149
17908 1180149 1284479 1061687 771341 570311 483315 552747 607453 566017 502438 522492
17898 522492 611021 646766 611878 619865 692261 740457 749365 957696 1071903 1170394 1343417
17887 1343417 1305739 1273619 1278129 1265287 1248244 1195672 1208743 1227377 1150726 1071748 1006499
17876 1006499 894979 639516 424525 321349 303708 206469 146470 129970 230509 258222
17866 258222 323880 292715 158978 100944 169489 167943 92162 -6417 -44095 22789 102584
17855 102584 54251 84242 159488 244798 244654 274860 269388 269845 179301 105484 -1097 -13555
17843 -13555 103817 90283 -4077 -42370 -78238 -169035 -88604 -16065 6821 -5081 -16514
17832 -16514 5267 73352 23138 1298 6196 -12793 51021 40230 23653 -46069 -11982 11145
17820 11145 113726 201095 132549 7164 23930 -3223 -17513 12926 -79627 -57781 -28369
17809 -28369 -44129 -36932 -49761 -145424 -215255 -185543 -74859 30 -24212 -22865 4207 103934
17797 103934 60110 -11243 90055 69472 -23910 -99157 -103494 -30527 -4905 -15120 -12218 69830
17785 69830 78578 6003 -59010 -83128 -11489 70333 148320 62019 80223 62846 16761 76323
17773 76323 165558 188811 186646 220446 251502 146877 -13801 -99848 -20286 -17303 59325 7847
17761 7847 36223 16199 100724 -28264 -66684 -88485 -63374 46161 -2339 51561 125646
17750 125646 211149 158192 95528 10593 -24707 18004 147742 136923 57101 -33532 -60906
17739 -60906 -67289 19804 61258 42794 88835 192699 240337 120146 110643 193469 137021 170496
17727 170496 186878 82299 -7345 -108266 -163887 -170053 -134113 -60515 34973 -453 16894
17716 16894 -43305 -104426 -120116 -95305 -9153 25299 65664 75866 134130 49457 -77428
17705 -77428 -67690 17462 24643 99291 -2428 -159276 -89612 64568 75669 -826 -50779
17694 -50779 9544 -11109 3053 13059 -95267 -125828 -48652 -23215 -130471 -100198 -85216
17683 -85216 -70601 -91580 -25768 -85270 -164025 -139017 -23058 82368 198119 213695 217088
17672 217088 114895 111429 167324 119159 124101 96667 -15056 23340 8311 -15213 -111995
17661 -111995 -119773 -106372 -161315 -224105 -236038 -123597 -51044 -162002 -111472 18073 82825
17650 82825 -17291 -33081 140594 110637 -68551 -164463 -113851 -10862 54181 99266 82666
17639 82666 58042 -5840 42634 90409 13813 27813 74068 131206 52226 60986 48690 -24082
17627 -24082 24678 96305 90743 64874 49630 146197 138010 114956 128226 141417 98185 53437
17615 53437 136089 25779 23094 93568 130196 113840 7128 -54896 -39150 -11856 80736
17604 80736 91871 175916 204055 69944 -193058 -382070 -270835 -109236 6627 -42610
17594 -42610 -91871 -82651 -66017 56102 73045 48109 -46221 6461 140194 214183 99141
17583 99141 -67372 -74768 46886 63030 118324 164836 234695 225945 140591 95853 125335 -25150
17571 -25150 -37713 25211 -60875 -41168 61420 168345 193992 196487 144386 -4140 -33987
17560 -33987 83127 149957 117672 135834 142489 118795 58181 83269 -1008 20787 91170 55106
17548 55106 18103 -49965 -125097 -92940 32205 -108034 -119948 -72300 41128 29613 64057
17537 64057 28409 40076 -25873 -81858 -109467 -71179 -24272 -20439 -80382 -26076 61001 70203
17525 70203 134734 218973 186615 98822 21764 -51895 28557 -6010 -43970 -80415 -31006 910
17513 910 115588 214308 221275 212803 172143 -5400 -69200 14202 32513 -16611 28181 51987
17501 51987 -67354 -145431 -84763 -13639 -44374 37699 112573 81834 124953 72815 168433
17490 168433 35104 11459 91117 183009 233891 305962 221929 201674 137913 54978 108266
17479 108266 157001 154675 160119 65291 -128293 -85659 -12802 -85763 -75499 -33084 -90677 -22413
17467 -22413 -99038 -80430 -49024 -184659 -183684 -172159 -65998 52764 146181 176157 168473 161237
17455 161237 183878 127271 -10662 -55928 148647 128388 100566 143664 341952 503461 504476
17444 504476 503797 476009 507997 519149 585124 634078 483138 345145 321071 201901 20397
17433 20397 -135249 -159924 -228101 -117671 -42221 85328 102716 72894 36988 19023 -61054
17422 -61054 -88992 -53147 21760 67188 78822 55542 -40357 -81917 -83144 -30985 17440 -37216
17410 -37216 11425 68020 87346 50851 -40946 -19358 11074 100455 67361 50303 57616 82837
17398 82837 40482 -8136 29287 -83644 -241927 -214309 -114487 -102575 -239814 -170042 -100219
17387 -100219 -101222 -73438 45121 116309 30842 -13972 -65530 -88259 -87602 -116819 -87868 -120019
17375 -120019 -52913 -130843 -180025 -150145 -169121 -6284 -64516 -139406 -109583 -57815 -79534
17364 -79534 -138100 -128066 -35942 -47127 -68296 -38325 -114928 -33085 18983 951 -48242 -69012
17352 -69012 27796 96197 131749 131121 -23325 -110131 -72229 -96743 -124590 -86372 21904 127140
17340 127140 67467 -20821 94597 165465 25173 -35027 -72954 -74733 36719 56739 37108
17329 37108 -117179 -46046 -123730 -121207 11350 110637 175499 151570 84138 -37331 -67444
17318 -67444 -31907 -97409 -116015 -118161 -25802 14522 -15587 -2789 -84850 -128546 -132857 -222064
17306 -222064 -257139 -158356 98509 214773 160863 89183 68130 183905 290270 235732 199820
17295 199820 54769 16777 886 13106 -42757 89870 160060 95072 -25137 706 57836
17284 57836 123457 111443 42414 64015 52375 -24807 -61907 24917 130486 200443 170156
17273 170156 124555 189063 186842 21854 37527 97859 87937 14198 -160983 -248952 -274731
17262 -274731 -144708 -106392 -66184 129367 179875 144523 267341 306588 245885 87894 121561
17251 121561 118744 50452 -45150 -73421 -17285 32609 48795 -2441 -67851 -53656 -50012 -114077
17239 -114077 -115441 -75926 -1977 -103588 -190138 -92918 -79686 -126871 -70583 -6864 53291
17228 53291 38774 -39589 -88477 20026 141610 92469 75720 9959 -1679 82103 158869
17217 158869 174546 131861 244889 172038 144259 228087 238056 241407 236656 85651 -57737
17206 -57737 -96082 -61569 -20354 -63951 -115599 -124325 -103598 -191400 -193981 -82375 -2754 -7100
17194 -7100 -35508 -1600 -104520 -67231 67624 25705 3581 24153 -57593 -109927 -157006
17183 -157006 -163185 -73267 12760 8717 -81251 -100392 -71336 -95151 -95074 40493 141612 153957
17171 153957 146772 33458 3064 49381 56293 -1952 -69537 -13949 92193 140151 146933 76233
17159 76233 37550 52870 41748 -31740 -34537 46056 16100 25831 59742 -76828 -60732 -15808
17147 -15808 -2262 58362 53893 20142 108455 157799 197650 163802 59657 -36022 -173178
17136 -173178 -58045 -59756 -106584 -3810 124334 46769 14967 98649 88759 55793 80509
17125 80509 152993 196188 154576 108774 82351 -44171 -47562 -113043 -120602 -109603 -102930 -52020
17113 -52020 48570 123713 158939 170168 92734 -11613 -43333 13351 42230 152120 86406
17102 86406 -73167 -16627 47213 -24008 22529 15040 57745 163834 155495 3374 -43413
17091 -43413 -125224 -158129 4112 75267 27906 84570 143303 169847 117751 -27482 -90646
17080 -90646 -53677 10776 65597 68207 -15663 -76744 -5726 103753 133083 212981 211513 127790
17068 127790 28770 -64206 -14519 110037 131172 59692 58677 105488 96862 14760 40668 148973
17056 148973 138977 116056 20590 -108513 -5976 101614 173342 188331 182247 152501 73743
17045 73743 -39949 15443 -54768 -51782 29439 149419 160877 75959 73715 91557 94241 214326
17033 214326 207287 159248 121084 48433 -5544 93978 260444 326604 255579 173638 157752
17022 157752 102589 -16587 -118501 -70124 55556 23727 -47549 -87978 -125585 -64164 -66872
17011 -66872 -44747 34142 158251 146968 -43509 -129369 -117318 -157582 -70912 64597 57743
17000 57743 74561 120133 169721 41530 -26272 -6439 -42761 67278 129314 33419 7276
16989 7276 44285 9735 -63750 15604 82034 74126 112049 121448 525 -46502 -80076 -73319
16977 -73319 -114225 -125033 -171684 -85455 -63237 -184099 -126001 -12186 144712 121813 1084
16966 1084 31207 104619 55812 122989 96096 -58994 -192866 -125344 -73549 -128605 -33299
16955 -33299 -10355 -47361 -46254 -17222 -78975 -172418 -208414 -157808 -150691 -191373 -206158 -79598
16943 -79598 -118353 -37596 40572 151286 104886 46924 36608 -57488 -23707 44064 66878
16932 66878 103880 215009 148118 90512 16683 10038 3872 -94897 -186900 -137039 -136549 -119834
16920 -119834 -64760 -32396 -24803 -112374 -28563 -29531 -76272 -23226 -52250 -143501 -48425 -40652
16908 -40652 -58683 84417 77683 33086 55482 31230 99592 19143 -115157 -163181 -202370
16897 -202370 -155614 -74188 -130387 -146938 -21742 -24055 -114108 -85867 -84544 -116069 -182015 -49071
16885 -49071 -2860 -86519 -176813 -178131 -242410 -281310 -343984 -276800 -220730 -223514 -237862 -162937
16873 -162937 -172171 -129973 -55552 10672 -63621 -130035 -97859 -127283 -75792 17561 93570 -31336
16861 -31336 -105176 -89238 135844 139220 55822 2670 -107648 -133918 -38961 97679 97653 59275
16849 59275 155406 76958 6261 -8251 -88094 -186008 -169102 -106809 24885 105412 64929
16838 64929 -27402 -157350 -133400 -86715 -55208 -50062 -45384 -52371 -17632 10717 -43537 42459
16826 42459 53529 -85160 -232361 -152268 6070 26018 -12077 -90066 -51397 -42597 -16073
16815 -16073 49657 31441 101630 150051 30086 -176832 -253656 -248144 -166273 -48299 -27712
16804 -27712 -9520 -74309 -86996 -88902 -152672 -105212 -128028 -74653 -50491 -77258 -71187 -35268
16792 -35268 90606 145299 144122 34612 -60819 -18662 -86446 -14785 41 18927 110025
16781 110025 180228 133274 130400 209043 172061 189819 281974 148926 84246 116207 195446
16770 195446 276285 160219 10487 134836 83708 51860 38190 12610 -28768 -174090 -286454
16759 -286454 -182981 -48550 64055 19703 -10037 -26467 15567 79284 174555 156927 143888
16748 143888 179476 83527 -56153 -21464 -52872 -157686 -179407 -31927 14261 -74473 -100469
16737 -100469 -50037 -32551 61198 21347 -59480 -86319 -45707 -61381 -85947 -17719 54358
16726 54358 -65033 -199844 -146286 -91077 26998 123820 145023 96576 -42908 -1166 69085
16715 69085 64412 14197 118979 184422 192606 150933 199093 156664 -6104 -113687 -68050
16704 -68050 78870 115402 98745 -2403 -57232 -69174 19400 112594 142116 122398 105342
16693 105342 80279 32638 61293 64581 120830 86170 138170 195851 222597 222882 180932 125099
16681 125099 145504 117990 134794 58617 -81472 -104020 -35350 25212 -4341 27874 -4166
16670 -4166 24621 155445 142946 -27379 28059 99118 118967 102634 144651 295235 321667
16659 321667 228871 99206 114007 140194 18307 -242204 -282083 -135365 -41913 43640 65153
16648 65153 129058 140401 13933 -25482 10161 77277 49832 124854 101318 39370 -2912
16637 -2912 -82244 -140311 -143850 -264949 -317408 -255311 -195285 -155840 -89795 31270 -38357 -2921
16625 -2921 -10098 -118440 -35349 -74713 -64349 6517 -62897 -19667 -52425 -99488 -100363 -77736
16613 -77736 -50654 -100747 -82734 -90994 -96948 -116831 -192879 -272460 -183767 -165600 -72091 100569
16601 100569 139211 50586 -49087 -92461 -131696 -133196 -41515 5964 -1730 36551 66439 80524
16589 80524 140776 38407 -105217 -18471 73242 213768 122708 96738 82725 17795 -10761
16578 -10761 -37746 -26383 -36587 -12400 -49935 13661 191081 59896 31160 27767 72547
16567 72547 26931 -8028 -68138 -76052 25235 95440 116365 29234 30879 26109 1082 11083
16555 11083 93563 48225 -18885 -21790 -6136 10385 -43521 -98788 -71689 -35985 -53226 -81195
16543 -81195 -22871 266 20742 1607 -11044 -53088 11871 102545 100218 97861 -66142 -68326
16531 -68326 58822 100617 32205 -37355 -47356 -76524 -3758 67918 19141 72322 141051
16520 141051 106597 159126 86688 116627 92421 57063 61229 41136 17654 34117 76649 -64778
16508 -64778 -157638 -122286 -117458 -139726 -210050 -89647 81145 132619 115301 20084 -155421
16497 -155421 -245150 -280763 -150725 -158469 -191555 -125305 -135857 -213350 -157651 -172079 -133225
16486 -133225 -38157 -91186 -156423 -48966 6818 -55532 -10733 -38434 -31596 31717 -20788
16475 -20788 -131794 -43263 126502 135201 56741 -105765 -139015 -108825 41844 34546 -19523
16464 -19523 -111495 -87792 -46775 -58332 42956 116298 183712 190665 -6795 -250781 -215631
16453 -215631 -56979 -16583 -75666 -132775 10076 134905 81574 12417 24260 55114 -9689
16442 -9689 -50953 86053 44164 38379 105940 85065 89636 163420 190837 56698 -20177 -77657
16430 -77657 -78090 -140722 -241425 -131536 -55847 -64681 16001 53180 -1813 -27999 -106591 -98851
16418 -98851 -63789 -30591 -8444 -146363 -116756 -17409 -42236 -51451 -10353 56405 15838 18660
16406 18660 98034 137116 80803 -2083 27131 12770 -34816 -71666 -113149 -136661 -89387 -183090
16394 -183090 -180850 -97198 -83487 -37047 115403 130852 39990 7610 -156773 -276023 -192704
16383 -192704 -138759 -93673 -64529 -92299 -177656 -166436 -171143 -189294 -116866 65009 152931
16372 152931 72657 108111 36509 -26353 58754 65401 69509 35462 -77823 -102317 -38709 90119
16360 90119 143188 63577 -4593 101 -53785 36704 156238 52589 -164034 -213320 -160531
16349 -160531 16290 4250 -73284 -37094 -137348 -159301 -38850 4434 46464 83985 35011
16338 35011 -53006 -41683 39624 51490 61588 14736 -70602 -95090 24084 140836 90706
16327 90706 49510 8557 -5028 -120479 -149875 -124747 -59436 48343 -64133 -150920 -97784
16316 -97784 -57653 -125647 -132252 15573 -61197 -250339 -211848 -178880 -222224 -144272 -71784
16305 -71784 33973 52205 19097 75388 16183 -37730 -78878 -30069 -27522 -21949 79068 36229
16293 36229 -51335 -139180 -45083 80007 62126 -45700 -147015 -111758 -57144 -31325 -88085
16282 -88085 -140962 -102496 80260 235369 200223 32969 -65325 -56251 -124310 -24427 91743
16271 91743 98761 26255 -69605 20871 146222 51957 17728 -42232 -95914 17977 53929
16260 53929 1838 -13868 2930 71217 84033 87332 50362 55533 85631 170768 110208 -12814
16248 -12814 -1779 13833 75051 100803 107658 55218 50749 50780 -56368 -56647 -89233 -118015 -166227
16235 -166227 -172536 -122175 -22957 109766 37131 -105125 -203591 -137259 2063 83478 181887
16224 181887 314931 258201 118060 -15628 6336 117965 137515 122424 45477 -135265
16214 -135265 -192145 -148078 -66389 18211 166479 148675 95439 108578 89703 111478 147684
16203 147684 172787 113303 34320 -71256 -66591 -38100 14586 -93640 -138514 -126389 -93663
16192 -93663 -106523 -60174 -72361 -54799 7366 50614 12471 -27495 -85203 -93155 -69200 -134613
16180 -134613 -100932 -50235 -69749 -84855 -179006 -152026 25450 114478 73949 150394 187761
16169 187761 31311 -68427 63451 44389 -34243 -58191 -58311 67278 151621 191369 -3226
16158 -3226 -102295 -156819 -100067 -39733 -44087 -7348 66705 61496 85183 45776 53220 25292
16146 25292 -68696 -19279 -36564 -157699 -134117 -119449 -39685 66909 74570 134689 107144
16135 107144 128501 226040 109671 48217 -140230 -205148 -160012 -118009 20119 18935 -93358
16124 -93358 -78947 -26734 -84836 -91924 -69592 25276 47934 -491 -64860 -191407 -187058 -149406
16112 -149406 -36754 -1757 -20283 -10800 29648 67840 53106 -155799 -169732 -124030 -227116
16101 -227116 -252881 -237356 -151516 -104330 -292741 -293472 -260662 -190204 -200527 -210293 -212617 -256885
16089 -256885 -235715 -215834 -39834 83711 59552 -34989 -94995 -87617 66172 140058 122195
16078 122195 11538 -34501 -85735 -121584 -133704 -180615 -228008 -192536 -137457 -56691 -140425
16067 -140425 -194491 -139305 -94209 -96796 -163344 -325103 -275285 -188123 -80481 -66678 -118914
16056 -118914 -287398 -269664 -121460 16716 -51808 -75413 -132614 -205627 -212609 -193250 -180837
16045 -180837 -226386 -65845 110851 67817 -121771 -140137 -106539 -62177 -67613 -69868 -76063
16034 -76063 -44235 331 -18001 -258277 -319866 -244184 -144352 -224110 -160793 -162760 -147285 -32030
16022 -32030 57465 123482 59523 -51932 -97692 20413 15977 25204 105658 -26638 -33820 35722
16010 35722 28906 36829 53147 55281 79631 131458 34519 -46936 -224671 -221080 -206960 -198352
15998 -198352 12231 36364 -14218 662 -6794 73042 -26023 28752 35544 -90146 -115427
15987 -115427 -15919 30490 105203 190482 106787 9840 -107001 -126629 -124581 -75461 -131885
15976 -131885 -220830 -211830 -63215 -33343 -77072 -78003 -143342 -152656 -53661 -24797 19137 9563
15964 9563 -39532 178 19411 25074 53818 66033 137947 160909 145977 130035 197479 81534
15952 81534 8880 -75827 -6533 73628 89413 87752 107838 93587 30801 88467 157753 139369
15940 139369 644 -126269 -63236 -15107 43062 111451 84144 24556 -2250 136178 157699
15929 157699 77895 -23066 -27327 7049 79452 49479 65181 125659 92472 23717 40443
15918 40443 123095 52665 -5030 31181 9337 32949 -19511 -11900 -72388 83635 69634 72889
15906 72889 41878 53333 -129583 -147243 -126661 -79996 31457 61671 34907 24996 -11660
15895 -11660 -6611 487 -146615 -129990 -62841 -105751 -42011 22112 90529 69847 15505 24001
15883 24001 93667 152144 198412 174055 55655 49881 -61629 -75229 737 -29962 -42339
15872 -42339 47826 43248 -55980 -39605 -35997 -33485 -54314 9955 49865 73972 73027 171712 172133
15859 172133 219181 170667 135417 76864 4380 -11896 -89104 -223704 -216241 -168276 -79849
15848 -79849 24448 38225 -71708 -2324 12846 143469 175328 116667 139002 193673 200533
15837 200533 216243 93683 -35642 -68862 -118773 -100047 -43877 105256 192676 201347 90925
15826 90925 -48784 -109872 -115850 -72249 -83859 -122877 -164622 -75981 -10679 -134785 -257916
15815 -257916 -245789 -129786 -54240 -37289 70510 77307 124065 83354 77588 168157 100152
15804 100152 78293 -1213 -16732 49095 49666 -78792 -118586 13836 110998 7366 -119438
15793 -119438 -51012 65234 135020 87800 -35464 -119755 -85428 -91253 -60106 19315 52577
15782 52577 37466 -71974 -145630 -141210 -89216 -35837 -9257 58951 128501 110718 1831
15771 1831 -53475 -105717 -179393 -150274 -187584 -138283 -66206 -79198 -61377 3378 168759 248198
15759 248198 146244 37948 81816 136953 178160 101983 -104244 -90467 -36645 -13842 -26460
15748 -26460 59215 31367 2202 -38467 -105693 2978 22857 80893 4862 -49828 12699
15737 12699 32180 -91830 -104188 -68752 -972 41432 -27639 -105234 -66422 -27767 -90062
15726 -90062 -218183 -113053 65258 117833 171708 213030 154673 80098 48895 25905 56023
15715 56023 69142 44890 -24250 -17901 28909 3662 52913 26543 -32156 -76164 -61336 7488
15703 7488 -57100 27906 58296 35902 -6253 -74778 -98235 -6537 4997 -164974 -300283
15692 -300283 -327652 -323992 -305010 -208910 -116214 32906 178335 130748 105627 72745 135655
15681 135655 40329 46210 83490 138460 81792 -3609 52886 139285 62055 99305 104965 18358
15669 18358 -49793 -41247 -141565 -159011 -146161 -60702 -21913 -82028 -154477 -101187 15231
15658 15231 82608 123578 85697 132655 79771 74508 -35467 -140959 -83177 -68502 -151714
15647 -151714 -217184 -304066 -275325 -142387 -95113 25111 155762 55458 66351 77809 76732
15636 76732 62056 64883 44329 67590 -82908 -107051 -135716 -37445 26629 -47109 -67221 -195890
15624 -195890 -227113 -337850 -251201 -77046 17199 -80349 -119808 -5385 59468 37909 -9339
15613 -9339 91308 35534 8698 -807 -15736 -9656 94749 -101665 -332172 -135559 -59309
15602 -59309 -110201 -51072 -48882 -82610 -77514 -23571 62359 71418 82290 47011 30941 44423
15590 44423 36344 54485 71107 15165 41319 18399 -36018 -31840 -36853 -61105 -94662 20462
15578 20462 17744 -85591 -233912 -224964 -199712 -144444 -163034 -34432 85416 18463 36844
15567 36844 124613 97198 1477 -161 -11933 21333 43265 88072 94526 84225 -7751 62822
15555 62822 131840 105887 -13952 -38070 -54253 44899 7377 -59917 3976 98729 129817
15544 129817 52161 -2524 -16842 -60252 -123644 -157777 -128792 -145937 -53055 -90252 -136439
15533 -136439 -105638 -75050 28920 135356 172592 296438 253212 312014 295356 124579 -33544
15522 -33544 -50002 35740 85663 129248 38444 10481 -65966 -12963 5725 45879 117804 194932
15510 194932 119674 -7990 175752 120485 -5749 -105383 -62171 40650 108830 -10391
15500 -10391 -161067 -243511 -200996 -17456 78013 99291 120708 278770 198609 241716 149704
15489 149704 14272 -98213 -78084 21325 2453 -52332 17253 21890 -19481 26717 45744
15478 45744 6425 33181 28667 31973 46024 82717 2467 -48758 -106800 -107689 -214609 -289882
15466 -289882 -59492 -31660 -56147 -67945 -41603 -114709 -117774 -240798 -228855 -189328 -153958
15455 -153958 -126301 -143322 -55680 -11673 -148156 -86761 -4429 -32961 -52429 -50905 -102572
15444 -102572 -43726 27425 -47517 21368 124449 92037 77931 69626 -12487 -8078 13362 -23676
15432 -23676 -129878 -87265 -21901 -71304 -170614 -257017 -180980 -152363 -196122 -213975 -167467
15421 -167467 -67586 -60553 -54760 -11578 43215 69889 44180 41221 -1470 -51529 70341 68708
15409 68708 -44209 -35991 66921 228294 144015 18148 -59479 -89860 -24726 6936 -19410
15398 -19410 6578 87012 19692 88622 18385 -57333 -60027 -5394 20305 42858 37225 -45039
15386 -45039 -144505 -165385 -170930 -82413 -51276 106600 194787 136226 -24209 -23230 -41206 9978
15374 9978 119325 143451 193293 310405 279489 183355 108559 76547 56175 19817 -2188
15363 -2188 120189 118324 98503 51566 -93585 -93500 -33816 17697 58785 52121 138298 132511 76886
15350 76886 94879 74904 25238 103493 93713 3837 -94788 48033 142707 -6705 -46238
15339 -46238 2010 125435 131180 90553 111710 63989 9018 45895 68981 55665 51230 89969
15327 89969 138267 118206 -70065 -228268 -264111 -85955 14877 79494 118537 104126 181910
15316 181910 197077 157126 116363 147830 209548 158956 177183 120183 86480 67487 70663 78261
15304 78261 -80466 -144923 -39328 13724 -7778 47787 111527 108282 141147 115152 10470
15293 10470 3825 130033 151093 129956 43077 -135754 -191894 -111717 -41337 -387 -5076 -138504
15281 -138504 -101599 -27444 60780 72687 -37329 -39042 61018 -1475 -108871 -138199 -109920
15270 -109920 -28481 -28937 -29147 -109857 -95037 -13159 166077 184486 249072 142715 80498 102094
15258 102094 21093 52913 50106 -64687 -113234 -54242 41222 39127 -5508 -41996 17129 20044
15246 20044 71307 86131 5561 -62652 -58865 -30258 -2328 -17906 -10984 -32578 -103407 -7821
15234 -7821 105607 87790 55671 136517 165579 140480 59681 148685 139554 6178 2148 -37378
15222 -37378 -66430 -35108 -96496 -123484 -54013 -49885 -90005 -127027 -62552 108299 135372 -44039
15210 -44039 -163959 -156696 -129918 -114043 25592 41252 30168 19833 6787 -121104 -213043
15199 -213043 -180390 -31215 -30778 -9608 -8498 -20202 -136499 -167809 -27622 31865 14403
15188 14403 21982 31463 -21893 -34765 -18695 -32903 -88274 -43155 94886 -17526 14460 37332
15176 37332 43749 91802 14225 -85794 -59940 -13721 -93854 -160022 -118902 -34785 -114239 -139309
15164 -139309 -11727 45424 101678 78079 -13270 -65168 -130825 -149103 -97089 -152816 -117665
15153 -117665 -1775 85803 24325 44028 -29459 -176840 -167050 -112628 -118563 40933 136062
15142 136062 222196 122039 98092 93549 67346 -4691 -9901 169882 180188 212114 123128
15131 123128 -157115 -221834 -98395 -68077 -104461 -131709 -51474 11998 -11391 15178 140114
15120 140114 156759 172299 146526 186755 184453 112461 160160 67781 -24519 -138946 -176879
15109 -176879 -129597 -113622 -106778 -114437 -94817 -106383 -40006 -197492 -329979 -256189 -105121
15098 -105121 -7520 62228 46149 -2788 69293 74628 42082 91087 83448 44132 31332 16995
15086 16995 -75254 -78563 -35203 19598 100278 91587 98749 119559 67352 80967 157542 177015
15074 177015 129577 -31690 -60509 -24008 97471 34068 -41674 -8798 78499 87094 130052
15063 130052 216591 220844 81808 116497 56874 48082 399 -58148 -165743 -107050 -15624
15052 -15624 -80490 -231601 -367770 -239302 -125708 16060 95874 50886 -14845 -34160 -152253
15041 -152253 -108783 -100008 -30257 6978 -88704 -168104 -194996 -125368 -26808 -134373 -214144
15030 -214144 -166053 -22384 67838 -7970 12524 138169 125248 25648 -309 -19504 -60809
15019 -60809 -24778 -39543 8982 13209 8199 72713 30587 8705 -39014 -56293 -70388 -17354
15007 -17354 28321 -36031 -100225 -47707 6371 -24821 -88357 -97802 -144294 -91814 -63454 43870
14995 43870 84049 134884 64155 -30800 -12183 -110180 -227817 -228125 597 121523 86963
14984 86963 109128 52391 1445 -33754 -191805 -181454 -154986 -152681 -147920 -136863 -153517 -140657
14972 -140657 -188781 -195954 -169635 -87682 -141121 -42688 91042 65469 -47136 -89545 -121462
14961 -121462 -56149 24022 -121477 -143044 -93455 -215576 -166932 -108884 -128522 -87749 -55288
14950 -55288 40970 -27460 -104534 -53143 17982 121706 124472 46055 11628 2603 10046 -36494
14938 -36494 -75839 -84111 78792 130769 251290 301639 219240 192035 122262 -38624 -77971
14927 -77971 -69810 -35963 -96148 -166930 -136218 -115343 -16270 72600 35549 -29669 -32898 -133494
14915 -133494 -127186 -43949 141557 174848 30901 -44689 -124518 -203247 -273466 -273871 -237714 -193804
14903 -193804 -180783 -146879 -79655 -89298 -81905 -85853 -164652 -187430 -144421 -130919 -96589 -111918
14891 -111918 -59180 -36751 32751 93952 128901 39573 13858 78738 61116 46907 64404
14880 64404 -34704 -140958 -81798 -126407 -177232 -83840 96 44157 -61373 -42167 34000
14869 34000 87693 115265 99899 94204 148619 166049 65268 -15301 3623 -40165 -56862 -92964
14857 -92964 -140285 -114966 20706 38935 -23547 -109613 -78190 -18428 40410 107065 52742
14846 52742 95497 153587 111187 155256 178375 149794 143753 104241 135488 84095 66916 29372
14834 29372 -32994 85299 108018 53581 36669 -74310 -221843 -194097 -240424 -282529 -292807
14823 -292807 -275190 -220938 -87418 -35347 30987 -43367 -29492 -13548 -64749 -29599 -67424
14812 -67424 -100902 -78151 -73452 -36704 -627 55951 175753 199519 83856 -39511 -115195
14801 -115195 -151978 -155991 -53916 -54213 -38228 -29035 16190 51445 51632 -18284 -100933 -62260
14789 -62260 -91621 -134914 -232168 -188463 -97960 -65648 -103719 -81195 -68459 -140267 10742
14778 10742 106664 21155 -101551 -64244 67539 181003 210658 183793 99036 105973 182393
14767 182393 18767 -38892 -41008 -112118 -121004 -131135 -241305 -241959 -103477 -118478 -206559 -115294
14755 -115294 53490 58522 -145399 -77622 40062 30373 10746 -4982 22893 154058 56125
14744 56125 17216 -42068 19662 -8501 -39232 131224 172312 147289 64056 33338 -3458
14733 -3458 96287 144978 142422 99830 12796 23210 26939 16741 -87596 -166461 -165863 -176669
14721 -176669 -122672 -178346 -118483 -103551 -10439 68090 58307 83177 55891 67622 17714 51385
14709 51385 9584 -70347 -15515 22485 -15665 13593 87315 111938 85947 94524 81511 -21607
14697 -21607 -63368 -116972 -103366 -70319 -46012 -24262 14642 57527 -17629 -14682 69559 141657
14685 141657 146952 75347 -19497 -20573 -66727 -103075 -85124 -93649 79951 88640 66069 128353
14673 128353 52794 -74842 -208112 -122452 79118 -28849 -51429 458 -87873 -144670 -191742
14662 -191742 -212382 -103651 13973 48069 43889 51098 -6955 18973 36040 -2534 3555 -95761
14650 -95761 -123752 -214159 -317215 -331459 -197791 -50185 38560 -19120 -108973 -128911 32783
14639 32783 -17741 -140980 -81840 -89826 -164998 -246993 -321951 -268370 -269922 -174929 -103691 -69469
14627 -69469 -6921 121671 144183 48709 -26387 -39236 6319 30342 26787 41722 -64797
14616 -64797 -78590 51630 139111 109940 21653 67161 61336 172148 162522 122563 124452 109642
14604 109642 103442 157094 175818 136161 -8560 6432 32784 -9775 -38136 23725 -34183
14593 -34183 -99419 -15703 49129 29159 27196 -60131 -94180 -51406 94849 136927 106830 40566
14581 40566 111437 112917 195185 149065 129028 37528 -67271 -150656 -128757 39947 177685
14570 177685 106293 51254 92850 92015 128274 161454 170459 209753 198603 220967 293956 83989
14558 83989 -15366 -28596 -60153 -146580 -242335 -289562 -234534 -185993 688 99478 15982
14547 15982 137362 69959 31945 -69013 -221165 -193861 -127347 20874 17870 16782 43494
14536 43494 197643 218150 158097 65925 -3550 -73616 -132634 -159576 -66093 -4155 -28610
14525 -28610 -59200 -11027 -43372 -114523 -150711 -175725 -35825 26092 34529 -37806 -89863 -11484
14513 -11484 31827 -57913 -92243 -111034 -86444 -81402 36255 127521 114082 26127 -43771 -55623
14501 -55623 -106471 -119567 -244835 -225104 -89821 -64387 -97281 -175819 -153474 -120792 -132206
14490 -132206 -7546 592 -102093 -21434 87464 142653 23686 15253 38661 34083 -7756
14479 -7756 -93870 -21245 -51771 -53571 -72365 -36294 -118526 -92711 103264 117034 47223 83040
14467 83040 111881 77498 10862 -94790 -126011 -227570 -201909 -161466 -63422 -76166 -94605
14456 -94605 8075 130637 55129 25322 31527 36749 17800 88857 87072 16146 -2820 9811
14444 9811 -31971 -45573 72176 160660 47479 78189 12135 23410 52234 14003 -33428
14433 -33428 27856 78503 88918 10089 -44021 -80670 -29413 75507 156747 129753 11424
14422 11424 69804 61401 53427 19233 -74728 -99116 -99784 64575 124027 58487 47306 138098
14410 138098 112286 -30527 -65520 -144873 -261207 -96531 -32737 -102582 6696 95514 34576
14399 34576 -21291 -116989 -65135 -14037 -6848 49488 93087 -8981 -58616 -100616 -265810
14388 -265810 -220392 -186829 -133707 -141028 -101100 -177562 -155513 -160307 -114910 -159329 -171124 -89747
14376 -89747 -26754 -125962 -119353 -108614 -51011 -21762 -6935 41404 123746 174361 179149 124265
14364 124265 63716 52019 169202 229933 159707 106491 123099 161563 -42856 -60757 -53517
14353 -53517 -10724 106086 158804 107579 171166 227666 140050 -9240 -120851 -164577 -87204
14342 -87204 -22038 -98506 -112767 -92202 39889 -609 47669 92362 210514 173384 30169
14331 30169 16618 -30177 -122328 22363 23670 9537 3454 -73604 65216 -1675 15863 61802
14319 61802 35898 -7110 -85093 -68258 -7078 -29845 -76631 -133196 -81162 -96328 -58441 -118897
14307 -118897 -126965 -97478 -114093 -81956 -75882 -23614 -58127 -97296 -141507 -185402 -225573 -49961
14295 -49961 67630 94176 85101 66514 5787 -21483 11716 33000 45148 96642 100127 -155281
14283 -155281 -303336 -222625 -189820 -79440 -38944 -48306 13290 10431 -8957 -58223 7554
14272 7554 47830 -26683 -104408 -38738 -31204 56087 235996 266987 236066 159606 127773 141617
14260 141617 59827 -52152 -164088 -148280 -138156 -71048 -125433 -90392 8444 -83384 -185482
14249 -185482 -140083 -112838 -97868 -65804 44676 103518 37797 -46394 16908 12473 -9993
14238 -9993 63656 -12482 -55103 16394 86680 160128 53231 75178 194394 269071 93361
14227 93361 -65239 -91599 -71049 -107260 -117562 21117 23285 63121 27613 124715 235811
14216 235811 229895 142156 168252 157669 124457 94374 118048 41378 64089 189619 186826 25048
14204 25048 120036 194138 229553 218836 94525 -42508 -79113 -76160 -62643 -27092 -65019
14193 -65019 -64209 -12289 115762 209165 163676 76294 -6221 -17721 23409 67226 134540 232728
14181 232728 190694 124247 132450 86738 41058 46922 110427 59980 26644 -109180 -206704 -175090
14169 -175090 -123776 -97385 -164329 -186085 -206900 -246627 -221668 18062 107746 29609 -52145
14158 -52145 -128153 -171888 -239857 -92439 57038 25674 119229 141852 39094 -99842 -168683
14147 -168683 -135271 -139517 -58486 -14740 15514 -50552 -71510 -67791 -122879 -108181 -52180 -125506
14135 -125506 -79607 100054 140446 -13911 55537 157436 128529 162465 134309 76965 -19697
14124 -19697 16685 -44137 14494 29880 27353 65969 114751 95740 -13279 -145278 -128146
14113 -128146 -187982 -211460 -74688 -83720 -121148 -183599 -162717 -115013 37647 28126 -10265
14102 -10265 42357 104874 55094 -88472 -165285 -54149 44805 14454 68729 139001 16525
14091 16525 -35144 -114359 -33171 24686 -41870 23259 21291 -59236 -14006 -33706 -64613 -59682
14079 -59682 -49987 -31937 4813 -13361 -45637 15888 -252 -35499 -76131 -260 -89072 -226544
14067 -226544 -106467 4535 -15916 -39779 -152595 -167447 -139061 -152012 -16004 13964 -77699
14056 -77699 29435 150729 181938 100776 97026 195205 194368 149006 135335 46235 -80667 -184700
14044 -184700 -156515 -181982 -87319 54298 -64158 -210850 -197850 -171164 -279655 -156633
14034 -156633 -82737 -7059 -56179 -42358 -3629 -44716 -82230 -1957 10483 -64804 -69898 -93741
14022 -93741 -74396 35577 43337 39186 48389 52970 113394 63041 36011 82769 71693 65303
14010 65303 -69916 -138308 -246303 -208206 -65608 -85839 -146424 -160030 -105506 -107762 -77991
13999 -77991 -114059 -44625 1718 -75406 -143942 -29571 -7624 -28635 -28168 -47560 25938 52384
13987 52384 27637 -41944 49209 28282 -31324 -32794 -4423 -23670 -2611 101075 98961 40409
13975 40409 -39800 -33266 25540 75146 -44153 -26803 -30165 -6272 107932 106099 23071 50284
13963 50284 -10310 -97577 -137494 -208284 -243021 -91718 -127068 -124862 -185194 -192762 -190520 -176802
13951 -176802 -173153 -146085 -144938 -50812 9370 23341 -35569 -29174 -66291 -47791 -93135 -110371
13939 -110371 -116571 -106698 -107895 -114891 -138568 -89202 7527 118181 501 -114987 -114077 -22972
13927 -22972 22475 -103211 -83065 -60340 -76794 -180424 -111095 -46432 1435 60414 120265
13916 120265 11227 -43060 -64859 -67562 -116700 -234464 -49699 83135 81955 53766 12002
13905 12002 -115206 -164403 -198022 -131177 -982 -4743 -73141 -7295 -62034 -129543 40655
13894 40655 72023 -1792 -4262 -5758 35012 -79899 -162613 -8204 85463 -6845 -144107
13883 -144107 -141274 -147115 -83917 -13020 19883 102597 51097 77669 29214 38017 -78250 -139580
13871 -139580 -81717 -51227 -147811 -197956 -174182 -125039 -75583 -87347 -66986 15281 -43792
13860 -43792 -67982 -44591 56761 107110 72684 39478 -21694 -44404 -24026 -141465 -203422
13849 -203422 -145233 -80638 -162143 -116837 -55664 -47819 -38813 55587 69996 -21162 -52714 -5417
13837 -5417 -12549 -73450 -100219 -61165 -15286 45163 106411 72390 96998 101467 46798 53163
13825 53163 40675 43446 79283 48508 92723 -17777 -80358 -39959 -22631 71996 116521 54769
13813 54769 -19060 -81053 -141429 -128330 -100910 -151469 -97982 -35669 -41120 -85675 -123123 -163028
13801 -163028 -113209 -74422 -54915 -57262 -21784 69922 106265 42258 46274 81225 34279 -109765
13789 -109765 -124184 61158 20697 -99984 -112206 -69606 30150 35449 37904 687 -71323
13778 -71323 14460 88141 -13854 -37081 -111857 -113318 7433 -114755 -156657 -207670 -83840
13767 -83840 -39382 -102953 -199926 -138492 -33482 -72317 -70899 -44870 -125758 -129977 -238220 -203414
13755 -203414 -184716 -237311 -163290 -94905 11197 89097 52455 159542 246670 190398 131406
13744 131406 78268 50641 -29424 10288 14722 32127 89566 171042 206083 108928 27939 62791
13732 62791 27168 2630 103969 159341 197364 277918 227161 111384 53444 -34644 -75463
13721 -75463 24249 169214 91073 -112966 -183042 -156389 -98091 -45309 48828 3521 -147531
13710 -147531 -172361 -79893 -106448 -96999 -60059 -9520 5992 -79892 -114128 -41816 12825 -40471
13698 -40471 -142205 -112536 -31256 116020 85106 17217 -49681 -92048 44281 1120 -339
13687 -339 90237 83790 105910 33102 19314 -23744 1743 42726 59868 139395 18324 2153
13675 2153 21818 -1807 4512 -53586 -52107 -61512 44676 30299 49193 26907 46767 110832
13663 110832 116148 148889 224849 308897 168426 86266 81277 -73731 -170525 -101973 10383
13652 10383 27523 78329 91886 78666 71035 40132 9933 16210 42289 73585 74156 26888
13640 26888 21121 17962 -40544 -19640 -54511 -47691 15469 134494 107302 48815 208370 353787
13628 353787 370952 207951 88651 180542 128017 -6011 -49616 -114206 -96226 -9202 6399
13617 6399 -64953 -119281 -31940 12672 -29120 12364 75179 24850 -115296 -122983 -67807 -129165
13605 -129165 -134666 -79643 -142083 -214190 -194095 -95479 -36446 41254 89918 3836 -49087 -7762
13593 -7762 56221 73008 57055 -36595 -147937 -72837 -124362 -95930 -102703 -121447 -99627 8450
13581 8450 21003 57211 40937 -73470 -57680 -49538 -118193 -111753 -8651 61820 54282 59563
13569 59563 74709 155622 205279 159224 122656 -13875 -146744 -60786 48663 134740 177450
13558 177450 98965 -54155 -78668 -74106 -47903 -38957 109420 157352 96511 96891 77484 1658
13546 1658 -38940 12253 -89758 9216 147481 151648 110272 127552 84207 42792 93376 259780
13534 259780 166777 15085 -172680 -247378 -118242 16473 128040 176318 82217 -132898
13524 -132898 -101775 -8889 90082 -16878 -48348 78099 22825 52131 8214 -76018 -57154
13513 -57154 -46784 39465 54401 -74829 26501 138282 232074 178593 -18040 -83706 -126930
13502 -126930 -93938 -41333 97554 47071 -38276 -50242 -22196 -71877 -131540 -240654 -223199
13491 -223199 -126930 -68901 -45926 -94885 -93224 -24996 -8284 53639 -21487 11447 63711 22933
13479 22933 -121197 -148592 -36357 14859 10621 -22896 -45969 30814 11784 30934 94268
13468 94268 112631 154127 191432 193055 181157 133707 108167 170037 177042 4247 -11202 130482
13456 130482 104199 69408 -26801 99875 22048 89708 42928 34027 14942 -25551 -36846
13445 -36846 -28361 -87492 -39884 51541 40361 68763 67889 105697 143954 161587 189622 165238
13433 165238 73562 41973 -1596 3234 -39362 -13514 -90698 -83255 -49947 -45177 -85172 -176685
13421 -176685 -67032 10110 -41884 -147520 -66051 2558 42159 -2589 -20188 30440 -82351
13410 -82351 -194415 -78199 38220 101783 34228 -17518 -112199 -146636 -164337 -177607 -223663
13399 -223663 -210805 -69859 -105613 -197671 -128259 -132499 -131607 -25912 47220 35508 35946 -36782
13387 -36782 -99841 -246121 -278358 -223303 -225455 -167522 -50598 9609 37618 -47594 -136360
13376 -136360 -226769 -220023 -188214 -121705 -173649 -202717 -192847 -93230 -146161 -226059 -175333 -195542
13364 -195542 -51761 -24723 -71625 -9835 45911 -7314 -9810 61709 146397 127536 92748
13353 92748 44131 -9817 8206 22717 89862 99915 48232 -24546 18431 37259 44074 62689
13341 62689 71230 134731 168430 77624 78290 51271 23734 -42391 -118038 -76043 14679 -22486
13329 -22486 -45469 -493 -2870 83006 86286 29496 18258 36208 -4280 1464 -4654 -5652 -125828
13316 -125828 -102335 -37201 -15427 20900 -17079 -99735 -113282 -1478 63993 10788 -19432
13305 -19432 -165913 -145166 -4014 40260 -57998 -63973 -49129 9959 -2730 5549 -20841 -13481
13293 -13481 -11904 95981 202213 277227 244470 192382 135320 58668 19944 38848 52803
13282 52803 -73456 -149351 -138107 -157549 -149287 -63595 -7398 45192 68719 18631 80192 159359
13270 159359 47607 -9707 32382 22260 -3769 -54395 -62039 50034 140042 11813 -111058
13259 -111058 -148088 -217514 -225742 -155164 -68843 -104918 -127305 -56563 -29863 -50860 -134249 -46791
13247 -46791 -7160 25964 30454 -38420 27851 108940 6452 -71043 -191340 -177984 -126047
13236 -126047 -149360 -106368 -11352 13029 2881 -59255 -102156 -59997 -91120 -98927 8871
13225 8871 3949 -56837 -92554 -106060 -81905 -6249 39138 83746 129633 191116 127513 80273
13213 80273 69873 -23030 -48927 -118381 -67039 -99248 -73806 -102161 -97958 -51499 61072 60957
13201 60957 -74979 -121066 -85575 -54603 16243 86348 61564 -8935 -94306 -25117 -5328
13190 -5328 8162 95140 23061 -37646 32944 125774 93244 25532 -43569 -40580 -69754 -97816
13178 -97816 -182221 -199053 -141704 -136111 -43866 -64489 -49315 -78278 -92145 91615 184410 162891
13166 162891 206434 203670 179977 189987 188254 150214 1890 -110334 -28789 -9168 -87425
13155 -87425 -12202 152558 159405 107500 155389 127650 58391 58854 86236 59981 -66603 -74778
13143 -74778 46184 -42929 -33912 7140 45094 39511 133269 201208 179505 84404 139081 105089
13131 105089 131495 80270 6622 -131949 -102883 -53252 -99894 -147716 -156159 -203725 -50952
13120 -50952 17171 85081 6528 32464 30129 112707 118628 3682 -78061 40981 193240
13109 193240 185049 91969 101918 118445 93798 64246 46942 13540 87489 70724 28135 95586
13097 95586 150046 186213 209588 113322 160891 106895 -30508 -82586 -133064 -148999 -154911 -109984
13085 -109984 -101679 -88759 -16952 -27553 86823 242865 256687 185917 111765 157415 193520
13074 193520 152443 151541 99542 67700 82202 67051 69486 104034 39806 47071 1648 -75443
13062 -75443 -43368 14126 37219 105905 83108 -7318 -102921 -136802 40113 76172 813
13051 813 -11051 2308 98816 118775 -76484 -157185 -124928 -48425 -102768 -150924 -103009 16916
13039 16916 143788 213715 214506 182236 127269 66040 -13614 -133472 -199418 -158837 -195474 -29221
13027 -29221 56098 -36085 6003 -83 15444 -11869 84644 139185 86086 165954 130229 207672
13015 207672 178433 93345 143551 120658 149589 105883 160782 146034 157208 198422 247857
13004 247857 231595 119035 -27619 26880 32461 -2157 2709 -12045 -66776 -28766 14643
12993 14643 23193 -40310 -85892 -41543 33793 70630 112760 145306 129738 119505 129964 16584
12981 16584 -33657 -7670 86110 253594 183331 103400 54390 -46425 -110710 -45109 -56960
12970 -56960 -24377 32897 138644 311526 201591 56206 73655 211541 91765 -104273
12960 -104273 -287394 -255801 -59606 100990 1977 21573 76291 -15526 -108280 -61560 67174
12949 67174 70359 8006 -92540 -79371 -58835 46885 87555 34976 92954 -20954 -73757
12938 -73757 -29958 7682 43979 85803 115789 16886 -18692 27053 -8750 44584 61238 101505
12926 101505 173313 137660 45596 44577 121107 171711 60622 -111364 -31720 7942 -52484
12915 -52484 49349 -13460 -39965 145411 239424 175789 68031 6028 -5580 67984 139064
12904 139064 -3784 -143387 -70595 -152124 -104831 -66295 -128320 -58543 -47335 37358 111899
12893 111899 135810 104946 58068 8589 28117 25853 -75732 -84475 8857 -13212 -43584 -43796
12881 -43796 40427 139698 -1154 -16058 -5417 -64015 -34360 24226 235588 262775 136870
12870 136870 54235 -11557 -57676 -36249 135249 170105 134745 159538 142805 91526 52295
12859 52295 63828 -70360 -139584 -128025 -107085 -111984 -121362 -32289 28287 59218 32373 -5466
12847 -5466 -9688 61546 39699 21034 -51754 -76377 3917 50491 133855 154938 53961 -30942
12835 -30942 42489 119297 125305 157068 168236 225714 168724 163259 210573 162253 5246 82694
12823 82694 82170 128421 147304 123088 46643 82013 146004 107802 57132 -5049 66259 153044
12811 153044 172702 115220 36312 -11760 42371 155606 59174 -41567 -129406 42923 112150
12800 112150 39489 8664 138666 95467 43712 109857 77564 81229 19224 61537 20447
12789 20447 -10063 62908 43803 -76170 -62852 -36545 -28788 -99661 -27344 22218 6448 -79831
12777 -79831 -59304 95910 152510 169885 184185 31853 -135899 -141930 -90037 -26720 -20463
12766 -20463 99515 215762 154070 -17029 -167851 -289599 -160071 -158434 -197921 -141049 -142635
12755 -142635 -11188 -42629 -59862 -108436 -27092 -18029 67229 91320 152631 155034 72116 60148
12743 60148 7523 16265 -724 56975 54729 -52974 -52103 -130493 -103711 -52027 -70371 -32444
12731 -32444 23094 8087 -21015 -166551 -207521 -18174 80673 5761 -90508 -77599 115104
12720 115104 136581 81382 107668 115790 63100 -34138 -144199 -305440 -216733 -155150 -318109
12709 -318109 -267778 -248785 -281879 -271476 -240807 -218856 -192177 -168916 -86846 -33983 -96621
12698 -96621 -34758 -129546 -87253 -33155 -8746 130105 167452 83531 -81611 -46111 -31677
12687 -31677 -37886 11459 26696 -5132 39457 109930 140933 101165 98937 39240 83138 50692
12675 50692 -99535 -175230 -115387 2589 -33811 -173115 -125810 -140980 -130761 -98375 -56608
12664 -56608 -8733 15348 81486 149158 69462 32380 -26201 -194191 -200850 -199729 -290385 -175844
12652 -175844 -23165 24058 -88376 -43291 92975 136236 240334 160806 31058 -71339
12642 -71339 -80837 -85152 40826 53735 27858 -80973 -92323 -155907 -200782 -141449 -65541 -48537
12630 -48537 37928 61670 96840 7549 -68121 -172845 -206323 -61730 46216 72634 41289
12619 41289 57087 149688 148325 62059 -27953 -134997 -97247 -9216 86078 233316 167777
12608 167777 111051 66322 21565 21749 -48935 -138346 -191791 -129854 -74370 -81264 -9627 -3139
12596 -3139 -498 8329 11889 -16591 7821 21206 53036 25606 -102328 -80279 22031 -6362
12584 -6362 -51743 -75498 -108813 -12647 3716 34343 -58408 -9996 70759 47194 -6428 117297
12572 117297 191915 148623 108446 39241 4790 -51922 -106761 -113762 137857 199813 222230
12561 222230 100737 15815 3040 116900 38449 15946 19276 -87598 -136515 -95457 -35801
12550 -35801 54484 90080 43073 102516 82517 3790 1272 -20645 20543 105667 153074 239206
12538 239206 350316 404853 373472 361677 386638 379015 280296 313123 241899 231385 217290
12527 217290 119361 -25598 -28662 -39413 34485 165484 244901 322883 221381 118846 8914
12516 8914 19882 128715 176329 158047 128688 42608 110505 175142 58221 154336 236016
12505 236016 187376 179461 93423 66374 101571 219137 257427 196037 202338 322141 444287
12494 444287 402891 236234 187737 175155 249499 282130 232688 297044 278624 314584 363611
12483 363611 199853 3575 76239 113669 66100 74962 2666 -66534 -36417 61604 162616
12472 162616 192054 221695 259739 237201 121814 44038 118427 171212 119078 284525 342401
12461 342401 181697 159469 125943 190987 185142 186707 127831 -5272 -5683 -5119 58142 185020
12449 185020 171531 136086 197464 244978 370432 378871 306579 270316 324687 288720 144480
12438 144480 66752 81121 112163 20003 -90959 -12353 80930 118834 176735 151353 119876
12427 119876 61836 143650 82468 18935 -94239 47278 58121 99988 88573 133909 97171
12416 97171 -17803 29819 128790 179988 71694 -11173 -110126 -77770 -44931 -35089 9556
12405 9556 35085 18704 -61171 -70025 -16317 -45678 -79499 5199 11604 18293 128638 195431
12393 195431 125551 70416 -38997 -74293 -19802 -72067 -82971 -36448 -4490 -21602 -61075
12382 -61075 -116721 -73187 95252 51955 -26385 -172164 -270863 -372527 -389143 -307454 -313823
12371 -313823 -254826 -293527 -169984 -18571 -49800 -70597 -62234 -60877 -35872 -56382 -63038 -30856
12359 -30856 6058 -17346 -56584 44198 128614 107542 271007 245985 168358 49173 111946
12348 111946 139864 83183 22713 46558 66139 77518 -19120 -17955 -31908 -28213 31392 155391
12336 155391 92011 -17405 75999 118670 119547 53743 -71816 -117334 -93304 -61013 -113863
12325 -113863 -185159 -134241 -53543 -104296 -165661 -84492 -19190 -73096 -38093 -3412 -159190
12314 -159190 -243281 -249175 -267401 -163585 64490 59552 -16821 -134169 -200398 -66044 114267
12303 114267 130320 165452 152694 128520 109572 124307 119217 143077 120763 96933 44889 -34304
12291 -34304 38698 16063 -65455 -98282 -111088 -23820 67659 111984 124290 174020 143794 104467
12279 104467 5106 -12504 54929 19561 74845 106892 85450 72839 75503 9740 -6451 21873
12267 21873 24161 -8577 33799 25813 27838 22230 82088 187178 124543 180038 196245 158405
12255 158405 39158 -42066 -95553 -23111 31415 147114 154645 49639 -57641 -110884 -25679
12244 -25679 -59645 -72211 48792 66483 80694 166693 164206 111364 151555 120386 77445 -12747
12232 -12747 -29903 110221 138826 97158 86628 -37570 -143081 -72512 637 167569 235913
12221 235913 178252 108015 106052 6249 -45823 9199 137391 152120 85173 48908 -57931
12210 -57931 -74107 -170894 -114974 59831 138512 212233 254036 186168 -39292 -105364 82593
12199 82593 186703 137427 67269 -19758 -55292 20750 57102 37892 76261 126954 86928
12188 86928 -80724 -66190 100175 124002 84643 65229 78244 102555 112665 130044 203997
12177 203997 145147 -3186 -20197 74836 62136 -54768 -120856 -73521 -12470 29554 64024
12166 64024 -111855 -69009 44315 61745 112091 78084 178160 207859 92191 -6992 8196
12155 8196 -75010 -187259 -141880 -52165 -62260 -93482 -153127 -148673 -98007 -160264 -218832 -102938
12143 -102938 -149399 -55872 26643 -46184 -31246 -90938 -102892 -77115 -74449 -44920 -40721 73444
12131 73444 172730 213115 115120 57665 126117 167549 160358 125221 70633 -47221 -170114
12120 -170114 -167376 -58538 26751 84846 -790 21576 -470 -12732 -32063 988 62010
12109 62010 83449 -16853 -79218 -29667 -16078 -32538 -12879 -26862 -21901 24036 19571 -3515
12097 -3515 92678 247176 249244 245845 85354 6494 4228 40678 87905 128720 142282 148965
12085 148965 54347 59503 -41125 -52319 15076 39002 1578 12876 45574 50300 26042 -149988
12073 -149988 -264690 -189387 -111676 -77213 -109016 -331892 -383548 -338197 -188562 -66146 70738
12062 70738 94207 115555 272850 243461 140377 64404 54804 5168 -164618 -208086 -93857
12051 -93857 -151633 -3533 54688 67567 72679 122229 144424 20638 -80011 -74798 -65524 27480
12039 27480 9443 -85319 -36382 69879 75262 14998 -9790 -62788 -49050 -96232 -116490 -29931
12027 -29931 94906 208843 259657 244970 83005 30411 20704 -57445 -40703 -32334 -108356
12016 -108356 -128982 -182174 -136206 -195423 -155236 -194923 -161069 -124746 -151456 -165039 -87157
12005 -87157 -10166 25663 16522 28944 63196 2846 -7690 -89698 -63256 -22292 12246 -9408
11993 -9408 -130075 -106692 -1000 -6626 -37367 49711 90813 92144 149472 237149 94406 55772
11981 55772 198247 248421 112453 82525 16783 -30215 -131638 -189319 -213162 -58941 -37678
11970 -37678 -106723 -135920 -103430 -36453 -66147 -113536 -124299 -77621 -51967 -8505 39119 122283
11958 122283 189047 247566 268093 212598 95132 65126 143309 117467 127013 150842 92921
11947 92921 27207 22474 47262 32347 102419 116566 50437 15042 81712 -31943 -91833 -33402
11935 -33402 -97607 -165296 -113241 -94857 -170911 -174339 -60283 26017 -8041 -67269 -97246 -225329
11923 -225329 -237177 -210265 -223214 -162177 -52659 -38416 233 89162 53479 -98228 -63695
11912 -63695 -168688 -216814 -114857 -44226 -87610 47413 51150 -47413 -69119 20431 82024
11901 82024 98429 56836 -1422 -5155 61839 149233 86574 34583 84112 185714 225294 134861
11889 134861 50359 3839 40859 -54811 -84520 -10127 -127609 -170376 -182590 -113196 -75407
11878 -75407 -2412 -8983 -33937 -57978 -3242 -97708 -198124 -148465 -53383 -35451 -52044 2749
11866 2749 45091 15581 65163 39568 -75232 23703 113778 126518 52514 -58174 -32752
11855 -32752 20986 14517 -122584 -179545 -86387 -66801 -2192 55542 -9277 25439 65581 14981
11843 14981 -32984 -76429 -32385 -32625 -6778 55902 60651 90075 198278 182288 123370 25711
11831 25711 66049 143257 71132 56944 7443 -65132 -63268 -67155 -115271 -120478 -155741 -104777
11819 -104777 -3247 -11670 -22468 16939 56909 38269 34854 36581 -57515 -102060 -198958 -206936
11807 -206936 -210409 -30864 142941 26102 25934 55162 -65482 33808 142498 92782 20167
11796 20167 18715 -29681 -77963 13162 39923 73002 -47373 -37111 22229 8528 -25775 -128349
11784 -128349 -46265 85525 53871 16998 46412 106742 192921 139856 166386 78809 -40847
11773 -40847 -53397 10835 119459 32845 -63123 -72148 -98073 -58423 121822 99027 15869
11762 15869 67896 43665 11807 34054 116480 75459 51658 105914 100329 157824 122915 -24970
11750 -24970 -108598 -95076 -173327 -155017 -23411 13307 -11450 -42228 -102591 -79677 -134413
11739 -134413 -143268 -188782 -172841 -121796 -99622 5520 -34489 -34378 -75101 -107242 -163286 -205691
11727 -205691 -232796 -206861 -90819 426 23735 46767 3825 -21091 -113809 -149455 -76422
11716 -76422 -12970 36223 96413 56192 -11699 154913 130044 69903 51041 -16728 61069
11705 61069 166656 142935 128485 135175 228641 237005 145240 13092 29563 -39027 -150912
11694 -150912 -95465 89167 56081 98490 73789 36977 72247 153193 296834 260359 173274
11683 173274 103287 171386 179473 170820 121517 36246 65112 -38968 -195898 -308471 -188051
11672 -188051 -98732 4873 79276 162008 163070 222514 259904 293152 99504 -35772 -154637
11661 -154637 -165064 -142268 -25813 77 -21772 -52965 -71431 -110966 -156567 -146720 -143978 -62342
11649 -62342 -47469 -197207 -134615 -178613 -255221 -210122 -85511 14467 102591 187773 192274
11638 192274 216971 191269 83432 -7657 -123103 -26753 -20162 123521 79573 129445 216888
11627 216888 221428 192090 146965 109955 4432 -5930 -67234 -30450 -80310 -40283 64556
11616 64556 82854 107380 35951 37747 -5836 -115957 -117323 -83621 -59357 -31285 -34176 -81786
11604 -81786 60342 29324 -61782 -4221 -9729 -49424 -134770 -106454 -122416 1736 26294
11593 26294 6442 104960 182033 177128 175655 48506 -47225 -21536 13041 68858 108535 153033
11581 153033 164285 141739 121780 15311 -12780 -36701 -157341 -157281 -143450 -198057 -268450 -178587
11569 -178587 21602 56706 -94332 -213501 -199872 -221941 -189855 -102622 -109549 -286075 -317093
11558 -317093 -143536 -26162 24312 -56257 -106678 -134433 -83359 -7180 62640 18454 -31297
11547 -31297 -23703 -66818 -147000 -106099 -79063 -26269 -52827 30510 56942 59976 118854 186258
11535 186258 100959 -29792 -50652 -12031 -116805 -113838 -139531 -247916 -107986 -19106 -123587
11524 -123587 -133088 -99939 -143723 -120974 -209151 -142043 -102728 -61088 -36256 51750 -18862 -68958
11512 -68958 -91293 -160634 -63126 72219 217540 291027 209240 190975 31786 5855 9694
11501 9694 -43831 46542 -36427 -52204 19763 -79601 -58817 -50471 -100519 -77294 34774 -34612
11489 -34612 -45163 -52718 1353 58088 179176 257752 189620 95142 65197 36344 -3785 -4279
11477 -4279 90910 24339 28444 63487 -14082 -45211 81498 90664 -36031 -29871 43757 88911
11465 88911 114649 22289 70193 73465 85651 143010 197294 199569 57113 -42341 -18679 5520
11453 5520 71697 52510 42764 -58185 -54077 12716 -62611 -149356 -104723 -131504 -166426 -259715
11441 -259715 -368526 -273375 -31012 37767 -4651 -28384 -10178 31614 150688 34587 -73262
11430 -73262 -94581 -140918 -27369 -27544 -35766 -6971 -109196 -172152 -67259 8746 -22492 27409
11418 27409 23181 -11357 -99604 -72788 -121613 -175427 -127664 -116510 21578 -48204 -43873 32206
11406 32206 19447 103632 215288 186186 125550 127052 71737 39739 -19958 -82372 -45836 1923
11394 1923 -87806 -45055 1896 -82690 -146466 -125504 -110972 -136374 -94294 -68676 -71753 49287
11382 49287 99566 -438 -95401 -161239 -217574 -148864 -96748 -40154 -31288 26816 -10093 -83464
11370 -83464 -127213 -155750 1095 27649 31880 80163 155882 156783 153356 188169 244139 139165
11358 139165 116417 26907 32004 103207 103251 -743 -17038 -93963 -139778 -148033 -74491 -157330
11346 -157330 -72025 -48950 -27186 -4638 -194552 -113666 -189102 -150767 -136938 -9696 -111985
11335 -111985 -173505 -175476 -202632 -158820 -51739 17406 86020 138811 139075 111757 182309 258754
11323 258754 200920 182065 235519 135102 127290 71396 163145 89942 -68915 -48806 -24083
11312 -24083 -39264 48540 54708 64618 94753 164620 85385 -60569 -92118 -66595 69418 -34524
11300 -34524 -10657 100943 107811 96985 82213 123412 85926 83434 201376 248376 121531
11289 121531 27699 15647 -104507 -40604 75657 135587 118801 142607 178826 159500 186555
11278 186555 221167 181010 201847 78942 4112 -9453 -95576 -172131 -76748 -49570 -41826
11267 -41826 -56823 -73990 -111981 -76222 64644 99897 120913 176964 172688 129974 64188 49018
11255 49018 39350 100497 69855 25345 -1437 -38969 -35708 13712 38322 60941 -5410 -85418
11243 -85418 -148294 -83348 -130598 -52435 -17179 -46089 -54913 -92717 -102301 -27444 25680 -74382
11231 -74382 -75793 57611 34952 -46250 -56043 -17476 98879 146531 74534 120965 115051 47346
11219 47346 -39264 -45706 -2230 110148 25797 -89064 -72564 -192262 -288727 -226929 -131856
11208 -131856 -60200 19197 77705 30307 92595 19970 -42768 53993 70817 -41659 -34107
11197 -34107 27551 13580 -56502 -164344 -152646 -59491 41174 34064 31842 33194 111420 25594
11185 25594 -84413 -4488 79627 12542 -15699 64169 75580 39839 17829 -16719 -66668
11174 -66668 -46691 -1544 82237 107328 135530 117897 145023 57780 -10563 -62040 -62793 -18646
11162 -18646 -57784 -11887 32870 -59357 -118458 -160634 -173079 -124544 -129788 16748 73561 -8092
11150 -8092 -107820 -110900 -57949 -14031 -60100 -76168 -52547 -103860 -139808 -81350 -40088 -97637
11138 -97637 -71063 108107 124465 112221 39483 95791 176667 102360 66150 106258 2954
11127 2954 -74220 -118060 -116238 -34423 -66717 -146698 -110057 -82143 -17091 -26103 25770 154793
11115 154793 95668 88169 100774 7592 -109692 -137506 -129954 -90800 -142687 -123266 -131587 -128420
11103 -128420 -132528 -169498 -136712 -232712 -172685 -90878 -43852 -15628 -16248 62090 53044 1094
11091 1094 115399 185425 102344 -31780 -137481 -106995 121470 156798 144029 201103 100226
11080 100226 -29452 -84566 -33512 -284 91626 178329 177898 154692 177399 284205 168725
11069 168725 -35049 -183305 -95895 -51030 72227 52012 -74844 -51966 -29754 90784
11059 90784 5181 -142066 -256562 -117372 44205 39203 -10154 -85398 -174856 -189667 -35502
11048 -35502 24165 -51147 -27628 31977 -5896 -52079 -12519 -91646 -196983 -161077 -143305
11037 -143305 -109852 -113679 -117576 -115413 -199067 -162837 -143821 -101826 -4797 -35844 -71050 -34380
11025 -34380 50004 15518 -123987 -144164 -97023 -17366 1493 96381 270735 176961 5675
11014 5675 38742 81300 46223 -13641 -87783 -87079 -59909 -162805 -203145 -135129 -66877 1208
11002 1208 -17153 -21303 35850 50207 75860 67087 63968 -28096 15022 191678 211556 53321
10990 53321 -26372 -25107 -85894 -46118 -99678 -142998 -162441 -137546 -113964 -117955 -169081 -59339
10978 -59339 33371 -34347 -99215 -20554 65583 37793 -30223 69086 -75745 -146424 -34573
10967 -34573 43704 55397 -12427 -91303 -163295 -89782 -129559 -70888 45211 37694 -2227 -117094
10955 -117094 -44754 118747 207542 136617 181909 204454 245517 344734 363920 253710 154380
10944 154380 115551 31590 -30289 67511 158707 91013 87965 82855 67546 28613 50925 19501
10932 19501 -74344 -72624 -7522 -78351 -198101 -149738 -16367 -33996 -57768 -37324 -115941
10921 -115941 -174389 -138326 -50628 2950 -46282 -60193 -83484 -106038 -81741 5408 -77631
10910 -77631 -79095 -14510 -44764 -70847 -126679 -144295 -103661 -87797 -134934 -192251 -148704 -205972
10898 -205972 -288811 -241651 -238126 -112201 -64296 -99579 -137098 -69072 60099 51244 -59839
10887 -59839 -123525 -69307 -116109 -95738 14915 100384 85866 22319 -19485 -115504 -35724
10876 -35724 20635 -12116 -164424 -129946 -51916 -43562 -128259 -101698 21861 -43010 -91233
10865 -91233 -87840 -64295 -33500 -44673 -111511 -95179 -125339 -99379 -70770 -35571 -89594 -39184
10853 -39184 -37208 -108995 -195112 -90471 -52079 -128828 -110289 -51956 99348 104672 -47129
10842 -47129 -141877 -94054 -50706 -26040 -69893 -82463 -37266 51965 8271 -42832 19304 9202
10830 9202 -131430 -37462 72157 58950 42577 5156 -99788 -136998 -141794 -15437 31222
10819 31222 -33279 -75633 -184708 -128521 -95423 -78648 -126375 2282 103083 132145 82660
10808 82660 125954 233095 256925 229741 95355 19156 -7633 41282 157455 217987 146117
10797 146117 97732 158421 68050 34943 23061 66824 63300 30339 20977 -821 -72587 -100720
10785 -100720 -110275 -144486 -133575 -61625 -12666 -7007 -15493 -47670 47261 146400 187589 143799
10773 143799 77889 32341 33246 131940 161628 80592 97575 108211 60904 31695 78954 93532
10761 93532 135483 35664 -50927 -36867 -26163 4046 49024 67667 113924 182640 179253 270777
10749 270777 222007 89178 59459 71983 -24177 -87380 -55720 -104883 20374 82616 24825
10738 24825 -38675 -43105 -61741 -95630 -96910 -101026 -23736 -111195 -160463 -132854 -190458 -129583
10726 -129583 -54842 -77660 -124612 -143198 -50380 31726 105280 128322 45762 -29833 31344
10715 31344 1227 -99849 -170794 -174026 -105995 -119242 -92169 -109344 -68619 85324 110310
10704 110310 80122 70536 169625 259541 300300 251179 189944 126153 7688 -57499 -76004
10693 -76004 -97567 -75762 -31653 33247 -74950 -88978 -34923 11255 33564 93809 65165
10682 65165 13867 13064 -133983 -255770 -174724 -131066 -70475 -60903 -5880 5111 -36122 -132207
10670 -132207 -70591 -105569 -235171 -226386 -108582 -126942 -64654 -41848 -56867 -53942 -50589 -154345
10658 -154345 -214606 -161841 -212617 -210140 -188625 -115047 -121029 -116703 -137243 -157801 -278578 -437822
10646 -437822 -397509 -299942 -131988 7012 25888 -77754 -38967 -17268 -27188 -92307 -25438
10635 -25438 1180 99451 35401 86018 3694 -93287 -208117 -167582 -82168 -80995 -94634 -125445
10623 -125445 -28754 17118 -8726 -82891 -79396 31913 125262 105767 40806 -22623 -20621 12397
10611 12397 77671 52373 -24712 -13033 -95461 -82182 -221 106113 66221 -90050 -100029
10600 -100029 -116535 -10352 -83479 -120447 -106922 -112750 -80655 -30330 13263 31680 184672
10589 184672 219036 51632 11355 -92331 -154051 -84111 -103701 4968 -46926 -126744 -121067
10578 -121067 -52477 17841 -48404 8609 170207 114988 66679 34621 33123 51597 79296
10567 79296 82687 85146 -29534 -9581 19819 -58481 -6077 95081 28193 1135 -11981 -20765
10555 -20765 -27299 -56075 -99922 -147962 -109945 -66929 13727 17914 80626 40078 32214 55173
10543 55173 43888 -66255 -164134 -216299 -69991 65493 39729 -20428 -18071 -70502 -107801
10532 -107801 -98591 -82723 61258 119500 87655 24501 -111752 -184215 -117152 -128521 -173606
10521 -173606 -318186 -247726 -9036 105205 101200 33007 -11232 -7179 -41450 -14007 -138241
10510 -138241 -155313 -180895 -145975 -329100 -282436 -186159 -96873 10939 134283 156341 242815
10499 242815 208797 156725 -40773 -174581 38427 82241 -5897 25528 -56284 -50117 -87322
10488 -87322 -69280 50353 133799 132380 -35483 -134999 -60651 -27353 -44485 -80641 -147325
10477 -147325 -144830 -158046 -44448 -27689 -51463 57817 64065 -65296 -43052 13405 -7882
10466 -7882 -102441 -138720 -89659 -84544 -64672 -94488 -124641 -115101 -33753 3626 13309 -41893
10454 -41893 -220798 -340728 -230590 -219164 -207785 -72319 -78261 -66653 -50530 -2963 -8886
10443 -8886 -192862 -233749 -35020 -52673 -118886 -68946 127925 74412 -124996 -213353 -142651
10432 -142651 54661 94029 127310 142831 36557 -15371 -53845 -86005 -147721 -156261 -112027
10421 -112027 -25056 15554 26675 -40944 -98828 -176394 -121559 -12872 -6795 127 76072 76874
10409 76874 -84430 -177931 -92760 -10850 33517 39398 5520 16918 26658 33601 20015 -27285
10397 -27285 -26060 -43330 -58914 -24306 -12789 -4991 -16372 -24699 -68625 -46401 -21855 -66071
10385 -66071 -173581 -305960 -294236 -176980 -73328 50179 31814 -77236 -149571 -115860
10375 -115860 -18105 22581 44986 86670 85698 -28890 -115002 -141850 -86088 -160071 -198435 -31743
10363 -31743 59070 51361 124531 88757 -31892 -45022 71819 12934 -78829 -110203 -64917
10352 -64917 -41843 -74052 -13589 -31401 23308 33654 -139922 -146041 -42900 -11332 -68197
10341 -68197 -190394 -202783 -83176 17582 85022 69341 21176 47291 68730 64658 -117109
10330 -117109 -133858 -178603 -171034 -198002 -23338 29687 -12007 -59938 -105008 -24398 29849
10319 29849 -30413 -13580 14886 -91953 -15072 -43663 -95550 -54092 9231 5782 21207 29960
10307 29960 -9705 -39383 -140548 -94862 -69009 -54000 -26895 -103198 -115610 -95635 -20972
10296 -20972 -25624 -82492 -113519 -72956 54567 47014 -42839 -32948 -6418 12943 9902 -49030
10284 -49030 -125108 -102399 -55860 -30813 41337 127133 193000 104370 -49051 -215226 -162473
10273 -162473 -111161 -152403 -169688 -176857 -29347 21001 33247 -22144 37964 5669 74615
10262 74615 67980 104083 106703 16844 -137041 -102923 43128 68023 118216 121825 106360 -4454
10250 -4454 -28880 -37035 -159590 -321415 -219702 -106189 -120017 -197090 -102549 17592 135280
10239 135280 136751 88457 104835 136333 63664 66208 119957 36696 -31145 20261 30955 -21054
10227 -21054 80408 175890 183101 181302 140364 16871 -76392 28088 93265 49171 97545
10216 97545 186061 31876 -48573 -52655 -23496 20656 48728 -97850 -152579 -193874 -142627
10205 -142627 49915 148881 150792 44074 -23187 -12915 -82898 16477 121838 69095 60094
10194 60094 52443 52861 92544 26289 -42785 -155688 -181327 -61975 -46230 -117926 -164546 -182058
10182 -182058 -217881 -138081 -170180 -261281 -180141 -103947 -68367 -7176 388 -98351 -134221 -115556
10170 -115556 -133334 -149835 -238902 -230783 -260568 -100536 -40 78297 39861 -71689 -78370
10159 -78370 -132381 -209008 -69120 -173062 -212923 -163650 -200422 -145658 17448 9787 1253
10148 1253 45886 -34082 -154493 -156329 -80797 -58063 -36332 -84551 9452 57492 -30853 -22427
10136 -22427 23652 -26959 -50917 61684 147448 153226 80370 70562 100033 31623 -65401 -37038
10124 -37038 -2331 -60558 -151871 -113911 -72551 -10659 14486 14566 -22690 -220995 -206382 -122837
10112 -122837 -41733 -40325 -50778 -106925 -90106 -100687 -102161 -144586 -164736 -207969 -304026 -187514
10100 -187514 -73741 -69359 -72042 -45020 -34582 -130192 -156857 -127190 -24189 23604 146974
10089 146974 271109 175809 1036 -8339 47000 14535 -71480 25790 -13474 77389 25456
10078 25456 -116918 -185324 -82894 -95955 -105727 -10669 -45817 -146651 -145887 -48069 148765
10067 148765 232146 299776 264750 122375 118158 47538 22510 31389 57905 -13330 -24655 49746
10055 49746 36612 46751 -13574 -78809 -118384 -138117 -198958 -167900 -97026 18916 172030
10044 172030 235007 72837 -60926 -115837 -88311 -15470 92202 204835 315259 281862
10034 281862 153547 126821 54189 -10663 81038 118588 147053 115441 68980 41728 57654
10023 57654 89556 176877 196764 110040 6854 -35936 64665 107801 92407 142202 180060
10012 180060 218451 173970 77119 -20247 -55743 29843 106380 92946 69001 66190 94509 -20864
10000 -20864 -95666 -126534 -76999 41017 80723 27591 12743 -110146 -176717 -80393 20952
9989 20952 27956 45135 -72277 -86752 -154592 -90862 -52640 -21668 68158 -30735 -17574 -23128
9977 -23128 -106049 -191701 -87995 -68110 -13875 7083 -37187 -29862 -27793 -46206 -23677 71131
9965 71131 168179 338684 346321 140056 -54713 -78875 -45323 -78003 -68183 17054 121808
9954 121808 185190 143875 165645 91983 101479 52182 40505 64326 39684 -4417 101812 194844
9942 194844 203836 153996 24385 -30541 -25215 -115689 -146042 -185273 -232094 -205671 -118809 3304
9930 3304 61468 -9906 -153952 -179778 -168283 -100735 -48929 -179874 -298487 -315349 -319679 -348012
9918 -348012 -301753 -193409 -128183 -78072 -26187 -115355 -188789 -152838 -26678 -31237 -61503
9907 -61503 -36844 8426 15248 -121425 -113419 -70910 -75961 -91906 -71819 2500 -41105 25270
9895 25270 16246 -85037 -160296 -206709 -148495 -7744 -45028 -180189 -62027 17019 69736
9884 69736 59828 -80399 -93810 -71438 -203422 -124379 -43241 -118303 -102816 -55837 4483 47842
9872 47842 70948 1651 -9864 102905 29210 16148 22220 -88874 -75554 68533 116889
9861 116889 78792 -83344 -225097 -167213 -95476 46168 29169 -34789 -18446 20057 23376
9850 23376 75711 111840 137797 159248 135738 87377 -26261 -141559 -161715 -85819 -1344
9839 -1344 59421 97562 111745 176316 182353 74500 7350 -47229 -68169 -130649 -126387 -128873
9827 -128873 -21262 -55599 -48411 -76187 20196 38387 -11157 -8948 -29756 -71625 -57895 2432
9815 2432 -5950 -46817 34373 74998 75737 84372 25911 -56667 6638 20685 14751 73659 93413
9802 93413 65425 71603 151971 139437 40637 -45535 -244855 -243504 -93929 2291 23084 55509
9790 55509 48312 38708 90187 65461 -118889 -94058 -2801 -41170 -53068 27814 -26558 -100291
9778 -100291 -145358 -75999 -69463 -153684 -64640 -122308 -109930 -195288 -174729 -138088 -156105 -148756
9766 -148756 -30599 54214 138601 158616 57819 30742 39915 190244 83046 24764 -18068
9755 -18068 -43566 -20649 32692 -28237 -2582 19849 55397 98435 20637 -61310 -114738 -22613
9743 -22613 -79904 -118048 -65373 34917 62515 124702 119995 30199 121551 226656 137563 37092
9731 37092 32098 113921 124599 93026 36952 112233 128446 5943 18353 -54090 -150781 -140021
9719 -140021 -47145 38026 91407 27012 -65119 -45641 -40454 19897 88861 38618 -21367 815
9707 815 75906 106672 119778 80181 -52744 -169698 -236211 -171588 -25325 47080 35541 153037
9695 153037 154331 28852 -20324 -10166 18961 87510 88823 70951 62402 -18951 5669 35128
9683 35128 25358 158007 93075 155255 108778 2015 -79710 -181886 -202871 -86288 -241150
9672 -241150 -243144 -153382 -162306 -95765 -11713 25923 -723 -9376 -36027 36923 35925 66103 -77822
9659 -77822 -98194 -63767 -61423 -20341 -18524 -92973 -91346 -93270 -37620 67079 144874 231538
9647 231538 278262 206204 145263 118917 117975 127162 90612 -28443 -134693 -188840 -264818 -291208
9635 -291208 -198954 -98407 -89534 -78962 -93231 -266884 -282657 -254903 -164541 -175397 -244184
9624 -244184 -325671 -277341 -151364 -15627 -94831 -205364 -147062 -208927 -115094 -4433 -48203
9613 -48203 -84689 -124889 -158224 -123558 -163359 -110816 -23148 -66514 -68327 -178717 -305729 -236026
9601 -236026 -109971 -102427 -131640 -181772 -242533 -169421 -129409 -78301 4432 22578 -28797 -183999
9589 -183999 -193109 -175536 -74297 39689 11134 66448 48247 89647 89307 34494 123473 180194
9577 180194 197018 232085 120009 76603 -60888 -143489 -112212 -102548 -93580 -50153 -17310 23670
9565 23670 59921 49970 -21156 -54305 -130899 -175891 -131330 -192608 -168744 -123546 -114660 -140246
9553 -140246 -185952 -118608 -39223 60660 42420 14019 2977 74806 225934 161656 -74515
9542 -74515 -134512 -172887 -137415 -70032 -51349 48072 61821 97356 72620 -42898 39434 101373
9530 101373 62113 159070 235024 172754 8162 -58146 145556 67914 -42691 -153179 -115429
9519 -115429 -92324 -25103 22172 40461 -88345 -258800 -280364 -87916 24325 79713 77325
9508 77325 82260 88188 129811 146207 134067 115476 31706 149939 214607 235389 137580 26651
9496 26651 61660 139898 65078 9362 19777 35652 116181 159457 18855 -25878 -82970 -54951
9484 -54951 43846 -2717 -75026 -13467 21935 -24649 -54651 -67630 -80605 -97749 -38725 -83420
9472 -83420 -8970 102024 168560 48875 10398 -104526 -119252 -73624 -11981 -108501 -95994
9461 -95994 51905 59407 57204 15770 -31218 -48716 -96839 -108542 -62414 -31910 -54055 -62346
9449 -62346 89933 166666 207651 250265 203947 72611 -7098 -5870 74053 37326 -44525 80271
9437 80271 105725 168621 177834 85757 77479 60972 50270 -51841 -74422 -118505 -180033 -68898
9425 -68898 -30396 -65311 66898 126025 26116 -64741 -84275 91077 145160 161806 48801
9414 48801 -8242 -32922 -58971 -28451 -21681 -64303 51597 63480 101604 37309 -13580 -124643
9402 -124643 -189397 -98964 -75731 -91583 9249 -2619 32472 -21378 -86751 -74668 -134640
9391 -134640 -180214 41317 -11517 -109790 -157711 -150787 -13945 -1685 29196 49173 28389
9380 28389 -77165 -18252 81944 20480 12154 -44415 -77986 -125452 -43948 6300 -47242 -88867
9368 -88867 -144422 -16768 85858 7694 -64465 -28551 -49113 -197785 -131507 -12084 -8417
9357 -8417 27342 16820 30332 6958 -109878 -122882 -113587 -85093 33105 7159 40712 114967
9345 114967 148951 49304 3740 -50149 -74040 -71390 -45075 58082 33229 -29303 -29309 -111377
9333 -111377 -162859 -160811 -141542 -215122 -261066 -96862 147602 215755 150361 196865 186651
9322 186651 -59530 -135372 -45034 114522 38898 74623 30991 -36973 -27695 61027 74562
9311 74562 150255 230570 234271 219254 122695 90202 147075 102708 7542 5151 30021 55768
9299 55768 -19935 -21897 64272 58641 -15144 -39955 -97760 -73383 -52390 -2739 58195 64142
9287 64142 13335 -15010 22798 50604 30493 54969 -35935 -85956 -64659 47348 82012 30764
9275 30764 72666 194669 103827 93241 12186 10114 -46411 -116358 -70596 -96322 22654 61086
9263 61086 89011 71218 78017 59046 -40237 -54088 -89223 -49076 -52303 2420 -33233 -146430
9251 -146430 -127983 -19849 48609 46682 18963 39407 103820 52061 19508 -39002 45713 74984
9239 74984 164512 258762 288768 298012 359249 342012 314229 378511 469628 485211 374752 299683
9227 299683 338588 404036 371483 285928 192224 107879 131290 328703 253850 214609 350520
9216 350520 469858 563596 518040 395836 419608 482137 461146 549846 642605 685404 739063
9205 739063 833803 880065 785231 844190 1033480 1053628 1097963 1002038 1068716 1267861 1468887
9194 1468887 1614235 1841158 2018387 2230064 2379843 2530672 2706407 2876030 3188329 3529501
9184 3529501 3998511 4504937 5008302 5537733 6087741 6785824 7542782 8420098 9581187
9175 9581187 10718536 11788311 12939019 14204766 15490971 16958545 18548574 20407713
9167 20407713 22700082 25565065 28714217 32142645 35445568 38241320 40239972 41236876
9159 41236876 41351876 40501851 38173739 34339254 29494583 24611755 20353909 16790664
9151 16790664 14003938 11925344 10295590 9069187 8140562 7298853 6588859 5892841 5222470
9142 5222470 4835579 4551351 4267155 3822569 3524278 3329846 3124631 2872336 2591110 2449706
9132 2449706 2327185 2343170 2191336 1991979 1907867 1990034 1918073 1720027 1649329 1700700 1602585
9121 1602585 1476764 1399675 1386374 1447920 1400686 1368740 1325083 1295206 1188429 1145999 1078265
9110 1078265 1068311 1126210 1197639 1091057 1022118 1088141 1024744 973590 939902 989500 933458
9099 933458 791472 674713 750961 772891 819384 884266 780819 681020 607852 565625 610861
9088 610861 529344 508083 563731 564247 447963 444165 521129 554113 577769 540058 363880 245021
9076 245021 239067 231664 247186 177271 214135 261265 298324 285226 307524 352658 411714 397898
9064 397898 385583 407468 343798 289751 351546 389817 372341 297291 246435 326366 411551 380841
9052 380841 214901 196596 314004 534674 668632 608678 487817 388786 340438 431719 460330
9041 460330 401410 373796 322484 164159 -20037 45561 197945 277615 256528 243150 224125
$$ [...]
##END NTUPLES=NMR SPECTRUM
##END=
