##TITLE=Analysis number 323147
Compound Code spb 06856
Book Reference 508/200
Project Code adrs
Chemist Name antons
##JCAMPDX= 6.0         $$ Bruker NMR JCAMP-DX V2.0
##DATA TYPE= NMR SPECTRUM
##DATA CLASS= NTUPLES
##ORIGIN= Bruker BioSpin GmbH
##OWNER= nmr
$$ XWIN-NMR		Version 3.5
$$ Tue Oct 17 17:05:13 2006 GMT Daylight Time (UT+1h)  MAYBRIDGE\nmr@NMR_250MHZ
##.OBSERVE FREQUENCY= 250.131544655141
##.OBSERVE NUCLEUS= ^1H
##.ACQUISITION MODE= SIMULTANEOUS (DQD)
##.ACQUISITION SCHEME= undefined
##.AVERAGES= 16
##.DIGITISER RES= 18
##SPECTROMETER/DATA SYSTEM= dpx250
##.PULSE SEQUENCE= zg30
##.SOLVENT NAME= CDCl3
##.SHIFT REFERENCE= (INTERNAL, CDCl3, 0, 16.522)
##AUDIT TRAIL= $$ (NUMBER, WHEN, WHO, WHERE, WHAT)
$$ ##TITLE= Audit trail, XWIN-NMR		Version 3.5
$$ ##JCAMPDX= 5.01
$$ ##ORIGIN= Bruker BioSpin GmbH
$$ ##OWNER= nmr
$$ C:\u/data/dgb/nmr/ADRS/750/pdata/1/auditp.txt
$$ ##AUDIT TRAIL=  $$ (NUMBER, WHEN, WHO, WHERE, WHAT)
(   1,<2006-10-17 17:04:51.95 +100>,<MAYBRIDGE\nmr>,<NMR_250MHZ>,
      <created by zg, POWCHK disabled, PULCHK disabled
       configuration hash MD5:
       49 4B E0 1D 92 C2 6B 37 9F E6 65 BC 52 41 86 1D
       data hash MD5: 64K
       FD 49 95 F4 D5 75 EE CF E6 97 F4 7A EE FC 07 15>)
(   2,<2006-10-17 17:05:04.33 +100>,<MAYBRIDGE\nmr>,<NMR_250MHZ>,
      <Start of raw data processing
       ef LB = 0.3 FT_mod = 6 PKNL = 1 SI = 32K 
       data hash MD5: 32K
       41 99 8D 76 7F 16 E9 04 FD 1D D3 67 BC B5 3D BA>)
(   3,<2006-10-17 17:05:06.09 +100>,<MAYBRIDGE\nmr>,<NMR_250MHZ>,
      <apk 
       data hash MD5: 32K
       5F 51 89 98 FE 94 B3 49 76 8F 1E A7 E3 A3 44 40>)
(   4,<2006-10-17 17:05:06.89 +100>,<MAYBRIDGE\nmr>,<NMR_250MHZ>,
      <abs ABSG = 5 
       data hash MD5: 32K
       56 08 EB FF 5A 3B 23 8B 1C 00 03 31 BE 6D 9A 99>)
$$ ##END=
$$ 
$$ hash MD5
$$ 31 BD D5 1B F5 62 99 E3 A5 4D D1 9C 1F 91 42 99
##$RELAX= 
##$RELAX= 
##$RELAX= 
##$RELAX= 
##$RELAX= 
##$RELAX= 
##$RELAX= 
$$ Bruker specific parameters
$$ --------------------------
##$DU= <C:\u>
##$EXPNO= 750
##$NAME= <ADRS>
##$PROCNO= 1
##$TYPE= <nmr>
##$USER= <dgb>
##$AMP= (0..31)
100 100 100 100 100 100 100 100 100 100 100 100 100 100 100 100 100 100 
100 100 100 100 100 100 100 100 100 100 100 100 100 100 
##$AQSEQ= 0
##$AQ_mod= 3
##$AUNM= <au_zg>
##$AUTOPOS= <10 >
##$BF1= 250.13
##$BF2= 250.13
##$BF3= 250.13
##$BF4= 250.13
##$BF5= 500.13
##$BF6= 500.13
##$BF7= 500.13
##$BF8= 500.13
##$BYTORDA= 1
##$CFDGTYP= 0
##$CFRGTYP= 5
##$CHEMSTR= <none>
##$CNST= (0..31)
1 1 145 1 1 1 1 1 1 1 1 1 1 1 1 1 1 1 1 1 1 1 1 1 1 1 1 1 1 1 1 1 
##$CPDPRG= <>
##$CPDPRG1= <>
##$CPDPRG2= <>
##$CPDPRG3= <>
##$CPDPRG4= <mlev>
##$CPDPRG5= <mlev>
##$CPDPRG6= <mlev>
##$CPDPRG7= <mlev>
##$CPDPRG8= <mlev>
##$CPDPRGB= <>
##$CPDPRGT= <>
##$D= (0..31)
0 1 0 0 0 0 0 0 0 0.06 0 0 0 0 0 0 0.0002 0 0 0 0 0 0 0 0 0 0 0 0 0 0 
0 
##$DATE= 1161101091
##$DBL= (0..7)
120 120 120 120 120 120 120 120 
##$DBP= (0..7)
150 150 150 150 150 150 150 150 
##$DBP07= 0
##$DBPNAM0= <>
##$DBPNAM1= <>
$$ [...]
##$SUBNAM7= <"">
##$SUBNAM8= <"">
##$SUBNAM9= <"">
##$SW= 20.6930455092707
##$SWIBOX= (0..15)
0 0 3 0 0 0 0 0 0 0 0 0 0 0 0 0 
##$SW_h= 5175.983436853
##$TD= 65536
##$TD0= 1
##$TE= 683.16
##$TE2= 300
##$TE3= 300
##$TEG= 300
##$TL= (0..7)
0 120 120 120 120 120 120 120 
##$TP= (0..7)
150 150 150 150 150 150 150 150 
##$TP07= 0
##$TPNAME0= <>
##$TPNAME1= <>
##$TPNAME2= <>
##$TPNAME3= <>
##$TPNAME4= <>
##$TPNAME5= <>
##$TPNAME6= <>
##$TPNAME7= <>
##$TPOAL= (0..7)
0.5 0.5 0.5 0.5 0.5 0.5 0.5 0.5 
##$TPOFFS= (0..7)
0 0 0 0 0 0 0 0 
##$TUNHIN= 0
##$TUNHOUT= 0
##$TUNXOUT= 0
##$USERA1= <user>
##$USERA2= <user>
##$USERA3= <user>
##$USERA4= <user>
##$USERA5= <user>
##$V9= 5
##$VALIST= <valist>
##$VCLIST= <CCCCCCCCCCCCCCC>
##$VD= 0
##$VDLIST= <DDDDDDDDDDDDDDD>
##$VPLIST= <PPPPPPPPPPPPPPP>
##$VTLIST= <TTTTTTTTTTTTTTT>
##$WBST= 1024
##$WBSW= 4
##$XGAIN= (0..3)
0 0 0 0 
##$XL= 0
##$YL= 0
##$YMAX_a= 545850
##$YMIN_a= -404090
##$ZGOPTNS= <>
##$ZL1= 120
##$ZL2= 120
##$ZL3= 120
##$ZL4= 120
##$ABSF1= 16.522
##$ABSF2= -4.171173
##$ABSG= 5
##$ABSL= 3
##$ALPHA= 0
##$AQORDER= 0
##$ASSFAC= 0
##$ASSFACI= 0
##$ASSFACX= 0
##$ASSWID= 0
##$AUNMP= <proc_1d>
##$AZFE= 0.1
##$AZFW= 0.1
##$BCFW= 0
##$BC_mod= 0
##$BYTORDP= 0
##$COROFFS= 0
##$CY= 12.5
##$DATMOD= 1
##$DC= 0
##$DFILT= <>
##$DTYPP= 0
##$F1P= 14.0000005364418
##$F2P= -0.99999901652339
##$FCOR= 0.5
##$FTSIZE= 32768
##$FT_mod= 6
##$GAMMA= 0
##$GB= 0
##$INTBC= 1
##$INTSCL= 1
##$ISEN= 128
##$LB= 0.3
##$LEV0= 0
##$LPBIN= 0
##$MAXI= 10000
##$MC2= 0
##$MEAN= 0
##$ME_mod= 0
##$MI= 0
##$NCOEF= 0
##$NC_proc= -4
##$NLEV= 6
##$NOISF1= 0
##$NOISF2= 0
##$NSP= 0
##$NTH_PI= 0
##$NZP= 0
##$OFFSET= 16.522
##$PC= 1
##$PHC0= -52.0282
##$PHC1= 3.518174
##$PH_mod= 1
##$PKNL= yes
##$PPARMOD= 0
##$PSCAL= 4
##$PSIGN= 0
##$REVERSE= no
##$SF= 250.13
##$SI= 32768
##$SIGF1= 0
##$SIGF2= 0
##$SINO= 400
##$SIOLD= 32768
##$SREGLST= <1H.CDCl3>
##$SSB= 0
##$STSI= 32768
##$STSR= 0
##$SW_p= 5175.98343685301
##$SYMM= 0
##$S_DEV= 0
##$TDeff= 65536
##$TDoff= 0
##$TI= <Analysis number 999999
Compound Code 99
Book Reference 9
Project Code 9>
##$TILT= no
##$TM1= 0
##$TM2= 0
##$TOPLEV= 0
##$USERP1= <user>
##$USERP2= <user>
##$USERP3= <user>
##$USERP4= <user>
##$USERP5= <user>
##$WDW= 1
##$XDIM= 32768
##$YMAX_p= 473030120
##$YMIN_p= -198609
$$ End of Bruker specific parameters
$$ ---------------------------------
##NTUPLES= NMR SPECTRUM
##VAR_NAME=  FREQUENCY,     SPECTRUM/REAL,   SPECTRUM/IMAG
##SYMBOL=    X,             R,               I
##VAR_TYPE=  INDEPENDENT,   DEPENDENT,       DEPENDENT
##VAR_FORM=  AFFN,          ASDF,            ASDF
##VAR_DIM=   32768,         32768,           32768
##UNITS=     HZ,            ARBITRARY UNITS, ARBITRARY UNITS
##FACTOR=    0.157963299565203, 1,           1
##FIRST=     4132.6476996994, 0,             0
##LAST=      -1043.33573715361, 0,           0
##MIN=       -1043.33573715361, -198609,     0
##MAX=       4132.6476996994, 473030120,     0
$$ Real data points
##PAGE= N=1
##DATA TABLE= (X++(R..R)), XYDATA
$$ [...]
24829b4159l800k8465J1944k6000m5623N8457K3780l6292l8859R029L4281K3733
$$ -24159 -27959 -56424 -44480 -70480 -116103 -57646 -33866 -70158 -109017 -99988 -65707 -41974
24817d1974N2084k475j212p2766m4906M9238O8637j0009m0407N7013L3431m9939
$$ -41974 10110 7635 6423 -66343 -111249 -62011 6626 -3383 -43790 13223 46654 -3285
24805c285l9558J8510L7253l9455j22397J6556L9649j6455K646K6669L1185M0838
$$ -3285 -42843 -24333 12920 -26535 -148932 -132376 -92727 -109182 -106536 -79867 -48682 -7844
24793g844k3157l5775p102N6624k7639k6157k1056l6430j8626J246K9193N9886
$$ -7844 -31001 -66776 -73878 -17254 -44893 -71050 -92106 -128536 -147162 -145916 -116723 -56837
24781e6837J5765M974l6702j7428o547J9560P1209M479l5932k4565L9381O4561
$$ -56837 -41072 -36098 -72800 -90228 -96775 -77215 -6006 -1527 -37459 -62024 -22643 41918
24769D1918J6960l350o0785j4909P6212L0754j2176p1304m3951n0989o7034L5409
$$ 41918 58878 55528 -5257 -20166 56046 86800 74624 3320 -40631 -91620 -158654 -123245
24757a23245L7959M7325M7202q268M5955L3915o67m8325J6559J8892j6160n4058
$$ -123245 -85286 -37961 9241 973 46928 80843 80176 31851 48410 67302 51142 -2916
24745b916m1712M781L2114P995l1485J3995j2001R17J7387k4979n3749J9772J5307
$$ -2916 -44628 -39847 -7733 262 -31223 -17228 -29229 -28312 -10925 -35904 -89653 -69881 -54574
24732e4574m5435L472L5119P3818J9112J6028j16895j05995L5010L3657L3669
$$ -54574 -100009 -96537 -61418 12400 31512 47540 -69355 -175350 -140340 -106683 -73014
24721g3014P3365r162P483K9115J7530J1008L0230m9467l1602J4534n547l621
$$ -73014 351 -8811 -1328 27787 45317 56325 86555 37088 5486 20020 14473 10852
24709A0852k9643k969m8164k8197L8439L3214K8043k8727q465J4240K631n4505
$$ 10852 -18791 -21760 -69924 -98121 -59682 -26468 1575 -27152 -35617 -21377 -18746 -73251
24697g3251o748k4360K642P6018O9178K1821l1935k6615n561k6104N086J2295
$$ -73251 -79999 -104359 -101717 -25699 43479 65300 33365 6750 1189 -24915 -19829 -7534
24685g534L5153m4513l3344M2772Q087M2904l0362l8239P0372N647k0404o196
$$ -7534 27619 -16894 -50238 -7466 621 43525 13163 -25076 45296 50943 30539 24343
24673B4343l5830k608J0409J6726L1507L516o2456j7944J1634o7610L1669M2254
$$ 24343 -11487 -14095 -3686 13040 44547 48063 -14393 -32337 -20703 -88313 -56644 -14390
24661a4390l2065J6529N4337k5209m152n7909j6609k674K4592Q632J5108K8589
$$ -14390 -46455 -29926 24411 -798 -4950 -62859 -79468 -82142 -57550 -48918 -33810 -5221
24649e221j4321J4169R26k0869p99K9715k5302l9667O0885j6394j9719j7546J4924
$$ -5221 -19542 -5373 -4447 -25316 -26115 3600 -21702 -61369 -484 -16878 -36597 -54143 -39219
24636c9219k9329K1526M3923J4950l5794q339k3802m9292k8890Q3925M0336j566
$$ -39219 -68548 -47022 -3099 11851 -23943 -32282 -56084 -105376 -134266 -50341 -10005 -11571
24624a1571L6600K4565n8254k3076O675L9472J015p1738j913L3847L3697K1734
$$ -11571 25029 49594 -8660 -31736 -25061 14411 15426 -56312 -58225 -24378 9319 31053
24612C1053j1217l2118l212K6434L668J0848N962n9938m3654M8251L5771k168
$$ 31053 19836 -12282 -15494 10940 14608 25456 31418 -28520 -72174 -23923 11848 9680
24600I680j1910k741J5030P216K5135K5572J1754r989q0677k9333L1577M7769
$$ 9680 -2230 -4971 10059 17275 42410 67982 79736 69747 -10930 -40263 -8686 39083
24588C9083q639J7800J4848O766j0918l191j4443l9030m0436M265K4507L8815
$$ 39083 30444 48244 63092 69858 58940 55749 41306 2276 -38160 -33895 -9388 29427
24576B9427M1702J0287o7886l8743M2096k2351n4603l3921L6589K195J0993r012
$$ 29427 71129 81416 13530 -25213 16883 -5468 -60071 -93992 -57403 -55208 -44215 -53227
24564e3227P147K202Q592L9677J0919j3748j6047K429J01611L6877o2040p1050
$$ -53227 -46080 -43878 -35286 4391 15310 1562 -14485 -12056 89555 126432 64392 -6658
24552f658L2312p896p538j7893K0311J908j9859k6531M9107L4349k277l4934M997
$$ -6658 25654 17758 10220 -7673 12638 14546 -5313 -31844 17263 51612 49335 14401 19398
24539A9398M1J0955J6641m7985k7393j1149L486m658O890J2665O0049o965j2640
$$ 19398 19439 30394 47035 -950 -28343 -39492 -36006 -40664 -33774 -21109 38940 31975 19335
24526A9335L1604n1910p0004J8952M9796P6997n3350l4887J3480K0780N003n0297
$$ 19335 50939 -971 -70975 -52023 -2227 74770 21420 -13467 13 20793 25796 -24501
24514b4501Q774l1040K3097K1432K7078p389K9036N755k5588p8124l2123R521
$$ -24501 -15727 -46767 -23670 -2238 24840 17451 46487 52242 26654 -51470 -83593 -74072
24502g4072L3951M683o161K4820Q044K6263L1156M0479N3341m0681o0511n2343
$$ -74072 -40121 -35438 -41599 -16779 -8735 17528 48684 89163 142504 101823 41312 -11031
24490a1031j3199M2582K9835K9886j9214n9099k4707j5021M662j7021M7679N5062
$$ -11031 -24230 18352 48187 78073 58859 -240 -24947 -39968 -35306 -52327 -4648 50414
24478E0414L5112l3278k1747l2046J6864L0923K9686j7335l3954o1299j4556L8425
$$ 50414 85526 52248 30501 -1545 15319 46242 75928 58593 24639 -36660 -51216 -12791
24466a2791R683L0993o3778k3244k0673o123J0215j0084J6732K1615K9656N443
$$ -12791 -3108 27885 -35893 -59137 -79810 -85933 -75718 -85802 -69070 -47455 -17799 -12356
24454a2356j0402K2249N583j0744k0636J0304L1417q234l6388p435N8541L9908
$$ -12356 -22758 -509 5074 -5670 -26306 -16002 15415 7181 -29207 -36642 21899 61807
24442F1807K2184k4973n0322l353J4618j9917m0677k8594N909J8435Q0721K5831
$$ 61807 83991 59018 8696 5343 19961 44 -40633 -69227 -63318 -44883 35838 61669
24430F1669j9906l9309k497J8753k2119o7138M3876M3289J5786k1043J531K5524
$$ 61669 41763 2454 -43 18710 -3409 -70547 -26671 16618 32404 11361 12892 38416
24418C8416L9124l8136j8465k0371J240M4560J5940K432k8814j1137J6951n3015
$$ 38416 77540 39404 20939 568 1808 46368 62308 64740 35926 24789 41740 -11275
24406a1275m0613k08K7862J3243O642J3291N6P868r044J4925O7945K3614n9992
$$ -11275 -51888 -52096 -24234 -10991 -4349 8942 8998 16866 7822 22747 90692 114306 54314
24393E4314n944n776Q24n1805m7439l4386K6494Q603l1189K5934J0162K808K361
$$ 54314 48370 42594 43418 -8387 -55826 -90212 -63718 -55115 -86304 -60370 -50208 -47400 -45039
24380d5039M1658K8261j3761o5694k2993R966O0196M1452k629K4864l2560m8523
$$ -45039 -3381 24880 11119 -54575 -77568 -67602 -7406 34046 31417 56281 23721 -24802
24368b4802k0937N860j8789K8000J929L9645K631O597k0058M4913J1843l3852
$$ -24802 -45739 -39879 -58668 -30668 -28739 10906 13537 20134 76 44989 56832 22980
24356B2980l5169m463o727M4359n4730k3424J7273L3117L0480J3803m4733k206
$$ 22980 -12189 -16652 -23379 20980 -33750 -57174 -39901 -6784 23696 37499 -7234 -9440
24344i440j3877n5918L7826M9072P0720k3360r57m1632l007M631n2256Q896M8585
$$ -9440 -23317 -79235 -41409 7663 78383 55023 54066 12434 9427 14058 -38198 -29302 19283
24331A9283p22j5006l4085k15J6720j9038M3062K7313P394q3072L10L6748K6805
$$ 19283 18561 3555 -30530 -30745 -14025 -33063 9999 37312 44706 -38366 -38056 -1308 25497
24318B5497K9272m600n6809K6497j8569l3006P526L4036K6889J8902J6641J2874
$$ 25497 54769 50169 -6640 19857 1288 -31718 -24192 9844 36733 55635 72276 85150
24306H5150p3543m3191L0369n9087j7456M0908Q4957J9373l6609K3760l3688m5308
$$ 85150 11607 -31584 -1215 -60302 -77758 -36850 48107 67480 30871 54631 20943 -24365
24294b4365k9566n2388K2071K7139J3528N1405L0642Q482n0023m1922J9126M4065
$$ -24365 -53931 -106319 -84248 -57109 -43581 7824 38466 46948 -3075 -44997 -25871 18194
24282A8194n310J1591m6334n5412K8232M8018M1412k2989l5169m4220O7104N4232
$$ 18194 12884 24475 -21859 -77271 -49039 -1021 40391 17402 -17767 -61987 5117 59349
24270E9349R0297n7853j45454n3617j8621o5621K1233R2015M5250L8706j8947
$$ 59349 149646 91793 -53661 -107278 -125899 -191520 -170287 -78272 -33022 5684 -13263
24259a3263m2505j7945m5091J660j8694n6109Q2070N2002J4694l975l4084J672
$$ -13263 -55768 -73713 -118804 -117144 -135838 -191947 -109877 -57875 -43181 -47156 -81240 -79568
24247g9568N4716J8990j0691n4586K4005J7021K7898O572j7797l0057L112J4233
$$ -79568 -24852 -5862 -16553 -71139 -47134 -30113 -2215 4357 -13440 -43497 -40385 -26152
24235b6152L7065n3314n8929r072N3998K4271P4302P9624o8296r6850j3513Q398
$$ -26152 10913 -42401 -101330 -110402 -56404 -32133 42169 121793 53497 -43353 -56866 -48468
24223d8468N6161J010j1290m1419m275K8168J2714m277q931L0084k5571q9298
$$ -48468 7693 8703 -2587 -44006 -48281 -20113 -7399 -11676 -20607 9477 -16094 -105392
24211a05392J633O4510K4559n297L4446k9713k62p419L1024K7809M4858J6117
$$ -105392 -103759 -39249 -14690 -19987 14459 -15254 -15516 -22935 8089 35898 80756 96873
24199I6873J3778k3873p8212K5301k5959l7783r768m033L8557M6493m0295m9140
$$ 96873 110651 86778 8566 33867 7908 -29875 -39643 -43676 -5119 41374 1079 -48061
24187d8061M8606L0899l6306l7878q4367p199O1510K9462N1021k7650k847k530
$$ -48061 545 31444 -4862 -42740 -127107 -134306 -72796 -43334 7687 -19963 -22810 -25340
24175b5340P583m4261j4366L4703N6592k0441J3284J6551k4417O15n0417j8542
$$ -25340 -17757 -62018 -76384 -41681 14911 -5530 7754 24305 -112 503 -49914 -68456
24163f8456J1973L727J1777Q8096J4474p326k5154J0189k0471M8551O5775J866
$$ -68456 -56483 -52756 -40979 47117 61591 54265 29111 39300 18829 67380 133155 135021
24151A35021m8820l5278n2677m1308L7910K4028O381j5901K8062l0947P889L2143
$$ 135021 86201 50923 -1754 -43062 -5152 18876 25257 9356 37418 6471 14360 46503
24139D6503q773J1684L379N885l4664k6735k1803r16J3193k896m6092m3621P7824
$$ 46503 37730 49414 52793 58678 24014 -2721 -24524 -25440 -12247 -15143 -61235 -104856 -27032
24126b7032J15674n1493q9812k3150L5795P7584J7853k2816k2596l8674m9211
$$ -27032 88642 37149 -52663 -75813 -40018 37566 55419 32603 10007 -28667 -77878
24115g7878l4304j4963M4536O3222M3668k414l9585n9623j6279L0719j66j12Q358
$$ -77878 -112182 -127145 -82609 -19387 24281 21867 -17718 -77341 -93620 -62901 -63067 -63179 -54821
24102e4821n5210L6699N5161K9592n955j9285o4433L3790K6807M119k1544J7464
$$ -54821 -110031 -73332 -18171 11421 5466 -13819 -78252 -44462 -17655 -13536 -35080 -17616
24090a7616J7521M0998n0039k3364J7053l427l0404N0139N2053j3671r951M682
$$ -17616 -95 40903 -9136 -32500 -15447 -18874 -49278 861 52914 39243 29292 33974
24078C3974q097J6177R495K9119N219q291k3574o5804k9242K1676O4915j2740
$$ 33974 25877 42054 51549 80668 85887 77596 54022 -11782 -41024 -19348 45567 32827
24066C2827K3278m5504n5072m174K9192J5884J9926J2741l336J2581j0989m9751
$$ 32827 56105 10601 -44471 -48645 -19453 -3569 16357 29098 25762 38343 27354 -22397
24054b2397k2489J7307N502l6009l8906Q829N5519l451k4467k176L4203O1268
$$ -22397 -44886 -27579 -22077 -58086 -96992 -88163 -32644 -36095 -60562 -62738 -28535 32733
24042C2733j5688M2502n272k8166K1254m7470k8632K6484m4906m1604j5000M505
$$ 32733 17045 59547 54275 26109 47363 -107 -28739 -2255 -47161 -88765 -103765 -99260
24030i9260M1359R2610p426l0205L1788K0867m669k4687n9914Q662M8677N423
$$ -99260 -57901 34709 27283 -2922 28866 49733 45064 20377 -39537 -30875 17802 23225
24018B3225M797k024J1755M1817n2584n951l0285K2153k7211l9459K660N0381
$$ 23225 28022 25998 37753 79570 26986 21035 -9250 12903 -14308 -53767 -51107 -726
24006g26j85k6530n851M791j1543j5026N3178l121j9295q613k2424k004p895m7071
$$ -726 -911 -27441 -33292 -28501 -40044 -55070 -1892 -5013 -24308 -32921 -55345 -57349 -65244 -112315
23992a12315J8302N1162L6867K6108l0662j9843n419l2609k4031J0003O210N0215
$$ -112315 -94013 -42851 -5984 20124 -10538 -30381 -35800 -68409 -92440 -82437 -76227 -26012
23980b6012n906K2648L8592J2927m8644k6974K912K5080j5986K3966K5840q283
$$ -26012 -31918 -9270 29322 42249 -6395 -33369 -30457 -5377 -21363 2603 28443 20160
23968B0160k4940j78r472J0354n717n2707L6590Q447q3549L5193L4284R029j704
$$ 20160 -4780 -4958 -14430 -4076 -9793 -62500 -25910 -17463 -101012 -65819 -31535 -22506 -24210
23955b4210K0172k02N877J5267L2640j5068J9515L0579l3085J7003K3632L915
$$ -24210 -4038 -4240 1637 16904 49544 34476 53991 84570 51485 68488 92120 96035
23943I6035p0578m4299l5064M3306N8944J4424q0213l3940J9494o5824j5871K5685
$$ 96035 25457 -18842 -53906 -10600 48344 62768 -17445 -51385 -31891 -97715 -113586 -87901
23931h7901J5041L8439N1505K5430p232q1024m9432K5286M7050K1013L022L8223
$$ -87901 -72860 -34421 17084 42514 35282 -45742 -95174 -69888 -22838 -1825 1197 39420
23919C9420n2922P809m681l6600J895n9530l7537P7578N373n685O6439K3458p382
$$ 39420 -13502 -5693 -10374 -46974 -45079 -104609 -142146 -64568 -59195 -64880 1559 25017 17635
23906A7635m0779m0984l6059L0376P3071J7111j0876j5580N908k5634K0388K5011
$$ 17635 -23144 -64128 -100187 -69811 3260 20371 9495 -6085 -177 -25811 -5423 19588
23894A9588J765j3975k2955K7237J9551m3771l193L9940l8496O297k176L8944
$$ 19588 21353 7378 -15577 11660 31211 -12560 -15753 24187 -14309 -8012 -10188 28756
23882B8756j559o3411l2919m425M3226O023O2141M5071l1348k9027m4088k365
$$ 28756 27197 -36214 -69133 -73558 -30332 -24309 37832 82903 51555 22528 -21560 -23925
23870b3925J9417J2922m394k4369P797N9419j00977m5045J6533l4316k7033L5815
$$ -23925 -4508 8414 4020 -20349 -12552 46867 -54110 -99155 -82622 -116938 -143971 -108156
23858a08156N3347n806L3386J5276j749m6008N984N6379k9220N008Q7648m5272
$$ -108156 -54809 -60615 -27229 -11953 -13702 -59710 -53726 2653 -26567 -21559 66089 20817
23846B0817n2521k7964m0100J1485J6681J7323K8057L0929m1714r877j3452k50
$$ 20817 -31704 -59668 -99768 -88283 -71602 -54279 -26222 4707 -37007 -46884 -60336 -60586
23834f0586j4469Q400L1255l9434M8068l9140m6170k34J5221J064N7742K0325
$$ -60586 -75055 -66655 -35400 -74834 -26766 -65906 -112076 -112310 -97089 -96025 -38283 -17958
23822a7958m4469N538K7274K6915j1684n5608o7907M4137j2337J2193O0688j8832
$$ -17958 -62427 -56889 -29615 -2700 -14384 -69992 -137899 -93762 -106099 -93906 -33218 -52050
23810e2050r500O0310M288j2629l8006M070n0964J0374N5952K8413L454k5890
$$ -52050 -61550 -1240 3048 -9581 -47587 -43517 -94481 -84107 -28155 258 3712 -22178
23798b2178j2420j9914q175K9574M2734p895l6371J6072R531M618l4442j1955
$$ -22178 -34598 -54512 -62687 -33113 9621 1726 -34645 -18573 -9042 -4424 -38866 -50821
23786e0821j9364j664K215J6076M3234L0789k2566l0607M361j7207o7475N415
$$ -50821 -70185 -71849 -69634 -53558 -10324 20465 -2101 -32708 -28347 -45554 -113029 -107614
23774a07614K7655M380L6702j2931M3761q366j8727J0092K7965M3270j3280m1403
$$ -107614 -79959 -75579 -38877 -51808 -8047 -16413 -35140 -25048 2917 46187 32907 -8496
23762h496N078J1597K6852L4867l8360o8723m3205k3809J2273P3140O8541K8225
$$ -8496 -3418 8179 35031 69898 31538 -37185 -80390 -104199 -91926 -18786 49755 77980
23750G7980n9163l4814k3036j1667L906K9872L9397J1317k4398J724n5075M3790
$$ 77980 18817 -15997 -39033 -50700 -46794 -16922 22475 33792 9394 11118 -43957 -167
23738a67J8710K3224k0622L3241J4973m4869j4029m545j0159n5804j5457m063
$$ -167 18543 41767 21145 54386 69359 24490 10461 5916 -4243 -60047 -75504 -79567
23726g9567k0247L3859N6638N923O056J4012J3k853l6795P778j8826K790j3398
$$ -79567 -99814 -65955 -9317 -3394 2662 16674 16687 13834 -22961 -15183 -34009 -31219 -44617
23713d4617M748j5797j3031l345Q91o6555j9830Q092L7252L1042M3538l2550M4201
$$ -44617 -39869 -55666 -68697 -72042 -71151 -137706 -157536 -149444 -112192 -81150 -37612 -70162 -25961
23700b5961l472J3638J4941k9394O796K7837L5965j0739L589L4403k6818j7362
$$ -25961 -29433 -15795 -854 -30248 -23452 4385 40350 29611 33200 67603 40785 23423
23688B3423K5861k7495O648L9898k2083N808k5449Q058J8699k1517r579n47k1366
$$ 23423 49284 21789 28437 68335 46252 52060 26611 34669 53368 31851 22272 21725 359
23675C59m1454n250K6578R9043N6190k7339r998J033p5430k5212J0445n5360j2366
$$ 359 -41095 -46345 -19767 79276 135466 108127 98129 99162 23732 -1480 8965 -46395 -58761
23662e8761N6343k7245L04O8128k0474l3649l7071l6120J423O286M3623n9070
$$ -58761 -2418 -29663 -29359 38769 18295 -15354 -52425 -88545 -87122 -80836 -37213 -96283
23650i6283r983Q5081Q9717l3189p0337j3157J7470K2259O0999o789l0906l3650
$$ -96283 -106266 -21185 68532 35343 -34994 -48151 -30681 -8422 52577 45788 14882 -18768
23638a8768m348J709k1759n7383O7304J11459N086m5173o2206q706j4903J6202
$$ -18768 -23116 -21407 -43166 -100549 -33245 78214 83300 38127 -24079 -32785 -47688 -31486
23626c1486M5995L0446k0995O145k1579R235k1626k6259m531J6658N5163J8291
$$ -31486 14509 44955 23960 30105 8526 17761 -3865 -30124 -34655 -17997 37166 55457
23614E5457K8756m4591k8299l6639l7047j2403K4726Q8365P919q5021m8222n903
$$ 55457 84213 39622 11323 -25316 -62363 -74766 -50040 38325 46244 -38777 -86999 -92902
23602i2902J8340K2233j0822N6342J90k7518J0238m6852l7927N8512L9533L5269
$$ -92902 -74562 -52329 -63151 -6809 -6619 -34137 -23899 -70751 -108678 -50166 -10633 24636
23590B4636l0048o3744J853L7859l1409P1280j2694k9595K351N5766J5619r1783
$$ 24636 -5412 -69156 -67303 -29444 -60853 10427 -2267 -31862 -29511 26255 41874 -49909
23578d9909k7226Q1039R725j9480m3480K1108n212l0046K5557N4223K2948m6518
$$ -49909 -77135 3904 13629 -5851 -49331 -28223 -33435 -63481 -37924 16299 39247 -7271
23566g271p953M867J504k418k7181j6868M3652J6836m0870n237l7377J963K1469
$$ -7271 -15224 -10357 -8853 -11271 -38452 -55320 -11668 5168 -35702 -40939 -78316 -76353 -54884
23553e4884j2582n770l6665j967N8544L1475O808J904k1229j642O611M9153J405
$$ -54884 -67466 -73236 -109901 -111868 -53324 -21849 -15041 -13137 -34366 -36008 -29397 19756 21161
23540B1161j1245K2020l4086j1760Q767k6653m0637k3525M9586K5118j3173n66
$$ 21161 9916 31936 -2150 -13910 -5143 -31796 -72433 -95958 -46372 -21254 -34427 -34993
23528c4993J0324K9784m840k3564N9730J53n7239k6642p754J9438N6463j7205
$$ -34993 -24669 5115 275 -23289 36441 36594 -20645 -47287 -55041 -35603 20860 3655
23516C655j6240M991L9173k2308j8869J1464l5819J0683Q856k1067K6276k4876
$$ 3655 -12585 -7594 31579 9271 -9598 1866 -33953 -23270 -14414 -35481 -9205 -34081
23504c4081q744N5078J9093J2479J5422r0N866J8351q346l4433Q5k2226k8339
$$ -34081 -42825 12253 31346 43825 59247 59157 65023 83374 75028 40595 40680 18454 -9885
23491i885r140l8845Q835K2655O1220J7350j3982k6637m6098o885k0763K5932
$$ -9885 -19025 -57870 -49035 -26380 34840 52190 38208 11571 -34527 -41412 -62175 -36243
23479c6243J1068k0397l2719L3815R315j478L9906O139k3168L5579K6287M2705
$$ -36243 -25175 -45572 -78291 -44476 -35161 -36639 3267 9406 -13762 21817 48104 90809
23467I0809j6343p0110n345o0915K5676L9045j1550L1897K6238j3380l0427L804
$$ 90809 74466 4356 -989 -61904 -36228 2817 -8733 23164 49402 36022 5595 9399
23455I399k979m0252j6035k0202j9256K2145K9555J7620N4291N3477j8964k7171
$$ 9399 6420 -33832 -49867 -70069 -89325 -67180 -37625 -20005 34286 87763 68799 41628
23443D1628m0771J5498Q3188K1916l8382n5109k4579k637J8297K9356k1584n289
$$ 41628 857 16355 99543 121459 83077 27968 3389 752 19049 48405 26821 21532
23431B1532L7647O215j69l035m2286j7124r678q204m3907k398L7762M1679j868
$$ 21532 59179 65394 65225 62190 19904 2780 -6898 -15102 -59009 -61407 -23645 18034 16166
23418A6166j161R1489o0021n0382K2309O09m1919l0108O1459O049k8394L1063
$$ 16166 15005 106494 46473 -3909 18400 19009 -22910 -53018 8441 14490 -13904 17159
23406A7159J0039j165L067n03O4200J0031o5142j2072M539k1567j5510J0241L3643
$$ 17159 27198 26033 29100 28597 92797 102828 37686 25614 30153 8586 -6924 3317 36960
23393C6960r041J7378K038l6863J3780K8568n4468r107p636J2140O710j0906N891
$$ 36960 27919 45297 47335 10472 24252 52820 -1648 -10755 -18391 -6251 459 -10447 -4556
23380d556n899Q868n1267J8728O3622L6209O802n8384n0068N7182M5762j3096
$$ -4556 -10455 -1587 -52854 -34126 29496 65705 72507 14123 -35945 21237 66999 53903
23368E3903j1575j1133j4056k0352j5009L9702J4189K6396n4891R667k1799q646
$$ 53903 42328 31195 17139 -3213 -18222 21480 35669 62065 7174 16841 -4958 -13604
23356a3604j8414n7347N386Q8854k736l3507Q430L0783m9072j3872M0966N5825
$$ -13604 -32018 -89365 -83979 4875 2139 -31368 -22938 7845 -41227 -55099 -14133 41692
23344D1692J493j11462j12M4327K3553R934p557n7979J9522O347n979M2299j7116
$$ 41692 43185 -68277 -68389 -24062 -509 9425 1868 -56111 -36589 -30242 -36221 6078 -11038
23331a1038M3415Q0567J9736J2500l6413J0889j5405q3575l7281N5162k1410K8285
$$ -11038 32377 112944 132680 145180 108767 119656 104251 20676 -16605 38557 17147 45432
23319D5432k4102j3793j6379o404j2206j4456K8548l388L3183J1017K183O588
$$ 45432 21330 7537 -8842 -15246 -27452 -41908 -13360 -16748 16435 27452 29635 36223
23307C6223m6153n3092O766L4989o232o864n060L8330J2441m812k010k3914M3074
$$ 36223 -9930 -63022 -56256 -21267 -27499 -34363 -39423 -1093 11348 6536 4526 -19388 23686
23294B3686K8879j0442m8848k2075L4864K1377l7222j4455j4952J6639P522K4283
$$ 23686 52565 42123 -6725 -28800 6064 27441 -9781 -24236 -39188 -22549 -15027 9256
23282I256k8943k3209M304N587O8869r391o9047J5776l066j1809j1680P0934l3133
$$ 9256 -19687 -42896 -38592 -33005 35864 26473 -42574 -26798 -29864 -41673 -53353 17581 -15552
23269a5552j0864N9298K1660L3m5534q197j1564k0967M8939j8311j1290j6871
$$ -15552 -26416 32882 54542 54575 9041 844 -10720 -31687 17252 -1059 -12349 -29220
23257b9220J1788L7540o985l2740M2502j1682o7400l122N883r002r118P4669N2220
$$ -29220 -17432 20108 13123 -19617 22885 11203 -56197 -59319 -53436 -62438 -71556 3113 55333
23244E5333M0048J7106K4602m4104m5366o3209l8103l7646m8078J8478O4827O8247
$$ 55333 95381 112487 137089 92985 47619 -15590 -53693 -91339 -139417 -120939 -56112 12135
23232A2135J6186n3925m0306k6292K3631M401J9792m314J0873M1418m2564n5541
$$ 12135 28321 -25604 -65910 -92202 -68571 -64170 -44378 -48692 -37819 3599 -38965 -94506
23220i4506K4121M1018K1811r4083l8844N9296L7875j0864p168O9111M6829r356
$$ -94506 -70385 -29367 -7556 -101639 -140483 -81187 -43312 -54176 -61344 7767 54596 45240
23208D5240m7617K2657o727k6986j4305K2927j1394L7522Q505K5355P694n1999
$$ 45240 -2377 20280 13553 -13433 -27738 -4811 -16205 21317 29822 55177 62871 10872
23196A0872k2507M2276O1735J3883p3532q0551K4706K103k6908o1633O1338M4069
$$ 10872 -11635 30641 92376 106259 32727 -47824 -23118 -21015 -47923 -109556 -48218 -4149
23184d149M993j2943o5162j8773M9153O8072J4752K5480K2082j7562m5059j4618
$$ -4149 844 -12099 -77261 -96034 -46881 21191 35943 61423 83505 65943 20884 6266
23172F266j2936J4599O6932q307m7883j8726p960j2417m5716j5473K7469N996
$$ 6266 -6670 7929 74861 66554 18671 -55 -8015 -20432 -66148 -81621 -54152 -48156
23160d8156J44k7272m9574m5061N19O3300P9568L2802L301r338L6683o054l3558
$$ -48156 -48012 -75284 -124858 -169919 -169400 -106100 -26532 6270 9571 233 36916 30862 -2696
23147b696l5927j4317K0661j1676J2558O762K6644K0095O802j7489J2542J0946
$$ -2696 -38623 -52940 -32279 -43955 -31397 -24635 2009 22104 28906 11417 23959 34905
23135C4905N7803l472k1788q762L623L4822K4117j0868q0961n5132l63J1381N2816
$$ 34905 92708 89236 67448 58686 62309 97131 121248 110380 29419 -25713 -26076 -14695 38121
23122C8121P6023k1096m2310K2656k2389q819k9770j2334j3319j1194M5994M3513
$$ 38121 114144 93048 50738 73394 51005 42186 12416 82 -13237 -24431 21563 65076
23110F5076R924p1678L2300j0858m3941k5346L3897J5213J0718j7056J5082k4176
$$ 65076 75000 3322 35622 24764 -19177 -44523 -10626 4587 15305 -1751 13331 -10845
23098a0845k6356L732N5320O3663K6121l3829l1436l8316q1814O733L9103N4001
$$ -10845 -37201 -33469 21851 85514 111635 77806 46370 8054 -73760 -67027 -27924 26077
23086B6077M0425M9593K7488r6490l6351J2318n7866n1794M5840m679j4629l8174
$$ 26077 66502 116095 143583 47093 10742 23060 -34806 -86600 -40760 -45439 -60068 -98242
23074i8242n704K7773L1352M7764M7420l7509k8175P3544l9487k5090l3186j0732
$$ -98242 -103946 -76173 -44821 2943 50363 12854 -15321 58223 18736 -6354 -39540 -50272
23062e0272N1147K6582j2680j350O458M5558L4658J3826k7945o7014N6052P06
$$ -50272 875 27457 14777 13427 19885 65443 100101 113927 85982 18968 75020 75726
23050G5726j7247K6416j0162m0534l6933l1103p587M603P964N2998M3339L8906
$$ 75726 58479 84895 74733 34199 -2734 -33837 -41424 -36821 -28857 24141 67480 106386
23038A06386m1415K949n9819k2649R205L8167m186o787k8864n355J044j371P28
$$ 106386 64971 67920 8101 -14548 -5343 32824 28638 21851 -7013 -12368 -11324 -12695 -11967
23025a1967l737N8949k2318j14941o0132J8515L9852M2314L7640j8083L7409K0897
$$ -11967 -15704 43245 20927 -94014 -154146 -135631 -95779 -53465 -15825 -33908 3501 24398
23013B4398j6461J7540J6374K8901K1j08734q1930k318P6113K9589k7372J1033
$$ 24398 7937 25477 41851 70752 70773 -37961 -119891 -122209 -46096 -16507 -43879 -32846
23001c2846L1313J1414l1910L5376L4661o6471q6848m463J8412K9481N0031k3884
$$ -32846 -1533 9881 -22029 13347 48008 -18463 -105311 -109774 -91362 -61881 -11850 -35734
22989c5734k8635J8148Q665j1491L0971M6557J7152K9680j0969j0705J1965j2878
$$ -35734 -64369 -46221 -37556 -49047 -18076 28481 45633 75313 64344 53639 65604 52726
22977E2726n634l104O776m90k0793q3862r942M3994k366J6437L7076l1504m8095
$$ 52726 47092 43988 50764 50274 29481 -54381 -64323 -20329 -22695 -6258 30818 -686 -48781
22964d8781n773l3559n2251K4367M1285L1926l5808J2048J3783J3123m3702l8250
$$ -48781 -54554 -88113 -140364 -115997 -74712 -42786 -78594 -66546 -52763 -39640 -83342 -121592
22952a21592K2894L1267k7323n716L7678O3222q633J3857k5988J4169Q155j925
$$ -121592 -98698 -67431 -94754 -100470 -62792 430 -8203 5654 -20334 -6165 1990 65
22940F5l0619k0663q3432o0366O6872J6797K6013p56N8536L2231M2936m2152l6036
$$ 65 -30554 -51217 -134649 -195015 -128143 -111346 -85333 -86089 -27553 4678 47614 5462 -30574
22927c0574k9200j3391J3370j8270j6267J076M8856M2765l1076J1621L1135L269
$$ -30574 -59774 -73165 -59795 -78065 -94332 -93256 -44400 -1635 -32711 -21090 10045 13314
22915A3314j2853j6143M6494k432n4374L8953j0731p4240M1840M454J4102M1018
$$ 13314 461 -15682 30812 28380 -25994 12959 2228 -72012 -30172 -25718 -11616 29402
22903B9402q086k9093N1050n1934O949p776M94K6265K7778o0270o6573k6460Q494
$$ 29402 21316 -7777 43273 -8661 -1712 -9488 -8994 17271 45049 -15221 -81794 -108254 -99760
22890i9760L2264K4729J6047M748M1255j9288l0833k3011M991j6189O105M7828
$$ -99760 -67496 -42767 -26720 -21972 19283 -5 -30838 -53849 -48858 -65047 -58942 -11114
22878a1114L3326n9842K145k0877j4686Q236K5091k82l5864J452m467j0678M3170
$$ -11114 22212 -37630 -35485 -56362 -71048 -62812 -37721 -38003 -73867 -72415 -76882 -87560 -44390
22865d4390j108q993L5971M8757j6594k3513j1411N0346l8111j8673J3880Q115
$$ -44390 -45498 -54491 -18520 30237 13643 -9870 -21281 29065 -9046 -27719 -13839 -5724
22853e724n3893j1756K6968j6665R098O8389J9301J5556k972Q351o3012Q663M1175
$$ -5724 -59617 -71373 -44405 -61070 -51972 16417 35718 51274 48302 56653 -6359 2304 43479
22840D3479K5772m7563n6360m4961j3093J3374R5411P5786j1342n9302k1626l5734
$$ 43479 69251 21688 -34672 -79633 -92726 -79352 16059 91845 80503 21201 -425 -36159
22828c6159M0228L2871J124k0853J5008M0623j946k7605k7014j968m1098j8828
$$ -36159 4069 36940 38064 17211 32219 72842 70896 43291 16277 14309 -26789 -45617
22816d5617N9270M0034l7390m2503L38Q3373R219n5680l6220L1885J4918l1049
$$ -45617 13653 53687 16297 -26206 -25868 57505 66724 11044 -25176 6709 21627 -9422
22804i422m5663Q892L4757N0220m8960N713K2805n1489j6471L8785N9131k9209
$$ -9422 -55085 -46193 -11436 38784 -10176 -4463 18342 -33147 -49618 -10833 48298 19089
22792A9089J4769k6591j0892r248j9896K859n3489j2080R5908q826j7881K8168
$$ 19089 33858 7267 -3625 -12873 -32769 -29910 -83399 -95479 429 -8397 -26278 1890
22780A890m4595L146M4252M9931J3908J566r937j798j251j8633J986k8312K5558
$$ 1890 -42705 -39559 4693 54624 68532 70098 60161 58363 57112 38479 40465 12153 37711
22767C7711M886l4127m4130m9568P8768O9396m7458m2050j7783J4831K127k3167
$$ 37711 42597 8470 -35660 -85228 -6460 62936 15478 -26572 -44355 -29524 -27397 -50564
22755e0564k8509M1700m2546J4626R0085O109o4853n3797K8570M0461L7024n880
$$ -50564 -79073 -37373 -79919 -65293 24792 30901 -33952 -87749 -59179 -18718 18306 12426
22743A2426K4346L0970n7047m1614m4l987P4163n745m3451l3638k0007l2244j1048
$$ 12426 36772 67742 10695 -30919 -30963 -34950 39213 33468 -9983 -43621 -63628 -95872 -106920
22730a06920L5821L1877L7347l1600k9212j6057j3314J2295O7918n543l4622J1674
$$ -106920 -71099 -39222 -1875 -33475 -62687 -78744 -92058 -79763 -11845 -17388 -52010 -40336
22718d0336N2847M3164L0545m2340o81J4489k2105q2152r987J7300k5311j8765
$$ -40336 12511 55675 86220 43880 43199 57688 35583 -46569 -56556 -39256 -64567 -83332
22706h3332O3943O4173K430j9430k5821K159P6055m0099l4177l7288j4326j5109
$$ -83332 -19389 44784 47214 27784 1963 4122 80177 40078 5901 -31387 -45713 -60822
22694f0822M3124J9357j6435J1782J4433l4859j4664L7416K8345M067l80r46k4190
$$ -60822 -17698 1659 -14776 -2994 11439 -23420 -38084 -668 27677 31744 31364 30418 6228
22681F228N4890K26k8114P228o0498N6799N389l1620m0507K2205N0967L5510o0511
$$ 6228 61118 61344 33230 40458 -20040 36759 42148 10528 -29979 -7774 43193 78703 18192
22668A8192j2016L2319P900p5862l29L5960O378J2197J2970L3508K9162o811m0925
$$ 18192 6176 38495 46395 -29467 -29796 6164 12542 24739 37709 71217 100379 93568 52643
22655E2643K7207L0700l2581K333j7013p3963o3927m0614M2089L2451j535n288
$$ 52643 79850 110550 77969 80302 63289 -10674 -74601 -115215 -73126 -40675 -42210 -47498
22643d7498l0658l09M5265L0444m7769k0790r034p2212L1048M1082J8886l6294
$$ -47498 -78156 -78465 -33200 -2756 -50525 -71315 -80349 -152561 -121513 -80431 -61545 -97839
22631i7839J6374J8870K2279j108J3637l2191j1611j1598J9757P332M7739l394
$$ -97839 -81465 -62595 -40316 -41424 -27787 -59978 -71589 -83187 -63430 -56098 -8359 -11753
22619a1753l7628J4080k7061n7461L4674J9647N3853J2326o6418M223j7455n8216
$$ -11753 -49381 -35301 -62362 -119823 -85149 -65502 -11649 677 -65741 -61518 -78973 -137189
22607a37189l8417O4846O0795k4753Q720q429j8055J3474L8963J5706J7337l5360
$$ -137189 -175606 -110760 -49965 -74718 -65998 -74427 -92482 -79008 -40045 -24339 -7002 -42362
22595d2362n1944K9619N9409N4428l5441J680m062L84J4672m4552Q297o243l4283
$$ -42362 -94306 -64687 -5278 49150 13709 15389 11327 11711 26383 -18169 -9872 -16115 -50398
22582e0398K1476k990j858n8729m3058P654M1294M3095k4516l737J7726Q2098
$$ -50398 -28922 -31912 -33770 -92499 -135557 -127903 -86609 -43514 -68030 -71767 -54041 28057
22570B8057J015j4356L6829m7624J1938J2566J2949m1293n868j2809k6228M5344
$$ 28057 29072 14716 51545 3921 15859 28425 41374 81 -5787 -18596 -44824 520
22558E20O8553J8148l6721k595k274l4503K1189J6833j135K333j1199M7522q179
$$ 520 69073 87221 50500 47905 45631 11128 32317 49150 48015 50348 39149 86671 78492
22545G8492n5892m9894l341P7840O655l6380L7032K3183l1928m041K2157l283
$$ 78492 22600 -27294 -30635 47205 53860 17480 54512 77695 45767 41726 63883 60600
22533F0600n7963N0486R992p4827K8578J1238l886k0651K3016p677J5266K5166
$$ 60600 2637 53123 63115 -11712 16866 28104 24218 3567 26583 18906 34172 59338
22521E9338M1189q6296n3966k1421Q2115P1074N225m5296l6509j6953j4242K111
$$ 59338 100527 14231 -39735 -61156 20959 92033 97258 51962 15453 -1500 -15742 -13631
22509a3631p596J6240J0155O3153P551l8196K6820K6520n525L193k4086n872l512
$$ -13631 -21227 -4987 5168 68321 75872 37676 64496 91016 85491 88684 64598 58726 55214
22496E5214r7055l5316N2101o080l1644R618p608p4540J7698L4578J04896K0970
$$ 55214 -41841 -77157 -25056 -31136 -62780 -53162 -60770 -135310 -117612 -83034 21862 42832
22484D2832o564N2260l702o2891o2308o50j7438K0559J2559j193j7634L7123P5261
$$ 42832 36268 88528 84826 21935 -40373 -41023 -58461 -37902 -25343 -26536 -44170 -7047 68214
22471F8214j3516m0914n3314k5m8142O5729L2304J040L3991J6351l8129n2154
$$ 68214 54698 13784 -39530 -39555 -87697 -21968 10336 11376 45367 61718 23589 -28565
22459b8565m89l2589r030J3243J0172k6716J3076N2452o661l5010L723k272M4719
$$ -28565 -29054 -61643 -70673 -57430 -47258 -73974 -60898 -8446 -15107 -50117 -46394 -48666 -3947
22446c947m6375k4127M963J3138K1252J6867O6386k4051p5181l2635k0869P185
$$ -3947 -50322 -74449 -69486 -56348 -35096 -18229 48157 24106 -51075 -83710 -104579 -97394
22434i7394L9571M5351J8363N1258M45m1456k6975m8957n427K6487M2449M6943
$$ -97394 -57823 -12472 5891 57149 57594 16138 -10837 -59794 -65221 -38734 3715 50658
22422E0658n0312j5537l0285n1091O927J15597M1360m6679N2279M8978l4989l0919
$$ 50658 346 -15191 -45476 -96567 -89640 25957 67317 20638 72917 121895 86906 55987
22410E5987n6191q1164k3849L9033K2794J2211L6757P502k2414m33J1375K5398
$$ 55987 -204 -81368 -105217 -66184 -43390 -31179 5578 13080 -9334 -9767 1608 27006
22398B7006r188n0012k0649L4842N7170l0314p8145l7370K7818k5032k0383K6291
$$ 27006 17818 -32194 -52843 -18001 39169 8855 -69290 -106660 -78842 -103874 -124257 -97966
22386i7966l1511K1367K7581m0253Q333N6158J4684K5243L1360k3252L1647J3364
$$ -97966 -129477 -108110 -80529 -120782 -112449 -56291 -41607 -16364 14996 -8256 23391 36755
22374C6755j6505Q655k8716k0060l0150J6851j9302L370N93l4815o1459j9428
$$ 36755 20250 28905 189 -19871 -50021 -33170 -52472 -49102 -48509 -83324 -144783 -164211
22362a64211P5120R0733P9748l9637l8923l9979j1169K9220K4753K7203p2241
$$ -164211 -89091 1642 81390 41753 2830 -37149 -48318 -19098 5655 32858 -39383
22351c9383m6691K9300N8291Q9978k9018o4382L4606J2862P940J5068K3927n5603
$$ -39383 -86074 -56774 1517 91495 62477 -1905 32701 45563 53503 68571 92498 36895
22339C6895J3228j4424L57J0483R97k5867k7113p593O112l921R225M8J8211k847
$$ 36895 50123 35699 36056 46539 47536 21669 -5444 -13037 -6925 -10846 -1621 -1573 16638 13791
22325A3791r066m9904l2016K5583J9833M4496l9967n9875p422M0058N5412n7474
$$ 13791 4725 -45179 -77195 -51612 -31779 12717 -27250 -87125 -94547 -54489 923 -56551
22313e6551k8573k467N8537L6175M687j5744k5403k1248k0941O2702K7318j5448
$$ -56551 -85124 -87591 -29054 7121 11808 -3936 -29339 -50587 -71528 -8826 18492 3044
22301C044J252j7458K069j1324Q336N164K4762l3562l3319R2487N1281K7549R871
$$ 3044 4296 -13162 -11093 -22417 -14081 -8917 15845 -17717 -51036 41451 92732 120281 130152
22288A30152l5288l9357L0273j8395p9832k2098N2723n6706l3824K0512R082L1689
$$ 130152 94864 55507 85780 67385 -12447 -34545 18178 -38528 -72352 -51840 -42758 -11069
22276a1069M1073j8050m204L1367L6266R649j9735j0221l3818n9433j4335J9173
$$ -11069 30004 11954 7750 39117 75383 85032 65297 55076 21258 -38175 -52510 -33337
22264c3337r924J4472K4609M4910J4089K8202m8149j06699m129J09308N0055p0405
$$ -33337 -43261 -28789 -4180 40730 54819 83021 34872 -71827 -75956 33352 83407 13002
22252A3002L196q683p909p0587N58N6506K3718l1063M5807l1058k6668K0005k8625
$$ 13002 16198 7515 -394 -70981 -70423 -13917 9801 -21262 24545 -6513 -33181 -13176 -41801
22239d1801Q700n7599n816k5837P997M2553n434p62Q337M8436N3982m539O922
$$ -41801 -33101 -90700 -96516 -122353 -114356 -71803 -77237 -77999 -69662 -21226 32756 28217 35139
22226C5139L223L0601n5204l5041K7774M9375L7842K8018j1065J0141l7923j7431
$$ 35139 38362 68963 13759 -21282 6492 55867 93709 121727 110662 120803 82880 65449
22214F5449n48m6724k9205j5132j9542n5579n149R9676M4657q42J096k2689r099
$$ 65449 64901 18177 -11028 -26160 -45702 -101281 -106430 -6754 37903 37061 38157 15468 6369
22201F369k3774J9883m0488n8397j1955N6476j2654M5273M2498M2900l3757k2891
$$ 6369 -17405 2478 -38010 -96407 -108362 -51886 -64540 -19267 23231 66131 32374 9483
22189I483n901k6641J3361j0627o4334l9109M6896J7725J2609J3653J4013K5383
$$ 9483 3582 -23059 -9698 -20325 -84659 -123768 -76872 -59147 -46538 -32885 -18872 6511
22177F511M2632O1258k3570o4676l8298N1480K5041k5299k910k343l891l3066
$$ 6511 49143 110401 86831 22155 -16143 35337 60378 35079 32169 29826 25935 -7131
22165g131n671o6286p0471O073R1169L2151K0969j3321p7727K4387O2416K2778
$$ -7131 -12802 -79088 -149559 -143486 -52317 -20166 803 -12518 -90245 -65858 -3442 19336
22153A9336m273n344M768j8208J7535N614j5661K4297J9353P855J619K6978J2999
$$ 19336 15063 9719 14487 -3721 13814 19428 3767 28064 47417 55272 56891 83869 96868
22140I6868k2757m1596J8279L129m8597o2429J07558N6342K3634m032n4500k5506
$$ 96868 74111 32515 50794 53923 5326 -57103 50455 106797 130431 126399 71899 46393
22128D6393J8907m5787o839M0162L62j2115l7743p0492L1409K7986N7015K1290
$$ 46393 65300 19513 12674 52836 53198 41083 3340 -67152 -35743 -7757 49258 70548
22116G0548n9078m0423M9527l162o4232L2252o297n0562j4897K2010J761M6339
$$ 70548 11470 -28953 20574 17412 -46820 -14568 -20865 -71427 -86324 -64314 -62553 -16214
22104a6214O3869k2031o0456j6516m3130K1493j2928J5074N1666N6913K2271m8429
$$ -16214 47655 25624 -34832 -51348 -94478 -72985 -85913 -70839 -19173 37740 60011 11582
22092A1582l7032L6625K8139l0485k7025o527K6731m2390l5748M1478M8341o066
$$ 11582 -25450 11175 39314 8829 -18196 -24723 2008 -40382 -76130 -34652 13689 7623
22080G623K9576l0844l015n508l2912k0150O642M1931l0215J0399M2944O0226
$$ 7623 37199 6355 3340 -2168 -35080 -55230 -48588 -6657 -36872 -26473 16471 76697
22068G6697J7778o0983k3077J1492p779n6213q31M4442j9140k8849L4575M455
$$ 76697 94475 33492 10415 21907 14128 -42085 -42916 1526 -17614 -46463 -11888 -7433
22056g433q802j5829J4023o116l5853j087P8621L734J695k8716o6814L5619K1272
$$ -7433 -16235 -32064 -18041 -24157 -60010 -61097 17524 21258 22953 -5763 -72577 -36958 -15686
22043a5686j3463J0907L4755K6888L0688m7802l8763k8655J6455J9038M0417P242
$$ -15686 -29149 -18242 16513 43401 74089 26287 -12476 -41131 -24676 -5638 34779 42021
22031D2021k8502m0045l9378J8339M0237M6678m5534k7349K7833M698k2500j0480
$$ 42021 13519 -26526 -65904 -47565 -7328 39350 -6184 -33533 -5700 -1002 -23502 -33982
22019c3982K3023l2884k1749M4898n736j0359K1324m347N579P2653j1863j4831
$$ -33982 -10959 -43843 -65592 -20694 -26430 -36789 -15465 -19812 -14233 58420 46557 31726
22007C1726l3397J1215K2596N5071j6208J2448l4573L3919m1449n7505j7401O341
$$ 31726 -1671 9544 32140 87211 71003 83451 48878 82797 41348 -16157 -33558 -27217
21995b7217P874l288J8638k460k4964l7552M5019P2246j9429K9956K0874J7918
$$ -27217 -19343 -22631 -3993 -6453 -31417 -68969 -23950 48296 28867 58823 79697 97615
21983I7615J4113j2132m5782l6345m6457J3250K6948j8756J3734L7387l7236j6422
$$ 97615 111728 99596 53814 17469 -28988 -15738 11210 -7546 6188 43575 6339 -10083
21971a0083m2282m9208K249Q984r688N833J4469j899m1205J5079M3009O9662O0172
$$ -10083 -52365 -101573 -99324 -90340 -100028 -94195 -79726 -81625 -122830 -107751 -64742 4920 65092
21958F5092L305q3390j064O9305n4544j8658m694J5833p57N631l5438m0253R5863
$$ 65092 68397 -14993 -16057 53248 -1296 -19954 -24648 -8815 -9572 -3941 -39379 -79632 16231
21945A6231M2949K0768m6371J7295k0113j461P296n9604q585j2598J3897j6116
$$ 16231 59180 79948 33577 50872 30759 29298 36594 -23010 -31595 -44193 -30296 -46412
21933d6412Q000J087j1273q358j5719j2760N64M3729l0281q506M9763J4435m215
$$ -46412 -38412 -37325 -48598 -56956 -72675 -85435 -84871 -41142 -71423 -79929 -30166 -15731 -19946
21920a9946K4279L3428P8600j1873l9248j2835K5997o9785l4769M0061l1926m7822
$$ -19946 4333 37761 116361 104488 65240 52405 78402 8617 -26152 13909 -18017 -65839
21908f5839j1390l1323J493k9470l8894Q5098Q9969k4897j9400N4965L3003m5916
$$ -65839 -77229 -108552 -107059 -136529 -175423 -90325 -356 -25253 -44653 10312 43315 -2601
21896b601k8717j6776j6883K7520L2564n0722j446j6515n2415J1845N235j590
$$ -2601 -31318 -48094 -64977 -37457 -4893 -55615 -57061 -73576 -125991 -114146 -108911 -110501
21884a10501o188K2326K9398J08963K6990k2534l010m7293J1772R517m717p514
$$ -110501 -116689 -94363 -64965 43998 70988 48454 45444 -1849 9923 19440 14723 7209
21872G209m9860k8573m456K7236Q7779P1924l408k9663o1348k6070l9840P734
$$ 7209 -42651 -71224 -75680 -48444 39335 111259 107851 78188 16840 -9230 -49070 -41336
21860d1336K6610K3561m6376N5324Q253M2668J2845q0098m781J3687j9855l585
$$ -41336 -14726 8835 -37541 17783 26036 68704 81549 1451 -3330 10357 -9498 -13083
21848a3083k0420r196L0694K8956J4721O406K213K8402K9855l8889o6838k6523
$$ -13083 -33503 -42699 -12005 16951 31672 38078 40291 68693 98548 59659 -7179 -33702
21836c3702J7642M5164m3597m4447J5458K6178K7397j0584k0563J0963L8755P3170
$$ -33702 -16060 29104 -14493 -58940 -43482 -17304 10093 -491 -21054 -10091 28664 101834
21824A01834J0725O643q3316j10448j6816k6078K1343L5703K069r802L6570K1270
$$ 101834 112559 119202 35886 -74562 -91378 -117456 -96113 -60410 -58341 -68143 -31573 -10303
21812a0303l2964R30K5276K1622k375o3974O560M7186o979k4795M2568J9940O527
$$ -10303 -43267 -42337 -17061 4561 2186 -61788 -55228 -8042 -15021 -39816 2752 22692 29219
21799B9219K1204L249K700m1648j8K0614L2832j6707p8007o550n806l1305j1503
$$ 29219 50423 53672 56372 14724 14706 35320 68152 51445 -26562 -33112 -38918 -70223 -81726
21786h1726K7103N4909j8889n4777J89P5155N0398l8820J6424J6006m8573l2753
$$ -81726 -54623 286 -18603 -73380 -73191 1964 52362 13542 29966 45972 -2601 -35354
21774c5354M810J857M3161J6701n6828j4001O83N882l2017k3607O45O2339K6201
$$ -35354 -30544 -28687 14474 31175 -25653 -39654 -38971 -33089 -65106 -88713 -88068 -25729 472
21761D72n413L3775M2581N343n1020L2090J608j7695J5388k7616j5955R051J4113
$$ 472 -4941 28834 71415 76758 25738 57828 59436 41741 57129 29513 13558 22609 36722
21748C6722N75O489p2247j2657J6388K282M6359K838l1913j7411O1466l781k1041
$$ 36722 37297 43786 -28461 -41118 -24730 -22448 23911 26749 -5164 -22575 38891 35110 14069
21735A4069j4893j5989j3422J3368K4367M814K0487N087m7822o1929L1312J7823
$$ 14069 -824 -16813 -30235 -16867 7500 12314 32801 37888 -9934 -71863 -40551 -22728
21723b2728m1515n4264m3721M0238N1675K9390m809J5532j2635K0052L1842j0810
$$ -22728 -64243 -118507 -162228 -121990 -70315 -40925 -45734 -30202 -42837 -22785 9057 -1753
21711a753o1044l0370O497m4790l656J1118J2491m709j5440M6645K0934J0530
$$ -1753 -62797 -93167 -86670 -131460 -135116 -123998 -111507 -116216 -131656 -85011 -64077 -53547
21699e3547L5434j9729k5409m9498N9292M7484k7372l5634L2472P013o333j8731
$$ -53547 -18113 -37842 -63251 -112749 -53457 -5973 -33345 -68979 -36507 -29494 -35827 -54558
21687e4558K3789Q14K364N9090J4610n9120l6103N445k3429R7007P0625j0666
$$ -54558 -30769 -29955 -27591 31499 46109 -13011 -49114 -43669 -67098 29909 100534 89868
21675H9868k3007j2653m3475o8577k356K1252L738P729J3083K6790n0420J2600
$$ 89868 66861 54208 10733 -57844 -60200 -38948 -35210 -27481 -14398 12392 -38028 -25428
21663b5428K5352l7954k176j0679o159L7874M3472m2809L1501j2900K7089M8449
$$ -25428 -76 -38030 -40206 -50885 -57044 -19170 24302 -18507 12994 94 27183 75632
21651G5632J894l1391k3833K2443L3086p4465k5813K230J3618M726J4596l6202
$$ 75632 77526 46135 22302 44745 77831 3366 -22447 -20217 -6599 -1873 12723 -23479
21639b3479j148L2768j6031k3428M6840k3439k7072r522J2909k633N857l5798
$$ -23479 -24627 8141 -7890 -31318 15522 -7917 -34989 -44511 -31602 -34235 -28378 -64176
21627f4176p0530l2938J9176M8139L4460K9485N2638j6854k4111O828J3513N478
$$ -64176 -134706 -167644 -148468 -100329 -65869 -36384 16254 -600 -24711 -17883 -4370 1108
21615A108l0069r1l430j533M550l8613J6831L4880P37l8260P104L8477q8290o1386
$$ 1108 -28961 -29052 -32482 -34015 -29465 -68078 -51247 -16367 -15630 -53890 -46786 -8309 -96599 -157985
21601a57985N8476N9816M936k1227P786p15M5557j5158m1918N567J3355M0495
$$ -157985 -99509 -39693 -34757 -55984 -48198 -48913 -3356 -18514 -60432 -54865 -41510 -1015
21589a015M2433K1305o256l9555j8797K6707M3617k6475k1086N652K0430k3030
$$ -1015 41418 62723 56467 16912 -1885 24822 68439 41964 20878 26530 46960 23930
21577B3930l664k3945L8087L3309m7074o4506j0678j7819L1069j9737k8444k0747
$$ 23930 20266 -3679 34408 67717 20643 -43863 -54541 -72360 -41291 -61028 -89472 -110219
21565a10219q496k0323J4484O8101K6295M407M1653Q6940q099m0082M0430M4149
$$ -110219 -118715 -139038 -124554 -56453 -30158 -25751 15902 102842 94743 54661 95091 139240
21553A39240l0667n6741j9274M9585M8020p219l1880m8982j1200K194j358q48
$$ 139240 108573 51832 32558 82143 130163 122944 91064 42082 30882 33076 31718 30870
21541C0870m3601M7894L8421p9871j9914j0222q8201k5997M3972K6121J1512M1348
$$ 30870 -12731 35163 73584 -6287 -26201 -36423 -124624 -150621 -106649 -80528 -69016 -27668
21529b7668K0248N441K1953J264n1471n917J728J7814r345N2681q857j8223J0434
$$ -27668 -7420 -1979 19974 21238 -30233 -36150 -34422 -16608 -25953 26728 17871 -352 10082
21516A0082q6008J0334N6220N580P520o344k4210k8477N276m3721j236J00239
$$ 10082 -75926 -65592 -9372 -3792 3728 -2616 -26826 -55303 -50027 -93748 -94984 5255
21504E255j8221M3967K0314M820K194J3349r948k6589J8134o3639m0007M7099
$$ 5255 -12966 31001 51315 56135 58329 71678 61730 35141 53275 -10364 -50371 -3272
21492c272N2145j2312n1050q4898o592l2017R630j1478l0631M1474q68M4641J8894
$$ -3272 48873 36561 -14489 -99387 -105979 -137996 -128366 -139844 -170475 -129001 -129869 -85228 -66334
21479f6334K1803m6172k1329O9542O3249J0438q246L8397k626q699o4344l0820
$$ -66334 -44531 -90703 -112032 -42490 20759 31197 22951 61348 58722 50023 -14321 -45141
21467d5141j12K533J0590N8628j3446l6999o904J6681o4737p3969l3098k749K9955
$$ -45141 -45253 -42720 -32130 26498 13052 -23947 -30851 -14170 -78907 -152876 -185974 -188723 -158768
21454a58768M8764k7146J1204P9191L3496J3515j5541k2652M4537j1964N1812
$$ -158768 -110004 -137150 -125946 -46755 -13259 256 -15285 -37937 6600 -5364 46448
21443D6448L4200j2229n3143m0764k5024L0660K9775L1241k4052J0862J6761k8140
$$ 46448 80648 68419 15276 -25488 -50512 -19852 9923 41164 17112 27974 44735 16595
21431A6595K3199M0076m6535l616k7669K0104j197M6468N5334j1263K027J4663
$$ 16595 39794 79870 33335 29719 2050 22154 20957 67425 122759 111496 113523 128186
21419A28186o7942j02043m6596J3440J0870J411N7882P3704k1132k2104m9920
$$ 128186 60244 -41799 -88395 -74955 -64085 -62674 -4792 68912 47780 25676 -24244
21408b4244j4795k054k5216n0884M7792P5118M9776J8037K822M1638M773m4670
$$ -24244 -39039 -41093 -66309 -117193 -69401 5717 55493 73530 76352 117990 122763 78093
21396G8093r8754J9207N0323K1164k2857k4334j4026m6480l4241j8075l558k9029
$$ 78093 -20661 -1454 48869 70033 47176 22842 8816 -37664 -71905 -89980 -93538 -122567
21384a22567K8076J15356J0710l3205m4395J3127n530j7213L3123k4466l661N0765
$$ -122567 -94491 20865 31575 -1630 -46025 -32898 -38428 -55641 -22518 -46984 -50645 120
21372A20j4547o5131M3985K7025j7676j6226O9097J242n2265m147L4269J6563
$$ 120 -14427 -79558 -35573 -8548 -26224 -42450 26647 27889 -24376 -28523 5746 22309
21360B2309N015j3251m1743p9287k497L6339J6709l549k9879l058O4045M9194
$$ 22309 27324 14073 -27670 -106957 -109454 -73115 -56406 -59955 -89834 -92892 -28847 20347
21348B0347Q463M7818r8436l0011K6442l223l4016J3091j2275l8289k9854J9929
$$ 20347 28810 76628 -21808 -51819 -25377 -28600 -62616 -49525 -61800 -100089 -129943 -110014
21336a10014M0811L9451K0354k779R91N8078n276m9368j5220k3324j0179p594
$$ -110014 -69203 -29752 -9398 -12177 -11186 46892 41616 -7752 -22972 -46296 -56475 -64069
21324f4069q805O796K9054J0512K168l3198k0410J5721L875J8445N4469P418o7300
$$ -64069 -72874 -66078 -37024 -26512 -24344 -57542 -77952 -62231 -58356 -39911 14558 21976 -45324
21311d5324N939P1180O6701K4732m1478l2062J8287K1243j0101n0155k7055J036
$$ -45324 -39385 31795 98496 123228 81750 49688 67975 89218 79117 28962 1907 2943
21299B943j927j6698m341L2244J8269n850m8950k5941L8970k9408m4727J3437
$$ 2943 1016 -15682 -20023 12221 30490 24640 -24310 -50251 -11281 -40689 -85416 -71979
21287g1979K5362P8431O3836l1275p4476l522k632L5398m4889r3094j8466Q2522
$$ -71979 -46617 31814 95650 64375 -10101 -13623 -16255 19143 -25746 -118840 -137306 -54784
21275e4784O0818M3500j0048k9175k8313m3861K2292M1746o3510M562J2827k8352
$$ -54784 6034 49534 39486 10311 -18002 -61863 -39571 2175 -61335 -56773 -43946 -72298
21263g2298j7006J2468N6271N2109k8978j6518R981q8970l8824k0644J4307N8115
$$ -72298 -89304 -76836 -20565 31544 2566 -13952 -3971 -92941 -131765 -152409 -138102 -79987
21251g9987J745l877N2070O089m0077r254k4772m2917p04O5166L9016o7078M6763
$$ -79987 -78242 -82119 -30049 -23960 -64037 -73291 -98063 -140980 -141684 -76518 -37502 -104580 -57817
21238e7817J10585p322j6468l5885J1691L4381m5709o9711P026J07462L3171m1672
$$ -57817 52768 45446 28978 -6907 4784 39165 -6544 -76255 -69229 38233 71404 29732
21226B9732n6649j3212J1157p979k0259K6087o935J4496N754Q282k4344j1251
$$ 29732 -26917 -40129 -28972 -36951 -57210 -31123 -38058 -23562 -17808 -9526 -33870 -45121
21214d5121N209J5805J5603j7015j5960J3059k2403M2622N5876J3387j7592j4335
$$ -45121 -39912 -24107 -8504 -25519 -41479 -28420 -50823 -8201 47675 61062 43470 29135
21202B9135L6508M3840o7459j1487L1090k4206L01L2746k3526K9408L2745j9765
$$ 29135 65643 109483 42024 30537 61627 37421 37722 70468 46942 76350 109095 89330
21190H9330L906p745k9098n5132k8434l2015l1649J2750O8452P6843L9375n853
$$ 89330 93236 85491 56393 1261 -27173 -59188 -90837 -78087 -9635 67208 106583 100730
21178A00730o1762n8154L9580L0997n8299r6187J5363P4513P3283K9875j6778
$$ 100730 38968 -19186 20394 51391 -6908 -103095 -87732 -13219 60064 89939 73161
21167G3161j1594L655K586j6555m1848P991k9543j4107K4692M789J0420N5869
$$ 73161 61567 65222 67808 51253 9405 17396 -12147 -26254 -1562 3227 13647 69516
21155F9516j8294M548R199k8783O015k3204m6760M0192L1282L160M2350n3665
$$ 69516 51222 55770 64969 36186 42201 18997 -27763 12429 43711 46871 89221 35556
21143C5556k2570k239m2009r347M0018K2046k9813j9578o067k2070P940K1161
$$ 35556 12986 10747 -31262 -40609 -591 21455 -8358 -27936 -34003 -56073 -48133 -26972
21131b6972J2100J855J3521J9403L0291j1668n2395n2224J095M6584K8548o1631
$$ -26972 -14872 -13017 504 19907 50198 38530 -13865 -66089 -64994 -18410 10138 -51493
21119e1493M665k9742K0060k5138K7150R2783L8033j809K759r530k0812k2555
$$ -51493 -46828 -76570 -56510 -81648 -54498 38285 76318 74509 77268 67738 46926 24371
21107B4371J927L699k5497n4377M4515L6261M3787L3853q4162m7342K569o30J4228
$$ 24371 26298 29997 4500 -49877 -5362 30899 74686 108539 24377 -22965 -20396 -21026 -6798
21094f798J9899K9304J3942N6136j9151n7709K465O326J5534r3945j4464L0754
$$ -6798 13101 42405 56347 112483 93332 35623 38088 44414 59948 -33997 -48461 -17707
21082a7707k793k8075M5976K7349M488r991o9472n2388K9766O1401R4903l3326
$$ -17707 -20500 -48575 -2599 24750 29238 19247 -50225 -102613 -72847 -11446 83457 50131
21070E0131k7221p4804L4670N9539P551k6049J5253Q6320p148m3985l505p0939
$$ 50131 22910 -51894 -17224 42315 49866 23817 39070 125390 118242 74257 70752 -187
21058a87q9153j0855K9441L3677O7295K9615k049j3453o6228K3853M0594O7658
$$ -187 -89340 -100195 -70754 -37077 30218 59833 57784 44331 -21897 1956 42550 110208
21046A10208l1019o4828j7118L2832M3217K7421J2637l0214l3809n4967m4769
$$ 110208 79189 14361 -2757 30075 73292 100713 113350 83136 49327 -5640 -50409
21035e0409O117L3504R334j2852K8202J9140j338M4827k6210q6358j7950J0049
$$ -50409 -44292 -10788 -1454 -14306 13896 33036 31698 76525 50315 -36043 -53993 -43944
21023d3944O1546K9309j9208K7093k578m8436j2481m3176m3583m771K4242L0108
$$ -43944 17602 46911 27703 54796 52218 3782 -8699 -51875 -95458 -100229 -75987 -45879
21011d5879M7567M9236k3992k7651M751K302K5524k5918M967j5599o8892k3031
$$ -45879 1688 50924 26932 -719 4032 6334 31858 5940 10907 -4692 -73584 -96615
20999i6615L8189k0741N8941L7393K0907M0542L1074j6841l5707m8426p199L1470
$$ -96615 -58426 -79167 -20226 17167 38074 78616 109690 92849 57142 8716 1517 32987
20987C2987O2466n6199m3300l2063J4265L0476j5251m1956K4615J1569O817n0435
$$ 32987 95453 39254 -4046 -36109 -21844 8632 -6619 -48575 -23960 -12391 -5574 -56009
20975e6009k4001J9449O633J5530N4068k1012M0274K3554N763R851k0934l9427
$$ -56009 -80010 -60561 -53928 -38398 15670 -5342 34932 58486 64249 74100 53166 13739
20963A3739N1007K3167J8725j1982M4622j5151n5025K4970K1885l9677o6761j9970
$$ 13739 64746 87913 106638 94656 139278 124127 69102 94072 115957 76280 9519 -10451
20951a0451L7912N0342N733j4725L4434P4787K7526p5656l5225j1227j1301l9633
$$ -10451 27461 77803 83536 68811 103245 178032 205558 129902 94677 83450 72149 32516
20939C2516M2064K4199M2489l5181l3437k6182l221N2569J6258k1676k0140O7960
$$ 32516 74580 98779 141268 106087 72650 46468 43247 95816 112074 90398 70258 138218
20927A38218O2351l5739j9279k9570o0499j4426l9677J1862K5543K6272L8276
$$ 138218 200569 164830 145551 115981 55482 41056 1379 13241 38784 65056 103332
20916A03332L6903M3520K412O145j7350J7696K4599j0750J9402L2166R5870J08043
$$ 103332 140235 183755 186167 192312 174962 192658 217257 206507 225909 258075 353945 461988
20904D61988J21373J45889K47583L13383L66218K47471R6337q081j7983R456j03842
$$ 461988 583361 729250 976833 1290216 1656434 1903905 2000242 1992161 1974178 1983634 1879792
20893A879792k09458l16785l41751k59112j72494n0462j1523l5028m0153m6942
$$ 1879792 1670334 1353549 1011798 752686 580192 529730 518207 483179 443026 396084
20883C96084r7748r9796q401M4238Q040L5947J9598J4779J022N6593Q3350R2790
$$ 396084 298336 198540 190139 234377 242417 278364 297962 312741 313763 370356 453706 546496
20871E46496J00640J97935L34812L81474L21362J76525O4904L9505O4653q1975
$$ 546496 647136 845071 1179883 1561357 1882719 2059244 2124148 2163653 2228306 2146331
20861B146331k28238l34316k93646k63599j53822j32409j26434q7440j15122m3142
$$ 2146331 1918093 1583777 1290131 1026532 872710 740301 613867 526427 411305 368163
20851C68163Q046k3570k4484l0785k4108m5391m1763l013o0480K4142Q6377K1006
$$ 368163 376209 352639 328155 297370 273262 227871 186108 183095 122615 146757 233134 254140
20839B54140q169m204K9601R695j7831n224J738J8626N2230l4487r8721j5507
$$ 254140 245971 241767 271368 281063 263232 258008 259746 278372 330602 296115 197394 181887
20827A81887M9945r343M3639J8146O8726o790N2665j9154n323p2135O471k0517
$$ 181887 231832 222489 266128 284274 353000 346210 398875 379721 374398 302263 308734 288217
20815B88217m8635j1456n9589k7302L1246N341K3496M4866M0572k7969j7278n7079
$$ 288217 239582 228126 168537 141235 172481 177822 201318 246184 286756 258787 241509 184430
20803A84430p9504k8127n1029k1483j2555M7697J01793j1759m9212o8148M3395
$$ 184430 104926 76799 25770 4287 -8268 39429 141222 129463 80251 12103 55498
20792E5498M5033m8220l1385O7334k6083o4828O6292L3641o5981K0591P3151N0725
$$ 55498 100531 52311 20926 88260 62177 -2651 63641 97282 31301 51892 125043 175768
20780A75768j2406O825P657m3244o0474o4468j3371K3280K3115N409Q4981O1895
$$ 175768 163362 170187 177844 134600 74126 9658 -3713 19567 42682 48091 133072 194967
20768A94967k292l8971O943K8524L722R26l8844l7381m0549L6290k1973J9202
$$ 194967 192675 153704 160647 189171 192893 193819 154975 117594 77045 113335 91362 110564
20756A10564l9476l164k0922k6922L7127M0603K3060k1467l5069n6726K1J8141
$$ 110564 71088 67924 47002 20080 57207 97810 120870 99403 64334 7608 7629 25770
20744B5770k4891K1185K0579K4825L105J9457q829j4284l3925L7091J1458J4660
$$ 25770 879 22064 42643 67468 70573 90030 81201 66917 32992 70083 81541 96201
20732I6201J755l6627J5056O2641K4494r65J8021k9477M010P383k097j0021o5487
$$ 96201 97956 61329 76385 139026 163520 162555 180576 151099 155109 162492 160395 150374 84887
20719H4887r516M8389j1005K3575k4835j3534Q543J84L4267N1794N153K4147M7117
$$ 84887 75371 123760 112755 136330 111495 97961 106504 106688 140955 192749 197902 222049 269166
20706B69166m3231o0650o7506j4671K6303Q34k289N71J6729p138n223l6667m164
$$ 269166 225935 165285 97779 83108 109411 110245 107956 108527 125256 118118 112895 76228 72064
20693G2064J03J6347J5604J3677j4687p515l5813j0415j5441K2475l6992M83N3826
$$ 72064 72167 88514 104118 117795 103108 95593 59780 49365 33924 56399 19407 19890 73716
20680G3716P7256j0133l7582j4718n7845n489j877N7610L0038K4762k5152L2178
$$ 73716 150972 140839 103257 88539 30694 25205 23328 80938 110976 135738 110586 142764
20668A42764L337l0058R475m144J7093n8050Q492J33219j713l8836o2515m6505
$$ 142764 146101 116043 125518 121374 138467 80417 88909 222128 220415 181579 119064 72559
20656G2559L178j2502M4615j0728L633L2347p37p1993k8033O6789k8164k3571
$$ 72559 75737 63235 107850 97122 100755 133102 132365 60372 32339 99128 70964 47393
20644D7393l0064j7705j7362N7581M0728P9355J9474n2763j3278j9424k994O042
$$ 47393 17329 -376 -17738 39843 80571 159926 179400 126637 113359 93935 90941 96983
20632I6983n4230p5392K6737k4965L6426P2598J8859K9106m9586k094J9734m865
$$ 96983 42753 -32639 -5902 -30867 5559 78157 97016 126122 76536 74442 94176 89311
20620H9311L9194L4184L1855j2220l5545K0893L3272l9219q2468p01L4052l9929
$$ 89311 128505 162689 194544 182324 146779 167672 200944 161725 79257 78556 112608 72679
20608G2679P812O8144M7073k7474q7758n001J3136m623N2119N042R493J0232k6385
$$ 72679 80491 148635 195708 168234 80476 75475 88611 83988 136107 141149 150642 160874 134489
20595A34489q822J7168m4427l635k8027n5205L4366O1776N2196P9015N50k975
$$ 134489 125667 142835 98408 94773 66746 11541 45907 107683 159879 238894 239444 236469
20583B36469Q501M0437N526l4218j1776l8399k2984k977q926K9903j0626j2517
$$ 236469 244970 285407 290933 256715 244939 206540 183556 180579 171653 201556 190930 178413
20571A78413J16027K2749P341L7367Q8901M0065K2332n2741l1557O4432J08590
$$ 178413 294440 317189 324530 361897 450798 490863 513195 460454 428897 493329 601919
20560F01919M5838q9373o0182m6927K419n4979n1269L2029K7399l8249J4467k4744
$$ 601919 647757 558384 498202 451275 453694 398715 347446 379475 406874 368625 383092 358348
20548C58348l1678L8734J3802m4290k5846N417K9800O5608k8390j01428k2473
$$ 358348 326670 365404 379206 334916 309070 314487 344287 409895 381505 280077 257604
20537B57604Q2496L9455N6121R8452J12029Q6369M4513M7757L6043O3047j0104
$$ 257604 340100 379555 435676 534128 646157 732526 777039 824796 860839 923886 913782
20526I13782o8221q990r667k2845m1555P0117J08237Q1278J37743K55768L95660
$$ 913782 845561 836571 826904 804059 762504 832621 940858 1022136 1159879 1415647 1811307
20515A811307M60975N48181M92766M23903K95898J10297j8198k50949n07512n07714
$$ 1811307 2272282 2820463 3313229 3737132 4033030 4143327 4125129 3874180 3366668 2858954
20505B858954n26574n23163l34642k74984k15458j57692j03784m6964K8346L643
$$ 2858954 2332380 1809217 1474575 1199591 984133 826441 722657 675693 704039 707682
20495G07682p7013p0842N192R548q288n0640j1914J499p5399J1185M3539k5014
$$ 707682 630669 559827 565019 574567 566279 515639 503725 505224 429825 441010 484549 459535
20483D59535o8503p8211Q32m388K7975K829j1567J2234J2488j9702N0110J7594
$$ 459535 391032 312821 313653 309265 337240 340069 328502 340736 353224 333522 383632 401226
20471D01226L0922R42p9132k5644L9024M9157l014n7784J1674N1485q904O7513
$$ 401226 432148 433090 353958 328314 367338 416495 413481 355697 367371 418856 409952 477465
20459D77465P3968k5837P270L2043K5092q578J2165m3025o4750m0448L9095O3152
$$ 477465 551433 525596 532866 564909 590001 581423 593588 550563 485813 445365 484460 547612
20447E47612J3641m2918l5553J4447Q0877Q0977j7893O9498L1295O1268k2625
$$ 547612 561253 518335 482782 497229 578106 659083 641190 710688 741983 803251 780626
20436G80626k7006k9318K4061P9398O2590l3381J039L7184O4876Q9712J48797
$$ 780626 753620 724302 748363 827761 890351 856970 858009 895193 960069 1049781 1198578
20425A198578J94334K18496M18434M43347L80068K12862r2398k26472k79506l39668
$$ 1198578 1392912 1611408 2029842 2473189 2853257 3066119 2973721 2747249 2467743 2128075
20415B128075l75519k21501j29281n2985o3574o7625l0106L5607o030l1747j3819
$$ 2128075 1752556 1531055 1401774 1348789 1285215 1217590 1187484 1223091 1217061 1185314 1171495
20404A171495O223n6933o7436J5265Q7140Q3374O9001j5820M9277J44073J41616
$$ 1171495 1177718 1120785 1053349 1068614 1155754 1239128 1308129 1292309 1341586 1485659 1627275
20393A627275J90630K84172L49000L37576M20920L05440Q8280j14547l07897l66930
$$ 1627275 1817905 2102077 2451077 2788653 3209573 3515013 3603293 3488746 3180849 2813919
20383B813919m07394k76595j36617l5210l9406o1340k266L3592n9589m3046K9088
$$ 2813919 2406525 2129930 1993313 1958103 1918697 1857357 1855091 1888683 1829094 1786048 1815136
20372A815136Q638J7038N9243M3928N1012J22675J23642O0353J20496J07769J89312
$$ 1815136 1823774 1840812 1900055 1943983 1994995 2117670 2241312 2301665 2422161 2529930 2719242
20361B719242J43392J76021K47274M03918M51779K69341J19150J55144J34254
$$ 2719242 2862634 3038655 3285929 3689847 4141626 4410967 4530117 4685261 4819515
20352D819515J86229J71949R3681O5715K4404Q9040J32645K46146L47477L90552
$$ 4819515 5005744 5177693 5271374 5337089 5361493 5450533 5583178 5829324 6176801 6567353
20342F567353M04300M75290M61658M51934N70734P26632O87475N23381L30760
$$ 6567353 6971653 7446943 7908601 8360535 8931269 9657901 10345376 10868757 11199517
20333A1199517L32450M28243L82679M24419M76582O75137J051530J565406K038036
$$ 11199517 11531967 11960210 12342889 12767308 13243890 13919027 14970557 16535963 18573999
20324A8573999K502992K994860L799228N016211O866399R400428J3340812K0188206
$$ 18573999 21076991 24071851 27871079 32887290 39753689 49154117 62494929 82683135
20316H2683135L1814658M8909600O6191242O5034138L7571425J2146549N16266
$$ 82683135 114497793 163407393 229598635 294632773 332204198 344350747 344867013
20309C44867013L810169N588387j7325808m2956149o2503032o2460950m4036016
$$ 344867013 348677182 354265569 336939761 293983612 231480580 169019630 124983614
20302A24983614k7836047j8147407j2463886q840098o454248m789280l619771
$$ 124983614 97147567 79000160 66536274 57696176 51241928 46452648 42832877
20295D2832877k647121j602512o85486K44946J168759K326933L504789N041483
$$ 42832877 40185756 38583244 37897758 38142704 39311463 41638396 45143185 50184668
20287E0184668P327970J0577805J6102496K5296120L9663755N8637193P1579240
$$ 50184668 57512638 68090443 84192939 109489059 149152814 207790007 279369247
20280B79369247N7810079K6114510N556716j364722N938357k958254l1067069
$$ 279369247 337179326 363293836 368850552 367485830 373424187 370465933 339398864
20273C39398864n5500743p0184833n9459086l9033341k4727659j6666788j1919093
$$ 339398864 283898121 213713288 154254202 115220861 90493202 73826414 61907321
20266F1907321q812580o716478n185713m178334l536582l055228k444208j934194
$$ 61907321 53094741 46378263 41192550 37014216 33477634 30422406 27978198 26044004
20258B6044004j516477j187503j078770j016052q66890o12388l77415l70301n89205
$$ 26044004 24527527 23340024 22261254 21245202 20378312 19765924 19388509 19018208 18429003
20249A8429003q55019r10303p90833o03328o07879o41843n54172n67106n70780
$$ 18429003 17573984 16663681 15872848 15269520 14661641 14019798 13465626 12898520 12327740
20240A2327740m68923l28198j10701L9453l8155k20500m68280m36709l60244l71810
$$ 12327740 11858817 11530619 11419918 11459371 11421216 11200716 10732436 10295727 9935483 9563673
20230I563673m93159n67172o61511n87100l94413l41433k58249k34463j99920
$$ 9563673 9070514 8503342 7841831 7254731 6860318 6518885 6260636 6026173 5826253
20221E826253j20320p7468r3092j62535j29537j39086k14962k05613r9545r6630
$$ 5826253 5705933 5628465 5535373 5372838 5243301 5104215 4889253 4683640 4584095 4487465
20211D487465p6041j16655j11461n2645j07597j19581n2725j33656r7245q9064
$$ 4487465 4411424 4294769 4183308 4130663 4023066 3903485 3850760 3717104 3619859 3530795
20201C530795m2924m7857j23256j42220j51447p0901p6794n1261o9200j18342
$$ 3530795 3487871 3440014 3316758 3174538 3023091 2952190 2875396 2824135 2754935 2636593
20191B636593l0114M6316K989j4123l995L2267J9816k4016q2461q9774k2674l7691
$$ 2636593 2606479 2652795 2655784 2641661 2637666 2669933 2689749 2665733 2583272 2493498 2470824 2433133
20179B433133p6543q3094l5824J7101m8159j15445j1435j9529j03934j91607o5686
$$ 2433133 2356590 2273496 2237672 2254773 2206614 2091169 2079734 2060205 1956271 1764664 1698978
20168A698978o0281p7490r581m5614o6072m3653p6992k1860q3370m0877P4620
$$ 1698978 1638697 1561207 1551626 1506012 1439940 1396287 1319295 1297435 1214065 1173188 1247808
20157A247808L6128K351Q1433N0750K1816J7083p923j8160Q473Q177l9856k5832
$$ 1247808 1283936 1286287 1367720 1418470 1440286 1457369 1449446 1431286 1439759 1447936 1408080 1382248
20145A382248k4891n8228r437k4728q0652r2880K3091J5994o8340j5192m42o2120
$$ 1382248 1357357 1299129 1289692 1264964 1184312 1091432 1114523 1130517 1062177 1046985 1046543 984423
20133I84423p5370o3565m4895Q698q451m0097q2996k4970L2672M935n046j8095
$$ 984423 909053 845488 800593 809291 800840 760743 677747 652777 685449 690384 685338 667243
20121F67243O9538M6513j6035J5540m8644l4859n8667l9028m217j5860j8930j6386
$$ 667243 736781 783294 767259 782799 734155 699296 640629 601601 597384 581524 562594 546208
20109E46208M2994M3881N0758q1129m9952j4133K4375k0792k8781o1919m2230
$$ 546208 589202 633083 683841 602712 552760 538627 563002 542210 513429 451510 409280
20098D09280j0356M562n0762o2403K2845R0540L9288K1793J6240M7237j4760M1544
$$ 409280 398924 403486 352724 290321 313166 403706 442994 464787 481027 528264 513504 555048
20086E55048J34323l7670r3701m9644l1355L2790J0017o8012q5978m3640L8213
$$ 555048 689371 651701 558000 508356 477001 509791 519808 451796 365818 322178 360391
20075C60391L5055K5301K614j8813l3206n3276k8435K880K344p5400m0280o6553
$$ 360391 395446 420747 423361 404548 371342 318066 289631 292511 294855 219455 179175 112622
20063A12622R6619Q8259J114L8406o0168O933J4480l6924K0399j9279k3838o5563
$$ 112622 209241 297500 298614 337020 276852 283785 298265 261341 281740 262461 238623 173060
20051A73060L451K6921j4781l1996P1515N5446j6737k9357j3359l8375J1935o5286
$$ 173060 176511 203432 188651 156655 228170 283616 266879 237522 224163 185788 197723 132437
20039A32437n2887K0673J7869K5465n971J6438L6922m9968n74J9755l345j1930
$$ 132437 79550 100223 118092 143557 137586 154024 190946 140978 140404 160159 156814 144884
20027A44884L5003L0245m9771P989l3310K9561L7223Q993j594P634q3788m2681
$$ 144884 179887 210132 160361 168350 135040 164601 201824 210817 209223 216857 133069 90388
20015I0388k9855M5091J2769l4870m9517L622M063J2487r684K545l0306l7919
$$ 90388 60533 105624 118393 83523 34006 37628 41691 54178 44494 47039 16733 -21186
20003b1186P378Q365J9043N1827M9377L0679K5762L9276J7096k8348j0377k7774
$$ -21186 -13808 -5443 13600 65427 114804 145483 171245 210521 227617 199269 188892 161118
19991A61118l1198k6544L822l9556k587M2718n411M5410l7799l2925K311K786
$$ 161118 129920 103376 107198 67642 65055 107773 102362 147772 109973 77048 79359 82145
19979H2145o8745n4607J861l7760M3698O3454K5112j1550l7669L9564p71n9207
$$ 82145 13400 -41207 -39346 -77106 -33408 30046 55158 43608 5939 45503 44732 -14475
19967a4475q295N8137L8142N8405O366k0267K9502J0762R955q590m7215m5755
$$ -14475 -22770 35367 73509 131914 138280 118013 147515 158277 168232 159642 112427 66672
19955F6672Q144j9501k7512j4261P9554M936o0816j4544k8375J6206M5241J2479
$$ 66672 74816 55315 27803 13542 93096 98032 37216 22672 -5703 10503 55744 68223
19943F8223J4051l1097L428m416o6770j2000L2877J6683J7071J349J6995J7048
$$ 68223 82274 51177 54605 50189 -16581 -28581 4296 20979 38050 39399 56394 73442
19931G3442j3825L6969J5352n0562l8073K2723K4946J0250m9639N0262P0408O982
$$ 73442 59617 96586 111938 61376 23303 46026 70972 81222 31583 81845 152253 159235
19919A59235j3356l9534j1225N2621k3948k9207o73m1593K1829L0901k6193J6065
$$ 159235 145879 106345 95120 147741 123793 94586 93913 52320 74149 105050 78857 94922
19907I4922L6075k3370L2471k8052r5210K3445j898m5774J4048O8800O105J5010
$$ 94922 130997 107627 140098 112046 16836 40281 38383 -7391 6657 75457 81562 96572
19895I6572L3159K4006n6865p4670J1158R910K1752M6668O657l3877m527J1409
$$ 96572 129731 153737 96872 22202 33360 43270 65022 111690 118347 84470 79943 91352
19883I1352K8910N249k9375k9518k400k1145L0797J7634N5152p816n1174k8650
$$ 91352 120262 125511 96136 66618 64218 43073 73870 91504 146656 138840 87666 59016
19871E9016l2240j4797P4407j9888p0571J0689M6788K7727n1678P026M1367J1702
$$ 59016 26776 11979 86386 66498 -4073 6616 53404 81131 29453 36479 77846 89548
19859H9548j6758q002k355Q427o0306N152j2490M9254R117L060L1239K0188m6910
$$ 89548 72790 64788 62433 70860 10554 15706 3216 52470 61587 64647 95886 116074 69164
19846F9164n291K8527n1000O025O2901J1865p5630N5521N4943l887p421p900o4084
$$ 69164 63873 92400 41400 47425 110326 122191 46561 102082 157025 153138 145717 137817 73733
19833G3733K0287L3214O923k1765M0311o439m7008k4981q284J9484n125K5176
$$ 73733 94020 127234 134157 112392 152703 146264 99256 74275 65991 85475 80350 105526
19821A05526J0890M8881j8107n5069j159L0458l6154o4604L9943N1139J3006L4504
$$ 105526 116416 165297 147190 92121 90962 121420 85266 20662 60605 111744 124750 159254
19809A59254o0658k3687J7019j8887M5083K7686l8016J2999o587K9766K9722k9072
$$ 159254 98596 74909 91928 73041 118124 145810 107794 120793 114206 143972 173694 144622
19797A44622m9639Q065O860k0282k9269L4411m412K6383n860K8911J7192j048
$$ 144622 94983 103048 109908 89626 60357 94768 90356 116739 110879 139790 156982 155934
19785A55934k3198L8893k598n9182m0287l5043M7950R5485K3474N0949J6823M2337
$$ 155934 132736 171629 169031 109849 69562 34519 82469 177954 201428 252377 269200 311537
19773C11537N9968M6134K5831O6645M7487R405J611n5566n0910O615k4858q4963
$$ 311537 371505 417639 443470 510115 557602 567007 568618 513052 462142 468757 443899 358936
19761C58936l8502K0797p101K3541j6171m6473p7365N290J5492K0666N8601l2132
$$ 358936 320434 341231 334130 357671 341500 295027 217662 222952 238444 259110 317711 285579
19749B85579n1247J9897K6392J0994O3386O6183Q4710J0830R40r206Q2814K6552
$$ 285579 234332 254229 280621 291615 355001 421184 505894 516724 517664 508458 591272 617824
19737F17824N5252O4657M5105N1442Q9460J30260J84658K06126K97754M26552
$$ 617824 673076 737733 782838 834280 923740 1054000 1238658 1444784 1742538 2169090
19727B169090L59103J85784j9141m810J91962K76219K66179K58964K50899L94907
$$ 2169090 2528193 2713977 2694836 2690026 2881988 3158207 3424386 3683350 3934249 4329156
19717D329156K06122m1939m0332m9931p9144k54324n91549p57523p50023n93514
$$ 4329156 4535278 4493339 4453007 4403076 4323932 4069608 3478059 2720536 1970513 1376999
19707A376999l20029j66836j11528m9795n3004o1656k9557J928K4704k7830K077
$$ 1376999 1056970 890134 778606 728811 675807 614151 584594 586522 611226 583396 585473
19696E85473K1501L055l7466j1250O7148O8794J28094K13419K55878L66130L03682
$$ 585473 606974 610029 572563 561313 628461 697255 825349 1038768 1294646 1660776 1964458
19685A964458J55659N3742M1269J9650K324j30039k82833m11634l63852j99157
$$ 1964458 2120117 2173859 2215128 2234778 2237102 2107063 1824230 1412596 1048744 849587
19675H49587j33474j18975o4480R28o0646m9352l6175K3705k8364o4189k9328
$$ 849587 716113 597138 532658 533586 472940 423588 387413 411118 382754 318565 289237
19664B89237p964m2066k7344K9965j2121K4004J829K2779J408N38j8074l3182
$$ 289237 281273 239207 211863 241828 229707 253711 255540 278319 279727 280265 262191 229009
19652B29009k8589J1530L0824k8080l9814l3670m2580q36J294L9834n332j7256
$$ 229009 200420 211950 242774 214694 174880 141210 98630 97794 99088 138922 133590 116334
19640A16334o676J6336J7575k9099J9691N797l6070m5480K497M6285L7392J5155
$$ 116334 109658 125994 143569 114470 134161 139958 103888 58408 60905 107190 144582 159737
19628A59737L7759k0766m2867L0873O218l9993L8042K9031J1566l9222K5589k1141
$$ 159737 197496 176730 133863 164736 170954 130961 169003 198034 209600 170378 195967 174826
19616A74826L7764M7930L8220p2846j16688R130Q022K3238M5702k1247l653L5187
$$ 174826 212590 260520 298740 225894 109206 118336 126358 149596 195298 174051 170398 205585
19604B05585J8125j7817l9893O67j8208j1343Q943k1512K5979M5821j4378k6997
$$ 205585 223710 205893 166000 166667 148459 137116 146059 124547 150526 196347 181969 154972
19592A54972k5060M4752R727L0551K1704m4501q8043k9576L2394P1095K9938J0960
$$ 154972 129912 174664 184391 214942 236646 192145 104102 74526 106920 178015 207953 218913
19580B18913m3446j5894J3895o2023n286n3502l567R3935K2502M4812J8262k8495
$$ 218913 175467 159573 173468 111445 106159 52657 49090 143025 165527 210339 228601 200106
19568B00106k61L4541j2746r3611j3419O798K3857N4545N1629Q420O4214J01887
$$ 200106 199845 234386 221640 128029 114610 121408 145265 199810 251439 259859 324073 425960
19556D25960J12503J82345L19170M41320M58138O3181j89788k92748l34293j67917
$$ 425960 538463 720808 1039978 1481298 1939436 2002617 1812829 1520081 1185788 1017871
19546A017871J9929J02317K88249L69297K22369p035j76064m08702l99303k60541
$$ 1017871 1037800 1140117 1428366 1797663 2020032 2012997 1836933 1428231 1028928 768387
19536G68387l9057K881p6449r7430p3738m3687J6128K1512l9265j9505j0299R5832
$$ 768387 729330 732211 655762 558332 484594 440907 457035 478547 439282 419777 409478 505310
19524E05310O3324P6973J78323L45322M13252L09648K5987j95500l73068k86812
$$ 505310 568634 645607 823930 1169252 1582504 1892152 1918139 1722639 1349571 1062759
19514A062759k04642n2823J92568L03446L60549K12602n4128k85885l64207k56425
$$ 1062759 858117 805294 997862 1301308 1661857 1874459 1820331 1534446 1170239 913814
19504I13814j68897j44332p8614r0732n1540j7649n892P824m2936p517J2080K1290
$$ 913814 744917 600585 521971 431239 379699 362050 356158 363982 321046 313529 325609 346899
19492C46899n1703l6197o6887K922J7094j3658J3918N6231L210R251J936l784
$$ 346899 295196 258999 192112 195034 212128 198470 212388 268619 271829 281080 283016 279232
19480B79232j8117K185K931Q7853O9246K1094P7130o68j09018n502M2569J529
$$ 279232 261115 263300 266231 354084 423330 444424 521554 520886 411868 406366 448935 450464
19468D50464M227l9921l5867J5583L632k9628o5229n7544j4760j5730L5964k2162
$$ 450464 454691 414770 378903 394486 398118 368490 303261 245717 230957 215227 251191 229029
19456B29029J29O45j9978j2897j5592q0189K5527O2672J2124L2778J9161l8222
$$ 229029 229158 229803 209825 196928 181336 101147 126674 189346 201470 234248 253409 215187
19444B15187J7849J3120O2712J8224N395j5002K3539m8950p5950O11L0981J08065
$$ 215187 233036 246156 308868 327092 332487 317485 341024 292074 216124 216735 247716 355781
19432C55781R7762O2829J11459R1728K8452k1928l9610m3140O0932P2822m3563
$$ 355781 453543 516372 627831 719559 748011 726083 686473 643333 704265 777087 733524
19421G33524j8561M8693R2716k7693j3070P9858K5251l0602m0807q8018j01908
$$ 733524 714963 763656 856372 828679 815609 895467 920718 890116 849309 761291 659383
19410F59383j30642l3186k1299r843k0589R47m8544j2460J8128K7173q446k5985
$$ 659383 528741 495555 474256 464413 443824 444771 396227 383767 401895 429068 420622 394637
19398C94637l2119p8806K72P015o8050l9642K1502L1937N046k8140k0500K8640
$$ 394637 362518 283712 283984 290999 222949 183307 204809 236746 241792 213652 193152 221792
19386B21792n655J0168O815L0864l1539j2525L9171j9698K9344J5412n0699j9632
$$ 221792 216137 226305 233120 263984 232445 219920 259091 239393 268737 284149 233450 213818
19374B13818j4334M287j7428o3521k526M9890l6152l3943m9511K7370Q224L1499
$$ 213818 199484 203771 186343 122822 120296 170186 134034 100091 50580 77950 86174 117673
19362A17673K7511k7440j7386j0116L1898N8645K6604o8518j0191L5830O1815
$$ 117673 145184 117744 100358 90242 122140 180785 207389 138871 128680 164510 226325
19351B26325K5823Q250l090J2315O183K7428R5110N0061m8350j3994J1131j8697
$$ 226325 252148 260398 257308 269623 275806 303234 398344 448405 400055 386061 397192 378495
19339C78495m4024k0028J4358N1256K3378n5818n530r5016K7334J12536M9582
$$ 378495 334471 314443 328801 380057 403435 347617 342087 247071 274405 386941 436523
19328D36523K7933P942m1804k6540M3685O9420N7092K3088K7814J582o0230p8886
$$ 436523 464456 472398 430594 404054 447739 517159 574251 597339 625153 626735 566505 487619
19316D87619K8763R2483K5206k6153k9041K9621K40N4048K8331r1170j2695N928
$$ 487619 516382 608865 634071 607918 578877 608498 608738 662786 691117 599947 587252 593180
19304E93180j8682L4648Q1062N682l3059J7791j0966O9965L5461n38J974m2203
$$ 593180 574498 609146 690208 695890 662831 680622 669656 739621 775082 774544 776518 734315
19292G34315P5658M0055l8968k4587Q076L3712O2048n310p8354o4557j9371N467
$$ 734315 809973 850028 811060 786473 794549 828261 890309 884999 806645 742088 722717 728184
19280G28184l1029P940J8239N3233M4184p1926l7061N3790O2553N0059k2968J1687
$$ 728184 697155 705095 723334 776567 820751 748825 711764 765554 828107 878166 855198 866885
19268H66885P2271M6022k4408J2873k7298J0591N7177K2328J46330Q6817O0772
$$ 866885 939156 985178 960770 973643 946345 956936 1014113 1036441 1182771 1269588 1330360
19257A330360Q6122J3323p1411l8913k0664k8176M3315J5324j5113L2505N9184
$$ 1330360 1416482 1429805 1358394 1319481 1298817 1270641 1313956 1329280 1314167 1346672 1405856
19246A405856O2470J169N087j7464J7557j3595N5281O256L4703R5969J36648J62173
$$ 1405856 1468326 1469495 1474582 1457118 1474675 1461080 1516361 1522617 1557320 1653289 1789937 1952110
19234A952110Q6525R2816J09918N3190K4312M9336J06417Q6168J63167R7536J3903
$$ 1952110 2038635 2131451 2241369 2294559 2318871 2368207 2474624 2560792 2723959 2821495 2835398
19223B835398J7004P7514J29364R213N3058M6405P411L9554R8454J34780J71788
$$ 2835398 2852402 2929916 3059280 3068493 3121551 3167956 3175367 3214921 3313375 3448155 3619943
19212C619943K20140K25163K15046J88770J00365Q8941K05396K99986K96882L17898
$$ 3619943 3840083 4065246 4280292 4469062 4569427 4658368 4863764 5163750 5460632 5778530
19202E778530M38978M74364M80094N46760P20570R71816J223618J354491J354551
$$ 5778530 6217508 6691872 7171966 7718726 8439296 9411112 10634730 11989221 13343772
19193A3343772J276532J389142J324387J535833J787348K022093K490650K983223
$$ 13343772 14620304 16009446 17333833 18869666 20657014 22679107 25169757 28152980
19185B8152980M082970N360786P447156J1204692J7380924K8441955M7460111
$$ 28152980 32235950 37596736 45043892 56248584 73629508 102071463 149531574
19178A49531574P4571898Q7900446N2991125J5221421J435460N960075L1500587
$$ 149531574 224103472 312003918 364995043 380216464 381651924 387611999 419112586
19171D19112586J1241517j0127398j4880590N643214M2731061J9309730r743529
$$ 419112586 430354103 420226705 405346115 410989329 453720390 473030120 463286591
19164D63286591k0541341j1079930J1269998k1626513n5999213q5108197q8414028
$$ 463286591 442745250 431665320 442935318 421308805 365309592 280201395 191787367
19157A91787367n5280305l1635412j9446042j3336235r956179p501814n747359
$$ 191787367 136507062 104871650 85425608 72089373 62133194 54631380 48884021
19150D8884021m428863l604141l013061k586580k338758k135504k058478k048535
$$ 48884021 44455158 40851017 37837956 35251376 32912618 30777114 28718636 26670101
19142B6670101j993020j858572j517455j187460j061119q86391q03001p82106
$$ 26670101 24677081 22818509 21301054 20113594 19052475 18166084 17363083 16580977
19134A6580977o37409n47012n93762n46383n48082n68559n63317n05151m69082
$$ 16580977 15943568 15396556 14802794 14256411 13708329 13139770 12576453 12071302 11602220
19125A1602220m42861k49199k96602l76344l51489l15565k92152l11991k77962
$$ 11602220 11159359 10910160 10613558 10237214 9885725 9570160 9278008 8966017 8688055
19116H688055k75985k58132j40042j36481k46655k26677k29446k30890j42882
$$ 8688055 8412070 8153938 8013896 7877415 7630760 7404083 7174637 6943747 6800865
19107F800865r7361j93822j26632q5006q0990j16548j01069r2969j23912j42686
$$ 6800865 6703504 6509682 6383050 6298044 6217054 6100506 5999437 5906468 5782556 5639870
19097E639870p3338j93269k09888j08396o2927j39798j41112l2348o6952r6356
$$ 5639870 5566532 5373263 5163375 5054979 4992052 4852254 4711142 4678794 4611842 4515486
19087D515486o2246j40324o7948O445L1441N8761m7511p6477r5963j16562j01545
$$ 4515486 4453240 4312916 4244968 4251413 4282854 4341615 4294104 4217627 4121664 4005102 3903557
19076C903557l8430J9429J517M5384J19890n047L20r2507j08361n102j2819J3681
$$ 3903557 3865127 3884556 3886073 3931457 4051347 4046300 4046620 3954113 3845752 3840650 3827831 3841512
19064C841512j045m908q0970l3546J1000j9058O6458Q9472L0555P2350J39753
$$ 3841512 3840467 3835559 3754589 3721043 3732043 3712985 3779443 3868915 3899470 3971820 4111573
19053D111573J68186P1148J18307J73388J58445J31515L9792M5900Q9183R6505
$$ 4111573 4279759 4350907 4469214 4642602 4801047 4932562 4972354 5018254 5107437 5203942
19043E203942J04310K51604L66366M78955M12901L14028L07401M92610P82599
$$ 5203942 5308252 5559856 5926222 6405177 6818078 7132106 7439507 7932117 8714716
19034H714716J046516J290386J306426J039992N45915K84579K99372Q33319J630448
$$ 8714716 9761232 11051618 12358044 13398036 13943951 14228530 14527902 15361221 16991669
19025A6991669K596620L791781N005948O115156P785649J0990017J7976817L1806051
$$ 16991669 19588289 23380070 28386018 34501174 42286823 53276840 71253657 103059708
19017A03059708N5184714Q3949884Q3645703K6766079k4863682o2790783p5771065
$$ 103059708 158244422 242194306 325840009 352606088 327742406 264951623 189180558
19010A89180558m3299862j2647423J2496418M0217944O7833655O2325963R210050
$$ 189180558 145880696 133233273 145729691 185947635 253781290 316107253 325317303
19003C25317303l3415036o6657923p2141467m4042611k4148393j4742121j0043247
$$ 325317303 291902267 225244344 153102877 109060266 84911873 70169752 60126505
18996F0126505p069114m698940k347556p78692P23305K237705L716534N184866
$$ 60126505 53057391 48358451 46010895 45232203 45955508 48193213 51909747 57094613
18988E7094613O796245J0409492J9110330L5662266O1535671Q4155416O0804208
$$ 57094613 63890858 74300350 93410680 129072946 190608617 274764033 335568241
18981C35568241J305058l8484212p1650362o1846684k8615195k541923K1941739
$$ 335568241 336873299 298389087 226738725 164892041 136276846 133734923 155676662
18974A55676662M9936339O9053039M1427518j1595746m5828158p4051433o0735716
$$ 155676662 205613001 274666040 316093558 304497812 258669654 184618221 123882505
18967A23882505l4504304j9880294j2771535q660447o074941m360695l207798
$$ 123882505 89378201 69497907 56726372 48065925 41990984 37630289 34422491
18960C4422491k625037k150526j808699j405432j210565j669726k010674j998809
$$ 34422491 31797454 29646928 27838229 26432797 25222232 23552506 21541832 19543023
18952A9543023j741802j359368j108391q59904q57814q58053n82113m31577l60578
$$ 19543023 17801221 16441853 15333462 14473558 13615744 12757691 12175578 11744001 11383423
18943A1383423l08140l19969m18701l95281m40440m42216l91155l27887k90131
$$ 11383423 11075283 10755314 10336613 9941332 9500892 9058676 8667521 8339634 8049503
18934H049503k75536k57546l31661k32342j87772k57799l00792k66206j92297
$$ 8049503 7773967 7516421 7184760 6952418 6764646 6506847 6206055 5939849 5747552
18925E747552j08166j23753j30166j21094r4726j40240j41684j47563j59000j07841
$$ 5747552 5639386 5515633 5385467 5264373 5169647 5029407 4887723 4740160 4581160 4473319
18915D473319q0423n8738K2580k1415r2711p6734j23141j54347j85603j45600
$$ 4473319 4392896 4334158 4356738 4335323 4242612 4165878 4042737 3888390 3702787 3557187
18905C557187n2022n5579j0630r2289p4667p6599j14193j62633q3112l5685l254
$$ 3557187 3505165 3449586 3438956 3346667 3272000 3195401 3081208 2918575 2835463 2799778 2796524
18894B796524k7388p8993m9426m47k4480n8234J6359l7535j30308j25870j01728
$$ 2796524 2769136 2690143 2640717 2640270 2615790 2557556 2573915 2536380 2406072 2280202 2178474
18883B178474j0080n4443j18265m292N8006N5225m0642p0406j45152j20957r6980
$$ 2178474 2168394 2113951 1995686 1991394 2049400 2104625 2063983 1993577 1848425 1727468 1630488
18872A630488j33033r3519o9161K323l3925q9127J4834K1971l5146n7399n9068
$$ 1630488 1497455 1403936 1334775 1337098 1303173 1214046 1228880 1250851 1215705 1158306 1099238
18861A099238l4720N9831J1613m2876K7362Q7428M9901l2080l8581p0682q3843
$$ 1099238 1064518 1124349 1135962 1093086 1120448 1207876 1257777 1225697 1187116 1116434 1032591
18850A032591k1963O632j709R774Q8326Q7516l652p4215j34595j03903o1876o508
$$ 1032591 1010628 1017260 1015551 1025325 1113651 1201167 1197515 1123300 988705 884802 822926 816418
18838H16418j9478L7853m0387j18129m1937n929n894l1950l1877L0889O3305P7474
$$ 816418 796940 834793 794406 676277 634340 628411 622517 590567 558690 589579 652884 730358
18826G30358L164k6567j10552p2301m9453J8603M774l3502N1329O9886o117q787
$$ 730358 733522 706955 596403 524102 474649 493252 498026 464524 515853 585739 579622 570835
18814E70835r8790l5732J5397M8203L5901n0910o2105m6330k5952K4319r361p5525
$$ 570835 472045 436313 451710 499913 535814 484904 422799 376469 350517 374836 365475 289950
18802B89950j7083N7642m046m3998k4101m389L9162L2694K9575m3214k5320l1134
$$ 289950 272867 330509 326463 282465 258364 253975 293137 325831 355406 312192 286872 255738
18790B55738M4895O0364j7738o7813J7254l218J8402M9851J0649J4451Q217l1621
$$ 255738 300633 360997 343259 275446 292700 289482 307884 357735 368384 382835 391052 359431
18778C59431l5623k6686l7372k8317J3086N9345K6754O2084l435K2128J26373
$$ 359431 323808 297122 259750 231433 244519 303864 330618 392702 389267 411395 537768
18767E37768N7282n2373j19079q1292n2093n530l7995o6994m4695j4435J3719
$$ 537768 595050 542677 423598 342306 290213 284683 246688 179694 134999 120564 134283
18756A34283N2567L208M8307K7364l9453m8333m8271J5465J3109l1169L367l1989
$$ 134283 186850 190058 238365 265729 226276 177943 129672 145137 158246 127077 130444 98455
18744I8455k9318K3119j0713l2880J7179j4333j2521K386l9586K608P311M139
$$ 98455 69137 92256 81543 48663 65842 51509 38988 41374 1788 4396 11707 15846
18732A5846j0708p75J1118L7490O7599k1067n4911m300J1087n4394m3418N710
$$ 15846 5138 4363 15481 52971 120570 99503 44592 40292 51379 -3015 -46433 -40723
18720d0723K287k3961P0135M5429K3705N0282o913o9982j0721j4914l0684j7285
$$ -40723 -38436 -62397 7738 53167 76872 127154 120241 50259 39538 24624 -6060 -23345
18708b3345p6537K9110J03195P0217l955n3550m7098k4475m8061M248j8171K2362
$$ -23345 -99882 -70772 32423 102640 98685 45135 -1963 -26438 -74499 -70251 -88422 -66060
18696f6060P7214k3350m1563N914R482P6967K1162r649J4917l0303K0733j9181
$$ -66060 11154 -12196 -53759 -47845 -38363 38604 59766 50117 65034 34731 55464 36283
18684C6283N005M866R925J7316O769j4759j824K1343p6580o2279j1369M9792M5719
$$ 36283 41288 46154 56079 73395 80164 65405 63581 84924 8344 -53935 -65304 -15512 30207
18671C0207n137p0489N4831O6007k7847k4096J4181j8481L5896L1155n3516r743
$$ 30207 25070 -45419 9412 75419 47572 23476 37657 19176 55072 86227 32711 22968
18659B2968j4230k2356k7947K5807M8991M6485M0422N8062n3527m7170n1560L026
$$ 22968 8738 -13618 -41565 -15758 33233 79718 120140 178202 124675 77505 25945 28971
18647B8971j1338m8804K5550N5913m267R89K1452J2756L073j9474J6945m115L0172
$$ 28971 17633 -31171 -5621 50292 46025 47014 68466 81222 84295 64821 81766 77651 107823
18634A07823J0434j0641J4223O5834M6387K8727N223P421M5125N6834P9998J72069
$$ 107823 118257 107616 121839 187673 234060 262787 268010 275431 320556 377390 457388 629457
18622F29457L35473M83986M88606K89845J02391j4733L9026J68377Q0675j14364
$$ 629457 964930 1448916 1937522 2227367 2329758 2315025 2354051 2522428 2603103 2488739
18612B488739j75931m0128J55342M0436l322m5057q3266k5921j56965l48579m16202
$$ 2488739 2312808 2272680 2428022 2468458 2465136 2420079 2336813 2310892 2153927 1805348 1389146
18601A389146m69889k81345r6882q874o0373j20350p0108J6549l5726l00j7646
$$ 1389146 919257 637912 541030 532156 471783 351433 281325 297874 262148 261848 244202
18590B44202m4879j2462M1204n627m5769q188N990j790p0113K984L9137J3106
$$ 244202 199323 186861 228065 222438 176669 168481 174471 172681 102568 105552 144689 157795
18578A57795L8556k5418m8995p4256m9922M5665N0718j23j6013M161J4636J0100
$$ 157795 196351 170933 121938 47682 -2240 43425 94143 94020 78007 82168 96804 106904
18566A06904m8599k3957L221J8201J054M5747J4554m40o8600K3619M1872j8012
$$ 106904 58305 34348 37569 55770 56824 102571 117125 116685 48085 71704 113576 95564
18554I5564k1935J2091l105M1535L931m2941l9533J7554M3048k111o227K1718
$$ 95564 73629 85720 82615 124150 128081 85140 45607 63161 106209 104098 97871 119589
18542A19589j1774J243N971l9287n9242k3848k8705m0574J4673L2490K9239K390
$$ 119589 107815 109058 115029 75742 16500 -7348 -36053 -76627 -61954 -29464 -225 2165
18530B165R334L4152m1987k3809O6533M4095o1654L161L5124p5802J332j3461
$$ 2165 11499 45651 3664 -20145 46388 90483 28829 31990 67114 -8688 -7356 -20817
18518b0817k0513P4580L7009o0893K8591N8992m2180k3394k640j9866J8607O1263
$$ -20817 -41330 33250 70259 9366 37957 96949 54769 31375 28735 8869 27476 88739
18506H8739J870n9082n5362j1416K5645K8173N9003M5955K400j7672k8984J9773
$$ 88739 90609 31527 -23835 -35251 -9606 18567 77570 123525 125925 108253 79269 99042
18494I9042J1706L0010M4136k8143n4018J2340J0849L0929j2041j6659j7821k4277
$$ 99042 110748 140758 184894 156751 102733 115073 125922 156851 144810 128151 110330 86053
18482H6053P0743M1960j3918L1493K6106P7098J19842J28032K14379M27480M37676
$$ 86053 156796 198756 184838 216331 242437 319535 439377 567409 781788 1209268 1646944
18471A646944J35171l2778k77444l64482k39424p5351Q0560J78042L73458L44338
$$ 1646944 1782115 1749337 1471893 1107411 867987 792636 873196 1051238 1424696 1769034
18461A769034K9967j53067k94255l91155k43667k06220j30913k9516j2493k5535
$$ 1769034 1799001 1645934 1351679 960524 716857 510637 379724 350208 337715 312180
18451C12180O3538J8751n5759j7232o761j545L7770N9303R9377J63952K47370
$$ 312180 375718 394469 338710 321478 314717 313172 350942 410245 509622 673574 920944
18440I20944M82140M07391L5555k63764m03682l64158j40502J0467J81697L13445
$$ 920944 1403084 1810475 1846030 1582266 1178584 814426 673924 684391 866088 1179533
18430A179533L61412K27460q4760k40895l64222l35035j81165j45628j19531p6647
$$ 1179533 1540945 1768405 1683645 1442750 1078528 743493 562328 416700 297169 220522
18420B20522l0908j218n721l0107J9256L5709P998l9299o165l1646K5829O9731
$$ 220522 189614 188396 182675 152568 171824 207533 215531 176232 170067 138421 164250 233981
18408B33981J0944m0689q1808q6528P6461k1447n0313n0713P3168k1810l1949
$$ 233981 244925 204236 122428 35900 112361 90914 40601 -10112 63056 41246 9297
18397I297Q276O4810L2309j6870p0871l3724K0186k7419K7833O0962j0403j268
$$ 9297 17573 82383 114692 97822 26951 -6773 13413 -14006 13827 74789 64386 63118
18385F3118K9328j0063o502m0394J486k5710J908L3020l0025M1248N691n774m8267
$$ 63118 92446 82383 75881 35487 36973 11263 13171 46191 16166 57414 63105 57331 9064
18372I064j1985j0180k6963L3760N1009K3578N113p271O714M8929m615K4628K683
$$ 9064 -2921 -13101 -40064 -6304 44705 68283 73396 66125 72839 121768 117153 141781 144464
18359A44464k4215m8752K7265j9028k8074L0017K8264j1055j8529j5099N8414
$$ 144464 120249 71497 98762 79734 51660 81677 109941 98886 80357 65258 123672
18348A23672j168k5563o4780k8302M9941M2358P704n1300J1301K9457L3o5477
$$ 123672 122504 96941 32161 3859 53800 96158 103862 52562 63863 93320 93353 27876
18336B7876j2269N911P188P458k2802L1583J558K4749K0161n009q39L2433j5634
$$ 27876 15607 21518 28706 36164 13362 44945 46503 71252 91413 86404 85565 117998 102364
18323A02364j6134L2577l6467m4487m3243J6918J0612p2317K2989P4758K5997
$$ 102364 86230 118807 82340 37853 -5390 11528 22140 -50177 -27188 47570 73567
18312G3567J8408k9114J2420l6630m4731O2075O1305M607j4285k934R169J5043
$$ 73567 91975 62861 75281 38651 -6080 55995 117300 121907 107622 104688 113857 128900
18300A28900l2562j7337l102L2270L1821j241K9979m537J5293J0898O413k5187
$$ 128900 96338 79001 75899 108169 139990 138749 168728 164191 179484 190382 196795 171608
18288A71608m1988J9324M6938l4774j1298O6218J13809M7262K1325j8772N5757
$$ 171608 129620 148944 195882 161108 149810 216028 329837 377099 398424 379652 435409
18277D35409K0184j1639k7859j728l089j9302l498M6598L7438j2598j6058M3983
$$ 435409 455593 443954 416095 414367 411278 391976 388478 435076 472514 459916 443858 487841
18265D87841L1552p3585l8148p5940p5198K4587L7373m6737n5467k6159n2041
$$ 487841 519393 445808 407660 331720 256522 281109 318482 271745 216278 190119 138078
18254A38078J194L8433j1107Q518l2103m2557l7730l0269N3839J02018M1359j3132
$$ 138078 139272 177705 166598 175116 143013 100456 62726 32457 86296 188314 229673 216541
18242B16541K6986M5676k8846j8380J2110K2295M1231k2924m5835m6030m2076
$$ 216541 243527 289203 260357 241977 254087 276382 317613 294689 248854 202824 160748
18231A60748m7894M942R922J1776j3546K3033r7n7923o5612l8180L6022N1571
$$ 160748 112854 117796 127718 139494 125948 148981 148884 90961 25349 -12831 23191 74762
18219G4762L9521Q147l2806J5069M112P185K9666l5434l6055Q3995M0650m6806
$$ 74762 114283 122430 89624 104693 108805 115990 145656 110222 74167 158162 198812 152006
18207A52006M876K6493K8799m1334o3289j9310k3114l0888P11K905m125j4426
$$ 152006 156882 183375 212174 170840 107551 88241 65127 34239 34950 37855 33730 19304
18195A9304o147K4661N3691K6868K6118O316k8580K9815L8704K0925l8547k6837
$$ 19304 13157 37818 91509 118377 144495 150811 122231 152046 190750 211675 173128 146291
18183A46291J7626L9772j9014J1151m0125n6469N0687K2010J2992J6923j8685
$$ 146291 163917 203689 184675 195826 155701 99232 149919 171929 184921 201844 183159
18172A83159m4334m7114K7402N1942P633j9970p2743j3075L8351M5014N5439J0675
$$ 183159 138825 91711 119113 171055 178688 158718 85975 72900 111251 156265 211704 222379
18160B22379j1473L650M3958m5400m0366l7845J3419O6371Q0662l639l8567J9242
$$ 222379 210906 214556 258514 213114 172748 134903 148322 214693 295355 291716 253149 272391
18148B72391o7207m5319k2644O894P6962L0271J3380k2676J6803N0376L6248N2765
$$ 272391 205184 159865 137221 144115 221077 251348 264728 242052 258855 309231 345479 398244
18136C98244O4502P2170L0512M360l625Q1589K6300J08259P2467N9376R3755J01867
$$ 398244 462746 534916 565428 569788 566163 647752 674052 782311 854778 914154 1007909 1109776
18124A109776R8674J72493J79518K70025M63397M92914N44128P95376J251693
$$ 1109776 1208450 1380943 1560461 1830486 2293883 2786797 3330925 4126301 5377994
18115E377994J956658L380225O020811J0636029J7394373J9902220Q089531n217387
$$ 5377994 7334652 10714877 16735688 27371717 44766090 64668310 72757841 67540454
18107F7540454j3913217j9348205j3123732p000369l882334k348242j543929j021750
$$ 67540454 53627237 34279032 21155300 14154931 10272597 7924355 6380426 5358676
18099E358676q07209o12193m86439l43588l32475k31010j55069j42348j93324
$$ 5358676 4551467 3939274 3452835 3109247 2776772 2545762 2390693 2248345 2055021
18090B055021j40517j17472j35856j51343r4042j31446j31781q0756K173K0314
$$ 2055021 1914504 1797032 1661176 1509833 1415791 1284345 1152564 1071808 1073981 1094295
18080A094295m0346M502j2326j5084n9453p3742n1147l6576k1521k944k1494j1267
$$ 1094295 1053949 1058451 1046125 1031041 971588 897846 846699 810123 788602 785658 764164 752897
18068G52897K5054j391j1354j4119q7294k6659O3294O8513R4990J8982K3190n0160
$$ 752897 777951 776560 765206 751087 663793 637134 700428 768941 863931 882913 906103 855943
18056H55943n5911m9976r1775m6561k6765l0648l4101l3987j536l9727k5526p141
$$ 855943 800032 750056 658281 611720 584955 554307 520206 486219 484683 444956 419430 412289
18044D12289l3454l2563L45L2115m050n475p1138n977j8761m559l1713L8015M5589
$$ 412289 378835 346272 346617 378732 374682 369207 298069 292092 273331 268772 237059 275074 320663
18031C20663J3518m7658J7426O277m0813r5121j7802j1730O0586k793L0519M8748
$$ 320663 334181 286523 303949 310226 269413 174292 156490 144760 205346 202553 233072 281820
18019B81820J28906N8284O0219k6J3664M608k218m5484n127n1024o5253j3887
$$ 281820 410726 469010 529229 529203 542867 547475 545257 499773 494646 443622 378369 364482
18007C64482j0532r2760q1874l2375j7652j1100l9729n8060K9719K3101n2223
$$ 364482 353950 261190 179316 146941 129289 118189 78460 20400 50119 73220 20997
17996B0997J1257N8819L899j0553j2734k7486j9471M4605P5778r146P5108L4595
$$ 20997 32254 91073 94972 84419 71685 44199 24728 69333 145111 135965 211073 245668
17984B45668Q937j8076m8852m8372k8162Q720J5933J0075k3341o0563j9929O3115
$$ 245668 254605 236529 187677 139305 111143 119863 135796 145871 122530 61967 42038 105153
17972A05153L7192n1247k0096O93L957L1577L8493n4529r789K5379M0480j9677
$$ 105153 142345 91098 71002 71695 75652 107229 145722 91193 81404 106783 147263 127586
17960A27586K77M5344M4522M6384O8856O4283J8224k2062k053O5401j8766k4759
$$ 127586 127863 173207 217729 264113 332969 397252 415476 393414 391361 456762 437996 413237
17948D13237Q629N7172K8407J7297J7099q0872m6578L7525M318q7773j15457J3311
$$ 413237 421866 479038 507445 524742 541841 460969 414391 451916 456234 368461 253004 266315
17936B66315Q0200j3049r9054m0011k4132K025j0134m9791j0900L5548j5206J1567
$$ 266315 346515 333466 234412 194401 170269 172294 162160 112369 101469 137017 121811 133378
17924A33378L6090l8196o1943K3040J6701K3505M4851N6172M401n2088P1508j5885
$$ 133378 169468 131272 69329 92369 109070 132575 177426 233598 237999 185911 257419 241534
17912B41534R133M206J7224N0199K9912m1579m857o1498M7753K4919k6333l2061
$$ 241534 250667 254873 272097 322296 352208 310629 305772 244274 292027 316946 290613 258552
17900B58552m1370J9957L7996j3204j8342m27M2792K6531J1301m0907j23495r2654
$$ 258552 217182 237139 275135 261931 243589 243162 285954 312485 323786 282879 159384 66730
17888F6730m5519R067k112m4116K1521L753L357j2848L9739O653M861l6793j8047
$$ 66730 21211 30278 28166 -15950 5571 9324 12681 -167 39572 46225 51086 14293 -3754
17875c754l4130j720P0907K2201j3816J8887k4911j4111K9871J6088j3155k6996
$$ -3754 -37884 -39604 31303 53504 39688 58575 33664 19553 49424 65512 52357 25361
17863B5361p613k8895l8768J5723N7150K7624o0126n3866k3106N4059O9314K7688
$$ 25361 17748 -11147 -49915 -34192 22958 50582 -9544 -63410 -86516 -32457 36857 64545
17851F4545J2742l9747p0469K1548N9487J1446j7204j2708K8888N4877m1247r538
$$ 64545 77287 37540 -32929 -11381 48106 59552 42348 29640 58528 113405 72158 62620
17839F2620l0093k1127R508m0914k1480K4664j4066J3044N6406Q1378K567o9745
$$ 62620 32527 11400 20908 -20006 -41486 -16822 -30888 -17844 38562 119940 122507 52762
17827E2762k4726K6989m1610n626M3552n5779J2536L4188m2941l7730L4239J2322
$$ 52762 28036 55025 13415 7789 51341 -4438 8098 42286 -655 -38385 -4146 8176
17815H176k6844J3107K4046P517r221P908n0804m0791j7314j1711O1692P3956
$$ 8176 -18668 -5561 18485 26002 16781 24689 -26115 -66906 -84220 -95931 -34239 39717
17803C9717n9095o3468J6612J1109l8749k4802O4273N9918k4423l1035j1066K0875
$$ 39717 -19378 -82846 -66234 -55125 -93874 -118676 -54403 5515 -18908 -49943 -61009 -40134
17791d0134L5786j462l1099P9317K8583l3780q4711m4893k970P6560N3863m4347
$$ -40134 -4348 -5810 -36909 42408 70991 37211 -47500 -92393 -95363 -18803 35060 -9287
17779i287l0100J9627m618p449k3589j8748M0282L8836K2557l422K0343K2609
$$ -9287 -39387 -19760 -24378 -31827 -55416 -74164 -33882 4954 27511 24089 44432 67041
17767F7041Q625j6590n3335k1416K6919K5467L1638j7972m1895l9984J0548l261
$$ 67041 75666 59076 5741 -15675 11244 36711 68349 50377 8482 -31502 -20954 -24215
17755b4215l8368L3695K9925m514k1492L533J0686P704O396j3296J0431N374j9742
$$ -24215 -62583 -28888 1037 -3477 -24969 -21436 -10750 -3046 3350 -9946 485 5859 -13883
17742a3883P947J7345L078n474N4891K5122k5125j0345k4534n6597m0317j2335
$$ -13883 -5936 11409 14487 9013 63904 89026 63901 53556 29022 -27575 -67892 -80227
17730h0227M5121L6871k8099l9964J9209K6701L0324K4166R595o63j1156N2166
$$ -80227 -35106 1765 -26334 -66298 -47089 -20388 9936 34102 43697 43034 31878 84044
17718H4044J9772n0722r3533q833O4504l160J7205K4057k3066m7134K3133L2488
$$ 84044 103816 53094 -40439 -49272 15232 12072 29277 53334 30268 -16866 6267 38755
17706C8755r718o921m7039m1537m0701L7895M3991p124Q7374Q7783J3155o7220
$$ 38755 29037 22116 -24923 -66460 -107161 -69266 -25275 -32399 54975 142758 155913 88693
17694H8693p4664L984o10l4115K67M094j9822j3602l9848O7175J794N939j1334
$$ 88693 14029 18013 17403 -16712 -16445 -12351 -32173 -45775 -85623 -18448 -16654 -10715 -22049
17681b2049P973J7965k4299R329K7907J8998m6854K0070l0106j2339l3708M0845
$$ -22049 -14076 3889 -20410 -11081 16826 35824 -11030 9040 -21066 -33405 -67113 -26268
17669b6268L4746r924m3133Q026j5061j7849J6755M8319Q2340L6958J1678J8605
$$ -26268 8478 -1446 -44579 -36553 -51614 -69463 -52708 -4389 77951 114909 126587 145192
17657A45192k1681l7761j9811J3837J593J3469R797p573q731l071M4707K6055
$$ 145192 123511 85750 65939 79776 81369 94838 104635 97062 88331 85260 129967 156022
17645A56022o3547l9917k7909m9879J7131k2878p054K1341N5998N2167l9169l0601
$$ 156022 92475 52558 24649 -25230 -8099 -30977 -38031 -16690 39308 91475 52306 21705
17633B1705p0047o2097J9980M3075M2505j3041l6762O9193k7963n0382L8539J9468
$$ 21705 -48342 -110439 -90459 -47384 -4879 -17920 -54682 14511 -13452 -63834 -25295 -5827
17621e827J8455j9572M160M8397l5093l7679J8977p848J3971L286M2006M9853
$$ -5827 12628 -6944 -2784 45613 10520 -27159 -8182 -16030 -2059 1227 43233 93086
17609I3086j2152k4750K3094m1568P49P339J3635l8902j2140l0951j8761j0006
$$ 93086 80934 56184 79278 37710 38459 45798 59433 20531 8391 -22560 -41321 -51327
17597e1327J0663K7542M5751j8053l3302j9292k8592j54M0781j2543j6632J5464
$$ -51327 -40664 -13122 32629 14576 -18726 -38018 -66610 -66764 -25983 -38526 -55158 -39694
17585c9694K2719N7480N6354j59o877l6830m4675n82n099k1726m6599n5801N256
$$ -39694 -16975 40505 96859 96700 89823 52993 8318 7736 2637 -19089 -65688 -121489 -116233
17572a16233J03557L355J5462J684N8269K9987l2924p8124j3506j4894l2883K5935
$$ -116233 -12676 -9321 6141 7825 66094 96081 63157 -14967 -28473 -43367 -76250 -50315
17560e0315N621r051O230n2246J739O8256O167L943j9366k5115J5206M6943K4911
$$ -50315 -44694 -53745 -47515 -99761 -98022 -29766 -23599 -19656 -39022 -64137 -48931 -1988 22923
17547B2923k5884m611P83L8262J3707j9438k571m0097l2122K0448k0585j9303
$$ 22923 -2961 -7572 -6789 31473 45180 25742 23171 -16926 -49048 -28600 -49185 -68488
17535f8488P2154K0673k7711l7188k8714j0210M3799M6914j5662m3806n9327l0517
$$ -68488 3666 24339 -3372 -40560 -69274 -79484 -35685 11229 -4433 -48239 -107566 -138083
17523a38083K8701L1032O1558Q958l4856k8520Q933n922j712M8406P3105j8736
$$ -138083 -109382 -78350 -16792 -7834 -42690 -71210 -62277 -68199 -69911 -21505 51600 32864
17511C2864K6799K1757J6395l2931n0232K8704N7456m5843q9132k3987R4967O810
$$ 32864 59663 81420 97815 64884 14652 43356 100812 54969 -34163 -58150 36817 43627
17499D3627k3415m5833P623O203K4127K9320M0963k4918m0424k4309l1978L9743
$$ 43627 20212 -25621 -17998 -11795 12332 41652 82615 57697 17273 -7036 -39014 729
17487G29k1131l0265K1110L0093m3415k3747N7297M3620m2479m9954M7449L8737
$$ 729 -20402 -50667 -29557 536 -42879 -66626 -9329 34291 -8188 -58142 -10693 28044
17475B8044O1335j7052q34j8253m2318j7111K8538M2886k4642k8924k680o520
$$ 28044 89379 72327 71493 53240 10922 -6189 22349 65235 40593 11669 8989 2469
17463B469J2302J9612j6740K6057k6477J5951M2990K3344N000J1180j9773n0488
$$ 2469 14771 34383 17643 43700 17223 33174 76164 99508 104508 115688 95915 45427
17451D5427K3476M0414m9117n9507J7452O8753O9975O6310J72977J7929l0618
$$ 45427 68903 109317 60200 693 18145 86898 156873 223183 396160 414089 383471
17440C83471m0928n7898m6562o7370o8262p402L2617k5248m1435K952j24l4644
$$ 383471 342543 284645 238083 170713 102451 95049 127666 102418 60983 63935 63811 29167
17428B9167k2729N4652j6436p4186o092N2279N3558p694k9351j1823k0293k9299
$$ 29167 6438 61090 44654 -29532 -35624 16655 70213 62519 33168 21345 1052 -28247
17416b8247M5140J2791J2146L0478K0377o073n3929l2941N449M040j8439o3473
$$ -28247 16893 29684 41830 72308 92685 86612 32683 -258 5191 9231 -9208 -72681
17404g2681j4067J7800O1938j3239k2959L2884M2043j5262n5093j2401L1078J0373
$$ -72681 -86748 -68948 -7010 -20249 -43208 -10324 31719 16457 -38636 -51037 -19959 -9586
17392i586K6968P874L2281o0701m1773n381J4041L5451P7862l7535m8154M6127
$$ -9586 17382 25256 57537 -3164 -44937 -50318 -36277 -826 77036 39501 -8653 37474
17380C7474k1716R287K1192J9765j4672j0099J2507l9450Q371K2326j13504n2215
$$ 37474 15758 25045 46237 66002 51330 41231 53738 14288 22659 44985 -68519 -120734
17368a20734P1158O5418M8294k5114n1721M2377J0632o7515k1769R852j1508Q9494
$$ -120734 -49576 15842 64136 39022 -12699 29678 40310 -27205 -48974 -39122 -50630 38864
17356C8864L8885n2297R855q3089j4500j386j3149n479J2317R8430J9493j1345
$$ 38864 77749 25452 35307 -47782 -62282 -63668 -76817 -82296 -69979 28451 47944 36599
17344C6599L0540K0251o5586m6667o6229L8940Q1703R258k2969L6922j193j285
$$ 36599 67139 87390 21804 -24863 -91092 -52152 29551 38809 15840 52762 51569 50284
17332E0284k6975j808L4649K4855k6192o3539L546l5857k304Q323L2435j5802
$$ 50284 23309 21501 56150 81005 54813 -8726 -5180 -41037 -43341 -35018 -2583 -18385
17320a8385K1783J7932M2936L6987r69l3096n1543j1498M6897l2159J2847L3318
$$ -18385 3398 21330 64266 101253 100284 67188 15645 4147 51044 18885 31732 65050
17308F5050j1715l4676k6719M2619J8138k9468o1672j995L2859N0459j5792n1982
$$ 65050 53335 18659 -8060 34559 52697 23229 -38443 -40438 -7579 42880 27088 -24894
17296b4894j511k6592J6120L1958K0857j5666k3461j4861J1499k3417l9417O608
$$ -24894 -26405 -52997 -36877 -4919 15938 272 -23189 -38050 -26551 -49968 -89385 -82777
17284h2777j153K3446L6064L1387j0219j6613m976l6258k2231K8380N2047M134
$$ -82777 -83930 -60484 -24420 6967 -3252 -19865 -24841 -61099 -83330 -54950 -2903 1231
17272A231K7331p690k1778m8923j9075K0637P5331m5879N339j9568k9339j977
$$ 1231 28562 20872 -906 -49829 -68904 -48267 27064 -18815 -13476 -33044 -62383 -64360
17260f4360L7998j822o475L9079L7472k7646N8587j350j8081m4582m0186k9622
$$ -64360 -26362 -28184 -34659 4420 41892 14246 72833 71483 53402 8820 -31366 -60988
17248f0988r585K4115Q358j933K3949J1040j6947M3065k050j1606j9283k0802
$$ -60988 -70573 -46458 -38100 -40033 -16084 -5044 -21991 21074 19024 7418 -11865 -32667
17236c2667J7664Q8024K4646m3988o4659r34L397k8202O651K6645L2865M2344
$$ -32667 -15003 73021 97667 53679 -10980 -11914 -8517 -36719 -30068 -3423 29442 71786
17224G1786M8431m3631o2416L688o264k9275M892L0698J3291n6689P396P457L8090
$$ 71786 120217 76586 14170 17858 11594 -17681 -12789 17909 31200 -25489 -18093 -10636 27454
17211B7454j0735J695M5801P1630L6276l0040n8841p4106J6350n585M1798q632
$$ 27454 16719 18414 64215 135845 172121 142081 83240 9134 25484 19899 61697 53065
17199E3065n8102m9006m87M9177j9233l1932k8907M620N1746j602K4151j0034
$$ 53065 -5037 -54043 -54530 -5353 -24586 -56518 -85425 -80805 -29059 -30661 -6510 -16544
17187a6544J8629R249J1612j6175l2683l324k4909P806l2438L195J0145L0768
$$ -16544 2085 11334 22946 6771 -25912 -29236 -54145 -46339 -78777 -75582 -65437 -34669
17175c4669L7333j9224l2079k8303J0321M1378K9165L5363o8451l3706K5565J9951
$$ -34669 2664 -16560 -48639 -76942 -66621 -25243 3922 39285 -29166 -62872 -37307 -17356
17163a7356l3070k4830L7549J1497N4656j3575j4143j8316j2913L4156P5550J3046
$$ -17356 -50426 -75256 -37707 -26210 28446 14871 728 -17588 -30501 3655 79205 92251
17151I2251k0320k5118J2950J770k5976J5036l4434n5773J4162J7432l1990m4695
$$ 92251 71931 46813 59763 61533 35557 50593 16159 -39614 -25452 -8020 -40010 -84705
17139h4705J4977o5378K6388L9842m0840m0508P3011O4370m752M8150J5969K7795
$$ -84705 -69728 -135106 -108718 -68876 -109716 -150224 -77213 -12843 -17595 30555 46524 74319
17127G4319O174k0077M4848J1755K5424k8556o1029l9373l4915Q942O658N91Q3366
$$ 74319 80493 60416 105264 117019 142443 113887 52858 13485 -21430 -12488 -5830 -5239 78127
17114G8127L2682o5140l7556R046q0626L3040J8232l7138j5235L4093K5067K7305
$$ 78127 110809 45669 8113 17159 -63467 -30427 -12195 -49333 -64568 -30475 -5408 21897
17102B1897L5770j5757j07765l1895L7106R786O2458n945m2657j4590M687L4613
$$ 21897 57667 41910 -65855 -97750 -60644 -50858 11600 5655 -37002 -51592 -46905 -12292
17090a2292K3318k3160m4250M7317O9066J3472j2594m2867N412M0574L0047p8750
$$ -12292 11026 -12134 -56384 -9067 59999 73471 60877 18010 23422 63996 94043 15293
17078A5293k8510K6883K697L3617K3470q234J1758N0833P552k7254m1967M753
$$ 15293 -13217 13666 16363 49980 73450 65216 76974 127807 135359 108105 66138 70891
17066G0891n295m4718l3003L020J4847K4529l0183k5096O9398K9443k5609m2923
$$ 70891 65596 20878 -12125 -9105 5742 30271 88 -25008 44390 73833 48224 5301
17054E301K9535k3012K3139o134j0653k9551J0290L1038o9335l0642K9059l340
$$ 5301 34836 11824 34963 28829 18176 -11375 -1085 29953 -39382 -70024 -40965 -44305
17042d4305l042L3111j022N5126N2783J0677m0198o361K0126n648K5470k0794
$$ -44305 -47347 -14236 -15258 39868 92651 103328 63130 56769 76895 71247 96717 75923
17030G5923k6691j1267k2714J7873l4789j7095K3907n5943r337K5963L2722J0116
$$ 75923 49232 37965 15251 33124 -1665 -18760 5147 -50796 -60133 -34170 -1448 8668
17018H668p4448k1604N4513K0544K1578q7015m1539K1991M7049M669L4374N0329
$$ 8668 -65780 -87384 -32871 -12327 9251 -77764 -119303 -97312 -50263 -45594 -11220 39109
17006C9109O912n987K677n9812R276M9302M2503k1484o8584m3886k559K3601M3709
$$ 39109 46021 40034 42711 -17101 -7825 41477 83980 62496 -6088 -49974 -52533 -28932 14777
16993A4777K398J0056L9255p760l283k963N852l5788k8126n240L1178J7159O655
$$ 14777 17175 27231 66486 58726 55443 52480 58332 22544 -5582 -10822 20356 37515 44170
16980D4170n7166L5912q457J8004j6921q253L8834n6848k538L6697M4042Q758
$$ 44170 -12996 22916 14459 32463 15542 7289 46123 -10725 -13263 23434 67476 76234
16968G6234j7877k4754K6999j0549O742M7601p746j02969O795Q932l9224n683
$$ 76234 58357 33603 60602 50053 56795 104396 96650 -6319 476 9408 -29816 -35499
16956c5499L1919J5724M0187J5061j5993L0960J1142l3387n011k3531j3462n4563
$$ -35499 -3580 12144 52331 67392 51399 82359 93501 60114 55103 31572 18110 -36453
16944c6453k6758J678l677K1070p008J9252M3518l078J2881l8689l2979K2292
$$ -36453 -63211 -61533 -65210 -44140 -51148 -31896 11622 8544 21425 -17264 -50243 -27951
16932b7951m582j2002M026l4335j0824K6336P0790J5706K8584j9917m8842J4493
$$ -27951 -32533 -44535 -40509 -74844 -85668 -59332 11458 27164 55748 35831 -13011 1482
16920A482k5116m2872n501m4309M31M4962M2000Q3830L7740q1221j4659N6609
$$ 1482 -23634 -66506 -72007 -116316 -115885 -70923 -28923 54907 92647 11426 -3233 53376
16908E3376K2194k3463l6943J453j7539K6928P54q0668M0924M6807M379L424l6049
$$ 53376 75570 52107 15164 16617 -922 26006 26760 -53908 -12984 33823 38202 41626 5577
16895E577k7624K1679J8521m8792O289K1660k4382j9172N541N6998m343n0301
$$ 5577 -22047 -368 18153 -30639 -24350 -2690 -27072 -46244 -40703 16295 11952 -38349
16883c8349k1085l8353l6085K1643O0368N1951L6892k3013l5107J3865J645n3227
$$ -38349 -59434 -97787 -133872 -112229 -51861 90 36982 13969 -21138 -7273 -5628 -58855
16871e8855l337K0573l4525M614j5052j289N7726N6235N309l708j4961m2339j0516
$$ -58855 -62192 -41619 -76144 -71530 -86582 -87871 -30145 26090 31399 27691 12730 -29609 -40125
16858d0125K8818q852l1362L7594j0272M378m582L3573R3248O5896m9252o8827
$$ -40125 -11307 -20159 -51521 -13927 -24199 -19821 -24403 9170 102418 168314 119062 50235
16846E0235m0306P9142l0792l1447m9877l5836m606N3924K7421l2947q697K4069
$$ 50235 9929 89071 58279 26832 -23045 -58881 -63487 -9563 17858 -15089 -23786 283
16834B83r031j6759o6258J8881Q986R245K8477J8246L1007l3192j3948M2371L8657
$$ 283 -8748 -25507 -91765 -72884 -63898 -54653 -26176 -7930 23077 -10115 -24063 18308 56965
16821E6965r432j6089j0833q223l5962j3601l3651l1642l5268O8449O9440l1474
$$ 56965 47533 31444 20611 12388 -23574 -37175 -70826 -102468 -137736 -69287 153 -31321
16809c1321l3224k3912K8377L8696K5199R390O3917P724k3497J5700k9756o6845
$$ -31321 -64545 -88457 -60080 -21384 3815 13205 77122 84846 61349 77049 47293 -19552
16797a9552j2135J8910L9036k355J7090J3982j3614m8870R294M0130l3306m1155
$$ -19552 -31687 -12777 26259 23904 40994 54976 41362 -7508 1786 41916 8610 -32545
16785c2545O5636l0272n9213O35O6628L7937j6618M872j0212k852K6068R315o430
$$ -32545 33091 2819 -56394 -55759 10869 48806 32188 37060 26848 23996 50064 59379 52949
16772E2949n1189m524L7506j3862k8110K0291l3068L1045J2611k4058P6967M904
$$ 52949 1760 -2764 34742 20880 -7230 13061 -20007 11038 23649 -409 76558 81462
16760H1462k5921P532n6085k9486K914M9369o8125j9103M6431J7955k1712K7034
$$ 81462 55541 63073 6988 -22498 -19584 29785 -38340 -57443 -11012 6943 -14769 12265
16748A2265Q784j868j5824M6566N2445O0362R518r7388p7305k6398O020j3566
$$ 12265 21049 19181 3357 49923 102368 162730 172248 74860 -2445 -28843 -22823 -36389
16736c6389k2379M0177N8870O5739N30o1653k2127l8935m1637k2105J5160J7138
$$ -36389 -58768 -18591 40279 106018 106548 44895 22768 -16167 -57804 -79909 -64749 -47611
16724d7611N4290j5058n5903L4762O910L6816k3929j605O5143m5950M3816J6593
$$ -47611 6679 -8379 -64282 -29520 -22610 14206 -9723 -11328 53815 7865 51681 68274
16712F8274l9442M5566K3083k0169L949Q729k8257j459o5465k5535N4830L3649
$$ 68274 28832 74398 97481 77312 81261 89990 61733 60274 -5191 -30726 24104 57753
16700E7753j0480p31L6175P306k7025k2094J4528M670J7027J2053m2824o2271
$$ 57753 47273 46542 82717 90023 62998 40904 55432 60102 77129 89182 46358 -15913
16688a5913J2158J5030l5622p647J036l336j9656l358l6766q384K0848L1649j5040
$$ -15913 -3755 11275 -24347 -31994 -30958 -34294 -53950 -57308 -94074 -102458 -81610 -49961 -65001
16675f5001O476P9143k4925n0656K5521N6159k4208K413k1307k5273J8754J7225
$$ -65001 -58525 20618 -4307 -54963 -29442 26717 2509 4922 -16385 -41658 -22904 -5679
16663e679k5180M3033P6765R50j01832m3850L4704K8807M29P142p2559L9437N5831
$$ -5679 -30859 12174 88939 89889 -11943 -55793 -21089 7718 8147 15289 -57270 -17833 37998
16650C7998m4968m6909L91j9570j298J4902L3353j0280J0535M3898k6681q773
$$ 37998 -6970 -53879 -53488 -73058 -74356 -59454 -26101 -36381 -25846 18052 -8629 -17402
16638a7402J3587L0831l0972k6804J5686M9398l0825j7472k0076m1928n1878K3631
$$ -17402 -3815 27016 -3956 -30760 -15074 34324 3499 -13973 -34049 -75977 -127855 -104224
16626a04224K8170o01J3027M6438K1728n1302P70J6559L4455k971L5810J9137
$$ -104224 -76054 -76655 -63628 -17190 4538 -46764 -45994 -29435 5020 2049 37859 56996
16614E6996l2440j3878j8919j1817l6151j9363k4839Q196P3474j6169j862K0700
$$ 56996 24556 10678 -8241 -20058 -56209 -75572 -100411 -92215 -18741 -34910 -36772 -16072
16602a6072K2982K8747L0974J0379Q624l3115N325o82m6012k7445m9536K1981
$$ -16072 6910 35657 66631 77010 85634 52519 57844 57162 11150 -16295 -65831 -43850
16590d3850N0151K4754k5305L3463j1635k8081M742J427J1250m0909l7233K1228
$$ -43850 6301 31055 5750 39213 27578 -503 4239 5666 16916 -23993 -61226 -39998
16578c9998O4174q520j4995o8155m2006p985K9731M1141M8900m553m1817M2960
$$ -39998 24176 15656 661 -67494 -109500 -117485 -87754 -46613 2287 -2266 -44083 -1123
16566a123P6274J9720n2351m9063j3099o5384k1971K4628L2710N9115L578k9818
$$ -1123 75151 94871 42520 -6543 -19642 -85026 -106997 -82369 -49659 9456 13034 -16784
16554a6784j6519l394K1553J3725j6516K234K142n88R023M6613j2932p657J2067
$$ -16784 -33303 -36697 -15144 -1419 -17935 -15701 -13559 -14147 -5124 41489 28557 20900 32967
16541C2967l2331j688N674m6609K7795j8557l6465J8869n0648p7717J7254J06896
$$ 32967 636 -1052 4622 -41987 -14192 -32749 -69214 -50345 -100993 -178710 -161456 -54560
16529e4560M7866K7336O715P181l0408O298J5101J5690p3167J4148J0478k9745
$$ -54560 -6694 20642 27357 34538 4130 10428 25529 41219 -31948 -17800 -7322 -37067
16517c7067J5538O8250R064o110K0370J095j9132L5182K9776n1585o8067p863
$$ -37067 -21529 46721 55785 49675 70045 71140 52008 87190 116966 65381 -2686 -10549
16505a0549K4193L801L711o969p4210p1232P0295M6396k7734k1377K6687N3666
$$ -10549 13644 17445 21156 14187 -60023 -131255 -60960 -14564 -42298 -63675 -36988 16678
16493A6678m8383l4776M9394L6005Q633O310q2977J1693M0976L3253K0448L243
$$ 16678 -31705 -66481 -17087 18918 27551 33861 -49116 -37423 3553 36806 57254 60497
16481F0497o7356J0742L3800j3156m2239l3449J0581N3904o617k143o239Q933
$$ 60497 -6859 3883 37683 24527 -17712 -51161 -40580 13324 6707 4564 -1675 7258
16469G258J6050j2150k2971J5171J5297n658l2669o8064l9352l6493K4119N8861
$$ 7258 23308 11158 -11813 3358 18655 12997 -19672 -87736 -127088 -163581 -139462 -80601
16457h0601Q7911R848j9328o009J6321l1800L5437k3856q9938l599K7113k8603
$$ -80601 7310 17158 -2170 -8179 8142 -23658 11779 -12077 -102015 -105614 -78501 -107104
16445a07104j1997K8747K7779J1143N982J9291J8633k941P0878k1073r452l2915
$$ -107104 -119101 -90354 -62575 -51432 -45450 -26159 -7526 -10467 60411 39338 29886 -3029
16433c029k2209P449L6343R495N6256L5120l1132p972m3476J4816K1972M52J1227
$$ -3029 -25238 -17789 18554 28049 84305 119425 88293 80321 36845 51661 73633 74085 85312
16420H5312L0421k3977o4094L2089O6907k9609l9795m1019l3408J644q761P114
$$ 85312 115733 91756 27662 59751 126658 97049 57254 16235 -17173 -15529 -24290 -17176
16408a7176l0147R446O1829P739k5608m7006j7595N2641L5683J8765M456k5100
$$ -17176 -47323 -37877 23952 31691 6083 -40923 -58518 -5877 29806 48571 53027 27927
16396B7927o4089m5366K2480O1924J3167m1328k4855O2329J7781k1953k1496J2836
$$ 27927 -36162 -81528 -59048 2876 16043 -25285 -50140 12189 29970 8017 -13479 -643
16384f43M6669K0408l4429m7349K1843J2474n41J7653M8586n0588l1394n218K2688
$$ -643 46026 66434 32005 -15344 6499 18973 18432 36085 84671 34083 2689 -2529 20159
16371B0159L9539k9314l1289p940K3134J3803k8193P332m6155m973j450j1557
$$ 20159 59698 30384 -905 -8845 14289 28092 -101 7231 -38924 -43897 -45347 -56904
16359e6904K0523M145l9753J5188J0953L4215p774M0538k4098q192j84L3252j8321
$$ -56904 -36381 -32236 -71989 -56801 -45848 -11633 -19407 21131 -2967 -11159 -11343 21909 3588
16346C588J4884J5013n1110r49N831n1978k372J4k318J32K5145J0728K7510J4973
$$ 3588 18472 33485 -17625 -18574 -12743 -64721 -67093 -67079 -69397 -69265 -44120 -33392 -5882 9091
16332I091l6230k2277J736k6678R712J9089K2070J5075j3264K9056J3391r225
$$ 9091 -27139 -49416 -47680 -74358 -64646 -45557 -23487 -8412 -21676 7380 20771 11546
16320A1546n7004n808R986K4577O9343k8019J0645l7513k0560N2855L5971m5066
$$ 11546 -45458 -51266 -41280 -16703 52640 24621 35266 -2247 -22807 30048 66019 20953
16308B0953J3967N9449m3374j35091J692P7222M6150r557k791L169k1869j2170
$$ 20953 34920 94369 50995 -84096 -82404 -5182 40968 31411 28620 31789 9920 -2250
16296b250K2604j3926p3480k0810M0371r144m8544J440j4458M2953M4108J7396
$$ -2250 20354 6428 -67052 -87862 -47491 -56635 -105179 -103739 -118197 -75244 -31136 -13740
16284a3740K7320K7295k5735o1278j9200o272j3564R2300j8696R500L9488m019
$$ -13740 13580 40875 15140 -46138 -65338 -71610 -85174 7126 -11570 -2070 37418 33399
16272C3399j2355P4848J8076o4507k2159n098K834p395l096k3247j2654m3941
$$ 33399 21044 95892 113968 49461 27302 22204 25038 17643 14547 -8700 -21354 -65295
16260f5295m5280N985L5795J2908N9246N5040p782r629r496q913o2312o004k456
$$ -65295 -110575 -104590 -68795 -55887 3359 58399 50617 40988 31492 22579 -39733 -45737 -48193
16247d8193l0867J4485m3531J6891N7721P760N1174K4411k6264j1853j0886K373
$$ -48193 -79060 -64575 -108106 -91215 -33494 -25734 25440 49851 23587 11734 848 3221
16235C221n09o1906m3851M2715j423P231M8606m4081L0864K4512j3607K0243l011
$$ 3221 2712 -59194 -103045 -60330 -61753 -54522 -5916 -49997 -19133 5379 -8228 12015 9004
16222I004k4019Q666l5466k6244P607Q122O9674O6823o617M1554L8664N83n3099
$$ 9004 -15015 -6349 -41815 -68059 -60452 -52330 17344 84167 77550 119104 157768 158351 105252
16209A05252p0189m9442l0639m394K3641O501j7471J4921R0696o668J6600r5769
$$ 105252 35063 -14379 -45018 -49412 -25771 -19270 -36741 -21820 68876 62208 78808 -16961
16197a6961n3835k1377l9107N3975o562j7037K8986L4224J718M0150K6739j7386
$$ -16961 -70796 -92173 -131280 -77305 -83867 -100904 -71918 -37694 -35976 4174 30913 13527
16185A3527j4825p877J0872q696l229l9920n196L4139L6300k0022j6179l6914
$$ 13527 -1298 -9175 1697 -6999 -10228 -50148 -55344 -21205 15095 -4927 -21106 -58020
16173e8020J1730M5217j9293l2129M0915n0526m8533P911M2930L4129O95j8534
$$ -58020 -46290 -1073 -20366 -52495 -11580 -62106 -110639 -102728 -59798 -25669 -24974 -43508
16161d3508K3831j1181o3911m9111L5594R967K9213M6498K7384j9871P472M2027
$$ -43508 -19677 -30858 -94769 -143880 -108286 -98319 -69106 -22608 4776 -15095 -7623 34404
16149C4404j2906K921l3324l3307R903L5513l089L0972l8861j7626k195J2113
$$ 34404 21498 24419 -8905 -42212 -32309 3204 115 31087 -7774 -25400 -27595 -15482
16137a5482K671J3928k3414j2935k0721J8657J6948m896L5376J6902K787k1587
$$ -15482 -12811 1117 -22297 -35232 -55953 -37296 -20348 -25244 10132 27034 29821 8234
16125H234k3530N9878N642k4692K0905m3601k895k7880k9223P4L0504Q904K1457
$$ 8234 -15296 44582 50224 25532 46437 2836 -59 -27939 -57162 -57088 -26584 -17680 3777
16112C777J3992K206Q219J5991Q804k0421n7632n8018N8377N9202q940L9480M525
$$ 3777 17769 19975 28194 44185 52989 32568 -25064 -83082 -24705 34497 25557 65037 69562
16099F9562R732Q422j7773r0623L516L8565P4217m0091p8124J449K5736J4638
$$ 69562 79294 87716 69943 -20680 -17164 21401 95618 55527 -22597 -21148 4588 19226
16087A9226M008m0548p671o1827k9551P9420J2459k5826l4503P842K7441Q4703
$$ 19226 23234 -17314 -24985 -86812 -116363 -36943 -24484 -50310 -84813 -76971 -49530 35173
16075C5173K6922n5306k6480j7273N0428O239j0775k4355j7885L8363k2952p5430
$$ 35173 62095 6789 -19691 -36964 13464 19703 8928 -15427 -33312 5051 -17901 -93331
16063i3331k891K5187M9126P7449K1283l2599k2039K5314M9535K721l5748M5j3575
$$ -93331 -96222 -71035 -21909 55540 76823 44224 22185 47499 97034 99755 64007 64052 50477
16050E0477n1100N957J969l4170J6063j3986m0788k7519k520K6358M4985K5963
$$ 50477 -623 5334 7303 -26867 -10804 -24790 -65578 -93097 -95617 -69259 -24274 1689
16038A689O180L820q7558M4741N7084K500k3125o6192K8797Q7589N3720p9159
$$ 1689 7869 11689 -75869 -31128 25956 28456 5331 -60861 -32064 55525 109245 30086
16026C0086l1785J591R473m4054L43k3585k2080J1415j7366L9748N3861m1812
$$ 30086 -1699 -108 9365 -34689 -34346 -57931 -80011 -68596 -85962 -46214 7647 -34165
16014c4165l0303M5300l5688r90J6244L5810j645M4991k8876o0839j004K293p430
$$ -34165 -64468 -19168 -54856 -55846 -39602 -3792 -5437 39554 10678 -50161 -51165 -48872 -56302
16001e6302k6933K8635K9983K818M1085k2741n9282J4938K1980k501j764r653
$$ -56302 -83235 -54600 -24617 -21799 19286 -3455 -62737 -47799 -25819 -28320 -30084 -39737
15989c9737n2147K0000K8812j7257L3795K576m4769o257K6356l324K1472N8513
$$ -39737 -91884 -71884 -43072 -60329 -26534 -23958 -68727 -74984 -48628 -51952 -30480 28033
15977B8033k267k6759R4219L3987l7190j24459l2668k5087j3786J2357K7710r624
$$ 28033 25766 -993 93226 127213 90023 -34436 -67104 -92191 -105977 -93620 -65910 -75534
15965g5534K707K6092J1669L1572n9202O279M0388j4356J4676M2119M3951K7702
$$ -75534 -72827 -46735 -35066 -3494 -62696 -56417 -16029 -30385 -15709 26410 70361 98063
15953I8063M2196o2856n3078l1371k2794j2745J112Q3044K1581l9512r795P309
$$ 98063 140259 77403 24325 -7046 -29840 -42585 -41473 41571 63152 23640 13845 21154
15941B1154L4840L4303n3217J8260q094k2974j9560p1146K6504K8994k880J8518
$$ 21154 55994 90297 37080 55340 47246 24272 4712 -66434 -39930 -10936 -13816 4702
15929D702k4034J487J9962K9058p515j8397p1858Q153K6665P1258l0688l6584
$$ 4702 -19332 -17845 2117 31175 23660 5263 -66595 -58442 -31777 39481 8793 -27791
15917b7791K323K6103p880j6732K5869K1631k7958N072q659K4321n5525o2722
$$ -27791 -25468 635 -7245 -23977 1892 23523 -4435 637 -8022 16299 -39226 -101948
15905a01948J6974K8726N596O5913J7881j5607j2184N102M7552L5927l4356l0120
$$ -101948 -84974 -56248 -50652 15261 33142 17535 5351 10453 58005 93932 59576 29456
15893B9456K9080p583N9645j2040l9739n8536m7898l1420n6737K5052J7884O6078
$$ 29456 58536 50953 110598 98558 58819 283 -47615 -79035 -135772 -110720 -92836 -26758
15881b6758J44186N1817m2058o8680k2877J1920J1139k9755J4024o8393n6614
$$ -26758 117428 169245 127187 58507 35630 47550 58689 28934 42958 -25435 -82049
15870h2049L664K7726N03j453K2465l5919J3028o083R762M6345j6156R217j1652
$$ -82049 -78385 -50659 -50156 -51609 -29144 -65063 -52035 -58118 -48356 -2011 -18167 -8950 -20602
15857b0602n7431n1347M1127N4774j8844j6683p9k1153n750L2345L7920k6339
$$ -20602 -78033 -129380 -88253 -33479 -52323 -69006 -69085 -90238 -95988 -63643 -25723 -52062
15845e2062K4559M0349J7041K819p041J1824q515K9159m9996k8874J2644k9835
$$ -52062 -27503 12846 29887 32706 25665 37489 28974 58133 8137 -20737 -8093 -37928
15833c7928J2661Q957n489N31K0096l0662m8382M6816J06016K2273q0488j3900
$$ -37928 -25267 -16310 -21799 -21268 -1172 -31834 -80216 -33400 72616 94889 14401 501
15821E01L0186J8026j2809l6338k2738l5784L4687N9045l195l8569j7367n4526
$$ 501 30687 48713 35904 -434 -23172 -58956 -24269 34776 31581 -6988 -24355 -78881
15809g8881K9483J02983K3753l9143m1587k3762j2627p463M4027J8994n868l4037
$$ -78881 -49398 53585 77338 38195 -3392 -27154 -39781 -47244 -3217 15777 9909 -24128
15797b4128L7153N1482j4257p2196k4585j1696n318J9974M9820L0820L4374j00499
$$ -24128 13025 64507 50250 -21946 -46531 -58227 -63545 -43571 6249 37069 71443 -29056
15785b9056K673J8148L7893Q649l6320j6265n8887J0308j5861R955o219M8778
$$ -29056 -26383 -8235 29658 38307 1987 -14278 -73165 -62857 -78718 -68763 -74982 -26204
15773b6204P0620J2039r0340q2449N942P5760J6619l5268J6045K3278n6466Q273
$$ -26204 44416 56455 -33885 -116334 -110392 -34632 -18013 -53281 -37236 -13958 -70424 -62151
15761f2151P2081O3257m4486k0566n065m3066j7890L2388R359k5538M1465k1862
$$ -62151 9930 73187 28701 8135 3070 -39996 -57886 -25498 -16139 -41677 -212 -22074
15749b2074K2667N0357M6339n3614L3009K8293k9763l0645m8286M90O1871L7802
$$ -22074 593 50950 97289 43675 76684 104977 75214 44569 -3717 -3227 58644 96446
15737I6446j4966q2106l651j5899k9467L1263k9034J557L5497L3353m8855j7687
$$ 96446 81480 -626 -4277 -20176 -49643 -18380 -47414 -45857 -10360 22993 -25862 -43549
15725d3549m6398K0636M3906L7850K3181n9146l1239M5126J21520J0113m6183
$$ -43549 -89947 -69311 -25405 12445 35626 -23520 -54759 -9633 111887 122000 75817
15714G5817K0050k8728j7859K9863m416K797M5246j0895p7204k8081M013o456
$$ 75817 95867 67139 49280 79143 74727 77524 122770 111875 34671 6590 10603 4147
15702D147j7297n4529l2249L9190O356j8933m6551m5547j5233J27227M8477j5007
$$ 4147 -13150 -67679 -99928 -60738 -54382 -73315 -119866 -165413 -180646 -53419 -4942 -19949
15690a9949L2383K4607k0774l7420k5931L5182j0963M1265j087k4341L679l5358
$$ -19949 12434 37041 16267 -21153 -47084 -11902 -22865 18400 17313 -7028 -3349 -38707
15678c8707o0056O5646N6450K1755m0225k5875J24k9005j0583K8859N3630q3842
$$ -38707 -98763 -33117 23333 45088 4863 -21012 -20888 -49893 -60476 -31617 22013 -61829
15666f1829j7195N0492l8223k6333O4812M0481L0969K3684k5033J2887o7958p515
$$ -61829 -79024 -28532 -66755 -93088 -28276 12205 43174 66858 41825 54712 -13246 -20761
15654b0761m3366k0808L4897P9689l7909K249K6315k1094j1555K1790q0737o1245
$$ -20761 -64127 -84935 -50038 29651 -8258 -6009 20306 -788 -12343 9447 -71290 -132535
15642a32535N9263O1613J4464k9966o081j8638l0004j4015o586O0424P3010O958
$$ -132535 -73272 -11659 2805 -27161 -33242 -51880 -81884 -95899 -102485 -42061 30949 37907
15630C7907k3281l7489j0622j7004l4727M4339N6032J5066k428l8496n0584M1815
$$ 37907 14626 -22863 -33485 -50489 -85216 -40877 15155 30221 27793 -10703 -61287 -19472
15618a9472L5070k5757Q840M800K175m694j1802J0009P702j5671n1694j1329l0004
$$ -19472 15598 -10159 -1319 3481 5656 962 -10840 -831 6871 -8800 -60494 -71823 -101827
15605a01827m3823L230j0083J7051J7736n184o748N169N2408N8696N1220k7798
$$ -101827 -145650 -142420 -152503 -135452 -117716 -122900 -129648 -124479 -72071 -13375 37845 10047
15593A0047k4354j4864l2201j1778R956O0873N7016p953k3476n0948J3677J2971
$$ 10047 -14307 -29171 -61372 -73150 -63194 -2321 54695 46742 23266 -27682 -14005 -1034
15581a034l7559k3312P0273K1015J975Q314m7412m9639J9668L1609j5462j6058
$$ -1034 -38593 -61905 8368 29383 31358 39672 -7740 -57379 -37711 -6102 -21564 -37622
15569c7622M8400P378q8304k1885l1241L2674N5035j7912K335Q4105J6597r0148
$$ -37622 10778 18156 -70148 -92033 -123274 -90600 -35565 -53477 -51142 32963 49560 -40588
15557d0588l6284N3519L7820K9930j434o2380j8220k2103j5093M0974L5370k5127
$$ -40588 -76872 -23353 14467 44397 42963 -19417 -37637 -59740 -74833 -33859 1511 -23616
15545b3616l10n169j2187o225j9111j022l8905K519J541L4163m8680k9690N1829
$$ -23616 -23926 -29095 -41282 -47507 -66618 -67640 -106545 -104026 -102485 -68322 -117002 -146692 -94863
15532i4863N5931K2667R7718L7747j17910n1512m7274K8780O4535j4535n1649
$$ -94863 -38932 -16265 81453 119200 1290 -50222 -97496 -68716 -4181 -18716 -70365
15521g0365K2557Q7186O9790j6565n0741j0775J8067r040m6802j0778K3552R185
$$ -70365 -47808 39378 109168 92603 41862 31087 49154 40114 -6688 -17466 6086 15271
15509A5271j9083k2471K229n2734l7555P115K1212K9775M7811K8539K760l0255
$$ 15271 -3812 -26283 -24054 -76788 -114343 -107228 -86016 -56241 -8430 20109 22869 -7386
15497g386J901M8718j6553o0995k0272M4391m2688K6116M1420L0265q2234o433
$$ -7386 -5485 43233 26680 -34315 -54587 -10196 -52884 -26768 14652 44917 -37317 -43750
15485d3750L3909K2911J2107J5721k6089n8549k4083j799K3302P6841L5942K7113
$$ -43750 -9841 13070 25177 40898 14809 -43740 -67823 -69622 -46320 30521 66463 93576
15473I3576p789j6159m1065J3295j4499J6371l2043l386j2153n7808l2461K8598
$$ 93576 85787 69628 28563 41858 27359 43730 11687 8301 -3852 -61660 -94121 -65523
15461f5523K7827L0066L5196j435l7403j7239k459j3199n989L528J3447L2776
$$ -65523 -37696 -7630 27566 26131 -11272 -28511 -30970 -44169 -50158 -46630 -33183 -407
15449d07J4613j5071j5142o3827m2987N048N161J3501k177O4175j0422k1755K4864
$$ -407 14206 -865 -16007 -79834 -122821 -117773 -112612 -99111 -101288 -37113 -47535 -69290 -44426
15436d4426J8267l3085p982K9638Q622J8581l4045N6745L8000k6467k4617K7422
$$ -44426 -26159 -59244 -67226 -37588 -28966 -10385 -44430 12315 50315 23848 -769 26653
15424B6653K624r541m8663R727l4265N551j6930j070J1121L6031L4153R740q736
$$ 26653 29277 19736 -28927 -19200 -53465 -47914 -64844 -65914 -54793 -18762 15391 25131 16395
15411A6395q66l0219R04K4336J8015j6188j748n69n952j1287k1473j4909m123
$$ 16395 15529 -14690 -13786 10550 28565 12377 10629 10060 4108 -7179 -28652 -43561 -47684
15398d7684k6588j3668k5053l420L1937P8510k0499N333l4286o5177K8501N4943
$$ -47684 -74272 -87940 -112993 -116413 -84476 -5966 -26465 -21132 -55418 -120595 -92094 -37151
15386c7151M0139K0081k6454k0500J4382M9618n8901j7386O7102j1793o8388l6462
$$ -37151 2988 23069 -3385 -23885 -9503 40115 -18786 -36172 30930 19137 -49251 -85713
15374h5713P1151M2841k3978l6418k7488n0750K5595M928M8240K4932O277J8697
$$ -85713 -14562 28279 4301 -32117 -59605 -110355 -84760 -79832 -31592 -6660 -383 18314
15362A8314j3019j375J1902j2420q85K3533O503k6159k5059k9320M9299K3604
$$ 18314 5295 3920 15822 3402 2517 26050 32553 6394 -18665 -47985 1314 24918
15350B4918l3328N0466O522J2336p704l8856k8064J4984l8570j4600J5641P6400
$$ 24918 -8410 42056 48578 60914 53210 14354 -13710 1274 -37296 -51896 -36255 40145
15338D0145k0590j1679l7460p7732j2894Q04L033Q213J6311J5479l4205J4392
$$ 40145 19555 7876 -29584 -107316 -120210 -119406 -116373 -108160 -91849 -76370 -110575 -96183
15326i6183O7929N8704j9595l2978k8262P161p917k5701L0927R116N1415J3683
$$ -96183 -28254 30450 10855 -22123 -50385 -43224 -51141 -76842 -45915 -36799 14616 28299
15314B8299L1540j6663p6409l7316J7461K4825L1401L0530L455m7769j4023k0949
$$ 28299 59839 43176 -33233 -70549 -53088 -28263 3138 33668 37123 -10646 -24669 -45618
15302d5618K1888J0886J480l3152L710O6242K7502K7362L6621m1423k5490j9622
$$ -45618 -23730 -12844 -11364 -44516 -40806 25436 52938 80300 116921 75498 50008 30386
15290C0386J8957j7903l3323N561K1813j6585K3376j0555k7511l0882J2096Q432
$$ 30386 49343 31440 -1883 3678 25491 8906 32282 21727 -5784 -36666 -24570 -16138
15278a6138K9167k6924q5929K1871K9441n1398n678J00146O6421l5253n0742J1146
$$ -16138 13029 -13895 -99824 -77953 -48512 -99910 -105588 -5442 60979 25726 -25016 -13870
15266a3870m0370j0810k1949P4697J2858l8050m7708L0102l531p560J0327r789
$$ -13870 -54240 -65050 -86999 -12302 556 -37494 -85202 -55100 -58631 -66191 -55864 -65653
15254f5653L8537J5900j1674k0911l8315k0828R989L0402M9000j0007n7360P495
$$ -65653 -27116 -11216 -22890 -43801 -82116 -102944 -92955 -62553 -13553 -23560 -80920 -73425
15242g3425j8024n4743N4873P6320J3376j2931j7136j5267l4912K2835M0578J9077
$$ -73425 -91449 -146192 -91319 -14999 -1623 -14554 -31690 -46957 -81869 -59034 -18456 621
15230F21k2464m7264l9538r015j3575L3398L5467L5829L5177l847j5801r173K91
$$ 621 -21843 -69107 -108645 -117660 -131235 -97837 -62370 -26541 8636 4789 -11012 -20185 -19894
15217a9894K683K8024m6939l8790l254q353J8849J3892l289j5325l1287l2677
$$ -19894 -17211 10813 -36126 -74916 -78170 -86523 -67674 -53782 -57071 -72396 -103683 -136360
15205a36360N7700N7413m9896l1708j0924j2454L1207K9419M0149q19l3763k0155
$$ -136360 -78660 -21247 -71143 -102851 -113775 -126229 -95022 -65603 -25454 -26273 -60036 -80191
15193h0191m073J6694K8337l566K9375J3396l5380j431k0506j5632L7711M3514
$$ -80191 -84264 -67570 -39233 -42799 -13424 -28 -35408 -36839 -57345 -72977 -35266 8248
15181H248j7759j6889M4320k5425J4929k2568m3675l6583J1568J9164K8202j5113
$$ 8248 -9511 -26400 17920 -7505 7424 -15144 -58819 -95402 -83834 -64670 -36468 -51581
15169e1581K180j0750J0879o062N5020k9315p236M7529K4864J198l7879J0823
$$ -51581 -49401 -60151 -49272 -55334 -314 -29629 -36865 10664 35528 36726 -1153 9670
15157I670Q9293m2535p1370k2868k8908r75N846K2644M917k0143M3171j6835J9361
$$ 9670 98963 56428 -14942 -37810 -66718 -67693 -61847 -39203 -34286 -54429 -11258 -28093 -8732
15144h732L1192Q766k961j4385k4098O25Q518L4907K940m0954K4350N8625R061
$$ -8732 22460 31226 28265 13880 -10218 -9593 -1075 33832 36772 -4182 20168 78793 87854
15131H7854j07814p547Q643o1647j9252N2539k5641L9510M0561n7286m0616O258
$$ 87854 -19960 -27507 -18864 -80511 -99763 -47224 -72865 -33355 7206 -50080 -90696 -84438
15119h4438P1130m3479m334M2722j6819R5608M0693J4155k371n5540J5329k3801
$$ -84438 -13308 -56787 -61121 -18399 -35218 60390 101083 115238 112867 57327 72656 48855
15107D8855J084j6038p510M8759Q3411N7277p4185p0635p7660m2879k6526K6167
$$ 48855 49939 33901 26391 75150 158561 215838 141653 71018 -6642 -49521 -76047 -49880
15095d9880M3880L5770k8067J1544L8853P518j517k3025k6734j2626q36J1758
$$ -49880 -6000 29770 1703 13247 52100 59618 58101 35076 8342 -4284 -5120 6638
15083F638J5479k6058o5576o3283K250k5867j0027M297K4526K608M4186O1920
$$ 6638 22117 -3941 -69517 -132800 -130550 -156417 -166444 -162147 -137621 -135013 -90827 -28907
15071b8907L8948p0335m7373J7692K4830J9038L3915L8915O099m9303j8129K8876
$$ -28907 10041 -60294 -107667 -89975 -65145 -46107 -12192 26723 32822 -16481 -34610 -5734
15059e734Q1330K1124l6940m1481n0537p3738J207O8490L8204P457k5971j933
$$ -5734 75596 96720 59780 18299 -32238 -105976 -104769 -36279 1925 9382 -16589 -18522
15047a8522J1249N3401m7059j6851j7614J3687M6996K8623k9379o6929l9289J2767
$$ -18522 -7273 46128 -931 -17782 -35396 -21709 25287 53910 24531 -42398 -81687 -68920
15035f8920L5568k2683k4441R69k888J5404N34L0611l6786J1633M6207R239l7748
$$ -68920 -33352 -56035 -80476 -79507 -82395 -66991 -66457 -35846 -72632 -60999 -14792 -5553 -43301
15022d3301m8327l6087k604L0057J2896N4529M6253O0130J2841n081l8644k0870
$$ -43301 -91628 -127715 -130319 -100262 -87366 -32837 13416 73546 86387 81306 42662 21792
15010B1792k5504l4017k9775K0285m0875L8009j1758M517k685k2250j8589k3374
$$ 21792 -3712 -37729 -67504 -47219 -88094 -50085 -61843 -57326 -60011 -82261 -100850 -124224
14998a24224n691O285J1880N6109O9874L0309n5047m335P8272K5128L0639M8924
$$ -124224 -129915 -123630 -111750 -55641 14233 44542 -10505 -14840 63432 88560 119199 168123
14986A68123K5101m1496p6481o4009k8007O347J8096J4615J0197o3803n5567K9464
$$ 168123 193224 151728 75247 11238 -16769 -10422 7674 22289 32486 -31317 -86884 -57420
14974e7420N2768l5682o7367L923K8981J0422M3218K7515K6475J427m6136o4473
$$ -57420 -4652 -40334 -107701 -103778 -74797 -64375 -21157 6358 32833 34260 -11876 -76349
14962g6349L1750j0907r9152K6449J9539J3281M2848L7114j2570l9833P649l628
$$ -76349 -44599 -55506 -154658 -128209 -108670 -95389 -52541 -15427 -27997 -67830 -60181 -63809
14950f3809l1353O2505J0116r404l2705R160K9475l669K1776N2812L4122r540
$$ -63809 -95162 -32657 -22541 -31945 -64650 -55490 -26015 -29684 -7908 44904 79026 69486
14938F9486j7067l5236J4803L7251j2559P391p2482l2719n1240N3119J815L4364
$$ 69486 52419 17183 31986 69237 56678 64069 -8413 -41132 -92372 -39253 -37438 -3074
14926c074Q421n850J3906q087l8844j4922j6235j8923L8360L7249m7787n1447
$$ -3074 5347 -503 13403 5316 -33528 -48450 -64685 -83608 -45248 -7999 -55786 -107233
14914a07233L9221L7190j9732l7644K0977J7683k7052l3546M034P0073P1406N7899
$$ -107233 -68012 -30822 -50554 -88198 -67221 -49538 -76590 -110136 -106102 -36029 35377 93276
14902I3276j7697l5164k0160k0537m3120l2100K4927O0772j2720J6685M3495J711
$$ 93276 75579 40415 20255 -282 -43402 -75502 -50575 10197 -2523 14162 57657 59368
14890E9368p822m8216L151J1730j974j3184l9600j1033P1482J4111Q890n3006
$$ 59368 51546 3330 6481 18211 16237 3053 -36547 -47580 23902 38013 46903 -6103
14878f103M4815m2248m2789J8213K6287M622k9504K3909j4483l0431L56J4545
$$ -6103 38712 -3536 -46325 -28112 -1825 2797 -26707 -2798 -17281 -47712 -47356 -32811
14866c2811N1610K6925m8029m5593J07J1026K5474r821k0148L5035K1374o625
$$ -32811 18799 45724 -2305 -47898 -47791 -36765 -11291 -21112 -41260 -6225 15149 8524
14854H524o3798L3433L7673Q285r332L8688p1228r4775N7543K0658K6508n172
$$ 8524 -55274 -21841 15832 24117 14785 53473 -17755 -112530 -54987 -34329 -7821 -12993
14842a2993K0621k2954k9431k8218j1371N647P2812L4423L2937J2071l0096l3548
$$ -12993 7628 -15326 -44757 -72975 -84346 -78699 -5887 28536 61473 73544 43448 9900
14830I900q9261L7085P2539M9022j9908k9982L608k6473L5270j8114k1841K765
$$ 9900 -79361 -42276 30263 79285 59377 29395 33003 6530 41800 23686 1845 4610
14818D610o0591J6562K9062K9535J8689k1920j2508j9988j7408m17O575K6824
$$ 4610 -55981 -39419 -10357 19178 37867 15947 3439 -16549 -33957 -34374 -27799 -975
14806i75m1531j5700L6441m1503k4982n7908N334M5477O1383L114k8103P3597
$$ -975 -42506 -58206 -21765 -63268 -88250 -146158 -140824 -95347 -33964 -30850 -58953 14644
14794A4644j8390l588M4710r851q7301j3636r198P969j4693n581N2887J6567O8043
$$ 14644 -3746 -7334 37376 27525 -59776 -73412 -82610 -74641 -89334 -94915 -42028 -25461 42582
14781D2582K7939m7302l4639l6778k6984k5330K7357K8921O095k5243j0304J6829
$$ 42582 70521 23219 -11420 -48198 -75182 -100512 -73155 -44234 -38139 -63382 -73686 -56857
14769e6857K4799j3153J0687L801N6160K0638J7109n6371n5335L3835K8185L4927
$$ -56857 -32058 -45211 -34524 -30723 25437 46075 63184 6813 -48522 -14687 13498 48425
14757D8425K3197r3587m4225J9880L1243J4935L6155j789K1309J7596j4503o4930
$$ 48425 71622 -21965 -66190 -46310 -15067 -132 36023 34234 55543 73139 58636 -6294
14745f294k6049m5844l619M8394M5841k5582J7434N302j4488j6667n0760k9574
$$ -6294 -32343 -78187 -81806 -33412 12429 -13153 4281 9583 -4905 -21572 -72332 -101906
14733a01906M6766J5808K0559Q260K492j4510l8041k2443M8930K5524J5642M7222
$$ -101906 -55140 -39332 -18773 -10513 -8021 -22531 -60572 -83015 -34085 -8561 7081 54303
14721E4303J7426o2170m4591j7386J6290j8422l5387J0633L3202K7014l3994j3516
$$ 54303 71729 9559 -35032 -52418 -36128 -54550 -89937 -79304 -46102 -19088 -53082 -66598
14709f6598M0110K7176K3216k305J8718m0043Q509k7234K1806L6491k7998m1379
$$ -66598 -26488 688 23904 21599 40317 274 8783 -18451 3355 39846 11848 -29531
14697b9531J6188M984L3817j8552p3610k7346O0882L6788l0252M201R3281P90
$$ -29531 -13343 -8359 25458 6906 -66704 -94050 -33168 3620 -26632 -22431 70850 71640
14685G1640k7486J6395n4487k8359m0094M7722O0360J8659j5983j2038j0985p561
$$ 71640 44154 60549 6062 -22297 -62391 -14669 45691 64350 48367 36329 25344 17783
14673A7783k564K2271k6174k838k5603k1136L3376l6149l0818O4715O942l2910
$$ 17783 15219 37490 11316 8478 -17125 -38261 -4885 -41034 -71852 -7137 -195 -33105
14661c3105k5475m0012n8660N5135P4669l1106K1410Q413L846m0690M0004o856
$$ -33105 -58580 -98592 -157252 -102117 -27448 -58554 -37144 -28731 -24885 -65575 -25571 -32427
14649c2427j4508k343J865k0567p039M8957O9024Q345n571L426Q329n942L1355
$$ -32427 -46935 -49278 -47413 -67980 -75019 -26062 42962 51307 45736 49162 57491 51549 82904
14636H2904K4660j7738j9982n9417l9938j350K0143k4952p3066m556R485M5842
$$ 82904 107564 89826 69844 10427 -29511 -30861 -10718 -35670 -108736 -113292 -103807 -57965
14624e7965k8490k8542J0648L4366k6359P693J8800O9232N0119q426n945m9867
$$ -57965 -86455 -114997 -104349 -69983 -96342 -88649 -69849 -617 49502 41076 35131 -14736
14612a4736j9733J889M7760j6279j8516r793Q186l61P0515p044k7953L2047j9077
$$ -14736 -34469 -32580 15180 -1099 -19615 -29408 -21222 -21583 48932 41888 13935 45982 26905
14599B6905j4140l897k2702N305O3908l1390p6208n0808M903l1859k4128K0697
$$ 26905 12765 8868 -13834 -8529 55379 23989 -52219 -103027 -98124 -129983 -154111 -133414
14587a33414L7487M2734L1239M8553M2242k8285m5341K0092K3772p25J4202l9154
$$ -133414 -95927 -53193 -21954 26599 68841 40556 -4785 15307 39079 38354 52556 13402
14575A3402l5065J4947j2157o4244m8915J3806j8646L6512O409N3742r504l0525
$$ 13402 -21663 -6716 -18873 -83117 -132032 -118226 -136872 -100360 -93951 -40209 -49713 -80238
14563h0238M0685K151m8669J9165L5231j5970K2844L7220J6519n3705l4720m4784
$$ -80238 -39553 -37402 -86071 -66906 -31675 -47645 -24801 12419 28938 -24767 -59487 -104271
14551a04271K5497R082K3630N1001k9403k1361K4171K164J2866P802L428n7901
$$ -104271 -78774 -69692 -46062 4939 -24464 -45825 -21654 -19490 -6624 1178 4606 -53295
14539e3295j9726J5431L0075j5879m4514K8301O2226K8047K5571m6719J5177L7405
$$ -53295 -73021 -57590 -27515 -43394 -87908 -59607 2619 30666 56237 9518 24695 62100
14527F2100l7615p1990k8641n1923K765O2630J8592N975L7969o72L9198N3306
$$ 62100 24485 -47505 -76146 -128069 -125304 -62674 -44082 -38107 -138 -810 38388 91694
14515I1694p130r3413j04370m248L4171L6680J4710m9052k70P2977J9460k8865
$$ 91694 84564 -8849 -113219 -117467 -83296 -46616 -31906 -80958 -81228 -8251 11209 -17656
14503a7656l232l4784M0572O3622j0733r034j0018l0323l5383N476K3415m4205
$$ -17656 -20888 -55672 -15100 48522 37789 28755 18737 -11586 -46969 -41493 -18078 -62283
14491f2283j1249L7806N8540k7912M056k404p718K7645r222l5662J9929k0675
$$ -62283 -73532 -35726 22814 -5098 -1042 -3446 -11164 16481 7259 -28403 -8474 -29149
14479b9149m3552O4064O8188J5189j1007l7201j6347j376m187K2193K9914M720
$$ -29149 -72701 -8637 59551 74740 63733 26532 10185 8809 4622 26815 56729 61449
14467F1449l3532m4145l0901k1878r866k441k0940j0438M1920N7942N989J1904
$$ 61449 27917 -16228 -47129 -69007 -78873 -81314 -102254 -112692 -70772 -12830 -6841 5063
14455E063k5615m1051M2869O944Q8085j9077n0502j9438J9052L0597L6258K7772
$$ 5063 -20552 -61603 -18734 -11790 76295 57218 6716 -12722 6330 36927 73185 100957
14443A00957L6588q218n5259m9602O189k6782k4502P31j0686o8857M188j9098
$$ 100957 137545 129327 74068 24466 30655 3873 -20629 -19898 -30584 -99441 -95253 -114351
14431a14351K0074L3150k676p79K4267N5618L2776k942k3559j7151j3625L562
$$ -114351 -94277 -61127 -63803 -64582 -40315 15303 48079 45137 21578 4427 -9198 -5636
14419e636J3763J4963M368j1874l6624j8597K678j6960K2329J5976l1750L2714
$$ -5636 8127 23090 27458 15584 -21040 -39637 -36959 -53919 -31590 -15614 -47364 -14650
14407a4650M0076l1152r4482k196k298l2371j3464j8153M3242J14048N3764J3606
$$ -14650 25426 -5726 -100208 -102404 -104702 -137073 -150537 -168690 -125448 -11400 42364 55970
14395E5970m3961m5313J7442J1989M689m6770Q818L947J0870k0395r545K0110
$$ 55970 12009 -33304 -15862 -3873 816 -45954 -37136 -33189 -22319 -42714 -52259 -32149
14383c2149R314q864m4155K4848M8339l8763J716J6148L4920j2552k1518R666
$$ -32149 -22835 -31699 -75854 -51006 -2667 -41430 -39714 -23566 11354 -1198 -22716 -13050
14371a3050P5830M9457q8569m5569N4744L8185L2592l2907o2769o4092M148j1970
$$ -13050 62780 112237 23668 -21901 32843 71028 103620 70713 7944 -56148 -52000 -63970
14359f3970K5108R908k4467Q7888o842n2062K1679J2583J0428l3900m8942j5795
$$ -63970 -38862 -28954 -53421 34467 27625 -24437 -2758 9825 20253 -13647 -62589 -78384
14347g8384O5692P8312M456l6144j8924J9333j4753n3213l3483J9257M0778K2750
$$ -78384 -12692 65620 70076 33932 15008 34341 19588 -33625 -67108 -47851 -7073 15677
14335A5677L7567M4836M0211M0018l8117j6624k3598J1095R319o7692k8521K4414
$$ 15677 53244 98080 138291 178309 140192 123568 99970 111065 120384 52692 24171 48585
14323D8585J7077K3156m0895l6207n0789k6456j0716o6010J8507P0634N2914M489
$$ 48585 65662 88818 47923 11716 -39073 -65529 -76245 -142255 -123748 -53114 -200 4289
14311D289j1531J6317L4174P03j2627m969J2039k870K7875k7163k6722J979M0827
$$ 4289 -7242 9075 43249 43952 31325 26356 38395 35525 63400 36237 9515 11494 52321
14298E2321k6108o111K2245r776K1807k4725p7642q601N0824m3957n3088R50J6792
$$ 52321 26213 20102 42347 32571 54378 29653 -47989 -56590 -5766 -49723 -102811 -101861 -85069
14285h5069j4883L5622N4270M5947L554k0504K6252m2214j5402q400K1551j1695
$$ -85069 -99952 -64330 -10060 35887 39441 18937 45189 2975 -12427 -20827 724 -10971
14273a0971l6189o292K1981N2748l2953l7847N5766P5771M5294n5163j08553q373
$$ -10971 -47160 -53452 -31471 21277 -11676 -49523 6243 82014 127308 72145 -36408 -44781
14261d4781N9335J9695J8111L0264n907l4453j1938J0664k9572j5474J193J31
$$ -44781 14554 34249 52360 82624 76717 42264 30326 40990 11418 -4056 -2863 -2732
14249b732l7109o9016L8836N1063l4819o426K2563J5242J7930L7527j5623n0819
$$ -2732 -39841 -108857 -70021 -18958 -53777 -60203 -37640 -22398 -4468 33059 17436 -33383
14237c3383k9350L3702L3392j4656J2418j9578K226J6661N7941J0865O662j4458
$$ -33383 -62733 -29031 4361 -10295 2123 -17455 -15229 1432 59373 70238 76900 62442
14225F2442l9877o4672n9301Q5774Q7634j452q0472m7665j3688K9300o724N0073
$$ 62442 22565 -42107 -101408 -15634 72000 70548 -9924 -57589 -71277 -41977 -48701 1372
14213A372K3571J7965q496o5457l6242k4673k187J18184N6641J9518n7239l1196
$$ 1372 24943 42908 34412 -31045 -67287 -91960 -94147 24037 80678 100196 42957 11761
14201A1761q083L7750j0868J8322j95o5643p036k463J1117n792l1311Q198K2940
$$ 11761 3678 41428 30560 48882 48687 -16956 -23992 -26455 -15338 -21130 -52441 -44243 -21303
14188b1303L9187R197n0361l4682k370j6102P8775N2277k7997K0764l267l7669
$$ -21303 17884 27081 -23280 -57962 -60332 -76434 2341 54618 26621 47385 44118 6449
14176F449j7905k6957M8005M492L1787l49K1543K5167J8639M924n0233j9020P013
$$ 6449 -11456 -38413 9592 14084 45871 45522 67065 92232 110871 115795 65562 46542 53555
14163E3555p1990r0065j7417K6390L8986J1074o873N9148m0321n426j366j0158
$$ 53555 -18435 -108500 -125917 -99527 -60541 -49467 -56340 2808 -37513 -42939 -44305 -54463
14151e4463o2149o407P024Q8045O4246K7870K9409N924l824n1373p9264j0289
$$ -54463 -116612 -123019 -115995 -27950 36296 64166 93575 99499 95675 44302 -34962 -45251
14139d5251M822L4868J7730j5910p2157Q267n3436K096K2150J3036n1465j2147
$$ -45251 -40429 -5561 12169 -3741 -75898 -67631 -121067 -118971 -96821 -83785 -135250 -147397
14127a47397J1016m8676j3552P3753J32096R2735j0638m4445k312l8282l3377
$$ -147397 -136381 -185057 -198609 -124856 7240 99975 89337 44892 42580 4298 -29079
14116b9079R417J30O232R305J4150n2503r556L5006L7103J5891Q605n297j8365
$$ -29079 -19662 -19532 -13300 -3995 10155 -42348 -51904 -16898 20205 36096 44701 39404 21039
14103B1039m0143k7909m0108K7508N5804m0977j536q577k3330m4374l5551j0041
$$ 21039 -19104 -47013 -87121 -59613 -3809 -44786 -46322 -54899 -78229 -122603 -158154 -168195
14091a68195L6868N4635J1636K584L6462J0831P394K3247j2076N4150j8904j9167
$$ -168195 -131327 -76692 -65056 -62472 -26010 -15179 -7785 15462 3386 57536 38632 19465
14079A9465K8700K4095j7611k2904j1857j8819n581l7944K7094J8373k146k8613
$$ 19465 48165 72260 54649 31745 19888 1069 -4512 -42456 -15362 3011 865 -27748
14067b7748M7623N2392l5776J0178p3534n0193l3286J6984l9189K3985O5200p8726
$$ -27748 19875 72267 36491 46669 -26865 -77058 -110344 -93360 -132549 -108564 -43364 -122090
14055a22090p97N3908O2396K3421K4077k9286q2393j5275l2655j7034M3684N621
$$ -122090 -122887 -68979 -6583 16838 40915 11629 -70764 -86039 -118694 -135728 -92044 -86423
14043h6423K1472O208L5687r521j123J1350l226j9460K6168N6193J2839n2961
$$ -86423 -64951 -58743 -23056 -32577 -33700 -22350 -25576 -45036 -18868 37325 50164 -2797
14031b797o393j7368m6536J8309J1884K6899M8497K1051k4472j7609o4690J1309
$$ -2797 -9190 -26558 -73094 -54785 -42901 -16002 32495 53546 29074 11465 -53225 -41916
14019d1916Q5491M5572J757n0503m5160k1047k712J4009r711J1120m8853K482
$$ -41916 43575 89147 90904 40401 -4759 -25806 -28518 -14509 -24220 -13100 -61953 -59471
14007e9471K7042l8366L7264Q905j7199k0358l2556r951j1005N6610O7665k9907
$$ -59471 -32429 -70795 -33531 -24626 -41825 -62183 -94739 -104690 -115695 -59085 8580 -21327
13995b1327O239M1286L2300K1425p3536j5056r848k0393r330k6788J7817O281
$$ -21327 -15088 26198 58498 79923 6387 -8669 -18517 -38910 -48240 -75028 -57211 -50930
13983e0930l6570j3316l7314l8596K4784K5386R930J0778K9152Q7502L6685l8691
$$ -50930 -87500 -100816 -138130 -176726 -151942 -126556 -116626 -105848 -76696 10806 47491 8800
13971H800n1844J9014M4028l8389j6254J855J8430M455K4787J2331m4636r4619
$$ 8800 -43044 -24030 19998 -18391 -34645 -32790 -14360 -9905 14882 27213 -17423 -112042
13959a12042K689P8576k307l1877q0248O7934N5161L236R59N0527k618n8226L2225
$$ -112042 -109353 -30777 -33084 -64961 -145209 -77275 -22114 -18878 -17919 32608 29990 -28236 3989
13946C989L1345l1249k4059K897P156m67j9684m2075K8733k7706P149J2824K2029
$$ 3989 35334 4085 -19974 -17077 -9921 -10388 -30072 -72147 -43414 -71120 -63971 -51147 -29118
13933b9118j0766L8520L0359K2373P920m3685P013m4352k2726n2363Q195L0095
$$ -29118 -39884 -1364 28995 51368 59288 15603 22616 -21736 -44462 -96825 -88630 -58535
13921e8535m4626Q7726O8092p4320p3387L275K7370j1218J5756k6118O953L7549
$$ -58535 -103161 -15435 52657 -21663 -95050 -91775 -64405 -75623 -59867 -85985 -79032 -41483
13909d1483l4619l8975Q215R4370K2201j0835m4720l5556P3574L4817o212k7089
$$ -41483 -76102 -115077 -106862 -12492 9709 -1126 -45846 -81402 -7828 26989 20777 -6312
13897f312M6546M9002j3248n2036m186J6852m6034n816j4235l8938q701K1028
$$ -6312 40234 89236 75988 23952 19766 36618 -9416 -15232 -29467 -68405 -77106 -56078
13885e6078L6098r823m8738m0049j246L1128L5476O660P515n606J6252l3455J9479
$$ -56078 -19980 -29803 -78541 -118590 -119836 -88708 -53232 -46572 -39057 -44663 -28411 -61866 -42387
13872d2387O0449J1712L5921R198J6432r93j753N4797M6896O5894K7520J08488
$$ -42387 18062 29774 65695 74893 91325 90332 88579 143376 190272 256166 283686 392174
13860C92174J22269M0973m1378o0755q6811j44565r2659p413l2262l4160k8713
$$ 392174 514443 555416 514038 453283 366472 221907 129248 121835 89573 55413 26700
13849B6700j5997J884m0671K9733M7265j022n2505k8457K0286J781j7004m2454
$$ 26700 10703 12587 -28084 1649 48914 47892 -4613 -33070 -12784 -11003 -28007 -70461
13837g0461J17116L4707m0443q2790k4580K9808l5025M9861K2033k2726J7429
$$ -70461 46655 81362 40919 -41871 -66451 -36643 -71668 -21807 226 -22500 -5071
13826e071j6067j3983l5679L5347Q080K2354k5401j3675l3085l1281k7472L5671
$$ -5071 -21138 -35121 -70800 -35453 -27373 -5019 -30420 -44095 -77180 -108461 -135933 -100262
13814a00262l1303K7638O9142K6078q399j1274N4564J5703k5032k6587j3648o7624
$$ -100262 -131565 -103927 -34785 -8707 -17106 -28380 26184 41887 16855 -9732 -23380 -91004
13802i1004j3711Q0164J9415Q228J9191J2676m793j1715o7132l3463j2719P3207
$$ -91004 -104715 -24551 -5136 3092 22283 34959 30166 18451 -48681 -82144 -94863 -21656
13790b1656N317j00l0384p106Q3789N2686j6404r502p2259n8930N9891K6794R741
$$ -21656 -16339 -16439 -46823 -53929 29860 82546 66142 56640 -15619 -74549 -14658 12136 21877
13777B1877m6208m2386k0027N6608O1775n8343r2392k9891O3250K8562O1003P081
$$ 21877 -24331 -66717 -86744 -30136 31639 -26704 -119096 -148987 -85737 -57175 3828 10909
13765A0909l5505r7709K6675M7532n14j5893J2868J1568K6326l7733n1320k1318
$$ 10909 -24596 -122305 -95630 -48098 -48612 -64505 -51637 -40069 -13743 -51476 -102796 -124114
13753a24114l9130o321Q6418L3069N9794L2051o5192n0463l5589j4851n1437M7264
$$ -124114 -163244 -169565 -83147 -50078 9716 41767 -23425 -73888 -109477 -124328 -175765 -128501
13741a28501K4422N6345L881n3686n0214j3317N3470K277M4790J3223m5133J1738
$$ -128501 -104079 -47734 -43853 -97539 -147753 -161070 -107600 -105323 -60533 -47310 -92443 -80705
13729h0705J1304R445Q5021j8139K748o152l6985k8171L3252M1732K1455j5546
$$ -80705 -69401 -59956 25065 6926 9674 3522 -33463 -61634 -28382 13350 34805 19259
13717A9259n3464L7101J07684l2627l2796j1239K1054j4603j6801K3649j6433
$$ 19259 -34205 2896 110580 77953 45157 33918 54972 40369 23568 47217 30784
13706C0784o4669j9247M3989l5513k9604L5688K4623J0427J0428j6599J6660L381
$$ 30784 -33885 -53132 -9143 -44656 -74260 -38572 -13949 -3522 6906 -9693 6967 10348
13694A0348N02l0340k9124M627k442L7498L9413k1978M244N1910p764m0817k5851
$$ 10348 10850 -19490 -48614 -43987 -46429 -8931 30482 8504 12748 64658 56894 16077 -9774
13681i774J1832J6333m6593l2308k5737m4567r254M6785K5605N0522M3700l2996
$$ -9774 2058 18391 -28202 -60510 -86247 -130814 -140068 -93283 -67678 -17156 26544 -6452
13669f452R810r375K095n493k6021j018L0435L9449M9239k9783m1952L2837J7960
$$ -6452 3358 -6017 -3922 -9415 -35436 -36454 -6019 33430 82669 52886 10934 43771 61731
13656F1731k1085l0245m3260N6082L7445n5741m6105L025M1382L4349J1790m8984
$$ 61731 40646 10401 -32859 23223 60668 4927 -41178 -38153 3229 37578 49368 384
13644C84L1978J2794j8875l4293L5408j8608p6188r921K5005L9193L3792l4974
$$ 384 32362 45156 26281 -8012 27396 8788 -67400 -77321 -52316 -13123 20669 -14305
13632a4305R063j1819j5300q10J8766K1405k6092k3053j0657J3176L9671l3366
$$ -14305 -5242 -17061 -32361 -33171 -14405 7000 -19092 -42145 -52802 -39626 45 -33321
13620c3321k7253N4634N355K0263l2597k2320j7767l6991j5927K7405R666k1149
$$ -33321 -60574 -5940 -585 19678 -12919 -35239 -53006 -89997 -105924 -78519 -68853 -90002
13608i0002N1281O1889K5078k7314k8075o433Q838m7013r7151k7039R908M4895
$$ -90002 -38721 23168 48246 20932 -7143 -13576 -4738 -51751 -148902 -175941 -166033 -121138
13596a21138M2865M5496M1388q957n182J2591O584k5154L3597k3107K9959J2491
$$ -121138 -78273 -32777 8611 -346 -5528 7063 13647 -11507 22090 -1017 28942 41433
13584D1433K8687J3381o1171j5470n6344J5256N8040o851L648J9488J4874K9925
$$ 41433 70120 83501 22330 6860 -49484 -34228 23812 16961 20609 40097 54971 84896
13572H4896o911m2099J0150J7073q450k2784j6210L6452O418j5245J8496M6124
$$ 84896 77985 35886 46036 63109 54659 31875 15665 52117 58535 43290 61786 107910
13560A07910L6234J9006o8869r0845J0801K0813J8509J885j7536q040r090n8332
$$ 107910 144144 163150 94281 3436 14237 35050 53559 55444 37908 29868 20778 -37554
13548c7554k1849M9962L7215m484k9285j0731j3981J2409n1746k5641j0262J00720
$$ -37554 -59403 -9441 27774 23290 -5995 -16726 -30707 -18298 -70044 -95685 -105947 -5227
13536e227Q3994N069j3198l4419q974J4663j7137m3010k832L9430M0505p6988
$$ -5227 78767 83836 70638 36219 27245 41908 24771 -18239 -21071 18359 58864 -18124
13524a8124l7314M3591K2533l1914j9493R5794R1873l099j18107p6449m15K6266
$$ -18124 -55438 -11847 10686 -21228 -40721 55073 146946 143847 25740 -50709 -51124 -24858
13512b4858K164k5079k3050o4766j6945L355M4448k3900L1213O6295m6947L5841
$$ -24858 -22694 -47773 -70823 -135589 -152534 -149179 -104731 -128631 -97418 -31123 -78070 -42229
$$ [...]
##END NTUPLES=NMR SPECTRUM
##END=
