##TITLE=Analysis number 323169
Compound Code spb 06960
Project Code adrs
Chemist Name fudan
##JCAMPDX= 6.0         $$ Bruker NMR JCAMP-DX V2.0
##DATA TYPE= NMR SPECTRUM
##DATA CLASS= NTUPLES
##ORIGIN= Bruker BioSpin GmbH
##OWNER= nmr
$$ XWIN-NMR		Version 3.5
$$ Tue Oct 17 19:50:17 2006 GMT Daylight Time (UT+1h)  MAYBRIDGE\nmr@NMR_250MHZ
##.OBSERVE FREQUENCY= 250.131544655141
##.OBSERVE NUCLEUS= ^1H
##.ACQUISITION MODE= SIMULTANEOUS (DQD)
##.ACQUISITION SCHEME= undefined
##.AVERAGES= 16
##.DIGITISER RES= 18
##SPECTROMETER/DATA SYSTEM= dpx250
##.PULSE SEQUENCE= zg30
##.SOLVENT NAME= DMSO
##.SHIFT REFERENCE= (INTERNAL, DMSO, 0, 16.522)
##AUDIT TRAIL= $$ (NUMBER, WHEN, WHO, WHERE, WHAT)
$$ ##TITLE= Audit trail, XWIN-NMR		Version 3.5
$$ ##JCAMPDX= 5.01
$$ ##ORIGIN= Bruker BioSpin GmbH
$$ ##OWNER= nmr
$$ C:\u/data/dgb/nmr/ADRS/820/pdata/1/auditp.txt
$$ ##AUDIT TRAIL=  $$ (NUMBER, WHEN, WHO, WHERE, WHAT)
(   1,<2006-10-17 19:49:55.36 +100>,<MAYBRIDGE\nmr>,<NMR_250MHZ>,
      <created by zg, POWCHK disabled, PULCHK disabled
       configuration hash MD5:
       49 4B E0 1D 92 C2 6B 37 9F E6 65 BC 52 41 86 1D
       data hash MD5: 64K
       C6 35 94 F2 E7 0A 77 63 92 58 25 2D F3 83 0B E4>)
(   2,<2006-10-17 19:50:07.95 +100>,<MAYBRIDGE\nmr>,<NMR_250MHZ>,
      <Start of raw data processing
       ef LB = 0.3 FT_mod = 6 PKNL = 1 SI = 32K 
       data hash MD5: 32K
       5C AB 99 52 F7 74 33 52 18 9B 89 5D 99 80 14 B7>)
(   3,<2006-10-17 19:50:09.62 +100>,<MAYBRIDGE\nmr>,<NMR_250MHZ>,
      <apk 
       data hash MD5: 32K
       B3 B9 0C A8 EE 59 59 EF D3 E3 E3 58 C4 FB CE E7>)
(   4,<2006-10-17 19:50:10.42 +100>,<MAYBRIDGE\nmr>,<NMR_250MHZ>,
      <abs ABSG = 5 
       data hash MD5: 32K
       1A BC 13 23 07 6B AD 59 E8 04 B1 09 94 D4 85 89>)
$$ ##END=
$$ 
$$ hash MD5
$$ C3 76 AD F4 AB 43 6A 23 B3 57 0B 31 18 74 FB 4C
##$RELAX= 
##$RELAX= 
##$RELAX= 
##$RELAX= 
##$RELAX= 
##$RELAX= 
##$RELAX= 
$$ Bruker specific parameters
$$ --------------------------
##$DU= <C:\u>
##$EXPNO= 820
##$NAME= <ADRS>
##$PROCNO= 1
##$TYPE= <nmr>
##$USER= <dgb>
##$AMP= (0..31)
100 100 100 100 100 100 100 100 100 100 100 100 100 100 100 100 100 100 
100 100 100 100 100 100 100 100 100 100 100 100 100 100 
##$AQSEQ= 0
##$AQ_mod= 3
##$AUNM= <au_zg>
##$AUTOPOS= <30 >
##$BF1= 250.13
##$BF2= 250.13
##$BF3= 250.13
##$BF4= 250.13
##$BF5= 500.13
##$BF6= 500.13
##$BF7= 500.13
##$BF8= 500.13
##$BYTORDA= 1
##$CFDGTYP= 0
##$CFRGTYP= 5
##$CHEMSTR= <none>
##$CNST= (0..31)
1 1 145 1 1 1 1 1 1 1 1 1 1 1 1 1 1 1 1 1 1 1 1 1 1 1 1 1 1 1 1 1 
##$CPDPRG= <>
##$CPDPRG1= <>
##$CPDPRG2= <>
##$CPDPRG3= <>
##$CPDPRG4= <mlev>
##$CPDPRG5= <mlev>
##$CPDPRG6= <mlev>
##$CPDPRG7= <mlev>
##$CPDPRG8= <mlev>
##$CPDPRGB= <>
##$CPDPRGT= <>
##$D= (0..31)
0 1 0 0 0 0 0 0 0 0.06 0 0 0 0 0 0 0.0002 0 0 0 0 0 0 0 0 0 0 0 0 0 0 
0 
##$DATE= 1161110993
##$DBL= (0..7)
120 120 120 120 120 120 120 120 
##$DBP= (0..7)
150 150 150 150 150 150 150 150 
##$DBP07= 0
##$DBPNAM0= <>
##$DBPNAM1= <>
##$DBPNAM2= <>
##$DBPNAM3= <>
$$ [...]
##$SUBNAM7= <"">
##$SUBNAM8= <"">
##$SUBNAM9= <"">
##$SW= 20.6930455092707
##$SWIBOX= (0..15)
0 0 3 0 0 0 0 0 0 0 0 0 0 0 0 0 
##$SW_h= 5175.983436853
##$TD= 65536
##$TD0= 1
##$TE= 683.16
##$TE2= 300
##$TE3= 300
##$TEG= 300
##$TL= (0..7)
0 120 120 120 120 120 120 120 
##$TP= (0..7)
150 150 150 150 150 150 150 150 
##$TP07= 0
##$TPNAME0= <>
##$TPNAME1= <>
##$TPNAME2= <>
##$TPNAME3= <>
##$TPNAME4= <>
##$TPNAME5= <>
##$TPNAME6= <>
##$TPNAME7= <>
##$TPOAL= (0..7)
0.5 0.5 0.5 0.5 0.5 0.5 0.5 0.5 
##$TPOFFS= (0..7)
0 0 0 0 0 0 0 0 
##$TUNHIN= 0
##$TUNHOUT= 0
##$TUNXOUT= 0
##$USERA1= <user>
##$USERA2= <user>
##$USERA3= <user>
##$USERA4= <user>
##$USERA5= <user>
##$V9= 5
##$VALIST= <valist>
##$VCLIST= <CCCCCCCCCCCCCCC>
##$VD= 0
##$VDLIST= <DDDDDDDDDDDDDDD>
##$VPLIST= <PPPPPPPPPPPPPPP>
##$VTLIST= <TTTTTTTTTTTTTTT>
##$WBST= 1024
##$WBSW= 4
##$XGAIN= (0..3)
0 0 0 0 
##$XL= 0
##$YL= 0
##$YMAX_a= 599852
##$YMIN_a= -463939
##$ZGOPTNS= <>
##$ZL1= 120
##$ZL2= 120
##$ZL3= 120
##$ZL4= 120
##$ABSF1= 16.522
##$ABSF2= -4.171173
##$ABSG= 5
##$ABSL= 3
##$ALPHA= 0
##$AQORDER= 0
##$ASSFAC= 0
##$ASSFACI= 0
##$ASSFACX= 0
##$ASSWID= 0
##$AUNMP= <proc_1d>
##$AZFE= 0.1
##$AZFW= 0.1
##$BCFW= 0
##$BC_mod= 0
##$BYTORDP= 0
##$COROFFS= 0
##$CY= 12.5
##$DATMOD= 1
##$DC= 0
##$DFILT= <>
##$DTYPP= 0
##$F1P= 14.0000005364418
##$F2P= -0.99999901652339
##$FCOR= 0.5
##$FTSIZE= 32768
##$FT_mod= 6
##$GAMMA= 0
##$GB= 0
##$INTBC= 1
##$INTSCL= 1
##$ISEN= 128
##$LB= 0.3
##$LEV0= 0
##$LPBIN= 0
##$MAXI= 10000
##$MC2= 0
##$MEAN= 0
##$ME_mod= 0
##$MI= 0
##$NCOEF= 0
##$NC_proc= -3
##$NLEV= 6
##$NOISF1= 0
##$NOISF2= 0
##$NSP= 0
##$NTH_PI= 0
##$NZP= 0
##$OFFSET= 16.522
##$PC= 1
##$PHC0= -58.47495
##$PHC1= 6.211143
##$PH_mod= 1
##$PKNL= yes
##$PPARMOD= 0
##$PSCAL= 4
##$PSIGN= 0
##$REVERSE= no
##$SF= 250.13
##$SI= 32768
##$SIGF1= 0
##$SIGF2= 0
##$SINO= 400
##$SIOLD= 32768
##$SREGLST= <1H.DMSO>
##$SSB= 0
##$STSI= 32768
##$STSR= 0
##$SW_p= 5175.98343685301
##$SYMM= 0
##$S_DEV= 0
##$TDeff= 65536
##$TDoff= 0
##$TI= <Analysis number 999999
Compound Code 99
Book Reference 9
Project Code 9>
##$TILT= no
##$TM1= 0
##$TM2= 0
##$TOPLEV= 0
##$USERP1= <user>
##$USERP2= <user>
##$USERP3= <user>
##$USERP4= <user>
##$USERP5= <user>
##$WDW= 1
##$XDIM= 32768
##$YMAX_p= 317105737
##$YMIN_p= -106805
$$ End of Bruker specific parameters
$$ ---------------------------------
##NTUPLES= NMR SPECTRUM
##VAR_NAME=  FREQUENCY,     SPECTRUM/REAL,   SPECTRUM/IMAG
##SYMBOL=    X,             R,               I
##VAR_TYPE=  INDEPENDENT,   DEPENDENT,       DEPENDENT
##VAR_FORM=  AFFN,          ASDF,            ASDF
##VAR_DIM=   32768,         32768,           32768
##UNITS=     HZ,            ARBITRARY UNITS, ARBITRARY UNITS
##FACTOR=    0.157963299565203, 1,           1
##FIRST=     4132.6476996994, 0,             0
##LAST=      -1043.33573715361, 0,           0
##MIN=       -1043.33573715361, -106805,     0
##MAX=       4132.6476996994, 317105737,     0
$$ Real data points
##PAGE= N=1
##DATA TABLE= (X++(R..R)), XYDATA
$$ [...]
28181A3885j7211L0499q83k8744k9446o3J258L938J0198j758l1983j5286K2290
28168d3306J5511J6510j192J7452m500k3006K2613M687r132m529N18K0845K5081
28155C7552R498J2280j7800k1489j5872n219J1221P050k989j0407Q733K8656j0617
28142C0597r788j5083J3357J8082p710j4783j1997J7204Q377l674j0959p810K274
28129H087q560j1523p009j7729Q269J2207j4937m451L4551K2509k4411j3941K1094
28116D156k87j493K777j3003j7707k5043L3304K3737J960m330k4678j5099j4322
28103e0028O671J8015K1316J0533J551n810j1284j4281J2682j3705J2646N675
28091f019J5576J3636K6539K139j4654R929L704r120k4535L675K3060k1877j9813
$$ plain form
28181 13885 -3326 27173 26290 -2454 -31900 -31963 -30705 -26767 -16569 -18327 -50310 -65596 -43306
28168 -43306 -27795 -11285 -12477 4975 475 -22531 82 4769 -4363 -8892 -8374 12471 37552
28155 37552 47050 59330 41530 20041 4169 -1050 10171 17221 14232 3825 12558 41214 30597
28142 30597 20809 5726 19083 37165 29455 14672 2675 19879 28256 24582 13623 5813 8087
28129 8087 -473 -11996 -19005 -36734 -28465 -16258 -31195 -35646 -1095 21414 -2997 -16938 4156
28116 4156 3869 2376 5153 -7850 -25557 -50600 -17296 6441 8401 4071 -20607 -35706 -50028
28103 -50028 -43357 -25342 -4026 6507 8058 2248 -9036 -23317 -10635 -24340 -11694 -6019
28091 -6019 9557 23193 49732 51871 37217 47146 50850 41730 17195 20870 43930 22053 2240
28078B240J5528r49k6656Q040k572k3786J4036J4756q575P614P564J015P182K0837
28064C6274J8529J7589N464k2040p612Q444j9993k8635m430J524J5860j451p803
28051A1720K958J5808J2545j121q083P838l279p969K697J2588M866N680r019K609
28037D9838j6139j4150K3904K894o408J8024l845j7857j603m316o946J5984k0692
28024A8688k1162J608J9494N437K1768Q564j2798M58r86j8324L326j5090j5868
28011d885R90k6224j5293J5852Q718K62r26R955O56p901M349l279m974p573L454
27996b6819j37M54l573q413J6218K0820J8614j1131k9802r78P284P157J3291J7154
27982B0139k8115r3j0006J0874J6636R370j1490l296J7517j1181j0523K7431R266
$$ plain form
28078 2240 17768 16819 -9837 -1797 -4369 -28155 -14119 637 -7938 -324 7240 8255 15437 36274
28064 36274 54803 72392 77856 55816 48204 56648 36655 8020 3590 5114 20974 19523 11720
28051 11720 14678 30486 43031 41910 33827 41665 38386 30417 33114 45702 50568 56248 47229 49838
28037 49838 33699 19549 43453 46347 39939 57963 54118 36261 34658 30342 23396 39380 18688
28024 18688 -2474 -866 18628 24065 45833 54397 41599 42057 41071 22747 26073 10983 -4885
28011 -4885 -3895 -30119 -45412 -29560 -20842 -20580 -21506 -11551 -10895 -18796 -14447 -17726 -22700 -30273 -26819
27996 -26819 -26956 -26502 -30075 -38488 -22270 -1450 17164 6033 -23769 -24747 -17463 -10306 2985 20139
27982 20139 -7976 -8069 -18075 -7201 9435 18805 7315 4019 21536 10355 -168 27263 36529
27969C6529k2321j1177j8245k900n102p707Q164J0923L2782J5091j1625q322L129
27956A9219q483N596M813q033j3534j0035O049J6576O138N741K1554k4668j0857
27943A0076l753j1020J9862O106N454m783J6701N799N285n507O38l133j832m6168
27929f275k4806K9196J0119N676L939n608k1544P22N486m69J5731K1626L344j7257
27915A9880j3667j252N637K2042J1287n183j0764j0059j8422Q269J5774N234n180
27902B3596m624O282k972j9910k5233p819L432J4885J1241J9352P291l746r918
27889A1857j2201P164r999j5469l138J3156J4933J1152K4093L133k1211l5032
27877a1562m03r254N915J4425O177j4880M709K301R92k792N037p904l4488l15
$$ plain form
27969 36529 14208 3031 -15214 -18114 -23216 -30923 -22759 -11836 20946 36037 24412 16090 19219
27956 19219 10736 16332 21145 13112 -422 -10457 -4408 12168 18306 24047 45601 20933 10076
27943 10076 6323 -4697 15165 21271 26725 21942 38643 44442 49727 44220 44858 41725 39893 -6275
27929 -6275 -31081 -1885 8234 13910 17849 12241 -9303 -8581 -3095 -3564 12167 33793 37137 19880
27915 19880 6213 4961 10598 32640 43927 38744 27980 17921 -501 7768 23542 28776 23596
27902 23596 18972 25254 22282 2372 -22861 -30680 -27248 -12363 -1122 18230 25521 21775 11857
27889 11857 -344 6820 -3179 -18648 -21786 -8630 6303 17455 41548 44681 23470 -11562
27877 -11562 -11965 -21219 -15304 -879 5298 -9582 -4873 -2572 -1580 -4372 665 -7239 -41727 -42042
27863d2042J8982Q64k355P326N063j0616j2765J3923K1184L4717K052j6523j3520
27850F290J697k8207j1082K2390K2994p261o143M350J084j7471N007n556j1954
27837b3862J0812J4997j0431K7363M901j2842J1330k2359k8919j223R039J7775
27825c419J0198K6369M109j3236q569R27K3585j8826k8614l273k016J0076K3899
27812B1210j1698k5476K051J7003Q559J2720j7622k5902l578K3734j5573q402
27800b2974J8973J881J2660q303o346R568J5924j1807Q14j2016j2055J1160j462
27787c983n143k4133P976J3008O588j3530Q624K4315j840j2594P976j1274Q50
27774c160q406J7284Q593q639k533k366J0009m773L28J0152o386j4704j397o445
$$ plain form
27863 -42042 -23060 -22196 -24551 -17225 -12162 -22778 -35543 -21620 -436 34281 36333 19810 6290
27850 6290 7987 -20220 -31302 -8912 14082 6821 678 5028 6112 -11359 -6352 -11908 -23862
27837 -23862 -13050 1947 -8484 18879 23780 10938 22268 -91 -29010 -30233 -21194 -3419
27825 -3419 6779 33148 37257 24021 15452 16379 39964 21138 -7476 -10749 -12765 -2689 21210
27812 21210 9512 -15964 -13913 3090 11649 24369 6747 -19155 -22733 1001 -14572 -22974
27800 -22974 -4001 -2120 10540 2237 -4109 5459 21383 9576 10390 -1626 -13681 -2521 -3983
27787 -3983 -9126 -33259 -25283 -12275 -5687 -19217 -10593 13722 11882 -712 7264 -4010 -3160
27774 -3160 -11566 5718 14311 5672 3139 773 10782 6009 6337 16489 10103 -4601 -5998 -12443
27760a2443L2224K5627P761J2557j6588k4091k3793r100Q728k037l643J6266J9554
27747C1022j5067j7863j0971k11q361k630l796j5437K8778L5120Q651J1717J2417
27734E3369n758j8004L615m708n014K400j6085O923k2996p735n548K6391J1844
27721A8694M16Q62j0740q905k831k8057J1963K1713r634m638n407j9810k283P182
27707c1475L3312J6317Q864k9085R25j1976O361J5871L957j036j5979k474N256
27694a162M353K8085j3111L523o001P076j239l696l083l859l786k0299j9652k052
27680c4903j7424q948J243J6040J9902r012Q316k2824j4037O312K9693K2411K199
27667a032j0643o131j609M620K5243Q189n491R89J9211k3127j8556k1R402k0566
$$ plain form
27760 -12443 19781 45408 53169 65726 49138 25047 1254 -7846 882 -1155 -4798 11468 31022
27747 31022 15955 -1908 -12879 -13090 -21451 -24081 -27877 -43314 -14536 20584 29235 40952 53369
27734 53369 47611 29607 33222 28514 23500 25900 9815 16738 -6258 -13993 -19541 6850 18694
27721 18694 19110 19972 9232 327 -2504 -30561 -18598 3115 -6519 -11157 -16564 -36374 -38657 -31475
27707 -31475 1837 18154 27018 -2067 -1142 -13118 -6757 9114 13071 12035 -3944 -6418 -1162
27694 -1162 3191 31276 18165 21688 15687 22763 21524 17828 14745 10886 7100 -13199 -32851 -34903
27680 -34903 -52327 -61275 -60032 -43992 -24090 -33102 -24786 -47610 -61647 -55335 -25642 -3231 -1032
27667 -1032 -11675 -17806 -19415 -14795 10448 18637 13146 14135 33346 10219 -8337 -8358 1044 -19522
27653a9522K7443J5452J1049j791k788O191j4238j1948j4549M831l42J5433o615
27640H606J3892q244R49J099J079K1226r217j756l6273P488J5981j3319j729m729
27626d947j2470J9007J1669j5152N512j6921J0212J8901J1113J7129j1706J7348
27614D9695J0417l383n121k6148l7268j2569P992Q587J249L1905J8369M831l3748
27601A4808j3097j3133L016j7527j3536O904J4375J2619l978j4951M856J8179
27589a465K0773K518j7892k0521k364l475R943J62j0917N721j6252o291K6557
27576a3503N071M68J3703j527p21q284K2123j3904R114K1358J0893k0888m253
27563A9650j6625j624J0478k9556j2873J0127L579K172K820q11K789J153j6281
$$ plain form
27653 -19522 7921 23373 34422 32631 29843 36034 21796 9848 -4701 130 -212 15221 8606
27640 8606 22498 14254 15203 16302 17381 38607 29390 27634 -8639 -1151 14830 1511 -218 -4947
27626 -4947 -17417 1590 13259 -1893 3619 -13302 -3090 15811 26924 44053 32347 49695
27614 49695 60112 56729 51608 25460 -11808 -24377 -16385 -7798 -6549 25356 43725 48556 14808
27601 14808 1711 -11422 -8406 -25933 -39469 -32565 -18190 -5571 -9549 -24500 -19644 -1465
27589 -1465 19308 21826 3934 -16587 -18951 -22426 -12483 -12321 -23238 -17517 -33769 -40060 -13503
27576 -13503 -8432 -7964 5739 4212 3491 -4793 17330 3426 12540 33898 44791 23903 19650
27563 19650 3025 1401 11879 -17677 -30550 -20423 -16844 -14672 -11852 -12663 -9874 -8721 -25002
27550b5002l861L385K165k785J0608K1085J3879j1274j844k6097l4680L4808K2409
27537B796L2085J5450n20l7163j6019L181K1075j4897j3096K1931j555k9570J0946
27524e356L51J9728J2635Q048k487n643Q499J5362p891j4596R907j2087l2338
27511e868J3750N463l689k5946j7383k998J6078N812J7643j6329m018J6845J672
27498A032k222m928p065j423O268L7303K8998m544k6054j6465n816L037Q594o740
27484I975Q986N826J9168k6083k8679k1210j1932j4880J6434J2767j5278M077
27472d0829J133j065J6365k5279J0766K3693K6753J3796j6160j7113K0647k866
27460I841k3189J9088N374k2583j949j3845q948J211J7077J470j0324k6317J0650
$$ plain form
27550 -25002 -28863 -25478 -23313 -26098 -15490 5595 19474 8200 6356 -19741 -54421 -19613 2796
27537 2796 34881 50331 49811 12648 -3371 -190 20885 5988 -7108 14823 13268 -16302 -5356
27524 -5356 -5005 14723 27358 35406 32919 27276 35775 51137 43246 28650 38557 26470 -5868
27511 -5868 7882 13345 9656 -16290 -33673 -36671 -20593 -14781 2862 -13467 -17485 -640 1032
27498 1032 -1190 -6118 -13183 -14606 -8338 28965 57963 53419 27365 10900 5084 8121 16715 9975
27484 9975 18961 24787 43955 17872 -10807 -32017 -43949 -58829 -42395 -29628 -44906 -40829
27472 -40829 -39696 -40761 -24396 -49675 -38909 -15216 11537 25333 9173 -7940 12707 9841
27460 9841 -13348 5740 11114 -11469 -13418 -27263 -36211 -35000 -17923 -16453 -26777 -53094 -42444
27447d2444p298J5152O985L884o53j3031r651M161K0388K4799q124j3434N74J2689
27433f003R924R301J4454q722M066j6946j0632J347j851j2922Q566Q95K0535j058
27419A0954k3546K4477K2552j3834r942j7777j4313J1868J474m26k5407n750j7637
27406e7307m921J9355M2040K5288k080j4756L274j4351k0845m874J1077o718k3299
27393d8117J2764L3354K562L37J5869K6820J5039m3320l1969j4427J469J7187
27381a2432J0959N164j2820J112k479O21o6k481K5275J083k0902K04K6134R60
27367B0332j4531k8615j5784j0333r345J1011N479j0358N036K7738J2142j7949
27355b5177j9906K0387o413O699O171J994j2025j2941O490O132K827J755P290
$$ plain form
27447 -42444 -49742 -34590 -27605 -23721 -24374 -37405 -47056 -42895 -22507 2292 -5832 -19266 -18692 -6003
27433 -6003 3921 13222 27676 18954 23020 6074 -4558 -3211 -5062 -17984 -9418 -8523 12012 10954
27419 10954 -12592 11885 34437 20603 10661 -7116 -21429 -9561 -8087 -8513 -33920 -39670 -57307
27406 -57307 -62228 -42873 -833 24455 22375 7619 10893 -3458 -24303 -29177 -18100 -24818 -48117
27393 -48117 -35353 -1999 563 900 16769 43589 58628 15308 -16661 -31088 -29619 -12432
27381 -12432 -1473 3691 -9129 -8017 -10496 -9875 -9941 -12422 12853 13936 -6966 -6762 19372 20332
27367 20332 5801 -22814 -38598 -48931 -58276 -47265 -41786 -52144 -47108 -19370 -7228 -25177
27355 -25177 -45083 -24696 -31109 -24410 -18239 -16245 -28270 -41211 -34721 -28589 -25762 -24007 -16717
27342a6717J5533J0593j1132j140N103L0720o443r884O258j4773P665k9714p380
27329b1311K9474j376j3575M846o268J6490R059n412j8889m653J0110p945K13
27316i237j582j1338J4696J0877k2330j3671M364P63J2356J3122r55K1283L4499
27303E2847L957k1705k3347k548j3898J4923p525j0827J612j5492j3108J4287
27291b0824J7155o501J93O910k078J4953M2931J6372k5375j6698J2214R656j4695
27278C4213k536k5879q120q045N991J6597o830N04L924M515Q104j4597k3440j3471
27264b9070k950j2740j5746K866J3682J8992K0082P222n112M399j4996o847M912
27251a5306k836L6705K1428J6364k9704k3567Q840j1348j2821j1643J2935J7845
$$ plain form
27342 -16717 -1184 9409 -1723 -2863 2240 32960 26517 16633 22891 8118 15783 -13931 -21311
27329 -21311 8163 6787 -6788 -1942 -8210 8280 17339 11927 -6962 -11615 -1505 -9450 -9237
27316 -9237 -10819 -22157 -7461 3416 -18914 -32585 -28221 -27458 -15102 -1980 -2935 18348 52847
27303 52847 56804 35099 11752 9204 -4694 10229 2704 -8123 -6511 -22003 -35111 -20824
27291 -20824 -3669 -10170 -9977 -3067 -5145 9808 52739 69111 43736 27038 39252 48908 34213
27278 34213 31677 5798 -2322 -10367 -4376 12221 5391 5895 9819 14334 22438 7841 -15599 -29070
27264 -29070 -32020 -44760 -60506 -57640 -43958 -24966 -4884 2338 -2774 1625 -13371 -20218 -15306
27251 -15306 -18142 18563 39991 56355 26651 3084 11924 576 -12245 -23888 -10953 6892
27239F892n219J5718r305j8860J48k1747j8666Q915M5642K2716l907p271k7835
27226a2779L678K7731K6360j2759k3282r067L524M750k4600k0120K2487J5273
27214A196L976J2373j847Q442n875l4000q171K4920J6883o268k7582J846j7118
27201c1225j4401J0461O06n048J4035M9943P720m1760j8335J2890K0351K478L783
27188A1498k0005j8122j0249J6288J6677J410k2441J9667J8164j0580j9601j5343
27176c2637j52K5576N467L318Q087k0748l985J5304j0369j475J5955K0896j2419
27163A2818k1407K2796J8557l8013j8860q971l529K496K3846L3505J2502j5998
27151A9742j5444O601L240N538L268J1117J088J304l5601j9864L3949K1533j2280
$$ plain form
27239 6892 1673 17391 8086 -10774 -10626 -32373 -51039 -42124 3518 26234 22327 15056 -12779
27226 -12779 -9101 18630 44990 32231 8949 -118 3406 8156 -16444 -36564 -14077 1196
27214 1196 5172 17545 15698 24140 18265 -15735 -23906 1014 17897 11629 -15953 -14107 -31225
27201 -31225 -45626 -35165 -34559 -39607 -25572 24371 32091 -9669 -28004 -15114 5237 7715 11498
27188 11498 -8507 -26629 -36878 -20590 -3913 -2503 -24944 -5277 12887 2307 -17294 -32637
27176 -32637 -32789 -7213 -1746 1572 9659 -11089 -15074 230 -10139 -11614 4341 25237 12818
27163 12818 -8589 14207 32764 -5249 -24109 -33080 -36609 -34113 -10267 23238 35740 19742
27151 19742 4298 10899 14139 19677 22945 34062 35150 36454 853 -19011 14938 36471 24191
27138B4191j9585k5941J6673O986j9337Q505J257P793J1281k7111j9832p201J3406
27125b8915L273J7192Q04J5706K3949K0818j5169n1242o630o790j1711O056n01
27112c3160Q089K1510J0235k375J52N357j2603k8919R61J5213K8306J4705K0371
27099D7842N218k0116k6101k3502L586l891R251J8094p85j0068N732J2865J3850
27086C1975J038k4969n510k227J5818Q23m129J2283j8383J340N465L337l6818
27073a9957j3315K686K1500o10J610J1607J6474m4409j0090J8490j2247k158L4161
27060C742j6941k4706r851k152Q109J7093j7095J8478J9720n371N885k183J3280
27047H008p408j3239j1757P541J8952K0706j1457l1282m862j100K523j3264L3587
$$ plain form
27138 24191 4606 -21335 -4662 2324 -17013 -8508 -7251 542 11823 -15288 -35120 -42321 -28915
27125 -28915 -25642 -8450 -7646 8060 32009 52827 37658 -13584 -20214 -27004 -38715 -32659 -33160
27112 -33160 -25071 -3561 6674 4299 4451 9808 -2795 -31714 -30753 -15540 12766 27471 47842
27099 47842 53060 32944 6843 -16659 -13073 -16964 -7713 10381 9596 -472 5260 18125 31975
27086 31975 33013 8044 2534 307 16125 16948 12819 25102 6719 8059 13524 16861 -19957
27073 -19957 -33272 -30586 -9086 -9696 -8086 3521 19995 -24414 -34504 -16014 -28261 -30419 3742
27060 3742 -13199 -37905 -47756 -49908 -41799 -24706 -41801 -23323 -3603 -8974 -3089 -5272 8008
27047 8008 600 -12639 -24396 -16855 2097 22803 11346 -19936 -24798 -25898 -23375 -36639 -3052
27034c052J0518O600n912j3222J7313R267j7043k8440r590J3824j0168l157K26
27021c2836J205J6751L9444L721j341l435k1808m627J8094J1036k0555j7569R323
27008b597j4963m86J1167J650J1667J3261j6761k2043K1992J6810K689K297O949
26995C1632k522Q082J4582r464k7652r080j1165L468N752R033j087k55J3444k2869
26981A899j3629R795k4299k0563o524k838K2304J5982J9362k80O551K1640k0374
26968I026k5323J4141k1761J2165L685J0773J1557M787r261Q40j4451o68q610
26955a3100J6892M4983P633l4095j853j3609R600m77J3323o190j4340N737n42
26942A3962k57m942j8363P065K9082j1354j1890j7825j9892k8701J432K0381J6764
$$ plain form
27034 -3052 7466 14066 8154 -5068 12245 21512 4469 -23971 -33561 -19737 -29905 -33062 -32836
27021 -32836 -31631 -14880 24564 28285 26944 23509 1701 -2926 15168 26204 5649 -11920 -2597
27008 -2597 -17560 -18046 -6879 -5229 6438 19699 2938 -19105 2887 19697 22386 24683 31632
26995 31632 29110 37192 51774 42310 14658 5578 -5587 -2119 3633 12666 11579 11324 24768 1899
26981 1899 -11730 -1935 -26234 -46797 -53321 -56159 -33855 -17873 1489 1209 7760 29400 9026
26968 9026 -16297 -2156 -23917 -11752 -8067 2706 14263 19050 9789 10629 -3822 -4490 -13100
26955 -13100 3792 48775 56408 22313 20460 6851 16451 15974 29297 23107 8767 14504 13962
26942 13962 13705 8763 -9600 -2535 26547 15193 3303 -14522 -34414 -63115 -61683 -41302 -24538
26929b4538J9567N177Q944M912J818j7547j8567L4774M102Q848k2343J9151R457
26916C3755q641k2321k138j4427L653p597j1403J6148n221J1331k0335J5588O309
26903e299J1772L56l053Q632m4959p695n328L5211O4557j3967l5383j004N422
26890I262k4089J4756K4360j2828l0914n200m372j2180K7944R505K2134L2879
26878E1257k8516j1569j871N699L292R983l8610k4584l654J785K0166K2544j589
26865D333j5794n313r519p266J2370l1917k645J0627r278R94L3758J5787l271
26852g134p8j2916q220j621l978Q777k4033J7134R860J0967J4156l058O823K2651
26838B9330K0397j0195j4373k0731j0987j1237q880j7755P880L0964J9142m12
$$ plain form
26929 -24538 -4971 206 9150 14062 15880 -1667 -20234 14540 18642 27490 5147 24298 33755
26916 33755 25114 2793 655 -13772 -10119 -17716 -29119 -12971 -18192 -6861 -27196 -11608 -5299
26903 -5299 6473 6829 3776 12408 -32551 -40246 -45574 -10363 54194 40227 4844 3840 9262
26890 9262 -14827 -71 24289 11461 -19453 -24653 -29025 -41205 -13261 -3756 18378 51257
26878 51257 22741 11172 9301 15000 18292 28275 -10335 -34919 -38573 -36788 -16622 5922 4333
26865 4333 -11461 -16774 -26293 -33559 -21189 -53106 -55751 -45124 -54402 -53408 -19650 -3863 -7134
26852 -7134 -7212 -20128 -28348 -29969 -33947 -25170 -49203 -32069 -22209 -11242 2914 -144 6679 29330
26838 29330 49727 39532 25159 4428 -6559 -17796 -26676 -44431 -36551 -5587 13555 13143
26826A3143k259n251p257J8882Q086n532N999l0318J1086J0056O699o864p607
26813H863k3022l2576j9769K789J0682J0480j729K4804J6127j3937j051N39K5380
26800G580K5848L11N776j0292N984k4134l13j3331j2291J9772j5911J3396K0053
26787B2448j0954k9348l4556K6032J3809k391j3032M828L0355j0148l085J3326
26775G284Q370j7953j5428R909R372o057P54K096J1019p772m415P838P795K2823
26761C5635j6055m1108K127K4160O507o603r053p443K2911J4767J4363j6165l7764
26748a3721m02K1260N115K3204k735j8098k2842L226R723K2971J4496J0455P743
26735F0395j9279O091k1840j8339j6707j161k496k0968j1683L532m753J9747Q02
$$ plain form
26826 13143 10884 5633 -1624 17258 25344 19812 25811 -4507 6579 16635 23334 16470 8863
26813 8863 -14159 -46735 -66504 -63715 -53033 -42553 -44282 -19478 -3351 -17288 -18339 -17800 7580
26800 7580 33428 33739 39515 29223 35207 11073 10760 -2571 -14862 4910 -11001 2395 22448
26787 22448 11494 -17854 -52410 -26378 -12569 -14960 -27992 -23164 7191 -2957 -6042 7284
26775 7284 15654 -2299 -17727 -7818 1554 -4503 -3749 -1653 9366 1594 -2821 5017 12812 35635
26761 35635 19580 -21528 -19401 4759 11266 4663 -4390 -11833 11078 25845 40208 24043 -13721
26748 -13721 -14123 7137 12252 35456 32721 14623 -8219 -4993 4730 27701 42197 52652 60395
26735 60395 41116 47207 25367 7028 -9679 -10840 -13336 -34304 -45987 -42455 -47208 -27461 -26659
26722b6659J1681O686l1587k3634L0624L0783N1J83m089p044j8737m394J9429
26709a6707j016j8098J2372o474j2333R592j8104l902l512m13J0564K271j059
26696d6819k4362O397K8634K3911K1557J2070p806l2727n884k003n363m12J045
26683c1762L694M815Q189J8291J2886j7387r601R27m120l482j4275m468K2183
26670a4110J1479O425J2295N92q906p414j3407j6963K822N146r517K836K2183
26657f539M0698m67j9570l3998m658K6681Q597R412p841K1685j6054j8078j5016
26644a5148k1963K173M877J7815o23K7873l301k3672K964J7681j01k1063K1400
26631H912o409k7769M570Q138P229J9066J2923L598j505J1788j0272k5459N909
$$ plain form
26722 -26659 -14978 -8292 -39879 -63513 -32889 -2106 -2055 -1872 -5961 -13005 -31742 -36136 -16707
26709 -16707 -17723 -35821 -23449 -29923 -42256 -32664 -50768 -54670 -58182 -58595 -48031 -45760 -46819
26696 -46819 -71181 -64784 -36150 -12239 9318 21388 13582 -19145 -25029 -27032 -32395 -32807 -31762
26683 -31762 -28068 -23253 -15064 3227 16113 -1274 -10875 -9948 -14068 -17550 -31825 -36293 -14110
26670 -14110 -2631 3794 16089 16681 7775 361 -13046 -30009 -27187 -22041 -31558 -28722 -6539
26657 -6539 34159 33692 14122 -19876 -24534 2147 10744 20156 12315 34000 17946 -132 -15148
26644 -15148 -37111 -34938 -30061 -12246 -12869 15004 11703 -11969 -9005 8676 8575 -12488 8912
26631 8912 2503 -25266 -20696 -12558 -5329 13737 26660 30258 28753 40541 30269 4810 10719
26618A0719L908k647J5892M212j6565J080k0951j0580n2k1560l50o240j5199L1728
26604b6605K9641P341Q094j8277Q504r743l3999Q667K7896p639j3523q188N227
26591b2604L0390j3765j1543k082J5782KN718k3022o791J0774J4420K2843m628
26578A5494k40n859q50L91j7848K3220K3450m2874N011J1687o847Q497m199j8550
26564i517l454J0932J0505J752q908K886j3370l9644j8702m715M5843K9920P897
26551A1425l445J1468k7462j3837r596K2875K4335p042k0704j311J7913K2830
26539B7449j9065j6300J9013j885l0761j1064J3773J0762J5916J6972r066j3857
26527A887k6345M915k6128k5902J5706k208j2988J5638K2052K253L2272K5913
$$ plain form
26618 10719 14627 11980 27872 32084 15519 16599 -4352 -14932 -14984 -36544 -36894 -43134 -58333 -26605
26604 -26605 3036 10377 18471 194 8698 -1045 -35044 -26377 1519 -6120 -19643 -27831 -22604
26591 -22604 7786 -5979 -17522 -19604 -3822 -3820 1898 -21124 -27915 -17141 -2721 20122 15494
26578 15494 15254 9395 8545 8936 -8912 14308 37758 -5116 -105 11582 4735 13232 9033 -9517
26564 -9517 -12971 -2039 8466 10218 1310 4196 -9174 -48818 -67520 -72235 -26392 3528 11425
26551 11425 7980 19448 -8014 -21851 -31447 -8572 15763 8721 -11983 -13294 4619 27449
26539 27449 8384 -7916 11097 9212 -21549 -32613 -18840 -8078 7838 24810 15744 1887
26527 1887 -24458 -19543 -45671 -71573 -55867 -58075 -71063 -55425 -33373 -31120 1152 27065
26515B7065r878l545j1994M096j8220J6451L1387j0177l3422l121J530M965L9707
26502C4844J8815K3109j9479k6202p684m214j0633k0379J4928K5535L6561J161
26490F6362j0229j1999l1621j9769j6070j0407J3561J5208j8275J3523J685m166
26478a2197Q9O968K043k2627j8320J7430K3897J6666J2969J7628M899k6529k5128
26465b212K344l0775j0651l543K0721k0236J4751L3384j634r82n759k716j664
26452h972j2883j7734J5716J0280J8124J7480k9959j0419J4551J5670j6976o009
26440a1131K4980R639j1668k869j4513p263l089J2504K6170J6548J5178m457p105
26427D2924N038j2941o216j5575l1726L303J3664K6868J4333o517j9500k614K640
$$ plain form
26515 27065 17187 13642 1648 5744 -12476 3975 35362 25185 -8237 -11358 -9828 -4863 34844
26502 34844 53659 76768 57289 31087 23403 19189 8556 -11823 3105 28640 65201 66362
26490 66362 56133 44134 12513 -7256 -23326 -33733 -20172 -4964 -23239 -9716 -8031 -12197
26478 -12197 -12108 -5140 -3097 -25724 -44044 -26614 -2717 13949 26918 44546 49445 22916 -2212
26465 -2212 132 -30643 -41294 -44837 -24116 -44352 -29601 3783 2149 1167 -4592 -7308 -8972
26452 -8972 -21855 -39589 -23873 -13593 4531 22011 -7948 -18367 -3816 11854 -5122 -11131
26440 -11131 13849 23488 11820 8951 -5562 -12825 -15914 -3410 22760 39308 54486 50029 42924
26427 42924 47962 35021 28805 13230 -18496 -15193 -1529 25339 39672 33155 13655 11041 13681
26414A3681K633O927k6069R323M832k7350j4409k5084J7043J3101j2723L346K5690
26401i059P244n23j2792j4040J1268J2000K2387J2253k2081j0281R632J4047L460
26388B3515j2680k215m260J1851J5610q443M05K5625J268o208j9790j4357J4313
26375B4634j1733j5127K0146L151M892J472R276M721J3479k6794j3681j4963P536
26362G009J9852j7852J2874j842j2128K956J998J7299J0205j6644n896J1082L154
26349C2067r199j4089k2320J2047K8307K866j1110N93n049L202N39Q915J0337
26336C7106R890k0116k9059k3370j3677p347K1788M7156L0707l3501k5439o544
26324a2406m164K167n376J5507J1992J1659j1017J7141l2936o76J9680q272P610
$$ plain form
26414 13681 16314 23241 -2828 6495 11327 -16023 -30432 -55516 -38473 -25372 -38095 -34749 -9059
26401 -9059 -1815 -2338 -15130 -29170 -17902 -5902 16485 28738 6657 -3624 6008 20055 23515
26388 23515 10835 8620 4360 16211 31821 23378 23783 49408 50676 44468 24678 10321 24634
26375 24634 12901 -2226 17920 21071 25963 27435 36711 41432 54911 28117 14436 -527 7009
26362 7009 26861 9009 21883 20041 7913 10869 12867 30166 40371 23727 17831 28913 32067
26349 32067 22868 8779 -13541 -1494 26813 29679 18569 19162 14113 17315 17854 26769 37106
26336 37106 46996 26880 -2179 -25549 -39226 -46573 -24785 22371 53078 19577 -5862 -12406
26324 -12406 -16570 -14403 -19779 -4272 7720 19379 8362 25503 -7433 -8109 11571 3299 10909
26311A0909O757r199O755L05j9149J1466R208l1782q940K353R254r761O465J2599
26297b760j7532n575k5220K2863L4224M006m993N418r574R725q55Q801o063Q25
26283A3290K1505m01O699j0871j0109j9058J1224p662l4082o548J1628J9660J316
26270c409R171L1446Q318k8834l1767l168J3074j9509k46K9916M327K995L3777
26257D6091j1219k8961k2001l892M355j0504K071K0195O700j1461R900M297L24
26244E895Q269k29k0860k1584K315J4076j2107N199J6320K0685j1719n54k3301
26231a7595K604J7328K0818j0786k4737J740k208J0322Q975K2776j2321q379n76
26218G961l5861j3192m882k2487J7943J7102J8229R616J7145J2271j259o20j4707
$$ plain form
26311 10909 17666 8467 15222 15527 -3622 7844 17052 -14730 -23670 -21317 -12063 -21824 -15359 -2760
26297 -2760 -20292 -25867 -51087 -28224 6000 10006 5013 10431 857 10582 9727 18528 12465 13290
26283 13290 34795 34394 41093 30222 20113 1055 12279 4617 -29465 -36013 -24385 -4725 -3409
26270 -3409 5762 37208 45526 16692 -15075 -18243 -5169 -24678 -24924 4992 9319 12314 46091
26257 46091 34872 5911 -16090 -19982 -15627 -26131 -24060 -3865 2835 -8626 1274 5571 5895
26244 5895 14164 13935 -6925 -28509 -26194 -12118 -24225 -19026 -2706 17979 6260 5706 -17595
26231 -17595 -14991 2337 23155 12369 -12368 -10628 -12836 -2514 6461 29237 16916 8537 7961
26218 7961 -27900 -41092 -45974 -68461 -50518 -33416 -15187 -5571 11574 23845 22586 21966 7259
26205G259k824j5424p80Q06J1183j2346j8931o939k1478n406N983j988J053K5999
26191c3833M1143k896j6177L680q698j751M982N729p514O403M680p129r426J7914
26177b893M554k6242K808K5367J0228R54L486l1704L1888K3430p926J5108j1691
26164C7367j7189l3J8003k5667m8321r589J8297J0418K5061J906n741K2691L1627
26151E8830q201m4156j0645J4532J2080L691k0253p513j2105j5555L4663R686
26139A5054l3329j4849L4425k2694K200K1804n175l595l4779q858J0803J3647
26127b5346K1908R192j365q017r681p303Q10L3400K4134J2148l6830j2493J1260
26114A1817J5958k8925j6665K8898J5251j4731k7899r673P672j1306J7713k3796
$$ plain form
26205 7259 4435 -10989 -11769 -10963 220 -12126 -31057 -37996 -59474 -64880 -58897 -60885 -59832 -33833
26191 -33833 7310 4414 -11763 -8083 -16781 -18532 -13550 -7821 -15335 -8932 -4252 -11381 -20807 -2893
26177 -2893 1661 -24581 -21773 3594 13822 14776 18262 -13442 18446 41876 33950 49058 37367
26164 37367 20178 20145 38148 12481 -35840 -45429 -27132 -16714 8347 10253 4512 27203 58830
26151 58830 50629 6473 -4172 10360 22440 26131 5878 -1635 -13740 -29295 5368 15054
26139 15054 -18275 -33124 1301 -21393 -19193 2611 -2564 -6159 -40938 -49796 -38993 -25346
26127 -25346 -3438 5754 4389 -3628 -13309 -20612 -19802 13598 37732 49880 13050 557 11817
26114 11817 27775 -1150 -17815 11083 26334 11603 -16296 -25969 -18297 -29603 -11890 -35686
26102c5686p670K1323j2455j4745K5329K1138J9314o562L662q027j3704m0851
26090d8934J0906q479O933J0670J4926K5350o60q305j8034j2453J5572j8124J0150
26077b0482J5729K514J5472J716o846q964l71j3524P846J95J7121J1926p86P007
26063B8553j1389l870K5352K7795l1830l9140j3695J6811P088p503l004O288q417
26050f961m919j3738j449M989R276J1315Q890j6912J8509J3999j3094k3290K0437
26037G052P880r64l615p68k4319J6663M1867k1489r745o299k1689J6807N1703
26024E3084o280k1873n499m775K795k27r875J4821j9426k5777J4177K2383Q526
26011B2054J1212K226j6030j314r016j9095n559R190m2056J7070L8427J2053j2279
$$ plain form
26102 -35686 -43356 -22033 -34488 -49233 -23904 -2766 16548 9986 13648 5621 -8083 -48934
26090 -48934 -38028 -46507 -39574 -28904 -13978 11372 10712 2407 -15627 -28080 -12508 -30632 -20482
26077 -20482 -4753 -2239 13233 14949 8103 -861 -1232 -14756 -6910 -6715 10406 22332 21546 28553
26063 28553 17164 13294 38646 66441 34611 -4529 -18224 -1413 5675 -1828 -4832 1456 -6961
26050 -6961 -11880 -25618 -27067 -22078 -12802 -1487 7403 -9509 9000 22999 9905 -13385 7052
26037 7052 14932 13968 10353 9585 -14734 1929 43796 22307 12562 6263 -15426 1381 53084
26024 53084 46804 24931 19432 14657 17452 17225 7350 22171 2745 -23032 -8855 13528 22054
26011 22054 33266 35492 19462 18148 9132 -9963 -15522 -6332 -48388 -31318 7109 19162 6883
25998F883l754N855l6005l047O711J0487L864K0831p729q041J0445J927l576l0686
25984b5835n032k144o969J1908L5544M275J70j4938j2376l7160k3030J5938L9043
25971b0606K7270J2819N183j9410N223J2586K1156k064q232k6820j7736j6423
25959b7054l027J1670m290j2576J346K8370L711J0687L0721L4768q661j9399n0123
25946c857j2526J0706J6229J5732m35O245J2295j4221j2901j1337J532j5975j660
25933a0173M176o556J84J4855l644P976J025q618J0371J202j0185O810L1583J962
25919D0968n526j4933j6206K074m906R566K8969n538N6j6934k0299k2815K4744
25906g80K1139j0786k135l355j0533j0433L963L0226K0322j4772l4748o007O579
$$ plain form
25998 6883 3129 8984 -27021 -30068 -23357 -12870 -9006 11825 4096 -3945 6500 8427 4851 -25835
25984 -25835 -30867 -33011 -39980 -28072 7472 11747 11917 -3021 -15397 -52557 -75587 -59649 -20606
25971 -20606 6664 19483 24666 5256 10479 23065 44221 42157 33925 7105 -10631 -27054
25959 -27054 -30081 -18411 -22701 -35277 -33931 -5561 -1850 8837 39558 74326 65665 46266 -3857
25946 -3857 -16383 -5677 10552 26284 25849 32094 44389 30168 17267 5930 7462 -8513 -10173
25933 -10173 -5997 -12553 -12369 2486 -1158 6818 7843 -775 9596 10798 613 7423 39006 40968
25919 40968 35442 20509 4303 6377 1471 11037 40006 34468 34524 17590 -2709 -25524 -780
25906 -780 20359 9573 7438 4083 -6450 -16883 -12920 17306 37628 22856 -11892 -17899 -11320
25893a1320j2005L9339J3520n838j1661k1176J2643J1200j2006j301K0416R07
25881B2718J4818m777J9j0314n060R506m704q342r456k0828q039J0154J0539o665
25867a0431J2146j9616j7037l018N615J7245P40r088K0591j1767L0490N0215K808
25854F8893l1037J525m898j0085j0037j69j045k273N30O893j7206l991K64o536
25840i172o262k520j09p623j4381P642L396J2687J5232O82k694p164l962Q159
25826f089P264J3956p405J475L0164j661O312j8957m4569n056j7610j9762n194
25813f7132J4881K6844J2587J996j0725j5580j2885L76J5578K7578N492j5027
25801a6017n577M073K1043N625j7526Q752K3031J7707j4579j9888k917L547L703
$$ plain form
25893 -11320 -23325 16014 29534 23696 12035 -9141 3502 14702 2696 1395 21811 22718
25881 22718 37536 32759 32778 22464 17404 26910 22206 13864 4408 -16420 -24459 -14305 -3766 -10431
25867 -10431 1715 -17901 -34938 -37956 -32341 -15096 -14356 -23444 -2853 -14620 15870 66085 68893
25854 68893 37856 39381 34483 24398 14361 14192 13147 10874 11404 18297 1091 -2900 -2636 -9172
25840 -9172 -15434 -17954 -18063 -25686 -40067 -32425 -29029 -16342 -1110 -428 -3122 -10286 -14248 -6089
25826 -6089 1175 15131 7726 9201 39365 37704 44016 25059 -19510 -24566 -42176 -61938 -67132
25813 -67132 -52251 -25407 -12820 -10824 -21549 -37129 -50014 -49638 -34060 -6482 -990 -16017
25801 -16017 -21594 -17521 3522 9147 -8379 373 23404 41111 26532 6644 3727 7274 10977
25788A0977k0466K5294K6140k3587j8740q57j8549k2977O307o321L35K481N04
25775c9459R015J8804N703N027l263J008K2820P587j5079k3085k475Q795j0450
25762a5052K3261K2501n763n5359k918K984J5005O651J8938Q377J21l869N446
25749B0323J8075k558M885r571k1762n082J6798o415j1981j2011j1676k058J346
25736b1687K653J3285j288m464j9928N203K9517Q795j0197p038K550J3184Q091
25723A8676o233j8753k5469q867O789J1485p134K7696K4120j3980r606L127O39
25710B490k473j2633q146O620K793J3604J0602k217J0173R789j2698j4418J3275
25697A6761j0873l792L467k5101Q733K1964P338K570O306r476j7194n724K6794
$$ plain form
25788 10977 -9489 15805 41945 18358 -382 -1239 -19788 -42765 -36458 -42779 -42444 -39963 -39459
25775 -39459 -30444 -11640 -5937 -910 -4173 -3165 19655 27242 12163 -10922 -13397 -4602 -15052
25762 -15052 8209 30710 24947 -30412 -33330 -30346 -15341 -8690 10248 18625 18746 14877 20323
25749 20323 38398 35840 40725 31154 9392 4310 21108 14693 2712 -9299 -20975 -23033 -21687
25736 -21687 -19034 -5749 -7037 -11501 -31429 -26226 3291 12086 1889 -5149 -2599 10585 18676
25723 18676 12443 -6310 -31779 -40646 -33857 -22372 -29506 -1810 22310 8330 -1276 1851 2490
25710 2490 17 -12616 -20762 -14142 -11349 2255 12857 10640 20813 30602 17904 3486 16761
25697 16761 5888 2096 5563 -19538 -10805 11159 18497 21067 27373 17897 703 -5021 21773
25684B1773k348L135K3645m106k5821j3840K1163J2638p926l169N441k3336q781
25671a532L2428k877r049o900p968j0800k0054k259J3090m943k8744j9292K1685
25658d7215K9461J9162o1k2591R49J0880m632n209J3615P410L793O04k130k4128
25644b0092J95K0620J6631k4561k453J7428J484p657m321J0859p201j1017P90
25631i295J751j6239j6407J5024M7779O790k3776o868k6107j9342j5315L928j3976
25618g2053J556K2960M0600j0668K229m90j6748l794J1554J9427P237m827o743
25605i760j1901O695K1126m514j2462K4684j1290J6448p336k4101J063j3533J7931
25592f950J7225K1814j8178k5136Q974p042j9701j726K0360K635K3976l5831j7473
$$ plain form
25684 21773 19425 22560 46205 42099 16278 2438 23601 36239 28313 25144 30585 7249 -1532
25671 -1532 30896 28019 18970 12070 4102 -6698 -26752 -29011 -15921 -20864 -49608 -68900 -47215
25658 -47215 -17754 1408 1347 -21244 -20295 -9415 -14047 -19256 -5641 1769 5562 6166 4036 -20092
25644 -20092 -19897 723 17354 -7207 -9660 7768 9252 1595 -2726 8133 932 -10085 -9295
25631 -9295 -7544 -23783 -40190 -25166 22613 29403 5627 -1241 -27348 -46690 -62005 -58077 -72053
25618 -72053 -70497 -47537 -6937 -17605 -15376 -15866 -32614 -36408 -24854 -5427 1810 -3017 -9760
25605 -9760 -21661 -14966 6160 1646 -10816 13868 2578 19026 11690 -12411 -11348 -24881 -6950
25592 -6950 10275 32089 13911 -11225 -2251 -9293 -28994 -30720 -10360 -7725 16251 -19580 -37053
25579c7053j0392J4790P168o076J2109K6640Q555J6196k4824k0362j2041k19K3772
25566a737P523l4801o328j8534n118K4478K5395q046J0574N251m093Q260J0532
25553A3356o778j8689q495j294J2915K7591j5692K056L9114k927L854J3012P404
25540F5427l1769r134M394j1210o061j850O200k341j2000Q205j6357J0158K7725
25527C1387Q636n326j8002p718j0408j0609J5915J9780j4599k8651Q288k2242
25515c3549m036J4689J7746k841K7790m338j3977J0772K9974k3652k7432j1416
25503b0270J0530J5981J1307J0920n966k3431Q566J8353K07j1484j3408J8310
25491A9615J4577q186J2292K142j8234q400J7431K1250j2742l9343L65J543m781
$$ plain form
25579 -37053 -47445 -32655 -25487 -31563 -19454 7186 15741 31937 7113 -13249 -25290 -25509 -1737
25566 -1737 5786 -29015 -35343 -53877 -58995 -34517 -9122 -17168 -6594 -1343 -5436 2824 13356
25553 13356 6578 -12111 -20606 -21900 -8985 18606 2914 4970 44084 41157 45011 58023 65427
25540 65427 33658 24524 28918 17708 11647 9797 15997 13656 1656 9861 -6496 3662 31387
25527 31387 40023 34697 16695 8977 -1431 -12040 3875 23655 9056 -19595 -11307 -33549
25515 -33549 -37585 -22896 -5150 -7991 19799 15461 1484 12256 42230 18578 -8854 -20270
25503 -20270 -9740 6241 17548 28468 22502 -929 7637 25990 26197 14713 1305 19615
25491 19615 34192 26006 38298 40440 22206 13806 31237 52487 39745 402 767 2310 -2471
25478b471l4380k2507L7999J9375j930J5810j3852m601K945K3622L445L896J3650
25465D1001R990k1534j9520K4391L98j9198O44J8424o471M072K5404j8671j2555
25452B6375K685j2592L613M918L378O726N927j2604N798o344n132k7981j890J7939
25438A0816j1216j6848k15J4623K2404K2440O707l4735J4257K625k7533k3460
25426b0135o21N368K810L0129K8051q555q297J0470j5119J5792L219m1419k8805
25413b7112l947J4327P667K271J7237q674O09k4507o80l287J3754O467l1586p160
25399d4621j482K0637L7589k324n768J8657l152j3371J2983J2766j7911N640j9330
25386C13K1237M29r260J9799N943q876l4618n3315j3416K2968K6094r168j5814
$$ plain form
25478 -2471 -36851 -59358 -21359 -1984 -3914 11896 -1956 -6557 -3612 20010 23455 27351 41001
25465 41001 50991 29457 9937 34328 34726 15528 16172 34596 28125 32197 57601 38930 26375
25452 26375 29060 16468 20081 24999 28377 35103 41030 28426 34224 27880 22748 -5233 -7123 10816
25438 10816 -400 -17248 -17463 -2840 19564 42004 48711 13976 28233 30858 3325 -20135
25426 -20135 -20756 -15388 -12578 17551 45602 37047 28750 39220 24101 39893 43112 1693 -27112
25413 -27112 -31059 -16732 -9065 -6794 10443 1769 2378 -22129 -22809 -26096 -12342 -5875 -37461 -44621
25399 -44621 -46103 -25466 12123 9799 4031 22688 19536 6165 19148 31914 14003 19643 313
25386 313 21550 21979 12719 32518 38461 29585 -5033 -58348 -71764 -48796 -22702 -31870 -47684
25373d7684R348K1097j6059j0693K7256Q889r289j3605k324K4288J5199k9657
25361b3234r970l719J9563l872K147J9994K3987R524K357O302k3033k9794l349
25348a3097L111O26J6129Q194j8013P397J412l60l022k6426l753J7207j08k619
25334a3322K8181J4788n300J2904j1736j9913q317K6611J9824J4374k5736r450
25322B2908j6674k0791L0107k868N877K795J3849m979K430l544o180j0827j0161
25309A942q543j962j4210P986J8264j5719l5407L0282L0392N619j1953q385j6833
25296a8527J301J3963R901N484O787P492j1511n3126n983Q816j5560L3883N998
25283a1082p399J969q268j542J6410k1376j7693J0528J4134J8750K5023J3302
$$ plain form
25373 -47684 -38336 -17239 -33298 -43991 -16735 -7846 -17135 -30740 -33064 -8776 6423 -23234
25361 -23234 -33204 -36923 -17360 -21232 -19085 909 24896 34420 36777 43079 20046 -9748 -13097
25348 -13097 -9986 -9360 6769 14963 -3050 4347 5759 5399 2377 -24049 -27802 -10595 -10703 -13322
25334 -13322 14859 29647 24347 37251 25515 5602 -2715 23896 43720 58094 32358 22908
25322 22908 6234 -14557 15550 12682 18559 21354 35203 30224 32654 29110 22930 12103 1942
25309 1942 -6601 -8563 -22773 -14787 3477 -12242 -47649 -17367 13025 18644 6691 -1694 -18527
25296 -18527 -17226 -3263 6638 12122 18909 26401 14890 -38236 -44219 -35403 -50963 -17080 -11082
25283 -11082 -18481 -16512 -24780 -26322 -9912 -31288 -48981 -38453 -24319 -5569 19454 32756
25271C2756k831j9631p491q212r928J2166J3201R369q801R196q806j5906k9320
25258c4238k858l266K5594J3129J8834J62k1156m825q589J534j4446L2717M289
25245F881J446K1050n879k7807j0139l838k2762J4259J1470K401l210r256j1542
25232c6926J7371O457P987J8345j428q400k859p597l3249k0697J0905P700M4888
25219B497L4862j0944k1432m0085j8412J7769j387P213M179l314K0475o266R540
25206e305O045j4680K4008K5035P599j8033j7118l601n1137l322K3132R676p037
25193b4738O19J3687r852L237J6613k9560l1871J3699L1168l730J0978J8396K5480
25180C4126P011j7487j0476j9159l08k9733j1403L0291O482M702j3741j5347J4263
$$ plain form
25271 32756 29925 10294 2803 -5409 -15337 -3171 10030 19399 10598 19794 10988 -4918 -34238
25258 -34238 -37096 -40362 -14768 -1639 17195 17357 -3799 -8624 -17213 -15679 -30125 2592 6881
25245 6881 8327 29377 23498 -4309 -14448 -18286 -41048 -26789 -15319 -12918 -16128 -25384 -36926
25232 -36926 -19555 -13098 -5111 13234 11806 3406 547 -7050 -40299 -60996 -50091 -42391 2497
25219 2497 37359 26415 4983 -35102 -53514 -35745 -37132 -29919 -25740 -29054 -8579 -14845 -5305
25206 -5305 740 -13940 10068 35103 42702 24669 7551 3950 -47187 -50509 -27377 -17701 -24738
25193 -24738 -24119 -10432 -20284 -17047 -434 -29994 -61865 -48166 -16998 -20728 -9750 8646 34126
25180 34126 41137 23650 13174 -5985 -6293 -36026 -47429 -17138 -10656 -5954 -19695 -35042 -20779
25167b0779K2245J4495J0945m553m727R550q862J4995k3601q708K9676M607k8495
25154F788o403J3864J3946k9174m766K4131N255k8626K0554j2196P284j7286j5375
25141b2004j9422k4050J3445L1773J570J9670r587o069R808L078Q669k6678J7022
25128b775o014j6554p615M169K157n050J3200J5062J0896p728j6369Q950J5433
25115G762K667L04o949K948L0330J2885J6664o556j7290K139p067j1180P61k0167
25101G251j5807Q85j9449l796J5504m774J3124J3735l732j9256P654j5138M862
25088a8937L451P182m926k5781J435J6716K7968J7605O158q085N873l1232r27
25075c500J5209K9913J341j9120J4481J5015m887l372k5263k0981J6277o769m19
$$ plain form
25167 -20779 1466 15961 26906 22353 17626 27176 18314 33309 9708 1000 30676 35283 6788
25154 6788 385 14249 28195 -979 -5745 18386 23641 -4985 15569 3373 10657 -6629 -22004
25141 -22004 -41426 -65476 -52031 -20258 -18688 982 -8605 -14674 -4866 -1788 6881 -19797 -2775
25128 -2775 -8789 -25343 -32958 -28789 -26632 -31682 -18482 -3420 7476 -252 -16621 -7671 7762
25115 7762 10429 10733 3784 6732 37062 49947 66611 60055 42765 44904 37837 26657 27418 7251
25101 7251 -8556 -7671 -27120 -30916 -15412 -20186 -7062 6673 2941 -16315 -8661 -23799 -18937
25088 -18937 -15486 -8304 -13230 -39011 -37576 -20860 7108 24713 30871 22786 28659 -2573 -3500
25075 -3500 11709 41622 42963 23843 38324 53339 48452 45080 19817 -1164 15113 8344 7925
25062G925J4013M674L448j5846Q535j098L0206Q54O81k2721j7874j50M241j0623
25048F265k996J2770J1907q996j1852q122j365J3645j5017j3276K3673N733P558
25035A9927q600j1912L652J8857j2715m2939j8913J4059J2541J4119j1288k7774
25023e0986N321K249K517K2615r217O267m653l791m980R967M7579J1482k1778
25010A2592K5385m0964j0609K6381P850k2760j3663J2272L247J767n024j79R180
24997E475j4087j41l4387n718M087K4345L5217K2376L7584l2547l3839m092J8352
24984B2625j1291r020o788k582l28n448N575J7729M216k431R544j4256j1492j9181
24970b3128j3786j0777J957N604J2910M925k2942p142j167J883K6323K8621J8640
$$ plain form
25062 7925 21938 26612 30060 14214 22749 21651 51857 52711 53392 30671 12797 12647 16888 6265
25048 6265 3269 16039 27946 18950 7098 -1024 -2389 11256 -3761 -17037 6636 12369 19927
25035 19927 11327 -585 3067 21924 9209 -33730 -52643 -38584 -26043 -11924 -23212 -50986
25023 -50986 -45665 -43416 -40899 -18284 -27501 -21234 -25887 -29678 -34658 -24691 22888 34370 12592
25010 12592 37977 -2987 -13596 12785 20635 -2125 -15788 -3516 -269 1498 -3526 -3705 5475
24997 5475 -8612 -8753 -43140 -48858 -44771 -20426 14791 37167 74751 42204 8365 4273 22625
24984 22625 11334 2314 -4474 -7056 -7384 -12832 -7257 10472 14688 12257 21801 7545 -3947 -23128
24970 -23128 -36914 -47691 -45734 -40130 -27220 -22295 -45237 -52379 -53546 -51663 -25340 3281 21921
24957B1921J4863m104J5018k339k7601n487k062K0001j3311l0018j6571J8046
24945a1644N723j2588j0119J591o068J3240L9130p839K665R953k1290J7634L6115
24932E6503P723k7535k9437L194J531l659j0115j0986L895j991L0l005O904K332
24918d616J2290O816m683j4621k513K3840m087n317L86j1167M143M1120K2972
24905F4563r864K609o073j8790l0247J2357K6424J1200l6441j5179M682P204m454
24892G991j490K0254J789k3164j5424L322L2583n58k3597n694n41P339j5033k2205
24878c4428q16K4166M660j4339m162J9023m906J7942J5193r978k0789N782K1414
24865A8762j4193m075n544j3319K5102J6998K8479j2980j3003n233j4588k3948
$$ plain form
24957 21921 36784 32680 47698 45359 17758 12271 10209 30210 16899 -13119 -29690 -11644
24945 -11644 -5921 -18509 -28628 -27037 -33105 -19865 19265 11426 14091 24044 2754 20388 56503
24932 56503 64226 36691 7254 10448 11979 8320 -1795 -12781 -8886 -10877 -10847 -13852 -6948 -4616
24918 -4616 7674 14490 9807 -4814 -7327 16513 12426 7109 7495 -3672 471 41591 64563
24905 64563 54699 57308 51235 32445 2198 14555 40979 52179 15738 559 5241 12445 7991
24892 7991 6501 26755 28544 5380 -10044 -6722 25861 25303 1706 -3988 -4529 2810 -12223 -34428
24878 -34428 -35244 -11078 -6418 -20757 -24919 -5896 -10802 7140 22333 12355 -8434 -2652 18762
24865 18762 4569 494 -5050 -18369 6733 23731 52210 39230 26227 20994 6406 -17542
24853a7542j1488J218j9194L109K2353L049L835J096j2781R584J2464P777J5358
24840A8838N374l6274m494p031j6810K3631O059O643j4938j4803R100J2871r794
24827b1628k462k768m917P136J061K6368Q867J3704J3744J0282j8123k5724j4800
24814i260j718l65j1100L937J3032J6873J6591j7858r288n0616l873K3831k127
24801c1941R502K5998L256j3124J491J1278K6249k3165q161N812L985J917q121
24788D976j1814j1149P203L4033j2812k6506l893j0236j4276J0732j1044j281
24776d6067K5166L2331l311j9193J983o400J7878K3764k2901k5698j6014L013
24764c5449M246L7361J4558L594j0505j8797l1084P390K0677J5375J5995L4708
$$ plain form
24853 -17542 -29030 -27812 -47006 -43897 -21544 -18495 -14660 -13564 -26345 -16761 -4297 3480 18838
24840 18838 24212 -12062 -16556 -23587 -40397 -16766 -10707 -4064 -19002 -33805 -24705 -11834 -21628
24827 -21628 -24090 -26858 -31775 -24639 -23578 2790 11657 25361 39105 49387 31264 5540 -9260
24814 -9260 -10978 -11343 -22443 -18506 -5474 11399 27990 10132 844 -49772 -53645 -29814 -31941
24801 -31941 -22439 3559 6815 -6309 -4818 6460 32709 9544 1383 7195 11180 13097 4976
24788 4976 -6838 -17987 -10784 23249 10437 -16069 -19962 -30198 -44474 -33742 -44786 -46067
24776 -46067 -20901 11430 8119 -11074 -9091 -15491 2387 26151 3250 -22448 -38462 -35449
24764 -35449 -31203 6158 20716 24310 13805 -4992 -36076 -28686 -8009 7366 23361 58069
24752E8069J4815j9907n7233j7969l440j9282q99K4702r986R331R301O472j8483
24739b4509j201Q640M182j4022j1669o395l187J9050j5514j9654o685L0512K0062
24726b0390J632k689J0548J8191J0494l632l337j3199l205K7569J327M53J7468
24713D1230R838m437j5317k2420j3165k3776j6526J480k67J3263L6820L567j9304
24700i014j0186Q038J1366Q699P499L9330j4888k4093q534j695J1720p201j1436
24687c95k2766J2269J9145j0835K891j360n432q021m954K1224j5368q644L996
24674a8250J915P573L0896L537m348j569k8407k211J9198J2886k3816k367j372
24661f335k285k4997n324M1029J9284j4989J1871l075k175k7567l564k0305N055
$$ plain form
24752 58069 72884 52977 -4256 -22225 -25665 -44947 -45846 -21144 -31130 -21799 -12498 -6026 -24509
24739 -24509 -25710 -17070 -12888 -26910 -38579 -44974 -48161 -29111 -44625 -64279 -70964 -40452 -20390
24726 -20390 -18758 -21447 -10899 7292 17786 14154 10817 -2382 -5587 21982 23309 23762 41230
24713 41230 51068 46631 31314 8894 -4271 -28047 -44573 -43093 -43360 -30097 6723 10290 -9014
24700 -9014 -19200 -11162 204 8903 16402 55732 40844 16751 8217 6522 18242 11041 -395
24687 -395 -23161 -10892 8253 -2582 309 -1051 -6483 -14504 -19458 1766 -13602 -22246 -18250
24674 -18250 -16335 -8762 22134 25671 21323 19754 -8653 -10864 8334 21220 -2596 -4963 -6335
24661 -6335 -8620 -33617 -38941 2088 21372 6383 18254 15179 13004 -14563 -18127 -38432 -33377
24648c3377J5132J175m656J2623m626j3827k588l935O458R926N287j6654J6624
24635a2438J0425o23j0232K187J7398j9288O441R642j2264J7206N419l884k895
24622G094K0283j5426k6884q730L854j1200R268J8068P612J4693k8817j2866j1129
24609c4180j2705k918O293L518p955J822P049L2982m062j2773Q722l900m886K37
24595b2756j4203J4563L1553N085P222p487j745J0330j5309N220o534o920j6950
24582a7931j4593p369J8486M322J1948L1778K7799j3575k6643j6234k436M315
24570a33K5773Q240k7586j1114j2170j1733J0749j3816r875L9208Q231r88P773
24557A2559k561j5944r999O808O13J0963L2255J7046r588l0696p076J6333j6700
$$ plain form
24648 -33377 -18245 -17070 -21726 -9103 -13729 -27556 -30144 -34079 -27621 -17695 -12408 -29062 -12438
24635 -12438 -2013 -2636 -12868 -10681 6717 -12571 -6130 3512 -8752 8454 13873 9989 7094
24622 7094 27377 11951 -14933 -23663 -19809 -31009 -21741 -3673 3939 18632 -10185 -23051 -34180
24609 -34180 -46885 -49803 -43510 -39992 -47947 -46125 -39076 -6094 -10156 -22929 -14207 -18107 -22993 -22756
24595 -22756 -36959 -22396 9157 14242 21464 13977 12232 22562 7253 12473 5939 -981 -17931
24582 -17931 -32524 -39893 -21407 -17085 -5137 26641 54440 40865 14222 -2012 -4448 -133
24570 -133 25640 33880 6294 -4820 -16990 -28723 -17974 -31790 -41665 -2457 5774 4786 12559
24557 12559 9998 -5946 -15945 -9137 -8524 2439 34694 51740 42152 11456 4380 20713 4013
24544D013m166M876N290n846L335N953J7153j3883J30L366l228J6967J8122k736
24530D9346k2243n2693J84J0196M094J1167L1173q909r968j1480J684M615Q539
24517A5705k475l8695l988n91K1562Q461M811L9656j0248j3232J8720r733O746
24504C6699o656J2850J1900o281k8049L966l808p073R989P21j313j3460J3966
24491B3451R503r408l937j6354l4285K436J0165P096m812j4595J7596K4098M282
24478A5236J4789j1152Q168k991k7867j0300J0271o697k6856N478K5585J168o109
24465a1277N798K473j4371J1630J5772k1361n486P288J9287j588j1562K2651J874
24452B1128k5653l8209k001m258j0162o944J5425L5986J2715j1860k2589o646
$$ plain form
24544 4013 -153 4723 10013 4167 7502 13455 30608 16725 16855 20221 16993 33960 52082 49346
24530 49346 27103 -25590 -25406 -15210 -11116 51 31224 22315 12347 867 2551 7166 15705
24517 15705 13230 -25465 -29453 -30044 -8482 -21 4790 44446 34198 20966 39686 29953 36699
24504 36699 30043 42893 54793 48512 20463 24429 20621 13548 23537 24258 22945 9485 23451
24491 23451 32954 23546 19609 3255 -31030 -28594 -18429 -11333 -16145 -30740 -13144 10954 15236
24478 15236 30025 18873 27041 24050 -3817 -14117 -3846 -10543 -37399 -31921 -6336 -5168 -11277
24465 -11277 -5479 -3006 -17377 -5747 10025 -11336 -16822 -9534 9753 8165 -3397 19254 21128
24452 21128 -4525 -42734 -44735 -48993 -59155 -66099 -50674 -14688 -1973 -13833 -36422 -43068
24440d3068J0506K7878K2307j5432j5248O584m025J6062j2889M900l156j108L3819
24427B7130k227m7643J206J8325l254K2630j2796j7946qj8315J0691M349j4568
24414c2426l929J515J2317J6422K2357J0490k4078J6467J9961m222N514K930q712
24401C4606j9827k3927K0070K1627j6698L23q886j7431p700P915k938k3117Q49
24388c5134O330J0685J9264J5221J987M936o725Q029p535m564J6162k0173j4942
24375f459L007L2149l932o558j4072j5517n242O294R780O607J3651k3801l8389
24362d2482J948J7366P468j7197o412L7633o91l3830J3077J8482j7264l4190K8494
24349b7598J9976o625J9861J4592p641k3065n525k7721k2298K6329L5536K3366
$$ plain form
24440 -43068 -32562 -4684 17623 2191 -13057 -6473 -10498 5564 -7325 -2425 -5581 -6689 27130
24427 27130 24903 -22740 -21534 -3209 -6463 16167 3371 -14575 -14583 -32898 -22207 -17858 -32426
24414 -32426 -36355 -34840 -22523 -6101 16256 26746 2668 19135 39096 34874 40388 43318 34606
24401 34606 14779 -9148 10922 32549 15851 16174 7288 -10143 -17843 -9928 -12866 -35983 -35134
24388 -35134 -28804 -18119 1145 16366 18353 23289 16564 24593 17058 12494 28656 8483 -6459
24375 -6459 -3452 28697 24765 18207 4135 -11382 -16624 -10330 -550 6057 19708 -4093 -42482
24362 -42482 -40534 -23168 -15700 -32897 -39309 -1676 -2367 -36197 -23120 -4638 -21902 -56092 -27598
24349 -27598 -7622 -14247 5614 20206 12565 -10500 -16025 -43746 -66044 -39715 -4179 19187
24337A9187J0335M254N489r787j8123j9743r743J0012K0272J3858R548l5055j6151
24324a5647M726O373o464j131k6113n709R301N44L0284J9384j5195l3549k3082
24311e6278j4248J1013K3504K7027J6841j0743L088R918m475J2428r969r05p020
24298A81r577J3361O190q766j3334O473K4681j3018j9553j3637n692J6452m98
24285a6737k2825M460L4650K6176k679k134j299j1431L043L06j4784m555O270
24272a539J3938k684J44L605Q759j3523j2961j6411p509l580J4612K6176k7527
24259a8500q413M552j3966j3368K1470N535J4095K014j2577o062L4199K9634L793
24246D2406q313o81p547l9024k1301L5512J6162l7622j0762R326j3924k3473k5426
$$ plain form
24337 19187 29522 33776 39265 29478 11355 -8388 -18131 -8119 12153 26011 35559 504 -15647
24324 -15647 -10921 -4548 -11012 -12143 -38256 -43965 -34664 -34120 -3836 15548 353 -33196 -56278
24311 -56278 -70526 -59513 -36009 -8982 7859 -2884 204 10122 5647 18075 8106 7201 181
24298 181 -9396 3965 10155 1389 -11945 -5472 19209 6191 -13362 -26999 -32691 -16239 -16737
24285 -16737 -39562 -35102 -452 25724 23045 20911 19612 8181 11224 11530 -3254 -7809 -1539
24272 -1539 12399 9715 9859 13464 22223 8700 -4261 -20672 -28181 -31761 -17149 9027 -18500
24259 -18500 -26913 -22361 -36327 -49695 -28225 -22690 -8595 -6581 -19158 -25220 8979 38613 42406
24246 42406 34093 33412 25865 -13159 -34460 1052 17214 -20408 -31170 -21844 -35768 -59241 -84667
24233h4667l314K0486K8256L573M443K0518J1111K161L299j4976k9013M122n181
24220c9182n789O880K2159L026l5213J5306K0350J3378M616P388m82o701l692
24207B044N076J5488j9328j6416K990j79Q500L2534o115j2022r85q328l050R974
24193A0183O614l889J4819l6945k2724k7510M685K4490N223l052J1871j011r748
24180b6994N527n434k970l645J1710J8783P001R185j3176J4602j068j0338J0342
24167A3525K2367j5328k4050o252q216j7512j1041K0343K5125j8290k4017J0390
24155c2956K806J800k191N96J4729m935J6169j7881J1194J2410r88L6j7569q623
24141b5403J0002L0418l727J2949r49O458J5346k571k2131k739K0134M472r887
$$ plain form
24233 -84667 -87981 -67495 -39239 -35666 -31223 -10705 406 2567 5866 -9110 -38123 -34001 -39182
24220 -39182 -44971 -38091 -15932 -12906 -48119 -32813 -12463 915 5531 12919 12437 5736 2044
24207 2044 7120 22608 3280 -13136 -10146 -10325 -1825 30709 24594 12572 11587 3259 209 10183
24193 10183 16797 12908 27727 -9218 -31942 -59452 -54767 -30277 -25054 -28106 -16235 -17246 -26994
24180 -26994 -21467 -26901 -29871 -33516 -21806 -3023 3978 13163 -13 14589 13521 3183 13525
24167 13525 35892 20564 -3486 -9738 -17954 -35466 -46507 -26164 -1039 -19329 -43346 -32956
24155 -32956 -30150 -28350 -30541 -29945 -15216 -20151 -3982 -21863 -10669 1741 753 789 -16780 -25403
24141 -25403 -15401 15017 11290 24239 23290 29748 45094 42523 20392 17653 37787 42259 32372
24128C2372j6681o043l029K5893L807j7070O819L0538p042j8598l6475r097p671
24115b2277j38l4045J4901K2432J6569j440J2674k1904j4960J2811Q209j3344
24103b0512j405j310P979j0226M008N2316J9565O445k1883k9315k1755J239L2523
24090A7669K53q925j1219j6137j6443O69J9365J7799J492k0123j8471O599K7801
24077C29P79K0065p603K4246K2960j0403j7767k3743l3412J4398J8336j3033j6617
24064b1465J3885n443p246p336L916O934m114J1500J5778j6681K945J8868J6643
24051B8184J0978K922j4246J413J6665J2120M084k5652j8004m651j0959l494J2618
24038A1978L7R636K560j6642k8458k0323L5389K4219j2951n123J6624m0384l2089
$$ plain form
24128 32372 15691 9648 6619 32512 36319 19249 26068 56606 49564 30966 -5509 -14606 -22277
24115 -22277 -22415 -56460 -41559 -19127 -2558 -3998 8676 -13228 -28188 -15377 -7168 -20512
24103 -20512 -21917 -23227 -15248 -25474 -21466 30850 50415 56860 34977 5662 -16093 -14854 17669
24090 17669 17922 8997 -2222 -18359 -34802 -34133 -14768 3031 4523 -15600 -34071 -27472 329
24077 329 1108 21173 13570 37816 60776 50373 32606 8863 -24549 -10151 8185 -4848 -21465
24064 -21465 -7580 -13023 -20269 -27605 -23689 -16755 -20869 -9369 6409 -10272 -7327 11541 28184
24051 28184 39162 42084 27838 29251 45916 58036 62120 36468 18464 13813 2854 -640 11978
24038 11978 12015 21651 24211 7569 -20889 -41212 -5823 18396 5445 322 16946 -23438 -55527
24025e5527K3885O320J2533J0062M87r641J2562j463K0738m916j6034L3449L362
24012C5817n2076j6081J4727k0771J3012n488Q340Q741K968j7750r579n192K7062
23999a6270K4615N495j056K5763j9406k595j5754k547j3651p868P107O163k3510
23986c3514M299L7145J180k1794n753N206K3343k495j274N961L1332j8349l6323
23973a1036J0523O55k1564K430J9061p78l963j7375r620k6951j0676K0969l65
23960d8690j4214j2447o459L5255K6940J6560J5397J5626m615l5020j6808m431
23948c2906n988J1127K759p140j4506Q293J6754K1028O586k8044m191M431O934
23935a4863n93J4882P985N572Q111P42j92k5615k2258l595q649Q731R116J2681
$$ plain form
24025 -55527 -31642 -25322 -12789 -2727 -2240 -11881 681 -782 19956 15040 -994 32455 35817
24012 35817 -16259 -32340 -17613 -38384 -25372 -30860 -22520 -13779 -10811 -28561 -38140 -43332 -16270
23999 -16270 8345 13840 12784 38547 19141 16546 792 -1755 -15406 -23274 -16167 -10004 -33514
23986 -33514 -29215 7930 9110 -12684 -18437 -13231 10112 7617 6343 12304 43636 25287 -11036
23973 -11036 -513 142 -21422 -18992 69 -709 -4672 -22047 -31667 -58618 -69294 -48325 -48690
23960 -48690 -62904 -75351 -81810 -46555 -19615 -3055 12342 27968 23353 -11667 -28475 -32906
23948 -32906 -38894 -27767 -25008 -32148 -46654 -38361 -21607 -579 6007 -22037 -26228 -21797 -14863
23935 -14863 -15456 -574 7411 12983 21094 21836 21644 -3971 -26229 -29824 -38473 -29742 -20626 -7945
23921g945O820J48n079l197L6308K803k5780j2887q452J8057K6971l329k0174
23908D264P410k5122j6362R850J1783L933J4395k3574k7480N25j5359J067J2915
23895d1755K8547N645k543p315k3426Q845K4343R771Q742J4861l2348m694k5942
23882c7269m902J2168O882k4193j4028K1889L3599J8110K0977J4282o458k9878
23870A1179l3494j3000N338K2906J1660j0935k0787j3646K1715J7917j1051j7178
23858b9376n013l846J1761J7890N808J1948J2125K07K1932j7194k6615j447m776
23845f596j1510r476M736L065J9179j7479k404R233k825j406j911K930K9088l809
23831A0815k22l77j3905J8620j973k0662m469L9847r238l9010K020J0416N912
$$ plain form
23921 -7945 -1125 -977 -6056 -9253 27055 29858 4078 -8809 -17261 796 27767 24438 4264
23908 4264 11674 -13448 -29810 -19960 -8177 -4244 10151 -13423 -40903 -40378 -55737 -54670 -41755
23895 -41755 -13208 -7563 -10106 -17421 -40847 -32002 -7659 2112 10854 25715 -6633 -11327 -37269
23882 -37269 -42171 -30003 -23121 -47314 -61342 -39453 -5854 12256 33233 47515 41057 11179
23870 11179 -22315 -35315 -29977 -7071 4589 -6346 -27133 -40779 -19064 -1147 -12198 -29376
23858 -29376 -34389 -38235 -26474 -8584 -2776 9172 21297 21504 43436 26242 -373 -1820 -6596
23845 -6596 -18106 -27582 -22846 -19781 -602 -18081 -20485 -11252 -14077 -15483 -17394 -14464 14624 10815
23831 10815 10593 10216 -3689 14931 12958 -7704 -12173 27674 18436 -20574 -18554 -8138 -2226
23818b226N171m201j3809J8338L690N965J3068n154j2705j5365j9915P291J6642
23805c210R860L135n068Q133K6126P336p107j6741j4583j5309j3699L986k0304
23792c7445k74J3956K199m771l75K3666o896Q20m855P662K1738L41J5063j7172
23778A3657p10r638j7434k083L764J5579O728N0K7508R64o173j2070j1249j0558
23764a665r030N53K46J803J2669k213n270M937k577K403M563m128p843q14J2228
23749E862M635n10l6113k0911j0560J3033O867R596j3475r732L4455J4993j9112
23736b0972o390o626L6977J3726p784K3134K204n0m3143j9508J9027p009k122
23723a8536j1383k9304J313J4576L4031l29J5899j4539n865K0138o828n593O53
$$ plain form
23818 -2226 2945 -1256 -15065 3273 6963 12928 25996 20842 8137 -7228 -27143 -19852 -3210
23805 -3210 6650 9785 4717 12850 38976 46312 39205 22464 7881 -7428 -21127 -17141 -37445
23792 -37445 -37719 -23763 -21564 -26335 -26710 -3044 -9940 -9120 -13975 -6313 15425 15766 30829 13657
23778 13657 12947 3309 -14125 -16208 -12444 3135 9863 9913 37421 38385 32212 20142 8893 -1665
23764 -1665 -10695 -10142 -9896 -8093 4576 2363 -2907 2030 -547 1856 6419 2291 -5552 -6366 5862
23749 5862 10497 9987 -26126 -47037 -57597 -44564 -37697 -28101 -41576 -51308 -16853 -1860 -20972
23736 -20972 -27362 -33988 2989 16715 8931 32065 34269 34219 -8924 -28432 -9405 -16414 -18536
23723 -18536 -29919 -59223 -57910 -43334 -9303 -9632 6267 -8272 -14137 6001 -827 -6420 -5767
23710e767K0033N878m522J0600J5555r241r240p050J8040j6006k8817M884J800
23697c853k110k3040J128Q779R186P204J013r384J5381m050Q985J8393K440J896
23683C1968m1218j9214J4657J432l3293J5556m97K797L3674R391Q534L3384J174
23670E8345k8556k3271j1982k415j0195L707j76K2931O644k4000J7102K969j8202
23657g099j8224M586K2262R201q585K1145J6201l614j6970k5626M28k0953J2409
23644a4839J4416P933j0575j2652P63N980j7297j3587K1872J5949Q960N391k0687
23631h373o298J8420k822j1944q094J5673J3606J0461P35J6159j7917j0265L514
23618A2855J5789o790r197q564m270j1400o912J080K0618M863Q602j0264P30j0402
$$ plain form
23710 -5767 14266 20144 15622 26222 41777 32536 23296 16246 34286 18280 -10537 -5653 -3853
23697 -3853 -5963 -29003 -27875 -19096 -9910 -2706 -1693 -11077 4304 254 9239 27632 30072 31968
23683 31968 -9250 -28464 -13807 -12375 -45668 -30112 -30609 -27812 5862 15253 23787 57171 58345
23670 58345 29789 6518 -5464 -7879 -18074 -14367 -14543 8388 15032 -8968 8134 11103 -7099
23657 -7099 -25323 -20737 1525 10726 2141 23286 39487 35873 18903 -6723 -6295 -27248 -14839
23644 -14839 -423 7510 -3065 -15717 -14954 -8974 -26271 -39858 -17986 -2037 6923 12314 -8373
23631 -8373 -14671 3749 927 -11017 -19111 -3438 10168 20629 21364 37523 19606 9341 12855
23618 12855 28644 21854 12657 4093 -177 -11577 -18489 -17409 3209 8072 16674 6410 7140 -3262
23604c262J678K720Q400M135N651L2812R013k7405k9541K692k5206K169l240J658
23590a7726o394j1450N443J4104J2799r278j1346J4048K9132j6859k460J5763
23578A5776n417k6234j9868j4211J1999J9478l427J2881P449m902r12j8696l723
23565b9807k7489L6397J2490J085P078L271k605j3816J286k0054k856K6479M5412
23552C6871P454J075j1991l6954l6699j2403J3375L1335J754n541L088k826k95
23539a1757J5484K6796k1452l4373K2412K0367k4401R019M244R736M238j3736
23527F577r755k3289k565K1127q916k2928n924M88k20J5023J1635K6951Q736J3533
23513C0473M455m474p141j7454j2454j9208j5145j5284J1727J8563K7715J4266
$$ plain form
23604 -3262 -1584 1136 9536 13671 19322 52134 61147 33742 4201 6893 -18313 -16144 -19384 -17726
23590 -17726 -24120 -35570 -30127 -16023 -3224 -12502 -23848 -9800 19332 2473 13 15776
23578 15776 10359 -15875 -35743 -49954 -37955 -18477 -21904 -9023 -1574 -6476 -7388 -26084 -29807
23565 -29807 -57296 -20899 -8409 -7324 -246 3025 420 -13396 -12110 -32164 -35020 -8541 36871
23552 36871 44325 45400 33409 -3545 -40244 -52647 -39272 -7937 -6183 -11724 -8636 -11462 -11757
23539 -11757 3727 30523 9071 -25302 -2890 17477 -6924 2095 6339 16075 20313 6577
23527 6577 -3178 -26467 -29032 -7905 -16821 -39749 -45673 -45185 -45405 -30382 -18747 8204 16940 30473
23513 30473 34928 30454 23313 5859 -6595 -25803 -40948 -56232 -44505 -25942 1773 16039
23501A6039j6230K0142Q190j9854k2388K6041L6011K6740j1477k5383k2489L3230
23489D8572q42k0850p192j3108R48K0170k148k3626q373L352j0248J3235L587
23476C477k8603j7845K5566K3790r958j2792M221k2647l933L3019K5056q296m630
23463F425j0010N106J6421l019n64l374j6148P696R969M247J2869q813j1796j474
23449G535j5092l932J0209K0647j3768r607j8520j4897j4992J8528J4670L207
23437a6012K183J6938j2283m441N99N025j9721j5184J4035K9814m116K4304k442
23424A8699J5698j5182m2744k0432j6242J6748L0407R322n603J8946J4632J931
23412B6180o374O683K514k378r169J997n696Q272J4988l251n762n709j9835J1595
$$ plain form
23501 16039 -191 19951 28141 8287 -14101 11940 47951 74691 63214 37831 15342 48572
23489 48572 47730 26880 19688 6580 7528 27698 25550 1924 -6449 -3097 -13345 -110 3477
23476 3477 -25126 -42971 -17405 6385 -3573 -16365 -12144 -34791 -38724 -5705 19351 11055 6425
23463 6425 -3585 1521 17942 14923 14359 10985 -5163 2533 12502 16749 29618 20805 9009 7535
23449 7535 -7557 -11489 -1280 19367 5599 -4008 -22528 -37425 -52417 -33889 -19219 -16012
23437 -16012 -13829 3109 -9174 -13615 -13016 -7991 -27712 -42896 -28861 953 -3163 21141 18699
23424 18699 34397 19215 -23529 -43961 -60203 -43455 -13048 -3726 -9329 9617 24249 26180
23412 26180 19806 26489 29003 26625 17456 19453 13757 22029 37017 33766 28004 22295 2460 14055
23398A4055n040M851P717j0722m211k724J7034j8822Q650o422q242O579R46l692
23384d3J1682p412q490k929J0947R662J3060p11p005j8303L103j462j0692J965
23370f628N000m857k865M752K9928j1306q467k1120J599j2532j4595K3973L2225
23357A5107J5362l145j0949k4189N721K2109q887j1053j0617J702j4501J2383
23345a0957J5618j6924P935N1697p880m1133J3298n476j5008J9270J1770j9364
23333B846Q74R002k4271l261L901K931L2P67o650K5071K9360P972j2531j5203
23319B0840N466L75J2827j5184k0234r343J6280j6815k5079J6705R337n231M541
23306e515O847K0679l6486l5620o809J3246j3324J108J9131K5613J9238O446k9882
$$ plain form
23398 14055 9015 13866 21583 10861 6650 3926 20960 2138 10788 4366 -3876 2703 3649 -43
23384 -43 11639 4227 -4263 -7192 3755 13417 26477 25766 18761 458 3561 2099 -8593 -6628
23370 -6628 -1628 -6485 -9350 -4598 25330 14024 5557 -15563 -13964 -26496 -41091 -17118 15107
23357 15107 30469 27324 16375 -7814 -2093 20016 11129 76 -10541 -8839 -23340 -10957
23345 -10957 4661 -12263 -4328 47369 39489 -1644 11654 6178 -8830 10440 22210 2846
23333 2846 3720 12722 -11549 -14810 -10909 -7978 -7946 -7179 -13829 11242 40602 48574 36043 20840
23319 20840 26306 26681 39508 24324 4090 -5253 11027 -5788 -30867 -14162 -4825 -10056 -5515
23306 -5515 1332 22011 -14475 -50095 -56904 -43658 -56982 -55874 -36743 -11130 8108 14554 -15328
23293a5328j7263K152j7458r38J8434K5269K174R408R428L204N185N699J3130
23280D3096k796l573o460j0559k3991l0886l540j789J1774J4286J2824J5270J292
23267A4948j9603q886O66o332K0511L3045Q979m2745k2707K9636O740J9745n831
23254B8166j9505l1600M945K3394O196J8568j1834l2120j7170j6271J0768J2459
23242b4004L81R614K950L5J2123o1j6736J6274n944j1128J1624k6979m665o87
23228c7203j7944N030N529l154K3223q92J1351j267j0653P525J0999Q257L459
23215D260o391K3986j7995n149M057K5190j941k6158o019q731k6399j0439N259
23202d6470K5211K0581k208J5927j4892k1139J4238K5472j4064N381J4634m85
$$ plain form
23293 -15328 -32591 -30439 -47897 -48835 -30401 -5132 -2958 6450 15878 19082 24267 29966 43096
23280 43096 40300 36727 30267 19708 -4283 -35169 -38709 -40498 -28724 -14438 -1614 13656 14948
23267 14948 -4655 -13541 -12875 -19207 1304 34349 43328 583 -22124 7512 14252 33997 28166
23254 28166 8661 -22939 -17994 5400 11596 30164 18330 -13790 -30960 -47231 -36463 -24004
23242 -24004 -23623 -14009 -11059 -11024 1099 1038 -15698 576 -5368 -16496 -4872 -31851 -36516 -37203
23228 -37203 -55147 -50117 -44588 -47742 -24519 -25411 -14060 -15327 -25980 -18455 -7456 801 4260
23215 4260 -2131 21855 3860 -1289 2768 27958 26017 -141 -6160 -14891 -41290 -51729 -46470
23202 -46470 -21259 -678 -2886 13041 -1851 -22990 -8752 16720 2656 8037 22671 22186
23190B2186k7359l4208J8561M3239K1015l7582j2861j0704J6863j1347j8730j7267
23178d8194j8444J9549L3142M0844r010L4550K0781k8799k9896O872n63j478J9852
23165C9206K695j3587O808k343J7570k9955n669N994J805J3583k139k4859l692
23152E417J2730L416J2503J879j444L294m0367k5028N498J5995P95j7486q466
23139c1264J4592m186R086K4032j4276k1443j1829J3167m586J8046J0839N613
23127G791J4094j0556j3301R577j0473K412P887J1804P833k4981J6774L8454M12
23114E7727k6532k7318m829J0403l178m713k0557q057o762j733Q214K9902J2106
23101A4673k0220p153O219J1463J5082k1656j7401K2006K7140k0759m434Q813
$$ plain form
23190 22186 -5173 -39381 -20820 22419 43434 5852 -7009 -17713 -850 -12197 -30927 -48194
23178 -48194 -66638 -47089 -13947 26897 17887 52437 73218 44419 14523 21395 20832 19354 39206
23165 39206 41901 28314 35122 32779 50349 20394 14725 20719 22524 36107 33968 9109 5417
23152 5417 18147 21563 34066 35945 34501 37795 -2572 -27600 -22102 -6107 -5312 -22798 -31264
23139 -31264 -16672 -20858 -11772 12260 -2016 -23459 -35288 -22121 -26707 -8661 2178 7791
23127 7791 21885 11329 -1972 7605 -2868 -456 7431 19235 27068 2087 18861 57315 57727
23114 57727 31195 3877 -952 9451 6273 1560 -18997 -27054 -33816 -35549 -27335 2567 14673
23101 14673 -5547 -12700 -6481 4982 20064 -1592 -18993 3013 30153 9394 4960 13773
23089A3773k9748R271M041k2501N787K7499j5951j2214k2739J8675N061k9694
23077d8740k9021L4K9406M1456M947O096p966J392m627k920J1587n035k5708n834
23063c4933K2761J4515N555j4627M162Q097J3677N056o703J316O144j4459j5765
23050e204k8757p114n752L4062K5857k6160J587R414J0693M1589j1642j9013P070
23037B6630m374J847Q618k8531r60J2123K3525j0170k1302l1269M505p10K9612
23024I544K378l1734k6380Q307K2855K3428K6336J2867l6676N484R251k7448j8870
23011b0658N078k244J470j3806j3040j7172K0283L3608Q639l227J0580k1337l9561
22998e1387L54J5151n249m368P646K0426r74l074K2323p664j4532K0758J9607
$$ plain form
23089 13773 -15975 -6704 -2663 -25164 -19377 8122 -7829 -20043 -42782 -24107 -19046 -48740
23077 -48740 -77761 -77727 -48321 -6865 -1918 4178 -3788 -2396 -7023 -9943 1644 -3391 -29099 -34933
23063 -34933 -12172 2343 7898 -6729 -2567 5530 19207 24263 17560 18876 25020 10561 -5204
23050 -5204 -33961 -41075 -46827 -12765 13092 -13068 -11481 -2067 8626 50215 38573 19560 26630
23037 26630 22256 24103 32721 4190 3230 15353 38878 28708 7406 -23863 -19358 -20068 9544
23024 9544 11922 -19812 -46192 -37885 -15030 8398 34734 47601 10925 16409 25660 -1788 -20658
23011 -20658 -15580 -17824 -16354 -30160 -43200 -60372 -40089 -6481 2158 -1069 9511 -11826 -51387
22998 -51387 -51033 -35882 -41131 -45499 -37853 -17427 -18401 -21475 848 -6816 -21348 -590 19017
22985A9017p031j597J3717K707r222m371j1690k1475N939j4634j7803J5798L8478
22972G833O997Q429R194j0463l07m575j0554K7313o928r385o186j9111k6201M384
22958b9560j1587m225J2208K6219j3946p037J4707M1102K0659R724N002k9878
22946C3388N646L1066j4502R43n804j3567l037k4039m0203K4461O808m067O081
22933C174O495Q32n6j399k5158p605j371k4170j0177L2222N0356p118j7973L979
22919B031M953J3q002J975R958l517P773J7559n910p26O592J046R188O576N74
22904E0083k9651k0401j4238k4389K9988L1169j7100l1855m303l452J2204J0653
22892a1292J762M637J3662K378m1423J823L786q278k0187M258M4914M0115L417
$$ plain form
22985 19017 11986 10389 24106 26813 17591 13220 1530 -19945 -14006 -28640 -46443 -30645 7833
22972 7833 14830 23259 32453 21990 21683 17108 6554 33867 26939 17554 11368 -7743 -33944 -29560
22958 -29560 -41147 -45372 -33164 -6945 -20891 -27928 -13221 27881 48540 58264 63266 33388
22946 33388 39034 70100 55598 56541 50737 37170 34133 10094 -30109 -5648 1160 -2907 3174
22933 3174 9669 10501 10445 9046 -16112 -23717 -25088 -49258 -59435 -27213 23143 16025 -1948 2031
22919 2031 6984 6997 -1005 970 10928 7411 15184 32743 26833 26107 32699 33745 42933 49509 50083
22904 50083 20432 31 -14207 -38596 -8608 22561 5461 -26394 -30697 -34149 -21945 -11292
22892 -11292 -9530 -4893 8769 11147 -30276 -28453 -24667 -32945 -53132 -48874 -3960 36155 39572
22879C9572p79J9255l8990j0709L475p357n412N587j5212k2439k5340k5814M620
22866g9543J9117K0975L8858l396J1489L1918P344P066j1703L662k924j0293j8927
22853A3643k3971M7735N177Q203R14l0825L534J4407j7977P614N24j9481m4494
22840c4997l0609P207J7044R275j011J4210r34J0218k4071L0934M0801o761k0611
22827A0695l3930J950N448L793j7333Q607p24k531K8502O7j6392P627J1445j0563
22813c339O009n372l221J0101J8658r888j591n069n630k6201J8321r14k8000o539
22799d2675K8553J7840K631l239J5784J1620K9081J8002j0411q775k7414l7563
22787f566l4511j9264K8063K7634J8481O515J7943j2719k803l209k1968l011K2796
$$ plain form
22879 39572 38793 58048 19058 8349 11824 4467 -945 4642 -10570 -33009 -58349 -84163 -79543
22866 -79543 -60426 -39451 -593 -3989 7500 39418 46762 53828 42125 45787 42863 32570 13643
22853 13643 -10328 37407 42584 50787 51701 20876 24410 38817 20840 28454 28978 9497 -34997
22840 -34997 -65606 -58399 -41355 -32080 -33091 -18881 -19815 -9597 -33668 -2734 38067 31306 10695
22827 10695 -23235 -21285 -15837 -12044 -29377 -20770 -21494 -24025 4477 4544 -11848 -4221 7224 -3339
22813 -3339 2670 -2702 -5923 4178 22836 12948 11357 6288 658 -25543 -7222 -8136 -36136 -42675
22799 -42675 -14122 3718 6349 3110 18894 30514 59595 77597 67186 58411 30997 -6566
22787 -6566 -41077 -60341 -32278 -4644 13837 20352 38295 25576 22773 19564 -2404 -5415 17381
22774A7381J3512M62k5513O79m941k9760l2J9020m047r350k047j902L718J7515
22760e305J8829j467J1876n051j9659o220N432R05R0k764K5503j984q618k585
22746H982k8520l0131O915J9362M1845J7641j7698k0810k493J3331J5129K0439
22734D3992O999q446m710j7073O9p292j5473J0907J7808p723j767p069o151o890
22720b819J5496J7468l995L351j6807L211n747N737J3303J3518j1076j7709j8646
22707d715P279L5407n318n742L858K5201j3929j1589J4612n19j2340r031j3437
22694I737o124j5515K322k253j8527k8832J7562L0907L8506j0986j0779L579J708
22681A1305J1926j615J0714l02m592j3271L139n992k6088O597M789O539M908k0612
$$ plain form
22774 17381 30893 31355 5842 6521 1580 -28180 -28212 -9192 -13239 -22589 -24636 -26538 -22820 -5305
22760 -5305 13524 12057 23933 18882 -777 -6997 -1565 -660 -570 -3334 22169 20185 11567 8982
22746 8982 -19538 -49669 -42754 -23392 18453 36094 18396 -2414 -4907 8424 23553 43992
22734 43992 50991 42545 37835 20762 20831 13539 -1934 8973 26781 19058 17291 10222 4071 -2819
22720 -2819 12677 30145 26150 29501 12694 15905 10158 15895 29198 42716 31640 13931 -4715
22707 -4715 2564 37971 32653 26911 30769 55970 42041 30452 45064 44545 32205 23174 9737
22694 9737 3613 -11902 -9580 -11833 -30360 -59192 -41630 -10723 27783 16797 6018 9597 11305
22681 11305 23231 21616 32330 32028 27436 14165 17304 11312 -14776 -8179 -3390 3149 8057 -12555
22667a2555j4269j362Q244P888r958K598R098j994k238J3776P979L811L590J411
22653A6019J3454Q846N736J0181j8034j9529L296J6275M285j5623l2694j716K1483
22640A1979l0962k033q512J4033L5316M443l0212m624J6016K8558l345J3881k912
22627D1626n100K163j3895q207j4471L496J0788J45p686K75l1128R513L1479l2948
22613a3950K0534L2958K760k3340j1652q268J378j1054j1394l941j7766Q603L939
22600c1193L0668M618R275l455R156j2747N858q935K61J7262K4809L1143k5369
22587E1351k3325L6616k0707k277J1964M930k5673k1116N879K2477k4231L12l207
22574A2993q61Q600j9096j1866L785L3388k054l5780r0J5477j7578j4774M681
$$ plain form
22667 -12555 -26824 -28186 -19942 -12054 -22012 -19414 -10316 -12310 -14548 -772 7207 11018 14608 16019
22653 16019 29473 38319 44055 54236 36202 16673 19969 36244 40529 24906 -7788 -9504 11979
22640 11979 -18983 -21016 -29528 -15495 19821 24264 -5948 -10572 5444 34002 30657 44538 41626
22627 41626 36526 38689 24794 16587 2116 5612 16400 16545 8859 9134 -21994 -12481 18998 -13950
22613 -13950 6584 39542 42302 18962 7310 -958 420 -10634 -22028 -25969 -43735 -35132 -31193
22600 -31193 -525 4093 13368 9913 19069 6322 12180 3245 3506 20768 45577 76720 51351
22587 51351 28026 64642 43935 41658 53622 58552 32879 11763 17642 40119 15888 16200 12993
22574 12993 12132 20732 1636 -10230 -6445 26943 24889 -10891 -10981 4496 -13082 -27856 -23175
22561b3175P774K2209J0391J6606P667n517n385R750p359l6161n3Q936k0388L147
22547a1558K673j1518j610J0893K4179j8877l0133p87K3437J8179L4640J3023
22535E2541p613j3357q097r135o017P119L782m597k1740R499J6817q268L262R101
22521B3297M1573o73m631J25J7004j2351l5989j3774P23r090j974k7431j2586
22508c5777K2435R395K5802J5460j918m590l919K712M48j0552o503k8931j7063
22495c3001j9846o559L6564K6872j4623R921q331k911R713L22J3140K7291j2195
22482B6357K739l621q144K765j6893k0544j691J3218m178j2242k697q93K4805
22469a019K6263j7487k7794j3142k1138J9415M5518K5042J8793K2583J718j0839
$$ plain form
22561 -23175 -15401 6808 17199 33805 41472 35955 30570 40320 32961 -3200 -3253 5683 -14705 -11558
22547 -11558 -8885 -20403 -22013 -11120 13059 -5818 -35951 -36738 -13301 4878 39518 52541
22535 52541 44928 31571 23474 14339 8322 15441 19223 14626 -7114 2385 19202 10934 14196 23297
22521 23297 64870 64197 59566 59691 76695 64344 28355 14581 15304 6214 4240 -23191 -35777
22508 -35777 -13342 -3947 21855 37315 35397 30807 26888 29600 30048 19496 12993 -15938 -33001
22495 -33001 -52847 -59406 -22842 4030 -10593 -672 -9003 -11914 -2201 -1879 11261 38552 26357
22482 26357 29096 25475 17331 20096 3203 -17341 -19032 -5814 -9992 -22234 -24931 -25824 -1019
22469 -1019 25244 7757 -20037 -33179 -54317 -34902 10616 35658 54451 77034 78752 67913
22457F7913j8400J779J7854l394k7238k9135q541J503J6214K243m283J3837K959
22444C3311k196k3995j1276N1954Q357l1021k3450J9634J5467K423J285K390k2107
22431B0776k1198k0572M5555L3788n157R657p658l373j2592J16k6016j8243O377
22418A460K015J054L571J075j645K8436J4263j6778N143N127k9136j0329J5993
22405B0249L5016m600r285M395l7712k4016j2407L9545J8309n334l5429k0322
22393c1591J8042K3489J0979m175J3557k0031l4811K8035K7413q485m271J2908
22381C1059K6927R632m7195o161K4735K1558M976K729O137k481L5426j1925l5412
22368F0005K1072L0833J2149j0507l5425k3684J1285L606m276j0085j846j1970
$$ plain form
22457 67913 49513 51292 69146 65752 38514 9379 838 2341 18555 20798 16515 30352 33311
22444 33311 31115 7120 -4156 47798 56155 25134 1684 21318 36785 39208 40493 42883 20776
22431 20776 -422 -20994 24561 58349 53192 62849 55191 51818 39226 39342 13326 -4917 1460
22418 1460 3475 4529 8100 9175 7530 35966 50229 33451 38594 43721 14585 4256 20249
22405 20249 55265 50665 41380 45775 8063 -15953 -28360 11185 29494 24160 -11269 -31591
22393 -31591 -13549 9940 20919 16744 30301 10270 -24541 3494 30907 22422 18151 31059
22381 31059 57986 67618 20423 14262 38997 60555 65531 68260 74397 71916 107342 95417 60005
22368 60005 81077 111910 124059 113552 78127 54443 65728 69334 65058 54973 53127 41157
22356D1157k0041k2793O863J9419j34l3979m474J8681p168J8680J7210P397l824
22343C6994k7487k2948q5L6168J2942p319Q844Q416J2197N159J1101k5294J687
22330E0375R201j698Q435o091l048j6855j2686k579j2011J499o67k1502K0154
22317A2527J0010j955K732J5862J0060J4684J0443J0430L9986M9695N4796P1045
22305C00315Q9002N6008P2253N0507o8628j37558q7491m1359k9752l2872k9956
22294A40469k2616l130j8818k5680r070J2833j9535Q410P604K8317q84m350J8085
22281A11635k073p37j1758k3341j1136N168J18j642O762K900N084j6810k4853
22268C9317M947p293j5462k5231J5457N6085k03k3276K6240j4082j994K2599K7963
$$ plain form
22356 41157 21116 -1677 5186 24605 24471 -9508 -13982 4699 -2469 16211 33421 40818 36994
22343 36994 9507 -13441 -13526 22642 35584 28265 37109 45525 57722 62881 73982 48688 50375
22330 50375 59576 57878 66313 60222 57174 40319 27633 25054 13043 14542 13875 -7627 12527
22317 12527 22537 20582 23314 39176 49236 63920 74363 84793 124779 174474 229270 300315
22305 300315 389317 445325 517578 568085 499457 361899 274408 233049 203297 170425 140469
22294 140469 117853 114723 95905 70225 61155 73988 54453 62863 70467 98784 97900 93550 111635
22281 111635 109562 108825 97067 73726 62590 67758 67876 66234 72996 75896 80980 64170 39317
22268 39317 44264 36971 21509 -3722 11735 67820 67617 44341 70581 56499 54505 77104 105067
22255A05067q748r677l1205k6490j4155K2727K2870O797N199k2023J2795J0644
22243G3801j8731J159K817K836j2699k0167J2000J8126L0759J1641n820j5279
22231H0443p412q146J6056J9735k593k1392j4683K084J1011J9062J2355O13j4890
22218I2243l3467j4874K693q326L963J6536K3091J696L2679K9064k142J6652J8351
22205A78159K4783r720l4423k6177j6165J0546J5474K1861J7327K2862K912l3620
22193A73819j0002k38o038j075J0539j3600k1777l58J0981L4781M0986J3266K2572
22180B53856K5182L145o60M6215J5032K6850Q392k5284m4533m1792j8929j1464
22168B36010l1572J2745m917k156j4052K813p453O26k301J3866K4143K5836L38
$$ plain form
22255 105067 96319 86642 55437 28947 14792 37519 60389 67186 72385 50362 63157 73801
22243 73801 55070 56229 59046 61882 49183 29016 41016 59142 89901 101542 95722 80443
22231 80443 73031 64885 80941 100676 98083 76691 62008 64092 75103 94165 106520 107133 92243
22218 92243 58776 43902 46595 38269 42232 58768 81859 83555 116234 145298 143156 159808 178159
22205 178159 202942 193222 158799 132622 116457 127003 142477 164338 181665 204527 207439 173819
22193 173819 163817 163579 157541 156466 167005 153405 131628 131270 142251 177032 218018 231284 253856
22180 253856 279038 282183 281523 327738 342770 369620 378012 352728 308195 266403 247474 236010
22168 236010 204438 217183 212266 210110 196058 198871 191418 192044 189743 203609 227752 253588 253926
22155B53926k9042j7026O915L5495j352j2104q279O705k275O50Q00Q483J0035
22142B52931r00J7355L2175L0989n514r313l298m790q107J632J1422K376j1113
22129C05845M074K7213o896j6636J2407M9515K931j8330J6681J1363J4532l9414
22117C63285J2773K4638L5154N1134K4019J6681J6144L725m539K1332K8462L4933
22105F27741K7902j2615j1381M587M8507K9161L1765M0606L7867O1161O4639N0929
22093A000869L6343L0205L5962p242N161K0063O9592O7604M1557Q2340J17445
22082A499899J29715J11519J00019J31397J41393J54615J69764J90779K54727
22073B883827L44134M15257M54182M90948M63335L97707L22115L86297N34704
$$ plain form
22155 253926 224884 207858 214773 250268 248916 236812 228533 235238 232963 233613 234413 242896 252931
22142 252931 252031 269386 301561 332550 327036 317723 314425 309635 301528 303160 314582 316958 305845
22129 305845 309919 337132 330236 313600 326007 375522 378453 360123 376804 388167 402699 363285
22117 363285 376058 400696 435850 486984 511003 527684 543828 547553 543014 564346 592808 627741
22105 627741 655643 643028 631647 636234 684741 713902 745667 786273 824140 885301 949940 1000869
22093 1000869 1037212 1067417 1103379 1096137 1101298 1121361 1190953 1258557 1300114 1382454 1499899
22082 1499899 1629614 1741133 1841152 1972549 2113942 2268557 2438321 2629100 2883827
22073 2883827 3227961 3643218 4097400 4588348 5051683 5449390 5771505 6157802 6692506
22064F692506P72813J015476J342199J727301K269068L083700M340794O400013
22056B7643870J0252644J7672884L1074473N1556437P2866721P2640725L3397983
22049C17105737k4376586p9114633q0241608m8905604k7139081j5955064r889022
22042C1484139o444118m453889l177380k299949j732483j390005j088406q75457
22034A0022452p66906o51503n32763m27097l27646k50185k26537k55419l54737
22025F229659m47581m67320m50232l87876l28875k51781j87493j68086j65043
22016C375372j30873j24643j60502j73445j14723r1394j05799j08110j19797j30624
22006B115462r1630o5618m0327k8614m8460n0497n4512p0182o5233q663j9348
$$ plain form
22064 6692506 7465319 8480795 9822994 11550295 13819363 16903063 21243857 27643870
22056 27643870 37896514 55569398 86643871 138200308 211067029 283707754 317105737
22049 317105737 292729151 213614518 133372910 84467306 57328225 41373161 31484139
22042 31484139 25040021 20586132 17408752 15108803 13376320 11986315 10897909 10022452
22034 10022452 9255546 8604043 8071280 7644183 7316537 7066352 6839815 6584396 6229659
22025 6229659 5782078 5314758 4864526 4476650 4147775 3895994 3708501 3540415 3375372
22016 3375372 3244499 3119856 2959354 2785909 2671186 2579792 2473993 2365883 2246086 2115462
22006 2115462 2023832 1958214 1917887 1889273 1840813 1790316 1735804 1665622 1600389 1591726 1572378
21995A572378o1880n8592o3294p9693n3963l0558m4241n6299l0479o527n0638
21984A036214k0732M737k0763n4410j3624k8724m6849l7002l4675n20J741n4022
21972G31371n6645k0831j7598P875n0090m7360p657K1579J9061p750j1202L874
21960E64627k6875k8327k6303k9907l999k4257k9699j3268Q968r967L597l492
21948C81098J1219j4137k0081m916j7312m4466m0750J7954M928j5555K091O313
21936B66386J7300o3j3142o321L106j6999j5126k452J5097J3730M2229P9169O3316
21923D46230L1625p066o5532o2150m8891p2953n3794l2487j4324P04r822J378
21911A12918J8164r612q957r242q777l4759j3373p835J6053J6701O637J9129j0415
$$ plain form
21995 1572378 1510498 1451906 1388612 1308919 1254956 1224398 1180157 1123858 1093379 1086852 1036214
21984 1036214 1015482 1020219 999456 945046 931422 902698 855849 818847 784172 783652 785393 731371
21972 731371 674726 653895 636297 644172 594082 546722 539065 560644 579705 571955 560753 564627
21960 564627 537752 509425 483122 453215 449216 424959 395260 381992 390960 380993 384590 381098
21948 381098 392317 378180 358099 353183 335871 291405 250655 268609 273537 257982 260073 266386
21936 266386 283686 283623 270481 264160 267266 250267 235141 232689 247786 261516 303745 382914 446230
21923 446230 477855 470789 405257 343107 294216 221263 167469 134982 120658 121362 111540 112918
21911 112918 131082 121470 112513 103271 94494 59735 46362 38527 54580 71281 77918 97047 86632
21898H6632k0918l475j331m609Q31l3231k8363J5161K2058K2557q599m285J1407
21885E3835K8728M621m275p401R443K0857j6454m0867K717J4577j9843r008J1931
21872D8861J7702M2377J4126k1628l1097k6491o575k0821Q530J995j7078M86k7972
21859a7585J2615J224L0848o36l01K4106O412J7745l5055k6784k3571R721N981
21846D720J6304J3027k703k587p519j4013q705J4288J3547K3843N827l5864j5114
21833E051K2604L6974j8521m8144m7190j607Q423J2151J5285K5454j1594k2477
21821b3591p696K0313P572k5364o338L105K989p973J5276M5994J1048j1452J0627
21808C4510N218m5142j2896k271m062j5380M3898J1515k7344k8050J4604M4128
$$ plain form
21898 86632 65714 62239 60908 56299 57130 23899 -4464 10697 32755 55312 46713 42428 53835
21885 53835 82563 87184 82909 75508 84951 105808 89354 48487 51204 65781 45938 36930 48861
21872 48861 66563 108940 123066 101438 70341 43850 37275 16454 24984 26979 9901 10387 -17585
21859 -17585 -4970 -3746 27102 26466 26165 50271 56683 74428 39373 12589 -10982 -1261 4720
21846 4720 21024 34051 31348 28761 21242 7229 -1476 12812 26359 50202 56029 20165 5051
21833 5051 27655 64629 46108 -2036 -49226 -50833 -42410 -30259 -14974 10480 -1114 -23591
21821 -23591 -31287 -10974 -3402 -28766 -35104 -31999 -29010 -36983 -21707 24287 35335 23883 34510
21808 34510 39728 -5414 -18310 -20581 -24643 -40023 3875 15390 -11954 -40004 -25400 18728
21796A8728J8951k2312l2752j7663j3763J5970J1401L454K008k550O054J8014
21784E540j402k4624M494J8507o331k27j8017j1915k0999q886K313O530Q11j0808
21770f5014J3509K96K0370J000o26O589j6877M284J4530K3206K0944M0280o713
21757E5778k2876k7780L333J9699J5482j085K848K3175J2717j9931l4028k9195
21745a863j0553j6178N829n295K2215n98o509m037k6074o6J7629N5749j5956j8277
21731c984j775N052l2281p159j8699J0169q237j5161K1134L2934k696j4285N967
21718b9021J7542j6620k0700O283J1639J6610K409j3969j466j0110j0076j3353
21706f0832k984J3385k1786K0191L1167J6200O0j0498q139K9321K1636j5500o034
$$ plain form
21796 18728 37679 15367 -17385 -35048 -48811 -32841 -21440 -17986 -15978 -18528 -12474 5540
21784 5540 4138 -20486 -15992 2515 -3816 -4043 -22060 -33975 -54974 -63860 -61547 -55017 -54206 -65014
21770 -65014 -51505 -51209 -30839 -29839 -30465 -23876 -40753 -36469 -21939 1267 22211 62491 55778
21757 55778 32902 5122 8455 28154 43636 42551 45399 68574 81291 61360 27332 -1863
21745 -1863 -12416 -28594 -22765 -28060 -5845 -6443 -12952 -16989 -43063 -43129 -25500 30249 14293 -3984
21731 -3984 -5759 -707 -32988 -40147 -58846 -48677 -56914 -72075 -50941 -18007 -20703 -34988 -29021
21718 -29021 -11479 -28099 -48799 -42516 -30877 -14267 -11858 -25827 -27293 -37403 -47479 -60832
21706 -60832 -63816 -50431 -72217 -52026 -20859 -4659 -4599 -15097 -23236 6085 27721 12221 6187
21693F187L4177M706j8261k8676j0691O38j621K5664K4702k6037J5879j0359k5443
21680i135k8944k0419j5942r195K6289L2543k0934J4901j5222m851J9721J7920
21668a3268K569O127O69P860k2824l4251J3655K7294K274L1271r011l2455l3238
21655e3328O973J2031r007j5633K508Q794M25J8787O416P146J9979J7353Q343
21642C0787L380k5576p044j6805k5895j4879J852K4164J2055K341J1626p244J8802
21629G564J1800J0972J330k495J2543j6215l1150n160Q840J3283J2615j8694m1372
21616c6139l137r96o549k6246L0993K7221j3062M145J869n03J3476m19k142n205
21602a6694K3475P47P298L819l4225K12j6597j27k2972P659J5086P68m212K4864
$$ plain form
21693 6187 40364 45070 26809 -1867 -12558 -11920 -13541 12123 36825 10788 26667 16308 -9135
21680 -9135 -38079 -58498 -74440 -83635 -57346 -24803 -45737 -30836 -46058 -50909 -31188 -13268
21668 -13268 -10699 -4572 -3903 3957 -18867 -53118 -39463 -12169 -9895 21376 12365 -20090 -53328
21655 -53328 -46355 -34324 -43331 -58964 -56456 -47662 -47237 -28450 -22034 -14888 5091 22444 30787
21642 30787 34167 8591 1547 -15258 -41153 -56032 -54180 -30016 -17961 -15620 -3994 -11238 7564
21629 7564 19364 30336 31666 29171 41714 25499 -5651 -10811 -1971 11312 23927 5233 -36139
21616 -36139 -39276 -40272 -46821 -73067 -42074 -14853 -27915 -23770 -21901 -22404 -8928 -9347 -11489 -16694
21602 -16694 6781 7528 14826 18645 -15580 -15368 -31965 -32092 -55064 -47405 -32319 -31551 -35763 -10899
21588a0899J5725K6758j3622l0386r291l7704j5212J8867L2110K9715K0659R89
21576B7709K378j9103k8762l1108p637L1000K8942R794l4439j0263J7417J5691
21564A619j0521L783L1740Q12j2245j9927K460J1927j9221j607k474N898j248
21551i004j3955j8882M7150K6502j7555r657l0564J2294K0049O231R91r031r992
21538e423j1201M666K3939q565j5579r126J6077j3070l1972k1070J0184P414j1465
21525f5191J9819K8175N978l0885j0423R594K8207J6220J1971n006M192K22j1015
21512A858j3604M651k2831l1572L135J7955K0168J3134j5563q400L187P317P21
21499a9844p412K3319K7650q648k0715N75K5395N615p767j7367k279N214j0202
$$ plain form
21588 -10899 4826 31584 17962 -12424 -21715 -59419 -74631 -55764 -23654 6061 26720 27709
21576 27709 30087 10984 -17778 -48886 -56523 -25523 3419 13213 -21226 -31489 -14072 1619
21564 1619 -8902 -5119 26621 27433 15188 -4739 -2279 9648 -9573 -11180 -13654 -7756 -9004
21551 -9004 -22959 -41841 5309 31811 14256 4599 -25965 -13671 6378 12609 13600 4569 -5423
21538 -5423 -16624 -11958 11981 3416 -12163 -21289 -5212 -18282 -50254 -71324 -61140 -53726 -65191
21525 -65191 -45372 -17197 -11219 -42104 -52527 -42933 -14726 1494 13465 8459 12651 12873 1858
21512 1858 -11746 -7095 -29926 -61498 -58363 -40408 -20240 -7106 -22669 -31069 -27882 -20565 -19844
21499 -19844 -27256 -3937 23713 15065 -5650 -5075 20320 25935 18168 801 -1478 3736 -6466
21486f466N450J7022P839j4892j6220l903j329k4257k80n317M052l251k851M0528
21472c875J0043J54j1429k2155N17o602o204o130J2457J733J5798K0327R652k0400
21458f114q917p036k260j4043j1456q166o533J0550n99K2562p301j1779M4075
21445g017K0579k440r517l643L815l805o96k4224m300J2190N535J4294J413J2933
21431A5117J2971j71j0452j0402l5550j5407j5141j5166J8825J8007L3390J1236
21419G257M105m4937Q07K4081j6709p855j1572J7278N385O509R357k4667J7838
21406a3123M252j3053k493J2475r617k9130m938m720K6834P234p413l19j0687
21393d4698K41j7191q2K2663l7818J232K4324J5625P123J3823J094P199J3293
$$ plain form
21486 -6466 -1016 16006 23845 8953 -7267 -11170 -12499 -36756 -37036 -42353 -38301 -41552 -44403 -3875
21472 -3875 6168 6322 -5107 -27262 -26745 -33347 -39551 -45681 -33224 -31491 -15693 4634 14286 -6114
21458 -6114 -15031 -22067 -24327 -38370 -49826 -57992 -64525 -53975 -54574 -32012 -39313 -51092 -7017
21445 -7017 13562 11122 1605 -2038 1777 -2028 -2724 -26948 -31248 -19058 -13523 771 2184 15117
21431 15117 28088 27917 17465 7063 -28487 -43894 -59035 -74201 -55376 -37369 -3979 7257
21419 7257 11362 -33575 -32768 -8687 -25396 -33251 -44823 -27545 -22160 -15651 -6294 -30961 -13123
21406 -13123 -8871 -21924 -24417 -11942 -21559 -50689 -55627 -60347 -33513 -26279 -33692 -34011 -44698
21393 -44698 -44457 -61648 -61730 -39067 -76885 -75653 -51329 -35704 -28581 -14758 -13664 -6465 6828
21380F828k3246j2327P750r007M50P367j6016O893j1062j7371k073J3341K272
21367d6201J3230J8421N869M785o181p496k444J5478R753j3804l66k7588l1946
21354f8490J37O716P045J8192L7668J8369l383j4001j9651l454N510p67j4711
21341c0820P819J2936m963O140J0477N075j0312k8079j9882J10K4910K030k912
21328b7471L6186M478k7629k6924O258J6124k0137j2965j0620K322l964j754Q237
21315e7859K3925M708J7097J1521J5560r268R024j520K654l4153j6723m041J508
21302c7567N711J084K2603J5934j1386j777R336q008l4774k9146J9953J6195J9537
21289a2305Q234L184j2409K1432P071k8930J2255L550j560m626O448l716P952
$$ plain form
21380 6828 -16418 -28745 -20995 -30002 -29552 -22185 -38201 -31308 -42370 -59741 -61814 -48473 -46201
21367 -46201 -32971 -14550 -8681 -3896 -10077 -17573 -20017 -4539 5214 -8590 -8956 -36544 -68490
21354 -68490 -68353 -61637 -54592 -36400 1268 19637 16254 2253 -17398 -20852 -15342 -16109 -30820
21341 -30820 -23001 -10065 -15028 -8888 1589 6664 -3648 -31727 -51609 -51499 -26589 -24559 -27471
21328 -27471 8715 13193 -14436 -41360 -35102 -18978 -39115 -52080 -62700 -60378 -64342 -66096 -57859
21315 -57859 -33934 -29226 -12129 -608 14952 5684 14708 13188 15842 -18311 -35034 -39075 -37567
21302 -37567 -31856 -30772 -8169 7765 -3621 -5398 3938 -4070 -38844 -67990 -48037 -31842 -12305
21289 -12305 -4071 -887 -13296 8136 15207 -13723 -1468 2082 522 -4104 2344 -1372 6580
21276F580j6370m413J7685j4193J0086K1269L449j4605k0566j1120J8123J0597
21264F522k355j1691j4264j2647R78k731k4089L1928J1802j4518j5660j1383K3167
21251c4941Q458j9304l283K1215J2895j5044j729K1685O867K5031n585j2739j0902
21238g376r703N948o895O458J3271j5207L744K205j6926o558J8091J8015P148
21225A2215j4661J0986K411J5844j4261j6917k5697l402J2994J8854p98j2622
21213a5054M751j0030Q409N195K05j6192O126k423K0753k9455J4677Q917j7440
21200b1561j2901L0247R458L241J4185j3125j5201j129j9428l0108J2866K4438
21188a9018j3989N684M618k109Q834O77j8177j04n020o225J3848J8083p677r660
$$ plain form
21276 6580 -9790 -14203 3482 -10711 -625 20644 24093 9488 -11078 -22198 -4075 6522
21264 6522 4167 -7524 -21788 -34435 -33457 -36188 -60277 -28349 -16547 -31065 -46725 -58108 -34941
21251 -34941 -26483 -45787 -49070 -27855 -14960 -30004 -31733 -10048 -3181 21850 16265 3526 -7376
21238 -7376 -17079 -11131 -18026 -11568 1703 -13504 -9760 -7555 -24481 -31039 -12948 5067 12215
21225 12215 -2446 8540 10951 26795 12534 -4383 -30080 -33482 -20488 -1634 -2432 -15054
21213 -15054 -10303 -20333 -11924 -6729 -6524 -22716 -16590 -19013 1740 -27715 -13038 -4121 -21561
21200 -21561 -34462 -4215 5243 8484 22669 9544 -5657 -6786 -26214 -56322 -43456 -19018
21188 -19018 -33007 -27323 -22705 -24814 -15980 -15303 -33480 -33584 -38604 -44829 -30981 -12898 -20575 -30235
21174c0235m412K5273l153k5749J9155K7884l6134j495o264Q86q088J0895J8336
21161a3101K1447l2718l4158p666K3157K879r769l887J739J7388k966K80r637
21148d7012L0830j5138L992r750n45n031l309j6910j4928J2723K5996K322k3164
21135e9924j8197K8792K5439L3421J0185l2491q811J994j4675j2629j2216N262
21123e3850L597O884R300Q182j513p087r454j8112K826K8704r52k243J8789j2157
21109b7086J0472l859N433n723l65L3108O06k0791L600J9279L1438l10l7315j9974
21095a1487m6l627J990p334j0026J458j9007q127K9393P145N283J6062P082k4905
21081a6146M466K9854j0024k36J8412J0695k2535k0767q566R254j929m818l409
$$ plain form
21174 -30235 -34647 -9374 -12527 -38276 -19121 8763 -27371 -28866 -35130 -34244 -42332 -31437 -13101
21161 -13101 8346 -24372 -58530 -66196 -43039 -40160 -49929 -53816 -52077 -34689 -37655 -37375 -47012
21148 -47012 -16182 -31320 -27328 -37078 -37623 -42654 -45963 -62873 -77801 -65078 -39082 -36760 -59924
21135 -59924 -78121 -49329 -23890 9531 19716 -12775 -21586 -19592 -34267 -46896 -59112 -53850
21123 -53850 -50253 -43369 -34069 -25887 -27400 -34487 -43941 -62053 -59227 -30523 -31475 -33718 -14929 -27086
21109 -27086 -16614 -20473 -15040 -20763 -21128 11980 12586 -8205 -4605 14674 46112 45802 8487 -11487
21095 -11487 -11533 -15160 -13170 -20504 -30530 -29072 -48079 -56206 -26813 -19668 -14385 1677 8759 -16146
21081 -16146 -11680 18174 8150 7914 26326 37021 14486 -6281 -14847 -5593 -7522 -12340 -15749
21068a5749N541p213r292p773j2948J0615L4128K7342o462k6167j2314k1080j0382
21055e1754O388J1169L8698J5912l924Q834K6747j6612j9893M800J1522J8568
21043E0455r64N387k4426n5092k655j2122j532L1988K9081j7861j8403j8934m934
21030d0012K5502K4508J6418j086o354K787j8798j3448k2193j3926j717K979P962
21017c7378K6870j2121j9857K3698J2747j3915m944p272M786K0306p883L427R438
21004b098j6216K0061K5135l7157m270K3796Q87l6152o940M533l1116j5495M5913
20991b9119L9568L0813J1171j9067k1043j455P211J362N559j0806Q467J9763k1001
20978B1423j2248K160p786j6156J4048J1537k3288J1278l961L1492R657k4924
$$ plain form
21068 -15749 -10208 -17421 -26713 -34486 -47434 -36819 -2691 24651 18189 -7978 -20292 -41372 -51754
21055 -51754 -45366 -34197 4501 20413 16489 25323 52070 35458 15565 20365 31887 50455
21043 50455 49491 54878 30452 -24640 -27295 -39417 -40949 -8961 20120 2259 -16144 -35078 -40012
21030 -40012 -14510 9998 26416 25330 18976 21763 2965 -10483 -32676 -46602 -48319 -45340 -37378
21017 -37378 -10508 -22629 -42486 -18788 -6041 -19956 -24900 -32172 -27386 -7080 -14963 -11536 -2098
21004 -2098 -18314 1747 26882 -10275 -14545 9251 10138 -26014 -32954 -28421 -59537 -75032 -29119
20991 -29119 10449 41262 52433 33366 12323 10868 18079 19441 25000 14194 22661 42424 21423
20978 21423 9175 11335 3549 -12607 1441 12978 -10310 968 -2993 28499 38156 13232
20966A3232j6560K1648m793j6756n580j6174l6450O238M8804M2704k5905j5137
20954d729J2477J0333R598j3323j3272j1342j1142j7245K3430k31Q259J4440M417
20941A1670m061m926k8515O939p834K012L1831K2700p600k0039j8921J0627q898
20928a5015j082K7580L354m767O053J825P549j025p169n889k9195k1597j2027
20915e1405J8852K3403J5467J006J7166k0643k0881K8185L791M600L099N31l5979
20902a2808k0678J34k731K3225P416l5551j9793J1700K4378J133j6541N617J6862
20889a7637p806K1807J3613j0533J295o822J4663J0624l8734r886o091Q934K5509
20876a064q628l7282r052K3280k240K6692L790j9287p296j7112J8233K2869Q52
$$ plain form
20966 13232 -3328 18320 13527 -3229 -8809 -24983 -61433 -55195 -6391 36313 10408 -4729
20954 -4729 7748 18081 27679 14356 1084 -10258 -21400 -38645 -15215 -15446 -7187 7253 11670
20941 11670 7609 2683 -25832 -18893 -26727 -24715 7116 29816 22216 2177 -16744 -6117 -15015
20928 -15015 -16097 11483 14837 10070 16123 17948 25497 24472 17303 11414 -17781 -39378 -51405
20915 -51405 -32553 -9150 6317 7323 24489 3846 -17035 11150 14941 19541 22640 23171 -12808
20902 -12808 -33486 -33352 -36083 -12858 -5442 -40993 -60786 -49086 -24708 -23575 -40116 -34499 -17637
20889 -17637 -25443 -3636 9977 -556 739 -6083 8580 19204 -19530 -29416 -35507 -26573 -1064
20876 -1064 -9692 -46974 -56026 -32746 -34986 -8294 -4504 -23791 -31087 -48199 -29966 -7097 -6245
20863f245j2115J1520J5403L0549j5033m8844J52L0452K3108n150m5826k6713
20851d8742R912N815q917K8295Q218P155k875k564K467J1127j2404Q26k0897j3361
20837c5945m013J8224K06p974K6981p137l1502j3742J9176J7692l4569J2189J0564
20824b9850Q805o034J0427M980J3769j4120n271p855N37m572Q344Q015q29r113
20810b2767P751l922K1737M156j9905J1687p430O212n953J501J1480j2686k2298
20797c0437O286M3073L1487J0828k7684j9977l2053Q497j3830p15q5Q303j725
20784a8032j2040P402o171J4269N979j0443J7600J8618l2832j5993r02L279m43
20771b9709r361L8k533J8515r496J6921K6228J4452j5413m781n839Q893j7233
$$ plain form
20863 -6245 -18360 -6840 8563 39112 24079 -24765 -24613 5839 28947 23797 -22029 -48742
20851 -48742 -38830 -33015 -41932 -13637 -5419 1736 -1139 -3703 -1236 9891 -2513 -1687 -22584 -35945
20837 -35945 -39958 -21734 -21528 -29502 -2521 -9658 -41160 -54902 -35726 -18034 -52603 -40414 -29850
20824 -29850 -21045 -27079 -16652 -11672 2097 -12023 -17294 -25149 -24612 -29184 -20840 -12825 -13654 -22767
20810 -22767 -15016 -18938 2799 6955 -12950 -1263 -8693 -2481 -8434 -6933 4547 -8139 -30437
20797 -30437 -24151 18922 50409 61237 33553 13576 -18477 -9980 -23810 -24525 -24610 -16307 -18032
20784 -18032 -30072 -22670 -28841 -14572 -8593 -19036 -1436 17182 -15650 -31643 -32545 -29266 -29709
20771 -29709 -39070 -39032 -41565 -23050 -32546 -15625 10603 25055 9642 4861 -978 7915 -9318
20758i318n71K81K4897j6531j8186k6550P730L4415q819k1794P87j217r689k526
20744d7091n938j4113R186L0096J6317K4434L2047L540k942k4397k8541J0188
20732B786K9986k713j5520j5172j2145K651k190Q523J671k3095k5143k936j1643
20719f4940J5492L4714M874j6821j3687P012K8450O835j7940l561R577L634n246
20706a1607K526k4573k060o26J3221P039l692R159j7677n201j2667j2697J2340
20693d6515J3535J8376P100j7587j4177r223J575J42R48r726M416J9595r912j5860
20679e7313k4766J5512K2380P476l237J8060M051r206l127K2959L1206r371k105
20666A2519j0778J7355P577K685J335n356o126j6125K8024J0688n68j7192r207
$$ plain form
20758 -9318 -9889 -9608 15289 -1242 -19428 -45978 -38248 -3833 -12652 -34446 -33659 -34876 -44565 -47091
20744 -47091 -53029 -67142 -57956 -27860 -11543 12891 44938 48478 45536 21139 -7402 2786
20732 2786 32772 30059 14539 -633 -12778 -10127 -12317 -3794 -2123 -25218 -50361 -53297 -64940
20719 -64940 -49448 -14734 -9860 -26681 -40368 -33356 -4906 1929 -16011 -19572 -9995 -6361 -11607
20706 -11607 -9081 -33654 -35714 -36340 -23119 -16080 -19772 -10613 -28290 -33491 -46158 -58855 -46515
20693 -46515 -32980 -14604 -7504 -25091 -39268 -48491 -46916 -46774 -45826 -55552 -51136 -31541 -41453 -57313
20679 -57313 -82079 -66567 -44187 -36711 -39948 -21888 -17837 -27043 -30170 -7211 23995 14624 12519
20666 12519 1741 19096 26673 29358 30693 25337 19211 3086 31110 41798 41230 24038 14831
20653A4831j3737R451l312Q771M492R880o384l3648J8933J0602j5381l35n516
20640a353j1470N81J1707P79K7106J2423k7432l175K994k9529j2542K7474K7926
20627B5489k9046j3803j0408o071Q180j9515J949J1233J1131K4234q662j6473
20615b1762j6959j9411J7092L6781l795j2132K1851J3128K199K1030j9373l3340
20603a4691J8722P843m048K932O419j3989j4819J247j0991L047J8557p827Q184
20590E86N0j2691o02J2201L3152L55l9131o430q445j2946j455J0713L4609N401
20576A5367k2465k1062J3580J3593j4727j8004K4619k3235j6778M0178Q848L956
20564C870k8744p376K7045o371K899q132k1830J7059J3118r671L769J634M1065
$$ plain form
20653 14831 1094 10545 7233 16004 20496 30376 23992 -9656 9277 19879 4498 4163 -1353
20640 -1353 -12823 -12242 -535 244 27350 39773 12341 9166 12160 -17369 -29911 -2437 25489
20627 25489 -3557 -17360 -27768 -33839 -25659 -45174 -43225 -31992 -20861 3373 -5289 -21762
20615 -21762 -38721 -58132 -41040 -4259 -8054 -20186 1665 14793 16992 38022 18649 -14691
20603 -14691 4031 11874 7826 10758 17177 3188 -11631 -10384 -21375 -18328 229 -7598 586
20590 586 636 -12055 -12657 -456 32696 33051 -6080 -12510 -20955 -33901 -35356 -24643 9966 15367
20576 15367 -7098 -28160 -14580 -987 -15714 -33718 -9099 -32334 -49112 -8934 -86 3870
20564 3870 -24874 -32250 -5205 -11576 -8677 -16809 -38639 -21580 -8462 -18133 -14364 -12730 28335
20551B8335k0605p43k500L951l1383n810J0806K9864M329l1409J1777J8763k9742
20538a4367m23p511J3508K198Q933L1233j236M812k3107Q198j3476n641J4257
20525A7378K4995m677k4680n978O079K3057j5175p809J3804l0435n886J1554p59
20512A468l53J1779J1531K0173m1707p869J2032M655j9585M316J5330Q677l730
20499A6717Q085j1392k2641j920q734P189Q883l526L295j6440k2099J963j1014
20486e1634L993J6962O258K643o893Q961J1473j040J3004r129j0015J1034O071
20473A688N671k156R632n747j4115j8126J8929o01m375j349k102J2039j7719j6474
20459c4805j512l339R507j711L093J5232L5984k462O474o175m224R351J497J1994
$$ plain form
20551 28335 7730 6987 4487 8438 -22945 -28755 -17949 11915 16244 -15165 -3388 15375 -14367
20538 -14367 -14790 -22301 -8793 -6595 2338 33571 32335 37147 14040 22238 8762 3121 17378
20525 17378 42373 37696 13016 7038 13117 36174 20999 13190 26994 -3441 -9327 2227 1468
20512 1468 1115 12894 24425 44598 2891 -4978 7054 11709 -7876 -3560 11770 20447 16717
20499 16717 24802 13410 -9231 -11151 -19885 -12696 -3813 -7339 -4044 -20484 -42583 -40620 -51634
20486 -51634 -47641 -30679 -24421 -21778 -28671 -19710 -8237 -9277 3727 -5402 -15417 -4383 1688
20473 1688 7359 5203 14835 9088 -5027 -23153 -4224 -4825 -9200 -10549 -12651 -612 -18331 -34805
20459 -34805 -36317 -39656 -30149 -31860 -28767 -13535 22449 19987 26461 20286 16062 25413 26910 38904
20445C8904j9006o815J1724k2852J214J0891P596j7960O08K0120M472k0482j7286
20432h872k3176P475l900j3968j0531j0785O798L623j6479J6817K93J1300j9208
20419f0613m3086M050J7616J4205J5115L8216K2132q991j1881J0950P225J9734
20407B4672j2625j9421J4367K065j7493l4830j4927K1801L6041J082J8084K3015
20395D1831j5227j9145J1496J1691k2791j5402j9196J2909J0468j5277j7230J0306
20383b5567L013L1649O927L6561l2220k8089R324J4343Q341J8086N301k2729j4889
20370A0051r197k01j566N624m710j3934n985L051N691k4543j1645J0283O670l258
20356c3669O459K1508L2982Q194j526p771j4678j0181j2846K375L3538K7878j3711
$$ plain form
20445 38904 19898 13083 24807 1955 3169 14060 21656 3696 4304 24424 28896 8414 -8872
20432 -8872 -32048 -24573 -28473 -42441 -52972 -63757 -56959 -53336 -69815 -52998 -52705 -41405 -60613
20419 -60613 -103699 -99649 -82033 -67828 -52713 -14497 7635 -1356 -13237 -2287 4938 24672
20407 24672 12047 -7374 6993 9058 -8435 -43265 -58192 -36391 -350 732 18816 41831
20395 41831 26604 7459 18955 30646 7855 -7547 -26743 -13834 -3366 -18643 -35873 -25567
20383 -25567 -22554 9095 16022 52583 20363 -7726 1598 15941 24282 42368 47669 24940 10051
20370 10051 854 653 -913 4711 1 -13933 -19918 -16867 -11176 -35719 -47364 -37081 -30411 -33669
20356 -33669 -27210 -5702 27280 35474 33948 26177 11499 1318 -11528 -9153 24385 52263 38552
20343C8552k6364k7525q75K0660J0061j2149j9869j2192J6816k510l3052j4546
20331f2993K6316K8167O325Q437J813j0859P162k7894j2775J7198K1519r235j558
20318h377k394N338M356R283m991j5463Q658J9847J6195p061P710k1356k3941
20305a2196K5230L214k6300k3259n487j2980J8647o980k0698m628J0661p1Q762
20292d6085K8975J2457O10p435j7920Q438O169J9458o52J2418j8169m1834k5257
20279f8827L64L4107j7050j3275J7923K3119J7679n515O760J4429J958j2596J143
20266B19p627L383k715M344O904m310k3290j0248K8236K4516j541j8293q570k889
20252a1881O61j9017j5166J8929L435J386O666J4059J4041l2628k0182k8169l272
$$ plain form
20343 38552 12188 -15337 -16212 4448 14509 2360 -17509 -29701 -12885 -15395 -48447 -62993
20331 -62993 -36677 -8510 -2185 6252 8065 -2794 4368 -23526 -36301 -19103 2416 -6819 -8377
20318 -8377 -10771 -5433 -1077 8206 3215 -12248 -3590 16257 32452 25391 33101 11745 -12196
20305 -12196 13034 16248 -10052 -33311 -38798 -51778 -33131 -40111 -60809 -65437 -54776 -54847 -46085
20292 -46085 -17110 -4653 -4043 -11478 -29398 -20960 -14791 4667 4015 16433 -1736 -43570 -68827
20279 -68827 -68463 -34356 -51406 -64681 -46758 -23639 -5960 -11475 -4715 9714 11672 -924 219
20266 219 -7408 -4025 -6740 -2396 4508 198 -23092 -33340 -5104 19412 17871 -422 -8992 -11881
20252 -11881 -11220 -30237 -45403 -26474 -23039 -21653 -14987 -928 13113 -19515 -39697 -67866 -71138
20239g1138L3078J8632j0312P079P851j0648j4817k005M4307L6663j0197l7259
20227h766k7383K5070J6870j6728N203j2204j617j6937k4160N05R963l909O685
20214d7408J8300J0172j4603q512J9178J6914J5331M2557K2198k4668j9436j2695
20202A7328p342K717j650J746l0222j6478J5519l78j2681p76M2761J2747k0894
20189B397n308k845J308L8904J4688p006l4982l1326J5101R541K0300K0969o379
20176C5362l5160j5819J7796K441r590M590n945j1366J6513j015k0575L5575J2586
20163B5393K349J3390k7172k3962j540Q428R516p384r499J9405k270J757J8324
20150B6735N502J3211q213j6522l6474k6728l857K7380J0249J0007K7981J4937
$$ plain form
20239 -71138 -38060 -19428 -29740 -22661 -14810 -25458 -40275 -42280 2027 38690 28493 -8766
20227 -8766 -36149 -11079 5791 -10937 -5734 -17938 -19555 -36492 -60652 -60147 -50184 -54093 -47408
20214 -47408 -29108 -18936 -33539 -42051 -22873 -5959 9372 51929 74127 49459 30023 17328
20202 17328 9986 12703 11053 12799 -17423 -33901 -18382 -18760 -31441 -32217 10544 23291 2397
20189 2397 -2911 -5756 -4448 34456 49144 42138 7156 -24170 -9069 472 20772 41741 35362
20176 35362 202 -15617 2179 4620 -4970 -380 -6325 -17691 -1178 -2193 -22768 12807 25393
20163 25393 27742 41132 13960 -10002 -11542 -3114 6402 -982 -10481 8924 6654 8411 26735
20150 26735 32237 45448 37235 20713 -15761 -42489 -46346 -18966 -8717 1290 29271 44208
20138D4208p231j7233p680j7233r612n816R611k0293K2819J9307j2884n791K8315
20125B0487Q018k5715q456j5802P417k83k0230J3133J2480J362j0722l112J0292
20112a1131J7488j9575l442j9956m128K7524K1331l778l0330l1881j2637J4986
20100e5529O434J3844k1102N500J7342L1939O611L198l4M17K0454k3941j975M979
20086H137J1268L829J946j959j8323k5049k6257J5437M0677J7703k2672n875J1098
20073I960J4658L804k2489j3730J6847J7036J2267j5009k3770j4322J6693j5287
20061a3342j6280J1646K7477j366n625J49k112k0320J9695J4082r688r216k6237
20048c1137k028J2864J4336J2540K873l836k3620j0068J0248p976j1429J8288
$$ plain form
20138 44208 36977 19744 12064 -5169 -14781 -20597 -10986 -31279 -8460 10847 -2037 -7828 20487
20125 20487 28505 2790 -5666 -21468 -14051 -14334 -34564 -21431 -8951 -7589 -18311 -21423 -11131
20112 -11131 6357 -13218 -16660 -36616 -40744 -13220 8111 4333 -25997 -57878 -70515 -55529
20100 -55529 -49095 -35251 -56353 -50853 -33511 -1572 5039 8237 8203 8620 29074 5133 3158 8137
20086 8137 19405 23234 25180 23221 4898 -20151 -46408 -30971 9706 27409 4737 -1138 9960
20073 9960 24618 28422 5933 -7797 9050 26086 38353 23344 -426 -14748 1945 -13342
20061 -13342 -29622 -17976 9501 8135 2510 2659 547 -19773 -78 14004 4316 -4900 -31137
20048 -31137 -33165 -20301 -5965 6575 9448 5612 -18008 -28076 -17828 -25804 -37233 -18945
20036a8945O686N351j9142J0376K6516L2503N492j6410k2237J4070q338k287j6160
20023b525k0889j0708Q300J3446N062K3315J238j4180j4582j2643P170J6536j2785
20010a3245K501K5000Q297j029j3554j7682q742L0859K9178O800k6981j9875p186
19997e659j9394J546J8114K1955j8005k6169K7844K7373o747j9628J1861J0870
19985B3961J2729K673j9507k6980j1222J3992K2379J6802l0500l1047j5011N847
19973c5884M92J7853J7083J6298L54k7160J0601j0629n496J4185K8074k1873l661
19960B37K9102j2398l3474j2132k3200K5938K9097L736j0407L733J6759j4704
19948B287k9798j0673L3165L5618L970l797j3245J145M699L8381m7o5581j8559
$$ plain form
20036 -18945 -12259 -6908 -26050 -15674 10842 43345 48837 32427 10190 24260 15922 13635 -2525
20023 -2525 -23414 -34122 -25822 -12376 -7314 16001 17239 3059 -11523 -24166 -16996 -460 -13245
20010 -13245 -10744 14256 22553 21524 7970 -9712 -18454 12405 41583 48383 21402 1527 -5659
19997 -5659 -25053 -23507 -5393 16562 -1443 -27612 232 27605 20858 1230 13091 23961
19985 23961 36690 39363 19856 -7124 -18346 -4354 18025 34827 4327 -26720 -41731 -35884
19973 -35884 -35392 -17539 -456 15842 16196 -10964 -363 -10992 -16488 -2303 25771 3898 237
19960 237 29339 16941 -16533 -28665 -51865 -25927 3170 6906 -3501 232 16991 2287
19948 2287 -27511 -38184 -5019 30599 34569 30772 17527 18672 23371 61752 61705 -3876 -22435
19935b2435J5996L6012M936j0448k666N176K4564R923p784p416j4549k917K9550
19922E7942j8577n106Q677k453n603m607j6142J0370N129j1215k1519N649K669
19909E214r077R997p936k844j2909j0403R580J8181K5051J4200p600q967j635
19896B0852j7812j3653q83J5813J4965Q976l563l9444O707K8574O448M377J0014
19883D1371O308J3845R06j7151K872p672n633j972O483M724k3328K595P656J6171
19869D7175j2902r94j1765J1149r258k5398k3494L90K5822L6839j8308q534q997
19856A725j8518Q493K8709J2091m19J7592j06K5233j562q300j9944k5029j6085
19843C880k0422j6125J2631J8610J1977J4039j5357l776j690j9052k0358J9034
$$ plain form
19935 -22435 -6439 29573 34509 24061 21395 26571 51135 61058 53274 45858 31309 28392 57942
19922 57942 39365 34259 42936 40483 34880 30273 14131 24501 29630 18415 -3104 2545 5214
19909 5214 -3863 6134 -1802 -4646 -17555 -27958 -18378 -197 24854 39054 31454 22487 20852
19896 20852 3040 -10613 -11496 4317 19282 28258 24695 -14749 -8042 20532 26980 31357 41371
19883 41371 47679 61524 62430 45279 48151 40479 34846 32874 39357 44081 20753 23348 31004 47175
19869 47175 34273 33279 21514 32663 23405 -1993 -25487 -25097 725 37564 19256 10722 1725
19856 1725 -16793 -8300 20409 32500 32081 49673 49567 74800 73238 64938 44994 19965 3880
19843 3880 -16542 -32667 -20036 -1426 10551 24590 9233 5457 3767 -15285 -35643 -16609
19831a6609L1313J0836q923l0593m169j7911J4351K7423J0876K6633j370k182
19819C9675j5548N175p508J340j9657q874j3771l529l2422M29K7102K729J2930
19806a1929K0801q704P352l4482j5007K6273K3476J3268R741l864j0464k2523
19794f062j6156n54j761J9951L0446J2810q247r89j9586q081R449J9240N14N993
19780C6967J2842k1759k551p711J3637K5201l243j9089k15n508q40J2016o68q261
19766C0818n204k9251j8733J0811K5687L1887m252j9882l9321j7811J2905n862
19754b8208j5646q950L1958K1313K2463R267Q107r348O153O988l360j1448j0645
19741A8644J5214J3278M72j5126j3190j0939p89j0190o157L320M039K0744J6775
$$ plain form
19831 -16609 14704 25540 16617 -13976 -18145 -36056 -21705 5718 16594 43227 41857 39675
19819 39675 24127 29302 21794 23134 3477 -5397 -19168 -22697 -55119 -54690 -27588 -24859 -11929
19806 -11929 8872 168 7520 -26962 -41969 -15696 7780 21048 30789 26925 16461 -6062
19794 -6062 -22218 -22772 -24533 -4582 25864 38674 30427 29438 9852 1771 11220 30460 30974 36967
19780 36967 49809 28050 25499 17788 31425 56626 53383 34294 34079 28571 27731 39747 39079 30818
19766 30818 25614 -3637 -22370 -11559 14128 46015 41763 21881 -17440 -35251 -22346 -28208
19754 -28208 -43854 -52804 -20846 467 22930 32197 40304 30956 37109 44097 40737 29289 18644
19741 18644 33858 47136 47608 32482 19292 8353 7564 -2626 -8783 -5463 -1424 19320 36095
19728C6095Q970m0538o688L2871L337M605k173Q218J3272k5460k5426j0837k0610
19715b4364k1243J0547K3018J6396K8414J6184J3397o153k1693j631K4721J2130
19703F9723q714K4305j45q985j2516O687n467k5611o008j3697l2712j0748N850
19690a8038L0808M857j9279n997J0175M192l567M2278R726k9935m137K2258K3299
19677F6640k4036j3792j1742J12k40j7444P456R607J969j7519N934K4760Q902
19664D0607L014o04l5670j2908K0652k099q51j6055K0303r575O213P537j6153
19651D411k5927N277J6415L6068L9824k077m9880k1317L912N531J2808L842m881
19638B4006j5881j3597J6469J3618K9477K0970j785l2368l1648j4013k0844J3084
$$ plain form
19728 36095 45065 4527 -2161 30710 34047 38652 36479 44697 57969 32509 7083 -3754 -24364
19715 -24364 -45607 -35060 -12042 4354 32768 48952 62349 56196 34503 32872 57593 69723
19703 69723 61009 85314 85169 76184 63668 70355 64888 39277 33269 19572 -13140 -23888 -18038
19690 -18038 12770 17627 -1652 -7649 2526 6718 3151 45429 55155 25220 21083 43341 66640
19677 66640 42604 28812 17070 17182 16942 -502 6954 16561 18530 1011 6945 31705 40607
19664 40607 43621 43017 7347 -5561 15091 12992 12141 -3914 16389 6814 13027 20564 4411
19651 4411 -21516 -16239 176 36244 76068 73991 24111 2794 6706 12237 25045 28887 24006
19638 24006 8125 -5472 10997 24615 54092 75062 73277 40909 9261 -4752 -25596 -12512
19626a2512M0595K8759k4313k7518j3793J5677k39L254O714j398o963k5085o35
19613a7457L2093l477q429j3963J3225J9839J2708J6003J4404k3320j7033J048
19601B5641m542k3453j328J0484j2576K5074O566j7186M97K6047K3504l0532j1760
19588A6436K6956J6433J8995j1320n483q419l188M478J2878j3734j4144j4065
19576B5823j5322J9343m304l0488M69N870L4027O300j3124p601k6703L353M215
19563A858J1850L4677J5802k0993O87p931k1961k805j0923L987k257m054J0897
19550H834l774m954J9141K9048Q64O818J1839P581m0562l8049j9337J7801K4995
19537B0245M316J7216Q117M934k902q595k269l615j1865O503o27p064P754j0957
$$ plain form
19626 -12512 28083 56842 32529 5011 -8782 6895 6656 9910 16624 15226 8263 -16822 -17457
19613 -17457 14636 11159 2730 -11233 1992 21831 34539 50542 64946 41626 24593 25641
19601 25641 21099 -2354 -3682 6802 -5774 19300 25866 8680 9177 35224 58728 28196 16436
19588 16436 43392 59825 78820 67500 62017 53598 50410 54888 67766 54032 39888 25823
19576 25823 10501 29844 25540 -4948 -4479 1391 35418 41718 28594 20993 -5710 -2357 1858
19563 1858 13708 48385 64187 43194 43881 35950 13989 11184 261 4248 1991 -2063 8834
19550 8834 5060 106 19247 48295 49159 55977 67816 75397 34835 -3214 -22551 -4750 20245
19537 20245 24561 41777 49894 54828 51926 43331 41062 37447 25582 32085 31458 24394 32148 21191
19523B1191O987K6817L3197l3713j1390k09J1341M053Q109R622j2831l4174K0180
19510D9180K110k7740M0799N573l6791N874J8673J3368j3353j8673l7868l998
19498b846J4134J3954K6640k2582j9389J8457J4584r874M03J6638q991k1513J1785
19485C1400J2404j3167q330M120m478J7021r569j7046K1154O784J7197j261J1022
19472F7251k2074o582J3811j695K177o422J2715j2003k4202l596P571l273L209
19459B6887J3385M114r909J6887K631k9348l5904Q293J4410j0753j7506J572J3269
19446a972K4166j0715L2219N739k7237J2197J0957J2216j3511n349l043m151m308
19433B7208m398l9840p34L1475J3163n165o85J8801K0734p840R79J353R599j6
$$ plain form
19523 21191 28178 54995 88192 54479 43089 42880 54221 58274 66383 76005 63174 29000 49180
19510 49180 51290 23550 64349 69922 33131 39005 57678 71046 57693 39020 1152 -2846
19498 -2846 11288 25242 51882 29300 9911 28368 42952 33078 33481 50119 41128 19615 31400
19485 31400 43804 30637 22307 26427 21949 38970 29401 12355 33509 40293 57490 56229 67251
19472 67251 45177 38595 52406 50711 52888 46466 59181 47178 22976 19380 26951 23678 26887
19459 26887 40272 44386 34477 51364 53995 24647 -11257 -2964 11446 693 -16813 -15241 -1972
19446 -1972 22194 11479 43698 49437 22200 34397 45354 57570 44059 38710 35667 31516 27208
19433 27208 22810 -17030 -17764 13711 26874 21709 21024 39825 60559 52719 53698 55051 64650 64634
19419F4634r316q352L903M874l208j0183j4438K3495r511k722J2516R250r642
19406E1300q001k2341q221R225K814p077K660p497O871K6409J6407l195J8620
19393G7974K3150K547k362j639k3998K084N478k9194N498J2348J906K3480j2456
19380H4816l9547m751o165J0154j0333M331P992L945N222Q603J5020K3228M6149
19367A48664M2265L5502L1617M1351N1275L6410J1631K8390r515k6133l7586k0204
19355C33667j7841k4593M156M805J2705L9689N7236O2180M8313N3160k9715n3462
19343D90300j0773k1691l8411k4742j8581O700k977n1918o3982l6650l6483j1776
19331A79016k6992j9096L456O856J5279n285J9651K8957o81k34j2027j1751j6731
$$ plain form
19419 64634 55318 46966 50869 55743 52535 42352 27914 51409 41898 39176 51692 60942 51300
19406 51300 43299 20958 12737 21962 24776 17699 20359 12862 19733 46142 62549 59354 77974
19393 77974 101124 103671 101309 99670 75672 77756 83234 54040 59538 71886 73792 97272 84816
19380 84816 45269 40518 34353 44507 34174 38505 46497 50442 55664 64267 79287 102515 148664
19367 148664 190929 226431 258048 299399 350674 387084 398715 427105 417590 391457 353871 333667
19355 333667 315826 291233 295389 300194 312899 352588 409824 472004 520317 573477 543762 490300
19343 490300 479527 457836 419425 394683 376102 382802 379825 327907 263925 227275 190792 179016
19331 179016 152024 132928 136384 143240 158519 153234 172885 201842 201161 200927 188900 177149 160418
19318A60418J1605L2059L3081J9069P423k8157k0742o983J6112K1987N3004L0332
19306C29208L5976L4527L8463N1477L9661J1024j4693j0488m807P522j9443m138
19294D94289k8319L422O535k893J0014k921K1255j9314o1384o3354n7760k3190
19282B76380p684k6882k5557m1005j9579j8585j1468K24k9468m1493J6900J0057
19270H1840K3341K0827l508m3419j0914M897O14L471K995J920J3821J2216L77
19257A08478p173P599q030r469k4j0247P607P585R319K1882k7269J20K5040J5696
19243A41114n845l0492j3715k979K909o192J2325o321m5087L961R161J7199O480
19230H2518n715l761O250j5496m996O442n976j3357O113K2817J57r386o121j1308
$$ plain form
19318 160418 172023 204082 237163 256232 263655 235498 214756 207773 223885 245872 298876 329208
19306 329208 365184 399711 438174 489651 529312 540336 525643 515155 510348 517870 498427 494289
19294 494289 465970 469392 475927 473034 483048 480127 501382 482068 420684 357330 299570 276380
19282 276380 268696 241814 216257 175252 155673 137088 125620 125844 96376 54883 71783 81840
19270 81840 105181 126008 122500 79081 68167 73064 73678 77149 80144 82064 95885 108101 108478
19257 108478 101305 108904 100874 91405 91381 81134 88741 96326 105645 127527 100258 100378 125418 141114
19243 141114 135269 104777 91062 88083 90992 84800 97125 90804 45717 49678 58839 76038 82518
19230 82518 76803 73042 79292 63796 58800 65242 59266 45909 52022 74839 74996 65610 59489 48181
19216D8181k601K5331N369J5632r437m652K972N581k618R018j3272K4166J2179
19203A15849k0981j2070N547j472J4741J4806q385o409m572K1813J2771j4022
19191A17616l6134o804j315P794K6253j5539n282K086k9107j7474J6787O593K7510
19178I2984J7486j2720J2513J2954j3596k9732j5023k4253M954l913L317J3686
19166E8657K2327M0568J5666j2598J506M031O115q373m437M130J1060K2966r08
19153A60710j8166k7837j4845m907N976m989k6271O490N057M746O490Q044n836
19140I4662m443K6337K852J9227q338k4101j080j4199j1405p146J5937J8722J1031
19127A18056O678n625Q13N145q71q706R420l277j1983M434L6902j249P247j9437
$$ plain form
19216 48181 45580 70911 76280 91912 82475 77823 80795 86376 83758 92776 79504 103670 115849
19203 115849 94868 82798 88345 86873 101614 116420 108035 101626 97054 118867 131638 117616
19191 117616 81482 74678 73363 81157 107410 91871 86589 88675 59568 42094 58881 65474 92984
19178 92984 110470 97750 110263 123217 109621 79889 64866 40613 45567 41654 44971 58657
19166 58657 80984 121552 137218 124620 126126 130157 136272 127899 123462 127592 138652 161618 160710
19153 160710 142544 114707 99862 94955 100931 95942 69671 76161 81218 85964 92454 100498 94662
19140 94662 90219 116556 119408 138635 130297 106196 105116 90917 79512 72366 88303 107025 118056
19127 118056 124734 119109 119922 125067 124196 115490 124910 121633 109650 114084 150986 149737 156984 137547
19113A37547J8087J8834M621k5j3795J3592K0841k5007j3282k2626p300r436Q763
19100A30814J4050K6568M267J8491K2085K4734M0453K5269L0971J1033n610n8314
19088B84811o1581k8043l2758j3067J9775L381J0777j7814k8687j7136L4253L8005
19076A91916l1100m0387p56L7802L4048J6324m803k5270l6969O004L907m162J7192
19063A63746J8146j6089K996J4618l048L123o104j3503l6501J8314L6183L998
19051A85879k742J2563L65j5914n494L117K0300L0010J4487K2573J770L6316M0344
19038C43574M0100K7878J4344j1020K858k9099o8201n5803l5856j6633j1059j6649
19026A84434j2027O725j5328L1411L5382j1554j219M070p090L300l3051j6229
$$ plain form
19113 137547 155634 174468 179089 179064 165269 178861 199702 174695 161413 138787 131487 122051 130814
19100 130814 144864 171432 175699 194190 216275 241009 281462 306731 337702 348735 343125 284811
19088 284811 223230 195187 162429 149362 169137 172518 183295 165481 136794 119658 153911 191916
19076 191916 160816 120429 119673 157475 191523 207847 203044 177774 140805 146809 150716 146554 163746
19063 163746 181892 165803 168799 183417 180369 183492 177388 163885 127384 145698 181881 185879
19051 185879 183137 195700 196065 180151 174657 177774 198074 228084 242571 265144 266914 303230 343574
19038 343574 383674 411552 425896 414876 417734 388635 320434 264631 228775 212142 201083 184434
19026 184434 172407 179132 163804 195215 230597 219043 217824 221894 214804 218104 185053 168824
19014A68824j54j5624o367K8519M8602J3722k0170k4592N794N694N4959P191k1563
19001B44835l358r275l1291k6803J699J4330L1164K6256M517L512J5250J4394
18989B85230J6284K477p722M113k914k3470K132L6560L3308O806J5593K5059N291
18976C98747J592P216K7638N0925J1104O140L0511M0354J9411l4654j9867J8465
18964E57582L9874L5323K2289J7484P937J2478J4062k7673j8215p623n4707k0626
18952E78185l6682k996K3822M718j425n712K473P52j2531l117j5004k5625p834
18939D99024K2162J4771m837l9793m672K4651M548Q532L0238L6897L4630J0450
18927F36601N335M0425K1320L9586O7127N0847K1668N160L0975N7227L8448M4169
$$ plain form
19014 168824 168670 153046 146679 175198 223800 237522 217352 192760 198554 204248 259207 266398 244835
19001 244835 241477 232202 200911 174108 175807 190137 221301 247557 252074 255586 270836 285230
18989 285230 301514 303991 296269 300382 297468 273998 276130 312690 345998 352804 368397 393456 398747
18976 398747 400339 407555 435193 486118 497222 503362 533873 574227 593638 558984 539117 557582
18964 557582 597456 632779 655068 672552 680489 692967 707029 679356 661141 653518 598811 578185
18952 578185 541503 538507 562329 567047 565622 559910 562383 563135 550604 547487 532483 506858 499024
18939 499024 521186 535957 531120 491327 486655 511306 515854 524386 554624 591521 626151 636601
18927 636601 641936 682361 703681 743267 810394 861241 882909 888069 919044 976271 1014719 1058888
18915A058888P3454Q9523N7867k741J5053P426j460J3827K1863k4232m4091l7355
18903A228022O41L9767K3193O3555O8203M0409l36m6244l3672m8180o7746n9142
18891A208470m039L9420J4979r359J2133J9899L6079K6390N8618N1274K5297O7371
18879A546532J10893J42173J56210K07891K41533J96882J59836J06343M3705N4129
18869B966127L3738P7180J28553J27770J64559K61989L45347M65798O30758Q61925
18859F063744J249499J826119K508808K964773K501072J033325o63996j696086
18851A5787258j434850n82131J90286Q51750J628647K642527M112812O628884
18843B9825183J0840611J7309898K5466390L1318834K7688255J4898589j877048
$$ plain form
18915 1058888 1132342 1221865 1279732 1276991 1292044 1299470 1298010 1311837 1333700 1309468 1265377 1228022
18903 1228022 1228663 1268430 1291623 1355178 1423381 1463790 1463454 1417210 1383538 1335358 1267612 1208470
18891 1208470 1204431 1243851 1258830 1249471 1261604 1281503 1317582 1343972 1402590 1453864 1479161 1546532
18879 1546532 1657425 1799598 1955808 2163699 2405232 2602114 2761950 2868293 2911998 2966127
18869 2966127 2999865 3077045 3205598 3333368 3497927 3759916 4105263 4571061 5201819 6063744
18859 6063744 7313243 9139362 11648170 14612943 17114015 18147340 17483344 15787258
18851 15787258 14352408 13770277 13960563 14812313 16440960 19083487 23196299 29825183
18843 29825183 40665794 57975692 83442082 114760916 142449171 157347760 155470712
18836A55470712j6261098k1400278k3068375k2630459j6830740r880122m585972
18829D0813668m11919L075410N361180M954374J284289l956182q169303q982823
18821C3968694p102673m856421l269915k326597j700495j265158r79420p10651
18813A1757364m89288l72342k42014q5805O7886J72640L17943N38367Q37053J198593
18803A3700397J657123K386418L525017N390614P699120R679265R553688N983948
18795E9575590K67205m916138o470320m364543q12391L314676Q598095J5775703
18787G0967877K4811477L2888061L5290104L0907503J6023200o343738k6544582
18780A77999902m1131937l9518998k7549495j7481241j1262621p378201m807865
$$ plain form
18836 155470712 139209614 117809336 94740961 72110502 55279762 45399640 40813668
18829 40813668 40401749 43477159 48838339 53792713 55077002 51120820 42951517 33968694
18821 33968694 26866021 22009600 18739685 16413088 14712593 13447435 12468015 11757364
18813 11757364 11268076 10895734 10653720 10567915 10635801 10808441 11126384 11664751 12501804 13700397
18803 13700397 15357520 17743938 21268955 26659569 34358689 44037954 53591642 59575590
18795 59575590 59842795 54926657 48456337 44091794 43279403 46594079 55192174 70967877
18787 70967877 95779354 128667415 163957519 194865022 210888222 204544484 177999902
18780 177999902 136867965 97348967 69799472 52318231 41055610 33677409 28869544
18773B8869544l037999j633677l78208Q15403K018487K603935J567836q75558
18765B9949763l542001m895003m250619l001127k100650j530469j166556q90487
18757H572851o86228n32385m01887k99537k50744k09160j19424q8802r0097j38697
18747E755890k58010l35034l89011l80223l12870k58182k49759k40014j85960
18738C146827j56524r3721m9295p7033q1287o2590p3737p5840q9644q8370j14273
18727B184513p9124q0593r8399p0116o8506r0346n2420k9035m5468n4857j1001
18716A504648J490j1754p23j4896l8976l7279l4605j4298o0356m6832p0761n7878
18704A117780k7902k1596k6907k8536m4301k4785o072l4444j8932j1775j0662
$$ plain form
18773 28869544 25831545 24197868 23819660 24635063 26653550 29257485 30825321 29949763
18765 29949763 26407762 21512759 17262140 14261013 12160363 10629894 9463338 8572851
18757 8572851 7886623 7354238 6952351 6652814 6402070 6192910 6073486 5984684 5894587 5755890
18747 5755890 5497880 5162846 4773835 4393612 4080742 3822560 3572801 3332787 3146827
18738 3146827 2990303 2896582 2847287 2770254 2688967 2626377 2552640 2476800 2387156 2298786 2184513
18727 2184513 2105389 2024796 1926397 1856281 1787775 1697429 1645009 1615974 1570506 1515649 1504648
18716 1504648 1506138 1494384 1493661 1478765 1439789 1402510 1367905 1353607 1293251 1246419 1175658 1117780
18704 1117780 1089878 1068282 1041375 1012839 968538 943753 937681 903237 884305 872530 861868
18693H61868m9673o3344J142j4856n168J2751K0356J8195J6542J9212L7149K6027
18681H80201j2604p4225o9184q8799n0151P62Q312j9121k5571p561n459M00J969
18668E38969J4559j5811j2567k4978j0708r459n1620j4543J9283L9266M7863L6169
18656E56423M4243j9622k1809j2365k3723j8714l7444l5474j3959l6995l8981
18645C41580k0398J1489K2609J7433k8114J5955q215k143k7115j9852K9875J2771
18633C45875K378j0221j4218M7673L5972K1220o58n677q826l0151l6312j6054
18621C31001l0539l5140j956q812k2490N919Q357K5456J0921n187q995n462j3179
18608B49894j4835j2412k6444j2235L4321L9451j672J4423n410j3236J730M602
$$ plain form
18693 861868 812195 748851 749993 735137 729969 742720 763076 781271 797813 817025 854174 880201
18681 880201 867597 793372 724188 635389 585238 586000 594312 575191 549620 542059 536600 537000 538969
18668 538969 553528 537717 525150 500172 489464 480005 428385 413842 433125 472391 520254 556423
18656 556423 600666 581044 559235 546870 523147 504433 466989 431515 417556 380561 341580
18645 341580 321182 332671 355280 372713 344599 360554 352339 350196 323081 303229 333104 345875
18633 345875 348253 338032 323814 371487 407459 428679 428021 422344 413518 383367 347055 331001
18621 331001 300462 265322 263366 254554 232064 237983 246340 271796 282717 277530 268535 263073 249894
18608 249894 235059 222647 196203 183968 218289 257740 256068 270491 265081 251845 253575 258177
18596B58177j0793L684l0986k358j3507m0576Q041K2648L2365N7241L372l3791
18584B53517K2121J1905j0618k1105J339l827l284K6792O731j7700j4317o070
18572B45484K4768L5747Q260K73r256N688l8966j7201J5191L9545J0530K1078
18560C41141q821r746k6634K5852J2316O759J7268K1516M2840J5889o438l556
18548D28386l0197k1441j1816j7071O858j1587j0338J650j3571k182L7309M1240
18536C97240N928o882j0086j8577q682j0230J6062K8885J2846k0816j8441l653
18524C63594J4711k84J6339K6140J3774P519J6144J6778K9209J8587k8008k4978
18512D69525L3269P548N372J1686m6J435o438L3889M1865J7042k6262N76L9880
$$ plain form
18596 258177 247384 251068 220082 217724 204217 163641 171682 194330 226695 283936 287308 253517
18584 253517 275638 287543 276925 255820 257159 253332 250048 276840 283571 265871 251554 245484
18572 245484 270252 305999 314259 314532 305276 310964 271998 254797 269988 309533 320063 341141
18560 341141 332320 322574 295940 321792 334108 340867 358135 379651 422491 438380 431942 428386
18548 428386 398189 376748 364932 347861 354719 343132 332794 334444 320873 318691 356000 397240
18536 397240 403168 396286 386200 367623 358941 348711 364773 393658 406504 385688 367247 363594
18524 363594 378305 378021 394360 420500 434274 441793 457937 474715 503924 522511 494503 469525
18512 469525 502794 510342 515714 527400 527354 528789 522351 556240 598105 615147 588885 589461 629341
18499F29341L1177J3859K2362j58P884K0332L2843M2140J6653n028L4l252R957
18486H18144J8662K3443M3387K3999J5224N6895L5994M2053M8356M2936K0855
18475A189948L2334O7357P2552N7193Q9036R0713P5992Q0696N1003N2868P4577
18464A934269J05365J45184J70625K07692K71842L02812L59233M40769N82949
18455D520740O70679O73811O66533P43495R77233J636176K563657L742071M443480
18446B0637875L690536J526364j107601k674303k170787p73916M84158J500127
18438B1112453K503107L924680O271678J0263263J6702296K6198286L6880939
18431A23856702M1656159L2543229J2647049j2697007k9669867l3624425l2074403
$$ plain form
18499 629341 660518 674377 696739 696581 704465 724797 757640 799780 816433 811405 811439 808187 818144
18486 818144 836806 860249 903636 927635 942859 999754 1035748 1077801 1126157 1169093 1189948
18475 1189948 1222282 1289639 1362191 1419384 1508420 1599133 1675125 1755821 1806824 1859692 1934269
18464 1934269 2039634 2184818 2355443 2563135 2834977 3137789 3497022 3937791 4520740
18455 4520740 5191419 5865230 6531763 7275258 8252491 9888667 12452324 16194395 20637875
18446 20637875 24328411 25854775 24747174 22072871 19902084 19128168 19612326 21112453
18438 21112453 23615560 27540240 33811918 44075181 60777477 86975763 123856702
18431 123856702 165512861 198056090 210703139 198006132 168336265 134711840 102637437
18424A02637437k4792790j5770529r053005m293076l16968L137408N306795M618859
18416F1474131M95866n194698r586118j0095335p795360n331581l606292k475293
18408A7885320j690087j181685r01925p44380o98493o08590m54445k79151o2772
18399A1263792P9855J76827K98080M33390O45593J103065J839341K949026M518701
18390B3307670O542681Q413589Q416379N381269M42193m069875n320981l261251
18382C9851674N3530L914882Q898508J5293554K1706892K4880953K3651920J7559018
18374A55810931M322295j1050208k5622315l2860889k6546184j6888145j0612916
18367C6552569o984917m713310l234172k136720j283603n02938L07435J039633
$$ plain form
18424 102637437 77844647 62074118 53021113 48728037 48411069 51548477 56855272 61474131
18416 61474131 61969997 56775299 47189181 37093846 29298486 23966905 20360613 17885320
18408 17885320 16195233 15013548 14111623 13367243 12668750 12060160 11605715 11326564 11263792
18399 11263792 11343647 11520474 11818554 12251944 12897537 14000602 15839943 18788969 23307670
18390 23307670 29850351 38263940 46680319 52061588 52503781 48433906 43112925 39851674
18382 39851674 39905204 43820086 52718594 68012148 89719040 114599993 138251913 155810931
18374 155810931 160133226 149083018 123460703 90599814 64053630 47165485 36552569
18367 36552569 29567652 24854342 21620170 19483450 18199847 17696909 18004344 19043977
18359A9043977J396148P94896p38192k370573l125567k615068j773625j193226
18351I418770q76977p47300o85710o47022n89823n05831m48993l32411k66488
18342D318215k55206k04061j72837j31308j42329j32246j45943j08857j03852
18333B921576j20083j06815j24214j10312p2548o0646m7945k9830l3413k5599
18323B190171K2388L5221J6702j4800r754l0092l6126q0746j36434r3627m4112
18312A818791j9715j4645K5877M0656L824l3606k4793J4144j720k5255r8469j23815
18300A561274j05432p4132m7042m6838m7145o4478n2627m5809p1619n2012n6955
18289H97185o7226m3854k9774j8022l8743m4195m3814r456m677L218j9046j6833
$$ plain form
18359 19043977 20440125 21235021 20496829 18126256 15000689 12385621 10611996 9418770
18351 9418770 8541793 7794493 7108783 6461761 5871938 5366107 4917114 4584703 4318215
18342 4318215 4063009 3858948 3686111 3554803 3412474 3280228 3134285 3025428 2921576
18333 2921576 2801493 2694678 2570464 2460152 2387604 2326958 2279013 2249183 2215770 2190171
18323 2190171 2212559 2247780 2264482 2249682 2239928 2209836 2173710 2092964 1956530 1862903 1818791
18312 1818791 1799076 1784431 1810308 1850964 1854788 1821182 1796389 1810533 1808813 1783558 1685089 1561274
18300 1561274 1455842 1381710 1334668 1287830 1240685 1176207 1123580 1077771 1006152 954140 897185
18289 897185 829959 786105 756331 738309 699566 655371 611557 602101 597424 600642 581596 564763
18277E64763j6326j759J0079j3124j3413o96j1512J0887N304j2627q902j3204
18265D99470j4396K7092M5494M6791J0209J071N552r242j5858k405O748n1301
18253E49225l2740j5357r377J8266K8284K2566K2098m9786l0781j9246k8359m1075
18241D13718o1711o4058k2389J574j8633j1000n346j8733k4441P004J0403K914
18229B09302m867q857k8424j1013K446L886r572j5268n858q077K47p020n087l1641
18215H0197r586l460K186K4075M0365O528k4356l0810j5398l2616o140L4850J5561
18202H1396j3976n266p909J5686j2418J6555J918j0543j3503j0820l526O909J3489
18189E7992M747j0790j2956J6471P624J1190j1872L2213J0385P956P13l5929P707
$$ plain form
18277 564763 548437 546678 556757 543633 530220 529524 518012 528899 534203 521576 512674 499470
18265 499470 485074 512166 557660 604451 614660 615731 621283 612041 596183 593778 600526 549225
18253 549225 516485 501128 491751 510017 538301 560867 582965 533179 502398 483152 454793 413718
18241 413718 352007 287949 265560 267134 248501 237501 232155 213422 188981 195985 206388 209302
18229 209302 204435 195578 167154 156141 158587 162473 152901 137633 131775 123698 123945 116925 111838 80197
18215 80197 70611 67151 69337 93412 133777 140305 115949 85139 69741 37125 30985 65835 81396
18202 81396 67420 62154 54245 69931 57513 74068 75986 65443 51940 41120 37594 44503 57992
18189 57992 62739 51949 38993 55464 63088 74278 62406 94619 105004 112960 113673 77744 85451
18176H5451L063K494j2596j1673p201m5595M70o635J0420K0424q44j4949j1730
18163A1099n259Q55N708P863m695q059j1687K5658J9748j9232l5080J2596p310
18150g795j0561j6310j978J1523J5041L409k8098m406K8175P476k2462P878K670
18137a5438Q188L398K1213J5368N657j4527j2381K6282k091j5731J8783K748n199
18124C6270l3800k0833L951P097M80K332J0307K2766J2619j6063j9081k311J178
18111D912J9516k1337o949J1652K1232n675q576p224p362k2633k387K1661j9798
18098b2968K2578K0038O580j6723q921j6814k741Q634j0172j8681j7852J259M3077
18085a2706K0737j4266k1545J2776K9761K3425k4159r104o552l1320J3830J9589
$$ plain form
18176 85451 88514 91008 78412 66739 59538 13943 14413 7778 18198 38622 37778 22829 11099
18163 11099 5840 6695 12403 20266 15571 7512 -4175 21483 41231 21999 -13081 -485 -7795
18150 -7795 -18356 -34666 -36644 -25121 -10080 -6671 -34769 -39175 -11000 -3524 -25986 -18108 -15438
18137 -15438 -7250 -3852 17361 32729 38386 23859 11478 37760 35669 19938 38721 41469 36270
18124 36270 2470 -18363 -14412 -7315 -6835 -4503 5804 28570 41189 25126 6045 3734 4912
18111 4912 24428 3091 -3858 7794 29026 23351 14775 7551 189 -22444 -24831 -3170 -22968
18098 -22968 -390 19648 26228 9505 584 -16230 -18971 -10337 -20509 -39190 -57042 -55783 -12706
18085 -12706 8031 -6235 -27780 -15004 14757 38182 14023 4919 -1633 -32953 -19123 466
18073D66K4983j6916q709j0030J4632J6675l630N201J445J2151P166m401k1687
18060A7346n958J1471q986l3816j3714m862J5669n175K6009r882l7822L324J483
18047d4913j5994J2252J6630J7710l082J4282J2332j9272k523K6181L087k3209
18035f519l1252j7049K8505J5800j783j9907O910J1687q616j3610n569n017K0658
18022b5762q531n258J376j926K5418L5985J3772k9586k0706o416j1135N880L09
18009b6580P472R769n388j1922o929r646j2448J9011K1438j8485j1163J3774j3675
17996d4772L624L2446k405j0035L5451K9327k8847p531p658o300l7832J6028J7858
17983a0646n129J1393J3530K189M187r533l3529j0246j8323p668J2168J7855R286
$$ plain form
18073 466 25449 8533 -176 -10206 4426 21101 17471 22672 24117 36268 43434 39033 17346
18060 17346 11388 22859 13873 -19943 -33657 -38519 -22850 -28025 -2016 -11898 -49720 -46396 -44913
18047 -44913 -60907 -48655 -32025 -14315 -17397 -3115 9217 -10055 -12578 13603 16690 -6519
18035 -6519 -37771 -54820 -26315 -10515 -12298 -32205 -25295 -13608 -22224 -35834 -41403 -46420 -25762
18022 -25762 -34293 -39551 -38175 -40101 -14683 21302 35074 5488 -15218 -21634 -32769 -26889 -26580
18009 -26580 -19108 -9339 -14727 -26649 -33578 -43224 -55672 -36661 -15223 -33708 -44871 -31097 -44772
17996 -44772 -41148 -8702 -11107 -21142 14309 43636 14789 7258 -400 -6700 -44532 -28504 -10646
17983 -10646 -15775 -4382 9148 11337 15524 5991 -27538 -37784 -56107 -63775 -51607 -33752 -24466
17970b4466J275M276J4338J291p836L4912J0304j3568j2945j6411p816l941k4419
17957d5006n163J8426O86J5099l626M367O850j7017J266J6678o085k8932l269
17944d5726j8036J2834P024J4259j469j5890m564J2615J026K9298K6505o337k407
17931I132m049j3829J4005K4163k7721j3833K3962J4298K7329Q057Q874J7598
17919H7986j6855J453K9387K5807j734l5447K2666N0460P3306O2401M0760M5965
17907C86155M2256j1516r486J0217K7623J0662l1801j3520n4969j9476L1929M6117
17895D14191N5712L4210k113o4111o4656o3306o0678n4839k5861l5371j3327L164
17883A23015P196R259j0361R29K8691j2977j0875M355k4914k6520j3521J0826
$$ plain form
17970 -24466 -23191 -18915 -4577 -3286 -11122 23790 34094 20526 7581 -8830 -16646 -20587 -45006
17957 -45006 -50169 -31743 -31057 -15958 -19584 -15217 -8367 -25384 -24118 -7440 -13525 -42457 -45726
17944 -45726 -63762 -50928 -43904 -29645 -31114 -47004 -51568 -38953 -37927 -8629 17876 11539 9132
17931 9132 5083 -8746 5259 29422 1701 -12132 11830 26128 53457 61514 70388 87986
17919 87986 71131 72584 101971 127778 126044 90597 113263 163723 237029 299430 340190 386155
17907 386155 428411 416895 407409 417626 445249 455911 424110 410590 355621 336145 368074 414191
17895 414191 469903 504113 502000 437889 373233 309927 249249 194410 168549 133178 119851 123015
17883 123015 130211 139470 129109 130038 158729 145752 134877 139232 114318 87798 74277 85103
17871H5103r093j6036N972j4866O297J5981J6126J1974n927J4718M5860L1002
17859A87111O9722N1156L9454M7638L9207J6396J4104K0327J3583m8810p1877
17848C78011o5040n1699m1407l3622m1683J3151L8571L8705L0435N7864N1314
17837C74600K7457K3453N64m5984m8300n2242o4681m8767m2771k075k1404o924
17825I2926k9115l5974M051k0973q340L3243K1144j3684m1057N138K1707j215
17813B7851j3966J2607J1138J3855k8130l6676j8029J3080j6549L5716J6285l1255
17801a4073j7959j8104n06K3182J0677J8311K1559k21k9072k7246J6761P990j4
17788h715L434j7691m0824Q309K1885J572J0242j5147J3076K1623n335j6096L7369
$$ plain form
17871 85103 76010 59974 65946 51080 57377 73358 89484 101458 95531 110249 156109 187111
17859 187111 256833 307989 347443 395081 434288 450684 464788 485115 498698 449888 378011
17848 378011 312971 261272 219865 186243 144560 157711 196282 234987 265422 323286 374600
17837 374600 402057 425510 426074 380090 331790 279548 214867 166100 123329 121254 99850 92926
17825 92926 63811 27837 31888 10915 2575 35818 56962 43278 2221 7359 29066 27851
17813 27851 13885 26492 37630 51485 23355 -13321 -31350 -18270 -34819 897 17182 -14073
17801 -14073 -32032 -50136 -50642 -27460 -16783 1528 23087 22866 -6206 -33452 -16691 -8701 -8715
17788 -8715 -5281 -22972 -63796 -55487 -33602 -32030 -21788 -36935 -23859 -2236 -7571 -23667 13702
17775A3702Q545j4646K937j6404K843J3739J650q236J0142K51J5599m236j9166
17762F720j9110l675J8598j1327J8155K039K60R82m246K3281j2060k1260l575
17749e218k6691K174l879q496L949L04R493J8799l807J0441k4188k2006J6931
17736c2194K2098j0482k778o114j622O204M469k048l6789j7749K497N197M2303
17723b7008J4436l5573N11P842j337q03J4497k2495k707k957J2223p590K3507
17710b7454J6773l507l688k3120J2190J0919p148R734J9393k57n744j9560q540
17697c0009K3020N526k9193l866J7381J3970m3648R44K0827j9702j4052K8622
17685c0180J3249L769n851J487J4948j8347j0796m404J7567Q653k3204j832K3212
$$ plain form
17775 13702 22247 7601 10538 -5866 -3023 10716 12366 4130 14272 14523 30122 25886 6720
17762 6720 -12390 -16065 2533 -8794 9361 11400 11660 12642 8396 31677 19617 -1643 -5218
17749 -5218 -31909 -29735 -33614 -42110 -38161 -37857 -28364 -9565 -13372 -2931 -27119 -49125 -32194
17736 -32194 -10096 -20578 -23356 -29470 -31092 -24888 -20419 -22467 -59256 -77005 -74508 -69311 -27008
17723 -27008 -12572 -48145 -47634 -39792 -41129 -41932 -27435 -49930 -52637 -55594 -43371 -50961 -27454
17710 -27454 -10681 -14188 -17876 -40996 -28806 -17887 -25035 -15301 4092 3835 -1909 -21469 -30009
17697 -30009 -6989 -1463 -30656 -34522 -17141 -3171 -46819 -45875 -25048 -44750 -58802 -30180
17685 -30180 -16931 -13162 -19013 -17526 -2578 -20925 -31721 -36125 -18558 -9905 -33109 -34941 -11729
17672a1729J3647q081k1445q987K0349J2435J7442j6547m53K7181O613j7525k3874
17659a0974q687r485J8211m63j0808l3511P614J5912M270J8394m339n653L656
17646a5863j1516r534R213l895Q03J4030R680K0236j5774n694j5130P534J4453
17633a457j0936k1253k6249Q27J1848Q04R511M250n925O926J4907J7085J8283
17620A8621q233k0997k0133j5721L572L2067o201j0594K1564j346k4329J1710
17608b0020N621j243l066N878k430k6076j4774r610K3654j4745m523L2018p158
17595c6474m006L0091O999o27j0925k8957J148P735J2394m698m424O461R257K267
17581a3759K449J0632O470l716l138J1319P435k0660j9024o981j7944J3178J1216
$$ plain form
17672 -11729 1918 -6163 -27608 -36595 -16246 -3811 13631 -2916 -3369 23812 30425 12900 -10974
17659 -10974 -19661 -29146 -10935 -11398 -22206 -55717 -48103 -32191 -27921 -9527 -13866 -19519 -15863
17646 -15863 -27379 -36913 -27700 -31595 -30792 -16762 -7082 13154 -2620 -8314 -23444 -15910 -1457
17633 -1457 -12393 -33646 -59895 -59068 -47220 -46416 -36905 -32655 -38580 -31654 -16747 338 18621
17620 18621 10388 -10609 -30742 -46463 -42891 -10824 -17025 -27619 -6055 -7401 -31730 -20020
17608 -20020 -14399 -15642 -18708 -12830 -15260 -41336 -56110 -65720 -42066 -56811 -61334 -29316 -36474
17595 -36474 -40480 -10389 -3390 -4017 -14942 -43899 -42751 -35016 -22622 -27320 -31744 -25283 -16026 -13759
17581 -13759 -11310 -678 5792 2076 -1062 10257 17692 -2968 -21992 -28973 -46917 -33739 -22523
17568b2523j417J7236J6889K702j6641l986j4750k0138J0153K2135J1494j0485
17556i331k0142L2822L5146k8062K612P72m776j4891J4332k2829k7893J9491K0608
17543b141j0791j2018j3563J3845j8076L830R773K6034J8032K7195j2128l5134
17531e142l2949J0605K2866J3467J2005J660r16M805J760j8460M776k4699L342
17518f880j8805j5164M370K8339j4724j8713J9104R486l6148j6950J2654L4250
17506a9181J1027j7717J6147K1108j0442K1465j6226k163L776Q569L436K2319
17494D2118k7107k864r898j9697J003J5519j5861L278l2947m501J57J3315J6300
17481b1185K679K736K7044J1577j1706q191l3952k4450j549J0915J5366J2638
$$ plain form
17568 -22523 -23940 -6704 10185 12887 -3754 -7740 -22490 -42628 -32475 -10340 1154 -9331
17556 -9331 -29473 3349 38495 10433 13045 13817 9041 -5850 8482 -14347 -42240 -22749 -2141
17543 -2141 -12932 -24950 -38513 -24668 -42744 -38914 -29141 -3107 14925 42120 29992 -5142
17531 -5142 -38091 -27486 -4620 8847 20852 22512 21596 26401 28161 9701 14477 -10222 -6880
17518 -6880 -25685 -40849 -36479 -8140 -22864 -41577 -22473 -12987 -49135 -66085 -53431 -19181
17506 -19181 -8154 -25871 -9724 11384 942 22407 6181 4018 7794 16363 19799 42118
17494 42118 15011 12147 2249 -17448 -16445 -926 -16787 -13509 -46456 -50957 -50800 -37485 -21185
17481 -21185 -18506 -15770 11274 22851 11145 2954 -30998 -55448 -56997 -46082 -30716 -18078
17469a8078J7105r290O857k086j0973P122J2350k549K0198J205j4405m246L184
17456F394j0085J019M149j1010k9344j9776O677L4746J374J583J0182o701j2132
17443b2924M856J9923m353n181k9279K7583J7275j6681j5433K1340k58J2701j3769
17430d200j6940n919J389q294L076j421K0144O285K0095J2795k811l147j6202
17417D850J413n691K5249N526j8200k5564k5442K341K7931m086j0113j0781k00
17404c2767J0830p44q363J5399r495K510j7458q131J2960j4073o321K9686P162
17391a8805R801J1843K513j0143j0812k2243n771L1914M921j910J3719k1067p521
17378b3561K451j2123N753L8374O846p084m708j066r294R905L3067J1939l1753
$$ plain form
17469 -18078 -973 -10263 -3406 -5492 -16465 -9343 3007 458 20656 21861 7456 3210 6394
17456 6394 -3691 -2672 1477 -9533 -38877 -58653 -51976 -17230 -15856 -14273 -4091 -10792 -22924
17443 -22924 -18068 1855 -2498 -7679 -36958 -9375 7900 -8781 -24214 -2874 -3132 9569 -4200
17430 -4200 -21140 -27059 -25670 -33964 -30888 -32309 -12165 -5880 14215 27010 24199 21052 4850
17417 4850 6263 572 25821 31347 13147 -12417 -37859 -35518 -7587 -11673 -21786 -32567 -32767
17404 -32767 -21937 -22681 -31044 -15645 -25140 -22630 -40088 -48219 -35259 -49332 -55653 -25967 -18805
17391 -18805 -9004 2839 5352 -4791 -15603 -37846 -43617 -11703 -6782 -8692 5027 -16040 -23561
17378 -23561 -21110 -33233 -27480 10894 17740 10656 5948 4882 -4412 5493 38560 50499 18746
17365A8746m450m609k3027o731J05j7999J2874l008k8539k1267L5502K2610J7824
17352a969j830p740r682q765j6946M51J8780J5637j8349k1869q684K8150K7284
17339e532j823j6284j012K7217j0199o493R47n127L360m274q664j219J2743J2666
17325c694l444j2385J3061J0107N777o557l688k6407N44J2607J6908q197J1894
17312F526K3533J0797j3648j3329q680j8478O211m755m812Q279J1912l697r632
17299i773J7136J2116K1479O822k7995m9212Q051M933m77k826K337J9435j0779
17286h753q009J2097J1911j7670j5273n5009k6099K8897J7994J1043J3631m481
17274c9721J585M404Q250M552K3143m298R669J5970j480P097j49j9505j5766k2873
$$ plain form
17365 18746 14296 9687 -13340 -20071 -19966 -37965 -25091 -28099 -56638 -77905 -42403 -19793 -1969
17352 -1969 -3799 -11539 -21221 -29986 -46932 -46481 -27701 -12064 -30413 -52282 -60966 -32816 -5532
17339 -5532 -7355 -23639 -24651 2566 -7633 -14126 -13179 -18306 -14946 -19220 -27884 -29103 -16360 -3694
17325 -3694 -7138 -19523 -6462 3645 9422 2865 -823 -27230 -26686 -14079 2829 -5368 6526
17312 6526 30059 40856 27208 13879 5199 -13279 -7068 -11823 -16635 -8356 3556 -141 -9773
17299 -9773 7363 19479 40958 47780 19785 -29427 -21376 -16443 -16920 -19746 -17409 2026 -8753
17286 -8753 -16762 -4665 7246 -10424 -25697 -80706 -106805 -77908 -59914 -48871 -35240 -39721
17274 -39721 -38136 -33732 -25482 -20930 2213 -2085 7584 23554 22074 29171 29022 9517 -6249 -29122
17260b9122J1253k9332n35M950K0280J9380l654J4840K4695J1886Q009l993k130
17247D6527j4604k1743j5882K2959l870R883J7373R894J0237k5127n1240L565
17235a2028R492K7694r484j1863N351J9271o954k7712j3638K5695n77N135j2638
17222b256k5310j070j1244p754j5938K866K2787R564M2671K9183K2188n2278k8413
17209a5004N827M913K4224J8795l488k412j5853m8922N318L8734k097r149M923
17196E809J1936K311R029Q237p616k8434j6282k847j5417k914K0845J6537k1075
17183a9881N673P971J3691L058l172M337M186k4146l0095m50K285J8315J6880
17170a348N952R433q429l1122j4398J1081J7436M503L885J6601j665j0585R332
$$ plain form
17260 -29122 -17869 -47201 -47736 -42786 -22506 -3126 -6780 8060 32755 44641 52650 48657 46527
17247 46527 31923 10180 -5702 17257 13387 23270 40643 50537 60774 35647 -15593 -12028
17235 -12028 -2536 25158 15674 3811 9162 28433 21479 -6233 -19871 5824 5247 10382 -2256
17222 -2256 -27566 -28636 -39880 -47634 -63572 -60706 -37919 -28355 14316 43499 65687 13409 -15004
17209 -15004 -9177 -4264 19960 38755 35267 32855 17002 -31920 -26602 12132 10035 886 5809
17196 5809 17745 20056 29085 37322 29706 1272 -15010 -17857 -33274 -36188 -15343 1194 -19881
17183 -19881 -14208 -6237 7454 10512 7340 11677 15863 -8283 -38378 -38828 -36543 -18228 -1348
17170 -1348 4604 14037 5608 -25514 -39912 -28831 -11395 -6892 -3007 13594 11929 1344 10676
17157A0676O038j1960j092q210J6105l38J0080J763j6953k062L7382J6724j3045
17144D5108O104k0695j0188j5148j7223k1565K4913L5769j1186j0358R912j8479
17132c036k5388R143L6718r798q307O931K1285k57K9004j3487k9593j8585k4879
17119c0249L684J9308K6621O042k0822P113P495k3747m0094k208K4424Q37K016
17106a9580J2824O213M700k0437k201r905J3749J2618K109n47r67J218P960L989
17092A1743j4274Q050J240j0747k7936K0783M7011k3791k6487M994M756K446m667
17079f879m764M732J8649K967k8969p397J2436K1931J3613j0102k7286j0878J0561
17066a1386J7348R418M520m3023L64N631N187Q695k346K674O788j3333p642j6904
$$ plain form
17157 10676 16714 4754 3662 -4548 11557 11219 21299 23062 6109 4047 41429 58153 45108
17144 45108 51212 30517 20329 5181 -12042 -33607 -8694 27075 15889 5531 15443 -3036
17132 -3036 -28424 -19281 17437 7639 -668 6263 27548 27291 56295 42808 13215 -5370 -30249
17119 -30249 -26565 -7257 19364 25406 4584 11697 19192 -4555 -44649 -46857 -22433 -21596 -19580
17106 -19580 -6756 -543 4157 -16280 -18481 -28386 -14637 -2019 90 -457 -1424 -206 7754 11743
17092 11743 -2531 5519 6759 -3988 -31924 -11141 35870 12079 -14408 -9414 -4658 -2212 -6879
17079 -6879 -11643 -6911 11738 14705 -14264 -21661 -9225 12706 26319 16217 -11069 -21947 -11386
17066 -11386 5962 15380 19900 -23123 -22759 -17128 -11941 -3246 -5592 -2918 3870 -9463 -17105 -34009
17052c4009j303J4558J4722N359j2351Q130K1362J546k8343j4248J1005P643p75
17039f704j2989k1248J6112J260K3119J7196j7155j589o594N886J5958N254L9338
17026E7844r545k4342k2093j3392K32J1845P856O118M608k1138N557K0933J9545
17013D4028l0897k7298L3603L3123l509o117j5796J7547Q527j8659q498R639j1749
17000B3944q567k6686K3314L44k0721J2074j3916M738L863N777Q326O841m595
16987A4736l5084K18J0778p695J1206L006J6471L454l9892l805r662M065k1596
16974e3800J5069L7468K0176p104J2440K0929j971k7454J5280k0361l1202P379
16962a3151K8102j6501j7099O274l373k712k277J6827O258M84l0799J7986o065
$$ plain form
17052 -34009 -35312 -20754 -6032 -673 -13024 -4894 16468 18014 -10329 -24577 -13572 -5929 -6704
17039 -6704 -19693 -40941 -24829 -23569 -450 16746 -409 -1998 -8592 -2706 13252 18506 57844
17026 57844 48299 23957 1864 -11528 -11296 549 8405 14523 19131 -2007 3550 24483 44028
17013 44028 13131 -14167 19436 52559 49050 42933 27137 44684 53211 34552 26054 35693 23944
17000 23944 15377 -11309 12005 12349 -8372 3702 -10214 -5476 -1613 4164 12490 19331 14736
16987 14736 -20348 -20130 -9352 -17047 -5841 -2835 13636 17090 -22802 -26607 -36269 -32204 -53800
16974 -53800 -38731 -1263 18913 11809 24249 45178 43207 15753 31033 10672 -20530 -13151
16962 -13151 14951 -1550 -18649 -12375 -15748 -18460 -20737 -3910 2348 2832 -27967 -9981 -16046
16949a6046K067J1958N664j0853p883J5798l2282j1553K5072J3332R278J5368
16937A9920K7061q375j0881J7657M80p302j0833k849j0051N969P506J1930j5057
16924B5175m950o106O130K226K0680p770k1046J9492j7090L798P715J5050N52
16911D3856r07j2757J9462K6845N182k87j3780j0389L938j6170o321l5185J0596
16898A4083Q126j1776j1353r223k2767r167K3037k2056j4260K5799L2091J6034
16886A8568M420j4599r906M745o956k857R651n04J1815k4614j9604J0576K4911
16873E646O42k170J6236r578J56K4141J4574J9761k5771j6642j6783L001K4257
16860C7470L133J008j6613o44p497q764j7503j4475o644J5225J498J9616j5584
$$ plain form
16949 -16046 -13979 -2021 3643 -7210 -15093 705 -31577 -43130 -18058 -4726 4552 19920
16937 19920 46981 38606 27725 45382 45862 38560 27727 24878 14827 20796 28302 40232 25175
16924 25175 20225 14119 20249 22475 43155 35385 14339 33831 16741 20539 28254 43304 43856
16911 43856 42949 30192 49654 76499 81681 81394 67614 57225 61163 44993 38672 3487 14083
16898 14083 22209 10433 -920 -10143 -32910 -42077 -19040 -41096 -55356 -29557 2534 18568
16886 18568 22988 8389 -1517 3228 -3728 -6585 3066 2562 14377 -10237 -29841 -19265 5646
16873 5646 6288 4118 20354 10776 10932 35073 49647 69408 43637 26995 10212 13213 37470
16860 37470 40603 41611 24998 24354 16857 8093 -9410 -23885 -30529 -15304 -13806 5810 -9774
16847i774K323K8916j1032l0337q175K08N718r042J7843L980j1351M057J2820
16834c846L1805j891k0668j1602l396o812K809J3124K1858K447O187j1620j744
16821A6651O341J5955o843j8150P289L3490L7903k3291l3676k0662J3597J2077
16809D0681J1389k3331l0279j6285M923M600L1105j192j2892L918Q246L4442K1865
16796G7190M08Q744l571o116k0980l393j2568k0415r215J610J6962J5919q359
16783C6216k0922j3426j850j0038J1842L5983J7061J3999n417j6106M131N761
16771E7234k2421n742K872L12J2481L915j4411k2522l415J6458O769k5821j1083
16758e374n716K0429K6820o329M121k419Q50J380K1384J4510l258k8681J2416
$$ plain form
16847 -9774 -7451 21465 10433 -19904 -28079 -27871 -22153 -31195 -13352 -9372 -20723 -16666 -3846
16834 -3846 27959 26068 5400 -6202 -9598 -16410 -13601 -477 21381 23828 30015 18395 16651
16821 16651 22992 38947 32104 13954 21243 54733 92636 69345 35669 15007 28604 40681
16809 40681 52070 28739 -1540 -17825 -12902 -8302 22803 21611 8719 12637 20883 55325 77190
16796 77190 77598 86342 82771 76655 55675 52282 39714 19299 10084 11694 28656 44575 36216
16783 36216 15294 1868 18 -10020 1822 37805 54866 68865 63448 47342 51473 57234
16771 57234 34813 29071 31943 32255 44736 48651 34240 11718 8303 24761 31530 5709 -5374
16758 -5374 -11090 9339 36159 29830 33951 31532 32382 33762 55146 69656 66398 37717 50133
16745E0133k4686N179j0627j9713n204j6651l0786k070K0460K8004K1728K3360
16733C9127J1154J302M875j7258L712J6215R244J8126j7633k7217O16j0820K164
16720C3607K0897J809j245j3539l4970K5369J8082K0636p922R54k0656l5439j0956
16707c373k16K4790J8893L5528k7208k3475l288R779r278j5253L5495K1679Q653
16694G2726M654q217j5338L13r862m093J2968J3737r507l6433P613q392o033L079
16680A7215K8452J1237r713p394L005J7856k4396P405J122L1792J2090j9824j3382
16667E5465l875J9094j0151j6401n290O969N801j1310j7559O668O066J2507j4341
16654C3643m662J1560r753J9092J5974n530j9587R785L772j1840k7764J3756M8138
$$ plain form
16745 50133 25447 30626 19999 286 -4918 -21569 -52355 -54425 -33965 -5961 15767 39127
16733 39127 50281 51583 56458 39200 42912 59127 68371 86497 68864 41647 42263 31443 33607
16720 33607 54504 56313 55068 41529 6559 31928 50010 70646 62724 63678 43022 7583 -3373
16707 -3373 -3589 21201 40094 75622 48414 24939 21651 31430 22152 6899 42394 64073 72726
16694 72726 77380 69163 53825 54138 44276 40183 53151 66888 57381 20948 28561 20169 14136 17215
16680 17215 45667 56904 47191 39797 42802 60658 36262 43667 44789 76581 88671 68847 55465
16667 55465 51590 70684 60533 44132 38842 45811 51612 40302 22743 29411 35477 47984 33643
16654 33643 28981 40541 30788 49880 65854 60324 40737 50522 54294 42454 14690 28446 76584
16641G6584J5642k6748j8708K2053R902J381M102R650k7260j0556r745j1277N985
16628D1005l692j531J0741J3545k4225j3313J0804J8740k861j6098J1002J9629
16616F3746n662Q748J569m7198k4484P10J0475J9176L6485J2596l81J3789J0094
16603I9663q318o098p62o938J2803J0545o273j1738q082J0418k461k4734J4715
16590G2740q703k1699M592j7967j8966O329J6108l09J6149J5565J590k0428J4887
16577E9888L1435J7738j527n829p022j2723j2900n443k356J7132K9090K7358p042
16564A27799q587L570j9734l3808L654M0134L029l1552j4602K400K893L276j4199
16551F4273k0278K1370K965O729K0501J9263j1243k9546r21Q213l1879j4462J2918
$$ plain form
16641 76584 92226 65478 46770 68823 78725 80106 84208 93858 66598 56042 46297 35020 41005
16628 41005 37313 35782 46523 60068 35843 22530 33334 52074 49213 33115 44117 63746
16616 63746 58084 66832 68401 21203 -3281 -2571 7904 27080 63565 76161 75780 89569 99663
16603 99663 91345 85247 84485 77547 90350 100895 94622 82884 74802 85220 82759 58025 72740
16590 72740 64037 42338 46930 28963 9997 16326 32434 32125 48274 63839 65429 45001 59888
16577 59888 91323 109061 107534 101705 94683 81960 69060 63617 61261 78393 107483 134841 127799
16564 127799 119212 122782 103048 69240 72894 113028 116057 84505 69903 72303 75196 78472 64273
16551 64273 43995 65365 68330 75059 95560 114823 103580 74034 73113 81326 49447 34985 47903
16538D7903O047Q253J8273K2754m146j4529J9426n675N470j8440j1646j4052l82
16525E9256K8785K1671n52j0162J4294k0432m593K0338j2259j914l880K751r592
16512H3711M581L705J0904j0860k0751O937j4168j1946O846l9818K0909K0456
16500F0506K7472p435R295L879k4797k8943R849L3282R030j5923K0199j2346k9185
16487E4883j6369K6250K8390M314m5606M079K3460J8846Q794o43n793j0197k7319
16474F3089K5199L4367j6220J94K0466j4818l27k768L060q863J8190k813j2178
16461A06578n313M333J9186o600j0397k2099J2552K5172Q614m521M220J5893m771
16448A42847k0528l018R365p820j3236j4706R458o952l353J0367J9016M56M683
$$ plain form
16538 47903 53950 62203 80476 103230 99084 84555 103981 98306 103776 85336 73690 59638 59256
16525 59256 88041 109712 109160 98998 113292 92860 88267 108605 96346 94432 90552 93303 83711
16512 83711 88292 91997 102901 92041 71290 78227 64059 52113 58959 19141 40050 60506
16500 60506 87978 80543 89838 93717 68920 39977 49826 83108 92138 76215 96414 84068 54883
16487 54883 38514 64764 93154 97468 51862 55941 79401 98247 107041 106398 100605 90408 63089
16474 63089 88288 122655 106435 106629 127095 112277 111950 109182 112242 103379 121569 118756 106578
16461 106578 101265 105598 124784 118184 107787 85688 98240 123412 132026 127505 131725 147618 142847
16448 142847 122319 119301 128666 120846 107610 92904 102362 95410 92057 102424 121440 121896 126579
16435A26579L217M170m5146n364p668Q973o338J6382Q976q746j2766K985K6113
16422A11367q90J167o540J2268J4252j7252k6058q131K4256J5133j3025j100P770
16409A13217k5438O924M0315L7508j4524m7717q568J5792r995j8976j4937N443
16397G9044N208l101K4892R037l7214K2820K3860j3369Q295K7074J5794J665o578
16384A57427k0401o636K6408k015J2800K768m725j6624j4022k1508p596J2620
16372A18496J7647J7788k511N634j9093l611J5553N972l730K6459R050J1480L1274
16359B30408j9037j9304k3646j2707J3882J9487j2919l8452j9695l902r616J9055
16347A23554K0715M931j0755j3991J9110K4330R916j9341O542J4799l130j1907
$$ plain form
16435 126579 129796 133966 88820 83456 75788 84761 78423 94805 103781 95035 82269 85254 111367
16422 111367 110477 111644 105104 117372 131624 114372 88314 80183 104439 119572 106547 105447 113217
16409 113217 87779 94703 135018 172526 158002 110285 101717 117509 107514 88538 73601 79044
16397 79044 84252 81151 106043 115080 77866 100686 124546 111177 119472 146546 162340 164005 157427
16384 157427 137026 130390 156798 154783 167583 170351 165626 149002 134980 113472 105876 118496
16372 118496 136143 153931 151420 157054 137961 134350 149903 155875 152145 178604 187654 199134 230408
16359 230408 211371 192067 168421 155714 169596 189083 176164 137712 118017 114115 104499 123554
16347 123554 144269 149200 138445 124454 143564 167894 177810 158469 165011 179810 176680 164773
16335A64773M699J424q90q756K75p073q907j139K0295J141k3388J1209N791O12
16321A60066J0664L176j8251k3450o705K7730J1420J8074L1487k0094K727N258
16309B02102l3007N972M834m034k22J0015k0618K5159L6294K2215j1775k5550
16297B11385M778J2922L94R680L836J8924O073j0703l5783K151R54L942p533o718
16283B14302l488N617J0935L1173p188r636q126J1355M327l765J1144K413m154
16270B54909J0126j399j1551N072N3P967j9606k9485j5670J3489N1381K1800K982
16257B90068l186l421k6322l1933j5551k419L2906K8308L6962L820j4128O923
16245C02027M757l52j5268k8870J1279O349K2952L3842j5090j0175J0529m17N2
$$ plain form
16335 164773 169472 170896 170006 161250 161525 154452 145545 144406 164701 165842 142454 153663 159454 160066
16321 160066 170730 173906 155655 132205 125500 153230 164650 182724 214211 194117 196844 202102
16309 202102 169095 175067 179901 175867 175645 185660 165042 190201 226495 248710 236935 211385
16297 211385 216163 229085 229479 239159 242995 261919 267992 257289 221506 223657 224611 228553 221020 214302
16283 214302 210814 216431 227366 258539 251351 241715 233589 244944 249271 245506 256650 259063 254909
16270 254909 265035 263636 252085 257157 257210 265177 245571 216086 200416 213905 265286 287086 290068
16257 290068 286882 283461 257139 225206 209655 207236 240142 268450 305412 309232 295104 302027
16245 302027 306784 306432 291164 262294 273573 279922 302874 336716 321626 311451 321980 321563 321615
16232C21615q243J3380P215k499L747N229L7712L7125J3880j2732P996K4318K1584
16219D70327j1481J1739J7058K0815L1485O0223N5927L9243O4353K8728J4189
16208H02606R25L812j4346l9676k8644l7295l0251q475j2858k8005j8723j5073
16196E73997k612J9511r417o664K0695Q388K5376P226j799J2001J6021K803j8318
16183F47208k4863k0681N970J3028j1724m2103k0674J9690O056J6814L634j5593
16171E76762j1581L2969K6892j7229j6990m348Q192J701l836k370J6313K7676
$$ plain form
16232 321615 313372 326752 333967 331468 335215 340444 378156 415281 429161 416429 424425 448743 470327
16219 470327 458846 470585 487643 508458 539943 600166 656093 695336 759689 788417 802606
16208 802606 803531 807343 792997 753321 724677 687382 657131 648656 635798 607793 589070 573997
16196 573997 571385 590896 581479 574815 595510 603898 629274 636500 634701 646702 662723 665526 647208
16183 647208 622345 601664 607634 620662 608938 566835 546161 565851 571907 588721 592355 576762
16171 576762 565181 598150 625042 607813 590823 586475 594667 596368 592532 590162 606475 634151
$$ [...]
##END NTUPLES=NMR SPECTRUM
##END=
