##TITLE=Analysis number 322722
Compound Code tl 00917
Project Code adrs
Chemist Name fudan
##JCAMPDX= 6.0         $$ Bruker NMR JCAMP-DX V2.0
##DATA TYPE= NMR SPECTRUM
##DATA CLASS= NTUPLES
##ORIGIN= Bruker BioSpin GmbH
##OWNER= nmr
$$ XWIN-NMR		Version 3.5
$$ Sat Oct 14 11:16:12 2006 GMT Daylight Time (UT+1h)  MAYBRIDGE\nmr@NMR_250MHZ
##.OBSERVE FREQUENCY= 250.131544655141
##.OBSERVE NUCLEUS= ^1H
##.ACQUISITION MODE= SIMULTANEOUS (DQD)
##.ACQUISITION SCHEME= undefined
##.AVERAGES= 16
##.DIGITISER RES= 18
##SPECTROMETER/DATA SYSTEM= dpx250
##.PULSE SEQUENCE= zg30
##.SOLVENT NAME= CDCl3
##.SHIFT REFERENCE= (INTERNAL, CDCl3, 0, 16.522)
##AUDIT TRAIL= $$ (NUMBER, WHEN, WHO, WHERE, WHAT)
$$ ##TITLE= Audit trail, XWIN-NMR		Version 3.5
$$ ##JCAMPDX= 5.01
$$ ##ORIGIN= Bruker BioSpin GmbH
$$ ##OWNER= nmr
$$ C:\u/data/dgb/nmr/ADRS/280/pdata/1/auditp.txt
$$ ##AUDIT TRAIL=  $$ (NUMBER, WHEN, WHO, WHERE, WHAT)
(   1,<2006-10-14 11:15:52.17 +100>,<MAYBRIDGE\nmr>,<NMR_250MHZ>,
      <created by zg, POWCHK disabled, PULCHK disabled
       configuration hash MD5:
       49 4B E0 1D 92 C2 6B 37 9F E6 65 BC 52 41 86 1D
       data hash MD5: 64K
       C0 BD A1 43 40 6E CF 25 3A 9C 3C DF 83 0C E9 36>)
(   2,<2006-10-14 11:16:03.23 +100>,<MAYBRIDGE\nmr>,<NMR_250MHZ>,
      <Start of raw data processing
       ef LB = 0.3 FT_mod = 6 PKNL = 1 SI = 32K 
       data hash MD5: 32K
       C6 CB AB A0 68 01 42 EE B4 A6 56 7F 84 30 52 2E>)
(   3,<2006-10-14 11:16:04.84 +100>,<MAYBRIDGE\nmr>,<NMR_250MHZ>,
      <apk 
       data hash MD5: 32K
       C6 C5 3C A3 86 8D 81 03 50 39 C3 C9 DC 5F 61 7F>)
(   4,<2006-10-14 11:16:05.64 +100>,<MAYBRIDGE\nmr>,<NMR_250MHZ>,
      <abs ABSG = 5 
       data hash MD5: 32K
       F5 A8 2E 4A 27 96 88 92 6C 2D FF 6B E3 82 F9 C5>)
$$ ##END=
$$ 
$$ hash MD5
$$ 58 C1 9D F6 5A E8 A4 FB 12 26 AD 70 E1 9A B1 19
##$RELAX= 
##$RELAX= 
##$RELAX= 
##$RELAX= 
##$RELAX= 
##$RELAX= 
##$RELAX= 
$$ Bruker specific parameters
$$ --------------------------
##$DU= <C:\u>
##$EXPNO= 280
##$NAME= <ADRS>
##$PROCNO= 1
##$TYPE= <nmr>
##$USER= <dgb>
##$AMP= (0..31)
100 100 100 100 100 100 100 100 100 100 100 100 100 100 100 100 100 100 
100 100 100 100 100 100 100 100 100 100 100 100 100 100 
##$AQSEQ= 0
##$AQ_mod= 3
##$AUNM= <au_zg>
##$AUTOPOS= <5 >
##$BF1= 250.13
##$BF2= 250.13
##$BF3= 250.13
##$BF4= 250.13
##$BF5= 500.13
##$BF6= 500.13
##$BF7= 500.13
##$BF8= 500.13
##$BYTORDA= 1
##$CFDGTYP= 0
##$CFRGTYP= 5
##$CHEMSTR= <none>
##$CNST= (0..31)
1 1 145 1 1 1 1 1 1 1 1 1 1 1 1 1 1 1 1 1 1 1 1 1 1 1 1 1 1 1 1 1 
##$CPDPRG= <>
##$CPDPRG1= <>
##$CPDPRG2= <>
##$CPDPRG3= <>
##$CPDPRG4= <mlev>
##$CPDPRG5= <mlev>
##$CPDPRG6= <mlev>
##$CPDPRG7= <mlev>
##$CPDPRG8= <mlev>
##$CPDPRGB= <>
##$CPDPRGT= <>
##$D= (0..31)
0 1 0 0 0 0 0 0 0 0.06 0 0 0 0 0 0 0.0002 0 0 0 0 0 0 0 0 0 0 0 0 0 0 
0 
##$DATE= 1160820950
##$DBL= (0..7)
120 120 120 120 120 120 120 120 
##$DBP= (0..7)
150 150 150 150 150 150 150 150 
##$DBP07= 0
##$DBPNAM0= <>
##$DBPNAM1= <>
##$DBPNAM2= <>
##$DBPNAM3= <>
$$ [...]
##$SUBNAM7= <"">
##$SUBNAM8= <"">
##$SUBNAM9= <"">
##$SW= 20.6930455092707
##$SWIBOX= (0..15)
0 0 3 0 0 0 0 0 0 0 0 0 0 0 0 0 
##$SW_h= 5175.983436853
##$TD= 65536
##$TD0= 1
##$TE= 683.16
##$TE2= 300
##$TE3= 300
##$TEG= 300
##$TL= (0..7)
0 120 120 120 120 120 120 120 
##$TP= (0..7)
150 150 150 150 150 150 150 150 
##$TP07= 0
##$TPNAME0= <>
##$TPNAME1= <>
##$TPNAME2= <>
##$TPNAME3= <>
##$TPNAME4= <>
##$TPNAME5= <>
##$TPNAME6= <>
##$TPNAME7= <>
##$TPOAL= (0..7)
0.5 0.5 0.5 0.5 0.5 0.5 0.5 0.5 
##$TPOFFS= (0..7)
0 0 0 0 0 0 0 0 
##$TUNHIN= 0
##$TUNHOUT= 0
##$TUNXOUT= 0
##$USERA1= <user>
##$USERA2= <user>
##$USERA3= <user>
##$USERA4= <user>
##$USERA5= <user>
##$V9= 5
##$VALIST= <valist>
##$VCLIST= <CCCCCCCCCCCCCCC>
##$VD= 0
##$VDLIST= <DDDDDDDDDDDDDDD>
##$VPLIST= <PPPPPPPPPPPPPPP>
##$VTLIST= <TTTTTTTTTTTTTTT>
##$WBST= 1024
##$WBSW= 4
##$XGAIN= (0..3)
0 0 0 0 
##$XL= 0
##$YL= 0
##$YMAX_a= 388927
##$YMIN_a= -600688
##$ZGOPTNS= <>
##$ZL1= 120
##$ZL2= 120
##$ZL3= 120
##$ZL4= 120
##$ABSF1= 16.522
##$ABSF2= -4.171173
##$ABSG= 5
##$ABSL= 3
##$ALPHA= 0
##$AQORDER= 0
##$ASSFAC= 0
##$ASSFACI= 0
##$ASSFACX= 0
##$ASSWID= 0
##$AUNMP= <proc_1d>
##$AZFE= 0.1
##$AZFW= 0.1
##$BCFW= 0
##$BC_mod= 0
##$BYTORDP= 0
##$COROFFS= 0
##$CY= 12.5
##$DATMOD= 1
##$DC= 0
##$DFILT= <>
##$DTYPP= 0
##$F1P= 14.0000005364418
##$F2P= -0.99999901652339
##$FCOR= 0.5
##$FTSIZE= 32768
##$FT_mod= 6
##$GAMMA= 0
##$GB= 0
##$INTBC= 1
##$INTSCL= 1
##$ISEN= 128
##$LB= 0.3
##$LEV0= 0
##$LPBIN= 0
##$MAXI= 10000
##$MC2= 0
##$MEAN= 0
##$ME_mod= 0
##$MI= 0
##$NCOEF= 0
##$NC_proc= -3
##$NLEV= 6
##$NOISF1= 0
##$NOISF2= 0
##$NSP= 0
##$NTH_PI= 0
##$NZP= 0
##$OFFSET= 16.522
##$PC= 1
##$PHC0= 162.0232
##$PHC1= 5.127266
##$PH_mod= 1
##$PKNL= yes
##$PPARMOD= 0
##$PSCAL= 4
##$PSIGN= 0
##$REVERSE= no
##$SF= 250.13
##$SI= 32768
##$SIGF1= 0
##$SIGF2= 0
##$SINO= 400
##$SIOLD= 32768
##$SREGLST= <1H.CDCl3>
##$SSB= 0
##$STSI= 32768
##$STSR= 0
##$SW_p= 5175.98343685301
##$SYMM= 0
##$S_DEV= 0
##$TDeff= 65536
##$TDoff= 0
##$TI= <Analysis number 999999
Compound Code 99
Book Reference 9
Project Code 9>
##$TILT= no
##$TM1= 0
##$TM2= 0
##$TOPLEV= 0
##$USERP1= <user>
##$USERP2= <user>
##$USERP3= <user>
##$USERP4= <user>
##$USERP5= <user>
##$WDW= 1
##$XDIM= 32768
##$YMAX_p= 411421365
##$YMIN_p= -36062
$$ End of Bruker specific parameters
$$ ---------------------------------
##NTUPLES= NMR SPECTRUM
##VAR_NAME=  FREQUENCY,     SPECTRUM/REAL,   SPECTRUM/IMAG
##SYMBOL=    X,             R,               I
##VAR_TYPE=  INDEPENDENT,   DEPENDENT,       DEPENDENT
##VAR_FORM=  AFFN,          ASDF,            ASDF
##VAR_DIM=   32768,         32768,           32768
##UNITS=     HZ,            ARBITRARY UNITS, ARBITRARY UNITS
##FACTOR=    0.157963299565203, 1,           1
##FIRST=     4132.6476996994, 0,             0
##LAST=      -1043.33573715361, 0,           0
##MIN=       -1043.33573715361, -36062,      0
##MAX=       4132.6476996994, 411421365,     0
$$ Real data points
##PAGE= N=1
##DATA TABLE= (X++(R..R)), XYDATA
$$ [...]
16766A8387L174n34N35J0677l872p568n578l663Q64p863l767N838L209N704K582
$$ 18387 21561 21027 21562 32239 28367 20799 15221 11558 12422 4559 792 6630 9839 15543 18125
16751A8125K070n056n311O211Q846k0j4175j516L890K208J0256j0885j0487J798
$$ 18125 20195 15139 9828 16039 24885 24865 10690 9174 13064 15272 25528 14643 4156 5954
16737E954l723J895p57J212P0O809Q250q95K284M227L30p457l338m917m914j914
$$ 5954 2231 4126 3369 4581 4651 11460 19710 18815 21099 25326 25656 18199 14861 9944 5030 3116
16721C116K706k519r495q948N218R95k533N506Q698P896k826R122R505j025j4269
$$ 3116 5822 3303 -6192 -15140 -9922 -8927 -11460 -5954 2744 10640 7814 16936 26441 25416 11147
16706A1147j2189M536M875m75j778r579l304P792J524q232M344L574M26R443Q057
$$ 11147 -1042 3494 8369 7894 6116 -3463 -6767 1025 2549 -5683 -1339 2235 2661 12104 20161
16691B0161N474k50j304J884k097o734j6064O270N759m765K974m125J682O534
$$ 20161 25635 25385 24081 25965 23868 17134 1070 7340 13099 8334 11308 7183 8865 15399
16677A5399K615L754j1077j0075l433M370O251L392j4467J160j921j541m780P2
$$ 15399 18014 21768 10691 616 -2817 1553 7804 11196 -3271 -2111 -4032 -5573 -10353 -10281
16663a0281O63j1443K167N701Q36L202N951J431J2456J686p959j0434L372O234
$$ -10281 -9618 -21061 -18894 -13193 -12357 -9155 -3204 -1773 10683 12369 4410 -6024 -2652 3582
16649C582l581o952L099R214l89n026j1367P845R025K50k077k266Q751N17k268
$$ 3582 1 -6951 -3852 5362 4973 -53 -11420 -3575 5450 5700 3623 1357 10108 10625 8357
16634H357M498o84j2644n006J7648J1626q80n514L997j0596m980O584m06n17q313
$$ 8357 12855 12171 -473 -5479 12169 23795 22915 17401 21398 10802 5822 12406 12000 11483 3170
16619C170j935J893J0830l3r521L907K451k871L845Q593l556L347O235J098K786
$$ 3170 1235 3128 13958 13925 4404 8311 10762 7891 11736 20329 16773 20120 26355 27453 30239
16604C0239q748m568o495p695Q37L103K680l649l435O80k383n017l776K159J2310
$$ 30239 21491 16923 10428 2733 3570 6673 9353 5704 2269 2949 566 -4451 -8227 -6068 6242
16589F242P042K857N232q910l139L062q34M008l270q765p028K396Q215p984j60
$$ 6242 13284 16141 21373 12463 9324 12386 11552 15560 12290 3525 -3503 -1107 7108 -876 -1036
16574a036N483k224J11J3935K79j4456KJ32L986l354J735R074K826m982K21P72
$$ -1036 4447 2223 2334 16269 16548 2092 2094 2226 6212 2858 4593 13667 16493 11511 11732 12504
16558A2504R290r81j0657k0179K550J1766Q584P407k810o274p298o662m792j067
$$ 12504 21794 20813 10156 -10023 -7473 4293 12877 20284 17474 11200 3902 -2760 -7552 -8619
16544h619q83l7N08P832M088l272j952R297j747Q23m768J743J2105J0910q04j388
$$ -8619 -9502 -9539 -9031 -1199 2889 -383 -2335 6962 5215 6038 1270 3013 15118 26028 25224 23836
16528B3836k279k117N746k773n40m850k229n789m781M296j929j562p320m8N114
$$ 23836 21557 19440 25186 22413 21873 17023 14794 9005 4224 8520 6591 5029 -2291 -2339 2775
16513B775K851R236o817q025M48J273L445O770Q8k400L866m281k221Q39k38J867
$$ 2775 5626 14862 8045 20 468 1741 5186 11956 12044 9644 13510 9229 7008 7847 7609 9476
16497I476N588k641K767j600m38k987k510J613J967p866J013R981j949n954N96
$$ 9476 15064 12423 15190 13590 13152 10165 7655 9268 11235 3369 4382 14363 12414 6460 7056
16482G056n839L482L499q335L239q68m952l858L06j708N683Q330j0124r797k70
$$ 7056 1217 4699 8198 -137 3102 2234 -2718 -6576 -6270 -7978 -2295 6035 -4089 -13886 -14156
16467a4156O238K746P273K246l108N547L463M529o42m180P864K890k690j924j63
$$ -14156 -7918 -5172 2101 4347 1239 6786 10249 14778 14136 9956 17820 20710 18020 16096 15933
16452A5933m717q024K508O755l920n125o512j596L696n020l410M236R398l064
$$ 15933 11216 3192 5700 12455 8535 3410 -3102 -4698 -1002 -6022 -9432 -5196 4202 1138
16438A138J955J3763K62J90Q340j813j5225l210m218j3591n474j699Q654l568
$$ 1138 3093 16856 17118 17308 25648 23835 8610 5400 1182 -12409 -17883 -19582 -10928 -14496
16424a4496M164N998M533L492n280O698P721J304m028J237n369m30n423N980K192
$$ -14496 -10332 -4334 199 3691 -1589 5109 12830 14134 10106 11343 5974 5544 121 6101 8293
16409H293n339p941K918p00O32k543O784Q990N216O57l113N118j455o394q467
$$ 8293 2954 -4987 -2069 -2769 -2137 -4680 2104 11094 16310 16967 13854 18972 17517 11123 2656
16394B656j0205R225O121j974r360p257P685O121m93o2J688O983M288l433l826
$$ 2656 -7549 1676 7797 5823 -3537 -10794 -3109 3012 2519 2457 4145 11128 15416 11983 8157
16379H157O240m88j4334o413K135Q470L89K053p25M07j030p56N753j230J810n727
$$ 8157 14397 13909 -425 -6838 -4703 3767 4156 6209 5484 5891 4861 4105 9858 8628 10438 4711
16363D711m99K555M227o771J528J2667q476K144J885j0392k041J1386n963j0157
$$ 4711 4212 6767 10994 4223 5751 18418 9942 12086 13971 3579 1538 12924 6961 -3196
16349c196l527P18J0105m383j128M769O983N029j1995o240p286N308l041K884
$$ -3196 -6723 -6005 4100 -283 -1411 3358 10341 15370 3375 -2865 -10151 -4843 -7884 -5000
16335e000J0965J501m825L878M090J70l134q757j090O059J827O310oj957r944
$$ -5000 5965 7466 2641 6519 10609 10779 7645 -1112 -2202 3857 5684 11994 11988 10031 87
16320H7k1176k249K3814N047K158J0514r75r816k893j672o68m24Q231O245P20
$$ 87 -21089 -23338 476 5523 7681 18195 17220 7404 4511 2839 2171 1747 9978 16223 16943
16305A6943O9M590Q36o419l651p231j1010r500k1J3889Q126J6011P26M619j713
$$ 16943 17012 21602 22438 16019 12368 5137 -5873 -15373 -15394 -1505 6621 22632 23358 27977 26264
16290B6264l932j1726r939L739K632j1612p0J0448j104j33k376q034K134P434
$$ 26264 22332 10606 667 4406 7038 -4574 -4644 5804 4700 4567 2191 -5843 -3709 3725
16276C725P660K740n989j474j0722k723Q640O026L59k024n296p350m919O7J2606
$$ 3725 11385 14125 8136 6662 -4060 -6783 1857 7883 8242 6218 922 -6428 -11347 -11280 1326
16261A326R379j869m256n406J135J1241K461j401m134j580m765n069k342M415
$$ 1326 10705 8836 4580 -826 309 11550 14011 12610 8476 6896 2131 -2938 -5280 -865
16247h65O427L253J621k281j187k264j165J034p325j2353k288O379P432M200l710
$$ -865 5562 8815 10436 8155 6968 4704 3539 4573 -2752 -15105 -17393 -11014 -3582 618 -3092
16232c092J17m00p175q62R576Q090m032j1920o80R34R473Q186k470n928n04k547
$$ -3092 -2975 -3375 -10550 -11412 -1836 6254 2222 -9698 -10378 -9444 29 8215 5745 -183 -687 -3234
16216c234O758L785N334q104p82L872r718k635N016j675o8j180k2N87N206M315
$$ -3234 3524 7309 12643 4539 3757 7629 -2089 -4724 292 -1383 -1451 -2631 -2653 -2066 3140 7455
16200G455P466q296j3011L271N188K073J031r440j459k354J026O668m712n676
$$ 7455 14921 6625 -6386 -3115 2073 4146 5177 -4263 -5722 -8076 -7050 -382 -5094 -10770
16186a0770O361K441o49l304L059K020P375L486j2220p144J1531L757l780m761
$$ -10770 -4409 -1968 -2617 -5921 -2862 -842 6533 10019 -2201 -9345 2186 5943 2163 -2598
16172b598J17p093K994O700o01N067R80J88M503P895j2926p290j886j687l907
$$ -2598 -2481 -9574 -6580 120 -481 4586 5566 5754 10257 18152 5226 -2064 -3950 -5637 -9544
16157i544k900n887j880M848O850M723r35K716l508J735N353O010L588r838k41
$$ -9544 -12444 -18331 -20211 -15363 -8513 -3790 -4725 -2009 -5517 -3782 1571 7581 11169 1331 1090
16142A090n47j6060k925J2814O381k467K711K300p625j0752k861Q480K615Q426
$$ 1090 543 -15517 -18442 -5628 753 -1714 997 3297 -4328 -15080 -17941 -9461 -6846 1580
16128A580L705j428j804k897j864j733m060J1026J785N884P783j345m559k730
$$ 1580 5285 3857 2053 -844 -2708 -4441 -8501 2525 4310 10194 17977 16632 12073 9343
16114I343p125r443O803J561j479k630j046o80N595L957p680p859l849j90k408
$$ 9343 2218 -7225 -422 1139 -340 -2970 -4016 -4696 899 4856 -2824 -10683 -14532 -14722 -17130
16099a7130L923L859OJ5321P239j0284l314N015N325O84o263p241P186K909j1223
$$ -17130 -13207 -9348 -9342 5979 13218 2934 -380 4635 9960 10644 4381 -2860 4326 7235 -3988
16084c988K258R829k856j584p161K482m169m764K931k82o138O9J606J180k351
$$ -3988 -1730 8099 5243 3659 -3502 -1020 -5189 -9953 -7022 -7304 -13442 -13373 -11767 -10587 -12938
16069a2938J4494Q485q223n061R30R712P195q118m464n792L056M299r518m2L187
$$ -12938 1556 10041 1818 -3243 -2313 7399 14594 6476 2012 -3780 -724 3575 -5943 -5985 -2798
16054b798M322L236R741j0000j0733j819k976j059Q826P53p116j419N30j436O117
$$ -2798 1524 4760 14501 4501 -6232 -8051 -11027 -12086 -3260 -2507 -9623 -11042 -10512 -11948 -5831
16039e831n6K454Q153m038K681m641m937N782N294n862K222J1844O082j1778j4493
$$ -5831 -5887 -3433 4720 682 3363 -1278 -6215 -433 4861 -1001 1221 13065 19147 7369 -7124
16024g124K0J089r87p049q56O79J3675M339n4k437o092m295J0503j745l362k372
$$ -7124 -7104 -6015 -7002 -14051 -14907 -14228 -553 3786 3732 1295 -4797 -9092 1411 -334 -3696 -6068
16008f068L509p186J1239P346m956O69K991J554k273O206K874j86l052j0364J742
$$ -6068 -2559 -9745 1494 8840 3884 4553 7544 9098 6825 13031 15905 15719 12667 2303 4045
15993D045N83K5j742p808p105J044R559j454J878j033J83N78r773K09q95p032
$$ 4045 4628 4653 2911 -4897 -12002 -10958 -1399 -2853 -975 -2008 -1825 -1247 -11020 -10811 -11706 -18738
15977a8738q249j544J1726P983M161K549K226J716o022n222k63J17N559J0142
$$ -18738 -26987 -28531 -16805 -8822 -4661 -2112 114 1830 -4192 -9414 -9677 -9560 -4001 6141
15963F141J1302j201L196j1078j1400k023J0949P524L100Q122j728j2580m544
$$ 6141 17443 16242 19438 8360 -3040 -5063 5886 13410 16510 24632 22904 10324 5780
15950E780K339l735j5076j12J0254J719r092J255j2174K787J1471M925j919J840
$$ 5780 8119 4384 -10692 -10804 -550 1169 -7923 -6668 -18842 -16055 -4584 341 -1578 262
15936B62j90R28o005l245L633o128j0021m640M425O808Q929K134J807O639R47
$$ 262 72 1000 -5005 -8250 -4617 -10745 -20766 -25406 -20981 -14173 -5244 -3110 -1303 5336 6283
15921F283p982p086P09J1919k945p465J1228J5668j788j9997q924J0500Q905K1
$$ 6283 -1699 -8785 -8076 3843 898 -6567 4661 20329 18541 -1456 -10380 120 9025 9046
15907I046o564q768q825O726L407k380j868N038k986o919N68J6668m226j469J633
$$ 9046 2482 -6286 -15111 -8385 -4978 -7358 -9226 -4188 -7174 -14093 -13525 3143 -1083 -2552 -919
15892i19J031j48j22p583o381P92L897L439j2997N29O766n67q56M565J3398O780
$$ -919 112 -36 -158 -7741 -14122 -13330 -9433 -5994 -18991 -18462 -11696 -12263 -13119 -8554 4844 11624
15876A1624o549q784j5190K172J0096K243k409N457L908K396l808m957j375l534
$$ 11624 5075 -3709 -18899 -16727 -6631 -4388 -6797 -1340 2568 4964 1156 -3801 -5176 -8710
15862h710p546K527O222r96j2679l041P836J2198K690J3722J2978l583j3764n39
$$ -8710 -16256 -13729 -7507 -8503 -21182 -24223 -16387 -4189 -1499 12223 25201 21618 7854 7315
15848G315j642m980j311K393k907M80K995q345N408J0409L696k537o836j458J845
$$ 7315 5673 693 -618 1775 -1132 -652 2343 -6002 -594 9815 13511 10974 4138 2680 4525
15833D525K447K42J303K217J122m753O164O651o621j0803p078l225Q72o764K551
$$ 4525 6972 7214 8517 10734 11856 7103 13267 19918 13297 2494 -4584 -7809 -6937 -13701 -11150
15818a1150J2612j211j814K966J0760o467j232K768M113Q17j3926k1097J1659
$$ -11150 1462 251 -1563 1403 12163 5696 4464 7232 11345 12162 -1764 -22861 -11202
15805a1202J8112O937m636L6O057K878j1292J460L932q420j2694J209O244P609
$$ -11202 6910 13847 9211 9247 15304 18182 6890 8350 12282 3862 -8832 -7623 -1379 6230
15791F230K294j015l690R84J3357J29j3148r930J2793N738j5857j7037k191M777
$$ 6230 8524 7509 3819 4803 18160 18289 5141 -4789 8004 13742 -2115 -19152 -21343 -16566
15777a6566P461R480p555N765K405m865o928J808Q217K186q155j0028j575J1676
$$ -16566 -9105 375 -7180 -1415 990 -3875 -10803 -8995 -778 1408 -6747 -16775 -18350 -6674
15763f674J0989p637m721K618n813N924J0597k221l733n763p998p65Q975j047
$$ -6674 4315 -3322 -8043 -5425 -11238 -5314 5283 3062 -671 -6434 -14432 -15197 -6222 -7269
15749g269M057n884J200P821k133n402l11K552n16P8P486j0201n474J275l82O336
$$ -7269 -3212 -9096 -7896 -75 -2208 -7610 -7921 -5369 -5885 -5807 1679 -8522 -13996 -12721 -13103 -6767
15733f767N869N044J971p654p507j679J1189l987o546j65K233J3359J0120J606
$$ -6767 -898 4146 6117 -1537 -9044 -10723 466 -3521 -10067 -10232 -7999 5360 15480 17086
15719A7086j2142r622k258j1221J0435N82Qj044l924N311O272N860o008j385j062
$$ 17086 4944 -4678 -6936 -18157 -7722 -7140 -7132 -8176 -12100 -6789 -517 5343 -665 -2050 -3112
15704c112j167o382m738L271Q925j500K337K403L298P346k4J079p062l055n772
$$ -3112 -4279 -10661 -15399 -12128 -3203 -4703 -2366 37 3335 10681 10657 11736 4674 1619 -4153
15689d153j2603l966R081Q386r91q114J0528M066k974p546J867l826N239P440
$$ -4153 -16756 -20722 -11641 -3255 -4246 -12360 -1832 2234 -740 -8286 -6419 -10245 -5006 2434
15675B434N898n410J927K285k032k663L680k835M623L051j3040l005n150k840
$$ 2434 8332 2922 4849 7134 5102 2439 6119 3284 7907 10958 -2082 -5087 -10237 -13077
15661a3077k247K89J9P108N522k701P726O578q399l732m749L652l000j2031l30
$$ -13077 -15324 -15035 -15016 -7908 -2386 -5087 2639 9217 818 -2914 -7663 -4011 -7011 -19042 -19372
15646a9372k30N237j5m213L385Q222N557j341K092J0903m754o68L70k729k382
$$ -19372 -19602 -14365 -14380 -18593 -15208 -6986 -1429 -2770 -678 10225 5471 4803 5173 2444 62
15631F2q499m208J285R736J0808O16m223k678J1146o930j0370q28j1743j63P606
$$ 62 -8437 -12645 -11360 -1624 9184 9800 5577 2899 14045 7115 -3255 -4083 -15826 -15989 -8383
15616h383J0360Q054m625k781P89n28j3823n445K651P511M878l194j415n222L435
$$ -8383 1977 10031 5406 2625 3414 2886 -10937 -16382 -13731 -6220 -1342 -4536 -5951 -11173 -7738
15601g738N97q140l526K081J5745R745n659o616L09M32j402K697R94j1549l831
$$ -7738 -7141 -15281 -18807 -16726 -981 8764 3105 -3511 -3202 -2770 -4172 -1475 -481 -12030 -15861
15586a5861j258N49J2424l31o123k661j2029N802J2360Q640j512j200m865j627
$$ -15861 -17119 -16570 -4146 -4477 -10600 -13261 -25290 -19488 -7128 1512 0 -1200 -6065 -7692
15572g692R720J0194l276j5287p066K518N037m473k649M693J784j104L784K980
$$ -7692 2028 12222 8946 -6341 -13407 -10889 -5852 -10325 -12974 -8281 -6497 -7601 -3817 -837
15558h37m221r414m040J5598P154j2475j0212j023M242R41O049l249J094l781
$$ -837 -5058 -14472 -18512 -2914 4240 -8235 -18447 -19470 -15228 -14287 -8238 -11487 -10393 -14174
15544a4174l230O946Q623M043j039K9O890Q330J145o464N132O620p150k858N031
$$ -14174 -17404 -10458 -1835 2208 1169 1198 8088 16418 17563 11099 16231 22851 15701 12843 17874
15529A7874m77o610o452m12L022O385m090P999m833k831N76q984L300P25j1023
$$ 17874 17397 10787 4335 3923 6945 13330 9240 17239 12406 9575 10151 1167 4467 5192 -5831
15514e831O327l7J0005O251k342r510M226k228M477j0044l729m284p417m930J5600
$$ -5831 496 459 10464 16715 14373 4863 9089 6861 11338 1294 -2435 -6719 -14136 -19066 -3466
15499c466J4534p79r850q424N25M341j710k860l502O837J6269P326j000r014n586
$$ -3466 11068 10289 439 -7985 -7460 -3119 -4829 -7689 -11191 -4354 11915 19241 18241 9227 3641
15484C641o569j460J1330o018l531l921J263o729m814K520N445N926J0661M603
$$ 3641 -2928 -4388 6942 924 -2607 -6528 -5265 -11994 -16808 -14288 -8843 -2917 7744 12347
15470A2347p596j189j2276n026R694M120l068J696o611j591l606N79k245m240
$$ 12347 4751 3562 -8714 -13740 -4046 74 -2994 -1298 -7909 -9500 -13106 -12527 -14772 -19012
15456a9012N298R390M878k979o861M595j0730n327K28M765J3423K977L682K904
$$ -19012 -13714 -4324 554 -2425 -9286 -4691 -15421 -20748 -20520 -15755 -2332 645 4327 7231
15442G231J539k174j2083L641N197q58l837J275j0453N421P431j02R15J607j5967
$$ 7231 8770 6596 -5487 -1846 3351 2493 -1344 -69 -10522 -5101 2330 2228 3143 4750 -11217
15427a1217k081P068q83M389N644o826j2378r611L521L260L997J086k782p226
$$ -11217 -13298 -6230 -7113 -2724 2920 -3906 -16284 -25895 -22374 -19114 -15117 -14031 -16813 -24039
15413b4039k071O588K859m72L949j512M297N668N3k159L264J0753o154r956m071
$$ -24039 -26110 -19522 -16663 -17135 -13186 -14698 -10401 -4733 -4680 -6839 -3575 7178 1024 -8932 -13003
15398a3003m866m364n269P778R391Q57m469p120N064J932J811M450m96N732J387
$$ -13003 -17869 -22233 -27502 -19724 -10333 -9476 -13945 -21065 -16001 -14069 -12258 -7808 -8304 -2572 -1185
15383a185K333L777l14n117O45l851J274K705o43J0450k547j4536j2377M821J5873
$$ -1185 1148 4925 4611 -506 139 -3712 -2438 267 -376 10074 7527 -7009 -19386 -14565 1308
15368A308J142P796k86j6145j2644M985O208J874j28k98P408L055J907M571O32
$$ 1308 2450 10246 9960 -6185 -18829 -13844 -7636 -5762 -5890 -6188 1220 4275 6182 10753 11385
15353A1385j1246K164P192J125j8259n571L433K835m442P369M584p976l337K460
$$ 11385 139 2303 9495 10620 -7639 -13210 -9777 -6942 -11384 -4015 569 -7407 -10744 -8284
15339h284k0p036J212L151k123K482O38M563r08M56P138K931k025p238j331O86
$$ -8284 -8304 -15340 -14128 -10977 -13100 -10618 -9980 -5417 -6325 -5869 1269 4200 2175 -5063 -6394 -5708
15323e708M459p010k802J564Q96K5n075j917K739q29P105O579p399J240Q759L527
$$ -5708 -1249 -8259 -11061 -9497 -8601 -8576 -13651 -15568 -12829 -13658 -6553 26 -7373 -6133 2626 6153
15307F153n861O88M131J643p797Q687j3563l890m97k869k288n95J3748j764q876
$$ 6153 292 980 5111 6754 -1043 7644 -5919 -9809 -10306 -13175 -15463 -16058 -2310 -4074 -12950
15292a2950k409k536m158p536M86M257J7620l91l277R728k76k807J1964O78j0825
$$ -12950 -15359 -17895 -22053 -29589 -29103 -24846 -7226 -7617 -10894 -1166 -1442 -4249 7715 8393 -2432
15277b432n371n392o050K886M947J444L181L566j625K324j0056r764P359M478
$$ -2432 -7803 -13195 -19245 -16359 -11412 -9968 -6787 -3221 -4846 -2522 -12578 -22342 -14983 -10505
15263a0505R8k735l799o476M918R77K292M379J4291k504n116J0573Q940l703p449
$$ -10505 -10407 -13142 -16941 -23417 -18499 -17522 -15230 -10851 3440 936 -4180 6393 15333 11630 4181
15248D181l741N095j775p866k797j1011Q843J297j429J257l603J590k823j1239
$$ 4181 440 5535 3760 -4106 -6903 -17914 -9071 -7774 -9203 -7946 -11549 -9959 -12782 -24021
15234b4021q451J0381J0773L166j988l963P628J565O06M927j443p071l922l98
$$ -24021 -32472 -22091 -11318 -8152 -10140 -14103 -6475 -4910 -4304 623 -820 -7891 -11813 -12211
15220a2211M105Q587K727j100p274L769m381K990p37o551k273N817O125M488j699
$$ -12211 -8106 481 3208 2108 -5166 -1397 -5778 -2788 -3525 -10076 -12349 -6532 -407 4081 2382
15205B382k1803J592N918M244Q737m928j52K490o992l129n54J122q385p807L702
$$ 2382 -19421 -17829 -11911 -7667 1070 -3858 -4010 -1520 -8512 -11641 -12195 -11073 -19458 -27265 -23563
15190b3563N014J2116N283O066M132k046l395j1561k626o678J751k895n525M821
$$ -23563 -18549 -6433 -1150 4916 9048 7002 3607 -7954 -10580 -17258 -15507 -18402 -23927 -19106
15176a9106J0256q101j171N991M334N563M410l382m90l53o104M368R19o412j673
$$ -19106 -8850 -16951 -18122 -12131 -7797 -2234 2176 -1206 -1696 -2049 -8153 -3785 -2866 -9278 -10951
15161a0951j399M182M28k394K988K459R077k994l323k430q000M846L543M908n458
$$ -10951 -12350 -8168 -7740 -10134 -7146 -4687 4390 1396 -1927 -4357 -12357 -7511 -3968 940 -4518
15146d518q376J757M679O514p207k833M399M688m914N373L652j372p280m66N250
$$ -4518 -12894 -11137 -6458 56 -7151 -9984 -5585 -897 -5811 -438 3214 1842 -5438 -5904 -654
15131f54m269m227M428n254R230l401o735m448K944J958r57p499K41L143L386
$$ -654 -4923 -9150 -4722 -9976 -746 -4147 -10882 -15330 -12386 -10428 -11385 -18884 -18643 -15500 -12114
15116a2114O211O844k97l596L91L140q833m241M043Q199L99k904J384M827k401
$$ -12114 -5903 941 644 -2952 -2561 579 -8254 -12495 -8452 -253 146 -2758 -1374 3453 1052
15101A052r787p839L004R429O729K154m885N14R37p797k348m253m174m317R275
$$ 1052 -8735 -16574 -13570 -4141 2588 4742 -143 371 1308 -6489 -8837 -13090 -17264 -21581 -12306
15086a2306R375m36J673m975L993O57m520q093l268j500m470Q317J1432J483m320
$$ -12306 -2931 -3367 -1694 -6669 -2676 -2019 -6539 -14632 -17900 -19400 -23870 -15553 -4121 -2638 -6958
15071f958p81m156l007J763P303J851R48J0676p939j742k379p635m086M403O583
$$ -6958 -7739 -11895 -14902 -13139 -5836 -3985 -3037 7639 -300 -2042 -4421 -12056 -16142 -11739 -5156
15056e156q49j169j33Q948K326p109m67P907l475l971K604k358n45j078P388k475
$$ -5156 -6005 -7174 -7307 1641 3967 -3142 -3609 4298 823 -3148 -544 -2902 -3447 -4525 2863 388
15040C88j0619k314o996Q089N083p428M208k33j063P37o36l019n473J6683K109
$$ 388 -10231 -12545 -19541 -11452 -6369 -13797 -9589 -9822 -10885 -10148 -10784 -13803 -19276 -2593 -484
15025d84o414n282L865L961k330L840l068n851J868L276L918j715Q84o54O731
$$ -484 -6898 -12180 -8315 -4354 -6684 -2844 -5912 -11763 -9895 -6619 -2701 -4416 -3532 -4186 2545
15010B545k180J311P460q842j2489q472J1797P364l736r36L565K921j998n487
$$ 2545 365 1676 9136 294 -12195 -20667 -8870 -1506 -5242 -6178 -2613 308 -1690 -7177
14996g177m518j692o737m616L748Q550j078P214p77q575K924L811m284n463k956
$$ -7177 -11695 -13387 -20124 -24740 -20992 -12442 -13520 -6306 -7083 -15658 -12734 -8923 -13207 -18670 -21626
14981b1626R626Q820j100m922m162k078M963l8j333O853J254q666k407k25O175
$$ -21626 -12000 -3180 -4280 -9202 -13364 -15442 -10479 -10517 -11850 -4997 -3743 -12409 -14816 -15041 -8866
14966h866R267q456Q85K887j0636l639J692O889J857L347r68Q590K10j3954k153
$$ -8866 401 -8055 -7170 -4283 -14919 -18558 -16866 -9977 -8120 -4773 -5741 2849 3059 -10895 -13048
14951a3048J3051k375l785M189l737m078m246N905J2706K551l17O290j511P34
$$ -13048 3 -2372 -6157 -1968 -5705 -9783 -14029 -8124 4582 7133 6816 13106 11595 12329
14937A2329k397p75l505o998q909r893J239L774P442K593K120P967p060l559p096
$$ 12329 9932 9157 5652 -1346 -10255 -20148 -18909 -15135 -7693 -5100 -2980 4987 -2073 -5632 -12728
14922a2728m598P532k738q632k160K593J2451R630P962k178n504l22M637l116
$$ -12728 -17326 -9794 -12532 -21164 -23324 -20731 -8280 1350 9312 7134 1630 1308 5945 2829
14908B829Q872p96n968r588k098l609j169M405L71o9j1312o83M903p664j106J6757
$$ 2829 11701 10905 4937 -4651 -6749 -10358 -11527 -7122 -6751 -6820 -18132 -18815 -13912 -21576 -22682 -5925
14892e925P449j784r23q295p243N917J723O369j612M001L59j0594j2552M122q835
$$ -5925 1524 -260 -1183 -9478 -16721 -10804 -9081 -2712 -4324 -323 36 -10558 -23110 -18988 -27823
14877b7823k956Q584N359o484j535N913L596O495k553m462L34R018M117O905k613
$$ -27823 -30779 -22195 -16836 -23320 -24855 -18942 -15346 -8851 -11404 -15866 -15532 -6514 -2397 4508 1895
14862A895j1399N31r807o291M587L734l844m702O65Q590Q179L5O202O325j0189
$$ 1895 -9504 -8973 -18780 -25071 -20484 -16750 -20594 -25296 -24631 -16041 -7862 -7827 -1625 4700 -5489
14847e489j3008k672P685O365k312M071N096M404j2867j840N250M428L262k294
$$ -5489 -18497 -21169 -13484 -7119 -9431 -5360 -264 4140 -8727 -10567 -5317 -889 2373 79
14833G9l526k483r33n580J106M467k085r358n788O822K245j0295J96K147l194
$$ 79 -3447 -5930 -6863 -12443 -11337 -6870 -8955 -18313 -24101 -17279 -15034 -25329 -25133 -22986 -26180
14818b6180L363L597N453p298j717L899N97P294m662m886K92L874K130p035O208
$$ -26180 -22817 -19220 -13767 -21065 -22782 -18883 -18286 -10992 -15654 -20540 -20248 -16374 -14244 -21279 -15071
14803a5071k64M239J5460R524r264p991j0802m831J698J2475j1342Q80Q098L626
$$ -15071 -15335 -11096 4364 13888 4624 -3367 -14169 -19000 -17302 -4827 -16169 -15289 -7191 -3565
14789c565K799J061J853q90j1070K217o207n520O66P09M939k917j2617L665P364
$$ -3565 -766 295 2148 1258 -9812 -7595 -13802 -19322 -18656 -17947 -13008 -15925 -28542 -24877 -17513
14774a7513r013M944N110j022m535m104O301J2252l668j0062n335J1668O5r992
$$ -17513 -26526 -21582 -16472 -17494 -22029 -26133 -19832 -7580 -11248 -21310 -26645 -14977 -14912 -24904
14760b4904m867M971r60Q581L390K553J744j561p16N132k84n317m918o072J585
$$ -24904 -29771 -24800 -25760 -17179 -13789 -11236 -9492 -11053 -11769 -6637 -6921 -12238 -17156 -23228 -21643
14745b1643K931J2402j991p193j87j1256m651O520J3218P399j857j089K850l044
$$ -21643 -18712 -6310 -8301 -15494 -15681 -26937 -31588 -25068 -11850 -4451 -6308 -7397 -4547 -7591
14731g591R53J878J342k900k971K747L191L996p520o544j225n762m543J1481K319
$$ -7591 -6638 -4760 -3418 -6318 -9289 -6542 -3351 645 -6875 -13419 -14644 -20406 -24949 -13468 -11149
14716a1149m078o298K861J590M399k080Q16P893R108j2641o618l673J7567n315
$$ -11149 -15227 -21525 -18664 -17074 -12675 -14755 -13939 -6046 3062 -9579 -16197 -19870 -2303 -7618
14702g618K943O462j029m300r749J117O075N069N57K797M85n948q252n94L011
$$ -7618 -4675 1787 758 -3542 -13291 -12174 -6099 -1030 -473 2324 2809 -3139 -11391 -11985 -8974
14687h974q47O123p25J286L07o440o835K365K94J0770r54o509Q271N356P82R762
$$ -8974 -9821 -3698 -4423 -3137 -2830 -9270 -16105 -13740 -13446 -2676 -3630 -10139 -1868 3488 4270 14032
14671A4032J809j8215r569k292m81j0151o380N691R495J171k23J818j529j240
$$ 14032 15841 -2374 -11943 -14235 -14716 -24867 -31247 -25556 -16061 -14890 -15113 -13295 -14824 -16064
14657a6064J333K899N860J750L426P701j291r262l718j812k697p350k121k799
$$ -16064 -14731 -11832 -5972 -4222 -796 6905 5614 -3648 -7366 -9178 -11875 -19225 -21346 -24145
14643b4145M996P116N743K559M513j2505M513j535j0226o866n834O138M80N177
$$ -24145 -19149 -12033 -6290 -3731 782 -11723 -7210 -8745 -18971 -25837 -31671 -25533 -25053 -19876
14629a9876J0484J611j8705l531M006P194J6453R96l292o257r018N801J180q14
$$ -19876 -9392 -7781 -26486 -30017 -26011 -18817 -2364 -1368 -4660 -10917 -19935 -14134 -12954 -13768
14615a3768K093J966m121p93J0001K589n040p353K861o168M019Q774M214L107
$$ -13768 -11675 -9709 -13830 -14623 -4622 -2033 -7073 -14426 -11565 -17733 -13714 -4940 -726 2381
14601B381M000N342M122j2166r638LJ12r643L487l522l658J927J695q90R402m628
$$ 2381 6381 11723 15845 3679 -5959 -5956 -5844 -15487 -12000 -15522 -19180 -17253 -15558 -16448 -7046 -11674
14585a1674j118n846k638M505Q958J0818l69j5525q253N642Q450R030L74j1401
$$ -11674 -12792 -18638 -21276 -16771 -7813 3005 2636 -12889 -21142 -15500 -7050 1980 2354 -9047
14571i047r372o434o00k510O679Q908N831p273M947O601K536J343m656m098K903
$$ -9047 -18419 -24853 -25453 -27963 -21284 -12376 -6545 -13818 -8871 -2270 266 1609 -3047 -7145 -4242
14556d242J182n195N439N898m486j2093m699Q052l45o452o953L214L038O27K561
$$ -4242 -3060 -8255 -2816 3082 -1404 -13497 -18196 -10144 -10489 -16941 -23894 -20680 -17642 -17015 -14454
14541a4454M396m55L192N533O549n06q172o654O886l408q721l669k584O328Q363
$$ -14454 -10058 -10513 -7321 -1788 4761 4255 -3917 -10571 -3685 -7093 -15814 -19483 -22067 -15739 -7376
14526g376k549n551k238L646N426K788J924M735n397r319l033J687J111K617N538
$$ -7376 -9925 -15476 -17714 -14068 -8642 -5854 -3930 805 -4592 -13911 -16944 -15257 -14146 -11529 -5991
14511e991j51K058L041n042l945p760P152P097k288k221L932J695k12j003K817
$$ -5991 -6142 -4084 -1043 -6085 -10030 -17790 -10638 -3541 -5829 -8050 -4118 -2423 -2635 -3638 -821
14496h21j0451n940K221n501n08m081k951Q333M962Q505L379p721M405J294m071
$$ -821 -11272 -17212 -14991 -20492 -21000 -25081 -28032 -19699 -14737 -6232 -2853 -10574 -6169 -4875 -8946
14481h946N283j924N475l62o124k046L085j039o735L197J853K596M1N674O502
$$ -8946 -3663 -5587 -112 -474 -6598 -8644 -5559 -6598 -13333 -10136 -8283 -5687 -5646 28 6530
14466F530J518q83m346n781l483j543L651M348K607m291j262K638K270k838K590
$$ 6530 8048 7165 2819 -2962 -6445 -7988 -4337 11 2618 -1673 -2935 -297 1973 -865 1725
14451A725N134p153j2432J263n611k267m186j980N234J733M590L208O05L783R940
$$ 1725 6859 -294 -12726 -11463 -17074 -19341 -23527 -25507 -20273 -18540 -13950 -10742 -10137 -6354 3586
14436C586q078r775n879M144L197m596l570m137J521J0933K467P893L045m657
$$ 3586 -4492 -14267 -20146 -16002 -12805 -17401 -20971 -25108 -23587 -12654 -10187 -2294 751 -3906
14422c906j04L314p355l11K712N94o74L430L7N063m010j4587o388J2897n23k064
$$ -3906 -4010 -696 -8051 -8362 -5650 -5056 -5730 -2300 -2263 2800 -1210 -15797 -22185 -9288 -9811 -11875
14406a1875N476m8m139j238l337m665j366r69M555Q85L369m749m896M210K781
$$ -11875 -6399 -6447 -10586 -11824 -15161 -19826 -21192 -22161 -17606 -16721 -13352 -18101 -22997 -18787 -16006
14391a6006O671K50M891J692j1448j004k652n382O829O987j2218o551L684L173
$$ -16006 -9335 -9085 -4194 -2502 -13950 -14954 -17606 -22988 -16159 -9172 -21390 -27941 -24257 -21084
14377b1084N66j1251r90J4853P481o65r362j345M194K728o695l195J734N303K504
$$ -21084 -20518 -31769 -32759 -17906 -10425 -11090 -20452 -21797 -17603 -14875 -21570 -24765 -23031 -17728 -15224
14362a5224m435P138J4703K398j1752K97J3877L585j461n963k116M600n285o439
$$ -15224 -19659 -12521 2182 4580 -7172 -6875 7002 10587 9126 3163 1047 5647 362 -6077
14348f077R799N142K589o089j0048n692j716l663K940o066l772K90L914P847M736
$$ -6077 3722 8864 11453 5364 -4684 -10376 -12092 -15755 -12815 -18881 -22653 -22363 -18449 -10602 -5866
14333e866m614p963K502O03K159L368M325L876k847J051l80P4r056l647M772J059
$$ -5866 -10480 -18443 -15941 -15338 -13179 -9811 -5486 -1610 -4457 -3406 -3786 -3712 -12768 -16415 -11643 -10584
14317a0584k380K351j077J061L099j691k703L109o185K378L004j366k650O673
$$ -10584 -12964 -10613 -11690 -10629 -7530 -9221 -11924 -8815 -15000 -12622 -9618 -10984 -13634 -6961
14303f961k075k735n446j0930P99J2334m535M584O478K441q507M671m99l234k111
$$ -6961 -9036 -11771 -17217 -28147 -27348 -15014 -19549 -14965 -8487 -6046 -14553 -9882 -10381 -13615 -15726
14288a5726o317K354J437O952o69K342m942l215P354L978L098n191j617k060m022
$$ -15726 -22043 -19689 -18252 -11300 -11969 -9627 -14569 -17784 -10430 -6452 -3354 -8545 -10162 -12222 -16244
14273a6244m589O157M766L74K947q65k514q512N253J0442K074o337j641j20L715
$$ -16244 -20833 -14676 -9910 -9536 -6589 -7454 -9968 -18480 -13227 -2785 -711 -7048 -8689 -8809 -5094
14258e094m849Q179m572J509j608n540n047Q11J5333j960j309K278o469q60J285
$$ -5094 -9943 -1764 -6336 -4827 -6435 -11975 -17022 -16211 -878 -2838 -4147 -1869 -8338 -9198 -7913
14243g913n616k146Q408m670j1387L069J61n227O659K455k025Q93k073k891r83
$$ -7913 -13529 -15675 -7267 -11937 -23324 -20255 -20094 -25321 -18662 -16207 -18232 -17339 -19412 -22303 -23286
14228b3286r91O608K840O050j03J157M490O39L489M630j4766p731M302R389K123
$$ -23286 -24277 -17669 -14829 -8779 -8882 -7725 -3235 -2596 893 5523 -9243 -16974 -12672 -3283 -1160
14213a160N872o794M42P19r207k934j160L214L825k12o868L246L39M584j59k872
$$ -1160 4712 -2082 -1640 -921 -10128 -13062 -14222 -11008 -7183 -7395 -14263 -11017 -10678 -6094 -6253 -9125
14197i125J465r13j163l007q091M048N735n227p610K189J8001P238q608j804n871
$$ -9125 -7660 -8573 -9736 -12743 -20834 -16786 -11051 -16278 -23888 -21699 -3698 3540 -5068 -6872 -12743
14182a2743r25P637L90n420M764P974N639q2r461l745J418M885P130k916j1436
$$ -12743 -13668 -6031 -5641 -11061 -6297 1677 7316 7234 -2227 -5972 -4554 331 7461 4545 -6891
14167f891n309Q661M939k863J272k348J444j834n455P689J0400k567l399l366
$$ -6891 -12200 -3539 1400 -1463 -191 -2539 -1095 -2929 -8384 -695 9705 7138 3739 373
14153C73L903P70p702l693p474J058K327P854R553j251l3k904O119j946n242j331
$$ 373 4276 5046 -2656 -6349 -13823 -12765 -10438 -2584 6969 5718 5685 2781 8900 6954 1712 381
14137C81M262O471L155M69R623J2262J2988J4049R216K7872K3521K8595K7512
$$ 381 4643 11114 14269 14738 24361 36623 49611 63660 72876 100748 124269 152864 180376
14124A80376K5432L0765L8659L4829J6918J3105N111p548N872M91n552J012m783
$$ 180376 205808 236573 275232 310061 326979 340084 345195 337647 343519 344010 338458 339470 334687
14111C34687j7143k0073k4667k6428k8256k5697k6262k8581k7857j9280j1815
$$ 334687 317544 297471 272804 246376 218120 192423 166161 137580 109723 90443 78628
14100G8628j4305p222k869J621L106J301K493M745j225K767K050k060K671j938
$$ 78628 64323 57101 54232 55853 58959 60260 62753 67498 66273 69040 71090 69030 71701 69763
14086F9763L098R774M496l296k148j1023l270j216R659M676n622k926q058j6336
$$ 69763 72861 82635 87131 83835 81687 70664 67394 66178 75837 80513 74891 71965 63907 47571
14072D7571q376m172j0356k061N463Q3j1829k813M831q985N030k995j5359N681
$$ 47571 39195 35023 24667 22606 28069 28152 16323 13510 18341 9356 14386 11391 -3968 1713
14058A713J2797o608p877L094P218n064n274j3577N047J2663o201p440K323K100
$$ 1713 14510 7902 25 3119 10337 5273 -1 -13578 -8531 4132 -2069 -9509 -7186 -5086
14044e086K350r30l091j998r432q61O354N091L98K992N433L610k277k434K171
$$ -5086 -2736 -3666 -6757 -8755 -18187 -19048 -12694 -7603 -7205 -4213 1220 4830 2553 119 2290
14029B290p889k107K976J786K742k255P5o490m511q65P800k344l095q00l599l971
$$ 2290 -5599 -7706 -4730 -2944 -202 -2457 -2382 -8872 -13383 -14248 -6448 -8792 -11887 -12687 -16286 -20257
14013b0257J0941K769P474J451p36p032k693k136j985M166o115Q915q161j828
$$ -20257 -9316 -6547 927 2378 1642 -5390 -8083 -10219 -12204 -8038 -14153 -5238 -13399 -15227
13999a5227J184L808P148O650Q776n117j0199k196k946j777j63R779J0120J325
$$ -15227 -14043 -10235 -3087 3563 12339 7222 -2977 -5173 -8119 -9896 -10059 -280 9840 11165
13985A1165m465M079j058K699K575j814J14o522l451k730k284L984o088M258j3812
$$ 11165 6700 10779 9721 12420 14995 13181 13295 6773 3322 592 -1692 2292 -3796 462 -13350
13970a3350o613M143J204j364N412Q575j908j2875m041P082J328o540o922O180
$$ -13350 -19963 -15820 -14616 -15980 -10568 -1993 -3901 -16776 -20817 -13735 -12407 -18947 -25869 -19689
13956a9689R649r46P8J554J3432l735j469K617n945p041o702m660o998J2214J0243
$$ -19689 -10040 -10986 -10908 -9354 4078 343 -1126 1491 -4454 -11495 -18197 -22857 -29855 -17641 -7398
13941g398M728l619m220r931o125M80J1949M581O42L115l643o246P482J0405j728
$$ -7398 -2670 -6289 -10509 -20440 -26565 -26085 -14136 -9555 -8913 -5798 -9441 -15687 -8205 2200 472
13926D72N389l63j0801p208k028j190L17O514n734j1174K237J2138M215k866o977
$$ 472 5861 5498 -5303 -12511 -14539 -15729 -15412 -8898 -14632 -25806 -23569 -11431 -7216 -10082 -17059
13911a7059R93J1885l450l890j595j949L47K343K927N665j20q777j5204M004O052
$$ -17059 -16066 -4181 -7631 -11521 -13116 -15065 -14718 -12375 -9448 -3783 -3903 -12680 -27884 -23880 -17828
13896a7828M873j931n952J75M059J4105J0105o046n568J840N068Q388m975l519
$$ -17828 -12955 -14886 -20838 -20663 -16604 -2499 7606 1560 -4008 -2168 2900 11288 6313 2794
13882B794q58j590k207M963j534P60o13q780P695N365N098K251M564m560p17j297
$$ 2794 1936 346 -1861 3102 1568 2328 1715 -7065 630 5995 11093 13344 17908 13348 12631 11334
13866A1334j162P199M966q98J0254P458o494k164K713j3447J602J0215O994r549
$$ 11334 10172 17371 22337 21439 31693 39151 32657 30493 33206 19759 21361 31576 38570 29021
13852B9021p190n770l157m860p470l620j5557j919L84J0177J0704k547l723o642
$$ 29021 21831 16061 12904 8044 574 -3046 -18603 -20522 -20138 -9961 743 -1804 -5527 -12169
13838a2169N357Q63l033J854L828K743m222R745j633m329L363O357P498n056j019
$$ -12169 -6812 -5949 -8982 -7128 -3300 -557 -4779 4966 3333 -996 2367 8724 16222 11166 10147
13823A0147j165j1830q065q08m015N993K081K511K946q41k276l721J934N728M857
$$ 10147 8982 -2848 -10913 -11721 -15736 -9743 -7662 -5151 -2205 -3046 -5322 -9043 -7109 -1381 3476
13808C476N51o053J618J0K954m638r623q653n022m04O763Q552j182m974k187l928
$$ 3476 4027 -2026 -408 -398 2556 -2082 -11705 -20358 -25380 -25784 -19021 -10469 -11651 -16625 -18812 -22740
13792b2740M900O121K252k16Q0L765J0594O844j0864n827j0649j2599L849J6142
$$ -22740 -17840 -11719 -9467 -9683 -9603 -5838 4756 11600 736 -5091 -15740 -28339 -24490 -8348
13778h348J0856p779J301k681q711L08j3940l17K685M497J1772J0024K375L485
$$ -8348 2508 -5271 -3970 -6651 -15362 -15054 -28994 -29311 -26626 -22129 -10357 -333 2042 5527
13764E527r649n809N57k106K577R419L375p567O69O371p131n040n246j333Q297
$$ 5527 -4122 -9931 -9374 -11480 -8903 516 3891 -3676 -3007 3364 -3767 -8807 -14053 -15386 -7089
13749g089J039n772N951k209q864K589N431N608l576P22N219M746j3747r075O236
$$ -7089 -6050 -11822 -5871 -8080 -16944 -14355 -8924 -3316 -6892 -6170 -951 3795 -9952 -19027 -12791
13734a2791L243p50l73O79J577P876r31j5620n020O295J6346R368j3468m901M954
$$ -12791 -9548 -10298 -10671 -9992 -8415 -539 -1470 -17090 -22110 -15815 531 9899 -3569 -8470 -3516
13719c516n499m127k256O325K635r882O984J2230n917j3761p700O400M256Q31
$$ -3516 -9015 -13142 -15398 -9073 -6438 -16320 -9336 2894 -3023 -16784 -24484 -18084 -13828 -12997
13705a2997Q908N674l891l696J0962J582J257o097j773M172m633j293J03N557
$$ -12997 -4089 1585 -2306 -6002 4960 6542 7799 1702 -71 4101 -532 -1825 -1722 3835
13691C835k280L015m033j0107o360O671J0533m95Q467k594n120k712J516Q286
$$ 3835 1555 4570 537 -9570 -15930 -9259 1274 779 9246 6652 1532 -1180 336 8622
13677H622K067k878j780p410k842K689j830p100j0357Q030J0239J1159p836l001
$$ 8622 10689 7811 6031 -1379 -4221 -1532 -3362 -10462 -20819 -12789 -2550 8609 773 -2228
13663b228P100o355r756k619M410k299N916J801l313k860n335M031o550k640k854
$$ -2228 4872 -1483 -11239 -13858 -9448 -11747 -5831 -4030 -7343 -10203 -15538 -11507 -18057 -20697 -23551
13648b3551M704Q671n509k524P45l021k225J376j419J775J0297Q7O77N689q84
$$ -23551 -18847 -10176 -15685 -18209 -17464 -20485 -22710 -21334 -22753 -20978 -10681 -10594 -9917 -4228 -5112
13633e112J824L255J271o734o175r43m859M611J0307J135j651K640L122o520j3023
$$ -5112 -3288 -33 1238 -5496 -11671 -12614 -17473 -12862 -2555 -1420 -3071 -431 2691 -3829 -16852
13618a6852L734k454j724Q69J815R620R17j0108O712K207p317k489N149k319K509
$$ -16852 -13118 -15572 -17296 -16427 -14612 -4992 -4075 -14183 -7471 -5264 -12581 -15070 -9921 -12240 -9731
13603i731J443O474J205j693j0816j4396O100R860k704j451L567k696J000P02
$$ -9731 -8288 -1814 -609 -2302 -13118 -27514 -21414 -11554 -14258 -15709 -12142 -14838 -13838 -13136
13589a3136n720m198M657l39M021J030j677K711j622j883O125N812K444n174k846
$$ -13136 -18856 -23054 -18397 -18736 -14715 -13685 -15362 -12651 -14273 -16156 -10031 -4219 -1775 -6949 -9795
13574i795n227l269J90j63M726K847m004q117N06J0484m560P709J0196k368m998
$$ -9795 -15022 -18291 -18101 -18264 -13538 -10691 -14695 -22812 -22306 -11822 -16382 -8673 1523 -845 -5843
13559e843L128n21n63R16k266k215j1289q746l138j822M826R270j295R37L074
$$ -5843 -2715 -3236 -3799 -2883 -5149 -7364 -18653 -27399 -30537 -32359 -27533 -18263 -19558 -18621 -15547
13544a5547j0460K94K821M725J371J763n932m145o240m712O83J2413J620J490
$$ -15547 -26007 -25713 -22892 -18167 -16796 -15033 -20965 -25110 -31350 -36062 -35379 -22966 -21346 -19856
13530a9856Q430N769j607q200q883l273o822P326R476R366Q270m612O08J0747
$$ -19856 -11426 -5657 -7264 -15464 -24347 -27620 -34442 -27116 -17640 -8274 -4 -4616 -4008 6739
13516F739Q171K816n495j3333l724l422N048O521O555J010q02j5825L204J6700
$$ 6739 14910 17726 12231 -1102 -4826 -8248 -3200 3321 9876 10886 10084 -5741 -2537 14163
13502A4163J87p900o301q19K042j671Q357k425j4484n685k627J339q898N736L985
$$ 14163 14350 6450 149 -670 1372 -299 8058 5633 -8851 -14536 -17163 -15824 -24722 -18986 -15001
13487a5001M23J875L444N763J0709n671l544J96o18N855n781l640k452j0930m739
$$ -15001 -14578 -12703 -9259 -3496 7213 1542 -2002 -1806 -2424 3431 -2350 -5990 -8442 -19372 -24111
13472b4111N166r14k463J171q290K515O979l2P677k554J086j680K93m387n042
$$ -24111 -18945 -19859 -22322 -21151 -29441 -26926 -19947 -19979 -12302 -14856 -13770 -15450 -15157 -19544 -24586
13457b4586N064J862J705M554q625j874J0662J1876l46m494o788O36l94j2143
$$ -24586 -19522 -17660 -15955 -11401 -20026 -21900 -11238 638 292 -4202 -10990 -10354 -10748 -22891
13443b2891J892Q418J848K092J537L656k389N763k449L95l005m648M976k007l524
$$ -22891 -20999 -12581 -10733 -8641 -7104 -3448 -5837 -74 -2523 -2128 -5133 -9781 -4805 -6812 -10336
13428a0336Q886R295r04l655m198n769p26M98P47j486n162J979K502O514p592
$$ -10336 -1450 7845 6941 3286 -912 -6681 -7407 -6909 -6162 -7648 -12810 -10831 -8329 -1815 -9407
13413i407k305J1978N783N26L706r44j2215j0132Q391O212n004k83j830J892o366
$$ -9407 -11712 266 6049 6575 10281 9337 -2878 -13010 -4619 1593 -3411 -3694 -5524 -3632 -9998
13398i998q051N194p25K954l421K209M405o874p479M117j2604N746R794L298k041
$$ -9998 -18049 -12855 -13580 -10626 -14047 -11838 -7433 -14307 -21786 -17669 -30273 -24527 -14733 -11435 -13476
13383a3476J446K711j530j912L634L85j670M910J704P932N533j203n059M799L916
$$ -13476 -12030 -9319 -10849 -12761 -9127 -8742 -10412 -5502 -3798 4134 9667 8464 3405 8204 12120
13368A2120l843n726J1610P586o151p492j580J826q336r748L891P8p948l827k012
$$ 12120 8277 2551 14161 21747 15596 8104 6524 8350 14 -9734 -5843 -5765 -13713 -17540 -19552
13353a9552N57j344M356M618N658J548l143m969K6N03k903k022L161O07m051k552
$$ -19552 -18995 -20339 -15983 -11365 -5707 -4159 -7302 -12271 -12245 -11742 -14645 -16667 -13506 -12899 -16950 -19502
13337a9502K114k430L038Q499J0705K178p46n502q05l40n548O934O521K553o836
$$ -19502 -17388 -19818 -16780 -8281 2424 4602 3856 -1646 -2451 -2791 -8339 -1405 5116 7669 833
13322H33l337m293m352J671m551M898K110m59K453O506L076n073o081L650J7q549
$$ 833 -2504 -6797 -11149 -9478 -14029 -9131 -7021 -7480 -5027 1479 4555 -518 -6599 -2949 -2932 -11481
13306a1481j110J0192K524p036n288P941R400J341p871k848K189p825o03J839
$$ -11481 -12591 -2399 125 -6911 -12199 -4258 5142 6483 -1388 -4236 -2047 -9872 -10475 -8636
13292h636o975M704J3340M680L326l54j1239L825L585j5136q811N703N81j623
$$ -8636 -15611 -10907 2433 7113 10439 10085 -1154 2671 6256 -8880 -17691 -11988 -11407 -13030
13278a3030m93K222O33M733Q333p88n348M359K288m982j0956j1096O716J2586
$$ -13030 -13523 -11301 -10668 -5935 2398 1610 -3738 621 2909 -2073 -13029 -24125 -17409 -4823
13264d823M170p911L483K523n723N694j568j099O315K649p179L47M22r921n149
$$ -4823 -653 -8564 -5081 -2558 -8281 -2587 -4155 -5254 1061 3710 -3469 -3122 -2700 -12621 -17770
13249a7770L201Q507N97m325n117j162K96k776M782l001m852O587J2307J1788
$$ -17770 -14569 -6062 -5465 -9790 -14907 -16069 -15773 -18549 -13767 -16768 -21620 -15033 -2726 9062
13235I062j370n511n05k108m19k641j135O294n460m834K863k236p476q423Q95
$$ 9062 7692 2181 1676 -432 -851 -3492 -4627 1667 -3793 -8627 -5764 -8000 -15476 -23899 -23004
13220b3004Q247P554L176l430K248P470R58n193q151o3j024N670L111n11q567
$$ -23004 -14757 -7203 -4027 -7457 -5209 2261 3219 -1974 -10125 -10188 -11212 -5542 -2431 -2942 -11509
13205a1509p800j116P639N707J1380L255o215p955j637N569k307L304k609l57
$$ -11509 -19309 -20425 -12786 -7079 4301 7556 1341 -6614 -8251 -2682 -4989 -1685 -4294 -4651
13191d651m271n168P157O123P350l876r017J3490N857j2935k134l401J3084k065
$$ -4651 -8922 -14090 -6933 -810 6540 2664 -6353 7137 12994 59 -2075 -5476 7608 5543
13177E543n950J330J438q275j4781j307J2000j378o070r648o09J442J0690P733
$$ 5543 -407 923 2361 -5914 -20695 -22002 -10002 -11380 -17450 -27098 -27707 -26265 -15575 -7842
13163g842l628r967j83P811J708j234j604m797k912J1317M74j228l902o57l315
$$ -7842 -11470 -21437 -21620 -13809 -12101 -13335 -14939 -19736 -22648 -11331 -10857 -12085 -15987 -16644 -19959
13148a9959k639J2460J4307N26L313k834P616p96o852o664n202J5093R381J481
$$ -19959 -22598 -10138 4169 4695 8008 5174 12790 11994 5142 -1522 -6724 8369 17750 19231
13134A9231P58P894L893n400j730q982j2894j503L193K230Q188n781j6527O381
$$ 19231 19989 27883 31776 26376 24646 15664 2770 1267 4460 6690 14878 9097 -7430 -1049
13120a049J2097R17m193j2916k196L427J208P408L968j6192m890Q506j596n381
$$ -1049 11048 11965 7772 -5144 -7340 -3913 -2705 4703 8671 -7521 -12411 -3905 -5501 -10882
13106a0882n565M306l65M921J185M223N816j42l790J2566m39N822J6092K568o840
$$ -10882 -16447 -12141 -12506 -7585 -6400 -2177 3639 3497 -293 12273 11834 17656 33748 36316 29476
13091B9476j2516L680M587R389J562j771p88K993m997R87j638r048j2321J4761
$$ 29476 16960 20640 25227 34616 36178 34407 33619 36612 31615 32602 30964 21916 9595 24356
13077B4356Q897j657M253J2124R24P190P614R865M435J3856K1811J3403J6582
$$ 24356 33253 31596 35849 47973 48897 56087 63701 73566 78001 91857 113668 127071 143653
13064A43653K4647M2130M5395P5355Q9514R3956J34791J48049J53643J56082J32870
$$ 143653 168300 210430 255825 331180 420694 514650 649441 797490 951133 1107215 1240085
13053A240085R6810M4817J956l3450p6794j13589j40154j45872j36952j39454
$$ 1240085 1336895 1381712 1383668 1350218 1273424 1159835 1019681 873809 736857 597403
13043E97403j19136j00150p4370m8324l3782k5805j8374k6174j8850j2748j9611
$$ 597403 478267 378117 303747 255423 221641 195836 177462 151288 132438 119690 100079
13032A00079p480o245j1387p069j623k630q666N66M497J539j982l50j634j7160
$$ 100079 92599 86354 74967 67898 66275 63645 54979 55545 60042 61581 59599 59249 57615 40455
13018D0455p152Q31L497J83j5333M829K4313n68m617j0129n922j220p647l568
$$ 40455 33303 34134 37631 37814 22481 27310 51623 51055 46438 36309 30387 29167 21520 17952
13004A7952l074N219L713q351N307p693n798K597L961M26l494L895n792j984J6344
$$ 17952 14878 20097 23810 15459 20766 13073 7275 9872 13833 14259 10765 14660 8868 6884 23228
12989B3228L048j51j844j0020p829k098L890J2830N038j186J0145k813m865k098
$$ 23228 26276 26125 24281 14261 6432 4334 8224 21054 26092 24906 35051 32238 27373 25275
12975B5275k815l97k299n89j845N06J993O90j165O237p92k246o421k812j325N733
$$ 25275 22460 22063 19764 19175 17330 17836 19829 20519 19354 25591 24799 22553 16132 13320 11995 17728
12959A7728m169J0262J0114m115j0583l156n765J707n484M260q24j1847m402l034
$$ 17728 13559 23821 33935 29820 19237 16081 10316 12023 6539 10799 9975 -1872 -6274 -9308
12945i308j6422l253R093J2463J0752M077L335l018l370k290p92M352k758o615
$$ -9308 -25730 -28983 -19890 -7427 3325 7402 10737 7719 4349 2059 1267 5619 2861 -3754
12931c754l194L729O871N22p380p684L71O119Q812L042n496m158K26j0691J240
$$ -3754 -6948 -3219 3652 4174 -3206 -10890 -10519 -4400 4412 7454 1958 -2200 -1974 -12665 -11425
12916a1425M762N442O709l514n8Q875L328J001j959k148l23M069Q912J769K622
$$ -11425 -6663 -1221 5488 1974 1916 10791 14119 15120 13161 11013 10690 14759 23671 25440 28062
12901B8062j0922L571O380n588K514L030L464O68k881J1405Q041N196J4096K1232
$$ 28062 17140 20711 27091 21503 24017 27047 30511 31179 28298 39703 47744 52940 67036 88268
12887H8268K3871L1875M6961M8975K9002J5797J3159J6548N972j0758j9313k3986
$$ 88268 112139 144014 190975 239950 268952 284749 297908 314456 320428 309670 290357 266371
12875B66371l3021l4551k8723j9552l6727l2938r130j3573j827O597P73j3933
$$ 266371 233350 198799 170076 150524 113797 80859 71729 58156 56329 62926 63699 49766
12863D9766j0959n909j0177J3736J5037Q336j1868n655L340L611R461P741L831
$$ 49766 38807 32898 22721 36457 51494 59830 47962 42307 45647 49258 58719 66460 70291
12850G0291J2281M389j3598r941P753J0266N03p233n155o082l841m603n064l022
$$ 70291 82572 86961 73363 63422 71175 81441 81944 74711 69556 63474 59633 55030 49966 46944
12836D6944J940L60j839J309l415L111L076K833n125Q623P160K409K3595K6285
$$ 46944 48884 49244 47405 48714 45299 48410 51486 54319 49194 57817 64977 67386 90981 117266
12822A17266L2899L4331L1516K5230K2892K4620P376J427n384j3646j3780k0244
$$ 117266 150165 184496 216012 241242 264134 288754 296130 297557 292173 278527 264747 244503
12810B44503k5051l1215l2768j3785q160j7517j8001q948o555n640p98N65J775
$$ 244503 219452 188237 155469 141684 133524 116007 98006 89058 82503 76863 76065 76630 78405
12797G8405L145R059r84k83M205J3973j98m829K785J0006K013o220k692N373j015
$$ 78405 81550 90609 89625 89342 93547 107520 107322 102493 105278 115284 117297 111077 108385 113758 112743
12782A12743j1579q331O8R883P803p462O99P517R445J0988J688O491P127J2818
$$ 112743 101164 92833 92901 102784 110587 103125 103824 111341 120786 131774 133462 139953 147080 159898
12768A59898J8954J1008J7764K5892K5195J6489K0555L1612K7656L0096L5265
$$ 159898 178852 189860 207624 233516 258711 275200 295755 327367 355023 385119 420384
12757D20384J5662J7893L55j7046k0808k8112k5495m7901l5607k1285k361J8361
$$ 420384 436046 453939 454294 437248 416440 388328 362833 314932 279325 258040 255679 274040
12745B74040N2026P0983Q0503Q8091O5196L8510K4457r946k1788l0484l5294l2453
$$ 274040 326066 397049 477552 565643 630839 669349 693806 683860 662072 631588 596294 563841
12733E63841l9167m5307k4473j2186J827K0454N1503O6304P6193P4603N5493K6657
$$ 563841 524674 479367 454894 442708 444535 464989 516492 582796 658989 733592 789085 815742
12721H15742r4k9007m9287p2498o5237o3239m3295j5569j4856j9116r074k184
$$ 815742 815648 786641 737354 664856 599619 536380 493085 477516 462660 443544 434470 432286
12709D32286N494Q439K3787L5703M0272L2779K9738K4993L1495K3698J2873P183
$$ 432286 437780 446219 470006 505709 545981 578760 608498 633491 664986 688684 701557 708740
12697G08740r988j6546J870k79o640m690J3375K2696J7859J7767J7165J6972J6800
$$ 708740 698752 682206 684076 683797 677157 672467 685842 708538 726397 744164 761329 778301 795101
12684G95101J2360K0591J6175K7586L3986K5846L0329M2010N1958N0492N5675
$$ 795101 807461 828052 844227 871813 905799 931645 961974 1003984 1055942 1106434 1162109
12673A162109N6292N5445N5614O1677P6019Q1688Q9210R3082J00350J15964J41977
$$ 1162109 1218401 1273846 1329460 1391137 1467156 1548844 1638054 1731136 1831486 1947450 2089427
12662B089427J52436J58605J75908J96828K20702K41449K61423L09559L56618
$$ 2089427 2241863 2400468 2576376 2773204 2993906 3235355 3496778 3806337 4162955
12653D162955M31380N03197O06192P18835Q62703J004284J145474J294255J470868
$$ 4162955 4594335 5097532 5703724 6422559 7285262 8289546 9435020 10729275 12200143
12644A2200143J682993J969528K385678L046892M132057N824495Q196435J1269287
$$ 12200143 13883136 15852664 18238342 21285234 25417291 31241786 39438221 50707508
12636E0707508J4971182J8958354K2715383K5762106K7283127K6851454K4745363
$$ 50707508 65678690 84637044 107352427 133114533 160397660 187249114 211994477
12629B11994477K0738569J4329209O095134j847917q904042j5781207k2070211
$$ 211994477 232733046 247062255 253157389 251309472 242405430 226624223 204554012
12622B04554012k5764239k6145185k5244221k3570977k0590835j6439777j2623116
$$ 204554012 178789773 152644588 127400367 103829390 83238555 66798778 54175662
12615E4175662r637402p086479n106420l831050l031834k515611k173621j905815
$$ 54175662 44538260 37451781 32345361 28514311 25482477 22966866 20793245 18887430
12607A8887430j682535j481905j296116j133899r73831q33573p18956o33814n59065
$$ 18887430 17204895 15722990 14426874 13292975 12319144 11485571 10766615 10132801 9573736
12598I573736n01072m47940m07585l93882l52043l29127l10371k77996k58598
$$ 9573736 9072664 8624724 8217139 7823257 7471214 7142087 6831716 6553720 6295122
12589F295122k45440k34553k26740k09225j96668j80788j81901j65430j45413
$$ 6295122 6049682 5815129 5588389 5379164 5182496 5001708 4819807 4654377 4508964
12580D508964j58388j48195j22566j14356j20080j25002j14298j12663j00751
$$ 4508964 4350576 4202381 4079815 3965459 3845379 3720377 3606079 3493416 3392665
12571C392665r1800j00817r1687q5724q7491q5083q8457q2178q1009p7302p7307
$$ 3392665 3300865 3200048 3108361 3022637 2935146 2850063 2761606 2679428 2598419 2521117 2443810
12560B443810o7287n9405n7290o3947n7941m8018n7879m3283k7908m5364m4744
$$ 2443810 2376523 2317118 2259828 2195881 2137940 2089922 2032043 1988760 1960852 1915488 1870744
12549A870744m4296m9715l5011l9568m1372m3473l2280k7793l7010k9368k7538
$$ 1870744 1826448 1776733 1741722 1702154 1660782 1617309 1585029 1557236 1520226 1490858 1463320
12538A463320l7754l8074k9144l0269m0191l5256k0463j6658k5747l3489l2788
$$ 1463320 1425566 1387492 1358348 1328079 1287888 1252632 1232169 1215511 1189764 1156275 1123487
12527A123487k1611j5264j9402j9817j9922j5339j5705j6721j2276j3643j1275
$$ 1123487 1101876 1086612 1067210 1047393 1027471 1012132 996427 979706 967430 953787 942512
12516I42512o649j0326j3207j1743p047l94j4118j7239j675M400P548m036o343
$$ 942512 935863 925537 912330 900587 893540 893146 879028 861789 860114 864514 872062 868026 861683
12503H61683l717R619n655p335j3447j7513j9567k8367l8813l1532k6941l6607
$$ 861683 857966 867585 861930 854595 841148 823635 804068 775701 736888 705356 678415 641808
12491F41808k5468k7922r467m783j664k256j3040n212r635j7062j1041j6586j5154
$$ 641808 616340 588418 578951 574168 572504 570248 557208 551996 542361 525299 514258 497672 482518
12478D82518r312j9899j1912p683o630j0723j6501o030j2205j4226j3521j1999
$$ 482518 473206 453307 441395 433712 427082 416359 399858 393828 381623 367397 353876 341877
12466C41877j2460j1233q897j840K855j943m478n006o015j2469n817k791r675
$$ 341877 329417 318184 309287 307447 310302 308359 303881 298875 292860 280391 274574 271783 262108
12453B62108m497j0522j5073l52o609j0555j6583l5714l6926k4807k7444l0568
$$ 262108 257611 247089 232016 231664 225055 214500 197917 162203 125277 100470 73026 42458
12441D2458k0235j0930o432m140N094J0993J2441Q799K2985M2406K6160K2547
$$ 42458 22223 11293 4861 721 5815 16808 29249 38048 61033 103439 129599 152146
12429A52146K9889L242k836K620K083j745r056q187N647M208m84r812j1583j8276
$$ 152146 182035 185277 182441 185061 187144 185399 176343 168156 173803 178011 177527 167715 156132 137856
12415A37856J59J203R91j840m267j614J1j958m180o678m402p16m401m682m566
$$ 137856 138015 139218 140209 138369 134102 132488 132499 130541 126361 119683 115281 114565 110164 105482 100916
12400A00916q200O225j572k112m268l587o138j157Q261N604J389o159n7M570J977
$$ 100916 92716 98941 97369 95257 90989 87402 81264 80107 88368 93972 95361 89202 89145 93715 95692
12385I5692J1263N639M362m172j246P727R30k018M013J864n13p334L495J775N51
$$ 95692 106955 112594 116956 112784 111538 119265 120195 118177 122190 124054 123541 116207 119702 121477 122028
12370A22028n000k196N630m769J105j810q008l765O903J242j1535j839q048q586
$$ 122028 117028 114832 120462 115693 116798 114988 106980 103215 110118 111360 99825 97986 89938 81352
12356H1352M960j0567j86J1634m923p654L155K23k403L300p592o390P113P741
$$ 81352 86312 75745 75559 87193 82270 74616 77771 77994 75591 78891 71299 64909 72022 79763
12342G9763j1088j003K371P502L499J602n558o418m55J4327N018j401J970m520
$$ 79763 68675 67672 70043 77545 81044 82646 77088 70670 70215 84542 89560 88159 90129 85609
12328H5609l141p797j296n099o057P411J323j0647o523o183L023N94j478p918
$$ 85609 82468 74671 73375 68276 62219 69630 70953 60306 53783 47600 50623 51217 49739 41821
12314D1821Q039J5945J619k156l642m25o993n350l897j60P648j26m566j096r942
$$ 41821 49860 65805 67424 65268 61626 61201 54208 48858 44961 44801 52449 52323 47757 46661 36719
12299C6719n357M194P261q469r687J245J0213O021j0211k172P100m40p289N196
$$ 36719 31362 35556 42817 34348 24661 25906 36119 42140 31929 29757 36857 36417 29128 34324
12285C4324o774l445J1750K155r797m00J057M088L431l519k175P517n265R42L994
$$ 34324 27550 24105 35855 38010 28213 27813 28870 32958 36389 32870 30695 38212 32947 33889 37883
12270C7883k835o589l886j8J744M761N119R996O937J61o232j1135m502J129R309
$$ 37883 35048 28459 24573 24555 26299 31060 36179 46175 53112 53273 47041 35906 31404 32533 41842
12255D1842J408m812k066n23q548j7588J1621Q612k086o955K062K829k206p10
$$ 41842 43250 38438 36372 35849 27301 9713 21334 29946 27860 20905 22967 25796 23590 22880
12241B2880J590k017j3594M273N857k485J185O011q046K801K889L396O355Q724
$$ 22880 24470 22453 8859 13132 18989 16504 17689 23700 15654 18455 21344 24740 31095 39819
12227C9819l463o308J1397J3077k254j556L805P320R703J888J084N737N316j296
$$ 39819 36356 30048 41445 54522 52268 50712 54517 61837 71540 73428 74512 80249 85565 84269
12213H4269K9R215J7461K5300K3984K7337M6338N6834O4194R4934J29298J50159
$$ 84269 84298 93513 110974 136274 160258 187595 233933 290767 354961 449895 579193 729352
12201G29352J44834J40358J39228J11374Q5035L7057j5899n8218q7611j13959
$$ 729352 874186 1014544 1153772 1265146 1350181 1387238 1371339 1313121 1225510 1111551
12191A111551j45625j44436j41458j29190r8914q8356p3982n0990k8006k2392
$$ 1111551 965926 821490 680032 550842 451928 363572 289590 238600 210594 188202
12181A88202k4024k2017l0472n659L125j5868j6772q310O906K282q745j1729m532
$$ 188202 164178 142161 111689 106030 109155 93287 76515 68205 75111 77393 68648 56919 52387
12168E2387j0479q023r632r322J1547k460J291N985K433L619M115L852L216O343
$$ 52387 41908 33885 24253 14931 26478 24018 25309 31294 33727 37346 41461 45313 48529 54872
12154E4872k636N26o98q587J756j96q973l583j79j2314J692L876l750k779l340
$$ 54872 52236 52762 52064 43477 45233 45037 36064 32481 32302 19988 21680 25556 21806 19027 15687
12139A5687m778j753O317O85L585l701o97k018L325J2902M270l213o548q880n585
$$ 15687 10909 9156 15473 16158 19743 16042 15345 13327 16652 29554 33824 30611 24063 15183 9598
12124I598o48M822o242J915o377m919qN417J910L727J499p387q038L098P500L105
$$ 9598 8950 13772 7530 9445 3068 -1851 -1859 3558 5468 9195 10694 3307 -4731 -1633 5867 8972
12108H972o897K280N821J2083P685j275j9562j3343R750N669j563L421K491o652
$$ 8972 2075 4355 10176 22259 29944 28669 9107 -4236 5514 11183 9620 13041 15532 8880
12094H880O05m826p499P392j07q80P291J589n037p989R940R95j72M891j317M226
$$ 8880 9485 4659 -2840 4552 4445 3565 10856 12445 7408 -581 9359 10354 10182 15073 13756 17982
12078A7982P061O058l078l842k959o654Q718m396o710l190n467q552m372O86O081
$$ 17982 25043 31101 28023 24181 21222 14568 23286 18890 12180 8990 3523 -5029 -9401 -8715 -2634
12063b634L926R033J2119n358l480N682j0551L366J1899m040k434K138q564m7
$$ -2634 1292 10325 22444 17086 13606 19288 8737 12103 24002 19962 17528 19666 11102 11055
12049A1055K376k101m340k301O05J0511R506m188P988j47q307M835J0169o451
$$ 11055 13431 11330 6990 4689 5294 15805 25311 21123 29111 28964 20657 25492 35661 29210
12035B9210j0233q425L016n326k642K184r636n182j796m913L415M917M518j620
$$ 29210 18977 10552 13568 8242 5600 7784 -1852 -7034 -8830 -13743 -10328 -5411 -893 -2513
12021b513M336n177N442m898Q074R754P126M92m363l706o077K101p957m903p99
$$ -2513 1823 -3354 2088 -2810 5264 15018 22144 22636 18273 14567 8490 10591 2634 -2269 -3068
12006c068J0181J0941K175l299k046n141n900P032J907j464m893K424N973N041
$$ -3068 7113 18054 20229 16930 14884 9743 3843 10875 12782 11318 6425 8849 14822 19863
11992A9863p110k711N87L871R186j270k371k395j0320J2778Q089M03j460k627
$$ 19863 12753 10042 10629 14500 23686 22416 20045 17650 7330 20108 28197 28600 27140 24513
11978B4513k040J152n671l406r526n792K424j004j101R93M203J875O026j78p946
$$ 24513 22473 23625 17954 14548 5022 -770 1654 650 -451 542 4745 6620 12646 12468 4522
11963D522r177M31L199R518O800n49p569J718o493L046K189O086k695l574M394
$$ 4522 -4655 -4224 -1025 8493 15293 14744 7175 8893 2400 5446 7635 13721 11026 7452 11846
11948A1846N551q336q656K011P893M252J1885N416P9q998k987M216k966k258N529
$$ 11846 17397 9061 405 2416 10309 14561 26446 31862 31941 22943 19956 24172 21206 18948 24477
11933B4477L07R041L656k467l962j830r020Q674N577p734p236k207N49n843r678
$$ 24477 24784 33825 37481 35014 31052 29222 20202 28876 34453 26719 19483 17276 17825 11982 2304
11918B304o323J5324J1338J009n347k459O176n26n405J420M896J0417M898L808
$$ 2304 -4019 11305 22643 23652 18305 15846 22022 21496 16091 17511 22407 32824 37722 41530
11904D1530J5025J4771P755L78M329r738k90r67r359q632q900j185l496N139M432
$$ 41530 56555 71326 79081 79459 83788 74050 73760 72793 63434 54802 45902 44717 41221 46360 50792
11889E0792r531j1605j2601n924P709l862o629j998J824O222m388J330L095M321
$$ 50792 41261 29656 17055 11131 18840 14978 8349 6351 8175 14397 10009 11339 14434 18755
11875A8755K920l032m077M50r912k461L765j1318m801L146J1073L360j0731k857
$$ 18755 21675 18643 14566 15016 5104 2643 6408 -4910 -9711 -6565 4508 7868 -2863 -5720
11861e720J5960O834o976N64K000K548N027o913k130N173J0092J6216J1686R153
$$ -5720 10240 17074 10098 10662 12662 15210 20237 13324 11194 16367 26459 42675 54361 63514
11847F3514L919K730m996q928K354J082q225L318p10j4872p695j485l575L110
$$ 63514 67433 70163 65167 56239 58593 59675 51450 54768 54058 39186 31491 30006 26431 29541
11833B9541m003o949q729n280R31J2214j0264k307N449K592o569o506l684K094
$$ 29541 25538 18589 9860 4580 5511 17725 7461 5154 10603 13195 6626 120 -3564 -1470
11819a470k454p844N427O518R81R55r666L283N302p4L634P841K722J381L55J229
$$ -1470 -3924 -11768 -6341 177 1158 2113 -7553 -4270 1032 958 4592 12433 15155 16536 16891 18120
11803A8120j1087j020M716J941K908m667k02j6145k184J315r22l640M772k330
$$ 18120 7033 6013 10729 12670 15578 10911 10709 -5436 -7620 -6305 -7227 -10867 -6095 -8425
11789h425k10O058k636O23N419j286j62k645N119k272N170K045r043m864N341
$$ -8425 -8635 -2577 -5213 -4590 829 -457 -619 -3264 1855 -417 4753 6798 -2245 -7109 -1768
11774a768n07K640L485L90l989p73M17j751n574o990K588o38l4M592k350n005
$$ -1768 -2275 365 3850 4240 251 -522 -105 -1856 -7430 -14420 -11832 -12470 -12504 -7912 -10262 -15267
11758a5267J718R470M489R030j275J97M8K671r479r675O631K143q215N85N577
$$ -15267 -13549 -4079 410 9440 8165 8362 8410 11081 1602 -8073 -1442 701 -7514 -6929 -1352
11743a352K317L637n043j746J051r093j064M506l500K065J0436M404r841M244
$$ -1352 965 4602 -441 -2187 -1136 -10229 -11293 -6787 -10287 -8222 2214 6618 -3223 1021
11729A021k331J937k672l208Q562P182j785J539o781k666N619J354m842l805l922
$$ 1021 -1310 627 -2045 -5253 3309 10491 8706 10245 3464 798 6417 7771 2929 -876 -4798
11714d798K687O194l042p772k618m512m236k266R63J0458J0524m318k328J911
$$ -4798 -2111 4083 1041 -6731 -9349 -13861 -18097 -20363 -19400 -8942 1582 -2736 -5064 -3153
11700c153j886K327R046K120J772L0l887n785o525M84N560O741Q75l522k695O769
$$ -3153 -5039 -2712 6334 8454 10226 10256 6369 584 -5941 -5457 103 6844 7719 4197 1502 8271
11684H271j684j1991K468j337k204o7J775P910L272O210n982q767j1443o133Q604
$$ 8271 6587 -5404 -2936 -4273 -6477 -6544 -4769 3141 6413 12623 6641 -2126 -13569 -19702 -11098
11669a1098J1272m78N454O16r524R78K908P98L187l829p862l722j512r080M150
$$ -11098 174 -304 5150 5766 -3758 -2780 128 926 4113 284 -7578 -11300 -12812 -21892 -17742
11654a7742K066L38R424L274p534l338K733M624Q680P963N893r285q417p223q344
$$ -17742 -15676 -15338 -5914 -2640 -10174 -13512 -10779 -6155 2525 10488 16381 7096 -1321 -8544 -16888
11639a6888j60P898j180P024P012k241o946o501J3345m394P101N98M42J472m095
$$ -16888 -17048 -9150 -10330 -3306 3706 1465 -5481 -11982 1363 -3031 4070 4668 5110 6582 2487
11624B487o794p205j345m754R449K593J351m888M857M221k637M958N21r855k870
$$ 2487 -4307 -11512 -12857 -17611 -8162 -5569 -4218 -9106 -4249 -28 -2665 2293 2814 -7041 -9911
11609i911J0345K298m398K913M788k066m203o792r645M047Q224K589m793j054
$$ -9911 434 2732 -1666 1247 6035 3969 -234 -7026 -16671 -12624 -4400 -1811 -6604 -7658
11595g658k364J180P841J952j216n198O329J7407j937j1058m651o792j0176m998
$$ -7658 -10022 -8842 -1001 951 -265 -5463 866 18273 16336 5278 627 -6165 -16341 -21339
11581b1339J4388J4286r94L41o480p841n006J2598Q877k123m312l645m247L898
$$ -21339 -6951 7335 6341 6682 202 -7639 -12645 -47 8830 6707 2395 -1250 -5497 -1599
11567a599R943P654p076q184J845n070j741k507J430j763n31j340J648j13J678
$$ -1599 8344 15998 8922 738 2583 -2487 -4228 -6735 -5305 -7068 -7599 -8939 -7291 -7404 -5726
11552e726O337M696k041n301r898L117O593j2113k939J0836M683Q39p644M663
$$ -5726 611 5307 3266 -2035 -11933 -8816 -2223 -14336 -17275 -6439 -1756 -917 -8561 -3898
11538c898O618j1829r309M169Q021k666j755J1059q319l000k436n377P292k645
$$ -3898 2720 -9109 -18418 -14249 -6228 -8894 -10649 410 -7909 -10909 -13345 -18722 -11430 -14075
11524a4075r52r03l054M22R394P966M855o01o175m465k461j784q278P444J0675
$$ -14075 -15027 -15930 -18984 -18562 -9168 -1202 3653 3052 -3123 -7588 -10049 -11833 -20111 -12667 -1992
11509a992K230n127n903M146J0765J767k166p119o104K763J364Q690J0829q287
$$ -1992 238 -4889 -10792 -6646 4119 5886 3720 -3399 -9503 -6740 -5376 3314 14143 5856
11495E856l897M67q015o542J786Q904P477n405j1215j638K1811q43j2819j0642
$$ 5856 1959 2426 -5589 -12131 -10345 -1441 6036 631 -10584 -12222 9589 8746 -4073 -14715
11481a4715J1772Q868O132L725K191n685j2645N68J835O384J626o43L814J517
$$ -14715 -2943 5925 12057 15782 17973 12288 -357 211 2046 8430 10056 9413 13227 14744
11467A4744P09k529K7j6366p270J1322m495m16n572o014N30j189P725J0715Q478
$$ 14744 15453 12924 12951 -3415 -10685 637 -3858 -4274 -9846 -15860 -15330 -16519 -8794 1921 10399
11452A0399o059m521j934l804j710l009j975p37P017m304M80M804Q540k524l922
$$ 10399 4340 -181 -2115 -5919 -7629 -10638 -12613 -13350 -6333 -10637 -10157 -5353 3187 663 -3259
11437c259J1813n198r815L140P565m898M670n604M465k621p038j07N308n0j313
$$ -3259 8554 3356 -6459 -3319 4246 -652 4018 -1586 2879 258 -6780 -6887 -1579 -1629 -2942
11422b942K374M98M999n654k283k56J027J327J2188N030L584Q21j3825r271O525
$$ -2942 -568 -70 4929 -725 -3008 -3264 -2237 -910 11278 16308 19892 20713 6888 -2383 4142
11407D142M038n473l985k730L724l373L088R912p853j1121o577m740P653R688
$$ 4142 8180 2707 -1278 -4008 -284 -3657 -569 9343 1490 -9631 -16208 -20948 -13295 -3607
11393c607J185P026P647m549o142j4311j3538L439J2831Q620k839n646J2231P163
$$ -3607 -2422 4604 12251 7702 1560 -12751 -26289 -22850 -10019 -1399 -4238 -9884 2347 9510
11379I510j339l867m38N957L835L90Q758N020m125j0102m071Q359j1217q719J890
$$ 9510 8171 4304 3866 9823 13658 14048 22806 27826 23701 13599 9528 17887 6670 -2049 -159
11364a59r391n280M622l57N569N761J37n693N49J562p055K51N773K528l556o848
$$ -159 -9550 -14830 -10208 -10565 -4996 765 902 -4791 -4242 -2680 -9735 -9484 -3711 -1183 -4739 -11587
11348a1587N644N628K73M045N972P599k417J786L042M8l454n720k45N97m863J334
$$ -11587 -5943 -315 -42 4003 9975 17574 15157 16943 19985 20033 16579 10859 10614 11211 6348 7682
11332G682L27j0241l806J2841J0086k869j0472k901P612n78q369k474M6K182J262
$$ 7682 8009 -2232 -6038 6803 16889 14020 3548 647 8259 7681 -688 -3162 -3116 -934 328
11317C28q23Q373m948j158L584m48O066j250J703K905K41o873J727O122P351j0545
$$ 328 -495 7878 2930 1772 5356 4908 10974 9724 11427 14332 14573 7700 9427 15549 22900 12355
11301A2355j1727O743p654m894J0338K137o88n155P352L079k814r137j3348p823
$$ 12355 628 7371 -283 -5177 5161 7298 6610 1455 8807 11886 9072 -65 -13413 -21236
11287b1236R984R032m970n847K589j644j156J5644l721m134Q036j853J651L633
$$ -21236 -11252 -2220 -7190 -13037 -10448 -12092 -13248 2396 -1325 -5459 2577 724 2375 6008
11273F008m683l865K719o671o409n403L777j0287r80J0221j423l443J69N465O223
$$ 6008 1325 -2540 179 -6492 -12901 -18304 -14527 -24814 -25794 -15573 -16996 -20439 -20270 -14805 -8582
11258h582J258m625J634p755P84O255l72J3392K271m054k200K12j0245o862K131
$$ -8582 -7324 -11949 -10315 -18070 -17286 -11031 -11403 1989 4260 206 -1994 -1782 -12027 -18889 -16758
11243a6758J089P564O518j2150j407Q153k540m725K353P194L062P007M968j952
$$ -16758 -15669 -8105 -1587 -13737 -15144 -6991 -9531 -14256 -11903 -4709 -1647 5360 10328 8376
11229H376M530n674n414m565M249l994L321Q384J859J452N721p48o63M090j6422
$$ 8376 12906 7232 1818 -2747 1502 -2492 829 9213 11072 12524 18245 17497 16834 20924 4502
11214D502p349k464N316J2459Q314R513p133m031p580n181m796L531P069j1348
$$ 4502 -2847 -5311 5 12464 20778 30291 23158 19127 11547 6366 1570 5101 12170 822
11200H22p735l024L41R320J1172L434l510K034m323M312P889M253j2050j3448
$$ 822 -6913 -9937 -9596 -276 10896 14330 10820 12854 8531 12843 20732 24985 12935 -513
11186e13n119r904k230M981Q336J8554Q48m336N040q761q101j748J783k480P430
$$ -513 -5632 -15536 -17766 -12785 -4449 14105 14953 10617 15657 6896 -1205 -2953 -1170 -3650 3780
11171C780L475k453j0610m727J0665J0522p924J0482N109M167q135q420J270K631
$$ 3780 7255 4802 -5808 -10535 130 10652 2728 13210 18319 22486 14351 5931 7201 9832
11157I832K31m284m154O483J1772N604m177q281m81l288p148R1P904m967j4120
$$ 9832 10063 5779 1625 8108 19880 25484 21307 13026 12545 9257 2109 2200 10104 5137 -8983
11142h983K296M945j2506o626O034N413j623K53J3913l958j4177p585L655l848
$$ -8983 -6687 -1742 -14248 -20874 -14840 -9427 -11050 -10797 3116 -842 -15019 -22604 -18949 -22797
11128b2797L556J3709K524L701M42o995L963K141n619k96P17l559m791R087K984
$$ -22797 -19241 -5532 -3008 693 1135 -5860 -1897 244 -5375 -5671 -4954 -8513 -13304 -4217 -1233
11113a233L731J384O009P71j2643L531o190m326J6324J6212N735r515l870J5681
$$ -1233 2498 3882 9891 10662 -1981 1550 -4640 -8966 7358 23570 29305 19790 15920 31601
11099C1601R723O173N513J1721J4406O631Q789L428p307j8733j6948n676k742
$$ 31601 41324 47497 53010 64731 79137 85768 94557 97985 90678 71945 54997 49321 46579
11086D6579j0999j120n035j7243n676R299O694j2549K195O601J948p884o686L101
$$ 46579 35580 34460 29425 12182 6506 15805 22499 9950 12145 18746 20694 12810 6124 9225
11072I225q90j299l140K007k325n185J158m943k257P986N800n232n28P013p75
$$ 9225 8335 7036 3896 5903 3578 -1607 -449 -5392 -7649 337 6137 905 377 7390 6615
11057F615k058J509K421j604k579r683L717J1903n412j5541r61l96O862O558j935
$$ 6615 4557 6066 8487 6883 4304 -5379 -1662 10241 4829 -10712 -11673 -12069 -5207 1351 -584
11042e84O462j685j489M012l014r568n426L767R532O787K751j530n91K388q11
$$ -584 5878 4193 2704 6716 3702 -5866 -11292 -7525 2007 8794 11545 10015 9424 11812 11001
11027A1001l873j706k35K453o88l469o021K386R458j795J0192J5406J649j3688
$$ 11001 7128 5422 5187 7640 6952 3483 -2538 -152 9306 7511 17703 33109 34758 21070
11013B1070k704k549k489P26n744j3240l295p10M302L436K595m362L786Q148L786
$$ 21070 18366 15817 13328 14054 8310 -4930 -8225 -8935 -4633 -1197 1398 -2964 822 8970 12756
10998A2756p88k35k564J0m579p173K611M433O047l714o30K203j085o622j1752
$$ 12756 11968 11733 9169 9179 4600 -2573 38 4471 10518 6804 6174 8377 7292 670 -11082
10983a1082j914l489n094L554M419R644M91L815L195L67p06m962p037m696k023
$$ -11082 -12996 -16485 -21579 -18025 -13606 -3962 -3471 344 3539 3906 3200 -1762 -8799 -13495 -15518
10968a5518J136J0880J1554M788L369M41K488M169j1203m127j609K245P469l625
$$ -15518 -14382 -3502 8052 12840 16209 16650 19138 23307 12104 7977 6368 8613 16082 12457
10954A2457q093m87J360j296k061M085J624k232M269M843J948n372k980Q002p03
$$ 12457 4364 3877 5237 3941 1880 5965 7589 5357 9626 14469 16417 11045 8065 16067 15364
10939A5364j4351N791R193O867K650m692o095j539l899O407o159o676O179P306
$$ 15364 1013 6804 15997 22864 25514 20822 14727 13188 9289 15696 9537 2861 9040 16346
10925A6346L045M66R028o527m638j107k564j1126L001K315J322J836j14l632K69
$$ 16346 19391 19857 28885 22358 17720 16613 14049 2923 5924 8239 9561 11397 11283 7651 7920
10910G920P175Q292L054N201P594M811K344m274n868j829o192p349n896p999K58
$$ 7920 15095 23387 26441 31642 39236 44047 46391 42117 36249 34420 28228 20879 14983 6984 7242
10895G242o199M82J3289j1322l419N449N459R25O33p655j393L809r23o175O757
$$ 7242 1043 1525 14814 3492 73 5522 10981 11906 12539 4884 3491 7300 6377 202 6959
10880F959j969p868m20M676O618J393q94L393r286J007K783J137l291j695M649
$$ 6959 4990 -2878 -3298 1378 7996 9389 8495 11888 2602 3609 6392 7529 4238 2543 7192
10865G192M227j696j572j401o007M261l36p339N377K117j456Q11M89M275k16r05
$$ 7192 11419 9723 8151 6750 743 5004 4668 -2671 2706 4823 3367 4178 4667 8942 8726 7821
10849G821j2569j1047J965R512J5947P457k790j1466Q618k0l154N138R436O772
$$ 7821 -4748 -15795 -13830 -4318 11629 19086 16296 4830 13448 13428 10274 15412 24848 31620
10835C1620k665n438O510L488Q3R60l791L036N014N050j932M074P895m918L7l258
$$ 31620 28955 23517 30027 33515 33598 34558 30767 33803 38817 43867 41935 46009 53904 48986 49023 45765
10819D5765K073j183p20n711o825n627J853r15L873J0628o485j1654k467K646
$$ 45765 47838 46655 45935 40224 33399 27772 29625 28710 32583 43211 36726 25072 22605 25251
10805B5251r670L435L088N50M322j849j041j280n970p588J894m492M726K228q130
$$ 25251 15581 19016 22104 22654 26976 25127 24086 22806 16836 9248 11142 6650 11376 13604 5474
10790E474P806J3051r782M650M035J1679M619l905k216J1730O926L487m589o932
$$ 5474 13280 26331 16549 21199 25234 36913 41532 37627 35411 47141 54067 57554 52965 46033
10776D6033n7r378p881m665r164M127Q488Q417Q840l828p046l373J743J715Q23
$$ 46033 45976 36598 28717 24052 14888 19015 27503 35920 44760 40932 33886 30513 32256 33971 34794
10761C4794m736M187P871K466M843P711j0441j4451O062J105l755q40Q353J260
$$ 34794 30058 34245 42116 44582 49425 57136 46695 32244 38306 39411 35656 34816 43169 44429
10747D4429P485R746R506N635j2030N79J5095J3331L218L480P035L237Q576K8637
$$ 44429 51914 61660 71166 76801 64771 65350 80445 93776 96994 100474 107509 110746 119322 147959
10733A47959J6389J5247J1605K4229K7969M6364P3875J19812J57150K03991K52104
$$ 147959 164348 179595 191200 215429 243398 289762 363637 483449 640599 844590 1096694
10722A096694K67933K79324K61243K04509J58297O4749k7661j29979j79115k34667
$$ 1096694 1364627 1643951 1905194 2109703 2268000 2332749 2305088 2175109 1995994 1761327
10712A761327k79896k64487k41932k12865j54978j19880r3588o4887m2161k5669
$$ 1761327 1481431 1216944 975012 762147 607169 487289 393701 328814 286653 260984
10702B60984k3819j1671j2778j8631k2693j3328q819j1189j0291j2454p795j2112
$$ 260984 237165 225494 212716 194085 171392 158064 149245 138056 127765 115311 107516 95404
10690I5404o852Q30n783j3691N04k037m866O159O045o320M742l247m188J280k146
$$ 95404 88552 89382 83599 69908 70412 68375 63509 69668 75713 69393 74135 70888 66700 67980 65834
10675F5834k096q703M82j98O610Q409m914l152q269j2962J086J6071l2p113M334
$$ 65834 63738 55035 55517 55319 61929 70338 65424 62272 54003 41041 42127 58198 58166 51053 55387
10660E5387N682L827J05l388n969o445J352N567J0990O069m280j1267m026O919
$$ 55387 61069 64896 65001 61613 55644 49199 50551 56118 67108 73177 68897 57630 53604 60523
10646F0523N183l00j797j3158L466j556k432o217K934K094q074J457j1604j805
$$ 60523 65706 65406 63609 50451 53917 52361 49929 43712 46646 48740 40666 42123 30519 28714
10632B8714K999M565J0102n168J137J0545P410R83q553n00l847j0902j1397n719
$$ 28714 31713 36278 46380 41212 42349 52894 60304 61287 52734 52234 48387 37485 26088 20369
10618B0369j282M784p438j0877L583n820m049J310J877N685l94n979M775J0849
$$ 20369 19087 23871 16433 5556 9139 3319 -730 580 2457 8142 7748 1769 6544 17393
10604A7393n374O375M521L014l857Q714O139N557j912P98m702n519K561J0608
$$ 17393 12019 18394 22915 25929 22072 30786 36925 42482 40570 41368 36666 31147 33708 44316
10590D4316n540J285J627N88j395K90r801K029Q840R133K3253K1151K2070K1650
$$ 44316 38776 40061 41688 42276 40881 41171 31370 33399 42239 51372 74625 95776 117846 139496
10576A39496M1023M7701M7428N6007O4169N4298M7248L1903K733j2427k3771l2632
$$ 139496 180519 228220 275648 331655 395824 450122 497370 529273 532006 519579 495808 463176
10564D63176o1360o7205o0946n2637m1499k4624j7909p450j1918j311m883m929
$$ 463176 401816 334611 273665 221028 179529 154905 136996 129546 117628 116317 111434 106505
10552A06505j248K377L390j0506k834N715J34O97l378N676R594j931M247O978
$$ 106505 105257 107634 111024 100518 97684 103399 103533 104230 100852 106528 116122 114191 118438 125416
10538A25416J118N433J881j0140m608k939O305j81j0835p867p600q039K614L72
$$ 125416 126534 131967 133848 123708 119100 116161 122466 122285 111450 103583 95983 87944 90558 90930
10524I0930q937k457J770m623K376J123l221N434o38P838J3256K3412K9391L8179
$$ 90930 81993 79536 81306 76683 79059 80182 76961 82395 81757 89595 102851 126263 155654 193833
10510A93833M6868N7628N4671M6320M1747K6799J8385J3841j0383j8873l3843
$$ 193833 240701 298329 353000 399320 441067 467866 486251 500092 489709 470836 436993
10499D36993m6639n0902l1222j8115j7538m894j1374R22p577L53j0020j8318o745
$$ 436993 390354 339452 308230 290115 272577 267683 256309 257231 249654 250007 239987 221669 214924
10486B14924o962r21O84j0964j3468l299J3022J2967P316N462j985j0801p003
$$ 214924 207962 207041 207725 196761 183293 179994 193016 205983 213299 218761 216776 205975 198972
10473A98972L599L496p741m040O194k241m601K391J7952K0266N153R357J9074
$$ 198972 202571 206067 198326 194286 200480 198239 193638 196029 213981 234247 239400 248757 267831
10460B67831J7782J4559J1871K0534J0391R363K8262L4452M9495N7677O3210P0364
$$ 267831 285613 300172 312043 332577 342968 352331 380593 415045 464540 522217 585427 655791
10448F55791N5384M2481L9017J5586n649k7128l5105o5965p8325q3046p2321p6656
$$ 655791 711175 753656 792673 808259 802610 775482 740377 674412 596087 513041 440720 364064
10436C64064o3218m3554l2787j3293p49j403L236J1209K4700L0838J3878J2338
$$ 364064 300846 257292 224505 211212 210463 209060 212296 223505 248205 279043 292921 305259
10424C05259R534R160J4255J1580Q761N779j11J1056J0454R887J4227J2142O765
$$ 305259 314793 323953 338208 349788 358549 364328 364217 375273 385727 395614 409841 421983 428748
10411D28748M852O462M829K0458J5810J8500K7890L0567L7778N7209N1661N7581
$$ 428748 433600 440062 444891 465349 481159 499659 527549 558116 595894 653103 704764 762345
10399G62345M7499L7548L1454K8589R162N236r568j3298l523M802Q685O615N596
$$ 762345 809844 847392 878846 907435 916597 921833 912265 898967 895444 900246 908931 915546 921142
10386I21142K2655L5083K0424J3311J6185K0608N284J8592J6362K0830K1485K9276
$$ 921142 943797 978880 999304 1012615 1028800 1049408 1054692 1073284 1089646 1110476 1131961 1161237
10374A161237L8669M7015M3473L6720L9703M2061N5990P1771P2832Q2760Q9972
$$ 1161237 1199906 1246921 1290394 1327114 1366817 1408878 1464868 1536639 1609471 1692231 1782203
10363A782203J01168J14983J23664J28437J06121R6301R6808R7647J19351J50458
$$ 1782203 1883371 1998354 2122018 2250455 2356576 2452877 2549685 2647332 2766683 2917141
10353B917141J72711K05540K38972K67425L18202L62431M12864M82593N38918
$$ 2917141 3089852 3295392 3534364 3801789 4119991 4482422 4895286 5377879 5916797
10344E916797N95462O89769Q19040R46225J065006J198068J354399J476031J571566
$$ 5916797 6512259 7202028 8021068 8967293 10032299 11230367 12584766 14060797 15632363
10335A5632363J653989J676187J728770J833096K040121K453351L235046M592828
$$ 15632363 17286352 18962539 20691309 22524405 24564526 27017877 30252923 34845751
10327C4845751O803647J0333656J5487105K2225008L0124902L8272719M4716654
$$ 34845751 41649398 51983054 67470159 89695167 119820069 158092788 202809442
10320B02809442M8883554M9400703M3818302L5335271K3445975P728118o900468
$$ 202809442 251692996 301093699 344912001 380247272 403693247 411421365 404520897
10313D04520897k1782494l4012006m3337512m7788778m7038091m3857995l6647873
$$ 404520897 382738403 348726397 305388885 257600107 210562016 166704021 130056148
10306A30056148k8384251k1331361j4886550j0026146o914118m975120l761495
$$ 130056148 101671897 80340536 65453986 55427840 48513722 43538602 39777107
10299C9777107l010715k579529k333178k193958k127167k063464j970504j862385
$$ 39777107 36766392 34186863 31853685 29659727 27532560 25469096 23498592 21636207
10291B1636207j705674j525242j352470j179075j017394q92740p75163o90870
$$ 21636207 19930533 18405291 17052821 15873746 14856352 13963612 13188449 12497579
10283A2497579o22368n60783n08894m70267m39902m02486l74281l57074l27368
$$ 12497579 11875211 11314428 10805534 10335267 9895365 9492879 9118598 8761524 8434156
10274H434156l12676k97823k71769k68163k48054k38303k27600k09863j91588
$$ 8434156 8121480 7823657 7551888 7283725 7035671 6797368 6569768 6359905 6168317
10265F168317j86737j71939j71472j70571j61912j59993j53436j46210j49806
$$ 6168317 5981580 5809641 5638169 5467598 5305686 5145693 4992257 4846047 4696241
10256D696241j40273j33334j26291j24295j21596j12060j14877j10370j02282
$$ 4696241 4555968 4422634 4296343 4172048 4050452 3938392 3823515 3713145 3610863
10247C610863j06838r7085q4355q0243o2931o2566o1383n7159n6468n0961o9567
$$ 3610863 3504025 3406940 3322585 3242342 3179411 3116845 3055462 2998303 2941835 2890874 2821307
10236B821307p4096p0100o4833n4057n1187o4487o7676n7179m0073n2311n5590
$$ 2821307 2747211 2677111 2612278 2558221 2507034 2442547 2374871 2317692 2277619 2225308 2169718
10225B169718n5147m9423n7064m4859m5183n0294m3081l3338l2484l5438l2422
$$ 2169718 2114571 2065148 2008084 1963225 1918042 1867748 1824667 1791329 1758845 1723407 1690985
10214A690985l6632l6775k5785k0015k8284k7844k2916j4941j5039k0168j8105
$$ 1690985 1654353 1617578 1591793 1571778 1543494 1515650 1492734 1477793 1462754 1442586 1424481
10203A424481r845q007j6390j3260q097j0941j9822j8864j891L218n133R857J0504
$$ 1424481 1414636 1406629 1390239 1376979 1368882 1357941 1338119 1319255 1317364 1320582 1315449 1325306 1335810
10190A335810M365J85q315k0378m0600n1656n3506p0816p5967o0902o0762l9348
$$ 1335810 1340175 1340360 1332045 1311667 1271067 1219411 1165905 1095089 1019122 958220 897458 858110
10178H58110k7299k8306k1657j8480j9482j9301q685j0055L689m512j7084j0624
$$ 858110 830811 802505 780848 762368 742886 723585 714900 704845 708534 704022 686938 676314
10166F76314p860j2262j5994j0123j3760j9285k1625j2798j6260l529q197j1992
$$ 676314 668454 656192 640198 630075 616315 597030 575405 562607 546347 542818 534621 522629
10154E22629j8544k912k627n964j4814m814j2490m811K491n855j8520m788o533
$$ 522629 504085 501173 498546 492582 477768 472954 460464 455653 458144 452289 433769 428981 422448
10141D22448M96Q240J6326J7164J8115J3946j7846m2986n7399o1472p8548q0053
$$ 422448 422944 431184 447510 464674 482789 496735 478889 435903 378504 317032 238484 158431
10129A58431n8833n8276l5561L852K3361N1895P4477R8443J09573J11535P9105
$$ 158431 99598 41322 5761 9613 32974 84869 159346 257789 367362 478897 558002
10118E58002K6774k9907n5878n9856m8484l9560k5410j6152j0870j4684r273L162
$$ 558002 584776 554869 498991 439135 390651 351091 325681 309529 298659 283975 274702 277864
10106B77864O927m882j8722j3974j0544j2730j9040j7810l063m32p579m42o079
$$ 277864 284791 279909 261187 247213 236669 223939 204899 187089 184026 183594 176015 175573 169494
10093A69494P962Q589j65p796n090m549p407r990m53J0461N604m743k453m399
$$ 169494 177456 186045 185880 178084 172994 168445 161038 151048 150595 161056 166660 161917 159464 155065
10079A55065N829Q395l99M979L235r515n470q8O162L870j454L650o113N275O539
$$ 155065 160894 169289 168890 173869 177104 167589 162119 162031 168193 172063 170609 174259 168146 173421 179960
10064A79960J0925J8650P35p206k607K150P238q452k724k01J198N535j294r116
$$ 179960 190885 209535 210270 203064 200457 202607 209845 201393 198669 198468 199666 205201 203907 194791
10050A94791p681q695m377l885m088j7490l961O778l198m912j597q105j1605n54
$$ 194791 187110 178415 174038 170153 166065 148575 144614 151392 148194 143282 141685 133580 121975 121421
10036A21421K652p4N19k226L25n171J894M328r11O340O305O531l487J413q166
$$ 121421 124073 123999 124518 122292 122617 117446 119340 123668 122757 129097 135402 141933 138446 139859 131693
10021A31693K053j903J920L595P025K269j354q450j1439j7619j0633n047l141
$$ 131693 133746 131843 133763 137358 144383 146652 145298 136848 125409 107790 97157 92110 88969
10008H8969q970k003n205L559n23j765M070J1960O36l05M154M867M595J759o616
$$ 88969 79999 77996 72791 76350 75827 74062 78132 90092 90728 90423 94577 99444 104039 105798 99182
9993I9182O25k430L572k312j411j647p519q722m138J7495K2400K6424J9996J6881
$$ 99182 99807 97377 100949 98637 97226 95579 88060 79338 75200 92695 115095 141519 161515 178396
9979A78396J1626N365J5926J2976q397k0610j0314j9009k0333k1886k4713j8029
$$ 178396 190022 195387 211313 224289 215892 195282 184968 165959 145626 123740 99027 80998
9967H0998J205o896m674o940j664O797l784L406Q665L501q77Q038P102Q27j976
$$ 80998 82203 75307 70633 63693 62029 68826 65042 68448 77113 80614 79737 87775 94877 95704 93728
9952I3728K029O522j0001L319O008k892k803l65O24n130O966l32m308j151M215
$$ 93728 95757 102279 92278 95597 101605 98713 95910 95545 96169 91039 98005 97673 93365 92214 96429
9937I6429O15J306k157N402N708N010O590o845L816J3154M558N982J2463J0159
$$ 96429 97044 98350 96193 101595 107303 112313 118903 112058 115874 129028 133586 139568 152031 162190
9923A62190O333J4725K3145K9194M8521O1929J00302J30674J77616K27041K66787
$$ 162190 168523 183248 206393 235587 284108 346037 446339 577013 754629 981670 1248457
9912A248457K90077K80837K41265J85811R9703k224q9215j69876k21445k66104
$$ 1248457 1538534 1819371 2060636 2246447 2346150 2343926 2254711 2084835 1863390 1597286
9902A597286k88422k64767k31372j69030j30127r0507o2630k9407l4005k3616
$$ 1597286 1308864 1044097 812725 643695 513568 423061 360431 331024 297019 273403
9892B73403k0192k2605j9093k3414j1136l087p136l114O17P26j4723j5330j3268
$$ 273403 253211 230606 211513 188099 176963 173876 166740 163626 164243 164969 150246 134916 121648
9879A21648m042N081J499o039o722q957n108n089N41n207P39J417N397K127m924
$$ 121648 117606 122687 124186 118147 111425 102468 97360 92271 92812 87605 88344 89761 95158 97285 92361
9864I2361n727p925l242n428m103J0944k760o199o836j3594k0479n280k858l363
$$ 92361 86634 78709 75467 70039 65936 76880 74120 67921 61085 47491 27012 21732 18874 15511
9850A5511j622O115R706J0350J0911P894K062n541j640M228J067M360l801L050
$$ 15511 13889 20004 29710 40060 50971 58865 60927 55386 53746 57974 59041 63401 59600 62650
9836F2650J0631L60N440l118k410k217r080l067L718K152k511j2179j3421m135
$$ 62650 73281 73641 79081 75963 73553 71336 62256 59189 62907 65059 62548 50369 36948 32813
9822C2813J659O721K632l898r29L96m592M83L306k60k785K568K649p471j712R430
$$ 32813 34472 41193 43825 39927 38998 39394 34802 35285 38591 38331 35546 38114 40763 33292 31580 41010
9806D1010J5820M424k309n128n00m52L808j111O103j018o162K79K811n12n76Q937
$$ 41010 56830 61254 58945 53817 53317 52865 56673 55562 61665 60647 54485 54764 57575 57063 56487 65424
9790F5424M435K64L435j847n569J940P106p383N98J560r275p712O646J76M851
$$ 65424 69859 70123 73558 71711 66142 68082 75188 67805 68403 69963 60688 52976 59622 59798 64649
9775F4649K068k642M579L699J58r095l860n343j625n984J0023n459J516m96r000
$$ 64649 66717 64075 68654 72353 72511 63416 59556 54213 52588 46604 56627 51168 52684 52188 43188
9760D3188p980K261R506j283K48l659n143P11N548K775l698l961P357p602k431
$$ 43188 35208 37469 46975 45692 45940 42281 37138 37849 43397 46172 42474 38513 45870 38268 35837
9745C5837m025K312J6600J6227l818q800q83n518O92N400M72n012l33J2032N512
$$ 35837 31812 34124 50724 66951 63133 54333 53450 47932 48624 54024 54496 49484 49151 61183 66695
9730F6695r332n831n015m958k031m318j1273M16Q407L517J982L085J0219q975
$$ 66695 57363 51532 46517 41559 39528 35210 23937 24353 32760 36277 38259 41344 51563 42588
9716D2588m081n822O045J875j2337l871J0839N147L488J1074N105j0195R6Q972
$$ 42588 38507 32685 38730 40605 28268 24397 35236 40383 43871 54945 60050 49855 49951 58923
9702E8923K96p480p751l784l690P962k741k129k903K344m248J779M791L691j0186
$$ 58923 59219 51739 43988 40204 36514 44476 41735 39606 36703 39047 34799 36578 41369 45060 34874
9687C4874J438j978p277m984O84M190K73N449P234j785L558K155k517L218l335
$$ 34874 36312 34334 27057 22073 22757 26947 27220 32669 39903 38118 41676 43831 41314 44532 41197
9672D1197k939K237p69J2521M960Q511r817j3210j1067k003J8801k117j862m25
$$ 41197 38258 40495 39726 52247 57207 65718 55901 42691 31624 29621 48422 46305 44443 44018
9658D4018M777k471n873k835n839p222M854K143n922l935J2125K670R044L221
$$ 44018 48795 46324 40451 37616 31777 24555 29409 31552 25630 21695 33820 36490 45534 48755
9644D8755R80M726J562m803m386j1038J530K07Q541L80n866L687m455M060o48
$$ 48755 49735 54461 56023 51220 46834 35796 37326 37533 46074 46454 40588 44275 39820 43880 43232
9629D3232k548J690J0904K913n931q687R92J3260L886l754L390l649m738L808
$$ 43232 40684 42374 53278 56191 50260 41573 42565 55825 59711 55957 59347 55698 50960 54768
9615E4768J09l003j007p811o87k889l199L133L602k758p409k260N797J0978q04
$$ 54768 54877 51874 50867 43056 42369 39480 36281 39414 43016 40258 32849 30589 36386 47364 46560
9600D6560J257N008q283k087M38l751k53o891k416O922Q088j465n384M548J0249
$$ 46560 47817 52825 44542 42455 42893 39142 38889 31998 29582 36504 44592 43127 37743 42291 52540
9585E2540M703j1058l688P524k569k33p118k917L239J862j416j425o529J2305
$$ 52540 57243 46185 42497 50021 47452 47219 40101 37184 40423 42285 40869 39444 32915 45220
9571D5220P863K828O03p195m198K9m891L91j657N850M391O195n216l739L146J1035
$$ 45220 53083 55911 56514 49319 45121 45150 40259 40650 38993 44843 49234 55429 50213 46474 49620 60655
9555F0655L030K66p701J514l198k906N25N763l950j335j438O211r021k8K774M576
$$ 60655 63685 63951 56250 57764 54566 51660 52185 57948 53998 52663 51225 57436 48415 48387 51161 55737
9539E5737Q96m681q115j078L507L369L197M504L604n312K873J538j4357j0286
$$ 55737 56633 51952 43837 42759 46266 49635 52832 57336 60940 55628 58501 60039 45682 35396
9525C5396r206N805R610R035J506k885Q430M353j260j2625L154L130P366l770
$$ 35396 26190 31995 41605 50640 52146 49261 57691 62044 60784 48159 51313 54443 61809 58039
9511E8039n601Q660J0871J307l491j4528p855P556J2466P481O898J7352k103j1342
$$ 58039 52438 61098 71969 73276 69785 55257 47402 54958 67424 74905 81803 99155 97052 85710
9497H5710j0751O855m490p841n551M945N580Q560j832j4135p138Q365Q942k681
$$ 85710 74959 81814 77324 69483 63932 68877 74457 83017 81185 67050 59912 68277 77219 74538
9483G4538n088m73P524j917M380k091n149J914J3784J2215r00j1197m050o93j919
$$ 74538 69450 68977 76501 74584 78964 76873 71724 73638 87422 99637 98737 87540 83490 82797 80878
9468H0878m592j3503p843j01L283q46p92O171R233l060Q931M054p790j8354k484
$$ 80878 76286 62783 54940 54839 58122 57276 56484 62655 71888 68828 77759 81813 74023 55669 53185
9453E3185N29Q945O464l990o380P319M830N98m885J146p959K815O595K814o889
$$ 53185 53714 62659 69123 65133 58753 66072 70902 71500 66615 67761 59802 62617 69212 72026 65137
9438F5137k864N777j694j0947l874l122j425J230o54L296J2932Q42l733K738K019
$$ 65137 62273 68050 66356 55409 51535 48413 46988 48218 47564 50860 63792 64634 60901 63639 65658
9423F5658K909j588M054Q922N768n730P97o189o984n241k091j206p827L081M686
$$ 65658 68567 66979 71033 79955 85723 79993 80790 74601 67617 62376 60285 59079 51252 54333 59019
9408E9019P871J754L305J0015P640L927M110j1971j0521O670L927j7086n403J1368
$$ 59019 66890 68644 71949 81964 89604 93531 97641 85670 75149 81819 85746 68660 63257 74625
9394G4625k717L144K105L596o975o057M36N147M607R723J5920J217q655j0112
$$ 74625 71908 75052 77157 80753 73778 67721 68157 73304 77911 87634 103554 104771 96116 86004
9380H6004n377n35J820k720Q006O491k602j474m216n925L420J043o388l116O041
$$ 86004 80627 80092 81912 79192 87198 93689 91087 89613 85397 79472 82892 83935 77547 74431 80472
9365H0472P072n996l428J175k063j27R292R914j3263q379P855j934j845R959j006
$$ 80472 87544 81548 78120 79295 77232 77105 86397 96311 83048 74669 82524 80590 78745 88704 87698
9350H7698l915o0M306m851r009m515J732J69L675K600n255O270l97M62K061N979
$$ 87698 83783 83723 88029 83178 74169 69654 71386 71555 75230 77830 72575 78845 78448 78910 80971 86950
9334H6950M628k066N75j054J445M70n13J024k135M507L944P502N996r332L733
$$ 86950 91578 89512 90087 89033 90478 90948 90435 91459 89324 93831 97775 105277 111273 101941 105674
9319A05674Q561n340R68r534k374K984J634J616L417J752o162M148l31O75p751
$$ 105674 114235 108895 109863 100329 97955 100939 102573 104189 107606 109358 103196 107344 107013 107688 99937
9304I9937o418l854Q064r89J47R468J633l953n816O034j339M968q44J577q67K589
$$ 99937 93519 89665 97729 96740 96887 106355 107988 104035 98219 104253 102914 107882 107038 108615 107748 110337
9288A10337J801J0764L070j1896l395J19K338j905J791p544k005k924r671n283
$$ 110337 112138 122902 125972 114076 110681 110800 113138 111233 113024 105480 103475 100551 90880 85597
9274H5597l005R268L544N26k479N928P992P140J227m882M422L631j886j7207L576
$$ 85597 82592 91860 95404 95930 93451 99379 107371 114511 115738 110856 115278 118909 117023 99816 103392
9259A03392J0235K81J7q831q61O830q36l920p921k530Q231J2921J0721K575k667
$$ 103392 113627 113908 113925 105094 104233 111063 110227 106307 98386 95856 104087 117008 127729 130304 127637
9244A27637P617j479l333L033q57o156N800l180J108L506R044M56r53L167m727
$$ 127637 135254 133775 130442 133475 132618 126462 132262 129082 130190 133696 142740 143196 142243 145410 140683
9229A40683N652M114k177p044k759j793k532n032J876L244N71L918R944K216l950
$$ 140683 146335 150449 148272 141228 138469 136676 134144 129112 130988 134232 134803 138721 148665 150881 146931
9214A46931l08Q036K102m943L248N594J821O249K205p113j1090q934O96N426L719
$$ 146931 146623 154659 156761 151818 155066 160660 162481 168730 170935 163822 152732 143798 144494 149920 153639
9199A53639N840j514K33o94R09N60J929K523N956R474j577p621k007j955r78j154
$$ 153639 159479 157965 158198 157504 158413 158973 160902 163425 169381 178855 177278 169657 167650 165695 164717 163563
9183A63563j240N566R297k87N504N509o33p112j085l972l08N024o94K382P003
$$ 163563 162323 167889 177186 176899 182403 187912 187279 180167 179082 175110 174802 179826 179132 181514 188517
9168A88517l308n123N141P468m775l181N482N255K943j276M829k654J789K342
$$ 188517 185209 180086 185227 192695 187920 184739 190221 195476 198419 197143 201972 199318 201107 203449
9154B03449k142p479n772L895K559M228J0559O59K61l199N514O465j0140L658
$$ 203449 201307 193828 188056 191951 194510 198738 209297 209956 210217 207018 212532 218997 208857 212515
9140B12515J0273o650j188M477o888j094K247J1128J3666o09P838L12M463N086
$$ 212515 222788 216138 214950 219427 212539 211445 213692 224820 238486 237877 245715 246027 250490 255576
9126B55576Q35o276N805P026R045P038O807M861q32O66L584L754j3592Q446K5179
$$ 255576 256411 250135 255940 262966 272011 279049 285856 290717 289885 290551 294135 297889 284297 292743 317922
9111C17922J2138j711Q257J4057J6002P821q80Q393J8381N356N339J0739K100
$$ 317922 330060 328349 336606 350663 366665 374486 373606 381999 400380 405736 411075 421814 423914
9098D23914m911o29J131M899K52m366m431n814n907M038J0847O205K222r762j7307
$$ 423914 419003 418374 419505 424404 424656 420290 415859 410045 404138 408176 419023 425228 427450 417688 400381
9083D00381n686j758O355P093J534o037l302Q217J0436n14O212r820n055M726
$$ 400381 394695 392937 399292 406385 407919 401882 398580 406797 417233 416719 422931 413111 408056 412782
9069D12782K52l085M041P215R420K093j2130m117Q523J2173R395O608M988J1800
$$ 412782 413034 409949 413990 421205 430625 432718 420588 416471 424994 437167 446562 453170 458158 469958
9055D69958N243L476j503k758N390J2438O698J354J1919N281N924J2141M563J1030
$$ 469958 475201 478677 477174 474416 479806 492244 498942 500296 512215 517496 523420 535561 540124 551154
9041E51154J4748J3688R255N543M287Q675Q432P035n127l13P010o04R967J0542
$$ 551154 565902 579590 588845 594388 598675 607350 615782 622817 617690 617377 624387 623783 633750 644292
9027F44292p806N570Q248K0821R44j0792K339N448N000k514k205J0173J4233J0367
$$ 644292 636486 642056 650304 671125 672069 661277 663616 669064 674064 671550 669345 679518 693751 704118
9013G04118k122j046O517J1032J3144P378N355J7594J0449L575l282O219K1547
$$ 704118 701996 700950 707467 718499 731643 739021 744376 761970 772419 775994 772712 778931 800478
9000H00478J3875Q067P387R189R356M271J3840K9711K2380J8162O127J0134J8885
$$ 800478 814353 822420 829807 838996 848352 852623 866463 896174 918554 936716 942843 952977 971862
8987I71862J6567K0284J6324J2519R379J6747K5781K0769J5583K1339K7222K7385
$$ 971862 988429 1008713 1025037 1037556 1046935 1063682 1089463 1110232 1125815 1147154 1174376 1201761
8975A201761K2130J7095R698M351J3768P192M122Q804J9733J4151J5721Q580P193
$$ 1201761 1223891 1240986 1250684 1255035 1268803 1275995 1280117 1288921 1308654 1322805 1338526 1347106 1354299
8962A354299J6089J7002K1548J6026K6840K4156J7822K6767L2161K6339K9165
$$ 1354299 1370388 1387390 1408938 1424964 1451804 1475960 1493782 1520549 1552710 1579049 1608214
8951A608214L3959K9240L2546K2992K8658M0352K9837K6736M3612M9175L9174
$$ 1608214 1642173 1671413 1703959 1726951 1755609 1795961 1825798 1852534 1896146 1945321 1984495
8940A984495M6677M6595M9596M2030M7610N1320N1072N4517M9073N2194O8530
$$ 1984495 2031172 2077767 2127363 2169393 2217003 2268323 2319395 2373912 2422985 2475179 2543709
8929B543709P3254O7320N4059N5762O3474O3105P3016P3241P9142P9054P8778
$$ 2543709 2616963 2684283 2738342 2794104 2857578 2920683 2993699 3066940 3146082 3225136 3303914
8918C303914R0990R3914R7028R4953J04699J20000J18249J14303J05598J30903
$$ 3303914 3394904 3488818 3585846 3680799 3785498 3905498 4023747 4138050 4243648 4374551
8908D374551J31879J32149J55872J45794J43364J55655J65285J76426J88405K10823
$$ 4374551 4506430 4638579 4794451 4940245 5083609 5239264 5404549 5580975 5769380 5980203
8898E980203K13105K22152K29898K36905K61987K83463K94438L08515L28714L51626
$$ 5980203 6193308 6415460 6645358 6882263 7144250 7427713 7722151 8030666 8359380 8711006
8888H711006L70305L90054M14188M48972M80866N17618N58029N85215O30767O81563
$$ 8711006 9081311 9471365 9885553 10334525 10815391 11333009 11891038 12476253 13107020 13788583
8878A3788583P26664P70762Q29360Q98409R78345J055859J137022J229502J346673
$$ 13788583 14515247 15286009 16115369 17013778 17992123 19047982 20185004 21414506 22761179
8869B2761179J465858J593546J744549J899929K085684K272825K487524K720801
$$ 22761179 24227037 25820583 27565132 29465061 31550745 33823570 36311094 39031895
8861C9031895K968250L249619L542656L847040M143545M447879M746673M976420
$$ 39031895 42000145 45249764 48792420 52639460 56783005 61230884 65977557 70953977
8853G0953977N141895N223311N162412M932988M530233L917667L128663K152044
$$ 70953977 76095872 81319183 86481595 91414583 95944816 99862483 102991146 105143190
8845A05143190J044956j08118j245204k287000l181717l898860m402449m719754
$$ 105143190 106188146 106080028 104834824 102547824 99366107 95467247 91064798 86345044
8837H6345044m879009m895450m796710m631423m396004m129301l861427l597570
$$ 86345044 81466035 76570585 71773875 67142452 62746448 58617147 54755720 51158150
8829E1158150l322815l051421k814165k596407k377158k178688k001504j848692
$$ 51158150 47835335 44783914 41969749 39373342 36996184 34817496 32815992 30967300
8821C0967300j707659j580834j450542j339778j245707j151544j086002j005806
$$ 30967300 29259641 27678807 26228265 24888487 23642780 22491236 21405234 20399428
8813B0399428r33072q64520q04826p66207p22253o77490o30337n95439n63684
$$ 20399428 19466356 18601836 17797010 17030803 16308550 15631060 15000723 14405284 13841600
8804A3841600n25757m94474m68715m47321m23779m01413l87434l53509l33102
$$ 13841600 13315843 12821369 12352654 11905333 11481554 11080141 10692707 10339198 10006096
8795A0006096l24121l12641k93971k94410k77813k44980k40604k35042k23037
$$ 10006096 9681975 9369334 9075363 8780953 8503140 8258160 8017556 7782514 7559477
8786G559477k16051j98341k01032j97518j77821j63302j80618j74557j61562j55909
$$ 7559477 7343426 7145085 6944053 6746535 6568714 6405412 6224794 6050237 5888675 5732766
8776E732766j49938j33901j30523j22720j21929j25579j24792j18904j10031j08634
$$ 5732766 5582828 5448927 5318404 5195684 5073755 4948176 4823384 4704480 4594449 4485815
8766D485815r4702r2297j03943r4411q6104r4826q1911q5111q2384p3199p7647
$$ 4485815 4391113 4298816 4194873 4100462 4014358 3919532 3837621 3752510 3670126 3596927 3519280
8755C519280q3657o5943o4616o6593o2715o1348o5378o1219n6130o3467n9934
$$ 3519280 3435623 3369680 3305064 3238471 3175756 3114408 3049030 2987811 2931681 2868214 2808280
8744B808280m4744m4267m6544m0034m6294m3783m5914l8866m1339l5058l6126
$$ 2808280 2763536 2719269 2672725 2632691 2586397 2542614 2496700 2457834 2416495 2381437 2345311
8733B345311k3875k9439l3101m0015l2632k5832l6500l5315k4425k2290k8842
$$ 2345311 2321436 2291997 2258896 2218881 2186249 2160417 2123917 2088602 2064177 2041887 2013045
8722B013045k9839k9403l7163k4642k2554l5298k7845l3286m2976m2430m8512
$$ 2013045 1983206 1953803 1916640 1891998 1869444 1834146 1806301 1773015 1730039 1687609 1639097
8711A639097l8611j7781k5738l2687l4323k2844k2978k0507k0067k6242k6150
$$ 1639097 1600486 1582705 1556967 1524280 1489957 1467113 1444135 1423628 1403561 1377319 1351169
8700A351169j4174j5198k3115k7130k3132j8419k2101j8319j7959n861j5798r547
$$ 1351169 1336995 1321797 1298682 1271552 1248420 1230001 1207900 1189581 1171622 1165761 1149963 1140416
8688A140416j8650k1004j5233o811j1073n180j8353j1426J231j3810j6267j9383
$$ 1140416 1121766 1100762 1085529 1078718 1067645 1062465 1044112 1032686 1033917 1020107 1003840 984457
8676I84457j3984k4211j6562j2326j1138j6496k0688j4234q585j3611k3928j4692
$$ 984457 970473 946262 929700 917374 906236 889740 869052 854818 846233 832622 808694 794002
8664G94002j9306l0758k4171j6846j6474q933j3337j0420L448m761j7677j0747
$$ 794002 774696 743938 719767 702921 686447 677514 664177 653757 657205 652444 634767 624020
8652F24020m420l464j0407l904N425P847p870p410N87j276o425L458j15P445Q793
$$ 624020 619600 616136 605729 601825 607250 615097 607227 599817 600404 599128 592703 596161 596046 603491 612284
8637F12284L970n224m180N724k220j5370j5478p675l517M439O762k623j3407q225
$$ 612284 616254 611030 606850 612574 610354 594984 579506 571831 568314 572753 579515 576892 563485 555260
8623E55260j625L553o771j6621o634j3050p256r666j0179l493k186j248Q88k622
$$ 555260 553635 557188 550417 533796 527162 514112 506856 497190 487011 483518 481332 480084 480972 478350
8609D78350j3029j3910Q439N774J407k252J496m16J627r91l620P94p383O16R04
$$ 478350 465321 451411 459850 465624 467031 464779 466275 465859 467486 466495 462875 463669 456286 456902 457806
8594D57806m788k113J193n385m236P874O559M477j144p109o267j3336r372r473
$$ 457806 453018 450905 452098 446713 442477 450351 456910 461387 460243 453134 446867 433531 424159 414686
8580D14686L07Q765l138j2009N13O617J341J127k0622j6478j0604j3712r101r811
$$ 414686 414993 423758 420620 408611 409124 415741 417082 418209 397587 381109 370505 356793 347692 337881
8566C37881n557m280m011p310M138R04N74L125J296n449j2155r279q956P163P3
$$ 337881 332324 328044 324033 316723 320861 321765 322339 325464 326760 321311 309156 299877 290921 298084 298157
8551B98157n259j0439r018J301M860J094M61m371K084Q754p028j4626O9N462j5599
$$ 298157 292898 282459 273441 274742 279602 280696 281157 276786 278870 287624 280596 265970 266039 271501 255902
8536B55902j8284j411J0069J0775j039j6294L593M908p588q516m879m30m613o326
$$ 255902 237618 236207 246276 257051 256012 239718 243311 248219 240631 232115 227236 226806 222193 215867
8522B15867m150O069Q558l671r071l750r25k033r094k880L562K695r975m429Q800
$$ 215867 211717 217786 226344 222673 213602 209852 208927 206894 197800 194920 198482 201177 191202 186773 195573
8507A95573k54q9J948N499O66L113p150o190p023l490K880P0l952q890m25O05
$$ 195573 195319 195230 197178 202677 203343 206456 199306 193116 186093 182603 185483 185553 181601 172711 172286 172891
8491A72891L302p32p289j786n591L383m324m830J7139L963m860o547q690K106
$$ 172891 176193 175461 168172 166386 160795 164178 159854 155024 172163 176126 171266 164719 156029 158135
8477A58135L865j491k371M759J4q745k145l708n605K967o177J199p65M745o56
$$ 158135 162000 160509 158138 162897 162911 154166 152021 148313 142708 145675 139498 140697 139932 144677 144021
8462A44021L057l725k374m092k46N844k847n101j124L896l944N795O605o723q949
$$ 144021 147078 143353 140979 136887 136641 142485 139638 134537 133413 137309 133365 139160 145765 139042 130093
8447A30093m142N9J554p35l367M650m75O55n538k543L373K11m635m956j973j116
$$ 130093 125951 126010 127564 126829 123462 128112 127637 128292 122754 120211 123584 123795 119160 114204 112231 111115
8431A11115p79L983R521J779p231q680q306J865J1733M263j3478K260J6048Q261
$$ 111115 110336 114319 123840 125619 118388 109708 101402 103267 115000 119263 105785 108045 124093 132354
8417A32354p232k929j259j1934m671K831p425q923J1116R904L024l140j199p778
$$ 132354 125122 122193 120934 109000 104329 107160 99735 90812 101928 111832 114856 111716 110517 102739
8403A02739J700N105P445o996Q13N676r868M340M522j1634M295N984o418r237
$$ 102739 104439 109544 116989 109993 110806 116482 106614 110954 115476 103842 108137 114121 107703 98466
8389I8466l736m201N461o243M806Q934K181n761q895o910P379l670j5222j743
$$ 98466 94730 90529 95990 89747 94553 103487 105668 99907 91012 84102 91481 87811 72589 70846
8375G0846J5237L579o132j413M911N639Q826O814o739p834k469j803J707M223
$$ 70846 86083 89662 83530 82117 87028 92667 101493 108307 101568 93734 91265 89462 91169 95392
8361I5392J691Q92m65l845j0136R663N624j2286j6993R04Q632k2J0871K833k320
$$ 95392 97083 97975 97510 93665 83529 93192 98816 86530 69537 70441 79073 79051 89922 92755 90435
8346I0435K5L064j0132q618k608K440K050J415p21j047J251n81J549p247L301
$$ 90435 90460 93524 83392 74774 72166 74606 76656 78071 77350 76303 77554 76973 78522 71275 74576
8331G4576m95q117O270L531m089M77o320M004R359J8577Q8q889k39l471q755n630
$$ 74576 74081 65964 72234 75765 71676 72153 65833 69837 79196 97773 97861 88972 88733 85262 76507 70877
8315G0877j646Q45M596M000k815k589k792O184N92k800j0827k708N274M726O039
$$ 70877 69231 70076 74672 78672 75857 73268 70476 76660 77252 74452 63625 60917 66191 70917 76956
8300G6956M362p473j2818M018J978J436l294L624M03k635O428O36j861q58n432
$$ 76956 81318 73845 61027 65045 67023 68459 65165 68789 69192 66557 72985 73621 71760 70902 65470
8285F5470p968M792R469J812l123l317J063l64l115O968m743J159J1157J170m130
$$ 65470 57502 62294 71763 73575 70452 67135 68198 67834 64719 71687 66944 68103 79260 80430 76300
8270G6300n114r306L407J2866Q91j4592l808N956P820N615J511j656j2944j2277
$$ 76300 71186 61880 65287 78153 79044 64452 60644 66600 74420 80035 81546 79890 66946 54669
8256E4669l818K578N03K696L428N995k867L359N274P085L098l686q078l878n044
$$ 54669 50851 53429 53932 56628 60056 66051 63184 66543 71817 78902 82000 78314 70236 66358 61314
8241F1314l622K958O249O189q617J844m41r686l330q700K963K061m241K994J0063
$$ 61314 57692 60650 66899 73088 64471 66315 65874 56188 52858 44158 47121 49182 44941 47935 57998
8226E7998Q033J718J838p133p876P37L521j010R46m467j337J367l946J492k616
$$ 57998 66031 67749 69587 62454 54578 55315 58836 57826 58772 54305 52968 54335 50389 51881 49265
8211D9265l073K418R518R242l61o843q899j36K996k181M16O145r240j877P551
$$ 49265 46192 48610 58128 67370 67009 60166 51267 51131 54127 51946 52362 58507 49267 47390 54941
8196E4941j802J02J778r15N684q351n142L728O17K540N652o348k475Q661K055
$$ 54941 53139 53241 55019 54104 59788 51437 46295 50023 50640 53180 58832 52484 50009 58670 60725
8181F0725q942J620K668L863l245L193m492n491k109r004j25j0210m861J921o6
$$ 60725 51783 53403 56071 59934 56689 59882 55390 49899 47790 38786 38661 28451 23590 25511 25445
8166B5445N142J8027P073k830J817l166j47N438k038l78l954k374J55N107M06
$$ 25445 30587 48614 55687 52857 54674 51508 51361 56799 54761 54383 50429 48055 48210 53317 53723
8151E3723p037j0025P76N896K601R068O725R677j845J702K839n068q372k912p05
$$ 53723 46686 36661 37437 43333 45934 55002 61727 71404 69559 71261 74100 69032 60660 57748 57043
8136E7043k811l047M639j1125r731L577J7136N48M984o302r045j683J3493P953
$$ 57043 54232 51185 55824 44699 34968 38545 55681 56229 61213 54911 45866 44183 57676 65629
8122F5629j686m554k828j979O574k408n317M484Q898p375n711J454O101q905P643
$$ 65629 63943 59389 56561 54582 61156 58748 53431 57915 66813 59438 53727 55181 61282 52377 60020
8107F0020P838K050P832Q468N456J7734K5998L2937K6122Q852J6074K3043J5231
$$ 60020 67858 69908 77740 86208 91664 109398 135396 168333 194455 203307 219381 242424 257655
8094B57655j952j8869k0193j8949k5227k3719k0558k2991p647m986J568l266j0220
$$ 257655 255703 236834 216641 197692 172465 148746 128188 105197 97550 92564 94132 90866 80646
8081H0646q426M772J0414J908l177n276n493K538r58o346n96J215p327J872O106
$$ 80646 72220 76992 87406 89314 86137 80861 75368 77906 76948 70602 70006 71221 63894 65766 71872
8066G1872J897k806m032N392K076Q244M018P152R547L499J2570L9194L9752M6392
$$ 71872 73769 70963 66931 72323 74399 82643 86661 93813 103360 106859 119429 158623 198375 244767
8052B44767O4847O1889M0322J9248j5027m4299m7003m2732m5841m0240l7283k0729
$$ 244767 309614 371503 411825 431073 416046 371747 324744 282012 236171 195931 158648 137919
8040A37919r838j801r783l706k978j5770j5945k621k063p21j92N815j233o298
$$ 137919 128081 126280 116497 112791 109813 94043 78098 75477 73414 72693 72501 78316 77083 70785
8026G0785n978J29K002J3371o60p900q147m374p965n677O132J0740q230L992J1185
$$ 70785 64807 64936 66938 80309 79649 71749 63602 59228 51263 45586 51718 62458 54228 58220 69405
8011F9405J7961J7543K2494K4615L0243K5356N542M795q728L046q7k3528k1437
$$ 69405 87366 104909 127403 152018 182261 207617 213159 217954 209226 212272 212185 188657 167220
7998A67220k1397l4916l2809n387k016j3728q761j0484j323R139q78j431l08l216
$$ 167220 145823 110907 78098 72711 70695 56967 48206 37722 36399 45538 44660 43229 42921 39705
7984C9705p694p495j781K323J824J966Q003K156l859j275j982m721Q66k965J588
$$ 39705 32011 24516 22735 25058 26882 28848 36851 39007 35148 33873 31891 27170 28036 25071 26659
7969B6659P596N338k901L054J454n271L121l11L557j362Q10l31l431K041k619
$$ 26659 34255 39593 36692 39746 41200 35929 39050 38739 42296 40934 41744 41413 37982 40023 37404
7954C7404o028N293q241l575j172L576N682j472J447Q135o380L339P868J094l536
$$ 37404 31376 36669 28428 24853 23681 27257 32939 31467 32914 41049 34669 38008 45876 46970 43434
7939D3434n884n053M470l066m871j585L933k30O77P318J727j746o89l748l642
$$ 43434 37550 32497 36967 33901 29030 27445 31378 31148 31825 39143 40870 39124 38435 34687 31045
7924C1045n793J902m51j98N261K620j278K217J0516J094p224p517k303J615L776
$$ 31045 25252 27154 26703 26505 31766 34386 33108 35325 45841 46935 39711 32194 29891 31506 35282
7909C5282m108Q06j853K596r561o474L744J6757J2002k361q521o427K043N598
$$ 35282 31174 31980 30127 32723 23162 16688 20432 37189 49191 46830 38309 31882 33925 39523
7895C9523J832l821p272m567K907J0584N417J992r172r962n166m073K91L560R740
$$ 39523 41355 37534 30262 25695 28602 39186 44603 46595 37423 27461 22295 18222 18513 22073 31813
7880C1813R603J467j0945k347J1494j0133p470r883o17K141Q203r34o061r081
$$ 31813 41416 42883 31938 29591 41085 30952 23482 13599 12982 15123 23326 22392 16331 7250
7866G250l373L956R855J1109p433p821P098L930l398m642N745j681n001J070N166
$$ 7250 3877 7833 17688 28797 21364 13543 20641 24571 21173 16531 22276 20595 15594 16664 21830
7851B1830K702R19M232n038m994M523L934j775L085n850J699M746l813l662r29
$$ 21830 24532 25451 29683 24645 19651 24174 28108 26333 29418 23568 25267 30013 26200 22538 21609
7836B1609j815Q420j829n013J7O133k198j108p578n324P497m561j874J2311N076
$$ 21609 19794 28214 26385 21372 21389 27522 25324 24216 16638 11314 18811 14250 12376 24687 29763
7821B9763k355n89j258l289o720k695J4062M093j966R515J774o920m036M585o701
$$ 29763 27408 26819 25561 22272 15552 12857 26919 31012 29046 38561 40335 33415 29379 33964 27263
7806B7263j6048o950p519J0731J2594K547q390j2733J714O884P057J197J069M995
$$ 27263 11215 4265 -3254 7477 20071 22618 14228 1495 3209 10093 17150 18347 19416 24411
7792B4411M509m351L614m317n660q437k503q31J032J660M156J3603J782p498j372
$$ 24411 28920 24569 28183 23866 18206 9769 7266 6435 7467 9127 13283 26886 28668 21170 19798
7777A9798J4723j805n715k160j625m166p853J081k427P133j488m069J0593J830
$$ 19798 34521 32716 27001 24841 23216 19050 11197 12278 9851 16984 15496 11427 22020 23850
7763B3850o256M34k774N334J3841P342o868m237q404N357J0673M949o278j3536
$$ 23850 17594 18028 15254 20588 34429 41771 34903 30666 22262 27619 38292 43241 36963 23427
7749B3427n752K38N149m934R40J1653K621r940m922J769m26O783J114k230l328
$$ 23427 17675 17913 23062 18128 19068 30721 33342 23402 18480 20249 19823 26606 27720 25490 22162
7734B2162q492J494N679J2354L85n699l390j304j607J0904j659o965j3011k45
$$ 22162 13670 15164 20843 33197 33582 27883 24493 23189 21582 32486 30827 23862 10851 10606
7720A0606j595l829j572K112n487J1626j350Q53Q025Q004J962n080k692j702m694
$$ 10606 9011 5182 3610 5722 235 11861 10511 11364 19389 27393 29355 24275 21583 19881 15187
7705A5187L408k970q161m915n293J964o169P014J1171L47Q984K1m360j199M208
$$ 15187 18595 15625 7464 2549 -2744 -780 -6949 65 11236 11583 20567 20588 16228 15029 19237
7690A9237M024k050K222O669M324o199n922o344q305L785P274K619q037n670N84
$$ 19237 23261 21211 23433 30102 34426 28227 22305 15961 7656 11441 18715 21334 13297 7627 8211
7675H211Ql481Q822O354n712P302j217k456r046J674L841O020m398R7r132K639
$$ 8211 8219 4738 13560 19914 14202 21504 20287 17831 8785 10459 14300 20320 15922 16019 6887 9526
7659I526J021O580O610k151n489l953k78L897k199M187J78l310J0668m944j3312
$$ 9526 10547 17127 23737 21586 16097 12144 11866 15763 13564 17751 17929 14619 25287 20343 7031
7644G031J033O983P707K292o156q826o323K238P123J088j2810J001P246L703N44
$$ 7031 8064 15047 22754 25046 18890 10064 3741 5979 13102 14190 1380 2381 9627 13330 13874
7629A3874p256M614N024L123M429k491l155J575k340L349K436k750m197o361r3
$$ 13874 6618 11232 16256 19379 23808 21317 18162 19737 17397 20746 23182 20432 16235 9874 9781
7614I781N698N482P931N266m764l224l650j2362r51L803j3364J668J2131P822
$$ 9781 15479 20961 28892 34158 29394 26170 22520 10158 9207 13010 -354 1314 13445 21267
7600B1267J48j879l454l706l301K535J454O71n659o232K760r23K831O689j222
$$ 21267 21415 19536 16082 12376 9075 11610 13064 13735 8076 1844 4604 3681 6512 13201 11979
7585A1979M25K47N495l33j0474Q987J0180n006n859p276k315Q535j149n439J914
$$ 11979 12404 12651 18146 17813 7339 16326 26506 21500 15641 8365 6050 14585 13436 7997 9911
7570I911k449p6n280J0070O760j3497j03J2594o679j1739j89Q56k174K74N832
$$ 9911 7462 7386 2106 12176 18936 5439 5336 17930 11251 -488 -677 179 -1995 -1721 4111
7555D111k68n576J100M132Q384M906j108P734L107j404j3044n61Q722J20m006
$$ 4111 3843 -1733 -633 3499 11883 16789 15681 23415 26522 25118 12074 11513 20235 20355 16349
7540A6349P08k658n15J51j242L115L23n820j0357j418M845P736R236j040P011
$$ 16349 17057 14399 13884 14035 12793 15908 16231 10411 54 -1364 3481 11217 20453 19413 26424
7525B6424O674j187l667l194N990q084o755j1129n835K651N727q75M750k962L869
$$ 26424 33098 31911 28244 25050 31040 22956 16201 5072 -763 1888 7615 6740 11490 8528 12397
7510A2397O847k72k413n341j0796O657J789l637j320L261o88o699m145K430K241
$$ 12397 19244 18972 16559 11218 422 7079 8868 5231 3911 7172 6484 -215 -4360 -1930 311
7495C11M672K202R31m073p182n294J137M165J697M356M114J329r436m899Q611
$$ 311 4983 7185 8116 4043 -3139 -8433 -7296 -3131 -1434 2922 7036 8365 -1071 -5970 2641
7480B641R930M180k983j0227p573n283K422N51J46n946K748P197J1843R177o334
$$ 2641 12571 16751 13768 3541 -4032 -9315 -6893 -6342 -6196 -12142 -9394 -2197 9646 18823 12489
7465A2489l655K682L9L006Q82l293O31o645J889L077p33R407L772j23n749k057
$$ 12489 8834 11516 11555 14561 15443 12150 12781 6136 8025 11102 10369 19776 23548 23425 17676 15619
7449A5619N702n960n559R461k670K406O351m41o865j6039j235Q267L945q251O396
$$ 15619 21321 15361 9802 19263 16593 18999 25350 24909 18044 2005 770 9037 12982 4731 11127
7434A1127J2451Nk667N771K030j39J847n319N678O206K75q785m537l209O168k277
$$ 11127 23578 23583 20916 26687 28717 28578 30425 25106 30784 36990 37265 28480 23943 20734 26902 24625
7418B4625K857k703j0760j0543p161J050Q403P65N383K259p53K870j776j1366
$$ 24625 27482 24779 14019 3476 -3685 -2635 5768 6533 11916 14175 13422 16292 14516 3150
7404C150o831P922M544k181l172N916Q20k645M183m206O848K571q281O779n21
$$ 3150 -3681 4241 8785 6604 3432 9348 10168 7523 11706 7500 14348 16919 8638 15417 14896
7389A4896p661n430J412k447R097N288p625n878l663L810j351p45q355k428L763
$$ 14896 7235 1805 3217 770 9867 15155 7530 1652 -2011 1799 448 -297 -8652 -11080 -7317
7374g317L853M978R29K987O480k961K392N099m931l872L426Q429R412m947j5198
$$ -7317 -3464 1514 2443 5430 11910 8949 11341 16440 11509 7637 11063 19492 28904 23957 8759
7359H759k819J1148P654l266k132o818l260K784o074J296L947K726o672K579m315
$$ 8759 5940 17088 24742 21476 19344 12526 9266 12050 5976 7272 11219 13945 7273 9852 5537
7344E537m652k09j0949j384P317R635M591P06n791j315P881J618l092p545J806
$$ 5537 885 676 -10273 -11657 -4340 5295 9886 10592 4801 3486 11367 12985 9893 2348 4154
7329D154J691j005r53N601o038k870P478J021j1073n122j549m226m180J330O568
$$ 4154 5845 4840 3887 9488 3450 580 8058 9079 -1994 -7116 -8665 -12891 -17071 -15741 -9173
7314i173J2475N939k573p509Q925J0453l29k110j085k682m333k619l096o69q111
$$ -9173 3302 9241 6668 -841 8084 18537 18208 16098 15013 12331 7998 5379 2283 1614 -6497
7299f497j137Q961K746p50l626L140o43o908N921r41L287O448j591j143k712k371
$$ -6497 -7634 1327 4073 3323 -303 2837 2194 -4714 1207 266 3553 10001 8410 7267 4555 2184
7283B184j018Q282P59m658J0536K341j0211r043k961K819L323P124J186q68o571
$$ 2184 1166 9448 10207 5549 16085 18426 8215 -828 -3789 -970 2353 9477 10663 9795 3224
7268C224J759J633r946l992N853o10L078k859K147J888P416j286p23L34J940J99
$$ 3224 4983 6616 -3330 -7322 -1469 -2079 999 -1860 287 2175 9591 8305 7582 7916 9856 10055
7252A0055l265M39k32L209J0429p58j004p605o692j9Q886k548n336P420N426j47
$$ 10055 6790 7229 6997 10206 20635 19877 18873 11268 4576 4557 13443 10895 5559 12979 18405 18258
7236A8258m564k571J86n906o510j268N067J0194l465J512K114J869n807n515r933
$$ 18258 13694 11123 11309 5403 -1107 -2375 2692 12886 9421 10933 13047 14916 9109 3594 -6339
7221f339n611q65k154N949M188J4543k433j4451O349K389m802J398O552J09l278
$$ -6339 -11950 -12815 -14969 -9020 -4832 9711 7278 -7173 -824 1565 -3237 -1839 4713 4822 1544
7206A544P081r01o807k090j1104q124L918N993M44M968M78n477Q679L666k854
$$ 1544 8625 7724 917 -1173 -12277 -20401 -16483 -10490 -10046 -5078 -4600 -10077 -1398 2268 -586
7191e86J713O216m298K601N169L538p117j345Q313o170J647k027O478K497j3125
$$ -586 1127 7343 3045 5646 10815 14353 7236 5891 14204 8034 9681 7654 14132 16629 3504
7176C504K538r439l182k274k740K876Q355J4779Q396j04p531M029J591o262k412
$$ 3504 6042 -3397 -6579 -8853 -11593 -8717 -362 14417 22813 22709 15178 19207 20798 14536 12124
7161A2124O422k087k345K96K992l318j471n42p01k800j581n620J580j94k294m915
$$ 12124 18546 16459 14114 14410 17402 14084 12613 12071 11370 8570 6989 1369 2949 2755 461 -4454
7145d454N987K040M536R75j406M127r59r663k113J274K228J087L966l620p79J2609
$$ -4454 1533 3573 8109 9084 7678 11805 10846 1183 -930 344 2572 3659 7625 4005 3226 15835
7129A5835J052j3215j90j190K304Q108M664o132O31q730N023l590k11J2723P569
$$ 15835 16887 3672 3482 2292 4596 12704 17368 11236 11867 3137 8160 4570 4359 17082 24651
7114B4651q897j5326k142L335l165L977J350n825J977j489k149n964J0283K554
$$ 24651 15754 428 -1714 1621 -1544 2433 3783 -2042 -65 -1554 -3703 -9667 616 3170
7100C170j937J843M120j532q221m624n872M123O795n385o853M055O425M328O616
$$ 3170 1233 3076 7196 5664 -2557 -7181 -13053 -8930 -2135 -7520 -14373 -10318 -3893 435 7051
7085G051N859o251k985J302O763q445p115K318R477O485k565J732Q461j60j186
$$ 7051 12910 6659 3674 4976 11739 3294 -3821 -1503 7974 14459 11894 13626 22087 21927 20741
7070B0741K150j3548j3164L908P603o985r186J0899J005l944J899j084M392Jl212
$$ 20741 22891 9343 -3821 87 7690 705 -8481 2418 3423 -521 1378 294 4686 4687 1475
7055A475M546M020j5003l664J638M923N914M556J2606j613o782N73Q096N358p552
$$ 1475 6021 10041 -4962 -8626 -6988 -2065 3849 8405 21011 19398 12616 13189 21285 26643 19091
7040A9091p779p436J16K829M776L406J554p731J196j1235m166n506N444O529L003
$$ 19091 11312 3876 3992 6821 11597 15003 16557 8826 10022 -1213 -5379 -10885 -5441 1088 4091
7025D091R517M365j6877r024Q513R743K704j876Q63q102L87M113m532P082J737
$$ 4091 13608 17973 1096 -7928 585 10328 13032 11156 12019 3917 4304 8417 3885 10967 12704
7010A2704r32j360m169j147L4L380r016o390o2l635o193R70L570Q710J3218k962
$$ 12704 11772 10412 6243 5096 5130 8510 -506 -6896 -6958 -10593 -16786 -15816 -12246 -3536 9682 6720
6994F720l849n57k795O175J786j111p603K859J634J2112K616n726J807j0629r859
$$ 6720 2871 2314 -481 5694 7480 6369 -1234 1625 3259 15371 17987 12261 14068 3439 -6420
6979f420Q641L603Q79K971K565q873o990j287l54q64O295O889P556m502k154K404
$$ -6420 2221 5824 6703 9674 12239 3366 -3624 -4911 -5265 -6129 166 7055 14611 10109 7955 10359
6963A0359l619j0315j947O752J0437J78q375l799q66M386R97k702l393P014l101
$$ 10359 6740 -3575 -5522 1230 11667 11845 3470 -329 -1195 3191 4188 1486 -1907 5107 2006
6948B006j0039k796J5719Q179j880m065r400j1894k972J2661L345j2352Q104J586
$$ 2006 -8033 -10829 4890 13069 11189 7124 -2276 -14170 -17142 -4481 -1136 -13488 -5384 -3798
6934c798J169l3K4O244N37m968l089j0415N562J1512O919M120n168J864j040m007
$$ -3798 -2629 -2662 -2638 3606 4143 -825 -3914 -14329 -8767 2745 9664 13784 8616 10480 9440 5433
6918E433l567n453l276m919q78Q007N169l120m219n216N980O093o819J379L047
$$ 5433 1866 -3587 -6863 -11782 -12660 -4653 516 -2604 -6823 -12039 -6059 34 -6785 -5406 -2359
6903b359n000J92M827R619N325J760j029j645L189k602n235j535l483N212J2573
$$ -2359 -7359 -7167 -2340 7279 12604 14364 13335 11690 14879 12277 7042 5507 2024 7236 19809
6888A9809p723o225P40L556j583o657L86J6051m45q483o40R65L692l472l780m35
$$ 19809 12086 5861 6601 10157 8574 1917 2303 18354 17909 9426 8786 9751 13443 9971 6191 5756
6872E756p853m490k261P481L113K244o20J309J910n469N80l190j099J364K261
$$ 5756 -2097 -6587 -8848 -1367 1746 3990 3370 4679 6589 1120 1700 -1490 -2589 -1225 1036
6857A036j212q053N94P071J153p457l034j845K254M99j706J888L493J0485J024
$$ 1036 -176 -8229 -7635 -564 589 -6868 -9902 -11747 -9493 -8994 -10700 -8812 -5319 5166 6190
6842F190j0107M36O76n389q174K494P662o82p479k850J0386N660l070k133J0619
$$ 6190 -3917 -3481 -2805 -8194 -16368 -13874 -6212 -6894 -14373 -17223 -6837 -1177 -4247 -6380 4239
6827D239R70l436Q028N071q13O35L21k622l861m127m079J120k672j104L02j98
$$ 4239 5209 1773 9801 14872 14059 14694 15015 12393 8532 4405 326 1446 -1226 -2330 -2028 -2226
6811b226j858j061K488P630J163l458j296O937P820l225p995j799Q542j679j141
$$ -2226 -4084 -5145 -2657 4973 6136 2678 1382 8319 16139 12914 4919 3120 11662 9983 8842
6796H842n205K867M272m320r932q992r678P428R973O174J393K565j1092r14O854
$$ 8842 3637 6504 10776 6456 -3476 -12468 -22146 -14718 -4745 1429 2822 5387 -5705 -6619 235
6781B35M609J712L42l955p379N02j435K913L383L400P038m354j282l329m907l537
$$ 235 4844 6556 6898 2943 -4436 -3934 -5369 -2456 927 4327 11365 7011 5729 2400 -2507 -6044
6765f044P471j900j643q877m046k5M660p210J225k303N567N836K163O416O203
$$ -6044 1427 -473 -2116 -10993 -15039 -15064 -10404 -17614 -16389 -18692 -13125 -7289 -5126 1290 7493
6750G493N103n790L768o47l094n278K273M337L993q684q381K934Q54l001R223
$$ 7493 12596 6806 10574 9927 6833 1555 3828 8165 12158 3474 -4907 -1973 -1119 -4120 5103
6735E103L611o08j3856n750J521M464K026k757L80M813K230L342j380m287p473
$$ 5103 8714 8106 -5750 -11500 -9979 -5515 -3489 -6246 -5866 -1053 1177 4519 3139 -1148 -8621
6720h621R891J5338n038j1186p301Q660J0565l688P519O051K168l671l462r897
$$ -8621 1270 16608 11570 384 -6917 1743 12308 8620 16139 22190 24358 20687 17225 7328
6706G328r126o771n574O65P81L668L832l593n588q53N563J3785m13K254k459k008
$$ 7328 -1798 -8569 -14143 -13478 -12697 -9029 -5197 -8790 -14378 -15231 -9668 4117 3704 5958 3499 1491
6690A491L105m955o476k250J2107N119o977j0842J519K025M230R403L749K048
$$ 1491 4596 -359 -6835 -9085 3022 8141 1164 -9678 -8159 -6134 -1904 7499 11248 13296
6676A3296l834n335k633n932n159j100N632L972p671j883O936P847N170P537m067
$$ 13296 9462 4127 1494 -4438 -9597 -10697 -5065 -1093 -8764 -10647 -3711 4136 9306 16843 12776
6661A2776j242P88n313j4710j4596P195J1962M448o345j465L899L789n102N005
$$ 12776 11534 12322 7009 -7701 -22297 -15102 -3140 1308 -5037 -6502 -2603 1186 -3916 1089
6647A089M241R36P681j800m595L816J406k023l742M78P77r743j83O535n703L983
$$ 1089 5330 6266 13947 12147 7552 11368 12774 10751 7009 7487 8264 -1479 -1662 4873 -830 3153
6631C153L613O340k536j6489p540m500J202J1642R150N999M278n687o084k540
$$ 3153 6766 13106 10570 -5919 -13459 -17959 -16757 -5115 4035 10034 14312 8625 2541 1
6617AP32n100R28M482M386m982q451P545r1m668m350J3887R149m106J453N66o661
$$ 1 733 -4367 -3439 1043 5429 447 -8004 -459 -550 -5218 -9568 4319 13468 9362 10815 11381 4720
6600D720o370M150O47J2864Q144j6207j3933J51N354P562q885r017J245J505l15
$$ 4720 -1650 2500 3147 16011 24155 7948 -5985 -5834 -480 7082 -1803 -10820 -9575 -8070 -8385
6585h385k231J801J337n130N980J4458P20l079o957N291M988r244p618P373j789
$$ -8385 -10616 -8815 -7478 -12608 -6628 7830 8550 5471 -1486 3805 8793 -451 -8069 -696 -2485
6570b485l210O846m54o405K220O155L459L21O936J913N355K933j391l989l820
$$ -2485 -5695 1151 697 -5708 -3488 2667 6126 6447 13383 15296 20651 23584 22193 18204 14384
6555A4384n287q532k114J2660L1j8298L804R600N382j264j625l367o39r98j628
$$ 14384 9097 565 -1549 11111 11142 -7156 -3352 6248 11630 10366 8741 5374 4735 3737 2109
6540B109j215L268P623K524p800M18l196r379J649J5971J0418n512J007l938Q37
$$ 2109 894 4162 11785 14309 6509 6927 3731 -5648 -3999 11972 22390 16878 17885 13947 14784
6525A4784j2278j0853o96J5290L380M106J14m510l352j1956n279J1293M525q476
$$ 14784 2506 -8347 -9043 6247 9627 13733 13847 9337 5985 -5971 -11250 43 4568 -3908
6511c908m31j0664j512M943O431l812J129J4486p584j0216l974K100l963k933
$$ -3908 -4339 -15003 -16515 -11572 -5141 -8953 -7824 6662 -922 -11138 -15112 -13012 -16975 -19908
6497a9908Q14R129N029K478p408m488Q072N854N360o116n428k391m439M925O578
$$ -19908 -19094 -9965 -4936 -2458 -9866 -14354 -6282 -428 4932 -1184 -6612 -9003 -13442 -8517 -1939
6482a939M547k053J756m882M653l98J95q466j838J0546J963O810l651l276k95
$$ -1939 2608 555 2311 -2571 2082 1684 1879 -6587 -8425 2121 4084 10894 7243 3967 3672
6467C672k680R30J507o616R34l156l667L429K867K320K74J644p692K19O371R60
$$ 3672 992 1922 3429 -3187 -2253 -5409 -9076 -5647 -2780 -460 -186 1458 -6234 -6015 356 1316
6451A316J709J094k605r370j223k605k208k271q81N594P868P785l918j0182O19
$$ 1316 3025 4119 1514 -7856 -9079 -11684 -13892 -16163 -17044 -11450 -3582 4203 285 -9897 -9278
6436i278J409O323R299n509n671o866k264J683L576m798l887O038j247O467M2
$$ -9278 -7869 -1546 7753 2244 -3427 -10293 -12557 -10874 -7298 -12096 -15983 -9945 -11192 -4725 -4683
6421d683J93m306J311L567R8L454L825r964q964J812P256j550j559l007j774Q561
$$ -4683 -4490 -8796 -7485 -3918 -3820 -366 3459 -6505 -15469 -13657 -6401 -7951 -9510 -12517 -14291 -5730
6405e730k913k566j612L894K340O745K633L091P409k457j765p319m475J1295J2724
$$ -5730 -8643 -11209 -12821 -8927 -6587 158 2791 5882 13291 10834 9069 1750 -2725 8570 21294
6390B1294m504m789m9j1566M271M16n790q184O54K206j180P742K26K802m07N051
$$ 21294 16790 12001 11952 386 4657 5073 -717 -8901 -8247 -6041 -7221 521 747 3549 3142 8193
6374H193P706l677L219J523m482q419o056M541J95j0538o021j514N668K229n801
$$ 8193 15899 12222 15441 16964 12482 4063 -1993 2548 2743 -7795 -13816 -15330 -9662 -7433 -13234
6359a3234Q07J343M75M052r550l270O151J0825l29k566R081O711L061R41l191
$$ -13234 -12427 -11084 -10609 -6557 -16107 -19377 -13226 -2401 -2730 -5296 3785 10496 13557 14498 11307
6344A1307K030j003o289k008l640m041o63m759o390l603Mk48L729O485K661O439
$$ 11307 13337 12334 6045 4037 397 -3644 -4307 -9066 -15456 -19059 -19055 -19303 -15574 -9089 -6428 11
6328A1Q52j5071o162J450Q883K476K855k528K164N582K441j171k689N281m481
$$ 11 863 -14208 -20370 -18920 -10037 -7561 -4706 -7234 -5070 512 2953 1782 -907 4374 -107
6313a07j900J266j0700j44P967N700K057J3550O469l611J215q01l291p644J955
$$ -107 -2007 -741 -11441 -11585 -3618 2082 4139 17689 24158 20547 21762 20961 17670 10026 11981
6298A1981n584p678o900l686N213Q266k369m582M02L339n859n285M84M526l450
$$ 11981 6397 -1281 -8181 -11867 -6654 1612 -757 -5339 -4937 -1598 -7457 -12742 -12258 -7732 -11182
6283a1182Q786J2678j211r826K717k151m871m027L696L629n063j133k439j78P147
$$ -11182 -2396 10282 9071 -755 1962 -189 -5060 -9087 -5391 -1762 -6825 -7958 -10397 -10575 -3428
6268c428J6246L307r280o457q890j0073J130N176O026n437P86J450O472L456n557
$$ -3428 12818 16125 6845 388 -8502 -18575 -17445 -12269 -6243 -11680 -10894 -9444 -2972 484 -5073
6253e073m118o16m29o092M339R294L475r360j439m99Q335N846k456N77J603j11
$$ -5073 -9191 -9807 -10236 -16328 -11989 -2695 780 -8580 -10019 -10518 -2183 3663 1207 1784 3387 3276
6237C276P405K221q030l371l724J0282O994J3462R126j4045j0301L391n290m369
$$ 3276 10681 12902 4872 1501 -2223 8059 15053 28515 37641 23596 13295 16686 11396 7027
6223G027l98n141K243m956k800N205L483r188N475N534o696m744O820K355K548
$$ 7027 6629 1488 3731 -1225 -4025 1180 4663 -4525 950 6484 -212 -4956 1864 4219 6767
6208F767l475n510n51J947R641J016l390O511j263K081l140r014R49p4l967o21
$$ 6767 3292 -2218 -2769 -822 8819 9835 6445 12956 11693 13774 10634 1620 2569 2495 -1472 -2093
6192b093m464n179L548J2419m53k522j329q45n453j714l028L080m909M9O61r65
$$ -2093 -6557 -11736 -8188 4231 3778 1256 -73 -918 -6371 -8085 -11113 -8033 -12942 -12893 -12232 -13197
6176a3197J37P028M339P907l555P263j0035p029n973L253R942l442j791n845p251
$$ -13197 -13060 -6032 -1693 6214 2659 9922 -113 -7142 -13115 -9862 80 -3362 -5153 -10998 -18249
6161a8249L24J2398P579l469l725K072K837L621M346j869o869l556l97N041J371
$$ -18249 -17925 -5527 2052 -1417 -5142 -3070 -233 3388 7734 5865 -1004 -4560 -4957 84 1455
6146A455J752O155K385r974N984O417j0573j6149R063N445o98p439j864k101l980
$$ 1455 3207 9362 11747 1773 7757 14174 3601 -12548 -3485 1960 1262 -6177 -8041 -10142 -14122
6131a4122R31k076j276J1469q63o445k54R84K225R952O042n216q242J582L72l825
$$ -14122 -13191 -15267 -16543 -5074 -5937 -12382 -12636 -11652 -9427 525 6567 1351 -6891 -5309 -4937 -8762
6115h762p8M747L854m415j117P791J704l197o324O49k907k859O902Q521l632K411
$$ -8762 -8840 -4093 -239 -4654 -5771 2020 3724 527 -5797 -5148 -8055 -10914 -4012 4509 877 3288
6099C288P032p01p914p881q05j967r39k939m65l893R952M583l098J897m52k404
$$ 3288 10320 9619 1705 -6176 -6981 -8948 -9887 -12826 -13291 -17184 -7232 -2649 -5747 -3850 -4302 -6706
6083f706K46N26P11l52J831J2451K070j18l131o968j2248L556O316J295m346L703
$$ -6706 -6460 -5934 -5223 -5575 -3744 8707 10777 10659 7528 560 -11688 -8132 -1816 -521 -4867 -1164
6067a164P473N71j333l792P533K520p373l427j016L034o405L519j773n24K880
$$ -1164 6309 6880 5547 1755 9288 11808 4435 1008 -8 3026 -3379 140 -1633 -2157 723
6052G23J971r02j525o187j2344L263L15J618O088r681k10N821M231Q649l872p126
$$ 723 2694 1792 267 -5920 -18264 -15001 -14686 -13068 -6980 -16661 -16871 -11050 -6819 1830 -2042 -9168
6036i168J201J809n718j0540l17L65P422Q73j194M641Q92L350P752Q469l297o359
$$ -9168 -7967 -6158 -11876 -22416 -22733 -22368 -14946 -14073 -15267 -10626 -9734 -6384 1368 9837 6540 181
6020A81j0669pP499J5837K662m071r935r485J0772N157O821j1183j5910j482K186
$$ 181 -10488 -10495 -2996 12841 15503 11432 1497 -7988 2784 7941 14762 3579 -12331 -13813 -11627
6005a1627J898j156N249O863r278n155p842M9J2359J0511N858m691j2186J855
$$ -11627 -9729 -10885 -5636 1227 -8051 -13206 -21048 -20999 -8640 1871 7729 3038 -9148 -7293
5991g293m25N361M69p9j0307j275J2461j606J107N322Q638k924j4953k76K878
$$ -7293 -7718 -2357 -1888 -1967 -12274 -13549 -1088 -2694 -1587 3735 12373 9449 -5504 -5780 -2902
5976b902m517p18P796M541M270M842n516j0394p497P661k89M119n496L628R07
$$ -2902 -7419 -8137 -341 4200 8470 13312 7796 -2598 -10095 -2434 -2723 1396 -4100 -472 435
5961D35m556m754j11J649K471O389J1016J149m349p376q975J9L312r98L4R37o47
$$ 435 -4121 -8875 -8986 -7337 -4866 1523 12539 13688 9339 1963 -7012 -6993 -3681 -4679 -4645 -3708 -4355
5944d355k988K402Q48J696L702N403l397M012P034r240m993k954j203l958J164
$$ -4355 -7343 -4941 -4093 -2397 1305 6708 3311 7323 14357 5117 124 -2830 -4033 -7991 -6827
5929f827J512l352J547j473Q225M88m1L005O87l855l641l706m180j419K28k35
$$ -6827 -5315 -8667 -7120 -8593 -368 120 79 3084 3771 -84 -3725 -7431 -11611 -13030 -12802 -13037
5913a3037J366P88L729R16N638O435L245m698q539j686N698m425l515J270o764
$$ -13037 -11671 -10883 -7154 -6238 -600 5835 9080 4382 -4157 -5843 -145 -4570 -8085 -6815 -13579
5898a3579P73O77M599J0675J399m034r815k975P282J347p639n578Q807Q538M842
$$ -13579 -12806 -12129 -7530 3145 4544 510 -9305 -12280 -4998 -3651 -11290 -16868 -8061 477 5319
5883E319p990j518K79q5q586q37K830q39N810Q750n605O014J061R76j94n703j4875
$$ 5319 -2671 -4189 -3910 -3995 -12581 -13418 -10588 -11427 -5617 3133 -2472 3542 4603 5579 5385 -318 -15193
5866a5193k540k216J636P945k099M409M533M756p27r685m274J624L01J269K374
$$ -15193 -17733 -19949 -18313 -10368 -12467 -8058 -3525 1231 504 -9181 -13455 -11831 -11530 -10261 -7887
5851g887l886r01K692M722r62K399O41p087m751K413l479J32K915O530L069P362
$$ -7887 -11773 -12674 -9982 -5260 -6222 -3823 -3182 -10269 -15020 -12607 -16086 -15954 -13039 -6509 -3440 3922
5835C922J1710j008o695k477N242n367j2392p881N428O539J994L826m621j701
$$ 3922 15632 14624 7929 5452 10694 5327 -7065 -14946 -9518 -2979 -985 2841 -1780 -3481
5821c481P783J5317k857r583p844m396K715L201P706L736j1585p451R479J61j819
$$ -3481 4302 19619 16762 7179 -665 -5061 -2346 855 8561 12297 712 -6739 2740 2901 1082
5806A082p594j0321Q940j321J242M136J205K313L427q832O366P519J625J056j982
$$ 1082 -6512 -16833 -7893 -9214 -7972 -3836 -2631 -318 3109 -5723 643 8162 9787 10843 8861
5791H861j200n697n469o141q066O094M90J718N929O992n396j0239r504K31O886
$$ 8861 7661 1964 -3505 -9646 -17712 -11618 -11128 -9410 -3481 3511 -1885 -12124 -21628 -21397 -14511
5776a4511K498Q443L589L653k246j282r25p331j936L186M069J029j622j635j1057
$$ -14511 -12013 -3570 19 3672 1426 144 -781 -8112 -10048 -6862 -2793 -1764 -3386 -5021 -16078
5761a6078q151M655K369J2287N307q197L275N270J330m798k198l360L995N733
$$ -16078 -24229 -19574 -17205 -4918 389 -7808 -4533 737 2067 -2731 -4929 -8289 -4294 1439
5747A439P286j0925q014M767J0053R394K242k665j707l486j3998j1497k455l08
$$ 1439 8725 -2200 -10214 -5447 4606 14000 16242 13577 11870 8384 -5614 -17111 -19566 -19874
5733a9874q374P867P144N15l302N986J0966P33M12N656j781j8471k226M680O61
$$ -19874 -28248 -20381 -13237 -12722 -16024 -10038 928 1661 2073 7729 5948 -12523 -14749 -10069 -9408
5718i408N136K813l476l751k025R94M325l811j2267M244J0442P325J4390K560
$$ -9408 -4272 -1459 -4935 -8686 -10711 -9717 -5392 -9203 -21470 -17226 -6784 541 14931 17491
5704A7491n730r279L810O017o328j5213K252l56j889r566l127m734k986k371O287
$$ 17491 11761 2482 6292 12309 5981 -9232 -6980 -7336 -9225 -18791 -21918 -26652 -29638 -32009 -25722
5689b5722Q895P190K924R26o146Q197L828l7Q106m064j790L327m303j3575p759
$$ -25722 -16827 -9637 -6713 -5787 -11933 -3736 92 55 8161 4097 2307 5634 1331 -12244 -20003
5674b0003K31Q121M82L570J1492m65j4316N915J2839k004r512n909K943J801l168
$$ -20003 -19772 -11651 -11169 -7599 3893 3428 -10888 -4973 7866 5862 -3650 -9559 -6616 -4815 -7983
5659g983l268P18P630j390M640J4646M034Q1j0796j3409J612J605O918o149j812
$$ -7983 -11251 -10533 -2903 -4293 347 14993 19027 19108 8312 -5097 -3485 -1880 5038 -1111 -2923
5644b923K083j0124k944N546N502m450n141q48k945J3843P35k179L038k347k955
$$ -2923 -840 -10964 -13908 -8362 -2860 -7310 -12451 -13299 -16244 -2401 -1666 -3845 -807 -3154 -6109
5629f109l351P636J388o363j908J067l967j3371K968J925N354M104p49K045q7
$$ -6109 -9460 -1824 -436 -6799 -8707 -7640 -11607 -24978 -22010 -20085 -14731 -10627 -11376 -9331 -9418
5614i418k650R656M018j3999n325J8943Q419m848r190k57j987N27j649J048K406
$$ -9418 -12068 -2412 1606 -12393 -17718 1225 9644 4796 -4394 -4651 -6638 -6111 -7760 -6712 -4306
5599d306K897J548j1218O703Q973N28q749l437L335J490p731k53K340N904j193
$$ -4306 -1409 139 -11079 -4376 4597 5125 -3624 -7061 -3726 -2236 -9967 -10220 -7880 -1976 -3169
5584c169K637M31l733k698P320M642n709l521L752R05n513k579Q194L557r988
$$ -3169 -532 -101 -3834 -6532 788 5430 -279 -3800 -48 857 -4656 -7235 959 4516 -5472
5569e472j1311M561o83M173J2496J4966j2683j6649R403O237j388o93j4046j83
$$ -5472 -16783 -12222 -12905 -8732 3764 18730 6047 -10602 -1199 5038 3650 2957 -11089 -11272
5555a1272P88P958J4088K26n651j2832j349j306R981p902n292N927M809J3704
$$ -11272 -10484 -2526 11562 11788 6137 -6695 -8044 -9350 631 -7271 -12563 -6636 -1827 11877
5541A1877P77j4350m799k837P373j3101j677N770Q664k337Q3L814n416r626N231
$$ 11877 12654 -1696 -6495 -9332 -1959 -15060 -16737 -10967 -2303 -4640 -4557 -743 -6159 -15785 -10554
5526a0554R21K925L232m252p037M42N301m95q608o975J0465J120Q340q88k366
$$ -10554 -9633 -6708 -3476 -7728 -14765 -14323 -9022 -9517 -18125 -25100 -14635 -13515 -5175 -6063 -8429
5511h429R74l615n401k010k620k896L841J1191R862q557p346Q911K945j0402J749
$$ -8429 -7455 -11070 -16471 -18481 -21101 -23997 -20156 -8965 897 -7660 -15006 -6095 -3150 -13552 -11803
5496a1803J1153R098o460j0148o803J2482Q628p988q975n102J057J1J1250M053
$$ -11803 -650 8448 1988 -8160 -14963 -2481 6147 -1841 -10816 -15918 -14861 -14850 -3600 453
5482D53K782Q267m560l105m92q058n21K674p885k979m158O007P268L140n38m145
$$ 453 3235 11502 6942 3837 3345 -4713 -5234 -2560 -10445 -13424 -17582 -11575 -4307 -1167 -1705 -5850
5466e850M103J0667Q519n591j2679R56q61o282l669o400k23J3290l146J637j858
$$ -5850 -1747 8920 17439 11848 -831 125 -736 -7018 -10687 -17087 -17310 -4020 -7166 -5529 -7387
5451g387n695J657L982L302P113j45o426r853k027J783m305n893J415J1697K986
$$ -7387 -13082 -11425 -7443 -4141 2972 2827 -3599 -13452 -15479 -13696 -18001 -23894 -22479 -10782 -7796
5436g796o426k958M99J343J4704O174N450q93o073J511L607k74p575N332L40q43
$$ -7796 -14222 -17180 -16681 -15338 -634 5540 10990 10097 4024 5535 9142 8868 1293 6625 6965 6122
5420F122O262o289m551o853j71q693J948Q501p071k41p07K130M901K136k419N724
$$ 6122 12384 6095 1544 -5309 -5480 -14173 -12225 -3724 -10795 -11036 -11743 -9613 -4712 -2576 -4995 729
5404G29J1074O254p859j0158n304L61J0468k115l044n628p80P360O065r726r709
$$ 729 11803 18057 10198 40 -5264 -4903 5565 3450 406 -5222 -6002 1358 7423 -2303 -12012
5389a2012p096M89P125Q128L582J275k359m444K671k479M095k373q05m683O911
$$ -12012 -19108 -18619 -11494 -3366 216 1491 -868 -5312 -2641 -5120 -1025 -3398 -4203 -8886 -1975
5374a975k777j0668p718L458L211N138K891O04P743j203J389J0004k068N223M045
$$ -1975 -4752 -15420 -23138 -19680 -16469 -11331 -8440 -7836 -93 -1296 93 10097 8029 13252 17297
5359A7297r403j718l659j2417r58O396O278O851m703n935j1350k990Q781J3938
$$ 17297 7894 6176 2517 -9900 -10858 -4462 1816 8667 3964 -1971 -13321 -16311 -7530 6408
5345F408N049l827q794j838K729r79J235M414j158k824M911q648n486j223N369
$$ 6408 11457 7630 -1164 -3002 -273 -1252 -17 4397 3239 415 5326 -3322 -8808 -10031 -4662
5330d662Q509J018j3245P321N221L897q688r479l001K102q574r10N877K875J740
$$ -4662 3847 4865 -8380 -1059 4162 8059 -629 -10108 -13109 -11007 -19581 -20491 -14614 -11739 -9999
5315i999K100Q38N639J987M818L06L454j743m406j1585N237M104k712N874M862
$$ -9999 -7899 -7061 -1422 565 5383 5689 9143 7400 2994 -8591 -3354 750 -1962 3912 8774
5300H774m789m200q211N759P47J825k326k677J2000m784j2937j594O638L449K786
$$ 8774 3985 -215 -8426 -2667 -1920 -95 -2421 -5098 6902 2118 -10819 -12413 -5775 -2326 460
5285D60n740r19K231k788l503K23P692Q50j0441p743Q265J2012L682P85Q44l030
$$ 460 -5280 -6199 -3968 -6756 -10259 -10036 -2344 -1494 -11935 -19678 -11413 599 4281 5066 5910 2880
5269B880K705N59R1K291k217j1178j1691k713R04K786L573R606k397K587L923
$$ 2880 5585 6144 6235 8526 6309 -4869 -16560 -19273 -18369 -15583 -12010 -2404 -4801 -2214 1709
5254A709L460O422M963q999r540m468m563R629N21l379n3q52M938m744m777o126
$$ 1709 5169 11591 16554 7555 -1985 -6453 -11016 -1387 -866 -4245 -4298 -5150 -212 -4956 -9733 -15859
5238a5859M409O814O992L960o223j615N757p013k047n35L088K657M655P855m216
$$ -15859 -11450 -4636 2356 6316 93 -1522 4235 -2778 -4825 -5360 -2272 385 5040 12895 8679
5223H679n483n78m304J414N669k63j78l567j903K895O520k719o066j443k420L016
$$ 8679 3196 2618 -1686 -272 5397 5134 4956 1389 -514 2381 8901 6182 116 -1327 -3747 -731
5207g31k409K276Q125j07j313J207l98m749l744m201k984M83K567p60Q11q228
$$ -731 -3140 -864 7261 7154 5841 7048 6650 1901 -1843 -6044 -9028 -8545 -5978 -6738 -5927 -14155
5191a4155q643J0640O612n443l73L726j0138p02Q23n812k00J2097P509l613j434
$$ -14155 -22798 -12158 -5546 -10989 -11362 -7636 -17774 -18476 -17653 -23465 -23665 -11568 -4059 -7672 -9106
5176i106m573M423L941P075J0442L050r257o646K670o149mK491J519Q898M532
$$ -9106 -13679 -9256 -5315 1760 12202 15252 5995 -651 2019 -4130 -4134 -1643 -124 8774 13306
5161A3306k570l040L717n110m913p540p885j1473m373P231J1651K203o653K975
$$ 13306 10736 7696 11413 6303 1390 -6150 -14035 -25508 -29881 -22650 -10999 -8796 -15449 -12474
5147a2474L073O066r88p72l329j39N135k349k468k962j13J035o523M522R328j143
$$ -12474 -9401 -3335 -4323 -5095 -8424 -8563 -3428 -5777 -8245 -11207 -11320 -10285 -16808 -12286 -2958 -4101
5131d101j3671j4456J637J2917N454l98P37R238N992k083L295K498j3501p806
$$ -4101 -17772 -32228 -30591 -17674 -12220 -12618 -11881 -2643 3349 1266 4561 7059 -6442 -14248
5117a4248O3j79J489p717m4M371J814m598Q087R408m82J293n502p032m163J21
$$ -14248 -14185 -14364 -12875 -20592 -20636 -16265 -14451 -19049 -10962 -1554 -2036 -743 -6245 -13277 -17440 -17319
5101a7319J0364J832k391Q436R732q80r358K535J2331m631K433o597m277j777
$$ -17319 -6955 -5123 -7514 922 10654 9774 416 2951 15282 10651 13084 6487 2210 433
5087D33L546J510m553p019L417J2135K09m659l357K652N004n442k708l813n493
$$ 433 3979 5489 936 -6083 -2666 9469 9678 5019 1662 4314 9318 3876 1168 -2645 -8138
5072h138k318j757R510J3091J1023r042j5521J43R465r280J951L904j1835o366
$$ -8138 -10456 -12213 -2703 10388 21411 12369 -3152 -3009 6456 -2824 -873 3031 -8804 -15170
5058a5170K915N432M811M345J035r214q183J210O248Q796O013J020j2450r558
$$ -15170 -12255 -6823 -2012 2333 3368 -5846 -14029 -12819 -6571 2225 8238 9258 -3192 -12750
5044a2750M999Q165K291r901q45j094N818M326Q10L598J922o454N80n212n855
$$ -12750 -7751 414 2705 -7196 -8041 -9135 -3317 1009 1819 5417 7339 885 1465 -3747 -9602
5029i602k982j545k287q76L109J903L050J2923K507m380n070o709n678J026M523
$$ -9602 -12584 -14129 -16416 -17292 -14183 -12280 -9230 3693 6200 1820 -3250 -9959 -15637 -14611 -10088
5014a0088J1483J413r223M478N079Q410p915n216r23m745J734J176p420l4l597
$$ -10088 1395 2808 -6415 -1937 3142 11552 3637 -1579 -2502 -7247 -5513 -4337 -11757 -11791 -15388
4999a5388M108j30J905p941O623O137m278o61k2n098L181O788L440o568l058o366
$$ -15388 -11280 -11410 -9505 -17446 -10823 -4686 -8964 -9625 -9647 -14745 -11564 -4776 -1336 -7904 -10962 -17328
4983a7328M988O929L841J569j551N271n296o210k484L952n28M74K397K464r385
$$ -17328 -12340 -5411 -1570 -1 -1552 3719 -1577 -7787 -10271 -6319 -6847 -6373 -3976 -1512 -10897
4968a0897j0120M098N061L83j250O6Q607J594n211J712M732K871K22o243q259
$$ -10897 -21017 -16919 -11858 -11475 -12725 -12659 -4052 -2458 -7669 -5957 -1225 1646 1868 -4375 -12634
4953a2634L639l857N871K171k96r901m450p58Q291O893O272m192p998j524N476
$$ -12634 -8995 -12852 -6981 -4810 -5106 -15007 -19457 -20215 -11924 -5031 1241 -2951 -10949 -12473 -6997
4938f997J941n555J487J1898N887l801J059O78j057L281n534n077J318j835j574
$$ -6997 -5056 -10611 -9124 2774 8661 4860 5919 6597 5540 8821 3287 -1790 -472 -2307 -3881
4923c881q646j494M294L535o012K589O830P089O44N775N532j1955q049J1075J741
$$ -3881 -12527 -14021 -9727 -6192 -12204 -9615 -2785 4304 4948 10723 16255 4300 -3749 7326 9067
4908I067j917J939k731M308K955j774j3743r932n031L437M959o158J247K958r35
$$ 9067 7150 9089 6358 10666 13621 11847 -1896 -11828 -16859 -13422 -8463 -14621 -13374 -10416 -11351
4893a1351J1498k113p323l226P096Q921O682l311j6289k270Q949m971n078O005
$$ -11351 147 -1966 -9289 -12515 -5419 3502 10184 6873 -9416 -11686 -2737 -7708 -12786 -6781
4879f781r855m221Q867J620P772p792m886O710P58Q115j527m389N557J6136K650
$$ -6781 -16636 -20857 -11990 -10370 -2598 -10390 -15276 -8566 -7808 307 -1220 -5609 -52 16084 18734
4864A8734J148p061r025j03L566l326N224N786n282p672j4967q121n05K517N466
$$ 18734 19882 12821 3796 3693 7259 3933 9157 14943 9661 1989 -12978 -21099 -21604 -19087 -13621
4849a3621R328J593n340j3641p334J8245L415k477J1456L701m655N307J73m59
$$ -13621 -4293 -2700 -8040 -21681 -29015 -10770 -7355 -9832 1624 5325 670 5977 6150 5691
4835E691Q709p97r800j864J981L855K914p682p701K063J3343J805N167P806p200
$$ 5691 14400 13603 3803 1939 3920 7775 10689 3007 -4694 -2631 10712 12517 17684 25490 18290
4820A8290l568L714o457p737J386J994m510q324m407N279K831P59K462r75m694
$$ 18290 14722 18436 11979 4242 5628 7622 3112 -5212 -9619 -4340 -1509 -750 1712 737 -3957
4805c957j1160j347O852m753Q514R186j058l193M455L689L496K592k333J859J159
$$ -3957 -15117 -16464 -9612 -14365 -5851 3335 2277 -916 3539 7228 10724 13316 10983 12842 14001
4790A4001n668J167j003k497j324n563o382k417J122O842L368j217j340j473J395
$$ 14001 8333 9500 8497 6000 4676 -887 -7269 -9686 -8564 -1722 1646 429 -911 -2384 -989
4775i89p36k772k764J210J372P507q58O501n773n297n678K80M587o659j545J1032
$$ -989 -1725 -4497 -7261 -6051 -4679 2828 1970 8471 2698 -2599 -8277 -7997 -3410 -10069 -11614 -582
4759e82O218j225l55m595R66R150m718k525k652n881k640j077L260K264o29l569
$$ -582 5636 4411 4056 -539 427 9577 4859 2334 -318 -6199 -8839 -9916 -6656 -4392 -5021 -8590
4743h590L777N191m729k981p154j108K649Q216N811j2738r746P360l3K84N640
$$ -8590 -4813 378 -4351 -7332 -14486 -15594 -12945 -4729 1082 -11656 -21402 -14042 -14075 -13791 -8151
4728h151O491j629Q61N84n872M43O043N367j124o357J5L299M148o48L157n050
$$ -8151 -1660 -3289 -2428 -1844 -7716 -7273 -1230 4137 3013 -3344 -3329 -30 4118 3470 6627 1577
4712A577k478l042l106k83N279Q98n854P233o884q884r765Q321J0449k848j0986
$$ 1577 -901 -3943 -7049 -7332 -2053 -1155 -7009 224 -6660 -15544 -25309 -16988 -6539 -9387 -20373
4697b0373O193J3965N248o935j05R989m75n708L288l012r995K908j0160n276Q356
$$ -20373 -14180 -215 5033 -1902 -2007 7982 7507 1799 5087 2075 -7920 -5012 -15172 -20448 -12092
4682a2092J4095o890q567R221J3553P043o931l017N802m223n427J742q958j5109
$$ -12092 2003 -4887 -13454 -4233 9320 16363 9432 6415 12217 7994 2567 4309 -4649 -19758
4668a9758l100K049M761l224N703j793O585l199m783O882R02l458k560O417l369
$$ -19758 -22858 -20809 -16048 -19272 -13569 -15362 -8777 -11976 -16759 -9877 -8975 -12433 -14993 -8576 -11945
4653a1945o575P221J1826O405j2890j543o722O242J1394P033q569j1945n087L884
$$ -11945 -18520 -11299 527 6932 -5958 -7501 -14223 -7981 3413 10446 1877 -10068 -15155 -11271
4639a1271O851N581j911q129J829n144j774l097k876M487P917j0615p250k440
$$ -11271 -4420 1161 -750 -8879 -7050 -12194 -13968 -17065 -19941 -15454 -7537 -18152 -25402 -27842
4625b7842K925J0205j401R526j388O065m4n319o560J270N512R125J190k211q07
$$ -27842 -24917 -14712 -16113 -6587 -7975 -1910 -1954 -7273 -13833 -12563 -7051 2074 3264 1053 246
4610B46j1377K577J536l623l847M550J904l898q299j339R206p69R87j689L760
$$ 246 -11131 -8554 -7018 -10641 -14488 -9938 -8034 -11932 -20231 -21570 -12364 -13133 -12146 -13835 -10075
4595a0075J821K126K391L695R869O90k910p066k521j524L848K924j144m522L43
$$ -10075 -8254 -6128 -3737 -42 9827 10517 7607 541 -1980 -3504 344 3268 2124 -2398 -2055
4580b055P181l217J406J009k430l373J669N903Q879k738k603J670j2082k446K850
$$ -2055 5126 1909 3315 4324 1894 -1479 190 6093 14972 12234 9631 11301 -781 -3227 -377
4565c77m72L590n179L656K820L540m913l649L586j207j986L443J694k557K289
$$ -377 -849 2741 -2438 1218 4038 7578 2665 -984 2602 1395 -591 2852 4546 1989 4278
4550D278m687k991k48m406q87K045L372N905k005k436J0177N328k047O647q174
$$ 4278 -409 -3400 -3648 -8054 -8941 -6896 -3524 2381 376 -2060 8117 13445 11398 18045 9871
4535I871j1097r183M211k963k133R228R58l700l216m46l051J030k34O897O1q091
$$ 9871 -1226 -10409 -6198 -9161 -11294 -2066 -1108 -4808 -8024 -8470 -11521 -10491 -10725 -3828 -3767 -11858
4519a1858Q064L637j27n641M638J0004k370p431k374J551L543K054k290n058m248
$$ -11858 -3794 -157 -284 -5925 -1287 8717 6347 -1084 -3458 -1907 1636 3690 1400 -3658 -7906
4504g906O522j119l155j46N611n852R92j120N10L266M476N32j395J446K651M88
$$ -7906 -1384 -2503 -5658 -5804 -193 -6045 -5053 -6173 -5663 -2397 2079 2611 1216 2662 5313 5801
4488E801m492M97m217j985j1810k43J473K895O282q259J054J993J88M666J2934
$$ 5801 1309 1806 -2411 -4396 -16206 -16449 -14976 -12081 -5799 -14058 -13004 -11011 -10823 -6157 6777
4473F777O37j0562j699N677N452O400q847j989K223o060o569P836K538j09n44
$$ 6777 7414 -3148 -4847 830 6282 12682 3835 1846 4069 -1991 -8560 -724 1814 1705 1161
4458A161m666n881o264L603N922o750o905K553J3402j351m091P485n277M939L847
$$ 1161 -3505 -9386 -15650 -12047 -6125 -12875 -19780 -17227 -3825 -5176 -9267 -1782 -7059 -2120 1727
4443A727q063L742M164M334m924o447J277l913j1258P964J3680J0629n41j1597
$$ 1727 -6336 -2594 1570 5904 980 -5467 -4190 -8103 -19361 -11397 2283 12912 12371 774
4429G74q805P876J773m746k220K172K086M91J676k167O96l143n62L692k979Q52
$$ 774 -8031 -155 1618 -3128 -5348 -3176 -1090 -599 1077 -1090 -394 -3537 -4099 -407 -3386 -2534
4413b534j645j930K294m649j0905M879N202J0426j446q828p391L333O052k928
$$ -2534 -4179 -6109 -3815 -8464 -19369 -14490 -9288 1138 -308 -9136 -16527 -13194 -7142 -10070
4399a0070l218J938j632k644R323J4483J520l473J066L846Q840q344j0834J245
$$ -10070 -13288 -11350 -12982 -15626 -6303 8180 9700 6227 7293 11139 19979 11635 801 2046
4385B046K738n015O183K882l811m033K747p246p572n323R700N6k135K993J1799
$$ 2046 4784 -231 5952 8834 5023 990 3737 -3509 -11081 -16404 -6704 -6648 -8783 -5790 6009
4370F009J724m82M190k880k996o184j5235N379K558l085k142M373M019J00q284
$$ 6009 7733 7251 11441 8561 5565 -619 -15854 -10475 -7917 -11002 -13144 -8771 -4752 -4652 -12936
4355a2936o044M272K249P78k250J026K804Q575R75O36p165o463O35K776j674J599
$$ -12936 -18980 -14708 -12459 -11681 -13931 -12905 -10101 -1526 -551 85 -7080 -13543 -12908 -10132 -11806 -10207
4339a0207K69J926L626o837j783O464j815o102p924P290R106r92q107m766P34
$$ -10207 -9938 -8012 -4386 -11223 -13006 -6542 -8357 -14459 -22383 -15093 -5987 -6979 -15086 -19852 -19118
4324a9118P858O514J487r67l91j119r83P273J456p501n020R109m70p337l808l330
$$ -19118 -11260 -4746 -3259 -4226 -4617 -5736 -6719 554 2010 -5491 -10511 -1402 -1872 -9209 -13017 -16347
4308a6347K114k35R11M415N718p41j47n324l875L980J1801Q369l446j455j2343
$$ -16347 -14233 -14468 -13557 -9142 -3424 -4165 -4312 -9636 -13511 -9531 2270 10639 7193 5738 -6605
4293f605o250O206J1694k182q449l085m83K89P408O30k362J572L546n22K286L776
$$ -6605 -12855 -6649 5045 2863 -5586 -8671 -9154 -8865 -1457 -827 -3189 -1617 1929 1407 3693 7469
4277G469q959J614K432o198o891N234K940N716P476l174m779k763p735l338J0307
$$ 7469 -1490 124 2556 -3642 -10533 -5299 -2359 3357 10833 7659 2880 117 -7618 -10956 -649
4262f49R840m393p911l014J6889K290L01r447j4544K994Q751O575M501j887L45
$$ -649 9191 4798 -3113 -6127 10762 13052 13353 3906 -10638 -7644 1107 7682 12183 10296 10641
4247A0641m435n779L68Q327K353n753J973j4371p876p188J659K810N946O264k193
$$ 10641 6206 427 795 9122 11475 5722 7695 -6676 -14552 -21740 -20081 -17271 -11325 -5061 -7254
4232g254o091j429l85m400r970J04J522J5413J4732j0543j2044j916P148J595
$$ -7254 -13345 -14774 -15159 -19559 -29529 -29425 -27903 -12490 2242 -8301 -20345 -22261 -15113 -13518
4218a3518l760K461N030q592J0694P272j498O091O384L80j4161n432M996N134
$$ -13518 -17278 -14817 -9787 -18379 -7685 -413 -1911 4180 10564 10944 -3217 -8649 -3653 1481
4204A481J950r160p365J252O534o25L783j761j099M919l733r09J3455O441j1209
$$ 1481 3431 -5729 -13094 -11842 -5308 -5933 -2150 -3911 -5010 -91 -3824 -4733 8722 15163 3954
4189C954j1309m379P996O29m64n16L17J0793J640j349m096k162n887q714r193
$$ 3954 -7355 -11734 -3738 -3109 -3573 -4089 -3772 7021 8661 7312 3216 1054 -4833 -13547 -22740
4174b2740K539L551O052J953L296P57n043N612j375k048Q800O785O040K376r257
$$ -22740 -20201 -16650 -10598 -8645 -5349 -4592 -9635 -4023 -5398 -7446 1354 8139 14179 16555 7298
4159G298k45n681l142m677p871n04q73m556j620M745M730ql556n60Q311J0991
$$ 7298 7053 1372 -1770 -6447 -14318 -14822 -15695 -20251 -21871 -17126 -12396 -12404 -15960 -16520 -8209 2782
4143B782M848M432n374j4028n314M292M686l4K779n953j0874l003J0777L567o555
$$ 2782 7630 12062 6688 -7340 -12654 -8362 -3676 -3710 -931 -6884 -17758 -20761 -9984 -6417 -12972
4128a2972l435N420K143J107k785R722N546l481j1187P93K753l564K876R08K693
$$ -12972 -16407 -10987 -8844 -7737 -10522 -800 4746 1265 -9922 -9129 -6376 -9940 -7064 -6156 -3463
4113c463q706P946J307j284P645L772m365k738n29n068M33N196q86j0101J0213
$$ -3463 -12169 -4223 -2916 -4200 3445 7217 2852 114 -415 -5483 -5050 146 -740 -10841 -628
4098f28J6786P24j0030l375j118l494k719j872k042m404p822J0099J2711K125
$$ -628 16158 16882 6852 3477 2359 -1135 -3854 -5726 -7768 -12172 -19994 -9895 2816 4941
4084D941Q8n723n294N923O930o606j0087L000o255k050l04O109L261L325J062
$$ 4941 5029 -694 -5988 -65 6865 259 -9828 -6828 -13083 -15133 -15437 -9328 -6067 -2742 -1680
4069a680J287n211j420O921N993n268l61n924K771n88p36q13R410k249n243j621
$$ -1680 -393 -5604 -7024 -103 5890 622 261 -5663 -2892 -3480 -4216 -5029 4381 2132 -3111 -4732
4053d732j491j602j2J727R923J922l850O316M960J462n615q381j1343k999p96
$$ -4732 -6223 -7825 -7837 -6110 3813 5735 1885 8201 13161 14623 9008 627 -10716 -13715 -14511
4038a4511O777O917k831l09K593M385N303l959n085R18k54n176P454K671j0948
$$ -14511 -7734 -817 -3648 -3957 -1364 3021 8324 4365 -720 198 -56 -5232 2222 4893 -6055
4023f055N784j1687m298p320Q410O070l28N329l028o107m412J715L610L465P084
$$ -6055 -271 -11958 -16256 -23576 -15166 -9096 -9424 -4095 -7123 -13230 -17642 -15927 -12317 -8852 -1768
4008a768l221L618j210k648N139P455O04O443J856n893j1398m953r750P774M662
$$ -1768 -4989 -1371 -2581 -5229 -90 7365 7969 14412 16268 10375 -1023 -5976 -15726 -7952 -3290
3993c290j1213K907M956m872O689M047o739L53J0377k262j0987p577j451N163
$$ -3290 -14503 -11596 -6640 -11512 -4823 -776 -7515 -7162 3215 953 -10034 -17611 -19062 -13899
3979a3899K20R85N123R180P86j416p181m889m864P138O948o00n588J0168O805
$$ -13899 -13679 -12694 -7571 1609 2395 979 -6202 -11091 -15955 -8817 -1869 -2469 -8057 2111 8916
3964H916N777n423r824m384Q936j696n040n425L856P797j265j741r782m565K195
$$ 8916 14693 9270 -554 -4938 3998 2302 -2738 -8163 -4307 3490 2225 484 -9298 -13863 -11668
3949a1668O792l790K057Q961j59j2201k111K088K119N148J034o147J624J674m35
$$ -11668 -4876 -8666 -6609 2352 2193 -10008 -12119 -10031 -7912 -2764 -1730 -7877 -6253 -4579 -5014
3934e014L139J179J755Q304M317j449r156j8506M648O757p19l692J1761J996P968
$$ -5014 -1875 -696 1059 9363 13680 12231 3075 -15431 -10783 -4026 -4745 -8437 3324 5320 13288
3919A3288L759L158m681q195j4634m3O546L335m325Q58m121n274r626J1301L642
$$ 13288 17047 20205 15524 7329 -7305 -7348 -802 2533 -1792 -934 -5055 -10329 -19955 -8654 -5012
3904e012J211M358j0671p931M013K994J959m470O99J294M812N52O035K039P701
$$ -5012 -3801 557 -10114 -18045 -14032 -11038 -9079 -13549 -12850 -11556 -6744 -6192 -157 1882 9583
3889I583L714k776k756p553j1288r31K629p425k450M562o983N017J6445P865l413
$$ 9583 13297 10521 7765 212 -11076 -12007 -9378 -16803 -19253 -14691 -21674 -16657 -212 7653 4240
3874D240j742J832N115k622j2868M85J1906o640n18j456L991M134o479n422l067
$$ 4240 2498 4330 9445 6823 -6045 -5560 6346 -294 -812 -2268 1723 5857 -622 -6044 -9111
3859i111O945o100J218P703P036K349o416l671l096n370l163N335M257j6374j880
$$ -9111 -2166 -8266 -7048 655 7691 10040 3624 -47 -3143 -8513 -11676 -6341 -2084 -18458 -20338
3844b0338J0664J779o88M14P568Q117J061Q71r913j0828p05N553Q643J771J055
$$ -20338 -9674 -7895 -8583 -8169 -601 7516 8577 9448 -465 -11293 -11998 -6445 2198 3969 5024
3829E024m898k924L264M745K998L228j888r219j591q56l07r637p414M746R213
$$ 5024 126 -2798 466 5211 8209 11437 9549 330 -1261 -2117 -2424 -12061 -19475 -14729 -5516
3814e516j314M13K298n485J748O756j069n367q051o687L372j533R423K2221K305
$$ -5516 -6830 -6417 -4119 -9604 -7856 -1100 -2169 -7536 -15587 -22274 -18902 -20435 -11012 11209 13514
3799A3514j0320p147j235M085O123L318j617q762r002L212j351m984o57L898n008
$$ 13514 3194 -3953 -5188 -1103 5020 8338 6721 -2041 -11043 -7831 -9182 -14166 -14823 -10925 -15933
3784a5933j484J3654L534j0935o509J157K255R499J512j022j0310n078L568J801
$$ -15933 -17417 -3763 -229 -11164 -17673 -16516 -14261 -4762 -3250 -4272 -14582 -19660 -16092 -14291
3770a4291J1405N788j1392L970M816k133M449k956m241l92k55L573k686m372K116
$$ -14291 -2886 2902 -8490 -4520 296 -1837 2612 -344 -4585 -4977 -5232 -1659 -4345 -8717 -6601
3755f601l461J242O189r7J440l256M52j666m291N589J1060l255p55M000p608l867
$$ -6601 -10062 -8820 -2631 -2728 -1288 -4544 -4092 -5758 -10049 -4460 6600 3345 2590 6590 -1018 -4885
3739d885Nn123m26k395K726N311l814n823L365L195j0676j206R131o554n035J0924
$$ -4885 -4880 -10003 -10429 -12824 -10098 -4787 -8601 -14424 -11059 -7864 -18540 -19746 -10615 -17169 -22204 -11280
$$ [...]
##END NTUPLES=NMR SPECTRUM
##END=
