##TITLE=Analysis number 323430
Compound Code cc 05709
Book Reference 467/87/1
Project Code adrs
Chemist Name benw
##JCAMPDX= 6.0         $$ Bruker NMR JCAMP-DX V2.0
##DATA TYPE= NMR SPECTRUM
##DATA CLASS= NTUPLES
##ORIGIN= Bruker BioSpin GmbH
##OWNER= nmr
$$ XWIN-NMR		Version 3.5
$$ Wed Oct 25 10:02:10 2006 GMT Daylight Time (UT+1h)  MAYBRIDGE\nmr@NMR_250MHZ
##.OBSERVE FREQUENCY= 250.131544655141
##.OBSERVE NUCLEUS= ^1H
##.ACQUISITION MODE= SIMULTANEOUS (DQD)
##.ACQUISITION SCHEME= undefined
##.AVERAGES= 16
##.DIGITISER RES= 18
##SPECTROMETER/DATA SYSTEM= dpx250
##.PULSE SEQUENCE= zg30
##.SOLVENT NAME= CDCl3
##.SHIFT REFERENCE= (INTERNAL, CDCl3, 0, 16.522)
##AUDIT TRAIL= $$ (NUMBER, WHEN, WHO, WHERE, WHAT)
$$ ##TITLE= Audit trail, XWIN-NMR		Version 3.5
$$ ##JCAMPDX= 5.01
$$ ##ORIGIN= Bruker BioSpin GmbH
$$ ##OWNER= nmr
$$ C:\u/data/dgb/nmr/ADRS/1210/pdata/1/auditp.txt
$$ ##AUDIT TRAIL=  $$ (NUMBER, WHEN, WHO, WHERE, WHAT)
(   1,<2006-10-25 10:01:43.93 +100>,<MAYBRIDGE\nmr>,<NMR_250MHZ>,
      <created by zg, POWCHK disabled, PULCHK disabled
       configuration hash MD5:
       49 4B E0 1D 92 C2 6B 37 9F E6 65 BC 52 41 86 1D
       data hash MD5: 64K
       B0 38 4C 6A 25 50 D7 5D 73 D6 FD C4 06 20 BB EF>)
(   2,<2006-10-25 10:01:57.03 +100>,<MAYBRIDGE\nmr>,<NMR_250MHZ>,
      <Start of raw data processing
       ef LB = 0.3 FT_mod = 6 PKNL = 1 SI = 32K 
       data hash MD5: 32K
       40 30 3A 8E 76 5F 07 58 6F 28 8D 7C F1 F5 02 77>)
(   3,<2006-10-25 10:01:58.79 +100>,<MAYBRIDGE\nmr>,<NMR_250MHZ>,
      <apk 
       data hash MD5: 32K
       D3 2B BB 5C 89 CB 7C BE 28 E0 38 37 44 69 4D 32>)
(   4,<2006-10-25 10:01:59.78 +100>,<MAYBRIDGE\nmr>,<NMR_250MHZ>,
      <abs ABSG = 5 
       data hash MD5: 32K
       95 CF F4 6F 2E B5 58 83 94 47 D3 37 0F 39 0F 43>)
$$ ##END=
$$ 
$$ hash MD5
$$ 24 CD 1D 8A 9D 16 68 3B FA 99 57 F9 CF 70 02 67
##$RELAX= 
##$RELAX= 
##$RELAX= 
##$RELAX= 
##$RELAX= 
##$RELAX= 
##$RELAX= 
$$ Bruker specific parameters
$$ --------------------------
##$DU= <C:\u>
##$EXPNO= 1210
##$NAME= <ADRS>
##$PROCNO= 1
##$TYPE= <nmr>
##$USER= <dgb>
##$AMP= (0..31)
100 100 100 100 100 100 100 100 100 100 100 100 100 100 100 100 100 100 
100 100 100 100 100 100 100 100 100 100 100 100 100 100 
##$AQSEQ= 0
##$AQ_mod= 3
##$AUNM= <au_zg>
##$AUTOPOS= <5 >
##$BF1= 250.13
##$BF2= 250.13
##$BF3= 250.13
##$BF4= 250.13
##$BF5= 500.13
##$BF6= 500.13
##$BF7= 500.13
##$BF8= 500.13
##$BYTORDA= 1
##$CFDGTYP= 0
##$CFRGTYP= 5
##$CHEMSTR= <none>
##$CNST= (0..31)
1 1 145 1 1 1 1 1 1 1 1 1 1 1 1 1 1 1 1 1 1 1 1 1 1 1 1 1 1 1 1 1 
##$CPDPRG= <>
##$CPDPRG1= <>
##$CPDPRG2= <>
##$CPDPRG3= <>
##$CPDPRG4= <mlev>
##$CPDPRG5= <mlev>
##$CPDPRG6= <mlev>
##$CPDPRG7= <mlev>
##$CPDPRG8= <mlev>
##$CPDPRGB= <>
##$CPDPRGT= <>
##$D= (0..31)
0 1 0 0 0 0 0 0 0 0.06 0 0 0 0 0 0 0.0002 0 0 0 0 0 0 0 0 0 0 0 0 0 0 
0 
##$DATE= 1161766903
##$DBL= (0..7)
120 120 120 120 120 120 120 120 
##$DBP= (0..7)
150 150 150 150 150 150 150 150 
##$DBP07= 0
##$DBPNAM0= <>
##$DBPNAM1= <>
$$ [...]
##$SUBNAM7= <"">
##$SUBNAM8= <"">
##$SUBNAM9= <"">
##$SW= 20.6930455092707
##$SWIBOX= (0..15)
0 0 3 0 0 0 0 0 0 0 0 0 0 0 0 0 
##$SW_h= 5175.983436853
##$TD= 65536
##$TD0= 1
##$TE= 683.16
##$TE2= 300
##$TE3= 300
##$TEG= 300
##$TL= (0..7)
0 120 120 120 120 120 120 120 
##$TP= (0..7)
150 150 150 150 150 150 150 150 
##$TP07= 0
##$TPNAME0= <>
##$TPNAME1= <>
##$TPNAME2= <>
##$TPNAME3= <>
##$TPNAME4= <>
##$TPNAME5= <>
##$TPNAME6= <>
##$TPNAME7= <>
##$TPOAL= (0..7)
0.5 0.5 0.5 0.5 0.5 0.5 0.5 0.5 
##$TPOFFS= (0..7)
0 0 0 0 0 0 0 0 
##$TUNHIN= 0
##$TUNHOUT= 0
##$TUNXOUT= 0
##$USERA1= <user>
##$USERA2= <user>
##$USERA3= <user>
##$USERA4= <user>
##$USERA5= <user>
##$V9= 5
##$VALIST= <valist>
##$VCLIST= <CCCCCCCCCCCCCCC>
##$VD= 0
##$VDLIST= <DDDDDDDDDDDDDDD>
##$VPLIST= <PPPPPPPPPPPPPPP>
##$VTLIST= <TTTTTTTTTTTTTTT>
##$WBST= 1024
##$WBSW= 4
##$XGAIN= (0..3)
0 0 0 0 
##$XL= 0
##$YL= 0
##$YMAX_a= 490741
##$YMIN_a= -527363
##$ZGOPTNS= <>
##$ZL1= 120
##$ZL2= 120
##$ZL3= 120
##$ZL4= 120
##$ABSF1= 16.522
##$ABSF2= -4.171173
##$ABSG= 5
##$ABSL= 3
##$ALPHA= 0
##$AQORDER= 0
##$ASSFAC= 0
##$ASSFACI= 0
##$ASSFACX= 0
##$ASSWID= 0
##$AUNMP= <proc_1d>
##$AZFE= 0.1
##$AZFW= 0.1
##$BCFW= 0
##$BC_mod= 0
##$BYTORDP= 0
##$COROFFS= 0
##$CY= 12.5
##$DATMOD= 1
##$DC= 0
##$DFILT= <>
##$DTYPP= 0
##$F1P= 14.0000005364418
##$F2P= -0.99999901652339
##$FCOR= 0.5
##$FTSIZE= 32768
##$FT_mod= 6
##$GAMMA= 0
##$GB= 0
##$INTBC= 1
##$INTSCL= 1
##$ISEN= 128
##$LB= 0.3
##$LEV0= 0
##$LPBIN= 0
##$MAXI= 10000
##$MC2= 0
##$MEAN= 0
##$ME_mod= 0
##$MI= 0
##$NCOEF= 0
##$NC_proc= -2
##$NLEV= 6
##$NOISF1= 0
##$NOISF2= 0
##$NSP= 0
##$NTH_PI= 0
##$NZP= 0
##$OFFSET= 16.522
##$PC= 1
##$PHC0= -46.57479
##$PHC1= 4.400893
##$PH_mod= 1
##$PKNL= yes
##$PPARMOD= 0
##$PSCAL= 4
##$PSIGN= 0
##$REVERSE= no
##$SF= 250.13
##$SI= 32768
##$SIGF1= 0
##$SIGF2= 0
##$SINO= 400
##$SIOLD= 32768
##$SREGLST= <1H.CDCl3>
##$SSB= 0
##$STSI= 32768
##$STSR= 0
##$SW_p= 5175.98343685301
##$SYMM= 0
##$S_DEV= 0
##$TDeff= 65536
##$TDoff= 0
##$TI= <Analysis number 999999
Compound Code 99
Book Reference 9
Project Code 9>
##$TILT= no
##$TM1= 0
##$TM2= 0
##$TOPLEV= 0
##$USERP1= <user>
##$USERP2= <user>
##$USERP3= <user>
##$USERP4= <user>
##$USERP5= <user>
##$WDW= 1
##$XDIM= 32768
##$YMAX_p= 403996897
##$YMIN_p= -41000
$$ End of Bruker specific parameters
$$ ---------------------------------
##NTUPLES= NMR SPECTRUM
##VAR_NAME=  FREQUENCY,     SPECTRUM/REAL,   SPECTRUM/IMAG
##SYMBOL=    X,             R,               I
##VAR_TYPE=  INDEPENDENT,   DEPENDENT,       DEPENDENT
##VAR_FORM=  AFFN,          ASDF,            ASDF
##VAR_DIM=   32768,         32768,           32768
##UNITS=     HZ,            ARBITRARY UNITS, ARBITRARY UNITS
##FACTOR=    0.157963299565203, 1,           1
##FIRST=     4132.6476996994, 0,             0
##LAST=      -1043.33573715361, 0,           0
##MIN=       -1043.33573715361, -41000,      0
##MAX=       4132.6476996994, 403996897,     0
$$ Real data points
##PAGE= N=1
##DATA TABLE= (X++(R..R)), XYDATA
$$ [...]
17246G308j201K07P395p20N210k915j2614r793o24q077P395R598N04K942l827
$$ 7308 6107 6314 13709 12989 18199 15284 2670 -7123 -7747 -15824 -8429 1169 1673 4615 788
17231G88n271K873m723j2229M881J6322L922N402p764J998k392k214K278m397
$$ 788 -4483 -1610 -6333 -18562 -13681 2641 6563 11965 4201 6199 3807 1593 3871 -526
17217e26j0439o693N614L633p256m547J2033R782M820L467L399m730k187o1L38
$$ -526 -10965 -17658 -12044 -8411 -15667 -20214 -8181 1601 6421 9888 13287 8557 6370 6309 6647
17202F647n673j501J1978J056m081m654j472P808N145p336j531k075o94N768o89
$$ 6647 974 -527 11451 12507 8426 3772 2300 10108 15253 7917 6386 4311 3617 9385 8696
17187H696L435J374j441j2348O75L669k670n424o4M190l437o221O443k194K348
$$ 8696 12131 13505 12064 -284 391 4060 1390 -4034 -4098 92 -3345 -9566 -3123 -5317 -2969
17172b969o960J796L059J541n590P958K152J464M821M990k499J080L810p839q883
$$ -2969 -9929 -8133 -5074 -3533 -9123 -1165 987 2451 7272 12262 9763 10843 14653 6814 -2069
17157b069j182k778r96Q660O036k457m086l703o24N175l479k977J903j496K868
$$ -2069 -3251 -6029 -7025 1635 7671 5214 1128 -2575 -3199 1976 -1503 -4480 -2577 -4073 -1205
17142a205m767j5503L5L850O89L61R896Q369J713p042J786K556l568l551M521
$$ -1205 -5972 -21475 -21440 -17590 -16901 -16540 -6644 1725 3438 -3604 -1818 738 -2830 -6381 -1860
17127a860l935r166q60L986L992l34J6760J5559p003J1094K908j22N166L719P061
$$ -1860 -5795 -14961 -15821 -11835 -7843 -8177 8583 24142 17139 28233 31141 31019 36185 39904 46965
17112D6965P311J3781J7489M5551O0318M7072L3240K7598N3642P6523N6555j941
$$ 46965 54276 68057 85546 131097 191415 238487 271727 299325 352967 429490 486045 484104
17100D84104l5094k9691j2578l1813m9998m7920n4465m1108l0683l1936k9494
$$ 484104 449010 419319 406741 374928 324930 277010 222545 181437 150754 118818 89324
17089H9324j3243j4134p806j0977j4824l712k82j0195j3651P590R008J80p87l617
$$ 89324 76081 61947 54141 43164 28340 24628 24346 14151 500 8090 17098 17278 16491 12874
17075A2874J720l545r647J959P569k114p56O55k546K779p962q08N697p171r370
$$ 12874 14594 11049 1402 3361 10930 8816 8060 8715 6169 8948 986 178 5875 -1296 -10666
17060a0666m202K438K747P6J0618L897K413o593K170L804l069p99o166L366P329
$$ -10666 -14868 -12430 -9683 -9607 1011 4908 7321 728 2898 6702 3633 2834 -3332 34 7363
17045G363o055n266L609O116j073j458m706o192j219J5454Q465r302p346m289
$$ 7363 1308 -3958 -349 5767 4694 3236 -1470 -7662 -8881 6573 15038 5736 -1610 -5899
17031e899M99J205r514l89J0622M972N905N17j0319O39K436K115P95q894j341
$$ -5899 -5400 -4195 -13709 -14098 -3476 1496 7401 7918 -2401 -1762 674 2789 3584 -5310 -6651
17016f651J1605j868k563n461q294j03P015K867L93k947j1723K458Q654l221J392
$$ -6651 4954 3086 523 -4938 -13232 -13335 -6320 -3453 -3060 -6007 -17730 -15272 -6618 -9839 -8447
17001h447j475o734M350L482N409Q411J188j237J351N034r068r089o450J0305
$$ -8447 -9922 -16656 -12306 -8824 -3415 4996 6184 4947 6298 11332 2264 -6825 -13275 -2970
16987b970O736r246L487P692m619j955j21J118q80J869K113m573l558M907j399
$$ -2970 3766 -5480 -1993 5699 1080 -875 -996 122 -758 1111 3224 -1349 -4907 0 -1399
16972a399o109N729O298j594j868N702l773J70l074m738O687R802J376N365n596
$$ -1399 -7508 -1779 4519 2925 1057 6759 2986 3156 82 -4656 2031 11833 13209 18574 12978
16957A2978r077n613J436K625m329k449o11q90L519K289m414O843J0093L737m413
$$ 12978 3901 -1712 -276 2349 -1980 -4429 -5040 -5930 -2411 -122 -4536 2307 12400 16137 11724
16942A1724o534o506r141q239m041O032J4743Q015r879n592j037L248k048n891
$$ 11724 5190 -1316 -10457 -18696 -22737 -16705 -1962 6053 -3826 -9418 -10455 -7207 -9255 -15146
16928a5146k127L630l524m984R268J2590j811j173j764r977o619k760Q433O944
$$ -15146 -17273 -13643 -17167 -22151 -12883 -293 -2104 -3277 -5041 -15018 -21637 -24397 -15964 -9020
16914i020l327m43N02o647j669P076L323L865p140N468J1606m83J03K450j026
$$ -9020 -12347 -12790 -12288 -18935 -20604 -13528 -10205 -6340 -13480 -8012 3594 3111 3214 5664 4638
16899D638L508l057j2877O6L835P538j624j537k474k833l843j608J290q50p186
$$ 4638 8146 5089 -7788 -7722 -3887 3651 2027 490 -1984 -4817 -8660 -10268 -8978 -9828 -17014
16884a7014j43K308j129J167L446J0875j68r573r013J26J443K096K256K2107N505
$$ -17014 -17157 -14849 -15978 -14811 -11365 -490 -658 -10231 -19244 -19118 -17675 -15579 -13323 8784 14289
16869A4289j8575j0157N904K915K346O41j1123K121P086p758q680k183o06O650
$$ 14289 -4286 -14443 -8539 -5624 -3278 -2637 -13760 -11639 -4553 -12311 -20991 -23174 -23780 -17130
16855a7130M680Q076L545M327r939O675O392r276m849l119K783K381j834m285
$$ -17130 -12450 -4374 -829 3498 -6441 234 6626 -2650 -7499 -10618 -7835 -5454 -7288 -11573
16841a1573k800l266J772j49k881q08k729O73P791J4226m029j6772k278M755Q343
$$ -11573 -14373 -17639 -15867 -16016 -18897 -19705 -22434 -21761 -13970 256 -3773 -20545 -22823 -18068 -9725
16826i725J1644j336J768j244k267j822q323q198l44L684N869J687n87k142j592
$$ -9725 1919 583 2351 1107 -1160 -2982 -11305 -19503 -19847 -16163 -10294 -8607 -9194 -11336 -12928
16811a2928K031m026L712O218k467M173l05j459r342k89J07J325R108j781j0572
$$ -12928 -10897 -14923 -11211 -4993 -7460 -3287 -3592 -5051 -14393 -14682 -14575 -13250 -4142 -5923 -16495
16796a6495j266L613L614Q018m68L492k469j1605M75L778j560j066m335L65M329
$$ -16495 -17761 -14148 -10534 -2516 -2984 508 -1961 -13566 -13091 -9313 -10873 -11939 -16274 -15909 -11580
16781a1580m094K776Q196L685j868K482l142N249o203m084M436j345p920j146
$$ -11580 -15674 -12898 -4702 -1017 -2885 -403 -3545 1704 -4499 -8583 -4147 -5492 -13412 -14558
16767a4558J1743P523j0278r215J565J6088R818j0718l507j555K214l203j737
$$ -14558 -2815 4708 -5570 -14785 -13220 2868 12686 1968 -1539 -3094 -880 -4083 -5820
16754e820n29j498r34O254j251N24j0517O564O617j225n102k625N660L154n582
$$ -5820 -6349 -7847 -8781 -2527 -3778 -3254 -13771 -7207 -590 -1815 -6917 -9542 -3882 -728 -6310
16739f310m182n15J715l460n871j914M110M298K752n41p170J0402J2348Q84l469
$$ -6310 -10492 -11007 -9292 -12752 -18623 -20537 -16427 -12129 -9377 -9918 -17088 -6686 5662 6546 3077
16724C077Q4l205n309n419j199R504K152l239o555p607L496R682j157J476M455
$$ 3077 3161 -44 -5353 -10772 -11971 -2467 -315 -3554 -10109 -17716 -14220 -4538 -5695 -4219 236
16709B36j441M717p9j312M064K862j4620r689N556M25m102m513n821j245P669
$$ 236 -1205 3512 3433 2121 6185 9047 -5573 -15262 -9706 -9281 -13383 -17896 -23717 -24962 -17293
16694a7293N195N580q015k678J594J953K016N887k576p712R44Q726J0825k698
$$ -17293 -12098 -6518 -14533 -17211 -15617 -13664 -11648 -5761 -8337 -16049 -15105 -6379 4446 1748
16680A748M611J464j771p585j2253m178m908k195K784P828P648J810M020N271
$$ 1748 6359 7823 6052 -1533 -13786 -17964 -22872 -25067 -22283 -14455 -6807 -4997 -977 4294
16666D294k945m708o976r120K593J27R271P825M1m176K247O315r529j8324q810
$$ 4294 1349 -3359 -10335 -19455 -16862 -16735 -7464 361 402 -3774 -1527 4788 -4741 -23065 -31875
16651c1875Q466L568l448Q874R777l215j2045o917P418Q343Q193J116M667p446
$$ -31875 -23409 -19841 -23289 -14415 -4638 -7853 -19898 -26815 -19397 -11054 -2861 -1745 2922 -4524
16637d524j0715p164J455M21j001K582j67k65k351k793J198j888N876J2266J0536
$$ -4524 -15239 -22403 -20948 -20527 -21528 -18946 -19113 -19378 -21729 -24522 -23324 -25212 -19336 -7070 3466
16622C466N138o157j1493q831Q54k21J638L143k767K885R740j296k093M336L753
$$ 3466 8604 2447 -9046 -17877 -17023 -17244 -15606 -12463 -15230 -12345 -2605 -3901 -5994 -1658 2095
16607B095L706j1525j3944J950R689Q327q917o638J0771K469L905Q87q058p048
$$ 2095 5801 -5724 -19668 -17718 -8029 298 -8619 -15257 -4486 -2017 1888 2775 -5283 -12331
16593a2331L878M23O64k329M755n17l716J706P010L110j700l530N367L323M208
$$ -12331 -8453 -8030 -7366 -9695 -4940 -5457 -9173 -7467 -457 2653 953 -2577 2790 6113 10321
16578A0321J1606j012j4532J307N553L93n216n01P319m594j1762o552l245q81
$$ 10321 21927 20915 6383 7690 13243 13636 8420 7919 15238 10644 -1118 -7670 -10915 -11796
16564a1796P235l64j2834l249j438N587N618q659j207P741J739R61K155j0374
$$ -11796 -4561 -4925 -17759 -21008 -22446 -16859 -11241 -19900 -21107 -13366 -11627 -10666 -8511 -18885
16550a8885K93P276Q44K579o713J401N117J657l032J22n14J506M854l392k992
$$ -18885 -18592 -11316 -10472 -7893 -14606 -13205 -8088 -6431 -9463 -9341 -9855 -8349 -3495 -6887 -9879
16535i879k90J573M500R31k406n047o659l099j200k75P751l48O572l66p727j205
$$ -9879 -10169 -8596 -4096 -3165 -5571 -10618 -17277 -20376 -21576 -21851 -14100 -14448 -7876 -8242 -15969 -17174
16519a7174M847K895p118M64M285M633L422k818J614M338j060M887k503k339J757
$$ -17174 -12327 -9432 -16550 -16086 -11801 -7168 -3746 -6564 -4950 -612 -1672 3215 712 -1627 130
16504A30L06m527M274J373J325L090N332k728j1138m581j919K364O631L19L433
$$ 130 436 -4091 183 1556 2881 5971 11303 8575 -2563 -7144 -9063 -6699 -68 251 3684
16489C684O795n54M590j077j3329r350L06L411L373J028J24K072o088j155n016
$$ 3684 10479 9925 14515 13438 109 -9241 -8935 -5524 -2151 -1123 -999 1073 -5015 -6170 -11186
16474a1186l922J923P36q33r82l925L7q83L297j142l08L272K159k759L06R7L286
$$ -11186 -15108 -13185 -12449 -13282 -14264 -18189 -18152 -19035 -15738 -16880 -17188 -13916 -11757 -14516 -14210 -14113 -10827
16457a0827o298K474m47M795J1746J298k107P248l433l559M876l757m212J732
$$ -10827 -17125 -14651 -15098 -10303 1443 2741 634 7882 4449 890 5766 2009 -2203 -471
16443d71N817k93J376j209r784J1245J619r247j4445l245j566L319R229P560L106
$$ -471 5346 5053 6429 5220 -4564 6681 8300 -947 -15392 -18637 -20203 -16884 -7655 -95 3011
16428C011r80n477o36j299J80p257j3638J6039L746N1L325k79l56L397K129j313
$$ 3011 2031 -3446 -4082 -5381 -5201 -12458 -26096 -10057 -6311 -6260 -2935 -3214 -3570 -173 1956 643
16412F43l085m290l267j439j2141J19P40J331J868J048J404m580P554N030n506
$$ 643 -2442 -6732 -9999 -11438 -23579 -23460 -22720 -21389 -19521 -18473 -17069 -21649 -14095 -9065 -14571
16397a4571j67m062k706M574L253P765l560o70n519l153K072P653n11K093J171
$$ -14571 -14738 -18800 -21506 -16932 -13679 -5914 -9474 -10144 -15663 -18816 -16744 -9091 -9602 -7509 -6338
16382f338M461l071r391j859P486M741j767J828P182J976k714K617l28N84L893
$$ -6338 -1877 -4948 -14339 -16198 -8712 -3971 -5738 -3910 3272 5248 2534 5151 4823 5407 9300
16367I300m636j3323n620O081p96J08Q703J5128n976r763m143K105O124m901j3331
$$ 9300 4664 -8659 -14279 -8198 -8994 -8886 -183 14945 8969 -794 -4937 -2832 3292 -1609 -14940
16352a4940L340Q902j062p516q070J0577J712M010k0K334K263M612J796r098K258
$$ -14940 -11600 -2698 -3760 -11276 -19346 -8769 -7057 -3047 -3067 -733 1530 6142 7938 -1160 1098
16337A098p73P70l065k796j494k629n595N623o32l21M873P473P09k644o878k150
$$ 1098 325 1095 -1970 -4766 -6260 -8889 -14484 -8861 -9493 -9814 -4941 2532 3241 597 -6281 -8431
16321h431j086M056L096J534o617Q225L436k353o145k936j919l701P799J1112
$$ -8431 -9517 -5461 -2365 -831 -7448 777 4213 1860 -4285 -7221 -9140 -12841 -5042 6070
16307F070l147j0588J774j819r040K234N800l741m906l058R80j452J465O049K316
$$ 6070 2923 -7665 -5891 -7710 -16750 -14516 -8716 -12457 -17363 -20421 -19441 -20893 -19428 -13379 -11063
16292a1063P582K329K302K002m445q695l816j0294L801J6211J1871J452r340K634
$$ -11063 -3481 -1152 1150 3152 -1293 -9988 -13804 -24098 -20297 -4086 7785 9237 -103 2531
16278B531n658l721M250n286n672m660M515K386K854m999l282M095M41P948n450
$$ 2531 -3127 -6848 -2598 -7884 -13556 -18216 -13701 -11315 -8461 -13460 -16742 -12647 -12206 -4258 -9708
16263i708m260Q258k66j408k087P453J944j108m323j4319l316N006O061K691k500
$$ -9708 -13968 -5710 -5976 -7384 -9471 -2018 -74 -1182 -5505 -19824 -23140 -18134 -12073 -9382 -11882
16248a1882K321m222l445Q938j296J764M788p129q138m975Q388J3257L241o010
$$ -11882 -9561 -13783 -17228 -8290 -9586 -7822 -3034 -10163 -18301 -23276 -14888 -1631 1610 -4400
16234d400p068j664J6465M677j3076j3287J0463O116n832m100R899k163m643R255
$$ -4400 -11468 -13132 3333 8010 -5066 -18353 -7890 -1774 -7606 -11706 -1807 -3970 -8613 642
16220F42M080n225k272P205q673o809L316N424l123J390j428J009K721L47m054
$$ 642 4722 -503 -2775 4430 -4243 -11052 -7736 -2312 -5435 -4045 -5473 -4464 -1743 -1396 -5450
16205e450K333M462j4360J882Q43p739q142P039N533r67r38j938Q789J287Q439
$$ -5450 -3117 1345 -13015 -11133 -10290 -18029 -26171 -19132 -13599 -14566 -15504 -17442 -8653 -7366 1073
16190A073L683J091j8192j4451o32N616P652K795m319K682J0378k656j585J1987
$$ 1073 4756 5847 -12345 -26796 -27428 -21812 -14160 -11365 -15684 -13002 -2624 -5280 -6865 5122
16176E122M948j0472q171J82p352j1377j37N141P216R095P251J3334K47j2245
$$ 5122 10070 -402 -8573 -8391 -15743 -27120 -27257 -22116 -14900 -5805 1446 14780 15027 2782
16162B782o907m225q442M508N388l031k744J235Q126k560q94j745k624m039N344
$$ 2782 -4125 -8350 -16792 -12284 -6896 -9927 -12671 -11436 -3310 -5870 -6764 -8509 -11133 -15172 -9828
16147i828o650l318K241N560N200O939m974N105k143o64r412M453N210Q748n706
$$ -9828 -16478 -19796 -17555 -11995 -6795 144 -4830 275 -1868 -2532 -11944 -7491 -2281 6467 761
16132G61j0894k996O01q692O644J0692Rj736j3411M73J0430P831J920L46l896
$$ 761 -10133 -13129 -12528 -21220 -14576 -3884 -3875 -5611 -19022 -18549 -8119 -288 1632 1978 -1918
16117a918J237O10p286J284N787L259K205o018J235K70m411o652j927l27J4547
$$ -1918 -681 -71 -7357 -6073 -286 2973 5178 -840 395 665 -3746 -10398 -12325 -12652 1895
16102A895J569m94l271N5o016q893p612J0000R183M30o264O066J897O242n729
$$ 1895 3464 2970 -301 -246 -6262 -15155 -22767 -12767 -3584 -3154 -9418 -3352 -1455 4787 -942
16087i42l464p061m941M618P005k00p512j930J226j938m855J181J1272J1262m74
$$ -942 -4406 -11467 -16408 -11790 -4785 -4985 -12497 -14427 -13201 -15139 -19994 -18813 -7541 3721 3247
16072C247k059N937n356O860m052n372J855k797j1099p152n78J1427L281k038
$$ 3247 1188 7125 1769 8629 4577 -795 1060 -1737 -12836 -19988 -20566 -9139 -5858 -7896
16058g896p009J255N493N54p214o411K41J625M413L317j860n308n223n80J2753
$$ -7896 -14905 -13650 -8157 -7603 -14817 -21228 -20987 -19362 -14949 -11632 -13492 -18800 -24023 -24603 -11850
16043a1850Q295K582q70j925o218k062j280j229k141R575J2417l627j3208l235
$$ -11850 -3555 -973 -1843 -3768 -9986 -12048 -13328 -14557 -16698 -7123 5294 1667 -11541 -14776
16029a4776K527N468M486n868p090J6532k559j711N194M953K478M23J576m153
$$ -14776 -12249 -6781 -2295 -8163 -15253 1279 -1280 -2991 2203 7156 9634 10057 11633 7480
16015G480q274R312p930j5246l073k955N562Q932J1056N450l197o837j908P018
$$ 7480 -794 8518 588 -14658 -17731 -20686 -15124 -6192 4864 10314 7117 280 -1628 5390
16001E390l094m423N982R9l085l909J662L164l874m833o992L027l963J0478J2565
$$ 5390 2296 -2127 3855 3954 869 -3040 -1378 1786 -2088 -6921 -13913 -10886 -14849 -4371 8194
15986H194L109n522L226j365l300o725l901m939n753J509O239M426j313o174o694
$$ 8194 11303 5781 9007 7642 4342 -2383 -6284 -11223 -16976 -15467 -9228 -4802 -6115 -12289 -18983
15971a8983L527R992n25O389K460j177l986n469m544M595m922n57L423K893P886
$$ -18983 -15456 -5464 -5989 400 2860 1683 -2303 -7772 -12316 -7721 -12643 -13200 -9777 -6884 1002
15956A002J745n469O781N28P92n791o118j422r97K399J0470K241l513j0805l994
$$ 1002 2747 -2722 4059 4587 5379 -412 -6530 -7952 -8949 -6550 3920 6161 2648 -8157 -12151
15941a2151K731j2788m651J1441N037l316K679n539n41L810O051m387l269n286
$$ -12151 -9420 -22208 -26859 -15418 -10381 -13697 -11018 -16557 -17098 -13288 -7237 -11624 -14893 -20179
15927b0179Q444O409P956M028K710P131n893j3156j1613n71j308n517j210L468
$$ -20179 -11735 -5326 2630 6658 9368 16499 10606 -2550 -14163 -14734 -16042 -21559 -22769 -19301
15913a9301M364k99K66M565M242J548m712o16L033J808Q10J0794J413o653n060
$$ -19301 -14937 -15236 -14970 -10405 -6163 -4615 -9327 -9943 -6910 -5102 -4292 6502 7915 1262 -3798
15898c798m555k898k655N635L298p642m829k341N90R800k136q937L31L037n909
$$ -3798 -8353 -11251 -13906 -8271 -4973 -12615 -17444 -19785 -19195 -9395 -11531 -20468 -20137 -17100 -23009
15883b3009m209j132M231J100J1703P684k86j700K282l096j305N150j313M411
$$ -23009 -27218 -28350 -24119 -23019 -11316 -3632 -3918 -5618 -3336 -6432 -7737 -2587 -3900 511
15869E11m449j2728M951p942M094L146j070K456J745o700J1188J0851K825n053
$$ 511 -3938 -16666 -11715 -19657 -15563 -12417 -13487 -11031 -9286 -15986 -4798 6053 8878 3825
15855C825L954p397j0340K904N798p682j1142j288J0202R945p35l494K216L998
$$ 3825 7779 382 -9958 -7054 -1256 -8938 -20080 -21368 -11166 -1221 -1956 -5450 -3234 764
15841G64r75O148k437j5267o295m907J1081P418p852K253J1438P75l479n81j17
$$ 764 -211 5937 3500 -11767 -18062 -22969 -11888 -4470 -12322 -10069 1369 2144 -1335 -1916 -2033
15826b033j140J547M540n400n664p701J03P278K715K116M65n913N017j392r053
$$ -2033 -3173 -1626 2914 -2486 -8150 -15851 -15748 -8470 -5755 -3639 -3174 -9087 -4070 -5462 -14515
15811a4515m270p824J6125J6053L428q357p168q311L9J246m838K439J0155m49
$$ -14515 -18785 -26609 -10484 5569 8997 640 -6528 -14839 -14800 -13554 -18392 -15953 -5798 -6247
15797f247m857k432Q16L891J828J382K680n104j0740l242J2935J1001l466K53
$$ -6247 -11104 -13536 -12720 -8829 -7001 -5619 -2939 -8043 -18783 -22025 -9090 1911 -1555 -1302
15783a302N662n895q444k302N748N372p880L406P12l306o315p788J827l931K001
$$ -1302 4360 -1535 -9979 -12281 -6533 -1161 -9041 -5635 -4923 -8229 -14544 -22332 -20505 -24436 -22435
15768b2435K633J951j167R836p22r694J938M155P111Q779k406j1268J335r54k738
$$ -22435 -19802 -17851 -19018 -9182 -9904 -19598 -17660 -13505 -6394 2385 -21 -11289 -9954 -10908 -13646
15753a3646l776N263J1610N336n896n897O332q19m315K656J421o025m464k44N08
$$ -13646 -17422 -12159 -549 4787 -1109 -7006 -674 -1493 -5808 -3152 -1731 -7756 -12220 -12464 -11956
15738a1956J318j318n932l26K821L862n94L693N699n569q717j456M359l84Q806
$$ -11956 -10638 -11956 -17888 -18214 -15393 -11531 -12125 -8432 -2733 -8302 -17019 -18475 -14116 -14500 -5694
15723e694L011K873Q808n748p733O708o21n813k483k777l471k729j315N638R523
$$ -5694 -2683 190 8998 3250 -4483 2225 1604 -4209 -6692 -9469 -12940 -15669 -16984 -11346 -1823
15708a823m273k755N821M864l232m393O37k31k680m458M04J714k983J885j67L104
$$ -1823 -6096 -8851 -3030 1834 -1398 -5791 -5154 -5385 -8065 -12523 -12119 -10405 -13388 -11503 -11670 -8566
15692h566P295N308l729n428K07J874N236K107j9139j019J0462P835J371M28Q269
$$ -8566 -1271 4037 308 -5120 -4913 -3039 2197 4304 -14835 -15854 -5392 2443 3814 4242 12511
15677A2511k017r300p005k904n404r27j2807n999j57J462P318Q318P450O28J469
$$ 12511 10494 1194 -5811 -8715 -14119 -15046 -27853 -33852 -34009 -32547 -25229 -16911 -9461 -8833 -7364
15662g364J817n525L296N18n747M537k874o355j5708o542J0483P570L846O840
$$ -7364 -5547 -11072 -7776 -7258 -13005 -8468 -11342 -17697 -33405 -39947 -29464 -21894 -18048 -11208
15648a1208j105M554n925K654P693j992j0417R363K54L866N013K889k650n654
$$ -11208 -12313 -7759 -13684 -11030 -3337 -5329 -15746 -6383 -6129 -2263 2750 5639 2989 -2665
15634b665n137p859k664p141j825J4286J0439l01k710j14P571o671m214q15P75
$$ -2665 -7802 -15661 -18325 -25466 -27291 -13005 -2566 -2867 -5577 -5691 1880 -4791 -9005 -9820 -9045
15619i045K262J365r022k507r49J769n548j523O55J0007K933K836P222l305J8
$$ -9045 -6783 -5418 -14440 -16947 -17896 -16127 -21675 -23198 -22543 -12536 -9603 -6767 455 -2850 -2832
15604b832j4589m065J625r88J0518n25k781m37k951q856N642J5156n92P487r980
$$ -2832 -17421 -21486 -19861 -20849 -10331 -10856 -13637 -14074 -17025 -25881 -20239 -5083 -5675 1812 -8168
15589h168o013l316Q614P220N589O373m609j1192o025m376R06J843L698o61J0586
$$ -8168 -14181 -17497 -8883 -1663 3926 10299 5690 -5502 -11527 -15903 -14997 -13154 -9456 -10117 469
15574D69R658L031r043o135r414k739J5550L998Q183K178q156k871k025P152k765
$$ 469 10127 13158 4115 -2020 -11434 -14173 1377 5375 13558 15736 7580 4709 2684 9836 7071
15559G071n08O312L290m991j2556k224j116L221n377M742p1o64J253l803o944
$$ 7071 6563 12875 16165 11174 -1382 -3606 -4722 -1501 -6878 -2136 -2207 -2871 -1618 -5421 -12365
15544a2365n77K870O925L71j0386J0690O432o160L898k695q929K773k073l864
$$ -12365 -12942 -10072 -3147 -2776 -13162 -2472 3960 -2200 1698 -997 -9926 -7153 -9226 -13090
15530a3090j03q470J256J9955J0757n6o136j503N327l162o733q069k514m37M089
$$ -13090 -13193 -21663 -20407 -452 10305 10249 4113 2610 7937 4775 -1958 -10027 -12541 -12978 -8889
15515h889j342l30q82oo82O345O120L195n45j687k58N185l884l651k947L593q687
$$ -8889 -10231 -10561 -11443 -11449 -12131 -5786 334 3529 2984 1297 1039 6224 2340 -1311 -4258 -665 -9352
15498i352o350K677J955m483m130O831P182M298p194p279M876O1p688K120J748
$$ -9352 -15702 -13025 -11070 -15553 -19683 -12852 -5670 -1372 -8566 -15845 -10969 -10908 -18596 -16476 -14728
15483a4728L177l264J092J0390o073q163P47N271J959K414j180Q706Q57j102j0959
$$ -14728 -11551 -14815 -13723 -3333 -9406 -17569 -16822 -11551 -9592 -7178 -8358 348 1205 103 -10856
15468a0856J793M110p996q531K348P370M791p009n543n834R582N934J1358J284
$$ -10856 -9063 -4953 -12949 -21480 -19132 -11762 -6971 -13980 -19523 -25357 -15775 -9841 1517 2801
15454B801l18O440J343Q624L784o01o297j0562q727L905k386j810o564N946o870
$$ 2801 2483 8923 10266 18890 22674 22073 15776 5214 -3513 392 -1994 -3804 -10368 -4422 -11292
15439a1292l354M133Q49P30J282j398J555M162m411L698l310L075M82r997o380
$$ -11292 -14646 -10513 -9664 -8934 -7652 -9050 -7495 -3333 -7744 -4046 -7356 -4281 -3799 -13796 -20176
15424b0176r429m879J5353Q452N081N709N921M636j914o701l551O268l390Q4o267
$$ -20176 -29605 -34484 -19131 -10679 -5598 111 6032 10668 8754 2053 -1498 4770 1380 1464 -4803
15409d803n851J0043k19l163p330M221Q958j0733j1101P040R747p56j669k851
$$ -4803 -10654 -611 -830 -3993 -11323 -7102 1856 -8877 -19978 -12938 -3191 -3947 -5616 -8467
15395h467k952m809N350j645J0195m711j0069J846M213N10l62J4519o92m475p497
$$ -8467 -11419 -16228 -10878 -12523 -2328 -7039 -17108 -15262 -11049 -10539 -10901 3618 2926 -1549 -9046
15380i046r764K835M296O864n461r057N87J3616N786j0721O526L51j711K897j085
$$ -9046 -18810 -15975 -11679 -4815 -10276 -19333 -18746 -5130 656 -10065 -3539 -3188 -4899 -2002 -3087
15365c087K524R617l142j685p124K326n990m66n47m033m740Q94k422l040P78J185
$$ -3087 -563 9054 5912 4227 -2897 -571 -6561 -7027 -7574 -11607 -16347 -15453 -17875 -20915 -20137 -18952
15349a8952L685L602J1449P912l300m957r20n856j1468j016K86Q783J606O697
$$ -18952 -15267 -11665 -216 7696 4396 -561 -1481 -7337 -18805 -19821 -19535 -10752 -9146 -2449
15335b449J218m120J357J921p289j0830m850O305J3232M2K564L321m487k167J990
$$ -2449 -1231 -5351 -3994 -2073 -9362 -20192 -25042 -18737 -5505 -5463 -2899 422 -4065 -6232 -4242
15320d242L511n452o543P39J316J721q059j624K4o9Q493P940q788n311O6Q080
$$ -4242 -731 -6183 -12726 -11987 -10671 -8950 -17009 -18633 -18609 -18678 -10185 -2245 -11033 -16344 -16278 -8198
15304h198O157j065l066o496j973o018N719R009L353k844l798p3q10M180M337
$$ -8198 -2041 -3106 -6172 -12668 -14641 -20659 -14940 -5931 -2578 -5422 -9220 -9293 -10103 -5923 -1586
15289a586l000n806J119N750L599m805K753o039p586J0448o99j458k444O523k985
$$ -1586 -4586 -10392 -9273 -3523 76 -4729 -1976 -8015 -15601 -5153 -5852 -7310 -9754 -3231 -6216
15274f216m605Q963K04p370M079l657K601J315J648n694r695n8Q437n596P712
$$ -6216 -10821 -1858 -1654 -9024 -4945 -8602 -6001 -4686 -3038 -8732 -18427 -18485 -10048 -15644 -7932
15259g932M945p23q854R27L633R221l003o603j633j331P15R03r63j775n052o809
$$ -7932 -2987 -3710 -12564 -11637 -8004 1217 -1786 -8389 -10022 -11353 -10638 -9735 -10698 -12473 -17525 -24334
15243b4334j606M044J2778P924n483K529O85J44k282L762r98n901q029M290J1877
$$ -24334 -25940 -21896 -9118 -1194 -6677 -4148 -3463 -3319 -5601 -1839 -2837 -8738 -16767 -12477 -600
15228f00K108q649j195o566q400j839J7107R925l211j288o073J601q096l763J1004
$$ -600 1508 -7141 -8336 -14902 -23302 -25141 -8034 1891 -1320 -2608 -8681 -7080 -15176 -18939 -7935
15213g935J4675n29p150q260L96N238q281O00J973m675J922O239j968l187o2J774
$$ -7935 6740 6211 -939 -9199 -8803 -3565 -11846 -11246 -9273 -13948 -12026 -5787 -7755 -10942 -11004 -9230
15197i230K173n373L059l882M117R897q985p992M064K395J0834J3792M750L431
$$ -9230 -7057 -12430 -9371 -13253 -9136 761 -8224 -16216 -12152 -9757 1077 14869 19619 23050
15183B3050L523Q191N442l218l16r967q673r295R0n597M974L332k404p801q904
$$ 23050 26573 34764 40206 36988 36672 26705 18032 8737 8827 3230 8204 11536 9132 1331 -7573
15168g573J22m986K51M218P160l717P88o141L655L621O928r733J840k872k00J807
$$ -7573 -7451 -12437 -12186 -7968 -808 -4525 -3737 -9878 -6223 -2602 4326 -5407 -3567 -6439 -6639 -4832
15152d832p371J848j542Q364Q357m610j920o181k285q772m150m823J402P93L554
$$ -4832 -12203 -10355 -11897 -3533 4824 214 -1706 -7887 -10172 -18944 -23094 -27917 -26515 -25722 -22168
15137b2168J0483J1476Q327o166l456r40m319L013J2569K836j4792j2918k628
$$ -22168 -11685 -209 8118 1952 -1504 -2444 -6763 -3750 8819 11655 -3137 -16055 -18683
15124a8683j246j540Q60P13L363O840l583L468j984J1286J2333j080n460j0626
$$ -18683 -19929 -21469 -20609 -19896 -16533 -9693 -13276 -9808 -11792 -506 11827 10747 5287 -5339
15110e339j282R47l137l23M964k672r785Q80K162O266P948N529j1554j7512k075
$$ -5339 -6621 -5674 -8811 -9134 -4170 -6842 -16627 -15747 -13585 -7319 629 6158 -5396 -22908 -24983
15095b4983Q529Q166K403P554Q206l452l807n978o278m624R18N060N168R461J780
$$ -24983 -16454 -8288 -5885 1669 9875 6423 2616 -3362 -9640 -14264 -13346 -8286 -3118 6343 8123
15080H123p115o704p114j29L674L175q82N476P034j836l946J144M174o277j0164
$$ 8123 1008 -5696 -12810 -12939 -9265 -6090 -6972 -1496 5538 3702 -244 900 5074 -1203 -11367
15065a1367P534L82n853L25o89m825o018K834J0443J501l477l827L179K701P842
$$ -11367 -3833 -3451 -9304 -8979 -9668 -14493 -20511 -17677 -7234 -5733 -9210 -13037 -9858 -7157 685
15050F85p873m833o489O197K318l75O600m533k797J741N921o263k489m206j2249
$$ 685 -7188 -12021 -18510 -12313 -9995 -10370 -3770 -8303 -11100 -9359 -3438 -9701 -12190 -16396 -28645
15035b8645O842O859J2250O863o896q912L96r69o783Q596k008q185R019O100J058
$$ -28645 -21803 -14944 -2694 4169 -2727 -11639 -11243 -12212 -18995 -10399 -12407 -20592 -11573 -5473 -4415
15020d415M602l31k402q249P82J459m32J967N833L344l433q971m87P325n759l832
$$ -4415 187 -144 -2546 -10795 -10013 -8554 -8986 -7019 -1186 2158 -1275 -10246 -10733 -3408 -9167 -12999
15004a2999k636j195M950P434O681l397o491L850K476m279j250J649M124J1402
$$ -12999 -15635 -16830 -11880 -4446 2235 -1162 -7653 -3803 -1327 -5606 -6856 -5207 -1083 10319
14990A0319j083r649r664O172N099N365m002m444r237o55j172L892R370J484j64
$$ 10319 9236 -413 -10077 -3905 1194 6559 2557 -1887 -11124 -11779 -12951 -9059 311 1795 1631
14975A631L028L139l90L721o607o687j1P248l410l324P362m022m88o000N717N926
$$ 1631 4659 7798 7408 11129 4522 -2165 -2176 5072 1662 -1662 5700 1678 1190 -4810 907 6833
14959F833M105K564j0483m423N641R42q002L828K547K576q406m234r49n834N71
$$ 6833 10938 13502 3019 -1404 4237 5179 -2823 1005 3552 6128 -2278 -6512 -7461 -13295 -12724
14944a2724q22j633J593L697Q398L913p666j2659k843M998N134J808j715o616
$$ -12724 -13546 -15179 -13586 -9889 -1491 2422 -5244 -17903 -20746 -15748 -10614 -8806 -10521 -17137
14930a7137J0011O48Q80k220p101J890M223o375P63k859N249m61j368m07P478
$$ -17137 -7126 -6478 -5598 -7818 -14919 -13029 -8806 -15181 -14418 -17277 -12028 -12489 -13857 -14264 -6786
14915f786N852n671M250O956J917M202o046l49l837o035m259L847m133k219L504
$$ -6786 -934 -6605 -2355 4601 6518 10720 4674 4325 488 -5547 -9806 -5959 -10092 -12311 -8807
14900h807L430j071p471N693J0379O040N92r322j1408l332M579M578J892m41j151
$$ -8807 -5377 -6448 -13919 -8226 2153 8193 8785 -537 -11945 -15277 -10698 -6120 -4228 -4669 -5820
14885e820L11p064R442j000j1299m334k669J221K536J0320p35j456P606p399o412
$$ -5820 -5509 -12573 -3131 -4131 -15430 -19764 -22433 -21212 -18676 -8356 -9091 -10547 -2941 -10340 -16752
14870a6752p343j874N640O535O336J921j3650K980J1365J16K725P081N925j437
$$ -16752 -24095 -25969 -20329 -13794 -7458 -5537 -19187 -16207 -4842 -4726 -2001 5080 11005 9568
14856I568J303j4218j927k384P91O932R289q272o748L805K008m432j0448N378
$$ 9568 10871 -3347 -5274 -7658 -6867 65 9354 1082 -5666 -1861 147 -4285 -14733 -9355
14842i355J1833O79n678O862K716k205M885N228o977n833J165n75j0103m022M203
$$ -9355 2478 3157 -2521 4341 7057 4852 9737 14965 7988 2155 3320 2745 -7358 -11380 -7177
14827g177P285n410J46j228o789P899j619r894L255J1406j128J48L174J40q1q721
$$ -7177 108 -5302 -5156 -6384 -13173 -5274 -6893 -16787 -13532 -2126 -3254 -3106 68 208 127 -8594
14811h594p144O240O008J457J265L152l35J357j1409O077L914k847P212P216Q681
$$ -8594 -15738 -9498 -3490 -2033 -768 2384 2049 3406 -8003 -1926 1988 -859 6353 13569 22250
14796B2250j4785j1866L91P534O526M839j488l16k933j550p711k344k958j228
$$ 22250 7465 -4401 -4010 3524 10050 14889 13401 13085 10152 8602 891 -1453 -4411 -5639
14782e639N293j22j981q505M304O499k374j64l253k701n720r258J90J0357M993
$$ -5639 -346 -468 -2449 -10954 -6650 -151 -2525 -2689 -5942 -8643 -14363 -23621 -23431 -13074 -8081
14767h081K106K863l180n708P10K356O794l303n191J248L115N689q4j653o815
$$ -8081 -5975 -3112 -6292 -12000 -11290 -8934 -2140 -5443 -10634 -9386 -6271 -582 -666 -2319 -9134
14752i134L111P522P6j0700K775N596n934j811O514l489q789L551P309J0058N202
$$ -9134 -6023 1499 1575 -9125 -6350 -754 -6688 -8499 -1985 -5474 -14263 -10712 -3403 6655 11857
14737A1857l663m837P16J639R557k152n800j0569K059J8146K216j582l389r401
$$ 11857 8194 3357 4073 5712 15269 13117 7317 -3252 -1193 16953 19169 17587 14198 4797
14723D797n683L242Q190k462j902o968m111N643j323j0801n94K262j642j724K446
$$ 4797 -886 2356 10546 8084 6182 -786 -4897 746 -577 -11378 -11972 -9710 -11352 -13076 -10630
14708a0630R750J195J863O86p365J962P435K197K498N81M34J330r185j0802J520
$$ -10630 -880 315 2178 2864 -4501 -2539 4896 7093 9591 10172 10606 11936 2751 -8051 -6531
14693f531J628k016M615J881j004K415N673l905p0P63q442m958K659J814N052
$$ -6531 -4903 -6919 -2304 -423 -1427 988 6661 2756 2686 3449 -4993 -9951 -7292 -5478 -426
14678d26j279R59N061l360N420k269K928Q459J601j213r489K3q243K172J2616
$$ -426 -1705 -746 4315 955 6375 4106 7034 15493 17094 15881 6392 6415 -1828 344 12960
14663A2960j162m66k370j288k84O795o27j5390p48N719Q421o527M71J3176j944
$$ 12960 11798 11332 8962 7674 7390 14185 13558 -1832 -2580 3139 11560 5033 5504 18680 16736
14648A6736o7m221j0442l361R08J5160M682j240m651o584r563q236K370N771K66
$$ 16736 16669 12448 2006 -1355 -447 14713 19395 18155 13504 6920 -2643 -10879 -8509 -2738 -2472
14633b472j613o017K127j27P186J2283m08k894j992j565j906n366L523P269o611
$$ -2472 -4085 -10102 -7975 -8102 -916 11367 10959 8065 6073 4508 2602 -2764 759 8028 1417
14618A417r44O944j393o55J446m680n922R732J019K747J2362K42j0996j0373p517
$$ 1417 473 7417 6024 5369 6815 2135 -3787 5945 6964 9711 22073 22315 11319 946 -6571
14603f571k906K593M24L87L617m29Q48p63k25J178J0706M687p242m490q230n240
$$ -6571 -9477 -6884 -6460 -6073 -2456 -2885 -2037 -2800 -3025 -1847 8859 13546 6304 1814 -6416 -11656
14587a1656M349M025J1459N762J859k923r61J217K845O72m759l331k738j2523
$$ -11656 -7307 -3282 8177 13939 15798 12875 11914 13131 15976 16648 11889 8558 5820 -6703
14573f703J528J4723K582j1843j098K827M507M934K168O00o343m634J272O547
$$ -6703 -5175 9548 12130 287 -811 2016 6523 11457 13625 14225 7882 3248 4520 11067
14559A1067K16M661K780J0511L87p400j7748r929p17O202K284J381m61N02Q420
$$ 11067 11283 15944 18724 29235 29622 22222 4474 -5455 -6172 30 2314 3695 3234 3736 12156
14544A2156Q45J708Q823M357k992l094O81j264R196j526k296K387N755J050J481
$$ 12156 13001 14709 23532 27889 24897 21803 22484 21220 30416 28890 26594 28981 34736 35786 37267
14529C7267J5379K4707J7467L21O446K3033J9445L5209L8373L5571K6284K6744
$$ 37267 52646 77353 94820 95141 101587 124620 144065 179274 217647 253218 279502 306246
14517C06246K3836J5439J6060L28j4767k0401j5700k5844l5496j7832r929j8428
$$ 306246 330082 345521 361581 361909 347142 326741 311041 285197 249701 231869 221940 203512
14505B03512j7980j6191j5372j0705j1047j7663j484L346Q922J724p971q088J3406
$$ 203512 185532 169341 153969 143264 132217 114554 113070 116416 125338 127062 119091 111003 124409
14492A24409J5154M532j818R768R617J5860K1515K0410J9816L1765K6539K7063
$$ 124409 139563 144095 142277 152045 161662 177522 199037 219447 239263 271028 297567 324630
14480C24630L1658J4410J1437P20q031o785j4748k8439l5933l7954l3999l0224
$$ 324630 356288 370698 382135 382855 374824 368039 353291 324852 288919 250965 216966 186742
14468A86742j9173k6576k0730j8361j1145p563p499m096j2981m164n509j939p275
$$ 186742 167569 140993 120263 101902 90757 83194 75695 71599 58618 54454 48945 47006 39731
14455C9731o721N199J339R096R65l239k085O533Q652j0844p101r747m885K716
$$ 39731 33010 38209 39548 48644 49609 46370 44285 50818 59470 48626 41525 31778 26893 29609
14441B9609l179r776N186K560n741k61N279q580j026M675Q290Q708q184k145J894
$$ 29609 26430 16654 21840 24400 18659 18398 23677 15097 14071 18746 27036 35744 27560 25415 27309
14426B7309R360O538J492p795p802j450j49O332L191j975k477J020p487M69N967
$$ 27309 36669 43207 44699 36904 29102 27652 27503 33835 37026 35051 32574 33594 26107 26576 32543
14411C2543m930m981l460k325M944k577N407k945k617N750N185j1693L170L007
$$ 32543 27613 22632 19172 16847 21791 19214 24621 21676 19059 24809 29994 18301 21471 24478
14397B4478p675j1922L455J1331q68j2832K814N963N372m243o356O52j162R016
$$ 24478 16803 4881 8336 19667 18799 5967 8781 14744 20116 15873 9517 10169 9007 18023
14383A8023o934P180O681q109l329J328q4N026J41o016k480r13k829J442J918
$$ 18023 11089 18269 24950 16841 13512 14840 14756 19782 19923 13907 11427 10514 7685 9127 11045
14368A1045n04O802R750R622j2492m312M773k530m555N380Q86r494l294J343J036
$$ 11045 10541 17343 27093 36715 24223 19911 24684 22154 17599 22979 23865 14371 11077 12420 13456
14353A3456M200K312J215M547K688k69l904j160m85K937k060P36p553q20J766
$$ 13456 17656 19968 21183 25730 28418 28149 24245 23085 22600 25537 23477 24213 16660 15840 17606
14338A7606L271J693n933q9n884q82N58r126n034j172M116M217J0176J5218N297
$$ 17606 20877 22570 16637 16548 10664 9782 10340 1214 -3820 -4992 -876 3341 13517 28735 34032
14323C4032j1151M600K249m596Q461K207n732o229l479l236p48Q038K887O42n683
$$ 34032 22881 27481 29730 25134 33595 35802 30070 23841 20362 17126 16378 24416 27303 27945 22262
14308B2262K441m616P557M130l637l876l496K39N126N759k569O661O817m806q913
$$ 22262 24703 20087 27644 31774 28137 24261 20765 21004 26130 31889 29320 35981 42798 37992 29079
14293B9079O364J6882J1416o655r419l936m265n389r34P59k306L501M795j041
$$ 29079 35443 52325 63741 57086 47667 43731 39466 34077 33143 33902 31596 35097 39892 38851
14279C8851N752R327P820K396n236N907L919O405N848p459l661N409J9083Q501
$$ 38851 44603 53930 61750 64146 58910 64817 68736 75141 80989 73530 69869 75278 94361 102862
14265A02862k588N569j189p82k049p534j2420j834J6112K327j7134o982Q181r644
$$ 102862 100274 105843 104654 103872 101823 94289 81869 80035 96147 98474 81340 74358 82539 72895
14251G2895n886j781m266j215O161p233m582J1073R686m932l231K486l968P629
$$ 72895 67009 65228 60962 59747 65908 58675 54093 65166 74852 69920 66689 69175 65207 72836
14237G2836j430J1086M830J125M458M814O661R177L028K293j91L792q156m594
$$ 72836 71406 82492 87322 88447 92905 97719 104380 113557 116585 118878 118687 122479 114323 109729
14223A09729P277j274n563j8571n910r381r529p299M815J459K0M305m746J307
$$ 109729 117006 115732 110169 91598 85688 76307 66778 59479 64294 65753 65773 70078 65332 66639
14209F6639q977p43N949K441l324k186p246O407K098r025P511J5885j825n034
$$ 66639 57662 56919 62868 65309 61985 59799 52553 58960 61058 52033 59544 75429 73604 68570
14195F8570P70J3075P072q970j960K875O03M551J419p573n958l314P204J6073
$$ 68570 69340 82415 89487 80517 78557 81432 82035 86586 88005 80432 74474 71160 78364 94437
14181I4437Q545j97N179M241K510l399k872k358J0461J0112M490Q167Q020Q813
$$ 94437 102982 102785 107964 112205 114715 111316 108444 106086 116547 126659 131149 139316 147336 156149
14167A56149J1294J4891O057J3070P128O741J0498N867K802l672l193K355n50
$$ 156149 167443 182334 188391 201461 208589 215330 225828 231695 234497 230825 227632 229987 229437
14154B29437p089K402Q890j3930j0867N952R607L532P86O737N100Q46J4290R909
$$ 229437 222348 224750 233640 219710 208843 214795 224402 227934 228720 235457 240557 241403 255693 265602
14140B65602j08M908J951R731K5414J1429J4724J8797N975J7836J7339M576J1621
$$ 265602 265494 270402 272353 282084 307498 318927 333651 352448 358423 376259 393598 398174 409795
14127D09795K5428K4365K1657J1283K613Q120J8510J2945J6442Q907J3413J7097
$$ 409795 435223 459588 481245 492528 495141 503261 521771 534716 551158 560065 573478 590575
14115E90575K5326K7174J6936J6821J2835K4018K8065K9249L8038M0041L2004
$$ 590575 615901 643075 660011 676832 689667 713685 741750 770999 809037 849078 881082
14104H81082L9867M4768M8845O0300P3090Q2789R0784R2691J07444J12983J23414
$$ 881082 920949 965717 1014562 1074862 1147952 1230741 1321525 1414216 1521660 1634643 1758057
14093A758057J34259J46059J82260K13697K37972K71816L32267L90184M58483
$$ 1758057 1892316 2038375 2220635 2434332 2672304 2944120 3276387 3666571 4125054
14084D125054N48032O45361P60800Q98232J081419J333451J669361K097529K631876
$$ 4125054 4673086 5318447 6079247 6977479 8058898 9392349 11061710 13159239 15791115
14075A5791115L343956M184778N073501N876387O342785O295166N752908M860242
$$ 15791115 19135071 23319849 28393350 34269737 40612522 46907688 52660596 57520838
14067E7520838L818170K674115J315951k64976j877433l272122m264432m836291
$$ 57520838 61339008 64013123 65329074 65064098 63186665 59914543 55650111 50813820
14059E0813820n018851m865502m428516l826678l177286k577612k055015j618989
$$ 50813820 45794969 40929467 36500951 32674273 29496987 26919375 24864360 23245371
14051B3245371j270493r62955p06589m91027k72470o4962J26639L23305N33508
$$ 23245371 21974878 21011923 20305334 19814307 19541837 19476875 19603514 19926819 20460327
14042B0460327P71053J045858J376687J779099K269720K874475L586813M389159
$$ 20460327 21231380 22277238 23653925 25433024 27702744 30577219 34164032 38553191
14034C8553191N172523N761219N950816N566604M617785L364645K035048O62064
$$ 38553191 43725714 49486933 55437749 61004353 65622138 68986783 71021831 71683895
14026G1683895q52599k549489m175322n444383o216413o508247o382431n923642
$$ 71683895 70831296 68281807 64106485 58662102 52445689 45937442 39555011 33631369
14018C3631369n214632m376626l569182k872804k292800j814692j480490j222242
$$ 33631369 28416737 24040111 20470929 17598125 15305325 13490633 12010143 10787901
14010A0787901j033251q82934p49596o43322n58019m89109m37643l84063l48817
$$ 10787901 9754650 8871716 8122120 7478798 6920779 6431670 5994027 5609964 5261147
14001E261147l19870l01333k66503k39324k28501k03535j89975j81448j67150
$$ 5261147 4941277 4639944 4373441 4134117 3905616 3702081 3512106 3330658 3163508
13992C163508j49944j40476j16402j14882j10672j08761r0682q7584q7970q4687
$$ 3163508 3013564 2873088 2756686 2641804 2531132 2422371 2331689 2244105 2156135 2071448
13982B071448o6908n7069n5044m4989m8099m5449l0221k6847k5650k2926k2644
$$ 2071448 2004540 1947471 1892427 1847438 1799339 1753890 1723669 1696822 1671172 1648246 1625602
13971A625602k2711r403l317q461j4597o593k0301l8532m1818l8619l4937m3484
$$ 1625602 1602891 1593488 1590171 1581710 1567113 1560520 1540219 1501687 1459869 1421250 1386313 1342829
13959A342829n5798n7615n9571n8970n1099n7596m0688l2375l5462l9366l1513
$$ 1342829 1287031 1229416 1169845 1110875 1059776 1002180 961492 929117 893655 854289 822776
13948H22776l3948k2269j6161k8250l0719j7156j8836j2849j3539j5771j6225
$$ 822776 788828 766559 750398 722148 691429 674273 655437 642588 629049 613278 597053
13937E97053j6818j7483n809n21r786n636M539m164j0830o009o310j7127j7786
$$ 597053 580235 562752 556943 556422 546636 541000 545539 541375 530545 524536 518226 501099 483313
13924D83313j1122p808q672j6958k8155j9661q529j6336j4920j0157o190j569
$$ 483313 472191 464383 455711 438753 410598 390937 382408 366072 351152 340995 334805 333236
13912C33236p471k1028o236J717r016j2502j2788k094r984o728j569r767j0521
$$ 333236 325765 304737 298501 300218 291202 278700 265912 263818 253834 247106 245537 235770 225249
13899B25249j2512k583M795j9141l549R847n280l505P382N900k1396j0151J2220
$$ 225249 212737 210154 214949 195808 192259 202106 196826 193321 200703 206603 185207 175056 187276
13886A87276J0610J142j3395j1633N42j87J0489J502j076l536j895l175j1345
$$ 187276 197886 199028 185633 174000 174542 174355 184844 186346 185270 181734 179839 176664 165319
13873A65319K186j911l117l453K814l815j2873j3673q119m701J3754J0741n305
$$ 165319 167505 165594 162477 159024 161838 158023 145150 131477 123358 118657 132411 143152 137847
13860A37847j4555q830r857m963R339J0240m107l234l608r573J553J598R943o328
$$ 137847 123292 114462 104605 99642 108981 119221 115114 111880 108272 98699 100252 101850 111793 105465
13846A05465K487K710q369m446R048p323j4197o688N382m283J3703Q277n492j2744
$$ 105465 107952 110662 102293 97847 106895 99572 85375 78687 84069 79786 93489 101766 96274 83530
13832H3530j0909O821P999P567j3641q166K071o202k924N064N061m097j6174j2154
$$ 83530 72621 79442 87441 95008 81367 73201 75272 69070 66146 71210 76271 72174 56000 43846
13818D3846m45L032q21o656l240N981j215m917N448L0P567k759P88J038o001j144
$$ 43846 43401 46433 45612 38956 35716 41697 40482 35565 41013 41043 48610 45851 46639 47677 41676 40532
13802D0532O266J885n763r842M539m002n288K880j100O658M293o208o832m472
$$ 40532 46798 48683 42920 33078 37617 33615 28327 31207 30107 36765 41058 34850 28018 23546
13788B3546k044J0690l51o499k808m562j85L482J4495J0400p071p111l003r114
$$ 23546 21502 32192 31841 25342 22534 17972 17787 21269 35764 46164 39093 31982 28979 19865
13774A9865q273L304M269N135Q562n575o532m90L553P842R831Q530o191j1011
$$ 19865 11592 14896 19165 24300 32862 27287 20755 20265 23818 31660 41491 50021 43830 32819
13760C2819j2746J339j461o215J945K059n914l692J9065Q275j7537l289J601k572
$$ 32819 20073 21412 19951 13736 15681 17740 11826 8134 27199 35474 17937 14648 16249 13677
13746A3677L501R235k933j3785M440R533k946J613M979m378m08k329p171k060
$$ 13677 17178 26413 23480 9695 14135 23668 20722 22335 27314 22936 22528 20199 13028 10968
13732A0968R190o15k946M828P09j405j5K017J830m005p965j766M685m51k538O152
$$ 10968 20158 19543 16597 21425 22134 20729 20714 22731 24561 20556 12591 10825 15510 15059 12521 18673
13716A8673J274n584q296l454N770Q571M285k541l826l21l629n652M975L298k902
$$ 18673 19947 14363 6067 2613 8383 16954 21239 18698 14872 14551 10922 5270 10245 13543 10641
13701A0641j826q425N22m00P840O87r520N742l162Pj492J488N470J219j174j41
$$ 10641 8815 390 912 512 8352 9039 -481 5261 2099 2106 614 2102 7572 8791 7617 7476
13685G476K577N039P346p332p350j1579k052L615N160K063J0687L450o349K555
$$ 7476 10053 15092 22438 15106 7756 -3823 -5875 -2260 2900 4963 15650 19100 12751 15306
13671A5306k399q218K182L746l671m739O139P68r084K62L252K575m324J895L492
$$ 15306 12907 4689 6871 10617 6946 2207 8346 9114 30 292 3544 6119 1795 3690 7182
13656G182M188p07J44M222N429N411o205Q216m095Q79Q57R83k781j106m758L785
$$ 7182 11370 10663 10807 15029 20458 25869 19664 27880 23785 24664 25521 26504 23723 22617 17859 21644
13640B1644j115o241O54O413J847o57m935J364N299n216L772J3010N837k753K797
$$ 21644 20529 14288 14942 21355 23202 22545 17610 18974 24273 19057 22829 35839 41676 38923 41720
13625D1720J1908Q033J1766l530K990J1651J7701J5969L2410L8490K7853K1268
$$ 41720 53628 61661 73427 69897 72887 84538 102239 118208 150618 189108 216961 238229
13613B38229K8960L0497K4925R371R75q85P188k714n912j6245k6559k8042l3608
$$ 238229 267189 297686 322611 331982 332957 332072 339260 336546 330634 314389 287830 259788 226180
13600B26180j7359m410k6836j4353o355j2043j5993j2054l780K839o403j0280
$$ 226180 208821 204411 177575 163222 156867 144824 128831 116777 112997 115836 109433 99153
13588I9153L451J1061J2078J0907M433Q085J2845J2256K6341J4537K0012L2507
$$ 99153 102604 113665 125743 136650 141083 149168 162013 174269 200610 215147 235159 267666
13576B67666M0428L2307K3562K8444J7314L887J384j9210k9929j4143l1125l8355
$$ 267666 308094 340401 363963 392407 409721 413608 414992 395782 365853 351710 320585 282230
13564B82230m1048k9719k6147j6622k1029j5336j4368q594j4165j3814j0770j1010
$$ 282230 241182 211463 185316 168694 147665 132329 117961 109367 95202 81388 70618 59608
13552E9608r594J770L592j87m541o861k954K185q146Q28Q73r755j2057j0478N714
$$ 59608 50014 51784 55376 55189 50648 43787 40833 43018 34872 35700 36573 26818 14761 4283 9997
13537I997R611l383P34J4309P19n942O972J539q043r896M283J064o460O849J1
$$ 9997 19608 16225 16959 31268 31987 26045 33017 34556 26513 16617 20900 21964 15504 22353 22364
13522B2364p97k034K02J316O660J0434O588r63j1085o876k049L289J128k196N82
$$ 22364 21567 19533 19735 21051 27711 38145 44733 43770 32685 25809 23760 27049 28177 25981 26563
13507B6563L893R115n169j492q04n663n998l867o71M337P164l304N972o509l975
$$ 26563 30456 39571 34402 32910 32106 26443 20445 16578 15907 20244 27408 24104 30076 23567 19592
13492A9592R747N72q75M489q03q225q918m515k985n19m426n338N097J7017J0550
$$ 19592 29339 29911 29036 33525 32722 24497 15579 11064 8079 7560 3134 -2204 2893 19910 30460
13477C0460k694p560O467M417j3197p391K757P347Q788L206o583k093N761R18
$$ 30460 27766 20206 26673 31090 17893 10502 13259 20606 29394 32600 26017 23924 29685 30603
13463C0603K453r90O066Q665j0638o974L86L100L07L143L948j442l549n108J258
$$ 30603 33056 32066 38132 46797 36159 29185 29571 32671 32978 36121 40069 38627 35078 29970 31228
13448C1228Q186p096q970M434K242L197P05l047j630j246J612O643P23K793N18
$$ 31228 39414 32318 23348 27782 30024 33221 33926 30879 29249 28003 29615 36258 36981 39774 40292
13433D0292j191O35j74n985K071K403l354J566o600l69k989L749J873n530J111
$$ 40292 39101 39736 39562 33577 35648 38051 34697 36263 29663 29294 26305 30054 31927 26397 27508
13418B7508L741l285j5275p168L596L262L040L416N559j089O249K996k706K675
$$ 27508 31249 27964 12689 5521 9117 12379 15419 18835 24394 23305 29554 32550 29844 32519
13404C2519k042p538o797k572k078N102M553j661j79M090L930P70M592j150l069
$$ 32519 30477 22939 16142 13570 11492 16594 21147 19486 19307 23397 27327 28097 32689 31539 28470
13389B8470n737L156M20l645M37M129Q814j690m279M353N989o537m085K182L904
$$ 28470 22733 25889 26309 22664 23101 27230 36044 34354 30075 34428 40417 33880 29795 31977 35881
13374C5881j125L558K333m536m078P07Q48o077r97J2908L616q708M47p184o968
$$ 35881 34756 38314 40647 36111 32033 32740 33588 27511 26514 39422 43038 34330 34777 27593 20625
13359B0625M894Q71J797J648J2577J751j5323k743J7776K35p119m994M664J3603
$$ 20625 25519 26390 28187 29835 42412 44163 28840 26097 43873 44108 36989 31995 36659 50262
13345E0262P299P629l579J235j1312j3771j617Q80M706J750p647L566J6628P095
$$ 50262 57561 65190 61611 62846 51534 37763 36146 37026 41732 43482 35835 39401 56029 63124
13331F3124K302Q3k947L276n458j0403l312R535j966j1133j0163Q90Q256O496
$$ 63124 65426 65509 62562 65838 60380 49977 46665 56200 54234 43101 32938 33828 42084 48580
13317D8580N346j5l618Q035L979o222m504K826O959m16p056o12p267j363J095
$$ 48580 53926 53911 50293 58328 62307 56085 51581 54407 61366 60950 53894 53282 46015 44652 45747
13302D5747J907P567L376N325L029l182P234M274K240L080o827N58q271p168j0984
$$ 45747 47654 55221 58597 63922 66951 63769 71003 75277 77517 80597 73770 74328 66057 58889 47905
13287D7905n062L201O57J1853J0919j8047j0522P202J0470j717o069n32N430R99
$$ 47905 42843 46044 46701 58554 69473 51426 40904 48106 58576 56859 50790 50258 55688 56687
13273E6687k438j5927k151O923J2535J3492J331j1557m025Q288P844k374k947
$$ 56687 54249 38322 36171 43094 55629 69121 70452 58895 54870 63158 71002 68628 65681
13260F5681L097P727J0482k220m919N34n50K155L579M493O216J438K599M175j443
$$ 65681 68778 76505 86987 84767 79848 80382 79832 81987 85566 90059 96275 97713 100312 104487 103044
13245A03044j4205j469M525J1256K654o866p95k094m02J0621O815Q944l693O76
$$ 103044 88839 87370 91895 103151 105805 98939 98144 96050 95648 106269 113084 122028 118335 119011
13231A19011j029P612J2560O944o060l993L835N6p490l198l364M98L281M992p07
$$ 119011 117982 125594 138154 145098 139038 135045 138880 138936 131446 128248 124884 125382 128663 133655 132948
13216A32948M524M606N179Q773M153k793N888J1210J338L290l845J437l374J0197
$$ 132948 137472 142078 147257 156030 160183 157390 163278 174488 175826 179116 175271 176708 173334 183531
13202A83531J9280J0546Q858J588R887Q436N180K4030J2083l316N432J3089J539
$$ 183531 202811 213357 222215 223803 233690 242126 247306 271336 283419 280103 285535 298624 300163
13189C00163J1151P487Q757L945Q350J1304J1649M758J0649N068O901N332J9489
$$ 300163 311314 318801 327558 331503 339853 351157 362806 367564 378213 383281 390182 395514 415003
13176D15003J8756J2679K3243K1603J2899O115K0115K8373L6037L6103K4636K6700
$$ 415003 433759 446438 469681 491284 504183 510298 530413 558786 594823 630926 655562 682262
13164F82262M4029M7517L9428N1033N2187O2536Q0608Q1227Q3849Q3831R4861
$$ 682262 726291 773808 813236 864269 916456 978992 1059600 1140827 1224676 1308507 1403368
13153A403368J19109J39627J62989J81324K13193K44760K88434L45009M08807
$$ 1403368 1522477 1662104 1825093 2006417 2219610 2464370 2752804 3097813 3506620
13144C506620M80311N73777O91326Q25395R81298J133524J272391J406949J473038
$$ 3506620 3986931 4560708 5252034 6077429 7058727 8192251 9464642 10871591 12344629
13135A2344629J443571J282116J020139O42460K36412j87895n58310q41357j025582
$$ 12344629 13788200 15070316 16090455 16732915 16969327 16781432 16223122 15381765 14356183
13126A4356183j113831j108889j051163r43016q17782o95655n78006m71967l78151
$$ 14356183 13242352 12133463 11082300 10139284 9321502 8625847 8047841 7575874 7197723
13117G197723k91898k02517j44209q7843j3740O2258J24598J94499K92346L52771
$$ 7197723 6905825 6703308 6559099 6471256 6457516 6519774 6644372 6838871 7131217 7483988
13107G483988M70051O10360P62297R49461J180793J473099J815962K190502K560201
$$ 7483988 7954039 8564399 9326696 10276157 11456950 12930049 14746011 16936513 19496714
13098A9496714K887536L082343L044010K704210K036492J126753Q2940r46274
$$ 19496714 22384250 25466593 28510603 31214813 33251305 34378058 34460998 33514724
13090C3514724j831410k482649k841873k925926k802725k542577k208520j855677
$$ 33514724 31683314 29200665 26358792 23432866 20630141 18087564 15879044 14023367
13082A4023367j543323j276092j048737q59306o90405n60587m61465l77351k94199
$$ 14023367 12480044 11203952 10155215 9295909 8605504 8044917 7583452 7206101 6911902
13073F911902k30532j52994j02588n0227J7574O6593J16998J94006K64505L38160
$$ 6911902 6681370 6528376 6425788 6375561 6393135 6459728 6576726 6770732 7035237 7373397
13063G373397M39258N44182O48935P58175Q49874R07873R04357Q11378O36996
$$ 7373397 7812655 8356837 9005772 9763947 10613821 11521694 12426051 13237429 13874425
13054A3874425L93141O9231k67098n79963q41414j008494j105970j117356j071219
$$ 13874425 14267566 14336797 14069699 13489736 12648322 11639828 10533858 9416502 8345283
13045H345283r72369q54106p38548o25667n15479m17893l40830k77054k26783
$$ 8345283 7372914 6518808 5780260 5154593 4639114 4221221 3880391 3603337 3376554
13036C376554j73826j50475j39397j30555j35528j37070j39181j50380j48067
$$ 3376554 3202728 3052253 2912856 2782301 2646773 2509703 2370522 2220142 2072075
13027B072075j38413j25962j18632j10586r7481q4550p0688p1928o1003n5113
$$ 2072075 1933662 1807700 1689068 1578482 1481001 1396451 1325763 1253835 1192832 1137719
13017A137719n8757n3906l0755l4816m3351l7687l1884k0130k5251k1330j6992
$$ 1137719 1078962 1025056 994301 959485 916134 878447 846563 826433 801182 779852 762860
13006G62860k8975k9518j7894k0282j3195n105n620r687j0302o141j9187j2494
$$ 762860 733885 704367 686473 666191 652996 647891 642271 632584 622282 616141 596954 584460
12994E84460k037k439j7728j1538j346j4641k0199k0115p965j0013j0863j0200
$$ 584460 582423 579984 562256 550718 549372 534731 514532 494417 486452 476439 465576 455376
12982D55376k4773j4455j1901j6529m923K882J68J6108L6688L4619M2239L5651
$$ 455376 430603 416148 404247 387718 382795 385677 385845 401953 438641 473260 515499 551150
12970E51150K9518K3891M455Q446J032l1480m9405n0977m9646l9203l6681m0482
$$ 551150 580668 604559 609014 617460 618492 587012 537607 486630 436984 397781 361100 320618
12958C20618l3676j3664j3440q623j3454l263l349j1865j1139j1256l368J0138
$$ 320618 286942 273278 259838 251215 237761 234498 231149 219284 208145 196889 193521 203659
12946B03659M585j2254o412p426n199R271K087j857j3056p027o617j220l927j4614
$$ 203659 208244 195990 189578 182152 176953 186224 188311 186454 173398 166371 159754 158534 154607 139993
12932A39993l764K41m535L091M754o651j1255p222j0806m52R22m948M988n547
$$ 139993 136229 136470 131935 135026 139780 133129 121874 114652 103846 103394 104316 99368 104356 98809
12918I8809O133P023p404q90J6965J655p30m386j72Q369J8150J9289J8607K1110
$$ 98809 104942 111965 104561 103671 120636 122291 121561 117175 117003 125372 143522 162811 181418 202528
12904B02528J5362J0040L358r307j7013j0388j6067k0371j1237j7869k4439j8105
$$ 202528 217890 227930 231288 221981 204968 194580 178513 158142 146905 129036 104597 86492
12892H6492k18p318j1638P949j233q755m146K029p803O192Q445j264J248M042
$$ 86492 86274 78956 67318 75267 74034 65279 61133 63162 55359 61551 69996 68732 69980 74022
12878G4022J1982K572q065j3735j3611j2387n255P567N692l885r62M088N25R277
$$ 74022 86004 88576 80511 66776 53165 40778 35523 43090 48782 44897 43935 48023 48548 57825
12864E7825l23o298l360k071N063L680K510j2203p536k790o194P866J404p712
$$ 57825 57502 51204 47844 45773 50836 54516 57026 44823 37287 34497 28303 36169 37573 29861
12850B9861K267k072j3495J979k529K765L500M781J98L254M520k266J0591J503
$$ 29861 32128 30056 16561 18540 16011 18776 22276 27057 27255 30509 35029 32763 43354 44857
12836D4857q378j057M814L561P57n227m213p333q792l555N042O995J3056j590
$$ 44857 36479 35422 40236 43797 44554 39327 35114 27781 18989 15434 20476 27471 40527 38937
12822C8937n14k477r187l828P142N428J2008Q55o369j587r596K052J313J507K646
$$ 38937 38423 35946 26759 22931 30073 35501 47509 48364 41995 40408 30812 32864 34177 35684 38330
12807C8330j4106M626M016l351l175m691r442J549M525J757R43O519r078o762
$$ 38330 24224 28850 32866 29515 26340 21649 12207 13756 18281 20038 20981 27500 18422 11660
12793A1660J758O861O543L170K870Q645N367r152j3820m342L552M760K506m260
$$ 11660 13418 20279 26822 29992 32862 41507 46874 37722 23902 19560 23112 27872 30378 26118
12779B6118K261m243l020m633K039M038L631K86q248j1696n850J857k178l657
$$ 26118 28379 24136 21116 16483 18522 22560 26191 26477 18229 6533 683 2540 362 -3295
12765c295J589J056O126o48P68O113J0161J0061q802p873Q271L130p291l915R033
$$ -3295 -1706 -650 5476 4828 5596 11709 21870 31931 23129 15256 23527 26657 19366 15451 24484
12750B4484P743M487o819p386q018N221O190J3518p587j4910r607l713Q691N82
$$ 24484 32227 36714 29895 22509 14491 19712 25902 39420 31833 16923 7316 3603 12294 12876
12736A2876j661M463O512j8654L672L607P979P958P5k943K211K244m13L042K378
$$ 12876 11215 15678 22190 3536 7208 10815 18794 26752 26827 23884 26095 28339 27926 30968 33346
12721C3346P383n858q155l749m160l17L635J050l483o803l183n27o60M592M105
$$ 33346 40729 34871 26716 22967 18807 18490 22125 23175 19692 12889 9706 9179 8519 13111 17216
12706A7216N50R63p591J793M128l972q680K571N626k507k70K864K862L759l333
$$ 17216 17766 18729 11138 12931 17059 13087 4407 6978 12604 10097 9827 12691 15553 19312 15979
12691A5979J146j341K765J1680J8515o222m507p35k812j935J570m101N210M45
$$ 15979 17125 15784 18549 30229 48744 42522 38015 37280 34468 32533 34103 30002 35212 35657
12677C5657m750q278q835l593P147l882p516N670N064K983p083j548m219N640
$$ 35657 30907 22629 13794 10201 17348 13466 5950 11620 16684 19667 12584 11036 6817 12457
12663A2457Q365n924L850N356M90r112p55Q029O455k911k586m20l366p115o211
$$ 12457 20822 14898 18748 24104 24594 15482 14727 22756 29211 26300 23714 23294 19928 12813 6602
12648F602K637r50M97l065P074m647j530M726K517N024l108j2847m078Q541Q066
$$ 6602 9239 8289 8786 5721 12795 8148 6618 11344 13861 18885 15777 2930 -1148 7393 15459
12633A5459N59p347O201O135L623O389j2187r479j735L715M672m545m485k266
$$ 15459 16018 8671 14872 21007 24630 31019 18832 9353 7618 11333 16005 11460 6975 4709
12619D709q053O46R782N820O737o769n744m090o33M778o264p665L166P894k567
$$ 4709 -3344 -2698 7084 12904 19641 12872 7128 3038 2405 7183 919 -6746 -3580 4314 1747
12604A747p94N29K668M65m34R984J288l113K12K189p870j014L20J341j618k336
$$ 1747 953 1482 4150 4615 4181 14165 15453 12340 12552 14741 6871 5857 6177 7518 5900 3564
12588C564j095k777l443P551O170j880j5894p138J5745O804j684l926j221o322
$$ 3564 2469 -308 -3751 3800 9970 8090 -7804 -14942 803 7607 5923 1997 776 -5546
12574e546j129k335Q030J3313J2738j1554r140J0214P70M058l098J755J1063J061
$$ -5546 -6675 -9010 -980 12333 25071 13517 4377 14591 15361 19419 16321 18076 29139 30200
12560C0200l276l505j3784M6J1827N844M939k391p515m818L99m235m372m115j0081
$$ 30200 26924 23419 9635 9681 21508 27352 32291 29900 22385 17567 17966 13731 9359 5244 -4837
12545d837J771O103L459n4K332L884J318k440R791O52q597k552l500o992j87J0045
$$ -4837 -3066 3037 6496 6442 8774 12658 13976 11536 21327 21979 13382 10830 7330 338 151 10196
12529A0196J0431k1q047K35J622j277l476O20m483K341k104N885J091j1577n70
$$ 10196 20627 20606 12559 12794 14416 13139 9663 10283 5800 8141 6037 11922 13013 1436 866
12514H66L037l589J037O117r002l128L117J7828O650R70o427O11m860L42K91J255
$$ 866 3903 314 1351 7468 -1534 -4662 -1545 16283 22933 23903 17476 18087 13227 13569 13860 15115
12498A5115n055q825q56n22M434k246J097k775k733J89P319O870o938n204L738
$$ 15115 10060 1235 379 -143 4291 2045 3142 367 -2366 -2177 5142 12012 5074 -130 3608
12483C608J487N864J713L127l128l286l349J358K631J1953k518n111k261k678
$$ 3608 5095 10959 12672 15799 12671 9385 6036 7394 10025 21978 19460 14349 12088 9410
12469I410M350M489m177j195Q053J728n240ql078o77K21k308K21M184J4394O83
$$ 9410 13760 18249 14072 12877 20930 22658 17418 17410 14332 13655 13876 11568 11789 15973 30367 31050
12453C1050r658p512m945O731J0356O054O717J0565J206N170n392K907m704q558
$$ 31050 21392 13880 8935 15666 26022 32076 38793 49358 50564 55734 50342 53249 48545 39987
12439C9987o025o491j0650m83R190J409M453O883o30n908j632M704O811k583j3117
$$ 39987 33962 27471 16821 16338 25528 26937 31390 38273 37643 31735 30103 34807 41618 39035 25918
12424B5918p585n155K29K93p636p94J7436P765K1M000P825Q886L991L717j794
$$ 25918 18333 13178 13407 13700 6064 5270 22706 30471 30492 34492 42317 51203 55194 58911 57117
12409E7117J810L525l423o189K063L453O49J705J20qM532L420K820R322K399j1105
$$ 57117 58927 62452 59029 52840 54903 58356 59005 60710 60830 60822 65354 68774 71594 80916 83315 72210
12393G2210o090l641n777j0571J871K627M820Q328m339m735J592m344j0494j530
$$ 72210 66120 62479 56702 46131 48002 50629 55449 63777 59438 54703 56295 51951 41457 39927
12379C9927O318M414O862K310q519p759L151J2696J0455J4987L969k261J269J728
$$ 39927 46245 50659 57521 59831 51312 43553 46704 59400 69855 84842 88811 86550 87819 89547
12365H9547m418o804l672n644j3616p947J030J3881J0643K48M268O931P841N964
$$ 89547 85129 78325 74653 69009 55393 47446 48476 62357 73000 73248 77516 84447 92288 98252
12351I8252r208l096P647j144k980p474n915m632n91J847K087m179n096J1233
$$ 98252 89044 85948 93595 92451 89471 81997 76082 71450 70859 72706 74793 70614 65518 76751
12337G6751N117M742k870n404j616no292J545O090M18m351K475L786q955q459
$$ 76751 81868 86610 83740 78336 76720 76715 70423 71968 78058 78476 74125 76600 80386 71431 62972
12322F2972k716n031j736j2617p323l02R02n844k09R77N719L008m952M697J5256
$$ 62972 60256 55225 53489 40872 33549 33247 34149 28305 28096 29073 34792 37800 32848 37545 52801
12307E2801M324M377K272N906n785q803n825l614K259R43k09J6890L423o021N945
$$ 52801 57125 61502 63774 69680 63895 55092 49267 45653 47912 48855 48646 65536 68959 62938 68883
12292F8883J658o166P627L679j87m959j5544r686Q358m291j3607j1986k522j476
$$ 68883 70541 64375 72002 75681 75494 70535 54991 45305 53663 49372 35765 23779 21257 19781
12278A9781J535N481n925J028k330N616O321J165L789k771j4709j3039j467J391
$$ 19781 21316 26797 20872 21900 19570 25186 31507 32672 36461 33690 18981 5942 4475 5866
12264E866m087K959q23m323J787J5652p64j134K832p76p461K886R52N945l678
$$ 5866 1779 4738 3915 -408 1379 17031 16267 15133 17965 17189 9728 12614 13566 19511 15833
12249A5833j0461n533j117j369J1528N396m426k92J071N788K26m667n446o142
$$ 15833 5372 -161 -1278 -2647 8881 14277 9851 9559 10630 16418 16644 11977 6531 389
12235C89M864Q680J0742j423j0079m284n629R522K260L324K220j2936R03l372
$$ 389 5253 13933 24675 23252 13173 8889 3260 12782 15042 18366 20586 7650 8553 5181
12221E181j536J2272R010l676K488O100J3011j4665j3153N75j780n084j267M359
$$ 5181 3645 15917 24927 21251 23739 29839 42850 28185 15032 15607 13827 8743 7476 11835
12207A1835K635O447m300n974q019ol232o768L419J0955K121k065n772K836q62
$$ 11835 14470 20917 16617 10643 2624 2618 -614 -7382 -3963 6992 9113 7048 1276 4112 3250
12192C250j063L209K349L652M847k813R2l075l702j011Q004J7904o7j3324N643
$$ 3250 2187 5396 7745 11397 16244 13431 13523 10448 6746 5735 13739 31643 31576 18252 23895
12177B3895J95j0044n794K360K945p03k719P450M233K783m469q585J874K690J229
$$ 23895 24090 14046 8252 10612 13557 12854 10135 17585 21818 24601 20132 11547 13421 16111 17340
12162A7340n099o631k229O464R376l045J796M228n991o996M627p741p872M152
$$ 17340 12241 5610 3381 9845 19221 16176 17972 22200 16209 9213 13840 6099 -1773 2379
12148B379N337o213O041N643M058M235O408m778j0536j506p557j0777N176J0991
$$ 2379 7716 1503 7544 13187 17245 21480 27888 23110 12574 11068 3511 -7266 -2090 8901
12134H901j676m947J309R814N367n123N62J800j3565N65Q194o298k438J0103J1092
$$ 8901 7225 2278 3587 13401 18768 13645 14207 16007 2442 3007 11201 4903 2465 12568 23660
12119B3660J088p084m914O293P030r298q849j447j458Q904l499K87R0m028p141
$$ 23660 24748 17664 12750 19043 26073 16775 7926 6479 5021 13925 10426 10713 10803 6775 -366
12104c66m4M119N568M001L839j199m294q513l286O586J5127K271m735m609j299
$$ -366 -410 3709 9277 13278 17117 15918 11624 3111 -175 6411 21538 23809 19074 14465 13166
12089A3166N306N076j157n1n739m455R535Q580j644n167q345P470Q250j440j2155
$$ 13166 18472 23548 22391 22340 16601 12146 21681 30261 28617 23450 15105 22575 30825 29385 17230
12074A7230l134J1417J5356l288p890j0250J880O599j142L026l246K423N899L509
$$ 17230 14096 25513 40869 37581 29691 19441 21321 27920 26778 29804 26558 28981 34880 38389
12060C8389Q99m594J833N726m092M385L970J499K566l839j0924q128p145M861
$$ 38389 39288 34694 36527 42253 38161 42546 46516 48015 50581 46742 35818 27690 20545 25406
12046B5406m687M719K987J491m726q643R676P114J257P681m044l446L576l113
$$ 25406 20719 25438 28425 29916 25190 16547 26223 33337 34594 42275 38231 34785 38361 35248
12032C5248J763L154n075j917k213K772O026J328k936K545k824L036P611p194
$$ 35248 37011 40165 35090 33173 30960 33732 39758 41086 38150 40695 37871 40907 48518 41324
12018D1324j2346L28O683P384m362j970o03K540Q34J427N873n519j271K927O8
$$ 41324 28978 29306 35989 43373 39011 37041 36438 38978 39812 41239 47112 41593 40322 43249 43317
12003D3317N102M767L956m622o033P29J562O688J1040L599o80Q659R658k74K471
$$ 43317 48419 53186 57142 52520 46487 47216 48778 55466 66506 70105 69425 78084 87742 87468 89939
11988H9939O68L623o779k49K558q367l64L031j1755r143O560r055j2224m517M371
$$ 89939 90607 94230 87451 87202 89760 81393 81029 84060 72305 63162 69722 60667 48443 43926 48297
11973D8297j488J439L827k236o694L068J2678Q209l656M776l40L262m967l677
$$ 48297 46809 48248 52075 49839 43145 46213 58891 67100 63444 68220 67880 71142 66175 62498
11959F2498J506L937j84r070Q624J8450J717J928K960j540m562j1073o937p280
$$ 62498 64004 67941 67757 58687 67311 85761 87478 89406 92366 90826 86264 75191 68254 60974
11945F0974j0245K222j678Q477J0253M834Lo228N293P512J850q5J27J0275J5844
$$ 60974 50729 52951 51273 59750 70003 74837 74840 68612 73905 81417 83267 83182 83309 93584 109428
11930A09428Q766j2585n876q611j1267j6368j1115k873OJ612M730j2017k0077
$$ 109428 118194 105609 99733 91122 79855 63487 52372 49499 49505 51117 55847 43830 23753
11917B3753j3472M663J2079R077l387p294k996N86o079N84J495M593K517O171
$$ 23753 10281 14944 27023 36100 32713 25419 22423 23009 16930 17514 19009 23602 26119 32290
11903C2290M035R035k39J1797Q053L02J1234J0949K352P79K27L586j875P587O263
$$ 32290 36325 45360 45121 56918 64971 65273 76507 87456 89808 90587 90814 94400 92525 100112 106375
11888A06375J812M366N128K746L736R492R604j2416j2483J1451L867r420J642
$$ 106375 108187 112553 117681 120427 124163 133655 143259 130843 118360 129811 133678 124258 125900
11875A25900M989J468j857m954j2315j0581j9047j2786q745j3323p402n820j1551
$$ 125900 130889 132357 130500 125546 113231 102650 83603 70817 62072 48749 41347 35527 23976
11862B3976j098Q715J67l516q081l995p497L274J0784j055p881o766L289M88P612
$$ 23976 22878 31593 31760 28244 20163 16168 8671 11945 22729 21674 13793 7027 10316 10804 18416
11847A8416J991j345O366L525o086m807P603J555r584J399M362m549m580r661
$$ 18416 20407 19062 25428 28953 22867 18060 25663 27218 17634 19033 23395 18846 14266 4605
11833D605K531P931R056L017M533J8658J2743P41K9J4114Q124P289J6733J7850
$$ 4605 7136 15067 24123 27140 31673 50331 63074 63815 63844 77958 86082 93371 110104 127954
11819A27954J1072j525L59J883J227L03m556P603R595K025j6845q243o207j0381
$$ 127954 139026 137501 137860 139743 140970 141273 136717 144320 153915 155940 139095 130852 124645 114264
11805A14264j1910j0402j1760o518n46n717l717q242l428q824L397k810l965M606
$$ 114264 102354 91952 80192 73674 73128 67411 63694 55452 52024 43200 46597 43787 39822 44428
11791D4428j0045r321j3407L790R55j928k23j38p41j26N160l159l221R960K726
$$ 44428 34383 25062 11655 15445 16400 14472 14249 14111 13370 13244 18404 15245 12024 21984 24710
11776B4710n604O420j93r170m54o693j0656Q59J0087J384j912n720q30m391J728
$$ 24710 19106 25526 25333 16163 15709 9016 -1640 -781 9306 10690 8778 3058 2228 -2163 -435
11761d35K625L685q857R620J2128P041r74L3P951O072l53j225n50P453k533m11
$$ -435 2190 5875 -2982 6638 18766 25807 24833 24866 32817 38889 38536 37311 36761 44214 41681 41270
11745D1270p340n590J4356R53m844p892j079P2j2866r922K428P741Q833j1280
$$ 41270 33930 28340 42696 43649 38805 30913 29834 29906 17040 7118 9546 17287 26120 14840
11731A4840j1141J952J758q94l595N35l224K176M465Q933J0250J952L466j880
$$ 14840 3699 5651 7409 6515 2920 3455 231 2407 6872 15805 26055 28007 31473 29593
11717B9593J993R06n657j2210j587J39M168p363j313L447L360J667n687m655p213
$$ 29593 31586 32492 26835 14625 13038 13177 17345 9982 8669 12116 15476 17143 11456 6801 -412
11702d12p825k82l147M737R592Q077n918p207P925M829l732l418m188j989J2380
$$ -412 -8237 -8519 -11666 -6929 2663 10740 4822 -2385 5540 10369 6637 3219 -969 -2958 9422
11687I422J1388j596o883q411j518K361J113r69l301j873l548K858q035k403p44
$$ 9422 20810 19214 12331 3920 2402 4763 5876 4907 1606 -267 -3815 -957 -8992 -11395 -12139
11672a2139L566N117L188N119O486J900l521m822l731l469k629K853R134N447
$$ -12139 -8573 -3456 -268 4851 11337 13237 9716 4894 1163 -2306 -4935 -2082 7052 12499
11658A2499k103o31k637o02R4R20k597p543n6j812j46J825J644J356Q654l563
$$ 12499 10396 9765 7128 6526 6620 7540 4943 -2600 -2656 -4468 -4614 -2789 -1145 211 8865 5302
11642E302j813m238M086R138O810r863k325K930m291r829K042R339K942q094K451
$$ 5302 3489 -749 3337 12475 19285 9422 7097 10027 5736 -4093 -2051 7288 10230 2136 4587
11627D587k588n484m330K168o032K22R092O060M135J6697O076p963j683n547L44
$$ 4587 1999 -3485 -7815 -5647 -11679 -11457 -2365 3695 7830 24527 30603 22640 20957 15410 15754
11612A5754j0914n3m231k507p11k722K923n047O321O824j579k702M909O921m861
$$ 15754 4840 4787 556 -1951 -2662 -5384 -2461 -7508 -1187 5637 4058 1356 6265 13186 8325
11597H325m530o384K809M606L344J945Q770k36k871l081n151J752Q564P844o033
$$ 8325 3795 -2589 220 4826 8170 10115 18885 18649 15778 12697 7546 9298 17862 25706 19673
11582A9673O518j810q505k750J222l908n667J0949l293j5449l150O831R767R667
$$ 19673 26191 24381 15876 13126 14348 10440 4773 15722 12429 -3020 -6170 661 10428 20095
11568B0095N836Q83j924m152m502O28O654N294n027j0427J109q23L358l727n84
$$ 20095 25931 26814 24890 20738 16236 16864 23518 28812 23785 13358 14467 13644 17002 13275 12691
11553A2691j487K936K146L295L106k209j1959o600P740R890Q332r05L905J303
$$ 12691 11204 14140 16286 19581 22687 20478 8519 1919 9659 19549 27881 26976 30881 32184
11539C2184l878j159J271N581j400n452n09n991r51P309o275r014n254R38k415
$$ 32184 28306 27147 28418 33999 32599 27147 26638 20647 19696 27005 20730 11716 6462 7400 4985
11524D985m411K487Q702R804r18O162P321k867l783r812o565L413R607O628K673
$$ 4985 574 3061 11763 21567 20649 26811 34132 31265 27482 17670 11105 14518 24125 30753 33426
11509C3426K241M078n915n615k240m61J255L475o854j0230p326j727J967N343
$$ 33426 35667 39745 33830 28215 25975 25514 26769 30244 23390 13160 5834 4107 6074 11417
11495A1417j459o241l155K661o771M71M878j440O838L139J1621R46n293o843m992
$$ 11417 9958 3717 562 3223 -3548 -3077 1801 361 7199 10338 21959 22905 17612 10769 5777
11480E777O215M896o161N876M636k636Q9M586j52P399K021p894j1053q85m998
$$ 5777 11992 16888 10727 16603 21239 18603 18692 23278 23126 30525 32546 24652 13599 12714 7716
11465G716M279Q290N89k914n368O257l90l428q29n830o971o459K546M371P036
$$ 7716 11995 20285 20874 17960 12592 18849 18459 15031 14202 8372 1401 -5058 -2512 1859 8895
11450H895O621L546J0772L84l788q475J80n399J933q48l260L769J778p81M812
$$ 8895 15516 19062 29834 30218 26430 17955 18135 12736 14669 13821 10561 14330 16108 15327 20139
11435B0139q41j882O108P087k111l169n95k536k071j162m889m921L573Q025j485
$$ 20139 19298 17416 23524 30611 28500 25331 24736 22200 20129 18967 14078 9157 12730 20755 19270
11420A9270m235l465M017J617p949q702k284K681J156M744r72L077N66P120N095
$$ 19270 15035 11570 15587 17204 9255 553 -1731 950 2106 6850 5878 8955 9521 16641 21736
11405B1736k708n790m830j308Q649K272M914j376J429o39L777n893m216O13J844
$$ 21736 19028 13238 8408 7100 15749 18021 22935 21559 22988 22349 26126 20233 16017 16630 18474
11390A8474l632j834N174O397q069j628r738j969l155J645Q990R609Q724N888
$$ 18474 14842 13008 18182 24579 16510 14882 5144 3175 20 1665 10655 20264 28988 34876
11376C4876j2117m415J456J0048L191o279o35m53p422j0298k742K30p65K112L072
$$ 34876 22759 18344 19800 29848 33039 26760 26125 25672 18250 7952 5210 5440 4675 6787 9859
11361I859L068O404K911l945N175L016q6r103K202l956J561n395k64K273R239
$$ 9859 12927 19331 22242 18297 23472 26488 26402 17299 19501 15545 17106 11711 11447 13720 22959
11346B2959Q204J139M178L761k404J8617J2799K0159K7625K1661J2328O68q695
$$ 22959 31163 32302 36480 40241 37837 56454 69253 89412 117037 138698 151026 151694 142999
11333A42999n500j4180j8064j3491k0779j2944m425K332n800l61k197M221K124
$$ 142999 137499 123319 105255 91764 70985 58041 53616 55948 50148 49787 47590 51811 53935
11320E3935q272o281K315j97j6613r835j749R984J2733P063K124N33N470m385
$$ 53935 45663 39382 41697 41500 24887 15052 13303 23287 36020 43083 45207 45740 51210 46825
11306D6825l150q884j6118o333M41k080m280L631J7343K3683K2116L2632K1701
$$ 46825 43675 34791 18673 12340 12781 10701 6421 10052 27395 51078 73194 105826 127527
11293A27527J4342K375q478K405q769r853j1597j3438j6871q85J009M288j292
$$ 127527 141869 144244 135766 138171 129402 119549 107952 94514 77643 76758 77767 82055 80763
11280H0763K619l986P078J3246J0017J4164K1140J8205J8269L3488L9676K9923
$$ 80763 83382 79396 86474 99720 109737 123901 145041 163246 181515 215003 254679 284602
11268B84602K1953J0059l64N718J5931L5951Q2381J42470K35423L78248N12496
$$ 284602 306555 316614 316250 321968 337899 373850 456231 598701 834124 1212372 1724868
11257A724868M58863J55894j59956k62865k56634l24207l61565k95465j89185
$$ 1724868 2183731 2339625 2179669 1916804 1660170 1335963 974398 678933 489748
11248D89748j12863p1516m7162l6483l1843j8849j2654j8960o974o1k458m31k576
$$ 489748 376885 305369 258207 221724 189881 171032 158378 139418 132444 132383 129925 129494 126918
11235A26918O265K53q018o998P674J8090J7378J9478K2030K3090J4045j2574k9026
$$ 126918 133183 133436 125418 118420 126094 144184 161562 181040 203070 226160 240205 227631 198605
11222A98605k3598l1539k5914j1394j2982q017k13o773n800l662L781R910m01
$$ 198605 175007 143468 117554 106160 93178 85161 84948 78175 72375 68713 72494 82404 82003
11209H2003J748q324j0641J171O556K535p337n864N315m367r78K80l419j0331
$$ 82003 83751 75427 64786 65957 72513 75048 67711 61847 67162 62795 61817 62097 58678 48347
11195D8347J409R024L235L62N922Q47K95l870p535K153J0676R815P253L272o830
$$ 48347 49756 58780 62015 62377 68299 69146 69441 65571 58036 60189 70865 80680 87933 91205 84375
11180H4375m70p734l308n693P668m150l250n67o514O297j936l526k78q051N186
$$ 84375 83905 76171 72863 67170 74838 70688 67438 66871 60357 66654 64718 61192 60914 52863 58049
11165E8049j159q11J3345J7128J1798j357k334M746o750k0150k0776j5031j7091
$$ 58049 56890 56079 69424 86552 98350 96993 94659 99405 92655 72505 51729 36698 19607
11152A9607k6431j5718k165Q219M925J0681Q479J0198J7565J0086K68J704K986
$$ 19607 -6824 -22542 -24707 -16488 -11563 -882 7597 17795 35360 45446 45714 47418 50404
11139E0404J1792P308M634n173L117N057j1684j9454o547k16P142P05M155N367
$$ 50404 62196 69504 74138 68965 72082 77139 65455 46001 39454 39238 46380 47085 51240 56607
11125E6607J95m06n65M84m38k737m313J4382J0933K150L564n973o727M121P139
$$ 56607 56802 56396 55831 56315 55877 53140 48827 63209 74142 76292 79856 73883 67156 71277 78416
11110G8416M068J0978J3055O489J3646J4040L025J3839J4388N163l456n410o678
$$ 78416 82484 93462 106517 113006 126652 140692 143717 157556 171944 177107 173651 168241 161563
11097A61563m372O943J2135k064o148P044J2606k433l974J025q186k312n609M287
$$ 161563 157191 164134 176269 174205 168057 175101 187707 185274 181300 182325 174139 171827 166218 170505
11083A70505O584n258N35j9808n119n123m527q29M694J5969K371J049l718l474
$$ 170505 177089 171831 172366 152558 147439 142316 137789 136960 141654 157623 159994 161043 157325 153851
11069A53851O32P89l306p54j2477j0410l565J0858J0726o758j250J636J4M173
$$ 153851 154483 155272 151966 151212 138735 128325 124760 135618 146344 139586 138336 139972 139986 144159
11055A44159J5391K9591K2230K4654M1294N3080M4657K8951O832J1271P494j8254
$$ 144159 159550 189141 211371 236025 277319 330399 375056 404007 410839 422110 429604 411350
11043D11350k0458j1885k7328m6419l7517k7251k7322l2287q675N406P884R366
$$ 411350 390892 379007 351679 305260 267743 240492 213170 180883 172208 177614 185498 194864
11031A94864J7857m498j0428j0878j8584r742n366l706m974n975K696m218q475
$$ 194864 212721 208223 197795 186917 168333 158591 153225 149519 144545 138570 141266 137048 128573
11018A28573L716J0457R507k225M879p972j5236M853M491N551q066j1055Q491
$$ 128573 132289 142746 152253 150028 154907 146935 131699 136552 141043 146594 138528 127473 135964
11005A35964O91p663n482k3706j6789p024J1199J629k65K889L186M925J4355K527
$$ 135964 136655 128992 123510 99804 83015 75991 87190 88819 88554 91443 94629 99554 113909 116436
10991A16436q635l399j231l045Q2J5997J2627R522J9236J0454q635R28J225K580
$$ 116436 107801 104402 103171 100126 100208 116205 128832 138354 157590 168044 159409 160337 161562 164142
10977A64142L847Q222J2785R369J77M731P797J6614K3497L0264K7563l37p617
$$ 164142 167989 176211 188996 198365 198542 203273 211070 227684 251181 281445 309008 308671 301054
10964C01054l159p320k2353k2406k357p2J9900J4512Q409J3770K3369K2562K4830
$$ 301054 297895 290575 268222 245816 243459 243387 263287 277799 286208 299978 323347 345909 370739
10951C70739N2292Q7751Q5985N5512K1848K4313O9034P8008K1716q7400j14368
$$ 370739 423031 510782 596767 652279 674127 698440 767474 845482 867198 779798 665430
10940F65430o7220l9521k0239l0730j8124l319Q884m577o803o434k849N461J0497
$$ 665430 598210 558689 538450 507720 489596 486277 495161 490584 483781 477347 474498 479959 490456
10927D90456J2665J7026N235j0741j1004k973M021M654J0231J6785N585J866Q822
$$ 490456 503121 520147 525382 514641 503637 500664 504685 509339 519570 536355 541940 543806 552628
10914E52628K3390K0042J4316K8241L2746L2442K8345L2111K5558K2950J8014
$$ 552628 576018 596060 610376 638617 671363 703805 732150 764261 789819 812769 830783
10903H30783J7227J9932K3905M2306N3354N7754N7234O6506Q4158P9095O2949
$$ 830783 848010 867942 891847 934153 987507 1045261 1102495 1169001 1253159 1332254 1395203
10892A395203M7106L4031K9969K9383L3714M0576N7480P4080J13826J56501J72860
$$ 1395203 1442309 1476340 1506309 1535692 1569406 1609982 1667462 1741542 1855368 2011869 2184729
10881B184729J70557J87009K06069K11271K39411K75766L29900M00162N35447
$$ 2184729 2355286 2542295 2748364 2959635 3199046 3474812 3804712 4204874 4740321
10872D740321P15813P58306N19677K13514J40228K65612L26725L90463O01352
$$ 4740321 5456134 6214440 6734117 6947631 7087859 7353471 7680196 8070659 8672011
10863H672011R19981J236031J557504J929450K463010L278095M467652O232500
$$ 8672011 9591992 10828023 12385527 14314977 16777987 20056082 24523734 30756234
10855C0756234R175910J4209040K2585644L6156567N7195622Q2931937R2769517
$$ 30756234 39932144 54141184 76726828 112883395 170079017 253010954 345780471
10848C45780471N8216426l771739m0817547m2486313m7525056o4226258o2605292
$$ 345780471 403996897 400225158 359407611 316921298 269396242 205169984 142564692
10841A42564692m4361127k7531391j6961418j1020688p615492n450133m053299
$$ 142564692 98203565 70672174 53710756 42690068 35074576 29624443 25571144
10834B5571144l160281k499746j958843j530560j188845r21029p09508n03256
$$ 25571144 22410863 19911117 17952274 16421714 15232869 14311840 13602332 13099076
10826A3099076k76476r5063k26128o02123q45202q36898p91667q30862q07940
$$ 13099076 12822600 12727537 12501409 11899286 11054084 10217186 9425519 8594657 7786717
10817G786717o64655m95653l86723l01192k30310j93131j87571j95219j87697
$$ 7786717 7122062 6626409 6239686 5938494 5708184 5515053 5327482 5132263 4944566
10808D944566j94814k03239k07567k02314j96764j70062j41105j17222r0107o8184
$$ 4944566 4749752 4546513 4338946 4136632 3939868 3769806 3628701 3511479 3421372 3353188
10798C353188n3448m1693k9624k2496k6657j9797l633J5460L2154N0073P9005
$$ 3353188 3299740 3258047 3228423 3205927 3179270 3159473 3155840 3171300 3203454 3253527 3332532
10787C332532J02170J29197J40211Q0853l9989j44330k17920k53882k45126k06313
$$ 3332532 3434702 3563899 3704110 3784963 3744974 3600644 3382724 3128842 2883716 2677403
10777B677403j83075j68942j44858j23242j21468j16039r5840p2618o2087o9154
$$ 2677403 2494328 2325386 2180528 2057286 1935818 1819779 1723939 1651321 1589234 1520080
10767A520080m7452l3095l1035m2422m4093m5171m3340k9760l0469j6600j3445
$$ 1520080 1472628 1439533 1408498 1366076 1321983 1276812 1233472 1203712 1173243 1156643 1143198
10756A143198j3577k3185m266K7037K6859L1617J3200l633O799J3462k0610q4749
$$ 1143198 1129621 1106436 1102170 1129207 1156066 1187683 1200883 1197250 1204049 1217511 1196901 1112152
10744A112152j13185j01480p0383m4613m5598m5536k3017q424r570j5697j7115
$$ 1112152 998967 897487 827104 782491 736893 691357 668340 659916 650346 634649 617534
10733F17534j1898j4060j6366q389L264r433j4038k4342j7607j7879q821k023
$$ 617534 605636 591576 575210 566821 570085 560652 546614 522272 504665 486786 477965 475942
10721D75942p163m553J917J2943J5933k643j5564j9840j0889j8677j6227l101
$$ 475942 468779 464226 466143 479086 495019 492376 476812 456972 446083 427406 411179 408078
10709D08078J0131J5303J1990K1236J4300J7052J4300N281j9799k5707r409j9714
$$ 408078 418209 433512 445502 466738 481038 498090 512390 517671 497872 472165 462756 443042
10697D43042j9422l824m265p34K247J0521J9372K0182P150k325j0283p805N4M886
$$ 443042 423620 419796 415531 414797 417044 427565 446937 467119 474269 471944 461661 453856 453910 458796
10683D58796k3053m3493m4588l2807k6288k4632j4314m130l439J2778R507j649
$$ 458796 435743 392250 347662 314855 288567 263935 249621 245491 242052 254830 264337 262688
10671B62688j6567p039j3429j2071j3837j6295j8763J747J6669K0619J9099J2250
$$ 262688 246121 239082 225653 213582 199745 183450 164687 166434 183103 203722 222821 235071
10659B35071J4160J4826o721J313p304j4265m821J0708r747j7241j5879k2045
$$ 235071 249231 264057 257336 258649 251345 237080 232259 242967 233220 215979 200100 178055
10647A78055j5192j2007p146L488O527K1846L0900M5753L3506K2477K0824J8786
$$ 178055 162863 150856 143710 147198 153725 175571 206471 252224 285730 308207 329031 347817
10635C47817k433j1131l1369m2012l4702l2670k6698j7642p456N75K876J0081
$$ 347817 345384 334253 302884 260872 226170 193500 166802 149160 141704 142279 145155 155236
10623A55236K7699J7282P709p871q802r180j9809j8424p661j4650j7736q735j0423
$$ 155236 182935 200217 207926 200055 191253 182073 162264 143840 136179 121529 103793 95058 84635
10610H4635l112o308j3605k674J2254P501n521P107k93M82M808J37K722l240n137
$$ 84635 81523 75215 61610 58936 71190 78691 73170 80277 79984 80466 85274 85411 88133 84893 79756
10595G9756R080L695J523l286j8110q892q548o712o195M703j440J1661O124m609
$$ 79756 88836 92531 94054 90768 72658 63766 55218 48506 42311 47014 45574 57235 63359 58750
10581E8750q543j2420K713j341J185N153L271l69p084O77J192N397J177K546r201
$$ 58750 50207 37787 40500 39159 40344 45497 48768 48399 41315 41992 43184 48581 49758 52304 43103
10566D3103K988R541J0211K530K274P891J1197k716j4938l833r280n613O405j558
$$ 43103 46091 55632 65843 68373 70647 78538 89735 87019 72081 68248 58968 53355 59760 58202
10552E8202j313J683M367J3907M556J2786J8077J804m389j2757k4449k2685k3058
$$ 58202 56889 58572 62939 76846 81402 94188 112265 114069 109680 96923 72474 49789 26731
10539B6731j5275j6861j1022J320L179l144L046O414K0213J9648N754l072j345
$$ 26731 11456 -5405 -16427 -15107 -11928 -15072 -12026 -5612 14601 34249 40003 36931 35586
10526C5586M810J412j0936m400P830J4551Q203J1786J4935J7468N632l638J3753
$$ 35586 40396 41808 30872 26472 34302 48853 57056 68842 83777 101245 106877 103239 116992
10513A16992j0915o368J63k942k0874k0981r680m709Q22l972j467k760m865j210
$$ 116992 106077 99709 99872 96930 76056 55075 45395 40686 41508 37536 36069 33309 28444 27234
10499B7234L146J559O62K17r38j306j656j962j0722j208j203P823P931K161P48
$$ 27234 30380 31939 32601 32818 31880 30574 28918 26956 16234 15026 13823 21646 29577 31738 32486
10484C2486M673j970n436R967J2360K049j546l223O78M302J2965K5158L1127R923
$$ 32486 37159 35189 29753 39720 52080 54129 52583 49360 50038 54340 67305 92463 123590 133513
10470A33513J3206J0919P09j052j1857k0344k6761k3531q076r361j7767n760N442
$$ 133513 146719 157638 158347 157295 145438 125094 98333 74802 66726 57365 39598 33838 39280
10457C9280K025R679N180j121P68O592L058K194Q393L984K183J3083J7662J9554
$$ 39280 41305 50984 56164 55043 55811 62403 65461 67655 76048 80032 82215 95298 112960 132514
10443A32514K9508L3762N7516Q7875J28931J89753K88878M29300N09057L75967
$$ 132514 162022 195784 253300 341175 470106 659859 948737 1378037 1887094 2263061
10433B263061M1049k08394k57893k79025l55271l44292k51505j54867r1344o0339
$$ 2263061 2304110 2095716 1837823 1558798 1203527 859235 607730 452863 361519 301180
10423C01180m3659l4818l9074k6643j6181k2211j3658q342n239l873k304l270
$$ 301180 257521 222703 183629 156986 140805 118594 104936 96594 91355 87482 85178 81908
10411H1908o472L667j336j164o697p108q107l790M175O465M344o537l63J0675
$$ 81908 75436 79103 77767 76603 69906 62798 54691 50901 55076 61541 65885 59348 58985 69660
10397F9660J8694K3369J3823M629l003k295k630r342j6007q272j3659j6505p928
$$ 69660 88354 111723 125546 130175 127172 124877 122247 112905 96898 88626 74967 58462 50534
10384E0534K531n421j480l492n679R004o047m594j0978L645p99q923N431Q751
$$ 50534 53065 47644 46164 42672 36993 45997 39950 35356 24378 28023 27224 18301 23732 32483
10370C2483J5485L070m502o84o011k859m480J549l842K450J1284R537L918o351
$$ 32483 47968 51038 46536 45852 39841 36982 32502 34051 30209 32659 43943 53480 57398 51047
10356E1047l483j0017j524j536p862Q32p87N288P479J6360J654j256l328k866
$$ 51047 47564 37547 36023 34487 26625 27457 26670 31958 39437 55797 57451 56195 52867 50001
10342E0001M558o254r486q91O817j951J385q32L309j3339M957p965n097j679j3275
$$ 50001 54559 48305 38819 37928 44745 42794 44179 43347 46656 33317 38274 30309 25212 23533 10258
10327A0258J0453M605j21k240l72n850J315Q787q914Q01R802k516L523j524J29
$$ 10258 20711 25316 25195 22955 22583 16733 18048 26835 17921 18722 28524 26008 29531 28007 28136
10312B8136K100n094K636Q11M352p605n822o76m756N651N293n384Q99p55n195
$$ 28136 30236 25142 27778 28589 32941 25336 19514 18838 14082 19733 25026 19642 20541 19786 14591
10297A4591P308j958m587M752P739J1001n004j1321l74O215n297q756j849J1936
$$ 14591 21899 19941 15354 20106 27845 38846 33842 22521 22147 28362 23065 14309 12460 24396
10283B4396J047p246J617K409R665K781p631J324j254N450k361m451N243j805
$$ 24396 25443 18197 19814 22223 31888 34669 27038 28362 27108 32558 30197 25746 30989 29184
10269B9184n329Q695N509l548O19N68P36P550j0208j0242R870J9762k442o356
$$ 29184 23855 32550 38059 34511 35130 35698 36434 43984 33776 23534 33404 53166 50724 44368
10255D4368j1005l378P377K245N290K409r711O93p083j447J0855N540O03j113
$$ 44368 33363 29985 37362 39607 44897 47306 37595 38288 31205 29758 40613 46153 46756 45643
10241D5643K593Q563J3485L139j2347j0805l684m963j2609J6295J1052R552K697
$$ 45643 48236 56799 70284 73423 61076 50271 46587 41624 29015 45310 56362 65914 68611
10228F8611l662J541m738q22M136K816J0647R203K263J1220P848l647o187O154
$$ 68611 64949 66490 61752 60930 65066 67882 78529 87732 89995 101215 109063 105416 99229 105383
10214A05383K584j814n747J150R895J4009j192J809J1191j442L777J0432J1283
$$ 105383 107967 106153 100406 101556 111451 125460 124268 126077 137268 135826 139603 150035 161318
10201A61318O811J0705J0137L168O40K042K0879J4719J3016J7436J2115J4764
$$ 161318 168129 178834 188971 192139 192779 194821 215700 230419 243435 260871 272986 287750
10189B87750J6876J5986J6511J8221K0907L5412L0749L0957M2230M7448M1688
$$ 287750 304626 320612 337123 355344 376251 411663 442412 473369 515599 563047 604735
10178F04735M0155N7533P0243P4976Q5457Q5127J15545J23908J30777J61793J82604
$$ 604735 644890 702423 772666 847642 933099 1018226 1133771 1257679 1388456 1550249 1732853
10167A732853J82989K03925J97864J93821J79018J65152J04526O3550J2960l8869
$$ 1732853 1915842 2119767 2317631 2511452 2690470 2855622 2960148 3023698 3036658 2997789
10157B997789q8361j29889j66265j88649j96770j88462j89393j81426j50997j39701
$$ 2997789 2909428 2779539 2613274 2424625 2227855 2039393 1850000 1668574 1517577 1377876
10147A377876j29476j10563q3812p5453o7843p2088o4732n3234n3983m3409m6549
$$ 1377876 1248400 1137837 1054025 978572 910729 838641 773909 720675 666692 623283 576734
10136E76734m3578m0681l2946j4134k6196k4735k7857k0383p191j8526k5821j1082
$$ 576734 533156 492475 459529 445395 419199 394464 366607 346224 339033 320507 294686 283604
10124B83604j0926j1067j7702o293n615j0583k0508m038o34j135j0226r073o006
$$ 283604 272678 261611 243909 237616 232001 221418 200910 196872 196238 195103 184877 175804 169798
10111A69798O080n102j4220j0845N282J4014j444k1108j0762m050K25l17m820
$$ 169798 175878 170776 156556 145711 150993 165007 163563 142455 131693 127643 127868 127551 122731
10098A22731r458M08K177j0472p229k50n282R403l996q003m399R727K184l042
$$ 122731 113273 113681 115858 105386 98157 97907 92625 102028 98032 90029 85630 95357 97541 94499
10084I4499m763m048K012l125J555m836j083m877l253o117r827N1po53O886R704
$$ 94499 89736 85688 87700 84575 86130 81294 80211 75334 72081 65964 56137 56188 56181 55528 62414 72118
10068G2118N123o864j1612k01J752L71j0015j941J3287Q732J33j1118r645M750
$$ 72118 77241 70377 58765 58564 60316 60687 50672 48731 62018 70750 70883 59765 50120 54870
10054E4870l623M20n905O257J3278M54o714r58n03J2002k74j368l140K724J6092
$$ 54870 51247 51667 45762 52019 65297 65751 59037 58079 57576 69578 69304 67936 64796 67520 83612
10039H3612R819N527m96N21R666Q454K745N264J0906K4926M4559N5535O3272J12289
$$ 83612 93431 98958 98462 98983 108649 117103 119848 125112 136018 160944 205503 261038 324310 436599
10025D36599J95891L37759N80661Q30778O89592J3795m40930l44988k86932n15562
$$ 436599 632490 970249 1550910 2381688 3071280 3085075 2644145 2299157 2012225 1496663
10015A496663n08036l21152j85187j11905o9345n7022m0499k7112k2082k2247
$$ 1496663 988627 667475 482288 370383 301038 244016 203517 176405 154323 132076
10005A32076n575k461o407l941p758N84r6p070j3523p046j163p447j1746L60J280
$$ 132076 126501 124040 117633 113692 105934 106518 106422 99352 85829 78783 77620 70173 58427 58787 60067
9990F0067l533L362q375k674m101L892P357J232m087r71n694r715m561K687K276
$$ 60067 56534 59896 51521 48847 44746 48638 55995 57227 53140 52169 46475 36760 32199 34886 37162
9975C7162r036m637p531q453P195J3168J106j417K199j62P978o407p088L701P900
$$ 37162 28126 23489 15958 7505 14700 27868 28974 27557 29756 29594 37572 31165 24077 27778 35678
9960C5678O393N447j1639m384R18m63M72N8L568K285M228p358m051j280q211p723
$$ 35678 42071 47518 35879 31495 32413 31950 32422 32480 36048 38333 42561 35203 31152 29872 21661 13938
9944A3938n561L552J1746J2173M843r564j4507J996N502K295n591k124o73M190
$$ 13938 8377 11929 23675 35848 40691 31127 16620 18616 24118 26413 20822 18698 18025 22215
9930B2215N472R107J3685O070o781q893l512J894m911l665q419r724P954J2570
$$ 22215 27687 36794 50479 56549 49768 40875 37363 39257 34346 30681 22262 12538 20492 33062
9916C3062L387k117n427p141n477j272P250P54j2792k497L832o73M912L677r517
$$ 33062 36449 34332 28905 21764 16287 15015 22265 23019 10227 7730 11562 10889 15801 19478 9961
9901I961r97Q434M338q594M388K438n693K613P698R166J6671K1790P370q273j0615
$$ 9961 8964 17398 21736 13142 17530 19968 14275 16888 24586 33752 50423 72213 79583 71310 60695
9886F0695j5789k141j0658p865L037L880n709o48l342j157Q786k901n321o75k804
$$ 60695 44906 42765 32107 24242 27279 31159 25450 24802 21460 20303 29089 26188 20867 20192 17388
9871A7388m485l993K557J961o043M162J547j386M667n997R32O467J633Q117m244
$$ 17388 12903 8910 11467 13428 7385 11547 13094 11708 16375 10378 11310 17777 19410 27527 23283
9856B3283k122l441m320L850L93m523M625P031l399q361n364K3K155o078J1320
$$ 23283 21161 17720 13400 17250 17643 13120 17745 24776 21377 13016 7652 7675 9830 3752 15072
9841A5072N44r667L730n799n481N134K698J057L81l609k390O190n22l80k084O943
$$ 15072 15616 5949 9679 3880 -1601 3533 6231 7288 7669 4060 1670 7860 7338 6958 4874 11817
9825A1817L996J648J936M564J5513J0126J899j1507j4570l930r59n654n096N453
$$ 11817 15813 17461 19397 23961 39474 49600 51499 39992 25422 21492 20533 14879 9783 15236
9811A5236o610p921N314K286l546k075N024L883n877L171L197m175l572m302P602
$$ 15236 8626 705 6019 8305 4759 2684 7708 11591 5714 8885 12082 7907 4335 33 7635
9796G635M514m614M111R093M48j0143n663j151O501n360K192J982j3854p634J525
$$ 7635 12149 7535 11646 20739 21187 11044 5381 4230 10731 5371 7563 9545 -4309 -11943 -10418
9781a0418j246M532R873M715o698j8N396o516n253P47P061m87P623l580r815m38
$$ -10418 -11664 -7132 2741 7456 758 740 6136 -380 -5633 -4886 2175 1688 9311 5731 -4084 -4522
9765d522Q763K183Q714R950l81k415K411M123P239j2571n692l087P226N995q471
$$ -4522 4241 6424 15138 25088 24707 22292 24703 28826 36065 23494 17802 14715 21941 27936 19465
9750A9465k606M691r801n580j405N321R79m523N180K234o675k791o198p37o714
$$ 19465 16859 21550 11749 6169 4764 10085 11064 6541 11721 13955 7280 4489 -1709 -2446 -9160
9735i160n489J3251q70k509p132P114l327K089M737L065N689m89p913m822J270
$$ -9160 -14649 -1398 -2268 -4777 -11909 -4795 -8122 -6033 -1296 1769 7458 6969 -944 -5766 -4496
9720d496P849N701M293K322m895k584l464j89p188O127O986j90q429p099J365
$$ -4496 3353 9054 13347 15669 10774 8190 4726 4537 -2651 3476 10462 10272 1843 -5256 -3891
9705c891q077L282j628M273O078J195n034j712N449J0567P425j1083j12P20N65
$$ -3891 -11968 -8686 -10314 -6041 37 1232 -3802 -5514 -65 10502 17927 6844 6732 7452 8017
9690H017J67J161K252j051p280p988J397j554P137Q829M531M173k773o025o22
$$ 8017 8184 9345 11597 10546 3266 -4722 -3325 -4879 2258 11087 15618 19791 17018 10993 10371
9675A0371m013j6286l1J523L314k744J617J28q636m256J7J1942Q966k377p414
$$ 10371 6358 -9928 -9959 -8436 -5122 -7866 -6249 -6121 -14757 -19013 -18996 -7054 1912 -465 -7879
9660g879L922Q989M019n398r201k729Q38O968J413k47p215q76Q537O032P608j168
$$ -7879 -3957 5032 9051 3653 -5548 -8277 -7439 -471 942 695 -6520 -7396 1141 7173 14781 13613
9644A3613m736q874J366J272K019p826m028k492K515Q589m01o26n342L577P552
$$ 13613 8877 3 1369 2641 4660 -3166 -7194 -9686 -7171 1418 1017 391 -4951 -1374 6178
9629F178k567L50M320l847l801N160N41M72N90r971o243N572J2788L109M39r746
$$ 6178 3611 3961 8281 4434 633 5793 6334 6806 7396 -2575 -8818 -3246 9542 12651 13090 3344
9613C344j3766J896J0047K202r80k998m248j991o212N801M405n625j717J763K54
$$ 3344 -10422 -8526 1521 3723 2743 -255 -4503 -6494 -12706 -6905 -2500 -8125 -9842 -8079 -7825
9598g825K394K23O987L47O474l54l480n349j267M80O920m507l546M019l329J107
$$ -7825 -5431 -5208 1779 2126 8600 8246 4766 -583 -1850 -1370 5550 1043 -2503 1516 -1813 -706
9582g06R100K447O557P798o244n701L35o384j1080n842J1704Q691O071j888j1146
$$ -706 8394 10841 17398 25196 18952 13251 13586 7202 -3878 -9720 1984 10675 16746 14858 3712
9567C712o718k121l549J5055Q200j626o387K250L118j929k726J916l907Q430O975
$$ 3712 -3006 -5127 -8676 6379 14579 12953 6566 8816 11934 10005 7279 9195 5288 13718 20693
9552B0693k648k45o606j3295l571M021J0519R87n765m782P633K988j009N093m170
$$ 20693 18045 17800 11194 -2101 -5672 -1651 8868 9855 4090 -692 6941 9929 8920 14013 9843
9537I843j2091J115J699J1490K60n03J524j6497n048J102K460L494L441P66L2
$$ 9843 -2248 -1133 566 12056 12316 11813 13337 -3160 -8208 -7106 -4646 -1152 2289 3055 3087
9522C087O054L130r914N450m18j536L61n553K649l95J20k202L703k786j877m822
$$ 3087 9141 12271 2357 7807 7389 5853 6214 661 3310 2915 3035 833 4536 1750 -127 -4949
9506d949J524j0862l655J1411R878N865k262j253k284J56m530r431m223M969J9212
$$ -4949 -3425 -14287 -17942 -6531 3347 9212 6950 5697 3413 3569 -961 -10392 -14615 -9646 9566
9491I566n43J146M083N213P032j5207q592l508N653l800j493P798m357p661L82
$$ 9566 9023 10169 14252 19465 26497 11290 2698 -810 4843 1043 -450 7348 2991 -4670 -4288
9476d288J56n843j311R385J3046M500l469J78k135j6701n643Q555L862Q058p48
$$ -4288 -4132 -9975 -11286 -1901 11145 15645 12176 12354 10219 -6482 -12125 -3570 292 8350 7602
9461G602m552J2652p29j0217k279l450J044l566J809J2068J2178l860p998N843
$$ 7602 3050 15702 14973 4756 2477 -973 71 -3495 -1686 10382 22560 18700 10702 16545
9447A6545P980J171l207M230j771m395j950k292j0904q46R9J572K717k123q63
$$ 16545 24525 25696 22489 26719 24948 20553 18603 16311 5407 4561 4660 6232 8949 6826 5963
9432E963k807m101n01L923R84O79J787Q03J355M199j644j2802q666n17j071Q142
$$ 5963 3156 -945 -1446 2477 3461 4140 5927 6730 8085 12284 10640 -2162 -10828 -11345 -12416 -4274
9416d274J959k095M232P745m772K800M683O218j963j35m346j0306j794J4182K631
$$ -4274 -2315 -4410 -178 7567 2795 5595 10278 16496 14533 14398 10052 -254 -2048 12134 14765
9401A4765j2288J408N332m1M063j893m599j2333L56K722O802N70J327M20p915
$$ 14765 2477 3885 9217 9176 13239 11346 6747 -5586 -5230 -2508 4294 4864 6191 6611 -1304
9386a304o113l48n211P590j375k98L745P474P65r518j660K4L455L309J33L168
$$ -1304 -7417 -7765 -12976 -5386 -6761 -7059 -3314 4160 4925 -4593 -6253 -6229 -2774 535 668 3836
9370C836o161n592N753J1117N368n629q58k399k899n086N122j231K69j0171p733
$$ 3836 -2325 -7917 -2164 8953 14321 8692 7834 5435 2536 -2550 2572 1341 1610 -8561 -16294
9355a6294P188J0865N655J908M014J973J944j895p544j5546q277K696Q31O317
$$ -16294 -9106 1759 7414 9322 13336 15309 17253 15358 7814 -7732 -16009 -13313 -12482 -6165
9341f165J289l513m893K508l181O059L38m777m96O728k74O648N501j0266l116
$$ -6165 -4876 -8389 -13282 -10774 -13955 -7896 -7558 -12335 -12831 -6103 -6377 271 5772 -4494 -7610
9326g610l088L486Q453O86l6L193J60O893R057n837O453J431j6939j5864l020
$$ -7610 -10698 -7212 1241 1927 1891 5084 5244 12137 21194 15357 21810 23241 6302 -9562 -12582
9311a2582L795J1102M085l914n298p974O379P328N293Q521L215K514k047p757
$$ -12582 -8787 2315 6400 2486 -2812 -10786 -4407 2921 8214 16735 19950 22464 20417 12660
9297A2660o979M640J352j992o187j125J078j709J0022L519Q80n890J491j286n096
$$ 12660 5681 10321 11673 9681 3494 2369 3447 1738 11760 15279 16159 10269 11760 10474 5378
9282E378L535O66K903j2134l357k06p73N800R167J776j2145r969K673L000k217
$$ 5378 8913 9579 12482 348 -3009 -3215 -3988 1812 10979 12755 610 -9359 -6686 -3686 -5903
9267e903P312M257J270o760j060O696o461j1343j868j801j864Q6J3965P270l672
$$ -5903 1409 5666 6936 176 -884 5812 -649 -11992 -13860 -15661 -17525 -17439 -3474 3796 124
9252A24N717L733l986n704k818j727m127l348Q320Q359N45K423m098q025J453
$$ 124 5841 9574 5588 -116 -2934 -4661 -8788 -12136 -3816 4543 5088 7511 3413 -4612 -3159
9237c159K694J2206j4l948L216j376r478p220r447N055P348k983J225l764J1978
$$ -3159 -465 11741 11727 7779 10995 9619 141 -7079 -16526 -11471 -4123 -7106 -5881 -9645 2333
9222B333O071N244k473L929K763n638m41L11q657n486O657J029m599q753m845
$$ 2333 8404 13648 11175 15104 17867 12229 11788 12099 3442 -2044 4613 5642 1043 -7710 -12555
9207a2555Q057O061n99k123K318Q775L012o674n308P325M464mK87j512J805o731
$$ -12555 -4498 1563 964 -1159 1159 9934 12946 6272 964 8289 12753 12749 13036 11524 13329 6598
9191F598l863K838R347O748r532k101K988J966R003R29q564J51n300r803L879
$$ 6598 2735 5573 14920 21668 12136 10035 13023 14989 23992 24921 16357 16508 11208 1405 5284
9176E284M147R28K032J841j870k115J48J002o100J011L011n504K111k621L871
$$ 5284 9431 10359 12391 14232 12362 10247 10395 11397 5297 6308 9319 3815 5926 3305 7176
9161G176Q204r683n848k287M626J2439Q809M807O180j0047q713Q104O597L660
$$ 7176 15380 5697 -151 -2438 2188 14627 23436 28243 34423 24376 15663 23767 30364 34024
9147C4024p803O417N363J2879o333k0360j0927l8J256j1819p034K679N554k345
$$ 34024 26221 32638 38001 50880 44547 24187 13260 13222 14478 2659 -4375 -1696 3858 1513
9133A513l686K502l111l922p066J659M592N919j417p388K37K25O216R222L437
$$ 1513 -2173 329 -2782 -6704 -13770 -12111 -7519 -1600 -3017 -10405 -10168 -9943 -3727 5495 8932
9118H932l521J26L775n451j0301J105J841R024J0436L848Q271R445L164P97m813
$$ 8932 5411 5537 9312 3861 -6440 -5335 -3494 5530 15966 19814 28085 37530 40694 41491 36678
9103C6678m162r501j2729r173o2L497O242J42n861m504k544M036Q264P887Q62
$$ 36678 32516 23015 10286 1113 1051 4548 10790 10932 5071 567 -1977 2059 10323 18210 19072
9088A9072l557j210n114o838n295m328Q27M863N613N329m205r679J784K067k344
$$ 19072 15515 14305 9191 2353 -2942 -7270 -6443 -1580 4033 9362 5157 -4522 -2738 -671 -3015
9073c015J0230K851k218P59J373K81n951j0147K240L092L996N310J523K295o36
$$ -3015 7215 10066 7848 8607 9980 10261 4310 -5837 -3597 -505 3491 8801 10324 12619 11983
9058A1983r067L330J2620k06J261j0631L530Q563J731k568r752j319R960l604
$$ 11983 2916 6246 18866 18660 19921 9290 12820 21383 23114 20546 10794 9475 19435 15831
9044A5831j1810m284J2425L373k470n241m701o387Q526O149l901o65j1556j0004
$$ 15831 4021 -263 12162 15535 13065 7824 3123 -3264 5262 11411 7510 6845 -4711 -14715
9030a4715L276J1632N073K556o26p174r61k027N278K86N874p740n926m103o83
$$ -14715 -11439 193 5266 7822 7196 22 -939 -2966 2312 2598 8472 732 -5194 -9297 -9980
9015i980K363k637N492K779o75P748P845K368L080O246K734j0125j0253P10M522
$$ -9980 -7617 -10254 -4762 -1983 -2658 5090 12935 15303 18383 24629 27363 17238 6985 7695 12217
9000A2217K395K187J985J753o890M605J532K175q597o037k7M923J611n451j833
$$ 12217 14612 16799 18784 20537 13647 18252 19784 21959 13362 7325 7298 12221 13832 8381 6548
8985F548R00O854J962l920l686j37J1083O931m968m757o954L738m315r550n437
$$ 6548 7448 14302 16264 12344 8658 8521 19604 26535 21567 16810 9856 13594 9279 -271 -5708
8970e708M325Q741M148P55r197Q536l195P668r11l014p21K736q35J15J0887o785
$$ -5708 -1383 7358 11506 12261 3064 11600 8405 16073 15162 12148 11427 14163 13328 13443 24330 17545
8954A7545K483l215j4585o859J1484J3205M5j039o577p243m515n279O912M004
$$ 17545 20028 16813 2228 -4631 6853 20058 20103 19064 12487 5244 729 -4550 2362 6366
8940F366J16R703N428Q33k584p75Q077N016l242j2463j163k577m771k10k71n56
$$ 6366 6482 16185 21613 22446 19862 19087 27164 32180 28938 16475 15312 12735 7964 7754 7483 6927
8924F927N561l597m677J38J1153J2740m924j2693K127L566l423L233p752j221
$$ 6927 12488 8891 4214 4352 15505 28245 23321 10628 12755 16321 12898 16131 8379 7158
8910G158k279j369q65J801J0149r960p250O702J597O111O06m410o716j220L037
$$ 7158 4879 3510 2645 4446 14595 4635 -2615 4087 5684 11795 12401 7991 1275 55 3092
8895C092J372k43O505L977J365l168O951M930j471J1094Q998Q941L171j8725j5639
$$ 3092 4464 4221 10726 14703 16068 12900 19851 24781 23310 34404 43402 52343 55514 36789 21150
8880B1150j0593k76L791N549L061o038q786m140M407k028P35J1030J0141r305
$$ 21150 10557 10281 14072 19621 22682 16644 7858 3718 8125 6097 6832 17862 28003 18698
8866A8698j7153o840P504N401J2424r52n654n345J178O560J0004K363j695n112
$$ 18698 1545 -5295 2209 7610 20034 19082 13428 8083 9261 15821 25825 28188 26493 21381
8852B1381K761N938j615J823K372M515J500p073l934l55r1M313P506J278j388
$$ 21381 24142 30080 28465 30288 32660 37175 38675 31602 27668 27313 27222 31535 39041 40319 38931
8837C8931k153j400k916L45M88M183m092q388r757J1939k308L51P823j565p659
$$ 38931 36778 35378 32462 32807 33295 37478 33386 24998 15241 27180 24872 25223 33046 31481 23822
8822B3822J330k423n726L95k265L544K074M06p266j892M378J173L822N047M893
$$ 23822 25152 22729 17003 17398 15133 18677 20751 21157 13891 11999 16377 17550 21372 26419 31312
8807C1312J2185J3589P932O68p480j5293k227k906j2336p856l111r96Q387M560
$$ 31312 43497 57086 65018 65686 58206 42913 40686 37780 25444 17588 14477 13481 21868 26428
8793B6428J819l652j1526p518J0279Q594p499k224O962M308k687m299L171k565
$$ 26428 28247 24595 13069 5551 15830 24424 16925 14701 21663 25971 23284 18985 22156 19591
8779A9591p297k437p980N860J3569Q819K441n647l787j665l402k246M012n214
$$ 19591 12294 9857 1877 7737 21306 30125 32566 26919 23132 21467 18065 15819 19831 14617
8765A4617L030N862l260K695o320m537m198M037J1029J371M527m948m962k237
$$ 14617 17647 23509 20249 22944 16624 12087 7889 11926 22955 24326 28853 23905 18943 16706
8751A6706J014j5135k161R559N018n037Q154q452r064r183J4018N107j968K024
$$ 16706 17720 2585 424 9983 15001 9964 18118 9666 602 -8581 5437 10544 8576 10600
8737A0600k940R351M785p777j2298l955O093J3377L820l10j4559p90L557N288
$$ 10600 7660 17011 21796 14019 1721 -2234 3859 17236 21056 20746 6187 5397 8954 14242
8723A4242p727j015K748k449r876j873L477J069J0694N856q438l777l455N27J214
$$ 14242 6515 5500 8248 5799 -4077 -5950 -2473 -1404 9290 15146 6708 2931 -524 3 1217
8708A217n563P906Q425j573K435j039j598l097K231L0K584j067m835L862l391
$$ 1217 -4346 3560 11985 10412 12847 11808 10210 7113 9344 9374 11958 10891 6056 9918 6527
8693F527M576J1722K79P632l045q931J226P643j2512k157N234n145j341l848O717
$$ 6527 11103 22825 23104 30736 27691 18760 19986 27629 15117 12960 18194 13049 11708 7860 14577
8678A4577K627K161j408l441o940n092L198O553O044o056k217k870P29j900N645
$$ 14577 17204 19365 17957 14516 7576 2484 5682 12235 18279 12223 10006 7136 7865 5965 11610
8663A1610q60o624N582R726J0201O496m376n568r722K9j0147r488K942R205m471
$$ 11610 10750 4126 9708 19434 29635 36131 31755 26187 16465 16494 6347 -3141 -199 9006 4535
8648D535l947J1813J0846N814k091L373n84l865O08n678j0451L239J998M510r823
$$ 4535 588 12401 23247 29061 26970 30343 29759 25894 26502 20824 10373 13612 15610 20120 10297
8633A0297m449K156j569R46J0502m136j0542j297M759P544q52J152P752Q494n29
$$ 10297 5848 8004 6435 7381 17883 13747 3205 1908 6667 14211 13359 14511 22263 30757 30228
8618C0228n018O738J509M693J750k893q432m28j0849l535k696N747J576O167N36
$$ 30228 25210 31948 33457 38150 39900 37007 28575 28147 17298 13763 11067 16814 18390 24557 25093
8603B5093J1632J7067M853p616o606l252O772J1457p314n934K629r720n249k482
$$ 25093 36725 53792 58645 51029 44423 41171 47943 59400 52086 46152 48781 39061 33812 31330
8589C1330k492L311P618P184k225J074l162q057M498M937M377J687J733J2562
$$ 31330 28838 32149 39767 46951 44726 45800 42638 34581 39079 44016 48393 50080 51813 64375
8575F4375R475P019R130L437M595O450j7265n093R29L245J158k385j0603K462
$$ 64375 73850 80869 89999 93436 98031 104481 87216 82123 83052 86297 87455 85070 74467 76929
8561G6929j0546j0970K787q76j786o877r929L870P913n53l308L119k142j0243
$$ 76929 66383 55413 58200 57324 55538 48661 38732 42602 50515 49962 46654 49773 47631 37388
8547C7388j7246K925Q714j239r255k104m022p27K523J095J955k149q549q298r90
$$ 37388 20142 23067 31781 30542 21287 19183 15161 14434 16957 18052 20007 17858 9309 1011 21
8532B1J3760J787K367R885J1363q190o833L960J9495Q903q409j0513m2K468m515
$$ 21 13781 15568 17935 27820 39183 30993 24160 28120 47615 56518 48109 37596 37554 40022 35507
8517C5507j1476o477K873J245j965M287p788J126R397O927L252o176O5K974j995
$$ 35507 24031 17554 20427 21672 19707 23994 16206 17332 26729 33656 36908 30732 30797 33771 31776
8502C1776k418k885p030J0085j424P81j820p383n801P932O914J2936J0454J2840
$$ 31776 29358 26473 19443 29528 28104 28885 27065 19682 13881 21813 28727 41663 52117 64957
8488F4957P984K951O599L192l99j0810m577p414p258j5684q353L855Q945J448
$$ 64957 72941 75892 82491 85683 85284 74474 69897 62483 55225 39541 31188 35043 43988 45436
8474D5436n98M729Q893k188q911n301R961J2820q95j0665m150l251L390j723j2747
$$ 45436 44838 49567 58460 56272 47361 42060 52021 64841 63946 53281 49131 45880 49270 47547 34800
8459C4800l673K111R109M743n725o613q107o644R294R239Q618Q606J828p22j467
$$ 34800 31127 33238 42347 47090 41365 34752 26645 20001 29295 38534 47152 55758 57586 56864 55397
8444E5397j0543k283N962L981q883k29K1620K1945J6684K8472N3227Q7058R6831
$$ 55397 44854 42571 48533 52514 43631 43402 65022 86967 103651 132123 185350 272408 369239
8431C69239Q6807N3885L935l5225n2287o9717p6518n7606m4943l2939j7934j3465
$$ 369239 456046 509931 513866 478641 426354 356637 280119 222513 177570 144631 126697 113232
8419A13232k2499j3318j423m934q09K149o256l617j0615K116M235p115M452K146
$$ 113232 90733 77415 75992 71058 70249 72398 66142 62525 51910 54026 58261 51146 55598 57744
8405E7744P61O250o243m669Q098J202J451J0150L303O812R291R049J3139J5956
$$ 57744 58505 64755 58512 53843 61941 63143 64594 74744 78047 84859 94150 103199 116338 132294
8391A32294K7201N1747J00934J27866J83023K19678J65482K3041q6535j20196
$$ 132294 159495 211242 312176 440042 623065 842743 1008225 1031266 944731 824535
8381H24535j15933j40237j50103j05796p3933m9339k8066k6225r671j3812j6615
$$ 824535 708602 568365 418262 312466 238533 189194 161128 134903 125232 111420 94805
8370I4805j6974j659k16J380m04n169j2699J906O166O079l842l222N70M060j0353
$$ 94805 77831 76172 75956 77336 76932 71763 59064 60970 67136 73215 69373 66151 66721 70781 60428
8355F0428q895J311j368k760j18K911J354N749J7010R366J5232M2422N7286O6935
$$ 60428 51533 52844 51476 48716 48598 51509 52863 58612 75622 84988 100220 142642 199928 266863
8341B66863Q8628Q5362M3849j3332l7949m4704o2239p2840o3067m8067k2571k8206
$$ 266863 355491 440853 484702 471370 433421 388717 326478 253638 190571 142504 119933 91727
8329I1727k0076p991o569j35M880l964j94K209p32l434o986M550p041j2835n561
$$ 91727 71651 63660 57091 56956 61836 57872 57678 59887 59155 55721 48735 53285 46244 33409 27848
8314B7848l653K592k8p541j0670j782o961J468J0782M658K270N74o877j1646l720
$$ 27848 24195 26787 26759 19218 8548 6766 -195 1273 12055 16713 18983 19557 12680 1034 -2686
8299b686R335P015P461j011m907m780N056P944k857K518L188q04n231n705J78
$$ -2686 6649 13664 21125 20114 15207 10427 15483 23427 20570 23088 26276 25472 20241 14536 14714
8284A4714l049K539K327Q50L768L269p590q675n252L10J0459Q459M94l066L995
$$ 14714 11665 14204 16531 17381 21149 24418 16828 8153 2901 3211 13670 22129 22623 19557 23552
8269B3552J289j5335J362J547q175L215n835n852r78K473K116K660j898j1958
$$ 23552 24841 9506 10868 12415 4240 7455 1620 -4232 -5210 -2737 -621 2039 141 -11817
8255a1817J2365J3968n169M472J782o464l332L748P794J824m597l752j4213m219
$$ -11817 548 14516 9347 13819 15601 9137 5805 9553 17347 19171 14574 10822 -3391 -7610
8241g610M582J0630r40n954M122j771M054Q114Q259L178j3643o881M966p483p390
$$ -7610 -3028 7602 6662 708 4830 3059 7113 15227 23486 26664 13021 6140 11106 3623 -3767
8226c767O300O457J909l824L176r414l749j2613j203J2057J826m99O757J961l454
$$ -3767 2533 8990 10899 7075 10251 837 -2912 -15525 -16728 -4671 -2845 -3344 3413 5374 1920
8211A920n192L987m916o48l076L14M782N148J612J741O248Q06m412l571l716K786
$$ 1920 -3272 715 -4201 -4849 -7925 -7611 -2829 2319 3931 5672 11920 12726 8314 4743 1027 3813
8195C813k062j606N43J35P508q169m075O161Q845J608q839o360O510j920P44N193
$$ 3813 1751 145 688 823 8331 162 -3913 2248 11093 12701 3862 -2498 4012 2092 2836 8029
8179H029J572O760l95K929k813n748j1635K208L540L878n663K964o345p974M46
$$ 8029 9601 16361 15966 18895 16082 10334 -1301 907 4447 8325 2662 5626 -719 -8693 -8247
8164h247M834J766j694Q940n075j937j911P169J774j408O57L729K774o105j74
$$ -8247 -3413 -1647 -3341 5599 524 -1413 -3324 3845 5619 4211 4868 8597 11371 5266 5092
8149E092Q46l840k983K781K292L868m78p474q34j0175L185R730O75k951P52n695
$$ 5092 5938 2098 -885 1896 4188 8056 7578 104 -730 -10905 -7720 2010 2685 -266 486 -5209
8133e209p217Q68L670j103n004L751J5904P973j881j2290j0119o174Q808J1917
$$ -5209 -12426 -11558 -7888 -8991 -13995 -10244 5660 13633 11752 -538 -10657 -16831 -8023 3894
8119C894K085n961n46M36N520r818j4163O919J891p630N390l923q47R033O727
$$ 3894 5979 18 -528 -92 5428 -4390 -18553 -11634 -9743 -17373 -11983 -15906 -16753 -7720 -993
8104i93L300Q410j601r24M55r689n183J0138n285j2609O664M239K737Q260J457
$$ -993 2307 10717 9116 8192 8647 -1042 -6225 3913 -1372 -13981 -7317 -3078 -341 7919 9376
8089I376M693l636j839j07n724o966k38k638o609L964J2480M789j4932K068Q387
$$ 9376 14069 10433 8594 8487 2763 -4203 -4441 -7079 -13688 -9724 2756 7545 -7387 -5319 3068
8074C068L071L037p817o831P872J5030L677K644J5R612J630R97J200j516k879
$$ 3068 6139 9176 1359 -5472 2400 17430 21107 23751 23766 33378 35008 36005 37205 35689 32810
8059C2810p281m84J916j0311r540o809m772k886J201N301R85p135J39J3500O053
$$ 32810 25529 25045 26961 16650 7110 301 -4471 -7357 -6156 -855 130 -7005 -6866 6634 12687
8044A2687K587J43m948O876R7p00j5575p476L066J0456L34L008N692O51n894J662
$$ 12687 15274 15417 10469 17345 17442 16742 1167 -6309 -3243 7213 7547 10555 16247 16898 11004 12666
8028A2666J2641j313K282J5431Q06m269N966J2877k871O37n192q070j0989j286
$$ 12666 25307 23994 26276 41707 42513 38244 44210 57087 54216 54853 49661 41591 30602 29316
8014B9316O417r936j2670j566O466L682r17l40k219M798m632K89J610j782p598
$$ 29316 35733 25797 13127 11561 18027 21709 20792 20452 18233 23031 18399 18688 20298 18516 10918
7999A0918p176K592K502M075m379j876p416J0549J5440P591q426o57j530P350
$$ 10918 3742 6334 8836 12911 8532 6656 -760 9789 25229 32820 24394 23737 22207 29557
7985B9557m72n2Q253k336j814j429m043l478m721M250N688P494n718q231N305
$$ 29557 29085 29033 37286 34950 33136 31707 27664 24186 19465 23715 29403 36897 31179 22948 28253
7970B8253J416o033j1490M240q9K953K541J591o839j0682L463K325J578l687R92
$$ 28253 29669 23636 12146 16386 16297 19250 21791 23382 16543 5861 9324 11649 13227 9540 10532
7955A0532J030J867Q491R918m155j5225j565R944p857o513P749J439m256M092
$$ 10532 11562 13429 21920 31838 27683 12458 10893 20837 12980 6467 14216 15655 11399 15491
7941A5491J2550O48j710J2645J0806l180q438j1508j2639K256Q055J0262J486
$$ 15491 28041 28689 26979 39624 50430 47250 38812 27304 14665 16921 24976 35238 36724
7928C6724J926j727p391L202l694L963J632J319P412m486r873L7k205J142n76
$$ 36724 38650 36923 29532 32734 29040 33003 34635 35954 43366 38880 29007 29044 26839 27981 27405
7913B7405J246j060k634R929M132R233r253j7338l042K232Q720Pr616j0549J5640
$$ 27405 28651 27591 24957 34886 39018 48251 38998 21660 18618 20850 29570 29577 19961 9412 25052
7898B5052J1844O209O03p346N634P218N239m739j1147o977o480k041J3807O71
$$ 25052 36896 43105 43708 36362 41996 49214 54453 49714 38567 31590 25110 23069 36876 37547
7884C7547q598p498m26l813L9M064O860O687q722O11n405j979L187J394K888m381
$$ 37547 28949 21451 21025 17212 17251 21315 28175 34862 26140 26751 21346 19367 22554 23948 26836 22455
7868B2455n35J659N222n373J695P600n055j062l580j5039o412k077J232N711j053
$$ 22455 21920 23579 28801 23428 25123 32723 27668 26606 23026 7987 1575 -502 730 6441 5388
7853E388Q703M609J411k501q38l52o679l572L706R84q284k870O622L47j503Q589
$$ 5388 14091 18700 20111 17610 16772 16420 9741 6169 9875 10859 2575 -295 6327 6674 5171 13760
7837A3760k179l615n133K55K222K84r75J134Q297J1627O730p239n691q684m522
$$ 13760 11581 7966 2833 3088 5310 5594 4619 5753 14050 25677 32407 25168 19477 10793 6271
7822F271k25k569k584M76R37N613K459J353j592k084N396L30m342p596p823J892
$$ 6271 6046 3477 893 1369 2306 7919 10378 11731 10139 8055 13451 13781 9439 1843 -5980 -4088
7806d088O427j638j945m473j0997M084N823l856M752J0841Q105k173n741l736
$$ -4088 2339 701 -1244 -5717 -16714 -12630 -6807 -10663 -5911 4930 13035 10862 5121 1385
7792A385M8r250K470Q672m638n387L247J535l054j071l038k074J305j448M597
$$ 1385 1433 -7817 -5347 3325 -1313 -6700 -3453 -1918 -4972 -6043 -9081 -11155 -9850 -11298 -6701
7777f701K786J698L999J814R515Q89j2921j233m776n183P425P927k793k01O858
$$ -6701 -3915 -2217 1782 3596 13111 14000 1079 -154 -4930 -10113 -2688 5239 2446 2245 9103
7762I103J625m356o468j337r103l641J496L820K986R062P927p240j7775K058J632
$$ 9103 10728 6372 -96 -1433 -10536 -14177 -12681 -8861 -5875 3187 11114 3874 -13901 -11843 -10211
7747a0211p509M924M945m093M164Q185l392L370O587q27q869O265P655o460J672
$$ -10211 -17720 -12796 -7851 -11944 -7780 405 -2987 383 6970 6143 -2726 3539 11194 4734 6406
7732F406p369O924K192j9243r570M699L989j314n314n122k450R348J769m246J2852
$$ 6406 -963 5961 8153 -11090 -20660 -15961 -11972 -13286 -18600 -23722 -26172 -16824 -15055 -19301 -6449
7717f449L959P93K865m310J498J589j370L146j358P2j213R87n534J209k922l66
$$ -6449 -2490 -1697 1168 -3142 -1644 -55 -1425 1721 363 435 -778 209 -5325 -4116 -7038 -7404
7701g404N455k214M688K036J279o79j01L584P529K875M90J209l385r659j4468
$$ -7404 -1949 -4163 525 2561 3840 3161 3060 6644 14173 17048 17538 18747 15362 5703 -8765
7686h765n369K271O741k19k410q34R750N222j0198k541l425K279n9l30L282k519
$$ -8765 -14134 -11863 -5122 -5341 -7751 -8585 1165 6387 -3811 -6352 -9777 -7498 -7557 -7887 -4605 -7124
7670g124l76j178P552P71K911K787j169q399m443N353M432Q277j50p31n406j2390
$$ -7124 -7500 -8678 -1126 -355 2556 5343 4174 -4225 -8668 -3315 1117 9394 9244 8513 3107 -9283
7654i283q703j543N96N685O44J2351M230P77k914j0550J919K886j406l750PK427
$$ -9283 -17986 -19529 -18933 -13248 -12604 -253 3977 4754 1840 -8710 -6791 -3905 -5311 -9061 -9054 -6627
7638f627R710J6943k048j910n034n518o171M466Q706P500J952j2799p727m284
$$ -6627 3083 20026 17978 16068 11034 5516 -655 3811 12517 20017 21969 9170 1443 -2841
7624b841k916M948Q628j1229o377o21j36k991L980n25n074Q205Q257L106J819
$$ -2841 -5757 -809 7819 -3410 -9787 -10408 -10544 -13535 -9555 -10080 -15154 -6949 1308 4414 6233
7609F233J77l029k278M419m451p180Q61J2795j0501k582J167N870l677M028m845
$$ 6233 6410 3381 1103 5522 1071 -6109 -5248 7547 -2954 -5536 -4369 1501 -2176 1852 -2993
7594b993n338Q95n64j603J532m142P476r12l89j0315r371P994j950K787L485p28
$$ -2993 -8331 -7436 -8000 -9603 -8071 -12213 -4737 -5649 -6038 -16353 -25724 -17730 -19680 -16893 -13408 -14136
7578a4136P561o904l713o554M646Q897J352o80R90j0861j4622O887J1711p48N782
$$ -14136 -6575 -13479 -17192 -23746 -19100 -10203 -8851 -9531 -8541 -19402 -34024 -27137 -15426 -16174 -10392
7563a0392o150L645j888p053M005J1535J0413l478q657j874L854o710j1691q891
$$ -10392 -16542 -12897 -14785 -21838 -17833 -6298 4115 637 -8020 -9894 -6040 -12750 -24441 -33332
7549c3332J2580O017K445J681j2855q288J531k15M867P658R10M424P908l898n935
$$ -33332 -20752 -14735 -12290 -10609 -23464 -31752 -30221 -30436 -25569 -17911 -17001 -12577 -4669 -8567 -14502
7534a4502j9547o951J6930J0951O82o460r943K76J4330J2336j911l276l114J732
$$ -14502 -34049 -41000 -24070 -13119 -12437 -18897 -28840 -28564 -14234 -1898 -3809 -7085 -10199 -8467
7520h467P501R056m44o624O675j0156r922J983J3153Q289l844j0460J830Q797
$$ -8467 -966 8090 7646 1022 7697 -2459 -12381 -10398 2755 11044 7200 -3260 -1430 7367
7506G367J759j0203j2935k676M236J3175o758j6232m543R146N37m004N445P665
$$ 7367 9126 -1077 -14012 -16688 -12452 723 -6035 -22267 -26810 -17664 -17127 -21131 -15686 -8021
7492h021J2376J178o747n313N87P558J1349J010r846p924m179l614K781j899n468
$$ -8021 4355 5533 -1214 -6527 -5940 1618 12967 13977 4131 -3793 -7972 -11586 -8805 -10704 -16172
7477a6172P147L324l957j0856j111P258q43O720L640M61L520l721P33J0392k899
$$ -16172 -9025 -5701 -9658 -20514 -21625 -14367 -15210 -8490 -4850 -4389 -869 -4590 -3857 6535 3636
7462C636j1762K295M665j0656p257K405N716O745j194j892L676O821l379R90P49
$$ 3636 -8126 -5831 -1166 -11822 -19079 -16674 -10958 -4213 -5407 -7299 -3623 3198 -181 809 1558
7447A558p556j265p944p832O97m67m511J3087J4666J768j6416m564J5636J1514
$$ 1558 -5998 -7263 -15207 -23039 -22342 -22809 -27320 -14233 433 2201 -14215 -18779 -3143 8371
7433H371k378J324p50l295n281k131N92p392j0197L637J015j1241M036R134R097
$$ 8371 5993 7317 6567 3272 -2009 -4140 -3548 -10940 -21137 -17500 -16485 -27726 -23690 -14556 -5459
7418e459M717k771j589O508P512J043o635l305o129k18L393j084r924N7J0617
$$ -5459 -742 -3513 -5102 1406 8918 9961 3326 21 -6108 -6326 -2933 -4017 -13941 -13884 -3267
7403c267p9m719L77L163j14j822K986J62J965l385k961R43k469K394N083M63M834
$$ -3267 -3346 -8065 -7688 -4525 -4639 -6461 -3475 -3313 -1348 -4733 -7694 -6751 -9220 -6826 -1743 -1280 3554
7386C554P038J720o652j4638l695O174k08o610o962j046O144O690N329l70N823
$$ 3554 10592 12312 5660 -8978 -12673 -6499 -6707 -13317 -20279 -21325 -15181 -8491 -3162 -3532 2291
7371B291q023j1260L574K861l62k472Q448k285n915L903L919M097M10P92m416
$$ 2291 -5732 -16992 -13418 -10557 -10919 -13391 -4943 -7228 -13143 -9240 -5321 -1224 -814 -22 -4438
7356d438p029j208P808K322j021K383J289j2201q01M206l831p44n16J510J998
$$ -4438 -11467 -12675 -4867 -2545 -3566 -1183 106 -12095 -12896 -8690 -12521 -13265 -13781 -12271 -10273
7341a0273L667J948N31Q990J139j0498k565L039J245j769j2279p564Q957J6693
$$ -10273 -6606 -4658 -4127 4863 6002 -4496 -7061 -4022 -2777 -4546 -16825 -24389 -15432 1261
7327A261o85o592M016O047m825k352p3n512N118m584R42J2560K253j0773l590
$$ 1261 576 -6016 -2000 4047 -778 -3130 -3203 -8715 -3597 -8181 -7239 5321 7574 -3199 -6789
7312f789m28L246l927J861j557P120M616j55k628k894m327J0586K822p33k874
$$ -6789 -7217 -3971 -7898 -6037 -7594 -474 4142 3987 1359 -1535 -5862 4724 7546 6813 3939
7297C939l635Q684P681K997K295p381j3404J308n102k452R607J306n746P158J565
$$ 3939 304 8988 16669 19666 21961 14580 1176 2484 -2618 -5070 4537 5843 97 7255 8820
7282H820p514q34M026l484J395m438j275k486q329n869l314k860M45R548Q133
$$ 8820 1306 472 4498 1014 2409 -2029 -3304 -5790 -14119 -19988 -23302 -26162 -25717 -16169 -8036
7267h036K330K753m399M266R322K784q143k413K294R683J943m332q776J4081o537
$$ -8036 -5706 -2953 -7352 -3086 6236 9020 877 -1536 758 10441 12384 8052 -724 13357 6820
7252F820j0693r606q278P646J1086q68o262l74j680j424q88M017J594J532l688
$$ 6820 -3873 -13479 -21757 -14111 -3025 -3893 -10155 -10529 -12209 -13633 -14521 -10504 -8910 -7378 -11066
7237a1066m592j0756P461O455N904K630j808J604J3692p21j850J269J674k265
$$ -11066 -15658 -26414 -18953 -12498 -6594 -3964 -5772 -4168 9524 8803 6953 8222 9896 7631
7223G631j0758k724M983q23l963m542l115K634L862P59k673K156O088m4K609K316
$$ 7631 -3127 -5851 -868 -1691 -5654 -10196 -13311 -10677 -6815 -6056 -8729 -6573 -485 -529 2080 4396
7207D396r198r313l369O368N77o483J120l586P682J4887j764R48n430o673n019
$$ 4396 -4802 -14115 -17484 -11116 -10539 -17022 -15902 -19488 -11806 3081 1317 2265 -3165 -9838 -14857
7192a4857N06k122k583j0855m325J3662O407J095n590l972Q341M553O556M844
$$ -14857 -14351 -16473 -19056 -29911 -34236 -20574 -14167 -13072 -18662 -22634 -14293 -9740 -3184 1660
7178A660l736l0o77o37m234J626J849RM43J268P002j88q277L478K112K594J11
$$ 1660 -2076 -2106 -2783 -3420 -7654 -6028 -4179 -4170 -3727 -2459 4543 4355 -3922 -444 1668 4262 4373
7161D373p293l489N254L775o41n099m672r136j442P584Q32M143k683Q296L463
$$ 4373 -2920 -6409 -1155 2620 1979 -3120 -7792 -16928 -18370 -10786 -9954 -5811 -8494 -198 3265
7146C265O600j621k902l203J81r94l166o024l804K623l27O622l515q865J035K061
$$ 3265 9865 8244 5342 2139 2320 1326 -1840 -7864 -11668 -9045 -9372 -2750 -6265 -15130 -14095 -12034
7130a2034N478M047P156k370J627J991k012M976l013p250k167p337J709J0322
$$ -12034 -6556 -2509 4647 2277 3904 5895 3883 8859 5846 -1404 -3571 -10908 -9199 1123
7116A123m65j1878m083M828k724M079P058k452r899k933l893R198M29J58p99p79
$$ 1123 658 -11220 -15303 -10475 -13199 -9120 -2062 -4514 -14413 -17346 -21239 -12041 -11612 -11454 -12253 -13032
7100a3032J670L916O452N856m207K062K656p689J030o851p72K954N155p984J578
$$ -13032 -11362 -7446 -994 4862 655 2717 5373 -2316 -1286 -8137 -8909 -5955 -800 -8784 -7206
7085g206M663M907P80l372p542n560M404J256l521O991L261Q4n096j1350L191
$$ -7206 -2543 2364 3144 -228 -7770 -13330 -8926 -7670 -11191 -4200 -939 -855 -5951 -17301 -14110
7070a4110M775m001K12P929N305j0639L431K139k644L340P553M040L115p900L930
$$ -14110 -9335 -13336 -13124 -5195 110 -10529 -7098 -4959 -7603 -4263 3290 7330 10445 2545 6475
7055F475N017p260o788n241k886j870n172O095O30k99Q112n656p411q514O169
$$ 6475 11492 4232 -2556 -7797 -10683 -12553 -17725 -11630 -11000 -11299 -3187 -8843 -16254 -24768 -18599
7040a8599M413n644O977k284M62O694J786J233L356k340P16j653K607L077j089
$$ -18599 -14186 -19830 -12853 -15137 -14675 -7981 -6195 -4962 -1606 -3946 -3230 -4883 -2276 801 -288
7025b88K151j382N507K751l861n343N016m368j3275o131N912j15M965J307k115
$$ -288 1863 481 5988 8739 4878 -465 4551 183 -13092 -19223 -13311 -13426 -8461 -7154 -9269
7010i269l276Q3M971M732N98p78r153r061k466O895J837K177k347n736N005M206
$$ -9269 -12545 -12462 -7491 -2759 -2161 -2939 -12092 -21153 -23619 -16724 -14887 -12710 -15057 -20793 -15788 -11582
6994a1582M254j358o251N882J1570L456O811k172l351l273j0863l11J5689N563
$$ -11582 -7328 -8686 -14937 -9055 2515 5971 12782 10610 7259 3986 -6877 -7188 8501 14064
6980A4064j0366j2007o690m011R812P990m329J572J648o598l658o302P140M463
$$ 14064 3698 -8309 -14999 -19010 -9198 -1208 -5537 -3965 -2317 -8915 -12573 -18875 -11735 -7272
6966g272l882p50M080L567K14o060N64r17k86o867K261R529P625n471l373n869
$$ -7272 -11154 -11904 -7824 -4257 -4043 -10103 -9539 -10456 -10742 -17609 -15348 -5819 1806 -3665 -7038 -12907
6950a2907n477N173O183N395L205K04J381L045k417K527n241J037N562j0817p343
$$ -12907 -18384 -13211 -7028 -1633 1572 1776 3157 6202 3785 6312 1071 2108 7670 -3147 -10490
6935a0490n018l445P169L911k027k106l300M780L014J799r73j1722r046O417J1930
$$ -10490 -15508 -18953 -11784 -7873 -9900 -12006 -15306 -10526 -7512 -5713 -6686 -18408 -27454 -21037 -9107
6920i107L037L153K564J924N44k418p358r237J246N464j1729j003J0361Q31Q066
$$ -9107 -6070 -2917 -353 1571 2115 -303 -7661 -16898 -15652 -10188 -21917 -22920 -12559 -11728 -3662
6905c662K706r93j2495N674M684J212O635r525o76n746l581R35Q613L78K169k05
$$ -3662 -956 -1949 -14444 -8770 -4086 -2874 3761 -5764 -6440 -12186 -15767 -14832 -6219 -5841 -3672 -3877
6889c877j0836p528K920n327q32M409L943J1767Q558l135L780J1167K581p761
$$ -3877 -14713 -22241 -19321 -24648 -25480 -21071 -17128 -5361 3197 62 3842 15009 17590 9829
6875I829q749j004L712m927j289P261p622l067J211L032K910P682j313q274k56
$$ 9829 1080 76 3788 -1139 -2428 4833 -2789 -5856 -4645 -1613 1297 8979 7666 -608 -864
6860h64n125n459P399k58K583N942N746q79n760o22Q69k219N99o213M5n070q69
$$ -864 -5989 -11448 -4049 -4307 -1724 4218 9964 9085 3325 2703 3572 1353 1952 -4261 -4216 -9286 -10155
6843a0155M399n331R86L03J949n622M333N293l907o985N14l935L495n319p661
$$ -10155 -5756 -11087 -10101 -9798 -7849 -13471 -9138 -3845 -7752 -14737 -14223 -18158 -14663 -19982 -27643
6828b7643Q441N722N887L74j416L471m56P865j939o010M98Q8K637L918n529p521
$$ -27643 -19202 -13480 -7593 -7219 -8635 -5164 -5620 2245 306 -5704 -5206 -5118 -2481 1437 -4092 -11613
6812a1613n75L440m486L840L975K795J719p64m466l022N62p088m071M975L388
$$ -11613 -12188 -8748 -13234 -9394 -5419 -2624 -905 -1669 -6135 -9157 -8595 -15683 -19754 -14779 -11391
6797a1391K601p004j978m907p75Q288R423Q364q176J851L850M169j776o218j1456
$$ -11391 -8790 -15794 -17772 -22679 -23454 -15166 -5743 2621 -5555 -3704 146 4315 2539 -3679 -15135
6782a5135o342O116Q921P55K80K572j010P971l679K448N50l476o823J263o673
$$ -15135 -21477 -15361 -6440 -5685 -5405 -2833 -3843 4128 449 2897 3447 -29 -6852 -5589 -12262
6767a2262J276l699j869r09k083P82M066n634L230Q477k893k131R9M403M352j275
$$ -12262 -10986 -14685 -16554 -17463 -19546 -18764 -14698 -20332 -17102 -8625 -11518 -13649 -13550 -9147 -4795 -6070
6751f070n547n498k761M968P388K373j413K008L183m03n196M915r619m445P094
$$ -6070 -11617 -17115 -19876 -14908 -7520 -5147 -6560 -4552 -1369 -1772 -6968 -2053 -11672 -16117 -9023
6736i023J0243j023k608l430o842j320L733k621L006O226L624o26j256L97n853
$$ -9023 1220 197 -2411 -5841 -12683 -14003 -10270 -12891 -9885 -3659 -35 -661 -1917 -1520 -7373
6721g373L603p276P550L234L010J1169k955n206o755l902p804M481m79P540o53
$$ -7373 -3770 -11046 -3496 -262 2748 13917 10962 5756 -999 -4901 -12705 -8224 -8703 -1163 -1816
6706a816p657K963j356l225j418M020J55o12m81L181j5522r957M053J0079J1077
$$ -1816 -9473 -6510 -7866 -11091 -12509 -8489 -8334 -8946 -9427 -6246 -21768 -31725 -27672 -17593 -6516
6691f516J534p289o704K581O828R039J470k322M86m554j758n030P922K968r919
$$ -6516 -4982 -12271 -18975 -16394 -9566 -527 943 -1379 -893 -5447 -7205 -12235 -4313 -1345 -11264
6676a1264L148J995R09M127O81J649k25k80m643M393m82j611l496p372l463j585
$$ -11264 -8116 -6121 -5212 -1085 -404 1245 1020 740 -3903 490 8 -1603 -5099 -12471 -15934 -17519
6660a7519K467n488L85M359P319J262m312J292j0169L043j074J604J539J788Q07
$$ -17519 -15052 -20540 -20155 -15796 -8477 -7215 -11527 -10235 -20404 -17361 -18435 -16831 -15292 -13504 -12697
6645a2697P47l445J0557M475m631r514n762J811n517P455K239k914j2r42N063
$$ -12697 -11950 -15395 -4838 -363 -4994 -14508 -20270 -18459 -23976 -16521 -14282 -17196 -17208 -18150 -13087
6630a3087K083Q378J25J056k619J053k372J240L302p89M421N795j1476j0184O670
$$ -13087 -11004 -2626 -2501 -1445 -4064 -3011 -5383 -4143 -841 -1630 2791 8586 -2890 -13074 -6404
6615f404J4342L503m751M198J35j0116r469K188N999k696m409J992j055K574L190
$$ -6404 7938 11441 6690 10888 11023 907 -8562 -6374 -375 -3071 -7480 -5488 -6543 -3969 -779
6600g79j358K761L647p059p697k647j132k67k165o047J973P574M11p8l634K908
$$ -779 -2137 624 4271 -2788 -10485 -13132 -14264 -14531 -16696 -22743 -20770 -13196 -12785 -12863 -16497 -13589
6584a3589p04k176J3264M535k21p422k760l51J146O739n55J160o659j032J0027
$$ -13589 -14293 -16469 -3205 1330 1109 -6313 -9073 -9424 -8278 -1539 -2094 -934 -7593 -8625 1402
6569A402j635p360q052j358n62N691n541N72J893M867J0931J923q772m80L115
$$ 1402 -233 -7593 -15645 -17003 -17565 -11874 -17415 -16843 -14950 -10083 848 2771 -6001 -6481 -3366
6554c366P351J45J370n685j0539K488k499j121K137j001M478M169L784M996P212
$$ -3366 3985 4130 5500 -185 -10724 -8236 -10735 -11856 -9719 -10720 -6242 -2073 1711 6707 13919
6539A3919r915j369j764J019r310o659R370L8q077l784p27J5515M654r062o70
$$ 13919 4004 2635 871 1890 -7420 -14079 -4709 -4671 -12748 -16532 -17259 -1744 2910 -6152 -6822
6524f822L603j175O860N97o023M089m549j5518N861J4814N457n961q855j02K632
$$ -6822 -3219 -4394 2466 3063 -2960 1129 -3420 -18938 -13077 1737 7194 1233 -7622 -7724 -5092
6509e092K598k68l608K307n867n815L292K995o193P406j570l160O400k270M396
$$ -5092 -2494 -2762 -6370 -4063 -9930 -15745 -12453 -9458 -15651 -8245 -9815 -12975 -6575 -8845 -4449
6494d449O11j0396p221P311O779l954K405l90r852q520K877Q430N418k11k316
$$ -4449 -3838 -14234 -21455 -14144 -7365 -11319 -8914 -9304 -19156 -27676 -24799 -16369 -10951 -11162 -13478
6479a3478o519R46O683K882p00L076n301k774K913j3498P326P687Q042L070j841
$$ -13478 -19997 -19051 -12368 -9486 -10186 -7110 -12411 -15185 -12272 -25770 -18444 -10757 -2715 355 -1486
6464a486o110K027M315j519K387l325o453m192M882R703P354q504j0649P911J105
$$ -1486 -7596 -5569 -1254 -2773 -386 -3711 -10164 -14356 -9474 229 7583 -921 -11570 -3659 -2554
6449b554j0618L945O8p165L062q55L640j192j906j664J448J331L971j724L588
$$ -2554 -13172 -9227 -9159 -16324 -13262 -14117 -10477 -11669 -13575 -15239 -13791 -12460 -8489 -10213 -6625
6434f625Q46o591q857J347P926O127j769N7L334n2j925J754l377m594K200q010
$$ -6625 -5779 -12370 -21227 -19880 -11954 -5827 -7596 -7539 -4205 -4257 -6182 -4428 -7805 -12399 -10199 -18209
6418a8209k768J536J694N530l46L930n584k087P500K487R172J929q288q10r949
$$ -18209 -20977 -19441 -17747 -12217 -12563 -8633 -14217 -16304 -8804 -6317 2855 4784 -3504 -4314 -14263
6403a4263K988O801n837m628J068o134N885O121l040j041k100n376K460P67R872
$$ -14263 -11275 -4474 -10311 -14939 -13871 -20005 -14120 -7999 -11039 -12080 -14180 -19556 -17096 -16329 -6457
6388f457J5704N874j6156k354N974P180j1419r663L456p19N644L131k445o163
$$ -6457 9247 15121 -1035 -3389 2585 9765 -1654 -11317 -7861 -8580 -2936 195 -2250 -8413
6374h413l166o207p955J4527N968p044J733O113L380o468n214M979l24M537p646
$$ -8413 -11579 -17786 -25741 -11214 -5246 -12290 -10557 -4444 -1064 -7532 -12746 -7767 -8091 -3554 -11200
6359a1200N32P623N671P208J120m48j0670O34J59j3289l072J216K471K649P15
$$ -11200 -10668 -3045 2626 9834 10954 10506 -164 470 629 -12660 -15732 -14516 -12045 -9396 -8681
6344h681O23j437P817K807j0316j870R464J0824o89r463n081j2291k597M134Q432
$$ -8681 -8058 -9495 -1678 1129 -9187 -11057 -1593 9231 8542 -921 -6002 -18293 -20890 -16756 -8324
6329h324J465q78l491K824P390p211J1728J1889l188j0920n819n132J1406P546
$$ -8324 -6859 -7737 -11228 -8404 -1014 -8225 3503 15392 12204 1284 -4535 -9667 1739 9285
6315I285J543k694j0276q751p211l415l645j664r801J3163Q736O337J211q73j184
$$ 9285 10828 8134 -2142 -10893 -18104 -21519 -25164 -26828 -36629 -23466 -14730 -8393 -7182 -8055 -9239
6300i239O215L257J806O97PJ640p274l033L735L688J2359J495k407j899l806o922
$$ -9239 -3024 233 2039 2736 2743 4383 -2891 -5924 -2189 1499 13858 15353 12946 11047 7241 319
6284C19j2452k289J1064m619r814M897R840j530L730J0090j722j5795l468M887
$$ 319 -12133 -14422 -3358 -7977 -17791 -12894 -3054 -4584 -854 9236 7514 -8281 -11749 -6862
6270f862K294L526K960J126q622o907K455r39r165p28L880l252N550L469m72M291
$$ -6862 -4568 -1042 1918 3044 -5578 -12485 -10030 -10969 -20134 -20862 -16982 -20234 -14684 -11215 -11687 -7396
6254g396N406J260j963J252R950L137k199M96j2851j0777O62N574n235K236P314
$$ -7396 -1990 -730 -2693 -1441 8509 11646 9447 9943 -2908 -13685 -13023 -7449 -12684 -10448 -3134
6239c134m77n817o07J537k183N31N430j961l540R866L025p356n907r111k840L455
$$ -3134 -3611 -9428 -10035 -8498 -10681 -10150 -4720 -6681 -10221 -355 2670 -4686 -10593 -19704 -22544 -19089
6223a9089L117J244J472O093L37l510j271O286k381n950J0688P436J768O680q604
$$ -19089 -15972 -14728 -13256 -7163 -6826 -10336 -11607 -5321 -7702 -13652 -2964 4472 6240 12920 4316
6208D316j0159L581N801K333J812l672q630J004K063o055k742J2077P579N973
$$ 4316 -5843 -2262 3539 5872 7684 4012 -4618 -3614 -1551 -7606 -10348 1729 9308 15281
6194A5281l941p955j3081j84M687Q593J39K213R389l423k0728O51N082N14K634
$$ 15281 11340 3385 -9696 -9880 -5193 3400 3539 5752 15141 11718 -9010 -8359 -3277 -2763 -129
6179a29k222p790P004J321K524n003j0108M246j547J712j218L531J648k253l86
$$ -129 -2351 -10141 -3137 -1816 708 -4295 -14403 -10157 -11704 -9992 -11210 -7679 -6031 -8284 -8670
6164h670r840n419J333J098P311J2397o516K818L570j986p329l850k309l010J0090
$$ -8670 -18510 -23929 -22596 -21498 -14187 -1790 -8306 -5488 -1918 -3904 -11233 -15083 -17392 -20402 -10312
6149a0312K839m641M185J1104k296j625k338l358o770j031Q989l999K281l674
$$ -10312 -7473 -12114 -7929 3175 879 -746 -3084 -6442 -13212 -14243 -5254 -9253 -6972 -10646
6135a0646k823k860k35M42K405k256J528N82J3898R904o157n394P30k405K359
$$ -10646 -13469 -16329 -16564 -16122 -13717 -15973 -14445 -13863 35 9939 3782 -1612 -882 -3287 -928
6120i28l336r546O088M696J131K863L937k119k926n406J525m465l943M979Q683
$$ -928 -4264 -13810 -7722 -3026 -1895 968 4905 2786 -140 -5546 -4021 -8486 -12429 -7450 1233
6105A233O043q264j3825m868J6700k357j5503m625K799M653L115P429k963l06
$$ 1233 7276 -988 -14813 -19681 -2981 -5338 -20841 -25466 -22667 -18014 -14899 -7470 -10433 -10739
6091a0739k41j6072m525J5499J2598j17k40J211L330L071o926o771J277L338o133
$$ -10739 -10980 -27052 -31577 -16078 -3480 -3597 -3837 -2626 704 3775 -3151 -9922 -8645 -5307 -11440
6076a1440l529K179N628K816m569j274M96J028M961n130Q788L78r31M717N289
$$ -11440 -14969 -12790 -7162 -4346 -8915 -10189 -9693 -8665 -3704 -8834 -46 332 -599 4118 9407
6061I407l261j0038M840o45l838k779j0552K917J0006J060o099p995M717J3681
$$ 9407 6146 -3892 948 303 -3535 -6314 -16866 -13949 -3943 -2883 -8982 -16977 -12260 1421
6047A421K598k741N383r96r281q317o236M491J150P05j805j61L498l486L289Q288
$$ 1421 4019 1278 6661 5665 -3616 -11933 -18169 -13678 -12528 -11823 -13628 -13789 -10291 -13777 -10488 -2200
6031b200j294p90K163q21M24n897k11n452K868J1401l207n376n159O773O774p004
$$ -2200 -3494 -4284 -2121 -2942 -2518 -8415 -8626 -14078 -11210 191 -3016 -8392 -13551 -6778 -4 -7008
6015g008l365M019p69Q652l374j8242L03j781J967R140N245j2240j794J179Q746
$$ -7008 -10373 -6354 -7123 1529 -1845 -20087 -19784 -21565 -19598 -10458 -5213 -17453 -19247 -18068 -9322
6000i322P0j427j2835o118K585M893P150J054P996M464p361L553K742M868P978
$$ -9322 -9252 -10679 -23514 -29632 -27047 -22154 -15004 -13950 -5954 -1490 -8851 -5298 -2556 2312 10290
5985A0290K383j2463j1299K491L231M228J113o833J741k661M176N030l383j510
$$ 10290 12673 210 -11089 -8598 -5367 -1139 -26 -6859 -5118 -7779 -3603 1427 -1956 -3466
5971c466O43k480L28P696K752p884K04k584p254m001L751L933j135L549n862o15
$$ -3466 -2823 -5303 -4975 2721 5473 -2411 -2207 -4791 -12045 -16046 -12295 -8362 -9497 -5948 -11810 -12425
5955a2425k081L28Q395m58N516K811M001n264o284O383L201j10l917j3532n669
$$ -12425 -14506 -14178 -5783 -6241 -725 2086 6087 823 -5461 922 4123 4013 96 -13436 -19105
5940a9105J0606K503O867p346K170J0578k901j335n444n900k277R131Q944j766
$$ -19105 -8499 -5996 871 -6475 -4305 6273 3372 2037 -3407 -9307 -11584 -2453 6491 4725
5926D725l183J888J597p368o341J896m853n749k273k242L728R769k169N340Q751
$$ 4725 1542 3430 5027 -2341 -8682 -6786 -11639 -17388 -19661 -21903 -18175 -8406 -10575 -5235 3516
5911C516k376q36j938K026K12n97m502K377n602j130k558k110P438m911k20O16
$$ 3516 1140 304 -1634 392 604 7 -4495 -2118 -7720 -8850 -11408 -13518 -6080 -10991 -11211 -10595
5895a0595l724J111J0994J941M90J206p032j367N709k340q95o25K735M955M198
$$ -10595 -14319 -13208 -2214 -273 217 1423 -5609 -6976 -1267 -3607 -4502 -5127 -2392 2563 6761
5880F761O06J251r507L425L126P552l009p291n791o279k20N228J7701m246j8442
$$ 6761 7367 8618 -889 2536 5662 13214 10205 2914 -2877 -9156 -9376 -4148 13553 9307 -9135
5865i135q902j067j78K934M049N785N517O403O290l445j0279j0008J287O468m403
$$ -9135 -18037 -19104 -19282 -16348 -12299 -6514 -997 5406 11696 8251 -2028 -12036 -10749 -4281 -8684
5850h684O279k037J570R008K625q466n881N45l818n909m914j23R178J3797L441
$$ -8684 -2405 -4442 -2872 6136 8761 295 -5586 -5041 -8859 -14768 -19682 -19805 -10627 3170 6611
5835F611p404O310K741j720j1885l183J1552j450k175M013l383p92P382N2r121
$$ 6611 -793 5517 8258 6538 -5347 -8530 3022 1572 -603 3410 27 -765 6617 6669 -2452
5820b452O42L879j071P315l404j1933j4161R42J2056P167m022M34N620P166j004
$$ -2452 -1810 2069 998 8313 4909 -7024 -21185 -20243 -8187 -1020 -5042 -4608 1012 8178 7174
5805G174r018o326K453M656m055m691P43N918l247o479m89k208p370N753J2182
$$ 7174 -1844 -8170 -5717 -1061 -5116 -9807 -9064 -3146 -6393 -12872 -13361 -15569 -22939 -17186 -5004
5790e004N188Q5o924k205M1p844O060P409p16j0199M469Q809M538n589o581j178
$$ -5004 184 269 -6655 -8860 -8819 -16663 -10603 -3194 -3910 -14109 -9640 -831 3707 -1882 -8463 -9641
5774i641J04Q353Q090n440j26N07J155l966j286q913P955L588m156j997p385q147
$$ -9641 -9537 -1184 6906 1466 1340 1847 3002 -964 -2250 -11163 -3208 380 -3776 -5773 -13158 -21305
5758b1305l074k438n66N156J3189j920J972O701n738n902n146m536o201L022Q11
$$ -21305 -24379 -26817 -27383 -22227 -9038 -10958 -8986 -2285 -8023 -13925 -19071 -23607 -29808 -26786 -25975
5743b5975P742O293l978L613K865k840o764Q744Q400j271l289j649L035o95K290
$$ -25975 -18233 -11940 -15918 -12305 -9440 -12280 -19044 -10300 -1900 -3171 -6460 -8109 -5074 -5769 -3479
5728c479k361J103N497K409o132l17K838J0692K315M517L178m42j892q722n011
$$ -3479 -5840 -4737 760 3169 -2963 -3280 -442 10250 12565 17082 20260 19818 17926 9204 4193
5713D193n01r98n493n242R03k688L638O749R982O259k045r898n696n626j98p206
$$ 4193 3692 2694 -2799 -8041 -7138 -9826 -6188 561 10543 16802 14757 4859 -837 -6463 -6661 -13867
5697a3867n027o662Q385N043j601J338r40R908M597p835j012N140R583r02q922
$$ -13867 -18894 -25556 -17171 -12128 -13729 -12391 -13331 -3423 1174 -6661 -7673 -2533 7050 6148 -2774
5682b774m150L819J709o42M96l32m752q978k350L36r11r84M650J925N117Q997
$$ -2774 -6924 -3105 -1396 -2038 -1542 -1874 -6626 -15604 -17954 -17618 -18529 -19513 -14863 -12938 -7821 1176
5666A176J389m313l274J702k400K50K940L141l750J152J2275k350l616q985P710
$$ 1176 2565 -1748 -5022 -3320 -5720 -5470 -2530 611 -3139 -1987 10288 7938 4322 -4663 3047
5651C047k522k510j276J306J126j1889k928l915L367J0146N245o626J286N56K231
$$ 3047 525 -1985 -3261 -1955 -829 -12718 -15646 -19561 -16194 -6048 -803 -7429 -6143 -5587 -3356
5636c356Q262p667n395k256p820k547R390J8654O303p011j6472q850N059J0374
$$ -3356 4906 -2761 -8156 -10412 -18232 -20779 -11389 7265 13568 6557 -9915 -18765 -13706 -3332
5622c332K942p662k188q255j472M321Q751k304m738M798N390N630n804j0689n194
$$ -3332 -390 -8052 -10240 -18495 -19967 -15646 -6895 -9199 -13937 -9139 -3749 1881 -3923 -14612 -19806
5607a9806N306M632J0196l82K185k9J480o108k32n9m295p415l117n159o49J3540
$$ -19806 -14500 -9868 328 -54 2131 2102 3582 -2526 -2758 -2817 -7112 -14527 -17644 -22803 -23452 -9912
5591i912j005O508l31M479r280k842m388r19j05k366k69L44J0363K042n731O299
$$ -9912 -10917 -4409 -4740 -261 -9541 -12383 -16771 -17690 -17795 -20161 -20430 -20086 -9723 -7681 -13412 -7113
5575g113p10O99k633m707O377O532m032J269L832m324K514N617J656m22K46P039
$$ -7113 -7823 -7124 -9757 -14464 -8087 -1555 -5587 -4318 -486 -4810 -2296 3321 4977 4555 4801 11840
5559A1840q303j3805n116L52J130n263P059L129O196j201R32J824l243o221l367
$$ 11840 3537 -10268 -15384 -15032 -13902 -19165 -12106 -8977 -2781 -3982 -3050 -1226 -4469 -10690 -14057
5544a4057N98Q685L703o692j284N817k310k451n348N892O510N605n352L84k497
$$ -14057 -13459 -4774 -1071 -7763 -9047 -3230 -5540 -7991 -13339 -7447 -937 4668 -684 -300 -2797
5529b797l352J2485N682P952k779m502j5075n830M6p754K405J396J641N519K913
$$ -2797 -6149 6336 12018 19970 17191 12689 -2386 -8216 -8170 -15924 -13519 -12123 -10482 -4963 -2050
5514b050R3j310p298Q524j792O212N087M878o523r24l411M228J294l199o377n684
$$ -2050 -1957 -3267 -10565 -2041 -3833 2379 7466 12344 5821 4897 1486 5714 7008 3809 -2568 -8252
5498h252j22N273P237o341K886L010j0692l959P135M572j053K363k278o79J67
$$ -8252 -8374 -3101 4136 -2205 681 3691 -7001 -10960 -3825 747 -306 2057 -221 -900 -733
5483g33n019L623M886M771l714n49n28p25j137j252r782p330N97J3742L766k930
$$ -733 -5752 -2129 2757 7528 3814 3265 2737 2012 875 -377 -10159 -17489 -16892 -3150 616 -2314
5467b314k103K967n456P32N646J551j363m470M824K852K423K31j68r26L493l305
$$ -2314 -4417 -1450 -6906 -6174 -528 1023 -340 -4810 14 2866 5289 5520 5352 4426 7919 4614
5451D614j639q290P814L859j080l291J045k191n468n832K442J414k267l27Q108
$$ 4614 2975 -5315 2499 6358 5278 1987 3032 841 -4627 -10459 -8017 -6603 -8870 -9197 -1089
5436a089l971m987q439O657j752j213J212R292K435q268o555K065J0717R206N146
$$ -1089 -5060 -10047 -18486 -11829 -13581 -14794 -13582 -4290 -1855 -10123 -16678 -14613 -3896 5310 10456
5421A0456M854r084L603J0148l561j6467p443j494Q86j024k176k322J480M297
$$ 10456 15310 6226 9829 19977 16416 -51 -7494 -8988 -8102 -9126 -11302 -13624 -12144 -7847
5407g847M359n942Q23n971j503J2076k031j55R1O876O959m826K856j899k309o568
$$ -7847 -3488 -9430 -8607 -14578 -16081 -4005 -6036 -6191 -6100 776 7735 2909 5765 3866 1557 -5011
5391e011q421j681R768N821l44j0498J682M39r11j166M722j673K271j060O579
$$ -5011 -13432 -15113 -5345 476 132 -10366 -8684 -8245 -9156 -10322 -5600 -7273 -5002 -6062 517
5376E17L683K837j650q523l412J728L029l576j1218n295K677N061K459O747O799
$$ 517 4200 7037 5387 -3136 -6548 -4820 -1791 -5367 -16585 -21880 -19203 -14142 -11683 -4936 1863
5361A863O300M924n638n903r831p908l599j0559O897J0944J653k650q66K743L123
$$ 1863 8163 13087 7449 1546 -8285 -16193 -19792 -30351 -23454 -12510 -10857 -13507 -14373 -11630 -8507
5346h507m689N95Q625q00J0258M007l033j841j0686j2315L638r01O57J2581l63
$$ -8507 -13196 -12601 -3976 -4776 5482 9489 6456 4615 -6071 -18386 -14748 -15649 -14992 -2411 -2774
5331b774o052n850Q137M706r003J075j2822N960J822J233j3994M310k221N107
$$ -2774 -8826 -14676 -6539 -1833 -10836 -9761 -22583 -16623 -14801 -13568 -27562 -23252 -25473 -20366
5317b0366M689P881M71j506N666L138k982l102J230M75K862l599k998O547K916
$$ -20366 -15677 -7796 -7325 -8831 -3165 -27 -3009 -6111 -4881 -4406 -1544 -5143 -8141 -1594 1322
5302A322K921l582P842J0412j1449m938n24L172J716J563j574q003p762O705l212
$$ 1322 4243 661 8503 18915 7466 2528 2004 5176 6892 8455 6881 -1122 -8884 -2179 -5391
5287e391q058m152J721L623L805R421N604M12k127O58k884j871n813m326J08J271
$$ -5391 -13449 -17601 -15880 -12257 -8452 969 6573 6985 4858 5516 2632 761 -5052 -9378 -9270 -7999
5271g999P252L561j0686o091m902M324Q669K831o550m19Q062L24M100j577J09
$$ -7999 -747 2814 -7872 -13963 -18865 -14541 -5872 -3041 -9591 -10010 -1948 -1624 2476 899 1008
5256A008m09P376J170M10m631j3885J909j167m166P278R887O848k004p272K324
$$ 1008 599 7975 9145 9555 4924 -8961 -7052 -8219 -12385 -5107 4780 11628 9624 2352 4676
5241D676P723j663j2753K852L679L258J033j624r994l0N876r46J704K141k087
$$ 4676 12399 10736 -2017 835 4514 7772 8805 7181 -2813 -2843 3033 2087 3791 5932 3845
5226C845p899j672J775k042o083L414K454q385l292N754J3719K619q687M224k590
$$ 3845 -4054 -5726 -3951 -5993 -12076 -8662 -6208 -14593 -17885 -12131 1588 4207 -4480 -256 -2846
5211b846j0564N853M761J525k209n969o476M689O115N343l514m476N760M668K529
$$ -2846 -13410 -7557 -2796 -1271 -3480 -9449 -15925 -11236 -5121 222 -3292 -7768 -2008 2660 5189
5196E189N247o526L397j116j0526n357l194k148O087P311m020L058j469j380M623
$$ 5189 10436 3910 7307 6191 -4335 -9692 -12886 -15034 -8947 -1636 -5656 -2598 -4067 -5447 -824
5181h24O328Q26m237L012o13o567n700M754N381L14k785k726o332N374N782M207
$$ -824 5504 6330 2093 5105 4492 -2075 -7775 -3021 2360 2674 -111 -2837 -9169 -3795 1987 6194
5165F194N49j1524K278k470j2693l136O010K447l13j994J708N308k9l989m77R986
$$ 6194 6743 -4781 -2503 -4973 -17666 -20802 -14792 -12345 -12658 -14652 -12944 -7636 -7665 -11654 -12131 -2145
5149b145k939p437N195M635j173J82P328J4119L725q408o665q270p189N551l142
$$ -2145 -5084 -12521 -7326 -2691 -3864 -3682 3646 17765 21490 13082 6417 -1853 -9042 -3491 -6633
5134f633k187J055q705N509K946N103Q104j186P979l66k691n841j893j1535o987
$$ -6633 -8820 -7765 -16470 -10961 -8015 -2912 5192 4006 11985 11619 8928 3087 1194 -10341 -17328
5119a7328O963l966n25P446m201P208N160j838O231M299j2893n437o496j0537
$$ -17328 -10365 -14331 -14856 -7410 -11611 -4403 757 -1081 5150 9449 -3444 -8881 -15377 -25914
5105b5914o66Q424J4863J4067o857K53j032p146J1169k189o926r973N097Q144
$$ -25914 -26580 -18156 -3293 10774 3917 4170 3138 -4008 7161 4972 -1954 -11927 -6830 1314
5091A314m18K650j3437m02r60p180P429n424n727P089N856k083j1349J990O873
$$ 1314 896 3546 -9891 -10293 -11253 -18433 -11004 -16428 -22155 -15066 -9210 -11293 -22642 -20652 -13779
5076a3779J2381M857j1738K930K542O447M678J143M24K335m307r25n459o403j3682
$$ -13779 -1398 3459 -8279 -5349 -2807 3640 8318 9461 9885 12220 7913 6988 1529 -4874 -18556
5061a8556K169J2164L542m390m090l009J257M625J054K845J306O185L79q418L391
$$ -18556 -16387 -4223 -681 -5071 -9161 -12170 -10913 -6288 -5234 -2389 -1083 5102 5481 -2937 454
5046D54K694k432o750r253k096m62Q582R12K103M696j3637N029N639l150O054
$$ 454 3148 716 -6034 -15287 -17383 -17845 -9263 -8351 -6248 -1552 -15189 -10160 -4521 -7671 -1617
5031a617k174N666P025k892l347Q584j958j2000j549r8M64n567l79J0218l718
$$ -1617 -3791 1875 8900 6008 2661 11245 9287 -2713 -4262 -4360 -3896 -9463 -9842 376 -3342
5016c342m434L38J459r478l616M536o52K105N090J960l528l780O720J754m809
$$ -3342 -7776 -7438 -5979 -15457 -19073 -14537 -15189 -13084 -7994 -6034 -9562 -13342 -6622 -4868 -9677
5001i677P223M363l32M580q25K835n81j0254o393M568k926l564o969k708O091
$$ -9677 -2454 1909 1577 6157 5332 8167 7586 -2668 -9061 -4493 -7419 -10983 -17952 -20660 -14569
4986a4569L076L577J5594L711l300L8j1697l902O470J077j477l963j561j463L096
$$ -14569 -11493 -7916 7678 11389 8089 8127 -3570 -7472 -1002 75 -1402 -5365 -6926 -8389 -5293
4971e293m169j911Q96o17P634O625L373j850n986l946J768O182O835j118P42J444
$$ -5293 -9462 -11373 -10477 -11094 -3460 3165 6538 4688 -1298 -5244 -3476 2706 9541 8423 9165 10609
4955A0609L700m781j2067l895m004j816l301J12J3639M632l450K133K970J856
$$ 10609 14309 9528 -2539 -6434 -10438 -12254 -15555 -15443 -1804 2828 -622 1511 4481 6337
4941F337m332l604o294j072O645m897L73O604K298K875K247L187k839q121l2N836
$$ 6337 2005 -1599 -7893 -8965 -2320 -7217 -6844 -240 2058 4933 7180 10367 7528 -593 -625 5211
4925E211L723k147l386J160n130p258M438N743N560j974j1096k884O381K183L491
$$ 5211 8934 6787 3401 4561 -569 -7827 -3389 2354 7914 5940 -5156 -8040 -1659 524 4015
4910D015L006K022j5973q527K079Q571N163m810k914J1098q71j0339K68J692N58
$$ 4015 7021 9043 -6930 -15457 -13378 -4807 356 -4454 -7368 3730 2859 -7480 -7212 -5520 -4962
4895d962N229j320r427N99k740L692P504k484k380J522O395k112J93j698l477
$$ -4962 267 -1053 -10480 -9881 -12621 -8929 -1425 -3909 -6289 -4767 1628 -484 -291 -1989 -5466
4880e466l515j517J0242K328P231L64r652o413Q25L657J1394j505p36q67p504
$$ -5466 -8981 -10498 -256 2072 9303 9667 15 -6398 -5573 -1916 9478 7973 7237 6370 -1134
4865a134j5031m758R1n532O095J1499n967Q843J1818O678j169p031J887Q9j1497
$$ -1134 -16165 -20923 -20832 -26364 -20269 -8770 -14737 -5894 5924 12602 11433 4402 6289 6378 -5119
4850e119p204N467p171n302R63N401J7170J3000o105q260j2959M25N302k503j2176
$$ -5119 -12323 -6856 -14027 -19329 -18366 -12965 4205 17205 11100 2840 -10119 -9694 -4392 -6895 -19071
4835a9071K445P210M151L939O279q488q362k254N636P861l022K975K385p574p90
$$ -19071 -16626 -9416 -5265 -1326 4953 -3535 -11897 -14151 -8515 -654 -3676 -701 1684 -5890 -6680
4820f680M258n512k134K025pn21O267l843l250J332K220n107o307N088M879j0917
$$ -6680 -2422 -7934 -10068 -8043 -8050 -8571 -2304 -6147 -9397 -8065 -5845 -10952 -17259 -12171 -7292 -18209
4804a8209J278K390m518K711R034l775O463J0832l668n033j362O531M319J33l914
$$ -18209 -16931 -14541 -19059 -16348 -7314 -11089 -4626 6206 2538 -2495 -3857 2674 6993 7126 3212
4789C212r993k338L127o176o810J185k349O287o095J0274Q445K280O543m628l677
$$ 3212 -6781 -9119 -5992 -12168 -18978 -17793 -20142 -13855 -19950 -9676 -1231 1049 7592 2964 -713
4774g13o276o030L507k106R50P773m496j249l331o728L66K087P098M213N069l217
$$ -713 -6989 -13019 -9512 -11618 -10668 -2895 -7391 -8640 -11971 -18699 -18333 -16246 -9148 -4935 134 -3083
4758c083n843R353K178q09m148K706q134n324O291R896O20r192l093o406l594
$$ -3083 -8926 427 2605 1796 -2352 354 -7780 -13104 -6813 3083 3703 -5489 -8582 -14988 -18582
4743a8582K852M859j698J120K019l296L172n656Q448J2241N827N21l929k467l543
$$ -18582 -15730 -10871 -12569 -11449 -9430 -12726 -9554 -15210 -6762 5479 11306 11827 7898 5431 1888
4728A888q463k847j227J3162P740m616L039o695j193J975J555k018N560q934m548
$$ 1888 -6575 -9422 -10649 2513 10253 5637 8676 1981 788 2763 4318 2300 7860 -1074 -5622
4713e622j975P412n55m806K162j058m52Q56m088j979j201J258J3305O425J128
$$ -5622 -7597 -185 -740 -5546 -3384 -4442 -4894 -4038 -8126 -10105 -11306 -10048 3257 9682 10810
4698A0810J3995n087k0913P267Q000L62r430J078p721n114O023J5354R539r289
$$ 10810 24805 19718 -1195 6072 14072 14434 5004 6082 -1639 -6753 -730 14624 24163 14874
4684A4874o753p163l458j812M276M57k389l646j750J2484K112K785l959l303o79
$$ 14874 8121 958 -2500 -4312 -36 421 -1968 -5614 -7364 5120 7232 10017 6058 2755 2076
4669B076o721p522p067N365O017O965L416K71o996L888Q230k324p728m666j0212
$$ 2076 -4645 -12167 -19234 -13869 -7852 -887 2529 2800 -4196 -308 7922 5598 -2130 -6796 -17008
4654a7008n86Q998O228K616J4K399o319p662l746K952M028l28JJ863l162l390
$$ -17008 -17594 -8596 -2368 248 262 2661 -3658 -11320 -15066 -12114 -8086 -8414 -8413 -6550 -9712 -13102
4638a3102P370J517N416l984Q453M257n070p346n979q975L899N889J348n791n27
$$ -13102 -5732 -4215 1201 -2783 5670 9927 4857 -2489 -8468 -17443 -13544 -7655 -6307 -12098 -12625
4623a2625L670j1019k577R574J3020M085p605k656j734K496K56m592l645M14l577
$$ -12625 -8955 -19974 -22551 -12977 43 4128 -3477 -6133 -7867 -5371 -5115 -9707 -13352 -12938 -16515
4608a6515O564Q067N115N422l280k533k789q910j474o98k281P062J4569m246k920
$$ -16515 -9951 -1884 3231 8653 5373 2840 51 -8859 -10333 -11031 -13312 -6250 8319 4073 1153
4593A153r645j207L59M891l424J470J3125P50j566k814q63N829k133j2083o058
$$ 1153 -8492 -9699 -9340 -4449 -7873 -6403 6722 7472 5906 3092 2229 8058 5925 -6158 -12216
4578a2216P78M314O477K887r082q982R091O667l688k744K26k359j1241R5O892
$$ -12216 -11438 -7124 -647 2240 -6842 -15824 -6733 -66 -3754 -6498 -6272 -8631 -19872 -19777 -12885
4563a2885M742N541o42j503l98N138j1751j847R31J0668L695p018l372J088Q414
$$ -12885 -8143 -2602 -3244 -4747 -5145 -7 -11758 -13605 -12674 -2006 1689 -5329 -8701 -7613 801
4548H01L491k176L754k276p095o315m624K866J949m546j059O674L54P368Q81K297
$$ 801 4292 2116 5870 3594 -3501 -9816 -14440 -11574 -9625 -14171 -15230 -8556 -8202 -834 47 2344
4532B344L108L295j0363j808k211J168p153M730l09J0238P068j1145k837M07R041
$$ 2344 5452 8747 -1616 -3424 -5635 -4467 -11620 -6890 -7199 3039 10107 -1038 -3875 -3468 5573
4517E573J141O643M89j3842k708j439j352M97m369J278k006m114K415J2471p43
$$ 5573 6714 13357 13846 4 -2704 -4143 -5495 -4998 -9367 -8089 -10095 -14209 -11794 677 -66
4502f6l484J728j084m633k285P172R286l557l264O649M294j0540J409o134M379
$$ -66 -3550 -1822 -2906 -7539 -9824 -2652 6634 3077 -187 6462 10756 216 1625 -4509 -130
4487a30K533J176M316j878K205j333l434O780r696q911l339k418N24N390j2l173
$$ -130 2403 3579 7895 6017 8222 6889 3455 10235 539 -8372 -11711 -14129 -13605 -8215 -8227 -11400
4471a1400l421J780J81J861K820R733N480n482q250k962j721J071j34J0314L861
$$ -11400 -14821 -13041 -12860 -10999 -8179 1554 7034 1552 -6698 -9660 -11381 -10310 -10444 -130 3731
4456C731P58j135m458L359J1686N113j2003n454J099J368r000q060R196M24k21
$$ 3731 4489 3354 -1104 2255 13941 19054 7051 1597 2696 4064 -4936 -12996 -3800 -3376 -3597
4441c597m889N179O202L484p561k826j145l110m410P30R150K898K428p359q429
$$ -3597 -8486 -3307 2895 6379 -1182 -4008 -5153 -8263 -12673 -11943 -2793 105 2533 -4826 -13255
4426a3255j079L05O873P455j433l99p59N171o678o690M355M35K983m021o496N057
$$ -13255 -14334 -14029 -7156 299 -1134 -1533 -2292 2879 -3799 -10489 -6134 -5699 -2716 -6737 -13233 -8176
4410h176L25l361J645l492L258P258N695K001j0626M335N930K558k326j2341l091
$$ -8176 -7851 -11212 -9567 -13059 -9801 -2543 3152 5153 -5473 -1138 4792 7350 5024 -7317 -10408
4395a0408M920M451K933o308k669R233j565o30K481Q531m6L120J249l26q113n301
$$ -10408 -5488 -1037 1896 -4412 -7081 2152 587 -43 2438 10969 10923 14043 15292 14966 6853 1552
4379A552l516N041j037k920k114K375k537J1509p319P69j469o397j352p297M777
$$ 1552 -1964 3077 2040 -880 -2994 -619 -3156 8353 1034 1803 334 -6063 -7415 -14712 -9935
4364i935N629l761m757l043R925J7979N520j174Lj034j395m258j159k891m800
$$ -9935 -4306 -8067 -12824 -15867 -5942 12037 17557 16383 16386 15352 13957 9699 8540 5649 849
4349H49r73P2M746N635O473q991j5261M566M695r588j099N90P436m16O501O838
$$ 849 -124 -52 4694 10329 16802 7811 -7450 -2884 1811 -7777 -8876 -8286 -850 -1266 5235 12073
4333A2073j682n45J77q376j0539j1270M373M739j003K424j795K129M479L82J0011
$$ 12073 10391 9846 10023 1647 -8892 -20162 -15789 -11050 -12053 -9629 -11424 -9295 -4816 -4434 5577
4318E577J974o630l292Q2j794o088J985N38N009N080l910n798O064J237M348q80
$$ 5577 7551 921 -2371 -2289 -4083 -10171 -8186 -7648 -2639 2441 -1469 -7267 -1203 34 4382 3502
4302C502r540r928o93K981K364O945M855K89m945L81J2788p394q914l011l622
$$ 3502 -6038 -15966 -16659 -13678 -11314 -4369 486 775 -4170 -3789 8999 1605 -7309 -10320 -13942
4287a3942J0629m766j819K976j787l141n177L994Q814k239p42m445o123J564N755
$$ -13942 -3313 -8079 -9898 -6922 -8709 -11850 -17027 -13033 -4219 -6458 -7200 -11645 -17768 -16204 -10449
4272a0449N754n40P746R952n82q160p449l837J687J146q071L259N350l314L636
$$ -10449 -4695 -5235 2511 12463 11881 3721 -3728 -7565 -5878 -4732 -12803 -9544 -4194 -7508 -3872
4257c872j584n296K198N826J222r8L949R284p791m663p06j434k297Q519J2167
$$ -3872 -5456 -10752 -8554 -2728 -1506 -1604 2345 11629 3838 -825 -1531 -2965 -5262 3257 15424
4242A5424k35j821o553j4711p089j055r40j745J3069J3881M104n289m990l006
$$ 15424 15189 13368 6815 -7896 -14985 -16040 -16980 -18725 -5656 8225 12329 7040 2050 -956
4228i56J401M514J353p564m813q9k908N278O549j700k320j0223J3294J85p639
$$ -956 445 4959 6312 -1252 -6065 -6154 -9062 -3784 2765 1065 -1255 -11478 1816 2001 -5638
4213e638m613P539j15k930q597O254P799Q631R110K918o256r335o936k756O32
$$ -5638 -10251 -2712 -2827 -5757 -14354 -8100 -301 8330 17440 20358 14102 4767 -2169 -4925 -4293
4198d293n45K52M595O635J0399j894p230o509o930K749L08K302k677p45P739J662
$$ -4293 -4838 -4586 9 6644 17043 15149 7919 1410 -5520 -2771 -2463 -161 -2838 -3583 4156 5818
4182E818J192j670N007M581K891p961j0345o159p93Q331Q9l709j924n357M958
$$ 5818 7010 5340 10347 14928 17819 9858 -487 -6646 -7439 892 981 -2728 -4652 -10009 -5051
4167e051J918n52R83m39m794N224k658m710L560O057o543n061L527O080J1359
$$ -5051 -3133 -3685 -2702 -3141 -7935 -2711 -5369 -10079 -6519 -462 -7005 -12066 -8539 -2459 8900
4152H900O550K507j1083r015l074K503O635j2903r531N598J1110N136p889k953
$$ 8900 15450 17957 6874 -2141 -5215 -2712 3923 -8980 -18511 -12913 -1803 3333 -4556 -7509
4138g509j354N725R231J220L30j903j875n971k215j543n726k77L282M823N762
$$ -7509 -8863 -3138 6093 7313 7643 5740 3865 -2106 -4321 -5864 -11590 -11867 -8585 -3762 2000
4123B000M527r790l784m662M791K266n482o884J2062k775k527j06R305M65J615
$$ 2000 6527 -3263 -7047 -11709 -6918 -4652 -10134 -17018 -4956 -7731 -10258 -10364 -1059 -594 1021
$$ [...]
##END NTUPLES=NMR SPECTRUM
##END=
