##TITLE=Analysis number 323401
Compound Code cc 13726
Book Reference 407/137
Project Code adrs
Chemist Name andyw
##JCAMPDX= 6.0         $$ Bruker NMR JCAMP-DX V2.0
##DATA TYPE= NMR SPECTRUM
##DATA CLASS= NTUPLES
##ORIGIN= Bruker BioSpin GmbH
##OWNER= nmr
$$ XWIN-NMR		Version 3.5
$$ Tue Oct 24 09:20:22 2006 GMT Daylight Time (UT+1h)  MAYBRIDGE\nmr@NMR_250MHZ
##.OBSERVE FREQUENCY= 250.131544655141
##.OBSERVE NUCLEUS= ^1H
##.ACQUISITION MODE= SIMULTANEOUS (DQD)
##.ACQUISITION SCHEME= undefined
##.AVERAGES= 16
##.DIGITISER RES= 18
##SPECTROMETER/DATA SYSTEM= dpx250
##.PULSE SEQUENCE= zg30
##.SOLVENT NAME= CDCl3
##.SHIFT REFERENCE= (INTERNAL, CDCl3, 0, 16.522)
##AUDIT TRAIL= $$ (NUMBER, WHEN, WHO, WHERE, WHAT)
$$ ##TITLE= Audit trail, XWIN-NMR		Version 3.5
$$ ##JCAMPDX= 5.01
$$ ##ORIGIN= Bruker BioSpin GmbH
$$ ##OWNER= nmr
$$ C:\u/data/dgb/nmr/ADRS/1140/pdata/1/auditp.txt
$$ ##AUDIT TRAIL=  $$ (NUMBER, WHEN, WHO, WHERE, WHAT)
(   1,<2006-10-24 09:19:56.28 +100>,<MAYBRIDGE\nmr>,<NMR_250MHZ>,
      <created by zg, POWCHK disabled, PULCHK disabled
       configuration hash MD5:
       49 4B E0 1D 92 C2 6B 37 9F E6 65 BC 52 41 86 1D
       data hash MD5: 64K
       82 23 78 80 82 0E 87 2F 99 68 95 BC 74 79 69 22>)
(   2,<2006-10-24 09:20:13.48 +100>,<MAYBRIDGE\nmr>,<NMR_250MHZ>,
      <Start of raw data processing
       ef LB = 0.3 FT_mod = 6 PKNL = 1 SI = 32K 
       data hash MD5: 32K
       E0 3D 56 1E F3 3A F9 E5 D9 C9 E9 0C 84 02 E2 62>)
(   3,<2006-10-24 09:20:15.54 +100>,<MAYBRIDGE\nmr>,<NMR_250MHZ>,
      <apk 
       data hash MD5: 32K
       1E B4 4D 92 DC 18 98 E0 A0 F6 04 7F DC FA A4 73>)
(   4,<2006-10-24 09:20:16.78 +100>,<MAYBRIDGE\nmr>,<NMR_250MHZ>,
      <abs ABSG = 5 
       data hash MD5: 32K
       7F B5 D9 95 2B B8 D3 FF 5C 42 8F 8F FC 6C CB 33>)
$$ ##END=
$$ 
$$ hash MD5
$$ F4 1C 4A 2B A8 B4 60 31 15 CE D6 FD C1 CE 27 07
##$RELAX= 
##$RELAX= 
##$RELAX= 
##$RELAX= 
##$RELAX= 
##$RELAX= 
##$RELAX= 
$$ Bruker specific parameters
$$ --------------------------
##$DU= <C:\u>
##$EXPNO= 1140
##$NAME= <ADRS>
##$PROCNO= 1
##$TYPE= <nmr>
##$USER= <dgb>
##$AMP= (0..31)
100 100 100 100 100 100 100 100 100 100 100 100 100 100 100 100 100 100 
100 100 100 100 100 100 100 100 100 100 100 100 100 100 
##$AQSEQ= 0
##$AQ_mod= 3
##$AUNM= <au_zg>
##$AUTOPOS= <3 >
##$BF1= 250.13
##$BF2= 250.13
##$BF3= 250.13
##$BF4= 250.13
##$BF5= 500.13
##$BF6= 500.13
##$BF7= 500.13
##$BF8= 500.13
##$BYTORDA= 1
##$CFDGTYP= 0
##$CFRGTYP= 5
##$CHEMSTR= <none>
##$CNST= (0..31)
1 1 145 1 1 1 1 1 1 1 1 1 1 1 1 1 1 1 1 1 1 1 1 1 1 1 1 1 1 1 1 1 
##$CPDPRG= <>
##$CPDPRG1= <>
##$CPDPRG2= <>
##$CPDPRG3= <>
##$CPDPRG4= <mlev>
##$CPDPRG5= <mlev>
##$CPDPRG6= <mlev>
##$CPDPRG7= <mlev>
##$CPDPRG8= <mlev>
##$CPDPRGB= <>
##$CPDPRGT= <>
##$D= (0..31)
0 1 0 0 0 0 0 0 0 0.06 0 0 0 0 0 0 0.0002 0 0 0 0 0 0 0 0 0 0 0 0 0 0 
0 
##$DATE= 1161677994
##$DBL= (0..7)
120 120 120 120 120 120 120 120 
##$DBP= (0..7)
150 150 150 150 150 150 150 150 
##$DBP07= 0
##$DBPNAM0= <>
##$DBPNAM1= <>
$$ [...]
##$SUBNAM7= <"">
##$SUBNAM8= <"">
##$SUBNAM9= <"">
##$SW= 20.6930455092707
##$SWIBOX= (0..15)
0 0 3 0 0 0 0 0 0 0 0 0 0 0 0 0 
##$SW_h= 5175.983436853
##$TD= 65536
##$TD0= 1
##$TE= 683.16
##$TE2= 300
##$TE3= 300
##$TEG= 300
##$TL= (0..7)
0 120 120 120 120 120 120 120 
##$TP= (0..7)
150 150 150 150 150 150 150 150 
##$TP07= 0
##$TPNAME0= <>
##$TPNAME1= <>
##$TPNAME2= <>
##$TPNAME3= <>
##$TPNAME4= <>
##$TPNAME5= <>
##$TPNAME6= <>
##$TPNAME7= <>
##$TPOAL= (0..7)
0.5 0.5 0.5 0.5 0.5 0.5 0.5 0.5 
##$TPOFFS= (0..7)
0 0 0 0 0 0 0 0 
##$TUNHIN= 0
##$TUNHOUT= 0
##$TUNXOUT= 0
##$USERA1= <user>
##$USERA2= <user>
##$USERA3= <user>
##$USERA4= <user>
##$USERA5= <user>
##$V9= 5
##$VALIST= <valist>
##$VCLIST= <CCCCCCCCCCCCCCC>
##$VD= 0
##$VDLIST= <DDDDDDDDDDDDDDD>
##$VPLIST= <PPPPPPPPPPPPPPP>
##$VTLIST= <TTTTTTTTTTTTTTT>
##$WBST= 1024
##$WBSW= 4
##$XGAIN= (0..3)
0 0 0 0 
##$XL= 0
##$YL= 0
##$YMAX_a= 482927
##$YMIN_a= -292072
##$ZGOPTNS= <>
##$ZL1= 120
##$ZL2= 120
##$ZL3= 120
##$ZL4= 120
##$ABSF1= 16.522
##$ABSF2= -4.171173
##$ABSG= 5
##$ABSL= 3
##$ALPHA= 0
##$AQORDER= 0
##$ASSFAC= 0
##$ASSFACI= 0
##$ASSFACX= 0
##$ASSWID= 0
##$AUNMP= <proc_1d>
##$AZFE= 0.1
##$AZFW= 0.1
##$BCFW= 0
##$BC_mod= 0
##$BYTORDP= 0
##$COROFFS= 0
##$CY= 12.5
##$DATMOD= 1
##$DC= 0
##$DFILT= <>
##$DTYPP= 0
##$F1P= 14.0000005364418
##$F2P= -0.99999901652339
##$FCOR= 0.5
##$FTSIZE= 32768
##$FT_mod= 6
##$GAMMA= 0
##$GB= 0
##$INTBC= 1
##$INTSCL= 1
##$ISEN= 128
##$LB= 0.3
##$LEV0= 0
##$LPBIN= 0
##$MAXI= 10000
##$MC2= 0
##$MEAN= 0
##$ME_mod= 0
##$MI= 0
##$NCOEF= 0
##$NC_proc= -4
##$NLEV= 6
##$NOISF1= 0
##$NOISF2= 0
##$NSP= 0
##$NTH_PI= 0
##$NZP= 0
##$OFFSET= 16.522
##$PC= 1
##$PHC0= -46.26479
##$PHC1= 15.68855
##$PH_mod= 1
##$PKNL= yes
##$PPARMOD= 0
##$PSCAL= 4
##$PSIGN= 0
##$REVERSE= no
##$SF= 250.13
##$SI= 32768
##$SIGF1= 0
##$SIGF2= 0
##$SINO= 400
##$SIOLD= 32768
##$SREGLST= <1H.CDCl3>
##$SSB= 0
##$STSI= 32768
##$STSR= 0
##$SW_p= 5175.98343685301
##$SYMM= 0
##$S_DEV= 0
##$TDeff= 65536
##$TDoff= 0
##$TI= <Analysis number 999999
Compound Code 99
Book Reference 9
Project Code 9>
##$TILT= no
##$TM1= 0
##$TM2= 0
##$TOPLEV= 0
##$USERP1= <user>
##$USERP2= <user>
##$USERP3= <user>
##$USERP4= <user>
##$USERP5= <user>
##$WDW= 1
##$XDIM= 32768
##$YMAX_p= 460212083
##$YMIN_p= -900678
$$ End of Bruker specific parameters
$$ ---------------------------------
##NTUPLES= NMR SPECTRUM
##VAR_NAME=  FREQUENCY,     SPECTRUM/REAL,   SPECTRUM/IMAG
##SYMBOL=    X,             R,               I
##VAR_TYPE=  INDEPENDENT,   DEPENDENT,       DEPENDENT
##VAR_FORM=  AFFN,          ASDF,            ASDF
##VAR_DIM=   32768,         32768,           32768
##UNITS=     HZ,            ARBITRARY UNITS, ARBITRARY UNITS
##FACTOR=    0.157963299565203, 1,           1
##FIRST=     4132.6476996994, 0,             0
##LAST=      -1043.33573715361, 0,           0
##MIN=       -1043.33573715361, -900678,     0
##MAX=       4132.6476996994, 460212083,     0
$$ Real data points
##PAGE= N=1
##DATA TABLE= (X++(R..R)), XYDATA
$$ [...]
$$ plain form
25219 -469394 -430007 -280456 -184626 -11182 71366 307516 397385 91979 -101403 -137053
25209 -137053 -266060 -452639 -488647 -251998 25728 121443 132340 -201130 -131552 -74412
25199 -74412 -173930 -276834 -164664 -6355 8555 58411 -27151 89090 267348 359546 160661
25188 160661 -179363 -424484 -232465 -14937 -15184 -100796 -91155 -108059 -60438 -303546 -222525
25177 -222525 37759 113623 55153 -40253 -147305 51847 313235 284513 56754 -9759
25167 -9759 157222 169659 203272 259035 367946 344376 179829 166234 189086 298552 -21040
25156 -21040 -125512 -124328 -78905 -206648 -231419 -66338 -49900 -516566 -719144 -846497 -838789
25145 -838789 -701224 -470156 -293256 19036 -228341 -476747 -472278 -273293 -231596 -154072
$$ packed form
25219d69394L9387J49551R5830J73444Q2548K36150Q9869l05406j93382l5650
25209a37053j29007j86579l6008K36649K77726R5715J0897l33470O9578N7140
25199g4412r9518j02904J12170J58309J4910M9856q5562J16241J78258R2198j98885
25188A60661l40024k45121J92019K17528k47q5612R641j6904M7621k43108Q1021
25177b22525K60284P5864n8470r5406j07052J99152K61388k8722k27759o6513
25167i759J66981J2437L3613N5763J08911k3570j64547j3595K2852J09466l19592
25156b1040j04472J184M5423j27743k4771J65081J6438m66666k02578j27353P708
25145h38789J37565K31068J76900L12292k47377k48406M469J98985M1697P7524
$$ plain form
25135 -154072 -202576 -269467 -92245 -10887 157331 330896 336425 82106 -240545 -297206 -188927
25124 -188927 55778 69786 204960 414274 161048 -161093 -256093 -53171 -24386 -92402
25114 -92402 -242519 -308493 -414662 -667751 -681909 -407475 -267819 -179606 35972 159267
25104 159267 74845 -42078 -61762 111028 -72056 -227677 -286264 -146848 -55329 -27135
25094 -27135 121359 110619 163104 305086 338470 280033 16778 -12732 -153026 -59685 -88779
25083 -88779 -23864 -207077 -274375 -245465 -215686 -9157 106810 87413 -67388 81001 125096
25072 125096 -41468 -203848 -232187 -380907 -332040 -144699 -32750 -46491 -25764 134538
25062 134538 124121 174890 99580 69889 -114665 -145394 -6679 189480 104434 1353 129253
$$ packed form
25135a54072m8504o6891J77222Q1358J68218J73565N529k54319l22651n6661J08279
25124a88927K44705J4008J35174K09314k53226l22141r5000K02922K8785o8016
25114i2402j50117o5974j06169k53089j4158K74434J39656Q8213K15578J23295
25104A59267q4422j16923j9684J72790j83084j55621n8587J39416R1519K8194
25094b7135J48494j0740N2485J41982L3384n8437k63255k9510j40294R3341k9094
25083h8779O4915j83213o7298K8910K9779K06529J15967j9397j54801J48389M4095
25072A25096j66564j62380k8339j48720M8867J87341J11949j3741K0727J60302
25062A34538j0417N0769p5310k9691j84554l0729J38715J96159q5046j03081J27900
$$ plain form
25051 129253 19338 -46582 142891 48462 -162965 -97737 -47404 44251 92440 111233 -134330
25040 -134330 -128721 123069 54394 -68312 -348022 -402879 -291551 -100004 154061 265613
25030 265613 30635 -91563 58132 189734 87022 -145309 -184224 -211696 -73869 151210
25020 151210 50976 48898 34651 -30407 -142652 -60874 12541 45652 120940 132783 -49871
25009 -49871 -66630 23935 103710 174504 418878 248371 245027 282919 208423 205609 273428 228497
24997 228497 185803 -4261 -92999 -65350 89054 21753 -96433 -19345 -364741 -242409
24987 -242409 -286012 -424654 -488837 -394174 -198560 -186921 -209242 -101813 12717 -192831
24977 -192831 -282772 -135982 132022 5094 -158359 -128129 -174060 -63570 89194 102214
$$ packed form
25051A29253j09915o5920J89473r4429k11427O5228N0333R1655M8189J8793k45563
25040a34330N609K51790o8675j22706k79710n4857J11328J91547K54065J11552
25030B65613k34978j22198J49695J31602j02712k32331l8915k7472J37827K25079
25020A51210j00234k078j4247o5058j12245Q1778P3415L3111P5288J1843j82654
25009d9871j6759R0565P9775P0794K44374j70507l344L7892p4496k814O7819m4931
24997B28497m2694j90064q8738K7649J54404o7301j18186P7088l45396J22332
24987b42409m3603j38642o4183R4663J95614J1639k2321J07429J14530k05548
24977a92831q9941J46790K68004j26928j63453L0230m5931J10490J52764J3020
$$ plain form
24967 102214 25300 7856 35293 31787 59118 358674 434614 147001 -23763 -89413 19891
24956 19891 201584 230439 127692 88360 -33973 66843 243642 64822 -13570 125776
24946 125776 303648 89580 56512 249711 419530 394268 399953 379380 150722 61885 186850
24935 186850 242741 280721 199584 -89089 -199112 -107817 -140714 -48207 6119 -60990 -77532
24924 -77532 -85328 -112304 -176746 -51482 387918 558810 655419 443578 259625 184405 69782
24913 69782 -1923 -175507 -383511 -285970 -100886 -50290 -162968 -350092 -365571 -253116
24903 -253116 -114852 94944 83792 106460 62785 51321 112631 52269 -73857 -142746 -29914
24892 -29914 147465 211691 252095 268254 289726 383456 376139 164486 250111 216233 71982
$$ packed form
24967A02214p6914j7444K7437l506K7331K99556P5940k87613j70764o5650J09304
24956A9891J81693K8855j02747l9332j22333J00816J76799j78820p8392J39346
24946A25776J77872k14068l3068J93199J69819k5262N685k0573k28658q8837J24965
24935A86850N5891L7980q1137k88673j10023R1295l2897R2507N4326o7109j6542
24924g7532p796k6976o4442J25264M39400J70892R6609k11841j83953p5220j14623
24913F9782p1705j73584k08004R7541J85084N0596j12678j87124j5479J12455
24903b53116J38264K09796j1152K2668m3675j1464O1310o0362j26126o8889J12832
24892b9914J77379O4226M0404J6159K1472R3730p317k11653Q5625l3878j44251
$$ plain form
24881 71982 25737 -155886 -34630 43467 198979 117641 199698 158329 152727 177353 265233
24870 265233 208729 199792 76766 -17589 -64733 -111065 -135626 -129063 98817 103887 -87772
24859 -87772 -1853 417575 294575 25463 -111486 -74375 -31502 -110928 -327045 -458012
24849 -458012 -575983 -486073 -328717 -187292 -211147 -152912 -223405 -335514 -115434 26309
24839 26309 -108298 -313266 -243673 -317789 -456138 -438866 -449062 -348320 -339104 -266279 -104955
24828 -104955 -114680 -90112 -39465 67066 139878 142268 193050 205503 78176 21799 -19726
24817 -19726 26249 195891 123439 40969 176401 56183 -61181 -42987 -63204 -161688 -230392
24806 -230392 -340891 -171634 105054 -120906 -265084 -157916 -280293 -313724 -206014 -24338
$$ packed form
24881G1982m6245j81623J21256P8097J55512q1338Q2057m1369n602K4626Q7880
24870B65233n6504q937j23026r4355m7144m6332k4561O563K27880N070j91659
24859h7772Q5919M19428j23000k69112j36949L7111M2873p9426k16117j30967
24849d58012j17971Q9910J57356J41425k3855N8235p0493j12109K20080J41743
24839B6309j34607k04968O9593p4116j38349J7272j0196J00742R216P2825J61324
24828a04955r725K4568N0647J06531P2812K390N0782J2453j27327n6377m1525
24817a9726M5975J69642p2452q2470J35432j20218j17364J8194k0217r8484o8704
24806b30392j10499J69257K76688k25960j44178J07168j22377l3431J07710J81676
$$ plain form
24796 -24338 -36775 -122974 -280950 -421057 -278955 48913 127540 -121756 -275582 -367739
24786 -367739 -289478 -150105 -141384 -210481 -381839 -516380 -422240 -236201 -183346 -167476 -200795
24775 -200795 -153517 15863 125653 137241 -125542 -217974 51781 65550 -6532 -218944
24765 -218944 -310866 -376068 -277725 -414749 -298442 -234237 -289838 -198696 -135225 -265699 -192493
24754 -192493 -63296 -248204 -333681 -337797 -344211 -313614 -356864 -207906 -140933 22572 -30713
24743 -30713 -225252 -137759 -111835 -151969 -181603 -47246 -4474 74716 149429 197186 59495
24732 59495 -32228 -34836 225373 192421 61426 -45054 -123888 -191749 -152392 -71458 -19140
24721 -19140 -33258 -62862 -268426 -390221 -233665 -90938 -179027 -282605 -194331 16577
$$ packed form
24796b4338j2437q6199j57976j40107J42102L27868P8627k49296j53826r2157
24786c67739P8261J39373Q721o9097j71358j34541R4140J86039N2855J5870l3319
24775b00795M7278J69380J09790J1588k62783r2432K69755J3769p2082k12412
24765b18944r1922o5202R8343j37024J16307O4205n5601R1142O3471j30474P3206
24754a92493J29197j84908q5477m116o414L0597m3250J48958O6973J63505n3285
24743c0713j94539Q7493K5924m0134k9634J34357M2772P9190P4713M7757j37691
24732E9495r1723k608K60209l2952j30995j06480p8834o7861L9357Q0934N2318
24721a9140j4118k9604k05564j21795J56556J42727q8089j03578Q8274K10908
$$ plain form
24711 16577 60000 -76659 -240245 99215 277311 325146 336083 77357 -20847 2563 23883
24700 23883 -92310 -108385 23980 20713 186127 308290 441319 283795 240414 185882 229105
24689 229105 211222 291681 286809 127120 -81133 -107536 -162075 -291123 -301944 -266225 71568
24678 71568 116461 -120336 13285 -30738 -110384 -368471 -361010 -126828 117761 40785 -63430
24667 -63430 52512 86704 -117899 -82299 -67478 2694 93203 77018 117605 382960 347703
24656 347703 276675 264102 209369 208071 322114 353841 507907 427293 429294 299683 37595
24645 37595 -138459 -143441 -155921 -72431 -104437 -40599 -153515 -83111 144731 136728 134917 -60469
24633 -60469 -74879 -67990 11388 56186 -183331 -132499 81193 88932 333496 343607 23093
$$ packed form
24711A6577M3423j36659j63586L39460J78096M7835J0937k58726r8204K3410K1320
24700B3883j16193j6075J32365l267J65414J22163J33029j57524m3381n4532M3223
24689B29105j7883Q0459m872j59689k08253k6403n4539j29048j0821L5719L37793
24678G1568M4893k36797J33621m4023p9646k58087P461K34182K44589p6976j04215
24667f3430J15942L4192k04603L5600J4821P0172R0509j6185M0587K65355l5257
24656C47703p1028j2573n4733j298J14043L1727J54066q0614K001j29611k62088
24645C7595j76054m982j2480Q3490l2006O3838j12916P0404K27842q003j811j95386
24633f0469j4410O889P9378M4798k39517N0832K13692P739K44564J0111l20514
$$ plain form
24622 23093 178549 180310 -49723 24585 -159553 -138593 -113474 -277010 -124244 -129118 -175796
24611 -175796 -329696 -344677 -203973 -98998 -207796 -88149 -180488 -275857 -104696 -23016
24601 -23016 -42230 -40090 -169942 -121380 -218771 -30974 144560 111865 -115881 -324239 -188774
24590 -188774 -207794 -130003 -128699 -54126 -29643 228665 284620 34620 -11299 -150765 -380289
24579 -380289 -401170 -348383 -391699 -226311 -154156 -235850 -317937 -296430 -173679 -324146 -427959
24568 -427959 -169914 57183 -28297 7635 85698 173917 175561 116416 94328 -27352 304271
24557 304271 68917 -289717 -335152 -35560 126776 65257 295752 151993 2925 -11934
24547 -11934 68945 -44643 -341037 -371859 -351565 -374122 -489264 -339170 -293682 -172191 -240404
$$ packed form
24622B3093J55456J761k30033P4308j84138K0960K5119j63536J52766m874m6678
24611a75796j53900j4981J40704J04975j08798J19647r2339r5369J71161Q1680
24601b3016j9214K140j29852M8562r7391J87797J75534l2695k27746k08358J35465
24590a88774j9020P7791J304P4573K4483K58308N5955k50000m5919j39466k29524
24579c80289k0881N2787m3316J65388P2155q1694q2087K1507J22751j50467j03813
24568d27959K58045K27097q5480L5932P8063Q8219J644n9145k2088j21680L31623
24557C04271k35354l58634m5435K99592J62336o1519K30495j43759j49068j4859
24547a1934Q0879j13588k96394l0822K0294k2557j15142J50094M5488J21491o8213
$$ plain form
24536 -240404 -67943 205410 149440 133387 202062 148223 39779 50837 295382 202328 255601
24525 255601 376238 189548 -259627 -358388 -298261 -151756 132947 175321 145760 168307
24515 168307 -45063 -134373 -94239 -92626 -199238 -100949 143493 148671 252226 60702 45168
24504 45168 155792 -7504 -251216 -269721 -140943 -93129 47188 170046 152241 -51520
24494 -51520 -182499 -277039 -92506 371084 456581 276236 267199 437372 287145 -115493
24484 -115493 -176996 -37723 231320 531169 301324 4817 57992 25962 73244 44844
24474 44844 273689 247729 -169467 -501967 -323300 -53358 130967 71892 58126 263239
24464 263239 392390 318984 77483 -219764 -130230 30035 148841 71356 185597 -13413
$$ packed form
24536b40404J72461K73353n5970j6053O8675n3839j08444J1058K44545r3054N3273
24525B55601J20637j86690m49175r8761O0127J46505K84703M2374k9561K2547
24515A68307k13370q9310M0134J613j06612R8289K44442N178J03555j91524j5534
24504D5168J10624j63296k43712j8505J28778M7814J40317J22858j7805k03761
24494e1520j30979r4540J84533M63590Q5497j80345r037J70173j50227m02638
24484a15493o1503J39273K69043K99849k29845k96507N3175l2030M7282k8400
24474D4844K28845k5960m17196l32500J78667K69942J84325n9075j3766K05113
24464B63239J29151p3406k41501k97247Q9534J60265J18806p7485J14241j99010
$$ plain form
24454 -13413 -165766 -243150 -399870 -437232 -442946 -482200 -404529 -84634 110990 198425 342450
24443 342450 249199 374746 460265 364075 357428 382170 316521 74461 -206774 -139120 -214655
24432 -214655 -147204 -70861 -15262 -131593 -216260 -156434 -203173 -416327 -488678 -351727 -249569
24421 -249569 -34542 -161984 -110959 -35710 -27542 276 -382125 -351261 -105291 -133911 -256314
24410 -256314 -186307 -323878 -427766 -34808 121971 -185814 -219025 -53492 40327 -36840
24400 -36840 117153 262892 304820 172903 -96142 -115881 22375 211617 287803 219353
24390 219353 69148 314810 382000 176017 64304 140918 -17032 -92562 -164317 18294
24380 18294 138821 128485 154932 392303 464995 420470 317397 58811 -31320 -132354 -185636
$$ packed form
24454a3413j52353p7384j56720l7362n714l9254P7671L19895J95624Q7435J44025
24443C42450r3251J25547Q5519r6190o647K4742o5649k42060k81235O7654p5535
24432b14655O7451P6343N5599j16331q4667N9826m6739k13154p2351J36951J02158
24421b49569K15027j27442N1025P5249Q168K7818l82401L0864K45970k8620j22403
24410b56314P0007j37571j03888L92958J56779l07785l3211J65533R3819p7167
24400c6840J53993J45739M1928j31917k69045j9739J38256J89242P6186o8450
24390B19353j50205K45662O7190k05983j11713P6614j57950p5530p1755J82611
24380A8294J20527j0336K6447K37371P2692m4525j03073k58586r0131j01034n3282
$$ plain form
24369 -185636 -26674 -125849 -191257 -75283 -177749 -119539 12639 40473 -154602 -147383 -104712
24358 -104712 4908 94773 92104 89612 94239 128119 118617 -61161 44836 -130576 -84369
24347 -84369 4189 -38062 -122823 22704 46457 -103676 -89577 1018 -115580 -254426 -243540
24336 -243540 -204036 -153418 -69527 -48834 17929 -6276 -66615 -59619 -198344 -206123 -236015 -191385
24324 -191385 -279015 -259252 -230636 -136217 -85421 64931 292786 -4995 -55663 4748 105386
24313 105386 -149294 -3182 218326 73006 -215616 -401016 -239991 -160637 -248330 -321411
24303 -321411 -102656 -140843 -144561 -219325 -238117 -268458 -300460 -168074 110575 214232 304955
24292 304955 218706 85333 45603 93039 161810 41506 -8947 92485 -35345 -132229 -150859
$$ packed form
24369a85636J58962r9175o5408J15974j02466N8210J32178K7834j95075P219M2671
24358a04712J09620Q9865k669k492M627L3880r502j79778J05997j75412M6207
24347h4369Q8558m2251q4761J45527K3753j50133J4099R0595j16598j38846J0886
24336b43540L9504N0618Q3891K0693O6763k4205o0339O996j38725p779k9892M4630
24324a91385q7630J9763K8616R4419N0796J50352K27855k97781n0668O0411J00638
24313A05386k54680J46112K21508j45320k88622j85400J61025P9354q7693p3081
24303c21411K18755l8187l718p4764j8792l0341l2002J32386K78649J03657R0723
24292C04955q6249j33373l9730M7436O8771j20304n0453J01432j27830r6884j8630
$$ plain form
24281 -150859 -362836 -341251 -242375 -1507 259867 6451 -207561 -349760 -98277 153512
24271 153512 208154 495578 575757 421571 193923 72329 168873 -38523 -152204 -251335
24261 -251335 -222379 -42621 -6534 -80137 -380864 -403540 -129763 -55163 -122362 -13505 -58141
24250 -58141 33283 -134375 -107878 -42842 16626 29636 498704 623384 432858 339070 248872
24239 248872 145483 24549 14056 -112045 -281552 -197753 -147848 -183172 -94431 -63545 -242021
24228 -242021 -478271 -242899 -141248 -387019 -371397 -270325 -58118 50288 180943 171605
24218 171605 -105585 -98198 -84778 -180308 -259201 -380704 -394517 -240619 -85847 -117626 -103096
24207 -103096 -329702 -227686 -159725 -265703 -26882 50163 23727 -169163 -265473 -286710
$$ packed form
24281a50859k11977K1585R8876K40868K61374k53416k14012j42199K51483K51789
24271A53512N4642K87424Q0179j54186k27648j21594R6544k07396j13681r9131
24261b51335K8956J79758L6087p3603l00727k2676K73777P4600o7199J08857m4636
24250e8141R1424j67658K6497O5036N9468J3010M69068J24680j90526r3788r0198
24239B48872j03389j20934j0493j26101j69507Q3799M9905l5324Q8741L0886j78476
24228b42021k36250K35372J01651k45771J5622J01072K12207J08406J30655r338
24218A71605k77190P387J3420r5530p8893j21503j3813J53898J54772l1779J4530
24207a03096k26606J02016O7961j05978K38821P7045k6436j92890r6310k1237
$$ plain form
24197 -286710 -329292 -355780 -445412 -423368 -91025 14302 -269901 -346965 -216202 -11807
24187 -11807 3376 105157 92857 9942 -101407 -157826 -514560 -424890 -248922 23135 137228
24176 137228 383425 238055 147805 74078 -24355 -39664 -302642 -589880 -559334 -293666
24166 -293666 -251625 -269761 -247026 -326500 -69591 -99967 15752 160625 145249 53743 -2530
24155 -2530 -57378 -217612 -229579 -166346 -182365 -315860 -270720 -28311 56753 269035 270953
24144 270953 106750 122577 -127229 -122148 -249575 -204646 -67701 71684 38466 -9218 22966
24133 22966 -109850 -150476 122466 240012 212956 163483 -180702 -340907 -294090 -410383
24123 -410383 -435022 -433509 -478176 -293736 -29254 81782 422340 400936 253658 202345 9559
$$ packed form
24197b86710m2582k6488q9632K2044L32343J05327k84203p7064J30763K04395
24187a1807J5183J01781j2300q2915j11349n6419l56734Q9670J75968K72057J14093
24176A37228K46197j45370r0250p3727r8433j5309k62978k87238L0546K65668
24166b93666M2041j8136K2735p9474K56909l0376J15719J44873j5376r1506n6273
24155b530n4848j60234j1967O3233j6019j33495M5140K42409Q5064K12282J918
24144B70953j64203J5827k49806N081j27427M4929J36945J39385l3218m7684L2184
24133B2966j32816m0626K72942J17546k7056m9473l44185j60205M6817j16293
24123d10383k4639J513m4667J84440K64482J11036L40558k1404j47278n1313j92786
$$ plain form
24112 9559 210714 318298 58358 -99911 42748 125032 115343 47668 89835 89820 -18991
24101 -18991 -51635 285001 289125 157710 -55171 -130249 -64862 -4451 -77908 -59929 -87766
24090 -87766 -187696 -484587 -533218 -466754 -334601 -215331 -143633 -47545 -101319 -24426 198292
24079 198292 282120 244677 65023 22796 172538 36078 -4385 59900 -53577 -60666 -26672
24068 -26672 20406 -139756 -87576 -103984 1165 46731 -50220 19475 8397 -119944 -201550
24057 -201550 142713 286597 396759 370227 326250 188147 -185051 -43478 245766 266865
24047 266865 152414 77114 -127962 -184996 -279656 -296055 -178013 18147 26625 1969 -151835
24036 -151835 -46820 -8375 77330 -29926 3501 -87218 -79136 69643 45383 -89211 -296979
$$ packed form
24112I559K01155J07584k59940j58269J42659Q2284r689o7675M2167j5j08811
24101a8991l2644L36636M124j31415k12881p5078O5387O0411p3457J7979k7837
24090h7766r9930k96891m8631O6464J32153J19270P1698R6088n3774P6893K22718
24079A98292Q3828l7443j79654m2227J49742j36460m0463O4285j13477p089L3994
24068b6672M7078j60162N2180j6408J05149M5566r6951O9695j1078j28341q1606
24057b01550L44263J43884J10162k6532m3977j38103l73198J41573K89244K1099
24047B66865j14451p5300k05076n7034r4660j6399J18042J96160Q478k4656j53804
24036a51835J05015L8445Q5705j07256L3427r0719Q082J48779k4260j34594k07768
$$ plain form
24025 -296979 -103955 -34375 -99210 -44702 9435 43076 -318 117034 269408 65010 -20394
24014 -20394 118819 172814 73432 -173388 -22541 332966 208846 120276 196742 293655 290085
24003 290085 205470 -14951 -97471 112919 227314 131514 -229370 -380031 -146700 -163570
23993 -163570 -67390 234000 261155 88992 -200088 -235929 42564 207818 257554 289584
23983 289584 471181 483736 299930 66564 25797 -52409 -138455 -52567 -17415 -2652 3101
23972 3101 -43911 -201525 -304748 -102009 38170 198207 -16194 -221860 -160670 -457260
23962 -457260 -408417 -207136 -355755 -479103 -408043 -544150 -692182 -500641 -313837 -388110
23952 -388110 -177616 -105129 -155810 55326 41400 -38957 -20987 266080 183504 3760 -157833
$$ packed form
24025b96979J93024O9580o4835N4508N4137L3641m3394J17352J52374k04398q5404
24014b0394J39213N3995r9382k46820J50847L55507j24120q8570P6466R6913l570
24003B90085q4615k20421q2520K10390J14395r5800l60884j50661K33331j6870
23993a63570R6180L01390K7155j72163k89080l5841K78493J65254M9736L2030
23983B89584J81597J2555j83806k33366m0767p8206q6046Q5888L5152J4763N753
23972C101m7012j57614j03223K02739J40179J60037k14401k05666O1190k96590
23962d57260M8843K01281j48619j23348P1060j36107j48032J91541J86804p4273
23952c88110K10494P2487n0681K11136j3926q0357J7970K87067q2576j79744j61593
$$ plain form
23941 -157833 -78355 -203798 -111285 -7958 -217144 -263362 -195381 -312053 -166010 -83071
23931 -83071 -73032 -61357 -261636 -392595 -240882 -134883 -121942 -179848 -144260 -268967 -485669
23920 -485669 -531024 -459055 -283289 -220729 -158895 -165077 -166384 -104607 -55961 -275643 -450438
23909 -450438 -407191 -381969 -493801 -402906 -152372 -77658 -72880 -183674 -261167 -394514 -449417
23898 -449417 -192404 -143224 -307748 -155597 -312790 -103516 -54129 -341977 -532961 -456182
23888 -456182 -251707 -28243 -73507 70436 258517 112466 5964 -220793 -216720 -91267
23878 -91267 -35797 41446 3098 -89256 -276620 -493914 -480455 -364717 -173677 -271679 -333404
23867 -333404 -87912 -64704 47832 117186 174194 232317 90805 -56025 -241290 -5039
$$ packed form
23941a57833P9478j25443R2513J03327k09186m6218O7981j16672J46043Q2939
23931h3071J0039J1675k00279j30959J51713J05999J2941n7906L5588j24707k16702
23920d85669m5355P1969J75766O2560O1834o182j307O1777M8646k19682j74795
23909d50438M3247K5222j11832R0895K50534P4714M778j10794p7493j33347n4903
23898d49417K57013M9180j64524J52151j57193K09274M9387k87848j90984P6779
23888d56182K04475K23464m5264J43943J88081j46051j06502k26757M073J25453
23878i1267N5470P7243l8348r2354j87364k17294J3459J15738J91040r8002o1725
23867c33404K45492K3208J12536O9354N7008N8123j41512j46830j85265K36251
$$ plain form
23857 -5039 200714 314959 8674 -205326 -325694 -138635 -60585 -16493 46605 -161768
23847 -161768 -147862 -47115 -122733 -124063 -69440 -47867 -78123 -47065 174134 -85459 -311789
23836 -311789 -382889 -137237 -69563 87695 270214 99419 -133180 -153166 -442613 -511825
23826 -511825 -253718 -162146 88785 261016 465602 423424 256872 228031 330587 225601
23816 225601 93789 -79760 327476 528355 512235 437841 228836 240393 272250 207019
23806 207019 331018 316379 62563 -307382 -407190 -365047 -244996 -148245 -116747 -169076 -205121
23795 -205121 -201693 -93715 74818 -4617 2731 27150 83809 -135377 -157478 10493 180059
23784 180059 187391 34894 158705 235790 56944 173462 390118 204131 96638 108171
$$ packed form
23857e039K05753J14245l06285k14000j20368J87059P8050M4092O3098k08373
23847a61768J3906J00747p5618j330N4623K1573l0256L1058K21199k59593k26330
23836c11789p1100K45652O7674J57258J82519j70795k32599j9986k89447o9212
23826e11825K58107R1572K50931J72231K04586m2178j66552k8841J02556j04986
23816B25601j31812j73549M07236K00879j6120p4394k09005J1557L1857o5231
23806B07019J23999j4639k53816l69945r9808M2143J20051R6751L1498n2329l6045
23795b05121L428J07978J68533p9435P348K4419N6659k19186k2101J67971J69566
23784A80059P332j52497J23811P7085j78846J16518K16656j85987j07493J1533
$$ plain form
23774 108171 312850 229494 -19674 -280673 -260803 -127866 -166576 -448459 -652151 -788661
23764 -788661 -448730 -116037 15097 139377 145498 2842 -57573 19046 -94039 -258349
23754 -258349 -209765 -55031 -201705 -388142 -504825 -341864 -18851 381686 507213 165127
23744 165127 104746 -153954 -165975 -347837 -292882 54417 350957 419142 193369 20375
23734 20375 59448 -21219 -263981 -133358 -134480 -32820 100826 65155 -122182 45244 90115
23723 90115 56665 -120517 -338378 -440010 -433112 -38440 206611 46274 -192602 -53943
23713 -53943 -28573 -271790 -335773 -319977 -393338 -159870 -199214 -180338 -267577 -245158 -165095
23702 -165095 -241510 -245832 62147 357049 191847 30637 195586 140072 45813 21572 -78597
$$ packed form
23774A08171K04679q3356k49168k60999J9870J32937l8710k81883k03692j36510
23764g88661L39931L32693J31134J24280O121j42656o0415P6619j13085j64310
23754b58349M8584J54734j46674j86437j16683J62961L23013M00537J25527l42086
23744A65127o0381k58700j2021j81862N4955L47299K96540O8185k25773j72994
23734B0375L9073q0667k42762J30623j122J01660J33646l5671j87337J67426M4871
23723I0115l3450j77182k17861j01632O898L94672K45051j60337k38876J38659
23713e3943K5370k43217o3983J5796p3361K33468l9344J8876q7239K2419Q0063
23702a65095p6415m322L07979K94902j65202j61210J64949n5514r4259k4241j00169
$$ plain form
23691 -78597 -85795 36983 69727 51188 43466 -45788 -142725 -35958 5034 -252461 -140696
23680 -140696 119134 394384 297670 66069 -122663 -268585 -107661 234485 200640 208911
23670 208911 250191 96554 53536 173278 204760 180004 192573 49482 8231 -127933 -364102
23659 -364102 -432612 -479045 -492167 -394290 -101421 -206628 -283862 -151038 -45391 -15879 -806
23648 -806 -107166 -30212 288098 141619 83374 63758 -83382 -3107 150963 329328 273419
23637 273419 215148 164558 158282 112566 -14191 76062 45086 -16960 -72767 -131629 -252655
23626 -252655 -231254 -56533 51014 -88916 -250698 -229997 -149648 -82552 108665 41620
23616 41620 207093 -84673 -502091 -485317 -249040 -252718 -120489 -106050 -217922 -66517
$$ packed form
23691g8597p198J22778L2744j8539p722q9254r6937J06767M0992k57495J11765
23680a40696K59830K75250r6714k31601j88732j45922J60924L42146l3845Q271
23670B08911M1280j53637m3018J19742L1482k4756J2569j43091m1251j36164k36169
23659c64102o8510m6433j3122R7877K92869j05207p7234J32824J05647K9512J5073
23648h06j06360P6954L18310j46479n8245j9616j47140Q0275J54070J78365n5909
23637B73419n8271n0590o276m5716j26757R0253l0976o2046n5807n8862j21026
23626b52655K1401J74721J07547j39930j61782K0701Q0349O7096J91217o7045
23616D1620J65473k91766m17418J6774K36277l678J32229J4439j11872J51405
$$ plain form
23606 -66517 66924 -55703 -4287 51798 247481 218240 985 149973 357516 414832
23596 414832 288608 120465 67008 -9208 209596 252300 -10517 -115330 -12624 56161
23586 56161 65897 54878 -52614 -93626 -168077 -120376 -201111 -58754 212242 485942 500645
23575 500645 226114 215271 267710 133535 -354258 -293715 -7568 213881 174979 177925 60582
23564 60582 -32904 56691 101039 208116 -2150 -33480 -59559 -173572 -248279 -223040 -169232
23553 -169232 -258777 -277913 -93274 -91524 56441 200891 112615 429605 556761 308671
23543 308671 275496 333251 356512 354154 129667 2284 166612 280272 -6072 -188873
23533 -188873 -168510 201930 270906 71560 41239 306518 212339 63479 -133381 -211500
$$ packed form
23606f6517J33441j22627N1416N6085J95683k9241k17255J48988K07543N7316
23596D14832j26224j68143n3457p6216K18804M2704k62817j04813J02706O8785
23586E6161R736j1019j07492m1012p4451M7701q0735J42357K70996K73700J4703
23575E00645k74531j0843N2439j34175m87793O0543K86147K21449l8902K946j17343
23564F0582r3486Q9595M4348J07077k10266l1330k6079j14013p4707K5239N3808
23553a69232q9545j9136J84639J750J47965J44450q8276L16990J27156k48090
23543C08671l3175N7755K3261k358k24487j27383J64328J13660k86344j82801
23533a88873K0363L70440O8976j99346l0321K65279r4179j48860j96860p8119
$$ plain form
23523 -211500 -259431 -296435 -229700 -273194 -418625 -583819 -299021 7 28185 -197000
23513 -197000 -292137 -271787 -156440 -122626 -78522 22462 102788 -240398 -288360 -241863 -133176
23502 -133176 -15389 -179634 -65723 59319 54355 231945 238449 80117 -138155 -148480
23492 -148480 -178374 -302848 -195473 55036 4118 156718 278807 526324 504326 162999
23482 162999 -14610 178359 89342 -185268 -137642 -142714 -209408 -286675 -305802 -365086 -323142
23471 -323142 19001 201071 47075 -15049 245962 170867 128496 160263 -142306 -322864
23461 -322864 -434051 -513688 -232287 196099 145987 -13954 50190 136598 397806 418776
23451 418776 -169714 -112128 -1991 -121015 -400262 -395472 -187734 -68042 -58285 -214533
$$ packed form
23523b11500m7931l7004O6735m3494j45431j65194K84798K99028K8178k25185
23513a97000r5137K0350J15347L3814M4104J00984Q0326l43186m7962M6497J08687
23502a33176J17787j64245J13911J25042m964J77590O504j58332k18272j0325
23492a48480k9894j24474J07375K50509n0918J52600J22089K47517k1998l41327
23482A62999j77609J92969q9017k74610M7626n072o6694p7267j9127n9284M1944
23471c23142L42143J82070j53996o2124K61011p5095m2371L1767l02569j80558
23461c22864j11187p9637K81401M28386n0112j59941O4144Q6408K61208K0970
23451D18776n88490N7586J10137j19024k79247M790K07738J19692R757j56248
$$ plain form
23441 -214533 -277043 -168927 450 -89419 -174230 -116376 -113001 -323645 -456269 -483207 -354735
23430 -354735 -424508 -304881 -184853 -184718 -214458 -358556 -163465 59067 79189 141843 193910
23419 193910 57212 139660 194693 58772 252140 192736 190901 44494 -401934 -571644
23409 -571644 -351041 -87892 20516 -152597 -166525 -73376 -217260 -32152 110557 71332
23399 71332 26568 172218 276373 222300 214329 -72914 11872 83371 7532 150069 340138
23388 340138 260278 153879 341335 304332 180915 34199 -106478 -237567 -390389 -563594
23378 -563594 -674725 -560744 -494725 -433227 -566129 -369944 -378582 -295390 -149016 1658
23368 1658 84617 -169595 -293025 -214042 -301320 -221304 -89584 30333 -2523 -93640 -81140
$$ packed form
23441b14533o2510J08116J69377q9869q4811N7854L375k10644j32624k6938J28472
23430c54735o9773J19627J20028J35k9740j44098J95091K22532K0122O2654N2067
23419A93910j36698Q2448N5033j35921J93368n9404j835j46407m46428j69710
23409e71644K20603K63149J08408j73113j3928R3149j43884J85108J42709l9225
23399G1332m4764J45650J04155n4073p971k87243Q4786P1499p5839J42537J90069
23388C40138p9860j06399J87456l7003j23417j46716j40677j31089j52822j73205
23378e63594j11131J13981O6019O1498j32902J96185q638Q3192J46374J50674
23368A658Q2959k54212j23430P8983q7278Q0016J31720J19917l2856r1117J2500
$$ plain form
23357 -81140 -169821 -330500 -334435 -302264 -318360 -79881 222685 304693 280497 11471 18451
23346 18451 26201 -7800 182994 275503 136518 64625 31111 179931 301808 213642 29315
23335 29315 182951 272144 370713 316179 316193 181128 203101 126906 -15111 -85239 3202 67921
23323 67921 195523 167169 157680 166011 76098 34923 155875 29866 -138234 -222044 -330257
23312 -330257 -164726 8326 173472 93705 96389 -149994 -337462 -297574 -220515 -141168 -10790
23301 -10790 -105500 -58018 23427 83264 -63516 -71686 166682 456827 628390 487228 265248
23290 265248 196094 163417 -10939 -52679 115569 -5270 -127839 116666 152749 -87703
23280 -87703 -235647 -252341 -88300 -100127 -378551 -434215 -241450 -362944 -208076 -148796
$$ packed form
23357h1140q8681j60679l935L2171j6096K38479L02566Q2008k4196k69026O980
23346A8451P750l4001J90794R2509j38985p1893l3514J48820J21877q8166j84327
23335B9315J53636Q9193R8569n4534J4j35065K1973p6195j42017p0128Q8441O4719
23323F7921J27602k8354r489Q331q9913m1175J20952j26009j68100q3810j08213
23312c30257J65531J73052J65146p9767K684k46383j87468L9888P7059P9347J30378
23301a0790r4710M7482Q1445N9837j46780q170K38368K90145J71563j41162k21980
23290B65248o9154l2677j74356m1740J68248j20839j22569K44505L6083k40452
23280h7703j47944j6694J64041j1827k78424n5664J92765j21494J54868N9280
$$ plain form
23270 -148796 -91347 -274139 -23326 -148592 -330715 -434676 -483831 -266313 -46804 54282
23260 54282 74897 -48470 -303559 -578113 -603846 -407356 -260381 -214974 -223254 -57259 -38068
23249 -38068 116724 125397 127886 248495 251211 254092 23436 -38875 58175 168796 212897 144787
23237 144787 -22369 -109019 -121905 -54340 -12794 32046 276531 327379 61617 117653 129436
23226 129436 93520 9127 -17206 143318 -20514 -127424 -76306 81776 132847 240868
23216 240868 3704 3653 212678 153293 -256229 -344637 -430367 -399825 -284646 -210004 -255856
23205 -255856 -142220 -165368 -291142 -182548 -22965 43632 10392 266644 383624 413873
23195 413873 207323 87867 84156 140213 215649 268292 277337 154698 -559 -381909 -179507
$$ packed form
23270a48796N7449j82792K50813j25266j82123j03961m9155K17518K19509J01086
23260E4282K0615j23367k55089k74554k5733J96490J46975M5407q280J65995J9191
23249c8068J54792Q673K489J20609K716K881k30656o2311R7050J10621M4101o8110
23237A44787j67156q6650j2886O7565M1546M4840K44485N0848k65762N6036J1783
23226A29436l5916q4393k6333J60524j63832j06910N1118J58082N1071J08021
23216B40868k37164n1K09025n9385m09522q8408q5730L0542J15179P4642m5852
23205b55856J13636k3148j25774J08594J59583O6597l3240K56252J16980L0249
23195D13873k06550j19456l711N6057P5436N2643R045j22639j55257l81350K02402
$$ plain form
23184 -179507 69470 123409 89456 38218 -63072 -220361 31052 335930 278642 154533
23174 154533 189827 51990 79006 115603 -47467 8897 -86337 -216449 -379723 -425598 -508661
23163 -508661 -266719 -86838 125445 269103 383511 281693 300649 361572 99438 -160125
23153 -160125 -181014 33936 198598 -40121 -75224 279949 419658 297738 -23619 49033
23143 49033 217238 229697 -85436 -69588 -36679 -93177 25721 144353 -2234 259251
23133 259251 268321 388299 373572 282214 -15658 260682 325648 293769 314331 -19229 -156812
23122 -156812 -54164 194432 255099 -108601 -266571 -215848 -251331 -263045 -60858 141193
23112 141193 -101530 -266894 -135352 -114772 -298219 -301212 -186465 21171 -74657 -361121
$$ packed form
23184a79507K48977N3939l3953n1238j01290j57289K51413L04878n7288j24109
23174A54533L5294j37837K7016L6597j63070N6364r5234j30112j63274m5875q3063
23163e08661K41942J79881K12283J43658J14408j01818J8956O0923k62134k59563
23153a60125k0889K14950J64662k38719l5103L55173J39709j21920l21357P2652
23143D9033J68205J2459l15133J5848L2909n6498J18898J18632j46587K61485
23133B59251R070J19978j4727r1358k97872K76340O4966l1879K0562l33560j37583
23122a56812J02648K48596O0667l63700j57970N0723l5483j1714K02187K02051
23112A41193k42723j65364J31542K0580j83447k993J14747K07636r5828k86464
$$ plain form
23102 -361121 -641452 -689622 -495499 -201327 -275384 -312459 -160514 175345 49266 -141451
23092 -141451 35079 56235 145926 185060 94263 54718 16794 -63403 -84159 -18354 173951
23081 173951 17820 -60866 -23126 41865 -93079 -514065 -437938 -339861 -363637 -314189 -343147
23070 -343147 -272103 -186909 -62938 109577 31099 172564 310756 377991 304628 133928
23060 133928 84592 -57702 -344807 -265945 37447 122716 -24829 -131406 -139838 -96184 -10451
23049 -10451 76097 63051 160955 203747 52929 -80094 22555 232980 183392 124357 233453
23038 233453 -738 -50140 -126042 8344 218387 89598 -70401 -49608 -42026 69539
23028 69539 105310 -117266 -153171 -16014 174342 159926 325595 383893 201200 141598 275472
$$ packed form
23102c61121k80331m8170J94123K94172p4057l7075J51945L35859j26079j90717
23092a41451J76530K1156Q9691L9134r0797l9545l7924q0197k0756O5805J92305
23081A73951j56131p8686L7740O4991j34944m20986P6127R8077k3776M9448k8958
23070c43147P1044Q5194J23971J72515p8478J41465J38192O7235p3363j70700
23060A33928m9336j42294k87105P8862L03392Q5269j47545j06577q432M3654Q5733
23049a0451Q6548j3046R7904M2792j50818j33023J02649K10425m9588n9035J09096
23038B33453k34191m9402p5902J34386K10043j28789j59999K0793P582J11565
23028F9539L5771k22576l5905J37157J90356j4416J65669N8298j82693n9602J33874
$$ plain form
23017 275472 289201 -68649 -88446 -130164 -339727 -292531 -324659 -226365 -89074 -226805 -507273
23006 -507273 -512414 -486435 -456250 -295664 -146659 -143104 -23034 156544 212507 32566 -62703
22995 -62703 180804 189830 52850 68291 -129001 -219706 -147814 -269907 -91526 173769 169873
22984 169873 82360 65899 -73159 -279307 -239270 -183383 -70853 -128274 -212840 -118824 52078
22973 52078 194105 62022 -11304 25734 103495 260822 193287 -32662 47685 8236 -258796
22962 -258796 -212686 -161500 -136014 -225716 -28378 -81051 -234261 -165984 -61746 130675 122219
22951 122219 265192 233302 169455 229700 230371 284110 277766 124002 46602 15252 42259 215677
22939 215677 340139 224332 129165 -87731 -147810 -75613 -15736 101234 135088 171871 115616
$$ packed form
23017B75472J3729l57850j9797m1718k09563M7196l2128R8294J37291j37731k80468
23006e07273n141K5979L0185J60586J49005L555J20070J79578N5963j79941r5269
22995f2703K43507R026j36980J5441j97292r0705P1892j22093J78381K65295l896
22984A69873q7513j6461j39058k06148M0037N5887J12530n7421q4566R4016J70902
22973E2078J42027j32083p3326L7038P7761J57327o7535k25949Q0347l9449k67032
22962b58796M6110N1186K5486q9702J97338n2673j53210O8277J04238J92421q456
22951A22219J42973l1890o3847O0245O71N3739o344j53764p7400l1350K7007J73418
22939B15677J24462j15807r5167k16896o0079P2197N9877J16970L3854L6783n6255
$$ plain form
22928 115616 36285 7707 -26412 -178638 -189274 -230042 -256748 -288179 -90788 -99741 -2448
22917 -2448 14300 27072 -232563 -360116 -260618 -235844 -88864 -30411 174056 98382 214714
22906 214714 154249 53155 -102722 -258205 -330258 -222648 -139150 -181248 -242949 -276676 -230096
22895 -230096 -49742 -94128 -211609 -126208 1753 238777 110291 -26074 -202096 -118062
22885 -118062 76928 -62027 -199678 -11416 129582 -22665 -23953 -79728 -86079 -127054 -460668
22874 -460668 -484504 -331579 -304351 -314064 -357871 -197400 -218177 -74641 -211258 -259080 -179085
22863 -179085 -54425 12584 26110 -171270 -60696 112901 166537 128231 227361 139234 -66399
22852 -66399 -280644 -404464 -238515 -80914 33673 79672 44479 -174364 -82794 -198044
$$ packed form
22928A15616p9331k8578l4119j52226j0636m0768k6706l1431J97391q953R7293
22917b448J6748J2772k59635j27553R9498K4774J46980N8453K04467p5674J16332
22906B14714o0465j01094j55877j55483p2053J07610Q3498m2098o1701l3727M6580
22895b30096J80354m4386j17481Q5401J27961K37024j28486j36365j76022Q4034
22885a18062J94990j38955j37651J88262J40998j52247j288n5775o351m0975l33614
22874d60668k3836J52925K7228r713m3807J60471k0777J43536j36617m7822P9995
22863a79085J24660O7009J3526j97380J10574J73597N3636l8306R9130q8127k05633
22852f6399k14245j23820J65949J57601J14587M5999l5193k18843R1570j15250
$$ plain form
22842 -198044 -127394 -131885 -184111 -205868 -175464 -274433 -7128 251760 336471 239104 308072
22831 308072 251346 266212 434769 387332 275220 286208 270944 63317 -294031 -251213 -36681
22820 -36681 -13937 236383 110537 -62592 -216950 -323227 -210039 37533 33121 123913
22810 123913 265115 224685 168564 -44854 -16060 -162014 -56090 -40180 -60787 -64095 71723
22799 71723 109657 138886 252630 154909 64098 425686 647936 435479 257327 160296 206592
22788 206592 75336 193225 149367 18151 33592 -418238 -514166 -427317 -196681 47657
22778 47657 273676 313459 142549 305002 327626 390670 304382 231119 231041 188477 -11334
22767 -11334 95076 33392 -175186 -195433 -239115 -162672 -193306 -238961 -180905 -252253 -276670
$$ packed form
22842a98044P0650m491n2226k1757L0404r8969K67305K58888Q4711r7367O8968
22831C08072n6726J4866J68557m7437j12112J0988j5264k07627l57348M2818K14532
22820c6681K2744K50320j25846j73129j54358j06277J13188K47572m412R0792
22810A23913J41202m0430n6121k13418K8794j45954J05924J5910k0607l308J35818
22799G1723L7934K9229J13744r7721r0811L61588K22250k12457j78152r7031M6296
22788B06592j31256J17889m3858j31216J5441m51830r5928Q6849K30636K44338
22778D7657K26019L9783j70910J62453K2624O3044q6288p3263p8m2564j99811
22767a1334J06410o1684k08578k0247m3682P6443l0634m5655N8056p1348k4417
$$ plain form
22756 -276670 -321940 -365818 -416824 -145418 35059 222513 233379 247525 436589 467015 363988
22745 363988 476848 326794 243549 42 -122933 -36674 100448 -23543 -242190 -172311
22735 -172311 92857 144254 175966 351068 258045 59159 -95407 -81370 57587 -106081
22725 -106081 -231081 -231875 -414335 -439566 -299564 -369283 -141956 49797 -97685 -343971
22715 -343971 -611824 -562883 -470498 -487061 -362131 -527556 -561754 -181947 215339 32260
22705 32260 77447 227222 246215 346694 336710 217460 77211 88771 259821 146638 9902
22694 9902 127249 273740 377483 288757 268110 211868 28582 1631 -88536 59387 -7190
22683 -7190 -193583 -243488 -149737 -178724 -69002 33300 -17677 -208684 -127353 50809 -36835
$$ packed form
22756b76670m5270m3878n1006K71406J80477J87454J0866J4146J89064L0426j03027
22745C63988J12860j50054q3245k43507j22975Q6259J37122j23991k18647O9879
22735a72311K65168N1397L1712J75102r3023j98886j54566J4037J38957j63668
22725a06081j25000p94j82460k5231J40002o9719K27327J91753j47482k46286
22715c43971k67853M8941R2385j6563J24930j65425l4198L79807L97286j83079
22705C2260M5187J49775J8993J00479r984j19250j40249J1560J71050j13183j36736
22694I902J17347J46491J03743q8726k0647n6242j83286k6951r0167J47923o6577
22683g190j86393m9905R3751k8987J09722J02302n0977j91007Q1331J78162q7644
$$ plain form
22672 -36835 -64272 -20113 12543 23606 -206094 -426899 -454703 -292151 31673 -119360 -138329
22661 -138329 -44291 -334041 -306513 -103872 -89835 100023 -113469 5401 69732 -17142
22651 -17142 24968 75117 42663 -82299 -88903 -76725 -84539 67372 235082 178483 90131
22640 90131 42737 6971 -73844 203855 -9005 -26957 141601 102401 237696 485144 263411
22629 263411 -27634 -92481 -82613 -71126 -140221 -169907 -353382 -281486 -44627 -218717 -314189
22618 -314189 -252081 -238336 -46902 86013 16659 -51041 5293 26781 163067 116695 137633
22607 137633 -49825 51224 227077 194308 50814 -24398 64404 -22424 -127336 -61563
22597 -61563 -57923 -155255 -238577 -87454 12724 83837 -63083 -157813 -439112 -492693 -320470
$$ packed form
22672c6835k7437M4159L2656J1063k29700k20805k7804J62552L23824j51033j8969
22661a38329R4038k89750K7528K02641J4037J89858k13492J18870O4331q6874
22651a7142M2110N0149l2454j24962o604J2178p814J51911J67710n6599q8352
22640I0131m7394l5766q0815K77699k12860j7952J68558l9200J35295K47448k21733
22629B63411k91045o4847R868J1487o9095k9686j83475P1896K36859j74090r5472
22618c14189O2108J3745J91434J32915o9354o7700N6334K1488J36286m6372K0938
22607A37633j87458J01049J75853l2769j43494p5212Q8802q6828j04912O5773
22597f1563L640r7332q3322J51123J00178P1113j46920r4730k81299n3581J72223
$$ plain form
22586 -320470 -294342 -105871 -51281 28029 -23181 37884 128948 110111 98968 -17512 -55581
22575 -55581 26514 187905 69003 30541 -127015 -199094 59266 194605 70746 23397
22565 23397 -15153 -146587 -207922 -108057 -213347 -515538 -389298 -105675 -230038 -108725
22555 -108725 -174288 -305115 -312110 -94154 151963 12832 -210141 -360106 -266929 33913
22545 33913 49580 116406 70016 -204638 -146380 9184 154054 -56575 -197124 6582
22535 6582 137834 7876 -198118 -137504 -171449 -239460 -282558 -319652 -247943 -317344 -298374
22524 -298374 -473618 -604632 -321226 -146220 -146812 -56052 -96002 -43760 -138435 -323947 -112332
22513 -112332 86879 138506 55471 -139644 -110069 221975 464792 793512 711117 458644
$$ packed form
22586c20470K6128J88471N4590P9310n1210O1065R1064j8837j1143j16480l8069
22575e5581Q2095J61391j18902l8462j57556p2079K58360J35339j23859m7349
22565B3397l8550j31434o1335R9865j05290l02191J26240K83623j24363J21313
22555a08725o5563j30827o995K17956K46117j39131k22973j49965R3177L00842
22545C3913J5667O6826m6390k74654N8258J55564J44870k10629j40549K03706
22535F582J31252j29958k05994O0614l3945o8011m3098l7094P1709o9401J8970
22524b98374j75244j31014K83406J75006n92R0760l9950N2242r4675j85512K11615
22513a12332J99211N1627q3035j95115K9575L32044K42817L28720q2395k52473
$$ plain form
22503 458644 305323 248058 135669 319404 368718 173559 118126 23516 79969 -4005 7112
22492 7112 -35430 -17502 161524 96671 2122 -60031 -65589 76737 170274 235410 109591
22481 109591 94522 195887 239496 57951 200758 136509 -124273 76326 -118572 -447109
22471 -447109 -438570 -349297 -357748 -141772 163183 108279 164053 257041 186799 140516 118341
22460 118341 118979 73170 72898 282403 281787 277151 565540 483413 188167 180398 53728 66309
22448 66309 -22290 -61795 83504 318992 325208 -20457 -252874 -323715 -92727 211600 134173
22437 134173 -78629 -358947 -238034 -142408 -232661 -44887 -22101 61443 233870 178890
22427 178890 -70805 -54425 -143218 16496 430851 640321 434560 256694 335862 440963
$$ packed form
22503D58644j53321n7265j12389J83735M9314j95159n5433r4610N6453q3974J1117
22492G112m2542J7928J79026o4853r4549o2153n558J42326R3537O5136j25819
22481A09591j5069J01365M3609j81545J42807o4249k60782K00599j94898l28537
22471d47109Q539Q9273q451K15976L04955n4904N5774R2988p0242m6283k2175
22460A18341O38m5809k72K09505o16m636K88389q2127k95246p769j26670J2581
22448F6309q8599l9505J45299K35488O216l45665k32417p0841K30988L04327p7427
22437A34173k12802k80318J20913R5626r0253J87774K2786Q3544J72427n4980
22427A78890k49695J6380q8793J59714M14355K09470k05761j77866P9168J05101
$$ plain form
22417 440963 407969 218579 39894 -80388 -2469 31083 256331 398717 284807 -73238
22407 -73238 115464 314733 284691 323228 256105 134279 19389 -165001 -325793 -410255
22397 -410255 -284654 -322603 -402719 -147247 31688 212949 384439 147193 136184 212932
22387 212932 7287 19007 41686 250664 294858 351905 156295 -209043 -131916 -84806 31506
22376 31506 -70000 -112542 57203 309827 340199 139694 -171203 -424900 -373260 -129043
22366 -129043 -63345 225982 433766 628441 480503 131250 -176324 -274982 -163714 -335715
22356 -335715 -474541 -219005 -47761 120090 341262 497411 421222 364085 374797 235904
22346 235904 106839 49243 156440 189699 47426 106354 285603 155955 -159698 -177920
$$ packed form
22417D40963l2994j89390j78685j20282P7919L3552K25248J42386j13910l58045
22407g3238J88702J99269l0042L8537o7123j21826j14890j84390j60792q4462
22397d10255J25601l7949q0116K55472J78935J81261J71490k37246j1009P6748
22387B12932k05645J1720K2679K08978M4194N7047j95610l65338P7127M7110J16312
22376C1506j01506m2542J69745K52624L0372k00505l10897k53697N1640K44217
22366a29043O5698K89327K07784J94675j47938l49253l07574r8658J11268j72001
22356c35715j38826K55536J71244J67851K21172J56149p6189n7137J0712j38893
22346B35904j29065n7596J07197L3259j42273N8928J79249j29648l15653j8222
$$ plain form
22336 -177920 -1757 -104771 -30602 121117 42630 -164329 -374321 -6387 169515 112664
22326 112664 53155 -138006 -240484 -199725 -83943 -59098 110894 218894 -6234 -179048
22316 -179048 -104931 20451 -83521 -125576 -135242 -55663 6314 211613 208325 281169 317297
22305 317297 262543 246286 205151 34816 83764 114023 71819 38679 -2952 -224546 -105345
22294 -105345 231175 299021 350662 146470 187608 124016 -32638 116934 208595 200205 229080
22283 229080 389277 505985 638333 542493 15468 60038 225939 313011 317848 2289
22273 2289 -141900 -77642 54590 58126 -21562 213031 457681 272059 360891 270040 186163
22262 186163 202083 206259 172127 320744 287164 353136 119643 2698 -129894 -230730 -202490
$$ packed form
22336a77920J76163j03014P4169J51719p8487k06959k09992L67934J75902n6851
22326A12664n9509j91161j02478M0759J15782K4845J69992J08000k25128j72814
22316a79048P4117J25382j03972m2055r666P9579O1977K05299l288P2844L6128
22305C17297n4754j6257m1135j70335M8948L0259m2204l3140m1631k21594J19201
22294a05345L36520O7846N1641k04192M1138o3592j56654J49572R1661q390K8875
22283B29080J60197J16708J32348r5840n27025M4570J65901Q7072M837l15559
22273B289j44189O4258J32232L536p9688K34593K44650j85622Q8832r0851q3877
22262A86163J5920M176l4132J48617l3580O5972k33493j16945j32592j00836K8240
$$ plain form
22251 -202490 43069 -15271 40016 69954 258424 196618 58180 246967 309301 269890 296263
22240 296263 268061 251111 429382 251243 76395 216460 313254 112086 -78158 76196
22230 76196 259905 338511 346612 257418 77304 -155127 -199492 -268134 -383036 -493409 -525188
22219 -525188 -547384 -370538 -41053 -30351 -37251 43805 33683 -22378 77459 53956 82768
22208 82768 25393 -52948 -164700 -205957 -156333 -303651 -339763 -173831 -179432 -296398 -122744
22197 -122744 -115846 -109990 157101 323628 382462 209884 130909 296283 445238 433033 236660
22186 236660 -53771 -17399 163296 175938 -32245 -176083 -216612 -233915 -1485 35966
22176 35966 132412 59417 -232382 -324980 -16978 338351 440366 513747 345238 257994 456170
$$ packed form
22251b02490K45559n8340N5287K9938J88470o1806j38438J88787O2334l9411K6373
22240B96263k8202j6950J78271j78139j74848J40065R6794k01168j90244J54354
22230G6196J83709P8606Q101q9194j80114k32431m4365o8642j14902j10373l1779
22219e25188k2196J76846L29485J0702o900Q1056j0122n6061R9837k3503K8812
22208H2768n7375p8341j11752m1257M9624j47318l6112J65932n601j16966J73654
22197a22744O898N856K67091J66527N8834j72578p8975J65374J48955j2205j96373
22186B36660k90431L6372J80695J2642k08183j43838m0529j7303K32430L7451
22176C5966R6446p2995k91799r2598L08002L55329J02015P3381j68509q7244J98176
$$ plain form
22165 456170 761413 403360 -90988 9299 -27479 -80179 130003 203100 71055 22808
22155 22808 -49079 -93278 -37489 240245 329661 346834 204025 116241 38927 22425 76870
22144 76870 133921 39989 -26312 3208 -69973 -9247 35368 68843 -7523 40096 208317
22133 208317 265878 55525 90108 120551 57066 138984 299253 352889 399405 296663 191394
22122 191394 219296 189754 -157940 -144298 -98422 -61454 -121934 109397 110521 -38126 7290
22111 7290 -126537 -207179 -23031 145356 130998 -68681 -183112 -338185 -322340 -23959
22101 -23959 275458 307249 189038 238271 -115098 -270582 -315358 -359029 -267694 77797 160980
22090 160980 110344 12172 -72363 33470 45668 177387 126681 67385 209068 226079 278098
$$ packed form
22165D56170L05243l58053m94348J00287l6778n2700K10182P3097j32045m8247
22155B2808p1887m4199N5789K77734Q9416J7173j42809q7784p7314j6502N4445
22144G6870N7051r3932o6301K9520p3181O0726M4615L3475p6366M7619J68221
22133B08317N7561k10353L4583L0443o3485Q1918J60269N3636M6516j02742j05269
22122A91394K7902k9542l47694J3642M5876L6968o0480K31331J124j48647M5416
22111G290j33827q0642J84148J68387j4358j99679j14431j55073J5845K98381
22101b3959K99417L1791j18211M9233l53369j55484m4776m3671R1335L45491Q3183
22090A60980n0636r8172q4535J05833J2198J31719n0706n9296J41683J7011N2019
$$ plain form
22079 278098 177023 -77665 -261462 -518843 -524485 -31605 80349 12905 -33787 -44373
22069 -44373 -88721 -48428 -32068 -277901 -166443 67271 355063 250245 88364 -68543
22059 -68543 -178312 -139447 142742 24310 -206504 -269076 -143449 52117 368844 388861
22049 388861 264303 -135625 -262690 -124029 -15090 34774 63343 267490 443014 366854
22039 366854 23067 158799 315247 173228 -37470 5030 242484 382364 362369 231707
22029 231707 445348 582879 513202 344878 186848 214273 363314 321954 235591 365963
22019 365963 418403 487593 289952 192264 83230 41228 127042 -41090 -167608 -316651
22009 -316651 -463101 -162456 157598 201207 196038 -74272 -419129 -247888 -32983 -69933
$$ packed form
22079B78098j01075k54688j83797k57381n642M92880J11954o7444m6692j0586
22069d4373m4348M0293J6360k45833J11458K33714K87792j04818j61881j56907
22059f8543j09769L8865K82189j18432k30814o2572J25627J95566L16727K0017
22049C88861j24558l99928j27065J38661J08939M9864K8569K04147J75524p6160
22039C66854l43787J35732J56448j42019k10698M2500K37454J39880j9995j30662
22029B31707K13641J37531o9677j68324j58030K7425J49041m1360q6363J30372
22019C65963N2440O9190j97641r7688j09034m2002Q5814j68132j26518j49043
22009c16651j46450L00645L20054M3609n169k70310l44857J71241K14905l6950
$$ plain form
21999 -69933 -189464 -15091 -74084 -8859 5988 -186607 28471 286943 79975 -8327
21989 -8327 -111559 90423 103683 103437 -25523 70153 79566 21378 171720 135638 -12670
21978 -12670 -54270 -120292 54097 -35054 -84019 73654 -97159 27554 156800 247781 471162
21967 471162 147330 -37503 62663 148493 151477 12404 -40812 211769 185570 126346 239748
21956 239748 210233 157405 56900 -70725 -98490 -173959 -321443 -435208 -278774 -219250
21946 -219250 -172837 -246342 -284788 -19783 265341 282015 238528 177567 54878 166779 41449
21935 41449 -115600 -38746 180292 271933 110432 139809 169727 294976 583441 498992 168801
21924 168801 50092 257367 277475 299774 260410 424666 301709 208717 98009 310123
$$ packed form
21999f9933j19531J74373n8993O5225J4847j92595K15078K58472k06968q8302
21989h327j03232K01982J3260k46j28960R5676R413n8188J50342l6082j48308
21978a2670m1600o6022J74389q9151m8965J57673j70813J24713J29246R0981K23381
21967D71162l23832j84833J00166Q5830K984j39073n3216K52581k6199n9224J13402
21956B39748k9515n2828j00505j27625k7765p5469j47484j13765J56434N9524
21946b19250M6413p3505l8446K65005K85124J6674m3487o0961j22689J11901j25330
21935D1449j57049P6854K19038R1641j61501K9377K9918J25249K88465q4449l30191
21924A68801j18709K07275K0108K2299l9364J64256j22957r2992j10708K12114
$$ plain form
21914 310123 309701 307040 339795 321627 149506 -80088 -274804 -269712 -200075 -116218 -76824 148546
21902 148546 374241 300025 60261 -83377 -364714 -329719 -218323 -397608 -376885 -308489
21892 -308489 -343823 -219876 -128235 -58780 14050 -7031 114254 39122 73819 141777 325764
21881 325764 239223 298852 207683 297105 65699 -114585 -197603 -60622 240368 332376 202363
21870 202363 324069 355620 572001 403352 242441 90790 131690 72310 131281 125240 292999
21859 292999 443990 414331 168371 105528 267346 149050 236825 288735 368919 281969 166012
21848 166012 107640 5277 -62411 160859 223761 85500 56448 265260 299970 200479 250156
21837 250156 23123 49744 102833 -31970 -252630 -184262 -250950 -252602 -250769 -19129 -248893
$$ packed form
21914C10123m22k661L2755j8168j72121k29594j94716N092O9637Q3857L9394K25370
21902A48546K25695p4216k39764j43638k81337L4995J11396j79285K0723O8396
21892c08489l5334J23947R1641O9455P2830k1081J21285p5132L4697O7958J83987
21881C25764q6541N9629r1169Q9422k31406j80284q3018J36981L00990R2008j30013
21870B02363J21706L1551K16381j68649j60911j51651M0900n9380N8971o041J67759
21859B92999J50991k9659k45960o2843J61818j18296Q7775N1910Q0184q6950j15957
21848A66012n8372j02363o7688K23270O2902j38261k9052K08812L4710r9491M9677
21837B50156k27033K6621N3089j34803k20660O8368o6688j652J833K31640k29764
$$ plain form
21826 -248893 -213988 -83777 90634 -770 -205522 -243564 -93449 215724 203412 106537
21816 106537 160854 33816 -74683 -241727 -151141 -143249 -178034 -72124 -10650 158631 193260
21805 193260 323539 384531 511580 359967 402611 697552 1118730 1346408 1415352 1478260
21795 1478260 1326642 1256472 1121836 742661 538747 417102 775364 1307726 1482113 1484536
21785 1484536 1564438 1508057 1472562 1259682 1102641 1161585 961790 728509 792880 788927 607349
21774 607349 432712 93092 -133107 -75040 66654 141528 362641 487513 587956 575697
21764 575697 403403 354822 466286 503851 346421 422259 393500 216895 -46586 -535832
21754 -535832 -458374 -241385 -276805 -155018 -182023 -306863 -347980 -298476 -173286 -128081 -175524
$$ packed form
21826b48893L4905J30211J74411r1404k04752l8042J50115L09173j2312r6875
21816A06537N4317j27038j08499j67044R0586P892l4785J05910O1474J69281L4629
21805A93260J30279O0992J27049j51613M2644K94941M21178K27678O8944O2908
21795A478260j51618p0170j34636l79175k03914j21645L58262N32362J74387K423
21785A484536P9902n6381l5495k12880j57041N8944j99795k33281O4371l953j81578
21774F07349j74637l39620k26199N8067J41694P4874K21113J24872J00443j2259
21764E75697j72294m8581J11464L7565j57430P5838k8759j76605k63481m89246
21754e35832P7458K16989l5420J21787k7005j24840m1117M9504J25190M5205m7443
$$ plain form
21743 -175524 8906 243715 101294 157524 200464 28853 -52431 -48154 76156 100668 -29854
21732 -29854 -111553 -158488 -202544 -143680 82782 137561 71988 -38533 -87977 -8569 96986
21721 96986 25548 -357130 -250879 -187829 -210895 -206413 -207773 -305197 -414098 -428078 -440273
21710 -440273 -141198 -40934 -323266 -303748 90630 165132 228708 205780 218252 36720
21700 36720 -111837 155213 255912 158693 39509 237920 569130 511466 366439 379727
21690 379727 331651 118105 -50747 -50138 -66387 -47194 -129577 66807 306495 267816 412228
21679 412228 298578 292622 356354 105755 128601 108281 288528 376243 490263 400191 199599
21668 199599 -152869 2690 262223 117042 71875 67884 165958 121273 98301 174345 92316
$$ packed form
21743a75524J84430K34809j42421N6230M2940j71611q1284M277J24310K4512j30522
21732b9854q1699m6935m4056N8864K26462N4779o5573j10521m9444P9408J05555
21721I6986p1438l82678J06251O3050k3066M482j360r7424j08901j3980j2195
21710d40273K99075J00264k82332J9518L94378P4502O3576k2928J2472j81532
21700C6720j48557K67050J00699r7219j19184J98411L31210n7664j45027J3288
21690C79727m8076k13546j68852O09j6249J9193q2383J96384K39688l8679J44412
21679D12228j13650n956O3732k50599K2846k0320J80247Q7715J14020r0072k00592
21668A99599l52468J55559K59533j45181m5167l991R8074m4685k2972P6044q2029
$$ plain form
21657 92316 150407 169257 219083 102070 -88586 123421 377419 363569 276081 359166 231811
21646 231811 225447 179723 51128 -141859 -67487 -22433 165059 170387 31525 30627 82691
21635 82691 95767 346903 413704 358075 87850 98161 371817 247360 352913 298790 4221
21624 4221 -112800 20840 97527 138870 40918 49145 28864 194693 91367 259682 354218
21613 354218 170995 -24557 99792 478692 608768 337909 132653 110420 215576 243676
21603 243676 220013 201002 231458 340381 313353 83778 126329 91723 -24849 -207664 -115296
21592 -115296 -145751 -301945 -417332 -335252 -215556 -112858 -142410 -23402 137367 293243
21582 293243 68037 155524 158843 -78383 -13528 312370 453816 389921 401933 413229 246931
$$ packed form
21657I2316N8091J8850M9826j17013j90656K12007K53998j3850q7488Q3085j27355
21646B31811o364m5724j28595j92987P4372M5054J87492N328j38862q98N2064
21635H2691J3076K51136O6801n5629k70225J0311K73656j24457J05553n4123k94569
21624D221j17021J33640P6687M1343r7952Q227k0281J65829j03326J68315R4536
21613C54218j83223j95552J24349L78900J30076k70859k05256k2233J05156K8100
21603B43676k3663j9011L0456J08923k7028k29575M2551l4606j16572j82815R2368
21592a15296l0455j56194j15387Q2080J19696J02698k9552J19008J60769J55876
21582B93243k25206Q7487L319k37226O4855L25898J41446o3895J2012J1296j66298
$$ plain form
21571 246931 -29461 -408292 -504162 -326130 -489303 -324181 86138 395876 509415 534043
21561 534043 583381 640920 353717 113877 166422 122974 32535 117720 63416 -77144 99232
21550 99232 -10714 -83776 103989 281372 53730 173195 252567 152061 -109166 -247266
21540 -247266 -55027 32070 -80891 97749 -30914 81701 23599 -108925 -205471 -96590
21530 -96590 177390 332747 89513 137261 -430 -72277 93735 190197 151270 74971 -1051
21519 -1051 106200 78871 -65652 103521 342021 374110 258124 39616 -70414 83598
21509 83598 528512 547733 697314 624136 634049 634578 454935 346869 137681 112105 158213
21498 158213 -69929 -45983 214060 430947 297880 87995 -166814 -153154 -197872 -232240
$$ packed form
21571B46931k76392l78831r5870J78032j63173J65122M10319L09738J13539K4628
21561E34043M9338N7539k87203k39840N2545m3448r0439Q5185n4304j40560J76376
21550I9232j09946p3062J87765J77383k27642J19465P9372j00506k61227j38100
21540b47266J92239Q7097j12961J78640j28663J12615n8102j32524r6546J08881
21530i6590K73980J55357k43234M7748j37691p1847J66012R6462l8927p6299p6022
21519a051J07251k7329j44523J69173K38500L2089j15986k18508j10030J54012
21509H3598M44914J9221J49581p3178R913N29j79643j08066k09188k5576M6108
21498A58213k28142K3946K60043K16887j33067k09885k54809J3660m4718l4368
$$ plain form
21488 -232240 52562 79878 114976 173956 -55157 -126739 -110977 -119071 -240303 -261276 -315085
21477 -315085 -392843 -168995 104950 -19191 46996 153137 172310 335657 319321 368912
21467 368912 418509 406985 440151 363867 431363 371233 255766 309111 107560 -77921 -68038
21456 -68038 24462 -90275 -302514 -213465 45849 269590 356418 420961 345719 228737 195861
21445 195861 226984 192861 23250 62654 165112 75900 264501 364406 338513 346590 233840
21434 233840 238978 68785 168499 206853 -7334 -168508 29445 181654 190763 104401 122478
21423 122478 285868 410114 253491 394747 413427 568919 551654 491902 583267 447259
21413 447259 593946 710737 606532 412024 724427 774399 553436 347634 292469 404904
$$ packed form
21488b32240K84802K7316L5098N8980k29113p1582J5762q094j21232k0973n3809
21477c15085p7758K23848K73945j24141O6187J06141J9173J63347j6336M9591
21467C68912M9597j1524L3166p6284O7496o0130j15467N3345k01551j85481R883
21456f8038R2500j14737k12239Q9049K59314K23741Q6828O4543p5242j16982l2876
21445A95861L1123l4123j69611L9404J02458q9212J88601R9905k5893Q077j12750
21434B33840N138j70193R9714L8354k14187j61174J97953J52209R109q6362J8077
21423A22478J63390J24246j56623J41256J8680J55492j7265n9752R1365j36008
21413D47259J46687J16791j04205j94508L12403M9972k20963k05802n5165J12435
$$ plain form
21403 404904 331233 326397 264817 143200 -46450 -103910 231258 387268 394013 395456 229397
21392 229397 216484 239343 381322 635686 739683 731239 881795 798144 816511 478894 470879
21381 470879 788124 767217 653017 584033 632224 545303 472429 318577 514334 495544 636319
21370 636319 837315 1024191 1087477 1011450 919204 957035 857530 752397 616205 579296 398241
21359 398241 186199 302504 454834 505417 529995 537409 696270 695065 716448 790847 785151
21348 785151 850039 598960 495265 523698 387833 223267 201440 180510 213026 317272
21338 317272 473905 446861 368833 418450 334609 308287 517880 642403 598815 260525 307806
21327 307806 457498 485315 508146 445512 685155 1035420 962780 816789 721461 564804
$$ packed form
21403D04904p3671m836o1580j21617j89650n7460L35168J56010O745J443j66059
21392B29397j2913K2859J41979K54364J03997q444J50556q3651J8367l37617q015
21381D70879L17245k0907j14200o8984M8191q6921p2874j53852J95757j8790J40775
21370F36319K00996J86876O3286p6027r2246L7831r9505j05133j36192l6909j81055
21359C98241k12042J16305J52330N0583K4578P414J58861j205K1383P4399n696
21348G85151O4888k51079j03695K8433j35865j64566k1827k0930L2516J04246
21338C17272J56633k7044p8028M9617q3841k6322K09593J24523m3588l38290M7281
21327C07806J49692K7817K2831o2634K39643L50265p2640j45991r5328j56657
$$ plain form
21317 564804 443480 631158 747119 626341 671801 770817 871137 804254 669653 580669
21307 580669 472689 760345 1098795 1086989 1216633 1429370 1392356 1539163 1833841 1697579
21297 1697579 1626113 1602568 1537592 1529818 1631748 1824933 1868318 1761994 1639451 1620114 1544120
21286 1544120 1439049 1664651 1879164 1915434 1966928 2107567 2138574 2071400 2090469 2168803
21276 2168803 2231389 2219940 2379156 2438520 2344147 2260227 2326450 2466382 2522736 2758718 3069383
21265 3069383 3363008 3662451 3821393 3875733 3925174 4262535 4496294 4882829 5168556 5340886
21255 5340886 5560871 6060626 6591093 7333603 8103559 8779336 9628346 10469595 11552026
21246 11552026 12961296 14366695 16336161 19197787 22687783 27408170 33842824 41570649
$$ packed form
21317E64804j21324J87678J15961j20778M5460R9016J00320o6883j34601q8984
21307E80669j07980K87656L38450j1806J29644K12737l7014J46807K94678j36262
21297A697579p1466k3545o4976p774J01930J93185M3385j06324j22543j9337p5994
21286A544120j05071K25602K14513L6270N1494J40639L1007o7174J9069P8334
21276B168803O2586j1449J59216N9364r4373q3920O6223J39932N6354K35982L10665
21265C069383K93625K99443J58942N4340M9441L37361K33759L86535K85727J72330
21255E340886K19985M99755N30467P42510P69956O75777Q49010Q41249J082431
21246A1552026J409270J405399J969466K861626L489996M720387O434654P727825
$$ plain form
21238 41570649 51750171 65488195 82777566 101157220 118366358 133322355 148357906
21231 148357906 162736583 171148596 170674836 163292625 156016847 152654135 148340422 139720472
21223 139720472 128539446 121749294 124498999 133157702 142769970 152306421 163041038 172847392
21215 172847392 175394142 168351032 154954824 142291771 132123485 119419753 100966372
21208 100966372 78224073 57469033 42929314 33537647 27124840 22277806 18874566
21201 18874566 16665002 14951095 13609334 12133381 10985240 10238313 9695163 9214149
21193 9214149 8616642 7873697 7200959 6763663 6109941 5667810 5378590 5257655 5123816
21184 5123816 4839904 4533754 4116520 3876540 3735609 3619221 3472653 3195395 3066413
$$ packed form
21238D1570649J0179522J3738024J7289371J8379654J7209138J4955997J5035551
21231A48357906J4378677Q412013m73760p382211p275778l362712m313713q619950
21223A39720472j1181026o790152K749705Q658703R612268R536451J0734617R806354
21215A72847392K546750p043110j3396208j2663053j0168286j2703732j8453381
21208A00966372k2742299k0755040j4539719r391667o412807m847034l403240
21201A8874566k209564j713907j341761j475953j148141p46927n43150m81014
21193I214149n97507p42945o72738m37296o53722m42131k89220j20935j33839
21184E123816k83912l06150m17234k39980j40931j16388j46568k77258j28982
$$ plain form
21175 3066413 2906780 2598293 2331535 2370924 2123722 1952421 1711447 1490927 1508545 1416729
21165 1416729 1442040 1425929 1235734 1275962 1295741 1336295 1341330 1429606 1326725 1226637 1269608
21154 1269608 1320029 1263309 1108254 964302 892337 1029464 961227 941715 901538 981761 1010034
21143 1010034 996266 857157 877767 1242423 1228518 1029993 953453 666353 560084 536584
21133 536584 598676 659934 466430 291884 216280 341214 601617 621783 714446 590180
21123 590180 276982 289115 465178 450971 344572 133391 75425 273343 290045 77264
21113 77264 50213 293798 352611 17914 -248376 -98797 319253 565873 587086 598916
21103 598916 633513 681680 695449 565735 307376 435828 337920 174199 16008 -71588
$$ packed form
21175C066413j59633l08487k66758L9389k47202j71301k40974k20520J7618r1816
21165A416729K5311j6111j90195M0228J9779M0554N035Q8276j02881j00088M2971
21154A269608N0421n6720j55055j43952p1965J37127o8237j9512m0177Q0223K8273
21143A010034j3768j39109K0610L64656j3905j98525p6540k87100j06269k3500
21133E36584O2092O1258j93504j74546p5604J24934K60403K0166R2663j24266
21123E90180l13198J2133J76063j4207j06399k11181n7966J97918J6702k12781
21113G7264k7051K43585N8813l34697k66290J49579M18050K46620K1213J1830
21103E98916L4597M8167J3769j29714k58359J28452r7908j63721j58191q7596
$$ plain form
21093 -71588 222265 330585 83111 115549 520070 300170 121240 163945 108532 74088
21083 74088 -45561 -107339 -104778 86408 250855 37179 -392750 -750037 -554411 -209991
21073 -209991 135433 60208 -132414 -193544 -296233 -92372 60740 -18736 -209282 -96115
21063 -96115 61444 211577 272192 416351 274808 150905 226929 179011 233958 358756
21053 358756 479146 518865 308596 242936 193762 346657 401819 355020 339875 392155 467705
21042 467705 639214 728255 684276 721046 743813 735633 824159 1073807 960407 515368 321114
21031 321114 62191 25228 117193 214711 129317 247561 357656 327369 304032 176610 81073
21020 81073 68962 220552 252680 362609 499979 589388 611217 706942 706070 859671 859330 815894
$$ packed form
21093g1588K93853J08320k47474L2438M04521k19900j78930M2705n5413l4444
21083G4088j19649o1778K561J91186J64447k13676m29929l57287J95626L44420
21073b09991L45424p5225j92622o1130j02689K03861J53112p9476j90546J13167
21063i6115J57559J50133O0615J44159j41543j23903P6024m7918N4947J24798
21053C58756J20390L9719k10269o5660m9174J52895N5162m6799j5145N2280P5550
21042D67705J71509Q9041m3979L6770K2767q180Q8526K49648j13400m45039j94254
21031C21114k58923l6963R1965R7518q5394J18244J10095l0287k3337j27422r5537
21020H1073j2111J51590L2128J09929J37370Q9409K1829R5725q72J53601l41m3436
$$ plain form
21008 815894 592607 449320 467629 617425 568799 518280 472925 100250 -111056 -122621
20998 -122621 -296648 -512428 -394558 -302937 -211554 -124775 206002 312473 439087 573651
20988 573651 474561 491714 414848 326572 315761 98364 -78440 -162452 -140160 -278857 -278822
20977 -278822 -360209 -307973 -239005 -168695 -282430 -402217 -311480 -233909 -366219 -247242 -45850
20966 -45850 -139704 -339768 -340626 -156606 -210497 -192551 -158330 -253739 -500647 -263813 154474
20955 154474 338128 360249 143451 -4385 -93277 -72902 1632 86059 129792 234436 381465
20944 381465 439784 181979 -23368 -50504 -6561 -22097 33614 219450 288489 238033 283435
20933 283435 4167 -13632 68110 169535 205142 236165 300088 258271 253299 278248 130073
$$ packed form
21008H15894k23287j43287J8309J49796m8626n0519m5355l72675k11306j1565
20998a22621j74027k15780J17870R1621R1383Q6779L30777J06471J26614J34564
20988E73651r9090J7153p6866q8276j0811k17397j76804q4012K2292j38697L5
20977b78822q1387N2236O8968P0310j13735j19787R0737P7571j32310J18977K01392
20966d5850r3854k00064q58J84020n3891J7946L4221r5409k46908K36834M18287
20955A54474J83654K2121k16798j47836q8892K0375P4534Q4427M3733J04644J47029
20944C81465N8319k57805k05347k7136M3943j5536N5711J85836O9039n0456M5402
20933B83435k79268j7799Q1742J01425L5607L1023O3923m1817m972K4949j48175
$$ plain form
20922 130073 316571 383510 430070 65516 -274271 -331309 -341218 -223513 -349136 -189428
20912 -189428 10916 297716 409761 484579 359068 72514 -61605 -45904 92005 -54710
20902 -54710 -112191 -97258 -192384 -11051 -7362 86166 283241 133601 154412 276167 457610
20891 457610 165403 96849 -37127 -260976 -252805 -401242 -215228 -323021 -376224 -244058
20881 -244058 -190963 -200410 -183051 86029 219206 -5863 -29641 64460 38856 237590 223127
20870 223127 486826 564207 256040 153406 258407 238388 -1837 -58560 257982 318864
20860 318864 223618 96474 -162035 -125565 79634 106839 10916 224132 373859 353961
20850 353961 381718 348616 389276 501369 616462 619367 231483 14050 168083 406125
$$ packed form
20922A30073J86498O6939M6560l64554l39787n7038r909J17705j25623J59708
20912a89428K00344K86800J12045P4818j25511k86554j34119J5701J37909j46715
20902e4710n7481J4933r5126J81333L689R3528J97075j49640K0811J21755J81443
20891D57610k92207o8554j33976k23849Q171j48437J86014j07793n3203J32166
20881b44058N3095r447J7359K69080J33177k25069k3778R4101k5604J98734j4463
20870B23127K63699P7381l08167j02634J05001k0019k40225n6723L16542O0882
20860C18864r5246j27144k58509L6470K05199K7205r5923K13216J49727j9898
20850C53961K7757l3102M0660J12093J15093K905l87884k17433J54033K38042
$$ plain form
20840 406125 125506 200844 182501 104966 42536 -83826 -53951 13546 -3615 -77298 53171
20829 53171 258633 238815 136862 212910 124811 26039 -85524 -100091 -61357 42584 -28352
20818 -28352 -220754 -456666 -485398 -429068 -423824 -422194 -301209 47557 339155 250751 103162
20807 103162 155147 39831 152163 250656 11087 -225063 -204642 61659 114199 -71210
20797 -71210 -36014 -46083 -122679 -103542 142036 167243 100834 123007 193625 303617 -910
20786 -910 -238176 -177047 -28117 -38559 -39917 91299 196893 243118 304642 273051 193024
20775 193024 24381 11585 211794 341959 338389 409199 361057 249219 215065 247325 159991
20764 159991 258819 161951 60108 234379 239398 223732 302986 507064 430914 378097 262894
$$ packed form
20840D06125k80619P5338j8343p7535o2430j26362K9875O7497j7161p3683J30469
20829E3171K05462j9818j01953P6048q8099r8772j11563j4567L8734J03941p0936
20818b8352j92402k35912k8732N6330N244J630J20985L48766K91598q8404j47589
20807A03162N1985j15316J12332R8493k39569k36150K0421K66301N2540j85409
20797g1210L5196j0069p6596J9137K45578K5207o6409K2173P0618J09992l04527
20786i10k37266O1129J48930j0442j358J31216J05594M6225O1524l1591q0027
20775A93024j68643j2796K00209J30165l570P0810m8142j11838l4154L2260q7334
20764A59991R8828r6868j01843J74271N019j5666P9254K04078p6150n2817j15203
$$ plain form
20753 262894 250630 317032 355832 340047 358633 266325 478801 504369 722517 1318637 1840859
20742 1840859 2077862 2210149 2206407 2000761 2052775 2094046 1897900 1353936 1135116 805482
20732 805482 367274 60415 153961 -19221 11642 353561 382507 535861 531921 228652
20722 228652 196246 186239 235196 297427 276387 249051 383847 257940 212781 184274 383989
20711 383989 99802 34625 133104 116321 10009 43677 39196 56425 156963 288199 343589
20700 343589 80714 -139321 -228424 -278314 -273996 -76104 83193 368 13348 56084 91662
20689 91662 129178 161785 310312 580347 497209 233583 49109 208871 618377 635374
20679 635374 506721 513095 468093 331431 184474 325215 169880 119955 343464 488235
$$ packed form
20753B62894j2264O6402L8800j5785J8586r2308K12476K5568K18148N96120N22222
20742A840859K37003J32287l742k05646N2014M1271j96146n43964k18820l29634
20732H05482m38208l06859R3546j73182L0863L41919K8946J53354l940l03269
20722B28652l2406j0007M8957O2231k1040k7336J34796j25907m5159k8507J99715
20711C83989k84187o5177R8479j6783j06312L3668m481J7229J00538J31236N5390
20700C43589k62875k20035q9103m9890M318J97892J59297q2825J2980M2736L5578
20689I1662L7516L2607J48527K70035q3138k63626j84474J59762M09506J6997
20679F35374j28653O374m5002j36662j46957J40741j55335m9925K23509J44771
$$ plain form
20669 488235 266662 449190 424295 596990 640473 570697 580218 658064 720805 868387 971821
20658 971821 939530 1183332 1150183 1036933 1025568 1026779 1075255 993904 954705 1035951 1042298
20647 1042298 1118086 1155713 902451 674950 524153 647829 755507 991552 1123700 955583
20637 955583 914566 830097 776934 717645 500849 430187 354247 314390 548116 641683 664067
20626 664067 504719 630049 722884 680937 612124 309965 403698 426730 383373 515393 674562
20615 674562 842578 1044370 1162395 1340611 1321014 814521 721225 1023543 1196993 1172076
20605 1172076 1112874 1087071 919148 793793 550970 467942 601935 457264 746513 907400
20595 907400 816058 484948 336987 261651 410347 385518 357175 281512 347978 492612 608358
$$ packed form
20669D88235k21573J82528k4895J72695M3483o9776R521P7846O2741J47582J03434
20658I71821l2291K43802l3149j13250j1365J211M8476q1351l9199Q1246O347
20647A042298P5788L7627k53262k27501j50797J23676J07678K36045J32148j68117
20637I55583m1017q4469n3163n9289k16796p0662p5940l9857K33726R3567K2384
20626F64067j59348J25330R2835m1947o8813l02159R3733K3032m3357J32020J59169
20615F74562J68016K01792J18025J78216j9597n06493r3296L02318J73450k4917
20605A172076n9202k5803j67923j25355k42823q3028J33993j44671K89249J60887
20595I07400r1342l31110j47961p5336J48696k4829k8343p5663O6466J44634J15746
$$ plain form
20584 608358 532253 458745 406035 282229 220156 179808 368502 662399 769706 719735 699455
20573 699455 687732 765190 767744 811529 890327 937398 820378 733751 512751 812439 904402
20562 904402 684786 711694 774249 773414 801031 955607 1002700 1041674 1171334 1137230 1051646
20551 1051646 861267 780157 777105 613040 541347 732170 775652 746777 679506 821663 867352
20540 867352 815946 1097893 1172614 1062489 1096953 1128289 1360612 1543551 1534308 1520255 1419547
20529 1419547 1107425 1294977 1303752 1389751 1348784 1400269 1604376 1523375 1505784 1684517 1828004
20518 1828004 1956359 2251069 2655278 2652235 2620630 2839617 2975161 2990566 3131110 3412645
20508 3412645 3731873 3954058 4185658 4294167 4694848 4969217 5187902 5300410 5350330 5382250
$$ packed form
20584F08358p6105p3508n2710j23806o2073m0348J88694K93897J07307m9971k0280
20573F99455j1723P7458K554M3785P8798M7071j17020q6627k21000K99688R1963
20562I04402k19616K6908O2555q35K7617J54576M7093L8974J29660l4104q5584
20551A051646j90379q1110l052j64065p1693J90823M3482k8875o7271J42157M5689
20540H67352n1406K81947P4721j10125L4464L1336K32323J82939r243j4053j00708
20529A419547l12122J87552Q775Q5999m0967N1485K04107q1001j7591J78733J43487
20518A828004J28355K94710M04209l043l1605K18987J35544J5405J40544K81535
20508C412645L19228K22185K31600J08509M00681K74369K18685J12508M9920L1920
$$ plain form
20498 5382250 5765949 5779338 5940784 6512785 7293812 8258894 9405452 10733458 12234276
20489 12234276 14172593 16717946 20501150 25329141 31458812 39215189 49689213 62960100
20481 62960100 77528089 90658055 100631901 108262188 113988253 114620015 108672192 98041075
20473 98041075 89879689 88957762 94812894 103054497 109472563 113151821 114948593 113449948
20465 113449948 104092347 87142744 67212745 51631353 41503951 35338765 31977760
20458 31977760 30700484 31037757 33247967 37007975 42613056 50439331 61187229 74764311
20450 74764311 89836092 102502800 111266437 117774022 122147884 119944838 110866031 99132273
20442 99132273 91817324 92315432 98381134 105738919 111088598 113765082 114444115 110094606
$$ packed form
20498E382250L83699J3389J61446N72001P81027R65082J146558J328006J500818
20489A2234276J938317K545353L783204M827991O129671P756377J0474024J3270887
20481F2960100J4567989J3129966R973846P630287N726065O31762n947823j0631117
20473I8041075q161386r21927N855132Q241603O418066L679258J796772j498645
20465A13449948r357601j6949603j9929999j5581392j0127402o165186l361005
20458C1977760j277276L37273K210210L760008N605081P826275J0747898J3577082
20450G4764311J5071781J2666708Q763637O507585M373862k203046r078807j1733758
20442I9132273p314949M98108O065702P357785N349679K676484O79033m349509
$$ plain form
20434 110094606 97442420 77692269 57424632 42323447 32311813 25547215 20645523
20427 20645523 16951017 14414843 12629411 11380588 10297890 9299983 8694418 8120400
20419 8120400 7580594 6932474 6717640 6559954 6147123 5898738 5801782 5519102 5347654 5172871
20409 5172871 4977150 4567648 4189710 3947928 3766252 3784507 3696936 3638045 3549087 3490544
20399 3490544 3466024 3165697 2992149 2699356 2216098 1919714 1840845 1726264 1615688 1576059
20389 1576059 1799312 1816350 1360853 1081464 1224888 1200540 1364247 1717440 1743854 1749191
20379 1749191 1816211 1832164 1812231 1719002 1697744 1597981 1508678 1487728 1376517 1212627 1245839
20368 1245839 1425334 1578287 1689561 1746594 1697985 1685649 1529878 1357288 1211780 1144293
$$ packed form
20434A10094606j2652186j9750151k0267637j5101185j0011634o764598m901692
20427B0645523l694506k536174j785432j248823j082698r97907o05565n74018
20419H120400n39806o48120k14834j57686m12831k48385r6956k82680j71448j74783
20409E172871j95721m09502l77938k41782j81676J8255q7571n8891q8958n8543
20399C490544k4520l00327j73548k92793m83258k96384p8869j14581j10576l9629
20389A576059K23253J7038m55497k79389J43424k4348J63707L53193K6414N337
20379A749191O7020J5953j9933r3229k1258r9763q9303k0950j11211j63890L3212
20368A245839J79495J52953J11274N7033m8609j2336j55771j72590j45508o7487
$$ plain form
20358 1144293 1218970 1226964 1289262 1176685 1254440 1263005 1033384 798923 568353 637874 724816
20347 724816 939297 702250 131677 55914 310813 611821 764883 829553 770802 623068
20337 623068 498025 616565 735404 549893 508756 497005 410452 408021 473069 419600 183562
20326 183562 35788 46069 -93990 62668 246231 291536 403639 313433 397135 504022
20316 504022 267478 312692 488042 370811 266248 -68042 -42639 290633 380313 119486
20306 119486 195310 203380 184292 301242 180223 245953 478372 469873 408214 309673 256855
20295 256855 143425 243948 464228 581283 491079 385698 452506 238023 254212 582166
20285 582166 668289 722635 928410 903740 830850 840169 807259 827616 966651 941719 1056330
$$ packed form
20358A144293P4677P994O2298j12577P7755Q565k29621k34461k30570O9521Q6942
20347G24816K14481k37047n70573p5763K54899L01008J53062O4670n8751j47734
20337F23068j25043J18540J18839j85511m1137j1751q6553k431O5048n3469k36038
20326A83562j47774J0281j40059J56658J83563M5305J12103r0206Q3702J06887
20316E04022k36544M5214J75350j17231j04563l34290K5403L33272Q9680k60827
20306A19486P5824Q070j9088J16950j21019O5730K32419q499o1659r8541n2818
20295B56855j13430J00523K20280J17055r0204j05381O6808k14483J6189L27954
20285E82166Q6123N4346K05775k4670p2890R319l2910K0357J39035k4932J14611
$$ plain form
20274 1056330 951148 537353 561483 801544 879670 810505 888543 1054967 1017659 745966
20264 745966 530594 554167 507925 520279 421790 282732 374315 510825 601404 842395 903042
20253 903042 820253 755999 768083 831219 970075 831162 597527 494133 527626 720459
20243 720459 1010182 847997 517662 637435 466592 586905 132087 132859 382457 379515
20233 379515 397830 531918 522069 467346 409405 402631 331927 338885 444521 431828 452423 375875
20221 375875 394632 481611 480514 97772 -80080 201209 432294 640097 746999 651280
20211 651280 464067 485545 746856 1008391 878470 770240 1106772 1232914 1683183 1854902
20201 1854902 1825452 1764452 1526042 1497922 1671077 1651173 1464496 1304397 1531200 1894421
$$ packed form
20274A056330j05182m13795K4130K40061P8126o9165P8038J66424l7308k71693
20264G45966k15372K3573m6242J2354r8489j39058R1583J36510R0579K40991O0647
20253I03042q2789o4254J2084O3136J38856j38913k33635j03394L3493J92833
20243G20459K89723j62185l30335J19773j70843J20313m54818P72K49598k942
20233C79515J8315J34088r849n4723n7941o774p0704O958J05636j2693K0595p6548
20221C75875J8757Q6979j097l82742j77852K81289K31085K07803J06902r5719
20211F51280j87213K1478K61311K61535j29921j08230L36532J26142M50269J71719
20201A854902k9450o1000k38410k8120J73155j9904j86677j60099K26803L63221
$$ plain form
20191 1894421 1930613 1772131 1538759 1539331 1499534 1630989 1598220 1421817 1256873 1154920
20181 1154920 1198065 1194688 1197634 1439347 1624012 1563659 1403215 1347988 1340333 1547597 1739446
20170 1739446 1808684 1828175 2111177 2307087 2300228 2598961 2789393 3060080 3446670 3648990
20160 3648990 3682803 3931075 4479866 5098404 5563802 6037848 6242291 6780338 7696996 8129384
20150 8129384 8380073 8930242 9672922 11272653 13583863 16568849 19952283 23853850 28285824
20141 28285824 34479685 43527666 56110562 73670547 96506342 124992486 163712913
20134 163712913 220290350 296590548 370830414 404785419 413342722 436442273 460212083
20127 460212083 392714794 265928018 170641701 114560538 81505493 60534523 46752322
$$ packed form
20191A894421L6192j58482k33372N72l9797J31455l2769j76403j64944j01953
20181A154920M3145l377K946K41713J84665o0353j60444n5227p655K07264J91849
20170A739446O9238J9491K83002J95910o859K98733J90432K70687L86590K02320
20160C648990L3813K48272N48791O18538M65398M74046K04443N38047R16658M32388
20150H129384K50689N50169P42680J599731K311210K984986L383434L901567M431974
20141B8285824O193861R047981J2582896J7559985K2835795K8486144L8720427
20134A63712913N6577437P6300198P4239866L3955005Q557303K3099551K3769810
20127D60212083o7497289j26786776r5286317n6081163l3055045k0970970j3782201
$$ plain form
20120 46752322 37446532 31319961 27103406 23414404 20345631 18154112 16540007 14799530
20112 14799530 13252330 11772091 10585325 9740037 9322241 8964668 8431096 7988596 7738929
20103 7738929 7455712 6547456 5440514 4581149 4002344 3535497 3440837 3258446 3316407 3202489
20093 3202489 3209275 3146893 2846508 2549240 2472957 2325760 2340587 1982519 1578351 1684409
20083 1684409 1875103 1953095 1783496 1701389 1803389 1793568 1637374 1548815 1553762 1540880 1464571
20072 1464571 1275111 1158528 1095300 1326149 1632962 1592955 1435875 1436417 1480143 1426476 1304124
20061 1304124 1569233 1520323 1257785 1292028 1344493 1455131 1587055 1608872 1536333 1418118
20051 1418118 1427691 1233623 1167052 998510 737120 815744 872764 1040892 939012 831495
$$ packed form
20120D6752322r305790o126571m216555l689002l068773k191519j614105j740477
20112A4799530j547200j480239j186766q45288m17796l57573n33572m42500k49667
20103G738929k83217r08256j106942q59365n78805m66847r4660j82391N7961j13918
20093C202489O786o2382l00385k97268p6283j47197J4827l58068m04168J06058
20083A684409J90694P7992j69599q2107J02000r821j56194q8559M947j2882p6309
20072A464571j89460j16583o3228K30849L06813m0007j57080N42M3726n3667j22352
20061A304124K65109m8910k62538L4243N2465J10638J31924K1817p2539j18215
20051A418118R573j94068o6571j68542k61390P8624N7020J68128j01880j07517
$$ plain form
20041 831495 649810 419894 298002 247420 236820 466661 421433 423236 624073 721664 641149
20030 641149 678408 535175 689510 665420 703078 815627 820111 631067 481942 464433 451085
20019 451085 526264 407419 265642 204236 271660 354652 366787 568900 629276 575210 497272
20008 497272 704810 605679 506420 595110 547514 516424 665210 698468 896822 761002 278010
19997 278010 100884 270971 509814 498649 539371 651521 524734 481188 582908 601095
19987 601095 707933 680126 515288 447333 459219 640999 500452 271094 372806 703955
19977 703955 979255 941897 833235 750431 546728 599222 757290 624601 776435 670898
19967 670898 603478 565204 554736 598168 581518 606477 841923 829186 716144 684167 584321
$$ packed form
20041H31495j81685k29916j21892n0582j0600K29841m5228J803K00837R7591q0515
20030F41149L7259j43233J54335k4090L7658J12549M484j89044j49125j7509j3348
20019D51085P5179j18845j41777o1406O7424Q2992J2135K02113O0376n4066p7938
20008D97272K07538r9131r9259Q8690m7596l1090J48786L3258J98354j35820m82992
19997B78010j77126J70087K38843j1165M0722J12150j26787m3546J01720J8187
19987F01095J06838k7807j64838o7955J1886J81780j40547k29358J01712L31149
19977G03955K75300l7358j08662q2804k03703N2494J58068j32689J51834j05537
19967F70898o7420l8274j0468M3432j6650K4959K35446j2737j13042l1977r9846
$$ plain form
19956 584321 752901 900374 860848 733326 719632 514176 650266 811502 915229 876831
19946 876831 841012 805036 876960 874416 966931 927138 1063439 1193442 1385150 1416141 1718080
19935 1718080 1970884 2114484 2304877 2474793 2509796 2612495 3070399 3114328 3266711 3339921
19925 3339921 3629646 3933050 4278206 4832493 5441507 6315561 7509916 8737926 10667029
19916 10667029 13173027 16258701 20288187 25413137 32640241 41762353 50868920 56390908
19908 56390908 59635821 63987047 68077169 64364495 55346708 49808073 50143225 55741912
19900 55741912 64404213 72774174 79106229 86853500 97530461 103217491 96089627 86196229
19892 86196229 80939655 77790129 68712116 57091828 49458710 47720439 50394891 55290649
$$ packed form
19956E84321J68580J47473l9526j27522j3694k05456J36090J61236J03727l8398
19946H76831l5819l5976P1924k544R2515l9793J36301J30003J91708L0991L01939
19935A718080K52804J43600J90393J69916L5003J02699M57904M3929J52383P3210
19925C339921K89725L03404L45156N54287O09014Q74054J194355J228010J929103
19916A0667029K505998L085674M029486N124950P227104R122112R106567N521988
19908E6390908L244913M351226M090122l712674r017787n538635L35152N598687
19900E5741912Q662301Q369961O332055P747271J0676961N687030p127864r893398
19892H6196229n256574l149526r078013j1620288p633118j738271K674452M895758
$$ plain form
19884 55290649 58435016 58870668 59376249 60738032 56658445 44481568 32876432 24854809
19876 24854809 19641960 16363685 14639355 13473649 12915528 12781027 12896921 13137608 13604930
19867 13604930 14675963 16740965 19474694 22603064 26764640 32706989 40829469 50780169
19859 50780169 59625104 64188035 67354944 72365039 74696721 67304109 57741101 53506180
19851 53506180 55286755 62138388 71654672 79624778 86192283 95586231 106894309 108763011
19843 108763011 98889697 89695665 86246325 81703543 69348628 57159531 50823198 50252758
19835 50252758 53803715 58719619 61094401 61060640 61893339 62185862 54529612 40780243
19827 40780243 29135102 21306102 16271703 13038857 10848433 9231509 8077249 7468239
$$ packed form
19884E5290649L144367M35652N05581J361783m079587j2176877j1605136q021623
19876B4854809n212849l278275j724330j165706n58121j34501J15894K40687M67322
19867A3604930J071033K065002K733729L128370M161576N942349Q122480R950700
19859E0780169Q844935M562931L166909N010095K331682p392612r563008m234921
19851E3506180J780575O851633R516284P970106O567505R393948J1308078J868702
19843A08763011r873314r194032l449340m542782j2354915j2189097o336333n70440
19835E0252758L550957M915904K374782l3761Q32699K92523p656250j3749369
19827D0780243j1645141p829000n034399l232846k190424j616924j154260o09010
$$ plain form
19819 7468239 6806052 6089035 5474764 5113458 4765494 4272716 3905009 3429611 2807102
19810 2807102 2496912 2340644 2172249 2151407 2168749 2040341 1745561 1531795 1519407 1632545
19800 1632545 1757479 1550379 1350971 1288027 1091237 886303 1051349 1088090 993235 917685
19790 917685 899887 853846 847590 916158 1185568 1248316 1094017 875209 790424 616925 578498
19779 578498 478946 522758 584589 900114 983845 842193 678424 765884 570627 559425 480808
19768 480808 488263 605341 517643 299411 179591 363471 570745 700804 684480 502235
19758 502235 484688 363065 270004 237322 77285 61525 -73229 -52272 115728 264310
19748 264310 291095 242676 292003 321125 439275 417535 483279 271279 228617 152426 177337
$$ packed form
19819G468239o62187p17017o14271l61306l47964m92778l67707m75398o22509
19810B807102l10190j56268j68395k0842J7342j28408k94780k13766j2388J13138
19800A632545J24934k07100j99408o2944j96790k04934J65046L6741r4855p5550
19790I17685j7798m6041o256O8568K69410O2748j54299k18808q4785j73499l8427
19779E78498r9552M3812O1831L15525Q3731j41652j63769Q7460j95257j1202p8617
19768D80808P455J17078q7698k18232j19820J83880K07274J30059j6324j82245
19758E02235j7547j21623r3061l2682j60037j5760j34754K0957J68000J48582
19748B64310K6785m8419M9327K9122J18150k1740O5744k12000m2662p6191K4911
$$ plain form
19737 177337 85133 -74693 95300 -118445 -411088 -421443 -416545 -410631 -476212 -543344 -546840
19726 -546840 -569698 -319411 -252312 -181131 -240411 -105808 -94429 18717 120030 128130 -34213
19715 -34213 -159370 -152494 -44283 18270 122554 145346 -18352 -231210 -24088 37324 -230536
19704 -230536 -271048 -167479 -77792 135545 124672 -139911 -503469 -464832 -44240 82232
19694 82232 -161866 -74058 190446 -7393 -166596 -358861 -149302 58843 92037 160685
19684 160685 -25282 65334 243998 117384 -57155 93811 78238 -40701 -252439 -232271
19674 -232271 -60567 -106318 -39150 6347 -499447 -720813 -628183 -465543 -255896 -86748
19664 -86748 306754 278995 57981 95642 323195 289313 198677 259801 202126 32548 19237
$$ packed form
19737A77337r2204j59826J69993k13745k92643j0355M898N914o5581o7132l496
19726e46840k2858K50287O7099P1181n9280J34603J1379J13146J01313Q100j62343
19715c4213j25157O876J08211O2553J04284K2792j63698k12858K07122O1412k67860
19704b30536m0512J03569Q9687K13337j0873k64583l63558L8637M20592J26472
19694H2232k44098Q7808K64504j97839j59203j92265K09559K08145L3194O8648
19684A60685j85967R0616J78664j26614j74539J50966j5573j18939k11738K0168
19674b32271J71704m5751O7168M5497n05794k21366R2630J62640K09647J69148
19664h6748L93502k7759k21014L7661K27553l3882r0636O1124n7675j69578j3311
$$ plain form
19653 19237 10264 -115246 -263976 -97784 -13005 194020 163321 178506 67278 -198302 -278695
19642 -278695 -21428 -155303 -404883 -108260 554 -40578 -91104 -216547 4145 163643
19632 163643 59322 154573 28844 67687 109203 213880 16351 -9729 -357590 -392055
19622 -392055 -299872 -259533 -87114 -158788 -280611 -152229 104696 321291 160324 6151
19612 6151 -70767 182981 55359 -286041 -229473 -27853 36665 135407 7747 64677 -111146
19601 -111146 -137812 -314663 -288837 -114617 58545 104828 163050 113530 5922 -171251
19591 -171251 -450317 -562470 -608361 -884676 -900678 -672034 -353651 -72601 130004 -29731
19581 -29731 -175564 2139 -2835 -53949 -173850 -122914 60739 73653 -87093 -126497 -433620
$$ packed form
19653A9237q973j25510j48730J66192Q4779K07025l0699J5185j11228k65580q0393
19642b78695K57267j33875k49580K96623J08814m1132n0526j25443K20692J59498
19632A63643j04321R5251j25729L8843M1516J04677j97529k6080l47861l4465
19622c92055R2183M0339J72419p1674j21823J28382K56925K16595j60967j54173
19612F151p6918K53748j27622l41400N6568K01620O4518R8742j27660N6930j75823
19601a11146k6666j76851K5826J74220J73162M6283N8222m9520j07608j77173
19591a71251k79066j12153m5891k76315j6002K28644L18383K81050K02605j59735
19581b9731j45833J77703m974n1114j19901N0936J83653J2914j60746l9404l07123
$$ plain form
19570 -433620 -670027 -660014 -579783 -421550 -480586 -542171 -427877 -139734 -147531 -99055 -23826
19559 -23826 -35021 25170 137760 132419 35435 -286564 -467073 -454480 -609833 -320189 -183137
19548 -183137 8788 -189088 -251637 -173549 -255344 -178636 -124634 -213020 -356790 -302212 -332470
19537 -332470 -385759 -388910 -264838 -94050 -31211 -40687 -133991 -328936 -217158 -211990 -105278
19526 -105278 -260411 -553766 -425502 -227008 -150158 59212 343596 618112 794627 1045257
19516 1045257 1355610 1730910 1954737 2082626 2300637 2402858 2315649 1822182 899289 398774
19506 398774 174704 -22576 38442 153549 161124 66645 1753 -114560 137126 126085 186744
19495 186744 336058 106475 150788 126922 -130270 -200230 -412683 -488575 -377594 -434001
$$ packed form
19570d33620k36407J0013Q0231J58233n9036o1585J14294K88143p797M8476P5229
19559b3826j1195O0191J12590n341r6984l21999j80509J2593j55353K89644J37052
19548a83137J91925j97876o2549P8088q1795P6708N4002q8386j43770N4578l0258
19537c32470n3289l151J24072J70788O2839r476r3304j94945J11778N168J06712
19526a05278j55133k93355J28264J98494P6850K09370K84384K74516J76515K50630
19516A045257L10353L75300K23827J27889K18011J02221q7209m93467r22893n00515
19506C98774k24070j97280O1018J15107P575r4479o4892j16313K51686j1041O0659
19495A86744J49314k29583M4313k3866k57192o9960k12453p5892J10981n6407
$$ plain form
19485 -434001 -474273 -273357 -187309 -62683 55085 -51771 95339 60937 182551 72135
19475 72135 -8797 108030 321579 340582 274280 271285 281016 158402 35960 132447 87775
19464 87775 22208 164889 55677 -190772 -240016 -122268 -122870 70466 223385 138619 -157034
19453 -157034 -99833 17138 -70030 39316 84716 56791 63228 77164 167413 221850 172136
19442 172136 261250 188201 -128047 -158037 -123840 -53754 98900 314000 344951 286446 132315
19431 132315 180699 109332 85028 -339609 -413826 -15817 -693 -197452 -406458 -326317 -147469
19420 -147469 59936 105541 -70559 -280966 -442129 -228815 -99328 -133465 -110972 -411438
19410 -411438 -617821 -529385 -179496 -71607 -230693 -302230 -286096 -158942 -240568 -237615 -103150
$$ packed form
19485d34001m0272K00916Q6048J24626J17768j06856J47110l4402J21614j10416
19475G2135q0932J16827K13549J9003o6302k995R731j22614j22442R6487m4672
19464H7775o5567J42681j09212k46449m9244J17748o02J93336J52919q4766k95653
19453a57034N7201J16971q7168J09346M5400k7925O437J3936R0249N4437m9714
19442A72136Q9114p3049l16248k9990L4197P0086J52654K15100L0951n8505j54131
19431A32315M8384p1367k4304m24637p4217L98009J5124j96759k09006Q0141J78848
19420a47469K07405M5605j76100k10407j61163K13314J29487l4137K2493l00466
19410d11438k06383Q8436L49889J07889j59086p1537J6134J27154q1626K953J34465
$$ plain form
19399 -103150 -8413 188548 258361 290836 -45596 -74539 161026 583942 440203 282397
19389 282397 304870 164631 246562 271764 377443 368903 181984 1924 43037 233655 320445
19378 320445 267417 87420 101703 334495 538836 318379 243473 350536 78347 92081
19368 92081 282133 500003 600260 590824 352121 195832 69411 120478 127274 11765 45024
19357 45024 58964 116968 186494 237091 305046 360420 144386 99478 -165527 -45144 121637
19346 121637 123319 79056 203593 196579 319270 173741 288875 438785 198205 283311 325388
19335 325388 351157 381247 258370 210730 359573 164667 25463 122410 129404 249709 162544
19324 162544 209270 161972 79118 -22409 149103 258401 436838 559610 355296 206898
$$ packed form
19399a03150R4737J96961O9813L2475l36432k8943K35565M22916j43739j57806
19389B82397K2473j40239Q1931K5202J05679q540j86919j80060M1113J90618Q6790
19378C20445n3028j79997J4283K32792K04341k20457p4906J07063k72189J3734
19368I2081J90052K17870J00257r436k38703j56289j26421N1067O796j15509L3259
19357D5024J3940N8004O9526N0597O7955N5374k16034m4908k65005J20383J66781
19346A21637J682m4263J24537p014J22691j45529J15134J49910k40580Q5106M2077
19335C25388K5769L0090j22877m7640J48843j94906j39204R6947O994J20305q7165
19324A62544M6726m7298q2854j01527J71512J09298J78437J22772k04314j48398
$$ plain form
19314 206898 356005 333850 403181 677304 478505 469353 432692 442736 567050 404038 73897
19303 73897 -113098 -159953 85628 -35608 -91994 -201618 -327871 -500099 -510358 -288930
19293 -288930 -202332 -35516 -164043 -418783 -443493 -192864 -378000 -322663 -349464 -446450
19283 -446450 -190701 27122 226997 93864 -28641 33196 24811 -63020 -59351 101245 307377
19272 307377 39745 -1499 -9783 -30682 81692 116692 78905 17271 2742 266913 40248
19261 40248 -115915 -60891 -128544 -50339 -9108 -92580 680 84617 -62758 -205315 -71717
19250 -71717 -100146 57409 182140 174395 64369 -46431 -154795 -190340 -139799 -144668 -288124
19239 -288124 -232423 -3051 58672 -82708 -36776 -147362 -128057 -33181 -103682 -388372 -532744
$$ packed form
19314B06898J49107k2155O9331K74123j98799r152l6661J0044J24314j63012l30141
19303G3897j86995m6855K45581j21236n6386j09624j26253j72228j0259K21428
19293b88930Q6598J66816j28527k54740k4710K50629j85136N5337k6801r6986
19283d46450K55749K17823J99875j33133j22505O1837q385q7831L669J60596K06132
19272C07377k67632m1244q284k0899J12374L5000l7787o1634j4529K64171k26665
19261D0248j56163N5024o7653P8205M1231q3472R3260Q3937j47375j42557J33598
19250g1717k8429J57555J24731p745j10026j10800j08364l5545N0541m869j43456
19239b88124N5701K29372O1723j41380M5932j10586J9305R4876p0501k84690j44372
$$ plain form
19228 -532744 -567798 -494331 -468206 -345510 -241834 -125772 31448 -137660 -135346 -204554 -197869
19217 -197869 -53996 -198743 -130070 -37893 -124134 -187517 -91747 -64580 -32661 28314 275
19206 275 -139675 -131471 -169011 -89367 75620 2396 46604 65465 89601 502689 517213 402873
19194 402873 491369 140819 -43625 -93788 -144408 -207657 -56771 192520 112658 329557
19184 329557 174395 140340 47144 -37960 -6529 -88799 -326500 -276667 -32092 74579 70646
19173 70646 198846 15535 -263901 -471092 -405477 -91868 -81528 -27654 -191951 -220477
19163 -220477 -90468 -67859 -247725 -229216 -429856 -428009 -310485 -433247 -362590 25748
19153 25748 155119 -46458 -229415 -171076 -146025 -246068 -413899 -356427 -200023 -307964
$$ packed form
19228e32744l5054P3467K6125J22696J03676J16062J57220j69108K314o9208O685
19217a97869J43873j44747O8673R2177q6241o3383R5770K7167L1919O0975k8039
19206B75j39950Q204l7540P9644J64987p3224M4208J8861K4136M13088J4524j14340
19194D02873Q8496l50550j84444n0163n0620o3249J50886K49291p9862K16899
19184C29557j55162l4055r3196q5104L1431q2270k37701M9833K44575J06671l933
19173G0646J28200j83311k79436k07191O5615L13609J0340N3874j64297k8526
19163b20477J30009K2609j79866J8509k00640J847J17524j22762P0657L88338
19153B5748J29371k01577j82957N8339K5051j00043j67831N7472J56404j07941
$$ plain form
19143 -307964 -385231 -516287 -345272 -174176 -77455 48479 153328 462 130618 430041
19133 430041 247772 96117 160025 112893 161108 166025 106348 99593 93943 87171 207769 307929
19121 307929 424741 357728 285945 6837 -4458 39984 -22549 -51864 77115 -2089 -83343
19110 -83343 137797 28808 13480 46331 -244110 -481349 -528430 -352255 -364608 -138694
19100 -138694 171379 47149 -83364 -49873 80948 76821 -232972 -398856 -520925 -469219
19090 -469219 -255848 -222525 -342477 -261007 50884 157849 73360 -232658 -286954 -111183
19080 -111183 43222 -2248 -15653 72082 158847 144718 123268 220590 119110 58797 -11215
19069 -11215 101719 93652 -64504 -232667 -326630 -245584 -269433 -71190 -73075 -51111 -97693
$$ packed form
19143c07964p7267j31056J71015J71096R6721J25934J04849j52866J30156K99423
19133D30041j82269j51655O3908m7132M8215M917n9677o755n650o772J20598J00160
19121C07929J16812o7013p1783k79108j1295M4442o2533k9315J28979p9204q1254
19110h3343K21140j08989j5328L2851k90441k37239m7081J76175j2353K25914
19100a38694L10073j24230j30513L3491J30821m127l09793j65884j22069N1706
19090d69219K13371L3323j19952Q1470L11891J06965q4489l06018n4296J75771
19080a11183J54405m5470j3405Q7735Q6765j4129k1450R7322j01480o0313p0012
19069a1215J12934q067j58156j68163r3963Q1046k3849J98243j885K1964m6582
$$ plain form
19058 -97693 -9529 -199907 -536312 -339226 -72092 -75680 -185233 -69828 45815 12657
19048 12657 56034 66277 37195 141440 66244 -93052 -479003 -592095 -472366 -396097 -234334
19037 -234334 -244861 42238 147907 1011 -72235 -144939 -263240 -547486 -430888 -196765
19027 -196765 -297826 -303103 -244736 65311 -59197 108273 288485 160588 -5796 -396305
19017 -396305 -362019 -258255 -233703 -143977 -134633 178233 286956 164309 142506 -9741 -10249
19006 -10249 -117082 -254591 -54424 160854 180047 53444 277589 293795 351472 190752
18996 190752 8533 21768 90208 -3936 -198561 -236804 -244827 81196 182779 65838 3627
18985 3627 119614 292128 238000 218126 330704 362742 332981 351786 348665 278836 265154
$$ packed form
19058i7693Q8164j90378l36405J97086K67134l588j09553J15405J15643l3158
19048A2657M3377J0243k9082J04245p5196j59296l85951j13092J19729P6269J61763
19037b34334j0527K87099J05669j46896p3246p2704j18301k84246J16598K34123
19027a96765j01061n277N8367L10047j24508J67470J80212j27897j66384l90509
19017c96305L4286J03764K4552Q9726R344L12866J08723j22647k1803j52247n08
19006a0249j06833j37509K00167K15278J9193j26603K24145J6206N7677j60720
18996A90752j82219J3235O8440r4144j94625l8243q023L26023J01583j16941o2211
18985C627J15987J72514n4128j9874J12578L2038k9761J8805l121o9829j3682
$$ plain form
18974 265154 61404 21810 -42864 14138 -60056 -190181 -194085 -90058 67584 -32911 61788
18963 61788 104555 -129553 -193171 -37262 103065 62341 -218477 -110261 154100 169128
18953 169128 101565 241915 374542 438200 501016 522216 704411 589351 448480 443555 520861
18942 520861 695362 652895 793457 708439 527231 524800 312156 323137 199610 299886
18932 299886 333757 176051 444902 716184 711868 821505 810244 656982 474925 444635
18922 444635 390966 405148 254528 -66234 -204515 -142781 36265 183815 33513 -114131
18912 -114131 -154621 -30350 -222451 -110067 114818 -144925 -293556 -324123 -302805 -165870
18902 -165870 -38955 123524 82784 186868 272006 371359 50185 14980 119157 501174
$$ packed form
18974B65154k03750l9594o4674N7002p4194j30125l904J04027J57642j00495R4699
18963F1788M2767k34108o3618J55909J40327m0724k80818J08216K64361J5028
18953A69128o7563J40350J32627O3658O2816K1200J82195j15060j40871m925P7306
18942E20861J74501m2467J40562q5018j81208k431k12644J0981j23527J00276
18932B99886L3871j57706K68851K71282m316J09637j1261j53262j82057l0290
18922D44635n3669J4182j50620l20762j38281O1734J79046J47550j50302j47644
18912a14131m0490J24271j92101J12384K24885k59743j48631l0567K1318J36935
18902a65870J26915J62479m0740J04084Q5138R9353l21174l5205J04177L82017
$$ plain form
18892 501174 358878 179785 -45251 -171127 -11674 263691 181856 -10567 -62667 118435
18882 118435 129337 101503 -349551 -313564 -76223 159669 137351 -223975 -267221 -91127
18872 -91127 -15716 -201283 -378755 -256593 85561 189828 268535 428737 437719 424468 282234
18861 282234 165283 65478 109441 314239 244929 203785 203532 332688 281552 40203 52606
18850 52606 253047 220099 92876 -93790 123898 140931 281235 319241 415602 161201
18840 161201 -64970 -259469 -185228 -184040 142957 346135 49369 -76813 -49277 41473
18830 41473 -111555 -178658 33460 193296 204870 51667 -128379 -134266 6930 149570
18820 149570 175899 174592 109588 -21168 -183393 -177779 -263030 -214014 -206079 -240758 -157600 -245213
$$ packed form
18892E01174j42296j79093k25036j25876J59453K75365q1835j92423n2100J81102
18882A18435J0902k7834m51054L5987K37341K35892k2318l61326m3246J76094
18872i1127P5411j85567j77472J22162L42154J04267P8707J60202Q982j3251j42234
18861B82234j16951r9805M3963K04798o9310m1144k53J29156n1136k41349J2403
18850E2606K00441l2948j27223j86666K17688J7033J40304L8006R6361k54401
18840A61201k26171j94499P4241J188L26997K03178k96766j26182K7536R0750
18830D1473j53028o7103K12118J59836J1574j53203j80046n887J41196J42640
18820A49570K6329j307o5004j30756j62225N614q5251M9016P935l4679Q3158q7613
$$ plain form
18808 -245213 -202571 16392 2276 -91662 152837 224014 120810 -130295 -254969 8986
18798 8986 -32187 -49004 130208 16495 -250910 -377556 -106493 151997 95931 27633 226017
18787 226017 199891 146329 215166 106467 -56437 -98108 64591 164705 134869 220357 62101
18776 62101 64061 163955 459760 842552 1042507 1257642 1643715 1937203 2206780 1993984
18766 1993984 1680046 1456013 1175187 772199 506428 205183 272698 190103 149225 62204
18756 62204 -144758 -164942 -49056 -101615 52425 196332 257322 357041 247616 106069
18746 106069 96872 186146 155657 11676 -207517 -284222 -264636 -339901 -188296 113975 133928
18735 133928 393706 316644 53719 133323 53683 154977 193845 121340 -37641 -557 46226
$$ packed form
18808b45213M2642K18963j4116r3938K44499P1177j03204k51105j24674K63955
18798H986m1173j6817J79212j13713k67405j26646K71063K58490n6066o8298J98384
18787B26017k6126n3562O8837j08699j62904m1671J62699J00114k9836Q5488j58256
18776F2101J960R9894K95805L82792J99955K15135L86073K93488K69577k12796
18766A993984l13938k24033k80826m02988k65771l01245O7515q2595m0878q7021
18756F2204k06962k0184J15886n2559J54040J43907O0990R9719j09425j41547
18746A06069r197Q9274l0489j43981k19193p6705J9586p5265J51605L02271J9953
18735A33928K59778p7062k62925P9604p9640J01294L8868p2505j58981L7084M6783
$$ plain form
18724 46226 109066 51542 -323139 -479159 -481194 -432857 -427041 -188112 -225637 -262719 -509188
18713 -509188 -712673 -575782 -267022 -170930 -88791 40024 -39026 137562 158609 10252
18703 10252 131880 13633 -91149 19981 126146 271207 135748 7116 -68963 -146198
18693 -146198 -127294 -91051 13707 24096 -149791 -116721 -111276 -262367 -84662 -36289 168907
18682 168907 288027 205621 14786 -183565 -397891 -503973 -252008 -85484 -30727 9981
18672 9981 -111040 -227622 -51861 87324 151130 169660 298423 128591 24396 -62626
18662 -62626 117712 303501 163754 5976 -133785 -202665 -144664 -25923 31016 71038
18652 71038 167694 253907 266135 326990 283741 298342 193845 143214 192468 155433 49600
$$ packed form
18724D6226O2840n7524l74681j56020k035M8337N816K38929l7525l7082k46469
18713e09188k03485J36891L08760R6092Q2139J28815p9050J76588K1047j48357
18703A0252J21628j18247j04782J11130J06165J45061j35459j28632p6079p7235
18693a46198J8904L6243J04758J0389j73887L3070N445j51091J77705M8373K05196
18682A68907J19120q2406j90835j98351k14326j06082K51965J66524N4757M0708
18672I981j21021j16582J75761J39185O3806J8530J28763j69832j04195q7022
18662f2626J80338J85789j39747j57778j39761o8880N8001J18741N6939M0022
18652G1038R6656Q6213J2228O0855m3249J4601j04497n0631M9254l7035j05833
$$ plain form
18641 49600 88715 297705 290693 338894 467987 496660 435149 286282 263889 169578 -13274
18630 -13274 -27020 111243 138698 162895 210630 337532 390643 189275 114310 58888 86830
18619 86830 17199 103008 138447 104080 257177 479239 560625 673168 575061 450429 237636
18608 237636 305310 409674 487748 335465 278239 459017 313864 155249 210284 432355
18598 432355 473995 665937 624414 513787 525931 565208 380379 480636 628375 342947
18588 342947 292810 284489 396844 568208 472961 387250 175374 317325 291059 355639 406063
18577 406063 385948 468169 492185 394486 482299 483918 523212 331804 148540 116415 357828
18566 357828 494210 520158 547865 493889 233614 305732 188922 96891 98921 302815 293885
$$ packed form
18641D9600L9115K08990p012M8201J29093K8673o1511j48867k2393r4311j82852
18630a3274j3746J38263K7455K4197M7735J26902N3111k01368p4965n5422K7942
18619H6830o9631Q5809L5439l4367J53097K22062Q1386J12543r8107j24632k12793
18608B37636O7674J04364P8074j52283n7226J80778j45153j58615N5035K22071
18598D32355M1640J91942m1523j10627J2144L9277j84829J00257J47739k85428
18588C42947n0137q321J12355J71364r5247q5711k11876J41951k6266O4580N0424
18577D06063k0115Q2221K4016r7699Q7813J619L9294j91408j83264l2125K41413
18566C57828J36382K5948K7707n3976k60275P2118j16810r2031K030K03894q930
$$ plain form
18555 293885 304444 368426 417758 425465 434613 469331 508496 512022 696273 664024 560261 405630
18543 405630 435049 496395 623178 740854 804764 842271 844821 937705 830611 850737 719216
18532 719216 493438 490796 415933 295199 424567 454762 386686 594293 808230 821070 831842
18521 831842 788403 834166 962000 942406 852495 851604 787644 769477 801518 687549 460402
18510 460402 307650 492595 779293 1026047 865279 959241 1141310 929497 830488 837782
18500 837782 1212366 1396696 991820 678842 704624 767939 989583 1180504 1128017 1268635
18490 1268635 1247015 1286398 1539324 1688925 1799719 2112065 2062277 2247734 2098844 2292705
18480 2292705 2775747 3180958 3274814 3314383 3409860 3722998 4005870 4657505 5561488 6404506
$$ packed form
18555B93885J0559O3982M9332P707R148L4718L9165L526J84251l2249j03763j54631
18543D05630K9419O1346J26783J17676O3910L7507K550R2884j07094K0126j31521
18532G19216k25778k642p4863j20734J29368L0195o8076K07607K13937J2840J0772
18521H31842m3439M5763J27834j9594q9911q91o3960j8167L2041j13969k27147
18510D60402j52752J84945K86698K46754j60768R3962J82069k11813r9009P294
18500H37782L74584J84330m04876l12978K5782O3315K21644J90921n2487J40618
18490A268635k1620L9383K52926J49601J10794L12346m9788J85457j48890J93861
18480B292705M83042M05211R3856L9569R5477L13138K82872O51635R03983Q43018
$$ plain form
18470 6404506 7485465 9146512 11412720 14178887 17841731 22621042 28842129 37239198
18462 37239198 48339187 60300833 68760384 75111681 83512576 93457864 95698967 89400728
18454 89400728 80765697 74868618 72921570 68838885 55543957 40740728 30199847 23726653
18446 23726653 19388772 16395816 14496274 13172539 12446622 12291134 12537794 13021213 14256975
18437 14256975 16359142 19257796 22989175 27747804 34213704 42787567 53746596 64431274
18429 64431274 71466836 77603687 86335056 94740378 94247851 87141188 79666431 75358576
18421 75358576 73665202 67499222 54130106 42112935 35161014 32521310 32255385 34370065
18413 34370065 39084383 46319875 56225870 65514437 71652189 77162360 85220211 92790181
$$ packed form
18470F404506J080959J661047K266208K766167L662844M779311O221087Q397069
18462C7239198J1099989J1961646Q459551O351297Q400895R945288K241103o298239
18454H9400728q635031n897079j947048m082685j3294928j4803229j0540881o473194
18446B3726653m337881k992956j899542j323735p25917j55488K46660M83419J235762
18437A4256975K102167K898654L731379M758629O465900Q573863J0959029J0684678
18429F4431274P035562O136851Q731369Q405322m92527p106663p474757m307855
18421G5358576j693374o165980j3369116j2017171o951921k639704k65925K114680
18413C4370065M714318P235492R905995R288567O137752N510171Q057851P569970
$$ plain form
18405 92790181 91716684 84409697 76610046 71797691 69693182 62824992 48830671 36086615
18397 36086615 27520303 21830883 17946938 15581081 14199623 12994834 12415071 12195040
18389 12195040 12268736 12713020 14199152 16098957 18776037 22408128 27269628 33685318
18381 33685318 42421714 52881945 61936913 67753889 73979228 82636296 88225006 84575102
18373 84575102 76798951 70002246 66539553 64128224 54688710 40118151 28688186 21073742
18365 21073742 16037783 12687974 10500123 8998548 7964924 6975901 6145065 5606555
18357 5606555 5313004 5163625 4816295 4547651 3913274 3716859 3582915 3295177 2981058
18348 2981058 2722089 2564561 2450889 2262644 2028599 1819115 1785133 1773855 1978755 2032800
$$ packed form
18405I2790181j073497p306987p799651m812355k104509o868190j3994321j2744056
18397C6086615q566312n689420l883945k365857j381458j204789n79763k20031
18389A2195040P3696M44284J486132J899805K677080L632091M861500O415690
18381C3685318Q736396J0460231R054968N816976O225339Q657068N588710l649904
18373H4575102p776151o796705l462693k411329r439514j4570559j1429965p614444
18365B1073742n035959l349809k187851j501575j033624r89023q30836n38510
18357E606555k93551j49379l47330k68644o34377j96415j33944k87738l14119
18348B981058k58969j57528j13672j88245k34045k09484l3982j1278K04900N4045
$$ plain form
18338 2032800 1701495 1479325 1553721 1576896 1337724 1365997 1340211 1152783 1104522 1187115
18328 1187115 1026466 938850 853477 761333 841428 901857 900112 769877 704721 770055 758541
18317 758541 819760 1003579 1097888 1097387 581130 420448 431601 598092 675659 776553 982931
18306 982931 1057427 779469 541891 657015 786504 853805 827291 672856 740859 625807
18296 625807 526188 648534 462807 198638 240964 411111 577107 576867 345652 330432 254709
18285 254709 212902 265402 258504 479224 461613 471676 515955 178982 213781 459789 399304
18274 399304 206623 296138 298972 148485 186437 569020 553810 407945 576396 613030 730002
18263 730002 897006 720763 821415 582114 278042 38536 147310 299142 522906 646747
$$ packed form
18338B032800l31305k22170P4396K3175k39172K8273k5786j87428m8261Q2593
18328A187115j60649q7616q5373r2144Q0095O0429j745j30235o5156O5334j1514
18317G58541O1219J83819R4309n01n16257j60682J1153J66491P7567J00894K06378
18306I82931P4496k77958k37578J15124J29489O7301k6514j54435O8003j15052
18296F25807r9619J22346j85727k64169M2326J70147J65996k40k31215j5220p5723
18285B54709m1807N2500o898K20720j7611J0063M4279l36973L4799K46008o0485
18274C99304j92681Q9515K834j50487L7952L82583j5210j45865J68451L6634J16972
18263G30002J67004j76243J00652k39301l04072k39506J08774J51832K23764J23841
$$ plain form
18253 646747 640164 481081 72902 -88051 -78281 15525 102621 300688 493324 647776 430053
18242 430053 353991 606705 494506 508032 520681 419762 198504 135440 70967 118356 169872
18231 169872 255288 384830 370321 327491 334450 135510 -113590 106914 297412 436295
18221 436295 419506 2361 -306479 -12230 223971 169008 127422 210922 -2622 -47116
18211 -47116 -91156 -24684 95776 240300 331491 219300 144955 148110 -99625 -134512 18334
18200 18334 204015 171669 386648 560455 400971 379327 581785 608198 547511 510875 651928
18189 651928 762371 748442 555344 431044 537445 798750 1050723 911648 652298 615127
18179 615127 824679 954512 793800 453546 264492 195242 397381 474010 472364 312739
$$ packed form
18253F46747o583j59083m08179j60953R770R3806Q7096J98067J92636J54452k17723
18242D30053p6062K52714j12199J3526J2649j00919k21258o3064o4473M7389N1516
18231A69872Q5416J29542j4509m2830O959j98940k49100K20504J90498J38883
18221D36295j6789m17145l08840K94249K36201n4963m1586Q3500k13544m4494
18211d7116m4040O6472J20460J44524R1191j12191p4345L155k47735l4887J52846
18200A8334J85681l2346K14979J73807j59484k1644K02458K6413o0687l6636J41053
18189F51928J10443j3929j93098j24300J06401K61305K51973j39075k59350l7171
18179F15127K09552J29833j60712l40254j89054o9250K02139P6629j646j59625
$$ plain form
18169 312739 345536 645673 736149 583367 663124 539485 355705 364888 474470 666761
18159 666761 528133 439792 676112 852025 1141405 1084130 810183 663768 715550 908299
18149 908299 1037084 846684 892694 1053759 1080161 1130669 1242622 1579362 1864429 1914245
18139 1914245 2084262 2305043 2343842 2407699 2539376 2621593 2535929 2565396 3043793 3582506
18129 3582506 4032440 4657560 5361782 6078993 7194714 8469628 10242440 12346488 15285401
18120 15285401 19468661 25433180 34079595 45929344 60364218 78516067 104634425
18113 104634425 143291051 192045201 228212052 236200074 242391861 263894466 263253260
18106 263253260 193510422 123174734 80145013 55642689 40575956 31063582 24560444
$$ packed form
18169C12739L2797L00137R0476j52782P9757j23639j83780R183J09582J92291
18159F66761j38628q8341K36320J75913K89380n7275k73947j46415N1782J92749
18149I08299J28785j90400M6010J61065K6402N0508J11953L36740K85067M9816
18139A914245J70017K20781L8799O3857J31677Q2217q5664K9467M78397N38713
18129C582506M49934O25120P04222P17211J115721J274914J772812K104048K938913
18120A5285401M183260N964519Q646415J1849749J4434874J8151849K6118358
18113A04634425L8656626M8754150L6166851P988022O191787K1502605o41206
18106B63253260o9742838p0335688m3029721k4502324j5066733r512374o503138
$$ plain form
18099 24560444 19791474 16397893 13919496 12149718 10770495 9506176 8476643 7675570
18091 7675570 6854127 6032038 5139519 4385588 4284603 4297894 4104068 3679032 3212075 2875491
18081 2875491 2708502 2494816 2523929 2434780 2321103 2178929 2042205 2087075 2119528 1922609
18071 1922609 2076455 2248367 2034814 1715638 1459145 1585699 1696882 1428069 1210710
18062 1210710 974966 1014065 1048527 1117496 1128640 1142998 1165174 1021837 849687 768516 892281
18051 892281 979117 1035064 944838 874235 818428 947333 941274 851759 592298 768187 1084378
18040 1084378 1134892 939286 893977 895149 995176 1047912 1100673 964134 904184 1001439 1131382
18029 1131382 843738 905930 970034 906171 591503 413038 317856 411935 714984 700568
$$ packed form
18099B4560444m768970l393581k478397j769778j379223j264319j029533q01073
18091G675570q21443q22089q92519p53931j00985J3291j93826m25036m66957l36584
18081B875491j66989k13686K9113q9149j13677j42174j36724M4870L2453j96919
18071A922609J53846J71912k13553l19176k56493J26554J11183k68813k17359
18062A210710k35744L9099L4462O8969J1144J4358K2176j43337j72150q1171J23765
18051H92281Q6836N5947r0226p0603n5807J28905o059q9515k59461J75889L16191
18040A084378N0514j95606m5309J172J00027N2736N2761j36539n9950R7255J29943
18029A131382k87644O2192O4104o3863l14668j78465r5182R4079L03049j4416
$$ plain form
18019 700568 583247 556275 519060 351758 249331 416666 589496 457353 243201 -55723
18009 -55723 -171471 21561 109351 82227 -120861 -32129 -47721 -191119 -306640 23605
17999 23605 108045 -73959 -85 6862 164088 280777 171230 212518 358297 327077 228083
17988 228083 90906 137573 36616 -90376 -113563 -147436 102143 203862 19541 226458
17978 226458 240718 122332 153810 126553 26501 -9233 91872 320236 698294 703490 586140
17967 586140 731321 776406 501392 316090 80428 31110 53982 98914 118808 319950
17957 319950 273425 139988 122795 92272 -57089 34284 59274 109715 263910 135121 40746
17946 40746 194705 92653 12343 46817 119134 188223 286833 264473 245757 297813 204497
$$ packed form
18019G00568j17321k6972l7215j67302j02427J67335J72830j32143k14152k98924
18009e5723j15748J93032Q7790k7124k03088Q8732j5592j43398j15521L30245
17999B3605Q4440j82004P3874O947J57226J16689j09547M1288J45779l1220r8994
17988B28083j37177M6667j00957j26992k3187l3873K49579J01719j84321K06917
17978B26458J4260j18386L1478k7257j00052l5734J01105K28364L78058N196j17350
17967E86140J45181M5085k75014j85302k35662m9318K2872M4932J9894K01142
17957C19950m6525j33437j7193l0523j49361R1373K4990N0441J54195j28789r4375
17946D0746J53959j02052q0310L4474P2317O9089R8610k2360j8716N2056r3316
$$ plain form
17935 204497 203300 520833 682970 554125 728701 697241 730170 796403 760519 691950 409339
17924 409339 146410 -25105 121177 190224 217680 279453 423147 377630 190239 28037
17914 28037 64248 246769 68058 -139447 -4830 143958 31605 -24401 113657 228870
17904 228870 269622 398961 527236 274117 160661 274928 139723 327899 384550 462087
17894 462087 635187 643231 537149 459815 300283 143226 463772 438452 265386 425348
17884 425348 517611 487833 444102 418374 536902 350759 606306 839882 803257 523373
17874 523373 287986 421097 383370 235591 338902 293989 238929 193119 35214 -245978
17864 -245978 -430150 -490736 -147413 267565 517839 543369 154515 19196 314521 193645
$$ packed form
17935B04497j197L17533J62137j28845J74576l1460L2929O6233l5884o8569k82611
17924D09339k62929j71515J46282O9047K7456O1773J43694m5517j87391j62202
17914B8037L6211J82521j78711k07505J34617J48788j12353n6006J38058J15213
17904B28870M0752J29339J28275k53119j13456J14267j35205J88176N6651P7537
17894D62087J73100Q044j06082p7334j59532j57057L20546k5320j73066J59962
17884D25348R2263k9778m3731k5728J18528j86143K55547K33576l6625k79884
17874E23373k35387J33111l7727j47779J03311m4913n5060m5810j57905k81192
17864b45978j84172o0586L43323M14978K50274K5530l88854j35319K95325j20876
$$ plain form
17854 193645 -45406 -96153 -11415 212701 288493 222085 241729 239024 475847 442793 389894
17843 389894 336371 333703 432017 282293 130421 62080 89111 23553 -59692 -8096 26303
17832 26303 71317 10632 -117921 49837 322533 568257 374456 309807 392251 339483 595580
17821 595580 422272 197803 27719 -8544 189208 406966 632678 531181 380943 249971
17811 249971 278114 52863 -115542 -100060 -199715 -150382 -164319 -119015 98706 44337 -133644
17800 -133644 -36843 -3283 -93391 7579 -169372 -183074 1437 28417 -25393 62590 -5640
17789 -5640 -25041 -246823 -268432 -115168 -75962 -10377 -84586 24801 -50761 -166569 -58083
17778 -58083 59803 -49677 -254850 -393202 -266191 -223524 -182765 -91025 -88461 -282992 -524515
$$ packed form
17854A93645k39051n0747Q4738K24116P5792o6408J9644k705K36823l3054n2899
17843C89894n3523k668R8314j49724j51872o8341K7031o5558q3245N1596L4399
17832B6303M5014o0685j28553J67758K72696K45724j93801o4649Q2444n2768K56097
17821E95580j73308k24469j70084l6263J97752K17758K25712j01497j50238j30972
17811B49971K8143k25251j68405J5482r9655M9333j3937M5304K17721n4369j77981
17800a33644R6801L3560r0108J00970j76951j3702J84511K6980n3810Q7983o8230
17789e640j9401k21782k1609J53264L9206O5585p4209J09387p5562j15808J08486
17778e8083J17886j09480k05173j38352J27011M2667M0759R1740K564j94531k41523
$$ plain form
17767 -524515 -612585 -324181 -4942 -17530 -130764 -120384 56444 226191 110953 127376
17757 127376 258710 83339 -952 3748 -40451 -217917 -279457 -210248 -300639 -242889 22490
17746 22490 -177120 -217228 -180036 -45711 172755 234176 -75092 -85026 -132228 -430841 -433928
17735 -433928 -153018 -95893 -49307 40094 42596 116916 -32528 -31212 116486 274781 198541
17724 198541 87067 -25083 -196679 -266900 -89225 -141231 15097 140593 202871 411757
17714 411757 375734 -6166 -211072 128099 105850 159827 559696 537370 188830 -74881
17704 -74881 -73231 -3341 55597 13512 10195 -18770 -41395 112962 -87218 -118661 -105951 -81432
17692 -81432 -154879 -36887 -65868 48098 170609 107480 80725 152008 192828 189454 398642
$$ packed form
17767e24515q8070K88404L19239j2588j13234J0380J76828J69747j15238J6423
17757A27376J31334j75371q4291M700m4199j77466o1540O9209r0391N7750K65379
17746B2490j99610m0108L7192J34325K18466O1421l09268r934m7202k98613l087
17735d33928K80910N7125M6586Q9401K502P4320j49444J316J47698J58295p6240
17724A98541j11474j12150j71596p0221J77675n2006J56328J25496O2278K08886
17714D11757l6023l81900k04906L39171k2249N3977L99869k2326l48540k63711
17704g4881J650O9890N8938m2085l317k8965k2625J54357k00180l1443J2710K4519
17692h1432p3447J17992k8981J13966J22511o3129k6755P1283M0820l374K09188
$$ plain form
17681 398642 256625 54617 110831 221888 -28636 -206801 -127708 100092 96879 -110840
17671 -110840 -197679 -229041 2470 -200446 -329655 -22257 214504 497494 461754 284091
17661 284091 299612 196666 -74615 -83644 -39011 -35898 -28189 -4834 188949 342431 217678
17650 217678 28281 85339 85589 34555 92432 133837 280927 124921 -33500 144825 223413
17639 223413 66360 138817 153467 221753 111195 -132998 -140197 -67562 -177197 -43510 112474
17628 112474 15876 43596 -63372 -139586 -17022 18635 47617 72705 -17964 -82534 -27417
17617 -27417 -84549 -112086 -281803 -331859 -322734 -58395 209271 162328 42946 -161199 -302487
17606 -302487 -205508 -23263 83085 153157 -2805 -118782 -235140 38899 222727 139904
$$ packed form
17681C98642j42017k02008N6214J11057k50524j78165P9093K27800l213k07719
17671a10840q6839l1362K31511k02916j29209L07398K36761K82990l5740j77663
17661B84091J5521j02946k71281r029M4633L113P709K3355J93783J53482j24753
17650B17678j89397N7058K50n1034N7877M1405J47090j56006j58421J78325P8588
17639B23413j57053P2457J4650O8286j10558k44193p199P2635j09635J33687J55984
17628A12474r6598K7720j06968p6214J22564L5657K8982K5088r0669o4570N5117
17617b7417n7132k7537j69717n0056R125K64339K67666m6943j19382k04145j41288
17606c02487R6979J82245J06348P0072j55962j15977j16358K74039J83828q2823
$$ plain form
17596 139904 -140873 -103244 46070 112192 126855 9035 -76863 4649 263258 238736 -48632
17585 -48632 -117821 224649 393460 330459 198498 243469 163680 -149547 -96631 160829 234758
17574 234758 290578 273390 288769 160707 -56817 -389846 -569555 -500181 -467117 -493006 -286151
17563 -286151 -111711 289 69753 51358 227705 460099 500737 399900 212819 159473
17553 159473 216921 274566 347607 362857 250893 40377 -112688 -210668 -330673 -93854
17543 -93854 252125 335986 191979 -47441 24062 214933 85377 -42220 -320857 -456231
17533 -456231 -325013 -58552 250122 437274 448073 214976 -133779 -62116 -256094 -229463
17523 -229463 -80741 51779 77893 -69627 -129396 -202519 -141650 -44270 -115754 15906 124633
$$ packed form
17596A39904k80777L7629J49314O6122J4663j17820q5898Q1512K58609k4522k87368
17585d8632o9189L42470J68811o3001j31961M4971p9789l13227N2916K57460P3929
17574B34758N5820j7188J5379j28062k17524l33029j79709O9374L3064k5889K06855
17563b86151J74440J12000O9464j8395J76347K32394M0638j00837j87081n3346
17553A59473N7448N7645P3041J5250j11964k10516j53065r7980j20005K36819
17543i3854L45979Q3861j44007k39420P1503J90871j29556j27597k78637j35374
17533d56231J31218K66461L08674J87152J0799k33097l48755P1663j93978K6631
17523b29463J48722J32520K6114j47520n9769p3123O0869R7380p1484J31660J08727
$$ plain form
17512 124633 -130254 -321863 -186927 -110723 -198762 91979 420506 612731 452962 81987
17502 81987 -191312 -174586 -317925 -220392 35389 57207 146674 68427 87662 148888 124453
17491 124453 -80312 -49506 37297 140897 24890 -271261 -278550 -316618 -421301 -266486
17481 -266486 -268838 -189744 -6188 -88048 -370709 -382390 -286037 -222927 -254806 -290839 -264207
17470 -264207 -482823 -385890 -92766 -69005 -151611 -138801 -362407 -594632 -418594 -263876
17460 -263876 -370005 -425116 -165065 -241671 -330230 -106226 -144699 -34183 -107742 -40871 235845
17449 235845 472496 576431 579977 756955 1006205 1032596 956487 1381379 1773618 1731708
17439 1731708 1267255 656659 116612 56281 23920 6367 72206 100922 218698 292946
$$ packed form
17512A24633k54887j91609J34936P6204q8039K90741L28527J92225j59769l70975
17502H1987k73299J6726j43339R7533K55781K1818Q9467p8247J9235O1226k4435
17491A24453k04765L0806Q6803J03600j16007k96151p289l8068j04683J54815
17481b66486k352P9094J83556q1860k82661j1681R6353O3110l1879l6033K6632
17470b64207k18616R6933K93124K3761q2606J2810k23606k32225J76038J54718
17460b63876j06129n5111K60051p6606q8559K24004l8473J10516p3559O6871K76716
17449B35845K36651J03935L546J76978K49250K6391p6109M24892L92239m1910
17439A731708m64453o10596n40047o0331l2361j7553O5839K8716J17776P4248
$$ plain form
17429 292946 247649 232828 274794 328218 -23391 -194015 -98513 72344 96165 -44533 -290037
17418 -290037 -446948 -379778 -102633 49199 -137433 -91071 211455 180380 77265 131072
17408 131072 191640 46266 -303859 -180269 -637 142162 -16899 -348537 -572682 -362559
17398 -362559 -374537 -396867 -384725 -149415 -136352 -94340 178009 240742 53010 -196258 -88835
17387 -88835 56588 -105312 -221453 -289639 -418999 -209146 22871 205816 202390 236968
17377 236968 446920 293973 172740 104147 -10420 -181090 -59595 31224 93763 22290
17367 22290 132119 225314 150626 102739 212103 129594 38963 192328 289386 -52297 -286274
17356 -286274 -42859 35171 -62173 -116563 162118 180986 148347 -57974 -93291 -24744 52568
$$ packed form
17429B92946m5297j4821M1966N3424l51609j70624R5502J70857K3821j40698k45504
17418b90037j56911O7170K77145J51832j86632M6362L02526l1075j03115N3807
17408A31072O0568j45374l50125J23590J79632J42799j59061l31638k24145K10123
17398c62559j1978k2330J2142K35310J3063M2012K72349O2733j87732k49268J07423
17387h8835J45423j61900j16141o8186j29360K09853K32017J82945l426L4578
17377B36968K09952j52947j21233o8593j14567j70670J21495R0819O2539p1473
17367B2290J09829R3195p4688m7887J09364q2509r0631J53365R7058l41683k33977
17356b86274K43415P8030r7344n4390K78681J8868l2639k06321l5317O8547P7312
$$ plain form
17345 52568 -168212 -166168 108614 70404 -1031 -82604 -92614 -193564 -211136 -129777 -286509
17334 -286509 -230210 -149520 -22135 -55445 -14398 -218450 -109201 -89934 31244 12546 -108900
17323 -108900 -88893 -34719 -42858 -52593 -160665 -182767 -158739 -318324 -290941 -77184 -365564
17312 -365564 -311809 -250389 -545994 -542643 -420539 -235036 17985 38980 31532 -6631 -139022
17301 -139022 -436660 -232516 -334716 -304246 -190632 -101551 -319466 -507174 -355609 -103480
17291 -103480 -125768 -170973 -183807 -246252 -81 -41328 74039 194607 122188 39755 -156816
17280 -156816 -167590 68538 391781 356952 68731 -175616 -281594 -382773 -162538 8530
17270 8530 -209003 -124438 87551 -158519 -290278 -418175 -289024 -100261 -141447 -221083
$$ packed form
17345E2568k20780K044K74782l8210p1435q1573j0010j00950j7572Q1359j56732
17334b86509N6299Q0690J27385l3310M1047k04052J09249J9267J21178j8698j21446
17323a08900K0007N4174q139r735j08072k2102K4028j59585K7383K13757k88380
17312c65564N3755O1420k95605L351J22104J85503K53021K0995p448l8163j32391
17301a39022k97638K04144j02200L0470J13614Q9081k17915j87708J51565K52129
17291a03480k2288m5205j2834o2445K46171m1247J15367J20568p2419q2433j96571
17280a56816j0774K36128L23243l4829k88221k44347j05978j01179K20235J71068
17270H530k17533Q4565K11989k46070j31759j27897J29151J88763m1186p9636
$$ plain form
17260 -221083 -104565 -123381 89370 139489 22486 8963 -224088 -510997 -401743 -233339
17250 -233339 -317403 -264697 -45245 138254 132047 119125 -19817 -123010 858 241144
17240 241144 312342 202494 -81768 -116058 -81920 7746 61332 390170 432157 410425 270872
17229 270872 176251 91917 56241 199880 42040 -100854 104080 140929 20860 32402
17219 32402 -137353 -411620 -349867 -183094 -80594 -102718 -62087 -150214 -222840 -260320 -6394
17208 -6394 -121538 -308146 -304443 -237445 -88040 -34888 -92201 -48877 72052 -27685 25471
17197 25471 180405 -27197 -387273 -490542 -507467 -377849 -119742 -58719 -20700 53675
17187 53675 251611 187358 -106635 -127190 -110607 170162 372665 118426 124461 60642 46383
$$ packed form
17260b21083J16518j8816K12751N0119j17003j3523k33051k86909J09254J68404
17250b33339q4064N2706K19452J83499o207j2922j38942j03193J23868K40286
17240B41144P1198j09848k84262l4290L4138Q9666N3586L28838M1987k1732j39553
17229B70872r4621q4334l5676J43639j57840j42894K04934L6849j20069J1542
17219C2402j69755k74267O1753J66773J02500k2124M0631q8127p2626l7480K53926
17208f394j15144j86608L703O6998J49405N3152n7313M3324J20929r9737N3156
17197B5471J54934k07602l60076j03269j6925J29618K58107O1023L8019P4375
17187E3675J97936o4253k93993k0555J6583K80769K02503k54239O035o3819j4259
$$ plain form
17176 46383 -83888 -310290 -427972 -401075 -424798 -413400 -297020 -172882 -127720 72962
17166 72962 -50023 -246212 -212823 -293369 -380802 -348757 -205450 -30844 179463 139443 120324
17155 120324 239093 238616 56963 -18432 100495 183168 90721 133635 238217 60989 -257327
17144 -257327 -168861 -28200 116094 78679 15274 -67099 -58107 18895 32972 204325 138004
17133 138004 96916 246607 21056 -7127 183161 589 -257663 -224762 -165400 -196698
17123 -196698 -161697 -174866 -189670 -209947 -31044 152120 60899 -4701 -82228 -218503 -204456
17112 -204456 -205704 -94507 5528 102024 105523 -81571 -73482 70959 163797 202395 75212
17101 75212 90450 67792 -6765 51064 -37903 -43277 79209 119839 142040 -30217 -70964
$$ packed form
17176D6383j30271k26402j17682K6897k3723J1398J16380J24138M5162K00682
17166G2962j22985j96189L3389q0546q7433L2045J43307J74606K10307m0020j9119
17155A20324J18769m77j81653p5395J18927Q2673r2447M2914J04582j77228l18316
17144b57327Q8466J40661J44294l7415o3405q2373Q992P7002J4077J71353o6321
17133A38004m1088J49691k25551k8183J90288j82572k58252L2901N9362l1298
17123a96698L5001j3169j4804k0277J78903J83164r1221o5600p7527j36275J4047
17112b04456j248J11197J00035R6496L499j87094Q089J44441R2838L8598j27183
17101G5212J5238k2658p4557N7829q8967n374J22486M0630K2201j72257m0747
$$ plain form
17090 -70964 -116968 -202799 -462028 -419622 -266739 -370556 -338305 -410369 -577914 -347100 -31051
17079 -31051 87350 81084 317009 467618 427589 185204 67507 -12604 -157887 -180602 -217294
17068 -217294 -136295 -109943 -101787 49278 -8226 -75604 -84105 -94511 -100908 -46824 186886 173520
17056 173520 -15828 7214 27334 -146818 -73400 124475 249094 202023 -46473 -281786
17046 -281786 -235247 -356619 -464467 -545438 -305050 -45288 -179780 -136192 -157204 -451206
17036 -451206 -464917 -361279 -606593 -598466 -21684 159069 163099 -30025 34325 304661 215510
17025 215510 332180 495974 257350 -42674 9309 137494 -38956 67845 266191 229327
17015 229327 96096 -88714 -99487 -241516 -64467 16751 -28865 -108852 -219207 -206869
$$ packed form
17090g0964m6004q5831k59229M2406J52883j03817L2251p2064j67545K30814L16049
17079c1051J18401o266K35925J50609m0029k42385j17697q0111j45283k2715l6692
17068b17294Q0999K6352Q156J51065n7504o7378q501j0406o397N4084K33710j3366
17056A73520j89348K3042K0120j74152P3418J97875J24619m7071k48496k35313
17046b81786M6539j21372j07848q0971K40388K59762j34492M3588k1012k94002
17036d51206j3711J03638k45314Q127N76782J80753M030j93124O4350K70336q9151
17025B15510J16670J63794k38624l00024N1983J28185j76450J06801J98346l6864
17015B29327j33231j84810j0773j42029J77049Q1218m5616p9987j10355J2338
$$ plain form
17005 -206869 -304568 -415583 -393758 -311122 -5399 -22380 31694 12294 271511 251148 161432
16994 161432 128012 197697 78223 49166 -11073 48425 78430 39435 321941 227028 85461
16983 85461 64580 -132028 -276115 -269040 199073 538605 191165 -270626 -150340 188850
16973 188850 257649 208114 76451 37587 -72927 103477 268175 993 -176549 -100017
16963 -100017 42298 25625 99749 112465 57040 -312886 -400198 -370687 -281858 -282957 -182235
16952 -182235 -320807 -357591 -340914 -168174 -50971 -86577 -137759 -109117 -189438 -99729 87225
16941 87225 52779 -38554 -146383 -157174 -97203 -212657 -233539 -125663 103931 301386 391589
16930 391589 295576 351005 541646 642812 405993 173174 306823 638954 557552 241934
$$ packed form
17005b06869r7699j11015K1825Q2636L05723j6981N4074j9400K59217k0363q9716
16994A61432l3420O9685j19474k9057o0239N9498L0005l8995K82506r4913j41567
16983H5461k0881j96608j44087P075M68113L39532l47440m61791J20286L39190
16973A88850O8799m9535j31663l8864j10514J76404J64698k67182j77542P6532
16963a00017J42315j6673P4124J2716n5425l69926q7312K9511Q8829j099J00722
16952a82235j38572l6784J6677J72740J17203l5606n1182K8642q0321Q9709J86954
16941H7225l4446r1333j07829j0791N9971j15454k0882J07876K29594J97455R0203
16930C91589r6013N5429J90641J01166k36819k32819J33649L32131q1402l15618
$$ plain form
16920 241934 245948 187609 130292 -92584 -211385 -282299 -373861 -128771 187123 110884 44075
16909 44075 16764 -22361 33364 -97975 42250 112997 70729 282569 332134 426806 88833
16898 88833 43517 71575 16802 -9594 100746 166310 169367 41421 -150649 41190 -130815
16887 -130815 -278292 -333891 -586064 -498127 -453759 -483547 -362506 -266757 -12112 49062 157798
16876 157798 89049 -175773 -132782 61711 45662 -64087 5227 103427 165814 126080 151428
16865 151428 176717 -70624 -264881 -205048 -178332 -53471 -46262 136637 387178 459534 510652
16854 510652 576439 528771 419307 48225 -122105 5367 -6143 16603 167797 210696
16844 210696 262548 26656 -81126 117225 160769 66739 -2710 42726 378552 164674
$$ packed form
16920B41934M014n8339n7317k22876j18801p0914r1562K45090L15894p6239o6809
16909D4075k7311l9125N5725j31339J40225P0747m2268K11840M9565R4672l37973
16898H8833m5316K8058n4773k6396J10340O5564L057j27946j92070J91839j72005
16887a30815j47477n5599k52173Q7937M4368k9788J21041R5749K54645O1174J08736
16876A57798o8749k64822M2991J94493j6049j09749O9314R8200O2387l9734K5348
16865A51428K5289k47341j94257N9833K6716J24861P209J82899K50541P2356N1118
16854E10652O5787m7668j09464l71082j70330J27472j1510K2746J51194M2899
16844B10696N1852k35892j07782J98351M3544r4030o9449M5436L35826k13878
$$ plain form
16834 164674 35005 22497 -125900 189327 370594 556973 467885 97941 -39053 -138003
16824 -138003 -151831 -201252 -198699 -49375 64076 70448 38146 189277 334699 134588 -139156
16813 -139156 -296865 -263183 -191747 -41879 -101508 -38 98501 74295 49499 198959 234556
16802 234556 239651 165855 154405 209114 214896 96287 -176597 -306431 -205763 42427 -14081
16791 -14081 -191056 -179068 -137576 -10007 -65450 -143372 -271427 -296177 -368533 -280652 10407
16780 10407 165443 32090 44105 -36212 -92279 -3296 217478 86065 55732 -95109 3595
16769 3595 384787 402704 145661 -78568 24954 240459 132878 -210950 -165756 -215831
16759 -215831 -157121 -24714 51115 22745 224165 232985 109056 30998 -67301 -122383 76304
$$ packed form
16834A64674j29669j2508j48397L15227J81267J86379q9088l69944j36994r8950
16824a38003j3828m9421K553J49324J13451O372l2302J51131J45422k00111k73744
16813a39156j57709L3682P1436J49868n9629J01470R8539k4206k4796J49460L5597
16802B34556N095p3796j1450N4709N782j18609k72884j29834J00668K48190n6508
16791a4081j76975J1988M1492J27569n5443p7922j28055k4750p2356Q7881K91059
16780A0407J55036j33353J2015q0317n6067Q8983K20774j31413l0333j50841R8704
16769C595L81192J7917k57043k24229J03522K15505j07581l43828M5194n0075
16759b15831N8710J32407P5829k8370K01420Q820j23929p8058r8299n5082J98687
$$ plain form
16748 76304 278465 307100 215886 9600 137022 120423 5445 184902 224689 56018
16738 56018 245206 345431 343344 469922 403478 54944 -36481 73733 65719 20899 -89641
16727 -89641 10741 203627 301566 21700 -149214 -68572 1705 82583 98909 38450 -197616
16716 -197616 -234734 -83726 32548 136326 124131 108481 78412 -77886 -51642 158554
16706 158554 406065 334406 81593 -50317 156566 326705 242348 160175 293585 354867
16696 354867 345738 247429 28221 47438 67908 -31943 111768 95583 -56219 -24857 64071
16685 64071 299398 421619 224155 -25422 -80237 -161484 -363477 -164964 24639 204152
16675 204152 18320 -117941 -192417 -129345 160811 297556 188144 -70226 105161 242660
$$ packed form
16748G6304K02161K8635r1214k06286J27422j6599j14978J79457L9787j68671
16738E6018J89188J00225k087J26578o6444l48534r1425J10214q014m4820j10540
16727h9641J00382J92886R7939k79866j70914Q0642P0277Q0878J6326o0459k36066
16716a97616l7118J51008J16274J03778j2195j5650l0069j56298K6244K10196
16706A58554K47511p1659k52813j31910K06883J70139q4357q2173J33410O1282
16696C54867r129r8309k19208J9217K0470r9851J43711j6185j51802L1362Q8928
16685F4071K35327J22221j97464k49577n4815q1247k01993J98513J89603J79513
16675B04152j85832j36261p4476O3072K90156J36745j09412k58370J75387J37499
$$ plain form
16665 242660 158046 -69910 -176968 -183097 -254843 -328760 -444832 -310374 -40410 94024
16655 94024 177332 -142483 -182516 -71245 -20963 218233 199266 136262 260259 52807 11471
16644 11471 52956 253562 108130 19796 175402 175150 101041 59825 73190 -40389 -123150
16633 -123150 87531 315191 97075 -108580 -104442 -155298 -18842 -126123 -75850 142539
16623 142539 242755 387299 417265 48458 -166808 -120715 -65849 -77039 -169591 -211719 -15738
16612 -15738 48186 -6766 -19265 1588 -78777 42967 100943 102216 -40204 -125864 -43740
16601 -43740 6509 91486 92915 -101177 -200124 -78985 -59845 -53541 210451 223079 143165
16590 143165 79601 -38355 -53713 -191956 -153163 -96345 -258401 -297736 -276472 -30245 202998
$$ packed form
16665B42660q4614k27956j07058o129p1746p3917j16072J34458K69964J34434
16655I4024Q3308l19815m0033J11271N0282K39196j8967o3004J23997k07452m1336
16644A1471M1485K00606j45432q8334J55606k52p4109m1216J3365j13579q2761
16633a23150K10681K27660k18116k05655M138n0856J36456j07281N0273K18389
16623A42539J00216J44544K9966l68807k15266M6093N4866j1190r2552m2128J95981
16612a5738O3924n4952j2499K0853q0365J21744N7976J273j42420q5660Q2124
16601d3740N0249Q4977J429j94092r8947J21139J9140O304K63992J2628p9914
16590A43165o3564j17956j5358j38243L8793N6818j62056l9335K1264K46227K33243
$$ plain form
16579 202998 -26546 -264666 -254438 -125799 -164136 -68834 32259 -179822 -14717 57430
16569 57430 -153006 -219303 -26794 149867 112996 268635 147859 71107 -219660 -324706
16559 -324706 1487 -52640 -314861 -359061 -206257 -278731 -363484 -342913 -345872 -408766 -471379
16548 -471379 -485826 -249487 -203011 -231248 -186725 -188115 -164072 168363 219677 131907 15560
16537 15560 57 -78723 11194 -53125 56057 100093 365560 420508 577848 406362 144151
16526 144151 -48634 202633 307886 104275 -43413 -195491 -10901 215933 244429 237602
16516 237602 191258 -20204 -267520 -429057 -475598 -207233 94853 201765 89272 104656
16506 104656 171590 71627 167042 -114133 -179068 -58558 16841 -13472 -109911 32103 30209
$$ packed form
16579B02998k29544k38120J0228J28639l8337R5302J01093k12081J65105P2147
16569E7430k10436o6297J92509J76661l6871J55639j20776p6752k90767j05046
16559c24706L26193n4127k62221m4200J52804p2474q4753K0571k959o2894o2613
16548d71379j4447K36339M6476k8237M4523j390K4043L32435N1314q7770j16347
16537A5560j5503p8780Q9917o4319J09182M4036K65467N4948J57340j71486k62211
16526A44151j92785K51267J05253k03611j47688j52078J84590K26834K8496o827
16516B37602m6344k11462k47316j61537m6541K68365L02086J06912j12493J5384
16506A04656O6934r9963R5415k81175o4935J20510P5399l0313r6439J42014j894
$$ plain form
16495 30209 188114 183292 190110 321867 458862 298905 290737 205368 13957 10525 -75864
16484 -75864 -151702 -163198 -281549 -278062 -402604 -301574 -93635 -95768 -261498 -171767 4544
16473 4544 122818 315127 439561 214703 137236 378913 325303 153398 48208 -156266
16463 -156266 -96813 -180868 -287956 -282619 -298487 -414728 -303648 -204765 -213419 -324535 -401671
16452 -401671 -471610 -352006 -140304 30837 -235796 -246163 -140063 -8123 225590 138190
16442 138190 133476 177502 276873 65970 1234 -51413 65607 2935 -72316 36189 -7521
16431 -7521 -127406 -399433 -405905 -155615 -30785 63550 -86497 -434802 -573039 -450624
16421 -450624 -397253 -436476 -406578 -299176 -254383 -369779 -507793 -545867 -34373 14737 -77610
$$ packed form
16495C0209J57905m822O818J31757J36995j59957q168q5369j91411l432q6389
16484g5864p5838j1496j18351L487j24542J01030K07939k133j65730Q9731J76311
16473D544J18274J92309J24434k24858p7467K41677n3610j71905j05190k04474
16463a56266N9453q4055j07088N337j5868j16241J11080R8883q654j11116p7136
16452d01671o9939J19604K11702J71141k66633j0367J06100J31940K33713q7400
16442A38190m714M4026R9371k10903o4736n2647J17020o2672p5251J08505m3710
16431g521j19885k72027o472K50290J24830R4335j50047l48305j38237J22415
16421d50624N3371l9223K9898J07402M4793j15396j38014l8074N11494M9110r2347
$$ plain form
16410 -77610 -121857 -140987 -39079 -41499 47179 -61860 -257777 -124030 48217 26688 -261241
16399 -261241 -393709 -100962 -36655 -274883 -271915 -136987 -142604 82831 217124 1454
16389 1454 -149102 -20843 80150 220321 148156 80579 210759 19081 -51981 -271637
16379 -271637 -230688 -66752 -167895 -52316 -69957 -72016 -264195 -523434 -425161 -302390
16369 -302390 -247570 96452 -177582 -280895 -221711 -375907 -272943 -130239 -121559 -167244
16359 -167244 -264511 -245677 -49743 -228078 -252589 -165058 -163389 122355 236485 99718 105259
16348 105259 88498 9254 -185301 -146922 -95980 -47416 -109155 -19374 -32785 -167799 -525789
16337 -525789 -377888 -33834 -35799 -103854 5675 -109702 -378994 -311011 -442440 -193314
$$ packed form
16410g7610m4247j9130J01908k420Q8678j09039j95917J33747J72247k1529k87929
16399b61241j32468K92747O4307k38228K968J34928n617K25435J34293k15670
16389A454j50556J28259J00993J40171p2165o7577J30180j91678p1062k19656
16379b71637M0949J63936j01143J15579j7641k059j92179k59239R8273J22771
16369c02390N4820L44022k74034j03313N9184j54196J02964J42704Q680m5685
16359a67244r7267J8834J95934j78335k4511Q7531J669K85744J14130j36767N541
16348A05259j6761p9244j94555L8379N0942M8564o1739Q9781j3411j35014l57990
16337e25789J47901L44054j965o8055J09529j15377k69292O7983j31429K49126
$$ plain form
16327 -193314 89761 17483 -71416 -241219 -275668 -364166 -402677 -669005 -390382 -362097 -299904
16316 -299904 -33906 2349 80487 130788 -36063 -90677 -97626 -191210 -359186 -218804 -83060
16305 -83060 -170445 -191017 -239345 -91476 19153 -20521 -99706 -258338 -227014 -87207 -94013
16294 -94013 21610 195814 -25601 -25769 -203039 -502320 -274934 -240937 -76856 107139
16284 107139 28608 -152131 -119740 4411 78014 -126660 -257147 -399997 -463884 -367498
16274 -367498 -199926 -255432 -233091 -81211 56524 -24254 127675 101698 160423 169377 55434
16263 55434 -12677 -134636 -218248 -148614 16145 -234378 -194761 -32724 -77960 -35408 -244889
16252 -244889 -288273 -173238 89629 90130 -71144 62640 412170 395959 34707 -86026
$$ packed form
16327a93314K83075p2278q8899j69803l4449q8498l8511k66328K78623K8285O2193
16316b99904K65998L6255P8138N0301j66851n4614o949r3584j67976J40382J35744
16305h3060q7385k0572m8328J47869J10629l9674p9185j58632L1324J39807o806
16294i4013J15623J74204k21415j68j77270k99281K27386L3997J64081J83995
16284A07139p8531j80739L2391J24151P3603k04674j30487j42850o3887R6386
16274c67498J67572n5506K2341J51880J37735q0778J51929k5977N8725Q954j13943
16263E5434o8111j21959q3612O9634J64759k50523L9617J62037m5236M2552k09481
16252b44889m3384J15035K62867N01j61274J33784L49530j6211l61252j20733
$$ plain form
16242 -86026 29055 360304 470141 263441 141857 141697 347581 212964 -53597 3479
16232 3479 15484 219922 247071 234721 66833 39411 -78048 -97492 -15208 105676 -3360
16221 -3360 -315954 -371510 -437290 -253199 -3710 19526 -104625 -20573 241718 364150 278115
16210 278115 292570 272154 139668 91955 147382 370411 233835 112108 184091 237795 266916
16199 266916 290621 81213 38747 77613 162291 252436 289678 -42920 -352475 -233825 -51287
16188 -51287 -264048 -225614 114304 115144 -52206 -83563 125269 -183510 -154381 -18806 69540
16177 69540 -49464 -26768 191756 241816 9539 -90618 -231055 -110554 177394 59587
16167 59587 -73449 -293481 -251974 -132447 60998 349528 276028 55427 -23501 -9240
$$ packed form
16242h6026J15081L31249J09837k06700j21584j60K05884j34617k66561N7076
16232C479J2005K04438K7149j2350j67888k7422j17459j9444Q2284J20884j09036
16221c360l12594n5556o5780J84091K49489K3236j24151Q4052K62291J22432q6035
16210B78115J4455k0416j32486m7713N5427K23029j36576j21727P1983N3704K9121
16199B66916K3705k09408m2466L8866Q4678R0145L7242l32598l09555J18650J82538
16188e1287k12761L8434L39918Q40j67350l1357K08832l08779K9129J35575Q8346
16177F9540j19004K2696K18524N0060k32277j00157j40437J20501K87948j17807
16167E9587j33036k20032M1507J19527J93445K88530p3500k20601p8928J4261
$$ plain form
16157 -9240 -28496 -11922 -160685 -173876 -230432 -172565 -208937 29784 93884 -140866 -377965
16146 -377965 -234842 -235593 -168964 -47620 82226 214138 340085 130235 -131888 124
16136 124 -2342 174932 298405 349684 78363 -61159 18833 -105475 -118288 -149652 38614
16125 38614 154930 342090 149476 -176672 -125172 -133257 -126524 -68042 -12011 57116 7959
16114 7959 31582 26421 95848 -97118 -310542 -148905 -68775 124231 210162 184247 197204
16103 197204 259352 108910 70137 55490 28772 -20866 -209181 -311383 -163563 -165614 -292348
16092 -292348 -252851 -367677 -536810 -445324 -309614 -105467 -188446 -166920 -92252 -20204 257850
16081 257850 86117 63638 -39245 -21617 -128757 16213 210799 136811 64552 -75747
$$ packed form
16157i240j9256J6574j48763j3191n6556N7867l6372K38721O4100k34750k37099
16146c77965J43123p51O6629J21344J29846J31912J25947k09850k62123J32012
16136A24k466J77274J23473N1279k71321j39522P9992j24308j2813l1364J88266
16125C8614J16316J87160j92614l26148N1500q085O733N8482N6031O9127m9157
16114G959K3623n161O9427j92966k13424J61637Q0130J93006Q5931k5915J2957
16103A97204O2148j50442l8773j4647k6718m9638j88315j02202J47820k051j26734
16092b92348L9497j14826j69133R1486J35710K04147q2979K1526P4668P2048K78054
16081B57850j71733k2479j02883J7628j07140J44970J94586p3988p2259j40299
$$ plain form
16071 -75747 -181068 -240344 -188737 685 119727 -147992 -226485 -198551 -26196 1592 12388
16060 12388 -99682 -108449 110834 6150 -167620 -138320 68107 55609 -149873 120187
16050 120187 271845 141736 76014 128573 178172 344608 123236 81003 135240 360746
16040 360746 176087 -1189 -14921 -130263 -168242 -36638 73126 397293 614494 682287
16030 682287 193803 -174148 10850 69565 -59194 119346 354108 331944 262701 222796
16020 222796 209382 155979 189322 -96421 -388109 -192275 -5366 319485 324876 196332
16010 196332 88380 -223077 -235811 -192406 -269973 -124339 -115712 -119102 242298 360574 276641
15999 276641 56898 82923 107714 58883 190524 262194 169059 47778 -91127 -82218 -222720
$$ packed form
16071g5747j05321n9276N1607J89422J19042k67719p8493K7934J72355K7788J0796
16060A2388j12070q767K19283j04684j73770K9300K06427j2498k05482K70060
16050A20187J51658j30109o5722N2559M9599J66436k21372m2233N4237K25506
16040C60746j84659j77276j3732j15342l7979J31604J09764L24167K17201O7793
16030F82287m88484l67951J84998N8715j28759J78540K34762k2164o9243l9905
16020B22796j3414n3403L3343k85743k91688J95834J86909L24851N391j28544
16010A96332j07952l11457j2734M3405p7567J45634Q627l390L61400J18276q3933
15999B76641k19743K6025K4791m8831J31641P1670r3135j21281j38905Q909j40502
$$ plain form
15988 -222720 -119285 1770 26673 80330 33134 17387 88934 73157 -117685 -126509 -50134
15977 -50134 -139316 -169588 -38000 58606 -3405 53608 246505 162453 95135 146744 141318
15966 141318 189913 249351 78746 -57326 88075 292805 382886 351340 123849 114277 367900
15955 367900 415909 163296 115736 129728 -62273 -53673 161344 84626 -168879 -211307 -49400
15944 -49400 247760 395347 105582 105160 -228233 -403884 -459521 -228541 -13253 -160895
15934 -160895 -246340 -193072 -136756 -142744 -27090 244612 470102 225007 103579 163555 297519
15923 297519 162674 63842 120750 -22797 -89183 -52183 -67590 -119274 -278508 -141071 -197913
15912 -197913 -250996 -321611 -445747 -476911 -335468 -353168 -604815 -829162 -605533 -467522
$$ packed form
15988b22720J03435J21055K4903N3657m7196j5747P1547j5777j90842q824P6375
15977e0134q9182l0272J31588R6606o2011N7013J92897q4052o7318N1609n426
15966A41318M8595N9438j70605j36072J45401K04730R0081l1546k27491r572K53623
15955C67900M8009k52613m7560J3992j92001Q600K15017p6718k53505m2428J61907
15944d9400K97160J47587k89765m22l33393j75651n5637K30980K15288j47642
15934a60895q5445N3268N6316n988J15654K71702K25490k45095j21428N9976J33964
15923B97519j34845r8832N6908j43547o6386L7000j5407n1684j59234J37437n6842
15912a97913n3083p0615j24136l1164J41443j7700k51647k24347K23629J38011
$$ plain form
15902 -467522 -336319 -211986 -272945 -215923 -152708 -216917 -348415 -296791 -306651 -400291 -123902
15891 -123902 101655 -52012 27330 87931 -3715 -100791 -159553 36913 106569 243576 128777
15880 128777 134322 18750 84052 125552 -69616 -49907 -113041 -194891 -337865 -205202 -141850
15869 -141850 -261430 -459990 -517393 -336030 -322253 -323539 -425763 -506642 -301877 116526
15859 116526 439591 284750 168743 273808 240933 81088 276519 400736 146980 -153677
15849 -153677 -226790 -151852 -131085 -250656 -257951 -128594 -122162 -43844 119859 232408 247244
15838 247244 174461 94756 164087 225848 155495 -41441 -48586 63336 161381 49743 -40188
15827 -40188 -142308 -23259 208965 65101 -6268 66318 122761 1473 -55245 36418 -55307
$$ packed form
15902d67522J31203J24333o0959N7022O3215o4209j31498N1624r860r3640K76389
15891a23902K25557j53667P9342O0601r1646r7076n8762J96466O9656J37007j14799
15880A28777N545j15572O5302M1500j95168J9709o3134q1850j42974J32663O3352
15869a41850j19580j98560n7403J81363J3777j286j02224q0879K04765M18403
15859A16526L23065j54841j16007J05065l2875j59845J95431J24217k53756l00657
15849a53677p3113P4938K0767j19571p295J29357O432P8318J63703J12549J4836
15838B47244p2783p9705O9331O1761p0353j96936p145J11922R8045j11638q9931
15827d0188j02120J19049K32224j43864p1369P2586N6443j21288n6718R1663r1725
$$ plain form
15816 -55307 -146416 -76729 140424 154702 73062 -274329 -469434 -368193 -137088 -119558 -5766
15805 -5766 -5627 -70223 37344 164059 211244 165517 140635 163163 76973 59230 257312 252911
15793 252911 69392 -156640 -300616 -195839 -254142 -213546 -384237 -317100 -171963 -143285
15783 -143285 -60720 -117767 -22760 95850 40777 -7202 65706 387836 474752 272858 208768
15772 208768 -219213 -193652 94354 244925 223412 152241 -43206 -59092 -250930 -202721
15762 -202721 20001 22581 -180415 -219902 -109088 -84456 -244868 -115206 88294 163740
15752 163740 106255 51348 126490 -50232 19053 34295 46449 -209167 -219382 105614 398015
15741 398015 317744 221061 376994 312872 274445 389164 295414 267470 382044 76329 -276403
$$ packed form
15816e5307r1109O9687K17153J4278q1640l47391j95105J01241K31105J7530J13792
15805e766J39o4596J07567J26715M7185m5727k4882K2528q6190j7743J98082m401
15793B52911j83519k26032j43976J04777n8303M0596j70691O7137J45137K8678
15783a43285Q2565n7047R5007J18610n5073m7979P2908L22130Q6916k01894o4090
15772B08768m27981K5561K88006J50571k1513p1171j95447j5886j91838M8209
15762b02721K22722K580k02996l9487J10814K4632j60412J29662K03500P5446
15752A63740n7485n4907P5142j76722O9285J5242J2154k55616j0215L24996K92401
15741C98015q0271r6683J55933o4122l8427J14719r3750k7944J14574l05715l52732
$$ plain form
15730 -276403 -49483 320642 179726 -60984 -72578 -176443 -29267 103337 134622 131482
15720 131482 -150525 -233681 -13129 65840 -184188 -255604 -291251 -151469 -120292 -142165 -32668
15709 -32668 107906 66 -104088 -169812 -9714 -67880 -372651 -248088 -236836 -145988
15699 -145988 -84218 -45677 37720 77332 -63489 -120528 -208040 -302757 -163569 -134298 -9685
15688 -9685 -137225 -250186 -252983 -4077 376614 214734 -23734 -140511 -71883 -177413
15678 -177413 -501359 -653170 -497355 -603532 -650918 -440128 -303002 -161563 32064 -39950
15668 -39950 -187402 -290967 -22850 -50308 -132316 -59989 -87526 -88094 -76994 -69673 -108957 -256776
15656 -256776 -377008 -379123 -114177 -81781 11502 -14330 49163 229935 268688 147214 189122
$$ packed form
15730b76403K26920L70125j40916k40710j1594j03865J47176J32604L1285l140
15720A31482k82007q3156K20552P8969k50028p1416l5647J39782L1177k1873J09497
15709c2668J40574j07840j04154o5724J60098n8166l04771J24563J1252R0848
15699a45988O1770L8541Q3397L9612j40821n7039q7512r4717J39188K9271J24613
15688i685j27540j12961k797K48906L80691j61880k38468j16777O8628j05530
15678a77413l23946j51811J55815j06177m7386K10790J37126J41439J93627p2014
15668c9950j47452j03565K68117k7458q2008P2327k7537n68J1100P321l9284j47819
15656b56776j20232k115K64946L2396R3283k5832O3493J80772L8753j21474M1908
$$ plain form
15645 189122 -17877 -5242 67094 63829 200805 238739 167270 -50816 -41647 72887 71515
15634 71515 86710 320224 293665 -108591 -5180 -176146 -260767 -201980 -172847 -180133 -367909
15623 -367909 -364898 -415757 -242788 -225367 -232111 -29419 31604 -192205 -297541 -310114 -330401
15612 -330401 -185871 -107029 10 -218355 -280774 -314056 -283918 -291893 -400445 -428448 -176531
15601 -176531 -48337 93282 12766 -294140 -303629 -260245 -148622 -141612 -287733 -267865 -52135
15590 -52135 259186 59120 -1072 178557 114861 75747 22667 -37213 54089 235865 236515
15579 236515 117762 51030 -320469 -361979 -172730 -62542 -5266 206965 312101 223261
15569 223261 209842 21772 -117622 -175432 -144853 143371 292685 77231 -66699 -113476
$$ packed form
15645A89122k06999J2635P2336l265J36976L7934p1469k18086R169J14534j372
15634G1515J5195K33514k6559m02256J03411j70966q4621N8787K9133p286j87776
15623c67909L011n0859J72969J7421o744K02692O1023k23809j05336j2573k0287
15612c30401J44530P8842J07039k18365o2419l3282L0138p975j08552k8003K51917
15601a76531J28194J41619q0516l06906r489M3384J11623P010j46121J9868K15730
15590e2135L11321k00066o0192J79629o3696l9114n3080n9880R1302J81776O50
15579B36515j18753o6732l71499m1510J89249J10188N7276K12231J05136q8840
15569B23261j3419j88070j39394n7810L0579K88224J49314k15454j43930m6777
$$ plain form
15559 -113476 -206171 -334211 -386606 -244704 -114221 -20600 -241673 -398982 -415072 -426434
15549 -426434 -377060 -99816 -85186 -70809 58437 163409 215154 -27574 -338331 -298967
15539 -298967 -224487 -339412 -249254 -289968 -472574 -555647 -407393 -177142 7443 -14349
15529 -14349 -79858 -32869 150543 114312 -33223 -72837 25744 106572 217005 -10104 -479959
15518 -479959 -447240 -410586 -396807 -107589 -57657 -166165 -16731 187189 71187 -86473
15508 -86473 -249772 -274187 -147138 -68610 768 -496841 -613012 -94242 -17272 25728 -71612
15497 -71612 -289875 -330334 44070 204214 184386 248499 196868 232031 346531 198452 24488
15486 24488 200103 82244 -208158 -142113 -114894 -127614 4204 -123320 -87603 -111965 -212232
$$ packed form
15559a13476r2695j28040n2395J41902J30483R3621k21073j57309j6090j1362
15549d26434M9374K77244J4630J4377J29246J04972N1745k42728l10757L9364
15539b98967P4480j14925R0158m0714j82606q3073J48254K30251J84585k1792
15529a4349o5509M6989J83412l6231j47535l9614R8581Q0828J10433k27109m69855
15518d79959L2719L6654J3779K89218M9932j08508J49434K03920j16002j57660
15508h6473j63299k4415J27049P8528O9378m97609j16171N18770P6970M3000r7340
15497g1612k18263m0459L74404J60144j9828O4113n1631L5163J14500j48079j73964
15486B4488J75615j17859k90402O6045K7219j2720J31818j27524L5717k4362j00267
$$ plain form
15475 -212232 -173234 -179151 -162097 -15302 -49358 2412 21787 -97856 -104726 -39478 91562
15464 91562 213937 116155 190463 365544 123418 351246 437418 160449 8194 3249 241738
15453 241738 220506 41784 -201368 -338293 -133528 105875 218562 38472 -93937 129649
15443 129649 486598 583642 470289 478385 496579 391017 389428 209136 15564 -123237 -199830
15432 -199830 83099 227022 94113 211544 219678 -61827 55737 56071 59428 36517 76182
15421 76182 71434 -67687 -173321 110900 164449 259781 158639 -13514 -103096 -227686 -212181
15410 -212181 -163735 -235688 -72635 113986 188165 33815 -4888 73448 -80166 -24656 231441
15399 231441 117985 -224829 -313049 -160399 113949 87361 -10144 25003 148071 108821
$$ packed form
15475b12232L8998n917J7054J46795l4056N1770J9375j19643o870O5248J31040
15464I1562J22375r7782P4308J75081k42126K27828Q6172k76969j52255m945K38489
15453B41738k1232j78722k43152j36925K04765K39403J12687j80090j32409K23586
15443A29649L56949R7044j13353Q096J8194j05562j589j80292j93572j38801p6593
15432a99830K82929J43923j32909J17431Q134k81505J17564L34L357k2911L9665
15421G6182m748j39121j05634K84221N3549R5332j01142j72153q9582j24590J5505
15410b12181M8446p1953J63053J86621P4179j54350l8703P8336j53614N5510K56097
15399B31441j13456l42814q8220J52650K74348k6588r7505L5147J23068l9250
$$ plain form
15389 108821 -153785 -280328 -349513 -292165 35314 -60438 -146144 29016 112518 5499
15379 5499 142725 206228 95350 -130959 -105952 79609 208083 298349 243498 7461 -90608
15368 -90608 -114824 -74103 14740 128982 180486 240343 216786 142795 -211150 -139639 143129
15357 143129 166196 284241 423955 254201 -40922 -227980 -379964 -478713 -592834 -619948
15347 -619948 -385851 -264200 -62476 -159127 -251199 -191414 -17733 97096 -7950 -228960
15337 -228960 -499863 -344733 -116872 -193065 -474339 -532529 -308828 -258798 -439469 -516493
15327 -516493 -379877 -178049 16621 156859 84739 78642 90203 134734 82436 -71236 145766
15316 145766 190311 256828 88380 157962 137232 146500 79374 8862 98880 -50864 -73541
$$ packed form
15389A08821k62606j26543o9185N7348L27479r5752q5706J75160Q3502j07019
15379E499J37226O3503j10878k26309K5007J85561J28474R0266n4851k36037r8069
15368i0608k4216M0721Q8843J14242N1504N9857k3557p3991l53945P1511K82768
15357A43129K3067J18045J39714j69754k95123j87058j51984r8749j14121k7114
15347f19948K34097J21651K01724r6651r2072N9785J73681J14829j05046k21010
15337b28960k70903J55130K27861p6193k81274n8190K23701N0030j80671p7024
15327e16493J36616K01828J94670J40238p2120o097J1561M4531n2298j53672K17002
15316A45766M4545O6517j68448O9582k0730R268o7126p0512R0018j49744k2677
$$ plain form
15305 -73541 -11425 65475 51706 83177 70015 235159 237236 269081 265981 227698 155660 271512
15293 271512 290475 77315 -41542 -38686 4196 91914 115971 -59087 -172296 80650 290904
15282 290904 262528 199142 161747 -106808 -278666 -349147 -339399 -269843 -278924 -158941 -137906
15271 -137906 -345440 -197472 -62394 -101600 -46765 -12796 -118814 -170637 -341404 -337198 -92324
15260 -92324 4334 65529 -58685 -87298 138581 46403 157947 131868 79474 -155286 -124038
15249 -124038 -13499 25890 -41288 -37853 51541 -141155 -470332 -311852 10655 316675
15239 316675 347598 85436 -160270 -124697 -129039 -23763 186168 290941 418149 399340
15229 399340 165795 122513 395679 359779 210438 106770 131164 144376 57408 -7062 -162777
$$ packed form
15305g3541O2116P6900j3769L1471j3162J65144K077L1845l100l8283p2038J15852
15293B71512J8963k13160j18857K856M2882Q7718K4057j75058j13209K52946K10254
15282B90904k8376o3386l7395k68555j71858p0481R748O9556r081J19983K1035
15271a37906k07534J47968J35078l9206N4835L3969j06018n1823j70767M206K44874
15260i2324R6658O1195j24214k8613K25879r2178J11544k6079n2394k34760L1248
15249a24038J10539L9389o7178L435Q9394j92696l29177J58480L22507L06020
15239C16675L0923k62162k45706L5573m342J05276K09931J04773J27208j8809
15229C99340k33545m3282K73166l5900j49341j03668K4394J3212q6968o4470j55715
$$ plain form
15218 -162777 -106891 -54614 -33199 30389 -70076 -233982 -191749 -140996 -185610 -110431 -92752
15207 -92752 -73077 280547 316357 191881 -79830 104823 153223 120778 160079 113690 7606
15196 7606 -12562 -148819 -211123 -131546 -56470 -117427 -288702 -280268 -287929 -279416 -376093 -290176
15184 -290176 -79293 221046 435539 194161 -30136 -202587 -30238 -29153 -101096 -168040
15174 -168040 -27073 117441 320751 280732 249851 362599 505496 618800 691788 569399
15164 569399 241847 52425 -30260 -59684 -48617 13606 -94225 -203625 -159150 -72858 -13984
15153 -13984 173592 -8528 -47515 96075 -116266 -70493 -57015 -6919 -16810 110661 94258
15142 94258 -48835 -229151 -75961 96251 -1372 63880 85856 -50729 -47037 -72159 -81257
$$ packed form
15218a62777N5886N2277K1415O3588j00465j63906M2233N0753m4614P5179J7679
15207i2752J9675L53624L5810j24476k71711J84653M8400l2445L9301m6389j06084
15196G606k0168j36257o2304P9577P5076o0957j71275Q434p661Q513r6677Q5917
15184b90176K10883L00339K14493k41378k24297j72451J72349J085p1943o6944
15174a68040J40967J44514K03310m0019l0881J12748J42897J13304P2988j22389
15164E69399l27552j89422q2685k9424J1067O2223j07831j09400M4475Q6292N8874
15153a3984J87576j82120l8987J43590k12341M5773J3478N0096r891J27471j6403
15142I4258j43093j80316J53190J72212r7623O5252K1976j36585L692k5122r098
$$ plain form
15131 -81257 -60323 -119937 -131008 -119768 -177379 -439401 -457230 -372175 -209690 118896 156458
15120 156458 212715 10518 33490 195704 241266 231237 67359 94673 71135 -54113 -50548
15109 -50548 -25656 -153886 71149 118361 59127 191998 155966 -54706 -77567 -192423 -63480
15098 -63480 -64119 10012 -116324 -341787 -381695 -380474 -354360 -294388 -205595 -170951 -150264 -135968
15086 -135968 -85468 -85891 -47042 -152384 -318039 -336024 -74323 -86587 14546 73717 -25790
15075 -25790 -151869 -140019 71549 149237 66684 -30989 147524 115479 3406 26865 193447
15064 193447 59062 -16399 74877 206369 252317 144032 -56773 -137946 -43271 112194
$$ packed form
15131h1257K0934n9614j1071J1240n7611k62022j7829Q5055J62485L28586L7562
15120A56458N6257k02197K2972J62214M5562j0029j63878K7314k3538j25248L565
15109e0548K4892j28230K25035M7212n9234J32871l6032k10672k2861j14856J28943
15098f3480o39P4131j26336k25463l9908J221K6114N9972Q8793L4644K0687J4296
15086a35968N0500m23L8849j05342j65655j7985K61701j2264J01133N9171r9507
15075b5790j26079J1850K11568P7688q2553r7673J78513l2045j12073K3459J66582
15064A93447j34385p5461R1276J31492M5948j08285k00805q1173R4675J55465
$$ [...]
##END NTUPLES=NMR SPECTRUM
##END=
