##TITLE=Analysis number 323332
Compound Code cc 14526
Book Reference 407/133
Project Code adrs
Chemist Name andyw
##JCAMPDX= 6.0         $$ Bruker NMR JCAMP-DX V2.0
##DATA TYPE= NMR SPECTRUM
##DATA CLASS= NTUPLES
##ORIGIN= Bruker BioSpin GmbH
##OWNER= nmr
$$ XWIN-NMR		Version 3.5
$$ Tue Oct 24 09:11:25 2006 GMT Daylight Time (UT+1h)  MAYBRIDGE\nmr@NMR_250MHZ
##.OBSERVE FREQUENCY= 250.131544655141
##.OBSERVE NUCLEUS= ^1H
##.ACQUISITION MODE= SIMULTANEOUS (DQD)
##.ACQUISITION SCHEME= undefined
##.AVERAGES= 16
##.DIGITISER RES= 18
##SPECTROMETER/DATA SYSTEM= dpx250
##.PULSE SEQUENCE= zg30
##.SOLVENT NAME= CDCl3
##.SHIFT REFERENCE= (INTERNAL, CDCl3, 0, 16.522)
##AUDIT TRAIL= $$ (NUMBER, WHEN, WHO, WHERE, WHAT)
$$ ##TITLE= Audit trail, XWIN-NMR		Version 3.5
$$ ##JCAMPDX= 5.01
$$ ##ORIGIN= Bruker BioSpin GmbH
$$ ##OWNER= nmr
$$ C:\u/data/dgb/nmr/ADRS/1130/pdata/1/auditp.txt
$$ ##AUDIT TRAIL=  $$ (NUMBER, WHEN, WHO, WHERE, WHAT)
(   1,<2006-10-24 09:10:56.86 +100>,<MAYBRIDGE\nmr>,<NMR_250MHZ>,
      <created by zg, POWCHK disabled, PULCHK disabled
       configuration hash MD5:
       49 4B E0 1D 92 C2 6B 37 9F E6 65 BC 52 41 86 1D
       data hash MD5: 64K
       57 57 CC 51 FF 8A 2D 76 5A D9 06 98 DF FD A4 3B>)
(   2,<2006-10-24 09:11:15.90 +100>,<MAYBRIDGE\nmr>,<NMR_250MHZ>,
      <Start of raw data processing
       ef LB = 0.3 FT_mod = 6 PKNL = 1 SI = 32K 
       data hash MD5: 32K
       93 D9 08 7F E2 61 02 F9 AC E7 EA 61 D0 F8 4A 36>)
(   3,<2006-10-24 09:11:18.43 +100>,<MAYBRIDGE\nmr>,<NMR_250MHZ>,
      <apk 
       data hash MD5: 32K
       78 17 4E 93 6C 3E 7B 31 9C 02 B3 54 45 88 9B 01>)
(   4,<2006-10-24 09:11:19.34 +100>,<MAYBRIDGE\nmr>,<NMR_250MHZ>,
      <abs ABSG = 5 
       data hash MD5: 32K
       98 CE CF 04 76 60 87 71 E7 BA FE F1 0C 5F 1F 12>)
$$ ##END=
$$ 
$$ hash MD5
$$ 48 8E D7 E9 7C CA 92 7E 37 6D 2E 7C 20 A6 4B BA
##$RELAX= 
##$RELAX= 
##$RELAX= 
##$RELAX= 
##$RELAX= 
##$RELAX= 
##$RELAX= 
$$ Bruker specific parameters
$$ --------------------------
##$DU= <C:\u>
##$EXPNO= 1130
##$NAME= <ADRS>
##$PROCNO= 1
##$TYPE= <nmr>
##$USER= <dgb>
##$AMP= (0..31)
100 100 100 100 100 100 100 100 100 100 100 100 100 100 100 100 100 100 
100 100 100 100 100 100 100 100 100 100 100 100 100 100 
##$AQSEQ= 0
##$AQ_mod= 3
##$AUNM= <au_zg>
##$AUTOPOS= <2 >
##$BF1= 250.13
##$BF2= 250.13
##$BF3= 250.13
##$BF4= 250.13
##$BF5= 500.13
##$BF6= 500.13
##$BF7= 500.13
##$BF8= 500.13
##$BYTORDA= 1
##$CFDGTYP= 0
##$CFRGTYP= 5
##$CHEMSTR= <none>
##$CNST= (0..31)
1 1 145 1 1 1 1 1 1 1 1 1 1 1 1 1 1 1 1 1 1 1 1 1 1 1 1 1 1 1 1 1 
##$CPDPRG= <>
##$CPDPRG1= <>
##$CPDPRG2= <>
##$CPDPRG3= <>
##$CPDPRG4= <mlev>
##$CPDPRG5= <mlev>
##$CPDPRG6= <mlev>
##$CPDPRG7= <mlev>
##$CPDPRG8= <mlev>
##$CPDPRGB= <>
##$CPDPRGT= <>
##$D= (0..31)
0 1 0 0 0 0 0 0 0 0.06 0 0 0 0 0 0 0.0002 0 0 0 0 0 0 0 0 0 0 0 0 0 0 
0 
##$DATE= 1161677455
##$DBL= (0..7)
120 120 120 120 120 120 120 120 
##$DBP= (0..7)
150 150 150 150 150 150 150 150 
##$DBP07= 0
##$DBPNAM0= <>
##$DBPNAM1= <>
$$ [...]
##$SUBNAM7= <"">
##$SUBNAM8= <"">
##$SUBNAM9= <"">
##$SW= 20.6930455092707
##$SWIBOX= (0..15)
0 0 3 0 0 0 0 0 0 0 0 0 0 0 0 0 
##$SW_h= 5175.983436853
##$TD= 65536
##$TD0= 1
##$TE= 683.16
##$TE2= 300
##$TE3= 300
##$TEG= 300
##$TL= (0..7)
0 120 120 120 120 120 120 120 
##$TP= (0..7)
150 150 150 150 150 150 150 150 
##$TP07= 0
##$TPNAME0= <>
##$TPNAME1= <>
##$TPNAME2= <>
##$TPNAME3= <>
##$TPNAME4= <>
##$TPNAME5= <>
##$TPNAME6= <>
##$TPNAME7= <>
##$TPOAL= (0..7)
0.5 0.5 0.5 0.5 0.5 0.5 0.5 0.5 
##$TPOFFS= (0..7)
0 0 0 0 0 0 0 0 
##$TUNHIN= 0
##$TUNHOUT= 0
##$TUNXOUT= 0
##$USERA1= <user>
##$USERA2= <user>
##$USERA3= <user>
##$USERA4= <user>
##$USERA5= <user>
##$V9= 5
##$VALIST= <valist>
##$VCLIST= <CCCCCCCCCCCCCCC>
##$VD= 0
##$VDLIST= <DDDDDDDDDDDDDDD>
##$VPLIST= <PPPPPPPPPPPPPPP>
##$VTLIST= <TTTTTTTTTTTTTTT>
##$WBST= 1024
##$WBSW= 4
##$XGAIN= (0..3)
0 0 0 0 
##$XL= 0
##$YL= 0
##$YMAX_a= 469546
##$YMIN_a= -341825
##$ZGOPTNS= <>
##$ZL1= 120
##$ZL2= 120
##$ZL3= 120
##$ZL4= 120
##$ABSF1= 16.522
##$ABSF2= -4.171173
##$ABSG= 5
##$ABSL= 3
##$ALPHA= 0
##$AQORDER= 0
##$ASSFAC= 0
##$ASSFACI= 0
##$ASSFACX= 0
##$ASSWID= 0
##$AUNMP= <proc_1d>
##$AZFE= 0.1
##$AZFW= 0.1
##$BCFW= 0
##$BC_mod= 0
##$BYTORDP= 0
##$COROFFS= 0
##$CY= 12.5
##$DATMOD= 1
##$DC= 0
##$DFILT= <>
##$DTYPP= 0
##$F1P= 14.0000005364418
##$F2P= -0.99999901652339
##$FCOR= 0.5
##$FTSIZE= 32768
##$FT_mod= 6
##$GAMMA= 0
##$GB= 0
##$INTBC= 1
##$INTSCL= 1
##$ISEN= 128
##$LB= 0.3
##$LEV0= 0
##$LPBIN= 0
##$MAXI= 10000
##$MC2= 0
##$MEAN= 0
##$ME_mod= 0
##$MI= 0
##$NCOEF= 0
##$NC_proc= -4
##$NLEV= 6
##$NOISF1= 0
##$NOISF2= 0
##$NSP= 0
##$NTH_PI= 0
##$NZP= 0
##$OFFSET= 16.522
##$PC= 1
##$PHC0= -47.36168
##$PHC1= 18.87543
##$PH_mod= 1
##$PKNL= yes
##$PPARMOD= 0
##$PSCAL= 4
##$PSIGN= 0
##$REVERSE= no
##$SF= 250.13
##$SI= 32768
##$SIGF1= 0
##$SIGF2= 0
##$SINO= 400
##$SIOLD= 32768
##$SREGLST= <1H.CDCl3>
##$SSB= 0
##$STSI= 32768
##$STSR= 0
##$SW_p= 5175.98343685301
##$SYMM= 0
##$S_DEV= 0
##$TDeff= 65536
##$TDoff= 0
##$TI= <Analysis number 999999
Compound Code 99
Book Reference 9
Project Code 9>
##$TILT= no
##$TM1= 0
##$TM2= 0
##$TOPLEV= 0
##$USERP1= <user>
##$USERP2= <user>
##$USERP3= <user>
##$USERP4= <user>
##$USERP5= <user>
##$WDW= 1
##$XDIM= 32768
##$YMAX_p= 326842684
##$YMIN_p= -1044716
$$ End of Bruker specific parameters
$$ ---------------------------------
##NTUPLES= NMR SPECTRUM
##VAR_NAME=  FREQUENCY,     SPECTRUM/REAL,   SPECTRUM/IMAG
##SYMBOL=    X,             R,               I
##VAR_TYPE=  INDEPENDENT,   DEPENDENT,       DEPENDENT
##VAR_FORM=  AFFN,          ASDF,            ASDF
##VAR_DIM=   32768,         32768,           32768
##UNITS=     HZ,            ARBITRARY UNITS, ARBITRARY UNITS
##FACTOR=    0.157963299565203, 1,           1
##FIRST=     4132.6476996994, 0,             0
##LAST=      -1043.33573715361, 0,           0
##MIN=       -1043.33573715361, -1044716,    0
##MAX=       4132.6476996994, 326842684,     0
$$ Real data points
##PAGE= N=1
##DATA TABLE= (X++(R..R)), XYDATA
$$ [...]
23593g9633j24512P881K27971K34225J74109j31258j14735k58649J58476O0290
23583A54165K05369j37433J2786j56228l02720n6773J15940K61443j21357o275
23573c1083J7932k4236k3061J30519L10370j70334k99707O2306J71885r2981m9094
23562B516J17698L8467J02530Q9046K61548j65034l41562l347j0684J41608j57479
23551G5307j26675l7897J17158J09327k1720r3663J27230J07107O6971K9797K0157
23540C73099j92060k27498r4615j27496O9237M6387j04260Q8454K87196K62484
23530C80928j65089p9914p8994J63477k6391R712j33034J04413K41896l524r7877
23519C15603L820O2580p1904k74564p0858M69958K51283j87557l572j48051k82591
$$ y = [-79633, -204145, -196264, 31707, 265932, 440041, 308783, 194048, -64601, 93875, 154165, 359534, 222101, 234887, 78659, -224061, -280834, -164894, 96549, -24808, -31083, -13151, -37387, -60448, 70071, 380441, 210107, -89600, -27294, 144591, 51610, 2516, 120214, 158681, 261211, 350257, 611805, 446771, 105209, 101862, 91178, 232786, 75307, -51368, -89265, 27893, 137220, 115500, 21837, 149067, 256174, 323145, 352942, 373099, 181039, -46459, -141074, -268570, -199333, -152946, -257206, -168752, 118444, 380928, 215839, 135925, 56931, 220408, 194017, 203729, 70695, 175108, 417004, 413480, 315603, 319423, 382003, 310099, 35535, -35323, 434635, 685918, 498361, 494789, 346738, 64147]
23508F4147J22579k75184r2684j98296l4677l3984R4834J66758K37788K07948
23498B59229j74566m0484M9748l05596m0965K56749k409j94578J21695l3887O138
23487i8926K19855n6119o493n4214K52087Q5877k48347k37595l1927o6034k8522
23476b70358K64125k05046M5815Q6015K24428k03069r1741m1691L3862l739J13832
23465d7567J31624K9788R0077M2980j25696Q9924K9590p8192R0150j14442l13016
23454a74780j74655Q0637j52826N860K12872K10603m4711m2169J01881J26116
23444A48828r5969l36366k29514R419K4716J36751K86967J51505O5988J48198
23434C10523Q7124r5684j73643Q1184J63341k51996j6652K00633O6188J97674
$$ y = [64147, 186726, -88458, -181142, -379438, -414115, -448099, -353265, -186507, 51281, 259229, 84663, 44179, 93927, -211669, -252634, 4115, 1706, -192872, -71177, -105064, -98926, 120929, 64810, 58317, 4103, 256190, 342067, 93720, -143875, -175802, -241836, -270358, -6233, -211279, -165464, -79449, 144979, -58090, -149831, -191522, -157660, -161399, -47567, 84057, 113845, 203922, 246902, 121206, 211130, 240720, 162528, 252678, 138236, -174780, -349435, -268798, -421624, -415764, -202892, 7711, -37000, -79169, 22712, 148828, 52859, -283507, -513021, -503602, -478886, -342135, -55168, 96337, 162325, 310523, 397647, 301963, 128320, 209504, 372845, 120849, 104197, 304830, 371018, 568692]
23424E68692m2281j72773r938M1033k12090k14218j99687m2646k16391K59358
23414b40941J42224J17846P9196r5528m1678K79418R6615n3285k10463k01403
23404a27999k4236r7009K02739J72085k40987k74131q5798k8503J54331L36128
23394a3380j61423r8108K3343j5630J8648R2722m8690J98886Q4716O2180j19678
23383B3586j8037O8337m810l50322J65773K34736k2945j49685J18564j84082j28409
23372b47294P045l21226O7702L77824K38650J06988K7662j76496n8381j17920
23362i5446K7309L69135p6572k23098k27448m7327M552j90342k0428Q9847J38194
23351b51624J36122n6769p7571R8585K04060O5735q0668k4669L4381Q1112K93551
$$ y = [568692, 526411, 353638, 343700, 384733, 172643, -41575, -241262, -283908, -500299, -240941, -98717, 19129, 98325, 2797, -38881, 240537, 337152, 283867, 73404, -127999, -152235, -249244, -46505, 125580, -115407, -389538, -475336, -503839, -349508, -13380, -174803, -272911, -249568, -265198, -246550, -153828, -202518, -3632, 81084, 143264, 23586, 5549, 73886, 69076, -281246, -115473, 119263, 96318, -53367, 65197, -118885, -247294, -240249, -561475, -493773, -115949, 122701, 229689, 257351, 80855, 22474, -95446, -68137, 300998, 224426, 1328, -226120, -273447, -268895, -459237, -479665, -389818, -251624, -115502, -172271, -249842, -151257, 52803, 118538, 37870, 13201, 47582, 128694, 422245]
23340D22245k44618l08858k583K7154L7516k09113k00520N1885K722N2375K49349
23329a22446J39886j39683J27951o9508j58823R8195j80014J11832J62872J41771
23319A12033q4450q506O96p0739j26315J77214J27274L05898j9613j74404K6637
23308B65725l4405q4232r0110Q7411J06884k39334r5596R9468j84419J33939l2688
23297f7357j98982K53067J92019J42387j07305k02051N6973L12287J02821K3912
23287E07771j95452l63728r3489J27342N2858J0152k23792J33622M36285R458
23277D01027m05301P5000L26056j4287q1991n7824L45988k16493l02312o9820
23267D3j2147j4582M7718L16159P5726j76089l47150j59386j2551J44767k5385
$$ y = [422245, 177627, -131231, -133814, -106660, -69144, -278257, -478777, -426892, -424170, -371795, -122446, 17440, -122243, 5708, -63800, -222623, -124428, -304442, -192610, -29738, 112033, 27583, 19077, 19773, -50966, -177281, -67, 127207, 433105, 413492, 239088, 265725, 231320, 147088, 56978, 144389, 251273, 11939, -83657, 15811, -168608, -34669, -67357, -266339, -13272, 178747, 321134, 213829, 11778, 68751, 381038, 483859, 507771, 312319, -51409, -144898, -17556, 35302, 45454, -178338, -44716, 391569, 401027, -4274, 70726, 396782, 382495, 300504, 242680, 588668, 372175, 69863, 43, -12104, -26686, 21032, 337191, 412917, 236828, -110322, -269708, -282259, -137492, -162877]
23256a62877l01716m6682M7443M52773K20022n4115o4666P6168j00986m3692P0375
23245I2047k5276N2498n8612j535K50126J25238j03555K2649k89473p9158J20886
23234A05835O6138j64736j95742M8077M2430j57404K65385P3486j2411r2951N7741
23223C5848J17479N7441Q8254J2673k83499j93994Q4334J30823o6147J08847J84112
23212B76171j69764l19794l30720K8813l7646J72080L42169J73846N4881j37052
23202E2984k26148j80490j36354j77720J17755L73065n9509r9429K92873L28521
23192B85548q3177K7177j02671q5073l32688k42591K24929L40421k11039k07045
23182c86209K73817m3198j46810j10280J72574J9471J2599l1713J59734j93261
$$ y = [-162877, -464593, -511275, -463832, -11059, 208963, 154848, 90182, 166350, 65364, 21672, 92047, 66771, 119269, 60657, 59122, 309248, 434486, 330931, 353580, 64107, -15051, 105835, 171973, 7237, -188505, -140428, -97998, -255402, 9983, 83469, 71058, -21893, 35848, 153327, 210768, 299022, 311695, 28196, -165798, -81464, 49359, -16788, 92059, 276171, 106407, -213387, -544107, -515294, -552940, -380860, -38691, 135155, 190036, 52984, -173164, -353654, -490008, -667728, -549973, -176908, -236417, -335846, -42973, 285548, 202371, 229548, 126877, 41804, -290884, -533475, -308546, 31875, -179164, -386209, -112392, -155590, -302400, -412680, -240106, -220635, -208036, -239749, -80015, -273276]
23172b73276p9874N5021O1740K18282j19534o7633J55904J01991j39801l06252
23162c93432j94256j18430K38372M50899J10441l3915o8702k81336k12702N379
23152d97682J58466p6732j66431K63976L67493M01814K4679k37012l90340j29214
23142b80983J63182K29401q1851j52238r4036J14984Q6964J89595J74101q3550
23132B65569j26619k82364Q7534K9923k2327o7179j54696p7466q1648j26483K71460
23121b84296L500p7972J11921j05057j31951O4648J39694J43205J23305L9847
23111B6844O948K57311n8251l70268r2348L41666J65598k28489j26095k52446
23101c29530j30313J24016J07161l3193Q3804l11J3421j97128K35317J82252R9003
$$ y = [-273276, -353150, -298129, -236389, -18107, -137641, -205274, -49370, 52621, -87180, -393432, -587688, -706118, -467746, -16847, 93594, 59679, -9023, -290359, -503061, -497682, -339216, -415948, -582379, -318403, 49090, 450904, 475583, 238571, -151769, -280983, -117801, 111600, 29749, -122489, -216525, -101541, -14577, 175018, 349119, 265569, 138950, -143414, -55880, -25957, -48284, -115463, -270159, -347625, -429273, -555756, -284296, -280796, -358768, -246847, -351904, -483855, -419207, -279513, -136308, -13003, 26844, 33792, 291103, 232852, -137416, -229764, 111902, 277500, 49011, -77084, -329530, -459843, -335827, -228666, -261859, -178055, -178366, -164945, -362073, -126756, 55496, 154499]
23090A54499k63303j89024L20471J48501R6696M4670J4926l49647K12651K20014
23080D10454k87782j70951K13311n387k48739r8608J7329L78173J90725l57625
23070D0900j81747j2535K2606K8758j4173j35653k598K25808J82221l14199j35973
23059b96585J41687O8761m8252J41639J42461J25552Q403j48809p8317j41291
23049h4751J9967l5276k87825l0296R0356l33636K7531K59206M3879K59421r1496
23038a62920j74834j942O4424q098L50850K17380n5957k54232K35577o1900j6722
23027A31626j26482j43187l04111l260r464k1635K3799K21420J03133j68919K0323
23016b76757J18660l3197J56803J50779k69894l73645R0659q2281j96062j97289
$$ y = [154499, -108804, -297828, 22643, 171144, 267840, 312510, 327436, -22211, 190440, 410454, 122672, -48279, 165032, 159645, -89094, -187702, -170373, 207800, 398525, 40900, -140847, -153382, -130776, -102018, -116191, -251844, -254442, -28634, 153587, -160612, -296585, -154898, -86137, -134389, 7250, 149711, 275263, 283666, 134857, 56540, -84751, -64784, -100060, -387885, -418181, -327825, -661461, -633930, -374724, -330845, -71424, -162920, -337754, -339696, -275272, -283370, 67480, 284860, 228903, -25329, 210248, 148348, 131626, 5144, -138043, -442154, -445414, -454878, -476513, -452714, -231294, -128161, -297080, -276757, -158097, -191294, -34491, 116288, -153606, -527251, -436592, -518873, -714935, -912224]
23006i12224P7395L36866K82284j8245o1864l0666J87931K4508j31541K19881
22996b5675r9218M1668J08150q6666q6085j47382L11473K47614L7236K88872q776
22985E81211j89273l06211k12072n3511m6131p6278q0301J95121L65356O1527
22975B39438o3113M0472j15188k58339r5629j0525J83541J96577j91502M1141
22965c3127L4245j55268n981J67444q71j20418q0601J33816p1290N4933R5049
22954A7931K59438L49890j55185j14010r3662k0333J6738Q7244k15132j84277
22944e1358R1747N0872j22728J32578M7620l41258L9946k7389J69905K23605J47482
22933C61022L90473k73149l64812q9583j09228M0042K40416j41050j81549J03809
$$ y = [-912224, -834829, -497963, -215679, -233924, -295788, -326454, -138523, -114015, -245556, -25675, -124893, -83225, 24925, -61741, -147826, -295208, 16265, 263879, 301115, 589987, 581211, 391938, 85727, -126345, -179856, -225987, -302265, -382566, -187445, 177911, 239438, 176325, 216797, 101609, -156730, -252359, -262884, -79343, 117234, -74268, -33127, 1118, -154150, -160131, 7313, 6442, -113976, -194577, -60761, -132051, -77118, 17931, 277369, 627259, 472074, 358064, 264402, 244069, 260807, 348051, 132919, -51358, 40389, 91261, -31467, 101111, 148731, -192527, -152581, -179970, -10065, 213540, 361022, 751495, 478346, 113534, 23951, -85277, -45235, 195181, 54131, -127418, -23609]
22923b3609j55730l8040j15461K0777K4416K49231J8218J12249K63011K58202
22913F13264j1837j41823j45260k80525R9112n695k18805K23525J903l61036O1845
22902a65332J63206j40906j75072K4150m6829J31190J53862J70225j01458l5466
22892b2430R5271K8397j91428J66850K5595j67273J40324K53242K23476k7368
22882E24656l03283r6127j4811M00704L23K7663M1638j21881l7034k10323j34350
22871G7175J27425n1750K2455O1721L94797j10340l30352j58816j86683k32341
22861c86709m3028K06018J36425j03265m5017P3098J60751Q7478L4184L8582J88612
22850C47129O8323j57753l14874J16230M989j77492K0004J3815N4840J30064L0584
$$ y = [-23609, -179339, -217379, -332840, -312063, -287647, -38416, -20198, 92051, 355062, 613264, 601427, 459604, 314344, 33819, 132931, 127236, -91569, 131956, 133859, -227177, -165332, -2126, -143032, -318104, -293954, -340783, -209593, -55731, 114494, 13036, -22430, 72841, 101238, -90190, 76660, 102255, -65018, 75306, 328548, 552024, 524656, 221373, 125246, 110435, 511139, 511462, 539125, 580763, 458882, 421848, 211525, 77175, 204600, 152850, 175305, 237026, 631823, 521483, 191131, 32315, -154368, -386709, -429737, -223719, -87294, -190559, -235576, -162478, -1727, 85751, 119935, 158517, 347129, 415452, 257699, -57175, 59055, 64044, -113448, -93444, -79629, -24789, 105275, 135859]
22839A35859k30685Q0608m7114n6886J90773k32156k71718L60510M91677k6021
22829C94847J53274j36518k14532L2888j90942k22542L4731J37544o3440n2873
22819a27563P0136k46416j81582J27412j65976j93284L52459L39062m3948j81684
22809b51384L1777J4406M66827L37646k98530R026j34756J77941K0718q3698o302
22798B83671j79515K14740J70638q6632J68501J18080j49873k30387l78885k6789
22788i6451n2221K9913J23269K41951o960m62385k42102r8299J69234L3768L29398
22777c0885K79173j51584k51517N1047k8732K9004m6217P9202L2667J8876K97881
22766B78915O3967j24701J48883O7180m21903k27407p0087K04364J95776P5301
$$ y = [135859, -94826, -14218, -61332, -118218, 72555, -159601, -431319, -70809, 420868, 394847, 548121, 411603, 197071, 229959, 39017, -183525, -148794, -11250, -74690, -127563, -57427, -303843, -485425, -358013, -523989, -717273, -364814, -25752, -69700, -251384, -219607, -205201, 261626, 599272, 300742, 309768, 175012, 352953, 373671, 289973, 283671, 104156, 318896, 489534, 402902, 571403, 689483, 539610, 309223, -69662, -96451, -148672, -118759, 4510, 246461, 239501, -222884, -464986, -563285, -394051, -360283, -30885, 248288, 96704, -154813, -103766, -132498, -103494, -149711, -70509, -37842, -18966, 278915, 342882, 218181, 367064, 434244, 12341, -215066, -285153, -80789, 114987, 190288]
22756A90288j73844p8201K0691p4381j13063l99467P5574L76763n9410k3669J44220
22745a14499K40596j9651j04792k68600Q9648n4944o6228j77037J32825K39575
22735a03107J11481m240J78975M6710Q6834k30894k94508r1759m1761R4456n2429
22724c00242J39216L10743K5234j17132n6237j35041k25008m0513L43295J28724
22714G3039j15063R5509K10189P8457p3125l31612l19962K3100L3366J59084K23666
22703E6648K91352j79209l62826j14370Q6033J43334j11202J22278K71935k7790
22693A76183M4145J95355K1845j71070J70552k66264k52629J49184N968n6681
22683A6588O2883L2603j66602j57154j18180p9949J41690o67K83152k32411p6424
$$ y = [190288, 16444, -61757, -41066, -115447, -228510, -627977, -552403, -175640, -235050, -258719, -114499, 126097, 106446, 1654, -266946, -177298, -232242, -298470, -475507, -342682, -103107, 8374, 4134, 183109, 229819, 316653, 85759, -208749, -300508, -342269, -247813, -300242, -161026, 149717, 174951, 57819, 1582, -133459, -358467, -398980, -55685, 73039, -42024, 53485, 263674, 342131, 269006, -62606, -382568, -359468, -326102, -167018, 56648, 348000, 168791, -194035, -308405, -222372, -79038, -190240, -67962, 203973, 176183, 220328, 415683, 437528, 266458, 437010, 170746, -81883, 67301, 73269, 16588, 79471, 112074, -54528, -211682, -329862, -409811, -268121, -268788, 14364, -218047, -294471]
22672b94471J42236j9474j56340k2815K2678j48249L8015J9989M2963J78089K0061
22661a77318P5970K88034K57602M5898k60590o598k4244J62066P7990l24866k31674
22650a17730r2631K31574J26894K9567k75678o9988K31324m2472n2877P4968L2715
22639G5666O7176J94498k29161q7705P6916o5202k42394p6482K19176J59269r6451
22628d694l8159N1158p9623j97008k4531R2490J28214K9993j36624j50466J74895
22617a54355N6526J07962L63612q2774j01882K5739k34971K3909J0418L6358J6177
22606F6719Q2855K81169p8725l55816j64185L11567L27447N0622L1494l14076
22596B39071l56391j19212k10639n577L05281o1087k21996R497L26869K87279
$$ y = [-294471, -152235, -171709, -328049, -350864, -328186, -476435, -438420, -418431, -375468, -197379, -177318, -101348, 186686, 444288, 490186, 229596, 222998, 198754, 360820, 438810, 113944, -117730, -210361, 21213, 148107, 177674, -98004, -167992, 63332, 20860, -32017, 42951, 75666, 142842, 337340, 108179, 20474, 97390, 32188, -210206, -286688, -67512, 91757, -4694, -42853, 8305, -71318, -268326, -292857, -200367, -72153, -42160, -178784, -329250, -154355, -97829, 10133, 373745, 290971, 189089, 214828, -20143, 3766, 14184, 50542, 66719, 149574, 430743, 352018, -3798, -167983, 143584, 471031, 521653, 553147, 239071, -117320, -236532, -447171, -452748, -147467, -208554, -430550, -421053, -94184, 193095]
22586A93095M9528k07529K09094K30618j63333j39745j77206k9727q7046J18210
22576d041j50700j13723M7242J49680K83569K48990j67471j59997l69013k82806
22566e18270O7306J79607n7133l71589J84013Q2200J68447M3356m5795K04897
22556f2961n304M4887j60898q2899m7897r5729L79990J23360l60205J07493o7385
22545b27548P2995J02476k28164r755r8959p4391J09170J6525j11781K5670L8973
22534c84789L911K35431K53493L39961k00299l12967M6187j68265K03887j5338
22524A212j11981q0927j05807l476L11535N2548K0878k17839k20194P5350J01694
22513a77007r4011o7050p340K60958J18573K48330Q7078p6041l5222j96726Q8672
$$ y = [193095, 242623, 35094, 244188, 474806, 311473, 171728, -5478, -35205, -122251, -4041, -154741, -268464, -221222, -71542, 212027, 461017, 293546, 133549, -235464, -518270, -450964, -271357, -328490, -700079, -516066, -433866, -265419, -222063, -267858, -62961, -68265, -23378, -184276, -267175, -315072, -410801, -30811, 92549, -267656, -160163, -227548, -154553, -52077, -280241, -289996, -388955, -463346, -354176, -337651, -449432, -423762, -384789, -380878, -145447, 108046, 448007, 247708, -65259, -19072, -187337, 16550, 1212, -110769, -191696, -297503, -300979, 10556, 63104, 83982, -133857, -354051, -278701, -177007, -271018, -338068, -345408, -84450, 34123, 282453, 369531, 293490, 258268, 61542, 150214]
22502A50214M183k65389N765j18624J34550J39444j46082Q0735j10211J79701
22492E4286J81981q9564M0556j84310j63443l00685p2412J89484R1445j89624
22482d42286K22270L6991l0317p3169K46166M11391k60301l67122P6881j08633
22472b88129K85982J07848j99471k00714J05114J09087j15677o1943P0899n8363
22462b45367j44870J53662J39774M9470j67916l33j9463j10477m8483K93342J48767
22451D8106J7884J41443n8900m25027l4068K23391n9548J55645J03954l402P1264
22440A80742j0229l6322j25577J05839n4416k11356j77318J18428K37444k27883
22430b00648j81520M98897L1158M5217j24333j20667N2468K6470J8786k0745l8574
$$ y = [150214, 154397, -110992, -105227, -223851, -89301, 50143, -95939, -15204, -125415, 54286, 236267, 146703, 187259, 2949, -160494, -461179, -533591, -344107, -252662, -442286, -220016, -183025, -213342, -286511, -40345, 371046, 110745, -256377, -179496, -288129, -2147, 105701, -93770, -294484, -189370, -80283, -195960, -257903, -187004, -245367, -390237, -236575, -96801, -47331, -215247, -215580, -235043, -345520, -394003, -100661, 48106, 65990, 207433, 148533, -276494, -310562, -87171, -146719, 8926, 112880, 109478, 180742, 170513, 134191, 8614, 114453, 60037, -151319, -328637, -210209, 27235, -200648, -382168, 116729, 147887, 193104, 68771, -51896, 572, 27042, 45828, 25083, -13491]
22419a3491M5913j37013K7294O3709P168j81893J16405o6460j83604L2431k00570
22408d90111L06141K17938L6013j10185j97192Q9443j0250k01998n6756K07876
22398b09081J12614K47241J52343j25960j41916j06832q114K11738L3933k9926
22388A36040l41087J14049j10291N2367r2937r320o4043j22791O8134o1783O2253
22377c69409k5208j36207o549K26649J41358p4230O5001K1620K34875M4470r8235
22366B4135k11737J39153L0344K04506j85959p9782o0415K10816M8894k9696o1450
22355B8809j3925O7192j14539o9556K8912J29753l12195j11606l1792J63234j95206
22344d30919j09990M5128J44966O2553m46K06300J95170k40363k54652k49560
$$ y = [-13491, 32422, -104591, -77297, -13588, -6420, -188313, -71908, -138368, -321972, -289541, -490111, -183970, 33968, 69981, -40204, -237396, -147953, -158203, -360201, -416957, -209081, -96467, 150774, 303117, 177157, 35241, -71591, -79705, 132033, 165966, 136040, -205047, -90998, -201289, -148922, -241859, -251179, -315222, -438013, -369879, -431662, -369409, -394617, -530824, -537373, -310724, -169366, -243596, -178595, -156975, 77900, 122370, 24135, -187602, -48449, -18105, 186401, 442, -79340, -139755, 71061, 119955, 90259, 28809, 14884, 82076, -32463, -102019, -73107, 56646, -255549, -367155, -398947, -235713, -430919, -540909, -495781, -350815, -288262, -288708, -82408, 112762, -127601, -382253, -631813]
22334f31813Q6129L35961l8280j12027j27565J34349k3239j09181L06078J47859
22324c1729R6195j54657j44667R5023L98994N2755k083J23912k95165l50449n4333
22313b66204J98034P4655l1569Q1134r5376L5246k08075L00877J89939j63329
22303A15332J08546P579j20383m0424J22842J76693j45305m05348k05087Q0319
22293c05236r6651L66998J41299q4125K3711J8386J00877j6278O0943k7328j73262
22282I334m3881o3975J44840P5154r9722J76800l0663J2840k95374j90365J04126
22271b00886J74981J40817K37389q433K4754j171k67119l27865J80314M7719K9479
22260B9979l28647m880L02438L01412k33159l40678q4654j0613j5140l46498n6289
$$ y = [-631813, -545684, -209723, -248003, -360030, -487595, -353246, -376485, -485666, -179588, -31729, 64466, -90191, -234858, -139835, 259159, 311914, 309831, 433743, 138578, -211871, -266204, -68170, 6485, -25084, 56050, -39326, -4080, -212155, 88722, 278661, 115332, 223878, 231457, 111074, 70650, 193492, 370185, 224880, -180468, -385555, -305236, -401887, -34889, 106410, 22285, 45996, 64382, 165259, 148981, 209924, 182596, 9334, -34547, -98522, 46318, 121472, 21750, 198550, 167887, 180727, -114647, -305012, -200886, -25905, 114912, 352301, 343868, 368622, 367451, 100332, -227533, -47219, 500, 29979, -298668, -303548, -1110, 300302, 67143, -273535, -358189, -368802, -383942, -730440, -786729]
22249g86729L06890K37841M1950k33883J56430R6705Q7364O6647J08517L16985
22239C98717L66278j11549l90368m88161j4985J14504Q5302j37545k48382q1844
22229e08033M17909N25899K58752k61936l44192j53693n400M4816P1220R048P5425
22218A29815J189m09682L6845J38790p2637O4669k3428N5528L80394L0330j17172
22207B14641k27337k31519O6370K12274P2676J70279r8608l70250j21589J08644
22197b04419J05369L5840L692R2689J48505j00430j958p705K79479k4305j54157
22186A72600k29244k93391J8365R3591L4874m8465R1787J84791L07645K09924
22176E42477q5296q3859j15823j27144M8941K96276j01782j69577Q7478L1126
$$ y = [-786729, -479839, -241998, -200048, -433931, -277501, -180796, -93432, -26785, 81732, 398717, 764995, 653446, 263078, -225083, -240068, -125564, -40262, -177807, -426189, -508033, -90124, 435775, 694527, 432591, 88399, -65294, -70694, -25878, 45342, 54390, 129815, 131004, -278678, -241833, -103043, -175680, -111011, -134439, -78911, 301483, 331813, 214641, -12696, -244215, -177845, 34429, 107105, 277384, 178776, -191474, -313063, -204419, -99050, -63210, -59518, 33171, 181676, 81246, 79288, 71583, 351062, 326757, 172600, -56644, -350035, -331670, -238079, -203205, -251670, -159883, 24908, 332553, 542477, 457181, 373322, 257499, 130355, 179296, 475572, 373790, 204213, 291691, 322817]
22166C22817m27246k37715L57806K69152r760j67289j23629k54750N1422J47685
22156g1507n2202Q9168j9299J29997N6237k66020l39107K689K48725J12284k8376
22145a37411J83535j30177K03960R1723j95637j62342K25273J37618j40551L6311
22135A12302j38228p174j00217l06433K01269k8845J81674r8799j44644J13643
22125b15452J84912M5247k22454j15213N5576J59646M28742J87486j07704p5533
22115C25253J53608j5279j33440r7342p5274k839l19730J21390l3742k50693P9727
22104b48361K08226L270p1501J23237N7787j30227J92219P5073J1320k71668l2449
22093h3074m6070p8182Q4188O1901J44421J3470N8223j95943q0255L53570m5397
$$ y = [322817, -104429, -342144, 15662, 284814, 275054, 107765, -15864, -270614, -219192, -71507, -123709, -34541, -53840, 76157, 132394, -133626, -472733, -470044, -221319, -109035, -137411, 46124, -84053, 119907, 211630, 15993, -146349, 78924, 216542, 75991, 112302, -25926, -33100, -133317, -439750, -238481, -267326, -85652, -184451, -329095, -215452, -30540, 14707, -207747, -322960, -267384, -107738, 321004, 508490, 400786, 325253, 478861, 463582, 330142, 232800, 157526, 154687, -165043, -43653, -77395, -328088, -248361, -40135, -36865, -108366, 14871, 72658, -57569, 134650, 209723, 221043, -50625, -83074, -129144, -207326, -123138, -61237, 83184, 96654, 154877, -41066, -121321, 232249, 186852]
22082A86852j60823j6895n4494j65188j66174L8338K98051J21442k60349l6115
22072b15355n1844K1319L67353O4282j76302j88608q1320l5985L0477N6154l9741
22061b49570m5315j28889M9081J29973K78307k18944r1868J96146j46625J68055
22051e9649J73337K01414j14706l28491k28812r6948J34104j5346j52294J59822
22041c27569J74118O6456J09696K66342K52569l74859r5210J8225L0763j64754
22031d4223n7007J38117k7888r8546k95310j66347J34324K21326m4525l8954O3036
22020b15997L6217J86791l2197o7049q1045R8048k89205k17153J77655N1599N9251
22009b93085m7626O1623K9615K3159j44334O8058J61583Q1367J15966m40466k60663
$$ y = [186852, 26029, 9134, -45360, -210548, -376722, -338384, -40333, 81109, -179240, -215355, -267199, -245880, 121473, 185755, 9453, -179155, -260475, -296460, -265983, -209829, -249570, -294885, -423774, -374693, -244720, 33587, -185357, -277225, -81079, -227704, -59649, 113688, 315102, 200396, -128095, -356907, -453855, -319751, -335097, -487391, -327569, -153451, -86995, 22701, 289043, 541612, 166753, 71543, 89768, 120531, -44223, -101230, 36887, 8999, -89547, -384857, -551204, -416880, -195554, -240079, -279033, -215997, -179780, 7011, -25186, -92235, -173280, -75232, -364437, -581590, -403935, -352336, -293085, -340711, -279088, -249473, -226314, -370648, -302590, -141007, -59640, 56326, -384140, -644803]
21998f44803J42796L64228J67316k33474k25662K50500P4201O0820J4495m3234
21988g2817j992M6819o9479N7694o6983k56116j36600K06632K96824J63743j00427
21977F7298k46594q3648J06550K66212Q4876o2876P0175p4231q5360J03897o1267
21966H5032j53464J3557j22553M2984M67864l486l00612k28202J86532R6089M176
21955H7917K902j78021J29575L83171j05241l07159j06296J24632j72240k45319
21945c86079J56488q1529o0390j56406L03172L56907L87395j4488k40636J8259
21935B82693p4376j32451K6199J27439K7896j02726l71587Q2928r1794K84556
21925E8777J69853k42411j62570L52569N7497k15329m9245j95742J41394L6203
$$ y = [-644803, -502007, -137779, 29537, -203937, -429599, -179099, -104898, -44078, -29583, -72817, -74809, -27990, -97469, -39775, -106758, -362874, -499474, -292842, 3982, 167725, 67298, -179296, -262944, -156394, 109818, 194694, 131818, 201993, 127762, 42402, 146299, 85032, -68432, -54875, -177428, -134444, 333420, 329934, 29322, -198880, -12348, 83741, 87917, 90819, -87202, 42373, 425544, 320303, 13144, -93152, 31480, -140760, -386079, -229591, -311120, -371510, -527916, -224744, 132163, 519558, 505070, 264434, 282693, 208317, 75866, 102065, 229504, 257400, 154674, -216913, -133985, -225779, 58777, 228630, -13781, -176351, 176218, 233715, 18386, -30859, -226601, -85207, -49004]
21915d9004k01780m14273J62080L62651N43644N1366j41561j18718m04081n8649
21905b68325K18282K31478K91194J74709j66888l40264j53119l9711K51314r835
21895A88835j45133K19497q5812j15952n9716j39891q6505M9130o2730j5873k3731
21884b77881J9463k5652R3241Q9758Q4939p8505J64927j70282k17077n8944l2506
21873d08519K9400L05374K47595J3716J0573p8816m4163l46747J9240K48174J3052
21862H879j87567j91181K8646N0884M02146K63718m3404K50808K38768l08027
21852E13670j92260J41476j52738j74031k3398Q0406j0134K20935K33428q9075
21842E48279k54850j9984j54184j31941Q2623p6640k40677j02756K69613Q6217
$$ y = [-49004, -250784, -665057, -502977, -140326, 403318, 454684, 313123, 194405, -209676, -268325, -50043, 181435, 472629, 647338, 480450, 140186, -12933, -52644, 198670, 188835, 43702, 263199, 177387, 61435, 1719, -138172, -224677, -175547, -238277, -254150, -277881, -258418, -284070, -190829, -101071, -16132, -94637, 70290, -99992, -317069, -376013, -408519, -379119, -73745, 173850, 187566, 198139, 119323, 75160, -271587, -252347, -4173, 8879, -178688, -369869, -341223, -290339, 111807, 375525, 332121, 582929, 821697, 513670, 321410, 462886, 310148, 136117, 112719, 193125, 182991, 403926, 637354, 548279, 293429, 273445, 119261, -12680, 69943, -6697, -247374, -350130, -80517, 5700]
21832E700K3575n9923J10905P253r4772K14869j33749l3681K9263K53325M7436
21821C70201k35181j26855k37429j52017L5547j9367p828J06402L40388K32919
21811C06780n2196j36659P8554m1760j61675j84440j7998k601k12943j21727r1432
21800f38097K6441K81420k3207J97291K41072J69032k0709j97564k74708L8733
21790b00296P5359N5084K9478n8822k59122q9601K4532J14159Q1228N5793K25109
21779E2901l3951K37812k27962r8759j71572k60807L12526M84679q0650k79600
21769f5383k61024R4943K72599L26009q4193j65289l06163j14736J83976K60005
21759A40744l308j58976j39459j10763K7240p9090O5240K6847O1189M3987j4473
$$ y = [5700, 29275, -30648, 80257, 87510, -7262, 207607, 73858, 40177, 69440, 322765, 370201, 135020, 8165, -229264, -381281, -345734, -365101, -372929, -266527, 73861, 306780, 254584, 117925, 196479, 154719, -6956, -191396, -209394, -211995, -424938, -546665, -638097, -611656, -330236, -353443, -156152, 84920, 253952, 233243, 35679, -239029, -200296, -124937, -69853, -40375, -99197, -358319, -447920, -423388, -309229, -228001, -172208, 52901, 18950, 256762, 28800, -69959, -241531, -502338, -189812, 294867, 214217, -65383, -326407, -231464, 41135, 367144, 282951, 117662, -188501, -303237, -119261, 140744, 137436, -21540, -160999, -271762, -244522, -323612, -258372, -231525, -170336, -126349, -140822]
21748a40822j3703K7169n1685K64477J15590O94N2212J86636q1152l30507k6895
21737B014O3850q6501k53229k20858K05642K082j04211L44582L98952M5719j43771
21726B54271o69058j8786Q0906j6238K51622N2998J83154J18199r5801l7235m8979
21715E5053J5280P5790q5579P6286j42506k50717L15282K76570o2162k03980m8119
21704B1198N388k25058m4726K28647K03252j26356k08828Q518P602L2562m4614
21693a42415J02075j05579n8824M0280k24389r6785J16334K88201j40098m12775
21683f33975M7447K63242J39372k79414q1220J35986J45193J01599L25124K31264
21673C94618k22123k31790L40784K0744Q4407K37138o887k51587q4621k47273
$$ y = [-140822, -154525, -127356, -179041, 85436, 201026, 201720, 253932, 440568, 359416, 28909, 2014, 65864, -20637, -273866, -494724, -289082, -287000, -391211, -46629, 352323, 398042, 254271, -414787, -433573, -352667, -368905, -117283, -64285, 118869, 237068, 141267, 104032, 55053, 70333, 146123, 60544, 136830, -5676, -256393, 58889, 335459, 273297, 69317, 21198, 26586, -198472, -243198, -14551, 188701, 62345, -146483, -137965, -130363, -97801, -142415, -40340, -145919, -204743, -164463, -388852, -485637, -369303, -81102, -221200, -633975, -586528, -323286, -183914, -463328, -544548, -408562, -263369, -161770, 163354, 394618, 172495, -59295, 281489, 302233, 386640, 623778, 616891, 365304, 280683, 33410]
21663C3410J48296L3446k35709j27486p4509o8881p9734J61683m3203J89303J0836
21652e2548j0603l555m3550k0753P0223k836q2353k84787J105L60253N542r3691
21640a57553J76931J45800j28076j50765j14590J33673j32780J12289J25580r3493
21630h2984l58994J09377L50986K6835o38036k0486J62267N566o8405L46539K36728
21619F9393k78048j14788q3422j302J09364N8312J95651J52250k19781Q8416N3270
21608B9315k03511p1832J82678j98890k78331J10939K07100p3866j56210K12111
21598b40497L47834k6090M288J39550Q7297o8784k56127k34554L4090j93190K48656
21587a57527K68800K6485k37173k06706J72143J41480k68943J46796J68400j12305
$$ y = [33410, 181706, 215152, -20557, -148043, -222552, -291433, -371167, -209484, -252687, -63384, -52548, -63151, -66706, -110256, -131009, -60786, -63622, -145975, -430762, -429657, -69404, -63862, -157553, 19378, 165178, 37102, -113663, -228253, -94580, -227360, -115071, 10509, -82984, -441978, -332601, 18385, 45220, -592816, -613302, -451035, -445469, -513874, -167335, 69393, -208655, -323443, -406865, -408167, -298803, -240491, -44840, 107410, -112371, -23955, 29315, -174196, -246028, -63350, -262240, -540571, -429632, -222532, -296398, -452608, -240497, 107337, 81247, 85535, 225085, 312382, 243598, -12529, -247083, -212993, -406183, -157527, 111273, 137758, -99415, -306121, -133978, 7502, -261441, -114645, 53755, -58550]
21577e8550k74559K66764K42406O0168j63831j57565l60163J97103J30134j46331
21567b64424m3386Q6226J24214M09823P6436j86831q0622R6743j39186J31783
21557B10776L05569k71611l83017L1994J43683J40303N9533K1777l7082k07978
21547A3947k87345J40889K8148m0036J20221L2901J8178j57813M0484L80232J26615
21536D16421k44894k80487L2197K5130j43259M4212K34451K21809K53652m1776
21526E17456j52326K3900K9609k66483k38156j10390j53223J16950K21240R3019
21516H1596l0258J06657j28922l8140K59867O595r7711j16178j40497K4908J25114
21505E3031O4806M074P7809k534k72772Q6033R1411J39391J42350j19284o5622
$$ y = [-58550, -333109, -66345, 176061, 236229, 72398, -85167, -445330, -248227, -118093, -264424, -307810, -221584, -97370, 312453, 388889, 202058, 121436, 218179, 78993, 210776, 516345, 244734, -138283, -106289, 37394, 177697, 237230, 259007, 221925, 13947, -273398, -132509, -104361, -144397, -24176, 8725, 26903, -130910, -90426, 289806, 416421, 171527, -108960, -76763, -51633, -194892, -150680, 83771, 305580, 559232, 517456, 365130, 389030, 418639, 152156, -86000, -196390, -349613, -232663, -11423, 81596, 51338, 157995, 29073, -9067, 250800, 257395, 159684, 43506, -96991, -72083, 53031, 117837, 121911, 199720, 197186, -75586, 10447, 101858, 241249, 383599, 264315, 198693]
21494A98693n7802j04651J92220j08365l41598j87998J62836J8395N4608Q8809
21484h4853K23124L4517J0784J12669J4768P4461r91p1579k58989l13438r700
21473b69227o9501J35226K60223M622K16629K86829n4186O2934k44049l6238O8190
21462C61452L4787q0533j72301j43825j00983k86923L9281J44302N9779J99054
21452E4090J26295k18004j16026j15115P8574J86960j71650J42659J44205r8727
21442A3261j38625p9987r1312J99386m5524Q5689l3510l7460L1018j76100N3914
21431b19250K80612l7090j28961k15959J8310K17490O5551L981j65811j29694
21421c10821L0898N9018L9467J89778k8801J11661m8823P4118K39205k49899J33466
$$ y = [198693, 140891, 36240, 228460, 120095, -221503, -409501, -246665, -228270, -173662, -84853, 138271, 172788, 183572, 296241, 311009, 385470, 384479, 312900, 53911, -259527, -269227, -338728, -203502, 56721, 61343, 277972, 564801, 510615, 573549, 329500, 293262, 361452, 396239, 315706, 143405, -420, -101403, -388326, -349045, -204743, -144964, 54090, 180385, -37619, -153645, -268760, -190186, -3226, -174876, -32217, 111988, 13261, -125364, -205351, -296663, -97277, -142801, -57112, -90622, -128082, -97064, -273164, -219250, 61362, 24272, -104689, -320648, -302338, -84848, -19297, -15316, -181127, -310821, -279923, -220905, -181438, 8340, -20461, 91200, 42377, 116495, 355700, 105801, 239267]
21410B39267O4063q0211M894r1742k43432J20352J84030j0575k16754j93626k6186
21399b49920K05056j10798j77963j4472j93646m8523N1343K35594J17844K960
21389a82525m3260J01443K27330j30390J75020j28274o3867Q3512J54800Q5642
21379B79431M9369K24518K8608q6508j2424k0591m2943K8606J4634j86585j11389
21368A64726J0133L3043O4913O6466k67774j06056R3932n8214J07350n6059k47108
21357a94648j21001M19799J5343O1315k16673m0049O6984j28326j49625J80037
21347a06844J06993o4507k38235j3871q2799r0258J2181l9663K57160J05970n9326
21336b13199q4619K8675j9263J96046P1900o2635q3830l08992P5938L15479Q8871
$$ y = [239267, 303330, 223119, 228013, 136271, -107161, 13191, 197221, 186646, -30108, -223734, -249920, -44864, -155662, -333625, -348097, -541743, -590266, -538923, -303329, -185485, -182525, -225785, -124342, 102988, -27402, 147618, 19344, -44523, 38989, 193789, 279431, 328800, 553318, 581926, 495418, 482994, 462403, 419460, 448066, 462700, 276115, 164726, 174859, 207902, 272815, 339281, 71507, -34549, 59383, 1169, 108519, 52460, -194648, -315649, 104150, 119493, 180808, -35865, -75914, -8930, -137256, -286881, -106844, 149, -64358, -302593, -316464, -399263, -489521, -477340, -517003, -259843, -153873, -213199, -297818, -269143, -288406, -92360, -20460, -83095, -166925, -475917, -399979, -84500, 4371]
21325D371l48453K2193K44620m2560M1000L2504k17020j537J78190J02144j08465
21314i3013R86J04521n3222l4576k06176o3217j5028l99986j00295K82889K32904
21303c44213L73341J58405K0017Q7626n0461K1551m6603k13877m00308j14198
21293e08720J23162K14743J22915o9275J04014J27353m8621k34040o0826j89385
21283d18680j54499N9285Q9000J70948O6155o8283J80553L19634j17021r8191
21273B8901m9081k543J41660o9098l47482P1098J38804K42588Q7366r3776q3143
21262F5294k38405Q0271N0766J93020K21135P772K61773j4563j85621p2891l31248
21251C7303k61172R2666L85060o5393J3545r5720J68338K86821m4967q7040m2405
$$ y = [4371, -344082, -321889, -77269, -119829, -78829, -46325, -263345, -264882, -86692, 15452, -93013, -92027, 12494, -40728, -75304, -281480, -344697, -359725, -759711, -860006, -577117, -344213, 29128, 187533, 207550, 295176, 244715, 266266, 219663, 5786, -394522, -508720, -385558, -170815, -47900, -117175, -13161, 114192, 65571, -168469, -229295, -418680, -573179, -513894, -424894, -253946, -187791, -256074, -75521, 244113, 127092, 28901, -20180, -22723, 118937, 49839, -297643, -226545, -87741, 154847, 242213, 148437, 65294, -173111, -92840, -42074, 150946, 372081, 379853, 641626, 627063, 441442, 368551, 37303, -223869, -131203, 253857, 188464, 202009, 106289, 274627, 561448, 516481, 429441, 387036]
21240C87036m54380k16277K8485M28357J52401r7120j56317J7172L04201J81775
21230E75333l75147k28787j521J50388K9216J16124l9382l06607j89553L9197
21220b30739J48272j9836j35026P7011J6343J45505K2801p6678m2237j14838J19921
21209h9501J32895k39546r9832k4637O8838n6743k6207Q9917K87013J27634l65327
21198a95496j83991Q7928N6346O5715k21674k28897j8857Q7869K20737K86480
21188d3840K2935r0931j1781k1808m5292j17043J37139L16555K37758n6367j3144
21177C14181p5669m1095j87007l97609k34900J96697J94183Q7481P2758O202M8179
21166a6599j44306O7955n7548j9818j31746l803L31289J43818J10892R3712J7857
$$ y = [387036, -67344, -283621, -255136, 173221, 325622, 228502, 72185, 89357, 393558, 575333, 200186, -28601, -30122, 120266, 149482, 265606, 226224, -80383, -269936, -230739, -82467, -102303, -237329, -160318, -143975, 1530, 24331, -52347, -94584, -209422, -89501, 43394, -196152, -295984, -320621, -251783, -308526, -334733, -244816, 42197, 169831, -195496, -379487, -291559, -235213, -169498, -391172, -620069, -638926, -551057, -330320, -43840, -20905, -111836, -123617, -145425, -190717, -307760, -170621, 145934, 383692, 327325, 314181, 238512, 197417, 10410, -387199, -622099, -425402, -231219, -143738, -70980, -64778, -16599, -160905, -92950, -150498, -170316, -302062, -305865, 25424, 169242, 280134, 373846, 391703]
21155C91703k67471m4283j43799p502N0720m0432O6305J80851J77191L03847l08267
21144C58863j71583r7059J92328J14753j93599k11474J44025K8332n3840j77306
21134f6560j25822K22967J71956k1512k78571o1812J76062j51381o4901J62481
21124c7093K09813j78621J43051k98152q6489K86782k2811l53159M8016n9229
21114c47892L10163j43408K19931L1252P1272M4681J52997j94616m21532k15799
21104d92951O15K19535J21723j1303J20800J36779K19431P757j30358k34756j74152
21093b16880J25784K79760K7158m1422p5208j74368M2036j15137l20662R6467
21083c72472L92864J96515Q1554p5197j04841j85248o9022j80767O2547m9828
$$ y = [391703, 124232, 79949, -63850, -71352, -20632, -61064, 5241, 186092, 363283, 667130, 358863, 187280, 90221, 282549, 397302, 203703, -7771, 136254, 164586, 110746, -66560, -192382, 30585, 202541, 181029, -97542, -159354, 16708, -134673, -199574, -37093, 172720, -5901, 137150, -161002, -247491, 39291, 16480, -336679, -288663, -347892, -37729, -181137, 38794, 70046, 141318, 185999, 338996, 144380, -277152, -492951, -492336, -272801, -151078, -162381, -41581, 95198, 314629, 322386, 192028, -42728, -216880, -91096, 188664, 215822, 174400, 99192, -75176, -33140, -148277, -468939, -372472, 20392, 216907, 298461, 223264, 118423, -66825, -135847, -316614, -254067, -303895]
21073c03895J61944j5737j13594L578j25030K8091Q2312K2893L2117J30744R8299
21062A722J8789L1265Q241r732p3060n1368j09980j17702M7599m0117j44450j63737
21050f02530m2099k44125J30476L52242N08546M19918J14614r9579L337o694P2777
21039F06883J3481k42102j39084k1093k56729j31847L1514n8435j79811l9564
21029d16787K28331J89242m4239j79150J18898J92478R1104k33829j27714q7679
21019b69345K17895p6424k5723j54830n7092M8399J85253k12970k7986K6323j039
21008c47539J04014l3109J65202r6389m0767q5074j85354K43984K69176K81525
20998B75669K60007K67441j91244j79435O570K3901o9268j44000k52106M5681
$$ y = [-303895, -141951, -157688, -271282, -267704, -392734, -364643, -282331, -259438, -227321, -96577, 1722, 20511, 51776, 60017, 50285, -22775, -74143, -184123, -301825, -254226, -294343, -438793, -602530, -644629, -888754, -758278, -406036, 102510, 522428, 637042, 537463, 540800, 534106, 606883, 620364, 378262, 239178, 218085, -38644, -170491, -138977, -197412, -377223, -416787, -188456, 786, -43453, -222603, -103705, 88773, 179877, -53952, -181666, -269345, -51450, -127874, -153597, -308427, -365519, -317120, -131867, -344837, -372823, -346500, -347539, -243525, -276634, -111432, -207821, -248588, -333662, -519016, -275032, -5856, 275669, 535676, 803117, 611873, 432438, 439008, 462909, 393641, 249641, -2465, 43216]
20988D3216L0509O2564Q1881J0406N7702J5595J31786K2314j62587l85955j19764
20977b12333o9391j33449k03944k5863k7752J58620J84456L11840J40569k71509
20967a48756R0485j61245K0456j06178k99880r8960K32412L2782J48314J53094
20957a37476j02604M297O455j8837l7124o0330K49580M9921m3026J3036L07451
20946B31343p1407R9871K22595r0629l32220j72162k20261M4772J94655M2074
20936e1369q9670O4597P6571l9811q2684Q5720J45630p1689j83726Q0046k67018
20925c33403k6094J33575K26632j05183l67732n358N5794N7381L4651O0241K16278
20914e3218L6989j62879n9990M4451K6550J3519J7154P6478k89401P5134j17180
$$ y = [43216, 73725, 136289, 218170, 228576, 286278, 301873, 433659, 455973, 293386, -92569, -212333, -281724, -415173, -619117, -644980, -672732, -514112, -329656, -17816, 122753, -148756, -58271, -219516, -199060, -305238, -605118, -704078, -471666, -438884, -290570, -137476, -240080, -235783, -229328, -248165, -285289, -345619, -96039, -46118, -89144, -76108, 231343, 159936, 259807, 482402, 391773, 59553, -112609, -332870, -288098, -93443, -51369, -141039, -76442, 129, -39682, -122366, -36646, 108984, 37295, -146431, -66385, -333403, -359497, -225922, 710, -104473, -472205, -477563, -421769, -364388, -329737, -269496, -53218, -16229, -179108, -239098, -194647, -168097, -154578, -137424, -60946, -350347, -275213, -392393]
20903c92393N5028r7124J4867R5900n2622J68389k8733j97243j08477J08852K32801
20892b00755K32253p660m3189j72961k02206K77214J24280r7543Q3553J5036K8589
20881C6611k72099m2589P1761j13950K13642J59740J48565m4304j36923j38292
20871a17838R2974M2389j91060J36009L38877L4216k10942J09494K44238P3386
20861E51743K6489k40704j98318o3612K3330p610j73074k14259j9298P9248j42948
20850c79013J49728J66829L42193j14952j66336J19004J66459o3843j05625n9345
20840E5099N6672j44729r5546J37437J18749J77152L4569R5735n3988k28886k94417
20829a42153M5503J63811j49839j32828K0308J35908J19405J72804q592k97232
$$ y = [-392393, -337365, -434489, -419622, -323722, -376344, -207955, -236688, -433931, -542408, -433556, -200755, 31498, 23838, -19351, -192312, -394518, -117304, 6976, -90567, -7014, 8022, 36611, -235488, -278077, -206316, -320266, -106624, 53116, 201681, 157377, 20454, -117838, -24864, 17525, -173535, -37526, 301351, 335567, 124625, 234119, 478357, 551743, 578232, 337528, 139210, 75598, 98928, 91318, -81756, -296015, -315313, -236065, -379013, -229285, -62456, 279737, 164785, -1551, 117453, 283912, 220069, 114444, 55099, 111771, -32958, -128504, 8933, 127682, 304834, 339403, 435138, 381150, 152264, -142153, -96650, 67161, -82678, -215506, -195198, -59290, 60115, 232919, 224327, -72905]
20819g2905j45785j63671P0582K09184J88965J90595J08412J34309k03085n8975
20809B57626M1005J71901k74023k18169J66542J98779k27942J65566o9164k69835
20799e7714K0214K46296K13068n408o3899l12548j78795M7982P5734N1964R4175
20788A31069q0275k6854N7616K30217k5649j58484j33377j19990j27485j47869
20778d01081O1525M2957r1381j73028K16415K85774M9492j19620J68543N6994
20768I6590J44720j55356J11484j31224l9843p4274j41691j3298M33160K53577
20758D83845m638n9782K6327q7231j82725K10841O4272k49583K94487M3114k63190
20747B75737L9815k19052l20167j7979L30765j51656k18908P7590K90658J17765
$$ y = [-72905, -218690, -382361, -311779, -102595, 86370, 276965, 385377, 519686, 316601, 257626, 298631, 470532, 196509, -21660, 144882, 343661, 115719, 281285, 212121, -57714, -37500, 208796, 421864, 416456, 352557, 40009, -138786, -90804, -15070, 36894, 131069, 50794, 23940, 81556, 311773, 286124, 127640, -5737, -125727, -253212, -401081, -339556, -296599, -387980, -561008, -344593, -58819, -9327, -128947, 39596, 96590, 241310, 85954, 197438, 66214, 26371, -47903, -189594, -202892, 230268, 483845, 479207, 419425, 445752, 358521, 175796, 386637, 450909, 201326, 495813, 538927, 275737, 315552, 96500, -223667, -241646, 89119, -62537, -281445, -203855, 86803, 204568]
20737B04568j41034p5549j73004j02778k8066j05217K45681K43345J34295j39228
20727F3013l87369o873K04580J9572N4605J83728K72870Q5984j16925j48616l26073
20716a01504L9861r582q1161J70983L352K7499Q972j13322r7012j65750j59986
20705d77650j63924K60595J92644J93893J23520j32398N7856q523l0131k6470
20695a0588r0148Q1817P1882J48964L4830j07429j38165j32869l3834J37568k2896
20684f0868J21678K1034p2991J67646L11184p9423l7551Q457l32522k63071O0250
20673a56177L45059J0119m7449J25885j97674m2399J14006O0516j36517k72228
20663a96859k70248r4787J92628J54532J45535k5067n2097r1377o0625L98651
$$ y = [204568, 63534, -12015, -185019, -287797, -315863, -421080, -175399, 67946, 202241, 63013, -324356, -331229, -126649, -107077, -52472, 131256, 404126, 490110, 373185, 224569, -101504, -61643, -71225, -152386, 18597, 21949, 49448, 58420, -54902, -151914, -317664, -477650, -641574, -380979, -188335, 5558, 129078, -3320, 54536, 46013, 15882, -10588, -100736, -18919, 52963, 201927, 236757, 129328, -8837, -141706, -175540, -37972, -60868, 60810, 81844, 8853, 176499, 487683, 408260, 370709, 379166, 46644, -216427, -156177, 188882, 199001, 151552, 277437, 79763, 37364, 151370, 211886, 75369, -196859, -467107, -561894, -369266, -214734, -69199, -94266, -146363, -237740, -298365, 100286]
20653A00286J0840k57857j9927o2228j23053k62593J47184K27560L08318l4248
20643C4282k03186l6635L31934J86929j16897j18189l330J2581j48018k03541
20633b64070j2741L0294j09632J51253J48339M9073k18185j69737L6351J53903
20623b05152O7735K04063O394j13367K6677J52573j56229n5136l694m8439m736
20612a29311J59703K37473K26634j37829j63436K38114j19986k54076J13381P1320
20602B41987k46817L6693l193J89923k1575j68570J81777L3246J19443L6915k73186
20591A26643j0217J4750J2315p0473j78602j39975M8442k15564k7928J17700n923
20580c28832J39877J97274K6197L4555P7184l120N092J1458m23400L3825J40426
$$ y = [100286, 111126, -146731, -166658, -228886, -351939, -614532, -467348, -239788, 68530, 34282, -168904, -205539, 126395, 313324, 196427, 78238, 74908, 87489, -60529, -264070, -276811, -246517, -356149, -204896, -56557, -7484, -225669, -395406, -359055, -205152, -137417, 66646, 73040, -40327, -13650, 138923, -17306, -72442, -76136, -124575, -129311, 30392, 267865, 494499, 356670, 193234, 431348, 311362, 57286, 170667, 241987, -4830, 31863, 28670, 218593, 197018, 28448, 210225, 243471, 362914, 399829, 126643, 116426, 131176, 143491, 73018, -105584, -245559, -197117, -412681, -440609, -322909, -328832, -188955, 8319, 34516, 69071, 146255, 143135, 148227, 159685, -263715, -229890, -89464]
20569h9464n8256K95300J07118j0838P5766q8152r6487r2348j5610k8196r282
20558a0449J67108l49026O9734J62815j65491r0627l2648k28107j1570J84591
20548c03670L41246n6203j70576K06778J7105j18326k41190j1050p8502r5040
20538e09428L20985J56449k0178N6036l6767j40909Q7898J1677P520j28722K9223
20527a66216Q5731o2871j01144J6344J9901M34001J80610q1374j59941M4408o6116
20516A43333L2373m6849k10944o6029l9820k58689J05483J6496P5180K08029J73562
20505A32125J66077j75043j33779j31484J50905J53653M2270m362P4723P411k07319
20494G5177k21047P7643J54848K42515p4179r9976r7822p935J0131O1772p5488
$$ y = [-89464, -147720, 147580, 254698, 243860, 319626, 231474, 134987, 42639, 27029, -1167, -10449, 156659, -192367, -122633, 40182, -125309, -215936, -248584, -476691, -488261, -303670, 37576, -18627, -189203, 17575, 34680, -83646, -324836, -335886, -414388, -509428, -188443, -31994, -52172, 3864, -32903, -173812, -85914, -74237, -66717, -195439, -166216, -80485, -143356, -244500, -228156, -208255, 225746, 406356, 324982, 165041, 209449, 143333, 175706, 128857, -82087, -148116, -187936, -446625, -341142, -324646, -249466, -41437, 132125, 298202, 123159, -10620, -142104, 8801, 162454, 204724, 200362, 275085, 282496, 75177, -145870, -68227, 86621, 329136, 254957, 154981, 57159, 49224, 59355, 121127, 45639]
20483D5639K93892J86529k10907k04568j71431J52547P6782m1335J46845j17524
20473A56469k51478k91074J41949J83042L13603K6439k01555l2368J08561j47920
20463E668J03145P960o0793o2878J23344J98808k2852r9083j02349o9553k94597
20452b73180o6797K40449j4931p167P9062k05603P2048M23878J62634k61344l31538
20441a82489j04953o1180Q1528L83433J69471m02692q7342L35488Q6915J07359
20431C25538L3218p0622l062o6505j03777q680l26281J23784J63846o34539j92167
20420g59247J67329Q3090L03656k26374r5974n0799O8850M2793K48124l5173J21977
20409a31748K9723l3127Q2549Q5021r4329j04436K9542o598J67813j87459n6155
$$ y = [45639, 339531, 526060, 315153, 110585, -60846, 91701, 168483, 127148, 273993, 156469, -95009, -386083, -244134, -61092, 252511, 278950, 77395, 45027, 153588, 5668, 108813, 116773, 55980, -6898, 116446, 315254, 292402, 193319, 90970, 21417, -273180, -339977, -99528, -114459, -121626, -42564, -248167, -176119, 247759, 410393, 149049, -182489, -287442, -348622, -267094, 116339, 285810, -116882, -204224, 131264, 218179, 325538, 358756, 288134, 285072, 218567, 114790, 106110, -220171, -96387, 67459, -567080, -759247, -591918, -508828, -205172, -431546, -527520, -578319, -509469, -466676, -218552, -253725, -131748, -102025, -135152, -52603, 32418, -61911, -166347, -136805, -143403, 24410, -163049, -219204]
20398b19204K81237L68648J19156l84631k83964k5692L834l9322J63728J62412
20388A46202K88032L8859q1249l3317j6479l52170m6150j3092R1403K9684J45073
20377A96796P1650J52236j15592L7018q7573O391J33266O8719k26915l06547j25050
20366a95601J07307N6570l32226q7903L47620L05422p8836l2145j2580j13775
20356c6147k74147k281j00316L9712j86202m6143L52211K81594P5010k5611K6274
20345A03954J9613N8367K5223m1615k25388j3020M2069J45113j21116l59050J39671
20334b26179J42517j19826n3576J96791J86245q6824j63585j66327j20409L42406
20324f8767L692j90625j04298k21385n4672Q5050K64798J9491n7391J54104J0837
$$ y = [-219204, 62033, 430681, 549837, 165206, -118758, -144450, -140616, -179938, -16210, 146202, 434234, 473093, 391844, 358527, 342048, -10122, -56272, -69364, 22039, 51723, 196796, 268446, 420682, 305090, 342108, 254535, 260926, 394192, 462911, 235996, -70551, -195601, -88294, -31724, -363950, -451853, -104233, 201189, 122353, 90208, 77628, -36147, -310294, -312575, -412891, -373179, -559381, -605524, -253313, 28281, 103291, 77680, 103954, 123567, 181934, 207157, 165542, -59846, -72866, -30797, 114316, -6800, -365850, -226179, -83662, -203488, -257064, -60273, 125972, 39148, -124437, -290764, -411173, -68767, -65075, -255700, -359998, -581383, -636055, -551005, -286207, -266716, -324107, -170003, -159166]
20313a59166Q0166O011o6193P3156Q1014j83507K30405J76764l14431J0380J66803
20302A01402L29755m24436j92524J27099K07175J87309k022J35808O3044l5798
20292D96812r3497j50013O3920m3566R110j31668m712Q3484j61012k37530O4947
20281a03725l4953k05223M70719O9198O2656j48301q4435k966l0596j67789R1065
20270h4350J45826R1513L3785k055j2520o2853q7512N4640K53618K50820q037
20259E72875j49558k81760M9569K96820J00681l4929J6211k176r4353q0928Q3958
20248D76410j05130k06287R349m9971L8802J35041K47269j30247K97042m8780
20238F63498r9956J5383L5828j58883r138K5127k12957k52771q429k529K9222
$$ y = [-159166, -79000, -72989, -139182, -66026, 14988, -168519, 61886, 238650, -75781, -65401, 101402, 431157, 6721, -185803, -58704, 148471, 335780, 333758, 469566, 532610, 496812, 403315, 253302, 317222, 273656, 282766, 151098, 146386, 229870, 68858, -168672, -103725, -138678, -343901, 126818, 196016, 258672, 110371, 25936, 22970, -7626, -175415, -84350, 61476, 152989, 186774, 184719, 172199, 109346, 21834, 76474, 330092, 580912, 572875, 423317, 141557, 191126, 487946, 588627, 553698, 569909, 567733, 473380, 392452, 476410, 371280, 164993, 174342, 124371, 163173, 298214, 545483, 415236, 712278, 663498, 563542, 578925, 614753, 455870, 446732, 471859, 258902, 6131, -2298, -4827, 24395]
20227B4395J5709O1932J51226j05609J74328P9772q06j41740j49783J05081r5328
20216A19177J63613J88564k6070l32017l90290k04296Q8797L70777R3031J58506
20206B29792l6150j79057j03954K58170K73830Q2511K72590j02604O6200J58668
20196I19996J5631n4895O4307Q7770o3578j80473J10068r149R9059p8698j31679
20185G78359L5294j56547r3479l71663k09448Q4449J04336J59577J35354k05936
20175B60296k51373j03348M299J06817J69851p5636Q1880J43262J93040k17145
20165C11943k92890k00923M6239J59428N0768K30587L37850k45595l78693j888
20155A6826L434n5825R3671J87591Q2266J55256q5548k94489j29903P0655j60844
$$ y = [24395, 40104, 102036, 253262, 147653, 321981, 401753, 400947, 259207, 109424, 214505, 119177, 282790, 471354, 445284, 113267, -277023, -481319, -392522, -21745, 71286, 229792, 193642, 14585, -89369, 168801, 442631, 525142, 797732, 695128, 761328, 919996, 935627, 880732, 945039, 1032809, 969231, 788758, 898826, 889677, 988736, 910038, 778359, 813653, 657106, 563627, 191964, -17484, 66965, 171301, 330878, 466232, 260296, 8923, -94425, -90126, 16691, 186542, 110906, 192786, 336048, 529088, 311943, 19053, -181870, -135631, 23797, 74565, 305152, 643002, 397407, 18714, 16826, 20260, -35565, 58106, 245697, 327963, 483219, 397671, 103182, -26721, 43934, -116910]
20144a16910l66964J05364J14125m3303m5362L78079j57136k96703J00335K65112
20134f3363q6759j19134k5686q303J20211J37357N1523j60747m1108P1998L40128
20123B16117J74410l35687j77978R4449J15289M1452J40848L3790j63949j65167
20113b6426N4247J24612p2250j95514k12560J85116K60899L09j79041J57001K10353
20102C06746n921N9243J3748k5717K3848K23678k4052k15736j12049l4903J2851
20091B21736K1254r7074o7469L12960j89595J0767K4653q2436j54884k6465R1762
20080F5209M696J07432j04194j40282P0794J04300q9743N2740P7692j37514L6864
20069D7994k03044M3543l288K1060J91530J23121J34599J38137k8650j78792j28594
$$ y = [-116910, -483874, -378510, -264385, -307688, -353050, 25029, -132107, -428810, -328475, -63363, -150122, -269256, -294942, -303245, -183034, -45677, 5846, -154901, -196009, -124011, 216117, 390527, 54840, -123138, -28689, 86600, 128052, 268900, 302690, 138741, -26426, 27821, 152433, 80183, -115331, -327891, -142775, 118124, 118433, -60608, 96393, 306746, 300825, 360068, 373816, 348099, 371947, 595625, 571573, 355837, 243788, 208885, 221736, 242990, 145916, 78447, 391407, 201812, 212579, 237232, 154796, -88, -26553, 65209, 69905, 177337, 73143, -67139, 3655, 107955, 18212, 70952, 148644, 11130, 47994, -155050, -111507, -114795, -93735, 97795, 220916, 355515, 493652, 465002, 286210, 157616]
20058A57616j45182J46576R8720j58958K60627o0185q7424J19677J26894n4326
20048D04035K3708k85029j90825O0044j60473j38849J56841R0341K94877L37089
20038E91759K09068Q1817K87592R3710K02961r589l18904m83303k09065L5856
20028D81902O7084j6321k09868j10844J24006J63995j32701r5360J0920j30931
20018A51882j89647q5931L98284K4845j96743j211Q0674j20862r2830o4610j64785
20007b60934k80453J16921K28392o2900k60723K12796K46424J88276K5098J60665
19997C13562j05025O9837J40011j62828q80j60779j76268L0589J7170J25136J24766
19986B15291K58856K48862j17157q44l0724j43577J83430j31090J0656r9108j32746
$$ y = [157616, 12434, 159010, 257730, 98772, 359399, 299214, 211790, 331467, 458361, 404035, 427743, 142714, -48111, 11933, -148540, -287389, -130548, -40207, 254670, 591759, 800827, 882644, 1170236, 1263946, 1466907, 1457318, 1138414, 655111, 446046, 481902, 548986, 532665, 322797, 211953, 335959, 499954, 367253, 271893, 282813, 151882, -37765, -123696, 274588, 299433, 102690, 101479, 182153, 61291, -31539, -96149, -260934, -541387, -424466, -196074, -258974, -519697, -306901, -60477, 127799, 152897, 313562, 208537, 278374, 418385, 255557, 254677, 93898, -82370, -51781, -34611, 90525, 215291, 474147, 723009, 605852, 605008, 574284, 430707, 614137, 483047, 493703, 394595, 261849]
19975B61849m3534J87643J43983P471o913j09279q7874L8203j24051J6187n2164
19964B31521k8988j15397m3220j51888k46233K10667J83638j31646k8101J02177
19954a7470J50571r6991m2530j48897P1318M9008J1389J19468O0215N3829O1745
19943B71655j26578Q6894J59554K08470N1615k3905k13998j35681k71616j51229
19933a44819K3173l3129N33540J26419j60831k22097R6672N1536J27764j15861
19923B82367j81443j88642M3614M55762n7101k6049j38716r2924j81935k7928
19913a12995J79903m3037K70602K39610j92709J64220J08619k1671J44135j5390
19903G21287M8134l31273j30798k1762J15848P4057j79016J06602m0150l24672
$$ y = [261849, 218315, 405958, 549941, 557412, 550499, 441220, 353346, 391549, 267498, 283685, 231521, 202533, 87136, 43916, -107972, -354205, -143538, 40100, -91546, -119647, -17470, 133101, 36110, -6420, -155317, -83999, -34991, -23602, 95866, 156081, 209910, 271655, 145077, 231971, 391525, 599995, 651610, 627705, 413707, 278026, 6410, -144819, -121646, -154775, 378765, 505184, 344353, 122256, 218928, 270464, 398228, 282367, 100924, -87718, -44104, 411658, 354557, 328508, 189792, 96868, -85067, -112995, 66908, 23871, 294473, 534083, 341374, 505594, 614213, 592542, 736677, 721287, 769421, 438148, 307350, 285588, 401436, 475493, 296477, 403079, 362929, 38257]
19893C8257j53532j96418j02224K52607L75821M8688j4826p4762k3837P5326j9831
19882B05269L185K6585K66123J13417j11830Q9769K8854k16906l22810j83122
19872a01466K03328L60065n0774J31021K4223l23316r9984p0919O8782Q4813M9839
19861B75612K40026j28244k10152k23393N7843J53285J62687p7112R445J2344
19851B72341R6037K98389p8087k7372M9231l87426p5018K52266m1484O407K5702
19840C90986J00353j9578Q7838j32222J1480j53437M5896n2721J48350J26832
19830E53777M8890q1187J4650j96259M7110q5935k8374J70972j30280j12236K67719
19819D68847L35164P0100j10496k18995L04391j35789k95093M4250N3315M1741
$$ y = [38257, -115275, -311693, -413917, -161310, 214511, 263199, 248373, 173611, 149774, 225100, 205269, 208454, 235039, 501162, 614579, 502749, 592518, 621372, 404466, 81656, -101466, 101862, 461927, 411153, 542174, 566397, 243081, 143097, 72178, 140960, 225773, 275612, 515638, 387394, 177242, -46151, 11692, 164977, 327664, 250552, 259997, 272341, 368378, 666767, 588680, 561308, 610539, 223113, 148095, 400361, 358877, 365284, 390986, 491339, 471761, 559599, 427377, 438857, 285420, 331316, 278595, 426945, 553777, 602667, 521480, 536130, 339871, 386981, 301046, 272672, 443644, 313364, 201128, 468847, 804011, 874111, 763615, 544620, 849011, 713222, 418129, 462379, 515694, 557435]
19809E57435J58932M0179L7823j97747J19809r057K5511l79158j77321O2491j42395
19798I6502J76221L04727N6629k32952J89488R6642R4341K24544Q1848j32338
19788I55652O1646R1385J4525j15181k41974R2233K56445j74946N3222N2182J37758
19777A182947o367K16244M2561k07994k86462m8283Q56K10890L85882M1225K25350
19766A756849J21687o0955j5971j15637J70880J56465J28782M79452M86246Q210
19756C116008J6190L58445N65548O46453M21411M81721M53947M47736O75249R23295
19746H106003R89513J187924J276878K194237K760023K923884L467260M426659
19738B7332381M472760L525551L941476M570834L996975M873740Q000740J1816358
$$ y = [557435, 716367, 756546, 794369, 596622, 716431, 707374, 732885, 353727, 176406, 238897, 96502, 272723, 577450, 634079, 401127, 590615, 687257, 781598, 1006142, 1087990, 955652, 1017298, 1108683, 1123208, 1008027, 766053, 858286, 1114731, 939785, 993007, 1045189, 1182947, 1176580, 1392824, 1435385, 1227391, 940929, 892646, 893502, 1104392, 1490274, 1531499, 1756849, 1878536, 1817581, 1801610, 1685973, 1856853, 2013318, 2142100, 2621552, 3107798, 3116008, 3132198, 3490643, 4056191, 4702644, 5124055, 5605776, 6059723, 6507459, 7182708, 8106003, 9095516, 10283440, 11560318, 13754555, 16514578, 19438462, 22905722, 27332381, 31805141, 35330692, 39272168, 43843002, 47839977, 52713717, 60714457, 72530815]
19730G2530815J7348934K3520153K8546653K6130944J7468283J5882385J1078699
19723B12506866j1140778k5607957k1517585j8567326k1308536j8799194j1823077
19716H3742413n329667j743023j313121k201756k997687o007843j0203693j0866369
19708D3079254q624178o393034m381538k797648j936036j279271q41857p87042
19700A6038650k66745J96703K13531L8739J98666L15635P54313J067056J599549
19691B0156097K194826L139185M223947N494354P044350Q568870R863824R513843
19683G0199296P135229O800937N452365K195542J680097N793446J1939660J8929554
19675A30126126K3863304K4355985K5369938K7644174J5054016p837419j3467740
$$ y = [72530815, 89879749, 113399902, 141946555, 168077499, 185545782, 201428167, 212506866, 201366088, 175758131, 154240546, 135673220, 114364684, 95565490, 83742413, 78412746, 76669723, 75356602, 73154846, 70157159, 64149316, 53945623, 43079254, 34455076, 28062042, 23680504, 20882856, 18946820, 17667549, 16825692, 16038650, 15771905, 15968608, 16182139, 16220878, 16419544, 16735179, 17489492, 18556548, 20156097, 22350923, 25490108, 29714055, 35208409, 42252759, 50821629, 60685453, 70199296, 77334525, 84135462, 89587827, 91783369, 93463466, 99256912, 111196572, 130126126, 153989430, 178345415, 203715353, 231359527, 246413543, 238576124, 225108384]
19668B25108384j6213585l4193555m1773264l2498127k1873527j3257256p287749
19661E8011321l929820l194753l054054k613667m080864o492967o500142n043334
19653B3101720l888558l065948k197877j558060j283566r89970p81552k70592
19645I065597l36016o86497o54772p13465o87927m03932m70315l57621k97563
19636D457489n60197k98886j47483k16988r8144m9550k80199q6341l8961q4598
19626B596142k50577m17261l6887J44933J94709J51221j74380j02516j35543j99595
19616A770246p0521J9047j7653O3054k97773k97595K8257L2957j24998J12199
19606A217220o2207j81232p4722J4417l1965P3930j74890Q2424K84841o4143P7452
$$ y = [225108384, 208894799, 174701244, 132927980, 100429853, 78556326, 65299070, 58011321, 54081501, 50886748, 47832694, 45219027, 41138163, 34645196, 28145054, 23101720, 19213162, 16147214, 13949337, 12391277, 11107711, 10117741, 9336189, 9065597, 8729581, 8043084, 7388312, 6674847, 5986920, 5582988, 5112673, 4755052, 4457489, 3897292, 3598406, 3450923, 3233935, 3135791, 3086241, 2806042, 2719701, 2680740, 2596142, 2345565, 1928304, 1891417, 2036350, 2231059, 2382280, 2207900, 2105384, 1969841, 1770246, 1699725, 1718772, 1701119, 1764173, 1466400, 1168805, 1197062, 1230019, 1105021, 1217220, 1155013, 973781, 899059, 913476, 881511, 955441, 780551, 862975, 1147816, 1083673, 1161125]
19595A161125n9876p5033j19631k67480l8429J97622J32103P4880q76J00525J41576
19584A246506J1982l13177j57688J62547M3173k1073k05331R2513j47448k89762
19574D22242K5501N07114K94992r9412j06733k52919j57586J21058N09228J53961
19564A417446L72637K94933m1699k33027l71115k57002J71763Q4683j76976m9592
19554A212051J86869K23525K87005j80515k98161j91542Q1707r5775j87461J58270
19544A195973o5503l7879j04307q8011j20326J7666j85855j73011K1312k49274
19534B10785J69959J48620l1774j03422L13767J64730k62002J11039J047J942
19524G24691j90892j9657L25739k02904k23416l6438n3406K08683j70161j21295
$$ y = [1161125, 1101249, 1026216, 906585, 639105, 600676, 798298, 930401, 1005281, 1004405, 1104930, 1246506, 1258488, 945311, 787623, 950170, 993343, 972270, 766939, 859452, 712004, 422242, 447743, 954857, 1249849, 1150437, 1043704, 790785, 633199, 754257, 1263485, 1417446, 1790083, 2085016, 2043317, 1810290, 1439175, 1182173, 1353936, 1438619, 1261643, 1212051, 1398920, 1622445, 1909450, 1728935, 1430774, 1239232, 1320939, 1225164, 1037703, 1195973, 1130470, 1092591, 988284, 900273, 779947, 797613, 611758, 438747, 460059, 210785, 380744, 529364, 497590, 394168, 707935, 872665, 610663, 721702, 722749, 724691, 533799, 514142, 839881, 636977, 413561, 377123, 323717, 532400, 362239, 240944]
19514B40944K77177o668J06455K32038M1991j16917P3076K80247K66446o8427
19504A326362m07553j74698R9411j34860k15599K0260j00499k12897Q7040n044
19494B81923M4790K05117k7098k48329J44936k08859j58604K49701M65853R9066
19484H48496l28046k03707L8674q3501J13799J57843j02015p5635L7380r8025
19474C05263n9098l66480o1006N6586R6944k782J97378J9979l10589j3331L29770
19463A92634N5487j70062K9343K59032P7806j23513l074r305j25407j45934K61656
19452B98663q2124l2763J42553N7757K07208J27315j48159k78320K3655J90460
19442E06245J50973r6277j12951j17371m1759J05069J44753J03882l8217l16293
$$ y = [240944, 518121, 511453, 617908, 849946, 891937, 775020, 848096, 1128343, 1394789, 1326362, 918809, 744111, 843522, 708662, 493063, 513323, 412824, 199927, 286967, 281923, 326713, 531830, 504732, 256403, 401339, 192480, 33876, 283577, 749430, 848496, 520450, 316743, 355417, 271916, 385715, 543558, 441543, 365908, 403288, 305263, 246165, -120315, -181321, -124735, -27791, -30573, 166805, 186784, -123805, -137136, 192634, 248121, 78059, 107402, 366434, 444240, 320727, 317653, 308348, 182941, 37007, 298663, 216539, 183776, 326329, 384086, 591294, 718609, 570450, 292130, 315785, 506245, 657218, 560941, 447990, 330619, 288860, 393929, 538682, 642564, 604347, 288054]
19432B88054L4358J41860n4776L0472k46136O8206j8529q7921n3721K07759J49129
19421D58755k33701k05230n0069N5250r5494L4918j07032j34379J79843K00924
19411A03785J09809J42897p0215p3557J82020J70941j75719j48918k55998K48968
19401B34013J64056o3654M472N8372m1489l55485p9648M58098r6285m0165K1209
19390B63494j98475j92247J96645K31745K21538p5804q5684k46523J8947L52152
19380D85788J28730j49945J40197j5224o6234J9304j30627O6975J64078r894L5813
19369F68961J6381K26359j0936j00456O2479O7465k43491l4412K6220J95647K79384
19358A153601J11600j3865j99186j62329l8451L7653K15762L45773J56982J93929
$$ y = [288054, 322412, 464272, 409496, 439968, 193832, 262038, 243509, 155588, 101867, 309626, 458755, 225054, 19824, -30245, 25005, -70489, -35571, -142603, -276982, -97139, 103785, 213594, 356491, 286276, 212719, 394739, 565680, 389961, 241043, -14955, 234013, 398069, 334415, 338887, 397259, 355770, 285, -79363, 378735, 282450, 242285, 263494, 65019, -127228, 69417, 301162, 522700, 446896, 361212, 114689, 133636, 485788, 614518, 464573, 604770, 589546, 523312, 542616, 411989, 478964, 643042, 633148, 668961, 685342, 911701, 900765, 800309, 862788, 930253, 686762, 652350, 678570, 874217, 1153601, 1265201, 1251336, 1052150, 889821, 851370, 889023, 1104785, 1450558, 1607540, 1801469]
19348A801469J21971J7229K17221J60156J70386j0181K02081K55976p4260R9008
19338B961056N20008O15866K84227K01393J61951j83899J49019L6154K4631J55186
19328D925592L44742Q14941J103895J449727J831875J987399K084808K269022
19320A6812001L155795M209970N961694Q606450J2106117J6037535K0811152K6810399
19312A14511113L4952746M3450527M4852101L7120996K6363439Q126066j5880521
19305B93496467l6544688n2402606n5087248m3158171k9563106j9526617j2485439
19298D4728592q617580o156483m377159l358758k821235k387174j825221j751123
19290A3433859j194486j033711r86347r41775o75652n42475n64685k88713l54765
$$ y = [1801469, 1923440, 1940669, 2157890, 2318046, 2488432, 2478251, 2680332, 2936308, 2862048, 2961056, 3481064, 4096930, 4381157, 4582550, 4744501, 4560602, 4709621, 4745775, 4770406, 4925592, 5270334, 6085275, 7189170, 8638897, 10470772, 12458171, 14542979, 16812001, 19967796, 24177766, 30139460, 38745910, 50852027, 66889562, 87700714, 114511113, 149463859, 192914386, 237766487, 274887483, 301250922, 309376988, 293496467, 256951779, 204549173, 149461925, 106303754, 76740648, 57214031, 44728592, 36111012, 29954529, 25577370, 22218612, 19397377, 17010203, 15184982, 13433859, 12239373, 11205662, 10219315, 9277540, 8601888, 8059413, 7494728, 7206015, 6851250]
19281F851250m75124l08665m47059k80734k75030l54911o00702j87269N6509k78031
19271C700234m6878j06449j23049k03454j59123L0758J48977J03237n1711k31866
19261C060676l55586k04674j86697j12548k93074L5006R8150Q8308j01948l45535
19251A682078m36291J51989m7939m6853J13190Q1237k71978n6342K41219P0849
19241A481159m13496k23200J5315R6516K91766J52339m6216k38908m67350L3848
19231F81773K00459k01126j557J70553j43514q7903J12258J78634J79401l33506
19221G55472l43582J40631K88924L41273J46939R1044l4791O4527J22946K2244
19211A595627L23024R3362K25875J47150M9108L05628J81116K56067k66921m90950
$$ y = [6851250, 6376126, 6067461, 5620402, 5339668, 5064638, 4709727, 4109025, 3921756, 3978265, 3700234, 3653356, 3546907, 3423858, 3220404, 3061281, 3092039, 3241016, 3344253, 3292542, 3060676, 2705090, 2500416, 2313719, 2201171, 1908097, 1943103, 2041253, 2129561, 2027613, 1682078, 1245787, 1397776, 1349837, 1302984, 1416174, 1497411, 1225433, 1169091, 1410310, 1481159, 1067663, 844463, 859778, 956294, 1248060, 1400399, 1354183, 1115275, 647925, 681773, 882232, 681106, 679549, 850102, 706588, 618685, 730943, 909577, 1088978, 755472, 411890, 552521, 841445, 1182718, 1329657, 1420701, 1385910, 1450437, 1573383, 1595627, 1918651, 2012013, 2237888, 2385038, 2434146, 2739774, 2920890, 3176957, 2910036, 2419086]
19201B419086k94287k45186n2520q4547p4775o6564k4935k12266k30549k14709
19191I18748L00264q4147l06178m8281J18792J59820j9120k16543o6250p6177
19181F80928j13068j5063L0344j54380L05884J81783J50456K77318q8725j54852
19171A100625j92112o3418J11894K3654R9943p1382J35839n0601K37987P6401
19161A408830j86878j47888j10069k1128R6517J12721N8026j55332j78726j007
19151H75066L95430j30144k21518p2568K14937J26584Q4023L7629K46581q4357
19141A471663P2344p2628J9667r7102j75841l13906J4535m6841j69971K49591
19131I51511R0111j00529q6706M28o3629n0064n6214n1179j17093J00877K56550
$$ y = [2419086, 2124799, 1879613, 1827093, 1742546, 1667771, 1601207, 1576272, 1364006, 1133457, 918748, 1219012, 1134865, 828687, 780406, 899198, 1059018, 1039898, 823355, 757105, 680928, 567860, 552797, 583141, 428761, 734645, 916428, 1066884, 1344202, 1255477, 1100625, 908513, 845095, 956989, 980643, 1080586, 1009204, 1145043, 1094442, 1332429, 1408830, 1221952, 1074064, 963995, 942867, 1039384, 1152105, 1210131, 1054799, 876073, 875066, 1270496, 1140352, 918834, 846266, 1061203, 1187787, 1271810, 1309439, 1556020, 1471663, 1544007, 1471379, 1491046, 1393944, 1218103, 904197, 918732, 871891, 701920, 951511, 1041622, 941093, 854387, 854815, 791186, 741122, 684908, 633729, 516636, 617513, 874063]
19120H74063J7502j20830r0279N2975k787p5193P1906J39651j172M426J55627
19109A025889j75604Q7275Q8222q9262n62821q0185L82524j6903J30967J53720
19099I43822J84029J40083j11084m52019r5194J31917J35139O4383O8331J87341
19089A196748J09577L32626K05774N8333P0287K99577L46809O4108o1637J55309
19079B777511L61401L45676K95646L58986N63661L58127L60587O17471O69540
19070F708606L03049M72819O64009J173806J523783J772391K239482L057299L870717
19061B1785961M831933N265886N295768M766538M958336N416251O022573O677028
19053F5020274R224480J4522873K1125704K7701205L1598941K9201134K2754301
$$ y = [874063, 891565, 770735, 680456, 733431, 730644, 655451, 727357, 867008, 865836, 870262, 1025889, 850285, 937560, 1025782, 936520, 373699, 293514, 676038, 659135, 790102, 943822, 1127851, 1267934, 1156850, 704831, 609637, 741554, 876693, 941076, 1009407, 1196748, 1306325, 1638951, 1844725, 1903058, 1973345, 2272922, 2619731, 2683839, 2622202, 2777511, 3138912, 3484588, 3780234, 4139220, 4702881, 5061008, 5421595, 6039066, 6708606, 7011655, 7484474, 8148483, 9322289, 10846072, 12618463, 14857945, 17915244, 21785961, 26617894, 31883780, 37179548, 41946086, 46904422, 52320673, 58343246, 65020274, 74244754, 88767627, 109893331, 137594536, 169193477, 198394611, 221148912]
19046B21148912J7388616P126332j2067117k6526884k7633518k5687136k5418183
19039A28331022k1334605j3714584o392134k217630j549662k344552l201510n748511
19031G1827834r322189j0835098r976210p742617n434436m177742k579877j629770
19023B0129895j357757q83746l94050m54806n50975o28531l52461L9279L48954
19014A5895802N32188R96752J972378K910069L807320N008662O207960P636688
19006D4967819Q825813Q560402P351548O433019N216833L654328K964570N504662
18998I3478994J0419930J5676026J8199476J9295062K1590457J9051658P229783
18991B04941386n175931r880982j6194570k7229977l2420114k7350071j8835435
$$ y = [221148912, 238537528, 245663860, 233596743, 207069859, 179436341, 153749205, 128331022, 106996417, 93281833, 86889699, 84672069, 83122407, 80777855, 77576345, 71827834, 62505645, 51670547, 41694337, 33951720, 28517284, 24339542, 21759665, 20129895, 18772138, 17888392, 17494342, 17039536, 16488561, 15860030, 15507569, 15546848, 15895802, 16427990, 17424742, 19397120, 22307189, 26114509, 31123171, 37331131, 44967819, 53793632, 62354034, 69705582, 76138601, 81355434, 85009762, 87974332, 93478994, 103898924, 119574950, 137774426, 157069488, 178659945, 197711603, 204941386, 199765455, 189884473, 173689903, 146459926, 114039812, 86689741, 67854306]
18984F7854306j2150116p092025l783449k322696k105479k412545l342531m405166
18976C0240299m699426m208212l291234k687610k050964j504054j163393p02590
18968I932816m48644o38932o77068o51965p39204q06671o40767l99212k73584
18959D656769l02749l50447k18535j75410p4882j99389r9378J74530j17308j95973
18949C097228j23471k39634m05058k9599J66750p294k49026j31495j89503k84168
18939A604730j8973l1037Q2017J03683j16993j04272j8222K26193j62439J5798
18929A580485k45482j89884J20775M7838n7146J27511J16173O7525l6246K6142
18919A557691p5762l6489j61985j02943J4653J38286k98341j77084j16437J49691
$$ y = [67854306, 55704190, 48612165, 44828716, 42506020, 40400541, 37987996, 34645465, 30240299, 25540873, 21332661, 18041427, 15353817, 13302853, 11798799, 10635406, 9932816, 9484172, 8845240, 8168172, 7516207, 6777003, 5970332, 5329565, 4930353, 4656769, 4354020, 4003573, 3785038, 3609628, 3534746, 3335357, 3235979, 3410509, 3293201, 3097228, 2973757, 2734123, 2329065, 2299466, 2466216, 2458922, 2209896, 2078401, 1888898, 1604730, 1585757, 1554720, 1636737, 1740420, 1623427, 1519155, 1500933, 1727126, 1564687, 1580485, 1335003, 1145119, 1265894, 1313732, 1256586, 1384097, 1500270, 1567795, 1531549, 1557691, 1481929, 1445440, 1283455, 1180512, 1195165, 1333451, 1035110, 858026, 741589, 891280]
18909H91280O786r3889M39458J43473l04379k38628j33587j09923j80183Q9879
18899E10287k30818O56J14911N0396K7893J10041M3150J08084l1409J18912m7282
18888G74821M2307L7188Q8460j3792J1828j48580j34260Q936j1408j68215n7323
18877D29962J20682m6848K6990L9023j3864K41445L53509k85710n15080j57061
18867A93048L03086j75110m4734M79625K485M3839j77978m7684J27760j50875
18857E53462q4700J60631J53642J09764J78430M3350K32920J15812j79341l65669
18847I18301O1269L47238j07617m06116j06884l59242p1226K72779J1986j44428
18837D16060j12828Q4091R0060J18874J24423K1347O1782l08291J14168R3874
$$ y = [891280, 898066, 804177, 1243635, 1387108, 1082729, 844101, 710514, 600591, 420408, 510287, 279469, 280125, 395036, 445432, 473325, 583366, 626516, 734600, 703191, 822103, 774821, 817128, 854316, 942776, 928984, 940812, 792232, 657972, 666908, 655500, 487285, 429962, 550644, 503796, 530786, 569809, 555945, 797390, 1150899, 865189, 350109, 193048, 496134, 321024, 276290, 755915, 758400, 802239, 624261, 576577, 704337, 553462, 468762, 629393, 783035, 892799, 1071229, 1114579, 1347499, 1463311, 1283970, 918301, 979570, 1326808, 1219191, 813075, 706191, 346949, 275723, 548502, 560488, 416060, 303232, 387323, 477383, 596257, 720680, 742027, 803809, 495518, 609686, 703560]
18827G03560r6785j17160k29608P2147J00647j00893K51734k9165N3944M7733
18817F56154K7911j79189k06707J49033l0491j68164N7162n5419o5499J81991
18807C66782j06664j78851J19544o5200J4621l9224L0381K4136n5853J4328O495
18796A30495K32946J36636L5520j1180J66916l74543k8184l20044j07123J05908
18786c2653j050j98695J76820K00494K50338J11477k99812j59214N9375P7894
18776A84974o9691K48238K57921Q3112J13942P0657L20841Q2290K13999M77323
18766A983606J2206m32679m21927j89419j18844k59787k65298k37546J33600L16734
18756E20646k14832j56578r2532j64306R8045J46460N6231K9769j48610J94168
$$ y = [703560, 606775, 489615, 260007, 332154, 432801, 331908, 583642, 554477, 608421, 656154, 684065, 504876, 298169, 447202, 416711, 248547, 305709, 250290, 184791, 366782, 260118, 81267, 200811, 135611, 150232, 111008, 141389, 165525, 109672, 124000, 130495, 363441, 500077, 535597, 524417, 691333, 316790, 288606, -31438, -138561, -32653, -33703, -232398, -55578, 144916, 395254, 506731, 206919, 47705, 107080, 184974, 115283, 363521, 621442, 704554, 818496, 889153, 1209994, 1292284, 1506283, 1983606, 1995812, 1563133, 1141206, 951787, 832943, 573156, 307858, 70312, 203912, 520646, 305814, 149236, 56704, -107602, -9557, 136903, 193134, 222903, 74293, 268461]
18746B68461J7162k15595M51073n2175j13753L13747k34812k64196j16466j76369
18736a22923K75125K00693Q2434k69049j84228J93416L56868L04548n3363m02883
18726C80638o7251j29469L6392M46736N0612j61770L0828q8759L0242P2942j11250
18715D89891k4404p8291k06553l76869o7792J82691J60926K25991N2327j15582
18705B42335K9579J18124j51480j16519j4108j8112J22168K95049P1647m54686
18695A23997k1406M0392m9266k26045j29122K9034K31418j36452L060J95664r3317
18684c2043J10374K53773K48069J80590p6135j20622n9669K41128j05403P8171
18674G18233j71528o8825J06719j98132l06180K4638j72001j66303J43006K26735
$$ y = [268461, 285623, 70028, 521101, 468926, 355173, 668920, 434108, 169912, 53446, -122923, 152202, 352895, 435329, 166280, -17948, 175468, 532336, 836884, 783521, 380638, 313387, 183918, 220310, 667046, 717658, 555888, 586716, 497957, 528199, 601141, 489891, 465487, 387196, 180643, -196226, -264018, -81327, 79599, 305590, 357917, 242335, 271914, 390038, 238558, 122039, 107931, 89819, 211987, 507036, 578683, 123997, 102591, 142983, 93717, -132328, -261450, -232416, -998, -137450, -134390, 61274, -32043, 78331, 332104, 580173, 760763, 684628, 564006, 504337, 745465, 640062, 718233, 546705, 477880, 584599, 386467, 80287, 104925, -67076, -233379, -90373, 136362]
18664A36362K29303j5711l03433j22182L50632J72413j30029p8759K55216K82916
18654G76728J72840L38490J57472M5374K63145J33902M66606J00147k44415J28605
18644B338894L64796M7877l10749j73400j4763n9792k11750l3109J0108O1395
18634B019507j53382J00219J73337J58045L04728J77652P8789K59260L62002Q8174
18624C568331j95415j1556J38335l3362L099J02723l04465O0607L29415O6529
18614C724241O6118K87208L69783O77500J305524J289161J547773J697733K021423
18605A2986464K444940L049595M532199O397300R294442J2499673J6219399K0867266
18597H8291278K7438018L5308504M1639289M2667970L7440690K6452829Q702042
$$ y = [136362, 365665, 349954, 46521, -75661, 274971, 447384, 317355, 238596, 493812, 776728, 949568, 1288058, 1445530, 1490904, 1754049, 1887951, 2354557, 2454704, 2210289, 2338894, 2703690, 2751567, 2440818, 2267418, 2252655, 2192863, 1981113, 1948004, 1958112, 2019507, 1866125, 1966344, 2139681, 2297726, 2602454, 2780106, 2858895, 3118155, 3480157, 3568331, 3372916, 3361360, 3499695, 3466333, 3469432, 3572155, 3267690, 3328297, 3657712, 3724241, 3790359, 4077567, 4447350, 5124850, 6430374, 7719535, 9267308, 10965041, 12986464, 15431404, 18480999, 23013198, 29410498, 38704940, 51204613, 67424012, 88291278, 115729296, 151037800, 192677089, 235345059, 272785749, 299238578, 307940620]
18590C07940620j2842387l3188416m7303730n1572778m4442525l2123510k2130203
18583F4337071j5088622j0305457p438199n370313l783627k616691k049969j745626
18575A5938567j468907j240605r78280o38318o68419o24206m08367q37619r77112
18566H096734r92086q12961m62343l07823l6677j81739j01339m2075Q5636J75679
18556E421006j25573j18128m74249k52238l82478l24635k34974o30459k18005
18547B660267k123j32276l24586k03338J30433M00045K09240K01941K94018M54381
18537C688002K27441p5504j90965L7156J35290m38761m09562j42663j09454k01125
18527B519855M335j25899n4654k19883J26731J62528k49563q2180L12946j69264
$$ y = [307940620, 295098233, 261909817, 214606087, 163033309, 118590784, 86467274, 64337071, 49248449, 38942992, 31504793, 26134480, 22350853, 19734162, 17684193, 15938567, 14469660, 13229055, 12250775, 11612457, 10944038, 10319832, 9911465, 9073846, 8096734, 7104648, 6291687, 5829344, 5521521, 5484844, 5303105, 5201766, 5159691, 5245327, 5421006, 5295433, 5177305, 4703056, 4450818, 4068340, 3743705, 3508731, 2878272, 2660267, 2658144, 2525868, 2201282, 1997944, 2128377, 2528422, 2737662, 2939603, 3233621, 3688002, 3915443, 3839939, 3648974, 3686130, 3821420, 3382659, 2973097, 2830434, 2720980, 2519855, 2524190, 2398291, 2343637, 2123754, 2250485, 2413013, 2163450, 2081270, 2394216, 2224952]
18517B224952m00716m70144k03308k27913J26928L04961q0277j99719j15458m6718
18507I12588L4826J38850L6762n382k51788j03097Q2923j51787j89880J01826
18497F05841O4776j56390j99845Q9253n2280j86967l4668M98020K01258m9093
18487G79905k17742K00553J70483K18309k620J6754j9890j15033J51516l8311
18477A143924r4788k26808r0353n1375k03199J01000J72810M6666L3241q383J01166
18466I23901K37754J77434N8665J92182j24743k96447m0123j66851m37951n33915
18456a0094J08554J36466k43494Q2169J58264K41678M70k89910k17206l53822
18446c86925J64086L39232j36267j60669j44927j48205j24031L22067L14601J88504
$$ y = [2224952, 1824236, 1354092, 1150784, 922871, 1049799, 1354760, 1274483, 1074764, 959306, 912588, 947414, 1086264, 1123026, 1117644, 865856, 762759, 845682, 693895, 504015, 605841, 670617, 514227, 314382, 403635, 351355, 164388, 129720, 627740, 828998, 779905, 562163, 762716, 933199, 1151508, 1148888, 1165642, 1145752, 1030719, 1182235, 1143924, 1049136, 822328, 731975, 680600, 477401, 578401, 751211, 797877, 831118, 822735, 923901, 1161655, 1339089, 1397754, 1589936, 1465193, 1168746, 1128623, 961772, 523821, -10094, 98460, 234926, -8568, 73601, 231865, 473543, 474013, 184103, -33103, -386925, -222839, 116393, -19874, -180543, -325470, -473675, -597706, -275639, 38962, 227466]
18436B27466K7021j50234k47414J11563k05027j26783J82380O4704l10404Q180
18426d18548L87345K41943Q1757K55131p0852Q2442o4022j40583L7384J07473
18416D99470l52501k04715j3089K43806K11642K9875R2814L156J12407Q9902J64823
18405H77590P502M4583j43434m48365J2882J37755j54825o2960J56944j32233
18395B95439K51235n7548M7183j50124Q0053j24749J6979R0816j45068k8433l1129
18384B44654k22060N2484j76847K7833O8648q133k2995j45927K20145Q6061j88814
18373f4951L2217J58879r8119L16323j91263j72456J54351J76628L81299O7972
18363G60880m16441j18525j78319Q5966Q8465J41204L1594n8682k94188M0792
$$ y = [227466, 254487, 104253, -143161, -31598, -236625, -363408, -181028, -116324, -426728, -418548, -31203, 210740, 292497, 547628, 476776, 559218, 495196, 354613, 391997, 499470, 146969, -57746, -70835, 172971, 384613, 414488, 507302, 510458, 622865, 712767, 877590, 885092, 929675, 786241, 337876, 350758, 488513, 333688, 270728, 427672, 295439, 546674, 489126, 536309, 386185, 466238, 341489, 358468, 449284, 304216, 275783, 244654, 22594, 75078, -101769, -73936, -5288, -13421, -36416, -182343, 37802, 123863, -64951, -32734, 126145, 28026, 344349, 153086, -19370, 134981, 311609, 692908, 760880, 344439, 225914, 47595, 133561, 222026, 363230, 394824, 336142, 41954, 82746]
18353H2746K97490O6424j27870k67318L8726m2690k5517J84600J41984J49257
18343D97832j11862m82297k30903J8058J24593J93759j37989l8035K46315O2722
18333A42193q4140k04461M6266R3912k18580q712L49639M686K52507j64R9206
18322D72352J10945m1812k23831j72075N9274j08446k15020J73707J85164l2254
18312B08004j60641l6401r7530R8947O1344L6983j06125r2110L1515K09983r6287
18301E7682j13766j17992J31658J77219l30348k28934J80555J66953M4070r9175
18291a32078K7583K26342R5090J3582Q7583Q6196J42853J54260k04707k17965
18281B78739n13039k41117K11348L11802M569J3629j47598J36622K96835K06910
$$ y = [82746, 380236, 446660, 318790, 51472, 90198, 47508, 21991, 206591, 348575, 497832, 385970, -96327, -327230, -309172, -184579, 9180, -128809, -166844, 79471, 142193, 58053, -146408, -100142, -6230, -224810, -233522, 116117, 120803, 373310, 373146, 472352, 583297, 541485, 317654, 145579, 204853, 96407, -118613, 55094, 240258, 208004, 47363, 10962, -86568, 12379, 73723, 110706, 4581, -87529, -56014, 153969, 57682, -56084, -174076, -42418, 134801, -195547, -424481, -243926, -76973, -32903, -132078, -104495, 121847, 216937, 230519, 318102, 404298, 547151, 701411, 496704, 278739, -234300, -475417, -264069, 47733, 52302, 65931, -81667, 54955, 351790, 558700]
18271E58700j30262j02227j0246m2533M3425l15291j6604J30820J29126J19702
18261C64610N8136J50167J55909m5846k20506n14970j46223N02525L76247q6307
18251E93742j48153j35193J03596J23263p76K1068j61928k53553l37389j68789
18241c64112J99615L25547L84101L0440j7685k45584k22756J34068K93375l9322
18231D77687P2099O0379J93661j02172k37160k62978j16350j70282Q2789K38561
18221B36234R0274q9185p5219k6773O6599j32609Q2826M7836J40864P3172j84522
18210B29497k05641p6688J69784J66984J29498J42642J03322K20020j39508m11606
18200C28304n02163R7988K49592K15581J87482r2190j35496j35055j08491m7335
$$ y = [558700, 428438, 326211, 315965, 273432, 316857, 1566, -15038, 115782, 244908, 364610, 422746, 572913, 728822, 682976, 462470, -52500, -198723, 303802, 680049, 593742, 445589, 310396, 413992, 537255, 536479, 557547, 395619, 142066, -195323, -364112, -164497, 161050, 545151, 575591, 557906, 312322, 89566, 223634, 517009, 477687, 549786, 610165, 803826, 701654, 464494, 201516, 85166, -85116, -2327, 236234, 326508, 237323, 162104, 135331, 201930, 69321, 152147, 199983, 340847, 414019, 229497, 23856, -52832, 116952, 283936, 413434, 556076, 659398, 879418, 739910, 328304, -173859, -75871, 173721, 389302, 576784, 484594, 349098, 214043, 105552, 58217]
18190E8217J95948n9366j01008j50085M3447J38287l1408n5853J31857j00221
18180F9815m07321J90711K40608j39440J25581q9508r1863J50052J33062j89746
18170h049l9533j00734J38001Q2476J44044P9027o3712j16810J40060Q857J54325
18159D17952K7393o792J40567K48843j83008j18737P048L6031p3504j46352L7490
18148C86931K4712J72772L40535K98202J25278l10649N6572J91483J60274J58498
18138A604608O0380J63963L80194L84112K54047K03168j60236M814J82147K62170
18128C339367O28023R43289J104191J420189J635392K026832K331179K589361
18120A6017823L993105O258477J0319690J4085409J7226743K1876050K9040599
$$ y = [58217, 254165, 194799, 93791, -56294, -12847, 125440, 94032, 38179, 170036, 69815, -337506, -146795, 93813, -45627, 79954, -9554, -101417, 48635, 181697, -8049, -47582, -148316, -10315, 72161, 216205, 295232, 231520, 114710, 254770, 263627, 417952, 445345, 438553, 579120, 827963, 644955, 526218, 533266, 569297, 495793, 349441, 386931, 411643, 584415, 924950, 1223152, 1348430, 1037781, 1094353, 1285836, 1446110, 1604608, 1664988, 1828951, 2209145, 2593257, 2847304, 3050472, 2890236, 2895050, 3077197, 3339367, 3967390, 4910679, 6014870, 7435059, 9070451, 11097283, 13428462, 16017823, 20010928, 26269405, 36589095, 50674504, 67901247, 89777297, 118817896]
18113A18817896M0024195N5128459O2110005K6903180N948032J7910917k2520447
18106C04322237q4284819p2351925m6976553k9728970j8556440j1961394q118854
18099C2343282n868953m021079l294305k411745k114809j970843j403229r88225
18091A0270094q22859o18356n68564q21718p39684o83743l45262k39960n61858
18082D868090n46990m48000m01842l39099P35O2992p1207j27057p1887k80226
18072B645509j02787k4268k76124k63495N4497J25443J7677o5609p6245k31496
18062A803102o65700j91117K02573M19807O1240k10284N4477k10368l14252J15750
18052A065228J3929j53913j74822J43341M4424J79647J75090J14969j66320o0130
$$ y = [118817896, 158842091, 213970550, 276080555, 302983735, 308931767, 326842684, 304322237, 220037418, 147685493, 100708940, 70979970, 52423530, 40462136, 32343282, 26474329, 22453250, 19158945, 16747200, 14632391, 12661548, 11258319, 10270094, 9447235, 8828879, 8260315, 7438597, 6698913, 6015170, 5669908, 5429948, 4868090, 4321100, 3873100, 3471258, 3132159, 3132894, 3195886, 3124679, 2997622, 2925735, 2645509, 2542722, 2518454, 2242330, 1978835, 2033332, 2158775, 2176452, 2110843, 2034598, 1803102, 1137402, 946285, 1148858, 1568665, 1629905, 1419621, 1474098, 1263730, 949478, 1065228, 1079157, 925244, 750422, 893763, 938187, 1117834, 1292924, 1407893, 1241573, 1181443]
18042A181443m3842m28458k20369R7655L6170K12562R4708l9915K77159k90054
18032H77059m2736J40603j67439k85107M9546P1577l9810R8911k70127K1506K04382
18021F58365J64676k8563m17591k12515P9512K11041K58765p0218k12506n3336
18011C77630N8127J99255J47k27856p5602q6094l2111R1653P2911k7891J46005
18000D96174j45168n0285m9395M1879K14836P3424k72194n0111o4437R4967k5923
17989B63767K6735J69438j49579k9680J83758K22499K26743p033K3564J54691
17979A084903r9793j1722L66124J91292m2772R5864N0495Q1799J3611J12669k73538
17968A568932j36907j98788k62753l22375k2614j47260l43725j35460r4265q4818
$$ y = [1181443, 1137601, 709143, 488774, 586429, 622599, 835161, 929869, 889954, 1167113, 877059, 834323, 974926, 807487, 522380, 571926, 643503, 603693, 702604, 432477, 453983, 658365, 823041, 794478, 376887, 164372, 243884, 454925, 713690, 643472, 430966, 377630, 435757, 635012, 635159, 407303, 331701, 245607, 213496, 305149, 378060, 350169, 496174, 351006, 300721, 251326, 293205, 508041, 581465, 309271, 259160, 194723, 289690, 263767, 290502, 459940, 310361, 280681, 464439, 686938, 913681, 906648, 930212, 1084903, 985110, 973388, 1339512, 1530804, 1488032, 1583896, 1634391, 1716190, 1729801, 1842470, 1568932, 1432025, 1233237, 970484, 648109, 625495, 478235, 134510, -950, -95215, -180033]
17958a80033J05118K55190K54700j9858k23651J27969J83921J18895j13684K54561
17948G63128j22807n3945p4851J08552J62304J03574j43662j29763l26147l09204
17938b2821O9799j75778Q3857J40953j96415n2969k1914K24577J86546R571M4761
17927B90167j0916l8711r6842j2072M34145j14120l92549o3959L20765j7919r7780
17916B00209J14797K6164J26964R1581n0624k51974k06141J35433N3338J36057
17906C75804J99458N3431k89259k46404k73406q7733J81722J1304R7677j63709
17896a41115j14385K52557Q2195k37800l7979K11974J21321K92107j40155n3983
17886B34737J08550j93779N9451J7797j51653k36695r0682K75554J50249k8082
$$ y = [-180033, -74915, 180275, 434975, 415117, 191466, 319435, 503356, 622251, 508567, 763128, 640321, 586376, 511525, 620077, 782381, 885955, 742293, 612530, 286383, -22821, 46978, -128800, -44943, 96010, -100405, -153374, -175288, 49289, 235835, 245406, 290167, 279251, 240540, 143698, 131626, 565771, 451651, 59102, -4857, 315908, 297989, 200209, 315006, 341170, 468134, 559715, 509091, 257117, 50976, 186409, 239747, 375804, 575262, 628693, 339434, 93030, -180376, -268109, -86387, -75083, 22594, -141115, -255500, -2943, 79252, -158548, -196527, 15447, 136768, 428875, 288720, 234737, 343287, 149508, 208959, 226756, 75103, -161592, -252274, 23280, 173529, 145447]
17876A45447k40638N7857J33948K04452N4328k0366O2399j02510j76729K23890
17866C42078j8246j00714N2528J3794k64478J67880J89473k0609J96561J18828
17856F77095j98848P4768l0860q2502o3592j44095j62669O1850N00704J59841
17846G91692l36332k20394P1020P2252j95992N1036k5187k39201k10275j24794
17836c66175J69849J84260K1116j60710K1982K73735J6808j0983m4021P8617J78165
17825C62643p6382O2181J23805l1208j80916r6796j38979n7560J01875k2289j8537
17814B7837J49232j7159M8912J24704K1015Q2867j37251r950j75482O6183j09501
17803G1407Q2797j19703r128R608J89813L12177L2343j45718N1570K8061k02623
$$ y = [145447, -95191, -37334, 96614, 301066, 355394, 335028, 397427, 294917, 118188, 342078, 323832, 223118, 275646, 289440, 24962, 192842, 382315, 361706, 558267, 677095, 478247, 553015, 522155, 439653, 376061, 231966, 69297, 131147, 631851, 791692, 455360, 234966, 305986, 378238, 182246, 233282, 208095, -31106, -241381, -366175, -196326, -12066, 9050, -151660, -129678, 144057, 160865, 149882, 105861, 184478, 362643, 286261, 348442, 472247, 441039, 260123, 163327, 24348, -33212, 68663, 46374, 27837, 177069, 159910, 208822, 333526, 354541, 437408, 300157, 290207, 114725, 180908, 71407, 154204, 34501, 25373, 34981, 224794, 536971, 569314, 423596, 475166, 503227, 300604]
17792C00604k62551L3410J08251j23013j00205l17867R8071L03540k7503J11142
17782A23879K73208j25832j67371R2214n8119P929O560o9068J1262j6931J6081
17771I3812k3173k36822K48928J61224p883P9876j85357j67079J72967J22255
17761B58748l4050l49089k74564k4182j97098J70640J33071K42346K97488l6260
17751A87050k2250j33566Q3373J27988L70554O9555l64482k15764j03931K346
17741H73M00492J34274k34615k18807j49977J02359j3397j30446j04639N4472
17731a59411Q5855O1754r3785P4443k113j13524J09246L15920K13885r9166J16328
17720E09432P5116k96069K2882M4201m17166j94106J58482j58396L2375J33824
$$ y = [300604, 38053, 71463, 179714, 56701, -43504, -361371, -263300, 40240, 12737, 123879, 397087, 271255, 103884, 196098, 137979, 145908, 152468, 83400, 94662, 77731, 93812, 70639, -166183, 82745, 243969, 236086, 315962, 130605, -36474, 136493, 258748, 224698, -124391, -398955, -423137, -620235, -449595, -316524, -74178, 223310, 187050, 164800, 31234, 114607, 242595, 613149, 682704, 318222, 102458, -1473, 873, 401365, 535639, 301024, 82217, -67760, 34599, 21202, -109244, -213883, -159411, -73556, -11802, -105587, -31144, -33257, -146781, -37535, 278385, 492270, 393104, 509432, 584548, 288479, 311361, 355562, -61604, -255710, -97228, -255624, -223249, -89425]
17710h9425M5020M1042K2140J33792K70952l7398p6303o7301l5284J22596r6453
17699B33378L68234J65772j15012k59519q8207l52123N2804N7005q9790J69292
17689A41834R8265r2232J39477J36207k23806j66509l75249L5440J66767P1811
17679f7995M4547M4697j95335J27670M55891J18701l4487L8811K02001j98152
17669E36349m26829l39800j42544J5167K73657K15764j34396L2201J74404J00578
17659C04551k11314N7730q5738J8869l605L232M9555j56509j27495J26651P634
17648a6439L1411k11637p5674K86199J08075l9983q3524J8457o5036j16940m1746
17637b06837N1894p6307p6386k27758J96583P2224m5000O9114L5688j91355L144
$$ y = [-89425, -44405, -3363, 18777, 152569, 423521, 386123, 309820, 242519, 207235, 329831, 233378, 601612, 767384, 652372, 392853, 304646, -47477, 5327, 62332, -27458, 141834, 240099, 147867, 287344, 423551, 199745, 33236, -342013, -306573, -139806, -67995, -23448, 21249, -174086, -46416, 409475, 528176, 493689, 532500, 734501, 536349, 109520, -230280, -372824, -357657, -84000, 131764, -2632, 29569, 203973, 304551, 93237, 150967, 65229, 84098, 80493, 83725, 133280, -23229, -150724, -24073, -16439, 14972, -196665, -272339, 13860, 121935, 81952, -1572, 16885, -48151, -165091, -206837, -154943, -231250, -307636, -535394, -338811, -266587, -311587, -242473, -206785, -398140, -394996]
17626c94996L10634j64608n1128K57646K8548j07233l4363l3219R1081j90352
17616b87990k84748K16897L55921M7981k30147m638p9723J84416J97580p704K0367
17605A28212j14474k3624K40699j85720r391K45457R1603J34414N1255k51939
17595C06492j24508R091p1496J72601l6685j94513P7933q7283j95121J13754Q9329
17584E9594j5122j80808j77957n8195k4515Q0726J94372J06722J59836K3326O8597
17573B36576k79652j39287m4102r1056j18165k8230J48361J61691J64708o6659
17563e5815p0542M9451J49676q2682P2440J0550l09899j88009j5318L64132K8333
17552d7683l6691J63657n4270J03027J64740m3113l9381q535L3834K6359j26320
$$ y = [-394996, -84362, -248970, -300098, -42452, -13904, -121137, -155500, -188719, -97638, -287990, -572738, -355841, 80, 48061, -182086, -186724, -266447, -82031, 115549, 107845, 128212, 13738, -9886, 230813, 45093, 35702, 281159, 372762, 507176, 558431, 306492, 181984, 191075, 119579, 292180, 255495, 60982, 138915, 51632, -143489, -29735, 59594, 44472, -136336, -314293, -372488, -397003, -316277, -121905, -15183, 144653, 167979, 236576, -43076, -182363, -226465, -317521, -435686, -463916, -315555, -153864, 10844, -55815, -126357, -76906, 72770, -9912, 62528, 73078, -236821, -424830, -440148, -76016, -47683, -84374, 79283, 25013, 128040, 292780, 249667, 210286, 201751, 235585, 261944, 135624]
17541A35624j29085K46842K15677O6707j91245j58303l0250K80429k2432r6559
17531C17405l35878j07954j27545j3641m5708P8853J44011P2304l00450N2619
17521b65984L144N6327o071J75397K24364Q5746l5463j15213j17915j28322Q3781
17510d0209N9714o2200j08229K02063R0550q7848j21737j27620J10939j47497
17500b32074k05187j29740M31635K78847j76855J41594j76588k3771J64624K1453
17490I3938q9216J65406J53711l6211R3892J9644j05011J43627K4873k70756j24196
17479F9701j91311p5504j35250l49805J62774M78108J54754K3442j33057j72743
17469a68891j03117p856J0820j9283M7692J15630K16077l9356k06792q1450k0342
$$ y = [135624, 6539, 253381, 469058, 535765, 344520, 186217, 155967, 436396, 413964, 317405, -18473, -126427, -253972, -267613, -313321, -234468, -90457, -18153, -318603, -265984, -262840, -206513, -212584, -37187, 187177, 272923, 237460, 122247, 4332, -123990, -40209, 19505, -42695, -150924, 51139, 141689, 53841, -67896, -195516, -84577, -232074, -437261, -567001, -135366, 143481, -33374, 108220, -68368, -92139, 72485, 93938, 4722, 170128, 323839, 287628, 381520, 401164, 296153, 439780, 464653, 193897, 69701, -121610, -197114, -332364, -682169, -519395, -41287, 113467, 136909, 3852, -168891, -272008, -279864, -269044, -288327, -240635, -125005, 91072, 51716, -155076, -236526, -256868]
17458b56868o5280j0709k01356M4837K90628K26805O5036J04692L88718j55856
17448D30647k69076K13224M45215K99049L86073N6466P1141L6323m54231l08638
17438I06193l4859j54173j61882J24716j28697l17012j77241J62030R9230q6073
17428B32232j81799j24759j23140k74140J64700J09362M10258L95262j24573M7711
17418E31114p6477r7851J21373m24557k15657Q9028K43670Q7364k06729j67661
17408a16383L878j13817p5268j30043M0574q2169J24922P5528k7559K02400j28313
17397b26250o4774M31961Q002k36440j063k02339k89580J28311J80891P64j98403
17386d68920J90204K78157j85233K63869O9378k17603k07082m2989J14214L83050
$$ y = [-256868, -322148, -332857, -534213, -489376, -198748, 28057, 93093, 197785, 586503, 430647, 161571, 374795, 820010, 1119059, 1505132, 1561598, 1632739, 1669062, 1214831, 906193, 871334, 717161, 555279, 679995, 551298, 234286, 57045, 219075, 318305, 232232, 50433, -74326, -197466, -471606, -306906, -197544, 212714, 607976, 483403, 531114, 454637, 356786, 478159, 53602, -162055, -73027, 170643, 258007, 51278, -116383, -112505, -226322, -301590, -431633, -391059, -473228, -348306, -272778, -300337, -97937, -226250, -291024, 140937, 148939, -87501, -88564, -290903, -580483, -452172, -271281, -270517, -468920, -278716, -559, -185792, 78077, 147455, -70148, -277230, -320219, -206005, 177045]
17376A77045j56739k08587j71127k8823R9246J31254q3155m12359o399J13931
17366e45713q2518J42542L06557m1447k33578l36760N7813L0933L07298k6482
17356d21355Q9531M1154k11349m3319K43902Q7675J45312J38075K33184j9844
17346B82966k93489K3350j22558K27751j34448q1693L5143K88171n4278k16508
17336d5593Q102N6295J44514N2522j25311M7795q5486K2579Q7422P4371N0773
17325B87983m2906p4197J07313J98863m35216j10581J81303R4277k9291p1782
17315A05766R0583k03694j13950R8359N2542M202l27174j5916K13363o3464l7556
17304a96939K3773J07786P3312J13716J81899k71229j29629K36241m7599o6630
$$ y = [177045, 20306, -188281, -359408, -388231, -288985, -157731, -240886, -653245, -659644, -545713, -628231, -485689, -179132, -220579, -454157, -790917, -733104, -702171, -394873, -421355, -331824, -290670, -502019, -545338, -301436, -213761, -68449, 69626, 302810, 282966, -10523, 12827, -109731, 118020, -16428, -98121, -62978, 225193, 170915, -45593, -37491, 18804, 163318, 215840, 90529, 138324, 52838, 75417, 162839, 237210, 287983, 245077, 170880, 278193, 477056, 41840, -68741, 112562, 206839, 177548, 105766, 196349, -7345, -121295, -22936, 29606, 33808, -293366, -309282, -95919, -159383, -196939, -173166, -65380, 7932, 121648, 303547, 32318, -97311, 138930, 91331, 24701]
17294B4701p0286j98366j97306K0519K24125K51595j66170j98566N392J44965
17284a59397K15476O8800j23149l9084K6092q3833j09555L401L2283J15250p3604
17273a27320J05923J4089m5632R1998K43157j38037l13348J7774j29223l813K92155
17262G723K53788k16649Q869J50144k2967j35208Q4874p2559J8086R9930R8868
17251B74899o5311j8247P6875L42990j68017k41847k56358j82354j27766k4984
17241c90120j14788K0304J18488Q1592L6643O7847J16858L67414l1706l67494
17231i4962q4605M1288j56307k65910K14466K27319K03656K70564M1591o0286
17221C36814l08151J26145K07536J25973q1689m04167m6794K9658n091K58143
$$ y = [24701, -45585, -243951, -441257, -420738, -196613, 54982, -111188, -309754, -304362, -159397, 56079, 124879, 1730, -37354, -11262, -95095, -204650, -201249, -168966, -53716, -127320, -21397, -7308, -52940, 39058, 282215, 144178, -169170, -151396, -280619, -284432, 7723, 261511, 44862, 53731, 203875, 180908, 45700, 130574, 58015, 76101, 176031, 274899, 209588, 191341, 268216, 611206, 443189, 201342, -55016, -237370, -365136, -390120, -504908, -484604, -366116, -284524, -247881, -180034, -63176, 304238, 272532, -94962, -179567, -138279, -294586, -560496, -346030, -118711, 84945, 355509, 397100, 336814, 28663, 154808, 362344, 488317, 406628, 2461, -44333, -14675, -19766, 238377]
17211B38377J30516o5548R9001K14719J21820j08635o4324k16257n6656l33445
17201d0432J20309K5783k97121l8464N8508J97434J24122J21041J64507j58674
17191B77013k48351m0364K8076N0116L9745J48396K32259J33549J94500r0375
17181G24564l09389j31051N9945o4474j59051K9842O334n717L0284q4100J5474
17170A12661k02037L7073Q1836j221p9238J37123J82231L63134j34313l07565
17160A89684j3247j5955j79779L4541J54335J56550p0178l66j60193J42416q7390
17149A50418o1712O7038J04701N6325j29467k3323m6355j70498j01119J72007
17139A8015L4086p496N6129J7067M7234j48363j03144o2670J16838j5508j61216
$$ y = [238377, 368893, 303345, 402346, 617065, 738885, 630250, 565926, 349669, 293013, -40432, 79877, 105660, -191461, -229925, -171417, 26017, 150139, 271180, 435687, 277013, 28662, -11702, 16374, 66490, 106235, 254631, 486890, 620439, 814939, 724564, 415175, 284124, 344069, 279595, 120544, 150386, 156720, 151003, 181287, 97187, 112661, -89376, -52303, 29533, 28312, -50926, 86197, 268428, 631562, 497249, 189684, 176437, 160482, -19297, 15244, 169579, 326129, 255951, 255585, 95392, 237808, 150418, 88706, 155744, 260445, 316770, 187303, 163980, 117625, -52873, -153992, 18015, 52101, 44605, 100734, 117801, 165035, 16672, -86472, -149142, -32304, -47812, -209028]
17128b09028J03124P7917r9856P1025P9812L1454R0567K3446P4490j17408k35403
17117a09860j22740J23261n3727M5475r579L4510K18955M7389J2878J23975l8912
17106B71625p5462o4277j80070k51431j55564J4201J74328O4848K31422k3208
17096F412k04725O681q5819L8984K46517Q1802J71968j59175k62625J90575K908
17085C3503j65577J44362r0363q4881k29896m5875J7430J1898j74405N0488n4620
17074e87936j23813K53521K66210n232R7871j02622l6018q2371M5271J3375j69114
17063d30858L52577J4747J17687K5298J07470j79191k94980Q8602K12077L0563
17053D3992l14013R0399L26420R2037K2429k11604P3808j68681j00019M170Q8193
$$ y = [-209028, -105904, -27987, -127843, -56818, 22994, 54448, 145015, 168461, 242951, 125543, -109860, -232600, -109339, -163066, -117591, -127170, -92660, 126295, 173684, 186562, 310537, 271625, 196163, 131886, -48184, -299615, -455179, -440978, -266650, -201802, 29620, 6412, -198313, -191632, -277451, -238467, 8050, 89852, 261820, 102645, -159980, 30595, 33503, -132074, 12288, -78075, -162956, -392852, -438727, -421297, -409399, -583804, -533316, -587936, -711749, -458228, -192018, -197250, -99379, -202001, -238019, -320390, -275119, -261744, -430858, -78281, -63534, 54153, 79451, 186921, 7730, -287250, -198648, 13429, 43992, -270021, -179622, 146798, 238835, 261264, 49660, 123468, -45213, -145232, -141062, -52869]
17042e2869j05380l3645N9890O0477p8772J23217K03636k47091j24728n8796K08994
17031d5067j25432K35091K64683j91989j36486n8926j4509j21704j13438K06502
17021a01275N3339n176m9565p7261P4934R2065k30223j02851k4021m1583J23128
17010b88489M9929j13757J67017L58606M5510j82734J6837M38706j3447j60280
17000C17898Q1936J18306M8181P6345k46026j68240K3319j98332N0729m7605j38605
16989h2094K32410r1728k28052j10625J20017M41671J2625j99757J74681J82855
16979D52003l0828j95538j37164j40796N329K85999P3029J12028L0332j98043
16969B56351j4298J31106k9804p5385O7289r6633J74319p5760j76125O37O3487
$$ y = [-52869, -158249, -191894, -132004, -71527, -150299, -27082, 176554, -70537, -195265, -254061, -45067, -170499, 64592, 329275, 137286, 800, -58126, -72635, -194339, -307777, -101275, -47936, -53112, -102677, -179938, -105004, -12939, -243162, -346013, -370034, -411617, -288489, -238560, -352317, -185300, 173306, 218816, 36082, 52919, 491625, 478178, 317898, 399834, 518140, 566321, 642666, 396640, 228400, 251719, 53387, 104116, 56511, -82094, 150316, 58588, -169464, -280089, -160072, 281599, 294224, 94467, 269148, 452003, 421175, 225637, 88473, -52323, -46994, 239005, 312034, 424062, 454394, 256351, 242053, 373159, 343355, 267970, 335259, 238626, 412945, 337185, 161060, 161697, 225184]
16958B25184p0649k5512j3764L79674n6962m38064K6141k24046J85315K40747
16948B28064m97451k75219K38978K86288K54091J00552j16519j42748j43118j08783
16938a75865R2605J66996K2378j72419q9908K43328J21078q6875J82351l13263
16928i594R124J07603k23468k26201J06546K3338J04569R6541K30290q6480r0879
16917D1389m9239j57651j82905K04213J04092l518J64955L60214n8729K02163
16907F24984M2687j51524j90917k58003j41403K14709K27968P7214J47450j05838
16897D87327j39612J10150K18784m19862j93287k0629J64406J29365K36897k11432
16887C62107m30996j96570P4546M3291K74574J97595k56081j95695k07766k8624
$$ y = [225184, 154535, 129023, 115259, 494933, 437971, -93, 26048, -197998, -12683, 228064, -269387, -544606, -305628, -19340, 234751, 335303, 218784, 76036, -67082, -175865, -83260, 83736, 106114, -66305, -156213, 87115, 208193, 121318, 303669, -9594, -470, 107133, -116335, -342536, -235990, -212652, -108083, -11542, 218748, 132268, 41389, -7850, -165501, -348406, -144193, -40101, -43619, 121336, 481550, 422821, 624984, 667671, 516147, 325230, 67227, -74176, 140533, 368501, 445715, 593165, 487327, 347715, 457865, 676649, 256787, 63500, 42871, 207277, 336642, 573539, 362107, -68889, -265459, -190913, -147622, 126952, 324547, 68466, -127229, -334995, -363619]
16877c63619K22149N7347o6620p5934q7425M7733l20673J19569K84388J68043
16867a5042J09982o4955n2431J45442O4515n4963j38255j81313J05049L0107Q0649
16856B8785N1544K29180K41491O2367k36760k03216J9871k95293q3940l4586j7870
16845b38427K89852J82576J9173k57166o6131n6888O8359L9536M7585J05843K49013
16834C83325N0431l34926k24462J34744p9036n2946o8167J69876K12759j47761
16824D3837k57838J64491J83126q9257l79492J82609R0131P0894j64733O218M5340
16813a04674k7767n303j61792r3449K20835J06633J3706o491o4565j50624K02271
16802g1220K98616j01681m957m9256r2479q8382j19994O4070R038J26845K0880
$$ y = [-363619, -141470, -84123, -150743, -226677, -314102, -266369, -587042, -467473, -183085, -15042, 94940, 29985, -22446, 122996, 187511, 132548, -5707, -187020, -81971, -51864, 28785, 80329, 309509, 551000, 613367, 376607, 173391, 193262, -102031, -185971, -220557, -238427, 51425, 234001, 253174, -3992, -70123, -127011, -58652, -19116, 28469, 134312, 383325, 433756, 98830, -125632, 9112, -69924, -122870, -191037, -21161, 191598, 43837, -214001, -49510, 133616, 44359, -335133, -152524, -62393, 8501, -156232, -150014, -104674, -132441, -137744, -299536, -392985, -172150, -65517, -51811, -58302, -122867, -273491, -71220, 227396, 125715, 120758, 71502, -20977, -109359, -229353, -165283, -156245, -29400, -8520]
16791h520J15420n916j60902k3067j22868j18551P441P3772O8139l29554J41533
16780c63073J84907K32756P8234q0769J53417k62208R882M8099L8259r8138L20616
16769B61982J19221r4038j87048q5232q7115j11999p8975J41579L00860L23387
16759E02622r9308k08941j23828j16141P4209j04490R8083R9111R4889L6545q8607
16748A64144j57636l58780k29034K57667K40108n2284k64283o1548K6427J91457
16738b43762K30220J00936J94515j09641J12257J28904l06742j38326l0033N4654
16728g018J07263K0053j9316K8315P1546o2217M0451j20674j24094L2359J11985
16717G8653j06146j21467J84876m6552j27121J76085J99592k23082j49071j40089
$$ y = [-8520, 106900, 100984, -59918, -82985, -205853, -324404, -316963, -243191, -175052, -504606, -363073, -178166, 54590, 132824, 52055, 205472, -56736, -46854, 1245, 39504, -58634, 261982, 381203, 287165, 100117, 14885, -72230, -184229, -263204, -121625, 179235, 502622, 403314, 194373, 70545, -45596, 28613, -75877, 22206, 121317, 216206, 252751, 164144, 6508, -352272, -581306, -323639, -83531, -135815, -400098, -461646, -435219, -243762, -13542, 87394, 281909, 172268, 284525, 413429, 106687, -31639, -61672, -7018, 100245, 120298, 100982, 129297, 200843, 138626, 179077, 58403, -65691, -33332, 78653, -27493, -148960, 35916, -10636, -137757, 38328, 237920, 14838, -134233, -274322]
16707b74322m2693L7972O0012J17892o1817O8219J24229M5280J32825N1715o1939
16696A97373j4344m6271l3253j48873q0667O2041R0450J93497O3171J83877j25230
16685C41771k76534r6548L9413k16672j64365o9203J02858Q6327K09584J51067
16675A07698K23769J06129L932j51167l50173j38158P735K36164k12853j29546
16665b96470K67491L97430J20744K99r2892k28876k13260m6069J71709R9404n9243
16654A20267o7947k67927j25905J20757J73437k8676j34787J57696K51011Q6753
16644B84679j33109k44320o8717O7911J41237J63920o8808l31905O7443R5531
16634b6138M2431k9263j28047j54329K6650J5801J80542P2791K069j4800j96361
$$ y = [-274322, -317015, -279043, -219031, -101139, -162956, -94737, 29492, 74772, 207597, 259312, 197373, 183029, 136758, 103505, -45368, -126035, -63994, 26456, 219953, 283124, 467001, 341771, 65237, -31311, 8102, -208570, -372935, -442138, -339280, -252953, -43369, 107698, 331467, 437596, 441528, 290361, -59812, -197970, -190235, 45929, -166924, -296470, -28979, 368451, 489195, 489494, 396602, 167726, -45534, -91603, 80106, 179510, 120267, 52320, -215607, -341512, -220755, -47318, -75994, -210781, -53085, 197926, 284679, 151570, -92750, -161467, -93556, 47681, 211601, 142793, -189112, -121669, -26138, 16293, -12970, -141017, -295346, -268696, -252895, -72353, 438, 2507, -12293, -208654]
16623b08654J6995L30378K52990j88121j09516j58373m28098J34786K53031j898
16613a06480K34003j43893l04385J94136J00251j08178K355j60994J37614j81478
16603c37049j0744j23274J47070q1527M461J7620J27500M44120J4771j69721r307
16592B3920j49605J56868j36789j16422L26920P0397j61909q63K24274J09773
16582C46564q0871O3269l2749J89510J89003j96139o3263l5461k25683j60141
16572e961n3724J04321l7436K88875j8061j03653m8398J36200O1850o4789j35701
16561A23523k74460j32470J80486J18453J8324k91687k8150L63096J39592o0712
16551A55995K6336k06512K5727J76061p6515k31247m1749q5254L7553J07658k49174
$$ y = [-208654, -191659, 138719, 391709, 203588, 94072, -64301, -492399, -357613, -104582, -106480, 127523, -16370, -320755, -126619, -26368, -134546, -132191, -293185, -155571, -337049, -347793, -471067, -323997, -405524, -401063, -383443, -255943, 188177, 202948, 33227, 23920, -125685, 31183, -105606, -222028, 104892, 175289, 13380, 12517, 236791, 346564, 265693, 328962, 296213, 485723, 674726, 478587, 415324, 379863, 154180, -5961, -59685, 44636, 7200, 296075, 278014, 174361, 125963, 262163, 324013, 259224, 123523, -150937, -283407, -102921, 15532, 33856, -257831, -285981, 77115, 216707, 155995, 182331, -24181, 1546, 177607, 101092, -130155, -171904, -257158, -219605, -111947, -361121]
16540c61121R3059J08716n076q5674J8435o7796J56897J6995o0331K72753R0961
16529A77818j87816K00193m9296k48084K9527j26769k11236o441J62293K99804
16519C9993J97756J29596J29234O5270p3376j62680j68673m1943m9173k85435
16509b19431l01108j36865Q9407J41201m8400K42949M66157J23513j80505m3365
16499A33553m71442k6687N1872j70412K9599J70876O9798j27283j82713j93047
16489g15886M60090M67388K28563k33083j65349j01511j77236J58441J80979l0446
16479G1950j09760j75770K7494M18171J88581O3630O9497j75504k60061J14213
16469B32441l59822M6334J04040k37345j21145P9792q183Q5884J06587L9527N7393
$$ y = [-361121, -268062, -159346, -164422, -250096, -231661, -299457, -142560, -125565, -185896, 86857, 177818, -9998, 190195, 140899, -107185, -77658, -204427, -415663, -422104, -259811, 39993, 237749, 367345, 496579, 561849, 488473, 325793, 157120, 115177, 66004, -219431, -520539, -657404, -567997, -426796, -475196, -232247, 233910, 357423, 176918, 133553, -337889, -364576, -312704, -483116, -453517, -282641, -212843, -340126, -522839, -715886, -255796, 211592, 440155, 207072, 41723, -59788, -237024, -78583, 102396, 71950, -37810, -213580, -186086, 232085, 420666, 484296, 553793, 378289, 118228, 232441, -127381, -81047, 22993, -214352, -335497, -255705, -263888, -178004, -71417, -31890, 25503]
16458B5503P9100k9815l59789R7555L65787j71767k17944N6655Q4723M0844L2105
16447B957m8295N7129p0172J09014K6634J27266j9930k35252n8325k49086j42600
16436e00660J20759j1771m2659J04559J54585J47475Q7812j08615R8572L6672
16426H6729Q2660Q2898j19795k15840J83776R7543j3270J70111M6820j4258J27127
16415E14501K837J14873J58199J2177k72277m05121r5329K9230N9962O6109j97024
16404a1863j25739j05005J58828J14155M8288n9881p6972J00932K11719N6468
16394C10930m8153q4158l54268l12674K77394K00671L1192L1844j57J11729j30936
16383C3414j24892K69384n094p2326j54375o2915j61192M4871Q8532Q3969l5854
$$ y = [25503, 104603, 74788, -285001, -187446, 178341, 6574, -211370, -154715, -69992, -29148, 2957, -45338, 11791, -58381, 50633, 77267, 204533, 184603, -50649, -108974, -358060, -500660, -379901, -391672, -434331, -329772, -175187, -27712, 60100, -48515, 50057, 86729, 169389, 252287, 132492, -83348, 100428, 197971, 184701, 354812, 401632, 387374, 514501, 517338, 632211, 790410, 802587, 530310, 125189, 29860, 59090, 119052, 185161, -11863, -137602, -242607, -83779, 30376, 78664, 18783, -58189, 42743, 254462, 310930, 262777, 178619, -175649, -488323, -210929, -10258, 20934, 52778, 52621, 164350, 33414, -91478, 177906, 172812, 100486, -53889, -116804, -277996, -233125, -144593, -60624, -96478]
16372i6478J5511q5762r0259r8741q0497K42436L50308j05692j39383l4799K3795
16361i9561P2379j92r8177o0310J17158j88245K4090J1840J53399k8345j14033
16350b09997J79791n0738l19003q5158j3954M0125J85766J98803n1789j1259R8789
16339c8624P6772k5530j16924j06165k9072K48980k23133l6391O0674n2824l5864
16328b78101K48907P7624k29057J21908j2330k37245r1676L8633k28244Q7248
16318e02333K71311n3925j11503J58519l1425j37433J07603J75746N3464j00690
16308a70666j17547J74271L02033K12333l4501J1565j73949P1441k09242j56069
16298i0331J71174j1228m1133O0484k1582M5847o4636j25797k48932j52905K17304
$$ y = [-96478, -80967, -166729, -256988, -355729, -436226, -193790, 156518, 50826, -88557, -123356, -99561, -27182, -27374, -125551, -185861, -68703, -256948, -232858, -221018, -67619, -95964, -209997, -30206, -80944, -399947, -485105, -499059, -458934, -273168, -74365, -126154, -137413, -38624, 38148, 12618, -104306, -210471, -239543, 9437, -213696, -250087, -189413, -242237, -278101, -29194, 48430, -180627, -58719, -71049, -308294, -399970, -361337, -589581, -502333, -231022, -284947, -396450, -237931, -269356, -406789, -299186, -123440, -69976, -170666, -288213, -113942, 188091, 400424, 365923, 377488, 203539, 274980, 65738, -90331, 80843, 69615, 28482, 88966, 67384, 113231, 48595, -77202, -326134, -479039, -261735]
16287b61735L11587k5594j28857j11440J09567K12102J51897j75763R3297J41310
16277C16371L9891n09109k5693K83735j70328p46K02631J56947j58772n0735Q6319
16266A70511L73339L7912j14096m98233k08703K55518M27539j608j07100l50104
16256a5025j05241J3206k2198l09491j65549p2510P6839K29535J92051J772P577
16245a69034N5687M487O5135m0743j09977K04970J63494j86329K92796K76382
16235E56868p4516k89228n3929j46607k72997j60199K63514Q2617j74365J2746
16225b56096r2067j45296K45802M8196Q2813M29013J90950j56002k09665q2521
16215E5127k22686K0K45606J67121j02829q9391P6277j35151J43622J47714k40434
$$ y = [-261735, 49852, 24258, -104599, -216039, -106472, 105630, 257527, 81764, 175061, 316371, 356262, -152847, -178540, 105195, -65133, -65879, 136752, 293699, 134927, 84192, 170511, 543850, 581762, 467666, -30567, -239270, 16248, 443787, 442179, 335079, -15025, -120266, -107060, -129258, -438749, -604298, -676808, -599969, -370434, -178383, -176611, -169034, -113347, -108860, -43725, -84468, -194445, 10525, 174019, -12310, 280486, 556868, 482352, 193124, 139195, -7412, -280409, -440608, -177094, -94477, -268842, -256096, -348163, -493459, -247657, -199461, -116648, 312365, 503315, 347313, 137648, 55127, -167559, -167539, 78067, 245188, 142359, 52968, 129245, -5906, 137716, 285430, 44996]
16204D4996k6317p9855q3526K18836J35144k92716L22692J44408j97769p2880
16194A13013j08288j57915J38070k36792j59358K08940J14798k8070j30773L93691
16184A47316j8956j70779m7334k9657j08175q6740K28654J50109j78490j28371
16174b42423k62694k09915L81851K74456m5912m552R107M1049j92395k8250P6749
16163b02929J43926J57503r1366n9124J30806r3738l031n3190q7565K8165K57956
16152A27413k92794l28306J39722J35682N4163M10275K12884M8003N6550J00204
16142F63796l58882j19272K75966o4517j84060j97957J86385J54419l05449p7440
16132b7011L1895k08284q9313J39160r2243j7603j34101P3510J18975K30438j08697
$$ y = [44996, 18679, -61176, -144702, 74134, 209278, -83438, 239254, 383662, 185893, 113013, 4725, -153190, -15120, -251912, -411270, -202330, -87532, -115602, -246375, 147316, 128360, -42419, -89753, -119410, -227585, -314325, -85671, 64438, -114052, -242423, -505117, -715032, -333181, -58725, -104637, -109189, -100082, -59033, -251428, -279678, -202929, -59003, 98500, 7134, -51990, 78816, -14922, -17953, -71143, -158708, -130543, 127413, -165381, -493687, -353965, -218283, -164120, 246155, 459039, 507042, 563592, 663796, 304914, 185642, 461608, 397091, 213031, 15074, 201459, 355878, 50429, -27011, 4884, -203400, -292713, -153553, -245796, -263399, -397500, -323990, -205015, 25423, -83274]
16121h3274j51240Q0362J14107m482k32699Q0243M0190o3475L3465K57573R0869
16110A61639O8779o9209r1637k40994k42566J0436J67386q5778J93055J85347
16100E6458n4361j62800l51005k36075N6742P7754K97748L49237K28802k04468
16090E8032J98237M6571p6190m0137K55791j31518k05623R2901J94576j08886
16080B83754j37806k56407J93777k49474m513j61346N5577L6927j40505r8149
16070d78165K10963K27135n6192j97921K14257J10030J67628J76846k5898R6395
16060D45078l20962k92129J37501O0055K3063k85510o0411K05084J25789q9365
16050e1807r4737M8418K19924K83835J48620m8840k94987l66703J5759j06789
$$ y = [-83274, -234514, -154152, -40045, -44527, -277226, -196983, -156793, -220268, -186803, 70770, 161639, 230418, 161209, 69572, -171422, -413988, -403552, -236166, -321944, -128889, 56458, 2097, -160703, -511708, -747783, -691041, -613287, -315539, 33698, 262500, 58032, 256269, 302840, 226650, 186513, 442304, 310786, 105163, 198064, 392640, 283754, 145948, -110459, 83318, -166156, -170669, -332015, -276438, -239511, -380016, -478165, -267202, -40067, -96259, -294180, -79923, 30107, 197735, 374581, 348683, 445078, 124116, -168013, -30512, 29543, 52606, -232904, -293315, -88231, 37558, -51807, -146544, -98126, 121798, 405633, 554253, 505413, 210426, -156277, -140518, -247307]
16040b47307O173J63643r9426j93772N2684K21781J66659P3226J34149K12694
16030D90504j69296k35530L0684l5778j9144p3048J06265j20409j38065k2512
16020a86329K94062j2502k87345k37522n5253K44888J14857p9388J31784J8028
16010e4720P2216j55659J04361O1431N642o1156m080R9497K26510m6237l44206
15999i6401k28903J10789n8494J37183K74541r8509N9576J287M1320J81536K3742
15988C47667k15125j96128n2279o8445J82919r438k20946q0213K78649K54379
15978B21040k33536j31788K73216k222K46230J34624l8370k59689q9257r4504
15968B5744K61429o2682k74337m4830M23721J01407m75647l3159P1266r0259p8264
$$ y = [-247307, -241134, -77491, -176917, -370689, -318005, -96224, 70435, 143661, 277810, 490504, 321208, 85678, 116362, 80584, 61440, -11608, 94657, -25752, -163817, -186329, 107733, 95231, -192114, -429636, -484889, -240001, -125144, -204532, -72748, -54720, 17496, -138163, -33802, 27629, 33271, -27885, -31965, 67532, 294042, 247805, -96401, -325304, -214515, -273009, -135826, 138715, 40206, 99782, 101069, 142389, 323925, 347667, 132542, -63586, -115865, -184310, -1391, -10829, -231775, -311988, -33339, 221040, -12496, -144284, 128932, 126710, 372940, 507564, 469194, 209505, 120248, 25744, 287173, 224491, -49846, -94676, 329045, 430452, -45195, -78354, -7088, -97347, -175611]
15957a75611K35462K54649K11944k29537k46898j8459P7453R1560K47864K4837
15947D73264p1627k52983k17926J90409Q9701k37361p6124l1301j16480K45990
15937d438M10339k8794k77959j84001K8706J10319L336k22770j54201J1974J90652
15926a16837M8592M8848l7694P515L14412M04411J35243l89668k98741m04436
15916b88355j0772L12513J0351r5645k2690P307j47399j26719J22716n2598J83134
15905a08157J20237K00895k19973P9783N9937J7194P0278j35185k87579j01008
15895c03578k51044K14742K15983J8869j20073L7550K11526j22387N5186N6237
15885A3011o7199q7592R4431o473Q771j08514m25639J16734L15908J18398j27217
$$ y = [-175611, 59851, 314500, 526444, 296907, 50009, 31550, 109003, 200563, 448427, 473264, 401637, 148654, -69272, 121137, 210838, -26523, -102647, -133948, -250428, -4438, 405901, 377107, 99148, -84853, -56147, 54172, 57508, -165262, -319463, -307489, -116837, -68245, -19397, -57091, -49576, 264836, 669247, 804490, 414822, 116081, -288355, -299127, 13386, 23737, -71908, -94598, -87291, -234690, -361409, -238693, -291291, -108157, 12080, 212975, -6998, 72785, 132722, 149916, 220194, 85009, -202570, -303578, -554622, -339880, -123897, -105028, -225101, -187551, 23975, -98412, -43226, 13011, -54188, -141780, -47349, -53822, -45051, -153565, -579204, -462470, -146562, -28164, -155381]
15874a55381J01327j92300J07416J12260k10456q0452l7963J26846P488r4936
15864c16151J9572J90393J63726Q5164k63493j54980J81547J65640j43472J02573
15854C0519n7281j54967J31155L32284j07487j33548J00284Q5901K16703j12797
15844C30766k94406l18500l00999K79435l4687j64586J84365L28515K75389J0843
15834B96135k34861q7097O6738j9229J8375P4682r2851k64782Q9835r8070M7019
15823b04106K55440O9296j03989o6678L4380N7833L3234J75554J53294n4417j36700
15812B13141k41654p8306O2943O1909J97051j76223p5654M2561j52704J1200j84599
15801c20335k05474L68462L15787j35444k9536l89834j68877L84898M40686o6566
$$ y = [-155381, -54054, -246354, -138938, -26678, -237134, -317586, -355549, -228703, -221215, -316151, -296579, -106186, 57540, 142704, -120789, -275769, -94222, 71418, -72054, 30519, -26762, -181729, -50574, 281710, 174223, 40675, 140959, 226860, 443563, 330766, 36360, -282140, -583139, -303704, -338391, -502977, -318612, 9903, 285292, 296135, 61274, -25823, 40915, 21686, 40061, 114743, 21892, -242890, -153055, -251125, -204106, 51334, 120630, 16641, -50037, -15657, 42176, 75410, 250964, 404258, 349841, 213141, -28513, -106819, -43876, 18033, 215084, 38861, -36793, 5768, -146936, -135736, -320335, -525809, -157347, 158440, 22996, -6540, -396374, -565251, -180353, 260333, 193767]
15791A93767j76939j85811q5620r6221J86056M4989l426J8478j1034k86364J33261
15780b68864k024J87863O7564m5141j16225j86412K47971l11k40949j2606k611
15769c71745k00727Q6633O11040n7680k69939K00359j18704P0314J39837r356
15759H0032p7193j63111J10578n7907j55505J30113N6429K05112j38573M558J97670
15748A92203j86607J77537p9236k49811J22564n5148n8802q830j6913K98758K04345
15737C40060M2114j98565n5019m5194j46041j45109j88139R9734K08352q5350
15727a73157N1707m01373J17718M2661J80873j61639k22702O9258k12661K36737
15717d72578P0884K75114J86255q1857r4248R2651J1274m00119J2477J32139o6336
$$ y = [193767, 16828, -168983, -254603, -350824, -164768, -119779, -123205, -104727, -115761, -402125, -268864, -270888, -83025, -15461, -60602, -176827, -363239, -115268, -115579, -356528, -369134, -371745, -572472, -485839, 125201, 67521, -202418, -2059, -120763, -50449, 89388, 80032, 2839, -160272, -49694, -107601, -263106, -132993, -76564, 128548, -10025, -5467, 192203, 5596, 183133, 103897, -145914, -23350, -78498, -137300, -146130, -163043, 135715, 340060, 382174, 183609, 128590, 83396, -62645, -207754, -395893, -296159, -87807, -173157, -121450, -522823, -405105, -362444, -181571, -343210, -565912, -496654, -709315, -472578, -401694, -126580, 59675, -22182, -116430, -23779, -12505, -412624, -400147, -268008, -334344]
15706c34344R7037M0283K2321K25396N9102m0215k21057l1150L37769q643j73073
15695b6574M4680J61955K689j35764j18786j07956K27920j49349Q6139o9353j14551
15684a98950J06487m9456m07354k08784L8304J70103K43342J61651K5920J31228
15674A2491K2320J21595m9750j45937j2460q7492j8748L84533M8677o16J54181
15663D28794m6223k92701J34168J62652j30782l65277q9789J63325L45562k5348
15653B84381j83250j4290L04559R1515j28645k45845j38320j02003k9129j05946
15643b66973M41788M09k53943r7297J80815J09066p8991n3597n990j8135K6879
15632a5969K94948j11587k56182j50674J07908J70934k03187j47975M7622j33690
$$ y = [-334344, -237307, -197024, -174703, 50693, 109795, 69580, -151477, -182627, 155142, 146499, -26574, 18106, 180061, 182750, 46986, -71800, -179756, 48164, -101185, -15046, -84399, -198950, -92463, -141919, -549273, -758057, -719753, -549650, -306308, -144657, -118737, 12491, 34811, 156406, 106656, -39281, -51741, -139233, -157981, 226552, 275229, 274613, 428794, 382571, 89870, 224038, 386690, 255908, -109369, -199158, -35833, 309729, 284381, 101131, 86841, 391400, 482915, 354270, 108425, -29895, -131898, -161027, -266973, 174815, 175224, -78719, -176016, 4799, 113865, 34874, -18723, -24713, -42848, -15969, 278979, 167392, -88790, -239464, -131556, 39378, -163809, -311784, -264162, -397852]
15622c97852n7635q438J53069N5542J35315J95852N88j61395j42521j55190K94702
15611h7963O7206j35003P3813J42415j79925l9452J98647j90887k56701R4432
15601c13418J38495j63605K0681J15060J70593R6207m540K41139j09205j30033
15591F1374O8813l96562J22256K17124L00834Q5693k82414k90675j19478J60841
15581g2194j60030j48148J11013K19053R4923n8689m7498o4208J01793K9056O5550
15570G0621J70689p4749k33118k127m7798M8721N5240k35821q4089O4065M23952
15559A55586R4078K2345j06890k44654L9378Q3751K71404j04459j15928l31008
15549b36397J15259O4693K07665j20777k51412j22697p8617K35535J39245q4644
$$ y = [-397852, -455487, -463925, -310856, -255314, -119999, 75853, 76441, -84954, -227475, -382665, -87963, -20757, -155760, -81947, 60468, -119457, -158909, 39738, -151149, -407850, -313418, -174923, -338528, -317847, -202787, -32194, 64013, 59473, 300612, 191407, 61374, 130187, -266375, -144119, 73005, 373839, 459532, 177118, -113557, -233035, -72194, -232224, -380372, -269359, -50306, 44617, -14072, -61570, -125778, -23985, 5071, 70621, 241310, 166561, -66557, -68684, -116482, -67761, -12521, -248342, -332431, -268366, 155586, 249664, 272009, 165119, -79535, -40157, 43594, 314998, 210539, 94611, -236397, -121138, -56445, 151220, 30443, -220969, -343666, -422283, -186748, -47503, -132147]
15539a32147O1718O3501k30531K00034L6156k27696j27408K30420K1603N4068
15529e0282J2794j02216J64933j28218J25260L04289K69248j12905k60566r2110
15519A30227k37803j69580J17939N4285j71385J62531L16614q0180J06213J23638
15509C52499k64468j80465j65279k39558k04740K10300r643J05451J87520J52139
15499e6244K6798M1790K12689J46738k70699j87851O3689J67244l33291j31119
15489c20256o9198Q0599k9942j51470J64739Q7349R5658J61061J47673J70361
15479C36574O1414j29052k57334k57018L5438J03945L7317l77240O5114J45774
15469b35068k1653o082J1187K7114p8213l6051N5626k9919J20360L9925J55283
$$ y = [-132147, -70429, -6928, -237459, -37425, -1269, -228965, -356373, -125953, -104350, -50282, -37488, -139704, 25229, -102989, 22271, 326560, 595808, 482903, 222337, 130227, -107576, -277156, -159217, -104932, -276317, -113786, 202828, 122648, 228861, 352499, 88031, -92434, -257713, -497271, -702011, -491711, -501354, -395903, -208383, -56244, -29446, 12344, 225033, 371771, 101072, -86779, -23090, 144154, -189137, -320256, -389454, -308855, -338797, -490267, -325528, -238179, -142521, 18540, 166213, 336574, 397988, 268936, 11602, -245416, -209978, -106033, -68716, -445956, -380842, -235068, -256721, -262803, -251616, -224502, -302715, -338766, -283140, -313059, -192699, -152774, 2509]
15458B509L01700o4626k81840J4921J07782J11674J17289j91589j12951j83999
15448a79130P1095Q2395n0538P8430J93216j64723m17390J4838R1622J54015M2985
15437h3185R732q9949j32579J00658M17810K10357q9540j77664j87132j26287
15427a47779Q0645J95707p5159o2048j01752R0660P7957K76770Q1303k12791l49678
15416a46165L6314M7190k9305K40075j07902j17021J95327M5720J16484L5110
15406C15827j25458j58014K72273j0042P9113j5611Q1899j3071j28111m942N1121
15395C44984j63126j20850m9056k030O2302m1418N9655j18990j27436L35209K37874
15384D17118k61545k05012J53018J02448j30986K515n008J52628J2192k47408
$$ y = [2509, 304209, 239583, -42257, -27336, 80446, 192120, 309409, 117820, 4869, -179130, -108035, -25640, -76178, 2252, 195468, 30745, -386645, -371807, -280185, -126170, -83185, -73453, -163402, -295981, -195323, 222487, 432844, 343304, 165640, -21492, -147779, -67134, 128573, 53414, -8634, -110386, -19726, 58231, 335001, 416304, 203513, -146165, -109851, -62661, -91966, 148109, 40207, -76814, 118513, 164233, 280717, 315827, 190369, 32355, 304628, 294586, 373699, 358088, 439987, 426916, 298805, 293863, 344984, 181858, 61008, 11952, 9922, 72224, 30806, 90461, -28529, -155965, 179244, 417118, 155573, -49439, 103579, 206027, 75041, 77556, 72548, 225176, 237368, -10040]
15374a0040q932L7938j9381J41626J94159J28228m18062j70815n2356k3630L04316
15363A03051L72883Q4194k7963l34951k73399j94500j50874J30666J80843p7393
15353a87443j9173J29646k3919j74170M6874K67006J72922M6978q2627k42232
15343f6138K03379O2654o1781j55519p556J53917L01701K6767k56307R9351Q8252
15332C88720P1903j32800j36723k18351k0056j73655P0288O4312r7926J89430
15322E142J58601P9858k09446j9713m2770l70316k87603J41128J92195J8045M7021
15311b87858n8203K7319J42124M1991R5023J16191L2466J80145j13677j90860
15301a5339l8526J18346J43846l09735k92999j81648J62795J01291M8276j56115
$$ y = [-10040, -18972, 18966, -415, 141211, 335370, 463598, 45536, -125279, -177635, -201265, 103051, 475934, 560128, 532165, 197214, -76185, -270685, -421559, -290893, -110050, -187443, -206616, -76970, -100889, -275059, -228185, 38821, 211743, 258721, 176094, -66138, 137241, 199895, 138114, -17405, -24961, 128956, 430657, 457424, 201117, 300468, 388720, 460623, 327823, 191100, -27251, -47307, -220962, -150674, -86362, -184288, 5142, 163743, 243601, 34155, 14442, -28328, -398644, -686247, -545119, -352924, -334879, -287858, -346061, -318742, -176618, -134627, -39604, 76587, 109053, 289198, 175521, -15339, -53865, 64481, 208327, -101408, -394407, -576055, -413260, -311969, -263693, -419808]
15291d19808j070J47762k8423L9359j39013j40130K87447K15720L19118J73904
15281D54866k75220j81627p3181m54024j71290L71077J77556k16716j41840k5034
15271e35433l3Q6443N9699Q0699K23358J94408j15671o4555l1314K54988J28211
15260B80800l39876N5881L6357j60385K32611L16497j01613j71805J092j50534
15250i75k42716j76076m5827K14080J90801k42217L7924J72809J97091L4804j53784
15239a4086j69437j8131k87193j26048J62631N8222n9720K02794J4943j0652K5209
15228b21468K82546J77850j48157K8417k13108l31314j07254P5398L50901K10517
15218A04328P8604J00172m01042j57179L04833Q4562J70201l67987j55484J96243
$$ y = [-419808, -420878, -273116, -301539, -262180, -401193, -541323, -253876, -38156, 280962, 454866, 179646, -1981, -75162, -529186, -700476, -329399, -151843, -368559, -510399, -535433, -535466, -449023, -389324, -308625, -85267, 109141, -6530, -71085, -102399, 152589, 280800, -59076, -3195, 33162, -127223, 105388, 421885, 320272, 148467, 149559, -975, -243691, -419767, -465594, -251514, -60713, -302930, -265006, -92197, 104894, 139698, -14086, -183523, -201654, -488847, -614895, -452264, -394042, -453762, -250968, -236025, -246677, -221468, 61078, 238928, 90771, 119188, -93920, -425234, -532488, -457090, -106189, 104328, 182932, 283104, -117938, -275117, 29716, 114278, 284479, -83508, -238992, -42749]
15208d2749J89485k56407J44909l6724L691J54169N7294L1281p4741k58827k21921
15197c10540M4385P7373Q9263P9785j85700j79870M8631k3255j80898M5348J68033
15186c27445J26674o8356k7032N7845R0220L1435l8286L0451J0662K2933L8590
15175e2309q2037j54497K54271K86160k61544r1031J83665k9456j77888K04692
15165H0026n2875J48402R1988J44638M2547k44244m58972J16036M20053J01254
15155C88853k41847m9506j02987p5250o5513N4412J79006N7064m5803n5224n7865
15144a4660p5992J04586K41206k7253q2512j03576r6107J54540K63298J71146
15134E34676j10496m01775l1743J44011j50311p1094k0758o6067O6713j81182
$$ y = [-42749, 146736, -109671, 35238, -1486, 2205, 156374, 213668, 244949, 170208, -88619, -310540, -266155, -188782, -99519, -19734, -205434, -385304, -336673, -359928, -540826, -495478, -327445, -200771, -269127, -296159, -238314, -148094, -116659, -154945, -124494, -113832, -90899, -52309, -134346, -288843, -34572, 251588, -9956, -100987, 82678, 53222, -124666, 80026, 27151, 175553, 267541, 412179, 454726, 210482, -248490, -132454, 287599, 388853, 147006, 97500, -5487, -80737, -146250, -91838, 87168, 144232, 98429, 43205, -14660, -90652, 13934, 255140, 227887, 145375, 41799, -54308, 100232, 363530, 534676, 424180, 22405, -9338, 134673, -15638, -86732, -107490, -173557, -106844, -288026]
15124b88026q357J27860K8619j50678P5950L76297L86036l33617k25880K7694
15114A5898J00450k2238j78463q0807J57688l35384k0445L18551R7298j04068
15104e1520R1725K04j25888k08251J16554K4071O9366l8131J20791J68068O3826
15093B30815j22043j34507k03518O163K13355N70J20543j9364m23579J03846J26561
15082a01158M8948m5789k87736j74394R8115M2410R7102L96825L98598r1189p8861
15071C02871r0666j63249l1768M128o3507j05182l008k9098M1629k2434k48518
15060d08802N4288Q7672L05944L60252k58090k21817O0538r6738j36710R4211
15050a59252J48343Q7870o4500k48475N887J46604J06249m4145j418k13555k80499
$$ y = [-288026, -296383, -168523, -139904, -290582, -214632, 161665, 547701, 214084, -11796, 15898, 116348, 94110, -84353, -165160, -7472, -342856, -363301, -44750, 52548, -51520, 40205, 40409, -85479, -293730, -177176, -153105, -83739, -121870, -1079, 166989, 230815, 108772, -25735, -229253, -223090, -9735, -9165, 111378, 92014, -331565, -227719, -101158, -52210, -97999, -385735, -560129, -462014, -419604, -322502, 74323, 472921, 381732, 302871, 212205, 48956, 17188, 21316, -42191, -147373, -150381, -179479, -137850, -160284, -408802, -354514, -266842, 39102, 399354, 141264, -80553, -20015, -116753, -253463, -159252, -10909, 76961, 12461, -236014, -230127, -83523, 22726, -21419, -22837, -236392, -516891]
15039e16891J47538M29582l3871J53146k4965N7181m9459l12306o8326j8756J78786
15028e8341J32033q6925p0033J55587l4625r1376l992R670k1208N5441K70905
15017B57136J60212k71719l15142p1590J06301M2404j02987j13954J23678K1299
15007a64362J37090K18269j39567J43718K65430k39808k10842m7657k40685j3577
14997b91991J32096J23534K61625O9733K44015k81740k63070p2490k64184J14097
14987b28375j64518q9287K52448o1380n692R5038J55571M9048P8489j93829L0568
14976h1919J09398O0699k2672J5995J04988n6452K33472O0680j28437o9457R1897
14965C18192o8473j9348K4500L53726J36292O8086k4705l03549j30637J39296
$$ y = [-516891, -369353, 60229, 26358, 179504, 154539, 211720, 162261, -150045, -218371, -237127, -58341, 73692, -13233, -83266, 72321, 37696, -53680, -57672, -48002, -69210, -13769, 257136, 417348, 145629, -169513, -241103, -134802, -92398, -195385, -309339, -185661, -164362, -27272, 190997, 51430, 195148, 460578, 220770, 9928, -37729, -278414, -291991, -159895, -36361, 225264, 294997, 539012, 257272, -5798, -78288, -342472, -228375, -392893, -482180, -229732, -291112, -296804, -201766, -46195, 2853, 81342, -112487, -81919, 27479, 88178, 65506, 81501, 186489, 130037, 363509, 424189, 295752, 226295, 318192, 249719, 230371, 254871, 608597, 744889, 812975, 788270, 484721, 354084, 493380]
14955D93380Q0349j81538n2297j05862q2358o0133J1768m7619n3113J54544L15898
14944D73019M6715O1944j92754q5222J17025n4447k27579O170j94124j60464j11636
14933c21353K24658J84166J7326J32284q2569j40484n2038P516J31625j22181
14923b1050P0794j6588q5747K33368J2021m2331R9192n6022k29830k11257J04735
14912a42715K10139J70253l19220k1644j1095R0234O1493J02143j41687j2918
14902a5017j64137j06737R3698j45903L33899K25504J46390j71144j35193k85966
14892b24606R060j63087j14928N5685K68580O9792j06438j17339M2533M8379Q5564
14881a46805K96149J69743j08302j88772N099Q0580J01651j39718o0776j1741
$$ y = [493380, 573729, 392191, 339894, 234032, 151674, 91541, 103309, 55690, 2577, 157121, 473019, 519734, 581678, 388924, 303702, 420727, 366280, 138701, 144871, -49253, -209717, -321353, -96695, 87471, 104797, 237081, 154512, 14028, -38010, -30494, 101131, -21050, 49744, 33156, -52591, 180777, 192798, 150467, 249659, 193637, -36193, -247450, -142715, 67424, 237677, -81543, -103187, -114282, -24048, 37445, 139588, -2099, -15017, -179154, -285891, -192193, -338096, -4197, 221307, 367697, 196553, 61360, -224606, -215546, -378633, -493561, -437876, -169296, -99504, -205942, -323281, -280748, -232369, -146805, 149344, 319087, 210785, 22013, 27112, 107692, 209343, 69625, 8849, -2892]
14871b892J63726l6051l05425N4115J96811K84893J63147J17108j87009j30403
14861C18020l4136k10964m1233J21220N2754l63773l5327Q0108R5415K19451r4323
14850A07212j5568J89993n5200m61113k47209j796J81332K59219J94876J67438
14840C19184j6271j69162j24882M6453r5525k01367J67842K08038K04083k81951
14830E6442l11717J2505K04958P6736O8088Q8052o4913k1118j5707O0382J8094
14819A71802K5128j429j67079p0203K7044r0235N6456J50790J08184r9523p2317
14808C8618j27032j12597j0445o0785L8789L24711o1289j41418Q719p2282J3536
14797a61475L96693l6380l07478k58549q473R5104q4832p6537K38811M8878n9332
$$ y = [-2892, 160834, 124783, -180642, -126527, 70284, 355177, 518324, 635432, 448423, 318020, 283884, 72920, 31687, 152907, 205661, -158112, -193439, -113331, -17916, 201535, 107212, 91644, 281637, 226437, -234676, -481885, -483681, -302349, -43130, 151746, 319184, 302913, 133751, 8869, 55322, -40203, -241570, -73728, 134310, 338393, 56442, -255275, -242770, -37812, 38924, 107012, 195064, 130151, 109033, 93326, 153708, 171802, 196930, 195501, 28422, -41781, -14737, -104972, -48516, 102274, 210458, 110935, 38618, -88414, -201011, -211456, -272241, -233452, 91259, 29970, -111448, -102729, -175011, -161475, 235218, 198838, -108640, -367189, -375662, -280558, -365390, -441927, -203116, -154238, -213570]
14786b13570J08255J72669K5052j90867j33775k51180K59114L94053P7059o3107
14776A83703p8139P133j31272J69232k3774k6122k1658m58413j00015K62143K7889
14765a89293K6311J11190j33401o1985K52421K68575K1585j31897k70720J51198
14755D3984J86103J36114q5326K1270j00593k733k37703l3497K11463j25084j74891
14744a60893J12183J02554J25990L2155k52324m02081j94994R3130K42677k8996
14734c30599L96613K10035p3691m15337K8483k0462J33664r5913j02420J56261
14724a13366K60729o4599j76650o119n6513j04745j42469r9049K27541O4642J43844
14713f6754K53289K9864K2290k49099n7355O0884l11403M7570J20639n3055j05234
$$ y = [-213570, -105315, 67354, 92406, -98461, -232236, -483416, -224302, 169751, 246810, 183703, 105564, 112697, -18575, 150657, 126883, 100761, 79103, -379310, -479325, -217182, -189293, -162982, -51792, -185193, -247178, 5243, 273818, 295403, 163506, -107214, 43984, 230087, 366201, 280875, 302145, 201552, 198819, -38884, -72381, 139082, 13998, -160893, -48710, 53844, 179834, 211989, -40335, -442416, -637410, -544280, -301603, -330599, 66014, 276049, 202358, -212979, -184496, -204958, -71294, -167207, -269627, -113366, 147363, 82764, -93886, -100005, -156518, -261263, -403732, -502781, -275240, -210598, -66754, 186535, 216399, 238689, -10410, -67765, -6881, -318284, -270714, -150075, -203130, -308364]
14702c08364R2364M13142K3423l19622k07829m8548j77516K79380J79678K54788
14692A80896j07111j11091K71446m0867m15977k00647J16282N6998J14707l6134
14682a71498p0639k8034r7519j78878J61946J40673J85775j15827l7478L3899
14672a77580k4680L0109J51569n0925M9491J07544o1001k390J56544K27728m8343
14661C58066m14870l05509j30817K99766M6792p9941j99716K6941K20813K3308
14651a55167p0661J09861R5201J08221j21210r0862J49009J3608k185j75384p8170
14640b17739J09246L7711J67749m8103r7564R0410k03553r7939k32484J61889
14630c30377M81953J23087J186j42010k3777R9033J57711J58585j90249j28217
$$ y = [-308364, -216000, 197142, 220565, -99057, -306886, -355434, -532950, -253570, -73892, 180896, 73785, -37306, 234140, 193273, -222704, -423351, -307069, -250071, -135364, -171498, -242137, -270171, -367690, -546568, -384622, -243949, -58174, -174001, -211479, -177580, -202260, -172151, -20582, -71507, -22016, 85528, 24527, 22137, 178681, 406409, 358066, -56804, -362313, -493130, -193364, -146572, -226513, -426229, -399288, -178475, -155167, -225828, -115967, -20766, 87455, -33755, -124617, 24392, 38000, 35815, -139569, -217739, -108493, -70782, 96967, 48864, -48700, 41710, -161843, -259782, -492266, -330377, 151576, 274663, 275849, 133839, 110062, 209095, 366806, 525391, 335142, 206925]
14620B06925j99640j41536K83119K44120J8768j51095k30975L6859l190l6371
14610B6984j6546L06369k9685j10353j9879j57018o415J46172O0155O1948J28338
14599C90070k6614j71277M398k610n4767j82689j53559K12924j04360M7092P0374
14588B8982J21061J93904o6044Q2223L3155j77867o4761o7697Q5027Q4149o1962
14577A90170N0688J29859j24404M7511k18773m0963J41894r2451K31388k2481
14567B92438j13541J85532J58451m11660j52113r2506j06887O8336j7917N5164
14557a34703K8860l39815j17262J64686K9868M9285r1110J05931J24541K9101
14547a50618j76371R5467L47131P4940j65987L4215k43292j59956K94636J29564
$$ y = [206925, 7285, -134251, 148868, 392988, 411756, 260661, 29686, 66545, 63355, 26984, 10438, 316807, 287122, 176769, 156890, -128, -6543, 139629, 199784, 261732, 390070, 363456, 192179, 196577, 193967, 139200, -43489, -197048, 15876, -88484, -41392, 28982, 150043, 343947, 277903, 360126, 393281, 215414, 150653, 82956, 167983, 252132, 190170, 240858, 370717, 246313, 293824, 75051, 34088, 175982, 83531, 314919, 292438, 178897, 364429, 522880, 111220, -40893, -133399, -240286, -171950, -189867, -134703, -105843, -445658, -562920, -398234, -368366, -319081, -410191, -304260, -179719, -150618, -326989, -231522, 115609, 190549, 24562, 58777, -184515, -344471, -49835, 79729]
14537G9729k85853m5724K14786N2107q2047k98357L1082n8953J32508l2524K8255
14526b64991K24781J59478M2447k4575j67526n0049R5507k765r0898k07603L8827
14515b47367j90180L7917K47024J58155J13839j30506K5048j27153n3426J08364
14505e8285r4274k1824k59418K75462J34851k14416m6047J5690l03741k23249
14495g95251J83520K29627N61737J6331l69783k7861r956L76395K12576k9817
14485C47518j6141j40598l44136N347J46943L19068K73723j78922Q7542r9558
14475D00786k20610k12410J3233Q9884L5286Q1200K3388P9360j11294l7929k91358
14464a50464o4494M1759m7228p2417O3668N927R2526j16065n1620J07657J09986
$$ y = [79729, -206124, -251848, -37062, 15045, -67002, -365359, -334277, -393230, -260722, -293246, -264991, -40210, 119268, 161715, 137140, -30386, -80435, 15072, 12307, -78591, -286194, -247367, -437547, -399630, -152606, 5549, 119388, -11118, 13930, -113223, -166649, -58285, -152559, -174383, -433801, -158339, -23488, -237904, -283951, -268261, -572002, -795251, -611731, -382104, 179633, 195964, -173819, -201680, -211636, 164759, 377335, 347518, 331377, 190779, -153357, -148010, -1067, 318001, 591724, 412802, 500344, 400786, 180176, -32234, -19001, 70883, 106169, 187369, 210757, 290117, 178823, 140894, -150464, -214958, -173199, -220427, -292844, -229176, -223249, -130723, -246788, -298408, -190751, -80765]
14453h0765R7384J47552k1855j52121L2686o9360K88909n9766P5396j54625k95482
14442a92047p6485k10997L9138N24913J57289r2695q4215R0204J89982j15391
14432B29696K30298j22340j89338Q0526n985l96278j80019k8120J53300j01999
14422c30259o8782o9840L6268K25159p5704q8013p2193N0714J71365J40212R47
14411h0126J15223r0719J14583j85762J14931P3666n4931M9924N619j80910J22350
14400C848q8726l2611J08424K70821J23876J56598n7633k51107Q2479j66278n2560
14389I7131M16039m0078j37398J02316K4555k94750k32304l44846q2733J63659
14379c28409K30299K32950k111p5088r4235Q9030M0456j94115j49140q6544J94916
$$ y = [-80765, 16619, 164171, 142316, -9805, 22881, -46479, 242430, 182664, 258060, 103435, -192047, -268532, -479529, -440391, 84522, 241811, 149116, 64901, 155105, 345087, 229696, 459994, 337654, 148316, 228842, 222857, -173421, -353440, -381560, -228260, -330259, -399041, -468881, -432613, -207454, -283158, -371171, -443364, -392650, -221285, -81073, -80126, 35097, -55622, 58961, -126801, -11870, 61796, 6865, 56789, 62408, -118502, 3848, -84878, -117489, -9065, 261756, 385632, 542230, 484597, 233490, 315969, 149691, 97131, 513170, 473092, 335694, 438010, 462565, 167815, -64489, -409335, -492068, -328409, -98110, 134840, 132729, 57641, -36594, 52436, 92892, -101223, -250363, -336907, -141991]
14368a41991N7323q2251p1094J34661r6104P699J06396j04538p0736K33622J83126
14357A56113k77762l70936j3434J09646J14701J01235L7001N5590j33743k62432
14347d84021j15098R2327K72986J87828j8899n7893P0448J42974l59309m8907
14337c17564K67843K6150M5154k06229j00963N7249P1760J55897k06296p8551
14327b85550L30731r3112j10658J44491o8626J80985R8050Q3305j34702k04210
14317e9296j32979j86420K22280l4808j44433j66804P5082J66147K55193J24033
14307A17995k5806n0902j5640j8917k07193j33025K14276J17498L2068K8660r0713
14296c1699j52478q3045l702J31592K36690j09822k27256k27501J72834K17305
$$ y = [-141991, -84668, -166919, -238013, -103352, -199456, -191757, -85361, -189899, -260635, -27013, 156113, -121649, -492585, -506019, -396373, -281672, -180437, -143436, -87846, -221589, -484021, -599119, -506792, -233806, -45978, -64877, -122770, -52322, 90652, -268657, -317564, -49721, -23571, 21583, -184646, -285609, -228360, -156600, -703, -206999, -285550, 45181, -47931, -158589, -14098, -82724, 98261, 196311, 279616, 144914, -59296, -192275, -378695, -156415, -191223, -335656, -502460, -427378, -261231, -6038, 117995, 92189, 41287, 25647, 6730, -200463, -333488, -119212, -1714, 30354, 59014, -31699, -184177, -267222, -270924, -139332, 97358, -12464, -239720, -467221, -294387, -77082]
14286g7082Q0032J25891k78844j42173P44N2717K49454j40297k64011j37454L02186
14275b28837M83725j47672l47334j5051J79520n379m3788j07742k68848O4324
14265d37082L2932J49629M57663J86141K34K7891k95660k70672J26704o8755J3644
14254g7331q9292L898J23629P1311j30164n867J1354k92246j35278M6659K02338
14243b70989K44384k63445j86193r549K58242L79264O7012l53974j70471J38404
14233a67315M4963N2383J28831M251p0735J13165n6429j07818J28391Q3419j50482
14222B624m4276l5588J60545O7283k04803j1311k14431l43674j05030O4623K92599
14211c71439K3849Q7133j46017Q7521N1465m7413K47070J68073l45621k89025
$$ y = [-77082, 2950, 128841, -150003, -292176, -291432, -238715, 10739, -129558, -393569, -531023, -228837, 254888, 107216, -240118, -255169, -75649, -81028, -124816, -232558, -501406, -437082, -404150, -254521, 203142, 389283, 389517, 417408, 121748, -148924, -22220, -90975, -77331, -166623, -162725, -39096, 32215, -97949, -103816, -92462, -384708, -519986, -473327, -270989, -26605, -290050, -476243, -485792, -227550, 151714, 218726, -135248, -305719, -167315, -122352, -69969, 58862, 63113, -7622, 105543, 49114, -58704, 69687, 153106, 2624, -41652, -77240, 83305, 150588, -54215, -65526, -279957, -623631, -728661, -664038, -371439, -347590, -260457, -406474, -318953, -267488, -314901, -67831, 100242, -245379, -534404]
14201e34404K99517Q6744J75286j73532O7120J33398K673J30695K13392o6433
14191C34456j89735q4021j60159k34551l90122K90595M08952j5878K4692l8959
14181e4730J8859J50111k03807n5970n2822j73285K385O0233J24731K6716m7724
14170b05303Q2336k40683j26994Q9699j8568R4891n8204p2438j00150K28206J07918
14159b19290L30654J05094j8461l2798K2792L9382r7240j44783l66804j24735
14149e06189N426L50736K39346j41408l29686K83046k9119j43991j52758j90573
14139f15170K5942j06833K3320M34046K09654k5369j39076K18700J39117L3153
14129A97484j14283j37912J27561K63920k56375j77281K97887J23030m39643M2272
$$ y = [-534404, -234887, -148143, 27143, -146389, -79269, 54129, 56802, 187497, 400889, 334456, 144721, 60700, -99459, -334010, -724132, -433537, -24585, -40463, -15771, -54730, -35871, 114240, -89567, -145537, -198359, -371644, -369259, -309026, -184295, -157579, -205303, -122967, -363650, -490644, -400945, -419513, -324622, -382826, -455264, -555414, -327208, -219290, 111364, 216458, 197997, 165199, 187991, 227373, 130133, -14650, -381454, -506189, -500763, -150027, 89319, -52089, -381775, -98729, -127848, -271839, -424597, -615170, -589228, -696061, -672741, -238695, -29041, -54410, -193486, 25214, 164331, 197484, 83201, -54711, 72850, 336770, 80395, -96886, 201001, 324031, -115612, -73340]
14119g3340K30793Q410K5019j84907k02078L8337K08822n1761n8186n9001Q8136
14108b9756O4999J01833P0993l46049j57490K0088O1185J47826K40072j37505
14098C6196m1205m1448r2754N3155R4834J17987R003J40381j71328k9906M3888
14087A18803j44639q4695o4365J6022l30738J14459L48217j1439p1407j96290
14077c06072J00590J69101N9655J39312m8558j10412l470K48117o1210j1104k7213
14066A48736n1344o0087n5598J60224q0351q2810j17283k69943N4342J72519Q4823
14055i6772r0599j83778j61976J97700K73403k4641p8652M8143J32026R9183O5378
14044A79415J11631J83615k83153l97516j7958K40027K79690K13089k25344k46682
$$ y = [-73340, 157453, 165863, 190882, 5975, -196103, -157766, 51056, -705, -58891, -117892, -29756, 35243, 137076, 208069, -137980, -295470, -275382, -214197, -66371, 173701, 36196, -5009, -46457, -139211, -86056, 8778, 126765, 135768, 276149, 104821, 74915, 118803, -25836, -110531, -174896, -158874, -489612, -375153, -26936, -38375, -109782, -306072, -205482, -36381, 23274, 162586, 114028, 3616, 146, 248263, 187053, 175949, 148736, 97392, 37305, -18293, 141931, 61580, -21230, -138513, -408456, -354114, -181595, -96772, -187371, -371149, -533125, -335425, -62022, -86663, -165315, -117172, 14854, 114037, 179415, 291046, 474661, 191508, -206008, -223966, 16061, 295751, 508840, 283496, 36814]
14034C6814k6668j95488q067L7529k83150q4879J77739J66179J43361K32175j52334
14023D3211Q2832l52322m3699J36044p3582J23958j53807k5566M04661J85196
14013C26926n0549j15703j79551K8322j02378r205q4190r0809J62856P1011K6583
14002a6687L0982M2429j70838r228J98540M6500o1329r094j32510L6831M66771
13991D22367j0312j06969j16502k19829j62727J22567j4110P0453k05716m7059
13981b67837K77072j72306P2578Q8481K4180Q3882o52N4415J89458n9453k78654
13970A1164k57797J99207J9650P5668j7699n4058l32696l4099k12734K15521L79659
13959h214j08340o4373J25715J32133k49987j23954o7290q8870J80351J44995
$$ y = [36814, 10146, -185342, -193409, -155880, -439030, -523909, -346170, -179991, -36630, 195545, 43211, 126043, -226279, -269978, -133934, -207516, -83558, -237365, -262931, 141730, 326926, 276377, 160674, -18877, 9445, -92933, -102138, -186328, -277137, -114281, -43270, -16687, 14295, 56724, -114114, -123342, 75198, 121698, 60369, 51275, -81235, -44404, 422367, 412055, 305086, 188584, -31245, -193972, -71405, -85515, -15062, -220778, -267837, 9235, -163071, -90493, -2012, 22168, 106050, 105398, 159813, 349271, 289818, 11164, -246633, -47426, -27776, 47892, 30193, -23865, -356561, -390660, -603394, -387873, -8214, -116554, -180927, -55212, 76921, -173066, -297020, -364310, -453180, -272829, -127834]
13949a27834K62672j71560p7600n2257J53626L18391J39331k95452l83898J31684
13939a02897J46515R8861o0274l0852j64051K09910J00040j35801j10458L57019
13929C08012K02281m1851r9439P1251o2110l66077j48338j61353J75800J83643
13919F1819R0938j1509K4509j50819l22851K65514M96075J02797j78914k19478
13909A58081K74868M2702k26985m08659j86246J91306l40671k57014L25814J94895
13899b31909K20467J66337m0756j10026o0821K26346K36739j12240k45352r3783
13889d4998K9441O3880L5347k21294Q6239J28006R2112L44979J14112k45507j08299
13878B74018j32736K20082o6110k65890j34488k29973j81885j7680J97181O7925
$$ y = [-127834, 134838, -36722, -114322, -166579, -12953, 305438, 444769, 149317, -234581, -102897, 43618, 142479, 82205, 51353, -112698, 97212, 197252, 61451, -49007, 308012, 510293, 468442, 369003, 440254, 378144, 12067, -136271, -297624, -121824, 61819, 152757, 141248, 165757, 14938, -307913, -42399, 453676, 556473, 377559, 158081, 432949, 475651, 248666, -159993, -346239, -154933, -495604, -752618, -426804, -231909, -11442, 154895, 114139, 4113, -56708, 169638, 406377, 294137, 48785, -44998, -15557, 48323, 83670, -137624, -51385, 76621, 168733, 513712, 627824, 382317, 274018, 141282, 361364, 295254, 29364, -105124, -335097, -516982, -534662, -337481, -269556]
13868b69556K32252J8565R9912j34918l77762J32407L8516J9344J07135L98654
13858B64549L2806l85915l36729p8648j57297Q1606K02017j17543J62746P7377
13848b55031j408n0235j51619j26227O2193K33906j9556K3467n8694O8314R4245
13837a80645j06978J99820J51038j56K1096P6922M1772J24790j3178J56552o9629
13826D01404j45604k21626o5420P7667J73829J21727l624m7457J42128N0305j12320
13815C71009l7757K6068j54061j59153O1815M3847k21566k18176P931l050j14
13804b83207q8740K5304J17100J33639P1652l8288j50314R070P3129j73766j85953
13793d90374J62357p0978J41514P689l501L4431l4227j15451J42999K53220l1257
$$ y = [-269556, -37304, -18739, 81173, -53745, -431507, -299100, -260584, -241240, -134105, 264549, 297355, -88560, -425289, -503937, -661234, -579628, -377611, -495154, -332408, -255031, -256439, -306674, -458293, -584520, -522327, -288421, -307977, -284510, -343204, -274890, -180645, -287623, -87803, 63235, 63079, 84175, 161097, 202869, 327659, 314481, 471033, 401404, 255800, 34174, -31246, 46421, 220250, 341977, 338353, 290896, 433024, 483329, 371009, 333252, 359320, 205259, 46106, 107921, 151768, -69798, -287974, -280043, -283093, -283207, -371947, -346643, -229543, -95904, -24252, -62540, -212854, -203784, -130655, -304421, -490374, -328017, -398995, -257481, -249792, -253293, -218862, -253089, -368540, -225541, 27679, -3578]
13782c578l03563k72113L34323M852p2645m6456M2412l6241q7652M13700M09584
13771C82623O1141l36369l90298k17760R9660J27596N4974K20619J77835k05126
13761b5105J8551j46408J86065K25964L4580j76041k16614n7815q3577J6843j31524
13750c55081J25044J1685M8965p4432N5614Q8984J8036J95599l05932o570K32758
13739C4670P606K891L0359l14902k44085J01204O0699o6563K1389J69636J44202
13728e2894r1020Q9060m5526j90570m3886p1466K1242J85328J18609J13081l0393
13717A565k02736j90884K76404L68507j1956k88827j67499J54547j04739k05383
13707c71001K28710P3999o1113k28983L36327j10045j72511K02457P467L5547
$$ y = [-3578, -307141, -579254, -244931, -240079, -312724, -359180, -316768, -353009, -440661, -26961, 382623, 443764, 107395, -282903, -500663, -401003, -273407, -218433, 2186, 180021, -25105, -6554, -152962, 33103, 259067, 293647, 117606, -99008, -156823, -240400, -223557, -355081, -230037, -218352, -169387, -243819, -188205, -99221, -81185, 114414, -191518, -198088, 34670, 42276, 45167, 75526, -239376, -483461, -382257, -321558, -388121, -366732, -197096, -52894, -143914, -54854, -100380, -290950, -334836, -406302, -385060, -199732, -81123, 31958, 1565, -201171, -392055, -115651, 252856, 240900, -47927, -215426, -60879, -165618, -371001, -142291, -68292, -129405, -358388, -22061, -132106, -304617, -102160, -94693, -59146]
13697e9146j86928m7794O9045M9967J42440L979J37757k19238J19133J93325j12526
13686I0014k33627R4549j14940K13532K38522K61328L3593l08463m9458q3525
13676A41525j27260m5019K13279K23067k15441K0638P3942m61467j34895J32769
13666a78862P0849k88208K79098n7040j75224j1093J92044Q0533k2958Q604n2313
13655a54570M9500J50951n1229P1547K3234L1770O0732L0794L4128m2121l04313
13644i9577m57432j19188J38524L48800K62159j41218j94452q9556L8835J00359
13634b12746k9458L071J42597K25810r4143l57880k80330L99191J3751P8926m2544
13623a53755M5363p1662K0081J1900R3J58013J18696K01535M2688J824o423k52872
$$ y = [-59146, -246074, -293868, -224823, -174856, -32416, -28437, 109320, -109918, 9215, 202540, 90014, -143613, -49064, -164004, 49528, 288050, 549378, 582971, 274508, 225050, 141525, 14265, -30754, 182525, 405592, 190151, 210789, 284731, -176736, -311631, -178862, -108013, -396221, -117123, -174163, -349387, -360480, -168436, -87903, -110861, -102257, -154570, -105070, 45881, -5348, 66199, 89433, 121203, 181935, 212729, 246857, 204736, -99577, -557009, -676197, -537673, -188873, 73286, -67932, -262384, -351940, -313105, -212746, -242204, -239133, -96536, 129274, 35131, -322749, -603079, -203888, -190137, -111211, -153755, -108392, -180054, -159973, -148073, -147980, 10033, 128729, 330264, 372952, 374776, 368353, 115481]
13611A15481l74361K48496M832k17979J0513o4495n8385r193J76974K9250j94483
13600c33350J217K03079J37512j19987j35373J68308J3367j53815J04171M4728
13590g0143k63220N0366O5663n1737J85479j18239j47771J06358m2810j99625
13580d85679k39763m717K95032J11637q7708n8050k12296n8242K15037L51542
13570a73207Q2539J93885J56151k82088k33370J46398m0325N110l5210M2683K00863
13559F3429L7768r3103p5390j42036j63527n5633K92457M16507j05124j92964
13549a7616p2508J45308Q8321o0834O402k93184j77143R123J83141N3925k21332
13538c56397K68719K61226r0601k7300k63072l06183J41105J28673R9259L3541
$$ y = [115481, -258880, -10384, -5552, -223531, -213018, -277513, -335898, -345091, -168117, -138867, -333350, -332133, -129054, 8458, -111529, -246902, -78594, -65227, -219042, -114871, -70143, -333363, -282997, -217334, -269071, -83592, -201831, -349602, -243244, -286054, -485679, -725442, -730159, -435127, -323490, -411198, -469248, -681544, -739786, -524749, -173207, -90668, 103217, 259368, -22720, -256090, -109692, -150017, -144907, -180117, -137434, 63429, 101197, 8094, -67296, -209332, -372859, -428492, -136035, 280472, 175348, -17616, -90124, 55184, 143505, 82671, 89073, -204111, -381254, -372131, -188990, -135065, -356397, -87678, 173548, 82947, 55647, -207425, -513608, -372503, -243830, -144571, -111030]
13528a11030Q387l29185m72370j40518L60031M7130Q2976M05041K18098j87864
$$ y = [-111030, -102643, -431828, -904198, -1044716, -684685, -637555, -554579, -149538, 68560, -119304]
$$ [...]
##END NTUPLES=NMR SPECTRUM
##END=
