##TITLE=Analysis number 323558
Compound Code cc 27214
Book Reference 505/29
Project Code adrs
Chemist Name robb
##JCAMPDX= 6.0         $$ Bruker NMR JCAMP-DX V2.0
##DATA TYPE= NMR SPECTRUM
##DATA CLASS= NTUPLES
##ORIGIN= Bruker BioSpin GmbH
##OWNER= nmr
$$ XWIN-NMR		Version 3.5
$$ Fri Oct 27 10:41:06 2006 GMT Daylight Time (UT+1h)  MAYBRIDGE\nmr@NMR_250MHZ
##.OBSERVE FREQUENCY= 250.131544655141
##.OBSERVE NUCLEUS= ^1H
##.ACQUISITION MODE= SIMULTANEOUS (DQD)
##.ACQUISITION SCHEME= undefined
##.AVERAGES= 16
##.DIGITISER RES= 18
##SPECTROMETER/DATA SYSTEM= dpx250
##.PULSE SEQUENCE= zg30
##.SOLVENT NAME= CDCl3
##.SHIFT REFERENCE= (INTERNAL, CDCl3, 0, 16.522)
##AUDIT TRAIL= $$ (NUMBER, WHEN, WHO, WHERE, WHAT)
$$ ##TITLE= Audit trail, XWIN-NMR		Version 3.5
$$ ##JCAMPDX= 5.01
$$ ##ORIGIN= Bruker BioSpin GmbH
$$ ##OWNER= nmr
$$ C:\u/data/dgb/nmr/ADRS/1820/pdata/1/auditp.txt
$$ ##AUDIT TRAIL=  $$ (NUMBER, WHEN, WHO, WHERE, WHAT)
(   1,<2006-10-27 10:40:28.81 +100>,<MAYBRIDGE\nmr>,<NMR_250MHZ>,
      <created by zg, POWCHK disabled, PULCHK disabled
       configuration hash MD5:
       49 4B E0 1D 92 C2 6B 37 9F E6 65 BC 52 41 86 1D
       data hash MD5: 64K
       AB 1D 82 B7 D8 FC D3 75 83 5A E4 56 55 C1 46 E2>)
(   2,<2006-10-27 10:40:47.18 +100>,<MAYBRIDGE\nmr>,<NMR_250MHZ>,
      <Start of raw data processing
       ef LB = 0.3 FT_mod = 6 PKNL = 1 SI = 32K 
       data hash MD5: 32K
       4C 2D 1F 8F 7F FD 0D 50 3E F2 E0 9E 97 6C B5 80>)
(   3,<2006-10-27 10:40:51.84 +100>,<MAYBRIDGE\nmr>,<NMR_250MHZ>,
      <apk 
       data hash MD5: 32K
       A8 3A 26 4F 1F 95 7F A9 C9 ED A9 71 DC 11 C0 85>)
(   4,<2006-10-27 10:40:53.61 +100>,<MAYBRIDGE\nmr>,<NMR_250MHZ>,
      <abs ABSG = 5 
       data hash MD5: 32K
       8C A3 61 CF 2D 03 88 A2 95 F3 83 F9 98 C6 04 11>)
$$ ##END=
$$ 
$$ hash MD5
$$ 6F 9F 75 C6 4C 16 CA 93 87 1F 30 B3 8E E8 4B C9
##$RELAX= 
##$RELAX= 
##$RELAX= 
##$RELAX= 
##$RELAX= 
##$RELAX= 
##$RELAX= 
$$ Bruker specific parameters
$$ --------------------------
##$DU= <C:\u>
##$EXPNO= 1820
##$NAME= <ADRS>
##$PROCNO= 1
##$TYPE= <nmr>
##$USER= <dgb>
##$AMP= (0..31)
100 100 100 100 100 100 100 100 100 100 100 100 100 100 100 100 100 100 
100 100 100 100 100 100 100 100 100 100 100 100 100 100 
##$AQSEQ= 0
##$AQ_mod= 3
##$AUNM= <au_zg>
##$AUTOPOS= <16 >
##$BF1= 250.13
##$BF2= 250.13
##$BF3= 250.13
##$BF4= 250.13
##$BF5= 500.13
##$BF6= 500.13
##$BF7= 500.13
##$BF8= 500.13
##$BYTORDA= 1
##$CFDGTYP= 0
##$CFRGTYP= 5
##$CHEMSTR= <none>
##$CNST= (0..31)
1 1 145 1 1 1 1 1 1 1 1 1 1 1 1 1 1 1 1 1 1 1 1 1 1 1 1 1 1 1 1 1 
##$CPDPRG= <>
##$CPDPRG1= <>
##$CPDPRG2= <>
##$CPDPRG3= <>
##$CPDPRG4= <mlev>
##$CPDPRG5= <mlev>
##$CPDPRG6= <mlev>
##$CPDPRG7= <mlev>
##$CPDPRG8= <mlev>
##$CPDPRGB= <>
##$CPDPRGT= <>
##$D= (0..31)
0 1 0 0 0 0 0 0 0 0.06 0 0 0 0 0 0 0.0002 0 0 0 0 0 0 0 0 0 0 0 0 0 0 
0 
##$DATE= 1161942026
##$DBL= (0..7)
120 120 120 120 120 120 120 120 
##$DBP= (0..7)
150 150 150 150 150 150 150 150 
##$DBP07= 0
##$DBPNAM0= <>
##$DBPNAM1= <>
$$ [...]
##$SUBNAM7= <"">
##$SUBNAM8= <"">
##$SUBNAM9= <"">
##$SW= 20.6930455092707
##$SWIBOX= (0..15)
0 0 3 0 0 0 0 0 0 0 0 0 0 0 0 0 
##$SW_h= 5175.983436853
##$TD= 65536
##$TD0= 1
##$TE= 683.16
##$TE2= 300
##$TE3= 300
##$TEG= 300
##$TL= (0..7)
0 120 120 120 120 120 120 120 
##$TP= (0..7)
150 150 150 150 150 150 150 150 
##$TP07= 0
##$TPNAME0= <>
##$TPNAME1= <>
##$TPNAME2= <>
##$TPNAME3= <>
##$TPNAME4= <>
##$TPNAME5= <>
##$TPNAME6= <>
##$TPNAME7= <>
##$TPOAL= (0..7)
0.5 0.5 0.5 0.5 0.5 0.5 0.5 0.5 
##$TPOFFS= (0..7)
0 0 0 0 0 0 0 0 
##$TUNHIN= 0
##$TUNHOUT= 0
##$TUNXOUT= 0
##$USERA1= <user>
##$USERA2= <user>
##$USERA3= <user>
##$USERA4= <user>
##$USERA5= <user>
##$V9= 5
##$VALIST= <valist>
##$VCLIST= <CCCCCCCCCCCCCCC>
##$VD= 0
##$VDLIST= <DDDDDDDDDDDDDDD>
##$VPLIST= <PPPPPPPPPPPPPPP>
##$VTLIST= <TTTTTTTTTTTTTTT>
##$WBST= 1024
##$WBSW= 4
##$XGAIN= (0..3)
0 0 0 0 
##$XL= 0
##$YL= 0
##$YMAX_a= 525868
##$YMIN_a= -525912
##$ZGOPTNS= <>
##$ZL1= 120
##$ZL2= 120
##$ZL3= 120
##$ZL4= 120
##$ABSF1= 16.522
##$ABSF2= -4.171173
##$ABSG= 5
##$ABSL= 3
##$ALPHA= 0
##$AQORDER= 0
##$ASSFAC= 0
##$ASSFACI= 0
##$ASSFACX= 0
##$ASSWID= 0
##$AUNMP= <proc_1d>
##$AZFE= 0.1
##$AZFW= 0.1
##$BCFW= 0
##$BC_mod= 0
##$BYTORDP= 0
##$COROFFS= 0
##$CY= 12.5
##$DATMOD= 1
##$DC= 0
##$DFILT= <>
##$DTYPP= 0
##$F1P= 14.0000005364418
##$F2P= -0.99999901652339
##$FCOR= 0.5
##$FTSIZE= 32768
##$FT_mod= 6
##$GAMMA= 0
##$GB= 0
##$INTBC= 1
##$INTSCL= 1
##$ISEN= 128
##$LB= 0.3
##$LEV0= 0
##$LPBIN= 0
##$MAXI= 10000
##$MC2= 0
##$MEAN= 0
##$ME_mod= 0
##$MI= 0
##$NCOEF= 0
##$NC_proc= -2
##$NLEV= 6
##$NOISF1= 0
##$NOISF2= 0
##$NSP= 0
##$NTH_PI= 0
##$NZP= 0
##$OFFSET= 16.522
##$PC= 1
##$PHC0= -46.81175
##$PHC1= 7.586095
##$PH_mod= 1
##$PKNL= yes
##$PPARMOD= 0
##$PSCAL= 4
##$PSIGN= 0
##$REVERSE= no
##$SF= 250.13
##$SI= 32768
##$SIGF1= 0
##$SIGF2= 0
##$SINO= 400
##$SIOLD= 32768
##$SREGLST= <1H.CDCl3>
##$SSB= 0
##$STSI= 32768
##$STSR= 0
##$SW_p= 5175.98343685301
##$SYMM= 0
##$S_DEV= 0
##$TDeff= 65536
##$TDoff= 0
##$TI= <Analysis number 999999
Compound Code 99
Book Reference 9
Project Code 9>
##$TILT= no
##$TM1= 0
##$TM2= 0
##$TOPLEV= 0
##$USERP1= <user>
##$USERP2= <user>
##$USERP3= <user>
##$USERP4= <user>
##$USERP5= <user>
##$WDW= 1
##$XDIM= 32768
##$YMAX_p= 405780136
##$YMIN_p= -35980
$$ End of Bruker specific parameters
$$ ---------------------------------
##NTUPLES= NMR SPECTRUM
##VAR_NAME=  FREQUENCY,     SPECTRUM/REAL,   SPECTRUM/IMAG
##SYMBOL=    X,             R,               I
##VAR_TYPE=  INDEPENDENT,   DEPENDENT,       DEPENDENT
##VAR_FORM=  AFFN,          ASDF,            ASDF
##VAR_DIM=   32768,         32768,           32768
##UNITS=     HZ,            ARBITRARY UNITS, ARBITRARY UNITS
##FACTOR=    0.157963299565203, 1,           1
##FIRST=     4132.6476996994, 0,             0
##LAST=      -1043.33573715361, 0,           0
##MIN=       -1043.33573715361, -35980,      0
##MAX=       4132.6476996994, 405780136,     0
$$ Real data points
##PAGE= N=1
##DATA TABLE= (X++(R..R)), XYDATA
$$ [...]
$$ plain form
15328 -21451 -12958 -10821 -10204 -12444 -10160 -9577 -6371 -12803 -12576 -10082 -7134 -2616 -5717 -6720 -7480
15313 -7480 -10429 -15890 -13453 -10170 -7311 -4094 -12649 -16814 -22214 -24676 -18218 -14346 -20718 -14608 -16258
15298 -16258 -20467 -18585 -14455 -4795 -5585 -5788 -6882 -8660 -6416 -5523 -1001 3950 -1974 -62 3637
15283 3637 11506 16309 8512 -3337 -8415 -9948 -7187 -9539 -10611 3087 3072 -10262 -4975 963
15269 963 616 -3412 -7180 -8490 -13237 -12393 -8676 -8817 -6241 -827 -3090 -6543 -10898 -13594 -8821 -8136
15253 -8136 -7637 -12594 -12293 -8824 -7570 -6265 -9401 -13939 -18012 -15948 -13139 -16883 -28895 -27015 -14342
15238 -14342 -7548 -18920 -17916 -14010 -17599 -27148 -20288 -21164 -24987 -19670 -13361 -8023 -5248 -14653
15224 -14653 -6666 -5237 -7990 -6807 -5103 -7865 -5665 -8014 -17890 -19217 -17955 -12389 3047 4480
$$ packed form
15328b1451Q493K137O17k240K284N83L206o432K27K494K948M518l101j003p60
15313g480k949n461K437L283K859L217q555m165n400k462O458L872o372O110j650
15298a6258m209J882M130R660p90k03j094j778K244Q93M522M951n924J912L699
15283C637P869M803p797j1849n078j533K761k352j072J3698j5j3334N287N938
15269I63l47m028l768j310m747Q44L717j41K576N414k263l453m355k696M773O85
15253h136M99m957L01L469J254J305l136m538m073K064K809l744j2012J880J2673
15238a4342O794j1372J004L906l589r549O860q76l823N317O309N338K775r405
15224a4653P987J429k753J183J704k762K200k349r876j327J262N566J5436J433
$$ plain form
15210 4480 -5309 -2223 -2554 -9987 -2877 7831 3224 -3961 -14666 -25624 -28826 -27721 -11518 -5065
15196 -5065 -14196 -11305 -11202 -11858 -8289 -11132 -7758 -8628 -10044 -515 3121 1414 -2292 -2952 -8866 -5400
15180 -5400 -7527 -9496 -5900 2396 -691 652 -358 -6838 -6079 -4826 -12120 -5421 -8142 -13572 -13121
15165 -13121 -5368 -7271 -4332 -1139 8180 21660 12923 497 -6962 -5268 -8495 -4567 -3037 -566
15151 -566 -517 -414 -2330 -4238 -7217 -8703 -1109 7572 11233 487 -11211 -9403 -5513 961 2536
15136 2536 -4723 2526 8860 -2910 -15421 -13609 -18516 -21917 -8763 135 -4506 -6597 -1091 5357
15122 5357 11544 10877 1915 -3909 -4234 -3362 -6161 -7379 -4503 -1035 -11190 -15099 -12424 -9319 -6062
15107 -6062 9354 3541 -858 -7309 -10074 -16302 -11047 2704 -1233 1789 -9077 -15930 -8331 715
$$ packed form
15210D480r789L086l31p433P110J0708m607p185j0705j0958l202J105J6203O453
15196e065r131K891J03o56L569k843L374q70j416R529L636j707l706o60n914L466
15180e400k127j969L596Q296l087J343j010o480P59J253p294O699k721n430M51
15165a3121P753j903K939L193R319J3480q737j2426p459J694l227L928J530K471
15151e66M9J03j916j908k979j486P594Q681L661j0746j1698J808L890O474J575
15136B536p259P249O334j1770j2511J812m907l401J3154Q898m641k091N506O448
15122E357O187o67q962n824l25Q72k799j218K876L468j0155l909K675L105L257
15107f062J5416n813m399o451k765o228N255J3751l937L022j0866o853P599R046
$$ plain form
15093 715 -1893 -3722 1177 10117 8657 4016 919 -11025 -11105 -15203 -10427 -14164 -20082 -12886 -7171
15078 -7171 325 1431 -1238 -9458 -10608 -13500 -9138 4310 15765 23969 22618 13187 12265 922
15064 922 -7480 -6686 -17276 -15124 -10318 -11337 -4218 3653 -4350 -13133 -15953 -6475 -7501 -10287 -10725
15049 -10725 -1469 4414 4825 2206 2969 2645 3805 7153 6521 -2831 -8082 -13543 -15696 -17460 -8247
15034 -8247 -8509 -4919 -8565 -19411 -23013 -15632 -7879 3056 1672 -8703 -6610 -11836 -8603 -11920
15020 -11920 -8948 -4491 3724 7266 3826 5650 2279 -942 -9098 -2689 5233 5621 3388 -844 -1224
15005 -1224 2057 8940 11696 19572 4009 -8960 -11186 -13721 -14539 -9008 -4154 -4786 -7966 -9457 -1486
14990 -1486 -128 -4777 -14297 -12213 -11628 -16543 -12411 -10839 -17764 -23955 -18296 -7676 -15007 -9779 -7720
$$ packed form
15093G15k608j829M899Q940j460m641l097j1944q0m098M776l737n918P196N715
15078g171P496J106k669q220j150k892M362J3448J1455Q204j351r431r22j1343
15064I22q402P94j0590K152M806j019P119P871q003q783k820R478j026k786m38
15049a0725R256N883M11k619P63l24J160L348o32r352n251n461k153j764R213
15034h247k62L590l646j0846l602P381P753J0935j384j0375K093n226L233l317
15020a1920K972M457Q215L542l440J824l371l221q156O409P922L88k233m232l80
15005a224L281O883K756P876j5563j2969k226k535q18N531M854o32l180j491P971
14990a486J358m649r520K084N85m915M132J572o925o191N659J0620p331N228K059
$$ plain form
14975 -7720 -7002 -3865 897 -2940 -11138 -6517 -6385 -9940 -1572 48 2801 5362 4199 -3682 -12809
14960 -12809 -16592 -13417 -16840 -17582 -12991 -11324 -8647 -4899 -4956 -13942 -23704 -17989 -11341 -11420 -7141 -8967
14944 -8967 -11721 -9248 -11980 -13042 -5850 2050 -3643 -11606 -10011 -4054 11115 7333 5875 2577
14930 2577 -2340 -15827 -18485 -14117 -22391 -15899 -10934 -7721 -5663 -8449 -5675 -11859 -13356 -15108
14916 -15108 -11029 -6946 -14497 -10622 -9587 -8347 -11319 -13954 -16425 -16108 -12130 -11991 -10724 -10209 -2689
14901 -2689 123 5895 8179 10741 6294 1959 -5244 -2517 -3256 -4754 2849 9144 7060 1288 -6513
14886 -6513 -14522 -8677 -1156 -126 623 -7143 -14483 -15894 -18152 -20211 -10783 -4911 -1350 -176 -4890
14871 -4890 -12630 -17392 -17075 -26068 -35980 -31660 -20060 -9613 -6338 -4735 -11331 -9779 -1650 -2537 -7894
$$ packed form
14975g720P18L137M762l837q198M621J32l555Q368J620K753K561j163p881r127
14960a2809l783L175l423p42M591J667K677L748n7q986r762N715O648p9M279j826
14944h967k754K473k732j062P192P900n693p963J595N957J5169l782j458l298
14930B577m917j3487k658M368q274O492M965L213K058k786K774o184j497j752
14916a5108M079M083p551L875J035J240k972k635k471L17L978J39J267N15P520
14901b689K812N772K284K562m447m335p203K727p39j498P603O295k084n772p801
14886f513q009N845P521J030P49p766p340j411k258k059R428N872L561J174m714
14871d890p740m762L17q993r912M320J1600J0447L275J603o596J552Q129q87n357
$$ plain form
14856 -7894 -3755 1608 4149 -2651 57 7078 1119 -5329 -10129 -4603 1349 3977 -4674 -6630 -5064
14841 -5064 985 -4239 -6604 2449 6885 4411 -212 -307 -3620 -4190 -624 -689 -10706 -18709 -26478 -22831
14825 -22831 -10682 -673 1755 9909 7980 1513 -9446 -12684 -11665 -12077 -3077 -3391 -3620 1990
14811 1990 -1747 -11568 -20893 -17401 -14179 -8062 -8500 -9800 -10565 -9973 64 6939 6401 -220 -2423
14796 -2423 -6175 -5883 5571 15163 4299 4076 5663 2179 -7613 -10961 -7026 -277 -5746 -11495 -1117
14781 -1117 2356 -11640 -17309 -15305 -14912 -8799 -8005 -3949 6757 15647 5912 -4950 3778 10765
14767 10765 12535 11899 1799 740 3650 10808 7755 -5787 -11281 -21010 -14762 -13813 -12071 -17425
14753 -17425 -17248 -19148 -15961 -663 7602 -587 -5655 -8296 -9940 -5497 -4406 1700 -1553 -6325
$$ packed form
14856g894M139N363K541o800K708P021n959o448m800N526N952K628q651j956J566
14841e064O049n224k365R053M436k474m623r5l313n70L566o5j0017q003p769L647
14825b2831J2149J0009K428Q154j929o467j0959l238J019m12R000l14k29N610
14811A990l737r821r325L492L222O117m38j300p65N92J0037O875n38o621k203
14796b423l752K92J1454R592j0864k23J587l484r792l348L935O749n469n749J0378
14781a117L473j3996n669K004L93O113P94M056J0706Q890r735j0862Q728O987
14767A0765J770o36j0100j059K910P158l053j3542n494r729O248R49J742n354
14753a7425J77j900L187J5298Q265q189n068k641j644M443J091O106l253m772
$$ plain form
14739 -6325 -9824 -11479 -9036 -8898 -11144 -6415 -4366 -17488 -20517 -8701 1463 -39 1864 10477
14725 10477 18290 14618 1665 2973 8440 -2670 -6698 -6595 -2257 -4773 -14342 -15915 -13573 -18091
14711 -18091 -20418 -14931 -9556 -3207 -7313 -11746 -13102 -9744 -7809 -15858 -21569 -22883 -24212 -22874
14697 -22874 -19869 -12862 -2402 1912 -6250 -5996 -10460 -13394 -9211 2290 1009 -11560 -10082 -10622
14683 -10622 -15385 -6527 -8032 -11148 -5538 2630 -518 -2951 -2293 406 1270 4353 -491 5003 5618
14668 5618 4182 -301 12742 17180 13336 16544 22035 21546 17586 15675 13340 21891 28105 41118
14654 41118 47202 54146 59648 53699 40421 30147 25646 20287 11248 18160 18838 10914 7674 10656
14640 10656 13176 10406 5948 7545 10883 1212 4769 7062 17325 16305 13741 10818 16041 28831
$$ packed form
14739f325l499j655K443J38k246M729K049j3122l029J1816J0164j502J903Q613
14725A0477P813l672j2953J308N467j1110m028J03M338k516r569j573K342m518
14711a8091k327N487N375O349m106m433j356L358J935q049n711j314j329J338
14697b2874L005P007J0460M314q162K54m464k934M183J1501j281j2569J478n40
14683a0622m763Q858j505l116N610Q168l148k433O58K699Q64L083m844N494O15
14668E618j436m483J3043M438l844L208N491m89l960j911k335Q551O214J3013
14654D1118O084O944N502n949j3278j0274m501n359r039O912O78p924l240K982
14640A0656K520k770m458J597L338r671L557K293J0263j020k564k923N223J2790
$$ plain form
14626 28831 29548 21504 16762 19206 21185 22471 27749 22836 33771 52201 68414 89283 114291
14613 114291 123397 126856 112897 101412 85895 67195 49324 48787 48914 47318 46500 49809 43373 28606
14599 28606 28168 30286 24227 20940 26453 12470 10408 11593 11484 23033 30052 28708 21439 12581
14585 12581 13503 24042 36650 50473 55012 74241 91785 107776 131266 146808 159640 173338
14573 173338 186442 174544 155355 137007 113805 81638 62463 50759 43410 41026 36183 29276
14561 29276 32074 38769 33531 23483 29740 33801 28849 16295 19291 21654 18482 14261 22940 24428
14547 24428 25759 24467 39889 60461 60927 50734 44451 49285 56512 79261 100910 124916 128945
14534 128945 137442 143442 138802 123836 102334 84488 66996 47872 39739 33380 26443 29860 36636
$$ packed form
14626B8831P17q044m742K444J979J286N278m913J0935J8430J6213K0869K5008
14613A14291R106L459j3959j1485j5517j8700j7871n37J27j596q18L309o436j4767
14599B8606m38K118o059l287N513j3983k062J185j09J1549P019j344p269q858
14585A2581R22J0539J2608J3823M539J9229J7544J5991K3490J5542J2832J3698
14573A73338J3104j1898j9189j8348k3202l2167j9175j1704p349k384m843o907
14561B9276K798O695n238j0048O257M061m952j2554K996K363l172m221Q679J488
14547B4428J331j292J5422K0572M66j0193o283M834P227K2749K1649K4006M029
14534A28945Q497O000m640j4966k1502j7846j7492j9124q133o359o937L417O776
$$ plain form
14521 36636 30935 28491 28129 25259 22318 20420 17029 15614 13759 6307 4351 7545 9289 16810 14925
14506 14925 14131 10123 20788 19608 15087 8096 10871 18149 25196 35397 43492 47293 54017 50683
14492 50683 43654 26992 15428 11239 7427 7478 12952 5491 -2839 -4744 1572 -1215 -4699 -11302
14478 -11302 -19540 -16724 -5055 926 2789 12926 10152 2570 2848 1593 -6925 -2948 -6583 -2681
14464 -2681 1816 -495 194 6347 -109 -10483 -16011 -11294 -16525 -19847 -14879 -8073 -9730 -10190 -13815
14449 -13815 -10829 -13434 -4364 5143 6321 4376 7058 5853 4647 678 -7241 -24387 -21441 -13129
14435 -13129 -3103 -4360 -13598 -20126 -26590 -25115 -24307 -15644 -8929 -2092 12541 10601 923 -4700
14421 -4700 -3398 -4150 1089 -701 -9555 -16874 -20790 -11496 6833 7197 -6623 -11288 -15152 -18088 -21943
$$ packed form
14521C6636n701k444l62k870k941j898l391j415j855p452j956L194J744P521j885
14506A4925p94m008J0665j180m521o991K775P278P047J0201Q095L801O724l334
14492E0683p029j6662j1564m189l812N1N474p461q330j905O316k787l484o603
14478a1302q238K816J1669N981J863J0137k774p582K78j255q518L977l635L902
14464b681M497k311O89O153o456j0374n528M717n231l322M968O806j657m60l625
14449a3815K986k605R070R507J178j945K682j205j206l969p919j7146K946Q312
14435a3129J0026j257r238o528o464J475Q08Q663O715O837J4633j940r678n623
14421d700J302p52N239j790q854p319l916R294J8329L64j3820m665l864k936l855
$$ plain form
14406 -21943 -12873 -6870 -4915 -6403 -11299 -2512 -3504 -402 1234 -7550 -11116 -12518 -12880 -10874 -9638
14391 -9638 -1991 -210 -2239 690 4510 9361 1140 1950 756 -6121 -5726 -282 1732 -2389 -6205
14376 -6205 -4797 -1745 -11856 -20760 -9337 -8744 -6213 1964 -6370 -10673 -10658 -22538 -22187 -16590 -19654
14361 -19654 -4866 5255 -375 -8016 -14305 -22486 -25192 -26540 -23040 -14475 -6195 -7066 -18061 -20732
14347 -20732 -18996 -12559 -7010 -8381 -11085 -16312 -21119 -18963 -7475 -766 -11550 -18694 -18117 -16777
14333 -16777 -18833 -22130 -22533 -18931 -17122 -18698 -18704 -22227 -24649 -20360 -16770 -13243 -16430 -18953 -21553
14318 -21553 -12568 -6309 -8072 -18743 -17259 -10745 -12050 -18867 -21219 -21286 -22343 -16928 -17016 -23877 -18377
14303 -18377 -10630 -15342 -19944 -14518 -10557 -11112 -4094 -1494 -1331 -2335 -7067 -830 1962 6453 2282
$$ packed form
14406b1943R070O003J955j488m896Q787r92L102J636q784l566j402l62K006J236
14391i638P647J781k029K929L820M851q221Q10j194o877L95N444K014m121l816
14376f205J408L052j0111q904J1423N93K531Q177q334m303J5j1880L51N597l064
14361a9654J4788J0121n630p641o289q181k706j348L500Q565Q280q71j0995k671
14347b0732J736O437N549j371k704n227m807K156J1488O709j0784p144N77J340
14333a6777k056l297m03L602J809j576ol523k422M289L590L527l187k523k600
14318b1553Q985O259j763j0671J484O514j305o817k352o7j057N415q8o861N500
14303a8377P747m712m602N426L961n55P018K600J63j004m732O237K792M491m171
$$ plain form
14288 2282 -2395 -9895 -6452 -6377 -6194 -7318 -5149 -807 -4711 -18405 -16004 -8245 -6980 -7933 -5607
14273 -5607 1484 4218 5448 -1150 -966 810 1688 5051 5841 4166 -575 -1019 5589 10802 9264 -583
14257 -583 -7601 -11840 -11593 -7379 -7088 -3947 -2237 849 -1946 1383 -864 -8791 -9110 -3775 2484 2857
14241 2857 -129 -2339 1504 -3375 -860 4907 2039 -364 -2197 1111 -3563 -2541 -188 -3712 -9376
14226 -9376 -3918 -7133 -8498 -3659 92 -2945 -4699 1304 2803 -2332 -9033 -8056 5064 4154 1497
14211 1497 1618 -2280 2278 1480 86 -3334 -3382 72 5250 17723 5471 255 -1115 2499 5231
14196 5231 5692 4038 -7213 -1374 7517 12744 4479 451 -883 -3850 5777 8798 10970 6623 340
14181 340 78 -295 -5830 -8501 226 2755 139 -2320 -5006 -5410 -10882 -14389 -11330 -6566 -2207 -1930
$$ packed form
14288B282m677p500L443P5J83j124K169M342l904j3694K401P759J265r53K326
14273e607P091K734J230o598J84J776Q78L363P90j675m741m44O608N213j538r847
14257e83p018m239K47M214K91L141J710L086k795L329k247p927l19N335O259L73
14241B857k986k210L843m879K515N767k868k403j833L308m674J022K353l524n664
14226i376N458l215j365M839L751l037j754O003J499n135o701R77J3120r10k657
14211A497J21l898M558p98j394l420m8L454N178J2473j2252n216j370L614K732
14196E231M61j654j1251N839Q891N227q265m028j334k967R627L021K172m347o283
14181C40k62l73n535k671Q727K529k616k459k686m04n472l507L059M764M359K77
$$ plain form
14165 -1930 -10483 -9858 -6897 -6279 -8704 -6911 -2576 -4177 -7238 -11265 -19804 -14745 -14885 -9773 -7442
14150 -7442 -4454 7 -4371 -16777 -17226 -7900 -12133 -7634 -5946 -4623 -10889 -21467 -24397 -23344
14136 -23344 -21683 -16860 -13879 -16265 -10184 -12912 -16375 -9778 -5642 -6626 1327 -2071 -6146 -16918
14122 -16918 -9892 2058 5021 3321 -9077 -19762 -13708 -10026 -15237 -3413 -3447 -5530 -3171 -5059
14108 -5059 -581 -969 -3776 -4309 3416 10225 8303 9707 6189 8168 -5353 -17543 -22530 -13034 -8481
14093 -8481 -9925 -8539 -6946 682 1604 -7850 -4584 -4401 -7997 -4469 1395 6864 9875 6844 4611
14078 4611 6291 8067 6963 5897 -1068 -4287 -14028 -18969 -16456 -6700 -7842 -6186 -1167 -6653 -4110
14063 -4110 -12570 -10528 -10176 -7573 -3327 1190 -192 -12317 -5922 -2678 1778 3678 2708 6342 4084
$$ packed form
14165a930q553O25K961O18k425J793M335j601l061m027q539N059j40N112K331
14150g442K988M461m378j2406m49R326m233M499J688J323o266j0578k930J053
14136b3344J661M823K981k386O081k728l463O597M136r84P953l398m075j0772
14122a6918P026J1950K963j700j2398j0685O054L682n211J1824l4k083K359j888
14108e059M478l88k807n33P725O809j922J404l518J979j3521j2190m987R496M553
14093h481j444J386J593P628R22r454L266J83l596L528N864N469L011l031k233
14078D611J680J776j104j066o965l219r741m941K513R756j142J656N019n486K543
14063d110q460K042L52K603M246M517j382j2125O395L244M456J900r70L634k258
$$ plain form
14048 4084 5509 5909 -256 -152 5804 4477 -3095 -10915 -10977 -11480 -14195 -11090 -10247 -4701 -3529 1183
14032 1183 -5773 -10386 -7075 -1800 5758 4639 -7688 -9101 -8780 -10814 -4724 690 -4382 -5187 -936
14017 -936 -7335 -12634 -16463 -13347 -3361 -939 -67 5967 14049 10478 3779 -3989 -7101 -11106 -13162
14002 -13162 -19783 -21586 -19048 -17046 -12690 -7972 -6892 -349 -9716 -9762 -56 -1114 -11222 -16246 -11466
13987 -11466 -9626 -20710 -22098 -21301 -16769 -15161 -11898 -17033 -5536 10305 17741 9437 4280 -6470
13973 -6470 -10818 -11090 -15755 -22604 -23597 -9970 3942 1887 -7541 -9509 -12712 -16609 -13648 -2380
13959 -2380 -10988 -13918 -10725 -14892 -21007 -21192 -21688 -17534 -16464 -16709 -10949 -9495 -2956 -4516 -7517
13944 -7517 -14233 -7812 -2162 272 -6903 -18599 -10273 -1450 717 3593 1971 -7447 -19605 -21561
$$ packed form
14048D084J425M00o165J04N956j327p572p820o2n03k715L105Q43N546J172M712
14032A183o956m613L311N275P558j119j2327j413L21k034O090N414n072q05M251
14017i36o399n299l829L116R986K422Q72O034Q082l571o699p768l112m005k056
14002a3162o621j803K538K002M356M718J080O543r367m6R706j058j0108n024M780
13987a1466J840j1084j388P97M532J608L263n135J1497J5841P436q304n157j0750
13973f470m348k72m665o849r93J3627J3912k055r428j968l203l897K961J1268
13959b380q608k930L193m167o115j85m96M154J070k45N760J454O539j560l001
13944g517o716O421N650K434p175j1696Q326Q823K167K876j622r418j2158j956
$$ plain form
13930 -21561 -19983 -20755 -15495 -13000 -16344 -11289 -5265 -7815 -958 3725 406 -7710 -10920 -1440 -3881
13915 -3881 -8926 -4546 -2128 -1005 -3551 -12327 -17785 -13655 -10887 -11002 -10100 -9748 -3562 2147 -1200
13900 -1200 -8341 -11002 -6522 -12765 -9666 -9278 -17567 -18536 -8701 -9415 -16872 -12363 -15717 -16953 -10516
13885 -10516 -14428 -23739 -29466 -27460 -23763 -21324 -17169 -18346 -20513 -18321 -15110 -11036 -11205 -19391 -25005
13870 -25005 -17408 -12129 -4657 3117 -1015 2620 8301 3286 -1855 -2874 1035 4406 3805 2807 -6738
13855 -6738 -15185 -8627 -6000 -7245 -4835 -842 6056 5460 -9301 -23618 -18679 -12970 -7607 2509
13841 2509 -1378 -1702 -6648 -6717 4036 -1216 -3580 -6447 -7026 3113 -5137 -6032 -882 -1101 5721 4059
13825 4059 -8801 -8154 -3501 1457 5475 6334 7186 3770 1613 2053 -5500 -15791 -20905 -20316 -27645
$$ packed form
13930b1561J578p72N260K495l344N055O024k550O857M683l319q116l210R480k441
13915c881n045M380K418J123k546q776n458M130K768j15R02L52O186N709l347
13900a200p141k661M480o243L099L88q289r69R835p14p457M509l354j236O437
13885a0516l912r311n727K006L697K439M155j177k167K192L211M074j69q186n614
13870b5005P597N279P472P774m132L635N681n015n141j019L909L371o01r98r545
13855f738q447O558K627j245K410L993O898n96j4761j4317M939N709N363J0116
13841B509l887l24m946o9J0753n252k364k867n79J0139q250q95N150k19O822j662
13825D059j2860O47M653M958M018Q59Q52l416k157M40p553j0291n114N89p329
$$ plain form
13810 -27645 -18433 -12778 -6730 -10799 -20243 -24393 -16163 -7882 -2768 -1334 10312 19256 19048 9458
13796 9458 14 1631 959 -4697 -8030 -16459 -21584 -20515 -15842 -15795 -12841 -431 -6330 -9371 -3035
13781 -3035 -2588 7442 12666 3418 7203 4028 -7702 -10562 -19730 -16784 -11249 -7411 -9513 -3787
13767 -3787 5939 20467 29422 29890 20754 12293 3863 4068 -2575 -1613 -2163 -10840 -8293 -9968 -15074
13752 -15074 -12123 -11782 -10327 -3576 -4487 -128 16 -10757 -25753 -21515 -18689 -18638 -15526 -18112 -23364
13737 -23364 -23160 -13153 -4118 4128 -221 -5457 -7719 -11370 -4091 -10611 -21645 -21016 -9173 -2103
13723 -2103 -2810 -4806 -12709 -10759 -5888 -4386 -11990 -12305 -17632 -16629 -19030 -18412 -19950 -16246 -2768
13708 -2768 -4175 -14101 -14907 -12991 -5052 -3145 -12058 -21027 -22065 -14621 -11277 -11305 -7633 -6774 -7240 -7759
$$ packed form
13810b7645R212N655O048m069r444m150Q230Q281N114J434J1646Q944k08r590
13796I458r444J617o72n656l333q429n125J069M673M7K954J2410n899l041O336
13781c035M47J0030N224r248L785l175j1730k860r168K946N535L838k102N726
13767c787R726J4528Q955M68r136q461q430K05o643R62n50q677K547j675n106
13752a5074K951L41J455O751r11M359J44j0773j4996M238K826N1L112k586n252
13737b3364K04J0007R035Q246m349n236k262l651P279o520j1034O29J1843P070
13723b103p07j996p903J950M871J502p604l15n327J003k401O18j538L704J3478
13708b768j407r926q06J916P939J907q913q969j038P444L344k8L672Q59m66n19
$$ plain form
13692 -7759 -4619 -6349 -8523 -14750 -8553 -7878 -12701 -14564 -7675 -1026 -13814 -27165 -28775 -23415
13678 -23415 -10017 1596 -8457 -23252 -11470 1986 2490 500 -5320 -859 1111 3776 4849
13665 4849 -6097 -15495 -12371 -10630 -10674 -13365 -24260 -32949 -32364 -18030 -6036 -952 -6265 -8822
13651 -8822 -10863 -7452 -9755 -11286 -3017 6638 -374 2866 1140 -5817 -4408 -1041 -2587 -3229 -9217
13636 -9217 -5686 -5010 -3335 906 6616 6612 1239 -1168 -2920 -8818 -9925 -8842 -19017 -14805 -14279 -7088
13620 -7088 -1238 -798 -779 -6813 -11551 3231 9253 8951 6644 3125 -307 -14110 -17901 -3275 352
13605 352 -7654 -10629 -13997 -8897 -5798 -14562 -22925 -24360 -18623 -5287 6905 9046 9986 8187 6964
13590 6964 7239 1183 4928 192 -3659 3218 -2212 -2181 7536 3667 5003 2487 2312 1847 2449 8972
$$ packed form
13692g759L140j730k174o227O197O75m823j863O889O649j2788j3351j610N360
13678b3415J3398J1613j0053j4795J1782J3456N04j990n820M461J970K665J073
13665D849j0946r398L124J741m4k691j0895q689N85J4334J1994N084n313k557
13651h822k041L411k303j531Q269R655p012L240j726o957J409L367j546o42n988
13636i217L531O76J675M241N710mn373k407j752n898j107J083j0175M212N26P191
13620g088N850M40J9o034m738J4782O022l02k307l519l432j3803l791J4626L627
13605C52q006k975l368N100L099q764q363j435N737J3336J2192K141R40j799j223
13590F964K75o056L745m736l851O877n430L1R717l869J336k516j75m65O02O523
$$ plain form
13574 8972 9097 2599 -1001 5382 13875 14189 9860 9112 18208 16711 9978 6764 3130 -2835 -6887
13559 -6887 -5593 -8973 -4956 4547 9046 545 -7285 -7604 4843 -3876 -21473 -22303 -19493 -16949 -13228
13544 -13228 -14117 -20325 -6564 1671 5834 11253 6446 14025 12909 10612 2993 3817 608 -10187
13530 -10187 -5127 -3237 325 -14 -7098 -12173 -17000 -22589 -25462 -22825 -17032 -18721 -20750 -8149
13516 -8149 4441 -9010 -19509 -22066 -13725 -10099 -7276 910 4762 8325 -2723 -5448 -13963 -28450
13502 -28450 -33807 -29095 -24506 -24695 -21819 -9782 -7882 -4897 -8244 -9143 2060 6251 314 -3437
13488 -3437 -6044 -5112 -8282 -10244 -5628 -6342 -882 -7807 -9841 1362 -2996 -9849 -7600 -12063 -12233
13473 -12233 -9767 -4919 -247 -8778 -9245 -7132 -1309 1239 -870 3759 11929 -596 1298 4370
$$ packed form
13574H972J25o498l600O383Q493L14m329p48R096j497o733l214l634n965m052
13559f887J294l380M017R503M499q501p830l19J2447q719j7597q30K810K544L721
13544a3228q89o208J3761Q235M163N419m807P579j116k297p619Q24l209j0795
13530a0187N060J890L562l39p084n075m827n589k873K637N793j689k029J2601
13516h149J2590j3451j0499k557Q341L626K823Q186L852L563j1048k725q515j4487
13502b8450n357M712M589j89K876J2037J900K985l347q99J1203M191n937l751
13488c437k607R32l170j962M616p14N460o925k034J1203m358o853K249m463j70
13473a2233K466M848M672q531m67K113N823K548k109M629Q170j2525J894L072
$$ plain form
13459 4370 1088 -8126 -805 12926 14156 20301 27633 27400 15561 1310 2143 9650 2302 -6196
13445 -6196 1130 9242 11136 4289 -1700 -10026 -11022 -11057 -3544 11092 18929 13592 3849 -10445 -16933
13430 -16933 -10813 -8738 266 303 3911 -104 -14836 -14696 -5296 -3114 -42 6284 8469 5521 2848
13415 2848 -4706 -149 -5755 -12101 -11411 -14706 -8334 -11294 -7262 -13293 -12035 -6691 -9141 -8471 -2403
13400 -2403 -387 -1539 -1204 817 3819 1800 9846 21989 28606 32834 38822 54192 49779 32668
13386 32668 10273 7329 14929 11866 7853 12568 24225 39853 38449 37450 37284 27132 26649 16465
13372 16465 14800 15897 12587 15245 14013 10184 11054 11971 10251 7133 -722 -6582 8417 9869 -2383
13357 -2383 4037 1841 5357 14028 15200 15594 14221 15004 13500 8778 11944 12944 19329 26472 22914
$$ packed form
13459D370l282r214P321J3731J230O145P332k33j1839j4251Q33P507p348q498
13445f196P326Q112J894o847n989q326r96l5P513J4636P837n337r743j4294o488
13430a6933O120K075R004L7L608m015j4732J40R400K182L072O326K185k948k673
13415B848p554M557n606o346O90l295O372k960M032o031J258N344k450O70O068
13400b403K016j152L35K021L002k019Q046J2143O617M228N988J5370m413j7111
13386C2668k2395k944P600l063m013M715J1657J5628j404r99j66j0152m83j0184
13372A6465j665J097l310K658j232l829Q70R17j720l118p855n860J4999J452j2252
13357b383O420k196L516Q671J172L94j373P83j504m722L166J000O385P143l558
$$ plain form
13342 22914 15362 7411 2823 8004 26768 35605 46297 54949 58086 60405 50294 48352 35738
13329 35738 27537 20191 22971 22122 14162 7175 2579 887 3940 5612 4068 7689 9817 18605 24129
13314 24129 10133 9172 17078 21001 12705 11473 9631 129 2736 14684 14998 16419 19528 22760
13300 22760 25261 24993 25967 22697 31304 36450 34441 42603 50874 54866 56721 67522 70155 61439 47565
13285 47565 38014 32357 31859 32825 27804 20846 18523 11491 18541 22350 25974 29187 21680 15974 7229
13270 7229 -780 -1334 2205 1554 -5132 -11257 -10930 -4231 -300 8067 12920 9337 5860 -103 -10827
13255 -10827 -13587 5002 9747 1371 -2297 2732 8396 5263 4352 8844 8055 18577 9748 11054
13241 11054 14227 18341 18930 15141 13962 15054 16100 17125 21448 19501 14446 7711 7437 16991 21026
$$ packed form
13342B2914p552p951m588N181J8764Q837J0692Q652L137K319j0111j942j2614
13329C5738q201p346K780q49p960o987m596j692L053J672j544L621K128Q788N524
13314B4129j3996r61P906L923q296j232j842r502K607J1948L14J421L109L232
13300B2760K501k68R74l270Q607N146k009Q162Q271L992J855J0801K633q716j3874
13285D7565r551n657m98R66n021o958k323p032P050L809L624L213p507n706q745
13270G229q009n54L539o51o686o125L27O699L931Q367M853l583l477n963j0724
13255a0827k760J8589M745q376l668N029N664l133r11M492p89J0522q829J306
13241A1054L173M114N89l789j179J092J046J025M323j947n055o735k74R554M035
$$ plain form
13226 21026 16926 13674 13498 9563 8635 5473 6884 5632 -4714 -5882 -1780 4366 -1625 -1821 166
13211 166 -804 901 -6476 -3545 -1173 1793 948 -3076 -1751 -4166 -4410 -1111 1395 -3792 9889
13196 9889 8277 6903 7545 896 -3805 -4054 -12401 -7817 -1607 -1750 -6737 -7361 1064 4554 1210 -1456
13180 -1456 7538 11537 6251 10417 11509 12164 16021 9426 4712 6825 7636 7450 6031 -2676 -16355
13165 -16355 -9825 -6647 -1846 -5362 -11770 -10222 79 5147 -2818 -1381 1332 10662 10085 8119
13151 8119 13692 17783 14696 6065 4901 3506 12165 24691 21372 8266 -2918 -1791 15690 23544
13137 23544 23365 29594 28146 21244 16584 17988 12587 12215 18582 17735 16499 18077 21171 11008 3777
13122 3777 1657 4786 12183 15447 9316 5698 16826 13385 10003 12835 12035 13812 13110 6871 13055
$$ packed form
13226B1026m100l252j76l935r28l162J411j252j0346j168M102O146n991j96J987
13211A66r70J705p377K931K372K966q45m024J325k415k44L299K506n187J3681
13196I889j612j374O42o649m701k49q347M584O210j43m987o24Q425L490l344k666
13180a456Q994L999n286M166J092O55L857o595m714K113Q11j86j419q707j3679
13165a6355O530L178M801l516o408J548J0301N068p965J437K713R330n77j966
13151H119N573M091l087q631j164j395Q659J2526l319j3106j1184J127J7481P854
13137B3544j79O229j448o902m660J404n401l72O367q47j236J578L094j0163p231
13122C777k120L129P397L264o131l618J1128l441l382K832q00J777p02o239O184
$$ plain form
13107 13055 21385 27459 26981 21778 15662 9766 7880 16372 13761 18566 22645 22168 25574 21531 19319
13092 19319 12876 -7196 -5602 -13934 -7754 9701 17816 12337 16692 13678 12217 7571 2559 2120
13078 2120 1343 8969 15303 14366 12424 7755 5732 5306 -5823 -10731 -8348 1669 3151 5284 14491
13063 14491 22839 21083 13385 15706 16380 15604 16599 13001 6473 -2635 -2008 2530 4385 567 1978
13048 1978 5381 9943 -560 -10934 -10466 -11889 -6163 -1773 1205 6266 2724 5937 9794 13137
13034 13137 4042 6056 4621 5406 12767 8426 9830 13083 21631 23508 19777 13172 5229 1080 5243
13019 5243 11653 13884 10524 6319 9305 6464 16497 22454 27070 33367 29056 21044 29212 21596
13005 21596 18495 12203 2129 6909 14571 10889 10184 17322 28124 35198 26147 17827 19295 7502
$$ packed form
13107A3055Q330O074m78n203o116n896j886Q492k611M805M079m77L406m043k212
13092A9319o443k0072J594q332O180J7455Q115n479M355l014j461m646n012m39
13078B120p77P626O334r37j942m669k023m26j1129m908K383J0017J482K133R207
13063A4491Q348j756p698K321O74p76R95l598o528r108O27M538J855l818J411
13048A978L403M562j0503j0374M68j423N726M390K978N061l542L213L857L343
13034A3137r095K014j435P85P361m341J404L253Q548J877l731o605p943m149M163
13019E243O410K231l360m205K986k841J0033N957M616O297m311q012Q168p616
13005B1596l101o292j0074M780P662l682p05P138J0802P074r051q320J468j1793
$$ plain form
12991 7502 4980 13245 16439 11577 4380 5688 4483 10562 12756 8146 12096 17941 17897 12043 14642
12976 14642 20523 21663 20633 12429 7342 7926 6191 962 -5273 -4064 8340 19345 29684 30914
12962 30914 35377 31207 27886 26718 24771 4274 -2698 5725 12826 16689 24225 20800 21517 24985
12948 24985 20444 14178 22934 24037 23259 21326 18186 24924 36976 38477 34826 27188 23588 27758
12934 27758 25885 14932 18045 25058 30151 24233 24892 22788 16113 8989 15695 16593 11515 9264 11552
12919 11552 15849 19628 16227 8597 13503 17721 15539 12143 19897 27511 29377 24526 24161 34917
12905 34917 37673 34964 29502 33254 40256 46198 48070 43218 34212 27892 26120 26339 28545 31253 38301
12890 38301 40675 47827 60469 75317 93380 132658 177318 206698 212458 193127 153075 106840
$$ packed form
12991G502k522Q265L194m862p197J308j205O079K194m610L950N845m4n854K599
12976A4642N881J140j030q204n087N84j735n229o235J209J2404J1005J0339J230
12962C0914M463m170l321j168j947k0497o972Q423P101L863P536l425P17L468
12948B4985m541o266Q756J103p78j933l140O738J2052J501l651p638l600M170
12934B7758j873j0953L113P013N093n918O59k104o675p124O706Q98n078k251K288
12919A1552M297L779l401p630M906M218k182l396P754P614J866m851l65J0756
12905C4917K756k709n462L752P002N942J872m852r006o320j772K19K206K708P048
12890C8301K374P152J2642J4848J8063L9278M4660K9380N760j9331m0052m6235
$$ plain form
12878 106840 85894 82934 82300 84535 92486 105446 111245 108336 96834 86892 75750 68114 53673
12865 53673 40644 41757 40396 34306 30699 36200 39940 41407 40905 42406 47044 50227 46585 39731
12851 39731 32491 32875 39145 35192 33116 32510 37374 35174 31678 33998 37947 34577 35622 23199 17156
12836 17156 17040 18397 27467 37485 39985 38770 38534 41572 45630 46832 46406 40759 47670 53582 39877
12821 39877 26970 32188 42545 43673 47898 51924 50692 45424 48658 47852 46846 47476 49812 51269
12807 51269 48277 42893 46795 55723 54629 49166 53633 56475 55759 56239 53845 57831 62458 75841 84590
12792 84590 78349 71144 73736 87752 105756 121359 122610 136173 150953 169289 194786 223166
12780 223166 242282 286864 365986 479582 644713 888825 1225807 1666589 2162643 2574989
$$ packed form
12878A06840k0946k960o34K235P951J2960N799k909j1502r942j1142p636j4441
12865E3673j3029J113j361o090l607N501L740J467n02J501M638L183l642o854
12851C9731p240L84O270l953k076o06M864k200l496K320L949l370J045j2423o043
12836A7156j16J357R070J0018K500j215k36L038M058J202m26n647O911N912j3705
12821C9877j2907N218J0357J128M225M026j232n268L234q06j006O30K336J457
12807E1269k992n384L902Q928j094n463M467K842p16M80k394L986M627J3383Q749
12792H4590o241p205K592J4016J8004J5603J251J3563J4780J8336K5497K8380
12780B23166J9116M4582P9122J13596J65131K44112L36982M40782M96054M12346
$$ plain form
12770 2574989 2673420 2334099 1699834 1163138 813727 605690 474286 394506 337659 289846
12760 289846 251673 219478 203055 189058 170352 163168 155233 137479 119960 120887 125648 119881 107812
12747 107812 103760 106180 100944 95274 100289 108174 113966 104971 97123 82713 73314 78886 87495 79165
12733 79165 73825 72799 71172 73927 78126 85669 90221 88103 86134 91377 89838 83541 91568 103206
12719 103206 108235 99960 92925 81317 76183 72031 66299 67225 68286 65081 58947 56270 60449 70619
12705 70619 73908 68487 60468 56882 64609 75180 70819 63957 61202 58710 63647 74815 82033 81125
12691 81125 78242 82884 83866 80701 73022 65817 62987 68189 69639 71872 75900 76810 72181 76885 72048
12676 72048 71083 72492 71125 70233 75144 85933 87015 80238 71909 80546 87944 82740 81411 79429 69358
$$ packed form
12770B574989R8431l39321o34265n36696l49411k08037j31404p9780n6847m7813
12760B89846l8173l2195j6423j3997j8706p184p935j7754j7519R27M761n767j2069
12747A07812m052K420n236n670N015P885N792q995p848j4410r399N572Q609q330
12733G9165n340j026j627K755M199P543M552k118j969N243j539o297Q027J1638
12719A03206N029q275p035j1608n134m152n732R26J061l205o134k677M179J0170
12705G0619L289n421q019l586P727J0571m361o862k755k492M937J1168P218r08
12691H1125k883M642R82l165p679p205k830N202J450K233M028R10m629M704m837
12676G2048r65J409j367q92M911J0789J082o777q329Q637P398n204j329j982j0071
$$ plain form
12661 69358 73164 76106 81793 83706 85275 84247 88320 83553 74753 71445 83172 82891 77787 71006
12647 71006 72207 73919 81229 80023 72814 74623 75404 73317 73427 76487 78084 84512 91434 93330 91671
12632 91671 86882 87943 85307 90082 87164 83769 86340 92237 92361 92377 92352 95993 93008 87554 92826 98642
12616 98642 98171 108854 115826 110747 104145 110797 113339 107771 99474 93038 91904 102460 119353 136229
12602 136229 148961 147742 152887 153409 145960 136795 123563 113441 109779 115193 115304 102387 100331 115147
12588 115147 122418 123009 118280 115150 114339 108193 111034 117208 117649 116433 118653 117320 117854 117095 113786
12573 113786 110341 106125 104172 109017 115492 126417 132398 127246 115784 118720 117082 117627 115731 122258
12559 122258 122905 123932 120015 121590 130029 139151 142417 139928 139131 137211 134971 129945 130718 131569 132630
$$ packed form
12661F9358L806K942N687J913J569j028M073m767q800l308J1727k81n104o781
12647G1006J201J712P310j206p209J809P81k087J10L060J597O428O922J896j659
12632I1671m789J061k636M775k918l395K571N897J24J6k5L641k985n454N272N816
12616I8642m71J0683O972n079o602O652K542n568q297o436j134J0556J6893J6876
12602A36229J2732j219N145N22p449r165j3232j0122l662N414J11j2917k056J4816
12588A15147P271N91m729l130q11o146K841O174M41j216K220j333N34p59l309
12573A13786l445m216j953M845O475J0925N981n152j1462K936j638N45j896O527
12559A22258O47J027l917J575Q439R122L266k489p97j920k240n026P73Q51J061
$$ plain form
12544 132630 137078 135446 133773 136717 132096 129734 127341 127488 134196 144529 146627 151699 165357 151472
12530 151472 152043 164802 163575 158499 155287 163804 174743 180402 187365 186936 179178 185646 187339 180172
12516 180172 179091 180900 182041 181578 184831 183458 174793 174839 169349 160112 158383 163340 172221 173756 173350
12501 173350 170413 167611 165917 174273 179687 181429 182787 188923 190280 191520 200255 200214 191288 182381 178034
12486 178034 187012 211195 217394 219319 221211 219792 222308 219292 210959 210070 214118 215616 215179 217340
12472 217340 220277 215119 207380 213412 213818 220914 232676 237185 241780 240083 235356 235092 234243 234588 237083
12457 237083 249072 258133 269786 269983 261166 256180 252792 257028 259289 271171 276264 278933 278036 276239
12443 276239 272838 276941 277700 288385 294029 299405 309446 313639 312053 313417 319593 319365 311859 316250
$$ packed form
12544A32630M448j632j673K944m621k362k393J47O708J0333K098N072J3658j3885
12530A51472N71J2759j227n076l212Q517J0939N659O963m29p758O468J693p167
12516A80172j081J809J141m63L253j373q665M6n490r237j729M957Q881J535m06
12501A73350k937k802j694Q356N414J742J358O136J357J240Q735m1q926q907m347
12486A78034Q978K4183O199J925J892j419K516l016q333q89M048J498m37K161
12472B17340K937n158p739O032M06P096J1762M509M595j697m727k64q49L45K495
12457B37083J1989R061J1653J97q817m986l388M236K261J1882N093K669q97j797
12443B76239l401M103P59J0685N644N376J0041M193j586J364O176k28p506M391
$$ plain form
12429 316250 328997 324703 321811 323562 318806 327794 333836 336255 326691 320229 315956 317181 328785 342510
12415 342510 337922 345225 351558 358566 360159 357374 362845 364962 361370 366778 377441 386710 394075 396099
12401 396099 392517 386141 393974 396865 400208 399073 401673 407140 408697 412046 411851 421337 417713 411525
12387 411525 416514 424431 435599 446469 444976 452214 457145 465676 474271 475416 486086 488954 496974
12374 496974 501600 508078 514120 530121 530537 526768 539373 546868 551276 552672 558938 556424 560454 566031
12360 566031 580338 594614 607369 615759 621045 625517 644431 649854 640837 648245 654411 664671 673760
12347 673760 668674 682013 702976 711077 716817 723814 730433 739710 754494 759889 777411 786646 794842
12334 794842 805994 817580 823999 835202 832731 839878 858554 881943 896986 913523 928192 939946
$$ packed form
12429C16250J2747m294k892J751m756Q988O042K419r564o462m273J225J1604J3725
12415C42510m588P303O333P008J593k785N471K117l592N408J0663R269P365K024
12401C96099l582o376P833K891L343j135K600N467J557L349j95R486l624o188
12387D11525M989P917J1168J0870j493P238M931Q531Q595J145J0670K868Q020
12374D96974M626O478O042J6001M16l769J2605P495M408J396O266k514M030N577
12360E66031J4307J4276J2755Q390N286M472J8914N423r017P408O166J0260R089
12347F73760n086J3339K0963Q101N740O997O619R277J4784N395J7522R235Q196
12334G94842J1152J1586O419J1203k471P147J8676K3389J5043J6537J4669J1754
$$ plain form
12322 939946 956131 966553 982971 993826 1018857 1044166 1060122 1069091 1074941 1088273 1105541 1120080
12310 1120080 1138458 1159209 1188681 1202827 1216512 1236447 1259928 1288928 1315556 1341189 1365546
12299 1365546 1389482 1406428 1420728 1442690 1476069 1505964 1522045 1540310 1564194 1594745 1631090
12288 1631090 1666209 1701740 1741023 1778648 1812125 1847658 1878831 1906594 1953156 2005336 2037437
12277 2037437 2066361 2119055 2176420 2213903 2255297 2309848 2364446 2408526 2463466 2513601 2564206
12266 2564206 2633403 2705010 2766651 2824953 2891524 2967328 3050803 3129708 3202937 3282762 3372631
12255 3372631 3455901 3550479 3647081 3755026 3849099 3942357 4042425 4155365 4270201 4390939
12245 4390939 4519362 4645794 4767621 4903394 5047308 5202225 5351523 5511856 5684840
$$ packed form
12322I39946J6185J0422J6418J0855K5031K5309J5956Q969N850J3332J7268J4539
12310A120080J8378K0751K9472J4146J3685J9935K3481K9000K6628K5633K4357
12299A365546K3936J6946J4300K1962L3379K9895J6081J8265K3884L0551L6345
12288A631090L5119L5531L9283L7625L3477L5533L1173K7763M6562N2180L2101
12277B037437K8924N2694N7365L7483M1394N4551N4598M4080N4940N0135N0605
12266B564206O9197P1607O1641N8302O6571P5804Q3475P8905P3229P9825Q9869
12255C372631Q3270R4578R6602J07945R4073R3258J00068J12940J14836J20738
12245D390939J28423J26432J21827J35773J43914J54917J49298J60333J72984
$$ plain form
12236 5684840 5865369 6025023 6203062 6392062 6582360 6782946 6990309 7207680 7426985
12227 7426985 7647917 7880220 8120514 8372477 8623164 8869720 9128900 9394479 9663847
12218 9663847 9935889 10225994 10506343 10784875 11073557 11351576 11627086 11906961 12190760
12209 12190760 12466085 12716486 12957459 13196951 13421794 13627522 13815120 13986894 14140061
12200 14140061 14269710 14376501 14459575 14515442 14543632 14558325 14537275 14488912 14425496 14336925 14217400
12189 14217400 14084700 13928055 13752885 13554381 13349095 13135010 12903796 12662364 12410303
12180 12410303 12154588 11894658 11633052 11361214 11083679 10815311 10545484 10272429 10005603
12171 10005603 9745813 9482711 9218351 8963985 8719203 8487646 8246544 8016097 7794398
$$ packed form
12236E684840J80529J59654J78039J89000J90298K00586K07363K17371K19305
12227G426985K20932K32303K40294K51963K50687K46556K59180K65579K69368
12218I663847K72042K90105K80349K78532K88682K78019K75510K79875K83799
12209A2190760K75325K50401K40973K39492K24843K05728J87598J71774J53167
12200A4140061J29649J06791Q3074N5867K8190J4693k1050m8363o3416q8571j19525
12189A4217400j32700j56645j75170j98504k05286k14085k31214k41432k52061
12180A2410303k55715k59930k61606k71838k77535k68368k69827k73055k66826
12171A0005603k59790k63102k64360k54366k44782k31557k41102k30447k21699
$$ plain form
12162 7794398 7579620 7365752 7169909 6975136 6774978 6596812 6416468 6231470 6059188
12153 6059188 5893418 5726326 5578827 5428933 5286497 5149968 5013106 4874654 4749710
12144 4749710 4631381 4507575 4389246 4281936 4176297 4071342 3968419 3880519 3782791 3687471
12134 3687471 3597803 3508565 3417651 3339912 3271100 3196637 3129572 3063202 3003272 2929764 2868914
12123 2868914 2809944 2747711 2685918 2623123 2564101 2494410 2443484 2391961 2343022 2301233 2261075
12112 2261075 2222260 2186334 2138812 2093761 2047516 2010708 1973958 1931640 1890367 1861681 1827202
12101 1827202 1786345 1751719 1719282 1695683 1671103 1636614 1606303 1580390 1553914 1526175 1491520
12090 1491520 1469780 1451978 1418956 1398162 1378192 1352424 1331146 1309086 1288423 1263607 1245868
$$ packed form
12162G794398k14778k13868j95843j94773k00158j78166j80344j84998j72282
12153F059188j65770j67092j47499j49894j42436j36529j36862j38452j24944
12144D749710j18329j23806j18329j07310j05639j04955j02923q7900r7728r5320
12134C687471q9668q9238r0914p7739o8812p4463o7065o6370n9930p3508o0850
12123B868914n8970o2233o1793o2795n9022o9691n0926n1523m8939m1789m0158
12112B261075l8815l5926m7522m5051m6245l6808l6750m2318m1273k8686l4479
12101A827202m0857l4626l2437k3599k4580l4489l0311k5913k6476k7739l4655
12090A491520k1740j7802l3022k0794j9970k5768k1278k2060k0663k4816j7739
$$ plain form
12079 1245868 1230024 1210901 1182893 1160579 1143729 1125818 1114436 1093134 1081171 1070903 1053194
12068 1053194 1038468 1029355 1014206 996936 969958 947657 940478 924824 913474 900076 887011 890313
12056 890313 880692 860960 851460 838735 824440 806305 796017 792334 781132 766302 757813 745874
12044 745874 739422 732769 732594 728893 710728 700588 701688 703519 684659 670472 667186 660898 652348
12031 652348 640191 626269 622776 615520 596513 588047 589576 577637 563935 552770 551248 548767 546296
12018 546296 538353 526017 520438 532655 532286 518532 509350 515601 515015 506066 480203 458658 457308
12005 457308 461412 456263 451388 454593 448921 450162 444815 443553 442984 430451 423945 425102 421244 408031
11991 408031 401402 395092 381349 380596 389207 388662 379299 374548 369964 363949 364537 358037 347723 347684 351559
$$ packed form
12079A245868j5844j9123k8008k2314j6850j7911j1382k1302j1963j0268j7709
12068A053194j4726r113j5149j7270k6978k2301p179j5654j1350j3398j3065L302
12056H90313r621j9732r500j2725j4295j8135j0288l683j1202j4830q489j1939
12044G45874o452o653j75l701j8165j0140J100J831j8860j4187l286o288q550
12031F52348j2157j3922l493p256j9007q466J529j1939j3702j1165j522k481k471
12018E46296p943j2336n579J2217l69j3754r182O251n86q949k5863k1545j350
12005D57308M104n149m875L205n672J241n347j262n69j2533o506J157l858j3213
11991D08031o629o310j3743p53Q611n45r363m751m584o015N88o500j0314l9L875
$$ plain form
11976 351559 355281 348471 340278 334338 334290 338266 345364 337332 330046 327576 327429 319311 312676 301107 290687
11961 290687 295424 292001 289327 286708 285446 284393 280145 283419 288499 294020 293655 286299 281399 273292
11947 273292 268600 274370 280301 277094 269052 261487 249809 241664 249782 252545 253754 253801 249837 245977
11933 245977 238101 229804 222861 220961 224773 228023 223825 222232 223962 217200 215323 211290 208599 209739
11919 209739 210228 205191 202150 204688 213510 216442 217548 218698 219574 210771 197293 198924 199579 200165 200166 202204
11903 202204 203637 205124 202060 192106 181011 190438 188987 185878 194565 195600 201824 209481 202182 199414
11889 199414 189409 183878 181961 177709 164102 158169 155812 172881 182058 176258 173649 173171 169850 175630
11875 175630 175750 165025 173363 177674 179005 174808 170107 163765 167884 170199 169794 164715 165959 156588
$$ packed form
11976C51559L722o810q193n940m8L976P098q032p286k470j47q118o635j1569j0420
11961B90687M737l423k674k619j262j053m248L274N080N521l65p356m900q107
11947B73292m692N770N931l207q042p565j1678q145Q118K763J209M7l964l860
11933B45977p876q297o943j900L812L250m198j593J730o762j877m033k691J140
11919B09739M89n037l041K538Q822K932J106J150Q76q803j3478J631O55N86JK038
11903B02204J433J487l064r954j1095R427j451l109Q687J035O224P657p299k768
11889A99414j0005n531j917m252j3607n933k357J7069R177n800k609m78l321N780
11875A75630J20j0725Q338M311J331m197m701o342M119K315m05n079J244r371
$$ plain form
11861 156588 154607 164091 158272 156334 168574 161577 150080 148082 153824 160956 158385 148119 149647
11848 149647 156318 164709 169260 162848 159646 160585 160527 156982 160729 162189 160438 153218 137518 134223 129384
11833 129384 129525 134042 128155 128495 130750 124587 127133 129831 138528 131017 129120 132314 141388 144073 139049
11818 139049 130820 127319 126462 131873 139843 138228 140007 145060 151296 161553 168803 168598 176918 185837
11804 185837 195463 212566 241006 267648 311877 355176 392245 438282 469247 491794 521640 535584
11792 535584 539137 521587 493511 469918 443806 406869 369340 324171 278765 250239 229506 211060
11780 211060 193909 186290 173904 155674 148281 147923 143317 140815 144206 143389 132097 127472 131735 134174
11766 134174 131090 121846 110500 109320 112447 114106 113108 100725 92808 89311 89444 90181 96526 100835
$$ packed form
11861A56588j981R484n819j938J2240o997j1497j998N742P132k571j0266J528
11848A49647O671Q391M551o412l202R39n8l545L747J460j751p220j5700l295m839
11833A29384J41M517n887L40K255o163K546K698Q697p511j897L194R074K685n024
11818A39049q229l501q57N411P970j615J779N053O236J0257P250k05Q320Q919
11804A85837R626J7103K8440K6642M4229M3299L7069M6037L0965K2547K9846J3944
11792E35584L553j7550k8076k3593k6112l6937l7529m5169m5406k8526k0733j8446
11780B11060j7151p619j2386j8230p393l58m606k502L391q17j1292m625M263K439
11766A34174l084r244j1346j180L127J659r98j2383p917l497J33P37O345M309
$$ plain form
11752 100835 91702 89144 90376 85692 82555 80494 75300 76201 82703 87415 90918 80730 79376 75791
11738 75791 71574 77198 80203 82409 82800 84754 85429 88335 88099 89649 89752 90039 89810 91115 87321 84527
11722 84527 86447 89443 96368 102484 98633 98464 103863 110108 111751 113742 101044 96713 100218 93291
11708 93291 88888 88236 83947 80826 80109 83809 85482 85931 97869 93511 83149 68695 60542 73502
11694 73502 79113 82224 82457 74068 81281 87310 84484 74707 67906 64216 71740 70432 72703 77853 68773
11679 68773 77775 88501 92436 95526 94756 97645 116539 130286 133167 142239 147689 147585 131280 114680
11665 114680 101157 91381 98155 104380 105524 97362 91312 96400 92209 87288 82122 76456 68076 73044
11651 73044 83034 85317 80411 74003 76086 76507 82483 90627 88873 85672 84403 91204 99821 109206 118298
$$ packed form
11752A00835r133k558J232m684l137k061n194R01O502M712L503j0188j354l585
11738G5791m217N624L005K206L91J954O75K906k36J550J03K87k29J305l794k794
11722H4527J920K996O925O116l851j69N399O245J643J991j2698m331L505o927
11708I3291m403o52m289l121p17L700J673M49J1938m358j0362j4454q153J2960
11694G3502N611L111K33q389P213O029k826r777o801l690P524j308K271N150r080
11679F8773R002J0726L935L090p70K889J8894J3747K881R072N450j04j6305j6600
11665A14680j3523r776O774O225J144q162o050N088m191m921n166n666q380M968
11651G3044R990K283m906o408K083M21N976Q144j754l201j269O801Q617R385R092
$$ plain form
11636 118298 127535 143903 156097 161805 168766 170634 173995 171531 180851 186805 199973 197082 183458
11623 183458 177854 174533 160677 136695 121876 117159 112744 102520 95306 97829 99785 97515 98970
11610 98970 93435 82728 83417 82095 76416 89550 87280 93877 95247 90482 91335 88962 79137 78920 78080
11595 78080 80752 83168 75400 69335 62603 62595 64199 66796 66257 75995 79186 81786 77359 74528 84862
11580 84862 91037 89670 94673 105619 94372 88734 90892 88131 71117 66458 72793 76500 62502
11567 62502 65471 69197 72172 83217 86701 90273 89306 91311 90927 96198 88416 95614 96894 94478 90226
11552 90226 86210 76967 72782 68479 66567 71363 66833 72071 80887 77568 75669 75305 74354 78202 81052
11537 81052 78045 78888 80780 83280 83832 89752 81412 77731 78946 85087 95868 103465 100387 83179
$$ packed form
11636A18298R237J6368J2194N708O961J868L361k464R320N954J3168k891j3624
11623A83458n604l321j3856k3982j4819m717m415j0224p214K523J956k270J455
11610I8970n535j0707O89j322n679J3134k270O597J370m765Q53k373r825k17q40
11595G8080K672K416p768o065o732qJ604K597n39R738L191K600m427k831J0334
11580H4862O175j367N003J0946j1247n638K158k761j7014m659O335L707j3998
11567F2502K969L726K975J1045L484L572r67K005l84N271p782P198J280k416m252
11552I0226m016r243m185m303j912M796m530N238Q816l319j899l64r51L848K850
11537H1052l007Q43J892K500N52N920q340l681J215O141J0781P597l078j7208
$$ plain form
11523 83179 72498 75179 89812 97579 93944 97571 98379 100632 103987 106372 112504 130553 128462 133528
11509 133528 142090 148496 158094 160241 147148 141639 145850 151832 139355 132540 145576 158429 154710
11496 154710 148585 149251 151708 166394 168079 169608 176876 165715 163442 167209 172761 166849 167960 171892
11482 171892 171157 168071 155523 143811 154385 162722 155114 160004 173462 171039 166158 170145 168355
11469 168355 169004 176468 178289 184968 182525 169065 163450 167893 177518 184757 197082 203759 214468 224234
11455 224234 227959 227531 221963 233846 252010 261418 272501 286852 308696 324654 338893 347768 358821
11442 358821 364705 382023 402396 423187 447803 474997 506964 545517 590723 656221 747765 847982
11430 847982 955126 1070903 1183862 1309306 1425334 1535490 1654289 1749438 1795302 1793196
$$ packed form
11523H3179j0681K681J4633P767l635L627Q08K253L355K385O132J8049k091N066
11509A33528Q562O406R598K147j3093n509M211N982j2477o815J3036J2853l719
11496A54710o125O66K457J4686J685J529P268j1161k273L767N552n912J111L932
11482A71892p35l086j2548j1712J0574Q337p608M890J3458k423m881L987j790
11469A68355O49P464J821O679k443j3460n615M443R625P239J2325O677J0709R766
11455B24234L725m28n568J1883J8164R408J1083J4351K1844J5958J4239Q875J1053
11442C58821N884J7318K0373K0791K4616K7194L1967L8553M5206O5498R1544J00217
11430H47982J07144J15777J12959J25444J16028J10156J18799R5149M5864k106
$$ plain form
11420 1793196 1755145 1672761 1580996 1485840 1413687 1375029 1357457 1351968 1372279 1419017 1474971
11409 1474971 1547245 1623974 1731428 1853866 1997301 2165777 2372086 2602758 2883881 3209683
11399 3209683 3592917 4031290 4536228 5112807 5759881 6497654 7348787 8360732 9596194
11390 9596194 11146561 13196581 15989186 19801582 24935146 31581784 39655538 48598950
11382 48598950 57352699 64885300 70953216 76093813 80536022 83313995 82977325 79158000
11374 79158000 73128029 66696407 60674881 54449235 47165538 39000420 31102895 24569193
11366 24569193 19725676 16299048 13853966 12068797 10711685 9621152 8705767 7911787
11358 7911787 7214089 6599006 6048771 5543185 5084662 4648421 4266177 3925108 3610488
$$ packed form
11420A793196l8051q2384r1765r5156p2153l8658j7572n489K0311M6738N5954
11409A474971P2274P6729J07454J22438J43435J68476K06309K30672K81123L25802
11399C209683L83234M38373N04938N76579O47074P37773Q51133J011945J235462
11390I596194J550367K050020K792605L812396N133564O646638Q073754Q943412
11382D8598950Q753749P532601O067916N140597M442209K777973l36670l819325
11374G9158000o029971o431622o021526o225646p283697q165118p897525o533702
11366B4569193m843517l426628k445082j785169j357112j090533r15385p93980
11358G911787o97698o15083n50235n05586m58523m36241l82244l41069l14620
$$ plain form
11349 3610488 3330074 3089242 2896006 2720310 2555099 2407974 2288265 2183292 2082999
11340 2082999 1990153 1904878 1822597 1748067 1674254 1618800 1570386 1523879 1472114 1414016 1375341
11329 1375341 1348409 1313371 1280003 1249663 1221608 1188177 1166290 1139665 1116136 1083706 1052091
11318 1052091 1022452 992683 951102 917217 885716 850145 807045 767483 733079 708939 687351
11307 687351 667115 645260 621986 611152 581465 556167 551041 552885 535677 513526 497818 488053
11295 488053 471614 455965 440928 431404 413896 404764 393000 370163 369154 361423 350191 345060
11283 345060 329116 318832 321505 328608 328842 312297 299110 291119 284479 275293 271826 273510 271941
11270 271941 261301 240292 235537 240980 231669 223810 219760 210024 205987 214300 207075 202527 213453
$$ packed form
11349C610488k80414k40832j93236j75696j65211j47125j19709j04973j00293
11340B082999r2846q5275q2281p4530p3813n5454m8414m6507n1765n8098l8675
11329A375341k6932l5038l3368l0340k8055l3431k1887k6625k3529l2430l1615
11318A052091k9639k9769m1581l3885l1501l5571m3100l9562l4404k4140k1588
11307F87351k0236k1855k3274j0834k9687k5298n126J844j7208k2151j5708r765
11295D88053j6439j5649j5037r524j7508r132j1764k2837j009p731j1232n131
11283C45060j5944j0284K673P103K34j6545j3187p991o640r186l467J684j569
11270B71941j0640k1009m755N443r311p859m050r736m037Q313p225m548J0926
$$ plain form
11257 213453 219342 222216 225627 219056 216531 214945 215373 210046 209424 205801 197242 192504 183761 169553
11243 169553 158181 154767 147975 151542 146150 141279 143038 141300 135834 127017 119534 118578 115043 117458
11229 117458 106272 103723 96782 95089 94813 86686 92322 97164 90768 88229 91485 88394 97621 100591
11215 100591 97969 84907 80780 76982 69893 74387 81387 84615 89730 94181 83049 61544 61772 54016
11201 54016 39745 40383 51964 57388 55840 59766 65847 61609 54176 46741 42391 56078 59053 57216
11187 57216 57258 55908 52394 50250 50109 55476 59060 54888 52846 46819 43777 26584 21551 31146 30774
11172 30774 29202 26999 29722 34639 44299 47171 56691 51431 46481 35799 34451 33763 32404 26266
11158 26266 31881 41078 30342 26011 28157 31295 33335 38858 33359 24160 18361 20967 29788 39282
$$ packed form
11257B13453N889K874L411o571k525j586M28n327o22l623q559m738q743j4208
11243A69553j1372l414o792L567n392m871J759j738n466q817p483r56l535K415
11229A17458j1186k549o941j693k76q127N636M842o396k539L256l091R227K970
11215A00591k622j3062m127l798p089M494P000L228N115M451j1132k1505K28p756
11201E4016j4271O38J1581N424j548L926O081m238p433p435m350J3687K975j837
11187E7216M2j350l514k144j41N367L584m172k042o027l042j7193n033R595l72
11172C0774j572k203K723M917R660K872R520n260m950j0682j348o88j359o138
11158B6266N615R197j0736m331K146L138K040N523n499r199n799K606Q821R494
$$ plain form
11144 39282 46534 44873 39776 41229 42637 46371 50267 53004 46457 38372 31587 40148 45153 42044
11130 42044 36127 31563 30450 35225 31406 26868 34076 42490 43105 40376 34375 27251 38482 37612 33277
11115 33277 30995 28159 20655 22750 17886 15865 12019 9683 3635 5825 16525 18316 16391 15590
11101 15590 16659 26415 31193 37406 33174 27343 24306 18879 18028 22334 17324 21722 26427 25324 29179
11086 29179 30890 28808 22482 26053 24032 20757 18475 25349 23834 19906 18341 12673 5575 4119
11072 4119 16025 21802 15064 6674 3698 10389 16525 22852 25579 28947 22204 17311 20594 22303
11058 22303 20999 21689 34853 40470 34241 37850 32062 20496 22500 32135 37521 24824 14066 17725
11044 17725 25298 20174 21185 22318 23261 22329 17201 22739 19194 17895 26139 39525 41079 32974 32759
$$ packed form
11144C9282P252j661n097J453J408L734L896K737o547q085o785Q561N005l109
11130D2044n917m564j113M775l819m538P208Q414O15k729o001p124J1231q70m335
11115C3277k282k836p504K095m864k021l846k336o048K190J0700J791j925q01
11101A5590J069R756M778O213m232n831l037n427q51M306n010M398M705j103L855
11086B9179J711k082o326L571k021l275k282O874j515l928j565n668p098j456
11072D119J1906N777o738q390k976O691O136O327K727L368o743m893L283J709
11058B2303j304O90J3164N617o229L609n788j1566K004R635N386j2697j0758L659
11044A7725P573n124J011J133R43r32n128N538l545j299Q244J3386J554q105k15
$$ plain form
11029 32759 47671 54085 51369 40297 37644 32737 19160 17772 17947 21989 19048 23974 30164 27785
11015 27785 19782 20787 18365 23518 21476 19977 23279 21172 17301 21360 23517 33926 29140 22553
11001 22553 20596 33320 33638 30002 24038 18414 10862 17010 28788 22032 14509 19187 21203 24284
10987 24284 24115 28971 31089 25105 21884 20582 21140 28969 31229 29613 28711 27124 33493 39329 50107
10972 50107 61521 62275 53853 58874 82766 98958 111214 133158 164126 195929 239144 289732
10960 289732 332998 364612 393142 420852 450999 464950 455241 426190 392392 353442 316879 288328
10948 288328 245265 212574 170066 128843 109523 100089 83154 73551 65795 56975 56978 55207 51851
10935 51851 46418 40874 30751 20826 16732 20175 28189 31092 23453 12284 349 4946 9389 10030
$$ packed form
11029C2759J4912O414k716j1072k653m907j3577j388J75M042k941M926O190k379
11015B7785q003J005k422N153k042j499L302k107l871M059K157J0409m786o587
11001B2553j957J2724L18l636n964n624p552O148J1778o756p523M678K016L081
10987B4284j69M856K118n984l221j302N58P829K260j616r02j587O369N836J0778
10972E0107J1414P54q422N021K3892J6192J2256K1944L0968L1803M3215N0588
10960B89732M3266L1614K8530K7710L0147J3951r709k9051l3798l8950l6563k8551
10948B88328m3063l2691m2508m1223j9320r434j6935r603p756q820Lj771l356
10935E1851n433n544j0123r925m094L443Q014K903p639j1169j1935M597M443O41
$$ plain form
10921 10030 2199 3457 6560 7049 7816 -6 1654 6727 4780 1776 -4175 -2498 -5719 -15052 -16017
10906 -16017 -15933 -13402 -7253 11195 17341 16225 25824 16593 9435 5289 7432 6305 -2051 3085 4880
10891 4880 3521 7145 23468 33578 29024 21317 18909 18268 7301 8009 11906 17105 15769 9495
10877 9495 5947 9835 9253 9010 7893 9036 13346 18303 14091 4744 1514 7731 7114 6791 8514 13534
10861 13534 15331 8357 4916 1403 548 13827 31928 30452 19103 15906 16604 14145 5925 11248
10847 11248 14004 14950 5924 12644 17449 19161 13568 13604 10472 6121 13042 13759 16691 18296 12075
10832 12075 7629 5566 4589 13668 20760 14804 7983 9405 7741 3164 2044 9033 8696 8096 11139
10817 11139 10588 20568 18391 10098 -3502 -1663 3027 7195 4296 6634 365 3036 10423 12163
$$ packed form
10921A0030p831J258L103M89P67p822J660N073j947l004n951J677l221r333r65
10906a6017Q4K531O149J8448O146j116R599r231p158m146K143j127q356N136J795
10891D880j359L624J6323J0110m554p707k408o41j0967P08L897N199j336o274
10877I495l548L888n82k43j117J143M310M957m212r347l230O217o17l23J723N020
10861A3534J797o974l441l513q55J3279J8101j476j1349l197O98k459q220N323
10847A1248K756R46r026O720M805J712n593L6l132m351O921P17K932J605o221
10832A2075m446k063r77R079P092n956o821J422j664m577j120O989l37o00L043
10817A1139n51R980k177q293j3600J839M690M168k899K338o269K671P387J740
$$ plain form
10803 12163 7595 3904 -1159 -8699 -8776 -9813 -6521 3556 6441 11941 19000 19918 2923 -4546 4922
10788 4922 10287 5598 11084 578 2089 4296 10507 16398 5267 9226 18023 17897 18925 9167
10774 9167 5755 6748 -4349 -9517 -6342 -8672 -3870 -10333 -4716 4056 -388 -9420 -5987 5444
10760 5444 7715 6954 865 -4531 -7213 -7960 -4808 -167 2070 -3807 -7275 -10962 -2057 5825 6854
10745 6854 -1977 -132 1890 1133 7630 -1833 -8557 -11280 -6095 6243 -1394 3791 12771 20624 23669
10730 23669 8873 -2827 -4491 733 3629 2919 6720 3163 353 -3421 -8402 -6742 -3250 -5183
10716 -5183 -5467 -2505 1093 -7159 -12982 -13030 3519 5035 3568 4048 13725 11865 12834 11797 10619 8676
10700 8676 8554 6759 3965 7468 10210 2964 3449 -1034 -1806 -5367 -2190 242 -9380 -12691 -11794 928
$$ packed form
10803A2163m568l691n063p540p7j037L292J0077K885N500P059R18j6995p469R468
10788D922N365m689N486j0506J511K207O211N891j1131L959Q797j26J028r758
10774I167l412R93j1097n168L175k330M802o463N617Q772m444r032L433J1431
10760E444K271p61o089n396k682p47L152M641K237n877l468l687Q905P882J029
10745F854q831J845K022p57O497r463o724k723N185J2338p637N185Q980P853L045
10730B3669j4796j1700j664N224K896p10L801l557k810l774m981J660L492j933
10716e183k84K962L598q252n823m8J6549J516j467M80R677j860R69j037j178j943
10700H676j22j795k794L503K742p246M85m483p72l561L177K432r622l311Q97J2722
$$ plain form
10684 928 14248 13046 11258 10338 11666 10179 6938 -224 2416 4306 80 9623 21350 20195 12140
10669 12140 10020 13619 15181 1790 -14000 -8014 2427 -6202 -13240 -4493 7819 5801 1821
10656 1821 -2584 -4214 2606 -5533 -15137 -5893 -4864 -3691 -6650 2815 4558 10873 5046 612 2423
10641 2423 -10949 -9406 7549 20286 21822 14649 6212 -1799 -6323 2383 4491 -6700 -9951 716
10627 716 6004 14468 15988 10015 -8088 -11637 -3942 173 -9501 -10731 -4472 2131 -1854 -6612 -578
10612 -578 2061 4088 6534 -2199 -11984 -12226 -12188 -13992 -20462 -21871 -15389 -1751 12494 5683 -2226
10597 -2226 -953 6972 4245 11383 11552 4041 12793 9746 2423 -5239 2259 4628 7127 2043 479
10582 479 1043 -755 0 8201 1220 5286 2611 -5693 -2343 753 2652 299 -2406 -606 2721
$$ packed form
10684I28J3320j202j788r20J328j487l241p162K640J890m226R543J1727j155q055
10669A2140k120L599J562j3391j5790N986J0441q629p038Q747J2312k018l980
10656A821m405j630O820q139r604R244J029J173k959R465J743O315n827m434J811
10641B423j3372J543J6955J2737J536p173q437q011m524Q706K108j1191l251J0667
10627G16N288Q464J520n973j8103l549P695M115r674j230O259O603l985m758O034
10612e78K639K027K446q733r785k42L8j804o470j409O482J3638J4245o811p909
10597b226J273P925k727P138J69p511Q752l047p323p662P498K369K499n084j564
10582D79N64j798P55Q201o981M066k675q304L350L096J899k353k705J800L327
$$ plain form
10567 2721 4973 16489 24806 21940 17597 10629 7415 -5750 -11070 -4740 -1564 169 3045 4944
10553 4944 10311 17258 10658 4251 -5493 -2848 -4934 -2938 -1259 -3340 2274 14124 24215 22718
10539 22718 17395 9349 4566 -3689 -7058 -2450 -3898 4728 10635 12535 1011 -371 4262 3593
10525 3593 -4713 318 774 1587 3072 5127 12740 9466 5213 -5411 -10201 -13455 -8542 3243 7723
10510 7723 -2634 -727 1659 -3054 1184 13122 13136 6831 -2312 -2621 -6334 -4232 1542 -70 7942
10495 7942 3704 -3798 -6057 -3405 580 2990 14724 13641 1848 3214 3438 7009 1622 -4632
10481 -4632 -1406 -3995 -6761 -7160 -9546 -2948 371 -14063 -15256 -11226 379 -3415 -20281 -22329
10467 -22329 -5579 5091 6261 6606 8136 13187 13092 17902 21337 17599 4007 8468 14350 10292
$$ packed form
10567B721K252J1516Q317k866m343o968l214j3165n320O330L176J733K876J899
10553D944N367O947o600o407r744K645k086J996J679k081N614J1850J0091j497
10539B2718n323q046m783q255l369M608j448Q626N907J900j1524j382M633o69
10525C593q306N031M56Q13J485K055P613l274m253j0624m790l254M913J1785M480
10510G723j0357J907K386m713M238J1938J4o305r143l09l713K102N774j612Q012
10495G942m238p502k259K652L985K410J1734j083j1793J366K24L571n387o254
10481d632L226k589k766l99k386O598L319j4434j193M030J1605l794j6866k048
10467b2329J6750J0670J170L45J530N051r5M810L435l738j3592M461N882m058
$$ plain form
10453 10292 6320 959 5772 11710 12513 7165 7441 8202 10726 5727 6135 8988 17670 14942 13529
10438 13529 9094 11465 5440 994 -2119 -3366 -4348 -6829 -11757 -3551 3338 4672 6870 6268 -1252
10423 -1252 -4929 -4775 -9838 -10692 -13840 -16265 -17045 -14817 -16700 -15068 -13774 -10432 -7107 -4236 -3143
10408 -3143 -4976 -10892 -11256 -14284 -9811 -11138 -7354 649 -5251 -13020 -18360 -3996 13408 17184
10394 17184 4008 4401 -2679 -8229 -8338 -1408 7992 2792 -6077 -9597 -9128 -10327 -12834 -14124 -443
10379 -443 3064 -1490 -3266 -5764 -7528 -4161 -564 -934 -10425 -11659 384 2845 687 -1896 -1468
10364 -1468 1560 1967 -5605 -5579 -12587 -7716 -6962 -7311 -2129 7021 6262 107 3126 7814 15073 17124
10348 17124 5107 -10438 -8686 -2389 418 1151 5502 6745 -5665 -10448 -615 2372 5029 -2430
$$ packed form
10453A0292l972n361M813N938Q03n348K76P61K524m999M08K853Q682k728j413
10438A3529m435K371o025m446l113j247r82k481m928Q206O889J334K198o02p520
10423a252l677J54n063q54l148k425p80K228j883J632J294L342L325K871J093
10408c143j833n916l64l028M473j327L784Q003n900p769n340J4364J7404L776
10394A7184j3176L93p080n550j09O930R400n200q869l520M69j199k507j290J3681
10379d43L507m554j776k498j764L367L597l70r491j234J2043K461k158k583M28
10364a468L028M07p572K6p008M871P54l49N182R150p59o155L019M688P259K051
10348A7124j2017j5545J752O297K807P33M351J243j2410m783R833K987K657p459
$$ plain form
10334 -2430 -9744 -8525 -2046 10341 12749 16208 21480 14336 9537 11454 13861 9904 3740 5491
10320 5491 3812 -5401 -8575 -2402 3426 -96 -6084 -1919 -1929 -2883 -2557 -7128 -7317 -9057 -20057 -19130
10304 -19130 -13820 -9682 -2006 1132 2595 6694 6237 454 -2093 -8838 -11687 -11390 -8580 -7932 -12450
10289 -12450 -16601 -16037 -7682 -4736 -3370 -9892 -11120 -6675 -15635 -14242 -9917 -3143 1743 5955 6638
10274 6638 787 -2999 -1381 6407 8638 1706 2493 3409 4043 4125 -465 2044 5483 11803 6251 5624
10258 5624 3084 5275 2873 -14123 -6689 1298 -2709 2824 6446 284 -6462 -8123 424 8108
10244 8108 6648 14791 12975 10413 10333 580 -7452 -4070 3243 6829 6624 -1067 -17069 -16581 -10180
10229 -10180 -2678 1374 2769 -3688 -13057 -8850 -5825 -14652 -16690 -13888 -3209 -9513 -10857 1069
$$ packed form
10334b430p314J219O479J2387K408L459N272p144m799J917K407l957o164J751
10320E491j679r213l174O173N828l522n988M165j0r54L26m571j89j740j1000R27
10304a9130N310M138P676L138J463M099m57n783k547o745k849K97K810O48m518
10289a2450m151N64Q355K946J366o522j228M445q960J393M325O774M886M212O83
10274F638n851l786J618P788K231o932P87R16O34Q2m590K509L439O320n552o27
10258E624k540K191k402j6996P434P987m007N533L622o162o746j661Q547P684
10244H108j460Q143j816k562q0r753q032L382P313L586k05p691j6002M88O401
10229a0180P502M052J395o457r369M207L025q827k038K802J0679o304j344J1926
$$ plain form
10215 1069 12060 7407 1122 -7240 -14508 -21183 -18481 -16691 -5566 2406 4710 21 -13601 -8139
10201 -8139 -4663 -6351 -5122 2516 9248 1717 -293 6489 1801 -755 793 3412 5227 7414 6029
10186 6029 17774 30884 18791 -994 -5178 -3577 1997 11250 15562 2352 -1869 -4478 -9444
10173 -9444 -8691 -2043 -7529 -15421 -14403 -7639 -11391 -11345 -4443 6050 122 1644 4064 3804 -5602
10158 -5602 -11039 -9282 338 -4376 -533 4805 -6391 -14950 -18326 -6105 -4045 825 11056 5852
10144 5852 -454 -192 -4534 -13030 -4953 9144 9642 4805 8565 22501 16439 11570 9074 15796 20588
10129 20588 20179 27266 34227 44729 56463 65486 62826 48280 30981 35031 42496 34591 27199 19868
10115 19868 17312 10330 -2904 -9155 -14641 -4128 -2129 -5509 -7195 -7363 -2280 13186 23869 26123
$$ packed form
10215A069J0991m653o285q362p268o675K702J790J1125P972K304m689j3622N462
10201h139L476j688J229P638O732p531k010O782m688k556J548K619J815K187j385
10186F029J1745J3110j2093j9785m184J601N574R253M312j3210m221k609m966
10173i444P53O648n486p892J018O764l752M6O902J0493n928J522K420k60r406
10158e602n437J757R620m714L843N338j1196q559l376J2221K060M870J0231n204
10144E852o306K62m342q496Q077J4097M98m837L760J3936o062m869k496O722M792
10129B0588m09P087O961J0502J1734R023k660j4546j7299M050P465p905p392p331
10115A9868k556o982j3234o251n486J0513J999l380j686j68N083J5466J0683K254
$$ plain form
10101 26123 16895 13511 11595 2448 -3384 -2206 1019 -5271 -5035 3567 9958 11987 2679 -9445
10087 -9445 -11347 -11396 -4577 1210 -4169 -4862 -7174 2506 3176 5143 2066 -4115 -7625 3896 2102
10072 2102 5554 8609 4006 16112 26535 18032 21609 32043 50356 57008 59359 66739 52538
10059 52538 21956 17944 6037 -2981 -3626 5069 3619 1195 -3257 -256 -4910 -12111 -7278 -6147
10045 -6147 -11238 -12972 -12971 -7388 -3487 5499 4734 6044 8068 12312 6803 -939 -4633 -4594 -3576 6739
10029 6739 17636 15973 4872 -8581 -13140 -19269 -18529 -10933 -8942 1853 3643 2292 3468 3907
10015 3907 4815 12817 15973 10447 -897 -6804 -11664 -12714 -7500 -4063 -6486 -8728 -9857 -2565 2066
10000 2066 2735 6039 1966 -175 -196 -11349 -19096 -8129 -3040 2041 -2128 -1339 5314 5508 8393
$$ packed form
10101B6123r228l384j916r147n832J178L225o290K36Q602O391K029r308j2124
10087i445j902m9O819N787n379o93k312R680O70J967l077o181l510J1521j794
10072B102L452L055m603J2106J0423q503L577J0434J8313O652K351P380j4201
10059E2538l0582m012j1907r018o45Q695j450k424m452L001m654p201M833J131
10045f147n091j734JN583L901Q986p65J310K024M244n509p742l694L9J018J0315
10029F739J0897j663j1101j3453m559o129P40P596J991J0795J790j351J176M39
10015C907R08Q002L156n526j1344n907m860j050N214L437k423k242j129P292M631
10000B066O69L304m073k141k1j1153p747J0967N089N081m169P89O653J94K885
$$ plain form
9985 8393 15602 8658 -1861 1438 6735 13312 4206 4346 12419 5513 -4754 -8593 -11168 -9060 -3759
9970 -3759 -7417 -5854 1369 7503 13290 11057 15629 14877 21012 30371 34333 35543 48524 48758 33033
9955 33033 32323 37511 43180 36822 21718 9387 1102 9478 17987 15963 16812 26257 29232 27770 25530
9940 25530 25404 25135 29610 44216 61080 69919 75344 73399 52913 37989 27926 15276 14067 19829
9926 19829 24167 10017 2383 6716 5786 7787 9873 22001 20328 12181 -1541 -6517 -1310 -1092
9912 -1092 -10850 -3142 6122 3049 -643 -2954 -412 707 -4019 -16443 -8587 2558 -5988 -2385
9898 -2385 3679 2734 7759 21732 18275 14607 19215 15730 19176 19425 14611 12559 11666 6329 665
9883 665 -7325 -15744 -14277 -12228 -14764 -10560 -9821 -7911 269 9544 16193 5915 -1532 -2439 -4102
$$ packed form
9985H393P209o944j0519L299N297O577r106J40Q073o906j0267l839k575K108N301
9970c759l658J563P223O134N787k233M572p52O135R359L962J210J2981K34j5725
9955C3033p10N188N669o358j5104j2331q285Q376Q509k024Q49R445K975j462k240
9940B5530j26k69M475J4606J6864Q839N425j945k0486j4924j0063j2650j209N762
9926A9829M338j4150p634M333r30K001K086J2128j673q147j3722m976N207K18
9912a092r758P708R264l073l692k311K542J119m726j2424P856J1145q546L603
9898b385O064r45N025J3973l457l668M608l485L446K49m814k052q93n337n664
9883F65p990q419J467K049k536M204P39J910Q180R275O649j0278p447r07j663
$$ plain form
9868 -4102 -13121 -7380 5360 7798 1639 -1347 -9993 -9699 -3828 410 7026 11707 10067 8473 14566
9853 14566 6469 10316 15857 25357 5639 -4495 -7652 -5466 574 15739 18647 14501 6531 9217
9839 9217 16869 15511 12682 10302 10440 -471 -7194 -9673 -3737 -2498 -9832 -4718 -2911 -3064 937
9824 937 305 -3686 -6067 -7767 -3822 -4568 -6265 -4656 -7149 2749 10839 3784 -3918 6151 8912
9809 8912 8770 9883 6183 2317 8581 4270 993 -1726 7308 6005 6209 1704 -2164 -2516 5415 8677
9793 8677 238 1118 5445 11119 11814 13556 17239 13636 5049 4624 10742 8097 5212 -212 -3802 -3055
9777 -3055 -35 12626 11574 8723 13916 22138 20463 7230 3589 8935 4223 1376 5495 9818
9763 9818 9061 2981 9065 18476 19383 3094 -10780 -12457 -2075 2636 10132 10683 10952 10037 -12028
$$ packed form
9868d102r019N741J2740K438o159k986q646K94N871M238O616M681j640j594O093
9853A4566q097L847N541R500j9718j0134l157K186O040J5165K908m146p970K686
9839I217P652j358k829k380J38j0911o723k479N936J239p334N114J807j53M001
9824I37o32l991k381j700L945p46j697J609k493R898Q090p055p702J0069K761
9809H912j42J113l700l866O264m311l277k719R034j303K04m505l868l52P931L262
9793H677q439Q80M327N674O95J742L683l603q587m25O118k645k885n424l590P47
9777c055L020J2661j052k851N193Q222j675j3233l641N346m712k847M119M323
9763I818p57o080O084R411R07j6289j3874j677J0382M711P496N51K69r15k2065
$$ plain form
9748 -12028 -19478 -23234 -23822 -18086 -19022 -8682 -335 2965 497 2352 5738 7079 10282 9270 7802
9733 7802 8848 10213 8317 5443 11366 18854 13379 -380 565 12249 24973 28240 29401 29172 39188
9718 39188 36317 33707 25684 20205 13595 18284 19003 19307 23748 21215 19257 17979 11530 11925 16541
9703 16541 10065 3752 10697 12629 11820 23738 18754 8549 12959 27551 15308 10657 25010 22743
9689 22743 26791 27780 19020 20814 20772 18886 17059 24098 30165 35027 28668 27579 14225 3180 7220
9674 7220 11295 11149 5567 22066 26721 17629 23187 23641 19166 8679 7077 10909 23246 20008 17484
9659 17484 11976 16662 16769 14078 15239 14206 10349 12393 15053 17715 19170 22511 20824 12448 13604
9644 13604 6105 3298 11949 17256 12699 13267 12165 9088 10232 7383 7422 9642 8477 10043 6219
$$ packed form
9748a2028p450l756n88N736r36J0340Q347L300k468J855L386J341L203j012j468
9733G802J046J365j896k874N923P488n475j3759R45J1684J2724L267J161k29J0016
9718C9188k871k610q023n479o610M689P19L04M441k533j958j278o449L95M616
9703A6541o476o313O945J932q09J1918m984j0205M410J4592j2243m651J4353k267
9689B2743M048R89q760J794m2j886j827P039O067M862o359j089j3354j1045M040
9674G220M075j46n582J6499M655r092N558M54m475j0487j602L832J2337l238k524
9659A7484n508M686J07k691J161j033l857K044K660K662J455L341j687q376J156
9644A3604p499k807Q651N307m557N68j102l077J144k849L9K220j165J566l824
$$ plain form
9629 6219 12071 7304 934 3966 14885 18960 11698 11890 11116 12847 15788 17215 14941 15127 16982
9614 16982 25405 35493 32124 23552 27343 30591 34173 38879 34576 27537 28346 27278 23197 20090 21852
9599 21852 9983 11349 23157 19117 22119 27629 23514 31458 34258 31546 26668 27314 24962 21475
9585 21475 15748 5218 -1057 8067 12604 21442 35751 40900 44183 51450 52982 49192 37534 41807
9571 41807 55201 41827 39681 41949 37985 36868 28341 21397 28045 27797 24767 28116 28532 19859 22848
9556 22848 25597 31892 34915 43678 47023 48564 46407 43569 44801 39639 37945 39990 36066 38803 40826
9541 40826 34839 31430 23936 16710 14105 21552 22106 24011 26560 39660 36294 29146 30631 36552 38144
9526 38144 32234 30863 32288 37548 34590 33224 35466 37211 37107 41780 32899 37945 39151 40817 39067
$$ packed form
9629F219N852m767o370L032J0919M075p262J92p74J731K941J427k274J86J855
9614A6982Q423J0088l369q572L791L248L582M706m303p039Q09j068m081l107J762
9599B1852j1869J366J1808m040L002N510m115P944K800k712m878O46k352l487
9585B1475n727j0530o275R124M537Q838J4309N149L283P267J532l790j1658M273
9571D1807J3394j3374k146K268l964j117q527o944O648k48l030L349M16q673K989
9556B2848K749O295L023Q763L345J541k157k838J232n162j694K045l924K737K023
9541D0826n987l409p494p226k605P447N54J905K549J3100l366p148J485N921J592
9526C8144n910j371J425N260k958j366K242J745j04M673q881N046J206J666j750
$$ plain form
9511 39067 29558 28233 29864 33596 32814 31998 34649 35584 38721 38453 31020 25002 27277 34505 31372 36542
9495 36542 47818 57974 61053 67855 78342 93427 93990 89173 76101 70483 77969 76998 67466 70207
9481 70207 63235 56674 53788 53503 54797 65881 74604 77947 75365 62609 49375 44777 46274 51039
9467 51039 51757 54926 60743 56570 66535 67115 60883 47856 35757 32823 31777 24198 26726 38063
9453 38063 57297 63440 65005 65874 59955 60194 68695 76113 72031 60734 55996 59703 47334 50723
9439 50723 58795 59695 65027 64308 75298 86977 88553 91524 88638 91487 91133 89310 103691 114642
9425 114642 125768 132460 151077 163704 145645 113376 88788 71592 54545 53961 73324 76488
9413 76488 66338 68895 57484 62825 76399 81262 80456 85545 86822 88878 89191 87355 74814 65724
$$ packed form
9511C9067r509j325J631L732p82q16K651R35L137k68p433o018K275P228l133N170
9495C6542J1276J0156L079O802J0487J5085N63m817j3072n618P486r71r532K741
9481G0207o972o561k886k85J294J1084Q723L343k582j2756j3234m598J497M765
9467E1039P18L169N817m173R965N80o232j3027j2099k934j046p579K528J1337
9453C8063J9234O143J565Q69n919K39Q501P418m082j1297m738L707j2369L389
9439E0723Q072R00N332p19J0990J1679J576K971k886K849l54j823J4381J0951
9425A14642J1126O692J8617J2627j8059l2269k4588j7196j7047n84J9363L164
9413G6488j0150K557j1411N341J3574M863q06N089J277K056L13j836j2541r090
$$ plain form
9399 65724 59183 61561 69044 68110 63229 62527 70808 89329 87231 92745 93954 95438 102935 116096 114519
9384 114519 111259 107442 107124 104274 104410 112602 125028 131339 141912 152054 164293 178918 184508 184134
9370 184134 197466 213323 243222 276229 313161 367251 425585 514255 638720 784936 964020
9359 964020 1170193 1375657 1545233 1645377 1678615 1634978 1520175 1354391 1155829 956135
9349 956135 774318 634043 532540 454969 389517 346037 308582 275712 250821 224973 209436
9338 209436 197441 194005 187705 176615 166933 157446 157392 155614 149886 148867 142291 145106 154090 152091
9324 152091 140164 142196 146254 149801 147800 138852 131740 132679 137087 138115 145603 144719 135661 130263 126707
9309 126707 138304 148260 141676 138051 139293 138928 140130 140559 143249 138562 132279 131456 130561 133711 132244
$$ packed form
9399F5724o541K378P483r34m881p02Q281J8521k098N514J209J484P497J3161j577
9384A14519l260l817l18k850J36Q192J2426O311J0573J0142J2239J4625N590l74
9370A84134J3332J5857K9899L3007L6932N4090N8334Q8670J24465J46216J79084
9359I64020K06173K05464J69576J00144L3238m3637j14803j65784j98562j99694
9349I56135j81817j40275j01503p7571o5452m3480l7455l2870k4891k5848j5537
9338B09436j1995l436o300j1090r682r487n4j778n728j019o576K815Q984j999
9324A52091j1927K032M058L547k001q948p112R39M408J028P488q84r058n398l556
9309A26707J1597R956o584l625J242l65J202M29K690m687o283q23q95L150j467
$$ plain form
9294 132244 128858 138821 145279 149799 160137 165608 176614 176467 167966 159219 159068 156615 170051 174087
9280 174087 169059 180800 198672 205543 214393 224834 232621 238379 233981 222320 221742 232476 238298
9267 238298 241986 241818 242578 236820 228843 236596 249291 261238 274177 284448 300515 313814 318871
9254 318871 322682 328672 334375 345445 341142 352951 355641 363301 370032 376652 386972 407780 423908
9241 423908 433697 446611 454861 468967 478814 490562 508085 523040 544458 561691 575030 588895
9229 588895 615972 648208 657737 663527 675700 700655 721294 728463 742199 760685 790092 826244
9217 826244 874435 933347 1008742 1104925 1215890 1285556 1291311 1245550 1157629 1087357 1037559 1000139
9205 1000139 964562 938538 925922 913851 907562 906226 906055 892679 882407 886611 879160 866423 846527
$$ packed form
9294A32244l386R963O458M520J0338N471J1006j47q501q747j51k453J3436M036
9280A74087n028J1741J7872O871Q850J0441P787N758m398j1661n78J0734N822
9267B38298L688j68P60n758p977P753J2695J1947J2939J0271J6067J3299N057
9254C18871L811N990N703J1070m303J1809K690P660O731O620J0320K0808J6128
9241D23908R789J2914Q250J4106R847J1748J7523J4955K1418J7233J3339J3865
9229E88895K7077L2236R529N790J2173K4955K0639P169J3736J8486K9407L6152
9217H26244M8191N8912P5395R6183J10965O9666N755m5761q7921p0272m9798l7420
9205A000139l5577k6024j2616j2071o289j336j71j3376j0272M204p451j2737j9896
$$ plain form
9192 846527 839287 823851 807227 799082 791177 775121 754883 739767 725674 711299 701410 694541 681705
9179 681705 672062 657384 635254 612519 591517 566719 546947 528680 512385 505112 480186 458323
9167 458323 443027 440080 434606 426507 420479 423367 436038 437840 440436 429791 412939 390056 376654
9154 376654 360757 342893 327810 331350 350301 357483 357657 364774 370017 363537 345061 347269 354689
9141 354689 364294 383466 385327 371391 371441 367437 349393 334862 327131 320896 308569 305456 315993
9128 315993 314812 313045 311217 298354 271363 235506 213790 206155 208556 222916 235318 250878 267172
9115 267172 286116 305176 320285 328291 337373 335067 331868 317688 314720 314520 320655 315304 324185 340955
9101 340955 345159 345477 354406 366268 368782 375973 398770 416096 428753 458610 486951 510062 522261
$$ packed form
9192H46527p240j5436j6624q145p905j6056k0238j5116j4093j4375r889o869j2836
9179F81705r643j4678k2130k2735k1002k4798j9772j8267j6295p273k4926k1863
9167D58323j5296k947n474q099o028K888J2671J802K596j0645j6852k2883j3402
9154C76654j5897j7864j5083L540J8951P182J74P117N243o480j8476K208P420
9141C54689R605J9172J861j3936N0m004j8044j4531p731o235j2327l113J0537
9128C15993j181j767j828j2863k6991l5857k1716p635K401J4360J2402J5560J6294
9115B67172J8944J9060J5109Q006R082k306l199j4180k968k00O135n351Q881J6770
9101C40955M204L18Q929J1862K514P191K2797J7326J2657K9857K8341K3111J2199
$$ plain form
9088 522261 533580 537265 511945 483137 470789 470536 489570 514584 539496 557790 558923 559219 561055
9075 561055 576134 595058 624530 655141 681960 706876 712985 725553 733574 740412 750456 762926
9063 762926 775358 804105 851520 930414 1051684 1236864 1514881 1899750 2432514 3098554
9053 3098554 3844045 4523766 4907518 4780156 4152387 3314471 2579027 2039924 1682529 1431094
9043 1431094 1253251 1122388 1032419 974967 946846 932124 912621 892293 886361 891009 896971 910526
9031 910526 925606 939106 958007 988264 1018538 1057431 1081208 1102459 1111912 1118598 1127797 1144289
9019 1144289 1162645 1166500 1171697 1187735 1202314 1227763 1265659 1309732 1368296 1436064 1492252 1551099
9007 1551099 1617245 1695985 1777112 1870175 1977986 2094448 2224260 2342234 2470907 2618206
$$ packed form
9088E22261J1319L685k5320k8808j2348k53J9034K5014K4912J8294J133K96J836
9075E61055J5079J8924K9472L0611K6819K4916O109J2568Q021O838J0044J2470
9063G62926J2432K8747M7415P8894J21270J85180K78017L84869N32764O66040
9053C098554P45491O79721L83752j27362o27769q37916p35444n39103l57395k51435
9043A431094j77843j30863q9969n7452k8121j4722j9503k0328n932M648N962J3555
9031I10526J5080J3500J8901L0257L0274L8893K3777K1251R453O686R199J6492
9019A144289J8356L855N197J6038J4579K5449L7896M4073N8564O7768N6188N8847
9007A551099O6146P8740Q1127R3063J07811J16462J29812J17974J28673J47299
$$ plain form
8997 2618206 2765749 2906632 3059191 3230176 3418999 3630628 3871446 4147664 4443734 4761368
8987 4761368 5084890 5415676 5767380 6145618 6584886 7112073 7738973 8503291 9429754 10560005
8977 10560005 11939800 13605188 15588259 17965535 20770700 23984689 27516485 31305252
8969 31305252 35578010 41037514 48763518 60019133 76518377 100812869 136157109 185012267
8961 185012267 246491112 314731811 375736881 405780136 386323536 321354931 241407918
8954 241407918 175355968 129608600 99466879 79486476 65761788 55882251 48561469
8947 48561469 43139385 39081063 35822687 32878200 29917395 26882091 23932272 21342665
8939 21342665 19198951 17454001 16000045 14762384 13659769 12666174 11782141 10989534 10290178
$$ packed form
8997B618206J47543J40883J52559J70985J88823K11629K40818K76218K96070L17634
8987D761368L23522L30786L51704L78238M39268N27187O26900P64318R26463J130251
8977A0560005J379795J665388J983071K377276K805165L213989L531796L788767
8969C1305252M272758N459504P726004J1255615J6499244K4294492L5344240M8855158
8961A85012267O1478845O8240699O1005070L0043255j9456600o4968605p9947013
8954B41407918o6051950m5747368l0141721j9980403j3724688r879537p320782
8947D8561469n422084m058322l258376k944487k960805l035304k949819k589607
8939B1342665k143714j744950j453956j237661j102615r93595q84033p92607o99356
$$ plain form
8930 10290178 9681188 9167831 8722498 8341143 8001953 7658514 7308581 6938894 6561647
8921 6561647 6219709 5913418 5646262 5418624 5203260 5005728 4828663 4673527 4537659 4400951
8911 4400951 4267611 4134155 3992546 3858368 3734148 3619010 3510985 3395831 3272516 3154730
8901 3154730 3038077 2922021 2814111 2700100 2605731 2517007 2429544 2346951 2261863 2181498 2107995
8890 2107995 2040817 1992228 1936545 1896935 1861653 1814406 1775122 1737267 1698434 1672384 1653931
8879 1653931 1618927 1582475 1546101 1493486 1448996 1412268 1364812 1319214 1273426 1229462 1196213
8868 1196213 1159967 1137010 1109724 1075967 1052962 1038696 1018823 1002834 995939 995070 991533 976187
8856 976187 950749 928435 905328 870108 822374 790436 754941 727496 708728 701576 693097 682044
$$ packed form
8930A0290178o08990n13357m45333l81355l39190l43439l49933l69687l77247
8921F561647l41938l06291k67156k27638k15364j97532j77065j55136j35868j36708
8911D400951j33340j33456j41609j34178j24220j15138j08025j15154j23315j17786
8901C154730j16653j16056j07910j14011r4369q8724q7463q2593q5088q0365p3503
8890B107995o7178m8589n5683l9610l5282m7247l9284l7855l8833k6050j8453
8879A653931l5004l6452l6374n2615m4490l6728m7456m5598m5788m3964l3249
8868A196213l6246k2957k7286l3757k3005j4266j9873j5989o895q69l537j5346
8856I76187k5438k2314k3107l5220m7734l1938l5495k7445j8768p152q479j1053
$$ plain form
8844 682044 669934 656570 652721 650389 645529 632988 627609 635763 656238 682428 733539 818980 879830
8831 879830 889656 830990 730387 616924 536829 496127 473188 463023 465781 467245 463472 448317
8819 448317 434521 434873 433068 421055 399812 392374 389630 391728 385438 376725 375632 369639 360189 343379
8805 343379 335970 336712 337567 338576 335745 347749 368436 385042 391570 399206 403544 385068 356215 328059
8791 328059 300247 275538 263328 274976 273852 254046 241330 232700 219794 213580 206719 200572 197690
8778 197690 196990 197358 211668 220059 231282 252684 268926 275432 275176 259944 250455 256558 263209 261366
8764 261366 259436 256696 246403 240399 226591 211712 193921 191427 207555 218629 235294 254577
8752 254577 266084 272346 291954 322099 348699 375624 400020 441309 502747 578869 669663 759624
$$ packed form
8844F82044j2110j3364l849k332m860j2541n379Q154K0475K6190N1111Q5441O0850
8831H79830R826n8666j00603j13463q0095m0702k2939j0165K758J464l773j5155
8819D48317j3796L52j805j2013k1243p438k744K098o290q713j093n993r450j6810
8805C43379p409P42Q55J009k831J2004K0687J6606O528P636M338j8476k8853k8156
8791C28059k7812k4709j2210J1648j124j9806j2716q630j2906o214o861o147k882
8778A97690p00L68J4310Q391J1223K1402J6242O506k56j5232r489O103O651j843
8764B61366j930k740j0293o004j3808j4879j7791k494J6128J1074J6665J9283
8752B54577J1507O262J9608L0145K6600K6925K4396M1289O1438P6122R0794Q9961
$$ plain form
8740 759624 788323 723685 599105 474733 386560 318691 278670 249561 237775 220602 215140
8729 215140 222392 224950 232507 253687 268931 285469 308825 346905 385153 409038 428212 434989
8717 434989 443738 448092 453002 451425 463241 487408 526524 580140 665751 795743 966383 1209991
8705 1209991 1527553 1868322 2212510 2471929 2510513 2276416 1872012 1479570 1178139 956200
8695 956200 794457 676275 607524 568585 557215 565925 577907 586647 585093 555175 505048 462121
8683 462121 439134 419109 393178 381150 375238 367148 371946 401128 431146 456737 494020 545577
8671 545577 603922 670917 756523 867451 1044840 1281892 1565714 1886450 2182858 2335117
8661 2335117 2255859 1963813 1590093 1263337 1016709 852456 731464 629677 554989 506978
$$ packed form
8740G59624K8699o4638j24580j24372q8173o7869m0021k9109j1786j7173n462
8729B15140P252K558P557K1180J5244J6538K3356L8080L8248K3885J9174O777
8717D34989Q749M354M910j577J1816K4167L9116N3616Q5611J29992J70640K43608
8705A209991L17562L40769L44188K59419L8584k34097m04404l92442l01431k21939
8695I56200j61743j18182o8751l8939j1370Q710J1982Q740j554k9918n0127m2927
8683D62121k2987k0025k5931j2028n912q090M798K9182L0018K5591L7283N1557
8671E45577N8345O6995Q5606J10928J77389K37052K83822L20736K96408J52259
8661B335117p9258k92046l73720l26756k46628j64253j20992j01787p4688m8011
$$ plain form
8651 506978 456774 408750 371627 351898 361476 360708 360111 373162 393508 412257 423312 424072 399905
8638 399905 369157 344915 326208 300317 280346 269967 264360 262948 278005 293410 334632 400113
8626 400113 466765 526033 566531 550243 478017 402600 345432 316088 295221 280728 277260 278315
8614 278315 268627 267382 258438 260268 259325 257339 254239 251432 243150 255821 264928 271768 284832 305433
8600 305433 331465 347101 360798 361912 351494 331907 307718 293761 270813 243443 210767 196703
8588 196703 183923 173153 172064 177077 188631 188622 177628 175988 184808 195776 197502 197057 193723 198747
8574 198747 193173 190307 195520 210075 220326 236396 256329 280640 319045 383010 467517 567137
8562 567137 695671 860090 1044995 1245795 1443804 1599094 1691995 1698791 1623710 1478115
$$ packed form
8651E06978n0204m8024l7123j9729R578p68n97J3051K0346J8749J1055P60k4167
8638C99905l0748k4242j8707k5891j9971j0379n607j412J5057J5405M1222O5481
8626D00113O6652N9268M0498j6288p2226p5417n7168k9344k0867j4493l468J055
8614B78315r688j245q944J830r43j986l100k807q282J2671R107O840J3064K0601
8600C05433K6032J5636J3697J114j0418j9587k4189j3957k2948k7370l2676j4064
8588A96703j2780j0770j089N013J1554rj0994j640Q820J0968J726m45l334N024
8574A98747n574k866N213J4555J0251J6070J9933K4311L8405O3965Q4507R9620
8562E67137J28534J64419J84905K00800J98009J55290R2901O796p5081j45595
$$ plain form
8552 1478115 1293983 1094280 904905 743088 611710 514592 450781 402698 373523 348470
8542 348470 330747 302426 277905 263280 235864 221555 209657 189281 178612 174952 174378 155419
8530 155419 139641 129878 123652 121139 110806 107479 107313 107621 96405 94470 97146 92199 85154 75586
8516 75586 70907 68090 62410 54313 50363 41225 35090 35227 38441 38920 39391 48010 57649 55313 62354
8501 62354 70229 73381 60155 46696 29606 16687 -1762 -12783 -15156 -8445 -3346 1741 13406
8488 13406 16843 25729 27798 19947 17748 24943 25316 20639 17815 15149 18493 26566 31452 31516 28710
8473 28710 34965 44114 36882 30506 41431 49778 49743 53415 56319 54868 45114 43820 43960 41344 43097
8458 43097 47305 48876 46148 49714 54967 61112 64855 67892 63919 60738 62484 57023 46649 39962
$$ packed form
8552A478115j84132j99703j89375j61817j31378r7118o3811m8083k9175k5053
8542C48470j7723k8321k4521j4625k7416j4309j1898k0376j0669l660n74j8959
8530A55419j5778r763o226k513j0333l327j66L08j1216j935K676m947p045r568
8516G5586m679k817n680q097l950r138o135J37L214M79M71Q619R639k336P041
8501F2354P875L152j3226j3459j7090j2919j8449j1021k373O711N099N087J1665
8488A3406L437Q886K069p851k199P195L73m677k824k666L344Q073M886O4k806
8473B8710O255R149p232o376J0925Q347l5L672K904j451r754j294J40k616J753
8458D3097M208J571k728L566N253O145L743L037l973l181J746n461j0374o687
$$ plain form
8444 39962 42550 43300 39520 31354 27410 29781 36096 34492 28954 28329 36763 37805 34245 41528 49050
8429 49050 46267 38510 35799 36147 39925 38085 39841 37427 45060 55722 44910 37858 33271 24620
8415 24620 27151 40989 40584 26222 16491 11823 21185 27622 18568 21283 27482 24350 25943 28359
8401 28359 31366 37226 45580 39493 41437 34268 28343 33215 34687 27829 25386 24726 29138 23821 20607
8386 20607 17641 16543 28653 31343 15703 16068 16664 22201 32277 36693 29031 26905 26188 31359 29325
8371 29325 18027 20110 25431 23044 31804 40765 42984 50328 51640 42527 40913 44227 36720 31204
8357 31204 23063 30188 36143 34447 37575 42038 30990 22989 23107 27669 30945 37257 41968 44646 38095
8342 38095 42441 39396 36788 36334 37897 38791 38981 25412 19204 25239 27377 21646 15847 13257 14988
$$ packed form
8444C9962K588P50l780q166l944K371O315j604n538o25Q434J042l560P283P522
8429D9050k783p757k711L48L778j840J756k414P633J0662j0812p052m587q651
8415B4620K531J3838m05j4362r731m668R362O437r054K715O199l132J593K416
8401B8359L007N860Q354o087J944p169n925M872J472o858k443o60M412n317l214
8386B0607k966j098J2110K690j5640L65N96N537J0076M416p662k126p17N171k034
8371B9325j1298K083N321k387Q760Q961K219P344J312r113j614L314p507n516
8357C1204q141P125N955j696L128M463j1048q001J18M562L276O312M711K678o551
8342C8095M346l045k608m54J563Q94J90j3569o208O035K138n731n799k590J731
$$ plain form
8327 14988 10368 7222 12450 14015 11276 21685 22967 23267 16230 24060 23949 21991 21354 21009 18724
8312 18724 16915 14214 14796 9350 14054 18390 19805 20225 19474 19320 18979 25783 27305 24572 20632 23662
8296 23662 27367 29859 32597 35121 33385 28819 25642 23236 27561 29283 27752 26079 26919 39905 44002
8281 44002 47057 46150 40443 39128 43459 43666 46202 44660 40767 40084 42014 54233 54292 63502 60979 62882
8265 62882 61910 63825 80141 89254 99953 102071 95804 88048 72033 56213 56316 61244 63419 65080
8251 65080 56292 50789 59788 68934 62040 54381 50542 51652 46000 39788 43632 44431 42693 46093 39555
8236 39555 33839 39771 40707 38604 29187 23841 21078 20023 36990 50134 47396 41397 35765 30153
8222 30153 33298 39470 45088 47276 53600 73860 86219 113432 133888 140627 143942 133444 114757
$$ packed form
8327A4988m620l146N228J565k739J0409J282L00p037P830j11j958o37l45k285
8312A8724j809k701N82n446M704M336J415M20p51j54l41O804J522k733l940L030
8296B3662L705K492K738K524j736m566l177k406M325J722j531j673Q40J2986M097
8281D4002L055r07n707j315M331K07K536j542l893o83J930J2219N9R210k523J903
8265F2882r72J915J6316R113J0699K118o267p756j6015j5820J03M928K175J661
8251F5080q788n503Q999R146o894p659l839J110n652o212L844P99j738L400o538
8236C9555n716N932R36k103r417n346k763j055J6967J3144k738n999n632n612
8222C0153L145O172N618K188O324K0260J2359K7213K0456O739L315j0498j8687
$$ plain form
8209 114757 98514 83811 72148 65305 42556 36272 40941 42388 44057 46372 47249 44427 45503 49046
8195 49046 52896 55507 44058 41108 41266 40118 40421 30905 35530 37743 36839 43160 43398 48182 52741
8180 52741 52026 46933 49742 45326 46275 49601 48761 56371 53094 49717 44937 56477 72839 86302 94597
8165 94597 93770 84173 84243 72392 57860 44618 44496 49851 49355 47003 45125 46095 45795 40221 43694 49042
8149 49042 38767 35457 38763 30617 30292 33915 37004 39267 41422 40767 43569 44579 37975 27630 22088
8134 22088 8141 12925 19016 24303 24771 23235 18698 16286 13521 12890 21974 25222 25276 26482 31215
8119 31215 37698 30745 21712 28655 29518 16778 16570 15492 26508 32499 30693 26581 23362 26061 26664
8104 26664 25445 20375 18044 14190 23488 24210 10752 11553 9006 9285 17794 17686 16340 24230 34176
$$ packed form
8209A14757j6243j4703j1663o843k2749o284M669J447J669K315Q77k822J076L543
8195D9046L850K611j1449k950J58j148L03r516M625K213r04O321K38M784M559
8180E2741p15n093K809m416R49L326q40P610l277l377m780J1540J6362J3463Q295
8165I4597q27r597P0j1851j4532j3242j22N355m96k352j878R70l00n574L473N348
8149D9042j0275l310L306q146l25L623L089K263K155o55K802J010o604j0345n542
8134B2088j3947M784O091N287M68j536m537k412k765o31R084L248N4J206M733
8119C1215O483o953r033O943Q63j2740k08j078J1016N991j806m112l219K699O03
8104B6664j219n070k331l854R298P22j3458Q01k547K79Q509j08j346P890R946
$$ plain form
8089 34176 30726 26654 30522 24513 25488 39353 44915 35138 14310 12389 26203 31481 30903 30120 25791
8074 25791 22718 21453 17000 18907 23416 14504 18680 20256 17337 18271 10491 12656 23930 27502 21662
8059 21662 16783 15885 21066 22049 16014 15993 15416 18110 14776 14326 25443 23542 21076 24551 26947 27797
8043 27797 27055 21919 16105 14389 17311 17979 15471 23191 30564 19527 20509 18288 14349 11554 20746
8028 20746 32708 32677 30063 36363 42128 38875 30480 26664 15833 9188 16792 35302 32825 28559
8014 28559 14850 18521 32869 33253 21555 22036 24343 24794 25607 24593 26084 27039 33295 31651 37526
7999 37526 40573 34372 38868 33687 30357 37027 37392 32492 34602 24615 20436 26620 29308 33045 35864
7984 35864 37486 39066 46324 43005 28663 30542 40066 42621 44183 42257 44189 42623 32555 28383
$$ packed form
8089C4176l450m072L868o009R75J3865N562r777k0828j921J3814N278n78p83m329
8074B5791l073j265m453J907M509q912M176J576k919R34p780K165J1274L572n840
8059B1662m879q98N181R83o035k1n77K694l334m50J1117j901k466L475K396Q50
8043B7797p42n136n814j716K922O68k508P720P373j1037R82k221l939k795R192
8028B0746J1962l1k614O300N765l253q395l816j0831o645P604J8510k477m266
8014B8559j3709L671J4348L84j1698M81K307M51Q13j014J491R55O256j644N875
7999C7526L047o201M496n181l330O670L65m900K110r987m179O184K688L737K819
7984C5864J622J580P258l319j4342J879R524K555J562j926J932j566j0068m172
$$ plain form
7970 28383 28887 28132 27004 28505 37593 27660 25846 30568 21082 22191 28744 27508 25674 17262 12477
7955 12477 13900 26483 34262 39401 32965 25612 21822 28900 30701 35945 41468 43574 45076 48971
7941 48971 45886 41117 34359 37948 33307 26004 33396 35749 39598 35707 25886 17745 21784 32132
7927 32132 34701 28931 17656 21445 27106 23267 22612 20096 24770 21009 17550 19882 25453 41667
7913 41667 48280 39001 34755 32465 27778 21987 19467 19463 18400 18470 26326 19857 19174 17004 12940 17765
7897 17765 24301 25427 15318 9732 28488 36702 35567 22535 8400 2301 6711 14295 11608 9715
7883 9715 8142 6516 9866 21913 23328 23295 19682 12443 19223 20250 14353 14968 23022 22314 15240 22798
7867 22798 31155 29683 22092 12417 10212 7478 19427 26406 25734 33021 29510 18904 15632 15307 14632
$$ packed form
7970B8383N04p55j128J501R088r933j814M722r486J109O553j236j834q412m785
7955A2477J423J2583P779N139o436p353l790P078J801N244N523K106J502L895
7941D8971l085m769o758L589m641p303P392K353L849l891r821q141M039J0348
7927C2132K569n770j1275L789N661l839o55k516M674l761l459K332N571J6214
7913D1667O613r279m246k290m687n791k520mj063P0P856o469o83k170m064M825
7897A7765O536J126j0109n586J8756Q214j135j3032j4135o099M410P584k687j893
7883I715j573j626L350J2047J415l3l613p239O780J027n897O15Q054p08p074P558
7867B2798Q357j472p591r675k205k734J1949O979o72P287l511j0606l272l25o75
$$ plain form
7852 14632 20427 22388 21224 13287 5163 3722 2928 61 8123 6925 6412 3445 -2000 -5522 -6134
7837 -6134 -2357 -1239 9182 12918 7996 14625 16828 12635 3616 12094 23119 21629 19566 15150
7823 15150 8950 13682 11478 3887 -3410 -7313 -3666 -959 -6547 -5585 8125 17803 10985 9
7809 9 -840 1368 1510 5815 13284 13539 18445 20694 16071 8246 11172 15890 14719 16644 14773 1264
7793 1264 -6037 7716 14825 10602 18361 24680 26971 19479 18067 13864 7317 6751 7819 12897 14414
7778 14414 4728 3037 3731 -784 -4388 -2860 -3707 98 3887 12398 18273 20828 21016 17132 13719
7763 13719 12335 10764 9054 8145 7344 7068 4572 -1494 -10924 -3249 7106 24121 34153 37937 27572
7748 27572 20220 15829 13452 4750 3896 11356 7776 7438 2238 11811 22743 16345 5773 1011 4172
$$ packed form
7852A4632N795J961j164p937q124j441p94k867Q062j198n13k967n445l522o12
7837f134L777J118J0421L736m922O629K203m193r019Q478J1025j490k063m416
7823A5150o200M732k204p591p297l903L647K707n588R62J3710R678o818j0976
7809Iq49K208J42M305P469K55M906K249m623p825K926M718j171J925j871j3509
7793A264p301J3753P109m223P759O319K291p492j412m203o547n66J068N078J517
7778A4414r686j691O94m515l604J528q47L805L789Q511N875K555J88l884l413
7763A3719j384j571j710r09q01k76k496o066r430P675J0355J7015J0032L784j0365
7748B7572p352m391k377q702q54P460l580l38n200R573J0932o398j0572m762L161
$$ plain form
7733 4172 4630 13733 21305 23199 17053 13215 12161 8654 3839 -2153 -1387 4117 9806 20625 19740
7718 19740 17212 20531 25934 25021 18575 11972 7839 2489 2833 17559 20433 22334 25328 32256 29366
7703 29366 15823 13067 2064 2753 -387 2098 11987 6223 -2738 -4959 1717 8331 12013 6362
7689 6362 1321 2638 7191 12961 2916 -4410 1090 4302 1460 28 -3038 741 -40 -369 1558
7674 1558 3214 6925 3204 -281 -609 6765 6726 7196 6805 7574 3379 302 -5054 -3914 -2168 -1495 -4547
7657 -4547 -2049 -5214 -11482 -2093 -2826 -3236 1255 5243 9905 13044 12650 2472 -2526 4545 14903
7642 14903 11371 1609 1497 -683 -1920 -1680 6972 13646 18809 11807 13049 5817 7624 8165 9788
7627 9788 19061 13242 10773 9462 12966 15816 6872 6907 4768 2928 3448 5419 3127 -4724 -3333 1346
$$ packed form
7733D172M58R103P572J894o146l838j054l507m815n992P66N504N689J0819q85
7718A9740k528L319N403r13o446o603m133n350L44J4726K874J901K994O928k890
7703B9366j3543k756j1003O89l140K485R889n764q961k221O676O614L682n651
7689F362n041J317M553N770j0045p326N500L212k842j432l066L779p81l29J927
7674A558J656L711l721l485l28P374l9M70l91P69m195l077n356J140J746O73l052
7657d547K498l165o268R389p33m10M491L988M662L139l94j0178m998P071J0358
7642A4903l532r762j12k180j237K40Q652O674N163p002J242p232J807N41J623
7627I788R273n819k469j311L504K850q944L5k139j840N20J971k292p851J391M679
$$ plain form
7611 1346 5078 6217 11215 11076 14664 15396 4912 -4092 -9256 -1766 -3634 -376 3266 -191 581
7596 581 -2656 4111 5139 5071 3282 5329 10182 4452 -1055 141 -2239 1041 9560 7372 2903 7094
7580 7094 16800 13904 7352 9539 2583 7893 5925 11881 12575 4797 -1513 642 2579 -6027 -6984
7565 -6984 -4172 1502 -1291 -7795 -16266 -14999 -6287 2173 4735 13110 17254 11394 -628 -6488 -2819
7550 -2819 -2191 -2288 397 -268 -3 893 2645 3361 5853 8663 -646 -2992 -2825 -6 114 -3135 -10415
7533 -10415 -6962 385 4742 1010 1130 5489 1054 -1980 2706 1918 -241 -7867 -8196 -5704 647
7518 647 6709 4464 8728 7493 13213 7115 8344 13232 20036 21819 20032 13564 8431 7769 9784
7503 9784 8759 7477 3860 3904 -1787 3297 10435 10676 4470 3512 -549 -6094 -8644 418 10560 16605
$$ packed form
7611A346L732J139M998j39L588P32j0484r004n164P490j868L258L642l457P72
7596E81l237O767J028o8j789K047M853n730n507J196k380L280Q519k188m469M191
7580G094R706k896o552K187o956N310j968N956O94p778o310K155J937q606r57
7565f984K812N674k793o504q471J267Q712Q460K562Q375M144n860j2022n860L669
7550b819O28r7K685o65K65Q96J752P16K492K810r309k346J67K819J20l249p280
7533a0415L453P347M357l732J20M359m435l034M686p88k159p626l29K492O351
7518F47O062k245M264j235N720o098J229M888O804J783j787o468n133o62K015
7503I784j025j282l617M4n691N084P138K41o206r58m061n545k550R062J0142O045
$$ plain form
7487 16605 13665 7691 7821 12730 16012 18536 18530 8406 1227 -4326 50 -295 766 6592 12780 12997
7471 12997 4168 1834 -694 696 8912 13872 10815 13562 16348 5171 -1522 -1687 -1207 -5552 2031
7456 2031 17198 25533 20626 7891 -2219 -5678 2999 3871 97 984 -220 -5621 -2080 2232 -3615
7441 -3615 -3382 1804 8013 16749 5740 2463 -3123 -15252 -6240 10343 14828 9053 7784 5288
7427 5288 2476 10108 14939 10563 9337 7414 7783 7556 9177 10531 9434 1126 2836 -540 -9547
7412 -9547 -14298 -14551 -11655 -7562 -412 -4969 -4813 -5017 -3431 2754 -6365 -9338 602 382 -2304 1623
7396 1623 5733 2727 -2003 3882 6405 7562 9342 9932 3350 -964 2140 8750 2628 -3753 -4589
7381 -4589 -1147 3760 10024 17370 19206 20380 16876 9192 5631 10679 -2802 -8486 -6872 -9200 -10124
$$ packed form
7487A6605k940n974J30M909L282K524oj0124p179n553M376l45J061N826O188K17
7471A2997q829k334k528J390Q216M960l057K747K786j1177o693j65M80m345P583
7456B031J5167Q335m907j2735j0110l459Q677Q72l774Q87j204n401L541M312n847
7441c615K33N186O209Q736j1009l277n586j2129R012J6583M485n775j269k496
7427E288k812P632M831m376j226j923L69k27J621J354j097q308J710l376r007
7412i547m751k53K896M093P150m557J56k04J586O185r119k973R940k20k686L927
7396A623M110l006m730N885K523J157J780N90o582m314L104O610o122o381q36
7381d589L442M907O264P346J836J174l504p684l561N048j3481n684J614k328r24
$$ plain form
7366 -10124 -3424 -7207 -18 8933 13984 15203 8560 2312 2756 608 3867 8739 10978 12296 15066
7351 15066 9007 13662 19676 14539 9008 7565 2275 -6249 -11965 -1688 2233 10797 16356 10077
7337 10077 7050 8579 12576 13324 5623 3418 7087 7646 1022 2734 12975 8252 6619 2124 5154
7322 5154 11656 4388 439 7786 16016 15345 -799 -10602 -12008 -5398 5523 4659 -1523 -456 -1174
7307 -1174 463 -5072 -2246 -3841 -3659 -2889 -2987 528 8211 8562 12425 8066 17225 19814 11117 5310
7291 5310 -4860 -17367 -17605 -13974 -703 8241 10782 10359 9538 -1170 1800 12361 12870 3164 -1643
7276 -1643 -9927 -12052 -8310 1285 6452 -2515 -7096 -19622 -15151 -5900 1239 2055 -4899 -4316 5116
7261 5116 7791 3338 -5950 -8234 2445 14033 10653 6583 -2646 -8446 -6485 -1230 1253 -3896
$$ packed form
7366a0124O700l783P189Q951N051J219o643o248M44k148L259M872K239J318K770
7351A5066o059M655O014n137n531j443n290q524n716J0277L921Q564N559o279
7337A0077l027J529L997P48p701k205L669N59o624J712J0241m723j633m495L030
7322E154O502p268l949P347Q230o71j6144r803j406O610J0921q64o182J067p18
7307a174J637n535K826j595J82P70r8L515P683L51L863m359R159K589q697n807
7291E310j0170j2507k38L631J3271Q944K541m23q21j0708K970J0561N09r706m807
7276a643q284k125L742R595N167q967m581j2526M471R251P139Q16o954N83R432
7261E116K675m453r288k284J0679J1588l380m070r229n800J961N255K483n149
$$ plain form
7247 -3896 -4757 -5321 -6523 -8442 -3223 3211 10221 6529 2405 11485 24850 34224 29171 18757 14497
7232 14497 4241 -2051 8372 16418 12427 3192 5071 13843 12566 8584 2340 -1925 3295 7247
7218 7247 10049 18068 15496 4202 4926 5462 12777 22466 18831 19492 21708 15507 16248 10853 14726 13319
7202 13319 3307 -1711 2606 4407 5656 9070 9664 7952 3517 782 -107 3007 1455 -727 -3203
7187 -3203 952 3906 -4077 893 11201 1295 5091 679 -1842 15671 26841 21821 15362 13056
7173 13056 3576 1727 916 -2182 -80 7103 7039 911 -3803 -1311 1895 6195 4623 2613 5452
7158 5452 436 -4399 -1859 13166 20631 16825 10169 11935 12052 1820 4903 7689 7896 8227 6676
7143 6676 14360 12002 7588 1956 2211 4641 12317 8611 -3360 -10137 -5998 -7152 -14274 -11513 -10548
$$ packed form
7247c896q61n64j202j919N219O434P010l692m124R080J3365R374n053j0414m260
7232A4497j0256o292J0423Q046l991r235J879Q772j277l982o244m265N220L952
7218G247K802Q019k572j1294P24N36P315R689l635O61K216o201P41n395L873j407
7202A3319j0012n018M317J801J249L414N94j712m435k735q89L114j552k182k476
7187c203M155K954p983M970J0308r906L796m412k521J7513J1170n020o459k306
7173A3056r480j849q11l098K102P183o4o128m714K492L206M300j572k010K839
7158E452n016m835K540J5025P465l806o656J766J17j0232L083K786K07L31j551
7143F676P684k358m414n632K55K430P676l706j1971o777M139j154p122K761R65
$$ plain form
7128 -10548 4949 4518 6272 273 -9344 2272 7807 3598 -4208 -3878 2597 3803 5017 5790 10486
7113 10486 8725 17124 15946 13290 8399 8566 5879 8021 18511 18460 15427 8625 -391 -10814 -7779
7098 -7779 -6512 -2997 3864 -1690 -2934 4628 1364 -7081 -14124 -10218 -6299 -9497 -19565 -15182 -10812
7083 -10812 -6907 2588 3034 -3441 7771 13799 9712 5643 7151 -765 491 -613 4867 7488 -1270
7068 -1270 -6479 -7460 -8985 -10505 2098 -1247 -11047 -11702 -6078 -3997 -4837 -5116 -8002 -7337 -5270 -4694
7052 -4694 -12788 -7846 -1715 1035 4950 6012 2262 -7352 -12542 -5531 5837 9143 15958 18036 21524
7037 21524 25837 12298 5245 7022 4212 5513 10651 7106 9423 8882 -3997 -3919 2164 4961 11021
7022 11021 12646 4796 -7983 -9922 -5120 -1377 -8846 -8249 -9272 -15662 -5600 795 -6040 -8127
$$ packed form
7128a0548J5497m31J754n999r617J1616N535m209p806L30O475J206J214P73M696
7113A0486j761Q399j178k656m891J67k687K142J0490n1l033o802r016j0423L035
7098g779J267L515O861n554j244P562l264q445p043L906L919l198j0068M383M370
7083a0812L905R495M46o475J1212O028m087m069J508p916J256j104N480K621q758
7068a270n209r81j525j520J2603l345r800o55N624K081q40k79k886O65K067N76
7052d694q094M942O131K750L915J062l750r614n190P011J1368L306O815K078L488
7037B1524M313j3539p053J777k810J301N138l545K317n41j2879P8O083K797O060
7022A1021J625p850j2779j939M802L743p469N97j023o390J0062O395o835k087
$$ plain form
7008 -8127 -3138 -622 6747 7360 2792 7827 10708 8097 -782 -5939 -1797 -3552 -856 -2783 -1506
6993 -1506 -5004 -10955 -6797 8532 11073 7690 6050 10920 8553 -2947 -8423 -11637 -7716 -2278
6979 -2278 -4322 -8739 -11492 -10539 -9154 -9439 -9081 -4307 -8004 -9820 -11829 -7033 -1509 7578 7346 8812
6963 8812 -3642 -15335 -21875 -19197 -10970 -2655 -3488 1892 5131 1589 1829 -12488 -10815 82
6949 82 3076 1779 -4229 -6888 -9781 -10488 -1464 -7205 -9515 185 5028 18 -2492 74 -3296 2531
6933 2531 1802 -4099 -64 -58 -4044 -4439 -6650 -3 6726 -10130 -18872 -13878 -13939 -10269 -8895 -10371
6917 -10371 -6955 239 5188 -608 -6766 -1024 6203 4819 3482 12355 13304 12450 7571 4502 -1797
6902 -1797 1444 115 -3660 4040 9537 10179 14216 13151 -3709 -5659 -5308 -4182 2446 8233 5154
$$ packed form
7008h127M989K516P369O13m568N035K881k611q879n157M142j755K696j927J277
6993a506l498n951M158J5329K541l383j640M870k367j1500n476l214L921N438
6979b278k044m417k753R53J385k85L58M774l697j816k009M796N524R087k32J466
6963H812j2454j1693o540K678Q227Q315q33N380L239l542K40j4317J673J0897
6949H2K994j297o008k659k893p07R024n741k310R700M843n010k510K566l370N827
6933B531p29n901M035Ol986l95k211O647O729j6856q742M994o1L670J374j476
6917a0371L416P194M949n796o158N742P227j384j337Q873R49q54m879l069o299
6902a797L241j329l775P700N497O42M037j065j6860j950L51J126O628N787l079
$$ plain form
6887 5154 6508 12992 12884 11951 6206 5896 -1873 -15463 -18751 -9637 -9767 -11619 -9904 -392 5904 794
6871 794 -6388 -4182 3829 2099 1129 -4568 -3411 -6263 -19667 -13150 -3473 -3974 -3003 -1902 9379
6856 9379 12616 4905 13815 10736 5392 2933 106 148 8625 12435 19869 24120 21872 10568 2337
6841 2337 4810 7906 3256 5714 7008 -9661 -11619 -6774 -4624 -11287 -12930 -19917 -21213 -17116 -7556
6826 -7556 5274 4752 3304 1775 9947 7188 6696 -1534 -12558 -14618 -17666 -16840 -11820 -7325 -10935
6811 -10935 -9141 -13761 -17188 -19788 -20923 -13405 -8754 834 735 12475 22149 14805 16580 15140 13458
6796 13458 16439 17478 27960 26746 8103 2385 13003 6399 5672 6451 1810 4052 -3620 -2112
6782 -2112 1358 2094 -2831 -2668 -1511 3374 9732 1876 6163 6567 -3799 -3800 7553 15026 20067 19423
$$ packed form
6887E154J354O484j08r33n745l10p769j3590l288R114j30j852J715R512O296n110
6871G94p182K206Q011j730r70n697J157k852j3404O517R677n01R71J101J1281
6856I379L237p711Q910l079n344k459k827M2Q477L810P434M251k248j1304q231
6841B337K473L096m650K458J294j6669j958M845K150o663j643o987j296M097R560
6826g556J2830n22j448j529Q172k759m92q230j1024k060l048Q26N020M495l610
6811a0935J794m620l427k600j135P518M651R588r9J1740R674p344J775j440j682
6796A3458K981J039J0482j214j8643n718J0618o604p27P79m641K242p672J508
6782b112L470P36m925J63J157M885O358p856M287M04j0366jJ1353P473N041o44
$$ plain form
6766 19423 18513 15218 1889 -3205 1010 6391 941 6615 9558 10053 4967 -4265 -10970 -7027 -2280
6751 -2280 210 506 -5231 -2699 -3973 -6660 -7226 -3581 4551 2663 -606 2926 1999 4593 2719 -5588
6735 -5588 -14366 -15026 -1575 -2057 1603 582 -575 -10545 -9377 -11382 -16097 -16615 -18730 -28712 -35339
6720 -35339 -29900 -17675 -3275 2309 -911 -1844 3165 -3253 -6116 993 -5857 -12797 -16465 -6682
6706 -6682 4776 12434 2411 -6662 -5089 2892 267 72 -1682 4698 11580 13831 17084 16437 21961
6691 21961 18158 3776 550 -3987 -10936 -7270 -5288 -8324 -158 1496 6374 8565 3647 4343 3578
6676 3578 -666 -7561 -11216 -10162 -4668 2347 4308 6531 3412 1532 497 2019 5509 8324 9273
6661 9273 -1474 5905 7874 11122 7043 5038 98 -3774 -7096 -8586 -8463 -8302 -9474 -5192 -2708
$$ packed form
6766A9423r10l295j3329n094M215N381n450N674K943M95n086r232o705L943M747
6751b280K490K96n737K532j274k687n66L645Q132j888l269L532r27K594j874q307
6735e588q778o60J3451m82L660j021j157r970J168k005m715n18k115r982o627
6720c5339N439J2225J4400N584l220r33N009o418k863P109o850o940l668R783
6706f682J1458P658j0023r073J573P981k625j95j754O380O882K251L253o47N524
6691B1961l803j4382l226m537o949L666J982l036Q166J654M878K191m918O96p65
6676C578m244o895l655J054N494P015J961K223l119j880j035J522L490K815R49
6661I273j0747P379J969L248m079k005m940l872l322j490J23J61j172M282K484
$$ plain form
6646 -2708 -6515 -19948 -16111 -4670 3022 -307 -3040 110 -1810 -10982 -8085 -3450 -9701 -11150
6632 -11150 -19294 -6178 -1007 -11846 -14649 -10970 -6558 -4985 -12678 -12486 -17053 -17770 -18956 -15628 -7650
6617 -7650 2416 7253 7133 -1985 -4012 503 4506 13674 20937 17518 14299 9650 -2080 -13804
6603 -13804 -13057 -5234 5653 1429 -1833 6706 8294 9323 4722 -757 -4418 -15040 -17153 -11733
6589 -11733 -3000 1117 3262 576 -101 -328 -7526 -2521 -1728 48 -2783 -15564 -7582 -7142 -2133
6574 -2133 -988 -8558 -11356 -10528 -2205 4112 2399 -5990 -10090 -11822 4746 10582 3667 1786 8580
6559 8580 9867 19986 20511 9794 8432 1523 -6263 -3151 -2699 -4713 -415 -3942 -851 8654 10599
6544 10599 9797 10708 8354 7346 8424 1296 -1581 5534 7932 4322 3439 13767 8319 6808 9639
$$ packed form
6646b708l807j3433L837J1441P692l329k733L150j920r172K897M635o251j449
6632a1150q144J3116N171j0839k803L679M412J573p693J92m567p17j186L328P978
6617g650J0066M837j20r118k027M515M003R168P263l419l219m649j1730j1724
6603a3804P47P823J0887m224l262Q539J588J029m601n479l661j0622k113N420
6589a1733Q733M117K145k686o77k27p198N005P93J776k831j2781P982M40N009
6574b133J145p570k798Q28Q323O317j713q389m100j732J6568N836o915j881O794
6559H580J287J0119N25j0717j362o909p786L112M52k014M298l527L091R505J945
6544A0599q02R11k354j008J078p128k877P115K398l610q83J0328n448j511K831
$$ plain form
6529 9639 1962 -3960 -6736 -8150 -9258 -3698 -1005 -14449 -16302 -6478 -719 5135 5599 -1519 -10520
6514 -10520 -3280 -476 -4528 2436 5776 4893 13879 17789 9216 751 -2051 1609 4710 1714 8259
6499 8259 7985 4697 6750 7593 8796 1497 -3024 -1138 15220 13317 5969 2828 10253 5546 411
6484 411 -1360 3525 8275 10595 -1625 -4637 -2434 3760 3419 -5326 -3478 -3951 -14367 -13243 -9290
6469 -9290 -9057 -14541 -16954 -19429 -17213 -17139 -15323 -2751 11056 12603 3744 -8328 -11368 -282 8809
6454 8809 10059 7142 235 -993 -10340 -14192 -14478 -9647 -7143 -2495 1527 5831 5036 4174 3421 -1456
6438 -1456 -3227 -10689 -13103 615 13539 18303 14976 16509 8814 -407 1278 -52 6357 14580
6424 14580 14976 14297 6845 253 -134 -5144 -4974 -2169 -3438 -3084 -926 -6204 -8504 -4893 -1286 4688
$$ packed form
6529I639p677n922k776j414j108N560K693j3444j853R824N759N854M64p118r001
6514a0520P240K804m052O964L340q83Q986L910q573q465k802L660L101k996O545
6499H259k74l288K053Q43J203p299m521J886J6358j903p348l141P425m707n135
6484D11j771M885M750K320j2220l012K203O194l41q745J848m73j0416J124L953
6469i290K33n484k413k475K216P4J816J2572J3807J547q859j2072l040J1086R091
6454H809J250k917o907j228r347l852k86M831K504M648M022M304p95q62p53m877
6438a456j771p462k414J3718J2924M764l327J533p695r221J685j330O409Q223
6424A4580L96o79p452o592l87n010J70K805j269L54K158n278k300L611L607N974
$$ plain form
6408 4688 -250 -8945 -12696 -6619 -13969 -17092 -9209 -5481 -9799 -4075 -2641 -10564 -8140 1117 -5097
6393 -5097 363 -7547 -10069 -15055 -15968 -11253 -13032 -10172 5659 4997 5141 -1617 -5489 -1199 9774
6378 9774 9015 938 -2464 -7188 -17756 -20062 -11185 -862 -1944 -8196 -6259 -5532 -14571 -15962 -9475
6363 -9475 -473 -4534 -6633 -2619 -9200 -7030 -7262 -4904 3586 5627 5500 9455 5846 5856 13181 13947
6347 13947 9864 7560 12542 14825 19590 10304 753 -1055 3756 4037 -1349 -1604 757 -6893 4166
6332 4166 18397 19163 9520 -4841 -16044 -9097 -1662 1934 -245 -3420 -159 14476 14461 15786 12619
6317 12619 2605 5227 4950 -65 -8401 -12638 -9885 -5721 -8525 -4167 -845 -6790 4260 2940
6303 2940 -1433 -5186 -1035 6322 3376 -4418 1020 7381 9256 2573 -5261 -4555 -6548 -13895 -7266
$$ packed form
6408D688m938q695l751O077p350l123P883L728m318N724J434p923K424R257o214
6393e097N460p910k522m986r13M715j779K860J5831o62J44o758l872M290J0973
6378I774p59q077l402m724j0568k306Q877J0323j082o252J937P27r039j391O487
6363i475R002m061k099M014o581K170k32K358Q490K041j27L955l609J0P325P66
6347A3947m083k304M982K283M765r286r551j808M811K81n386k55K361p650J1059
6332D166J4231P66r643j4361j1203O947P435L596k179l175L261J4635j5J325l167
6317A2619j0014K622k77n015q336m237K753M164k804M358L322n945J1050j320
6303B940m373l753M151P357k946p794N438O361J875o683p834P06j993p347O629
$$ plain form
6288 -7266 -2907 -9710 -14155 -15152 -12274 -8713 3371 17187 17290 15102 16232 -605 -2642 -6883 -11973
6273 -11973 -12874 -13040 -12641 -14147 -8917 -5799 2142 -2959 -14483 -10787 955 5136 2925 1209 -1105
6258 -1105 3920 12565 3223 -2461 -10339 -11879 -7254 -6279 -8717 -8158 -14604 -13993 -14832 -7881 -2059 -1497
6242 -1497 -1492 -9531 -6035 -1823 -1151 -2001 1063 4210 4764 586 -6997 -11467 -521 -3049 -6754 -3273
6226 -3273 -577 -4277 -5504 -3525 -2555 -7203 -5730 -1041 -4395 -7319 -10108 -1636 4252 298 -3377
6211 -3377 -4428 -1765 3303 4387 4355 2251 604 5150 9668 9998 3030 -5868 -10735 1333 -1956
6196 -1956 -6264 -8715 -5843 -6696 -7214 -7246 -3583 -4630 -4277 -12182 -16008 -15007 -19183 -15315 3853 7268
6180 7268 -213 -13097 -25178 -26405 -14081 -10992 -14344 -13273 -7904 -6332 -2556 3171 -775 171
$$ packed form
6288g266M359o803m445r97K878L561J2084J3816J03k188J130j6837k037m241n090
6273a1973r01j66L99j506N230L118P941n101j1524L696J1742M181k211j716k314
6258a105N025Q645r342n684p878j540M625R75k438N59o446O11q39O951N822N62
6242a497Nq039L496M212O72q50L064L147N54m178p583m470J0946k528l705L481
6226c273K696l700j227J979R70m648J473M689l354k924k789Q472N888l954l675
6211c377j051K663N068J084l2k104j647M546M518L30o968q898m867J2068l289
6196a956m308k451K872q53n18l2L663j047L53p905l826J001m176L868J9168L415
6180G268p481j2884j2081j227J2324L089l352J071N369J572L776N727l946R46
$$ plain form
6166 171 5823 2427 -3960 -6757 -2900 2177 1663 741 -3930 -61 -597 -292 8089 4029 7291 545
6150 545 -3834 -6073 -53 -1148 -10618 -12610 -5720 -13705 -23691 -18444 -14829 -23265 -21738 -14627 -7725
6135 -7725 6148 12938 13451 15261 18092 17329 17210 10680 15244 11734 10823 9615 8905 5969 6571 4650
6119 4650 3260 1099 1364 2532 7971 -364 -2749 4839 7617 7980 5211 -3217 -2554 4367 -439 5530
6103 5530 8484 -12166 -5747 -6262 -2324 -1667 1100 7276 3006 1981 4974 -1491 5334 13420 7204
6088 7204 3141 3836 -9079 -19584 -15623 -7101 -12783 -6634 -8129 -13001 -14154 -11879 -16967 -13672 -18952
6073 -18952 -23309 -17389 -15119 -20417 -23607 -17681 -10797 -6248 -8075 -9258 -17761 -11205 -6251 -3391 -6884
6058 -6884 -9609 -14711 -23057 -11985 5377 3454 1745 -3826 -5807 -4954 -7236 -8959 -1241 -8330 -4034
$$ packed form
6166A71N652l396o387k797L857N077n14r22m671L869n36L05Q381m060L262o746
6150E45m379k239O020j095r470j992O890p985r986N247L615q436J527P111O902
6135g725J3873O790N13J810K831p63j19o530M564l510r11j208p10k936O02j921
6119D650j390k161K65J168N439q335k385P588K778L63k769q428O63O921m806N969
6103E530K954k0650O419n15L938O57K767O176m270j025K993o465O825Q086o216
6088G204m063O95j2915j0505L961Q522n682O149j495m872j153K275n088L295n280
6073a8952m357N920K270n298l190N926O884M549j827j183q503O556M954K860l493
6058f884k725n102q346J1072J7362j923j709n571j981Q53k282j723P718p089M296
$$ plain form
6043 -4034 -614 -1997 6706 10373 2995 4278 4807 -3365 -3149 -1160 663 272 3341 6360 -2875 -3440
6027 -3440 -2290 -338 1556 -6670 -5801 -3921 -9829 -3647 8274 6058 -1331 -5361 1694 3000 -4805
6012 -4805 -10364 -5667 8431 -312 -2324 -572 2022 10663 10937 580 -8325 -1020 15851 10490
5998 10490 467 3441 -2138 -1113 803 589 10719 4022 7263 8269 9274 6863 -2030 -811
5984 -811 17845 19482 19390 15502 12552 16216 20882 6732 -2483 -1355 -7603 -7783 -7956 4055 206
5969 206 -6406 -7730 -3958 -6162 -9650 -3390 -7815 -7907 -2123 -5506 -7157 -13785 -18109 -17511 -20526 -14983
5953 -14983 -6519 -3709 -12706 -12478 -8982 -6918 -6139 -13003 -10855 -12342 -12607 -9164 -4775 -7340 -11072
5938 -11072 -7943 -13043 -13266 -16796 -15331 -4269 578 -6705 -3044 4679 10205 12642 10428 -5785
$$ packed form
6043d034L420j383Q703L667p378J283N29q172K16J989J823l91L069L019r235n65
6027c440J150J952J894q226Q69J880n908O182J1921k216p389m030P055J306p805
6012d805n559M697J4098q743k012J752K594Q641K74j0357q905P305J6871n361
5998A0490j0023K974n579J025J916k14J0130o697L241J006J005k411q893J219
5984h11J8656J637r2l888k950L664M666j4150r215J128o248j80j73J2011l849
5969B06o612j324L772k204l488O260m425r2N784l383j651o628m324N98l015N543
5953a4983Q464K810q997K28L496K064P79o864K148j487k65L443M389k565l732
5938a1072L129n100k23l530J465J1062M847p283L661P723N526K437k214j6213
$$ plain form
5924 -5785 -14545 -9616 -7464 -2600 -1808 -1853 -9318 -16190 -16158 -11178 -4625 128 -7074 -9998 -2810 115
5908 115 -7647 -5176 -4214 -4450 8202 11804 -610 1663 7351 7828 7457 6550 1298 -12198 -13740 -12672
5892 -12672 -13119 -19111 -19035 -7029 -2327 -591 -4883 -6764 -8583 -9358 -6305 -4401 -11327 -12889 -2656
5877 -2656 2727 4409 5265 4116 602 -5007 -6654 -12405 -7442 2660 2521 -2319 -7305 -9089 -7289
5862 -7289 -11996 -15251 -10733 -9880 -2315 4875 3601 5087 5259 -216 -8122 -8400 -11186 -15646 -10398 -1143
5846 -1143 -7619 -15124 -16751 -6966 -6107 -8201 -15437 -23066 -25553 -27584 -35423 -16147 -5999 -2686 -3208
5831 -3208 -4400 -3565 41 1399 -771 3359 -10907 -16125 -14774 -12482 -12038 -10514 -6580 -2327 -5452
5816 -5452 -10281 -14402 -8993 -3884 2111 -48 3832 -4266 -16339 -19706 -7101 -4410 -1284 5804
$$ packed form
5924e785q760M929K152M864P92m5p465o872L2M980O553M753p202k924P188K925
5908A15p762K471R62k36J2652L602j2414K273N688M77l71r07n252j3496j542J068
5892a2672m47n992P6J2006M702J736m292j881j819p75L053J904o926j562J0233
5877b656N383J682Q56j149l514n609j647n751M963J0102j39m840m986j784J800
5862g289m707l255M518Q53P565P190j274J486J72n475p906k78k786m460N248R255
5846a143o476p505j627R785Q59k094p236p629k487k031p839J9276J0148L313n22
5831c208j192Q35L606J358k170M130j4266n218J351K292M44J524L934M253l125
5816e452m829m121N409N109N995k159L880q098j2073l367J2605K691L126P088
$$ plain form
5802 5804 6674 7866 4787 961 -3080 -8259 -14767 -21173 -10134 3489 599 -460 6527 7299 8233
5787 8233 5426 -2634 -4094 -3461 -8152 4121 3019 -3520 -4623 -12101 -8689 227 -1488 -2554 -5838
5772 -5838 1934 -445 -4273 -6302 -11852 -7163 -4943 -4063 -9471 -11261 -2980 -848 -10096 -18520 -12811
5757 -12811 -4210 4915 9882 11158 11828 10988 -1849 -3848 -2462 -6829 -6790 -4386 738 5081 722
5742 722 -6257 -4457 -6063 3223 2549 -11359 -18395 -19230 -8785 -5963 -11832 -16675 -12522 -10941 -1592
5727 -1592 -5204 -1032 1003 -4741 -6195 -5155 -7389 -6573 -5669 -3839 -3956 -8016 -13707 -12790 -15559 -15183
5711 -15183 -10822 -10518 -5570 -3952 2755 -1761 862 3431 8415 5474 3450 -2005 -1882 -1529 11632
5696 11632 14010 12046 2387 -1738 3275 1062 8604 14741 12499 2732 7000 10821 9926 733 -11110
$$ packed form
5802E804Q70J192l079l826m041n179o508o406J1039J3623k890j059O987P72R34
5787H233k807q060j460O33m691J2273j102o539j103p478L412Q916j715j066l284
5772e838P772k379l828k029n550M689K220Q80n408j790Q281K132r248q424N709
5757a2811Q601R125M967J276O70q40j2837j999J386m367L9K404N124M343m359
5742G22o979J800j606R286o74j3908p036q35J0445K822n869m843M153J581R349
5727a592l612M172K035n744j454J040k234Q16R04J830j17m060n691R17k769L76
5711a5183M361L04M948J618O707m516K623K569M984k941k024n455J23L53J3161
5696A1632K378j964r659m125N013k213P542O137k242r767M268L821q95r193j1843
$$ plain form
5681 -11110 -15218 -19962 -15814 2359 11774 14629 16541 12783 6536 10886 8700 9067 7704 10288 1544
5666 1544 -10997 -14764 -12013 -24667 -26090 -27013 -14905 1341 4369 5435 -191 -6625 -1679 5525
5652 5525 5264 2477 -1910 -6056 -587 -1627 -376 4962 3038 -9177 -13106 -2484 -5299 -3184 -1746
5637 -1746 -3685 -3748 4932 -1499 -112 -5371 -9440 -9811 -6196 -8352 -13834 -10396 5137 9986 6165
5622 6165 397 -2491 -7734 -9453 -19374 -25827 -23257 -23171 -22036 -23295 -16605 -1051 2869 1805 -4069
5607 -4069 -2349 2255 9903 3710 -14026 -16412 -16785 -13186 -6462 5139 5015 -3133 -896 -375 -7301
5592 -7301 -3922 1185 7138 12846 18950 15627 10982 -1169 -2602 -3494 -7530 2798 13101 9264
5578 9264 1630 -2641 -2312 -3696 -11945 -11164 -737 8003 8925 6976 -179 -174 5314 5917 6167 5700 2292
$$ packed form
5681a1110m108m744M148J8173R415K855J912l758o247M350k186L67j363K584q744
5666A544j2541l767K751j2654j423r23J2108J6246L028J066n626o434M946P204
5652E525k61k787m387m146N469j040J251N338j924j2215l929J0622k815K115J438
5637a746j939o3Q680o431J387n259m069l71L615k156n482L438J5533M849l821
5622F165n768k888n243j719r921o453K570Q6J135j259O690J5554L920j064n874
5607d069J720M604P648o193j7736k386l73L599O724J1601j24q148K237N21o926
5592g301L379N107N953N708O104l323m645j2151j433q92m036J0328J0303l837
5578I264p634m271L29j384q249P81J0427Q740R22j949p155NN488O03K50m67l408
$$ plain form
5561 2292 1403 3149 7642 5200 4609 7226 11994 4859 -1235 81 -5090 -11569 -1021 -4089 -8281
5546 -8281 -5205 1780 8233 1278 -1376 -4768 -13434 -9421 -4717 -4319 -228 -1215 -10904 -5740 -3348
5531 -3348 455 -2653 -1386 4118 2842 -8280 -15754 -16362 -10713 -9549 -12164 -7871 -5957 -3012 -7531
5516 -7531 -2459 -3964 -1075 3909 -4943 -4252 -12663 -15885 1139 11815 9835 2425 -2378 -4280 -4194
5501 -4194 -1384 -8246 -9451 -6142 -3702 -1318 -17005 -23364 -15988 -2203 1731 1189 7728 14006 12390
5486 12390 5915 -1706 -14969 -14356 -11527 -17863 -20596 -16316 -13120 -11150 -10937 -7018 -1038 -10198 -14146
5471 -14146 -19271 -12406 -10299 -5094 -4562 319 9986 9042 6068 9536 10505 12775 11572 4642 -5993
5456 -5993 -4726 -1913 -8296 -9720 -3736 -8345 -21121 -25979 -19959 -9459 -2187 2085 2862 2559 -2506
$$ packed form
5561B292q89J746M493k442n91K617M768p135o094J316n171o479J0548l068m192
5546h281L076O985O453o955k654l392q666M013M704L98M091r87r689N164K392
5531c348L803l108J267N504j276j1122p474o08N649J164k615M293J914K945m519
5516g531N072j505K889M984q852O91q411l222J7024J0676j980p410m803j902Q6
5501d194K810o862j205L309K440K384j5687o359P376J3785L934n42O539O278j616
5486A2390o475p621j3263O13K829o336k733M280L196J970K13L919N980r160l948
5471a4146n125O865K107N205N32M881R667r44k974L468R69K270j203o930j0635
5456e993J267K813o383j424N984m609j2776m858O020J0500P272M272P77l03n065
$$ plain form
5441 -2506 -8410 -610 -147 2739 13194 12376 3805 1252 -510 -3020 -17256 -15941 -20023 -17910 -18760
5426 -18760 -9821 -10635 -8284 -882 2171 1254 4900 -1654 -5858 1740 7481 155 -2051 10591 16512
5411 16512 10055 -1381 -8664 -21689 -17779 -4041 -6006 1049 284 -1842 1584 -68 -9488 -15597
5397 -15597 -17357 -8429 1683 2928 325 883 3949 10047 7026 447 74 -7527 -5945 -4982 -1970
5382 -1970 -3527 -4150 -545 7449 3725 5052 8763 9945 14530 4494 -1455 -3427 -8162 -13906 -18014
5367 -18014 -14864 185 2947 3271 -2336 -3800 -3871 -3086 4797 -891 -7920 -6613 -2856 -786 2298
5352 2298 10191 6530 6312 9246 13454 19130 22147 11688 -3603 -5839 -3883 -3164 -3016 -436 -2774
5337 -2774 -5218 -4415 -13690 -11544 -266 948 -1641 -4031 5739 -266 -5244 -10716 -14306 -10595 -7924
$$ packed form
5441b506n904P800M63K886J0455q18q571k553j762k510j4236J315m082K113q50
5426a8760Q939q14K351P402L053r17L646o554m204P598N741p326k206J2642N921
5411A6512o457j1436p283j3025L910J3738j965P055p65k126L426j652r420o109
5397a5597j760Q928J0112J245k603N58L066O098l021o579l73p601J582R63L012
5382a970j557o23L605P994l724J327L711J182M585j0036n949j972m735n744m108
5367a8014L150J5049K762L24n607j464p1P85P883n688p029J307L757K070L084
5352B298P893l661k18K934M208N676L017j0459j5291k236J956P19J48K580k338
5337b774k444Q03r275K146J1278J214k589k390R770o005m978n472l590L711K671
$$ plain form
5322 -7924 -10301 -15447 -14836 -12294 -12439 -17510 -20231 -18761 -23977 -24721 -12797 -2980 -878 4606 5480 6758
5306 6758 6165 5642 -549 5082 699 -767 -570 -6624 -10846 -7418 -7358 -14104 -6214 -2253 -3113 -9891
5290 -9891 -8088 -224 4703 4907 746 -3522 -10622 -6091 -9693 -20367 -9753 -4059 -6036 92 7325
5275 7325 11402 11881 3605 -988 -4981 -14173 -13186 -6896 4069 2816 -2779 -2893 -3095 -2123 -6486 -8980
5259 -8980 -3687 10030 6160 3519 -5362 -15448 -6338 -3953 -1296 8806 9604 11055 -30 3335
5245 3335 5484 -1601 -4429 2612 3116 -6731 -5404 -6440 -6782 2994 625 -9374 -15956 -19909 -14821
5230 -14821 -11344 -14844 -18353 -29736 -21360 3516 11202 13098 15701 2613 -8724 -15623 -21756 -19032
5216 -19032 -11929 -8621 -8235 -11425 -18804 -24889 -20678 -16720 -14159 -9872 -2647 5496 3945 -8215 -3954
$$ packed form
5322g924k377n146O11K542j45n071k721J470n216p44J1924R817K102N484Q74J278
5306F758n93n23o191N631m383j466J97o054m222L428O0o746P890L961q60o778
5290i891J803P864M927K04m161m268p100M531l602j0674J0614N694j977O128P233
5275G325M077M79q276m593l993r192R87O290J0965j253n595j14k02R72m363k494
5259h980N293J3717l870k641q881j0086R110K385K657J0102P98J451j1085L365
5245C335K149p085k828P041N04r847J327j036l42R776k369r999o582l953N088
5230a4821L477l500l509j1383Q376K4876P686J896K603j3088j1337o899o133K724
5216a9032P103L308L86l190p379o085M211L958K561M287P225Q143j551j2160M261
$$ plain form
5201 -3954 -8110 -10115 -6771 2055 -7170 -4855 -2228 -4530 4785 13282 8654 7416 1707 -11652 -19185
5186 -19185 -12513 -5808 -9968 1157 2275 858 2170 3377 5309 9495 4342 1116 4128 6874
5172 6874 14026 13335 7947 9084 12305 5949 -7723 -8684 -612 2169 -2735 -9790 -6309 -8334 -7435
5157 -7435 -7234 -2318 5859 6968 941 6096 4446 7054 9497 2560 3196 -1281 4987 8538 -1020
5142 -1020 -5500 -6997 -6393 -1191 1392 4804 10363 6102 -1509 2237 6870 11529 11230 2326 -7165
5127 -7165 -17548 -3456 10046 15646 13510 11680 7138 -8293 -7898 598 7012 5662 5847 109
5113 109 -9548 -8910 -8710 -14020 -9312 -368 -5651 -8565 -6040 -12602 -17019 -13451 -15605 -16699 -1363
5098 -1363 4449 6725 1921 128 7557 4618 3990 4079 6059 -18 -4170 -1120 883 -5275 -9020 -15179
$$ packed form
5201c954m156k005L344Q826r225K315K627k302R315Q497m628j238n709j3359p533
5186a9185O672O705m160J1125J118j417J312J207J932M186n153l226L012K746
5172F874P152o91n388J137L221o356j3672r61Q072K781m904p055L481k025Q99
5157g435K01M916Q177J109o027N155j650K608K443o937O36m477O268L551r558
5142a020m480j497O04N202K583L412N559m261p611L746M633M659k99q904r491
5127g165j0383J4092J3502N600k136j830m542j5431L95Q496O414j350J85n738
5113A09r657O38K00n310M708Q944n283k914K525o562m417L568k154j094J5336
5098a363N812K276m804j793P429k939o28Q9J980o077m152L050K003o158l745o159
$$ plain form
5082 -15179 -17575 -9999 -9070 -18148 -21196 -19742 -16741 -15337 -11952 -15059 -12795 -12182 -12060 -8960 -7885
5067 -7885 -1855 10105 8159 -2325 2445 -3789 -8074 -4078 -1226 -6157 -9345 -7207 -15406 -6380
5053 -6380 2828 6123 6663 1971 -2943 265 6746 19401 17102 1837 1159 4675 -1775 -17136 -17896
5038 -17896 -16311 -14447 -2203 97 -4253 -7620 -6831 -5587 -3638 -2975 4987 11813 5940 -8029 -10751
5023 -10751 -8369 -14644 -17014 -10657 -8537 -4378 -13047 -16126 -11561 -14158 -11115 -9252 -13855 -8810 -11002
5008 -11002 -8443 -4997 -6618 -3079 -3418 1101 -13005 -17338 -21853 -24154 -9021 -6937 -4054 -151
4994 -151 -1807 -914 5268 5235 1022 895 5256 -1150 837 4763 -1100 -2817 -3373 -13946 -13021 -21425
4978 -21425 -22704 -12437 -12876 -17586 -19378 -22143 -19790 -19572 -20456 -20150 -17513 -17382 -15075 -19480 -12549 -3716
$$ packed form
5082a5179k396P576R29r078l048J454L001J404L385l107K264O13J22L100J075
5067g885O030J1960j946j0484M770o234m285L996K852m931l188K138q199R026
5053f380R208L295N40m692m914L208O481J2655k299j5265o78L516o450j5361p60
5038a7896J585J864J2244K300m350l367P89J244J949O63P962O826n873j3969k722
5023a0751K382o275k370O357K120M159q669l079M565k597L043J863m603N045k192
5008a1002K559L446j621L539l39M519j4106m333m515k301J5133K084K883L903
4994a51j656Q93O182l3m213j27M361o406J987L926n863j717n56j0573R25q404
4978b1425j279J0267m39m710j792k765K353K18q84L06K637J31K307m405O931Q833
$$ plain form
4962 -3716 1637 7866 6713 3752 3649 4056 4549 995 -641 -4621 -15023 -12317 -7045 -11318 -15505
4947 -15505 -19910 -11480 -5843 1150 12584 12107 1350 -7606 -19656 -28632 -26073 -11961 -3075 -1491
4933 -1491 1027 -3234 -12282 -8797 2034 1178 -11874 -15982 -18638 -6284 3042 6006 3494 -4978
4919 -4978 -6676 -6718 -7377 704 5299 51 1100 4386 1871 2818 -3914 -2269 -2243 -1038 7042 6775 113
4902 113 -2493 -7956 -11894 -4699 -1378 -9828 -8514 -4245 -767 4666 -7702 -15726 -17791 -13025 -12478
4887 -12478 -2727 -5218 -3384 2839 2547 -1994 115 6758 7056 6149 4209 1237 8879 5610 -3874
4872 -3874 2152 4186 -2799 -917 2284 7212 7386 225 -2174 -2644 4356 3383 -9606 -18594 -14442
4857 -14442 -9995 -484 7263 7511 4777 -837 -3227 -2607 2829 5933 13330 489 -5921 -8799 -13416
$$ packed form
4962c716N353O229j153k961j03M07M93l554j636l980j0402K706N272m273m187
4947a5505m405Q430N637O993J1434m77j0757q956j2050q976K559J4112Q886J584
4933a491K518m261r048L485J0831q56j3052m108k656J2354R326K964k512q472
4919d978j698m2o59Q081M595n248J049L286k515R47o732J645K6J205Q080k67o662
4902A13k606n463l938P195L321q450J314M269L478N433j2368q024k065M766N47
4887a2478R751k491J834O223k92m541K109O643K98r07j940k972P642l269r484
4872c874O026K034o985J882L201M928J74p161k399m70P000r73j2989q988M152
4857a4442M447R511P747K48k734n614k390O20N436L104P397j2841o410k878m617
$$ plain form
4842 -13416 -12880 -12525 -21567 -20938 -11075 -3393 -8153 -6799 -9598 -14134 -11553 -12558 -6315 404 1307 3124
4826 3124 -2757 -2946 -5323 -4139 -12016 -15078 -13367 -12336 -5977 -9105 -4300 -253 -1972 -1702 -2331 -13384
4810 -13384 -18032 -15756 -7836 -7003 -13650 -23354 -30547 -26014 -20492 -20736 -21302 -15602 -11904 -17880 -18868 -16738
4794 -16738 -9939 -1507 -4031 -7844 -675 1706 -3771 -11572 -16031 -13584 -8553 -3408 -2890 -1189 -399
4779 -399 6667 15286 18015 11193 4952 -2072 -5609 -2597 -6510 -14557 -17499 -12043 -6829 -11516 -21835
4764 -21835 -25015 -12240 -5277 -2533 3578 5224 4350 749 -3462 -6631 1349 -1395 -2535 504 5386
4749 5386 4331 7248 17647 22663 11933 7786 9674 14449 15863 5581 1388 3127 6534 6030
4735 6030 9651 10769 61 6660 -967 -7844 597 -4326 -3848 1601 -3433 -9149 -1612 -344 -10491
$$ packed form
4842a3416N36L55r042O29R863P682m760J354k799m536K581j005O243O719R03J817
4826C124n881j89k377J184p877l062J711J031O359l128M805M047j719K70o29j1053
4810a3384m648K276P920Q33o647r704p193M533N522k44n66N700L698n976r88K130
4794a6738O799Q432k524l813P169K381n477p801m459K447N031N145N18J701P90
4779c99P066Q619K729o822o241p024l537L012l913q047k942N456N214m687j0319
4764b1835l180J2775O963K744O111J646q74l601m211l169P980k744j140L039M882
4749E386j055K917J0399N016j0730m147J888M775J414j0282m193J739L407n04
4735F030L621J118j0708O599p627o877Q441m923M78N449n034n716P537J268j0147
$$ plain form
4720 -10491 -10258 -7772 -5928 -3219 -6367 -12959 -12158 -3671 -215 211 3010 -1197 -5060 -6518 -6469 2492
4704 2492 4065 -553 -2784 -7161 -3641 3969 7069 -3230 -11236 -6138 -6361 -10624 -9456 -8726 -4558
4689 -4558 -11862 -14142 -12177 -7035 -7531 -8625 5451 14853 5035 -9831 -14821 -17257 -25588 -25749 -14609
4674 -14609 -8223 -8125 -11529 -8046 -7998 -6214 -3470 -4452 -2501 -6248 -15463 -8953 -1252 7952 7799 -3195
4658 -3195 -8697 -8101 -10624 -10312 -4109 464 -2290 -2335 4373 4307 -2793 643 -1809 -2557 -1150 -7819 -1575
4641 -1575 -3319 -7217 -16456 -9448 -14760 -11732 -9715 -7604 -7884 -8768 -1326 2773 -805 2030 2361 -3785
4625 -3785 -6863 -7158 -17537 -21402 -26186 -23242 -23344 -23263 -22687 -20976 -18029 -13551 -5701 20 -1857 -991
4609 -991 -2291 -3792 -8378 -9366 -3631 6577 6782 8393 9366 6258 -2385 -816 -3518 -9506 -8493 -12431
$$ packed form
4720a0491K33K486J844K709l148o592Q01Q487L456M26K799m207l863j458M9Q961
4704B492J573m618k231m377L520P610L100j0299q006N098k23m263J168P30M168
4689d558p304k280J965N142m96j094J4076R402r818j4866m990k436q331j61J1140
4674a4609O386R8l404L483M8J784K744r82J951l747r215O510P701R204j53j0994
4658c195n502N96k523L12O203M573k754m5O708o6p100L436k452p48J407o669O244
4641a575j744l898r239P008n312L028K017K111k80q84P442M099l578K835L31o146
4625c785l078k95j0379l865m784K944j02Q1N76J711K947M478P850N721j877Q66
4609i91j300j501m586r88N735J0208K05J611R73l108q643J569k702n988J013l938
$$ plain form
4593 -12431 -13936 -18689 -17863 -17311 -18224 -3559 3870 -1248 -2546 -212 -4122 -7798 -1405 7898 10359
4578 10359 7178 12288 4535 -4863 -5905 -2060 -1599 -5394 -2831 -6538 -4814 2140 6147 10494 4332
4563 4332 1944 7784 9720 6940 -2059 2155 2629 2665 3021 842 8612 6858 6647 10379 12653 16183
4547 16183 12681 2453 591 -8120 -14211 -7613 1681 305 -10699 -8058 -10986 -2059 5699 -1100
4533 -1100 -12834 -7901 -4938 1614 4256 -4432 -6679 -8283 -7568 -1762 2179 -6132 2094 9100 -823
4518 -823 -6172 -8437 -12472 -19580 -15275 -9567 -2533 4665 2393 -175 4189 -2257 -3740 -9770 -5106
4503 -5106 5113 10612 2102 -2175 3535 -3939 -3961 5362 9059 15184 13288 1605 -6297 -13245 -10400
4488 -10400 -5809 -12153 -15415 -9047 117 -5322 -532 6732 -1208 490 3173 -4866 -17312 -18480
$$ packed form
4593a2431j505m753Q26N52r13J4665P429n118j298K334l910l676O393R303K461
4578A0359l181N110p753r398j042L845M61l795K563l707J724O954M007M347o162
4563D332k388N840J936k780q999M214M74L6L56k179P770j754k11L732K274L530
4547A6183l502j0228j862q711o091O598R294j376j1004K641k928Q927P758o799
4533a100j1734M933K963O552K642q688k247j604P15N806L941q311Q226P006r923
4518h23n349k265m035p108M305N708P034P198k272k568M364o446j483o030M664
4503e106J0219N499q510m277N710p474k2R323L697O125j896j1683p902o948K845
4488a0400M591o344l262O368R164n439M790P264p940J698K683q039j2446j168
$$ plain form
4474 -18480 -7873 1498 -1197 -5804 -9801 -10714 -10363 -18331 -12225 1656 3893 419 -3230 -8368 -6760
4459 -6760 -5734 -198 -801 1620 5953 6823 96 1950 3856 675 -888 1155 46 -255 1016 1828
4443 1828 -1333 1701 7535 -4038 -3699 -4599 -6395 -864 7487 -2443 -8510 -8891 -7837 -12245 -10451
4428 -10451 -5787 -3114 2195 7636 9494 10211 4359 5489 1348 -961 -2388 -929 -8489 -10043 -2695
4413 -2695 -2317 -637 -3331 -8875 -7088 1263 17 -2531 6309 2748 -3821 -12474 -25401 -24514 -14717
4398 -14717 -9531 -7417 -9256 -12598 -23773 -20460 -9804 -8600 -5342 -9473 -11091 -7896 -2888 6457
4384 6457 4444 2490 -2042 -6560 -9663 -7631 -2438 2018 12260 9333 4529 -6008 -3059 -9233
4370 -9233 -9632 -2592 2663 3637 8328 9504 2895 -1945 -10895 -8886 -4536 -7646 6384 9316 4432
$$ packed form
4474a8480J0607R371k695m607l997r13L51p968O106J3881K237l474l649n138J608
4459f760J026N536o03K421M333Q70o727J854J906l181j563K043j109l01J271Q12
4443A828l161L034N834j1573L39r00j796N531Q351r930o067l81J054m408J794
4428a0451M664K673N309N441J858P17n852J130m141k309j427J459p560j554P348
4413b695L78J680k694n544J787Q351j246k548Q840l561o569q653j2927Q87R797
4398a4717N186K114j839l342j1175L313J0656J204L258m131j618L195N008R345
4384F457k013j954m532m518l103K032N193M456J0242k927m804j0537K949o174
4370i233l99P040N255R74M691J176o609m840q950K009M350l110J4030K932m884
$$ plain form
4355 4432 1110 -6847 -6677 -3054 -1605 -4151 -6889 -11615 -14736 -4224 -10861 -13461 -4537 5889 5430
4340 5430 2815 80 -51 1926 -2596 -3787 -4898 -2720 1634 -2098 -6524 7168 8641 6347 732
4325 732 -4737 -6669 -2382 1004 -3390 1055 8217 11195 14411 13025 17700 20307 15131 8113 8810
4310 8810 15867 18573 24059 24433 22251 4531 -6970 -12883 -16932 -8884 5073 -2843 -5267 3193
4296 3193 7451 10002 10570 10164 -1784 -6532 -368 6230 14562 12348 10191 10157 3757 3772 5592 -1824
4280 -1824 -6213 -8079 -4302 -4700 -3846 4530 1051 5246 5430 -463 -1522 -6044 -8520 -7059 -3353 7060
4264 7060 6812 11245 16239 9496 1777 -248 1878 -6121 -12639 -10916 -17433 -16594 -16440 -16423 -12335 -6981
4248 -6981 479 1674 -1236 -1532 -4580 -3540 2207 5973 8870 12327 7215 8715 7826 2120 -1790
$$ packed form
4355D432l322p957J70L623J449k546k738m726l121J0512o637k600Q924J0426m59
4340E430k615k735j31J977m522j191j111K178M354l732m426J3692J473k294n615
4325G32n469j932M287L386m394M445P162K978L216j386M675K607n176p018O97
4310H810P057K706N486L74k182j7720j1501n913m049Q048J3957p916k424Q460
4296C193M258K551N68m06j1948m748O164O598Q332k214k157l4o400J5J820p416
4280a824m389j866L777l98Q54Q376l479M195J84n893j059m522k476J461L706J0413
4264G060k48M433M994o743p719k025K126p999o518J723o517Q39J54J7M088N354
4248f981P460J195k910k96l048J040N747L766K897L457n112J500q89n706l910
$$ plain form
4233 -1790 8973 11070 10782 4316 -1156 1037 -4728 -17071 -4482 2367 -3721 -8601 -310 2950
4219 2950 1457 -5324 -2812 4188 -3922 -9326 3453 11827 17568 12896 3015 -2105 -2740 4245 1907
4204 1907 4759 2951 751 -10647 -12661 -7385 -8233 -6300 704 3006 2329 -7166 -6115 5210 7239
4189 7239 -1550 -11675 -8426 -7522 -3635 -6826 -16489 -21028 -18310 -23413 -24462 -21685 -19250 -18491 -21737
4174 -21737 -15588 -7446 -13975 -19893 -12768 -2320 -373 4097 465 6531 -1241 -4737 2076 2194 3028
4159 3028 2123 445 46 -987 1098 -848 -1049 5457 3192 1089 2566 1167 8523 10871 9455 4695
4143 4695 -2664 -4092 -8731 -1167 3998 -55 -6301 -9928 -10415 -9277 -8561 -2458 3111 8897 -1757
4128 -1757 -11028 -10795 -1934 1469 1461 -1858 -13523 -15917 -19127 -22399 -15023 -9228 -8530 -2172 -530 1964
$$ packed form
4233a790J0763K097k88o466n472K193n765j2343J2589O849o088m880Q291L260
4219B950j493o781K512P000q110n404J2779Q374N741m672r881n120o35O985k338
4204A907K852j808k200j1398k014N276q48J933P004K302o77r495J051J1325K029
4189G239q789j0125L249R04L887l191r663m539K718n103j049K777K435P59l246
4174b1737O149Q142o529n918P125J0448J947M470l632O066p772l496O813J18Q34
4159C028r05j678l99j033K085j946k01O506k265k103J477j399P356K348j416m760
4143D695p359j428m639P564N165m053o246l627m87J138P16O103N569N786j0654
4128a757r271K33Q861L403ql319j1665k394l210l272P376N795O98O358J642K494
$$ plain form
4112 1964 5829 4329 -2257 3001 2805 -3437 -5033 -4192 -5961 -7366 -13431 -12821 -9601 -8013 -6257 -7504
4096 -7504 -8510 -10267 -6055 -10096 -3237 2837 3451 -687 -6481 -9092 -4710 2735 10263 10335 5166 -8882
4080 -8882 -18665 -20324 -19980 -15507 -12308 -6315 4095 -5211 -7558 -5791 -6703 -5943 -5227 -2766 1140 -2867
4064 -2867 -8987 -6040 -208 -2042 -6779 2048 4228 -3910 -2935 -7760 -10224 -12149 -16276 -19023 -10449
4049 -10449 -10744 -8805 -8214 -8493 -13291 -12786 -6879 -5440 -4281 -5946 -6880 131 8872 -4219 -9216 -16900
4033 -16900 -13511 -6747 -7463 -15442 -12822 -18355 -18391 -11335 -2512 900 4295 7154 -395 528 -5725 -2364
4017 -2364 -2355 -1210 -2970 -668 -2590 3919 82 -706 -7978 -6417 -1770 -7589 -2702 -4669 -12162 -3389
4001 -3389 1023 -3325 -1600 -3643 -10443 -1045 4800 6598 8587 6535 1428 -975 -8291 -14593 -14141
$$ packed form
4112A964L865j500o586N258j96o242j596Q41j769j405o065O10L220J588J756j247
4096g504j006j757M212m041O859O074O14m138n794k611M382P445P528P2n169j4048
4080h882r783j659L44M473L199N993J0410r306k347J767r12P60P16K461L906m007
4064b867o120K947N832j834m737Q827K180q138R75m825k464j925m127k747Q574
4049a0449k95J939N91k79m798N05N907J439J159j665r34P011Q741j3091m997p684
4033a6900L389O764p16p979K620n533l6P056Q823L412L395K859p549R23o253L361
4017b364RJ145j760K302j922O509l837p88p272J561M647n819M887j967p493Q773
4001c389M412m348J725k043o800R398N845J798J989k052n107k403p316o302M52
$$ plain form
3986 -14141 -5574 -1501 4732 7498 2289 5071 8815 1240 -5953 -4051 3964 7966 -299 2457 819
3971 819 -7777 -6526 -4799 662 5129 3126 -5864 -8698 -1195 10840 3049 -4504 -3988 5483 2637
3956 2637 992 623 -1744 -8233 -6396 1506 -2611 -4446 -8464 -6407 -5820 -8228 -7358 -5517 -6302 -3547
3940 -3547 -1033 -2069 -10393 -8104 -8699 -11553 -10728 -9097 993 1591 -4055 -5991 -7013 -11353 -9519
3925 -9519 -2211 -4120 -7820 -3020 7647 4820 5703 2622 1239 2942 8319 7213 18834 23205 24673
3910 24673 17924 6666 -282 -531 7616 13739 13529 14401 14004 7575 698 -4376 -8286 -6860 -5390
3895 -5390 -2632 -1047 -5279 -10231 -3935 2009 7062 4850 8939 2755 3246 2837 3603 5156 2390 1615
3879 1615 532 -4616 2735 6714 568 -6333 -10378 -15999 -13227 -4144 -4173 6694 14625 10813 8643
$$ packed form
3986a4141Q567M073O233K766n209K782L744p575p193J902Q015M002q265K756j638
3971H19q596J251J727N461M467k003q990k834P503J2035p791p553N16R471k846
3956B637j645l69k367o489J837P902m117j835m018K057N87k408Q70J841p85K755
3940c547K514j036q324K289n95k854Q25J631J0090N98n646j936j022m340J834
3925i519P308j909l700M800J0667k827Q83l081j383J703N377j106J1621M371J468
3910B4673o749j1258o948k49Q147O123k10Q72l97o429o877n074l910J426J470
3895e390K758J585m232m952O296N944N053k212M089o184M91m09P66J553k766p75
3879A615j083n148P351L979o146o901m045n621K772R083k9J0867P931l812k170
$$ plain form
3864 8643 8093 6817 -961 -4332 2302 -6616 -958 9951 7571 -764 -2487 -8061 -6597 4356 10748
3849 10748 2955 1635 6890 4292 1270 8320 3733 -1704 1751 -2780 -12721 -23631 -26821 -16343
3835 -16343 -9259 -15337 -10146 -1957 10159 10986 1117 -7012 -7330 -11089 -14630 -18751 -20407 -12325 -5380
3820 -5380 -11775 -6205 -4912 -17296 -21154 -18778 -11838 4410 236 -7428 -12666 -25382 -28755 -24375
3806 -24375 -16163 -12072 -14295 -9492 -7070 -14959 -15847 -12142 -10087 -12593 -16970 -23343 -22600 -12513 3735
3791 3735 8085 5596 12085 -718 -8263 -4934 -4044 -13616 -8155 7978 3563 -9897 -16210 -15519 -15492
3776 -15492 -9195 3424 6103 6236 5126 -4446 -5743 -863 5411 11652 12394 17929 13670 2982 1196
3761 1196 -3793 -4278 -10382 -18877 -21375 -24376 -11871 -4650 -5444 -2416 2886 -4848 1105 9353 6872
$$ packed form
3864H643n50j276p778l371O634q918N658J0909k380q335j723n574J464J0953O392
3849A0748p793j320N255k598l022P050m587n437L455m531r941j0910l190J0478
3835a6343P084o078N191Q189J2116Q27r869q129l18l759l541m121j656Q082O945
3820e380o395N570J293j2384l858K376O940J6248m174p664n238j2716l373M380
3806b4375Q212M091k223M803K422p889q88L705K055k506m377o373P43J0087J6248
3791C735M350k489O489j2803p545L329Q90r572N461J6133m415j3460o313O91K7
3776a5492O297J2619K679J33j110r572j297M880O274O241P42N535m259j0688j786
3761A196m989m85o104q495k498l001J2505P221p94L028N302p734N953Q248k481
$$ plain form
3746 6872 8867 1412 -3724 -11395 -5105 -586 5546 7701 9200 5524 -4479 -2975 5570 1470 -5469
3731 -5469 -4071 -12960 -4160 3018 3742 49 -248 3722 3639 10015 2424 3370 -3493 -1790 -2216 4039
3715 4039 9832 7364 13901 10807 3938 -4244 -2592 2744 931 -2230 1712 3550 2502 4084 13001
3700 13001 13173 14135 13371 11773 3407 -1099 1266 -1041 -7955 -10449 -12439 -1860 6014 2723 -5848
3685 -5848 -14416 -15327 -12928 -11056 -7351 -1808 7982 13946 13641 9664 9735 11304 8556 7394 -4969 -5109
3669 -5109 899 -4399 -480 -3482 -5621 -6816 2269 20538 12213 5400 10126 -1335 -7808 -6748
3655 -6748 -951 -9330 -8066 -3640 2700 5400 -6392 -7278 -7098 -4430 -2701 -1445 -7710 -14976 -18015
3640 -18015 -18899 -10285 -1638 -5175 -4803 -5245 -1348 7862 8004 256 4160 8001 7713 7523 487 -4706
$$ packed form
3746F872J995p455n136p671O290M519O132K155J499l676j0003J504Q545m100o939
3731e469J398q889Q800P178P24l693k97L970q3O376p591R46o863J703m26O255
3715D039N793k468O537l094o869q182J652N336j813l161L942J838j048J582Q917
3700A3001J72R62p64j598q366m506K365k307o914k494j990J0579P874l291q571
3685e848q568r11K399J872L705N543R790N964l05l977P1J569k748j162j2363j40
3669e109O008n298L919l002k139j195R085J8269q325o813M726j1461o473J060
3655f748N797q379J264M426O340K700j1792q86J80K668J729J256o265p266l039
3640a8015q84Q614Q647l537L72m42L897R210J42p748L904L841k88j90p036n193
$$ plain form
3624 -4706 1880 5880 4128 -11892 -12166 -7076 -7845 5088 10924 16926 19604 9616 3279 -438 1035
3609 1035 2768 10139 15393 10106 7684 3498 -1737 -6472 -9869 4696 3566 -1947 -1952 -888 -4633
3594 -4633 -9499 -11958 -14728 -1831 1129 4594 4715 3572 4585 11707 22345 15696 15007 19507 15319
3579 15319 12799 7380 6751 2788 9105 13332 11585 5908 6294 4035 11160 7414 8038 165 -632 -3536
3563 -3536 -2149 -4901 -3643 3663 9067 3655 -3404 -5388 -5445 -5630 -3427 -5910 4893 5344 7154 14227
3547 14227 7668 -3156 -11922 -2023 -3518 -5428 -3979 -11791 -14019 -16712 -16214 -15706 -15404 -10744 -3586
3532 -3586 -4052 -2283 2470 5528 4349 1609 713 -10185 -14682 -12905 -4526 4415 8692 3524 -8865
3517 -8865 -2144 1746 9922 19215 25223 25313 10734 -1267 -7539 -10851 -6704 1006 1144 -545 -2136
$$ packed form
3624d706O586M000j752j6020k74N090p69J2933N836O002K678r988o337l717J473
3609A035J733P371N254n287k422m186n235m735l397J4565j130n513nJ064l745
3594d633m866k459k770J2897K960L465J21j143J013P122J0638o649o89M500m188
3579A5319k520n419o29l963O317M227j747n677L86k259P125l746O24p873p97k904
3563c536J387k752J258P306N404n412p059j984n7j85K203k483J0803M51J810P073
3547A4227o559j0824q766R899j495j910J449p812k228k693M98N08L02M660P158
3532c586m66J769M753L058j179k740q96j0898m497J777Q379Q941M277n168j2389
3517h865O721L890Q176R293O008R0j4579j2001o272l312M147P710J38j689j591
$$ plain form
3502 -2136 -4172 -232 6423 6056 4052 17669 16242 16212 10927 5255 -27 -3246 406 5128 7927
3487 7927 4637 -10746 -1024 7842 12364 11758 4878 2752 -3975 -7375 -9588 -12217 -12465 -8673 -9730
3472 -9730 -3006 -952 1773 5410 5549 -3937 -6051 3387 2497 847 4402 4107 -1620 -8265 -13008 -3371
3456 -3371 -6302 -5572 -1919 3926 4205 12675 19910 20558 13912 -2516 -8704 -2595 3860 7245 2014
3441 2014 -3225 -8299 -8126 -12794 -13538 -16957 -13715 -5102 -6258 -9173 -7093 -5117 1719 956 -6546 -13633
3425 -13633 -11062 -7925 -5742 -2705 -7876 -5685 -770 -2346 -4338 -4368 -13474 -11748 -2143 1598 -1543
3410 -1543 -6741 -1724 3192 3114 -986 3350 5516 2941 8850 4939 -10305 -18433 -12292 -14150 -8315
3395 -8315 -2913 2723 1663 -441 -3532 1500 6119 4960 -1792 -5263 3400 4545 4138 7545 19081
$$ packed form
3502b136k036L940O655l67k004J3617j427l0n285n672n282l219L652M722K799
3487G927l290j5383R722Q866M522o06o880k126o727l400k213k629k48L792j057
3472i730O724K054K725L637J39r486k114R438q90j650L555k95n727o645m743R637
3456c371k931P30L653N845K79Q470P235O48o646j6428o188O109O455L385n231
3441B014n239n074J73m668p44l419L242Q613j156k915K080J976O836p63p502p087
3425a3633K571L137K183L037n171K191M915j576j992l0r106J726R605L741l141
3410a543n198N017M916p8m100M336K166k575N909l911j5244q128O141j858N835
3395h315N402N636j060k104l091N032M619j159o752l471Q663J145m07L407J1536
$$ plain form
3380 19081 22946 13433 6868 3692 10818 13708 7415 2100 845 -2536 2270 7328 7502 8467 320
3365 320 -3929 -3227 -7081 -1516 -4326 -10151 -5250 -11856 -10008 2620 7412 11592 5972 1514 -12393
3350 -12393 -10471 -560 -3043 -891 2537 -2008 2387 7273 11790 20753 9562 7574 16932 13989
3336 13989 -877 -1535 1644 5934 -1279 -4920 -9026 -4205 245 -1662 -8593 -10467 -6290 1048 -2016
3321 -2016 694 6178 7776 745 -2824 -4738 -5904 -7057 -8762 -8213 -8952 -379 15200 6477 -4176
3306 -4176 889 -8947 -19232 -7957 2722 10750 5985 454 950 -321 578 -1803 -6079 -13707 -14083
3291 -14083 -8361 -11645 -14247 -9058 -2698 -2963 -3363 1577 6610 7067 -4667 -7192 -7944 -8057 -7678 -4776
3275 -4776 -3969 4219 11129 16220 24000 14318 3807 5096 8987 7179 -7431 -14322 -3124 3088
$$ packed form
3380A9081L865r513o565l176P126K890o293n315j255l381M806N058J74R65q147
3365C20m249P02l854N565k810n825M901o606J848J2628M792M180n620m458j3907
3350a2393J922R911k483K152L428m545M395M886M517Q963j1191j988R358k943
3336A3989j4866o58L179M290p213l641m106M821M450j907o931j874M177P338l064
3321b016K710N484J598p031l569j914j166j153j705N49p39Q573J5579q723j0653
3306d176N065r836j0285J1275J0679Q028m765n531M96j271Q99k381m276p628l76
3291a4083N722l284k602N189O360k65m00M940N033M57j1734k525p52j13L79K902
3275d776Q07Q188O910N091P780r682j0511J289L891j808j4610o891J1198O212
$$ plain form
3261 3088 11656 6750 11165 21345 17765 11373 -416 -1514 4125 7597 6779 9655 9864 -1225 -552
3246 -552 -1404 3218 9870 6917 16064 15765 8065 6258 3667 -153 1048 4872 6978 12787 4783 -1776
3230 -1776 -242 -3077 -790 -4067 -7191 -4139 -8736 -10099 -4391 5790 7197 3845 -4379 858 3833
3215 3833 9213 4986 3684 5186 11314 -4099 -9444 -9406 -6372 -6251 -2831 -5544 -9760 1177 7039
3200 7039 346 -9591 -14538 -9254 1039 100 107 3068 -637 -5625 -4432 -1735 2651 -4104 -14508
3185 -14508 -17689 -10404 -10180 -10414 -11767 -11176 -6460 -634 -1963 -12977 -22051 -18287 -9800 -13176 -11395
3170 -11395 -7480 1792 11116 10237 10542 17633 17400 18205 14894 2576 -5037 125 -1683 -14034 -15154
3155 -15154 -10105 -2333 -7011 -10337 -12526 -8820 -11374 -4767 4547 8592 12115 8067 6629 4168 4902
$$ packed form
3261C088Q568m906M415J0180l580o392j1789j098N639L472q18K876K09j1089O73
3246e52q52M622O652k953R147k99p700j807k591l820J201L824K106N809q004o559
3230a776J534k835K287l277l124L052m597j363N708J0181J407l352q224N237K975
3215C833N380m227j302J502O128j5413n345L8L034J21L420k713m216J0937N862
3200G039o693r937m947N284J0293r39PK961l705m988J193K697M386o755j0404
3185a4508l181P285K24k34j353N91M716N826j329j1014r074L764Q487l376J781
3170a1395L915R272R324q79L05P091k33Q05l311j2318p613N162j808j2351j120
3155a5154N049P772m678l326k189L706k554O607R314M045L523m048j438k461P34
$$ plain form
3140 4902 3895 13 6757 1936 -5396 -6549 -7600 -8314 -2632 4929 9243 9500 1942 5238 13963
3125 13963 10991 5383 8297 8286 5490 4681 -2903 -3042 -2853 -9245 -7861 -8735 -8310 -1180 3727 3179 483
3108 483 -385 4515 5194 1830 -682 -5798 -15967 -11558 -12161 -14001 -8681 -6259 -6335 -5149 4926 841
3092 841 -3873 -10550 -5491 5569 8224 4770 -3022 1162 2390 9553 26558 23442 12613 10671
3078 10671 9558 6018 3959 1371 -6047 -5339 -6356 -9254 -7818 -8765 -3003 4586 -190 -6077 -5733
3063 -5733 -1965 4618 11590 4626 1467 2292 6587 8406 2227 -853 -1868 -8914 -10109 -9481 -11730
3048 -11730 -13155 -12822 -10135 -6971 -2502 -3547 -13600 -8221 -14665 -20280 -13501 -16033 -20877 -12829 -7108
3033 -7108 -1982 -7444 -17960 -10552 -4010 -4818 -6446 -8575 -8490 -9052 -11035 -11072 -13230 -11840 -5700 -8923
$$ packed form
3140D902j007l882O744m821p332j153j051p14N682P561M314K57p558L296Q725
3125A3963k972n608K914j1k796q09p584j39J89o392J384q74M25P130M907n48k696
3108D83q68M900O79l364k512n116j0169M409o03j840N320K422p6J186J0075m085
3092H41m714o677N059J1060K655l454p792M184J228P163J7005l116j0829j942
3078A0671j113l540k059k588p418P08j017k898J436r47N762P589m776n887L44
3063e733L768O583O972o964l159Q25M295J819o179l080j015p046j195O28k249
3048a1730j425L33K687L164M469j045j0053N379o444n615O779k532m844Q048N721
3033g108N126n462j0516P408O542q08j628k129Q5n62j983l7k158J390O140l223
$$ plain form
3017 -8923 -8036 -2577 1132 1370 5081 1721 -10198 -20581 -21398 -26144 -23453 -8445 -7965 -17236 -18978
3002 -18978 -4662 12245 9755 3652 -6012 -5718 1524 -58 -5003 -4021 1188 2908 4407 7232 12776
2987 12776 7638 -7645 -3919 4 5216 6630 6558 430 -6262 -8110 -5351 -2886 -3479 -102 -3417
2972 -3417 -7301 -2770 9423 13238 11964 5373 -922 -12921 -20035 -13840 -10739 -11910 -9719 -9465 -8794
2957 -8794 -3880 -320 5089 8878 6603 931 -3977 -5179 -2146 2880 -667 -1385 6845 12574 8113
2942 8113 5756 10365 8002 5934 -1695 -546 5093 3395 5675 12527 12124 -1326 -5054 -4115 -5136
2927 -5136 -11805 -6749 -9475 -4647 -4636 -8023 -4502 8307 6910 1331 -1980 -10518 -16989 -13691 -1426
2912 -1426 4479 -3274 -1292 -748 -1941 1545 -4810 -8392 6200 6167 3128 5412 13140 16419 8712
$$ packed form
3017h923Q87N459L709K38L711l360j1919j0383q17m746K691J5008M80r271j742
3002a8978J4316J6907k490o103r664K94P242j582m945R82N209J720J499K825N544
2987A2776n138j5283L726L923N212J414p2o128o692j848K759K465n93L377l315
2972c417l884M531J2193L815j274o591o295j1999p114O195L101j171K191K54O71
2957h794M914L560N409L789k275n672m908j202L033N026l547p18Q230N729m461
2942H113k357M609k363k068p629J149N639j698K280O852m03j3450l728R39j021
2927e136o669N056k726M828J1l387L521J2809j397n579l311q538o471L298J2265
2912a426N905p753J982N44j193L486o355l582J4592l3l039K284P728L279p707
$$ plain form
2897 8712 6252 5545 -3467 -7699 -4355 -6141 -14218 -12589 -6420 -1071 -2910 -3285 -10899 -13483 -7106
2882 -7106 -10409 -16651 -5730 2419 2517 -7614 -12190 -14584 -11503 -8646 -11852 -9056 -10381 -7223 -2419
2867 -2419 559 -5761 -7555 -4837 2450 7207 8847 -339 -6491 -5829 1140 12703 1372 -3088 2874
2852 2874 9679 15222 9172 10233 6355 2952 4627 10054 6822 13309 10384 -1010 -8005 -7551 -2582
2837 -2582 2030 -7544 -23451 -14449 -10219 -12543 -18335 -19515 -4808 1170 52 -4040 -8095 -1568
2823 -1568 2554 -2626 -3600 -224 -14671 -24323 -23038 -21427 -11723 -11522 -20566 -3247 542 2686 4919
2808 4919 7654 1143 6089 9192 7751 9157 2094 5536 17085 21016 19662 15223 6506 -2043 5188
2793 5188 4005 2650 2019 10431 10228 2736 -5058 -4052 3698 10039 -2081 -3851 -2591 -6244 -9732
$$ packed form
2897H712k460p07r012m232L344j786q077J629O169N349j839l75p614k584O377
2882g106l303o242J0921Q149R8j0131m576k394L081K857l206K796j325L158M804
2867b419K978o320j794K718P287M757J640r186o152O62O969J1563j1331m460N962
2852B874O805N543o050J061l878l403J675N427l232O487k925j1394o995M54M969
2837b582M612r574j5907R002M230k324n792j180J4707N978j118m092m055O527
2823a568M122n180r74L376j4447r652J285J611R704K01r044J7319L789K144K233
2808D919K735o511M946L103j441J406p063L442J1549L931j354m439q717q549P231
2793E188j183j355o31Q412k03p492p794J006P750O341j2120j770J260l653l488
$$ plain form
2778 -9732 -16314 -10912 -4790 -10235 -3936 -1069 2283 5391 9065 12104 5413 7431 13397 14712 12653
2763 12653 5210 -521 -4074 -7330 1075 -6536 -16490 -13052 -7696 -2185 6808 2407 4841 11326 2035
2748 2035 -1071 -3358 259 2991 -9077 -9323 -5294 -5819 -2564 3462 5196 3934 2945 4854 -2470
2733 -2470 2161 -2053 -5442 -3012 -1040 -4350 -7297 2769 14818 15015 6280 5604 12590 18263 20526
2718 20526 12472 11751 17107 7632 -946 -8599 -6258 571 2723 -653 -5260 -957 -12869 246
2704 246 7291 2506 2986 6370 -5095 -12142 -8046 -4850 -8650 -7029 -9362 -6801 1072 5474 7676
2689 7676 10167 10177 5310 6561 11572 9824 5455 2503 5788 8383 1880 881 4855 1854 -2893 -4688
2673 -4688 -1304 -6250 -2942 -7327 -11684 -18049 -16936 -13963 -15855 -15587 -7543 557 7901 7934 9914 1256
$$ packed form
2778i732o582N402O122n445O299K867L352L108L674L039o691K018N966J315k059
2763A2653p443n731l553l256Q405p611r954L438N356N511Q993m401K434O485r291
2748B035l106k287L617K732j2068k46M029n25L255O026J734j262r89J909p324
2733b470M631m214l389K430J972l310k947J0066J2049J97q735o76O986N673K263
2718B0526q054p21N356r475q578p653K341O829K152l376m607M303j1912J3115
2704B46P045m785M80L384j1465p047M096L196l800J621k333K561P873M402K202
2689G676K491J0m867J251N011j748m369k952L285K595o503r99L974l001m747j795
2673d688L384m946L308m385m357o365J113K973j892K68Q044Q100P344L3J980q658
$$ plain form
2657 1256 -3639 -8649 -2498 -5461 -11604 -12561 -12465 -9921 -3889 -7573 -11988 -18093 -4460 4835 -1121
2642 -1121 -3250 2169 5928 1135 3727 8378 5989 -4413 -1430 8151 20563 19153 9544 8873 17326
2627 17326 18174 14270 6152 3192 2444 -9954 -11051 -5148 -2471 -5686 -15106 -16879 -7034 -7743 -3956
2612 -3956 -1468 -7613 -4968 1285 -4280 -22 1018 -13475 -16765 -9934 -5888 -3610 -2141 5044 11407
2597 11407 15977 21622 16400 7923 4222 -182 -3454 9294 8463 -2526 -1854 -1694 1378 -3101 -8788
2582 -8788 -5637 -5497 -2756 1925 3161 6219 551 41 9951 13793 21577 28981 22018 12074 4749
2567 4749 -10294 -12326 -12269 -13285 -9422 -5694 2874 6535 11261 14580 2156 -6825 -9272 -9919 -11717
2552 -11717 -15753 -13998 -4007 -3171 -8111 -4204 -1354 -11518 -9875 -15343 -14293 -7094 -12901 -9692 -3456
$$ packed form
2657A256m895n010O151k963o143r57R6K544O032l684m415o105J3633R295n956
2642a121k129N419L759m793K592M651k389j0402K983R581J2412j410r609o71Q453
2627A7326Q48l904q118k960p48j2398j097N903K677l215r420j773R845p09L787
2612c956K488o145K645O253n565M258J040j4493l290O831M046K278J469P185O363
2597A1407M570N645n222q477l701m404l272J2748q31j0989O72J60L072m479n687
2582h788L151J40K741M681J236L058n668n10R910L842P784P404o963r944p325
2567D749j5043k032N7j016L863L728Q568L661M726L319j2424q981k447o47j798
2552a1717m036J755R991Q36m940L907K850j0164J643n468J050P199n807L209O236
$$ plain form
2537 -3456 -7017 -11487 -10647 -11336 -8947 -6638 -3692 3477 -4760 -5679 -11290 -5606 -12158 -7693 -5770 -7197
2521 -7197 -8139 -6263 -5219 3773 7196 13098 9485 9521 12102 13224 5501 -124 -6726 1485 3591 5933
2505 5933 4388 -2786 -802 30 1776 -329 8809 8311 8540 7299 7647 5511 -4244 -7465 -4740 -9325
2489 -9325 -4465 9462 14965 14666 9310 6673 1405 -2197 -1540 6641 6594 5749 -4943 -6302 -3074 3361
2473 3361 7502 8893 14391 11917 16527 12492 17680 25460 23298 13075 5207 1584 12672 15579
2459 15579 11641 7313 -319 483 2657 6219 8375 -1094 -2978 -1995 -7487 -4038 2232 9067 14534
2444 14534 -599 -5082 -2974 -596 8229 14572 6405 -1717 -572 7056 4679 -1212 -2460 -1216
2430 -1216 -1080 2035 3262 371 -4505 -5096 -6628 -9650 -10268 -4329 4446 7399 8232 8849 7535 2549
$$ packed form
2537c456l561m470Q40o89K389K309K946P169q237r19n611N684o552M465J923j427
2521g197r42J876J044Q992L423N902l613L6K581J122p723n625o602Q211K106K342
2505E933j545p174J984Q32J746k105R138m98K29j241L48k136r755l221K725m585
2489i325M860J3927N503k99n356k637n268l602O57Q181m7q45j0692j359L228O435
2473C361M141J391N498k474M610m035N188P780k162j0223p868l623J1088K907
2459A5579l938m328p632Q02K174L562K156r469j884R83n492L449O270O835N467
2444A4534j5133m483K108K378Q825O343q167q122J145P628k377n891j248J244
2430a216J36L115J227k891m876n91j532l022o18N939Q775K953Q33O17j314m986
$$ plain form
2414 2549 -5176 -9941 -18018 -13735 -8125 -6767 -2830 -5302 4294 3312 12323 17949 13092 673 -9113
2399 -9113 -1782 7350 7868 13371 11089 8737 2125 6716 11302 5147 -6613 -9194 -14512 -17426 -9568
2384 -9568 -6057 -13726 -7262 -1746 -8224 -8581 -1722 -2849 -4404 -1406 -7677 -7419 -1197 556 1953
2369 1953 -5214 -12311 -17807 -12583 -2963 6980 12642 9842 -6769 -13629 -10973 -2914 -714 -6204 -14256
2354 -14256 -17715 -21019 -23211 -23110 -15017 -7313 -3061 -4057 -8629 -13171 -8129 -3373 945 4989 2614
2339 2614 3516 478 -3360 -7262 -8279 -8702 -856 6426 3572 1777 -9671 -8300 3255 15984 16677
2324 16677 12001 5505 -5621 -5125 -2637 -14 6372 7632 -674 -2780 -1585 -4525 -8268 -722 -2140
2309 -2140 -4358 -8640 -7886 -4756 8382 1992 -5059 -3398 -5361 -15718 -12347 -8175 -1779 -7019 -11813
$$ packed form
2414B549p725m765q077M283N610J358L937k472R596r82R011N626m857j2419r786
2399i113P331R132N18N503k282k352o612M591M586o155j1760k581n318k914P858
2384i568L511p669O464N516o478l57O859j127j555K998o271K58O222J753J397
2369A953p167p097n496N224R620R943N662k800j6611o860K656Q059K200n490q052
2354a4256l459l304k192J01Q093P704M252r96m572m542N042M756M318M044k375
2339B614R02l038l838l902j017m23P846P282k854j795j1448J371J1555J2729O93
2324A6677m676o496j1126M96K488K623O386J260q306k106J195k940l743P546j418
2309b140k218m282P54L130J3138o390p051J661j963j0357L371M172O396n240m794
$$ plain form
2294 -11813 -11255 1556 9171 -3105 -3855 -234 -149 3058 7805 11698 -1117 -13454 -16306 -18311 -12718
2279 -12718 -8918 -3631 -5360 1850 8388 4727 7599 11337 13187 8507 -590 -3231 11760 5081
2265 5081 -3475 404 -4320 -4111 -2014 -769 2256 9185 8337 4326 -2458 -2271 782 -4274 -4148 2481
2249 2481 -1696 7381 3498 4272 -7081 -7206 -487 2038 -2309 -6686 -3292 1578 -9297 -10619 -1509
2234 -1509 4047 3582 3345 -8782 -18457 -15858 -14092 645 5326 2311 4156 1264 278 2992 -641
2219 -641 3629 11531 19478 19225 15518 8095 1806 -10099 -10058 -7113 -4852 -848 2135 -1206 281 3725
2203 3725 -2330 -7495 -11665 -17821 -7928 1621 -1183 -3677 682 1010 371 2488 1818 -3588 -4114 612
2187 612 496 -1346 -8795 -18619 -16048 -2672 1648 -3936 -8403 -6422 2148 7811 12494 17112 9023
$$ packed form
2294a1813N58J2811P615j2276p50L621Q5L207M747L893j2815j2337k852k005N593
2279a2718L800N287j729P210O538l661K872L738J850m680r097k641J4991o679
2265E081q556L879m724K09K097J245L025O929q48m011o784J87L053n056J26O629
2249B481m177R077l883P74j1353j25O719K525m347m377L394M870j0875j322R110
2234a509N556m65k37j2127r675K599J766J4737M681l015J845k892r86K714l633
2219f41M270P902P947k53l707p423o289j1905M1K945K261M004K983l341J487L444
2203C725o055n165m170o156R893R549k804k494M359L28o39K117o70n406n26M726
2187F12j16j842p449r824K571J3376M320n584m467J981Q570N663M683M618q089
$$ plain form
2172 9023 -2171 -983 -430 -11822 -11159 -14767 -13597 -8285 -2961 -6195 -5765 -1600 -3914 -6872 -4914
2157 -4914 -3202 6697 5352 12125 11862 11717 9342 2634 -11083 -8675 -224 3039 4213 1556 4897
2142 4897 3741 -4114 -7716 -7723 -7564 -8052 -2654 -8265 -12262 -11351 -3777 -4791 -4303 -5236 -5760 1914 4904
2125 4904 8050 -496 -6359 4169 5671 5201 -554 -6496 -4369 3317 5183 8529 18026 19509 13426
$$ packed form
2172I023j1194J188N53j1392O63l608J170N312N324l234M30M165k314k958J958
2157d914J712R899j345O773k63j45k375o708j3717K408Q451L263J174k657L341
2142D897j156p855l602pJ59m88N398n611l997R11P574j014M88r33n24P674K990
2125D904L146q546n863J0528J502m70n755n942K127P686J866L346R497J483o083
$$ [...]
##END NTUPLES=NMR SPECTRUM
##END=
