##TITLE=Analysis number 323581
Compound Code cc 49609
Book Reference 449/162
Project Code adrs
Chemist Name davee
##JCAMPDX= 6.0         $$ Bruker NMR JCAMP-DX V2.0
##DATA TYPE= NMR SPECTRUM
##DATA CLASS= NTUPLES
##ORIGIN= Bruker BioSpin GmbH
##OWNER= nmr
$$ XWIN-NMR		Version 3.5
$$ Fri Oct 27 16:39:54 2006 GMT Daylight Time (UT+1h)  MAYBRIDGE\nmr@NMR_250MHZ
##.OBSERVE FREQUENCY= 250.131544655141
##.OBSERVE NUCLEUS= ^1H
##.ACQUISITION MODE= SIMULTANEOUS (DQD)
##.ACQUISITION SCHEME= undefined
##.AVERAGES= 16
##.DIGITISER RES= 18
##SPECTROMETER/DATA SYSTEM= dpx250
##.PULSE SEQUENCE= zg30
##.SOLVENT NAME= CDCl3
##.SHIFT REFERENCE= (INTERNAL, CDCl3, 0, 16.522)
##AUDIT TRAIL= $$ (NUMBER, WHEN, WHO, WHERE, WHAT)
$$ ##TITLE= Audit trail, XWIN-NMR		Version 3.5
$$ ##JCAMPDX= 5.01
$$ ##ORIGIN= Bruker BioSpin GmbH
$$ ##OWNER= nmr
$$ C:\u/data/dgb/nmr/ADRS/1880/pdata/1/auditp.txt
$$ ##AUDIT TRAIL=  $$ (NUMBER, WHEN, WHO, WHERE, WHAT)
(   1,<2006-10-27 16:39:18.78 +100>,<MAYBRIDGE\nmr>,<NMR_250MHZ>,
      <created by zg, POWCHK disabled, PULCHK disabled
       configuration hash MD5:
       49 4B E0 1D 92 C2 6B 37 9F E6 65 BC 52 41 86 1D
       data hash MD5: 64K
       DE 46 68 10 1C 86 8A AD C1 CE E3 5B 29 8C 07 B2>)
(   2,<2006-10-27 16:39:34.79 +100>,<MAYBRIDGE\nmr>,<NMR_250MHZ>,
      <Start of raw data processing
       ef LB = 0.3 FT_mod = 6 PKNL = 1 SI = 32K 
       data hash MD5: 32K
       A1 FF 32 C6 E5 23 EC D0 CC 19 A5 F6 64 AD DD AD>)
(   3,<2006-10-27 16:39:39.00 +100>,<MAYBRIDGE\nmr>,<NMR_250MHZ>,
      <apk 
       data hash MD5: 32K
       FC 9F A9 23 4A 6B 94 44 46 6C 77 0F B4 FD C2 8C>)
(   4,<2006-10-27 16:39:40.40 +100>,<MAYBRIDGE\nmr>,<NMR_250MHZ>,
      <abs ABSG = 5 
       data hash MD5: 32K
       91 21 9F 72 80 2D 0A C3 00 B6 90 88 59 DC EF 5B>)
$$ ##END=
$$ 
$$ hash MD5
$$ D1 9F 76 BC 68 AB AD 8C 61 A0 01 3B C5 D5 27 8E
##$RELAX= 
##$RELAX= 
##$RELAX= 
##$RELAX= 
##$RELAX= 
##$RELAX= 
##$RELAX= 
$$ Bruker specific parameters
$$ --------------------------
##$DU= <C:\u>
##$EXPNO= 1880
##$NAME= <ADRS>
##$PROCNO= 1
##$TYPE= <nmr>
##$USER= <dgb>
##$AMP= (0..31)
100 100 100 100 100 100 100 100 100 100 100 100 100 100 100 100 100 100 
100 100 100 100 100 100 100 100 100 100 100 100 100 100 
##$AQSEQ= 0
##$AQ_mod= 3
##$AUNM= <au_zg>
##$AUTOPOS= <48 >
##$BF1= 250.13
##$BF2= 250.13
##$BF3= 250.13
##$BF4= 250.13
##$BF5= 500.13
##$BF6= 500.13
##$BF7= 500.13
##$BF8= 500.13
##$BYTORDA= 1
##$CFDGTYP= 0
##$CFRGTYP= 5
##$CHEMSTR= <none>
##$CNST= (0..31)
1 1 145 1 1 1 1 1 1 1 1 1 1 1 1 1 1 1 1 1 1 1 1 1 1 1 1 1 1 1 1 1 
##$CPDPRG= <>
##$CPDPRG1= <>
##$CPDPRG2= <>
##$CPDPRG3= <>
##$CPDPRG4= <mlev>
##$CPDPRG5= <mlev>
##$CPDPRG6= <mlev>
##$CPDPRG7= <mlev>
##$CPDPRG8= <mlev>
##$CPDPRGB= <>
##$CPDPRGT= <>
##$D= (0..31)
0 1 0 0 0 0 0 0 0 0.06 0 0 0 0 0 0 0.0002 0 0 0 0 0 0 0 0 0 0 0 0 0 0 
0 
##$DATE= 1161963556
##$DBL= (0..7)
120 120 120 120 120 120 120 120 
##$DBP= (0..7)
150 150 150 150 150 150 150 150 
##$DBP07= 0
##$DBPNAM0= <>
##$DBPNAM1= <>
$$ [...]
##$SUBNAM7= <"">
##$SUBNAM8= <"">
##$SUBNAM9= <"">
##$SW= 20.6930455092707
##$SWIBOX= (0..15)
0 0 3 0 0 0 0 0 0 0 0 0 0 0 0 0 
##$SW_h= 5175.983436853
##$TD= 65536
##$TD0= 1
##$TE= 683.16
##$TE2= 300
##$TE3= 300
##$TEG= 300
##$TL= (0..7)
0 120 120 120 120 120 120 120 
##$TP= (0..7)
150 150 150 150 150 150 150 150 
##$TP07= 0
##$TPNAME0= <>
##$TPNAME1= <>
##$TPNAME2= <>
##$TPNAME3= <>
##$TPNAME4= <>
##$TPNAME5= <>
##$TPNAME6= <>
##$TPNAME7= <>
##$TPOAL= (0..7)
0.5 0.5 0.5 0.5 0.5 0.5 0.5 0.5 
##$TPOFFS= (0..7)
0 0 0 0 0 0 0 0 
##$TUNHIN= 0
##$TUNHOUT= 0
##$TUNXOUT= 0
##$USERA1= <user>
##$USERA2= <user>
##$USERA3= <user>
##$USERA4= <user>
##$USERA5= <user>
##$V9= 5
##$VALIST= <valist>
##$VCLIST= <CCCCCCCCCCCCCCC>
##$VD= 0
##$VDLIST= <DDDDDDDDDDDDDDD>
##$VPLIST= <PPPPPPPPPPPPPPP>
##$VTLIST= <TTTTTTTTTTTTTTT>
##$WBST= 1024
##$WBSW= 4
##$XGAIN= (0..3)
0 0 0 0 
##$XL= 0
##$YL= 0
##$YMAX_a= 405978
##$YMIN_a= -339317
##$ZGOPTNS= <>
##$ZL1= 120
##$ZL2= 120
##$ZL3= 120
##$ZL4= 120
##$ABSF1= 16.522
##$ABSF2= -4.171173
##$ABSG= 5
##$ABSL= 3
##$ALPHA= 0
##$AQORDER= 0
##$ASSFAC= 0
##$ASSFACI= 0
##$ASSFACX= 0
##$ASSWID= 0
##$AUNMP= <proc_1d>
##$AZFE= 0.1
##$AZFW= 0.1
##$BCFW= 0
##$BC_mod= 0
##$BYTORDP= 0
##$COROFFS= 0
##$CY= 12.5
##$DATMOD= 1
##$DC= 0
##$DFILT= <>
##$DTYPP= 0
##$F1P= 14.0000005364418
##$F2P= -0.99999901652339
##$FCOR= 0.5
##$FTSIZE= 32768
##$FT_mod= 6
##$GAMMA= 0
##$GB= 0
##$INTBC= 1
##$INTSCL= 1
##$ISEN= 128
##$LB= 0.3
##$LEV0= 0
##$LPBIN= 0
##$MAXI= 10000
##$MC2= 0
##$MEAN= 0
##$ME_mod= 0
##$MI= 0
##$NCOEF= 0
##$NC_proc= -4
##$NLEV= 6
##$NOISF1= 0
##$NOISF2= 0
##$NSP= 0
##$NTH_PI= 0
##$NZP= 0
##$OFFSET= 16.522
##$PC= 1
##$PHC0= -39.2651
##$PHC1= 0.2450509
##$PH_mod= 1
##$PKNL= yes
##$PPARMOD= 0
##$PSCAL= 4
##$PSIGN= 0
##$REVERSE= no
##$SF= 250.13
##$SI= 32768
##$SIGF1= 0
##$SIGF2= 0
##$SINO= 400
##$SIOLD= 32768
##$SREGLST= <1H.CDCl3>
##$SSB= 0
##$STSI= 32768
##$STSR= 0
##$SW_p= 5175.98343685301
##$SYMM= 0
##$S_DEV= 0
##$TDeff= 65536
##$TDoff= 0
##$TI= <Analysis number 999999
Compound Code 99
Book Reference 9
Project Code 9>
##$TILT= no
##$TM1= 0
##$TM2= 0
##$TOPLEV= 0
##$USERP1= <user>
##$USERP2= <user>
##$USERP3= <user>
##$USERP4= <user>
##$USERP5= <user>
##$WDW= 1
##$XDIM= 32768
##$YMAX_p= 574478783
##$YMIN_p= -752449
$$ End of Bruker specific parameters
$$ ---------------------------------
##NTUPLES= NMR SPECTRUM
##VAR_NAME=  FREQUENCY,     SPECTRUM/REAL,   SPECTRUM/IMAG
##SYMBOL=    X,             R,               I
##VAR_TYPE=  INDEPENDENT,   DEPENDENT,       DEPENDENT
##VAR_FORM=  AFFN,          ASDF,            ASDF
##VAR_DIM=   32768,         32768,           32768
##UNITS=     HZ,            ARBITRARY UNITS, ARBITRARY UNITS
##FACTOR=    0.157963299565203, 1,           1
##FIRST=     4132.6476996994, 0,             0
##LAST=      -1043.33573715361, 0,           0
##MIN=       -1043.33573715361, -752449,     0
##MAX=       4132.6476996994, 574478783,     0
$$ Real data points
##PAGE= N=1
##DATA TABLE= (X++(R..R)), XYDATA
$$ [...]
15710h1693N5773J06457J66800J2742L2133j47467q7621m3696r1912M2556J79156
15699A43228Q3705l3957k57548J7741O0254j3291l2583o7063P0632J04109j20837
15688d5610j5006J7681J11612P3918k63009j63178o1564n5141k0291R1672O1784
15677b67132l074n0093n150J15426K94086J59263j30316N4600J6286r060k09642
15666c4806R9967J43580o4821J69478J42616M4104r48j35806j12323j41212Q1505
15655A91334J93153o0835p5182o3428j75569j08255N5992K3035O1251L2576L1628
15644A05700O1352k33634k20366J23377J45001K08402q7432q8993k1341j08733
15634a16667j50843K30780n8882q2127K18926K1039k20566P8853R5019P1602o2213
$$ y = [-81693, -25920, 80537, 247337, 260079, 292212, 144745, 57124, 13428, -78484, -35928, 143228, 226933, 192976, -64572, -46831, 13423, 132, -32451, -99514, -28882, 75227, -45610, -60616, -42935, 68677, 142595, -120414, -283592, -345156, -400297, -420588, -328916, -267132, -270206, -320299, -325449, -210023, 84063, 243326, 113010, 167610, 183896, 174836, -34806, 65161, 208741, 143920, 313398, 456014, 500118, 499170, 363364, 251041, 109829, 191334, 384487, 323652, 248470, 185042, 9473, -98782, -42790, -19755, 41496, 74072, 105700, 167052, -66582, -286948, -163571, -18570, 189832, 102400, 13407, -7934, -116667, -267510, -36730, -95612, -177739, 41187, 62226, -158340, -79487, 15532, 87134, 24921]
15623B4921J77671k4722j46812j4821j09532q7688R6311K02963n0601J15487K7484
15612B10661n4686J2491n8263O4266P4050j86039n3882J40203j77584j36345L1839
15601a33289K16952L03393o018k64651j22132L3802l1836m177J42892j46196l44668
15590c55928O5221P5409L00157N9964k73189o6955K49783k492J04955Q4592K41424
15579D82941r4103l16157k95708j8837J08837O1597n5470R9207J46295j26004
15569g402k10027K75550J21922j7691q6914m5231j5094n6372n4841q7727J2012
15558a71815Q9494K36767j00963j19803Q4472j00282k25339q1669L3730M1050
15548c14358K66514M0301J52932K61353j94706k36099m6202J78735J31313j13422
$$ y = [24921, 202592, 177870, 31058, 16237, -93295, -180983, -84672, 118291, 67690, 183177, 210661, 155975, 168466, 110203, 174469, 248519, 62480, 8598, 148801, -28783, -165128, -133289, 83663, 387056, 381038, 116387, -5745, 28057, -3779, -7956, 134936, -11260, -355928, -290707, -215298, 84859, 144823, -128366, -195321, 54462, 51970, 156925, 241517, 482941, 388838, 72681, -223027, -241864, -133027, -71430, -126900, -27693, 118602, -7402, -217429, 58121, 180043, 162352, 75438, 30207, 15113, -41259, -96100, -183827, -171815, -82321, 154446, 53483, -66320, 18152, -82130, -307469, -389138, -355408, -314358, -47844, -7543, 145389, 406742, 212036, -24063, -70265, 108470, 239783, 126361]
15538A26361p2693o1553j80663m386L1384j68996J6106J9929P7037m7349k90426
15527e55249L9794R4247J00404J20032J38986J16480J60464M3304J1642j80404
15517H9700j87513n1444R7437J77879j01850j59626R091J42975j18114m7038l7961
15506a86464J45385K62229P1372J20007j30074j05493j68825r8170M1810Q6227
15496C8004J83986p4559l5017J31449j30557k8702j57322k0321R9723Q3070O9121
15485A58875J39282J06859o0893J58440l08872j67881J59688r3217p9289m6638
15475c3646R7832P861J34911Q1402j38701j85471j16900k1486n0127J11072K44831
15464A31578R1947q9463j41404J22750P6477Q0131j76221j16555P9586k4141n1517
$$ y = [126361, 53668, -7885, -188548, -192934, -161550, -330546, -314440, -294511, -217474, -264823, -555249, -515455, -421208, -320804, -200772, -61786, 54694, 215158, 258462, 270104, 89700, -97813, -149257, -51820, 126059, 24209, -135417, -126326, 16649, -101465, -148503, -186464, -41079, 221150, 292522, 412529, 282455, 176962, 8137, -90033, -48223, 38004, 221990, 147431, 112414, 243863, 113306, 84604, -72718, -93039, 6684, 89754, 158875, 298157, 405016, 344123, 502563, 193691, 25810, 185498, 92281, 12992, -33646, 64186, 72047, 206958, 288360, 149659, -35812, -152712, -174198, -224325, -113253, 131578, 223525, 134062, -7342, 115408, 191885, 272016, 95795, -20760, 58826, 34685, -16832]
15453a6832j521j021J4977n8447J813l10102k8068L26286j00924j9954m017o5833
15441b63643J73739K34293j16897j20324j88349K08472R4947j62396j63804J64986
15431a38976J86731j27649k28128j77737j59313K85900J73957o6961K8167j23282
15421c47291M1349J82389J34346Q7725m1482p4645j71631J77120J78260N9262
15411B25402J62855q5399k43607j18155n3022j18227M8453J19368J31371J88940
15401B57979K9987j01241m0261m2832j17348j08820Q1932M8957J32107Q9165L8576
15390B68201k88598p746L0222K39104J45683l10286k68851J26375k2983j7244
15380a06123r2948n4514k09892l7885m8644J57379J84870K52465n6923J98349
$$ y = [-16832, -18353, -19374, -4397, -62844, -61031, -371133, -399201, -72915, -173839, -193793, -197810, -263643, -89904, 144389, 27492, -92832, -281181, -72709, 22238, -140158, -303962, -138976, 47755, -79894, -308022, -485759, -645072, -359172, -185215, -252176, -224009, -347291, -305942, -123553, 10793, 98518, 57036, -17609, -189240, -12120, 166140, 225402, 388257, 302858, 59251, -58904, -111926, -230153, -181700, -62332, 69039, 257979, 287966, 186725, 146464, 103632, -13716, -122536, -40604, 8353, 140460, 229625, 268201, -20397, -28143, 2079, 241183, 386866, 76580, -192271, -65896, -88879, -106123, -199071, -253585, -463477, -501362, -550006, -392627, -207757, 44708, -12215, 186134]
15370A86134J23251j3121K06615M4895j26565p8897J03767q2994o9813R6178J5104
15359D04554k06540j21448O0290q9167j09240j1595P3277K046N849M3518j2621
15348C8923j3655N9212j7899q2846N5742L344j2293J00805M8296o7592q7148J9189
15336D4078j35805j51415j21941j3026J7746J25757K3441J62092l8554N1236R7401
15325F1010m7015j95828q1773M2795m2850o0212N4098O147k5936J60845R8787
15314b9932n2883J19692J09436n7696j67986J58030J05005O649j01876l3862p2210
15303a7633j76841r4146J89559J12622K14842J30582j34015j83210o6053K0591
15293c702o5487k6359r3888L4817J64326j6288j14320q6370j89458J3052J47742
$$ y = [186134, 309385, 296264, 502879, 547774, 421209, 342312, 446079, 363085, 293272, 389450, 404554, 198014, 76566, 136856, 47689, -61551, -73146, 131, 2177, 8026, 51544, 38923, 25268, 84480, 66581, -16265, 39477, 42821, 30528, 131333, 179629, 112037, 24889, 44078, -91727, -243142, -365083, -378109, -360363, -234606, -211165, -49073, -87627, -36391, 61010, 13995, -181833, -263606, -220811, -263661, -323873, -269775, -263628, -289564, -128719, -29932, -82815, 36877, 146313, 88617, -79369, 78661, 183666, 190315, 88439, 54577, -17633, -194474, -288620, -99061, 13561, 228403, 358985, 224970, 41760, -24293, -3702, -69189, -95548, -189436, -154619, 9707, -6581, -120901, -207271, -396729, -383677, -235935]
15282b35935J55100J15370j38259p4624J52675r7649P8709K08348J37881j67001
15272A34615r9214J61692k14955k5601J71840R2960l4655Q6416R5956r0650m1723
15261B36681r511R0196j8646K5553J69822J00034k77087j48262k29204l0125J36142
15250D5593o6935p7200l4814P0201Q6830J06321L549j25288m36871J31644K29543
15239f7427o049l8311k12504N7677P6986J9738K2197L6507O0331J18804K91705
15228C59654j82914j40607M91r5119O2026o1347p3914n4129J0818k3223r190O8933
15216a38521K79997q6129o5306j19775k92O6818m3126j58741J27797M0463J15373
15205A8558l9514q9032k3890K71294J37321j4843j06826k40654r2117J978o840
$$ y = [-235935, -80835, 34535, -103724, -178348, -25673, -123322, -44613, 163735, 301616, 134615, 35401, 197093, -17862, -43463, 128377, 221337, 186682, 273098, 369054, 278404, 236681, 227170, 317366, 298720, 324273, 494095, 594129, 317042, 168780, -60424, -90549, 45593, -21342, -98542, -133356, -63155, 23675, 129996, 133545, 8257, -428614, -296970, -67427, -73476, -111787, -324291, -266614, -189628, -169890, -147693, -111186, -50855, 67949, 359654, 176740, 36133, 36624, -58495, 3531, -57816, -131730, -185859, -175041, -198264, -207454, -138521, 141476, 55347, -9959, -129734, -130026, -63208, -106334, -265075, -137278, -96815, 18558, -20956, -109988, -133878, 137416, 274737, 259894, 153068, -87586, -179703, -177725, -184565]
15194a84565L8232J66347l4634k2987N8017N6872J808O354o5525n6977k8177p154
15182g2389j86894j18055m6669K72165K49422J98450j35659k23576J12548l0946
15172A8397n0756j39994j0906K10571O7520r8066p5183k16917k61427k2464R3650
15161d85575J99580J48l3509J08273j6470J57157J91697L6268Q0972K5334k94403
15150c0528j11161Q9143J30961N4103k58084k08203K90568J44977k86439j03452
15140b88115K21349K00114M8272j04579J74385M9255l02688j04178K10628J49323
15130B53766o1462j70389J48611r4961j09460P1942N4362n1446q1902j23760j91474
15119c56173P1594K1363Q5883J65997j78632P9396J23416j3669P5718j08586J34982
$$ y = [-184565, -146333, 20014, -14620, -37607, 20410, 77282, 79090, 85444, 19919, -37058, -65235, -72389, -259283, -377338, -424007, -151842, 97580, 296030, 160371, -63205, 49343, 18397, -32359, -172353, -183259, 27312, 94832, -3234, -78417, -295334, -556761, -579225, -485575, -285995, -285847, -319356, -211083, -227553, -70396, 121301, 157569, 238541, 263875, -30528, -141689, -52546, 78415, 132518, -125566, -333769, -43201, 101776, -184663, -288115, -66766, 133348, 181620, 77041, 251426, 300681, -2007, -106185, 104443, 253766, 192304, 21915, 170526, 75565, -33895, 38047, 92409, 40963, -40939, -164699, -356173, -284579, -263216, -177333, -11336, -189968, -110572, 12844, -825, 74893, -33693, 101289]
15108A01289P1576k7006r3189o2895N0577K00322k1033j97982j40731O9693j92626
15097b42005J21503J16420J8522n6534j3293L8536m7594L2578J17485l0306j37861
15086h2549J41296Q6118L7018k64627j23153l1536j17332p521J99976R4258j11510
15075a79562L114L6192j9235p6703j48650q1814L36306N9923J37387L37981K00875
15064F05814j41708j13766o9570K6333O2529L2363j88582q6503L9802K60960j02264
15053C25408Q4216k685m3082N6155p9117J02387k05068k28393L9151J60446J2563
15042B21981k41872p0372K8973Q3486J28349j01073j02937K69850J29938r3301
15032B53022J34790r610l06774k26187L5319J09226K24141K7857j60665J46823
$$ y = [101289, 172865, 145859, 52670, -10225, 40352, 240674, 219641, 21659, -119072, -49379, -242005, -120502, -4082, 14440, -42094, -55387, -16851, -64445, -31867, 85618, 55312, -82549, 58747, 144865, 181883, -82744, -205897, -237433, -354765, -362286, -162310, -68052, -179562, -176448, -140256, -159491, -236194, -384844, -466658, -130352, -70429, 66958, 404939, 605814, 464106, 350340, 280770, 307103, 369632, 401995, 213413, 126910, 166712, 427672, 325408, 409624, 406939, 363857, 420012, 340895, 443282, 238214, 9821, 48972, 209418, 221981, -19891, -90263, -61290, 22196, 150545, 49472, -53465, 216385, 346323, 253022, 387812, 378202, 71428, -154759, -119440, -10214, 213927, 241784, 81119, 227942]
15022B27942J62937P402l403j82625K1357j75815j37529J39217J03207J89648
15012C52338J77332j4195l3946j98760m03653k10705P8043K27498J64923M5943
15002A84818k74113j40309K70761L5457k9477J02536l3597j0633K55172M0599
14992D01214k59041k54704M395K46957K26134j76138K9141R6147K1202k39371
14982I5936m7843K41364q5316p2575m6586J5317m0225m4024m1545n8714m0815
14971a25026j25707Q9643K70102J08811k5167o0246K89526J48955J38188L594
14961G12673k57439k03257P5990J21357k390j27849q1964r1978J02541k4855N6319
14950B79148j9225L66J1666l9614J41031P402J32660K8207M5600J42250K8960
$$ y = [227942, 390879, 398281, 394878, 212253, 233610, 57795, -79734, 59483, 162690, 352338, 529670, 515475, 481529, 282769, -120884, -331589, -253546, -26048, 138875, 184818, -89295, -229604, 41157, 76614, 47137, 149673, 116076, 105443, 360615, 401214, 142173, -112531, -108136, 138821, 364955, 188817, 217958, 314105, 335307, 95936, 48093, 289457, 204141, 131566, 84980, 100297, 60072, 16048, -25497, -84211, -125026, -250733, -161090, 109012, 217823, 192656, 132410, 421936, 570891, 709079, 712673, 455234, 251977, 327967, 449324, 446934, 319085, 237121, 145143, 247684, 222829, 279148, 259923, 260289, 271955, 232341, 373372, 380774, 513434, 541641, 587241, 729491, 758451]
14939G58451Q8448K6924n407l0197J69597M206r2229J69493n0503Q0278J73972
14928A293033k382O6981J09489K05170m0144L2186K22504L79082J56369K0188
14918B442476L57946P15644Q79315J047170J143686J611439K277454K954628L685260
14909A7115018M188793M151443L625858K181061O44420q91088k532389l814318
14901B4668798l897154l439822k768887k110516j469117j272969q98426r26217
14893G885690q18773p94185m29303k73001j80869m94285m15059j78841O5773p466
14883D359681j44336j00130l1760M3709N202K20679l390j3239J73732M26054L33653
14872E269855L45268N94838Q36337Q41898J319967J575750K214819L224847M031758
$$ y = [758451, 846899, 873823, 868416, 838219, 1007816, 1012022, 919793, 1089286, 1038783, 1119061, 1293033, 1290651, 1357632, 1467121, 1672291, 1632147, 1664333, 1886837, 2265919, 2422288, 2442476, 2800422, 3516066, 4395381, 5442551, 6586237, 8197676, 10475130, 13429758, 17115018, 21303811, 25455254, 29081112, 31262173, 31906593, 31015505, 28483116, 24668798, 20771644, 17331822, 14562935, 12452419, 10983302, 9710333, 8811907, 7885690, 7066917, 6272732, 5843429, 5570428, 5389559, 4895274, 4480215, 4301374, 4367147, 4359681, 4215345, 4115215, 4083455, 4127164, 4132366, 4353045, 4349655, 4336416, 4510148, 4936202, 5269855, 5615123, 6209961, 7046298, 7888196, 9208163, 10783913, 12998732, 16223579, 20255337]
14863B0255337N089225O667636P232156P732368P928614P033491N108991K422092
14855F9469910p05421l612730n470661o940264p818551p852997o698111n106948
14847B5264227l743131k971481k054761j572654j653088j395445q14590r99260
14839A0059817j102118o93357m21561m60900k50200l67964l21951k12873l88268
14830E840625m10655l13314l36274n3052R4761J93271J75330m7209K36190K62451
14820E642124K19485M07954Q89311J235266J567403J953942K464797L303581M484453
14811B2168316N370441N479974M983980L612468J861358m00743k717012m688459
14803C5670323n426974n010391m176420l350414k334373k016993j778313j461406
$$ y = [20255337, 25344562, 32012198, 39244354, 46976722, 54905336, 61938827, 67047818, 69469910, 68764489, 65151759, 59681098, 52740834, 44922283, 37069286, 30371175, 25264227, 21521096, 18549615, 16494854, 14922200, 13269112, 11873667, 11059077, 10059817, 8957699, 8264342, 7842781, 7381881, 7131681, 6763717, 6441766, 6228893, 5840625, 5429970, 5116656, 4780382, 4727330, 4822091, 5015362, 5190692, 5143483, 5379673, 5642124, 5861609, 6269563, 7158874, 8394140, 9961543, 11915485, 14380282, 17683863, 22168316, 27538757, 33018731, 38002711, 41615179, 43476537, 43075794, 40358782, 35670323, 30243349, 25232958, 21056538, 17706124, 15371751, 13354758, 11576445, 10115039]
14795A0115039j130951j040734q36055o05110n14818m40070n31122k88498l01569
14786D426112l35600k81958m16235l27424r4012j70767m26572j17166K4604P7235
14776B358217l3755k19598k32623k16917j05387j74331j61867j00291K6728J86094
14766A326270J08937m8394l11691l55223n6153L35721J48670l07965O471R7508
14756I44151K7544P9208o5200j09779j01370j92554q1917j00190q0122J65524
14746D85295j4268j06011j8870L5066m8530l07195l3346J34128J82488J28864
14736D37621p7699J58294K58527o0858k5040n5006j77770j05951k31387P991J1785
14725A40507J2872J65214j19969k6357M1179L6833N2171R5280j573j5218j67903
$$ y = [10115039, 8984088, 7943354, 7107299, 6502189, 5987371, 5547301, 5016179, 4727681, 4426112, 4090512, 3808554, 3392319, 3064895, 2970883, 2800116, 2373544, 2256378, 2280982, 2358217, 2324462, 2104864, 1872241, 1655324, 1549937, 1375606, 1213739, 1113448, 1140176, 1326270, 1435207, 1386813, 1075122, 719899, 663746, 999467, 1148137, 840172, 846643, 944151, 971695, 1050903, 985703, 875924, 774554, 582000, 500083, 399893, 319771, 485295, 471027, 365016, 346146, 381212, 332682, 25487, -7859, 126269, 308757, 437621, 359922, 518216, 776743, 715885, 690845, 635839, 458069, 352118, 120731, 128722, 140507, 153379, 318593, 198624, 172267, 213446, 250279, 302450, 397730, 396157, 380939, 213036]
14714B13036O892p1805j29088n9900N6373Q8389J49004p4596n2188n7101K35940
14703C04956R9555N5467J00368n2123m239q2198M4404n964j73108o4214k12417
14692A0487j16071K24019K16187l851j37702J1165J509Q7252k751k6507l361J58052
14680D18428J34194m2271j23764N4660J45535N1802l5627K64521M9969j66227
14670G51220P6925R4636j36091q7482K06728K90580J650j73429q2319j41151j65474
14659F35793j09694k5574k0025P379j42650j36485Q5061J41873r4906k3453j94664
14648A22655J3209J87969o4473j6166n2743M0391m7469N2420j26J17126j19383
14637B33410m4482n3658R5889J69920Q4069L00060j9255j28091j11439L0522j36401
$$ y = [213036, 219928, 148123, 19035, -40865, 15508, 103897, 252901, 178305, 126117, 69016, 304956, 404511, 459978, 560346, 508223, 503984, 421786, 466190, 460226, 287118, 222904, 10487, -105584, 118435, 334622, 330771, 193069, 204234, 205743, 292995, 290244, 263737, 260376, 418428, 552622, 510351, 386587, 441247, 586782, 638584, 602957, 867478, 917447, 751220, 828145, 922781, 786690, 699208, 905936, 1196516, 1198166, 1024737, 942418, 801267, 635793, 526099, 500525, 480500, 487879, 345229, 208744, 293805, 435678, 340772, 317319, 122655, 135864, 323833, 259360, 243194, 190451, 230842, 183373, 235793, 235667, 352793, 233410, 188928, 135270, 231159, 401079, 485148, 785208, 765953, 637862, 526423, 556945, 420544]
14626D20544J07398N1511K6698P2616J2884L0952m1868n2524O4507o2098q7376
14615E43244P8752N2430j44845j59188n8374K07570j5945j87772j46560L0450
14605A99762R9525K0951p6274j28847q7o919O3401K27978K8834J60534K1384p1980
14593E38262o131j89885p1388k6779N6233L00573k5409k49304k07536n8103J41484
14582B02017J12258j57929r6391p2268J94369J27631J02608M9966R5029N725k11856
14571C51159j01706N8931k23453j49668O4509M262l0787p4706P7438J91201K43170
14560D10350n9760j37048K5667j10334j4995J51915J94845J1681k62286r3084
14550A16951P5335k2032r6447P1173r1105N5902P2951M5715L5276k40489j46251
$$ y = [420544, 527942, 579453, 606151, 678767, 691651, 722603, 680735, 628211, 692718, 630620, 543244, 621996, 674426, 529581, 370393, 312019, 519589, 503644, 315872, 169312, 199762, 299287, 320238, 243964, 115117, 115030, 108111, 171512, 399490, 428324, 588858, 610242, 538262, 532131, 342246, 270858, 244079, 300312, 600885, 575476, 326172, 118636, 60533, 202017, 314275, 156346, 59955, -12313, 182056, 309687, 412295, 462261, 557290, 563015, 351159, 249453, 308384, 84931, -64737, -228, 4034, -26753, -101459, -24021, 167180, 410350, 350590, 213542, 239209, 128875, 113880, 265795, 460640, 472321, 210035, 116951, 192286, 170254, 73807, 144980, 53875, 109777, 182728, 228443, 263719, 23230, -123021]
14539a23021J02443o3543j58429k6640L18184L9390l17302j31594R3484J32623
14529a34405M2618N8887J2753n5392J19511j712J95361q0147m0357r5961j5771
14518E385j01446J26116J66091n4705j07822J7281Q4764J22764J51841Q4121k78752
14507B15638j17305p2310J59575k9882r8740J64623m0558k08898p8465k6934j46874
14496b80130N6087J37677K38128J33612j02510q2120o9300L8694J74188r8292
14486A46034q8497J69165n6675J97L4000p4186J08146k67345j64529K07073K25997
14475B39380P6235p7026p9704N2866m6224K1131q7162j27052K3502r861q1566
14464i5481J41313j3148r6362q073J4453K509j41906j83753O0103N0035J18135
$$ y = [-123021, -20578, -84121, -242550, -269190, 48994, 88384, -228918, -360512, -267028, -134405, -91787, -32900, -20147, -75539, 43972, 42260, 237621, 157474, 117117, 21156, 5385, -96061, 30055, 196146, 141441, 33619, 50900, 135664, 258428, 410269, 494390, 215638, 98333, 26023, 185598, 155716, 56976, 221599, 181041, -27857, -106322, -133256, -280130, -224043, -86366, 151762, 285374, 182864, 100744, 31444, 70138, 244326, 146034, 57537, 226702, 170027, 170224, 204224, 130038, 238184, -29161, -193690, 13383, 239380, 315615, 238589, 158885, 211751, 165527, 186658, 99496, -27556, -4054, -13915, -95481, 45832, 32684, -63678, -71751, -57298, -54789, -196695, -380448, -320345, -270310, -152175]
14453a52175J41850R7179M5828j1768J85324J01604j84977k99866N0314p1131
14443i7818k34358Q247N1757J10415j29430M1037J1155J61717J10389J91616M5420
14432B70147o4610j62102P880M6106M7091j00912j50484O9455Q5499K12264J64092
14421D24426k94781J6603R3482O3214j19938N8927K6938j24212N809j48138j25848
14410a23518J72944J42596K70992p2354M4982l1023O4841j32990r313R4125J1415
14399D32697k58949k35836o4611J55202L13351J61364L5147m0635j96598J9932
14389C21064l844j69192r3030J85653m8036j88987m4180L33621O6305j11587q9556
14378A58231j35986k9310J02940O5848K2310j19628J73150m5820L9860q4803k49402
$$ y = [-152175, -10325, 86854, 132682, 120914, 306238, 407842, 222865, -77001, -26687, -97818, -332176, -323929, -272172, -161757, -291187, -250150, -238995, -77278, 33111, 224727, 270147, 205537, 43435, 51315, 97421, 144512, 43600, -106884, -37429, 48070, 260334, 424426, 129645, 146248, 239730, 302944, 183006, 241933, 268871, 144659, 150468, 2330, -123518, 49426, 192022, 463014, 390660, 435642, 404619, 469460, 336470, 327157, 421282, 432697, 173748, -62088, -126699, 28503, 341854, 503218, 538365, 497730, 301132, 321064, 317220, 148028, 54998, 240651, 192615, 3628, -40552, 293069, 359374, 247787, 158231, 22245, -7065, 95875, 161723, 184033, 64405, 237555, 191735, 231595, 146792, -102610]
14367a02610P9144L57101N4762k51754j21279j05694p5284m1399Q5976j40871
14357b61908m0630j6291Q3563j8808P3697r2899J00137K94514J59606o7416l532
14346B10033r21M1899K2394l4729j11038J60306k6356p4119m2380J21272L3690
14335C00051R4973P8604o6245R6091p3013o5211p4939k9943j85790R387K37134
14324C21099l6144j42741Q090J43370J37546O101J77602j12634p5580n7939J93287
14313E62057Q1003j3050j7346j1964o2149M5769J8158j23926M5448J53065j75130
14302E01935k9023j87240P4713J44122m1051p6076j30946J2438L29610J70346
14292G68828P4225J77077o7199j01980r9676k74306j76959O2660j6781j7814K05743
$$ y = [-102610, -23466, 333635, 388397, 136643, 15364, -90330, -165614, -207013, -121037, -261908, -302538, -318829, -235266, -254074, -180377, -273276, -173139, 121375, 280981, 213565, 210033, 209112, 251011, 273405, 238676, 127638, 287944, 261588, 187469, 145089, 266361, 300051, 395024, 473628, 407383, 503474, 430461, 365250, 290311, 260368, 74578, 83965, 321099, 284955, 142214, 150304, 293674, 431220, 437321, 614923, 502289, 426709, 368770, 562057, 643060, 630010, 612664, 600700, 538551, 584320, 602478, 478552, 524000, 677065, 501935, 472912, 285672, 360385, 504507, 463456, 387380, 256434, 268872, 598482, 768828, 843053, 1020130, 952931, 850951, 751275, 476969, 300010, 362670, 345889, 328075, 533818]
14281E33818J59857O1298K1571k41936K13373l8637K37296J38451J53424k742
14271A235773r8059p75p9769m8614K18053J36765l2941p1770J98710P8276j17404
14260A418245j5117J11410J72040J25910p0876J08846L11260r2730J88993K49179
14250B507160J29804J59874K40568M10249L69060M39901J90513L28750N46535
14241E322414P09333J025286Q63783R31895J167672J393665J483387K021212K950800
14232A7869447L696617N091816O906224R479914J2497512J5425270J7942848J9274439
14224A08184087J8607856J5353679R626798K658219m288096j0261008j4697209
14217A25184326j6706825j6492104j4382106j2028478r579913p748351o278968
$$ y = [533818, 693675, 754973, 776544, 534608, 747981, 709344, 946640, 1085091, 1238515, 1235773, 1137714, 1136939, 1057170, 1008556, 1226609, 1363374, 1330433, 1258663, 1457373, 1535649, 1418245, 1403128, 1514538, 1686578, 1812488, 1741612, 1850458, 2161718, 2068988, 2257981, 2507160, 2636964, 2796838, 3037406, 3447655, 3816715, 4256616, 4447129, 4775879, 5322414, 6031747, 7057033, 7920816, 8852711, 10020383, 11414048, 12897435, 14918647, 17869447, 21566064, 26657880, 33564104, 43044018, 55541530, 70966800, 88909648, 108184087, 126791943, 142145622, 151772420, 154430639, 150142543, 139881535, 125184326, 108477501, 91985397, 77603291, 65574813, 55994900, 48246549, 41967581]
14210D1967581m874191l993839k990653k516138k177246j913277j649486j316893
14202B0535858j252236j104787r34895p56015p36865n32868m11610k74810j47562
14193A4384210j07122K7340L01994M53653M90340Q92004Q22049J164142J613671
14184B0042281K080201K751912M214727N965019P897067J0201824J2783220J4870965
14176H0807216J5870154J5230061J2509494Q282169K678331l485136q824660j2706516
14168A10361113j4495165j4174322j3065711j1097132q862349p032443n761764
14161C5872227m393562l410552l077155k363374j871024j710348j402546j250816
14153A6392850j227104j150498j029026j106721j099034p79997n82205o60809
$$ y = [41967581, 37093390, 33099551, 30108898, 27592760, 25415514, 23502237, 21852751, 20535858, 19283622, 18178835, 17243940, 16487925, 15751060, 15218192, 14806582, 14531772, 14384210, 14277088, 14304428, 14606422, 15060075, 15550415, 16442419, 17264468, 18428610, 20042281, 22122482, 24874394, 29089121, 35054140, 42951207, 53153031, 65936251, 80807216, 96677370, 111907431, 124416925, 132699094, 135377425, 131892289, 123067629, 110361113, 95865948, 81691626, 68625915, 57528783, 48666434, 41633991, 35872227, 31478665, 28068113, 24990958, 22627584, 20756560, 19046212, 17643666, 16392850, 15165746, 14015248, 12986222, 11879501, 10780467, 10000470, 9418265, 8757456]
14145H757456n61216p84116p35553o00967m60969n62692k33893k23327n17035
14136D077688n35808k90271k60593k32372k70849n4903L3843l8138k2644j8460
14126B387493k49148n2134k02603q7908k23655J2926M2578m3217J2631P3483O186
14115A676632p7378j21350O8693r1191j63379l3868l07609j26705M7100p8726
14105G92219K00996J81682P8143j70117r6180o8959j6192m8726k16549n7103N6874
14094F36088l05616L4643J38592p3231J39646L01365Q2025j30294j17320l9033
14084F66865p670j1006j5346k34644J8964J08118J3488m0882Q6490K3817n4186
14073E54008J20399l4471j37519o613k06680l24647m4781K04692N9211r1924J8265
$$ y = [8757456, 8196240, 7412124, 6676571, 6075604, 5614635, 5051943, 4818050, 4594723, 4077688, 3541880, 3251609, 2991016, 2758644, 2487795, 2432892, 2466735, 2428597, 2405953, 2387493, 2138345, 2086211, 1883608, 1795700, 1572045, 1584971, 1627549, 1584332, 1596963, 1670446, 1676632, 1599254, 1477904, 1546597, 1455406, 1292027, 1258159, 950550, 823845, 870945, 792219, 993215, 1174897, 1253040, 1082923, 986743, 917784, 901592, 852866, 636317, 579214, 636088, 330472, 365115, 503707, 430476, 570122, 871487, 953512, 823218, 705898, 666865, 659195, 648189, 632843, 398199, 417163, 525281, 538769, 497887, 584377, 608194, 554008, 674407, 639936, 502417, 495804, 289124, -35523, -80304, 124388, 183599, 91675, 109940]
14062A09940J09686O1901p4373n3110M0089L7999n4307J46382k0265J60343K44789
14051G09074J6276r4902j11712k21318j38939L2870j28301K8894j8480N1633K02974
14040C28069R4715k8096Q4733o4356j92267j700k9721k79585k15092J59970K81655
14029A38325L7840l0331J80903J19861J31357j70592j65580l4793n3232J63129
14019C16887n3920l8014l2212J99734j50016l43233j36180n1401J17032J45742
14009b5581K9338M2082J17149P4041j85963Q9424K2710j66717n0153j78174J31991
13998i9853J99284K94977L2809k28824k28973j42567J23833J12127L800q123J51458
13987B09948n8817k55539J00117N4518j28787j03959j38958J0437J17897K1473
$$ y = [109940, 219626, 281527, 207154, 154044, 194133, 232132, 177825, 324207, 303942, 464285, 709074, 725350, 630448, 518736, 297418, 158479, 191349, 63048, 91942, 73462, 125095, 328069, 422784, 394688, 479421, 415065, 222798, 221098, 191377, -88208, -303300, -143330, 138325, 176165, 145834, 326737, 446598, 577955, 407363, 241783, 206990, 153758, 316887, 262967, 224953, 192741, 392475, 242459, -100774, -236954, -288355, -171323, -25581, 3757, 45839, 162988, 237029, 51066, 140490, 163200, -3517, -53670, -231844, -99853, 99431, 394408, 427217, 198393, -30580, -173147, -49314, 62813, 66613, 58490, 209948, 151131, -104408, -4291, 50227, -78560, -182519, -321477, -311040, -193143, -171670]
13977a71670J83657J71697q6361L3914O926q0886j85805r4289J11688N3165J32734
13966G4770M0784J09217Q8373K2493p2243o8815j10346j25662q6348L5730p0095
13955a62142o5844J30750J35597R8973j0409j4157k2742k3747K22664J72877j8290
13944D43530n1616q5787j43615L2988Q2908O1122l14266J48467l414k1337j6993
13933A31987p9397J68734l1190o0380K9223k7060n4027J47731J46049P9902J5244
13922D66816j47278R7563j09531j63598J56700q5864j88412K1450J36056o241
13912A77661M0265K597K12385l7390r6534l6311P7498J62093J357j34794P7653
13901D46480J69693j43684j87834k2136J24903l6573p9234j03286L5453l0949
$$ y = [-171670, 11987, 183684, 97323, 131237, 138163, 57277, -128528, -222817, -111129, -57964, 74770, 115554, 224771, 313144, 335637, 263394, 194579, 84233, -41429, -127777, -92047, -162142, -227986, -97236, 38361, 137334, 126925, 112768, 90026, 66279, 288943, 461820, 443530, 391914, 306127, 162512, 195500, 278408, 339530, 25264, 173731, 170317, 148980, 131987, 52590, 221324, 190134, 129754, 158977, 131917, 77890, 225621, 371670, 451572, 466816, 319538, 417101, 307570, 143972, 300672, 214808, 26396, 47846, 183902, 177661, 217926, 220523, 432908, 395518, 298984, 262673, 340171, 502264, 503621, 368827, 446480, 616173, 472489, 284655, 262519, 387422, 350849, 271615, 168329, 203782, 172833]
13891A72833o1013J67321l01495N6970J38038L9672j48167k02206J5825j23788
13881b46010M8514L18697K98233J2286l2283l3661j6036k52106j43120o0325L4340
13870g1471j3257o1870p7637K0662N6867J84372K32548J50310j27530j43935k53842
13859a04783q1955q4051J3973O4747Q3223O0845O446k0186q488l1702j61212k3619
13847b86762J40781m7637l2039L48102k1590k30522K5117J25729r2379k99546
13837c70746Q5564Q5161J08052J88189J23667o692k52237K4694L19867M5031m985
13826C45565J02892l5631j90728l05003m15246k54298J95935L89411J84219M1540
13816E8656r5636o5533P475R2902P8105k4502J7993P7815o0910n7454O7280r3674
$$ y = [172833, 111820, 279141, -22354, 34616, 172654, 212326, 64159, -138047, -122222, -246010, -197496, 121201, 419434, 431720, 399437, 365776, 349740, 97634, -45486, -105811, -71471, -84728, -146598, -224235, -203573, -146706, 37666, 270214, 420524, 292994, 149059, -104783, -186738, -270789, -256816, -192069, -108846, -48001, -41555, -61741, -70229, -101931, -263143, -286762, -145981, -193618, -225657, 122445, 100855, -129667, -104550, 21179, -71200, -370746, -285182, -200021, -91969, 96220, 219887, 213195, -39042, -14348, 305519, 350550, 345565, 448457, 412826, 222098, -82905, -498151, -752449, -556514, -167103, 17116, 58656, -36980, -102513, -95038, -2136, 75969, 51467, 69460, 147275, 86365, 28911, 96191, 2517]
13804B517l4876l9629j24955j41170p6532J01779K50859n0326J83704O3851k35452
13793a00230k2442j53646K4614N2667O1574j83645M118l7207j44472R9742J61797
13782b37130J45770N4546L1601j14428r7299N3939o956O6408N0497J1217J25832
13771H3997J93739R0969k266N0418J66998P2934Q8649k01571j47025J99490J20779
13760G17111m2390o9430j0864q4067j45370j28909N2631j67284k7195o5634r2043
13749f3444o3369j27189J24261J68326m4479j93737m4937L6390r4011k55049l5505
13738e92743J47114J89888K11888j2944r6066o7074k27863N5707M4929m178K01165
13727a50177Q6439M0379M5078l9176m9788J97503O6326N8293J72868K20948J88495
$$ y = [2517, -32359, -71988, -196943, -338113, -414645, -312866, -62007, -112333, 71371, 135222, -100230, -122672, -276318, -251704, -199037, -137463, -321108, -316990, -354197, -498669, -398927, -237130, -91360, -36814, -5213, -119641, -216940, -163001, -169957, -103549, -53052, -41835, 83997, 277736, 368705, 366439, 416857, 583855, 656789, 745438, 543867, 396842, 596332, 717111, 674721, 605291, 594427, 510360, 364990, 236081, 288712, 121428, 94233, 28599, -63444, -126813, -254002, -129741, 38585, -5894, -199631, -244568, -208178, -302189, -557238, -592743, -445629, -255741, -43853, -56797, -152863, -219937, -447800, -392093, -347164, -351342, -150177, -63738, -23359, 21719, -17457, -67245, 130258, 196584, 254877, 427745, 648693, 837188]
13716H37188m1389R0805O3875j31852R1845n7667j48664l03013k18227R13L2365
13705B16179p9869o0553R3957j39794j04532J9074j50573J17760k6709J7401J70424
13694G2765Q6147j73914j94201J32679J98479J3853j6404o0410q0534J81989j77475
13683a7026j3312L0990q1618J47305m7687n5098k7560J5399n314P8958K20499
13672B45536j78779K6643l8370r4745n4086J723J11656r327j817p1539L819o0101
13660a19387k5549J74401j36251J42498J46549J49913j2851j59769j29895j78246
13650a48587Q6136R4701j23129J42000J0140r8957J8370p894o705N5146j77938
13639a56717J5217J50964J29710O0169j15730k3104j97165o7540N3302m7656q6386
$$ y = [837188, 795799, 886604, 950479, 818627, 910472, 852805, 704141, 401128, 182901, 183814, 216179, 136310, 75757, 169714, 29920, -74612, -55538, -206111, -88351, -115060, -97659, 72765, 158912, -15002, -209203, -76524, 121955, 135808, 119404, 58994, -21540, 160449, -17026, -30338, 652, -80966, 66339, 18652, -36446, -64006, -48607, -53921, 25037, 245536, 66757, 93400, 55030, -39715, -93801, -92078, 19578, 10251, 8434, -63105, -59286, -119387, -144936, 29465, -106786, 35712, 182261, 332174, 319323, 159554, 29659, -148587, -62451, 32250, -90879, 51121, 61261, -37696, -19326, -27220, -33925, 21221, -156717, -141500, 9464, 139174, 199343, 83613, 60509, -136656, -204196, -150894, -198550, -284936]
13628b84936J6443k5721K72944j00986j08433K51137J27117M5555j32725j28528
13618f8133J76426o843r7196j0697M380R8785m1287l1134p3915p9675k7194Q6905
13606f9578J33958N113J48785O2990j96638k6947l0328j7733j65181n7032J87405
13595b5186P9167J56129n7970k65668o3504J16373R3629j34734m0505J6081J73429
13584D7241M5689r175O1428M8208k1849j13515j70244j74537J05639J91255M6080
13573E6220k35758q2931R9950j63846j9073P0930m898j51789j9435K9351J30639
13562b90640K28316K42134n2770k11880p8101O8135J22504k13160j73123K0201
13552c38384J25866q6961K9265L7334l6076o9677J30131J60534j44892j18k2640
$$ y = [-284936, -268493, -294214, -21270, -122256, -230689, 20448, 147565, 193120, 60395, -68133, 108293, 101450, 4254, -6443, -2063, 96722, 55435, 24301, -49614, -129289, -156483, -69578, 64380, 69493, 218278, 281268, 84630, 57683, 27355, 9622, -155559, -212591, -25186, 53981, 210110, 152140, -113528, -177032, -60659, 32970, -101764, -142269, -126188, 47241, 92930, 83755, 145183, 193391, 171542, 58027, -112217, -286754, -181115, 10140, 56220, -179538, -262469, -162519, -326365, -345438, -274508, -279406, -431195, -450630, -421279, -290640, -62324, 179810, 127040, -84840, -162941, -94806, 27698, -185462, -358585, -338384, -212518, -299479, -270214, -232880, -268956, -338633, -208502, -47968, -192860, -192978, -215618]
13541b15618j14173j7720J50136J37247O3686j4153m5612N9020r7993m1016J22876
13530a3320R6357L0546P7006l08583o5160J46712L4070j20100N0574K90230o6265
13519A52067j49016m6225o7622n1204k94281k17319K12190O6269O9122Q7196K63589
13508B4766K04497P0514q6969J01801J38190j08717j43852l16739r4637M8063
13498a63083n234Q4524J58455q7884k7644k23033K95562J85256k5062j42902L4541
13487H3496p7683L438k05590o8080q4194L4400Q4540O4131o9591R659J09482K3838
13475i2154K00041J96108r5999o8945j28986m2494n3996J18314n371J05199l9980
13464I1737l9268O646J12588n297l09740j53776P9575J38751J25596J74415J46995
$$ y = [-215618, -329791, -347511, -197375, -60128, 3558, -10595, -56207, 2813, -95180, -136196, -13320, 83037, 113583, 190589, -117994, -183154, -36442, -2372, -122472, -71898, 218332, 152067, 3051, -43174, -110796, -162000, -456281, -673600, -461410, -395141, -326019, -238823, 24766, 229263, 299777, 212808, 314609, 452799, 344082, 200230, -116509, -211146, -163083, -168317, -83793, 74662, -13222, -40866, -263899, 31663, 216919, 191857, 48955, 83496, 5813, 9251, -196339, -264419, -348613, -314213, -229673, -165542, -235133, -225474, -115992, -92154, 107887, 303995, 207996, 139051, 10065, -32429, -86425, 31889, 26518, 131717, 91737, 52469, 59115, 171703, 166406, -143334, -297110, -217535, -78784, 46812, 221227, 368222]
13453C68222k61129l30421p35K40930P7688J25747q3953l12507Q3658J70464k63715
13442a85751m6966M15R277J09358K84253J22738j11263j69009O6685j0159m8542
13431B1036N5299k45585j58806Q7902J49573Q4184Q4072J04861J4470j81471j21312
13420a05777k3182J07820K4638j56157j85672J59203J2324J59832K75516O4576
13410C33121j41513j39102k24272J34198K6344L7809p7970J9186q66J60059k59
13399A26735j50011j46425K0078J37199O8544K65401p5378j20804N797l1846j05762
13388f472m2404j07424P3103K14479J90241j12388j10430r5737o046j8270n5821
13377g7169j980k8033j5402J03293O3953K02988J9291r5753J83452k45932j36205
$$ y = [368222, 107093, -223328, -224063, 16867, 94555, 220302, 136349, -176158, -92500, 77964, -185751, -232717, -232302, -223025, -113667, 170586, 293324, 182061, 13052, 79737, 69578, 21036, 76335, -169250, -328056, -240154, -90581, -6397, 77675, 182536, 197006, 15535, -105777, -128959, -21139, 3499, -152658, -338330, -179127, -166803, -6971, 268545, 333121, 191608, 52506, -171766, -37568, -11224, 26585, -51385, -32199, -33065, 126994, 126735, -23276, -169701, -149623, -12424, 56120, 321521, 246143, 125339, 131136, 99290, -6472, -48876, -156300, -83197, 131282, 321523, 209135, 98705, 2968, -3078, -21348, -77169, -79149, -107182, -122584, -19291, 44662, 247650, 266941, 171188, 354640, 108708, -27497]
13366b7497J1016L179o6927J62846j55054k26559J0012K21819O1160k25219j07876
13355c39100J04533p6o622p0865O645K04411J01541P3090L2366N2276n3320j05780
13343i01K941K571R5509o4153R5029n4578l6286J04133J87993k01324k21648P2977
13331a7737m8990k0223k4381l5504j18064J87054J54683m035j63203Q6247o6675
13320g0828k87405j78524J66501K10053k06013J72503l5898j23611M5419q1016
13310c88819l256R802J82528J18657R305J12837J60421p4576k4774M4901P747
13299A54773r0125N0297K3435o6503L2175j6195j34830J2761j09216O3311M4036
13288c6081q6036p5768J22994J63295k9623L9158P4868j09110j17030j5097Q2905
$$ y = [-27497, -16481, -13302, -80229, 82617, -72437, -298996, -288984, -67165, -6005, -231224, -339100, -234567, -234643, -241265, -312130, -305485, -101074, 467, 73557, 105923, 158199, 104879, -901, 2040, 4611, 100120, 35967, 130996, 76418, 40132, 144265, 332258, 130934, -90714, -17737, -66727, -86950, -111331, -146835, -264899, -77845, 76838, 72803, -90400, -4153, -70828, -358233, -536757, -370256, -160203, -366216, -193713, -229611, -353222, -307803, -388819, -392075, -382273, -199745, -81088, -71783, 41054, 201475, 126899, 102125, 147026, 154773, 64648, 114945, 138380, 71877, 104052, 87857, -46973, -34212, -143428, -80117, -36081, -122117, -197885, -74891, 88404, 58781, 97939, 172807, 63697, -53333, -68430, 14475]
13277A4475j1122k5573N0298L8549N8425L3815O7424o678N053j61956j89349K71305
13265A44666J09249p3030L0382N1767j29050m0990n6025j52702P9054O7137R1678
13254A22136j4339j17255P0644r6748j22189j175J86834K9460j00015j53499q6313
13243b82459M0936J7354m2567p7956k2012J32859k1292o9522R8891j76116J24032
13232b77852J15014K13444j89494k83276P5926n9957R6729M819J14580J34221
13222e5846k7609O0087j4583n5233J04395j36235M2771J41746j14874j9697l711
13211g8789J39920k4896L538P2439r00j11848j16848l7344j6147L9699J0358q5181
13199b05999q9966O8571Q6257R0320P7716k14957L3954M02n6491J49582L2784
$$ y = [14475, 3353, -22220, 28078, 66627, 125052, 158867, 226291, 219613, 224666, 62710, -126639, 144666, 253915, 180885, 211267, 263034, 133984, 92994, 36969, -115733, -36679, 30458, 122136, 107797, -9458, 61186, -35562, -157751, -158926, 27908, 57368, -42647, -196146, -282459, -241523, -224169, -266736, -344692, -366704, -233845, -255137, -324659, -225768, -401884, -277852, -162838, 50606, -138888, -422164, -346238, -406195, -309466, -304647, -190067, -55846, -83455, -23368, -37951, -93184, 11211, -125024, -82253, 59493, -55381, -75078, -78789, 61131, 36235, 39773, 112212, 111312, -536, -117384, -154728, -170875, -131176, -120818, -205999, -295965, -227394, -141137, -50817, 26899, -188058, -154104, -153702, -210193, -60611, -27827]
13188b7827k18810K3933P0991R4245J96048K20384k31680j64363j07739k15696
13178c60514j16449M4469J62500J32580J3382P0438j28391r8282M5632O0631L5314
13167a38690j11453K2880R0052J6964k36996l5565J13990j11751j5961N4358R5212
13156b56960K61737L2089L4961Q9483K5050l5193j38609M4668J5361M3474N2498
13145A68559j57396j63569J85511j34794O9460J08362k41914K0420J57028j67607
13135a55940k57779L0161O27O3402J95738J66781P3896j51523o7365J39837J30971
13124A68806N6590j02903p3841J09712j07904k12904j63060L5480j3083J00593
13114b02514O0749M644q7779J15714r6491j42453K80351K00023J760o8144l5187
$$ y = [-27827, -246637, -222704, -151713, -57468, 138580, 358964, 127284, -37079, -144818, -360514, -476963, -432494, -269994, -137414, -124032, -53594, -181985, -280267, -234635, -174004, -138690, -250143, -227263, -137211, -120247, -357243, -392808, -278818, -390569, -406530, -352172, -256960, 4777, 36866, 71827, 161310, 186360, 151167, 12558, 57226, 72587, 116061, 168559, 11163, -152406, 33105, -101689, -32229, 76133, -165781, -145361, 11667, -155940, -413719, -383558, -382931, -319529, -123791, 42990, 116886, -34637, -102002, 37835, 168806, 225396, 122493, 48652, 158364, 50460, -162444, -325504, -290024, -303107, -202514, -141765, -137121, -224900, -109186, -205677, -348130, -67779, 132244, 134004, 65860, 30673]
13103C0673J25259O7678j13095l66955j96006J24952N6356P0276J65192l2033
13093f7703r5665j22593J99909K49207J29679P1269K9756p5291j98218j96179
13083g5829j96535J35703n2747k08055o7588K05254N5193j927k83833L6695J63905
13072b89764K80676N167j47818J83583N0510Q5969J3410K689k03130Q0598Q7956
13061A49846p5532k09670j20424M8545J08413N3743m4072n7002J63020m4285j00610
13050a28028J3250k90375m3321n5798J78450J62957J65274k1328j67079k599O7762
13039a20835J4961K5065l6100p0792O8297j87120j04559K08359K97330J577k58496
13028a62313K9690Q9563L2776K4148o6038j27131M5744O607P4643n4812k76911
$$ y = [30673, 155932, 223610, 110515, -256440, -452446, -327494, -271138, -200862, -35670, -67703, -163368, -285961, -86052, 163155, 292834, 364103, 393859, 318568, 120350, -75829, -272364, -136661, -189408, -397463, -465051, -259797, -204604, -206531, -490364, -453669, -289764, -9088, -3921, -151739, 31844, 82354, 168323, 181733, 184422, -18708, 61890, 149846, 74314, -135356, -255780, -207235, -98822, -45079, -89151, -146153, 16867, -27418, -128028, -114778, -405153, -448474, -504272, -325822, -162865, 2409, -18919, -185998, -188597, -120835, -105874, -80809, -116909, -187701, -119404, -306524, -411083, -202724, 94606, 96183, -162313, -132623, -43060, -10284, 13864, -52174, -179305, -133561, -126954, -52311, -107123, -384034]
13017c84034o1928R8714J65402P4611J11395Q9010n4846k51222J36900P257j4838
13006h3579J43580L5985J3752N9462p6806k06969q5235J24156R3593k22337K1270
12995a83128q4209p5308K41253J24180j58585j15424j98287j01227k7940J24275
12985d54400J57147J27551Q4281J529O869K8876m2201o9110l6726P0057r9414
12974b25541r8722K29156o6853P5470P2335Q6708k104j54394j8046L5865m9964
12963a16090j09369l8870j7678R0836K0258j21497n8831N2517J83076j55324o9546
12952c40518M7372J44746K23898l8390q0492L9901j84546N5255j9886R3860O2072
12941C272j14335O0850M9380J45318Q5013j20365k53572m8879K27644l4057m72357
$$ y = [-384034, -445962, -347248, -181846, -107235, 4160, 93170, 38324, -212898, -75998, -68741, -83579, 60001, 95986, 109738, 169200, 92394, -114575, -199810, -75654, 17939, -204398, -183128, -267337, -342645, -101392, 22788, -135797, -251221, -449508, -550735, -578675, -454400, -297253, -169702, -85421, -83892, -77023, -48147, -90348, -159458, -196184, -126127, -225541, -324263, -95107, -161960, -86490, -14155, 72553, 70449, -83945, -101991, -66126, -116090, -225459, -264329, -282007, -191171, -170913, -292410, -351241, -298724, -115648, -270972, -340518, -293146, -148400, 75498, 37108, -43384, -3483, -188029, -132774, -152660, -58800, 3272, -111063, -50213, -833, 144485, 229498, 109133, -144439, -193318, 34326, 269, -472088]
12930d72088j9370J10478J42154j1883m7664k8515J92863n3091J7905N0936M9892
12919f8383J417O6850n4656J47196J37925j23691o0032j69728j58838j46546j69652
12908e98138O544J38773M3275N4863k2878Q7264L3155r1198R4871J71344l9214
12897a21339m4979j30541J00498J68226K8062M7269J62645n4064m1631k07021
12887i2875j87283l2775N2595o3916j017M4511R0716O0117J52134R7379r7369
12876B2217j36904L794R3178k61854j25212J51712j7527r2404j06315m4045J59134
12865c54226j47947M4191K21041L6726o9227j10930P3062K41241O0688R1278r383
12854G6514O612J0274K5813q770M498n3385O3361N5805j6232j20314m3600j02304
$$ y = [-472088, -491458, -380980, -238826, -250709, -298373, -326888, -134025, -187116, -169211, -118275, -68383, -66966, -116, -54772, 92424, 230349, 106658, 46626, -123102, -281940, -428486, -598138, -591594, -452821, -409546, -354683, -377561, -290297, -257142, -348340, -253469, -82125, -121339, -166318, -296859, -196361, -28135, -73, 47196, 209841, 155777, 114146, -92875, -280158, -312933, -260338, -324254, -325271, -280760, -190044, -129927, 22207, 119586, 22217, -114687, -110893, -17715, -279569, -404781, -253069, -270596, -363000, -469315, -513360, -354226, -502173, -457982, -236941, -200215, -269442, -380372, -307310, -66069, -5381, 85897, 76514, 83126, 93400, 119213, 110443, 114941, 61556, 124917, 180722, 164490, 44176, 576, -101728]
12842a01728K867J62267L0415P2823q1055J15397j18004j21833j22635j21035
12832b82521j9066J03621J90010R6380j87577J26978K6449m6531j97956j10085
12822c00298J90822R9492P4803N3578J62304l4249m66825p5522K5941Q3955J59683
12811b6316N4484n6544j27296j16842r2588j40747M6238J95289M7109J28625p9136
12800a67724j0692L03331K82657k13798j69977J7807q5762m9323Q8412R0599L4034
12789A19564r9260L3919j60206l1434J28857K0789J4990k09637j5574J52386L72816
12778C27210K02207q0537k13745j59644l5158j34824k733j77291q6169K4428J67235
12767a69021k58R1969K63718J14351q0058J82111K05172l8331m0704J07915J6787
$$ y = [-101728, -98861, 63406, 93821, 166644, 85589, 200986, 82982, -38851, -161486, -282521, -301587, -197966, -7956, 88424, -99153, 27825, 54274, 7743, -190213, -300298, -109476, -9984, 64819, 118397, 280701, 246452, -220373, -295895, -269954, -185999, -26316, 28168, -28376, -155672, -272514, -365102, -505849, -459611, -264322, -217213, -88588, -167724, -178416, 124915, 407572, 193774, 23797, 41604, -44158, -93481, -5069, 85530, 119564, 20304, 54223, -105983, -137417, -8560, 12229, 27219, -182418, -197992, -45606, 327210, 529417, 448880, 235135, 75491, 40333, -94491, -97224, -274515, -360684, -336256, -169021, -169279, -77310, 186408, 300759, 220701, 402812, 607984, 569653, 528949, 636864, 653651]
12756F53651p3547k67445j56246j55681j22653l5922K1849N6778N4708l9022l6210
12745i9740q1360k02475j48233k4119K2973J75953K22960K36244q5427r5151J06105
12734B7730J54407o4280r0994p3367M1049m2567l00919m8642K44864p6642n3722
12723b83083J14649l7489p497P4200Q983O583p3040l5323M5104O5491Q6567j80075
12711b14930j67038J59552J42390J47751k0657o5480k1072K39791o3594j49478
12701a2765Q6689q1181j16648j9333R3437J26703K59434J32108p2873j04849o1413
12690B29309L0133k3539n6455p3775m3558m6967j62445k14891J33676J40944M3823
12679d3745j0556j97845l0244L82409J05363k80066k48900j21072j01177K01562
$$ y = [653651, 580104, 312659, 156413, 732, -121921, -157843, -135994, -79216, -24508, -63530, -99740, -181100, -383575, -531808, -555927, -532954, -357001, -134041, 102203, 16776, -78375, 27730, 182137, 117857, 26863, -46504, -5455, -48022, -348941, -397583, -152719, -229361, -283083, -168434, -205923, -213420, -139220, -130237, -123654, -196694, -232017, -186913, -121422, -34855, -214930, -381968, -222416, -80026, 67725, 47068, -18412, -39484, 200307, 136713, -12765, 73924, -7257, -123905, -143238, -49801, 76902, 336336, 468444, 395571, 290722, 229309, 259442, 235903, 179448, 105673, 62115, 15148, -147297, -362188, -228512, -87568, -43745, -54301, -252146, -282390, 100019, 205382, -74684, -323584, -444656, -545833, -344271]
12669c44271M540R5617R4984J21652n0748M2448n1039P3864J69819O7363j5957
12658B08272k02582k73294j13223J31399J87317P7629J37020J374j48780j15145
12648a10013j06659J16255N5881P1833M5802N6661J35651J21467j89299j44694
12638E2885j53198j06938P9166J94416L46632R2919j10795j27646j31567R565
12628A45439L8486Q586k73972j69900J10258L6448j79091L7992K32665J88183
12618A75094j64169l2924K03848j56804M4598J50906o8375q1596M1478p5672p9824
12607d3440J1761O8382j32134j74028j530J48267p0236q7150j39577N3823J16085
12596b49777J20591K8j60732j30102K45262L38254j06631M5950J57621k78822
$$ y = [-344271, -339731, -244114, -149130, -27478, -78226, -35778, -86817, -12953, 156866, 224229, 208272, 5690, -267604, -380827, -249428, -62111, 15518, 152538, 153912, 5132, -110013, -216672, -100417, -44536, 27297, 73099, 129760, 265411, 386878, 197579, 52885, -100313, -207251, -128085, 66331, 412963, 505882, 395087, 267441, 135874, 145439, 183925, 192511, -81461, -251361, -141103, -104655, -283746, -245754, -13089, 175094, 10925, -21999, 181849, 25045, 69643, 220549, 152174, 70578, 112056, 36384, -43440, -31679, 36703, -95431, -269459, -270989, -122722, -192958, -280108, -419685, -365862, -249777, -129186, -129158, -289890, -419992, -174730, 163524, 56893, 102843, 260464, -18358]
12586a8358k27392j37322n2605J63640O1405J38138m1594j83070N7414J38413
12576a01331J00003j30168k01103J52663N3817j13283o0997r7651j23110J45245
12566c75915J35481n8571J65758R8316r0817p7470j3641n6707j33449Q6384L981
12555c16650P8214j87127M0496P7671O5630o2974R4347R232M967K6433Q3754k9837
12543a15844k7540J29766J06638l7543J25108j4854J25300L0389j22193m6590
12533A52637l3132M6676R7276R5955q3805K0522l2798K8532J90858k62617j98395
12522B1709K81194j79886j77649K953J62326P9261m5474j33257j86528J16285
12512e9066J97218k2824L2560P4156j7859l7464K06500j58531j56885O9216P8417
$$ y = [-18358, -245750, -383072, -435677, -272037, -210632, -72494, -114088, -297158, -239744, -101331, -1328, -131496, -332599, -179936, -126119, -239402, -300399, -398050, -521160, -375915, -240434, -299005, -133247, -34931, -125748, -203218, -216859, -273566, -407015, -320631, -316650, -238436, -425563, -385067, -307396, -241766, -304740, -210393, -201161, -196194, -169761, -86007, -115844, -143384, -13618, 93020, 55477, 180585, 165731, 291031, 321420, 199227, 152637, 119505, 166181, 263457, 359412, 275607, 296129, 263331, 291863, 482721, 220104, 21709, 302903, 123017, -54632, -51679, 110647, 189908, 144434, 11177, -175351, -59066, 138152, 115328, 147888, 222044, 204185, 166721, 373221, 214690, 57805, 127021, 205438]
12501B05438j27819K3518r037m17139j0694J64200K08273J50549N0748j49389
12491H8648j20009P9687m2200N7259J31173J18851J50825j7005j88580k89421
12481c0772p1473j17097K3817J57570N0233r7352M732M7710m3786K3582R8519
12470D5683M7909J54666J9310J96584j26471q5923K8605L4322j11496M3524K5194
12459B71907r2543j24464j77821O2070J304J4404q8942o7739Q5655J07139j46870
12448a55900k327Q7219J36693p7280J01250j30413j38956J87922P6878j12752
12438b7666J78043J30679j21008k07978o5358Q3568l7007Q3084k8549n0901J51032
12427H7939j70085o5589Q4753J10671M0803J08318j44885k84773r7867p9931J43689
$$ y = [205438, 77619, 101137, 92100, -325039, -335733, -171533, 36740, 187289, 238037, 88648, -31361, 48326, 6126, 63385, 194558, 313409, 464234, 447229, 258649, -30772, -102245, -219342, -195525, -37955, 12278, -85074, -80342, -32632, -76418, -52836, 45683, 93592, 248258, 267568, 464152, 337681, 251758, 280363, 314685, 203189, 246713, 271907, 179364, 54900, -122921, -60851, -59547, -45143, -134085, -201824, -116169, -9030, -155900, -158227, -71008, 65685, -11595, 89655, -40758, -179714, 8208, 85086, -27666, 150377, 281056, 160048, -47930, -113288, -29720, -66727, 16357, -12192, -63093, 87939, -82146, -147735, -62982, 47689, 88492, 196810, 51925, -232848, -330715, -410646, -266957]
12416b66957K3111L1165J5117m930J92523J86182P5190J05606k7955j11536o5146
12405A52370k6582J1541J29991m8650r3778j00732J4480l5754N3333j24895N4939
12394a3737j4580N2853k273n3703O2275j65170o456K28661Q5505q204O6156n7646
12382A73681k41618J7633K47916Q198q9241m9793O7654J15901j1825j17428J43618
12371B64696o4481J8330o7876J9446k10377j97604K597K79267j4676j76244R2082
12360e4840M5544P2156j7105j5706j91820j42830j3578n1271o1694j54789L26737
12349b59196J89642N5602L4480p3312m8061J94886O8104j32003j19917j23846
12339b13621M4159L8447j25094n9679M8104K07799O2559q1994J02389k01205m1038
$$ y = [-266957, -243846, -212681, -197564, -202494, -9971, 176211, 251401, 357007, 329052, 217516, 152370, 125788, 137329, 267320, 218670, 124892, 24160, 38640, 2886, 56219, -68676, -13737, -28317, 24536, 22263, -31440, 30835, -134335, -140791, 87870, 173375, 165171, 231327, 173681, -67937, -50304, 197612, 205810, 116569, 66776, 134430, 250331, 238506, 121078, 264696, 200215, 218545, 150669, 170115, -40262, -237866, -235269, 43998, 29322, -146922, -54840, -9296, 62860, 45755, 30049, -161771, -304601, -318179, -369450, -431144, -585933, -259196, -69554, -13952, 20528, -52784, -100845, 94041, 162145, 30142, -89775, -213621, -169462, -131015, -256109, -315788, -267684, -59885, 2674, -79320, 23069, -178136, -219174]
12328b19174K18622J47494q1938j64130o5110K05512J1658O8819K39193q4111
12318B76835q5367q9637K29463k21619j62031m4407J891J49378K38560N5164r1307
12307B56923J169j2279k750n6922r6336P5885O0846j2270q3443m4714k61712j39192
12295c14795J38707J43678j7218N9423N43O951o4648R0883q409l0031M7085P1602
12283A23771m4606j76073j13386j09887Q729P5653J19047M152j43691p3089j7927
12272c47307K13745J04850o9860J01736j12797K8733p41J73722k31021n9624m689
12261b03253m169K09562J92787n865l1187j57199o1939j27760Q3334k259n0514
12250a58462k0423r4300k24065P8641M15262N9687j6972O1204J26867j16710r9662
$$ y = [-219174, -552, 146942, 65004, -99126, -164236, 41276, 52934, 121753, 360946, 276835, 191468, 101831, 331294, 109675, -52356, -96763, -94872, 54506, 293066, 348230, 256923, 258092, 245813, 243063, 186141, 89805, 165690, 226536, 214266, 130823, 86109, -175603, -314795, -176088, -32410, -49628, 9795, 10338, 17289, -47359, 43524, 35115, 5084, 52169, 123771, 79165, -96908, -210294, -320181, -311452, -235799, -116752, -112600, -256291, -329380, -347307, -133562, -28712, -98572, 3164, -109633, -80900, -81641, 92081, -138940, -198564, -203253, -207422, 2140, 194927, 189062, 157875, 676, -61263, -189023, -105689, -107948, -158462, -178885, -273185, -497250, -418609, -3347, 56340, 39368, 100572, 227439, 110729, 11067]
12239A1067j97459R144J87783J10614j09529K7342p4374m1615J04381J61434J67929
12228C56717J02627j00795j01219M6143j3003o8104j72762K41709J8519r4500
12218B15332O3091p2498O6196R8022l0944l3926R2085l3928j91484l74087P8500
12207a23641K9463j66271L5073K43675J35672j74434j20479L3821P6069o2558
12197i3610j46416L5586J00333L8800n2041k32025n6709m9492Q0998R5137J07262
12186a72177P4046N6044J74875K85979M4528k02873J22157J40137p9940P1379
12176E14155j4063n1736J8057n184l9595o4256P6713J00186J06045R7813j28931
12165F09204j72856n7928L0650k2469P5899J4931q975j63207J6527K12416L14354
$$ y = [11067, -186392, -177248, 10535, 121149, 11620, 38962, -35412, -77027, 27354, 188788, 356717, 459344, 358549, 257330, 303473, 290470, 222366, 49604, 291313, 309832, 215332, 278423, 205925, 272121, 370143, 339199, 305273, 397358, 363430, 171946, -202141, -123641, -94178, -260449, -225376, 18299, 153971, -20463, -140942, -107121, -31052, -93610, -240026, -204440, -104107, -65307, -117348, -349373, -406082, -455574, -374576, -279439, -172177, -98131, -42087, 132788, 418767, 463295, 260422, 382579, 522716, 442776, 514155, 500092, 448356, 466413, 461229, 421634, 357378, 434091, 534277, 640322, 738135, 609204, 436348, 378420, 409070, 386601, 462500, 477431, 468456, 305249, 321776, 534192, 848546]
12154H48546J37692P8045l5073p8733r0889j75985j63425r0526K2761L4009n8540
12143D27882O4021N114k07910K12965J16953k80013o7300J41816o1565L35985
12133F87948L07182Q6586k5328n9516K06457j0567j12389K2403K59885m7170n4963
12122A260528R05j27750r1436k08072j76927k01351J2605j07057q6159k50047
12112B5239J00990O0499k22936K0052J69581J03655o2657Q7309J59799N4425j22242
12101C73714N2050p7610k4605J67565o1406k25332k00680J13682K99335Q6434
12091E03147j20662K0144l7418j15006m535j81295Q3848K14603O1684k87030j83181
12080d5701Q454q8409r2548J14690o4062M3669J60829J47006q2656j25053k8062
$$ y = [848546, 986238, 1064283, 1029210, 950477, 859588, 683603, 520178, 429652, 452413, 486422, 427882, 491903, 497017, 289107, 502072, 619025, 339012, 271712, 413528, 351963, 687948, 995130, 1081716, 1056388, 996872, 1203329, 1192762, 1080373, 1102776, 1362661, 1315491, 1260528, 1261433, 1133683, 1042247, 834175, 657248, 455897, 468502, 361445, 275286, 25239, 126229, 186728, -36208, -16156, 153425, 257080, 194423, 281732, 441531, 495956, 373714, 425764, 348154, 323549, 491114, 429708, 204376, 3696, 117378, 416713, 503147, 382485, 402629, 365211, 250205, 245670, 64375, 148223, 362826, 424510, 137480, -45701, -37247, -125656, -218204, -103514, -167576, -123907, 36922, 183928, 101272, -23781, -51843]
12069e1843n8192l1168j25762O3222J74471N6235r3350o3279J7756J6258l3708
12058a29360j07143N187J70056p4821J92044L4194k89744o8715J19179J43431
12048e692Q5376R8874N5079O0748j27392k41263P1091m4291N872k4248j55773
12037b21619k1329K64492J81761j78951p3160j35813K5379K71150o4203r94J45870
12026A92583J99224j44976n6009K39269L0387r2592k35151O6242j2283n9780O037
12015A32951L3059L8892j52787j32810k11736J20329l4362K09678k962m6557j47631
12004a93936J69420j45249m1762R8760M5905n3082p5850L7671n657q6971J78052
11993g2699j01576J5081J34366J0320p9801k63214J33502J20021q952J83248j3161
$$ y = [-51843, -110035, -141203, -266965, -203743, -29272, 26963, -66387, -129666, -111910, -95652, -129360, -236503, -231316, -61260, -136081, 55963, 90157, -199587, -268302, -149123, -5692, 79684, 178558, 233637, 294385, 166993, -74270, -3179, -47470, -41598, -65846, -221619, -242948, 21544, 203305, 24354, -48806, -184619, -159240, 111910, 47707, 46713, 192583, 391807, 246831, 190822, 430091, 460478, 367886, 132735, 198977, 186694, 126914, 132951, 166010, 204902, 52115, -80695, -292431, -172102, -206464, 3214, 252, -46305, -193936, -24516, -169765, -211527, -112767, -66862, -119944, -195794, -158123, -163780, -250751, -72699, -174275, -159194, -24828, -14508, -94309, -357523, -224021, -104000, -112952, 70296, 57135]
11982E7135j72097j36586K53725J27832j43593J72124K27009P1266j20001m5474
11972B91340m2072j47718J6259j20978o5404L9030P9795j4482K9414r6264o6521
11961i7601j43187j67829K34829L35043m0792M4033Q1625j10476k48407j04312
11951b17074J14401J59101j11233K36237J73937r730j94406l82018n2307J87152
11941i5940Q1457R9517Q7283M2897j46401m7573K2070J6683K5714j59867O9891
11930d269K06629O653J18077m5565n4490j96583K1032M0946K2561j03153j23765
11919a11927L240Q8055P9410M8538Q993o504l9060q8936n5390k7875R5174k41109
11907b47391k72453J29084k6379J32736K37508m174j66630J13108J94697r782
$$ y = [57135, -114962, -251548, 2177, 130009, -13584, 158540, 385549, 456815, 336814, 291340, 249268, 101550, 117809, -3169, -68573, -29543, 50252, 35770, 65184, -31080, -97601, -240788, -408617, -173788, 161255, 120463, 164496, 246121, 135645, -112762, -217074, -102673, 56428, -54805, 181432, 355369, 345639, 151233, -230785, -283092, -95940, -14483, 85034, 172317, 215214, 68813, 21240, 43310, 59993, 85707, -74160, -4269, 202360, 209013, 327090, 281525, 227035, 30452, 51484, 92430, 114991, 11838, -111927, -108687, -20632, 58778, 107316, 116309, 109805, 70745, -18191, -73581, -101456, -6282, -247391, -519844, -390760, -417139, -284403, -46895, -51069, -217699, -104591, 90106, 80324]
11897H0324N908L8964Q7541n2206l3375R2871j93429j29155J63640k16878j72330
11886c28125k0103N5632J98615J33956J09613j0311J3518J34948n8603n437M174
11875B27877j28804q0172o5407j02525J34289N5027N6884M3707j84920m3307k0358
11864a07709N9991p0312j76448j81608J45466K71290K53438o101k59431M9111
11854b2313r8434O9682O8353J46327m1896j26781l88409j23512L87213K73854
11844A44084N639j85274k39474k26501K69904J76712L2114m8942M03978K51729
11834E83969j88534j33989p0740p2090j4218n6745p7455k5546k95886m0881K09737
11823a82378J20105Q1676J49152J04922k62805N166J54252l9600J19652M3724
$$ y = [80324, 86232, 125196, 212737, 160531, 127156, 220027, 26598, -102557, 61083, -155795, -328125, -348228, -292596, -93981, 39975, 149588, 139277, 152795, 287743, 229140, 223703, 227877, 99073, 18901, -46506, -149031, -14742, 40285, 97169, 140876, -44044, -87351, -107709, -47718, -118030, -294478, -476086, -330620, -59330, 194108, 188007, -71424, -22313, -120747, -51065, 17288, 163615, 121719, -5062, -393471, -516983, -129770, 144084, 149723, -35551, -275025, -501526, -231622, -54910, -22796, -71738, 332240, 583969, 395435, 261446, 190706, 118616, 104398, 47653, -29802, -55348, -351234, -392115, -182378, -62273, 19403, 168555, 273477, 10672, 15838, 170090, 130490, 250142, 293866]
11813B93866j54621j66630j64018M91K48667J17669J92498J30166l15986j38546
11803D3556K68138N8548J03675m0977j46448m1959J08411j9175k01018j07469
11793B5282o2056Q4117M3739j39499K1374J80393P6160j48620q6268l4892j54030
11782a94300j75379J23178J82015j11066Q2485J31113O8550k08987M658O4689
11772c3044O1957J43159J81266n9705j31624l8734q6661P5968l970N6199K28000
11761C92811J80214J36593j73205m43998k59217r3729P7042Q1864o9703J23591
11751d7737K74966j01347m7358j8393r4405J03085O3464j09195j88901M665p4953
11740b36109j47307N8815J8454K2237Q971R6794J39532K1880Q1320J15509m721
$$ y = [293866, 139245, -27385, -191403, -190912, 57755, 175424, 367922, 498088, 182102, 43556, 311694, 370242, 473917, 432940, 286492, 244533, 352944, 333769, 132751, 25282, -36774, 47343, 91082, -48417, -27043, 153350, 229510, 80890, -5378, -40270, -194300, -369679, -246501, -64486, -175552, -93067, 38046, 106596, -102391, -97733, -33044, 28913, 172072, 353338, 293633, 162009, 123275, 36614, 112582, 108612, 164811, 392811, 573025, 709618, 536413, 92415, -166802, -260531, -183489, -101625, -171328, -47737, 227229, 125882, 78524, 60131, -34274, 68811, 132275, 23080, -165821, -161156, -236109, -383416, -324601, -306147, -283910, -274939, -178145, -38613, -16733, 64587, 180096, 175375]
11729A75375m1582L2456k7978K0477L4907J82596O2892k72702k16080O345O0909
11718A7615J1907J03821K01087K2525j18698K1007K5053Q425K7790l58842j70919
11707b09229R8108J12278p6521l5998j90524R1431j27028p19N2810K52417J11046
11696G8071J2145o2620J18166J17156R4495r5972j8766n5849k94660n1621M55981
11685B96526J29272p5648k78607j2968Q7266L7332Q4730k6345j66709j49688J01189
11674B6350Q3047P6108m4749L4217P899j70605J02136J9930k7236J7648L9282
11663A64027j2747J91750j64486j67850k12429k0045K99834J41472k1520j70879
11653B7127j09511l9743k1407P2138O9943L9011M4983j47313j02470J05664J19002
$$ y = [175375, 133793, 166249, 138271, 158748, 193655, 376251, 439143, 166441, -49639, -43294, 17615, 29522, 133343, 334430, 356955, 238257, 259264, 284317, 292742, 320532, -38310, -209229, -111121, 1157, -75364, -111362, -301886, -210455, -337483, -338202, -285392, -32975, 78071, 90216, 27596, 145762, 262918, 357413, 261441, 242675, 186826, -107834, -159455, 296526, 425798, 350150, 71543, 58575, 145841, 183173, 267903, 241558, 74849, -74839, 26350, 109397, 185505, 140756, 174973, 182872, 12267, 114403, 134333, 107097, 124745, 164027, 151280, 343030, 178544, 10694, -201735, -221780, 78054, 219526, 198006, 27127, -82384, -122127, -143534, -71396, -1453, 37558, 82541, -64772, -167242, -61578, 57424]
11642E7424J601k13095q6081J44610K90196L686r6563q7184J37078P0477j04429
11631A17720k05003k7929k3605J02112N3746P0323L3974r7179K0802q3660j2539
11620e1238J96751J40408k98421O8941R5478J71825j13417j13108j08534L6253
11610B4938n1714K02405K43644j45023k41652l2318R1103O4685o399k18596j04684
11599a73611Q4411O6803m7693m7141J75606K08092J34507J0495o4503l6130j45737
11588A65099M1576n6766L3721j66684M9185J8841j51573j52049L701J00712N4145
11577f0092Q147J41143R7923k8360j8666l2597N080J14011K1371p8029k06603
11566c6672k18519O7550R1399p4168n9884M5784j6300o443J88372O6751N0330
$$ y = [57424, 59025, -154070, -240151, -95541, 194655, 198341, 101778, 14594, 151672, 222149, 117720, -87283, -115212, -138817, -36705, 17041, 87364, 121338, 24159, 44961, -38699, -51238, 145513, 285921, -12500, 56441, 151919, 323744, 210327, 97219, -11315, 24938, -26776, 175629, 419273, 274250, 32598, 280, 91383, 156068, 149669, -68927, -173611, -89200, -22397, -70090, -117231, 58375, 266467, 400974, 411469, 346966, 310836, 165099, 206675, 149909, 183630, 16946, 66131, 84972, -66601, -218650, -214949, -114237, -60092, -51945, 89198, 187121, 158761, 140095, 107498, 112578, 226589, 247960, 169931, -36672, -255191, -187641, -96242, -170410, -230294, -184510, -200810, -207253, -18881, 47870, 98200]
11555I8200J06394M3129n9391k96174n8903J20055J66769m9540j34570O7578J27292
11544A30839O9127o8787j13407n8324P1176J92088N2066j63077k10391j07170
11534b05860r8547J67098L24356j12579j3089J4010j42665k362J35114J9849R464
11523I4789j54465p7909J90834o4715j12724j48081q3679L66373K39603j50689
11513I9337o9199j08667K28680J74263m7876r5616j01726J84860r8818L0954L7982
11502B34174k49930j67034o7775J86344K00572P0842k48331l6634K32754J26099
11492B81081J21325j64659k76556j8783J74313k22025K49976q4093j53570o3560
11482a56551K9840J61433k2640J2551m8571o7282k24344K2510N1678n3434J40201
$$ y = [98200, 204594, 247723, 188332, -107842, -166745, -46690, 120079, 70539, -64031, 3547, 130839, 199966, 131179, 17772, -40552, 30624, 222712, 274778, 111701, -98690, -205860, -304407, -137309, 187047, 74468, 61379, 75389, -67276, -69638, 65476, 85325, 94789, -59676, -137585, 53249, -11466, -124190, -272271, -355950, 10423, 250026, 99337, 30138, -78529, 150151, 324414, 276538, 180922, 79196, 264056, 165238, 196192, 234174, -15756, -182790, -250565, -64221, 136351, 207193, -41138, -77772, 154982, 281081, 402406, 237747, -38809, -57592, 116721, -105304, 144672, 60579, -92991, -156551, -126711, 34722, 12082, 24633, -23938, -91220, -315564, -293054, -241376, -294810, -154609]
11471a54609J16427j02753k0331J96613J12323J64078Q331L0005M8348j77824
11461B20608j01444N0525k16186k58935O2115K57190K55956K28815n5271j33824
11451C09549j01711k7389m8728j05349P1190j8100k9658j3562k27353p6741K7971
11440b39881L24100J37718j5718m9921J45821r3939O489k9570N8704m5462j19486
11429G8855J61429p6668o3047j8680j42181j62420O3954J32101J0249j24491j05600
11418b46499k1618R9236R0159J20980J2176Q8104K22140K4059j50107r5601N2750
11407A95779k00860J30780o8157N006M1003M9353j48886N600P2354o994M6360
11396A21338J31078j42234n1053K79444K5663j26509o3785j97891k07271K03703
$$ y = [-154609, -38182, -140935, -161266, 35347, 147670, 311748, 320079, 350084, 398432, 220608, 119164, 169689, -46497, -305432, -243317, 13873, 269829, 498644, 443373, 309549, 207838, 180449, 131721, 26372, 97562, 79462, 49804, 36242, -191111, -267852, -239881, 84219, 221937, 206219, 156298, 302119, 208180, 214669, 185099, 243803, 198341, 78855, 240284, 163616, 100569, 81889, -60292, -222712, -158758, -26657, -16408, -140899, -246499, -268117, -168881, -78722, 42258, 54434, 142538, 364678, 388737, 238630, 143029, 195779, -5081, 125699, 57542, 62548, 103551, 152904, 4018, 9618, 81972, 74978, 121338, 252416, 110182, 59129, 338573, 364236, 237727, 173942, -23949, -231220, -27517]
11386b7517m3820j33380K3745J01623J22263l5890k24458P4957P7456K5853J0718
11375b8450n939J5369J05974K5432q3654q0117o3540l0481j01171l6498J62383
11364a20692Q7457q4759q7910q081K27162K19215N147j52278M9289p2475l08647
11353b46572n2738J49792J68407N5010j51009k45066l8339K06774Q1126m5592
11343a18207J04015K90320L8400J04636J26530k65515k5506k62K5617L5007p9494
11332B35541q987N5863J5175k25910j24897j6695l6855j24424J22062J54270J08169
11321A53312j72089o6573r8652J30121K16074J75314j169p1012l5785n8801L4608
11310B05348q6551j25075k31860M2102J26594J60353j58296q1056Q5517m5199
$$ y = [-27517, -71337, -204717, -180972, -79349, 42914, 7024, -217434, -142477, -65021, -39168, -28450, -34389, -19020, 86954, 112386, 28732, -51385, -114925, -145406, -246577, -283075, -120692, -33235, -117994, -205904, -213985, 13177, 232392, 237539, 85261, 134550, 62075, -246572, -299310, -149518, 18889, 73899, -77110, -322176, -360515, -153741, -72615, -118207, -14192, 276128, 314528, 419164, 545694, 280179, 254673, 254411, 280028, 315035, 235541, 226554, 282417, 297592, 71682, -53215, -69910, -106765, -231189, -109127, 45143, 153312, -18777, -85350, -184002, -53881, 162193, 337507, 336338, 265326, 229541, 170740, 205348, 118797, -6278, -238138, -196036, -69442, 90911, -67385, -148441, -62924, -108123]
11300a08123J05463m2909j17496O6791m7237P7607l0866M5367p571P9844K31592
11289B52462p8216o8548K28805J86176o4698k64178k30070L922j1113Q3230J08111
11278A45883Q0117n7406N7025J13676l69874p8248k1279J14082j0311q7107k19410
11267c32852o8010R112j04444K41618J5702j73438j20825J32120J83908m9531
11257b66640P6826j00491O1106P7311N9202j39409K7691K25595L5359P9019J49608
11246B85177j57585r4285L6982J87597L6054O8204j25882k88461p0493J90065
11236F7373N798P6498M2910r2742j23935j4527J81628J24055Q5035M1213l17755
11225G5551M542K15168m6941k01616P7256N0971p3880j18642N8901P9377K8648
$$ y = [-108123, -2660, -45569, -163065, -96274, -143511, -65904, -96770, -51403, -58974, 20870, 252462, 174246, 105698, 334503, 520679, 455981, 191803, -38267, -34345, -45458, 37772, 145883, 226000, 168594, 225619, 339295, -30579, -108827, -130106, -16024, -26335, -113442, -332852, -400862, -391750, -496194, -254576, -238874, -412312, -533137, -401017, -217109, -266640, -189814, -290305, -229199, -151888, -92686, -232095, -204404, 21191, 56550, 135569, 285177, 127592, 33307, 70289, 257886, 293940, 362144, 236262, -52199, -122692, 67373, 73171, 149669, 192579, 99837, -24098, -38625, 143003, 267058, 352093, 393306, 75551, 80093, 295261, 248320, 46704, 123960, 174931, 101051, -17591, 41310, 120687, 149335]
11214A49335j9639r1431N5299K5490q585l7036r1157K02159J9936N9401J39241
11203D03013j40910L730j81198q870k01628L10756J19945j41327J11330J36340
11193D11181l3272k25657K50940J14368j77544j39495o7547k55339k07340k341
11183c32046K14430J12893j4029m3859J0213R669j10739j8373J41206k6223j03456
11172a60314n0789M1953p837J23762J07756j14291k81827l28531L0058J98101
11162d41959o7231J2187K32294J61027J62006j4018j04750j27552J5104O1029
11152a11863P855l3529J59723J7073m7779J81707J87028j08052Q2833R1051O875
11141D32922k20502j97682l7222K22j57263R3502M5289O9688J29188j77478j0231
$$ y = [149335, 129696, 38265, 93564, 119054, 110469, 73433, -17724, 184435, 204371, 263772, 403013, 262103, 265833, 84635, 75765, -125863, 184893, 304838, 163511, 274841, 411181, 377909, 152252, 403192, 517560, 340016, 200521, 132974, -122365, -329705, -332046, -117616, -4723, -18752, -62611, -52398, -42729, -153468, -171841, -30635, -56858, -160314, -211103, -169150, -176987, -53225, 54531, -59760, -341587, -670118, -640060, -441959, -509190, -497003, -264709, -103682, 58324, 44306, -60444, -187996, -172892, -111863, -104008, -137537, 22186, 39259, -8520, 173187, 360215, 252163, 334996, 426047, 432922, 212420, 14738, -22484, -22262, -179525, -86023, -40734, 28954, 158142, -19336, -29567]
11130b9567k1844o5739j0777r0418K7548M5436K22726L02731q6904K2634O5461
11119C81287n9396L6409n1146n3579j6143p1477L1582Q6417k43733J20498j64
11108A60555k28787p4663K34746M9488j47788k24110J18906L7213K836m1072P2987
11097c9689R4543J46430m111J85597N9116k38602l5531m8488M9211J10560J10444
11086C89480N6635k44812m3128L2120O2495L7916K4194m8263k05414k02125n3117
11075a94019J22942L02113J80585P9969o0179j13766J6043J54051N9108j96896
11065C49951J68679J83679k23988k99890L7385L01406J97261m9145l5717m0355
11055E89266L0265j07241p0817J483o2463k23470Q3453L1398J59529J24146J31996
$$ y = [-29567, -51411, -117150, -127927, -218345, -190797, -145361, 77365, 380096, 293192, 315826, 381287, 321891, 358300, 307154, 253575, 237432, 165955, 197537, 283954, 40221, 160719, 160555, -68232, -142895, 91851, 141339, -6449, -230559, -111653, -74440, -71604, -112676, -39689, 54854, 201284, 197173, 382770, 441886, 203284, 167753, 119265, 168476, 279036, 389480, 446115, 201303, 158175, 190295, 252790, 290706, 314900, 266637, 61223, -140902, -194019, -71077, 231036, 411621, 491590, 431411, 317645, 333688, 487739, 546847, 349951, 518630, 702309, 478321, 178431, 215816, 517222, 714483, 665338, 629621, 589266, 619531, 512290, 441473, 442956, 380493, 157023, 240476, 271874, 431403, 555549, 687545]
11044F87545j77460l21852l50321j1720K45736M874m0128o1573j7533M7893J8025
11033B3486O3395J00633J60786o5282j59210p9240R4581l6779j44296q0392R8289
11022b4029O9903P5586k6210R4195O2249K52730K55157N2645Q0132R9308n2788
11011I38878J25268K87623O15195P35235O26059J36202o1467l31546n85051p46499
11001A739897k66509Q1151n2347l16271j38797k04298m9965j25754K1031O5922
10991G54060q0229J9787Q4210O8886J84463j73517k58926l2949k24242K734J84771
10980E29048J20601j60361j18760M6991m3183P662O8290J31205q8976j72585J85302
10969E05234O1013J18287q9921j81527O514N8166J62896r8465k04382J75349K62141
$$ y = [687545, 510085, 188233, -162088, -173808, 71928, 76802, 36674, -24899, -42432, 5461, 23486, 86881, 187514, 348300, 283018, 123808, 44568, 139149, 102370, -41926, -122318, -24029, 45874, 121460, 95250, 189445, 251694, 504424, 759581, 812226, 892358, 991666, 938878, 1064146, 1351769, 1966964, 2702199, 3328258, 3464460, 3402993, 3071447, 2486396, 1739897, 1473388, 1554539, 1502192, 1185921, 1047124, 842826, 792861, 667107, 688138, 754060, 673831, 693618, 777828, 846714, 1031177, 857660, 598734, 565785, 341543, 344277, 529048, 649649, 489288, 370528, 417519, 374336, 381998, 450288, 581493, 492517, 319932, 505234, 566247, 684534, 594613, 413086, 419600, 477766, 640662, 542197, 337815, 513164, 775305]
10958G75305q1224j11371K69793J695j777p8426r2647O6751j22351j5002k5705
10947E85041k5687m2265j57018J14605J00415J62472J13055N5928j72829l65432
10937C68285j38842j0877L7980J62722J22662J1901J89695J21730k91824K46984
10927H20416K48842j80155k01611o2035j45056J00337Q3479J06751k53208j97694
10917C20066J16693R6955P1309J57327J01163J09521j08115k16358R4912m522
10907G38951l90953l44738j24838n7015M9340P5452p5970K13840J30644q3373
10897A31340k14756L2913o5323j40790O036J7871j22819J76396J86032J60404
10887A67304j4218n8571j70198M9051R2234K7646Q4330j18368M77J26116J3470
$$ y = [775305, 694081, 582710, 852503, 854198, 852421, 773995, 681348, 748099, 625748, 610746, 585041, 559354, 517089, 360071, 474676, 575091, 737563, 850618, 906546, 733717, 368285, 229443, 218566, 256546, 419268, 541930, 553831, 743526, 865256, 573432, 820416, 1069258, 889103, 687492, 625457, 480401, 580738, 664217, 770968, 517760, 320066, 436759, 533714, 605023, 762350, 863513, 973034, 864919, 648561, 743473, 738951, 347998, 3260, -121578, -178593, -129253, -53801, -129771, 84069, 214713, 131340, -83416, -50503, -115826, -256616, -250580, -232709, -355528, -179132, 6900, 167304, 153086, 94515, -75683, -26632, 65602, 93248, 177578, 59210, 59687, 185803, 199273]
10876A99273p2075n2452l4829M1910K9772o6413l2167j32702J71323M23K7029
10865G9092j2579K19588l9171k16562j26375J50964P4728J07342J60878k4967
10855C72938k9435p6369j42046J34683L60283K09463j0387n0018o3107j19197
10845E86808j54552l72122o9078J36702J67947J9049Q1276n4465j20297K75276
10835D96544M5466k8934k01026j20914k3762j14160m4178l996O3652N4606N2496
10824A75794r7398N8862l270J2308J72711L8829j33358N8822K3157N0947j27628
10813B29776o1524L1050l9365R7184O1227k4999p6273j84847k9012K4593J3754
10802D1564J54242L5776k950o011o2868J41503o0424j9540r0513l1229N8969M3366
$$ y = [199273, 127198, 74746, 39917, 81827, 111599, 45186, 13019, -119683, 51640, 52063, 79092, 66513, 286101, 246930, 30368, -96007, 54957, 129685, 237027, 397905, 372938, 343503, 267134, 125088, 259771, 620054, 829517, 819130, 769112, 706005, 586808, 432256, 60134, -8944, 127758, 295705, 314754, 396030, 341565, 221268, 496544, 542010, 513076, 312050, 191136, 167374, 53214, 9036, 5040, 68692, 123298, 175794, 78396, 137258, 133988, 146296, 319007, 357836, 224478, 283300, 306457, 357404, 229776, 168252, 199302, 159937, 257121, 318348, 293349, 217076, 32229, 3217, 27810, 41564, 195806, 231582, 228632, 222621, 159753, 301256, 240832, 221292, 130779, 99550, 158519, 201885]
10790B01885L7467J1232M2910P1508m0165k31415o5943q0419j82234R5899J89054
10779D9779P8914q7266P4153K89965J00549J02243q8304j03810j04443k51758
10769F0022J5713J52899Q8210J21566O0339l8338P1410p7968j0899j18446Q3347
10758D07855p0383o2310R641J67793J41653Q8740m4474j79373j71208n1417q8131
10747A48386j42342j33636J54931J24463m7804m6882k22167M1392J67532o750
10737C7123K7262q1036P7811L06576N6148j61982O546o6462K65981j9219J38199
10726E86947P2413o7042J79540l282M3154q8611o8919o4981Q559L49302L09927
10715A257007k7536j58674j78806j25807j47351k39348J05638J63767J83384N5043
$$ y = [201885, 239352, 250584, 293494, 365002, 324837, 93422, 27479, -52940, -235174, -139275, 49779, 128693, 41427, 115580, 405545, 506094, 608337, 520033, 416223, 311780, 60022, 75735, 228634, 316844, 438410, 498749, 460411, 531821, 453853, 442954, 324508, 407855, 337472, 275162, 284803, 452596, 594249, 682989, 638515, 459142, 287934, 236517, 148386, 6044, -127592, 27339, 151802, 103998, 57116, -165051, -123659, 43873, 37123, 64385, -16651, 61160, 367736, 423884, 261902, 268448, 201986, 467967, 448748, 586947, 659360, 592318, 771858, 768576, 811730, 723119, 654200, 589219, 597778, 947080, 1257007, 1229471, 1070797, 891991, 766184, 618833, 379485, 485123, 648890, 832274, 887317]
10705H87317k347J27358J3057n4226J54961J40280k5463l89318k96575L5393L30925
10694I21362J3832j27159j98117K62622K4572j88476o0760l2012L9517M07262
10684A062643L85804j48772j19139J01495o7163j8511L4268L514r4336N2603p0749
10673A121657k53267P0744J77356K3095j54058J16505l6491p0459M9821L3039
10663A077942J24046R7512j12652K11986K4781k33474J01485J45570Q6071J61993
10653A685260J66885K44560R4681L5615J30792j20981l5796K13552J80936q7846
10643B507658l42903j29463K44427L14688J94340J32798L63593K00448L3865K63697
10633C783148K75193L28417J77717J12043J06984J79613N28558M80377K99137
$$ y = [887317, 884970, 1012328, 1025385, 971159, 1126120, 1266400, 1240937, 851619, 555044, 590437, 921362, 935194, 808035, 609918, 872540, 897112, 708636, 647876, 615864, 655381, 1062643, 1448447, 1299675, 1180536, 1282031, 1214868, 1196357, 1230625, 1234139, 1139803, 1192406, 1121657, 868390, 939134, 1116490, 1139585, 985527, 1102032, 1065541, 995082, 1044903, 1077942, 1201988, 1299500, 1186848, 1398834, 1423615, 1190141, 1291626, 1437196, 1523267, 1685260, 1852145, 2096705, 2191386, 2227001, 2357793, 2236812, 2201016, 2414568, 2595504, 2507658, 2164755, 2035292, 2279719, 2594407, 2788747, 2921545, 3285138, 3485586, 3519451, 3783148, 4058341, 4386758, 4564475, 4676518, 4783502, 4963115, 5491673, 5972050, 6271187]
10624F271187K49959O57432P72406R29542J100073J032583Q01164Q17978N92688
10615A3225012O36744Q21144J181826J611730K075282K543625L175476M274688
10607B9545527N824055Q133451J1288682J6349318K4866610L8822270N8314178
10600A93144091P9981953R5517379R5604959P6944041L3286360q682209l9216669
10593E26579905q5997476j16981701q5231515m7446629l0360541k4801527k2337427
10586A13423089j8831631j4442620j1099003q705487o788561m891080l744349
10579D4920358l343713k866542k162246j792560j678141j409898j412014j851284
10571B8403960k139747k321405k430305k442464k250340j640020j220616j364690
$$ y = [6271187, 6521146, 7178578, 7950984, 8880526, 9980599, 11013182, 11814346, 12632324, 13225012, 13861756, 14682900, 15864726, 17476456, 19551738, 22095363, 25270839, 29545527, 35369582, 43503033, 54791715, 71141033, 96007643, 134829913, 193144091, 273126044, 368643423, 464248382, 541192423, 574478783, 565796574, 526579905, 440582429, 323600728, 238369213, 190922584, 160562043, 135760516, 113423089, 94591458, 80148838, 69049835, 60344348, 53555787, 48664707, 44920358, 41576645, 38710103, 36547857, 34755297, 33077156, 31667258, 30255244, 28403960, 26264213, 23942808, 21512503, 19070039, 16819699, 15179679, 13959063, 12594373]
10563A2594373j404069j272133r63764q81583m39494m61629n84642m53157k53263
10554E880639j73146j11089r7491r0723N567m3908l434O495L0444J55134k02549
10543E355939k12503m76087n03084k87821k32271j07400j09466k62640j85426
10534B979241m9697L2924j03005j72876l38926l74221K9647N8007J99500K3903
10524B284497j14665j0047R2177J38315r2631j02818j5200K33934P13165N46474
10514C673201J94057J02141j33574k27258l93164o49898l32923k66067j84624
10505A781891j73285q8977j75370k39702n4441r6120n8451R2036p5280q7277r8772
10494G26252m7730P651J43002p0290j90765k6485o9821j54511o2738k7955k1425
$$ y = [12594373, 11190304, 9918171, 8954407, 8072824, 7633330, 7171701, 6587059, 6133902, 5880639, 5707493, 5596404, 5498913, 5408190, 5413757, 5369849, 5366415, 5372910, 5403354, 5558488, 5355939, 5143436, 4667349, 4164265, 3876444, 3644173, 3536773, 3427307, 3164667, 2979241, 2929544, 2962468, 2859463, 2686587, 2347661, 1973440, 2003087, 2061094, 2260594, 2284497, 2169832, 2159785, 2251962, 2390277, 2297646, 2194828, 2179628, 2413562, 3126727, 3673201, 3867258, 3969399, 3835825, 3608567, 3215403, 2565505, 2232582, 1966515, 1781891, 1608606, 1519629, 1344259, 1104557, 1050116, 953996, 895545, 987581, 912301, 825024, 726252, 678522, 686173, 829175, 758885, 568120, 541635, 471814, 317303, 254565, 226610, 205185]
10483B05185j304J40256J55775N0922k17047k86706n624J19847j20193K10727
10473B51838J60934j25867j16109J051L86711K15192j44421m1386J55844r5365
10463F48422Lj01374j41849J64042J013o4753m87j15919K8559J37369J04260n2964
10451F06322k10152J32719K13177L730R138k77424k0570r6156P7058L2937J80924
10440F51703j75514j60092j32322k53287O7777K48478J01509o6640q4063O7407
10430B64956O0233j31254j50077K25329L7545j27083Q2232n916k53767L0060R9266
10419A31524j5560J5726q3396r9118L6378o1534O1468m6630j69339o0015Q7445
10408b03051K90694K6759q82J3584o5435n0597p0981O0942J03978k951m9253j6749
$$ y = [205185, 203881, 344137, 499912, 550834, 333787, 47081, 41457, 161304, 41111, 251838, 412772, 286905, 170796, 171847, 558558, 773750, 629329, 587943, 743787, 648422, 648425, 547051, 405202, 569244, 570257, 505504, 505017, 389098, 417657, 555026, 659286, 606322, 396170, 528889, 742066, 745796, 754934, 477510, 456940, 360784, 437842, 470779, 651703, 476189, 316097, 183775, -69512, -1735, 246743, 348252, 281612, 197549, 264956, 325189, 193935, 43858, 269187, 306732, 179649, 261881, 255965, 2198, 32258, 131524, 115964, 131690, 48294, -50824, -14446, -75980, -14512, -61142, -230481, -290496, -203051, 87643, 114402, 113520, 127104, 61669, 11072, -59909, 1033, 105011, 102060, 52807, 36058]
10396C6058R3436l8040K70169k1955l2107k0635j01249k6175m3467O2862P3770
10385B52667R3072j08556j24451j34193r9131o475L09302m9558k14299k6003L0506
10374g7119j99486K0412J16421j82170o3666p46J09362O5566p4478J50229K10394
10363G4719j63228k30469j95728R6637K64778J3936k04740J61156Q1409l5412
10353a36942j00266k55J62911j0689J4981k1133M6162R0212j0221M7669K4485
10342A06914k11351m2024J40465P0256j44213J48862J88156R9669p4798j08535
10332A73401L9368m7436j1670p2499L7255J2174o940l2316K44451j00615k84723
10321d9550k78260J09840J06424K73312N8012l3502J19191J16128J16328p3077
$$ y = [36058, 129494, 91454, 361623, 339668, 307561, 286926, 185677, 159502, 116035, 178897, 252667, 345739, 237183, 112732, -21461, -120592, -127067, 182235, 132677, -81622, -107625, -77119, -276605, -256193, -139772, -321942, -385608, -386354, -276992, -211426, -285904, -135675, 74719, -88509, -318978, -514706, -418069, -153291, -139355, -344095, -182939, -101530, -136942, -237208, -237463, -74552, -85241, -70260, -91393, -45231, 44981, 34760, 82429, 106914, -104437, -146461, -5996, 64260, -79953, 68909, 257065, 356734, 281936, 173401, 212769, 165333, 153663, 81164, 118419, 130593, 123653, 91337, 335788, 235173, -49550, -327810, -217970, -111546, 161766, 219778, 186276, 305467, 421595, 537923, 464846]
10311D64846k22838j32208O8629J73047J5789N2303j31741k9302j46060j87944
10301g5479p5397J90606J26237P8532l0065K11598R1909P7424k07067J18778Q9069
10290E96145n9697J01155O0485k7966q163l58435j79706m7698m5655k19702Q4041
10279a05196P2428R5413J6586o8624J0378j42455j34168K03522j44140j59114
10269c55370J4044K37620J5494l8430J5160K14239p7716j28475Q587P035L1453
10258e6359N0961j38648o3959R4633R621R9603J24202j27776k16807p3849M9269
10247b49109l0635P2886J29358R4039n5985o1500J05944K73614o9353m62366k28522
10236d81629K55765L68842N4515j14894Q941j7634k1786m445q5634m8733J87502
$$ y = [464846, 242008, 109800, 178429, 351476, 367265, 419568, 287827, 258525, 112465, -75479, -150876, 39730, 165967, 244499, 214434, 426032, 517941, 595365, 388298, 507076, 596145, 536448, 637603, 698088, 670122, 661959, 303524, 123818, 76120, 30465, -189237, -105196, -32768, 62645, 79231, 10607, 20985, -121470, -255638, -52116, -196256, -355370, -341326, -103706, -88212, -126642, -111482, 102757, 25041, -103434, -94847, -87812, -56359, -5398, -144046, -208005, -113372, -103751, -4148, 120054, -7722, -224529, -298378, -249109, -279744, -206858, -77500, 16539, -39446, -100946, 4998, 278612, 209259, -253107, -481629, -225864, 142978, 197493, 82599, 91540, 73906, 52120, 47675, -37959, -86692, 100810]
10225A00810J82853J12643l00388r997M9454J73544Q178j33088o3001Q0989o209
10214A95788P9611p4139r2595J76818L1816J32052k4178l35501N619J987m0441
10203E6837m5358j08391q9945q378J12995l5072Q8851j39869J84088r3701r6967
10192a74910J32721Q4896L7951O3913J21290J12149K03560M82900O70776N74306
10182B309552K86592M61922L58934k41509m59240p17241n77068m45332l31942
10173F44668j92315j43354k82745l66654R980K87823N6031J90997o1915r8474
10163D4042k33601k0563J57270K76678M4500j83636J0141p8469j94254j5682l7853
10152b31427J56590J83481o7355j10748k3269o1101r7463J77271L7177J405j2624
$$ y = [100810, 283663, 396306, 95918, 85921, 135375, 308919, 317097, 184009, 121008, 201997, 195788, 275399, 201260, 108665, 285483, 317299, 449351, 425173, 89672, 95291, 97278, 56837, 11479, -96912, -186857, -195235, -82240, -117312, -28461, -168330, 15758, -77943, -174910, -42189, 42707, 80658, 144571, 265861, 378010, 581570, 1064470, 1735246, 2309552, 2596144, 3058066, 3417000, 3175491, 2716251, 1999010, 1421942, 976610, 644668, 452353, 308999, 26254, -340400, -330420, -42597, 13434, 204431, 142516, 44042, -189559, -210122, -52852, 223826, 268326, 84690, 94831, 16362, -177892, -193574, -231427, -74837, 108644, 41289, -69459, -92728, -153829, -251292, -74021, -36844, -35439, -48063]
10141d8063O1827J03506q328M2215j23516K6772j7501j05358n7284M6859O3209
10130a5662j30898m2764j13909N4474K66249J04342q5433K1382N1960j04315j13192
10119a07766J4861O8877l4784o8518j34419q478J35013J06088K32631l292J2554
10108B12767M9073O6866j76405j90840J7058R2997J02357k6108O9083j80633K11193
10097B47408K12313k57349j16484q7965j62037r942J47251O9551j46942M4428
10087e9768P4062l30J00562j56724j53556L49057L5407m1034K120j73410k22172
10076b45786J19819J52663J15886O1411J74809j08618J81873J7986k42590j1581
10066B15872O4665n1785o2528l4162J96442j33898J05376K75046J87295L84061
$$ y = [-48063, 13764, 117270, 108942, 151157, 27641, 54413, 36912, -68446, -125730, -78871, -15662, -146560, -189324, -303233, -248759, 17490, 121832, 36399, 57781, 109741, 5426, -107766, -92905, -24028, -58812, -127330, -261749, -270227, -135214, -29126, 203505, 200213, 212767, 261840, 328706, 152301, -38539, -21481, 71516, 173873, 147765, 216848, 36215, 247408, 459721, 202372, 85888, -2077, -164114, -174056, -26805, 42746, -104196, -59768, 14294, 13964, 114526, -42198, -195754, 153303, 188710, 147676, 149796, -23614, -245786, -125967, 26696, 142582, 203993, 378802, 270184, 452057, 470043, 227453, 215872, 280537, 228752, 166224, 132062, 328504, 194606, 299982, 575028, 762323, 1146384]
10056A146384K48504K44846K68455J43612k20771j39478l07787n27654q5052k08177
10046E62882l40056j36707J11058q3686j15941j89867j6807Q6139J61552Q3750
10036A22317M8956J60194n2705j46847j64453j02212L8257l1943O091J82301J25430
10025A85386O6255K1635n8041q5703l1911l20260j32051K42506J72114j46805
10015h6875o4074r7376o8509l5762O846K69365J227k28536r6816K37507J14926
10004d8077J08030R7586l9432l7379O6371M1574j39966k69818p1026l301J1836
9993b83602J11231M1989o8407q5701o5238J26537j59727k12563K54297R7132K46743
9982B691K20535j42946j82262q5556J88472K15692r172p8342p9694R9209k78552
$$ y = [1146384, 1394888, 1639734, 1908189, 2051801, 1831030, 1691552, 1383765, 856111, 771059, 562882, 222826, 86119, 197177, 113491, -2450, -192317, -209124, -122985, 38567, 122317, 171273, 331467, 278762, 131915, -32538, -134750, -96493, -128436, -122345, 59956, 185386, 251641, 273276, 215235, 129532, 97621, -222639, -354690, -112184, 59930, -86875, -150949, -248325, -316834, -352596, -345750, -76385, -75158, -303694, -400510, -163003, -48077, 59953, 157539, 118107, 80728, 147099, 188673, 48707, -221111, -292137, -295438, -283602, -172371, -130382, -198789, -284490, -349728, -223191, -382918, -595481, -341184, -244052, 2691, 223226, 80280, -101982, -187538, 934, 216626, 207454, 129112, 49418, 148627, -129925]
9971a29925j80927J89572J63179J82546Q3640k60645j31416O9521L387J96422
9961A85354o2842j05807q1771L9526o5035j71R6897M6352n8055L15933K97247
9950F07628p963k79240j99322k2662j90149M0818R638J8969N875j07185o345r2242
9938b22180L1024Q0696o8000M5952k7579R9519j05530o492j29853J5971J43310
9927a43162k3213j13330m7255o0960O3685J91996J97028j50399k14480k4239o6088
9916c90417J25743J2077k25997P8829K98476J4307k5976N4664R1699j06966k3692
9905i7253l9890J31472N835q9585J02509p7582l6303m8481J5027l613o7545J75520
9893b9889m5266j67929n4489J08218K09913O4488j39692l1340j4340L1903j29594
$$ y = [-129925, -310852, -121280, 41899, 224445, 308085, 47440, -83976, -14455, -11068, 185354, 122512, 16705, -65066, -25540, -90575, -90746, 6151, 52503, -5552, 310381, 607628, 599665, 320425, 121103, 98441, -91708, -50890, -41252, -22283, -16408, -123593, -129938, -222180, -191156, -110460, -178460, -132508, -160087, -60568, -166098, -172590, -302443, -286472, -143162, -166375, -279705, -326960, -387920, -324235, -132239, 64789, -85610, -300090, -324329, -390417, -264674, -252597, -478594, -399765, -101289, -86982, -112958, -58294, 33405, -73561, -97253, -137143, -5671, 164, -89421, 13088, -64494, -100797, -149278, -134251, -137864, -205409, -29889, -75155, -243084, -297573, -189355, 20558, 85046, -54646, -85986, -100326, -68423, -198017]
9882a98017k37629j67067O2270O7558J12268J57145J92434r4403o0473O1076j04652
9871b09490J8713n7787o4558j51L4575J94051j5787M4063K04943J04351o2977
9860A89946k63454K5385L10033q7046l9497L34117k42181k26349K113q0699J42765
9849F5133j2879j40031J01731K45737J59717j08427k45569k10024o0958q9237
9839b94807l4315J13430K77395P9184l5107K399l669J1943R3315p0506l3876P8234
9827A83620K439r4535j49747J87693l443j26678r7711J00432J58133J87184j62066
9816A85321j27841O5433j6969O9105J909j19118j92514k89837J75129J46985J457
9805a00940L0817J2981M7900p7831j3419L3255Q1592j31764j25740Q4285q710
$$ y = [-198017, -435646, -602713, -540443, -472885, -360617, -203472, -11038, -105441, -165914, -104838, -209490, -190777, -248564, -313122, -313273, -278698, -84647, -100434, -56371, 148572, 252923, 189946, -73508, -48123, 261910, 174864, 135367, 469484, 227303, 954, 3067, -77632, 65133, 52254, -87777, 13954, 259691, 419408, 310981, 65412, -144612, -205570, -294807, -329122, -215692, 61703, 140887, 105780, 108179, 104510, 116453, 209768, 139262, 105386, 183620, 186059, 91524, -58223, 129470, 126027, -651, -98362, 2070, 160203, 347387, 185321, 57480, 122913, 105944, 175049, 176958, 57840, -134674, -424511, -249382, -102397, -100940, -70123, -57142, -9242, -87073, -100492, -67237, 14355, -117409, -243149, -158864, -167574]
9794a67574M89j06761l4026J83761q3193J23803J15388O4574L0216j15902j15065
9783a04290O7312O5137M7991j90369j11193R4866J54083j85833k22123L05353
9773g9066J27559K06150J10122k31324j49082J83085m9988R182j3339l49511J26254
9762a09958J42787Q8480J26163M8437l5476j02557j67554j3395J10332j36728
9752d9469j25576M1901L0164q445l695r1645j904r0678p5921k928K94761m4849
9740a28284l2822r6859N6315j3430J96001Q5977j38624k9733p3045p1953Q1219
9729a65238Q3441J16610o9738J48784K91807k16967r7814j19170R4344n5403k04140
9718a93484P2843Q0214R26N3712P8383O6768k68801j86190P7007J12615J05698
$$ y = [-167574, -167085, -273846, -307872, -124111, -207304, -83501, 31887, 96461, 126677, 10775, -104290, -36978, 28159, 76150, -114219, -225412, -130546, 23537, -162296, -384419, -79066, 48493, 254643, 364765, 133441, -15641, 167444, 117456, 126638, 113299, -236212, -109958, 32829, 121309, 247472, 295909, 260433, 157876, -9678, -23073, 87259, -49469, -175045, -133144, -102980, -111425, -115120, -206765, -208669, -299347, -375268, -378196, -83435, -128284, -161106, -257965, -201650, -215080, -19079, 66898, -71726, -101459, -174504, -246457, -165238, -81797, 34813, -34925, 113859, 405666, 188699, 90885, -28285, 66059, 10656, -193484, -120641, -40427, -39501, 14211, 92594, 159362, -109439, -295629, -218622, -106007, -309]
9707c09J10222k22279o2998j00007Q1432J22662j41877n1129P8182J97540K03863
9696B15302q2131k3433J57806M5288m9722j45024n6269O0779R007r9274o248J72070
9684A98151K2430K5757Q5587j13130R8095Q9867j02964j78426j28738l2061J28132
9673I2700P2306j04325K3060k0741J9350j01528n9592k2411R4187M1209J57220
9662A91435m5758k26148j87887p6515L29726R9754k01451m2382n0856r5068j13959
9651d19109L9854q6179J79463J37306k3021k1306N3926K98797J8951m9477k42009
9640a12804k2333O0933j29188J81104k8735o1290J40202N6666K873L3526j87503
9629f6549j54242O7434m1238j84600J9732K3517P7121p9799p6988m6863r5739
$$ y = [-309, 109913, -112366, -175364, -275371, -193939, -71277, -213154, -264283, -186101, 11439, 215302, 133171, 109738, 267544, 312832, 263110, 118086, 61817, 122596, 131603, 32329, 26081, 198151, 220581, 246338, 331925, 218795, 316890, 406757, 303793, 125367, -3371, -35432, 92700, 165006, 60681, 83741, 63000, 82350, -19178, -78770, -101181, -6994, 34215, 191435, 145677, -80471, -268358, -344873, -15147, 84607, -116844, -159226, -210082, -305150, -419109, -379255, -465434, -285971, -148665, -171686, -192992, -139066, 159731, 178682, 129205, -112804, -135137, -74204, -203392, -22288, -51023, -112313, 27889, 84555, 87428, 120954, -66549, -220791, -153357, -194595, -379195, -359463, -335946, -258825, -338624, -415612, -462475, -558214]
9618e58214M938L22467J31528k3487k33192J73409J26078r8220j08912N4040j1309
9607b20874k34619J8084M00870L6792O9258J63608O3535m5097o2422J36212K4214
9596C49561m6972j46937j27156N3956J08339m1573j77444j69541m8683O9244J87918
9585A0712J38618j8299l6423K7865J7222K6646q0l1836r2205k59984k37816M1174
9573d14406K37497K03648j43503P3661K744K47636P8123m8844j38962p4982j6509
9562F103J97611P2522O1773n0224j13304k5546P1090j8043j04263L8598K31746
9551C68063n2096K289j68207j46936M2431J92099n2007j19952j42530J19361k8604
9540A3911j6593j72376r8344K47459J12657l1033K52820j33854l05523p712J85046
$$ y = [-558214, -553276, -230809, -99281, -122768, -355960, -182551, -56473, -154693, -263605, -209565, -220874, -455493, -437409, -36539, 253, 69511, 233119, 296654, 251557, 189135, 325347, 349561, 302589, 155652, 28496, 82452, 190791, 149218, -28226, -197767, -246450, -177206, 10712, 149330, 131031, 94608, 122473, 139695, 166341, 166261, 134425, 42220, -217764, -455580, -414406, -176909, 26739, -116764, -43103, -40359, 207277, 285400, 236556, 97594, 22612, 6103, 203714, 276236, 338009, 287785, 174481, 148935, 220025, 201982, 97719, 136317, 368063, 315967, 318256, 150049, 3113, 45544, 237643, 185636, 65684, -76846, 42515, 13911, -2682, -175058, -273402, -25943, 86714, 55681, 308501, 174647, -130876, -138588, 46458]
9529D6458O4394m5880J66421Q8623j44904j8761j85215r2622L05366J50571o4504
9518B69947k84018j40130N297K17080Q6023L02419j08308j94055J42602L6103
9508C32960q2090P3292r7169j69589m280N1527k617j19339p5522K7934K12863
9497A47970K26702r9384m4043o6102O136J22301j7785Q9550m7031k78143M8926
9486H9097O5595m4606k31459j52377J61752R2399J79390r6791j22786J76654L18238
9475D35106n706k91706j04715P7051o2473p9277k1443J30533K26455j131j3115
9464B89579p3909M6418J1813M5763j70230j14062O2016J3734K2246L7501Q8424
9453B59293J54303j211m5284Q9839M1206n5569l72030k65724J80609K70442J22624
$$ y = [46458, 110852, 64972, 231393, 320016, 175112, 156351, -28864, -121486, 183880, 334451, 269947, -14071, -154201, -148904, 68176, 154199, 456618, 348310, 154255, 296857, 332960, 250870, 324162, 226993, 57404, 53124, 104651, 102034, -17305, -92827, -64893, 147970, 374672, 275288, 231245, 165143, 171279, 293580, 275795, 365345, 318314, 40171, 89097, 154692, 110086, -121373, -273750, -111998, -19599, 159791, 63000, -59786, 116868, 435106, 429400, 137694, 32979, 110030, 47557, -31720, -53163, 77370, 303825, 302694, 289579, 215670, 262088, 273901, 319664, 149434, 35372, 97388, 111122, 133368, 170869, 259293, 413596, 412385, 367101, 456940, 498146, 442577, 70547, -195177, -14568, 255874, 378498]
9442C78498N7951M6078L8710k55174m93234j55617R0538O3152J06559K61203j921
9431A36743q4886J46081j53482r3598j80365p190o5394p5866j2091N9693L92136
9420F1781J49150n8688o9725N1356o0337l7779m3102J45332j3825j20514K0619
9409B4268L6238l0367k24345q4800K7997L66164k0975j19432p9766J64532O5728
9398A25242J02369j83179j18656k50202N8067J30451P5162M9211k14234k4399
9388b50168M4240q00k6056P6089m1180R5674J7629R7175j08251q1327J17009Q4780
9376B4814j680J7746J811j04397o0874O2429K74786j24994j89076Q4323j00555
9365a15667J2440O9107j69805k7199L18847K76195j93923o0280J38175J10485
$$ y = [378498, 436449, 482527, 521237, 266063, -227171, -382788, -292250, -229098, -122539, 138664, 136743, 51857, 197938, 44456, -49142, -229507, -236697, -302091, -377957, -390048, -330355, 61781, 210931, 152243, 82518, 133874, 73537, 35758, -7344, 137988, 124163, 3649, 24268, 60506, 30139, -194206, -279006, -251009, 115155, 94180, -25252, -105018, 59514, 125242, 227611, 44432, -74224, -324426, -266359, -135908, -60746, -11535, -225769, -250168, -205928, -206728, -232784, -156695, -197875, -102201, -84572, 12603, -95648, -176975, -59966, 24814, 23134, 40880, 42691, -61706, -122580, -60151, 214635, 89641, -99435, -15112, -115667, -103227, -34120, -203925, -231124, 87723, 363918, 169995, 109715, 247890, 358375]
9355C58375p8056N0514k4553l72655o8360J46059K03094L6129k6018r5669j78855
9344d9995K69761J30973J79837P2772k65538j57992O6788J11582p4419L4627J5246
9333C33642m1956j36659j8777J14160Q950J36212j21220k31697J68550n4769o3510
9322I2926L4816N8764k5826M0612N1280p1939K2929M7583j7643r0054J8554k7215
9310A34787J5309J83643k13026k13954j51812J55786M4986J98143o465O9768M7328
9299B64493j40013r5453J91087J89091j30408j37913j27279J84037J15298j03128
9289B09812k8453J55476R4661M300q6551M7964P6p6958N2195r6772m3223l08367
9277g5840o5119L1141N9570Q7379j25439l014J35469J12874m4242k59780M2749
$$ y = [358375, 280319, 330833, 306280, -66375, -134735, 11324, 214418, 250547, 224529, 128860, -49995, 219766, 350739, 530576, 603348, 337810, 179818, 246606, 358188, 283769, 318396, 333642, 291686, 155027, 136250, 250410, 259360, 395572, 274352, 42655, 211205, 156436, 92926, 127742, 186506, 160680, 201292, 252572, 180633, 203562, 251145, 233502, 143448, 162002, 134787, 150096, 333739, 120713, -93241, -245053, -89267, -44281, 153862, 147397, 217165, 264493, 124480, 29027, 220114, 409205, 278797, 140884, 13605, 197642, 312940, 209812, 181359, 336835, 431496, 435796, 349245, 397209, 397285, 320327, 372522, 275750, 232527, -75840, -140959, -109818, -50248, 37131, -88308, -91322, 44147, 157021, 112779, -147001, -104252]
9266a04252J939J04729l2700n9387j01101N1470Q8868o9947j0230l8614J06676
9255f2549O0465l3464m3345m5753N0543J47304N7172j36918J5835j71829r1885
9244b54424O5598P3595P1935p3017O3346m1675P2286J754q5397O5433N9155J09489
9232A28078J05802p3439J18636K9832n1599J5791l7161k4029J57107l7188p1926
9221B59904m4658j28955j95999J72000K31061L5006J20116J89914j19077o6182
9211D53130j76820M4562K5568m57j12121P8828J06757p242j9564L7753j5584k17072
9199A97738K3477L01716j4222p7908J87708j10075r5782r0559q719J04071J41000
9188E58445Q7560Q9171n2957J5763M4251k8847r9209r5930R5152Q2359J49456
$$ y = [-104252, -102313, 2416, -30284, -89671, -190772, -139302, -50434, -120381, -130611, -169225, -62549, -2084, -35548, -78893, -124646, -74103, 73201, 130373, -6545, 9290, -162539, -254424, -188826, -115231, -43296, -116313, -52967, -94642, -22356, -20602, -105999, -40566, 18589, 128078, 233880, 160441, 279077, 308909, 257310, 273101, 235940, 211911, 369018, 331830, 259904, 215246, 86291, -109708, 62292, 293353, 328359, 448475, 638389, 519312, 453130, 276310, 320872, 346440, 345983, 233862, 312690, 419447, 412205, 392641, 430394, 414810, 197738, 221215, 522931, 508709, 430801, 618509, 508434, 412652, 322093, 313374, 417445, 558445, 646005, 735176, 682219, 697982, 742233, 713386, 614177, 518247, 613399, 695758, 845214]
9177H45214r8645r6204m423M3474q649J38260j26154J91395K35101Q5023j57605
9166A046787o6067N9306j43967j57077M9331K60196Q9946j5908j34302J5261J90165
9155A193671J83441K18313j11409j70689j7707o1309J76272L25783J41594m2952
9145A835008O6430J09178q598J04478K37462K54994J02973Q5749J10578O4022
9135B962274K98659O6810J81521K10703L88286J96411J78230K38133O13850N50610
9125E885487P85810Q28177P96586R94500J052323J180391J593589J896405K307937
9116A7321205K951685L662940M596043N961266P566050Q792882R718111R925978
9108G0496160Q963181O502217L177036n16199m220417p103046q718361r074164
$$ y = [845214, 746569, 650365, 645942, 689416, 680767, 819027, 692873, 884268, 1119369, 1204392, 1046787, 980720, 1040026, 896059, 738982, 788313, 1048509, 1138455, 1122547, 988245, 1003506, 1193671, 1377112, 1595425, 1484016, 1313327, 1295620, 1234311, 1410583, 1736366, 1877960, 1835008, 1901438, 2010616, 2002018, 2106496, 2343958, 2598952, 2701925, 2787674, 2898252, 2962274, 3260933, 3327743, 3509264, 3719967, 4108253, 4304664, 4482894, 4721027, 5334877, 5885487, 6671297, 7499474, 8296060, 9290560, 10342883, 11523274, 13116863, 15013268, 17321205, 20272890, 23935830, 28531873, 34493139, 42059189, 50852071, 60570182, 70496160, 79459341, 85961558, 89138594, 88622395, 84401978, 77298932, 68580571, 59506407]
9100E9506407q325125o851127n683250m960275m234909l550397l042357k512064
9092B0346903k110594j847945j567725j132458r48568r02161r28640p19965o84539
9083I504308o79213p63445n64596m83153n52239o66078n50548l67220k70580l33928
9073D273308j33561k42452k98119m39854k14133k41546k00343m3536k74831j98478
9063A986455j0307Q3291j27565R258j34138j35144j52065l64157r8199K02234
9053A259663K744L0698l2057J02253K5440n6784j26748p5034R0782O9916k7398
9042A263475j27768M3353J30918k82095k93116r0008P0293r1295Q007r5674j07015
9031D29075J4150K4471J26586q4801k40438k20024J49743K79001j81939L5951
$$ y = [59506407, 51181282, 44330155, 38646905, 33686630, 29451721, 25901324, 22858967, 20346903, 18236309, 16388364, 14820639, 13688181, 12739613, 11837452, 10908812, 10188847, 9504308, 8825095, 8061650, 7497054, 7013901, 6461662, 5795584, 5245036, 4877816, 4607236, 4273308, 4139747, 3897295, 3599176, 3159322, 2945189, 2703643, 2503300, 2459764, 2184933, 1986455, 1976148, 2059439, 1931874, 1941132, 1806994, 1671850, 1519785, 1155628, 1057429, 1259663, 1262407, 1293105, 1261048, 1363301, 1388741, 1331957, 1205209, 1130175, 1220957, 1290873, 1263475, 1135707, 1179060, 1309978, 1027883, 734767, 644759, 715052, 623757, 631764, 536090, 429075, 443225, 467696, 594282, 509481, 269043, 49019, 198762, 477763, 295824, 331775]
9021C31775J2882j35517n6888J1749k6284o1185k0565j3405L8941J26751K35961
9010D44215P2100j67405P6318l7919l7039O4708N4711k4571j25263j7427n92M7974
8998C49810k049K1605J90923L4278l03746M1960J36249k05100j44803L3974R273
8987A62374J08321K27369j17190k54767j45215o0381J44479R6747l0158p4141
8977E7438j43607q1313R5247N2589J21082K9591o7923l4211j1227O0134P6326
8966A54126N0531j72290J06888P7837R3465K5229Q7578L1782J5911k04194l70067
8955a03204L9892K06293L9780J68609N2249j58713j25517k20212N306P0091j5254
8944d0680L3619k92776n3423l5509K06135J9528m9866J80958J55491J8299k97079
$$ y = [331775, 344657, 209140, 152252, 164001, 137717, 76532, 55967, 42562, 81503, 208254, 444215, 516315, 348910, 425228, 387309, 350270, 414978, 469689, 445118, 319855, 302428, 301836, 349810, 347761, 369366, 560289, 594567, 290821, 332781, 469030, 263930, 119127, 153101, 162374, 270695, 498064, 380874, 126107, -19108, -79489, 64990, 161737, 131579, 57438, -86169, -167482, -72235, -19646, 101436, 131027, 63104, 28893, 17666, 77800, 154126, 204657, 32367, 139255, 217092, 310557, 335786, 423364, 455146, 471057, 266863, -103204, -63312, 142981, 182761, 351370, 403619, 244906, 119389, -100823, -95517, -25426, -40680, -7061, -299837, -353260, -388769, -182634, -163106, -212972, -32014, 123477, 141776, -155303]
8933a55303p3521J18297K552J05529q5322J7017R6913N0932o1117k28991J06711
8922a06303J73749L6815p7578n5872q3825j6653M6112p80L6679P0881Q8176Q7576
8910A98977J91764p824o3258j14063j10535j14230r7045J08321J16905N441M4504
8899A58957k82910q5678K01609J23258j21642l9205K0765M6536k6274j26887J76212
8888D4741J8251P545L0567K46776K40809k3718q6297l81512j37360J02596J64230
8877B26628K1425j58525k71669j02742Q846O5637J18106k9832M4369K46114o7300
8866A01057j30470j62222k08298K68740J65525J37324M2387j0499l2245j9505
8856A51794N315l2779j82101n731K83884N0796k36357n2410M6336J05281j76409
$$ y = [-155303, -228824, -110527, -107975, -2446, -87768, -70751, 26162, 77094, 15977, -213014, -106303, 67446, 104261, 26683, -29189, -113014, -129667, -83555, -84335, -47656, 23225, 111401, 198977, 390741, 382917, 319659, 205596, 95061, -19169, -116214, -7893, 109012, 114453, 158957, -123953, -209631, -8022, 115236, -6406, -45611, -24846, 21690, -4584, -131471, 44741, 62992, 70537, 101104, 347880, 588689, 564971, 478674, 97162, -40198, 62398, 226628, 248053, 89528, -182141, -284883, -276037, -210400, -92294, -122126, -77757, 168357, 101057, -29413, -191635, -399933, -131193, 34332, 171656, 214043, 203544, 171299, 151794, 157109, 124330, -57771, -63502, 220382, 271178, 34821, -17589, 28747, 134028, -42381]
8845d2381k48753J14789K69985K15621P7939m1356j60356k31432K0277J42326
8835A16659j24677k24167o9447Q6451J57323J97011r1661o8602j24483K19304
8825G3711Q3118j59148n2894j26127J60698K29507m835j32624r1192n7226k01052
8814b78064j26094J00405J03574P9611J64993J27695K2796J77173N6449n5959
8804C72579k21210k2352R265K7983l0908k10004j33309K57403o7629k29918J8444
8793b29656J11751P1873J85407k403n923j6255O6515Q6023j60098k13373n0229
8782a56368J82365O0256j04095p2291J3145N665M4749k36027j30837j51706k5981
8771e71125K03626J54659O2621J37089J22631k22144l26323J51859R8577j44085
$$ y = [-42381, -291134, -176345, 93640, 309261, 387200, 345844, 185488, -45944, -25667, 116659, -8018, -232185, -301632, -215181, -57858, 139153, 47492, -21110, -145593, 73711, 156829, -2319, -55213, -181340, -20642, 208865, 204030, 71406, -19786, -77012, -278064, -404158, -303753, -200179, -120568, 44425, 172120, 194916, 372089, 428538, 372579, 151369, 129017, 138282, 166265, 135357, -74647, -207956, 49447, -18182, -248100, -229656, -117905, -46032, 139375, 136972, 131049, 114794, 181309, 267332, 107234, -106139, -156368, 25997, 86253, -17842, -90133, -76988, -71323, -26574, -262601, -393438, -545144, -571125, -367499, -212840, -150219, -13130, 109501, -112643, -438966, -287107, -188530, -332615]
8761c32615J554J54944n4506k78394J6055J45647N4777M9025j27415j3251K8832
8750c55347K38243K8890k17892K35867K82030O5261j10216k04134k2062N2555
8740f805J6984j47247J07792j300k13031l8510L17093N255J80894j45496j21287
8729d5658L4597M768j91888J31853K13544P5840j03010j04310P4925j40588J29304
8718G9377K57557J65933q4629n2777k0984k8638j67926j58729j06525q4812Q4403
8707a17750J00232J13331J43532L08499L3948l48923j05611J81432j08034j11703
8697H8953q5445q9873K3497L7879L02742l4831k0361n8117r3204j01786J00550
8686G0004l9931j41436K2961L6429R9328J8196Q9292Q9844n2001r7221N0163R2269
$$ y = [-332615, -331061, -176117, -230623, -509017, -492962, -347315, -292538, -243513, -370928, -384179, -355347, -117104, -88214, -306106, -70239, 211791, 277052, 166836, -37298, -59360, -6805, 10179, -137068, -29276, -30576, -243607, -282117, 34976, 40231, 221125, 75629, -45658, -11061, -6293, -198181, -66328, 147216, 223056, 120046, 15736, 90661, -49927, 79377, 336934, 502867, 418238, 365461, 344477, 315839, 147913, -10816, -117341, -202153, -117750, -17518, 95813, 239345, 547844, 581792, 232869, 127258, 308690, 200656, 88953, 3508, -86365, -62868, -24989, 277753, 242922, 222561, 164444, 71240, -30546, 70004, 30073, -111363, -88402, -51973, 47355, 65551, 154843, 244687, 192686, 95465, 145628, 237897]
8674B37897j71979j37621J28120J84464r8926j16820M6973Q2520O0489P9996n9860
8663B35253O290K32j08717K2830M7945j81138p6986K02204J71636L0739j4947
8652C35341J07980L14583n3634j12128K23132J62592K29445j19949n0407n3648
8642I83307k58741j22783l1311j09537Q3390k3689j50474J64232J18802M5329
8632F98525J3577n18j37831k56913j60449k2591P3502J42713L9996j47810o7220
8621A74981L0468J01214K1254L6676K0542j38118j77154J53139J57283J20486
8611E00771L55R7382J05321L48184L37268n2609J90138N38962L23313K3754L0508
8600B443347k76788o1716r123o2378k0550M0557N7475j4589r5450j33497j83502
$$ y = [237897, 65918, -71703, 56417, 240881, 141955, 25135, 72108, 154628, 215117, 295113, 235253, 241543, 241775, 133058, 155888, 203833, 22695, -54291, 147913, 319549, 350288, 335341, 443321, 757904, 704270, 592142, 815274, 977866, 1207311, 1087362, 1036955, 983307, 724566, 601783, 570472, 460935, 544325, 520636, 370162, 534394, 653196, 698525, 712102, 711584, 573753, 316840, 156391, 133800, 207302, 350015, 390011, 242201, 174981, 205449, 306663, 327917, 364593, 385135, 247017, 69863, 223002, 380285, 500771, 501126, 598508, 703829, 1052013, 1389281, 1336672, 1526810, 2065772, 2389085, 2412839, 2443347, 2166559, 2104843, 2095720, 2033342, 2012792, 2053349, 2110824, 2096235, 2000785, 1867288, 1683786]
8589A683786r6826l58346k79379j50628p8527j92378J98061L4737p0160m0728
8579F49612q9302j83040j095o871j4504r7758J4705K45533K6514q2973j40336
8568C20485J08854n848k08609n2885J60925j29879r3735J35825K89896J46443
8558F71472R6286J54361K6204J69852k77821q6687J9669M2991k40877l5121J6818
8547E57147k34341J2907R9228j61482j03017K9777J07570k6522J5162J48385j52860
8536B91954M9348P0749m9877n1330j12906m2024r5308n2303L427O0420K30344
8525C02494n3159j24262k7420j31558j87507J44968J18320P6826K05335q3727
8515B40310j15713J02564P9223m0091j79410j14524p4579n1308R3314K47134j35177
$$ y = [1683786, 1586960, 1228614, 949235, 798607, 720080, 527702, 725763, 760500, 690340, 649612, 560310, 377270, 376175, 369304, 354800, 257042, 271747, 517280, 543794, 460821, 320485, 429339, 423491, 214882, 161997, 322922, 193043, 99308, 235133, 525029, 671472, 767758, 922119, 948323, 1118175, 840354, 753667, 773336, 816327, 575450, 540329, 557147, 322806, 335713, 434941, 273459, 170442, 200219, 307789, 281267, 296429, 444814, 291954, 341302, 412051, 362174, 310844, 197938, 155914, 60606, 8303, 11730, 72150, 302494, 249335, 125073, 97653, -33905, -221412, -76444, 41876, 118702, 324037, 240310, 124597, 227161, 306384, 266293, 86883, -27641, -102220, -153528, -60214, 186920, 51743]
8504E1743l29739K62500J28114K36471J2594M621j53972J8321L3057j48466O0653
8493A75897o6863P9549J10310l6797j39743j81662k35329J09347L22127Q4471
8483B21307k5421Q152N0727j73352n948q3515j3435O2389o1014Q3144Q5273J10207
8471B58514r9075o7525j92554O5327P5796L4770P9189J4030R7479K50j78771j21796
8459c4366l8179L0433J90759O5941K1356O7658k29625j67934j0684O9900M02689
8448C67948R0648k66452k3846R0497o7240j33796r7937R5749N9205O3158k32556
8437e4622q6822J10038K3906J50625j09098q6267M0420J43346j38038Q1119O8158
8426A42765m4000K9465p5202M6946q3984k01759j14527J31042J57628j60299J77299
$$ y = [51743, -277996, -15496, 112618, 349089, 361683, 366304, 212332, 230653, 263710, 115244, 175897, 109034, 188583, 298893, 262096, 122353, -59309, -294638, -185291, 136836, 221307, 195886, 204038, 254765, 81413, 75465, -8050, -21485, 40904, -20110, 63034, 148307, 258514, 159439, 91914, -100640, -35313, 40483, 75253, 154442, 168472, 265951, 266201, 87430, -34366, -72545, -42112, 148647, 214588, 235944, 303602, 73977, -93957, -104641, -34741, 367948, 458596, 192144, 168298, 258795, 191555, 57759, -40178, 55571, 114776, 177934, -54622, -141444, -31406, -7500, 143125, 34027, -52240, -11820, 131526, -6512, 74607, 142765, 98765, 128230, 53028, 99974, 15990, -185769, -300296, -169254, -11626, -171925, 5374]
8415E374o016l0433R1105J08644J29750K2028m0596j58633l07356r6123m5442
8404c27698J01271J15515Q011J9716N9017J2609Q4013Q0996J0215j80954j30j10688
8392a28107K8418J26498k7072M8237J2395j10163p3515J51110Q438j79863R1098
8381e2526q7788l9864k531R0407Q7355M3315J30421m6032r3374m0349k6747J32844
8369I5131K62755j2696j54029p7374j64269L6690K3414k7297j4034J64472J43441
8358B76204j18208k94821m268r197m4809K07890K39129j57113j45522Q1007O9744
8347A00036k1338R0744J46023K019j9387J121J3463P7807J28827r9649l28448
8336I1218N7207J73608k40331k12606J43846j61481J7562J40005J27765M6940
$$ y = [5374, -642, -31075, 60030, 168674, 298424, 320452, 279856, 121223, -186133, -282256, -327698, -226427, -110912, -102901, -83185, -24168, -11559, 72454, 153450, 163665, -17289, -17419, -128107, -99689, 26809, -263, 47974, 60369, -49794, -123309, 27801, 36239, -143624, -52526, -140314, -180178, -182709, -92302, -4947, 38368, 168789, 122757, 29383, -10966, -37713, 95131, 357886, 345190, 191161, 113787, -50482, -13792, 9622, -17675, -31709, 132763, 276204, 157996, -136825, -141093, -150290, -195099, 12791, 251920, 94807, -50715, 30292, 100036, 78698, 169442, 315465, 317484, 298097, 299218, 312681, 390488, 519315, 419666, 91218, 148425, 322033, 81702, -130904, 12942, -148539, -130977, 9028, 136793, 183733]
8326A83733q7555J92193P0294j62305j99595m1903K1811K2584Q1251L8870n3344
8315F6034n9782q5991P1475J24385m5488j55225o3902m325R3966p1353P6513K0835
8303c2858j27195j8121K11251q3659O6364l7489j98345j51641K2602M3737J10071
8292a95283n0472J10780O5757n9601j36949N0008Q2290P097K62035J08440n7182
8281A86920k27785j09199q3223K506N7283k9823J58860J23865J2616J01744o9238
8270A24526L167K7652k66854k17413J61339J74711K567j14956J02125o28k36892
8259b40656l2992N7474J64256J72678J01439k9590j27546m3442m5948j8855o0238
8248a03420l5744Q3484j727N0550J70761J70033k56050M4215j20783m7750J01209
$$ y = [183733, 96178, 288371, 358665, 196360, -3235, -45138, -23327, -743, 80508, 119378, 66034, 6252, -79739, -8264, 116121, 70633, -84592, -148494, -152819, -58853, -130206, -53693, -32858, -160053, -178174, 33077, -50582, 15782, -21707, -220052, -371693, -349091, -305354, -195283, -245755, -134975, -69218, -128819, -265768, -215760, -133470, -126373, 135662, 244102, 186920, -40865, -150064, -233287, -230781, -173498, -203321, -44461, 79404, 92020, 193764, 124526, 127693, 155345, -111509, -328922, -167583, 7128, 9695, -105261, -3136, -3764, -240656, -273648, -216174, -51918, 120760, 222199, 192609, 65063, 21621, -24327, -43182, -103420, -139164, -55680, -57407, -6857, 163904, 333937, 77887, 122102, 1319, -46431, 54778]
8237E4778l3563p1001j26601j2826K7J14416K9189J33516l7098j28272P2995J90346
8225A85906j7338J39904o2901j47615P9110n5644j84333L922J21232Q0715K03357
8214C46315j82795k79413O9726j62268j57462O5040K32964J90491l9252j44296
8204f0950l5212J7363J32843P4709j31293L94R7112j68441M4464L76622J61211
8193E08822q7288j24054j6469n4511M5317R8344k89823l1938K1570N2211R2936
8182B15117K231p7305m017j0905r465k0969m9118n80l8943j46992q923K35661
8170H5792k3603k50361j37604J21542J45490J29691P4526n3812k11351k38141
8160c57831J59863K21431j60156K3100l548j74031p3536K18988J49016J4692q7849
$$ y = [54778, 21215, -49786, -176387, -189213, -189186, -74770, -45581, 87935, 50837, -77435, -4440, 185906, 168568, 308472, 245571, 97956, 177066, 121422, -62911, -58989, 62243, 142958, 346315, 163520, -115893, -46167, -208435, -365897, -300857, -67893, 122598, 83346, -60950, -96162, -78799, 54044, 128753, -2540, -2146, 94966, -73475, -29011, 347611, 508822, 421534, 297480, 281011, 226500, 271817, 370161, 80338, 48400, 69970, 122181, 215117, 217348, 140043, 136026, 125121, 115656, 94687, 45569, 44989, 6046, -140946, -149869, 85792, 62189, -188172, -325776, -204234, -58744, 70947, 145473, 91661, -119690, -357831, -197968, 23463, -136693, -113593, -117141, -291172, -364708, -145720, 3296, 17988, -69861]
8149f9861J5867q1833k28045L24939J60410J29272p6246Q3239L3086j7754q9081
8138A83993J91537J6063j45454l586J9287J89810J01928k0657N7812m39254k3104
8127A28375k1215r1071J6302N5419R543M8842M5488k33114Q8101J51818l649k4732
8115A70107J35049M7820j27077r4966o3447J87775j8032m5388J4180j43360K15252
8104B77913j28090J7861j3121r1175R2165J16458r5790q0838P2313L06568l0412
8093D43852m69537m1159K34247j75254l04633J76130K12905J57588k7942n928
8083B00269j07316k5065R7365K0003M4784L3252j26533m229l3341P4372n8074
8072A15487j03641j0954K4848K8375J40801J7466n9936r5608J55486n2377q2165
$$ y = [-69861, -53994, -135827, -363872, -38933, 121477, 250749, 174503, 257742, 290828, 273074, 183993, 375530, 391593, 246139, 242553, 261840, 451650, 553578, 532921, 590733, 151479, 128375, 107160, 16089, 32391, 87810, 97353, 146195, 191683, -41431, 46670, 198488, 194839, 170107, 305156, 352976, 225899, 130933, 67486, 255261, 237229, 191841, 206021, 62661, 277913, 149823, 167684, 154563, 63388, 155553, 272011, 176221, 95383, 167696, 474264, 443852, -25685, -66844, 167403, -7851, -312484, -136354, 76551, 234139, 206197, 200269, 92953, 67888, 165253, 185256, 230040, 263292, 136759, 132530, 99189, 173561, 115487, 11846, 892, 25740, 54115, 194916, 212382, 152446, 56838, 212324, 159947, 77782]
8061G7782n367K9790j8264K3075K1433k29108N290k3003l1259J77049K70159M3269
8049C40846k06543j65978O9830K25932j1711q6501L06k24338m851j28254K8599
8038a62663o5195R6636J57818l3793R4657J86921m2297j79705j69207j7623J01237
8027c3214K09409J23434K5085j81133J67301J57291J8953o2999q737q9537J21461
8016D47314J78358o2390k00522n9879j3963k49453P2183J95848L2462k32140J06035
8005B13853J65772J2586L6245O8331L6414n6002O4283Q3031q3686o4379o6871
7994D09577M3298L69137J47762k8746k50078m28779k68169k54397Q7386K41055
7984F8046K0862L31088J69447j67083j17127O7288J07322k47434Q354K9593K28887
$$ y = [77782, 72415, 102205, 83941, 107016, 128449, -100659, -95369, -118372, -149631, 27418, 297577, 340846, 134303, -31675, 38155, 264087, 252376, 165875, 166181, -58157, -63008, -191262, -162663, -227858, -131222, 26596, -7197, 87460, 274381, 232084, 52379, -116828, -134451, -33214, 176195, 299629, 324714, 143581, 310882, 468173, 487126, 424127, 415390, 325853, 447314, 625672, 563282, 362760, 302881, 288918, 39465, 111648, 307496, 339958, 107818, 213853, 379625, 392211, 428456, 496787, 533201, 477199, 541482, 624513, 540827, 476448, 409577, 452875, 822012, 969774, 941028, 690950, 262171, -5998, -260395, -173009, 68046, 88908, 419996, 589443, 422360, 305233, 372521, 479843, 232409, 240763, 270356, 499243]
7973D99243M3959j21675j99177M9580O471o104K08393J79504M3503o617j1741
7962F85339N1278K7564J42589j16044j09060J26499J15248O7888K95156o4487
7952A221970j62343k25826j96321j96604K7293N4361n3540O6383K67858O3029
7942H66260n5279n5040j98817p0356K03689J81330P4492n6442J2917k12322L024
7931F93456r6797j63114l7428K6054J29304Q8725M6158O4001k75688p7730J48565
7920E45506j8089J94946K74448P166k38618p7268K20689P4042k03276p6997J56544
7909H59093l5587l52237k59566j48378N5912J89300l1247m9529K18518J49484
7899E95763n5289N5173j42064J55811J49716O3024j39156j9992M3676p2320n996
$$ y = [499243, 543202, 421527, 222350, 271930, 278401, 272297, 480690, 660194, 703697, 697080, 685339, 736617, 764181, 906770, 790726, 681666, 808165, 923413, 991301, 1286457, 1221970, 1059627, 833801, 637480, 440876, 468169, 522530, 468990, 535373, 803231, 866260, 810981, 755941, 557124, 486768, 690457, 871787, 946279, 889837, 902754, 690432, 693456, 596659, 433545, 396117, 422171, 551475, 640200, 686358, 750359, 474671, 396941, 545506, 527417, 722363, 996811, 1003977, 765359, 688091, 908780, 982822, 779546, 702549, 859093, 823506, 471269, 211703, 63325, 119237, 308537, 277290, 227761, 446279, 595763, 540474, 595647, 453583, 609394, 759110, 822134, 682978, 662986, 706662, 634342, 628346]
7888F28346q3448R7719j82059k87840p240m3714J51955K59470K5813L181q585
7877E53598r3381K0850p2226k96457o7381N0046J23143j04115j02789K6011n8660
7866b1361k5487J74628N2493j26790O3829J04412M8778r6328N4489R8648k8186
7855B99125J0513J61003k4904j41119k59911K3224P6936k20615p3111K11450Q3083
7844A45674J30162N7768M2391J43737K9662k71484j69045R7044j25487j12372
7834c1950K76517R5945k04620j16209j15507M748J52439j85024j67185Q0707J75432
7823c4707Q6036j50698Q217J15603M2891m2816k61871l0480p5913J87255K4734
7812a31749J9676P9752J19891o624j83885j16658M635l5130J8715r811N9683J39711
$$ y = [628346, 544898, 642617, 460558, 172718, 165478, 121764, 273719, 533189, 559002, 562183, 553598, 460217, 481067, 408841, 112384, 45003, 95049, 218192, 114077, 11288, 37299, -21361, -46848, 127780, 180273, 53483, 117312, 221724, 270502, 174174, 228663, 327311, 299125, 309638, 470641, 445737, 304618, 44707, 67931, 144867, -75748, -148859, 62591, 145674, 275836, 333604, 375995, 519732, 549394, 277910, 108865, 205909, 80422, -31950, 244567, 340512, 135892, 19683, -95824, -91076, 61363, -123661, -290846, -210139, -34707, 51329, -99369, -91152, 24451, 67342, 24526, -237345, -267825, -343738, -156483, -131749, -112073, -32321, 87570, 80946, -102939, -219597, -214962, -250092, -231377, -241188, -181505, -41794]
7800d1794j08987m6879P5020K34705J8603j67764R1740l4400j70250j52372Q0974
7789b21404L1924P8406j00826j30897o2689K46645K55088K13319p6657K17338
7779D50247N9341k07352k16759P4199r0996j07798N659k08574K4165l3646J00641
7768a50873m6629J1627M1110J54280k6432k61221k9840R6082K60860J37895q4353
7757A02506p1852q1672K11040K29820j37804j22930J07142L4970l45154o6661
7747a40595j0650P951P8438J89250k7197j00326Q7623m4247k4884l0856j1836
7736b7329R109j00210p7840J76191K17233Q7967j3594j05323O7414M2162j47764
7725A28016k78877n1370m2181K243Q3134J56755P4479P2334Q6236N432l8313l424
$$ y = [-41794, -150781, -197660, -122640, 112065, 130668, -37096, 54644, 20244, -150006, -302378, -221404, -189480, -111074, -211900, -342797, -405486, -158841, 96247, 309566, 232909, 450247, 509588, 302236, 85477, 159676, 68680, -39118, -33459, -242033, -217868, -251514, -150873, -197502, -185875, -144765, 9515, -16917, -278138, -307978, -211896, 48964, 186859, 102506, 30654, -51018, 160022, 389842, 252038, 129108, 236250, 271220, -73934, -140595, -151245, -143294, -64856, 124394, 97197, -3129, 84494, 40247, 15363, -15493, -27329, -18220, -118430, -196270, -20079, 197154, 285121, 271527, 166204, 233618, 275780, 128016, -150861, -202231, -244412, -242169, -159035, -2280, 72199, 144533, 230769, 236201, 197888, 194464]
7713A94464O3118l45454k06584k181Q7417L1606J7719Q0473j08315p5066R3070
7702a69733o5351J26997L70077M5119j09311o3782q0327o2644j5461l0277P0553
7691A5860O9241J77180P4188j68372q4075N1775k13512j47002M130J06273j3152
7680a27466p6390J44321M9149k80819j24571J08479J06330M6892K4454J23889
7670e732N9616j29706n8239q9981j1196J36129M4973Q7084J10490l8547l0099
7659G4792J8517k8504k36815j77241N3582K16508J60265m5540k39677R230p2134
7648b67017J19038K47800m2350m8203j26916J18134m1724K8501J3941k3049j5483
7637c7328o2598L7828K7228N3457o3736j11510k41817j00698P8111L8014K22423
$$ y = [194464, 257582, -87872, -294456, -296637, -209220, -177614, -159895, -79422, -187737, -262803, -169733, -235084, -108087, 261990, 307109, 197798, 134016, 53689, -8955, -24416, -54693, 15860, 85101, 262281, 336469, 168097, 84022, 135797, -77715, -224717, -220587, -114314, -127466, -203856, -59535, -10386, -291205, -415776, -307297, -200967, -154075, -129621, -5732, 53884, -75822, -134061, -224042, -235238, -99109, -54136, 32948, 143438, 104891, 74792, 93309, 64805, -172010, -349251, -295669, -79161, 81104, 35564, -204113, -194883, -267017, -147979, 99821, 57471, 9268, -117648, 486, -41238, -12737, 1204, -21845, -37328, -99926, -62098, -34870, 18587, -45149, -156659, -398476, -499174, -421063, -383049, -160626]
7626a60626L27000J75331k34149k43906O4K65797K42383l12173j50487Q5640N4046
7615D8920k2545l33928j88300K53285J42729K6165K63374N8861j69387m3885J04538
7604A39827Q2094j1990m3601j46214j15819j03373J05502J43431J5038j0935l24516
7593b70556K1746J20707J51181O4914j08281q5865j69958Q6638J8080n1077J95408
7582b7063O9405K6987R462K8138j01907j79602J35879o8813n461J59541P7401
7571A23967P0444j82559m7467r2597m0341j37855k30394r4535J18451R0334K44430
7560a78122L12977J4109k14011n8149j52928o9522K59030J78886j61508j1066
7550h0304K9097K033k66974j58977L0902J92118J2406j68942L1412J95556n2175
$$ y = [-160626, 166374, 341705, 107556, -136350, -136286, 129511, 371894, 59721, -90766, -5126, 48920, 26375, -307553, -495853, -242568, -99839, -73674, 189700, 248561, 79174, 35289, 139827, 221921, 209931, 166330, 20116, -95703, -199076, -93574, 49857, 64895, 53960, -270556, -248810, -128103, 23078, 87992, -20289, -106154, -276112, -189474, -171394, -222471, -27063, 42342, 69329, 78791, 106929, 5022, -174580, -38701, -107514, -112975, 46566, 123967, 194411, 11852, -35615, -128212, -168553, -306408, -536802, -631337, -512886, -422552, -178122, 134855, 148964, -65047, -123196, -276124, -345646, -86616, 92270, -69238, -80304, -51207, -49174, -316148, -475125, -444223, -252105, -239699, -408641, -377229, -181673, -233848]
7539b33848o5480q9590r3929K20544L3564j02349L4776O915O0058L8222J35936
7528e5181J23997J98671j50858k79067J11282J75797Q1455j99212k7121J35625
7518A15388j77824q0922l6117J05392J92669j32224j25979m1779p1088p096J57881
7507a01699R0896K7688J19632N7220R0783J15359j1706j77580j8880j8833J35205
7496C08085n6766j13527o4841K22049m7676k18216q27n7527O8161q9885k18427
7485b69397r4682j07320J44885N7113k1501j34634n1718J33234K12822N5117j75937
7474b52018M5957P1245P2912M6865j5652M3267J13273l2089J38872o0001q9671
7463H2960j22623J1788K3396k19354K2785J33971R7764j04245j10374J35319J35821
$$ y = [-233848, -299328, -388918, -482847, -262303, -228739, -331088, -296312, -289397, -229339, -191117, -55181, 68816, 267487, 116629, -162438, -51156, 124641, 206096, 6884, -20237, 115388, -62436, -143358, -179475, -74083, 118586, -13638, -139617, -181396, -252484, -259580, -101699, -10803, 16885, 136517, 193737, 284520, 399879, 388173, 210593, 191713, 172880, 308085, 251319, 137792, 72951, 295000, 247324, 29108, 28281, -29246, 38915, -50970, -269397, -364079, -471399, -326514, -269401, -290902, -425536, -477254, -344020, -131198, -76081, -252018, -206061, -134816, -61904, -15039, -30691, 12576, 125849, 93760, 232632, 172631, 82960, -39663, -27875, -4479, -223833, -201048, -67077, 30687, -73558, -183932, -48613, 87208]
7452H7208K4776p335j56862j98551l4994P614K22392J22707K0127j06704j10455
7441a30077o7449k7011r8853J52845Q1913n7968j3142l4666J08561K1609j60510
7430b24748J94883J48426J07591j13639q146j01650J03150Q0490k2983j54768
7420H606r4408k308l1584j87495J7149K6500J24159O2123K14064P5017O6756j43055
7408A35524k22546j83283n1254J44982N2396L1464o6440O0399m7103r9553j73133
7397d18547M3858N6653k18327K5801K29771J85816k2142J80497Q9794j21746K00688
7386B32116J09140j43938r6452M3345P5780Q0762j51859j71803j13438J7880Q831
7375a09636p9462l9890Q7499J56214j8455J7472J12069O3423k54381j29211J92917
$$ y = [87208, 111984, 104649, -52213, -250764, -285758, -278144, -55752, 66955, 87082, -19622, -130077, -197526, -224537, -323390, -170545, -88632, -146600, -159742, -194408, -85847, -64238, -224748, -29865, 118561, 226152, 112513, 104367, 2717, 105867, 186357, 163374, 8606, -85802, -88110, -119694, -307189, -290040, -263540, -139381, -77258, 136806, 211823, 278579, 135524, -87022, -270305, -321559, -176577, -124181, -92717, -159157, -98758, -145861, -245414, -418547, -374689, -318036, -536363, -510562, -280791, -94975, -117117, 63380, 153174, 31428, 232116, 341256, 197318, 100866, 144211, 219991, 300753, 148894, -22909, -136347, -118467, -109636, -189098, -228988, -141489, 14725, -3730, 13742, 125811, 189234, -65147, -194358, -1441]
7364a441J74225R0716L30004q0535k15268k11723l6464N491M4702q2334j50933
7353a33560N9442K57910j73238r115J7362o9165Q0441J61722p3321j92481N2128
7342b1875J02671K22901J69087m7050m2470j93155k50946n1322Q1467Q5188J1891
7331F6387k57335j55246K11400J90748o9399j27820N8553K25365j32436J16092
7321A26309P0465M5652l1232Q607n0816k25639L9936J63816j3380j64549O0199
7310B9368j38777p7515J28046k9296n7113R8538J11702j8815J2830K8596j73107
7299h5543o1128j78405K8210Q956k8897J14299j1184O9568m2218q7392J96839
7288g6895j15830l71881n5255N9430K42959J69897Q4533K15498R9973j40977j56410
$$ y = [-1441, 172784, 263500, 593504, 512969, 297701, 85978, 49514, 55005, 99707, 17373, -133560, -74118, 183792, 10554, 1439, 18801, -50364, 30077, 191799, 118478, -74003, -21875, 80796, 303697, 472784, 425734, 383264, 190109, -60837, -112159, -30692, 54496, 66387, -190948, -346194, -134794, 55954, -13445, -141265, -82712, 142653, 10217, 126309, 196774, 242426, 211194, 219801, 168985, -56654, -16718, 147098, 133718, -30831, 29368, -109409, -186924, -58878, -88174, -145287, -46749, 64953, 46138, 58968, 87564, -85543, -146671, -325076, -296866, -287910, -316807, -202508, -213692, -144124, -186342, -273734, -76895, -192725, -564606, -619861, -560431, -317472, -147575, -63042, 152456, 252429, 111452, -44958]
7277d4958m1764q3495j86583R1696j18908O09r5494L15967K59666J2288j3810
7266I5214K9312J3865J35038j33809j52914j86682J05663K06389J22753k01850
7256C2979l691M3343j6151R5649p7243j95093J73119P3300k5494p1569p0403m3009
7244h4263p7815k8463J32249M0789M6224O9519M1071q5088n9503J20455O4067
7233A79242o7532o3347J25956j52215k6242P6600O5796j49250j08196K21735K54658
7222C57205p3871j35063j61343k79974J31353K70199M2014o1549o0848K9085k27122
7211a69914j05444K8069K93619R3152r4782j15996k40081O1546M1J68008L1822
7200d9960J7613j13808j05458j12639O2325J50553L8943j08048Q0071o0217q6502
$$ y = [-44958, -86722, -170217, -356800, -265104, -384012, -383403, -478897, -162930, 96736, 109024, 95214, 124526, 138391, 273429, 139620, -13294, -199976, -94313, 112076, 234829, 32979, 29288, 72631, 56480, 152129, 74886, -120207, 52912, 126212, 100718, 29149, -41254, -84263, -162078, -190541, -58292, -17503, 28721, 98240, 139311, 54223, -5280, 115175, 179242, 111710, 48363, 174319, 22104, -4138, 72462, 138258, -10992, -119188, 102547, 357205, 283334, 148271, -13072, -293046, -161693, 108506, 150520, 88971, 28123, 57208, -169914, -275358, -247289, 46330, 139482, 44700, -71296, -311377, -249831, -249790, -81782, -49960, -32347, -146155, -251613, -364252, -301927, -151374, -112431, -220479, -140408, -200625, -287127]
7189b87127o2509p1695r237J75627K41548n9037o2996J7634P8775O8229J48834
7178A78046j18389j27171J23127j6039R1297p4439j77657q5604J67330K05115
7168A65616q0532j42458o4775J22815m5038k16496j02393j41249J15936K16827
7158a71747M7486n585p6598L6227J53704K25004l1135K6360j0128k16158j28814
7147a51384p9119K16532O3855j05397j48458J5258l2144q5984j62876K0521L18943
7136a30253K62419J02801k11957K228m7999P6103j60357K091j4292n0463k05008
7125c74687J24043K79734N5906j51277m7352L38679J50406l69910m06305L9985
7115c60778K50885L49735J52167n8686l64252j73570K4336K313L57896k7248k28608
$$ y = [-287127, -349636, -421331, -430568, -254941, -13393, -72430, -135426, -117792, -39017, 29212, 178046, 59657, -67514, 55613, 39574, 130871, 56432, -121225, -206829, -39499, 165616, 85084, -57374, -122149, 666, -44372, -260868, -363261, -504510, -388574, -171747, -124261, -129846, -206444, -170217, -16513, 208491, 177356, 203716, 193588, -22570, -151384, -230503, -13971, 49884, -55513, -203971, -188713, -220857, -306841, -469717, -449196, -130253, 132166, 234967, 23010, 25238, -22761, 53342, -107015, -104924, -119216, -169679, -374687, -250644, 29090, 84996, -66281, -113633, 225046, 375452, 5542, -400763, -360778, -109893, 239842, 392009, 333323, -30929, -204499, -180163, -177850, 180046, 152798, -75810]
7104g5810j01754K04228K25740k5427j26695j07600o7242j6531j70985j62634
7094d24710K4065K7683J67209Q0101o3839N2084J57136m6276Q910p4882L2920
7083e9599J64789o3862j60551j8319r0537L287L5383J9634r1312o44R3460j65018
7071c33289L3105K04236P5013k23256j42845k3786K46892J40989l2924k0149l0895
7060a06909J4981n9589J45060O3377k9394j4606L2230M914O8008J35316r5139
7049A58249R0364r4242o4408J63256k812o8930n5316j40916r6966j2195K27714
7038A03798Q2659j7858r479k6866K9364o3903j42622L6075p1218J8799j83480
7027b44731J4852J93512J8304j68242N937O0803K1301J50154o9214j4210L01790
$$ y = [-75810, -177564, 26664, 252404, 226977, 100282, -7318, -74560, -91091, -262076, -424710, -400645, -372962, -205753, -125652, -189491, -137407, 19729, -26547, -17637, -92519, -59599, 105190, 41328, -119223, -137542, -228079, -224792, -189409, -169775, -261087, -261731, -168271, -333289, -300184, -95948, -20935, -244191, -387036, -410822, -163930, -22941, -55865, -76014, -106909, -91928, -151517, -6457, 56920, 27526, 12920, 45150, 50064, 118072, 253388, 158249, 248613, 154371, 89963, 253219, 250407, 181477, 126161, -14755, -111721, -123916, 103798, 186457, 168599, 159120, 132254, 161618, 97715, -44907, -8832, -80050, -61251, -244731, -229879, -36367, -18063, -186305, -180368, -119565, -98264, 51890, -17324, -31534, 270256]
7016B70256R2837k48722k65746j23705q877j24314N2017L05612N7779L1416r4088
7005e5535j86256m842Q4839l0895M2393O3421r770j4234n483p8596J4823J7457
6993a62678R7188J80097o5333j45480k0343j66516j51362l7838K39450J33829
6983i8986p6642j80423k27934J55902j13480K97497K42719O7280k46120M8036
6973a32151L96682J55797O4858n6306l59823j43977l9411M5335j07168j79177
6963c55341r7753K90115J59143m905j8581J03125k11536j18581q7608M5875k7150
6952c23197J47091L80477l0172k84762j5361Q3949l23907L8333J75598J46448
6942e503k1935R8719P8198p5257j84935J2087N0057k9376j56987j09367l9291
$$ y = [270256, 363093, 114371, -151375, -275080, -283957, -408271, -356254, -50642, 7137, 38553, -55535, -241791, -246633, -161794, -192689, -150296, -86875, -96645, -110879, -116362, -194958, -180135, -162678, -65490, 114607, 49274, -96206, -116549, -283065, -434427, -472265, -232815, -98986, -175628, -356051, -583985, -428083, -541563, -244066, -1347, 65933, -180187, -132151, 264531, 420328, 485186, 428880, 69057, -74920, -114331, -68996, -176164, -355341, -453094, -162979, -3836, -8741, -27322, 75803, -135733, -254314, -341922, -296047, -323197, -176106, 204371, 174199, -110563, -125924, -41975, -365882, -327549, -151951, -5503, -27438, 71281, 149479, 74222, -110713, -98626, -48569, -77945, -234932, -344299, -383590]
6931c83590K43630P0260m8524r4591j02319k10610K73288K67919p2807j36234
6921a93578q387o0947J9509J39269J15496q9566j02098j53144k0138J19308J36315
6910i7961O8529J12015K7483j31943q5441j70083J593M3488J83259J35863j28224
6899d1422p2020L9005J5635o9693l0428N9272L0554J19386k8803J20323m0091
6888A01718k8860K3195j2671j7502n5542J96402k4604l10432J12967J7262l61787
6877c59854q6902J55762M12066k5772o9924l871k433J30144L6363j04975q0527
6866G7l7970n3460j05588J17826K6969m0065j20367J13624L16114J18651P4278
6855D10089O2572N2993r131p2099M0424j87849p6269q1778Q7718j86003l18437
$$ y = [-383590, -139960, -69700, -118224, -212815, -315134, -525744, -252456, 15463, -57344, -193578, -201965, -262912, -243403, -104134, 11362, -78204, -180302, -333446, -353584, -234276, -97961, -29432, 82583, 110066, -21877, -107318, -277401, -275808, -232320, -49061, 86802, -41422, -113442, -74437, -58802, -128495, -158923, -99651, -69097, 50289, 21486, 141809, 101718, 72858, 96053, 83382, 65880, 10338, 206740, 182136, -128296, -15329, 1933, -359854, -446756, -290994, 121072, 95300, 25376, 21505, 19072, 149216, 185579, 80604, 77, -37893, -91353, -196941, -79115, -52146, -92211, -212578, -98954, 217160, 335811, 410089, 472661, 525654, 516523, 444424, 484848, 296999, 220730, 138952, 226670, 40667, -277770]
6844b77770m2722L15248r8220k55312Q5836K67679J66481K8984o0318k1598j02829
6833E459j19093n1494m5884K3818J3269j00766N9388M6791J28802p7636j20609
6822b37955j13365l51882J62647J75646P7517P5716m5792p5683J66840r1295r9879
6811c57485K0622Q7655J81548J88032P0240k3546j04477j12594j78215m2674j9404
6800b90298j38397j17844J36815K81070p4709m2192P6840J54467q3011o972O6631
6789c7600M9897p6447q2440J79883J49167k02010J65044J72457j50690o6937L0341
6778A30665J13032j05486o0498j53211J5108J62891J87410L8177j48146j97539
6768a7597J232r2417J8958J35782l4647j18074k9599Q143j38914P5634M2156k00944
$$ y = [-277770, -320492, -5244, -103464, -358776, -272940, -5261, 161220, 190204, 129886, 108288, 5459, -113634, -165128, -211012, -187194, -173925, -274691, -215303, -168512, -39710, -117346, -237955, -351320, -703202, -540555, -364909, -287392, -211676, -257468, -333151, -166311, -257606, -357485, -336863, -249208, -67660, 120372, 190612, 167066, 62589, -50005, -228220, -270894, -290298, -428695, -546539, -409724, -128654, -203363, -245555, -168715, -14248, -97259, -104231, -37600, 12297, -64150, -146590, 33293, 182460, -19550, 145494, 317951, 167261, 100324, 130665, 243697, 138211, 77713, -75498, -60390, 102501, 289911, 328088, 179942, -17597, -16365, -108782, -89824, 45958, 11311, -106763, -136362, -128219, -267133, -191499, -149343, -350287]
6756c50287k954K57267K05767j32028p612L2644Q3985j37460R2451L0212j00965
6745b8980j97406L9734L27333L4230J20832k050j89856j34681m4430o0037M8033
6734h7278K393m1806o8404K40382J05062j04008r2569K92523Q2776P4563J19367
6723E23001K19083j76848M0558J67929J4011j006k39130m47711j13422q0046K9171
6712f4410j6250Q2351j35806q7836O3876K43513j19997o625M2472j56276k61549
6701d16537K5813K16669J94979k37891K7943K007l3591J06832j24189r5095J86599
6690a46461J11885J53005P6423L054k4245p4235r0269p4415j4440N6538o5574
6679h8734Q2333O9991j3659o3242J20926k79796k87479j24068J42424J58524q0567
$$ y = [-350287, -353241, -95974, 109793, -22235, -29847, 2797, 86782, -50678, 41773, 71985, -28980, -226386, -186652, 140681, 174911, 295743, 293693, 103837, -30844, -75274, -135311, -87278, -84885, -126691, -195095, 45287, 150349, 46341, -46228, 246295, 329071, 403634, 523001, 742084, 565236, 605794, 773723, 787734, 786728, 547598, 99887, -13535, -93581, -64410, -80660, 1691, -134115, -221951, -158075, 85438, -34559, -41184, 1288, -154988, -416537, -390724, -174055, 20924, -216967, -189024, -187017, -220608, -113776, -237965, -333060, -146461, -34576, 118429, 194852, 197906, 173661, 99426, 9157, -65258, -79698, -23160, -88734, -6401, 63590, 49931, -13311, 107615, -172181, -459660, -583728, -441304, -282780, -363347]
6668c63347j7031L6633o2714M9232M571l7951j4278J84998K2433j31332M5035
6657b83751O9288K9793L9874j4569k45184r6497K41171J67719J25908J236r8097
6646f3109O5788J29539J29929J75575j25678l65265l4168m5753P1373k39792k21823
6635e23384N3259J80780J56422j521o1325J39827J77724j13720o7668j52135J89566
6624b2175L39443j08013R994n9295j28827j65636k5732O4250n6446p3049P1360
6613a54126J05062J46659K00386o4815q4855m4591n4417K5146L3692j2182j7002
6602G8957K84759J9481k36635l3824k0438j59851J56613m1806k2228J09588P3016
6591B07632q5594N0394j35548j87334k348J83683j6827j98182o2956K09875J4434
$$ y = [-363347, -380378, -343745, -406459, -357227, -352656, -390607, -404885, -219887, -197454, -328786, -283751, -214463, -184670, -144796, -159365, -404549, -501046, -259875, -92156, 33752, 34988, -63109, 2679, 132218, 262147, 437722, 312044, -53221, -87389, -133142, -61769, -301561, -523384, -470125, -289345, -132923, -134444, -195769, -55942, 121782, 8062, -59606, -211741, -22175, 317268, 209255, 219249, 159954, 31127, -134509, -160241, -95991, -152437, -225486, -154126, -49064, 97595, 297981, 233166, 148311, 103720, 49303, 74449, 108141, 95959, 78957, 363716, 383197, 146562, 112738, 92300, -67551, 89062, 47256, 25028, 134616, 207632, 122038, 172432, 36884, -150450, -152798, 30885, 14058, -184124, -247080, -37205, -22771]
6580b2771m5352m3484q5553J19123J93701n081n1169N9261m31J3271n2000k11027
6568a31512P6553j39106j93673J06067J80307J52980K756k10213k4457j9961J60981
6557c9278l4396J2999j49794J8726J5924O6892J24409r0419M0138J07578J23104
6546A95883R2893r3240j31187k68656O8221L0484p9048J49443J42814q0998j5283
6535A1326n4047L22469M7867M1694j54228m08672J7256L4658m8855P9721N7510
6524e3301M8763p9215n2042k35234O3536p577Q6849J34293m6085R9429J54793
6513A14209p1194j44297r1578R7307J7972L1544J12968J8151J82231K21038k93728
6502A94623l16537m1850p3967p6187J57896J68324K3008p3600m3529j82914J91114
$$ y = [-22771, -68123, -111607, -197160, -78037, 115664, 110583, 59414, 118675, 118244, 131515, 79515, -131512, -54959, -194065, -387738, -281671, -101364, 51616, 54372, -155841, -180298, -200259, -39278, -73674, -60675, -210469, -191743, -175819, -108927, 15482, -74937, -34799, 72779, 195883, 288776, 195536, 64349, -204307, -136086, -105602, -184650, -35207, 107607, 26609, 11326, -42721, 279748, 327615, 369309, 215081, -193591, -176335, -141677, -190532, -110811, -53301, -4538, -83753, -135795, -371029, -307493, -315070, -228221, -93928, -140013, -40584, 114209, 43015, -101282, -192860, -95553, -77581, -46037, 66931, 85082, 267313, 488351, 194623, -121914, -163764, -237731, -313918, -156022, 12302, 35310, -38290, -81819, -264733, -73619]
6491g3619J66188j33488j14974j74353O5383Q7550J38527k02883k30054r1808
6481e63531Q1011L46973k818R224J63285J70517m5412n1395q7941k44386M493
6470b19980J92780n608P399J03696r5476Q1005K1252p0059J5994J62994J4103
6459B08100j10773P5799l5815k44350n4441n9042M3328q2152k8486J06294J13970
6448f7568m2964K23465Q298j19173K3977m3924N0669m3507j30697J03696q7793
6437a25521J0821K01475n735j72705m6044m090J04857m7124j68724L3852K06502
6426a2436J40578J43884m7301J52663j69369k19663J09796j69868k888q5307j10686
6415b70597n4120Q3245K98771p6870j32953K3164N3637p4001J1598J46220j0261
$$ y = [-73619, 92569, -40919, -155893, -330246, -264863, -177313, -38786, -241669, -471723, -563531, -482520, -135547, -138365, -129141, 34144, 204661, 159249, 107854, 19913, -224473, -219980, -27200, -32808, -25409, 78287, -17189, 63816, 85068, 15009, 31003, 193997, 208100, 97327, 173126, 137311, -107039, -161480, -220522, -177194, -259346, -287832, -181538, -67568, -110532, 112933, 121231, 2058, 26035, -17889, 32780, -10727, -141424, -37728, -125521, -114700, 86775, 81040, -91665, -137709, -141799, -36942, -84066, -252790, -218938, -12436, 128142, 272026, 224725, 377388, 208019, -11644, 98152, -71716, -74604, -159911, -270597, -324717, -241472, 57299, -19571, -152524, -129360, -75723, -149724, -138126, 8094, -2167]
6404b167k41929O1617J51067J18999N6096k07844q6355K27928m4276k0633J50637
6393A63140p891q5729j0024j87241j67736j49349J09781N4939n0554J37585Q1375
6382a11704j19469k76887J35970J54059O4177o2537o878J52714J22071j8162k7772
6371E582J1167K11555N9894Q5712j51067k35108j47672j29265J56671K98693P346
6360A73508p9219q8651r0039j22114j548O4725J36037j6927r2458j03704J19563
6349a00827p7014j41664j82570K08005K07737J8293J72978N1727j70236l8055
6339e1626J36187k8848j01910K6355L4212O1688r9493J9755K1325j055L0474J73983
6327B21047k09488J1784J42796J0437o3433n7307l4128j35424P5374J05092K21405
$$ y = [-2167, -244096, -182479, -31412, 87587, 143683, -64161, -150516, 77412, 33136, 12503, 163140, 155249, 69520, 59496, -127745, -295481, -444830, -335049, -280110, -330664, -193079, -111704, -231173, -508060, -372090, -218031, -153854, -216391, -223269, -70555, 51516, 33354, 5582, 16749, 228304, 288198, 373910, 222843, -12265, -159937, -289202, -132531, 166162, 173508, 94289, 5638, -84401, -206515, -208063, -143338, -7301, -24228, -116686, -220390, -100827, -177841, -319505, -502075, -294070, -86333, -68040, 104938, 156665, -13571, -51626, 84561, 55713, -46197, -19842, 14370, 76058, -23435, -3680, 17645, 16590, 47064, 221047, 11559, 23343, 166139, 176576, 113143, 55836, 21708, -113716, -38342, 66750, 288155]
6316B88155L1198l21592j14111k20619J18833J16986L29733l2691p4904j3252
6306A07736m6891O524L6310n0184J76250j9526j12538j1253n2668j32366Q4301
6295a4305J05202q0709r2336j44965r0343M5958J67916m6988k76482j81255J59760
6284d48547m1934K09144M6261j62383J98457P6253o5095R4728p6065k25453n7120
6273d51754J50841K30251J43626m904j64467r1887J30881k3593k8172j5657k28479
6262c53314R7459L4815l2024J36620J32688J23048r5408J207J78150j20925J18984
6251B21300l6935k90052j13119J94933q2196q3081K8943J92943m734n5980k58393
6240b86371j43590L15976J57806k36193l8594m4392R7824K48323P0536K7154q6731
$$ y = [288155, 319353, -2239, -116350, -336969, -218136, -101150, 228583, 195892, 120988, 107736, 60845, 67369, 103679, 53495, 229745, 210219, 97681, 86428, 33760, -98606, -14305, 90897, 10188, -82148, -227113, -317456, -271498, -103582, -150570, -427052, -608307, -448547, -490481, -281337, -235076, -397459, -199002, -122749, -187844, -93116, -169181, -394634, -451754, -300913, -70662, 72964, 68060, -96407, -188294, -57413, -81006, -109178, -124835, -353314, -255855, -221040, -253064, -116444, 16244, 139292, 43884, 45091, 223241, 102316, 221300, 184365, -105687, -218806, -23873, -106069, -189150, -160207, 32736, 28002, -27978, -286371, -429961, -113985, 43821, -192372, -230966, -275358, -177534, 70789, 141325, 168479, 81748]
6229H1748l33377k34345o0729K7413l1208K78354J17797R8775J35035L4790j56764
6218d2511n8852J42616K81278l8925l71935k07973J09788K06845p4079j35625
6208a89373j53750K98407K60032N5819r6511n5633j62549m6432m787L3800n426
6197f6403N5972m2954O8543N0309J47483j44801j11907r8642N6452R2810j2269
6186e407N0267J6901k52391p1216k0211j1722R0493L92618N5899n2024j35920
6175E7287k26768j12293o0129J05848J42043j39146J19816K17848q6715Q0379
6165I8170j52315j30657j34229J8930J46459R9712j01610M4949K70686J0782k3982
6154A46895J97392J05511j16158l54655l85821L3670M5695j20499K56047L17796
$$ y = [81748, -251629, -485974, -546703, -519290, -550498, -272144, -154347, -55572, 79463, 114253, -42511, -101363, 41253, 322531, 283606, -88329, -296302, -186514, 20331, -53748, -189373, -343123, -44716, 215316, 271135, 174624, 118991, -43558, -89990, -94777, -60977, -66403, -10431, -53385, 15158, 65467, 212950, 68149, -43758, -142400, -85948, 6862, -5407, 44860, 61761, -190630, -261846, -282057, -293779, -203286, 189332, 245231, 193207, 57287, -169481, -281774, -341903, -236055, -94012, -233158, -113342, 104506, 17791, 98170, -54145, -184802, -319031, -300101, -153642, -53930, -155540, -110591, 160095, 170877, 146895, 344287, 449798, 333640, -21015, -406836, -373166, -327471, -447970, -191923, 125873]
6144A25873q4350j06289r1399J43432J08078J03725j7925j39792j08198M0535
6134b6310r629j38560j6719K52221O5299k09346j1980O3306J7687q2164m2565
6123a38760K45566J01632l2404p0441n521j30984M9773N5703r5870N9889m3695
6112e112j40385P7867J78842M7600N1766n126q4835k5101n9353j0844o7897j35774
6100a78352j65947l3165J2662J51302l8985M8008J57764J2442M130q045J5400
6089b2786Q7453M846q6590P6212K21909K0943m14818j39710L4402R9755J0849
6078a07535j36420J92399M9570n5203K5230j68017O4911q0051j13679J32504Q2023
6067a14268l9351j66858k22080l0523p25J06440J80025m2789L05724J18307J58864
$$ y = [125873, 41523, -64766, -156165, -12733, 95345, 199070, 181145, 41353, -66845, -26310, -35939, -174499, -191218, 61003, 126302, -83044, -95024, -31718, -14031, -96195, -138760, 106806, 208438, 176034, 105593, 100072, -30912, 18861, 74564, -21306, 38583, -5112, -145497, -67630, 111212, 158812, 210578, 205452, 120617, 95516, 36163, 25319, -42578, -178352, -344299, -377464, -364802, -213500, -252485, -204477, -46713, -34271, -30141, -38186, -22786, 64667, 69513, -17077, 59135, 281044, 301987, -112831, -252541, -218139, -118384, -107535, -243955, -51556, -1986, -57189, -31959, -199976, -135065, -215116, -328795, -196291, -114268, -153619, -320477, -542557, -573080, -573805, -467365, -287340, -330129, -24405, 93902, 252766]
6056B52766R1701j18770r0904j82K4411j08631k56296p580Q8167J43185Q5996
6045A03863j96098l6266j21626r2611K69447J60548j76479k23367R0032Q1449
6035a41108p7116j923j27598n1056K68506k8149J6721P7984p3839r6443r7069
6024c31090K09719K21760J51211k11431o3778J59326n2281J17347p2780k05386
6014g7383k8389J14887P0802j29555r3809J21964p9751m7328R3306k0073R933
6003f5396k7285M9825p3562l1850N7711j39899j959R8582q341J56795J02249j02464
5991A4406m0231l0699k13730J0271P315J2932j9940L393Q3317j60702q5637K38021
5979a81284K13539K82645j17404k57311O400J35718r9914j12388L7088Q2561M6572
$$ y = [252766, 344467, 225697, 134793, 134611, 159022, 50391, -205905, -213485, -125318, 17867, 103863, -92235, -128501, -250127, -342738, -73291, 87257, -89222, -312589, -222557, -141108, -218224, -220147, -347745, -398801, -130295, -158444, -141723, -63739, -137578, -234021, -331090, -121371, 100389, 251600, 40169, -23609, 135717, 83436, 200783, 128003, -77383, -105772, 9115, 79917, -49638, -143447, -21483, -101234, -148562, -55256, -75329, -65396, -92681, -42856, -116418, -148268, -90557, -230456, -232415, -133833, -142174, 14621, 116870, 14406, -25825, -56524, -270254, -259983, -252668, -239736, -259676, -256283, -172966, -333668, -419305, -181284, 32255, 314900, 197496, -59815, -53415, 82303, -17611, -129999, -92911, -10350, 36222]
5968C6222j5446l6223L1988m4198O1172j24113M0450K26969j49227m5209n1264
5957f8879r0933j19891j2448J54758K45285j05883L0032k389j64152j7818J50445
5946a873p4975o1169J10589J27852O2071j695K25j52370j59823j05852j5258N5907
5934b16371N991j44608O4241J97289o7346j99375J92372L18222o3392j81108k20201
5923c14286k53238K28183K31800m3534J42517K9263n6698R2986J03217k58129
5913i7919k4552J82268j8189M9292Q499J12922j76567p9037R2633j9961k71929
5902b42540j40777J26967K36638J50886m3347j33782o219J13304J16887n2548
5892A25469r3904j32333R0275Q0628O4438J21519J28908J55175k16281q3782p860
$$ y = [36222, 20776, -15447, 16541, -27657, 33515, -90598, -50148, 176821, 27594, -17615, -68879, -159812, -279703, -292151, -137393, 107892, 2009, 32041, 29652, -134500, -152318, -1873, -76848, -138017, -27428, 100424, 162495, 160800, 161025, 8655, -151168, -257020, -272278, -216371, -210380, -354988, -290747, -93458, -160804, -360179, -167807, 150415, 87023, -94085, -314286, -567524, -339341, -107541, -151075, -8558, 20705, -35993, 56993, 160210, -97919, -122471, 59797, 41608, 90900, 99399, 212321, 35754, -43283, 49350, 29389, -242540, -383317, -256350, -19712, 131174, 87827, -45955, -52174, 61130, 178017, 125469, 31565, -100768, -10493, 70135, 134573, 256092, 385000, 540175, 323894, 240112, 232252]
5881B32252o4796k11508l95r0157N687n7172P0072J5353k41463j74273j8800N3341
5869d81859R2973o8553J34811O5559P2217O8277n9387O2067M3829q4146k9467
5858a83679J37222l804k6368J2252j4533J62682R3014k15842k49534q9482K75319
5847a02753O7548Q3619K0201n5693r4962m2535l5149n7667r0440L6860J54566
5836a16405J28240J29891R0925k32264j20463K29543K71128k74933l96648O2103
5826b28883m1207l0696j7409j2635K34647k4288N6547J29818j503J44815j12715
5815I6491k50255r3774J10581J41879r4199j51380J43363L03153k998o7450O7487
5804B02898N4014k6841l3871j23906k35613q8232J0526L1643K12458l1393J33353
$$ y = [232252, 167456, -44052, -44447, -134604, -128917, -186089, -116017, -100664, -342127, -516400, -535200, -481859, -388886, -457439, -322628, -257069, -184852, -116575, -175962, -113895, -70066, -154212, -183679, -46457, -50261, -76629, -64377, -78910, 83772, 176786, -39056, -288590, -378072, -102753, -35205, 48414, 68615, 12922, -82040, -124575, -159724, -217391, -307831, -270971, -116405, 11835, 141726, 232651, 387, -120076, 109467, 380595, 105662, -290986, -228883, -270090, -300786, -318195, -330830, -96183, -120471, -63924, 65894, 64391, 209206, 96491, -153764, -247538, -136957, 4922, -89277, -240657, -97294, 205859, 202861, 135411, 202898, 256912, 230071, 196200, 72294, -163319, -251551, -241025, -209382, 3076, -28317, 105036]
5793A05036j916N0216K594j6091j23470j58017o9244j52207j00864J27804P1656
5782b64503J881J72854J32930K12874K2243j86769j28572k4450J02502J13170
5772A54160r1677q2649L5112J44436K37134k9780k67072r8786j06351p0354J72970
5761b857J16817k40163r7043j28626L9517K29440J4782P1962J32679L0761j6481
5750A50788k61317j22890J41106J59242j38449k5594P0174j42808k5242K9079
5740a65911J30170R2939j01399J2760n4356j76130j34098J83279K86011k00702
5730a27437j71395J61112K32875n857q3732j19982k4006J72997n4035j68070J05312
5719h2218J3614K9613M605j64477p4015Q7333j0472J72228J32276j5899j16952
$$ y = [105036, 103120, 153336, 155930, 139839, 16369, -141648, -210892, -363099, -463963, -336159, -264503, -262622, -89768, 43162, 256036, 278279, 91510, -37062, -61512, 40990, 154160, 62483, -20166, 14946, 159382, 396516, 366736, 99664, 878, -105473, -175827, -2857, 113960, -126203, -223246, -351872, -312355, -82915, -68133, 3829, 136508, 167269, 150788, -110529, -233419, -92313, 66929, -71520, -97114, -26940, -169748, -194990, -165911, -35741, 57198, -44201, -31441, -85797, -261927, -396025, -212746, 73265, -127437, -298832, -137720, 95155, 89298, 5566, -114416, -138422, 34575, -19460, -187530, -82218, -68604, -38991, -34386, -198863, -272878, -185545, -196017, -23789, 108487, 92588, -24364]
5708b4364j30697k56820o0169K64280P8993q6605J04447l0469p7795j2362R7575
5697a33986L00985l2187M3403j86660k41860J12806J32770K8949K0370n3062O2784
5686E4312Q8973o2135p1637r0181n0666J29778M0008k31007j16409J77352L44443
5675B12831K02064O4159p8691j65216j1491q2337k96093r2730N8639L2597j31944
5664b88212P345o2562p8269K35831K8248O9178J9436o4749k7324R4789k7663j54300
5652b48252Q510m5267K72796L14710k8265p4973l5781J617j0085L4973j99589
5641i606k43647l7251J00486J12647M1400K59475N6638j66956k66376k28347J57126
5630b24411K57770J94430J13446m2031J3800k22328j51080q3044R6142R7884M8708
$$ y = [-24364, -155061, -411881, -472050, -207770, -128777, -215382, -110935, -141404, -219199, -231561, -133986, 166999, 134812, 178215, -8445, -250305, -137499, -4729, 24220, 44590, -8472, 54312, 143285, 81150, 9513, -80668, -131334, -1556, 38452, -192555, -308964, -131612, 212831, 414895, 479054, 400363, 235147, 223656, 141319, -154774, -247504, -188865, -156268, -288212, -280867, -343429, -421698, -185867, -157619, -88441, -69005, -133754, -161078, -66289, -93952, -248252, -239742, -285009, -12213, 302497, 274232, 199259, 163478, 165095, 155010, 189983, -9606, -253253, -290504, -190018, -77371, -35971, 223504, 280142, 113186, -153190, -381537, -224411, 33359, 227789, 341235, 299204, 313004, 90676, -60404, -143448, -47306, 50578, 99286]
5619I9286r2795j53951P2627K6297q8196r5344P0323K36249L300n5505j08446
5608h6155N6384m9843j30347M0515L664j45555j42144M8906J95597j04147L9331
5597b73794M19491J21633l13872k64424J16592R7624L24237K43013j22326k57815
5587I0359j19258K88300o270j90113J22934j02707j81196o4781L1238j12213J01782
5576a41925J82483J1608m0816j6223O8450j107j69511j9627O5094J22931P9564
5565A40921j4954j54559k76700l8777K04016J33111J21901k37353j7162R0131
5555d9425J32932j02627l1247J20419R5553J03766J591m0597j9834Q5165J09899
5544D05595j99061k09852o9683j43048R0242R7832k9656K3250N2153J04351P5160
$$ y = [99286, 6491, -147460, -74833, -48536, -136732, -232076, -161753, 74496, 77796, 22291, -86155, -29771, -79614, -209961, -169446, -165782, -311337, -453481, -404575, -208978, -313125, -273794, 145697, 267330, -46542, -310966, -194374, -96750, 227487, 470500, 348174, 90359, -28899, 259401, 253131, 63018, 185952, 83245, -97951, -162732, -131494, -243707, -141925, 40558, 52166, 11350, -4873, 63577, 62470, -107041, -126668, -61574, 61357, 140921, 125967, -28592, -305292, -344069, -140053, -6942, 114959, -122394, -139556, -49425, 83507, -19120, -50367, 70052, 165605, 269371, 270962, 230365, 210531, 295696, 405595, 206534, -3318, -73001, -216049, -125807, -27975, -57631, -34381, 17772, 122123, 197283]
5533A97283J01694j22564j78136j0696J18648K00144L3667j96559l14322N753
5523a65088J45495K7741N3981j24827L5022O1047k05401j97359p5870K42083n1609
5512b54785m2327K94144M429N2816k06294N3802J29392j6201R8583J31319q7190
5501A57688m7178L45k66781j88743P4382p449o6006L9164M0963P0006J90782o8393
5489g1220L7235Q0940P43j92485j82239j50429O2887J23900j46566K46028J95787
5478D581J69899L3431n7054L2113M0090J02951j3864k39188k1687J58892j93024
5467A7140M038L8006k9181j95210j70167j17706K15651L29774l4148l22673j14410
5456c78886M9299N0016K12566K34045J93619q2608j73365p6521J05882L0893K9227
$$ y = [197283, 298977, 176413, -1723, -12419, 106229, 306373, 340040, 143481, -170841, -165088, -19593, 8148, 62129, -62698, -27676, 33371, -172030, -369389, -445259, -203176, -254785, -297112, -2968, 1461, 54277, -152017, -98215, 31177, 14976, 113559, 244878, 157688, 110510, 110855, -155926, -344669, -270287, -277736, -343742, -304578, -263615, -193609, -2827, -71220, -33985, 46955, 47698, -144787, -327026, -477455, -414568, -290668, -437234, -191206, 4581, 174480, 207911, 150857, 182970, 223060, 326011, 312147, 72959, 51272, 210164, 17140, 21178, 59184, 30003, -165207, -335374, -453080, -237429, 92345, 58197, -264476, -378886, -329587, -279571, -67005, 167040, 360659, 278051, 104686, 28165, 134047, 164940, 194167]
5445A94167j9772M2604q926N9005N7461L4684p4938k20181j35287o6979R7801
5434d0361p5409k67831Q3501K07145N0797J84937j64564k04610k2755J50319N9210
5423c9621K9598M5270P8591M8418L5071M049J5946J53558J11512k91302l69772
5412a78682o9755o644K78844J5967P7500K85480O6519j56668j83766k30371k1366
5401a22942L2304N2031O5814J25177k441M338j06777j80725o4428J1431o4023
5390b50241J6273J76199J26335m0041n5769m2841p0617N0465l3401p5839L2074
5379a67403M9243L31982K40009J6335m7389j60120q3216l9002j7072j83900Q9266
5368B8733J56245K7503p0333j32750k02251k88268P2497L94315M26771j79524
$$ y = [194167, 174395, 216999, 208073, 267078, 324539, 359223, 284285, 64104, -71183, -138162, -40361, -115770, -383601, -300100, -92955, -42158, 142779, -21785, -226395, -249150, -98831, -39621, -10023, 35247, 113838, 162256, 197327, 201376, 217322, 370880, 482392, 191090, -178682, -248437, -255081, 23763, 39730, 117230, 402710, 469229, 312561, 128795, -101576, -122942, -90638, -38607, 27207, 152384, 149943, 154281, 47504, -133221, -197649, -186218, -250241, -233968, -57769, 68566, 28525, -27244, -70085, -140702, -90237, -123638, -199477, -167403, -118160, 213822, 453831, 470166, 422777, 262657, 179441, 140439, 123367, -60533, 28733, 184978, 212481, 142148, 9398, -192853, -481121, -408624, -14309, 412462, 232938]
5358B32938m07666j83711J14766K45443O5096j4730J59136q6685m5834j39387
5348f0634k67007P8179K10620P7557j34757l3551J4713M9433j41340K6742m8942
$$ y = [232938, -174728, -358439, -243673, 1770, 66866, 52136, 211272, 124587, 78753, -60634, -327641, -249462, -38842, 38715, -96042, -129593, -114880, -65447, -206787, -180045, -228987]
$$ [...]
##END NTUPLES=NMR SPECTRUM
##END=
