##TITLE=Analysis number 323454
Compound Code cc 52216
Book Reference 467/88/1
Project Code adrs
Chemist Name benw
##JCAMPDX= 6.0         $$ Bruker NMR JCAMP-DX V2.0
##DATA TYPE= NMR SPECTRUM
##DATA CLASS= NTUPLES
##ORIGIN= Bruker BioSpin GmbH
##OWNER= nmr
$$ XWIN-NMR		Version 3.5
$$ Wed Oct 25 12:29:58 2006 GMT Daylight Time (UT+1h)  MAYBRIDGE\nmr@NMR_250MHZ
##.OBSERVE FREQUENCY= 250.131544655141
##.OBSERVE NUCLEUS= ^1H
##.ACQUISITION MODE= SIMULTANEOUS (DQD)
##.ACQUISITION SCHEME= undefined
##.AVERAGES= 16
##.DIGITISER RES= 18
##SPECTROMETER/DATA SYSTEM= dpx250
##.PULSE SEQUENCE= zg30
##.SOLVENT NAME= CDCl3
##.SHIFT REFERENCE= (INTERNAL, CDCl3, 0, 16.522)
##AUDIT TRAIL= $$ (NUMBER, WHEN, WHO, WHERE, WHAT)
$$ ##TITLE= Audit trail, XWIN-NMR		Version 3.5
$$ ##JCAMPDX= 5.01
$$ ##ORIGIN= Bruker BioSpin GmbH
$$ ##OWNER= nmr
$$ C:\u/data/dgb/nmr/ADRS/1270/pdata/1/auditp.txt
$$ ##AUDIT TRAIL=  $$ (NUMBER, WHEN, WHO, WHERE, WHAT)
(   1,<2006-10-25 12:29:38.45 +100>,<MAYBRIDGE\nmr>,<NMR_250MHZ>,
      <created by zg, POWCHK disabled, PULCHK disabled
       configuration hash MD5:
       49 4B E0 1D 92 C2 6B 37 9F E6 65 BC 52 41 86 1D
       data hash MD5: 64K
       9E 23 27 F6 7B BA B3 E0 F7 B9 1A B3 AC 8D 2D CC>)
(   2,<2006-10-25 12:29:51.48 +100>,<MAYBRIDGE\nmr>,<NMR_250MHZ>,
      <Start of raw data processing
       ef LB = 0.3 FT_mod = 6 PKNL = 1 SI = 32K 
       data hash MD5: 32K
       A8 49 2B 23 C5 7C 83 96 35 D5 0A 52 B8 13 FA 27>)
(   3,<2006-10-25 12:29:53.18 +100>,<MAYBRIDGE\nmr>,<NMR_250MHZ>,
      <apk 
       data hash MD5: 32K
       00 74 D1 36 0C D1 69 AB F5 C4 62 44 B2 6A 1A CA>)
(   4,<2006-10-25 12:29:53.90 +100>,<MAYBRIDGE\nmr>,<NMR_250MHZ>,
      <abs ABSG = 5 
       data hash MD5: 32K
       9E 39 1B 36 11 C3 B5 65 8D 56 FF 22 86 23 01 24>)
$$ ##END=
$$ 
$$ hash MD5
$$ 94 E5 99 44 93 49 89 41 80 7D EB 6D BD 0D B2 F1
##$RELAX= 
##$RELAX= 
##$RELAX= 
##$RELAX= 
##$RELAX= 
##$RELAX= 
##$RELAX= 
$$ Bruker specific parameters
$$ --------------------------
##$DU= <C:\u>
##$EXPNO= 1270
##$NAME= <ADRS>
##$PROCNO= 1
##$TYPE= <nmr>
##$USER= <dgb>
##$AMP= (0..31)
100 100 100 100 100 100 100 100 100 100 100 100 100 100 100 100 100 100 
100 100 100 100 100 100 100 100 100 100 100 100 100 100 
##$AQSEQ= 0
##$AQ_mod= 3
##$AUNM= <au_zg>
##$AUTOPOS= <23 >
##$BF1= 250.13
##$BF2= 250.13
##$BF3= 250.13
##$BF4= 250.13
##$BF5= 500.13
##$BF6= 500.13
##$BF7= 500.13
##$BF8= 500.13
##$BYTORDA= 1
##$CFDGTYP= 0
##$CFRGTYP= 5
##$CHEMSTR= <none>
##$CNST= (0..31)
1 1 145 1 1 1 1 1 1 1 1 1 1 1 1 1 1 1 1 1 1 1 1 1 1 1 1 1 1 1 1 1 
##$CPDPRG= <>
##$CPDPRG1= <>
##$CPDPRG2= <>
##$CPDPRG3= <>
##$CPDPRG4= <mlev>
##$CPDPRG5= <mlev>
##$CPDPRG6= <mlev>
##$CPDPRG7= <mlev>
##$CPDPRG8= <mlev>
##$CPDPRGB= <>
##$CPDPRGT= <>
##$D= (0..31)
0 1 0 0 0 0 0 0 0 0.06 0 0 0 0 0 0 0.0002 0 0 0 0 0 0 0 0 0 0 0 0 0 0 
0 
##$DATE= 1161775777
##$DBL= (0..7)
120 120 120 120 120 120 120 120 
##$DBP= (0..7)
150 150 150 150 150 150 150 150 
##$DBP07= 0
##$DBPNAM0= <>
##$DBPNAM1= <>
$$ [...]
##$SUBNAM7= <"">
##$SUBNAM8= <"">
##$SUBNAM9= <"">
##$SW= 20.6930455092707
##$SWIBOX= (0..15)
0 0 3 0 0 0 0 0 0 0 0 0 0 0 0 0 
##$SW_h= 5175.983436853
##$TD= 65536
##$TD0= 1
##$TE= 683.16
##$TE2= 300
##$TE3= 300
##$TEG= 300
##$TL= (0..7)
0 120 120 120 120 120 120 120 
##$TP= (0..7)
150 150 150 150 150 150 150 150 
##$TP07= 0
##$TPNAME0= <>
##$TPNAME1= <>
##$TPNAME2= <>
##$TPNAME3= <>
##$TPNAME4= <>
##$TPNAME5= <>
##$TPNAME6= <>
##$TPNAME7= <>
##$TPOAL= (0..7)
0.5 0.5 0.5 0.5 0.5 0.5 0.5 0.5 
##$TPOFFS= (0..7)
0 0 0 0 0 0 0 0 
##$TUNHIN= 0
##$TUNHOUT= 0
##$TUNXOUT= 0
##$USERA1= <user>
##$USERA2= <user>
##$USERA3= <user>
##$USERA4= <user>
##$USERA5= <user>
##$V9= 5
##$VALIST= <valist>
##$VCLIST= <CCCCCCCCCCCCCCC>
##$VD= 0
##$VDLIST= <DDDDDDDDDDDDDDD>
##$VPLIST= <PPPPPPPPPPPPPPP>
##$VTLIST= <TTTTTTTTTTTTTTT>
##$WBST= 1024
##$WBSW= 4
##$XGAIN= (0..3)
0 0 0 0 
##$XL= 0
##$YL= 0
##$YMAX_a= 433228
##$YMIN_a= -365898
##$ZGOPTNS= <>
##$ZL1= 120
##$ZL2= 120
##$ZL3= 120
##$ZL4= 120
##$ABSF1= 16.522
##$ABSF2= -4.171173
##$ABSG= 5
##$ABSL= 3
##$ALPHA= 0
##$AQORDER= 0
##$ASSFAC= 0
##$ASSFACI= 0
##$ASSFACX= 0
##$ASSWID= 0
##$AUNMP= <proc_1d>
##$AZFE= 0.1
##$AZFW= 0.1
##$BCFW= 0
##$BC_mod= 0
##$BYTORDP= 0
##$COROFFS= 0
##$CY= 12.5
##$DATMOD= 1
##$DC= 0
##$DFILT= <>
##$DTYPP= 0
##$F1P= 14.0000005364418
##$F2P= -0.99999901652339
##$FCOR= 0.5
##$FTSIZE= 32768
##$FT_mod= 6
##$GAMMA= 0
##$GB= 0
##$INTBC= 1
##$INTSCL= 1
##$ISEN= 128
##$LB= 0.3
##$LEV0= 0
##$LPBIN= 0
##$MAXI= 10000
##$MC2= 0
##$MEAN= 0
##$ME_mod= 0
##$MI= 0
##$NCOEF= 0
##$NC_proc= -6
##$NLEV= 6
##$NOISF1= 0
##$NOISF2= 0
##$NSP= 0
##$NTH_PI= 0
##$NZP= 0
##$OFFSET= 16.522
##$PC= 1
##$PHC0= -49.06361
##$PHC1= 6.771563
##$PH_mod= 1
##$PKNL= yes
##$PPARMOD= 0
##$PSCAL= 4
##$PSIGN= 0
##$REVERSE= no
##$SF= 250.13
##$SI= 32768
##$SIGF1= 0
##$SIGF2= 0
##$SINO= 400
##$SIOLD= 32768
##$SREGLST= <1H.CDCl3>
##$SSB= 0
##$STSI= 32768
##$STSR= 0
##$SW_p= 5175.98343685301
##$SYMM= 0
##$S_DEV= 0
##$TDeff= 65536
##$TDoff= 0
##$TI= <Analysis number 999999
Compound Code 99
Book Reference 9
Project Code 9>
##$TILT= no
##$TM1= 0
##$TM2= 0
##$TOPLEV= 0
##$USERP1= <user>
##$USERP2= <user>
##$USERP3= <user>
##$USERP4= <user>
##$USERP5= <user>
##$WDW= 1
##$XDIM= 32768
##$YMAX_p= 424226479
##$YMIN_p= -564110
$$ End of Bruker specific parameters
$$ ---------------------------------
##NTUPLES= NMR SPECTRUM
##VAR_NAME=  FREQUENCY,     SPECTRUM/REAL,   SPECTRUM/IMAG
##SYMBOL=    X,             R,               I
##VAR_TYPE=  INDEPENDENT,   DEPENDENT,       DEPENDENT
##VAR_FORM=  AFFN,          ASDF,            ASDF
##VAR_DIM=   32768,         32768,           32768
##UNITS=     HZ,            ARBITRARY UNITS, ARBITRARY UNITS
##FACTOR=    0.157963299565203, 1,           1
##FIRST=     4132.6476996994, 0,             0
##LAST=      -1043.33573715361, 0,           0
##MIN=       -1043.33573715361, -564110,     0
##MAX=       4132.6476996994, 424226479,     0
$$ Real data points
##PAGE= N=1
##DATA TABLE= (X++(R..R)), XYDATA
$$ [...]
22803B9051L4748K9773r4172j8854k20534j5775Q6964O0876O895o9899k8962J43703
$$ 29051 63799 93572 -600 -19454 -239988 -255763 -168799 -107923 -101028 -170927 -199889 -56186
22791e6186O6851q7102K7315L4947j45494R129J14533M2152p7451r8095j6213
$$ -56186 10665 -76437 -49122 -14175 -159669 -150540 -36007 6145 -71306 -169401 -185614
22780a85614o2747j3845m1898j6191Q0520j4438L371L3547m9001J19340J74572
$$ -185614 -248361 -262206 -304104 -320295 -239775 -254213 -250842 -217295 -266296 -146956 27616
22769B7616j54859j57497O0552J37275Q6454J61285L8171j3570N519p5708j5996
$$ 27616 -127243 -284740 -224188 -86913 -459 160826 198997 185427 190946 115238 99242
22758I9242k1090K8484Q2621p6503l3997n6890j5450K8712j2016J4545o518K4802
$$ 99242 78152 106636 189257 112754 78757 21867 6417 35129 23113 37658 31140 55942
22746E5942R9437K41443K4981j22445J0151l3956k7046j48155j07633J0859P775
$$ 55942 155379 396822 421803 299358 309509 275553 248507 100352 -7281 3578 11353
22735A1353L7671L1154O2546P0575o9380j13061j78982l3728Q3225J26436J99900
$$ 11353 49024 80178 142724 213299 143919 30858 -148124 -181852 -98627 27809 227709
22724B27709q0963j08493j34914k55924J06262L27601m3301p701J01911J30442
$$ 227709 146746 38253 -96661 -352585 -246323 81278 37977 30276 132187 262629
22714B62629M2904j52789M629P5002L729l2971k36546j08069j03327l2988l0248
$$ 262629 305533 152744 157373 232375 236104 203133 -33413 -141482 -244809 -277797 -308045
22703c08045j9274j4126O5609N4806J34624J21700o4488q1550l464K3974J06467
$$ -308045 -327319 -341445 -275836 -221030 -86406 35294 -29194 -110744 -114208 -90234 16233
22692A6233R5551q4820l1554j14651k1831J73459M5687J02717m0095j71906o5015
$$ 16233 111784 26964 -4590 -119241 -141072 32387 78074 180791 140696 -31210 -96225
22681i6225m7017Q9074L7643n4749m6876J0295j17133P8415N8670J38680K9819
$$ -96225 -143242 -54168 -16525 -71274 -118150 -107855 -224988 -146573 -87903 50777 80596
22670H0596q8399M0255o3134q0664O9410N9090L0755j74280j8817r845M9439K24641
$$ 80596 -7803 32452 -30682 -111346 -41936 17154 47909 -126371 -145188 -155033 -105594 119047
22658A19047N47l6126j43304j28651J20141J55073P2514Q369J1898j28005k28788
$$ 119047 119594 83468 -59836 -188487 -68346 86727 159241 167610 179508 51503 -177285
22647a77285J97866J82275p3442o8352M0807r1170q3027N6666J23776L1682j39691
$$ -177285 20581 202856 129414 61062 101869 10699 -72328 -15662 108114 139796 105
22636A05j39106o5553N4113K02591K3555o0207m4760j44291J1065Q4708J31514
$$ 105 -139001 -204554 -150441 52150 75705 15498 -29262 -173553 -162488 -77780 53734
22625E3734K16703k05258r7595K00430q5974j07983J60035k5511m0599k0477l5448
$$ 53734 270437 65179 -32416 168014 82040 -25943 134092 108581 67982 47505 12057
22614A2057R6111P8957l5395j41954L2243N3857P8198J18741k20792j49482J29514
$$ 12057 108168 187125 151730 9776 42019 95876 174074 292815 72023 -77459 52055
22603E2055j9698o7066j08537o8037J35202J03817L1390j74149j6941L0392R2466
$$ 52055 32357 -34709 -143246 -211283 -76081 27736 59126 -115023 -131964 -101572 -9106
22592i106J27095Q2243j68911m0795J9862m1875p9334j00676L7109n4393O7195
$$ -9106 117989 200232 31321 -9474 10388 -31487 -110821 -211497 -174388 -228781 -161586
22581a61586J31455l7261J04085L9963r6546L6157N3921l8058J39473j9201p1875
$$ -161586 -30131 -67392 36693 76656 -19890 16267 70188 32130 171603 152402 80527
22570H0527m815o4853P0105k3057L1908k0969j42065L9462q5704l2950K4818K9961
$$ 80527 75712 10859 80964 57907 89815 68846 -73219 -33757 -119461 -152411 -127593 -97632
22558i7632J08808j32893j54749R4532J06562j6083k6848L8591M7795O7413m2381
$$ -97632 11176 -121717 -276466 -181934 -75372 -91455 -118303 -79712 -31917 35496 -6885
22547f885j52831k17486P7626N7029Q0811k2160K9477j16613n4195J98122K31301
$$ -6885 -159716 -377202 -299576 -242547 -161736 -183896 -154419 -271032 -325227 -127105 104196
22536A04196N9154j16192r5472N9015J8205p7154n3902J652M267J13076P9422
$$ 104196 163350 47158 -48314 10701 28906 -48248 -102150 -100498 -96231 16845 96267
22525I6267m6125q9959o1092J8448K7873M4216j7345k4736R1449j7613n4390p0355
$$ 96267 50142 -39817 -100909 -82461 -54588 -10372 -27717 -52453 38996 21383 -33007 -103362
22513a03362N2319K29344K2368j92925j26187j6795Q8313L333P9329R6901K6338
$$ -103362 -51043 178301 200669 7744 -118443 -135238 -46925 -43592 35737 132638 158976
22502A58976q7999n0128p930j1541K4525J37536l4006k07827m8240K2472M1569
$$ 158976 70977 20849 12919 1378 25903 163439 129433 -78394 -126634 -104162 -62593
22491f2593O3030j03881Q825J11806q4680N847J958k5275R2850J20339n3434j74200
$$ -62593 437 -103444 -94619 17187 -67493 -61646 -59688 -84963 7887 128226 74792 -99408
22479i9408j06995P3082o302J00026j7244P5304J41901j20166j20089R0272O5936
$$ -99408 -206403 -133321 -139623 -39597 -56841 18463 160364 40198 -79891 10381 76317
22468G6317M4555M107l6042r514L1142M1671j8574p5271j53190n4622n1101O1174
$$ 76317 120872 124979 88937 79423 110565 152236 133662 58391 -94799 -149421 -200522 -139348
22456a39348n451N4475J46025L5034J0368L5765j101j63474r6827P6526O5189
$$ -139348 -144799 -90324 55701 90735 101103 136868 135767 -27707 -124534 -48008 17181
22445A7181j8671j20721J0489R7051J0305k6732j99053n3355J01957J28092J59320
$$ 17181 -1490 -122211 -111722 -14671 -4366 -31098 -230151 -283506 -181549 -53457 105863
22434A05863k9410o2312m9270Q8074P1782k4978k14119j72568N8801J75151J07430
$$ 105863 76453 14141 -35129 52945 124727 99749 -114370 -286938 -228137 -52986 54444
22423E4444o4034n7817M4260R7757n9100K8290P3131K1167k0968j7202r6336j15897
$$ 54444 -9590 -67407 -23147 74610 15510 43800 116931 138098 117130 99928 3592 -112305
22411a12305N005K53586J76665j07812j95020K339p4640p997O2310M7018O49N4727
$$ -112305 -107300 146286 322951 215139 20119 22458 -52182 -60179 2131 49149 49798 104525
22399A04525J2294j6254k2168l8197P8177j9227J259j39564j13149O2993Q2971
$$ 104525 116819 100565 78397 40200 118377 99150 100409 -39155 -152304 -89311 -6340
22388f340j227l8264N3608L2212J5844j779j21707n8445k7595n8202Q7140q3549
$$ -6340 -7567 -45831 7777 39989 55833 54054 -67653 -126098 -153693 -211895 -124755 -208304
22376b08304j06253o3786M3866M1129p7487Q4931P2490J59106J62697o5688k9011
$$ -208304 -314557 -378343 -334477 -293348 -370835 -285904 -213414 -54308 108389 42701 13690
22365A3690O2649j03179o7517J15910M8671J1933L1072j00397j0635R3074p5547
$$ 13690 76339 -26840 -94357 21553 70224 82157 113229 12832 2197 95271 19724
22354A9724J86423K7215k3905q9538q7389J70611O2690r9148q3702j11074r4362
$$ 19724 206147 233362 209457 119919 32530 203141 265831 166683 82981 -28093 -122455
22343a22455j73250O4801J60210l8872K4085O2718N5896k3590l9021J01720M9170
$$ -122455 -295705 -230904 -70694 -109566 -85481 -22763 33133 9543 -29478 72242 121412
22332A21412r5654j38644R8824r9295l4742N3099j3105L4499J0685n7372N6527
$$ 121412 25758 -112886 -14062 -113357 -148099 -95000 -108105 -73606 -62921 -120293 -63766
22321f3766n526j6261j06842l4635R4665Q3861J43533Q334r0925L9246J15614
$$ -63766 -69292 -85553 -192395 -227030 -132365 -48504 95029 103363 12438 51684 167298
22310A67298r0593j91364J9485J65611j635p7876P2676q0088k81825j99180J84883
$$ 167298 76705 -114659 -95174 70437 68802 -9074 63602 -16486 -298311 -497491 -312608
22299c12608P3793k04P8315J3898K2354J3554P1418J1593j58832L3539J04258
$$ -312608 -238815 -239019 -160704 -146806 -124452 -110898 -39480 -27887 -186719 -153180 -48922
22288d8922j14822k8452J69022M0828m8080j17621j13851M0260M480N3553J82771
$$ -48922 -163744 -192196 -23174 17654 -30426 -148047 -261898 -221638 -217158 -163605 19166
22277A9166Q9918r7324k2986J3533j74n4066q9531L3282j41879J65375J46845
$$ 19166 109084 11760 -11226 2307 2133 -51933 -141464 -108182 -250061 -84686 62159
22266F2159m2916j19264q1603J53548Q7488O4707p4092L5770j19257j43103N7163
$$ 62159 19243 -100021 -181624 -28076 59412 124119 50027 85797 -33460 -176563 -119400
22255a19400J5116k609Q897n1363m7044O944K3501j6819J07508J14604K2716m4824
$$ -119400 -104284 -106893 -97996 -149359 -196403 -189459 -165958 -182777 -75269 39335 62051 17227
22243A7227j07766N4909M6937l7986m9973J5587r735Q4071k37188k65315J80734
$$ 17227 -90539 -35630 11307 -26679 -76652 -61065 -70800 13271 -223917 -489232 -308498
22232c08498K27867o112j55564M1920J46124J4085j9272k6876N2696J02046O3619
$$ -308498 -80631 -86743 -242307 -200387 -54263 -40178 -59450 -86326 -33630 68416 132035
22221A32035k4088L474N5758n5088j6520o3685j4455J4122R573j25048p7746P9043
$$ 132035 107947 111421 167179 112091 95571 31886 17431 31553 41126 -83922 -161668 -82625
22209h2625Q4464m3937L1860Q585q6161r933K00144J58433m1810k49441j06918
$$ -82625 1839 -42098 -10238 -1653 -87814 -97747 102397 260830 219020 -30421 -137339
22198a37339J4400O3137O7033O5186J72078j0548j44832j04280L5550J18057q7957
$$ -137339 -122939 -59802 7231 72417 244495 233947 89115 -15165 20385 138442 50485
22187E0485r2473p026l5564J8979k7573M3665L0906P9849l6391p7281k828j01449
$$ 50485 -41988 -49014 -84578 -65599 -93172 -49507 -18601 61248 24857 -52424 -55252 -156701
22175a56701k9640N7485L0556M7475J5620J15943o4009N0766k0110j50224M8530
$$ -156701 -186341 -128856 -98300 -50825 -35205 80738 16729 67495 47385 -102839 -54309
22164e4309j7823N8008L2994m3808M3965J66031Q5178p0854n6796p2907k6809
$$ -54309 -72132 -14124 18870 -24938 19027 185058 270236 199382 142586 69679 42870
22153D2870j2183p0138j26186P982Q7953J79066J06295K3961j01006j95980k5657
$$ 42870 30687 -39451 -165637 -157655 -69702 109364 215659 239620 138614 -57366 -83023
22142h3023M426M5653M2586J8164n0602N0303J18526q3544j97961O5408K8537
$$ -83023 -78597 -32944 9642 27806 -22796 27507 146033 62489 -135472 -70064 -41527
22131d1527O3334J26603j2082r7445j84055p1875n4078J54023o0376M9633l1116
$$ -41527 21807 148410 136328 38883 -145172 -217047 -271125 -117102 -177478 -127845 -158961
22120a58961j33495N7764P0797Q0043J43110J3963J19937K3471p7668M2661o5402
$$ -158961 -292456 -234692 -163895 -83852 59258 73221 193158 216629 138961 181622 116220
22109A16220q9893j11324O5715J04469j54032j4382Q755Q8357J54426k14939k2575
$$ 116220 26327 -84997 -19282 85187 -68845 -83227 -74472 13885 168311 -46628 -69203
22098f9203R7464q5165p0338K408R8852o246m5968K7161M3553p3870k8255J39590
$$ -69203 28261 -56904 -127242 -124834 -25982 -32228 -78196 -51035 -7482 -81352 -109607 29983
22086B9983N4104m1484N2705n788j50843N6524Q8870N23m1600j25322J75072Q1377
$$ 29983 84087 42603 95308 89520 -61323 -4799 84071 84594 42994 -82328 92744 174121
22074A74121j48499j25059j6088j2084l1667L2351o3713J43262M6735o4221m9367
$$ 174121 25622 -99437 -115525 -127609 -159276 -126925 -190638 -47376 -641 -64862 -114229
22063a14229j7198j3667o3929J31964J37189P8038M4869l2554o2951K604k0941
$$ -114229 -131427 -145094 -209023 -77059 60130 138168 183037 150483 87532 90136 69195
22052F9195O1591K4129r9356k8146j71414J21462N7042Q177l1541p4644K6216
$$ 69195 130786 154915 55559 27413 -144001 -22539 34503 42680 11139 -63505 -37289
22041c7289R1346O6240J35083j08664j16972j1821l4694j77295J05256K0029K9966
$$ -37289 54057 120297 255380 146716 29744 17923 -16771 -194066 -88810 -68781 -38815
22030c8815l4425l3794j49893m445j04077r855j4357R5455M8320l3858R9756K41679
$$ -38815 -73240 -107034 -256927 -261372 -365449 -375304 -389661 -294206 -245886 -279744 -179988 61691
22018F1691k4966k6936J15646N2039j76420l2302J5417q0463M9602R5115N2604
$$ 61691 36725 9789 125435 177474 1054 -31248 -15831 -96294 -46692 48423 101027
22007A01027o4338n4514J50075K2823N4962J15834k4897J0237n3207k04579k7546
$$ 101027 36689 -17825 132250 155073 210035 325869 300972 311209 258002 53423 25877
21996B5877M2820J60607p9605k8521N8581J0054P347J88999r6609k6399p449M743
$$ 25877 68697 229304 149699 121178 179759 189813 197160 386159 289550 263151 255702 260445
21984B60445k27485n3576L6310n4562q9430Q9078o5041P966J22989l407j48047
$$ 260445 32960 -20616 15694 -38868 -128298 -39220 -104261 -96295 26694 23287 -124760
21973a24760p8525M6629K9536j12692J03541J73413j9559J7740J01141n9255r3046
$$ -124760 -203285 -156656 -127120 -239812 -136271 37142 17583 35323 136464 77209 -15837
21962a5837O162p8329q5825L1393Q2162j8330l3083J12059Q639j4151n627q506
$$ -15837 -9675 -88004 -173829 -142436 -60274 -78604 -111687 372 9011 -5140 -10767 -19273
21950a9273k3313k1440p8416j12080n7113m3134J18104K0898j01036M7280R1430
$$ -19273 -42586 -64026 -142442 -254522 -311635 -354769 -236665 -215767 -316803 -269523 -178093
21939a78093J04931K7749M9443p6121P1416J49201j9555n1057k09760L0863m4539
$$ -178093 -73162 -45413 4030 -72091 -675 148526 128971 77914 -131846 -100983 -145522
21928a45522K0925j57840J3894J90500J37144p2907j2125J36240j66116J1989
$$ -145522 -124597 -282437 -268543 -78043 59101 -13806 -25931 110309 -55807 -43818
21918d3818L8264J32503m38o8820o102J3812R5682j28495J9172k7107N5638Q3861
$$ -43818 -5554 126949 126511 57691 51589 65401 161083 32588 51760 24653 80291 164152
21906A64152k9166p0197j71690L3844q2J25197r0829m7299M425j20067M734r736
$$ 164152 134986 64789 -106901 -73057 -73139 52058 -38771 -86070 -81645 -201712 -196978 -206714
21894b06714p2467K7267o5510n3942o580J96545K50218J15537q1903j88586m7543
$$ -206714 -279181 -251914 -317424 -371366 -377946 -181401 68817 184354 102451 -86135 -133678
21883a33678K42487J00867j82619q4288j01749R2590J38115R3614j3221m9376
$$ -133678 108809 209676 27057 -57231 -158980 -66390 71725 165339 152118 102742
21873A02742N8228M6212K1679j82064j59946k9025M7712J09167m1937N6388J27726
$$ 102742 160970 207182 228861 46797 -113149 -142174 -94462 14705 -27232 29156 156882
21862A56882Q5856j07523j33924R1140l6208k8855J33961J29077l8054m3920j61649
$$ 156882 242738 135215 1291 92431 56223 27368 161329 290406 252352 208432 46783
21851D6783o1133J42145L0135j12196k04040j4128K4453r8012K7436J53830q9048
$$ 46783 -14350 127795 157930 45734 -158306 -172434 -147981 -245993 -218557 -64727 -153775
21840a53775O4069M3269k1281m626l6229o1047M5640L0018K9799m2380m561M540
$$ -153775 -89706 -46437 -67718 -72344 -108573 -169620 -123980 -93962 -64163 -106543 -111104 -106564
21828a06564K4618J38461J42372j36957j45418n0903k0119K21308N6118j4451
$$ -106564 -81946 56515 198887 61930 -83488 -134391 -154510 66798 122916 108465
21818A08465j0697J3655K4091N7435j41249m1595n3814Q193l9004N236K4398L5882
$$ 108465 97768 111423 135514 192949 51700 10105 -43709 -35516 -74520 -69284 -44886 -9004
21806i004N4041m6854L3611j1290m8376K0425k5813j66228R6186R5353K3280J65884
$$ -9004 45037 -1817 31794 20504 -27872 -7447 -33260 -199488 -103302 -7949 15331 181215
21794A81215J31330o0273j63201n8352j02079k383O997J06947M7943j60221q451
$$ 181215 312545 252272 89071 30719 -71360 -73743 -66746 40201 88144 -72077 -80528
21783h0528R0070N7395p0762j10443p5692j2651K9626L9457J64075q9310j5049
$$ -80528 9542 66937 -3825 -114268 -189960 -202611 -172985 -133528 30547 -58763 -73812
21772g3812R8049n9346j37085L7690J34220J27483j8039J5690p1503j50007p4984
$$ -73812 24237 -35109 -172194 -134504 -284 127199 109160 124850 53347 -96660 -171644
21761a71644K5479K1664q9495r769Q4134P2500k1139O6731N3337M8002Q5984J01021
$$ -171644 -146165 -124501 -213996 -223765 -139631 -67131 -88270 -21539 31798 79800 165784 266805
21749B66805q2011m6986l7975l3899o3998M5291m9559J2609O5528n8940j67108
$$ 266805 184794 137808 99833 65934 1936 47227 -2332 10277 75805 16865 -150243
21738a50243j5942O7258n6729R7209m3928o3866O5714P9788J2651j39123j1837
$$ -150243 -166185 -98927 -155656 -58447 -102375 -166241 -100527 -20739 -8088 -147211 -159048
21727a59048J4922Q7450O1722Q8033q8764q0447m5240q6566O7806r8477K9456
$$ -159048 -144126 -56676 5046 93079 4315 -76132 -121372 -207938 -140132 -238609 -209153
21716b09153m2518l6488K6572o8520J7263j196M7685J57665J58342n8279j45808
$$ -209153 -251671 -288159 -261587 -330107 -312844 -314040 -266355 -108690 49652 -8627 -154435
21705a54435K09808j677r2361O5548r7671J00561l0050L6771L4528j09449j28786
$$ -154435 55373 53696 -38665 26883 -70788 29773 -277 36494 71022 -38427 -167213
21694a67213o438L7296r8580K9878q1833k0931J66321l4001j5286J21155k2619
$$ -167213 -173651 -136355 -234935 -205057 -286890 -307821 -141500 -175501 -190787 -69632 -92251
21683i2251n119j0875K834M6879O8027m7870l2406N3331Q5148L6416J1106r3743
$$ -92251 -97370 -108245 -105411 -58532 9495 -38375 -70781 -17450 67698 104114 115220 21477
21671B1477j67916r5745P4355J09207L2682p0901O8041n801k5664M2309m9783
$$ 21477 -146439 -242184 -167829 -58622 -25940 -96841 -28800 -34601 -60265 -17956 -67739
21660f7739n0887k6063J39932l2045p9938K1035K3138O6781o006l578k0712L5459
$$ -67739 -118626 -144689 -4757 -36802 -116740 -95705 -72567 -5786 -11792 -15370 -36082 -623
21648f23p8246K7203J44806j35172n6686q1597j39932O5281Q0699L5197J8328
$$ -623 -78869 -51666 93140 -42032 -98718 -180315 -320247 -254966 -174267 -139070 -120742
21637a20742q3988p6360j4777J40119P2707O6054K8690P2831r2886q8248l8579
$$ -120742 -204730 -281090 -295867 -155748 -83041 -16987 11703 84534 -8352 -96600 -135179
21626a35179N0534L0383J05111M4683o9823o7983o4979m7846Q3367L2060j33646
$$ -135179 -84645 -54262 50849 95532 25709 -42274 -107253 -155099 -71732 -39672 -173318
21615a73318p1090J58888J18016J18938o3593n8945j47442p8963J90683O3090
$$ -173318 -244408 -85520 32496 151434 87841 28896 -118546 -197509 -6826 56264
21605E6264j26021l6922M805P5267R4831p4216m6395Q0263N9774K6285j53622
$$ 56264 -69757 -106679 -101874 -26607 68224 -5992 -52387 27876 87650 113935 -39687
21594c9687j85032r132O3989n7920L5699K39317K7186j10813k2317O6205r0928
$$ -39687 -224719 -233851 -169862 -227782 -192083 47234 74420 -36393 -58710 7495 -83433
21583h3433j04277J2144K1328R5601M0394L6815j53607r5764L7008J48492J5466
$$ -83433 -187710 -175566 -154238 -58637 -18243 18572 -135035 -230799 -193791 -45299 -29833
21572b9833q5842J4680J56924J70862N4222o8491p7772j59997k09220L0649l7941
$$ -29833 -115675 -100995 55929 226791 281013 212522 134750 -25247 -234467 -203818 -241759
21561b41759q102M1593j91799Q7833k674R6483N3989N8656P8975L5134j6218J29952
$$ -241759 -249861 -208268 -400067 -312234 -314908 -218425 -164436 -105780 -26805 8329 -7889 122063
21549A22063j66664k85757j12229K30547j2879j4898M770L3559p2236J46389J93562
$$ 122063 -44601 -330358 -442587 -212040 -224919 -239817 -235047 -201488 -273724 -127335 66227
21538F6227P4778N4662Q2253j2581k7146j32337k26382N6145k5172j3563J27343
$$ 66227 141005 195667 277920 265339 238193 105856 -120526 -64381 -89553 -103116 24227
21527B4227n0112J4877O4828k296J32013q9500q8757R433K2096q6200o0427m940
$$ 24227 -25885 -11008 53820 51524 183537 94037 5280 14713 36809 -49391 -109818 -114758
21515a14758n085j48790m9340K16875R5015O803n5405j27783j61257J91786L7092
$$ -114758 -119843 -268633 -317973 -101098 -6083 720 -54685 -182468 -343725 -151939 -114847
21504a14847O5842J07632q602j36055J07477O8696j27379j32182j4926K15521
$$ -114847 -49005 58627 50025 -86030 21447 90143 -37236 -169418 -184344 31177
21494C1177Q944j24291o5906o4684l6346N6946L1147O1838J44413J12970j42323
$$ 31177 40121 -84170 -150076 -214760 -251106 -194160 -163013 -101175 43238 156208 13885
21483A3885j64196M1692J36776J14488j99826j95448J24007J85662M2114j25994
$$ 13885 -150311 -108619 28157 142645 -57181 -252629 -128622 57040 99154 -26840
21473b6840P0571k8909j64473k3077R2802k9156J32268M0595j34937M0631r3693
$$ -26840 43731 14822 -149651 -172728 -79926 -109082 23186 63781 -71156 -30525 -124218
21462a24218j61395K2805Q295J19860M0404K4735J5883J64164N8167M0782K9553
$$ -124218 -285613 -262808 -254513 -134653 -94249 -69514 -53631 110533 168700 209482 239035
21451B39035L732m8449m4000l6414L4327J38032q99L258j72558r8597n3284M8786
$$ 239035 242767 194318 150318 113904 148231 286263 285364 288622 116064 17467 -35817 12969
21439A2969P8700J28214m7215j02480n6694J41020N0990q0341j81981L5179K8694
$$ 12969 91669 219883 172668 70188 13494 154514 205504 125163 -56818 -21639 7055
21428G055n6897o5267K1108J40709j5934k22991P8130p0234M0194l2511j27677
$$ 7055 -49842 -115109 -94001 46708 30774 -192217 -114087 -184321 -144127 -176638 -304315
21417c04315Q9560K31945K5632k15826p768J9209j9492j11065R058J80274M4521
$$ -304315 -214755 17190 42822 -173004 -180772 -161563 -181055 -292120 -283062 -102788 -58267
21406e8267P6914M3998k7768j50020R420O91j2410J3860n9487q80o7951M152K09276
$$ -58267 18647 62645 34877 -115143 -105723 -105032 -117442 -103582 -163069 -163949 -231900 -227748 -18472
21393a8472j07544k0335O4965m049j3804J17667O7649M3629J48j9406k5363o1512
$$ -18472 -126016 -146351 -81386 -85435 -99239 18428 86077 129706 129854 110448 85085 23573
21381B3573n9069j4511j01768J6256R7767N6483n5686N3658J376o4556m8153o3339
$$ 23573 -35496 -50007 -151775 -135519 -37752 18731 -36955 16703 18079 -46477 -94630 -157969
21369a57969R2436J07758l1792o2038k0009M6255P0792j06558j24332O199O965
$$ -157969 -65533 42225 10433 -51605 -71614 -25359 45433 -61125 -185457 -179258 -172293
21358a72293j8390J20330J7018p182N7002j84167k01848J50400J66259J52748
$$ -172293 -190683 -70353 -53335 -60517 -3515 -187682 -389530 -239130 -72871 79877
21348G9877m7626o7029o6102r5423N8361K9357J2701P3568N3393n6451Q6231J50544
$$ 79877 32251 -34778 -100880 -196303 -137942 -108585 -95884 -22316 31077 -25374 60857 211401
21336B11401j88783k19917p2469J14408J08296l1824p2031k9052J25362M4759
$$ 211401 22618 -197299 -269768 -155360 -47064 -78888 -150919 -179971 -54609 -9850
21326i850k9936L9902k6909M812P6853k6775o974j84664n4659J15536Q6014L3626
$$ -9850 -39786 116 -26793 -21981 54872 28097 21123 -163541 -218200 -102664 -16650 16976
21314A6976r3498J16801P3339m5153q8105L8239N0994k05517r6425q6245O5439
$$ 16976 -76522 40279 113618 68465 -19640 18599 69593 -135924 -232349 -318594 -253155
21303b53155K4979R243K7877o0976P2631J02275l3873j06243J38018K3838j6232
$$ -253155 -228176 -218933 -191056 -252032 -179401 -77126 -110999 -217242 -79224 -55386 -71618
21292g1618q5332R9074Q2833n8438l013q632l08r0985l4772m1257j11879m481
$$ -71618 -156950 -57876 24957 -33481 -36494 -45126 -45434 -136419 -171191 -212448 -324327 -328808
21280c28808J33474m6702k3860J16552J09374k4120j04405j09956o5290l6525
$$ -328808 -195334 -242036 -265896 -149344 -39970 -64090 -168495 -278451 -343741 -380266
21270c80266L6990R1602J15581P2874j1127l3462M3516P2350m0231M4640o8738
$$ -380266 -343276 -251674 -136093 -63219 -74346 -107808 -64292 8058 -32173 12467 -56271
21259e6271n7516p0727l1967j02126O2494R9575r1432J08850Q5167q9572N23L4296
$$ -56271 -113787 -184514 -216481 -318607 -256113 -156538 -247970 -139120 -53953 -143525 -143002 -108706
21247a08706l4319k506p3472k5918M8331J32136O808O9224q5053k3228K4429P0780
$$ -108706 -143025 -145531 -219003 -244921 -196590 -64454 -57646 11578 -73475 -96703 -72274 -1494
21235a494J21912K618M9121O2212j47443j00520k5198j0826q0973q1318Q8273
$$ -1494 120418 123036 172157 234369 86926 -13594 -38792 -49618 -130591 -211909 -123636
21224a23636J96313O1877m4786K0051K14799j827j29056j29583N4525K05030o8654
$$ -123636 72677 134554 89768 109819 324618 322791 193735 64152 118677 323707 255053
21213B55053j39913J9131M5701r9273p6169j63453o7071m5694K7970J88376J24182
$$ 255053 115140 134271 179972 80699 4530 -158923 -225994 -271688 -243718 -55342 68840
21202F8840j42855l8954J43927j30972m2489m1379M7050J31239j0029n4141K3500
$$ 68840 -74015 -112969 30958 -100014 -142503 -183882 -136832 -5593 -15622 -69763 -46263
21191d6263j85904j04492J28832j05637m8444L5295R9695R0737J05787J960j47921
$$ -46263 -232167 -336659 -207827 -313464 -361908 -326613 -226918 -136181 -30394 -28434 -176355
21180a76355Q1961J60875K04999q682k03456j79029l6213J55622J39564j31624
$$ -176355 -94394 66481 271480 262798 59342 -119687 -155900 -278 139286 7662
21170G662q9171R9931k7296n7558q1394j440J67358J40913J15592N5826k53613
$$ 7662 -81509 18422 -8874 -66432 -147826 -149266 18092 159005 274597 330423 76810
21159G6810j68459o9596l6751K06191l700P1159N1461k9156l4407N9257j81999
$$ 76810 -91649 -161245 -197996 8195 4495 75654 127115 97959 63552 122809 -59190
21148e9190j25559J8581J1188R0438R9317n806R0530k8503k70934N117O5453J32477
$$ -59190 -184749 -166168 -154980 -64542 34775 28969 119499 90996 -179938 -174821 -109368 23109
21136B3109N3138p0197j76218k00594P4034K33205m7529O9461R8639M552p3891
$$ 23109 76247 6050 -170168 -370762 -296728 -63523 -111052 -41591 57048 61600 -12291
21125a2291M6138J2836k3616j80388M742K2275M2901J16611J15052o1384j8157
$$ -12291 33847 46683 23067 -157321 -152579 -130304 -87403 29208 144260 82876 64719
21114F4719N2947j05403k38077j61411L5796P3604n8286o9270M3443K85502M2779
$$ 64719 117666 12263 -225814 -387225 -351429 -277825 -336111 -405381 -361938 -76436 -33657
21103c3657k5496p1716j80817N9167J56745K89875J21093n032j78856j02956J28473
$$ -33657 -59153 -130869 -311686 -252519 -95774 194101 315194 310162 131306 28350 156823
21092A56823N5098j84680k8709J30031J14371j80069n0079q8675K5561K1785K0591
$$ 156823 211921 27241 -1468 128563 242934 62865 12786 -75889 -50328 -28543 -7952
21081g952Q7768M939K4422M43N8073K125m4207O5659K0988L0309m6219j29827
$$ -7952 79816 84755 109177 109620 167693 169818 125611 191270 212258 242567 196348 66521
21069F6521j59198o7855J127J1605l5598j9620J8526K0522J27026R5825k09261
$$ 66521 -92677 -160532 -159405 -147800 -183398 -203018 -184492 -163970 -36944 58881 -150380
21058a50380K1752r5374J02081O4943j00344q8977R7444K03971M8451o5785J8914
$$ -150380 -128628 -224002 -121921 -56978 -157322 -246299 -148855 55116 103567 37782 56696
21047E6696J20540k38131j31594J14797N4783L9878J51j3139J76031j16963j60024
$$ 56696 177236 -60895 -192489 -77692 -22909 16969 17120 3981 180012 63049 -96975
21036i6975J03264k0486k4701J3579j1552J0336J8457R4696K5377p1243J50670
$$ -96975 6289 -14197 -38898 -25319 -36871 -26535 -8078 86618 111995 40752 191422
21025A91422m6807j15102l2719m6975K2054K2027l1180k6965r1765l6029R8313
$$ 191422 144615 29513 -3206 -50181 -28127 -6100 -37280 -64245 -156010 -192039 -93726
21014i3726P9355j2798J9648J04315L6829p1063k06519o5617N0620k2404O679
$$ -93726 -14371 -27169 -7521 96794 133623 62560 -143959 -209576 -158956 -181360 -174681
21003a74681k3269M6233J04478r927q9735j28407M1421P3216m2795k3668n6971
$$ -174681 -197950 -151717 -47239 -57166 -146901 -275308 -233887 -160671 -203466 -227134 -284105
20992b84105O0453R8760P6869k572k4147q037j12468n3039n2610J3270n8509J11914
$$ -284105 -223652 -124892 -48023 -50595 -74742 -82779 -195247 -248286 -300896 -287626 -346135 -234221
20980b34221O4120J67696J4669l8080j42241k44151k6384O2449J49650J31084
$$ -234221 -170101 -2405 12264 -25816 -168057 -412208 -438592 -376143 -226493 -95409
20970i5409K11712K8467q6100m8172K9233j2464j03137r3268p8914l8552K56267
$$ -95409 116303 144770 58670 10498 39731 27267 -75870 -169138 -248052 -286604 -30337
20959c0337L8879j11284m468j2080o2609K8768j0045m108o6726Q5674J37635q8720
$$ -30337 8542 -102742 -107210 -119290 -181899 -153131 -163176 -167284 -234010 -148336 -10701 -99421
20947i9421l6759n9747O583N5308K4590o5953n506K7818m8988k9421N277q9865
$$ -99421 -136180 -195927 -189344 -134036 -109446 -175399 -180905 -153087 -202075 -231496 -226219 -316084
20935c16084L4581J30737J47559J26262J40278O4420J1253j10613k00923m1348
$$ -316084 -281503 -150766 -3207 123055 263333 327753 339006 228393 27470 -13878
20925a3878M6895k2092r7002N5669J3139j56028j8381K3138J01581k0738p0589
$$ -13878 33017 10925 -86077 -30408 -17269 -173297 -191678 -168540 -66959 -87697 -158286
20914a58286m0992P0806R6721P5148N7460J62871l7578m0670J3047m5228k0211
$$ -158286 -199278 -128472 -31751 43397 100857 263728 226150 185480 198527 153299 133088
20903A33088j6836l090p5440k7042N7902M0612K4801m0397L9491k1956j53782
$$ 133088 116252 113162 37722 10680 68582 109194 133995 93598 133089 111133 -42649
20892d2649j42073j6401J27390j32961P1988q7913J0569J03694r2750n2252J03665
$$ -42649 -184722 -201123 -73733 -206694 -134706 -222619 -212050 -108356 -201106 -253358 -149693
20881a49693N0968p9953L469R5622N3056j09256l3453N7841P332j13537J26256
$$ -149693 -98725 -178678 -175209 -79587 -26531 -135787 -169240 -111399 -104067 -217604 -91348
20870i1348R3639N5430k14771k7440l3920P1940P6973Q4128J386j38349j4365
$$ -91348 2291 57721 -157050 -184490 -218410 -146470 -69497 14631 16017 -122332 -136697
20859a36697P5704k6136N6013J5858m4750p1409j7024j41342K09441L8057m538
$$ -136697 -60993 -87129 -31116 -15258 -60008 -131417 -148441 -289783 -80342 -42285 -46823
20848d6823k33565J06096P3725O9705O2066j2302R8949q10r9408j4152K132K3582
$$ -46823 -280388 -174292 -100567 -30862 31204 18902 117851 117041 17633 3481 5613 29195
20836B9195r132o3196N495p9236j79724N3523J22597j2504n5524J86251M4449
$$ 29195 20063 -43133 -37638 -116874 -296598 -243075 -120478 -132982 -188506 -2255 42194
20825D2194j35505n2862j48008N8440q904J17487J57118Q792l1533M3588K0130
$$ 42194 -93311 -146173 -294181 -235741 -244645 -127158 29960 38752 7219 50807 70937
20814G0937k1665r3058k8307J23152M0884j32245j06307p352r445q7493J68146
$$ 70937 49272 -43786 -72093 51059 91943 -40302 -146609 -153961 -163406 -250899 -82753
20803h2753O2044K8168Q0927n6274n7171l9075K3395o6076j0979L5299J49600
$$ -82753 -20709 7459 88386 32112 -25059 -64134 -40739 -106815 -117794 -82495 67105
20792F7105J49044k33465q6242J36514p0153j58425j0029N2481R942p7231P6483
$$ 67105 216149 -17316 -103558 32956 -37197 -195622 -205651 -153170 -143228 -220459 -143976
20781a43976J185R196J0352n9339r0849j49031K8339J37294J80996L661k5936
$$ -143976 -142791 -133595 -123243 -182582 -273431 -422462 -394123 -256829 -75833 -72172 -98108
20770i8108J05199m667P7510j07055j45033q1811j2329J8987J33299J04846j6834
$$ -98108 7091 2424 79934 -27121 -172154 -253965 -266294 -247307 -114008 -9162 -25996
20759b5996N8742j76719j43168Q8409J62148J07873L4960m1159j60923j849J47322
$$ -25996 32746 -143973 -287141 -198732 -36584 71289 106249 65090 -95833 -97682 49640
20748D9640j10013J04112N621k3675k7220j7455o658K7104n2125O963N558P1112
$$ 49640 -60373 43739 49360 25685 -1535 -18990 -25648 1456 -50669 -43706 -38148 32964
20736C2964n2546l8825K2857Q4682l1045o1036p5581N9460q0676j19448j4611
$$ 32964 -19582 -58407 -35550 49132 18087 -42949 -118530 -59070 -139746 -259194 -273805
20725b73805R6689K7546p3738l9004m440J4314J37627O1616P5870o3866q6777
$$ -273805 -177116 -149570 -223308 -262312 -266752 -252438 -114811 -53195 22675 -41191 -127968
20714a27968M8295n0918r6650j454N6289P0446q4955J1061J8034K1255q012n253
$$ -127968 -79673 -130591 -227241 -228695 -172406 -101960 -186915 -175854 -157820 -136565 -144577 -149830
20702a49830j1682j09091m2106J27512K28741O5000j53225j04440O4808J12607
$$ -149830 -161512 -270603 -312709 -185197 43544 108544 -44681 -149121 -84313 28294
20692B8294R0031j34139O2855J9192j06112M10o7593m1656Q0029p6360j18289
$$ 28294 118325 -15814 47041 66233 -39879 -39469 -107062 -148718 -68689 -145049 -263338
20681b63338M5536k0555P8861L8976O0468L579q4242k8010K8477J47008o2300
$$ -263338 -217802 -238357 -159496 -120520 -60052 -56473 -140715 -168725 -140248 6760 -55540
20670e5540p2135L4305L2933l1085J09874K6224L943o2858Q0294Q5830K4161j24232
$$ -55540 -127675 -93370 -60437 -91522 18352 44576 48519 -14339 65955 151785 175946 51714
20658E1714l7965M7338o2274K323j39740n4833J6585J93271P8851n9926j15569
$$ 51714 13749 61087 -1187 1136 -138604 -193437 -176852 16419 95270 35344 -80225
20647h0225m3711n6361K9775m3353j25854M8227J10435P3837m9767m4498P3515
$$ -80225 -123936 -180297 -150522 -193875 -319729 -271502 -161067 -87230 -136997 -181495 -107980
20636a07980J2630n9616O5803R6415R5784J8472j02766n4526l9927O0966J8283
$$ -107980 -95350 -154966 -89163 7252 103036 121508 18742 -35784 -75711 -14745 3538
20625C538p0669N4629L464P0769J6861M3857J74n4697Q4746P5076j30428q2254
$$ 3538 -67131 -12502 -9038 61731 78592 122449 122623 67926 152672 227748 97320 15066
20613A5066l6820q9469P884O7657J52146j2555o4248o1206P7617P9693o7322p3558
$$ 15066 -21754 -111223 -103339 -35682 116464 103909 39661 -21545 56072 135765 68443 -5115
20601e115K1008j61777j629Q8658n9425o5423Q9296P4648q7181j467P6950j85445
$$ -5115 15893 -145884 -147513 -58855 -118280 -183703 -94407 -19759 -106940 -108407 -31457 -216902
20589b16902j69398j43100J18239O8532J20230K38402Q9985l1027l718k1006n2999
$$ -216902 -386300 -529400 -411161 -342629 -222399 16003 105988 74961 71243 50237 -2762
20578b762L5647K0924o083j35272O8459O9926r3069J586J5247o3084J27478O2287
$$ -2762 32885 53809 47726 -87546 -19087 50839 -42230 -40644 -25397 -88481 38997 101284
20566A01284k317j47098p4520P7657o7187R810j6934Q4629j2917J24478o5458
$$ 101284 98967 -48131 -122651 -44994 -112181 -102371 -119305 -34676 -47593 76885 11427
20555A1427n4499o0146M4779J15806k7929P5206L070j60071p104K5771O1088k5796
$$ 11427 -43072 -103218 -58439 57367 29438 104644 107714 -52357 -59461 -33690 27398 1602
20543A602j08891M3589J41807J60094j5130o1831j4699k24188N769J8219j4700
$$ 1602 -107289 -63700 78107 238201 223071 161240 146541 -77647 -71878 -53659 -68359
20532f8359k0670J59732J7815r4698j40079j51422m1506j9494K1715O7389j4592
$$ -68359 -89029 70703 88518 -6180 -146259 -297681 -339187 -358681 -336966 -269577 -284169
20521b84169l8119J29727P292M611P4964j3140Q2841o5636J049P6613k0706l7250
$$ -284169 -322288 -192561 -185269 -180658 -105694 -118834 -35993 -101629 -100580 -23967 -44673 -81923
20509h1923Q4799J12376o224L0769j15251j6208L8465r083k2128j28426L1604
$$ -81923 2876 115252 109028 139797 24546 8338 46803 37720 15592 -112834 -81230
20498h1230p6244L312q4161l2075J21174J15000p460l8493r7911k4646O5730M94
$$ -81230 -157474 -154162 -238323 -270398 -149224 -34224 -41684 -80177 -178088 -202734 -137004 -136510
20486a36510j3593o2805K1527O4850J26646J8872L868J24543q5150K2695J01980
$$ -136510 -150103 -212908 -191381 -126531 115 18987 22855 147398 62248 84943 186923
20475A86923J57702o4969j72466q9632r3648j29730j44466K7336j7094O0631K74805
$$ 186923 344625 279656 107190 17558 -76090 -205820 -350286 -322950 -340044 -279413 -4608
20464d608J49326n2527J06250m6958j52765p0612L3292M7586j55766j76953m7952
$$ -4608 144718 92191 198441 151483 -1282 -71894 -38602 8984 -146782 -323735 -371687
20453c71687J60829O8482j67161J17189Q3472J9613Q6080Q7739L0103R156k65518
$$ -371687 -210858 -142376 -309537 -192348 -108876 -89263 -3183 84556 114659 123815 -141703
20442a41703n8923J11662K9894r9111p949J6456n9068N8776P3949R9786J13110
$$ -141703 -200626 -88964 -59070 -158181 -166130 -149674 -208742 -149966 -76017 23769 136879
20431A36879J4300j45869j41538N3268N3596J7425k33192o0689J42584J19546
$$ 136879 151179 5310 -136228 -82960 -29364 -11939 -245131 -305820 -163236 -43690
20421d3690J00884j42575j10065k3341J20290K46343M2870j25139l07268n9803
$$ -43690 57194 -85381 -195446 -218787 -98497 147846 190716 65577 -241691 -301494
20411c01494J8430N1264J14830K51592p3964m7484J12476q7069j00975M5690J07610
$$ -301494 -283064 -231800 -116970 134622 60658 13174 125650 38581 -62394 -16704 90906
20400I0906J11346j2646K3669j03511j0776J943N2857j06236r6035o6947j08546
$$ 90906 202252 189606 213275 109764 98988 100931 153788 47552 -48483 -115430 -223976
20389b23976O8701J49874J4300j78350j47758J0103K9399L1368J75126J12875
$$ -223976 -155275 -5401 8899 -169451 -317209 -307106 -277707 -246339 -71213 41662
20379D1662j7038r642j1405k1524L6739J58910k3188O5578O6121J6932j53087
$$ 41662 24624 14982 3577 -17947 18792 177702 154514 220092 286213 303145 150058
20368A50058n3977j71707j30688O9630Q7244j0381l9700j8557j03160p489J30205
$$ 150058 96081 -75626 -206314 -136684 -49440 -59821 -99521 -118078 -221238 -228727 -98522
20357i8522N0095r1993q5563N0430R1176L2481j29286j367K35247k4290k3308
$$ -98522 -48427 -140420 -225983 -175553 -84377 -51896 -181182 -182549 52698 28408 5100
20346E100r13k6232l6960k07958K6505Q9921K9450L9575O2596q6555N3543M9407
$$ 5100 4187 -22045 -59005 -266963 -240458 -150537 -121087 -81512 -18916 -105471 -51928 -2521
20334b521N4713l3434j90378O0484N955J20129n6168P6968p0619q7073J26617
$$ -2521 52192 18758 -171620 -111136 -105181 14948 -41220 35748 -34871 -121944 4673
20323D673O662k1379n4472o8813m3946n4718O1588L263K0059o5292j15372J08983
$$ 4673 11335 -10044 -64516 -133329 -177275 -231993 -170405 -167142 -147083 -212375 -327747 -218764
20311b18764r629l7872J42753N6017J0560n9167r6238j6397P6006K3896N0069
$$ -218764 -228393 -266265 -123512 -67495 -56935 -116102 -212340 -228737 -152731 -128835 -78766
20300g8766j2455J2162n9272N4945l5730j55564k09955J7860K44858J10057J61428
$$ -78766 -91221 -79059 -138331 -83386 -119116 -274680 -484635 -466775 -221917 -111860 49568
20289D9568p3056j4737K59O6701j8490o8665M8147j04700k8337p3339M4656J30436
$$ 49568 -23488 -38225 -37966 28735 10245 -58420 -10273 -114973 -143310 -216649 -171993 -41557
20277d1557J3739o0528K1145N4530L4450P9365k915J01756M6943j49690j01722
$$ -41557 -27818 -88346 -67201 -12671 21779 101144 98229 199985 246928 97238 -4484
20266d484O6117l646o7208l3963j51127p2026Q6531J35582m017j8710p0873O746
$$ -4484 61633 57987 -9221 -43184 -194311 -266337 -179806 -44224 -48241 -66951 -137824 -131078
20254a31078J12600Q0799m5600j59630L2687Q9149L6997K8369n2029R588L6621
$$ -131078 -18478 62321 16721 -142909 -110222 -21073 15924 44293 -7736 1852 38473
20243C8473M6945p0410j40109l5748J14317J39639q45o1104p7129K0227J06246
$$ 38473 85418 15008 -125101 -160849 -46532 93107 92262 31158 -45971 -25744 80502
20232H0502J71449R5192M160r2358L20j04316j69532L3563J09659N7131M1129
$$ 80502 251951 347143 351303 258945 259265 154949 -14583 18980 128639 185770 226899
20221B26899j02257J0120J7259j33133j54098O4414j5084p7896k9697K07605J6116
$$ 226899 124642 134762 152021 18888 -135210 -70796 -85880 -163776 -193473 14132 30248
20210C0248m0268p8691K9515J61363R2415k2123j12783r583q8852j1474m9814
$$ 30248 -10020 -88711 -59196 102167 194582 172459 59676 50093 -38759 -50233 -100047
20199a00047K8556N5125m2660M2479J16429J5440R9005q6020l2198J18052M3171
$$ -100047 -71491 -16366 -59026 -16547 99882 115322 214327 128307 96109 214161 257332
20188B57332j06805r6901j07565L2564j02329J5266J15260J44488j84905j08442
$$ 257332 150527 53626 -53939 -21375 -123704 -108438 6822 151310 -33595 -142037
20178a42037J21000o4605R885j5091J29057K9123m4672m3799q3108k5729n9036
$$ -142037 -21037 -85642 -75757 -90848 38209 67332 22660 -21139 -104247 -129976 -189012
20167a89012J32313Q5135j07488n3878M2766m6579O7837L4887m2434L1915l2736
$$ -189012 -56699 28436 -79052 -132930 -90164 -136743 -68906 -34019 -76453 -44538 -77274
20156g7274k9557L3304J937K44J13342M8055l1228k2793j49760L2762J79291M1819
$$ -77274 -106831 -73527 -71590 -71346 41996 90051 58823 36030 -113730 -80968 98323 140142
20144A40142k1741K933j34812r0404n033k5667L5918J38778J62012p4385p0431
$$ 140142 118401 121334 -13478 -103882 -108915 -134582 -98664 40114 202126 127741 57310
20133E7310N6348R26o2119K4733N1746j16308p5879J7774j2194k1577q4329o116
$$ 57310 113658 114584 52465 77198 128944 12636 -63243 -45469 -57663 -79240 -163569 -169685
20121a69685l3368R8701n7175l8137l6675J9895N8102Q7067J22386r3077j1765
$$ -169685 -203053 -104352 -161527 -199664 -236339 -216444 -158342 -71275 51111 -41966 -53731
20110e3731n9174P6977M9373J28352j20379j62705N3395L8803j02814p3922K779
$$ -53731 -112905 -35928 13445 141797 21418 -141287 -87892 -49089 -151903 -225825 -223046
20099b23046k6476M7881j02050L2497K00659J46110q2606M4118k3554o9197n5281
$$ -223046 -249522 -201641 -303691 -271194 -70535 75575 -7031 37087 13533 -55664 -110945
20088a10945j7546J44128r0276j60461P929J53854R155j39705K58845J65748j37818
$$ -110945 -128491 15637 -74639 -235100 -227171 -73317 -64162 -203867 54978 220726 82908
20077H2908j25000O764Q8862m6766q139j42334j20300j26980j17316L6485R0871
$$ 82908 -42092 -35328 53534 6768 -1371 -143705 -264005 -390985 -508301 -471816 -380945
20066c80945m4458L545K06916M2377o0719K24604Q3655J19745p6495M9266n110
$$ -380945 -425403 -421858 -214942 -172565 -233284 -8680 74975 194720 118225 167491 162381
20055A62381K7211j39649j27455m5372k2273j11662l2802J2751M9479J3817j06258
$$ 162381 189592 49943 -77512 -122884 -145157 -256819 -289621 -276870 -227391 -213574 -319832
20044c19832N3749N1837k9447J56307J69178L6717J58459k38065p2098M6497l957
$$ -319832 -266083 -214246 -243693 -87386 81792 118509 276968 38903 -33195 13302 9345
20033I345Q6116q0946m8273M9252k89J37442Q1918L0239j39569q2480l0465m5238
$$ 9345 95461 14515 -33758 15494 15205 152647 234565 264804 125235 42755 12290 -32948
20021c2948N4433K8861j612M5736r3833L9687N1820J26061j12970o4594N1686
$$ -32948 21485 50346 48734 94470 637 40324 92144 218205 105235 40641 92327
20010I2327j21300l8725k480j2296o1155K2333O2545L7924M8843j01329k9170
$$ 92327 -28973 -67698 -70178 -82474 -143629 -121296 -58751 -20827 28016 -73313 -102483
19999a02483l8875K456O0036k7260P8006P7144M7170L3182K9828o0305N8334J9770
$$ -102483 -141358 -138902 -78866 -106126 -28120 49024 96194 129376 159204 98899 157233 177003
19987A77003o8495m2705j14969j9019O1131L436J2628R0328j3811p9894l7901
$$ 177003 108508 65803 -49166 -68185 -7054 -3618 9010 99338 85527 5633 -32268
19976c2268n5490J58507O3434j4694k9359j43051J1487J9527r0090o4282P5421
$$ -32268 -87758 70749 134183 119489 90130 -52921 -41434 -21907 -111997 -176279 -100858
19965a00858J55779J3632r5262k11954j5014L7628J53330K04345p7064j03621
$$ -100858 54921 68553 -26709 -238663 -253677 -216049 -62719 141626 64562 -39059
19955c9059m7256M7325r2214j25548O6333J66547k9468j52871O2619K8981J37123
$$ -39059 -86315 -38990 -131204 -256752 -190419 -23872 -53340 -206211 -143592 -114611 22512
19944B2512N7204k9934j02142l1008q391r128M7248K7518Q1715o5740o0038Q8521
$$ 22512 79716 49782 -52360 -83368 -91759 -100887 -53639 -26121 55594 -10146 -70184 18337
19932A8337M3115K6812Q811l8947L3879j32609m7518K3965m5878O7865l0936O5931
$$ 18337 61452 88264 97075 58128 92007 -40602 -88120 -64155 -110033 -42168 -73104 -7173
19920g173J63496n9494M1636J57544L4731k14434j94414L351R1990P4591k06336
$$ -7173 156323 96829 138465 296009 330740 116306 -78108 -74757 17233 91824 -114512
19909a14512j01432k0636L3606J20156R5113K9643O421j052Q5406M4888j2790
$$ -114512 -215944 -236580 -202974 -82818 12295 41938 48359 47307 132713 177601 164811
19898A64811j60808l7590N8685J14869j17635p3323O1592m6010m5856m5057k8689
$$ 164811 4003 -33587 25098 139967 22332 -50991 10601 -35409 -81265 -126322 -155011
19887a55011K12676J2929Q188l4169l3201o410N9219q4895j89099k8913K52650
$$ -155011 57665 70594 78782 44613 11412 5002 64221 -20674 -209773 -238686 13964
19876A3964q4942P896m1631m352L520O2775l7240K3362n8862n4520K113J422J17422
$$ 13964 -70978 -63082 -104713 -109065 -105545 -42770 -80010 -56648 -115510 -170030 -167917 -166495 -49073
19863d9073P5682m7049o5420k06202m1048L8104J17466J37722M4199j6764j2986
$$ -49073 26609 -20440 -85860 -292062 -333110 -295006 -177540 -39818 4381 -12383 -25369
19852b5369j4157O2572J46752o6619l22j04137o7064k9024P7004R7231j08508
$$ -25369 -39526 23046 169798 103179 102857 -1280 -68344 -97368 -20364 76867 -31641
19841c1641q2101P6702j0017P1780K0490P7787n7633l3619k0454p5368p6132N1233
$$ -31641 -113742 -37040 -47057 24723 45213 123000 65367 31748 11294 -64074 -140206 -88973
19829h8973n2144J9381J88544J0077j33881L5998Q3213l865j10096M5917N9707
$$ -88973 -141117 -121736 66808 76885 -56996 -20998 62215 58350 -51746 -5829 53878
19818E3878n4489N5073J2940M235j15677l1779O4611J48091j7749p2179J0982
$$ 53878 -611 54462 67402 71637 -44040 -75819 -11208 136883 119134 46955 57937
19807E7937j14796j87659J43038m7203j09536O7190m3300P9084K49440O2056j25455
$$ 57937 -56859 -244518 -101480 -148683 -258219 -191029 -234329 -155245 94195 156251 30796
19796C0796p1023N7570M401j50939k02431K22032J26462p6556N2632J30000o1843
$$ 30796 -40227 17343 21744 -129195 -331626 -109594 16868 -59688 -7056 122944 61101
19785F1101l7082k9601j10567J3713O5815O0517k01471j39006j3611O4048J59321
$$ 61101 24019 -5582 -116149 -102436 -36621 23896 -177575 -316581 -330192 -266144 -106823
19774a06823O1302m7267j09218K4316R2683j52367m8162j00787N4643J28889K09685
$$ -106823 -45521 -92788 -202006 -177690 -85007 -237374 -285536 -386323 -331680 -202791 6894
19763F894J84972N3940p9793j53223k30681o1794r1351N4185j8893O4978J86355
$$ 6894 191866 245806 166013 12790 -217891 -279685 -371036 -316851 -335744 -270766 -84411
19752h4411O0866n0175q5921J9882J47507J10417J9478J3434P8243m8185k0938
$$ -84411 -23545 -73720 -159641 -139759 7748 118165 137643 151077 229320 181135 160197
19741A60197j49306P1757J299K6919j10699o8567R0346l6211R8419K069j14129
$$ 160197 10891 82648 83947 110866 167 -68400 21946 -14265 84154 86223 -27906
19730b7906N5600j63065j1428o3493J23066M813j03384o6721r0519J7496Q3936
$$ -27906 27694 -135371 -146799 -210292 -87226 -82413 -185797 -252518 -343037 -325541 -241605
19719b41605k4096Q1061Q4531o7602K412N5158R8299m1228K2969k5935p7700M2797
$$ -241605 -265701 -184640 -100109 -167711 -165299 -110141 -11842 -53070 -30101 -56036 -133736 -90939
19707i0939P4771r9722k06766L8143J50324N8049j8795M6168N4282n7980n1322
$$ -90939 -16168 -115890 -322656 -284513 -134189 -76140 -94935 -48767 5515 -52465 -103787
19696a03787p2767m3824m6678J93130O4243J2643n6131j69674R4469R636L3885
$$ -103787 -176554 -220378 -267056 -73926 -9683 2960 -53171 -222845 -128376 -118740 -84855
19685h4855K9j18822l2402J09591J28070J0202j30520J954K8043m3908n975o9847
$$ -84855 -84826 -203648 -236050 -126459 1611 11813 -118707 -116753 -88710 -132618 -138593 -208440
19673b08440J36558J07580l7973j4946o1643P3033R0146P0815j72182j33901q4892
$$ -208440 -71882 35698 -2275 -17221 -78864 -5831 84315 155130 -17052 -150953 -235845
19662b35845K5959O4543j12980m9204Q5651Q617o2059J0664J8917p2367K18045
$$ -235845 -209886 -145343 -258323 -307527 -221876 -213259 -275318 -264654 -245737 -318104 -100059
19651a00059K13543N5901l9143Q6898l5974k08682O8619P1152k8844J03675q229
$$ -100059 113484 169385 130242 217140 181166 -27516 41103 112255 83411 187086 178857
19640A78857K0990m5835j41122r6044o5543J2721J10118J28066k1830k7871j4849
$$ 178857 199847 154012 12890 -83154 -148697 -135976 -25858 102208 80378 52507 37658
19629C7658j31375n9244R9643J35981M3710O4939L7864Q9171k6480o8482j8078
$$ 37658 -93717 -152961 -53318 82663 126373 191312 229176 318347 291867 223385 205307
19618B05307q7142l1619j57808j10943M3418Q1576L096M5360k7781r6306L3809
$$ 205307 118165 86546 -71262 -182205 -138787 -57211 -54115 -8755 -36536 -132842 -99033
19607i9033J45567k0564r871j61157r335K41206J36421r301n5641o4582k4359
$$ -99033 46534 25970 16099 -145058 -154393 86813 223234 213933 158292 93710 69351
19596F9351n7837K0571Q7547n396Q2869j14801j83386J14980K0170j01416L3963
$$ 69351 11514 32085 119632 114236 197105 82304 -101082 13898 34068 -67348 -33385
19585c3385J82258N1918l1372M449o6435o9217r8707o6037j4143Q4501J42526
$$ -33385 148873 200791 169419 173868 107433 38216 -60491 -126528 -140671 -56170 86356
19574H6356j2107m854n7168P598j15667P7827J56311n5128j50945j18231l3782
$$ 86356 74249 69395 12227 19825 -95842 -18015 138296 83168 -67777 -186008 -219790
19563b19790P3248K34260M8468q9617j98899N2766J05318m5458N1480k4442N2023
$$ -219790 -146542 87718 136186 46569 -152330 -99564 5754 -39704 11776 -12666 39357
19552C9357j11485j49254O2628P5288l2634K6439L29K6231p1729P1284M1118N4602
$$ 39357 -72128 -221382 -158754 -83466 -116100 -89661 -89332 -63101 -134830 -63546 -22428 32174
19540C2174M7839p4829j73143j35980N7312J52661P6898J01690J20429N0974l4387
$$ 32174 80013 5184 -167959 -303939 -246627 -93966 -17068 84622 205051 256025 221638
19529B21638j46172K8995j61337j50963m8430J13926R7114j05198j32242R2320
$$ 221638 75466 104461 -56876 -207839 -256269 -142343 -45229 -150427 -282669 -190349
19519a90349J69589J24247o0950n7685P2678j773m9736j41295o4460j8068K26852
$$ -190349 -20760 103487 42537 -15148 57530 55757 6021 -135274 -199734 -217802 9050
19508I050r053l7512n9855R2896l0217r9493L983R8492M0241N0622R784m7366
$$ 9050 -3 -37515 -97370 -4474 -34691 -134184 -130201 -31709 8532 59154 68938 21572
19496B1572k8035J07940p5L2911j26898L7255m2099J13736R2408p9145p6643K920
$$ 21572 -6463 101477 101402 134313 7415 44670 2571 116307 208715 129570 52927 55847
19484E5847k4505n4407o5946J38102K44418j1411j06966q0263p3597j3681r2049
$$ 55847 31342 -23065 -89011 49091 293509 282098 175132 94869 21272 7591 -84458
19473h4458r5072Q044J45864J39788M3424Qj0061q6425j00572j47937N2811J37361
$$ -84458 -179530 -171486 -25622 114166 157590 157598 147537 61112 -39460 -187397 -134586 2775
19461B775k8464n4029p4357p987k7721Q3941K8216r3500M2469K26022M2030j07455
$$ 2775 -25689 -79718 -154075 -162062 -189783 -105842 -77626 -171126 -128657 97365 139395 31940
19449C1940p8210Q1587P5032J9545J07391p4431j42560j77115J83307J58699M2279
$$ 31940 -46270 35317 110349 129894 237285 162854 20294 -156821 26486 185185 227464
19438B27464r0820L169j22263p0817m7787j1519J16611m8513l2726J16997N0659
$$ 227464 136644 139813 17550 -53267 -101054 -112573 4038 -44475 -77201 39796 90455
19427I0455m0779J03112L554O5281j67472R9495Q8965j57280J02254M947p3569
$$ 90455 49676 152788 156342 221623 54151 153646 242611 85331 187585 192532 118963
19416A18963j20651K2389L887q3418p9045o116P450J0216M2499J13076l4014k09780
$$ 118963 -1688 20701 24588 -58830 -137875 -143991 -136541 -126325 -83826 29250 -4764 -214544
19404b14544j24097N6668Q6782L3277O2381l799k8016l8996J51166p1497m6586
$$ -214544 -338641 -281973 -195191 -161914 -99533 -103332 -131348 -170344 -19178 -90675 -137261
19393a37261J9753O3688j9305p3023K6022R2937J28233N7071n9992j7732p4921
$$ -137261 -117508 -53820 -73125 -146148 -120126 -27189 101044 158115 98123 80391 5470
19382E470K79J03372n2200l6939M4491J42144p2018l6566M4419j22615j7718p3751
$$ 5470 5749 109121 56921 19982 64473 206617 134599 98033 142452 19837 2119 -71632
19370g1632k17892o8371l3519O9399L49191N4686n4504J5069M8040j56154j17999
$$ -71632 -289524 -357895 -391414 -322015 27176 81862 27358 42427 90467 -65687 -183686
19359a83686j02079Q9506Q2971k0358J3449K5525J07374M3897L5743j60844o5955
$$ -183686 -285765 -196259 -113288 -133646 -120197 -94672 12702 56599 92342 -68502 -134457
19348a34457k9700l709M9549k1036R2298k638R9115M4074j3288k8350M9093Q569
$$ -134457 -164157 -167866 -118317 -139353 -47055 -49693 49422 93496 80208 51858 100951 109520
19336A09520K7047J4088L3885P6670L9911l9375j25004k00784j15350j21679J29226
$$ 109520 136567 150655 184540 261210 301121 261746 136742 -64042 -179392 -301071 -171845
19325a71845K02531L3837j9945r2284r3328P0973J21045J38509J41821K2546m8591
$$ -171845 30686 64523 44578 -47706 -141034 -70061 50984 189493 331314 353860 305269
19314C05269k6860j70706J70774J08665j25144p9133K8408o7177K4337m743j04025
$$ 305269 278409 107703 278477 387142 261998 182865 211273 144096 168433 163690 59665
19303E9665j17168J1953K0186J05588k6569J62387n793N3480n4206j64324K9102
$$ 59665 -57503 -45550 -25364 80224 53655 216042 210249 263729 209523 45199 74301
19292G4301o0461j09007j04457n0461m6604R6764J95019k4808k37957N3917k8235
$$ 74301 13840 -95167 -199624 -250085 -296689 -199925 -4906 -29714 -267671 -213754 -241989
19281b41989J2544P8655K9758M1610l0500j3464m9794j39175J04023J28673j0214
$$ -241989 -229445 -150790 -121032 -79422 -109922 -123386 -173180 -312355 -208332 -79659 -89873
19270h9873m3909L5811N6299l9439j56765p6922j2417R8521k9779P1793J03976
$$ -89873 -133782 -97971 -41672 -81111 -237876 -314798 -327215 -228694 -258473 -186680 -82704
19259h2704J8438J40941J1410p0988j9280j2246N3303o1735q0070p9030J03765
$$ -82704 -64266 76675 88085 17097 -2183 -14429 38874 -22861 -102931 -181961 -78196
19248g8196K1692P4360P5097j3461j25442R802o5055m6348J10198m2231J0877
$$ -78196 -56504 17856 92953 79492 -45950 -36148 -101203 -147551 -37353 -79584 -68707
19237f8707J19569P4615M3183L9920n6286j25622r158m2050J69155L7640j33740
$$ -68707 50862 125477 168660 208580 152294 26672 17514 -24536 144619 182259 48519
19226D8519L573k1446O1446j52863j26589M2005L1482j09105O9287J48153M7244
$$ 48519 52092 30646 92092 -60771 -187360 -145355 -113873 -222978 -153691 -5538 41706
19215D1706p0315Q3573l7453L3502J16633l6517m2472j33335o2883K12005k1223
$$ 41706 -28609 54964 17511 51013 167646 131129 88657 -44678 -107561 104444 83221
19204H3221k32383J35504R735J40674K4034p2708p6718M563J10994Q830n6656
$$ 83221 -149162 -13658 -3923 136751 160785 88077 11359 15922 126916 135746 79090
19193G9090J26295M2758k9044J06808K7172j42399j672J31516p962n2992m3532
$$ 79090 205385 248143 219099 325907 353079 210680 209008 340524 332562 279570 236038
19182B36038j93517j33899K8953J29263J05489l3450o6763J368J09469J02859
$$ 236038 42521 -91378 -62425 66838 172327 138877 72114 73482 182951 285810
19172B85810m9304n2007N3650q239j2737l0057J3313j63781J21442P8135N2432
$$ 285810 236506 184499 238149 229910 217173 187116 200429 36648 158090 236225 288657
19161B88657K3283j41344l20j10975p6897J23035J02586J00512j0240n1203O3625
$$ 288657 311940 170596 170276 59301 -17596 105439 208025 308537 298297 247094 310719
19150C10719P2229O2367k7968q54K2310J12648J18517K67038L18525J76519o7865
$$ 310719 382948 445315 417347 416493 438803 551451 669968 937006 1255531 1432050 1364185
19139A364185r1274l06531k27741O628J59206J81893P6849J17844N0931J12923
$$ 1364185 1272911 966380 738639 745267 904473 1086366 1163215 1281059 1331990 1444913
19129A444913k3326k01293l81427l09175k10985L8169N526q8443l0329j19742
$$ 1444913 1421587 1220294 838867 529692 318707 356876 362402 273959 243630 123888
19119A23888O5394P382K5674Q2931K18330m9571l14830j45926M3125K15910n2413
$$ 123888 189282 196664 222338 305269 523599 474028 159198 13272 56397 272307 219894
19108B19894n8613p580J3360M1942R7591k801j79416Q0440J74976R0726J6909
$$ 219894 161281 153701 167061 209003 306594 303793 124377 204817 379793 470519 487428
19097D87428J6566J29929K85217J91929l2126L7220J97031J34445l63519k17436
$$ 487428 503994 633923 919140 1111069 1078943 1116163 1313194 1447639 1084120 866684
19087H66684k7817P2462J67850R2425K18574L56613m2373k89859j66378r0283
$$ 866684 838867 911329 1079179 1171604 1390178 1746791 1704418 1414559 1248181 1157898
19077A157898m8066k35802k37441K4591o5604j04367r566J0272M8325j1970m8321
$$ 1157898 1109832 874030 636589 661180 595576 491209 481643 491915 540240 528270 479949
19066D79949L0538N0064J28103L8664P4077O5539r9930k06848j33576j07092k7549
$$ 479949 510487 560551 688654 727318 801395 866934 767004 560156 426580 319488 291939
19055B91939J79549J76544J03385O0975J23410j7624j42045j89479j16577Q7815
$$ 291939 471488 648032 751417 812392 935802 918178 776133 586654 470077 557892
19045E57892j16268j56188L7646K8496m121q8345j53291j12144N2131l8433q0420
$$ 557892 441624 285436 323082 351578 347457 259112 105821 -6323 45808 7375 -73045
19034g3045m7146O7639J3158l095o7370J688J0812K0185Q2870M2635O71P4690
$$ -73045 -120191 -52552 -39394 -42489 -109859 -108171 -97359 -77174 5696 48331 49002 123692
19022A23692N2318Q071J82709K22905L6087M7334K11525Q2598M4632J51278J48840
$$ 123692 176010 184081 366790 589695 625782 673116 884641 967239 1011871 1163149 1311989
19011A311989j09211N4681J82057J34938O5737p598m1827l9695l4442q8754m5112
$$ 1311989 1202778 1257459 1439516 1574454 1640191 1632593 1590766 1551071 1516629 1427875 1382763
19000A382763J10627j85550j74890Q0145p1360j99278k03106j15139k270j00997
$$ 1382763 1493390 1307840 1132950 1213095 1141735 942457 739351 624212 621942 520945
18990E20945q5047j12700o392n2250p6220M3852q4041P9350M2787j78455l0885
$$ 520945 435898 323198 316806 264556 188336 232188 148147 227497 270284 91829 60944
18979F0944J88900O6279j9993J3577K4717m6007M7551R9869L3306j06573J9941
$$ 60944 249844 316123 296130 309707 334424 288417 335968 435837 469143 362570 382511
18968C82511L0856m3359J92298J28837j3486K19791L7534N9099N1129j03444j47044
$$ 382511 413367 370008 562306 691143 677657 897448 934982 994081 1045210 941766 794722
18957G94722j13213L8162p8777j7613R6771J30996J47586r9899K124j6073q7277
$$ 794722 681509 719671 640894 623281 720052 851048 998634 898735 900859 884786 797509
18946G97509j75374q4597j03162R703n7389r1550n289J73416j196j90122O7825
$$ 797509 622135 537538 434376 444079 386690 295140 289851 463267 462071 271949 339774
18935C39774O0430j25063l1998m8780l3832m3286J97668m5717j39450p5700J926
$$ 339774 400204 275141 243143 194363 160531 117245 314913 269196 129746 54046 55972
18924E5972K4292O6199J66819P4754L6837k02564k28179J9733L2866J16074J70129
$$ 55972 80264 146463 313282 388036 424873 222309 -5870 13863 46729 162803 332932
18913C32932J5928j2521q0806n9392n1769K0762J8474K3032l5782J00980l1646
$$ 332932 348860 336339 255533 196141 144372 165134 183608 206640 170858 271838 240192
18902B40192L3982j32663P5115K6546n8102j42371J27304J20028q8074j27576
$$ 240192 274174 141511 216626 243172 185070 42699 170003 290031 201957 74381
18892G4381m990l9694L3090O1617R0028j38634n567J07464M6972P5472o1187j45210
$$ 74381 69391 29697 62787 124404 214432 75798 70231 177695 224667 300139 238952 93742
18880I3742K54335J43039J19342J26810q3968k38068j61190k0503j78126M9220
$$ 93742 348077 491116 610458 737268 653300 415232 254042 233539 55413 104633
18870A04633J61824m858J09475J7364r937o2004j98O118m8970j9833L4695q4187
$$ 104633 266457 261599 371074 388438 378501 316497 316299 322417 273447 253614 288309 204122
18858B04122L2693L3630M4916p2658r8719M3261J51563m0016J7782o1250j65586
$$ 204122 236815 270445 315361 242703 143984 187245 338808 298792 316574 255324 89738
18847H9738J7790J22729N3813O9951q90j38472k04807J4141k6787J62165J39984
$$ 89738 107528 230257 284070 354021 353131 214659 9852 23993 -2794 159371 299355
18836B99355R7822N6832j9452J72814j2599m8163P4054j1121j88381k9120o0194
$$ 299355 397177 454009 434557 607371 594772 546609 620663 609542 421161 392041 331847
18825C31847p8389R528K5349P0921M4687p7150J17549j10589M0926K65181P6925
$$ 331847 253458 262986 288335 359256 403943 326793 444342 333753 374679 639860 716785
18814G16785k32462k62556j5651K21804J76377K3437J9747J26170q8470j13296
$$ 716785 484323 221767 206116 427920 604297 627734 647481 773651 685181 571885
18804E71885m6670j02213p6106l3616j8060j18010J62169J48565L015L1002j44373
$$ 571885 525215 423002 346896 313280 295220 177210 339379 487944 490959 521961 377588
18793C77588P395J21919N5159P3649j210j52993j32344j8684N6861J38909J16128
$$ 377588 384983 506902 562061 635710 634500 481507 349163 330479 387340 526249 642377
18782F42377l6612M3680j24809q2965N572j8885M2340R1882J12747K04192J7053
$$ 642377 605765 649445 524636 441671 447243 428358 470698 562580 675327 879519 896572
18771H96572J15973K12582J77099L24954L6544j35600k20077k52958j80355j72140
$$ 896572 1012545 1225127 1402226 1727180 1763724 1628124 1408047 1155089 974734 802594
18761H02594o9493R1362J48677R4563N2645j2146j17003j60183P3108p9332m6636
$$ 802594 733101 824463 973140 1067703 1120348 1108202 991199 831016 904124 824792 778156
18750G78156J98002J0070j07731k8563r9120k9466n6905J49214Q4922J04319P3514
$$ 778156 976158 986228 878497 849934 750814 721348 664443 813657 898579 1002898 1076412
18739A076412j30466n3751j2549P1821j60046k94730n3893O5090l8612j23877
$$ 1076412 945946 892195 879646 951467 791421 496691 442798 507888 469276 345399
18729C45399O5117N8461l6145J22238j0031j8568L9299P9517J43827J4014K8013
$$ 345399 410516 468977 432832 555070 545039 526471 565770 645287 789114 803128 831141
18718H31141m8479p0162L3010j42642j19734N5735J82050K76692J89062J41337
$$ 831141 782662 712500 745510 602868 483134 538869 720919 997611 1186673 1328010
18708A328010L183P1711p7091k2121K3992q2110l9978m3267L5021J26949K01552
$$ 1328010 1331193 1402904 1325813 1303692 1327684 1245574 1205596 1162329 1197350 1324299 1525851
18697A525851N9110j769o6364K4668n2974m5724j593M5531j18223k03572k2902
$$ 1525851 1584961 1583192 1516828 1541496 1488522 1442798 1441205 1486736 1368513 1164941 1142039
18686A142039l0626L5977K87246K11533R3862j21541j33924j9625j9556J01125
$$ 1142039 1111413 1147390 1434636 1646169 1740031 1618490 1484566 1464941 1445385 1546510
18676A546510J68482O2334J05622J03232M9471J49185L0024Q559J21023J17466
$$ 1546510 1714992 1777326 1882948 1986180 2035651 2184836 2214860 2223419 2344442 2461908
18666B461908Q9208M0872J9737R8888K20839Q1781J14910J52206K71709L87762
$$ 2461908 2551116 2591988 2611725 2710613 2931452 3013233 3128143 3280349 3552058 3939820
18656C939820K32180K24602N00234N29553M99677N75153M43329M90070K64300
$$ 3939820 4172000 4396602 4896836 5426389 5926066 6501219 6944548 7434618 7698918
18647G698918L04243M57724O31111Q39154J224919J292863J098471Q65456N39290
$$ 7698918 8003161 8460885 9091996 9931150 11156069 12448932 13547403 14412859 14952149
18638A4952149M72626P46620J097682J801165K479399L645934N381698P911896
$$ 14952149 15424775 16171395 17269077 19070242 21549641 25195575 30577273 38489169
18630C8489169J2209978J8801010K6472650L2731320L5881275L2476877J5266787
$$ 38489169 50699147 69500157 95972807 128704127 164585402 197062279 212329066
18623B12329066j93210m027384j2027679k6150417k2650616l890437J6284684
$$ 212329066 212135856 208108472 196080793 169930376 147279760 143389323 159674007
18616A59674007L1530124M0049646L8570777J5502184j1911021k1056546l4181850
$$ 159674007 191204131 231253777 269824554 285326738 273415717 252359171 218177321
18609B18177321n0793619m6510498l1766918k0108540j2571043p720708m834549
$$ 218177321 167383702 120873204 89106286 68997746 56426703 48705995 43871446
18602D3871446l218386k076778j738004j528316j264454j309865j084458q07883
$$ 43871446 40653060 38576282 36838278 35309962 34045508 32735643 31651185 30843302
18594C0843302k98656N3669l3856J7749J38032N12094J090479J697522K532351
$$ 30843302 30544646 30598315 30564459 30582208 30720240 31232334 32322813 34020335 36552686
18585C6552686L705343N251927P648502J2081390J8999557K7339568L4052133
$$ 36552686 40258029 45509956 53158458 65239848 84239405 111578973 145631106
18578A45631106L7683578L4737926J7467086J501086j533425r631618k7959972
$$ 145631106 183314684 218052610 235519696 237020782 235487357 225855739 197895767
18571A97895767k8122361r106995J3230595L1852077M3193201M6245255L1091336
$$ 197895767 169773406 160666411 173897006 205749083 248942284 295187539 326278875
18564C26278875j456451j7623774k5198659m4326524m9738902l2384436j1231704
$$ 326278875 324822424 307198650 281999991 237673467 187934565 155550129 144318425
18557A44318425O053408J6980872J8869375J0869377j1853871l2845740l1571991
$$ 144318425 150371833 167352705 186222080 197091457 185237586 152391846 120819855
18550A20819855k0531661j0762931l133203M003284J1443030J6642770J6669874
$$ 120819855 100288194 89525263 86392060 90395344 101838374 118481144 135151018
18543A35151018J0376991o258896k5046355k6687279j8852449j2166912q122444
$$ 135151018 145528009 139269113 114222758 87535479 68683030 56516118 48393674
18536D8393674n786930m511652l459224k759669j915957j404688j026176p83572
$$ 48393674 42606744 38095092 34635868 31876199 29960242 28555554 27529378 26745806
18528B6745806o15683n10520m51130j76981l1999j18493j68372K22388Q11296
$$ 26745806 26130123 25619603 25168473 24991492 24959493 24841000 24672628 24895016 25706312
18519B5706312R31606J227160J812395K487376L338227M644143O782503J0204035
$$ 25706312 26637918 27865078 29677473 32164849 35503076 40147219 46929722 57133757
18511E7133757J5897576K4156776L2990559L7528895L4774197K1668477n304051
$$ 57133757 73031333 97188109 130178668 167707563 202481760 224150237 218846186
18504B18846186j8417649n689111J0165474J6947230J0867398r303074j9898196
$$ 218846186 200428537 194739426 204904900 221852130 232719528 223416454 203518258
18497B03518258r757965K841564P115230k33929j1721805q929867Q69076M119332
$$ 203518258 193760293 196601857 203717087 203483158 191761353 182831486 183700562 187819894
18489A87819894n274126k7289545l7009669k9230636j9192340j2390903q501505
$$ 187819894 182545768 155256223 118246554 89015918 69823578 57432675 48931170
18482D8931170o113298m356109l356068k585263j994649j581361j238017q33588
$$ 48931170 42817872 38461763 35105695 32520432 30525783 28944422 27706405 26872817
18474B6872817o84241k78257K394p7009k28550m24150m82944j87344J08898M16159
$$ 26872817 26188576 25910319 25912713 25835704 25607154 25183004 24700060 24512716 24621614 25037773
18464B5037773R96927J595172K344489L511328N156230P374047J1366050J7529442
$$ 25037773 26034700 27629872 29974361 33485689 38641919 46015966 57382016 74911458
18456G4911458K5695701L3296155L4915406K7418594N125192k8652792m0425836
$$ 74911458 100607159 133903314 168818720 196237314 201362506 172709714 132283878
18449A32283878k9728270j6205507n432145L916296J3026334K1381251K4483219
$$ 132283878 102555608 86350101 80917956 84834252 97860586 119241837 143725056
18442A43725056K0069048M818248k2776879l7004778l0477249k0118420j2954126
$$ 143725056 163794104 168612352 145835473 108830695 78353446 58235026 45280900
18435D5280900q743861o251639m390389l084828k162504j526797j307785r67236
$$ 45280900 36537039 30285400 25895011 22810183 20647679 19120882 17813097 16845861
18427A6845861o46028m93016m62660o16558o79480n88060q39052o85258n72127
$$ 16845861 16199833 15706817 15244157 14627599 13948119 13360059 12521007 11835749 11263622
18418A1263622m16352k90804j76636k75718j54800j24756k58615k67588l72328
$$ 11263622 10847270 10556466 10379830 10104112 9949312 9824556 9565941 9298353 8926025
18409H926025l56964k30455l8049K01138J25063j87502p39132p92890n38320k68184
$$ 8926025 8569061 8338606 8300557 8501695 8626758 8439256 7700124 6907234 6368914 6100730
18399F100730j50917r6232p2897J90423L92763J72526O1767l12782p68958p28391
$$ 6100730 5949813 5853581 5780684 5971107 6363870 6536396 6598163 6285381 5516423 4788032
18389D788032m24074k62903j95589j38107k1233k7619q0632r0161n8429N4275
$$ 4788032 4363958 4101055 3905466 3767359 3746126 3718507 3637875 3547714 3489285 3543560
18379C543560p6531j46517j20812J2468j956M0730j02892j38380J6376P625o1026
$$ 3543560 3467029 3320512 3199700 3212168 3210212 3250942 3148050 3009670 3026046 3033671 2972645
18368B972645n3866j42366n9371M7498n0985n2500J09175j75286j92753j93777
$$ 2972645 2918779 2776413 2717042 2764540 2713555 2661055 2770230 2594944 2402191 2208414
18358B208414j62493p2309j01925j32838j84737j765J74907J35989L8332j31207
$$ 2208414 2045921 1973612 1871687 1738849 1554112 1552347 1727254 1863243 1901575 1770368
18348A770368p7229j12512p4326l1528N9840k14159j06545K3457o2556J0891O3371
$$ 1770368 1693139 1580627 1506301 1474773 1534613 1320454 1213909 1237366 1174810 1185701 1249072
18337A249072l5315q8694n0920L5787q0117j12372J45090K29150O9213j17285
$$ 1249072 1213757 1125063 1074143 1109930 1029813 917441 1062531 1291681 1360894 1243609
18327A243609l5123n4191j85260n1536O6249j3861j02861j00647J10333J0341
$$ 1243609 1208486 1154295 969035 917499 983748 969887 867026 766379 876712 887053
18317H87053O5289j8375k91759j31668R5122L1345N928J042q9123J21194j33690
$$ 887053 952342 933967 642208 510540 605662 637007 642935 643977 554854 676048 542358
18306E42358J7005k8830M8033k0544J145R7230O5243n4434m5371J5039M9482L030
$$ 542358 559363 530533 578566 558022 559167 656397 721640 667206 621835 636874 686356 689386
18294F89386p1778K08110J62655l6713j72630p5846o2576k8236n9997p7269R8508
$$ 689386 617608 825718 988373 951660 779030 703184 640608 612372 552375 475106 573614
18283E73614k8832K8067J17420l393M0586Q7892m2915j2014J27271J19209j4862
$$ 573614 544782 572849 690269 686876 727462 815354 772439 760425 887696 1006905 992043
18272I92043P9444K32071n692J460J4644Q6032P1759r3320j37321N299P4928k4185
$$ 992043 1071487 1303558 1297866 1299326 1313970 1400002 1471761 1378441 1241120 1246419 1321347 1297162
18260A297162k43180j52180k32942j05032j67624j45341J05403N1150Q9617L9412
$$ 1297162 1053982 901802 668860 563828 396204 250863 356266 407416 497033 536445
18250E36445j65073r757O1566n9243O8078R2968N1418q8002l7992j27791m4343
$$ 536445 371372 361615 423181 363938 432016 524984 576402 488400 450408 322617 278274
18239B78274J4060K1477j1992k0206R190N7554k2520L5518J90642M9205r2565
$$ 278274 292334 313811 301819 281613 290803 348357 325837 361355 551997 601202 508637
18228E08637l9474J45734K03779J55122K38428M17528K61505J43153N9638p3533
$$ 508637 469163 614897 818676 973798 1212226 1629754 1891259 2034412 2094050 2020517
18218B020517j54360l0299J50485J70350j2318l09875k81391j83602l40649j01163
$$ 2020517 1866157 1835858 1986343 2156693 2144375 1834500 1553109 1369507 1028858 927695
18208I27695m3326j36312j08640r5439P1029J43737j10190j19150P9511k7172
$$ 927695 884369 748057 639417 543978 615007 758744 648554 529404 608915 581743
18198E81743O8577L23479K09626K64257L18199J89001L22127O367o0276J62828
$$ 581743 650320 973799 1183425 1447682 1765881 1954882 2277009 2283376 2223100 2385928
18188B385928K07518p8208m4961p2260J4243j68887k69332j15938j72920k24011
$$ 2385928 2593446 2515238 2470277 2398017 2412260 2243373 1974041 1858103 1685183 1461172
18178A461172k58055j5713O9386m9379L4123P3147K8624P0405K6975R8347L2605
$$ 1461172 1203117 1187404 1256790 1207411 1241534 1314681 1343305 1413710 1440685 1539032 1571637
18167A571637J01062O2158l29809l43346j46567p1490k9034R3387o0996n395J74950
$$ 1571637 1672699 1734857 1405048 1061702 915135 843645 814611 907998 847002 841607 1016557
18156A016557K09873l315j27824M3903r4130m6519J07211O4905Q2543j38727P2588
$$ 1016557 1226430 1223115 1095291 1139194 1045064 998545 1105756 1170661 1253204 1114477 1187065
18145A187065Q5641R4935J49511K61043L42335L99720M13988L46671K33494R7831
$$ 1187065 1272706 1367641 1517152 1778195 2120530 2520250 2934238 3280909 3514403 3612234
18135C612234J21876J47120O1570J19770L8700n1196J69873L8448J38941K29596
$$ 3612234 3734110 3881230 3942800 4062570 4101270 4050074 4219947 4258395 4397336 4626932
18125D626932K63266N16614O79146R10394J150254J334607J834621K804344L687701
$$ 4626932 4890198 5406812 6085958 6996352 8146606 9481213 11315834 14120178 17807879
18116A7807879N198147Q362208J4148132K4472592L8556510M8429243M7751694
$$ 17807879 23006026 31368234 45516366 69988958 108545468 156974711 204726405
18109B04726405L5694244q760339o3004667o0963479l7768143k2010480j2924722
$$ 204726405 240420649 231660310 168655643 107692164 69924021 47913541 34988819
18102C4988819p937099n074780l345708k606882k092958j492049j291624j129713
$$ 34988819 27051720 21976940 18631232 16024350 13931392 12439343 11147719 10018006
18094A0018006q04332o18913m77768k70674j34412l39850m06106l06245k55675
$$ 10018006 9213674 8594761 8116993 7846319 7711907 7372057 6965951 6659706 6404031
18085F404031n08002m56748n70327l34010k72228k86051l03555j43168K2835j56523
$$ 6404031 5896029 5439281 4868954 4534944 4262716 3976665 3673110 3529942 3552777 3396254
18075C396254k16310k06037k5476L9162j78365l6935m3653k5292j77165Q9664
$$ 3396254 3179944 2973907 2948431 2987593 2809228 2772293 2728640 2703348 2526183 2615847
18065B615847r1202k22434j39455N1748q0088J9196J949n892J11780J10051J31925
$$ 2615847 2524645 2302211 2162756 2214504 2134416 2153612 2155561 2149669 2261449 2371500 2503425
18054B503425J31189P2955Q8147K44433R5991k02835l04815m5582N3156O664K17311
$$ 2503425 2634614 2707569 2795716 3040149 3136140 2933305 2628490 2582908 2636064 2642728 2860039
18043B860039L45979J75176N6714j7607o7941k52866m48211l81699j07731j06877
$$ 2860039 3206018 3381194 3437908 3420301 3352360 3099494 2651283 2269584 2161853 2054976
18033B054976j26984j04072J02425K5608p3522j019j12264k8403j77185l7602
$$ 2054976 1927992 1823920 1926345 1951953 1878431 1877412 1765148 1736745 1559560 1521958
18023A521958j69020j24524r6166j10454K6562k6690j24475P701K7618j24355
$$ 1521958 1352938 1228414 1132248 1021794 1048356 1021666 897191 904892 932510 808155
18013H08155L6095j9197n2167J6774R752M3819Q3491J30523M9161j60747j31811
$$ 808155 844250 825053 772886 789660 799412 843231 926722 1057245 1106406 945659 813848
18002H13848N7428K6035R827K99977K06087M3353L494J09539M1972p968o0002
$$ 813848 871276 897311 907138 1207115 1413202 1456555 1460049 1569588 1611560 1603592 1543590
17991A543590p8906o4526l0838R4387P0655Q8761J31474N2144P7759j539Q4870
$$ 1543590 1464684 1400158 1369320 1463707 1534362 1623123 1754597 1806741 1884500 1882961 1967831
17980A967831m738r7658k80840k34962k40305j83056j00549l0058P7622m77M1912
$$ 1967831 1963093 1865435 1584595 1349633 1109328 926272 825723 795665 873287 872810 914722
17969I14722O9488q8931p6039k3991q17N9393J67468J32558Q6034K53524J88580
$$ 914722 984210 895279 819240 795249 794432 853825 1021293 1153851 1239885 1493409 1681989
17958A681989K39716K60006N27399N78586N30675P07997N00726K77886L41078
$$ 1681989 1921705 2181711 2709110 3287696 3818371 4526368 5027094 5304980 5646058
17949E646058J19106L6719N9737J93900n3658r5566n6615m42945q47278o78193
$$ 5646058 5765164 5801883 5861620 6055520 6001862 5906296 5849681 5406736 4559458 3881265
17939C881265o65707l27151k94059k49828j83638p3259j6394Q3572J838p7730
$$ 3881265 3215558 2888407 2594348 2344520 2160882 2087623 2071229 2154801 2156639 2078909
17929B078909j87688k39073j09702j61348k34699q3526j08863J3163j26378K9967
$$ 2078909 1891221 1652148 1542446 1381098 1146399 1062873 954010 967173 840795 870762
17919H70762r883J23158R6977M8290j3277J19453P3202j84638n7462J1059J27388
$$ 870762 860879 984037 1081014 1129304 1116027 1235480 1308682 1124044 1066582 1077641 1205029
17908A205029J46036M6657K29193K83193K57217L89536Q57262Q20074R25291J085206
$$ 1205029 1351065 1397722 1626915 1910108 2167325 2556861 3414123 4234197 5159488 6244694
17898F244694Q26676N26481J18436l28628l51315M8289K63932j26696l89226o84338
$$ 6244694 7071370 7597851 7716287 7387659 7036344 7084633 7348565 7221869 6832643 6148305
17888F148305r53112j143936q29544l80185j93968j70967j46644k22560k74363
$$ 6148305 5195193 4051257 3221713 2841528 2647560 2476593 2329949 2107389 1833026
17879A833026k46399k71649L2230J12865M5279P7601n6847j06144l171J6901r460
$$ 1833026 1586627 1314978 1347208 1460073 1505352 1582953 1526106 1419962 1416791 1433692 1424232
17868A424232K8984J38434J75156k1566M186q4962l2922J24305Q236j57268O3490
$$ 1424232 1453216 1591650 1766806 1745240 1749426 1664464 1631542 1755847 1764083 1606815 1670305
17857A670305J53558R8124K63305L48224L51291O70811J010838R22674O69759
$$ 1670305 1823863 1921987 2185292 2533516 2884807 3555618 4566456 5489130 6158889
17848F158889P4698n16876n47506k67938J64875K69988m9520n11462r08740p69058
$$ 6158889 6233587 5716711 5169205 4901267 5066142 5336130 5286610 4775148 3866408 3097350
17838C097350n95050k76340k85072k4597P458L1085p237J2407n9635j15205j38814
$$ 3097350 2502300 2225960 1940888 1916291 1923749 1954834 1947597 1960004 1900369 1785164 1646350
17827A646350o5793j00082n2350J33141K32287J09023n7808M1763m9658J36267
$$ 1646350 1580557 1480475 1428125 1561266 1793553 1902576 1844768 1886531 1836873 1973140
17817A973140J57545N6132J6501O3538N0057K4532J1951r9787j36205L4164L7909
$$ 1973140 2130685 2186817 2203318 2266856 2316913 2341445 2353396 2253609 2117404 2151568 2189477
17806B189477J77016K45046L56422M39083N07196K53956J7329k92163k52522J11344
$$ 2189477 2366493 2611539 2967961 3407044 3914240 4168196 4185525 3893362 3640840 3752184
17796C752184R6876L03815J0477k99197l52822k81270j70000l5105k8909K6999
$$ 3752184 3849060 4152875 4163352 3864155 3511333 3230063 3060063 3024958 2996049 3023048
17786C023048Q9649K11518K64076K53790K30040M05415N22605L14022L20245M66780
$$ 3023048 3112697 3324215 3588291 3842081 4072121 4477536 5000141 5314163 5634408 6101188
17776F101188M53013K76328L71491K11975L5300J85710N9491K41748K81537L59698
$$ 6101188 6554201 6830529 7202020 7413995 7449295 7635005 7694496 7936244 8217781 8577479
17766H577479N16289P03289Q18405J362806J772362K291424L021059M279623O127360
$$ 8577479 9093768 9797057 10615462 11978268 13750630 16042054 19063113 23342736 29470096
17757B9470096Q971143J3627457K0569756K8385230L2804722L1550392K1906397
$$ 29470096 38441239 52068696 72638452 101023682 133828404 165378796 187285193
17750A87285193o2576j0080113K194511J4977592J7065664N342737k5735039m7773011
$$ 187285193 187222617 177142504 179337015 194314607 211380271 216723008 190987969 143214958
17742A43214958m1266737k7476365j7431557j1209599p272334m733083l384201
$$ 143214958 101948221 74471856 57040299 45830700 38558366 33825283 30441082
17735C0441082k861661j961664j279339r04204n42440q2512J73255J21836K17726
$$ 30441082 27579421 25617757 24338418 23434214 22891774 22809262 22982517 23104353 23322079
17726B3322079K51361N6954j33015O6236K37685P4529k8584J95661P16882J172346
$$ 23322079 23573440 23630394 23497379 23563615 23801300 23875829 23847245 24042906 24759788 25932134
17716B5932134J621108K167783K952977M132189N547082P652311J0971161J5981407
$$ 25932134 27553242 29721025 32674002 36806191 42353273 50005584 60976745 76958152
17708G6958152K3998433L5589127M7763976N4143973N1483501L4363281Q70848
$$ 76958152 100956585 136545712 184309688 238453661 289937162 324300443 325171291
17701C25171291o780411J7545827L7816487L8396530J2076755m6681834q3084419
$$ 325171291 318390880 335936707 373753194 412149724 424226479 377544645 294460226
17694B94460226o8115021l8511568j3638238N351115K0043513L1422514L8647586
$$ 294460226 226345205 187833637 174195399 179546514 199590027 231012541 269660127
17687B69660127L7198967L3896958L4219325K3938518J737192r274790j5747714
$$ 269660127 306859094 340756052 374975377 398913895 400651087 391376297 375628583
17680C75628583k7891206l2620506l2610579l8074395l7847134l1400246k8818598
$$ 375628583 347737377 315116871 282506292 244431897 206584763 175184517 146365919
17673A46365919k7194425k1633701j5089112j0222070o965506m958230l533896
$$ 146365919 119171494 97537793 82448681 72226611 65261105 60302875 56768979
17666E6768979k595079j343795K19783J255578K722895N049537Q521056J3880608
$$ 56768979 54173900 52830105 53049888 54305466 57028361 62077898 70598954 84479562
17658H4479562K0192075K4331741K4314903J8698755K599761p729755R67647J2220824
$$ 84479562 104671637 129003378 153318281 172017036 174616797 166887042 167854689 180075513
17650A80075513J5272847P434578j6613820l8480523l5556020k3390721j3961616
$$ 180075513 195348360 202782938 186169118 147688595 112132575 88741854 74780238
17643G4780238p461395k990918Q11081M254510Q599429J4618510K1704345K8918003
$$ 74780238 67318843 64327925 65139006 69393516 77992945 92611455 114315800 143233803
17635A43233803L5756198L8952596L5621994L2458037L0057424J5758281N07881
$$ 143233803 178990001 217942597 253564591 286022628 316080052 331838333 332346214
17628C32346214k890489j0583727k1491993k3284259k8261234l5227708l3016719
$$ 332346214 329455725 318871998 297380005 274095746 245834512 210606804 177590085
17621A77590085k9617716k9936308k6041749j8899657j2980162q951019o247241
$$ 177590085 147972369 118036061 91994312 73094655 60114493 51163474 44916233
17614D4916233m661039l465261k557531k016160j651788j336272j364734j210620
$$ 44916233 40255194 36789933 34232402 32216242 30564454 29228182 27863448 26652828
17606B6652828j250031j181096j207451j136322j037316j197019r48985r76806
$$ 26652828 25402797 24221701 23014250 21877928 20840612 19643593 18694608 17717802
17598A7717802j058986q08680r12700q27357p05907o45181n91724o05453l78342
$$ 17717802 16658816 15850136 14937436 14110079 13404172 12758991 12167267 11561814 11183472
17589A1183472l37530k83163k11718k37533j09970l16936m51421l22300r8446
$$ 11183472 10845942 10562779 10351061 10113528 10003558 9686622 9235201 8912901 8814455
17580H814455k25787k48547o1335l45072l15759p5741j5420j64235k24402j54379
$$ 8814455 8588668 8340121 8278786 7933714 7617955 7542214 7526794 7362559 7138157 6983778
17570F983778j84607l53104j43832j40710j94954m5639j33333n4339j16573o6039
$$ 6983778 6799171 6446067 6302235 6161525 5966571 5920932 5787599 5733260 5616687 5550648
17560E550648R3326p6453r6414j7912M7549j4607j04453k40980J3852k3630k50768
$$ 5550648 5643974 5567521 5471107 5453195 5500744 5486137 5381684 5140704 5154556 5130926 4880158
17549D880158k02537j62907k28594j21342j14125j59874j04523j63927j33770
$$ 4880158 4677621 4514714 4286120 4164778 4050653 3890779 3786256 3622329 3488559
17540C488559j39589l22373k63559k80951j23262j59082l3440J25723K73211Q2475
$$ 3488559 3348970 3026597 2763038 2482087 2358825 2199743 2166303 2292026 2565237 2647712
17530B647712j50800j70790J59102N8916j48830j39243j00600q3519p8400k64053
$$ 2647712 2496912 2326122 2485224 2544140 2395310 2256067 2155467 2071948 1993548 1729495
17520A729495k60698M8042m1987o5667k2343K3922j1196k8157j22710j7234J38342
$$ 1729495 1468797 1516839 1474852 1409185 1386842 1410764 1399568 1371411 1248701 1231467 1369809
17509A369809Q593j67756J77034K8358m29R6826N3721j48867r7785j22929q0234
$$ 1369809 1378402 1210646 1387680 1416038 1415609 1512435 1566156 1417289 1319504 1196575 1116341
17498A116341J8804j45338q4247J34583J54l1340K5497l1607q369j53631j82014
$$ 1116341 1135145 989807 905560 1040143 1040297 1008957 1034454 1002847 994478 840847 658833
17487F58833J28601k5245j08041J17J11649L2288Q9676O4691M8161j13253p8965
$$ 658833 787434 762189 654148 654265 765914 798202 887878 952569 1000730 887477 808512
17476H08512m3088m3433q8242L3642j23156L7897q3591p7015j19110m1819J26109
$$ 808512 765424 721991 633749 667391 544235 582132 498541 421526 302416 260597 386706
17465C86706K3011k1412J51959J99501k0307j90151k61418N1731J93435n8112
$$ 386706 409717 388305 540264 739765 719458 529307 267889 319620 513055 454943
17455D54943K658K00565J56836q3044p9464J7488O3686l9354q955M5053J36382
$$ 454943 457601 658166 815002 731958 652494 669982 733668 694314 685359 730412 866794
17444H66794L27868K01454J36406j12903k40924k11457k41996r1414j08244R785
$$ 866794 1194662 1396116 1532522 1419619 1178695 967238 725242 633828 525584 535369
17434E35369l1076m2231J1813j01327j61015P5228J97777J31609m0611o7490o2572
$$ 535369 504293 462062 473875 372548 211533 286761 484538 616147 575536 508046 445474
17423D45474R3899O707j62339j43477o9396M7200J31187J07596m8916m4534J18950
$$ 445474 539373 546080 383741 240264 170868 218068 349255 456851 407935 363401 482351
17412D82351J17047p3140q0636r8679j52J03079j15017q9608q7611R137J97735
$$ 482351 599398 526258 445622 346943 346791 449870 334853 245245 157634 166771 364506
17401C64506J43045q5826q5020J08976Q3498n8530j14884j6191L6641L4479Q3405
$$ 364506 507551 421725 336705 445681 529179 470649 355765 339574 376215 410694 494099
17390D94099k6989o9191J449k0863J26756N6495j32864J5365K6288j29041n0706
$$ 494099 467110 397919 399368 378505 505261 561756 428892 444257 470545 341504 290798
17379B90798J67982P2536q9654k5230j87737k40632n867Q1267k7136L7455L5633
$$ 290798 458780 531316 441662 416432 228695 -11937 -17804 63463 36327 73782 109415
17368A09415K784N28O2297Q9892P7525j53179p7996J92373o7055p1013J5472n2312
$$ 109415 112199 112727 175024 264916 342441 189262 111266 303639 236584 165571 181043 128731
17356A28731l7446L8509l4539q4040O0682J6221K8515k9202O1778L5013O4909
$$ 128731 91285 129794 95255 11215 71897 88118 116633 87431 149209 184222 249131
17345B49131O4132r0120j0154K4696P8151j21167j31808L5351k8419m8372Q9198
$$ 249131 313263 223143 212989 237685 315836 194669 62861 98212 69793 21421 110619
17334A10619J1751O2956L751N3917J8148O4138M3833k09971p1362O9193J4177
$$ 110619 122370 185326 189077 242994 261142 325280 369113 159142 87780 156973 171150
17323A71150M2978K1031o791j20455J3913k8562j98191l0032O8953j46290j75795
$$ 171150 214128 235159 228368 107913 121826 93264 -104927 -134959 -66006 -212296 -388091
17312c88091Q6518m2854P9662J39404j8045o4755l9752M3602J45369N3954l0225
$$ -388091 -301573 -344427 -264765 -125361 -143406 -208161 -247913 -204311 -58942 -4988 -35213
17301c5213j15634J06069O3092j16669l9364K89098J95852m4469o8655q7786j08894
$$ -35213 -150847 -44778 18314 -98355 -137719 151379 347231 302762 234107 146321 37427
17290C7427n5494j5666K08641k8228j83548j83362K07458J37980q5184L0758K0548
$$ 37427 -18067 -33733 174908 146680 -36868 -220230 -12772 125208 40024 70782 91330
17279I1330l039K092O2970p9526P9938Q2074J40702n1620j31498K1974j5506O027
$$ 91330 88291 90383 153353 73827 153765 235839 376541 324921 193423 215397 199891 205918
17267B05918j54733K9250L4473M0103j59712n389p3544j1398J42200J4361L3843
$$ 205918 51185 80435 114908 155011 -4701 -10090 -83634 -95032 47168 61529 95372
17256I5372o889J08684j0877j68717j48483L6033P2161J09867J12454J7287r8334
$$ 95372 88483 197167 186290 17573 -130910 -94877 -22716 87151 199605 216892 118558
17245A18558k5635j20781O2090J21109q2522m3797l3688J98246J20244N592n5037
$$ 118558 92923 -27858 34232 155341 72819 29022 -4666 193580 313824 319416 264379
17234B64379j06406k4287J17100K3184j33673J50069J88710R4269K11955J19754
$$ 264379 157973 133686 250786 273970 140297 290366 479076 573345 785300 905054
17224I05054M415j08378R9916j13980N9916L0483j50423k0875j64140o7427j29171
$$ 905054 909469 801091 901007 787027 846943 877426 727003 706128 541988 474561 345390
17213C45390q1118O06l2045o7732R3145J7564j061J18211j02473o3880j5970M4891
$$ 345390 264272 264878 232833 165101 258246 275810 274749 392960 290487 226607 210637 255528
17201B55528Q3900P1052K1441k00675K0478M7197p3971l0677Q0402Q1288J55529
$$ 255528 339428 410480 431921 231246 251724 298921 224950 194273 274675 355963 511492
17190E11492J3739q4661l9239M6517o8032R7184J70589K00304K84557K82135L52263
$$ 511492 525231 440570 401331 447848 379816 477000 647589 847893 1132450 1414585 1766848
17179A766848K83253L86540L80571J24261J54112K21910K23184R3270j23457k99911
$$ 1766848 2050101 2436641 2817212 2941473 3095585 3317495 3540679 3633949 3510492 3210581
17169C210581l75396l67598k00007j80843m07701m61012k10326j11889o1642j04479
$$ 3210581 2835185 2467587 2267580 2086737 1679036 1218024 1007698 895809 834167 729688
17159G29688j75625j2381r2176j77338j5611O9476j03329j6090J64445o351k734
$$ 729688 554063 541682 449506 272168 256557 326033 222704 206614 371059 364708 361974
17148C61974n8169j46863O4605J87821N3604j28641j73272q8206M713M365o0817
$$ 361974 303805 156942 221547 409368 462972 334331 161059 72853 77566 81931 21114
17137B1114J46751J08788N9713J94711Q1646K39267J34794J52222Q4726K804k6239
$$ 21114 167865 276653 336366 531077 612723 851990 986784 1139006 1223732 1226536 1200297
17126A200297O7234J38485J23955J05474J26251J5958l2761P5834N3389N2238
$$ 1200297 1267531 1406016 1529971 1635445 1761696 1777654 1744893 1820727 1874116 1926354
17116A926354k3898j26967o2025j08031j13989j44961j67100o3909l33246k14062
$$ 1926354 1902456 1775489 1713464 1605433 1491444 1346483 1179383 1115474 782228 568166
17106E68166o1162j20309j25315j31935p6700o5845L3830J19626J8698j29025
$$ 568166 507004 386695 261380 129445 52745 -13100 20730 140356 159054 30029
17096C0029J7702N5176j68091j7774J45675P2882P2265l3015p8900Q6416m0132
$$ 30029 47731 102907 -65184 -82958 62717 135599 207864 174849 95949 182365 142233
17085A42233J0791M7790j11897j15078O6721n4248k3326o882j7018J10647j7389
$$ 142233 153024 200814 88917 -26161 40560 -13688 -37014 -43896 -60914 49733 32344
17074C2344R5329J01986m2916j82829p4699l8696m31J11473J3366j1628L652j47377
$$ 32344 127673 229659 186743 3914 -70785 -109481 -109912 1561 14927 3299 6951 -140426
17062a40426o3778O2953J82172J2307r1279q5621O6068P1327L7147L1134o5112
$$ -140426 -204204 -141251 40921 53228 -38051 -123672 -57604 13723 50870 82004 16892
17051A6892M3162P8399o2095r303N5714l51209j08880J44647K2660o1821J39704
$$ 16892 60054 138453 76358 67055 122769 -228440 -337320 -192673 -170013 -231834 -92130
17040i2130N5776j0028k3722L4768Q1716K272O6997j44880q4953J50309P2077
$$ -92130 -36354 -46382 -70104 -35336 46380 48652 115649 -29231 -114184 36125 108202
17029A08202L2966K8960K3652k03364j72601k1670R919K2425k185P6712L6791
$$ 108202 141168 170128 193780 -9584 -182185 -203855 -193936 -171511 -173696 -96984 -60193
17018f0193Q6067J44750m6200j88808j7271R1413m9788m9645l2979K419J47234
$$ -60193 25874 170624 124424 -64384 -81655 9758 -40030 -89675 -122654 -120235 26999
17007B6999J68750l603k14489j29921K6748k3534K4944J69358R0237J1632J1438
$$ 26999 195749 192146 -22343 -152264 -125516 -149050 -124106 45252 135489 147121 158559
16996A58559m0114r8684o3837k7945l025J37433j8001l1214q1988j09036q4492
$$ 158559 118445 19761 -44076 -72021 -75046 62387 44386 13172 -68816 -177852 -262344
16985b62344n7465N7112J10715J54011J27984J99458l9292r2378j87258p4094
$$ -262344 -319809 -262697 -151982 2029 130013 329471 290179 197801 10543 -63551
16975f3551k3978q5106J1676N8187l8576N8912J21618R407o5925K6143R2492M2556
$$ -63551 -87529 -172635 -160959 -102772 -141348 -82436 39182 48589 -17336 8807 101299 143855
16963A43855O4871K7973j8291o6666L2143j7165k0915J24508j36650k03287j4966
$$ 143855 208726 236699 218408 151742 183885 166720 145805 270313 133663 -69624 -84590
16952h4590O6280q603q3806j57663Q6264N8981Q4282o9635j42747J08552J67828
$$ -84590 -18310 -26913 -110719 -268382 -182118 -123137 -38855 -108490 -251237 -142685 25143
16941B5143l2302k0703Q3063L0418j2188j52382m6926R0996r3759l902l3026J6430
$$ 25143 -7159 -27862 55201 85619 73431 -78951 -125877 -34881 -128640 -132542 -165568 -149138
16929a49138J4437r5080J85433J66658M7817m2318m1871O7101J27454o0772P448
$$ -149138 -134701 -229781 -44348 122310 170127 127809 85938 153039 280493 219721 227169
16918B27169P58q8001p3298m6151k1597K6559r6844j35984J3099K18532J47110
$$ 227169 227927 139926 66628 20477 -1120 25439 -71405 -207389 -194290 24242 171352
16907A71352M223r8188p2881j22515r7382P9870O352j84305J09069J26924j23433
$$ 171352 175575 77387 4506 -118009 -215391 -135521 -129169 -313474 -204405 -77481 -200914
16896b00914j29933O5124J43431J29428J71822J7785M8178n979o7801j49560J6545
$$ -200914 -330847 -265723 -122292 7136 178958 196743 244921 238942 171141 21581 38126
16885C8126j98719m8326J66015J79316Q924j57583m0956m48l1045M0728q9119
$$ 38126 -160593 -208919 -42904 136412 145336 -12247 -53203 -53651 -84696 -43968 -133087
16874a33087R3707J67061k0533j02862j66627j5640J16786K3577r5796k06173
$$ -133087 -39380 127681 107148 4286 -162341 -177981 -61195 -37618 -133414 -339587
16864c39587Q3308J42288J23942K0212j03253O2656J03388j15912j34812n2495
$$ -339587 -256279 -113991 9951 30163 -73090 -10434 92954 -22958 -157770 -210265
16854b10265J1416J07508P2824J32971k0993j5295j45459q3124K2828J53304K8761
$$ -210265 -198849 -91341 -18517 114454 93461 78166 -67293 -150417 -127589 25715 54476
16843E4476l9049l9829J4579j08567n6046Q2146J60280j0307m8936P8769o1017
$$ 54476 15427 -24402 -9823 -118390 -174436 -92290 67990 57683 8747 87516 26499
16832B6499r7306J90615P3768J4781r4357j77424N5552L2681m9548K6028K906
$$ 26499 -70807 119808 193576 208357 114000 -63424 -7872 24809 -24739 1289 4195
16821D195R14J50999l1822p4904M7679L888o4755K2557O557L7753J43394j88277
$$ 4195 5109 156108 124286 49382 97061 100949 36194 58751 65308 103061 246455 58178
16809E8178j23530O7851J6311n0205o8992j36215Q4388L1428O3800p9834q6046
$$ 58178 -65352 2499 18810 -31395 -100387 -236602 -152214 -120786 -56986 -136820 -222866
16798b22866P6567J15459j9174K2784n5262r0323N8916j583Q3762J13859M7213
$$ -222866 -146299 -30840 -50014 -27230 -82492 -172815 -113899 -115482 -31720 82139 129352
16787A29352j7755R728J4636k32312J2624J49482O397m5610j26253Q8350K09247
$$ 129352 111597 121325 135961 -96351 -83727 65755 72152 26542 -99711 -11361 197886
16776A97886N9014q8130k892l5794j66138J33132m2367n4606N8051K2509k08037
$$ 197886 256900 168770 165878 130084 -36054 97078 54711 105 58156 80665 -127372
16765a27372O7274J90849J04459j01982j43040j54160j22573K0051O0600J15899
$$ -127372 -60098 130751 235210 133228 -9812 -163972 -286545 -266494 -205894 -89995
16755h9995Q3997K8862J3392j422j6975j0029j13286l3102N4466m3686J07414
$$ -89995 -5998 22864 36256 34834 17859 7830 -105456 -138558 -84092 -127778 -20364
16744b0364Q154k5011j5460P4380m28k27299p072L3342m830q0168j82910N3391
$$ -20364 -12210 -37221 -52681 21699 21271 -206028 -213100 -179758 -184588 -264756 -447666 -394275
16732c94275O9816j63552P0160K68199L6451L101N2034k4365m3825j9835l9220
$$ -394275 -324459 -488011 -417851 -149652 -113201 -110100 -58066 -82431 -126256 -146091 -185311
16721a85311J06703k2253j74079K7884L3899l2205J749J05820Q9419K2839k7726
$$ -185311 -78608 -100861 -274940 -247056 -213157 -245362 -243613 -137793 -48374 -25535 -53261
16710e3261P2340J79671N964j90314J9587K3442l578o5917p2294M5558L513k0581
$$ -53261 19079 198750 204714 14400 33987 57429 53851 -12066 -84360 -38802 -35289 -55870
16698e5870R2064j3976n8977k4756Q743j25251j22596J52625J32125L2250j06929
$$ -55870 36194 22218 -36759 -61515 -52772 -178023 -300619 -147994 -15869 16381 -90548
16687i0548l6861p739l1627M9882j0776J61174K4728r5981K396J3561j5010r5050
$$ -90548 -127409 -135148 -166775 -116893 -127669 33505 58233 -37748 -35352 -21791 -36801 -131851
16675a31851j49008J24440J78292j6659j07795j09072J5560l4325o4640j03745
$$ -131851 -280859 -156419 21873 5214 -102581 -211653 -196093 -230418 -295058 -398803
16665c98803m9661K06956l6075N8540k5113j86j01841N373K01209J62316j959
$$ -398803 -448464 -241508 -277583 -219043 -244156 -244342 -346183 -340810 -139601 22715 20756
16654B0756q7975n8954R8006J08046k087K1620L0491j8675p0520k27628r6501
$$ 20756 -67219 -126173 -28167 79879 77792 99412 129903 111228 40708 -186920 -283421
16643b83421M1959J98221M1091J2273o0802L8180O8004j01995n88n7953j53211
$$ -283421 -241462 -43241 -2150 10123 -50679 -12499 55505 -46490 -47078 -105031 -258242
16632b58242L247K7086O3390Q0898R825m0034q1684K9683j7287n7542l653J03839
$$ -258242 -254995 -227909 -164519 -83621 -73796 -113830 -195514 -165831 -183118 -240660 -244313 -140474
16620a40474K10479m0242q0643M9286j97416l3118Q5108o8007k5427J01321J32255
$$ -140474 70005 29763 -50880 -1594 -199010 -232128 -147020 -215027 -240454 -139133 -6878
16609f878n4908j10755m9541K4175O5621N7881P4830j26007m765M2344l995J16023
$$ -6878 -61786 -172541 -222082 -197907 -132286 -74405 425 -125582 -130347 -88003 -91998 24025
16597B4025P2693J10145J15527r9741O087k4489q3238o2797l0614K3532l9217
$$ 24025 96718 206863 322390 222649 228736 204247 121009 58212 27598 51130 11913
16586A1913O2434R8744K8700j7198j58979m8663j6853m6671Q6562J59609r6802
$$ 11913 74347 173091 201791 184593 25614 -23049 -39902 -86573 -11 159598 62796
16575F2796o669j06524p1177Q1117n1482L8018Q9355k0479J4226L3738j04334
$$ 62796 56127 -50397 -121574 -40457 -91939 -53921 35434 14955 29181 62919 -41415
16564d1415J00520J09539K1619K2003l3697n0856k1431j82569p3323J13087n6609
$$ -41415 59105 168644 190263 212266 178569 127713 106282 -76287 -149610 -36523 -93132
16553i3132P8246J02331l8960r7540J1131L4623l8716j19845m3641N7258Q5681
$$ -93132 -14886 87445 48485 -49055 -37924 -3301 -42017 -161862 -205503 -148245 -62564
16542f2564r2462l5658q0364n4992M8522L9076P6964k6826O0208J8872J2088k32
$$ -62564 -155026 -190684 -271048 -326040 -277518 -238442 -161478 -188304 -128096 -109224 -97136 -97368
16530i7368K555j0499J4477m0182j76899J6708J32257L1888o9743J7976J45178
$$ -97368 -94813 -105312 -90835 -131017 -307916 -291208 -158951 -127063 -196806 -178830 -33652
16519c3652l0622J8854M2123k3272J8188L7637m7662j38826j10548r05K24194
$$ -33652 -64274 -45420 -3297 -26569 -8381 29256 -18406 -157232 -267780 -268685 -44491
16508d4491q137L598r8588n7571K7332O3721l9305R3390j05173l0615Q6510P0259
$$ -44491 -52628 -49030 -147618 -205189 -177857 -114136 -153441 -60051 -165224 -195839 -109329 -39070
16496c9070N1190j9954l000k26639n4456L5835J22675J23181j58912k9697J21394
$$ -39070 12120 -7834 -10834 -237473 -291929 -256094 -133419 -10238 -169150 -198847 -77453
16485g7453M0412o0572p5993n4397K1950N5666J19075l7086j14482o5294Q8921
$$ -77453 -37041 -97613 -173606 -228003 -206053 -150387 -31312 -68398 -182880 -248174 -159253
16474a59253M4514P1485j5219J7787J16597k2770p4278l5552r7754O2184o739
$$ -159253 -114739 -43254 -58473 -40686 75911 53141 -21137 -56689 -154443 -92259 -98998
16463i8998N2108l2910J64928P2615M4432J39523j7163j53349j92150j31678q1038
$$ -98998 -46890 -79800 85128 157743 202175 341698 324535 171186 -20964 -152642 -233680
16452b33680J06258K2098j36015j22408P9358R6873K6622L5805O8419L9258o6679
$$ -233680 -127422 -105324 -241339 -363747 -284389 -187516 -160894 -125089 -56670 -17412 -84091
16441h4091j131n0436j04189n081J46066j5675k9190K6266k9037R0700K1857M4553
$$ -84091 -85222 -135658 -239847 -244928 -98862 -114537 -143727 -117461 -146498 -55798 -33941 10612
16429A0612R0783N8865o3133p9399l2539K754L7146r9556R0916Q3125j7830j9230
$$ 10612 101395 160260 97127 17728 -14811 -12057 25089 -74467 16449 99574 81744 62514
16417F2514K4627k68q5761o6616O9058J86775j667p5309n5619q7926m8355k8068
$$ 62514 87141 86873 1112 -65504 3554 190329 188662 113353 57734 -30192 -78547 -106615
16405a06615o1731J00115J97507k3046j44319j07489j4661m0267J25878J69994
$$ -106615 -168346 -68231 129276 106230 -38089 -145578 -160239 -200506 -74628 95366
16395I5366Q2617j61235j57555m2638p559L951M8672L1003K3323M9473j0569K16383
$$ 95366 177983 16748 -140807 -183445 -191004 -187053 -138381 -107378 -84055 -34582 -45151 171232
16383A71232J8351j45183n5331O9099j3279j55253P1515R9715j80160r9882J17722
$$ 171232 189583 44400 -10931 58168 44889 -110364 -38849 60866 -119294 -219176 -101454
16372a01454j3893n4273Q4208N148j04697j1359l8323M4942m3978J12696M5773
$$ -101454 -115347 -169620 -85412 -80264 -184961 -196320 -234643 -189701 -233679 -120983 -75210
16361g5210j94003N7037J70696J89795J20158j35109j60937n6592l6000l316L4789
$$ -75210 -269213 -212176 -41480 148315 268473 133364 -27573 -84165 -120165 -123481 -88692
16350h8692J55523o5487j88212l1193K04752Q9956n5104l9233j32197k9059n5613
$$ -88692 66831 1344 -186868 -218061 -13309 76647 21543 -17690 -149887 -178946 -234559
16339b34559Q7634O8953K01296J72703j39127m11p2863p7034l6376Q1485j8400
$$ -234559 -146925 -77972 123324 296027 156900 156489 83626 6592 -29784 51701 33301
16328C3301o2853k2238l5779q8236j83324J37799Q1126q2407q2031m1091N8599
$$ 33301 -29552 -51790 -87569 -175805 -359129 -221330 -140204 -222611 -304642 -345733 -287134
16317b87134Q0031J48916J40695p2678r4225j15343m9180n0718J84451J12058
$$ -287134 -207103 -58187 82508 9830 -84395 -199738 -248918 -299636 -115185 -3127
16307c127j04736o2073L1570J8438k8344O2756k1432j31816L808Q7615o7919p3247
$$ -3127 -107863 -169936 -138366 -119928 -148272 -85516 -106948 -238764 -234956 -147341 -215260 -288507
16295b88507m9880r467J60364J68000k6337k5128L9828R9135n8672r051q2912
$$ -288507 -338387 -347854 -187490 -19490 -45827 -70955 -31127 68008 9336 285 -82627
16284h2627R126Q8134N0290J09457j13543j53436j03779N969j18345L6587J30763
$$ -82627 -73501 14633 64923 174380 60837 -92599 -196378 -190409 -308754 -272167 -141404
16273a41404m2930o0050N0183J97511P1045j09490j16251j25286m3062P3839J12600
$$ -141404 -184334 -244384 -194201 3310 74355 -35135 -151386 -276672 -319734 -245895 -133295
16262a33295N8771j5182l9190J15095K09732r6853n1479j79103j73235J52040
$$ -133295 -74524 -89706 -128896 -13801 195931 99078 47599 -131504 -304739 -152699
16252a52699J92629R569q5521j12681j19699J8101P7017L4508j2648O5373m640
$$ -152699 39930 49499 -36022 -148703 -268402 -250301 -173284 -138776 -151424 -86051 -90691
16241i0691r7208L3087J06799j13715p6921J01429J85073l965r1066j61187N108
$$ -90691 -187899 -154812 -48013 -161728 -238649 -137220 47853 43888 -47178 -208365 -203257
16230b03257J06375N1862P9530j71018r4992K4449M966p3808l8623K8139j18897
$$ -203257 -96882 -45020 34510 -136508 -231500 -207051 -202085 -275893 -314516 -286377 -405274
16219d05274N6915K49066j1318j65723p313J92259J67968p7986n1222j18810r557
$$ -405274 -348359 -99293 -110611 -276334 -283647 -91388 76580 -1406 -52628 -171438 -180995
16208a80995L3177Q4402n0656K72r5705P719K4024n6608O2665o87k8142N5582
$$ -180995 -147818 -63416 -114072 -113800 -209505 -201786 -177762 -234370 -171705 -172392 -200534 -144952
16196a44952J29774j01599J3017J84311M2769j15054j60517p5050q2647J42111
$$ -144952 -15178 -116777 -103760 80551 123320 8266 -152251 -227301 -309948 -167837
16186a67837R5923Q4631m2762N3283P509J8187r0113J7475q5107p6221J63160
$$ -167837 -71914 12717 -30045 23238 30747 48934 -41179 -23704 -108811 -185032 -21872
16175b1872J42193n1479j26513M947n8106l5509j1424j49266O0073O6283O0026
$$ -21872 120321 68842 -57671 -52724 -110830 -146339 -157763 -307029 -246956 -180673 -120647
16164a20647P9727O8713O5640o3133N9569j16499p7279k6782k3661N2971J27262
$$ -120647 -40920 27793 93433 30300 89869 -26630 -103909 -130691 -154352 -101381 25881
16153B5881R1748R5356o6617j42412n6669k9283L7151J28457L5940J51909j00538
$$ 25881 117629 212985 146368 3956 -52713 -81996 -44845 83612 119552 271461 170923
16142A70923j06432J06715j0994j7177j3323m5738O0118j42920j27336k5860o3409
$$ 170923 64491 171206 160212 143035 129712 83974 144092 1172 -126164 -152024 -215433
16131b15433K9254j15459l4634J87071J89770L7608n501o0770j6582m0885J6530
$$ -215433 -186179 -301638 -336272 -149201 40569 78177 72676 11906 -4676 -45561 -29031
16120b9031K6805j46622q6846J6250K31900J12879Q2049j33168k11164j05490
$$ -29031 -2226 -148848 -235694 -219444 12456 125335 207384 74216 -136948 -242438
16110b42438J67490J01056J06360P5966k12699m6819M4558o3952r2356j08999
$$ -242438 -74948 26108 132468 208434 -4265 -51084 -6526 -70478 -162834 -271833
16100b71833K7615J23779N268P0744n5677K6778r0633j53031N3873J00388k991
$$ -271833 -244218 -120439 -115171 -44427 -100104 -73326 -163959 -316990 -263117 -162729 -165720
16089a65720j0164l8957o094K37154k712j64510M0842J48556j9113J40510L1894
$$ -165720 -175884 -214841 -220935 16219 13507 -151003 -110161 38395 19282 159792 191686
16078A91686j09505p2502l4531K3328j02191r726p3025q1079J23689J62960n9817
$$ 191686 82181 9679 -24852 -1524 -103715 -113441 -186466 -267545 -143856 19104 -40713
16067d0713j8624l3138J0824L0616j58439k9397J68883L5657j80077j46199J1922
$$ -40713 -59337 -92475 -81651 -51035 -209474 -238871 -69988 -34331 -214408 -360607 -348685
16056c48685J81398J51848j6455j11305l4035J51800J22772J52661m2813j00580
$$ -348685 -167287 -15439 -31894 -143199 -177234 -25434 97338 249999 207186 106606
16046A06606k2520M8609N732k2097Q5759K6336j31516k28921o9426j5325O3082
$$ 106606 84086 132695 138427 116330 202089 228425 96909 -132012 -201438 -216763 -153681
16035a53681J15364J28122J9364j76693K0125J18934m3329j38799j1779J1468
$$ -153681 -38317 89805 109169 -67524 -47399 71535 28206 -110593 -122372 -110904
16025a10904K1279j8211l7215N441J07051o16j2936q5087j39069J3110N6610J10964
$$ -110904 -89625 -107836 -145051 -139610 -32559 -33175 -46111 -131198 -270267 -257157 -200547 -89583
16013h9583j9766j4755L3858l6634J97242o172j61992J5243k8311n1915k2048
$$ -89583 -109349 -124104 -90246 -126880 70362 64190 -97802 -82559 -110870 -162785 -184833
16002a84833K3700M7164M8123J11750k266j90370n4369r781K9923j31268p9825
$$ -184833 -161133 -113969 -65846 45904 43638 -146732 -201101 -210882 -180959 -312227 -392052
15991c92052R289M6291J10596J84405J78862j821r4729j86407K862P9336n1080
$$ -392052 -382763 -336472 -225876 -41471 137391 135570 40841 -145566 -142704 -63368 -114448
15980a14448q129j5905j01598O6044J09839n2733n5039J8416J04635J39614n5918
$$ -114448 -122577 -138482 -240080 -174036 -64197 -116930 -171969 -153553 -48918 90696 34778
15969C4778j52701n809j07302J7923J62055R8475n8879j18224j57853m1798N2916
$$ 34778 -117923 -123732 -231034 -213111 -51056 47419 -11460 -129684 -287537 -329335 -276419
15958b76419K60438q5009m6727P65l5412Q9953M4586N0457j91969l8295J51417
$$ -276419 -15981 -100990 -147717 -146952 -182364 -92411 -47825 2632 -189337 -227632 -76215
15947g6215O5872j64686m776J56991q5446r2477l0525q7241k13906P2370J41109
$$ -76215 -10343 -175029 -179805 -22814 -108260 -200737 -231262 -318503 -532409 -460039 -318930
15936c18930J89842P1221r344k6785J1343J2514M5488L3783j47853j32995j59112
$$ -318930 -129088 -57867 -67211 -93996 -82653 -70139 -24651 9132 -138721 -271716 -430828
15925d30828N6427J05649J27517J53411j63278j81669K5868J25262J7193k0069
$$ -430828 -374401 -268752 -141235 12176 -151102 -332771 -306903 -181641 -164448 -184517
15915a84517M6470j6596J15813q3886L356J1745q8814n4056k4653n164R5463J10884
$$ -184517 -138047 -154643 -38830 -122716 -119360 -107615 -196429 -250485 -275138 -280302 -184839 -73955
15903g3955l4877k36813j26322K57237K37991J6734Q5855N7740j58305j76210
$$ -73955 -108832 -345645 -471967 -214730 23261 39995 125850 183590 25285 -150925
15893a50925K35843J4432n6755O923n176r503O7878J00143k6227r1763j75810
$$ -150925 84918 99350 42595 49518 44342 34839 102717 202860 176633 84870 -90940
15882i0940q4774N4687P9513m2046l9772R5244j6281j55928L8804N9660j05089
$$ -90940 -175714 -121027 -41514 -83560 -123332 -28088 -44369 -200297 -161493 -101833 -206922
15871b06922J2698J98912Q347k5458J40892m3852J0534P3900m8370P817k4171
$$ -206922 -194224 4688 13035 -12423 128469 84617 95151 169051 120681 128498 104327
15860A04327j0674R5042j11828j60591P0310J94560P5994j10750j03457K2931
$$ 104327 93653 188695 76867 -83724 -13414 181146 257140 146390 42933 65864
15850F5864m3048K5851j1093Q1729k01757q5700O7303K7133L7757J20745j40401
$$ 65864 22816 48667 37574 119303 -82454 -168154 -100851 -73718 -35961 84784 -55617
15839e5617j30550k2861L7450R6730j2510Q9166j17832M6712P2345P0633J1953
$$ -55617 -186167 -209028 -171578 -74848 -87358 1808 -116024 -69312 3033 73666 85619
15828H5619l6066k5383r4065j6705l9578j5890K4151J23500Q770j03400K5932
$$ 85619 49553 24170 -69895 -86600 -126178 -142068 -117917 5583 14353 -89047 -63115
15817f3115r7896J7809N1959J1095n6404L7783K34389n2013k90716j31010J85073
$$ -63115 -161011 -143202 -91243 -80148 -136552 -98769 135620 83607 -207109 -338119 -153046
15806a53046Q1413K4317L1130R8070M3371n1527j46107m3794q9287m1371k8384
$$ -153046 -71633 -47316 -16186 81884 125255 73728 -72379 -116173 -205460 -246831 -275215
15795b75215j2460K10199J64920l7978J00552J9452l7773j79882q4490q046J29356
$$ -275215 -287675 -77476 87444 49466 150018 169470 131697 -48185 -132675 -140721 -11365
15784a1365P4252R0736K4848j27918p9063l607M1230R7585J20985L5784p1693
$$ -11365 62887 153623 178471 50553 -28510 -32117 9113 106698 227683 263467 191774
15773A91774k4993P915l7729m4077M0022q0876j72460k3929R7143q2144N452N3892
$$ 191774 166781 174696 136967 92890 132912 52036 -120424 -144353 -47210 -129354 -123902 -70010
15761g0010o6162M3461N1444q1730m9146M0553m7279J02313K6470m9414Q2645
$$ -70010 -136172 -92711 -41267 -122997 -172143 -131590 -178869 -76556 -50086 -99500 -16855
15750a6855J14154o4684k4435m8755j47919j24535R8577J60955p7589O0050J9915
$$ -16855 97299 32615 8180 -40575 -188494 -313029 -214452 -53497 -131086 -71036 -51121
15739e1121p4679r7754j6999J62908R17j09118P8929m7623j06573J29673J15205
$$ -51121 -125800 -223554 -240553 -77645 -76728 -185846 -106917 -154540 -261113 -131440 -16235
15728a6235n3165l7320N7296P3294j75885M2605P9565J2583J28771j9305j45626
$$ -16235 -69400 -106720 -49424 23870 -152015 -109410 -29845 -17262 111509 92204 -53422
15717e3422k08492Q893J2939J00741J58380J21182j09920j42084m9194j19964
$$ -53422 -261914 -253021 -240082 -139341 19039 140221 30301 -111783 -160977 -280941
15707b80941L3127J54053O6216j10313r266O9810N175R3790J1418j02030P6655
$$ -280941 -247814 -93761 -27545 -137858 -147124 -77314 -72139 21651 33069 -68961 7694
15696G694J9103l8980j13739M3438L4920r2178n2701l7416k740J50214J9926L2638
$$ 7694 26797 -12183 -125922 -82484 -47564 -139742 -192443 -229859 -232599 -82385 -62459 -29821
15684b9821Q7462J10988L8140j54023k34544j38029m7754P6859R5230J45762M9983
$$ -29821 57641 168629 206769 52746 -181798 -319827 -367581 -290722 -195492 -49730 253
15673B53M5302p373r5906L9153K5157j87733l2294k7798o8412j04594J30943K6425
$$ 253 45555 38182 -57724 -18571 6586 -181147 -213441 -241239 -309651 -414245 -283302 -256877
15661b56877J03091J78199K4593L2073M4152j05082m1560l862R6329j01795k39004
$$ -256877 -153786 24413 49006 81079 125231 20149 -21411 -25273 71056 -30739 -269743
15650b69743J3140J02042J65637J05405m0645j24846l3943J18984K9202j12254
$$ -269743 -256603 -154561 11076 116481 75836 -49010 -82953 36031 65233 -47021
15640d7021n6926L2978k647M351n6765n473L9984Q9242P3418m9507J04178n7753
$$ -47021 -103947 -70969 -73616 -69265 -126030 -131503 -91519 -2277 71141 21634 125812 68059
15628F8059Q5447Q5955k33869n3052o2193q9055R7884J39180j3148j69302j10027
$$ 68059 153506 239461 5592 -47460 -109653 -198708 -100824 38356 25208 -144094 -254121
15617b54121Q3189J33679O3530r1052J92685J58763j46022p8918q1907k2403k8134
$$ -254121 -170932 -37253 26277 -64775 127910 286673 140651 61733 -20174 -42577 -70711
15606g0711j56084o6893J01961J95291L4811Q812R0075k13108j35739j53151O7828
$$ -70711 -226795 -293688 -191727 3564 38375 47187 137262 -75846 -211585 -364736 -296908
15595b96908J69005O1536J04244j87753N6519J04779p1528k3436r9316k08668
$$ -296908 -127903 -66367 37877 -149876 -93357 11422 -60106 -83542 -182858 -391526
15585c91526J32216J87041r3840k0721N2250Q0999j78730Q4713J38934J4326k0981
$$ -391526 -259310 -72269 -166109 -186830 -134580 -53581 -232311 -147598 -8664 5662 -15319
15574a5319o2920l7150p6095r9601l616N6497J70272J10858Q842q0707p2993O4614
$$ -15319 -78239 -115389 -191484 -291085 -294701 -238204 -67932 42926 51768 -28939 -101932 -37318
15562c7318R5731j15062n3455j18668l1714J41622R9694P2989J9916N5330l8546
$$ -37318 58413 -56649 -110104 -228772 -260486 -118864 -19170 53819 73735 129065 90519
15551I0519o5600k241M4137j33377K3009K13465P7040j99517o5448M5717k4732
$$ 90519 24919 22678 66815 -66562 -43553 169912 246952 47435 -18013 27704 2972
15540B972L2894j23395r0258r2699j17470l1898l2619m6349J01462O5858O9581
$$ 2972 35866 -87529 -177787 -270486 -387956 -419854 -452473 -498822 -397360 -331502 -261921
15529b61921L1579K8261Q0306O7006K5395O9572J0935j5834j03428j9658J6740
$$ -261921 -230342 -202081 -121775 -54769 -29374 40198 51133 35299 -68129 -87787 -71047
15518g1047r5130L6668k1486q7781J71166P1771M0940j6228r8968J88080J21645
$$ -71047 -166177 -129509 -150995 -238776 -67610 4161 45101 28873 -70095 117985 239630
15507B39630Q9728j35413j98765P2228K375m5991n0843J8014N7981j7467p4427
$$ 239630 329358 193945 -4820 67408 69783 23792 -27051 -9037 48944 31477 -42950
15496d2950L5658J25375k39319j62826P4359R2235M6246Q3752N4435L2378j10205
$$ -42950 -7292 118083 -121236 -284062 -209703 -117468 -71222 12530 66965 99343 -10862
15485a0862j82561j1344p6711M7138K21687K33415J9490j25614j09572N8867J96030
$$ -10862 -193423 -204767 -281478 -234340 -12653 220762 240252 114638 5066 63933 259963
15474B59963n9860j78925k3684j27872K734Q8383O691o877M161J13531j37525
$$ 259963 200103 21178 -2506 -130378 -127644 -39261 -32570 -39447 -35286 78245 -59280
15463e9280n1348k1677j2600N7240q711j49302J21765j0244o9368J72990O1472
$$ -59280 -110628 -132305 -144905 -87665 -96376 -245678 -123913 -134157 -203525 -30535 30937
15452C0937j37743j07801K8510J65693J89881q8803M7889n8152k51459p8689J46078
$$ 30937 -106806 -214607 -186097 -20404 169477 80674 128563 70411 -181048 -259737 -113659
15441a13659K0957r8939J10050J29810p3096q0405L7335J81486p7706M2774m9900
$$ -113659 -92702 -191641 -81591 48219 -24877 -105282 -67947 113539 35833 78607 28707
15430B8707j31819k3963o898q414k9524J07434K6223J18744N5308j67317j20373
$$ 28707 -103112 -127075 -133973 -142387 -171911 -64477 -38254 80490 135798 -31519 -151892
15419a51892q9082r5974k27162J58204K94009R0622o2711j04401p7919J04481
$$ -151892 -240974 -336948 -564110 -405906 -111897 -21275 -83986 -188387 -266306 -161825
15409a61825j7033K06933q906k14493j74131K1840O0646m9590j04862J2187K02709
$$ -161825 -178858 28075 19169 -195324 -369455 -347615 -286969 -336559 -441421 -429234 -226525
15398b26525J65126L2726O7974P9104K8476j98160j14850J5720j6107R4046L358
$$ -226525 -61399 -28673 39301 118405 146881 -51279 -166129 -150409 -166516 -72470 -69112
15387f9112j54768m6950o152J04833J172j521J47822o5123j03766J2334J74610
$$ -69112 -223880 -270830 -276982 -172149 -170977 -172498 -24676 -89799 -193565 -181231 -6621
15376f621K41851N7468j18283k01098M6026P1828J8708n6877O818k00009o7220
$$ -6621 235230 292698 174415 -26683 19343 91171 109879 53002 59820 -140189 -207409
15365b07409L6156j53906L1037J42506k9751J17808p3047n6928j10572K6266J86660
$$ -207409 -171253 -325159 -294122 -151616 -181367 -63559 -136606 -193534 -304106 -277840 -91180
15354i1180l6729j9341L6959R8366P6056N2125j57426m4507n9034J70766L2882
$$ -91180 -127909 -147250 -110291 -11925 64131 116256 -41170 -85677 -144711 26055 58937
15343E8937q9361j07650o4948q668J6171o9799N7126q744j6613P7866L9330k1308
$$ 58937 -30424 -138074 -203022 -211690 -195519 -265318 -208192 -216936 -233549 -155683 -116353 -137661
15331a37661O126r1845k7934M2287J57035K18071o057m2788n7723r9864l5668
$$ -137661 -131535 -223380 -251314 -209027 -51992 166079 160022 117234 59511 -40353 -76021
15320g6021k0760p2420r7950j35160J44907R7600J78585N4882k0461r938l562
$$ -76021 -96781 -169201 -267151 -402311 -257404 -159804 18781 73663 53202 43264 39702
15309C9702o8091M9367N2224J48038M7010K6495j26626k13975q4287P437k4715
$$ 39702 -28389 20978 73202 221240 268250 294745 168119 -45856 -130143 -122706 -147421
15298a47421p2214j0495o6696Q5730m2055L979k3015J4506J57372K9705J9878
$$ -147421 -219635 -230130 -296826 -211096 -253151 -249172 -272187 -257681 -100309 -70604 -50726
15287e0726M4143L8072K22966O5033m9826j49834j27629j49800L4611j1405o3771
$$ -50726 -6583 31489 254455 319488 269662 119828 -7801 -157601 -122990 -134395 -198166
15276a98166L9970n470R7234p6937l2513R9364P8927J3812m9430n0773j25249
$$ -198166 -158196 -163666 -66432 -143369 -175882 -76518 2409 16221 -33209 -83982 -209231
15265b09231Q3764J85141R7279K3142r8878l590Q91j21139m8250J2361j5149j10931
$$ -209231 -125467 59674 156953 180095 81217 77627 78518 -42621 -90871 -78510 -93659 -204590
15253b04590J04287M2862P5152j53085k1493P1995K8054m1114k041N8584j63355
$$ -204590 -100303 -57441 17711 -135374 -156867 -84872 -56818 -97932 -99973 -41389 -204744
15242b04744p9302J0535J59659Q8883N286J20128r458r5516o7826j8096l1773
$$ -204744 -284046 -273511 -113852 -24969 -19683 100445 90987 -4529 -72355 -90451 -122224
15231a22224l2804J56500K2354M0865l1487n5895r3189R864o9108L5931l4305
$$ -122224 -155028 1472 23826 64691 33204 -22691 -115880 -106016 -175124 -139193 -173498
15220a73498j2083O1229k4155n1290k9718o531O5280K10223J21514j5706j70966
$$ -173498 -185581 -124352 -148507 -199797 -229515 -236046 -170766 39457 160971 145265 -25701
15209b5701p8030l8150k15776N7619R9617J42636R5678j28449n7856J35434J50983
$$ -25701 -103731 -141881 -357657 -300038 -200421 -57785 37893 -90556 -148412 -12978 138005
15198A38005O8841j46610k25783L9948Q4811O1782p77k3610j3868j58413j01039
$$ 138005 206846 60236 -165547 -125599 -40788 20994 20217 -3393 -17261 -175674 -276713
15187b76713R499M4672J34076P1269l0492L744O704J3985O1025Q9811k37451l0884
$$ -276713 -267214 -222542 -88466 -17197 -47689 -43945 -37241 -23256 37769 127580 -109871 -140755
15175a40755P1945M7119j08943P7386P4307m5026r754N704k5395J26006L6566
$$ -140755 -68810 -21691 -130634 -53248 21059 -23967 -33721 -28017 -53412 72594 109160
15164A09160k02308J423o4503j22975m7883L31992J10780k94066j58055J39628
$$ 109160 -93148 -91725 -156228 -279203 -327086 4906 115686 -178380 -336435 -196807
15154a96807P2524l120L2088p8930r8963K89058L53004J1392p2357K0089j0514
$$ -196807 -124283 -127403 -95315 -174245 -273208 15850 368854 380246 307889 327978 317464
15143C17464j79650q6221L797o1193K2594R4931l1962N909K6137j26171j28737
$$ 317464 137814 51593 55390 -5803 16791 111722 79760 85669 111806 -14365 -143102
15132a43102o5271j96363j0663J18723J41878J95814N4997j2321r945O5403n471
$$ -143102 -208373 -404736 -415399 -296676 -154798 41016 96013 83692 73747 139150 133679
15121A33679j65750j02841R6123M6274j46987r3675J5904l0542J4521j4186n8322
$$ 133679 -32071 -134912 -38789 7485 -139502 -233177 -217273 -247815 -233294 -247480 -305802
15110c05802J85214J58976R550n522k1109q3222j58076P2054O8023m6971n5276
$$ -305802 -120588 38388 47938 42416 21307 -61915 -219991 -147937 -79914 -126885 -182161
15099a82161J4651J17830N7182j49992o3613K7065J0708R0059N8726K4437j05831
$$ -182161 -167510 -49680 7502 -142490 -206103 -179038 -168330 -78271 -19545 4892 -100939
15088a00939l9007R634J68931J7907l2436M8108O3868q7471J0131N5382L084k8019
$$ -100939 -139946 -130312 38619 56526 24090 72198 136066 48595 58726 114108 117192 89173
15076H9173P6539o9830j86827j12272J4001N973k7089J6894L5781l9697N9281
$$ 89173 165712 95882 -90945 -203217 -189216 -183243 -210332 -193438 -157657 -197354 -138073
15065a38073m008j1318J54108N0999J8102k34274j7219J36444M4836l0378J54509
$$ -138073 -142081 -153399 709 51708 69810 -164464 -181683 -45239 -403 -30781 123728
15054A23728j16003m1610K3j33260K5327j4008R6830J3567k1078j60008J4021
$$ 123728 7725 -33885 -33862 -167122 -141795 -155803 -58973 -45406 -66484 -226492 -212471
15043b12471P0249P1764k3563M5480j9902O2403k0917J5856P6329M0537J23608
$$ -212471 -142222 -70458 -94021 -48541 -68443 -6040 -26957 -11101 65228 105765 229373
15032B29373q6728o8109J15097L0485j51898l17590J0224j8467r5972r6927J05559
$$ 229373 142645 74536 189633 220118 68220 -249370 -239146 -257613 -353585 -450512 -344953
15021c44953J22440M7913k377R4003m9345P0838K2612n2392j14115J9594k9594
$$ -344953 -222513 -174600 -176977 -82974 -132319 -61481 -38869 -91261 -205376 -185782 -215376
15010b15376j5340K7053j4477M0161l6737J06529m0941j05343O5805j947N1626
$$ -215376 -230716 -203663 -218140 -177979 -214716 -108187 -149128 -254471 -188666 -190613 -138987
14999a38987R287j5075q715m9418J29538J3718l056J2849j56360j13355K32078
$$ -138987 -129700 -144775 -153490 -202908 -73370 -59652 -62708 -49859 -206219 -319574 -87496
14988h7496J35655J15345o5837o8362K8499k1353O0621M8536j43724m2668J72923
$$ -87496 48159 163504 97667 29305 57804 36451 97072 145608 1884 -40784 132139
14977A32139P4225j3161K577m1013P591o2005k80M618k57492L2276R3648l2258
$$ 132139 206364 193203 195780 154767 162358 100353 100073 104691 -152801 -120525 -26877 -59135
14965e9135l18J006m1500j7179l4683J08412R6594Q3244k1121k08506J6192m3169
$$ -59135 -59453 -58447 -99947 -117126 -151809 -43397 53197 136441 115320 -93186 -76994 -120163
14953a20163P4679P6018n8486n0018j875j1775j20412N716M7060m7961N7368J04233
$$ -120163 -45484 30534 -27952 -77970 -79845 -91620 -212032 -206316 -159256 -207217 -149849 -45616
14941d5616L5664m6035j2878m2733M6028K5629l0171l2776O8300J96952n3606
$$ -45616 -9952 -55987 -68865 -111598 -65570 -39941 -70112 -102888 -34588 162364 108758
14930A08758j87250q7995j05001o085R7259K66676J79389N4408q2104M5046n4751
$$ 108758 -78492 -166487 -271488 -277573 -180314 86362 265751 320159 238055 283101 228350
14919B28350j2669q6630k31578o0224k128M9702o2362q5388R1923J76666Q5173
$$ 228350 215681 129051 -102527 -162751 -164879 -115177 -177539 -262927 -171004 5662 90835
14908I0835J19567K8289j00807k03856m9916p6501O1051Q4306q7452k9037j9824
$$ 90835 210402 238691 137884 -65972 -115888 -192389 -131338 -47032 -134484 -163521 -183345
14897a83345K6667J5043n6735K7686J45718j0465j28379m1112N574j10893k0801
$$ -183345 -156678 -141635 -198370 -170684 -24966 -35431 -163810 -204922 -199348 -310241 -331042
14886c31042P1387J98214J43175m8004M5424q4078j36939K11838J27210j61085
$$ -331042 -259655 -61441 81734 33730 79154 -4924 -141863 69975 197185 36100
14876C6100q3832r8014J43275O9284j34621l6967O9469O1402j90832j03840n2458
$$ 36100 -47732 -145746 -2471 66813 -67808 -104775 -35306 26096 -164736 -268576 -321034
14865c21034r8253l3117m7445J71576J20349L7457N8312J25598M1428k0475j33917
$$ -321034 -419287 -452404 -499849 -328273 -207924 -170467 -112155 13443 54871 34396 -99521
14854i9521r6457O6057K4896K4428K9759j13935R7801J40375J3179O565j04904
$$ -99521 -195978 -129921 -105025 -80597 -50838 -164773 -66972 73403 86582 93147 -11757
14843a1757j44367O7199J85870R5957q4090J602J0188j8443K9042Q8592j17251
$$ -11757 -156124 -88925 96945 192902 108812 110414 120602 102159 131201 219793 102542
14832A02542j40106J1088l824m2142r0243M1234j1713L4839K4564n7836L7281
$$ 102542 -37564 -26476 -30300 -72442 -162685 -121451 -133164 -98325 -73761 -131597 -94316
14821i4316K9006p5377R1131J44598j29841k99842j32089N9367M9022P8788K9665
$$ -94316 -65310 -140687 -49556 95042 -34799 -334641 -466730 -407363 -358341 -279553 -249888
14810b49888L9061p435j05687N0059J46339o7666P1081K3722j72757p1352m4071
$$ -249888 -210827 -218262 -323949 -273890 -127551 -195217 -124136 -100414 -273171 -344523 -388594
14799c88594n9321K9013M0707n9243O6371K13478J08421j3108m2885M9853J22525
$$ -388594 -447915 -418902 -378195 -437438 -371067 -157589 -49168 -62276 -105161 -55308 67217
14788F7217j70695N854j1077j46293r1932J65645K8070o6735j36980l2962J38281
$$ 67217 -103478 -97624 -108701 -254994 -346926 -181281 -153211 -219946 -356926 -389888 -251607
14777b51607L5438J65852K8390m7019j14183k0237M8435Q4885p8087M9l4483k0629
$$ -251607 -216169 -50317 -21927 -68946 -183129 -203366 -154931 -70046 -148133 -148084 -182567 -203196
14765b03196o6275j07065J36089K90505k3516j28252j27366q4683J18413K8305
$$ -203196 -269471 -376536 -240447 50058 26542 -101710 -229076 -313759 -195346 -167041
14755a67041Q6957N711j43010Q561N2763Q474R3345L6586J05870L6918j1984m9440
$$ -167041 -80084 -74373 -217383 -208822 -156059 -147585 -54240 -17654 88216 125134 113150 63710
14743F3710j53991j26994L1371K34861O1592k00047k29565m619R5114o2598P5423
$$ 63710 -90281 -217275 -185904 48957 110549 -89498 -319063 -323682 -228568 -291166 -215743
14732b15743J28775k5929O6427m7401K2109J21484o5906p1723K2507o4754J2744
$$ -215743 -86968 -112897 -46470 -93871 -71762 49722 -16184 -87907 -65400 -130154 -117410
14721a17410n2281n3274Q904o591L4970j11198j03912R5268K03750J06398L2520
$$ -117410 -169691 -222965 -214061 -220652 -185682 -296880 -400792 -305524 -101774 4624 37144
14710C7144R3019M2784n0224l1522j20923J359o43m3348q659M2978m4279J58925
$$ 37144 130163 172947 122723 91201 -29722 -28363 -29006 -72354 -81013 -38035 -82314 76611
14698G6611K11735p3675j69017j1019j72906m7880J39537m0681j2330j887L8515
$$ 76611 288346 214671 45654 34635 -138271 -186151 -46614 -87295 -99625 -101512 -62997
14687f2997q8073o8726J1511N8408j10062n4866R3866J37242J03615k21192j35602
$$ -62997 -151070 -219796 -208285 -149877 -259939 -314805 -220939 -83697 19918 -201274 -336876
14676c36876M5855Q2178R0512l3902J6339N1300K1982j40000j16780J7118L41051
$$ -336876 -291021 -208843 -118331 -152233 -135894 -84594 -62612 -202612 -319392 -302274 38777
14665C8777J62833j61495j56523j1538l1105M0327j4598O8606P8251q7906n6729
$$ 38777 201610 40115 -116408 -127946 -159051 -118724 -133322 -64716 13535 -74371 -131100
14654a31100l1993Q2916O6038J5041j1783n151j45282j30293n7567Q2578J25084
$$ -131100 -163093 -80177 -14139 902 -10881 -16032 -161314 -291607 -349174 -266596 -141512
14643a41512m1726J26061N6091k8455j49074J5791J6725r0286m0255K8870j06932
$$ -141512 -183238 -57177 -1086 -29541 -178615 -162824 -146099 -236385 -276640 -247770 -354702
14632c54702M0746P0512Q7052J71303l5222j35669O8321m963l2732P3223j32227
$$ -354702 -313956 -243444 -156392 14911 -20311 -155980 -87659 -92622 -125354 -52131 -184358
14621a84358P8120L4265j14105O2429L0180m5433Q6005R4517O4820P4253K6127
$$ -184358 -106238 -71973 -186078 -123649 -93469 -138902 -52897 41620 106440 180693 206820
14610B06820j28493j78442J02634L8375k0362p0111K01240n0190j76823P8250
$$ 206820 78327 -100115 2519 40894 20532 -49579 151661 101471 -75352 2898
14600B898o4168q927J42769m0755l9635N1775L3527n7384j21348j41287R380j683
$$ 2898 -61270 -70197 72572 31817 -7818 43957 77484 20100 -101248 -242535 -233155 -234838
14588b34838l4807O8598J26624l663J9221J44041k9129j71195p4075l2217m9635
$$ -234838 -269645 -201047 -74423 -78086 -58865 85176 56047 -115148 -189223 -221440 -271075
14577b71075J72302j0972k50014m0714Q3513J17742L3599R2774O9854l75j50001
$$ -271075 -98773 -109745 -359759 -400473 -316960 -199218 -165619 -72845 -2991 -3366 -153367
14566a53367j4008K8127R9866Q3531q4979l8809p9839m7698J67463Q9676p059
$$ -153367 -167375 -139248 -39382 44149 -40830 -79639 -159478 -207176 -39713 49963 42904
14555D2904l5621L6275K4406r4029M7826J288r633O1987L1841o988r2478Q223
$$ 42904 7283 43558 67964 -26065 21761 23049 13416 75403 107244 100256 7778 16001
14543A6001j3053j09552Q7131R238k2996N1754K646o8385j1171M9521k79520O2340
$$ 16001 2948 -106604 -19473 -10235 -33231 18523 21169 -47216 -58387 -8866 -288386 -226046
14531b26046J18542l3442J43533m3816p4298o1159J04200J16058Q3131Q125l5281
$$ -226046 -107504 -140946 2587 -41229 -115527 -176686 -72486 43572 126703 134828 99547
14520I9547p2638l3033P199p946k9837j5377n466Q8443R2832P2082k39158K390
$$ 99547 26909 -6124 1075 -6871 -36708 -52085 -57551 30892 123724 195806 -43352 -40962
14508d0962J15709O826J69678m2594r3315R595J02396N7474r4092p1863l378j40881
$$ -40962 74747 81573 251251 208657 115342 124937 227333 284807 190715 118852 115474 -25407
14496b5407M717k809l2595j0838j13881J8404m2798M1984J87097O2830m4819o4766
$$ -25407 -20690 -23499 -56094 -66932 -180813 -162409 -205207 -163223 23874 86704 41885 -22881
14484b2881m0021J63459K16177o8568K3749P8409J95381q56M0593l8193j17997
$$ -22881 -62902 100557 316734 248166 271915 350324 545705 544849 585442 547249 429252
14473D29252j10950j22442m2807J07662R2141j26990k4797N3686M0729j14673
$$ 429252 318302 195860 153053 260715 352856 225866 201069 254755 295484 180811
14463A80811J0077J00303k5152p294J14137j632J76107R8571j43509j67750m3843
$$ 180811 190888 291191 266039 258745 372882 371250 547357 645928 502419 334669 290826
14452B90826M9019N4579l5405j48284j83941o827J65241o003r3329k2421M597
$$ 290826 339845 394424 359019 210735 26794 19967 185208 179205 85876 63455 68052
14441F8052L3347K00218J67828K30052Q6470o8016N9905J01321J8880q9471K5107
$$ 68052 101399 301617 469445 699497 785967 717951 777856 879177 898057 808586 833693
14430H33693L333m3832j67293j60142j04283j02805J68675N8995j72105k70246
$$ 833693 837026 793194 625901 465759 361476 258671 427346 486341 314236 43990
14420D3990k8216M2369O091Q7036K89807J67535q5374l6555K39481n2928j9588
$$ 43990 15774 58143 64234 151270 441077 608612 523238 486683 726164 673236 653648
14409F53648q5200q1099O8096J64346N189j19446j27442j29971k49667J20389
$$ 653648 568448 487349 555445 719791 724980 605534 478092 348121 98454 218843
14399B18843M1449l1220m466P4987J22072n5270p1660m7843j9786j5854N3259
$$ 218843 260292 229072 224606 299593 421665 366395 294735 246892 227106 211252 264511
14388B64511N5784j7158n4731q194J7127l3765L5776J31913L5582k36066n4472
$$ 264511 320295 303137 248406 240212 257339 223574 259350 391263 426845 190779 136307
14377A36307j16430L7176j1855P8423j07566p6848J51539M9915O0902L3206k4445
$$ 136307 19877 57053 45198 123621 16055 -60793 90746 140661 201563 234769 210324
14366B10324J4493N5384O5423P9971j77983j07971M4419k56777N2121M486r2927
$$ 210324 224817 280201 345624 425595 247612 139641 184060 -72717 -20596 -16110 -109037
14355a09037j23537J07433K07388P2947J821k5752q7817j9005l0634O2985M7234
$$ -109037 -232574 -125141 82247 155194 157015 131263 43446 24441 -6193 56792 104026
14344A04026m1991O2896r1429Q5548J18908l3395o6114j26332o175j07684m3890
$$ 104026 62035 124931 33502 119050 237958 204563 138449 12117 5942 -101742 -145632
14333a45632k2991M6552L6213Q192k5756J4747j462N1130m2174j36262k07896
$$ -145632 -168623 -122071 -85858 -77666 -103422 -88675 -90137 -39007 -81181 -217443 -425339
14322d25339j16803K07135N9571J72253K24694Q0239l9809M850L1234p3817j10324
$$ -425339 -542142 -335007 -275436 -103183 121511 201750 161941 166791 198025 124208 13884
14311A3884k8634m1654N31q3939K11707J41778l8134q1617M8953J13746j1328
$$ 13884 -14750 -56404 -55873 -139812 71895 213673 175539 93922 142875 256621 245293
14300B45293j78824k9620j3619P6996q3597j4990j259m6265n2651R5487L7736
$$ 245293 66469 36849 23230 100226 16629 1639 380 -45885 -98536 -3049 34687
14289C4687l9985m4714O9088K546j29078l9750J78246N4154q244P0028q5406m715
$$ 34687 -5298 -50012 19076 21622 -107456 -147206 31040 85194 76950 146978 61572 56857
14277E6857P1145Q2242J07150J9927j91772r7634J9448j14219J4921K3165J2134
$$ 56857 128002 210244 317394 337321 145549 47915 67363 -46856 -31935 -8770 3364
14266C364Q096J07924O9652m4242K2186l437J0968p0185J36539K5886n9637k4580
$$ 3364 11460 119384 189036 144794 166980 163543 174511 104326 240865 266751 207114 182534
14254A82534q633j38943m2142J07479R4241P2247j7242j70127j39056l1888M9506
$$ 182534 173901 34958 -7184 100295 194536 266783 249541 79414 -59642 -91530 -42024
14243d2024p7433j01421J6837J07639J88599O0949K380M8620J58928j6709o3228
$$ -42024 -119457 -220878 -204041 -96402 92197 153146 155526 204146 363074 346365 283137
14232B83137p8889R2468K8170j60985j89367n1217j38397K6332Q6744O750M2263
$$ 283137 204248 296716 324886 163901 -25466 -76683 -215080 -188748 -102004 -95254 -52991
14221e2991J52332J41332j34396j19298k5083j7218N2981j9484l4838J06461Q9389
$$ -52991 99341 240673 106277 -13021 -38104 -55322 -2341 -21825 -56663 49798 139187
14210A39187J3352m4395O397Q0880p2413j3679O3682j22912p0588J39521K24410
$$ 139187 152539 108144 114541 195421 123008 109329 173011 50099 -20489 119032 343442
14199C43442Q0911m2675r5683j04122j70402J00957J69249q4065j5524M3526J10569
$$ 343442 424353 381678 285995 181873 11471 112428 281677 197612 182088 225614 336183
14188C36183K3052p1882J7074R6100K3405N5251k5959j06944j12347o0141K9315
$$ 336183 359235 287353 304427 400527 423932 479183 453224 346280 233933 173792 203107
14177B03107r301Q482L0215N5068J0163J7649q2387K0076j06321Q3058L7094R3810
$$ 203107 193806 202288 232503 287571 297734 315383 232996 253072 146751 229809 266903 360713
14165C60713J59460L2275o7863k72993m7712J45890J42055p9203j19967o7042
$$ 360713 520173 552448 484585 211592 163880 309770 451825 372622 252655 185613
14155A85613J4462l1146j34237R7660K11308R376j16358j458N7511j3432M3195
$$ 185613 200075 168929 34692 132352 343660 353036 236678 235220 292731 279299 322494
14144C22494j9743J00559J2289m363P2702o0331m2056P023J10901j3508j38474
$$ 322494 302751 403310 415599 411236 483938 423607 381551 388574 499475 485967 347493
14133C47493R462j14212j25383P2762J22678J63639L3924K0059Q8688P1459j02075
$$ 347493 356955 242743 117360 190122 312800 476439 510363 530422 619110 690569 588494
14122E88494k29549R9736J32092j59223R9993N5474q3916m8223j06238L0955O8135
$$ 588494 358945 458681 590773 431550 531543 587017 503101 454878 348640 379595 447730
14111D47730r9370J8016J81624L5834N5587M5599J3242n8448j5623O6186N7576
$$ 447730 348360 366376 548000 583834 639421 685020 698262 639814 624191 690377 747953
14100G47953m1597j1678O8460L2078q2903q1534p2860K2011K51063K53208O728
$$ 747953 706356 694678 763138 795216 712313 630779 557919 579930 830993 1084201 1090929
14089A090929k76443j7824j892K6322J14006L3370J45651N8441J07978J42834
$$ 1090929 814486 796662 794770 821092 935098 968468 1114119 1172560 1280538 1423372
14079A423372K2130k05230l6077O7048K39212Q1159O1786j26240Q466K70275L10707
$$ 1423372 1445502 1240272 1204195 1271243 1510455 1591614 1653400 1527160 1535626 1805901 2116608
14068B116608Q0495Q6647J60785P9910K17497L16430K55776M16561M26043M20859
$$ 2116608 2197103 2283750 2444535 2524445 2741942 3058372 3314148 3730709 4156752 4577611
14058D577611M62555O23834R71745J234997J440863K082699K712336L362974M126001
$$ 4577611 5040166 5664000 6635745 7870742 9311605 11394304 14106640 17469614 21595615
14049B1595615M490629M766409M836417M129797L062391J631618P3961j579683
$$ 21595615 26086244 30852653 35689070 39818867 42881258 44512876 44586837 43007154
14041D3007154k870167l515999l735891l518394l154634k629169j632223q56857
$$ 43007154 40136987 36620988 32885097 29366703 26212069 23582900 21950677 21093820
14033B1093820q4205P66600J677068K824377L822240N347802O816190Q357048
$$ 21093820 21009615 21776215 23453283 26277660 30099900 35447702 42263892 50620940
14025E0620940R451602R487416Q641459P175600M861731J685893j644531m467072
$$ 50620940 60072542 69559958 78201417 85377017 90238748 91924641 90280110 85813038
14017H5813038o629066p916595q204147p551691o008352m463434k777339o83688
$$ 85813038 79183972 71267377 63063230 55511539 49503187 45039753 42262414 41578726
14009D1578726J331088L293496N507590P697175J0047589J1708437J2918178J3036524
$$ 41578726 42909814 46203310 51710900 59408075 69455664 81164101 94082279 107118803
14001A07118803J2010654R661877O206927J897083k491682o558420r816984j1745949
$$ 107118803 119129457 128791334 134998261 136895344 134403662 127845242 118028258 106282309
13993A06282309j2219547j1473820r958022p935268n378467k769239n29879J967013
$$ 106282309 94062762 82588942 72630920 64695652 59317185 56547946 56018067 57985080
13985E7985080M536487P612476J0986305J3946303J6468104J8302757J8382591
$$ 57985080 62521567 70134043 81120348 95066651 111534755 129837512 148220103
13978A48220103J6637906J2872122P059341M38473o101973j1769841j5895767
$$ 148220103 164858009 177730131 184789472 185227945 179125972 167356131 151460364
13971A51460364j8096944j8069832j6533430j4016458j1064378q014057n021870
$$ 151460364 133363420 115293588 98760158 84743700 73679322 65665265 60643395
13964F0643395k052250L16190K725864N190664P557774R762286J1580895J2389373
$$ 60643395 58591145 58907335 61633199 66823863 74381637 84143923 95724818 108114191
13956A08114191J2306976J0706698P784148M021262n53559n080795r035436j1979376
$$ 108114191 120421167 131127865 138912013 142933275 142379716 137298921 128263485 116284109
13948A16284109j3216428j3321536j2240565j0320453q150415n885666l716396
$$ 116284109 103067681 89746145 77505580 67185127 59034712 53149046 49432650
13941D9432650j564347O80499K680959M368315O137884P714315Q584968Q573349
$$ 49432650 47868303 48548802 51229761 55598076 61735960 69450275 78035243 86608592
13933H6608592P506513N259723K297581j024499m286788o837062r005851j0026360
$$ 86608592 94115105 99374828 101672409 100647910 96361122 89524060 80518209 70491849
13925G0491849r719127q803265p709992o093550m415910l135527k002389j043402
$$ 70491849 60772722 51969457 44259465 38165915 33750005 30614478 28612089 27568687
13917B7568687k33883Q26853J604177K422244L252580L789131L824574L759148
$$ 27568687 27334804 28161657 29765834 32188078 35440658 39229789 43054363 46813511
13909D6813511L093661J855421N14070j269322k799602l989553m814827m989599
$$ 46813511 49907172 51762593 52276663 51007341 48207739 44218186 39403359 34413760
13901C4413760m813793m242619l702970l103507k476993j941134j454364j042550
$$ 34413760 29599967 25357348 21654378 18550871 16073878 14132744 12678380 11635830
13893A1635830r61576q66427o52777o15712m68923l75237m20659l12676l60695
$$ 11635830 10674254 9807827 9155050 8539338 8070415 7695178 7274519 6961843 6601148
13884F601148l11480j47049k08498k51845j59489k71782j76299k49016j8267m9880
$$ 6601148 6289668 6142619 5934121 5682276 5522787 5251005 5074706 4825690 4807423 4757543
13874D757543j51354j81045k09047j14527o804j11482n6180j44868j49874k36597
$$ 4757543 4606189 4425144 4216097 4101570 4094766 3983284 3927104 3782236 3632362 3395765
13864C395765j40895j30484n1456P781j84467j21138p4455o7688j23455j12464
$$ 3395765 3254870 3124386 3072930 3080711 2896244 2775106 2700651 2632963 2509508 2397044
13854B397044m5954J6413m5995K4895l6397j9498O6176j73159m6986L9124j67370
$$ 2397044 2351090 2367503 2321508 2346403 2310006 2290508 2356684 2183525 2136539 2175663 2008293
13843B008293k57661l6058M7107o506j75018k0675R198l6721j01064O4472N7831
$$ 2008293 1750632 1714574 1761681 1755175 1580157 1559482 1568680 1531959 1430895 1495367 1553198
13832A553198O2589R501r7258j17844j29661P5982N7778K164j45085k6386r359
$$ 1553198 1615787 1625288 1528030 1410186 1280525 1356507 1414285 1416449 1271364 1244978 1235619
13821A235619q6985j69149P282L8336N8121q5622j00742q3160o2898j73551L8703
$$ 1235619 1148634 979485 986767 1025103 1083224 997602 896860 813700 750802 577251 615954
13810F15954K1324l318P2904K17311k5048j52640j067k3937R0628L0888j4504
$$ 615954 637278 633960 706864 924175 899127 746487 745420 721483 812111 842999 828495
13799H28495r4210n7308m8671P4500j0560K211n3936j31909l8294j07469K7423
$$ 828495 734285 676977 628306 702806 692246 694457 640521 508612 470318 362849 390272
13788C90272R8436j84135j00708n994J12464P6027p5921J8314K32066J31081q5414
$$ 390272 488708 304573 203865 197871 310335 386362 310441 328755 560821 691902 606488
13777F06488j45697j31636N0602j10333m4294K36528L776j93416j21728J60983
$$ 606488 460791 329155 379757 269424 225130 461658 465434 272018 150290 311273
13767C11273j1252k6181p4698P5470j9009o3265l5350n2507n120J77373K4479
$$ 311273 300021 273840 199142 274612 255603 192338 156988 104481 99361 276734 301213
13756C01213p0333Q0367M5262j26159q0603j7821L6030l6480R1710m4920O377
$$ 301213 230880 311247 356509 230350 149747 131926 167956 131476 223186 178266 184643
13745A84643o7002M8925J10057K7891K5085M8161J6765j30155j9078P8825O5467
$$ 184643 117641 166566 276623 304514 329599 377760 394525 264370 245292 324117 389584
13734C89584j28119j71523m9773j0736m6567J26784O9661J3775Q4427L0360J09290
$$ 389584 261465 89942 40169 29433 -17134 109650 179311 193086 277513 307873 417163
13723D17163M3683r4265j26649j22320m215k2131J19687Q8705J4956J1860l3598
$$ 417163 460846 366581 239932 117612 113397 91266 210953 299658 314614 326474 292876
13712B92876j40336k29900o9542O2809J36116J67306P3611j12362q6477J39798
$$ 292876 152540 -77360 -146902 -84093 52023 219329 292940 180578 94101 233899
13702B33899j08472n5369J43396p2575L6212K18145N376K0545q4825n1056o0174
$$ 233899 125427 70058 213454 140879 177091 395236 400612 421157 336332 285276 225102
13691B25102m2693k49659r8313Q0632O2364n2206N7910R0316J18640O7887l1523
$$ 225102 182409 -67250 -165563 -84931 -22567 -74773 -16863 73453 192093 259980 228457
13680B28457j045r3720j35463O9067J6549n2113K161K0945O831P2768P0709N4111
$$ 228457 227412 133692 -1771 67296 83845 31732 33893 54838 61669 134437 205146 259257
13668B59257j43302r4591p0228J01779J93998R6790o4293j37803Q0960J34024
$$ 259257 115955 21364 -48864 52915 246913 343703 279410 141607 222567 356591
13658C56591j64006j23773k2310O8963M430R2604Q2096M5781r9635r9345p7173
$$ 356591 192585 68812 46502 115465 119895 212499 294595 340376 240741 141396 64223
13647F4223O5821n0212j07959p6906K1681j193M6790K6129N9790N9791P0299N5164
$$ 64223 130044 79832 -28127 -105033 -83352 -84545 -37755 -11626 48164 107955 178254 233418
13635B33418l3233k38722J10361p6469k52360j11076R7810J00626N5949N1027
$$ 233418 200185 -38537 71824 -4645 -257005 -368081 -270271 -169645 -113696 -62669
13625f2669K2590m1722K6939O7975m9892j09626R167N3017p9542P907j4244R611
$$ -62669 -40079 -81801 -54862 13113 -36779 -146405 -137238 -84221 -163763 -155856 -170100 -160489
13613a60489J89670j3408j42021Q75K7411n9387J0147J84125K00053J17801j58347
$$ -160489 29181 15773 -126248 -125373 -97962 -157349 -147202 36923 236976 354777 196430
13602A96430r5092j33316j09510l0730o5548O4898N2823J07439L3649J16021j41130
$$ 196430 101338 -31978 -141488 -172218 -237766 -172868 -120045 -12606 21043 137064 -4066
13591d066j52165Q0322P8337M8614K251L4358J32235J3126K3862j8366J55421
$$ -4066 -156231 -75909 2428 51042 53293 87651 219886 233012 256874 238508 393929
13580C93929J40874L5429k29272j36961m8145N2477j45989j7628K06303R4726
$$ 393929 534803 570232 340960 203999 155854 208331 62342 44714 251017 345743
13570C45743K813m3765L4079M3341k0187k49742J0615J70513J30340K6567j3054
$$ 345743 348556 304791 338870 382211 362024 112282 122897 293410 423750 450317 437263
13559D37263J28321n8037m3250J48406J07220O5314j89432o5100k3052n4271j67877
$$ 437263 565584 507547 464297 612703 719923 785237 595805 530705 507653 453382 285505
13548B85505j34868j9014J06875Q7568k1913J7296N4296K5876k8761J5718o8742
$$ 285505 150637 131623 238498 326066 304153 321449 375745 401621 372860 388578 319836
13537C19836j1965J74442J26358P0089J71258m4920k89432k07333q6869J01876
$$ 319836 307871 482313 608671 678760 850018 805098 515666 308333 221464 323340
13527C23340n4526M6461L4839N3592j2844j85175N7019J15348Q3609J35363J07991
$$ 323340 268814 315275 350114 403706 390862 205687 262706 378054 461663 597026 705017
13516G05017J55590n916J41475K12784J6244j49042q3764p5679o0018q4315K3534
$$ 705017 860607 854691 996166 1208950 1225194 1076152 992388 916709 856691 772376 795910
13505G95910j1776j52245m9432L2223P4083J43706R5723J03821J13305M5975O8627
$$ 795910 784134 631889 582457 614680 688763 832469 928192 1032013 1145318 1191293 1259920
13494A259920K41984J3246j2231m852n8500j13810r7547q3067j56515p9370j01258
$$ 1259920 1501904 1515150 1502919 1498067 1439567 1325757 1228210 1145143 988628 909258 808000
13483H08000j01535P9419J6188o3772P626J34210J35277K9493p178R6196N971
$$ 808000 706465 785884 802072 738300 745926 880136 1015413 1044906 1037728 1133924 1139895
13472A139895L22138O4607j5465n5871j17533k03216k59593j33636J60825J07725
$$ 1139895 1462033 1526640 1511175 1455304 1337771 1134555 874962 741326 902151 1009876
13462A009876n6017k26684j97428k4351K8113O5082J06171P6004J8866J66453
$$ 1009876 953859 727175 529747 505396 533509 598591 704762 780766 799632 966085
13452I66085j06392m9548J10307K12369l4886k275o9381k28853q7091J59846j2690
$$ 966085 859693 810145 920452 1132821 1097935 1095660 1026279 797426 710335 870181 857491
13441H57491j44115j00444K495O2708R364J5802R6037l0734n7400J2389N1382
$$ 857491 713376 612932 615427 678135 687499 703301 799338 768604 711204 723593 774975
13430G74975J13814k474j7493K18497K29321J65120M8989P4325L7215J23528r7226
$$ 774975 888789 886315 868822 1087319 1316640 1481760 1530749 1605074 1642289 1765817 1668591
13419A668591k46788q1039j16994m5036j31524j20541p1022j65838m214O1871
$$ 1668591 1421803 1340764 1223770 1178734 1047210 926669 855647 689809 685595 747466
13409G47466O1565k43554l6274Q0759N8872J75888l9426k5779N9950J20914J29102
$$ 747466 809031 565477 529203 609962 668834 844722 805296 779517 839467 960381 1089483
13398A089483K68169o7324j32809k8064k1542j2538n0151j43969j32662k05865
$$ 1089483 1357652 1290328 1157519 1129455 1107913 1095375 1045224 901255 768593 562728
13388E62728r749k3675q000J70879J24325J499J8041p999J16311J9682J24119
$$ 562728 552979 529304 521304 692183 816508 818007 836048 828049 944360 964042 1088161
13377A088161K34385J20820J3104R7466k77168k81439m3016N291L7292j18103
$$ 1088161 1322546 1443366 1456470 1553936 1276768 995329 952313 957604 994896 876793
13367H76793j31723M5453j4218j13753q3985l555k16442K919J07420J88505N6920
$$ 876793 745070 790523 776305 662552 578567 575012 358570 361489 468909 657414 714334
13356G14334J13083P8660K1729K3651K28598o5464o7300p2191k3450j87473j7866
$$ 714334 827417 906077 927806 951457 1180055 1114591 1047291 975100 951650 764177 746311
13345G46311j00694o8910J27650o2370j14385k23350j9142J32024k4799j83696
$$ 746311 645617 576707 704357 641987 527602 304252 285110 417134 392335 208639
13335B08639j23214q3024K42685J31034j17521Q7085J24546J3309J7155K434p4142
$$ 208639 85425 2401 245086 376120 258599 345684 470230 483539 500694 503128 428986
13324D28986j38835J9514n4899j35896n3546q284R7205J58210J24258m2031K2727
$$ 428986 290151 309665 254766 118870 65324 57040 154245 312455 436713 394682 417409
13313D17409M0076m9646j16976j34669j393p8496P2252O801j5117L8508j406P5399
$$ 417409 457485 407839 290863 156194 154801 76305 148557 155358 140241 178749 177343 252742
13301B52742j4628N8679m0914q5601r61J7915l3109M3154o6626p2963M1726L970
$$ 252742 238114 296793 255879 170278 169317 187232 154123 197277 130651 57688 99414 103384
13289A03384O0994Q1433P5791k8221r9754j7730J08202J06424L5842J6196m6766
$$ 103384 164378 245811 321602 293381 193627 175897 284099 390523 426365 442561 395795
13278C95795j48904r7843J3835O6277l649q0794Q7858j6633J45920n7949q906
$$ 395795 246891 149048 162883 229160 225511 144717 232575 215942 361862 303913 295007
13267B95007k0722j25164k6813P769R9104J43823l9800q5561J5400j59219j24172
$$ 295007 274285 149121 122308 130077 229181 373004 333204 247643 263043 103824 -20348
13256b0348P424J721l0712M9300K03861J55874J30803k734j58893r4409k4751
$$ -20348 -12924 -11203 -41915 7385 211246 367120 497923 495189 336296 241887 217136
13245B17136J9896r5280L2038J26130L7324n3078j39549K35609M1922l8066o0674
$$ 217136 237032 141752 173790 299920 337244 284166 144617 380226 422148 384082 323408
13234C23408p2103q7326J24502M5253J43479o251O1336J278P883p2647K8011M9088
$$ 323408 251305 163979 288481 333734 477213 470962 532298 533576 541459 468812 496823 545911
13222E45911n6387l9298n843M0545K265o8528O576j01373J14335l2776j5869n3632
$$ 545911 489524 450226 444383 484928 487193 418665 425241 323868 438203 405427 389558 335926
13210C35926o7765J8581K0294j27545J6055J40188J39667k5072M3005l4452R129
$$ 335926 268161 286742 307036 179491 195546 335734 475401 450329 493334 458882 468011
13199D68011M4084J45369p1349j00069j39852p6438J41509O1049p3505j14365
$$ 468011 512095 657464 586115 486046 346194 269756 411265 472314 398809 284444
13189B84444k5184N0642n6582L3231p2134k49o9797J26707o6078p9396J66809
$$ 284444 259260 309902 253320 286551 214417 214168 144371 271078 205000 125604 292413
13178B92413K56046O6177M0811n3416k3761L8778J20979o6528j94254n9948l0443
$$ 292413 548459 614636 655447 602031 578270 617048 738027 671499 477245 417297 386854
13167C86854L8900N0161m5771K19284J36652m2310j1762m4595O9623J12806p3208
$$ 386854 425754 475915 430144 649428 786080 743770 732008 687413 757036 869842 796634
13156G96634O5148L19491P1757j69145k08400j05422Q915J80713Q9872j20920
$$ 796634 861782 1181273 1253030 1083885 875485 770063 778978 959691 1049563 928643
13146I28643j9520J28803j9054k0712n0576j47566j76841Q397J1616J42438J18718
$$ 928643 909123 1037926 1018872 998160 947584 800018 623177 631574 643190 785628 904346
13135I04346k9128j7029j06534P0303M5255j35626l6908K25930l1533R3k3233
$$ 904346 875218 858189 751655 821958 867213 731587 694679 920609 889076 889169 865936
13124H65936o1395M3726R6307j55944L860O5236J5634j90752p0711k7261O429
$$ 865936 804541 848267 944574 788630 792490 857726 873360 682608 611897 584636 591065
13113E91065J55987J25600P8997M4637n3740N8127J78814J07099m7607M1632J98223
$$ 591065 747052 872652 951649 996286 942546 1000673 1179487 1286586 1238979 1280611 1478834
13102A478834P0362r5849p6126J19054M0493J25121Q5779l8835k9597o1741o4456
$$ 1478834 1549196 1453347 1377221 1496275 1536768 1661889 1747668 1708833 1679236 1617495 1553039
13091A553039J43181M9191j09436J6222J31215K8922R8700J09688P2067J35576
$$ 1553039 1696220 1745411 1635975 1652197 1783412 1812334 1911034 2020722 2092789 2228365
13081B228365K75058R1101J2249K3218O0194J3370m8235K08467J82497K67159
$$ 2228365 2503423 2594524 2606773 2629991 2690185 2703555 2655320 2863787 3046284 3313443
13071C313443L28791J73553L36687K88391L99541L74429K42827L14889N16557
$$ 3313443 3642234 3815787 4152474 4440865 4840406 5214835 5457662 5772551 6289108
13062F289108L76881N19587O32680O34398M59504P73460Q88238J224912J462675
$$ 6289108 6665989 7185576 7818256 8452654 8912158 9685618 10573856 11798768 13261443
13053A3261443J769524K000637K665912L556587M629435N547953P104836R246955
$$ 13261443 15030967 17031604 19697516 23254103 27883538 33431491 40536327 49783282
13045D9783282J2032783J4807453J7180940J8234832J7102090J3761610R099090
$$ 49783282 61816065 76623518 93804458 112039290 129141380 142902990 152002080
13038A52002080L725010k486194q515470j2939070j4919269j5557585j5144525
$$ 152002080 155727090 153240896 144725426 131786356 116867087 101309502 86164977
13031H6164977j3218410j0310846p174570m086491j633113J067942L369327N937662
$$ 86164977 72946567 62635721 55461151 51374660 49741547 50809489 54178816 60116478
13023F0116478Q656503J1426769J4505278J6934878J8030264J7010964J4037476
$$ 60116478 68772981 80199750 94705028 111639906 129670170 146681134 160718610
13016A60718610R667529M303283k043948q729455j3727070j6182839j6939974
$$ 160718610 170386139 174689422 172645474 163916019 150188949 134006110 117066136
13009A17066136j6515428j4206652j0999314p465647l995255q24087K500830N546857
$$ 117066136 100550708 86344056 75344742 67879095 63883840 63059753 65560583 71107440
13001G1107440Q229513J1110151J3660814J5102370J5443672J4279568J1572314
$$ 71107440 79336953 90447104 104107918 119210288 134653960 148933528 160505842
12994A60505842P415905K738982j840765o651494j0917386j3445629j4464212
$$ 160505842 167921747 170660729 168819964 162168470 151251084 137805455 123341243
12987A23341243j4521045j3542357j1171220q044232m671798j418630J647581
$$ 123341243 108820198 95277841 84106621 76062389 71390591 69971961 71619542
12980G1619542M710665P886256J1070650J4302618J7339779J9949252K1721573
$$ 71619542 76330207 84216463 95287113 109589731 126929510 146878762 168600335
12973A68600335K3069141K3268242K2152110J9400213J6155470J1739433O364996
$$ 168600335 191669476 214937718 237089828 256490041 272645511 284384944 290749940
12966B90749940L72403n535436j1373364j6154451j9504043k2249834k3631284
$$ 290749940 291122343 285586907 274213543 258059092 238555049 216305215 192673931
12959A92673931k3312583k1507863j9075236j6242001j2797505r079136n186789
$$ 192673931 169361348 147853485 128778249 112536248 99738743 90659607 85472818
12952H5472818j553190K448856O496237J0531101J4406447J7108419J8439536
$$ 85472818 83919628 86368484 92864721 103395822 117802269 134910688 153350224
12945A53350224J8070912J6762805J4335842R679515L598289l018752q396175
$$ 153350224 171421136 188183941 202519783 212199298 215797587 212778835 204382660
12938B04382660j2809114j6640090j8712714j8613552j6948188j4102150j0456118
$$ 204382660 191573546 174933456 156220742 137607190 120659002 106556852 96100734
12931I6100734o638291k843886R44529N257156R671691J4371861J8402026K1036804
$$ 96100734 89462443 86618557 87563086 92820242 102491933 116863794 135265820 156302624
12923A56302624K1812565K0302181J6413243J0705705K994680n823068j3539889
$$ 156302624 178115189 198417370 214830613 225536318 228530998 222707930 209168041
12916B09168041j8573066k1311109k2203491k0686769j7365181j3515418j0092105
$$ 209168041 190594975 169283866 147080375 126393606 109028425 95513007 85420902
12909H5420902o769336l706142p90951K350210N819322R626714J3547682J6997231
$$ 85420902 78651566 74945424 74154473 76504683 82324005 91950719 105498401 122495632
12901A22495632J9630294K0688876J9609638J6711112J1602515M572911m031653
$$ 122495632 142125926 162814802 182424440 199135552 210738067 215310978 211279325
12894B11279325j2065290j7858753k1545405k3212088k2621002j9663457j5728949
$$ 211279325 199214035 181355282 159809877 136597789 113976787 94313330 78584381
12887G8584381j2222127r352750p235172n952692m877323l901933l282462k627657
$$ 78584381 66362254 57009504 49774332 43821640 38944317 35042384 31759922 29132265
12879B9132265j946207j675197j447165j202775j251685j097012j162128j086946
$$ 29132265 27186058 25510861 24063696 22860921 21609236 20512224 19350096 18263150
12871A8263150p93206o70346p45287o67447m10842l57912l82894m34473m98219
$$ 18263150 17469944 16799598 16054311 15386864 14976022 14618110 14235216 13800743 13302524
12862A3302524n74372l49975m99883o15197m75768l72294m20854l40983k56565
$$ 13302524 12728152 12378177 11878294 11263097 10787329 10415035 9994181 9653198 9396633
12853I396633m20479m51330j60328j36785m22718k35319K4824m221m633J16806
$$ 9396633 8976154 8524824 8364496 8227711 7804993 7569674 7594498 7590277 7585644 7702450
12843G702450M5938k1279Q4726O0617k71694k77264k90311k56888l06780l60629
$$ 7702450 7748388 7727109 7811835 7872452 7600758 7323494 7033183 6776295 6469515 6108886
12833F108886l00446p8024k7832j40351j86181k46849j20779j96656r7657j09311
$$ 6108886 5808440 5730416 5702584 5562233 5376052 5129203 5008424 4811768 4714111 4604800
12823D604800q6823J43870J73821J39072j7366J63412o6837p6793j02431m14078
$$ 4604800 4517977 4661847 4835668 4974740 4957374 5120786 5053949 4977156 4874725 4460647
12813D460647k36009q9574k00612j30110j48361k20476j56529K2695K4826O411
$$ 4460647 4224638 4135064 3934452 3804342 3655981 3435505 3278976 3301671 3326497 3332908
12803C332908k2198p7589k17745k9504K77340J61702L2524J0513K28594J70937
$$ 3332908 3310710 3233121 3015376 2985872 3263212 3424914 3457438 3467951 3696545 3867482
12793C867482o8464K676k38565l15592j8370k55822j83757j67867k62347j42139
$$ 3867482 3799018 3801694 3563129 3247537 3229167 2973345 2789588 2621721 2359374 2217235
12783B217235m5173n1524J03732q6416j30679n3624n3142R8561l7736J22906L3473
$$ 2217235 2172062 2120538 2224270 2137854 2007175 1953551 1900409 1998970 1961234 2084140 2117613
12772B117613Q0904L3746j1934n2779L4099J0988k4278n7780l5924r4077p4537
$$ 2117613 2198517 2232263 2220329 2167550 2201649 2212637 2188359 2130579 2094655 2000578 1926041
12761A926041j30308k54505m0468r6678k1044l0687p6446J1438O7198J41946J11471
$$ 1926041 1795733 1541228 1500760 1404082 1383038 1352351 1275905 1287343 1354541 1496487 1607958
12750A607958n2435N2363q745J63119J13172N9375J829J10354Q1957j53237o6373
$$ 1607958 1555523 1607886 1599141 1762260 1875432 1934807 1936636 2046990 2128947 1975710 1909337
12739A909337q2037k15458q0815j4514p5989k48393L2153J11002k1372k79833
$$ 1909337 1827300 1611842 1531027 1516513 1440524 1192131 1224284 1335286 1313914 1034081
12729A034081k7509M9834L9198J91228K318m2708J01769J19512R7955K1632j01989
$$ 1034081 1006572 1056406 1095604 1286832 1289150 1246442 1348211 1467723 1565678 1587310 1485321
12718A485321m6448n9440k25923j34224N1597k160j3891q3795p663j067R5043
$$ 1485321 1438873 1379433 1153510 1019286 1070883 1068723 1054832 971037 963374 962307 1057350
12707A057350k28527l21603P2013K02248J30729q9494l1083m8513k8347m8174
$$ 1057350 828823 507220 579233 781481 912210 822716 791633 743120 714773 666599
12697F66599L7960P9165n448J0473j76518r9521n0212J0931O7555R7663k2822
$$ 666599 704559 783724 778276 788749 612231 512710 462498 473429 540984 638647 615825
12686F15825O3167j8520P7622K49429J30001q9936j39207j31150n7628k0197M4372
$$ 615825 678992 660472 738094 987523 1117524 1027588 888381 757231 699603 679406 723778
12675G23778K4077L0866j37750m1473j4090J4610K7850J27485J1162q4152j6119
$$ 723778 747855 778721 640971 599498 585408 600018 627868 755353 766515 682363 666244
12664F66244N5014O8283o5277o641p0256n8841j8829K1743k8859n1316L8601O8624
$$ 666244 721258 789541 724264 717623 647367 588526 569697 591440 562581 511265 549866 618490
12652F18490M8217m018K9745Q8705l1878O6969N284j01171j07184j16444j15942
$$ 618490 666707 662689 692434 781139 749261 816230 821514 720343 613159 496715 380773
12641C80773p8180o8438L1647J40029N6486k4030J79703q468j38636J5326M6700
$$ 380773 302593 234155 265802 405831 462317 438287 617990 609522 470886 486212 532912
12630E32912N5342j11484j86849j23240N4161R9833R6513P7371M159k5954l1867
$$ 532912 588254 476770 289921 166681 220842 320675 417188 494559 498718 472764 440897
$$ [...]
##END NTUPLES=NMR SPECTRUM
##END=
