##TITLE=Analysis number 323331
Compound Code cc 52416
Book Reference 464/72/1
Project Code adrs
Chemist Name chrisr
##JCAMPDX= 6.0         $$ Bruker NMR JCAMP-DX V2.0
##DATA TYPE= NMR SPECTRUM
##DATA CLASS= NTUPLES
##ORIGIN= Bruker BioSpin GmbH
##OWNER= nmr
$$ XWIN-NMR		Version 3.5
$$ Tue Oct 24 09:03:46 2006 GMT Daylight Time (UT+1h)  MAYBRIDGE\nmr@NMR_250MHZ
##.OBSERVE FREQUENCY= 250.131544655141
##.OBSERVE NUCLEUS= ^1H
##.ACQUISITION MODE= SIMULTANEOUS (DQD)
##.ACQUISITION SCHEME= undefined
##.AVERAGES= 16
##.DIGITISER RES= 18
##SPECTROMETER/DATA SYSTEM= dpx250
##.PULSE SEQUENCE= zg30
##.SOLVENT NAME= CDCl3
##.SHIFT REFERENCE= (INTERNAL, CDCl3, 0, 16.522)
##AUDIT TRAIL= $$ (NUMBER, WHEN, WHO, WHERE, WHAT)
$$ ##TITLE= Audit trail, XWIN-NMR		Version 3.5
$$ ##JCAMPDX= 5.01
$$ ##ORIGIN= Bruker BioSpin GmbH
$$ ##OWNER= nmr
$$ C:\u/data/dgb/nmr/ADRS/1120/pdata/1/auditp.txt
$$ ##AUDIT TRAIL=  $$ (NUMBER, WHEN, WHO, WHERE, WHAT)
(   1,<2006-10-24 09:03:15.95 +100>,<MAYBRIDGE\nmr>,<NMR_250MHZ>,
      <created by zg, POWCHK disabled, PULCHK disabled
       configuration hash MD5:
       49 4B E0 1D 92 C2 6B 37 9F E6 65 BC 52 41 86 1D
       data hash MD5: 64K
       2C 00 F2 CD CE AB 24 52 60 D2 B2 F2 07 6A 95 43>)
(   2,<2006-10-24 09:03:30.59 +100>,<MAYBRIDGE\nmr>,<NMR_250MHZ>,
      <Start of raw data processing
       ef LB = 0.3 FT_mod = 6 PKNL = 1 SI = 32K 
       data hash MD5: 32K
       98 83 C6 5F E1 98 02 C6 BB 20 32 E1 31 88 81 79>)
(   3,<2006-10-24 09:03:32.48 +100>,<MAYBRIDGE\nmr>,<NMR_250MHZ>,
      <apk 
       data hash MD5: 32K
       E8 AC 7C C9 B4 BC EC 09 A9 2A 68 32 F3 71 EC 0F>)
(   4,<2006-10-24 09:03:33.47 +100>,<MAYBRIDGE\nmr>,<NMR_250MHZ>,
      <abs ABSG = 5 
       data hash MD5: 32K
       49 F9 DE 1C 29 20 11 1D F4 1E 6A B9 46 3B F0 46>)
$$ ##END=
$$ 
$$ hash MD5
$$ 3D 73 66 EB A7 78 A7 87 1C 85 4C 9D AA D0 45 23
##$RELAX= 
##$RELAX= 
##$RELAX= 
##$RELAX= 
##$RELAX= 
##$RELAX= 
##$RELAX= 
$$ Bruker specific parameters
$$ --------------------------
##$DU= <C:\u>
##$EXPNO= 1120
##$NAME= <ADRS>
##$PROCNO= 1
##$TYPE= <nmr>
##$USER= <dgb>
##$AMP= (0..31)
100 100 100 100 100 100 100 100 100 100 100 100 100 100 100 100 100 100 
100 100 100 100 100 100 100 100 100 100 100 100 100 100 
##$AQSEQ= 0
##$AQ_mod= 3
##$AUNM= <au_zg>
##$AUTOPOS= <1 >
##$BF1= 250.13
##$BF2= 250.13
##$BF3= 250.13
##$BF4= 250.13
##$BF5= 500.13
##$BF6= 500.13
##$BF7= 500.13
##$BF8= 500.13
##$BYTORDA= 1
##$CFDGTYP= 0
##$CFRGTYP= 5
##$CHEMSTR= <none>
##$CNST= (0..31)
1 1 145 1 1 1 1 1 1 1 1 1 1 1 1 1 1 1 1 1 1 1 1 1 1 1 1 1 1 1 1 1 
##$CPDPRG= <>
##$CPDPRG1= <>
##$CPDPRG2= <>
##$CPDPRG3= <>
##$CPDPRG4= <mlev>
##$CPDPRG5= <mlev>
##$CPDPRG6= <mlev>
##$CPDPRG7= <mlev>
##$CPDPRG8= <mlev>
##$CPDPRGB= <>
##$CPDPRGT= <>
##$D= (0..31)
0 1 0 0 0 0 0 0 0 0.06 0 0 0 0 0 0 0.0002 0 0 0 0 0 0 0 0 0 0 0 0 0 0 
0 
##$DATE= 1161676994
##$DBL= (0..7)
120 120 120 120 120 120 120 120 
##$DBP= (0..7)
150 150 150 150 150 150 150 150 
##$DBP07= 0
##$DBPNAM0= <>
##$DBPNAM1= <>
$$ [...]
##$SUBNAM7= <"">
##$SUBNAM8= <"">
##$SUBNAM9= <"">
##$SW= 20.6930455092707
##$SWIBOX= (0..15)
0 0 3 0 0 0 0 0 0 0 0 0 0 0 0 0 
##$SW_h= 5175.983436853
##$TD= 65536
##$TD0= 1
##$TE= 683.16
##$TE2= 300
##$TE3= 300
##$TEG= 300
##$TL= (0..7)
0 120 120 120 120 120 120 120 
##$TP= (0..7)
150 150 150 150 150 150 150 150 
##$TP07= 0
##$TPNAME0= <>
##$TPNAME1= <>
##$TPNAME2= <>
##$TPNAME3= <>
##$TPNAME4= <>
##$TPNAME5= <>
##$TPNAME6= <>
##$TPNAME7= <>
##$TPOAL= (0..7)
0.5 0.5 0.5 0.5 0.5 0.5 0.5 0.5 
##$TPOFFS= (0..7)
0 0 0 0 0 0 0 0 
##$TUNHIN= 0
##$TUNHOUT= 0
##$TUNXOUT= 0
##$USERA1= <user>
##$USERA2= <user>
##$USERA3= <user>
##$USERA4= <user>
##$USERA5= <user>
##$V9= 5
##$VALIST= <valist>
##$VCLIST= <CCCCCCCCCCCCCCC>
##$VD= 0
##$VDLIST= <DDDDDDDDDDDDDDD>
##$VPLIST= <PPPPPPPPPPPPPPP>
##$VTLIST= <TTTTTTTTTTTTTTT>
##$WBST= 1024
##$WBSW= 4
##$XGAIN= (0..3)
0 0 0 0 
##$XL= 0
##$YL= 0
##$YMAX_a= 449477
##$YMIN_a= -378777
##$ZGOPTNS= <>
##$ZL1= 120
##$ZL2= 120
##$ZL3= 120
##$ZL4= 120
##$ABSF1= 16.522
##$ABSF2= -4.171173
##$ABSG= 5
##$ABSL= 3
##$ALPHA= 0
##$AQORDER= 0
##$ASSFAC= 0
##$ASSFACI= 0
##$ASSFACX= 0
##$ASSWID= 0
##$AUNMP= <proc_1d>
##$AZFE= 0.1
##$AZFW= 0.1
##$BCFW= 0
##$BC_mod= 0
##$BYTORDP= 0
##$COROFFS= 0
##$CY= 12.5
##$DATMOD= 1
##$DC= 0
##$DFILT= <>
##$DTYPP= 0
##$F1P= 14.0000005364418
##$F2P= -0.99999901652339
##$FCOR= 0.5
##$FTSIZE= 32768
##$FT_mod= 6
##$GAMMA= 0
##$GB= 0
##$INTBC= 1
##$INTSCL= 1
##$ISEN= 128
##$LB= 0.3
##$LEV0= 0
##$LPBIN= 0
##$MAXI= 10000
##$MC2= 0
##$MEAN= 0
##$ME_mod= 0
##$MI= 0
##$NCOEF= 0
##$NC_proc= -5
##$NLEV= 6
##$NOISF1= 0
##$NOISF2= 0
##$NSP= 0
##$NTH_PI= 0
##$NZP= 0
##$OFFSET= 16.522
##$PC= 1
##$PHC0= -49.85995
##$PHC1= 7.996083
##$PH_mod= 1
##$PKNL= yes
##$PPARMOD= 0
##$PSCAL= 4
##$PSIGN= 0
##$REVERSE= no
##$SF= 250.13
##$SI= 32768
##$SIGF1= 0
##$SIGF2= 0
##$SINO= 400
##$SIOLD= 32768
##$SREGLST= <1H.CDCl3>
##$SSB= 0
##$STSI= 32768
##$STSR= 0
##$SW_p= 5175.98343685301
##$SYMM= 0
##$S_DEV= 0
##$TDeff= 65536
##$TDoff= 0
##$TI= <Analysis number 999999
Compound Code 99
Book Reference 9
Project Code 9>
##$TILT= no
##$TM1= 0
##$TM2= 0
##$TOPLEV= 0
##$USERP1= <user>
##$USERP2= <user>
##$USERP3= <user>
##$USERP4= <user>
##$USERP5= <user>
##$WDW= 1
##$XDIM= 32768
##$YMAX_p= 371571827
##$YMIN_p= -418201
$$ End of Bruker specific parameters
$$ ---------------------------------
##NTUPLES= NMR SPECTRUM
##VAR_NAME=  FREQUENCY,     SPECTRUM/REAL,   SPECTRUM/IMAG
##SYMBOL=    X,             R,               I
##VAR_TYPE=  INDEPENDENT,   DEPENDENT,       DEPENDENT
##VAR_FORM=  AFFN,          ASDF,            ASDF
##VAR_DIM=   32768,         32768,           32768
##UNITS=     HZ,            ARBITRARY UNITS, ARBITRARY UNITS
##FACTOR=    0.157963299565203, 1,           1
##FIRST=     4132.6476996994, 0,             0
##LAST=      -1043.33573715361, 0,           0
##MIN=       -1043.33573715361, -418201,     0
##MAX=       4132.6476996994, 371571827,     0
$$ Real data points
##PAGE= N=1
##DATA TABLE= (X++(R..R)), XYDATA
$$ [...]
24040F7872m208r476J9571k00335Q1026K6793N647J33274q9265j85228l154j8980
$$ 67872 63664 54188 73759 -126576 -45550 -18757 -13110 120164 30899 -154329 -157483 -176463
24028a76463J0356Q143l6877L4250J02906k6096k7481J03535O7644K8753P0410
$$ -176463 -166107 -157964 -194841 -160591 -57685 -83781 -111262 -7727 59917 88670 159080
24017A59080j09989j32869m6115N9088J75950M0261k3716j0803j21306m8999J14804
$$ 159080 49091 -83778 -129893 -70805 105145 145406 121690 110887 -10419 -59418 55386
24006E5386N0409j31795j36983P8736M5155k6745j1009J2018M9511l378O7192
$$ 55386 105795 -26000 -162983 -84247 -39092 -65837 -76846 -64828 -15317 -18695 48497
23995D8497J3800L3159O8217j85895j43720P737L0354J55394O392q7795N0580
$$ 48497 62297 95456 163673 -22222 -165942 -158205 -127851 27543 33935 -53860 -3280
23984c280J45681o6752j52788J4717r0169j14446M9185J48904R3692J25219O0899
$$ -3280 142401 75649 -77139 -62422 -152591 -267037 -217852 -68948 24744 149963 210862
23973B10862n5442n6263q7162r0646K4137q840j04824j547Q2638Q2187J24181
$$ 210862 155420 99157 11995 -78651 -54514 -63354 -168178 -169725 -87087 -4900 119281
23962A19281l6200m6982O9235j0549j50587p757L4636l8322m3778O8981m406J14716
$$ 119281 83081 36099 105334 94785 -55802 -63559 -28923 -67245 -111023 -42042 -46448 68268
23950F8268j6407l0342J949J1405J5303l136K8958K2255l6951j2137L1185m9815
$$ 68268 51861 21519 23468 34873 50176 47040 75998 98253 61302 49165 80350 30535
23938C0535j0257O4131k0661J0803j42954o5537N5516P3966P6071J2287Q622L652
$$ 30535 20278 84409 63748 74551 -68403 -133940 -78424 -4458 71613 83900 92522 96174
23926I6174k2214J4898o4971P1454P2583J3194l8032K3615j1730k557R02m7612
$$ 96174 73960 88858 23887 95341 167924 181118 143086 166701 154971 152414 153316 105704
23914A05704j7472j30212l7683J49581Q2216n9474m1406L7469j2280o611K9453
$$ 105704 88232 -41980 -79663 69918 152134 92660 51254 88723 76443 69832 99285
23903I9285k8998M7061K28223k4124l8485o3368j63962r35P1825k5404N908n4798
$$ 99285 70287 117348 345571 321447 282962 219594 55632 54697 126522 101118 107026 52228
23891E2228o3440j1707K2768o6506L4164N3274J8269j42152r6329o3696J07411
$$ 52228 -11212 -22919 -151 -66657 -32493 20781 39050 -103102 -199431 -263127 -155716
23880a55716N1114j24707O087K33535J69095n2725R315L8332l7332q0131n9059
$$ -155716 -104602 -229309 -223222 10313 179408 126683 135998 174330 136998 56867 -2192
23869b192l9705J5732q498q9032q0653K1763Q4157M4622K1462q9497j15290j02731
$$ -2192 -41897 -26165 -34663 -123695 -204348 -182585 -98428 -53806 -32344 -121841 -237131 -339862
23857c39862R3282K07876J29409l2839k9147j19361L5936P9050J6083O6136j05904
$$ -339862 -246580 -38704 90705 57866 28719 -90642 -54706 24344 40427 106563 659
23846F59n9899m5724K1234O0913O172j57682j3385R1963Q7187K5318P2484k9645
$$ 659 -59240 -104964 -83730 -22817 -16645 -174327 -187712 -95749 -8562 16756 89240 59595
23834E9595q2868N5390P6088q395q072p8690j0434j067L5315O0720m9416l2495
$$ 59595 -23273 32117 108205 99810 91738 13048 2614 1547 36862 97582 48166 15671
23822A5671P182O7334o8082l2138L7622l1076l8562o8095n6832R1093p070K9988
$$ 15671 22853 90187 22105 -10033 27589 -3487 -42049 -110144 -166976 -75883 -82953 -52965
23810e2965R2374O5544J7390l9928r612k1228m2016O308P6813R9341j34325j4341
$$ -52965 39409 104953 122343 82415 72803 51575 9559 15867 92680 192021 57696 43355
23798D3355J4350o3187q155l945r0676p1810N6091O4167J4173M2115P4524J9312
$$ 43355 57705 -5482 -13637 -17582 -108258 -180068 -123977 -59810 -45637 -3522 71002 90314
23786I0314j02255o2024O1917k980m582l7463j883j42730m5232L0721Q4248J07403
$$ 90314 -11941 -73965 -12048 -15028 -19610 -57073 -58956 -201686 -246918 -216197 -131949 -24546
23774b4546Q253M7338m4629l1837k7555k6975L5191O6987J930o9759J7070l6723
$$ -24546 -16293 31045 -13584 -45421 -72976 -99951 -64760 2227 4157 -65602 -48532 -85255
23762h5255k9570R7029N9740q2441r5754J32421J15274O817j54844n3672k3333
$$ -85255 -114825 -17796 41944 -40497 -136251 -3830 111444 118261 -36583 -90255 -113588
23751a13588N5826M0926J2345J4191M0132p3570K372P666j6832r2166l671q2116
$$ -113588 -57762 -16836 -4491 9700 49832 -23738 -21366 -13700 -30532 -122698 -126369 -208485
23739b08485j5976k4929J09032M3477j21205K2626Q3923L2194L3530J18017J481
$$ -208485 -224461 -249390 -140358 -96881 -218086 -195460 -111537 -79343 -45813 72204 73685
23728G3685m1001o9346j7053L7652N092o0525m0174R4390J53819j2510j49312
$$ 73685 32684 -36662 -53715 -16063 -10971 -71496 -111670 -17280 136539 124029 -25283
23717b5283m5670j8033j2841k8912M447Q6762K3025k8473R3501o5577m4646n245
$$ -25283 -70953 -88986 -101827 -130739 -126292 -39530 -16505 -44978 48523 -17054 -61700 -66945
23705f6945J55935R6236n9463j3240K8415P1385j7689n9015L5741j8972j04727
$$ -66945 88990 185226 125763 112523 140938 212323 194634 135619 171360 152388 47661
23694D7661m8386K1882K2531R190n449q3820n9400J4824m8241J36497Q1763o382
$$ 47661 -725 21157 43688 52878 47429 -36391 -95791 -80967 -129208 7289 89052 82670
23682H2670O1074L4380j9536j0240j27833m513M3725m4732m1591k1906M2579P2053
$$ 82670 143744 178124 158588 148348 20515 16002 59727 14995 -26596 -48502 -5923 66130
23670F6130K4571j07188k6951k5951n5759J9794k5052n3329K2349L6932Q9816
$$ 66130 90701 -16487 -43438 -69389 -125148 -105354 -130406 -183735 -161386 -124454 -34638
23659c4638M6670O8329m7449m6941J7485n2184r0633p7808j5433N531P3592J4529
$$ -34638 12032 80361 32912 -14029 3456 -48728 -139361 -217169 -232602 -227071 -153479 -138950
23647a38950r8007N7083J19248Q9654P7549M7746K3150q9432K41j11402L6345
$$ -138950 -236957 -179874 -60626 29028 106577 154323 177473 88041 88282 -23120 13225
23636A3225N0616r6165r8145k4036J02613J0096j13946J2049J26962P0184r6087
$$ 13225 63841 -32324 -130469 -154505 -51892 -41796 -155742 -143693 -16731 53453 -42634
23625d2634p7140J08345L2743m1724m852n0067P5410l6195j14465M0611j5223
$$ -42634 -119774 -11429 21314 -20410 -25262 -75329 81 -36114 -150579 -109968 -125191
23614a25191r055P4532R0340K4543q3189R343k187N5750J59401k0877j31769j0108
$$ -125191 -134246 -59714 30626 55169 -28020 -18677 -20864 34886 194287 173410 41641 31533
23602C1533j7606M6687o9171N1314L5245M9351L2836n7394J9200m5904q1959j9696
$$ 31533 13927 60614 -8557 42757 78002 127353 160189 102795 121995 76091 -5868 -25564
23590b5564l0660j02044k4732Q5180P631J20947L7167J4308Q0835O2222j35821
$$ -25564 -56224 -158268 -183000 -97820 -90189 30758 67925 82233 163068 225290 89469
23579H9469j06338N8388m4811q3620m9044M8807O4689j898J245o0294M219J02702
$$ 89469 -16869 41519 -3292 -86912 -135956 -87149 -22460 -24358 -23113 -83407 -79188 23514
23567B3514R4870N3985r1756j6886k750n1319k6041Q1259K203o3893N795L9970
$$ 23514 118384 172369 80613 63727 60977 9658 -16383 64876 67079 3186 8981 48951
23555D8951j08602r092J1084Q0852R6369r6618l7287m3133m8477N1381r2617q8544
$$ 48951 -59651 -68743 -57659 23193 119562 22944 -14343 -57476 -105953 -54572 -147189 -235733
23543b35733P5841L6103m796O6268M1955L232j4012N0182O42J1785O6963J3039
$$ -235733 -159892 -123789 -128585 -62317 -20362 -17130 -31142 19040 19682 31467 98430 111469
23531A11469j40480j5502J8310m2088m7353J4361N8022K6146K4313M11k213R9445
$$ 111469 -29011 -44513 -26203 -68291 -115644 -101283 -43261 -17115 7198 7609 5396 104841
23519A04841J0048J9874k0831r0970m563J5884o4141p5124q7171J13596J70634
$$ 104841 114889 134763 113932 22962 18399 34283 -29858 -104982 -192153 -78557 92077
23508I2077J03844m6088q2374r3338m7629M0219p134n9916j9737q3265j1420o0261
$$ 92077 195921 149833 67459 -25879 -73508 -33289 -40423 -100339 -120076 -203341 -214761 -275022
23496b75022k2221J14570N3897L2935J46448k7646j52294J7750J91519P0248j09244
$$ -275022 -297243 -182673 -128776 -95841 50607 22961 -129333 -111583 79936 150184 40940
23485D0940j00689j17943M5521R4363J18120o9570m2331k823P402k0822L112N6301
$$ 40940 -59749 -177692 -132171 -37808 80312 10742 -31589 -34412 -27010 -47832 -44720 11581
23473A1581K0393p0681n5354Q1742J0764p0022k297J38371J4309M5834O3270J0397
$$ 11581 31974 -38707 -94061 -12319 -1555 -71577 -73874 64497 78806 124640 187910 198307
23461A98307j68159k7066R9378r072q3662p6830R6368M2025l9668L4244Q5425
$$ 198307 30148 3082 102460 93388 9726 -67104 29264 71289 31621 65865 151290
23450A51290N3308l4162j5333p6236l1906p5142j8194O0674n453N7341J756J0399
$$ 151290 204598 170436 155103 78867 46961 -28181 -46375 14299 8846 66187 67943 78342
23438G8342O2530m4881j18889p5737P8796J44696n6515j31858j09238j22478O2594
$$ 78342 140872 95991 -22898 -98635 -19839 124857 68342 -63516 -172754 -295232 -232638
23427b32638J02808N8866O1774J6670p732O4099J1133J7088K323q82j4350M3050
$$ -232638 -129830 -70964 -9190 7480 -252 63847 74980 92068 94391 93509 79159 122209
23415A22209N832j23677n7378p1239O6660M3918n6054p8677j5298N5871J06346
$$ 122209 128041 4364 -53014 -124253 -57593 -13675 -69729 -148406 -163704 -107833 -1487
23404a487R283O340J0824n4792j09795P5847J6710O1200P4320O1228o091m3090
$$ -1487 7796 14136 24960 -29832 -139627 -63780 -47070 14130 88450 149678 143587 100497
23392A00497J0470q5818p1693N6563K7778j1093J8352q6594k9829J41264L032
$$ 100497 110967 25149 -46544 10019 37797 26704 45056 -41538 -71367 69897 72929
23381G2929r8147N8672J42725j6137j14518j4167K0226R1280n1738q7982J3815
$$ 72929 -25218 33454 176179 160042 45524 31357 51583 142863 91125 3143 16958
23370A6958j1947k8074P5769o0526j00480L1149R1835J3939l4330P563o0842j735
$$ 16958 5011 -23063 52706 -7820 -108300 -77151 14684 28623 -5707 1856 -58986 -60721
23358f0721O7276O0258m8305l1658K7915K4696M2507j19351j53864J20758R5115
$$ -60721 6555 66813 18508 -13150 14765 39461 81968 -37383 -191247 -70489 24626
23347B4626P1918L2557j42992m3485n0732j448K5165k2481k8935N4902n4445p4234
$$ 24626 96544 129101 -13891 -57376 -108108 -109556 -84391 -106872 -135807 -80905 -135350 -209584
23335b09584m5659k6651N2973R9068J1913l8500m1298K784J40733P3712j3851
$$ -209584 -255243 -281894 -228921 -129853 -117940 -156440 -197738 -194954 -54221 19491 5640
23324E640p5510L9043N8469l8201o3853P229M2488O1028l6440j10319J26623j7466
$$ 5640 -69870 -30827 27642 -10559 -74412 -67183 -24695 36333 -107 -110426 16197 -1269
23312a269j2615p2863N8514k9107L1419J00906J2395r1665r8068j1600J00128
$$ -1269 -13884 -86747 -28233 -57340 -25921 74985 87380 -4285 -102353 -113953 -13825
23301a3825j0029m6331K844P7236k7113j13691r6538Q4593Q6765o0296m4543l2541
$$ -13825 -23854 -70185 -67341 9895 -17218 -130909 -227447 -142854 -56089 -116385 -160928 -193469
23289a93469R0098P46N1094J13407l2399m6620k3777K6606k2250k3352N812Q812
$$ -193469 -103371 -102625 -51531 61876 29477 -17143 -40920 -14314 -36564 -59916 -54104 -45292
23277d5292K691k7013k9721o9041J9422N2541P9512K7866q224J08054r1623o9503
$$ -45292 -42601 -69614 -99335 -168376 -148954 -96413 -16901 10965 2741 110795 19172 -50331
23265e0331m980P8670M7324k7114P638N8400L7168J5732P527n6191n6748Q5279
$$ -50331 -55311 23359 70683 43569 51207 109607 146775 162507 170034 113843 57095 142374
23253A42374j5325j04736k5405L5304M5562P8698Q341j16781j62944L0750P2224
$$ 142374 127049 22313 -3092 32212 77774 156472 164813 48032 -114912 -84162 -11938
23242a1938K9981j3114j5719m7381m9412Q2472R7415k7589l8881R717r262l8787
$$ -11938 18043 4929 -10790 -58171 -107583 -25111 72304 44715 5834 15551 6289 -32498
23230c2498P7977R6932q086l8333P689l0620k3951R8303N8885j6340r880j75443
$$ -32498 45479 142411 134325 95992 103681 73061 49110 147413 206298 189958 180078 4635
23218D635k7103Q482M1657M9254m7852L2486n1308R0394N0522J4743p5272P8651
$$ 4635 -22468 -13986 27671 76925 29073 61559 10251 100645 151167 165910 90638 169289
23206A69289k1888l8554k607p8652P0038j2565o308K8731J0870J9024j7490o8666
$$ 169289 147401 108847 106240 27588 97626 85061 78753 107484 118354 137378 119888 51222
23194E1222l3115k4105o812J08321O1988p3734r3004r3762l8594N4606M6503n9109
$$ 51222 18107 -5998 -12810 95511 157499 83765 -9239 -103001 -141595 -86989 -40486 -99595
23182i9595m5757P9198Q5785O894N3198l9512n2103N7453j40090o1398L8972r229
$$ -99595 -145352 -66154 19631 26525 79723 40211 -11892 45561 -94529 -155927 -116955 -126184
23170a26184j05933P1285R9842J36469o1426j20051k3196M5581n5717L9384J07999
$$ -126184 -232117 -160832 -60990 75479 14053 -105998 -129194 -83613 -139330 -99946 8053
23159H053K3213P6878l1557m8472O4197Q9948m7216n0761o5575O3641L2775L7102
$$ 8053 31266 108144 76587 28115 92312 182260 135044 84283 18708 82349 115124 152226
23147A52226n1202l2859J7923J752j16945p6018J89523K02440j0835j02106j05986
$$ 152226 101024 68165 86088 87840 -29105 -105123 84400 286840 276005 173899 67913
23136F7913n2397n6760L3130P4030k8484m6119n0111n3762k56l8375O8714Q5345
$$ 67913 15516 -41244 -8114 65916 37432 -8687 -58798 -112560 -112816 -151191 -82477 2868
23124B868K1319M5716J02550M4567p338p0348m163n2714q301m6699j11288J2027
$$ 2868 24187 69903 172453 217020 209682 139334 135171 82457 74156 27457 -83831 -71804
23112g1804K2733j04607K9171K4598Q8845J13533n0784j21591n3426N124J3381
$$ -71804 -49071 -153678 -124507 -99909 -11064 102469 51685 -69906 -123332 -118208 -104827
23101a04827l4812o2165J19501N986Q3739O6115P8573m0688j7567j74140m7137
$$ -104827 -139639 -201804 -82303 -76317 7422 73537 152110 111422 93855 -80285 -127422
23090a27422k8507q6962J11352N273j0923O8376q8264k5723J66145J33446m0771
$$ -127422 -155929 -242891 -131539 -126266 -137189 -68813 -157077 -182800 -16655 116791 76020
23079G6020n039k2976l3746L8837k506q2007j7801O6705L25l084K8539Q8374K070
$$ 76020 70981 48005 14259 53096 50590 -31417 -49218 17487 17812 14728 43267 131641 133711
23066A33711m7057j19454K0444l257r2177j06522l0168Q5146J50948O1211j1144
$$ 133711 86654 -32800 -12356 -15613 -107790 -214312 -244480 -159334 -8386 52825 41681
23055D1681n3033r5296j2245J61284p3725m962K2222k8099J4886k9334k589N8359
$$ 41681 -11352 -106648 -118893 42391 -31334 -36296 -14074 -42173 -27287 -56621 -59210 -851
23043h51o1508n7095O5328m1206L6387N0900m6835r1541J06342J76226O9849L9405
$$ -851 -62359 -119454 -54126 -95332 -58945 -8045 -54880 -146421 -40079 136147 205996 245401
23031B45401j30340j16371n537N3441o6222n4766J60978k9049k9902N4650P728
$$ 245401 115061 -1310 -6847 46594 -19628 -74394 86584 57535 27633 82283 90011
23020I0011j20527o9866N6853n9932n7372L5687N7663k1446k1696o1915J950Q9740
$$ 90011 -30516 -100382 -43529 -103461 -160833 -125146 -67483 -88929 -110625 -172540 -170590 -80850
23008h0850O322m0207M20J43746O1376o3869N184M1016j5383p9585O5661p0083
$$ -80850 -74528 -114735 -114315 29431 90807 26938 32122 73138 57755 -21830 43831 -26252
22996b6252M3908J01329j04564p0414j180L0075K8565j23168n6598J02228L0451
$$ -26252 17656 118985 14421 -55993 -57173 -27098 1467 -121701 -178299 -76071 -45620
22985d5620j09570J742J31039O9148o4001q6111q034R4911K7570q605p204k9021
$$ -45620 -155190 -153448 -22409 46739 -17262 -103373 -111407 -16496 11074 2469 -4735 -33756
22973c3756j5873j380P684j4286O3462l7792n4014K999j0218P5403L2740M6825
$$ -33756 -49629 -51009 -43325 -57611 5851 -31941 -85955 -82956 -93174 -17771 14969 61794
22961F1794J41743n7320j82684L586k5987j4271P8384P4562l8331L539j36480
$$ 61794 203537 146217 -36467 -32881 -58868 -73139 5245 79807 41476 45015 -91465
22950i1465j0018j0939M0399Q6777j1865k0667K2725o736l207O7393p3306k71
$$ -91465 -101483 -112422 -72023 14754 2889 -17778 4947 -1789 -4996 62397 -10909 -11180
22938a1180Q8603K5720n2460M0349l7254q098p3104k8680J4427k7399K1858j1692
$$ -11180 77423 103143 50683 91032 53778 45680 -27424 -56104 -41677 -69076 -47218 -58910
22926e8910k6754O7719j298l1758j1907k085L6556J2932K5840o7346m3913J7450
$$ -58910 -85664 -17945 -19243 -51001 -62908 -64993 -28437 -15505 10335 -57011 -100924 -83474
22914h3474Q977O5190L1677n8262n6976m6047Q5088P2026P8431J18309p4155m6384
$$ -83474 -74497 -9307 22370 -35892 -92868 -138915 -53827 18199 96630 214939 140784 94400
22902I4400n9168L4603p121K5406j7297o0990l2268P7831O7116J196L386k2024
$$ 94400 35232 69835 62714 88120 70823 9833 -22435 55396 122512 123708 127094 105070
22890A05070m2678j8776j08396j08820M8714K27688M3203n7556m7570n9117O210
$$ 105070 62392 43616 -64780 -173600 -124886 102802 146005 88449 40879 -18238 -12028
22879a2028M8820j6599m5586m360l3907K3417M1681k911k8935l7575p36J0872
$$ -12028 36792 20193 -25393 -29753 -63660 -40243 1438 -1473 -30408 -67983 -68719 -57847
22867e7847m0164M6440q573K5961R147m8472m7319k3583P8969k8025Q203M3196
$$ -57847 -98011 -51571 -60144 -34183 -25036 -73508 -120827 -144410 -65441 -93466 -85263 -42067
22855d2067P8421k470l4312O4038j06211r4023n2160k6999K0438k8795J16526
$$ -42067 36354 33884 -428 63610 -42601 -136624 -188784 -215783 -195345 -224140 -107614
22844a07614J31306q5485l7056r995N7290J03475M4443p4795j13202k3483N0414
$$ -107614 23692 -61793 -98849 -108844 -51554 51921 96364 21569 -91633 -115116 -64702
22833f4702O5253j1891l6661O7172J433l0925l2517o823J5459K2332P2757p994
$$ -64702 551 -11340 -48001 19171 20604 -10321 -42838 -49661 -34202 -11870 60887 52893
22821E2893o4907l767n527K9908K4505k1381o8357n2446O1183m8824O2971j4085
$$ 52893 -12014 -15781 -21308 8600 33105 11724 -56633 -109079 -47896 -96720 -33749 -47834
22809d7834m4636M3426L4541l908n0575P2517J1782j9520k2200J14285J5507k3119
$$ -47834 -92470 -49044 -14503 -18411 -68986 3531 15313 -4207 -26407 87878 103385 80266
22797H0266K8302n9978j06431l0926M4619K5177N1282M3904Q7134J5909n4373
$$ 80266 108568 48590 -57841 -88767 -44148 -18971 32311 76215 163349 179258 124885
22786A24885p2851o7400k8753J00296L0882l930r8410j8258K100P1449P0841m8602
$$ 124885 52034 -15366 -44119 56177 87059 83129 -15281 -33539 -31439 40010 110851 62249
22774F2249r2556r0860M2611L2952Q1145J3963j36559q8922J0456J42343P0335
$$ 62249 -30307 -121167 -78556 -45604 35541 49504 -87055 -175977 -165521 -23178 47157
22763D7157m5504l5462O671N2694K700l9576P4888O031j2644o3425l9850O2281
$$ 47157 1653 -33809 -27138 25556 28256 -11320 63568 69599 56955 -6470 -46320 15961
22751A5961Q3874l362p0804n7463L4141M4550L9755k1M2193O8111O9950J7176
$$ 15961 99835 96473 25669 -31794 2347 46897 86652 86631 128824 196935 266885 284061
22739B84061j72096p1314K1080P499J3443n1706p0463J5404M0005K3384k0611
$$ 284061 111965 40651 61731 69230 82673 30967 -39496 -24092 15913 39297 18686
22728A8686M4479N8667o5155q9030k8098O491O0820Q3800J5591j6220J0862q4747
$$ 18686 63165 121832 56677 -32353 -60451 -53960 6860 90660 106251 90031 100893 16146
22716A6146n9702N0540j0690l7735j0684K1044J438N1879r7922j8747O3763P4092
$$ 16146 -43556 6984 -3706 -41441 -52125 -31081 -29643 22236 -75686 -94433 -30670 43422
22704D3422m6764N5233N0082p941P0333j10175j16470m9842k802R3051Q8240j1418
$$ 43422 -3342 51891 101973 94032 164365 54190 -62280 -112122 -114924 -21873 66367 54949
22692E4949J8333l1684k7367j14052l5228R0513O6087q7239l0755M5805M6133
$$ 54949 73282 41598 14231 -99821 -135049 -44536 21551 -65688 -96443 -50638 -4505
22681d505J0577j07588k6063N472k6510L470O782P3631J05422m8841m7386n749
$$ -4505 6072 -101516 -127579 -122107 -148617 -145147 -138365 -64734 40688 -8153 -55539 -61288
22669f1288J801R1579M5399o0651J27293o8514m0873j397K5776k4162k701K7183
$$ -61288 -59487 32092 77491 16840 144133 75619 34746 33349 59125 34963 32262 59445
22657E9445K1417n7097p339J4064K6686m0105Q342j1496q9288m9403J57946M3619
$$ 59445 80862 23765 16426 30490 57176 17071 25413 13917 -75371 -124774 33172 76791
22645G6791k8952j3238k7515P8500J1984L2583N16n9037n8035n5978j8649k4335
$$ 76791 47839 34601 7086 85586 97570 130153 130669 71632 13597 -42381 -61030 -85365
22633h5365l5028M6097J04842O4392j0314R479p0491o9055M2399j3708O447p9376
$$ -85365 -120393 -74296 30546 94938 84624 94103 23612 -45443 -3044 -16752 -10305 -89681
22621h9681q7687q814N0292j5073J2624P2268p179j6590J8600M4783Q113l3179
$$ -89681 -177368 -186182 -135890 -150963 -138339 -66071 -73250 -89840 -71240 -26457 -18344 -51523
22609e1523k5710l1136M7979J19712n4147k0394k1448j4693K6513j0792M7444
$$ -51523 -77233 -108369 -60390 59322 5175 -15219 -36667 -51360 -24847 -35639 11805
22598A1805L725J2002k2654O5117N2608j9144j27606j45726K9807J83391j06322
$$ 11805 15530 27532 4878 69995 122603 103459 -24147 -169873 -140066 43325 -62997
22587f2997l2408j4539P7909j03472m8224O247Q5327N6069J48234n3149j08690
$$ -62997 -95405 -109944 -32035 -135507 -183731 -177484 -92157 -36088 112146 58997 -49693
22576d9693n2741J7442M2104K1156j06679j5396M4474R341p1414N7367J2332n8551
$$ -49693 -102434 -84992 -42888 -21732 -128411 -143807 -99333 -89992 -161406 -104039 -91707 -150258
22564a50258o0665m6147L9500R0241M5378N0085L2446K7809P1663q9735r5383
$$ -150258 -210923 -257070 -217570 -127329 -81951 -31866 580 28389 100052 10317 -85066
22553h5066J305J3698k0712J6034O4522Q3067k29j00556j43223K8841J81609O8602
$$ -85066 -83761 -70063 -90775 -74741 -10219 72848 72619 -27937 -171160 -142319 39290 107892
22541A07892o7356l6013M0513R0049J2153m2031K2413q566j31596l8142o6657
$$ 107892 40536 4523 45036 135085 147238 105207 127620 119054 -12542 -50684 -117341
22530a17341k3209J139Q4968Q7125j3854k7721m4377Q5086J08681m077r6412j20691
$$ -117341 -140550 -139411 -54443 32682 18828 -8893 -53270 31816 140497 136420 40008 -80683
22518h0683m5262J7106K2027j49540p3014J92641R6869k4024n8212P9508L1027
$$ -80683 -125945 -108839 -86812 -236352 -309366 -116725 -19856 -43880 -102092 -22584 8443
22507H443j1733q7519l4972Q9846J9651O2235k5562j03879l3818L0558O7500Q1267
$$ 8443 -3290 -90809 -125781 -35935 -16284 45951 20389 -83490 -117308 -86750 -19250 62017
22495F2017o5712o3725j8409P5233L3071l5048M5606n8075o4137M7702m5112J1485
$$ 62017 -3695 -67420 -85829 -10596 22475 -12573 33033 -25042 -89179 -41477 -86589 -75104
22483g5104L7668J18240R7753n1917n9300m1393l3633j08643k0671l7413O0399
$$ -75104 -37436 80804 178557 126640 67340 25947 -7686 -116329 -137000 -174413 -114014
22472a14014J56066n113o0011p8537P0560m5679O6192K1644n8309k9590L6468
$$ -114014 42052 36939 -23072 -101609 -31049 -76728 -10536 11108 -47201 -76791 -40323
22461d0323K6364j7728L9463J3984p6894m019M6241m1292l4558N2032N1855M4985
$$ -40323 -13959 -31687 7776 21760 -55134 -59153 -12912 -54204 -88762 -36730 15125 60110
22449F0110j1065l207L6494L7076K2590K2379q2728o4038L610J1839r216j311
$$ 60110 49045 45838 82332 119408 141998 164377 81649 17611 21221 33060 23844 22533
22437B2533n2289m198j5803n8567J03920L5903K4550n1326L2250K9690o6871r1274
$$ 22533 -29756 -33954 -49757 -108324 -4404 31499 56049 4723 36973 66663 -208 -91482
22425i1482p0683r380N2731R057Q135O2777J63913K0848j85643n8084J41322K6025
$$ -91482 -162165 -171545 -118814 -109757 -101622 -38845 125068 145916 -39727 -97811 43511 69536
22413F9536o7584p1123k516O2129j7109n2862K6197j57976m4391P0659R1861N9873
$$ 69536 1952 -69171 -71687 -9558 -26667 -79529 -53332 -211308 -255699 -185040 -93179 -33306
22401c3306R7214l0961L8891J12037p5033o3078j2044M4205n1248r6384o7656
$$ -33306 63908 32947 71838 183875 108842 45764 33720 77925 26677 -69707 -137363
22390a37363k564M8184r7394M6888M670n7936k5768K292P6585R454P5824J110
$$ -137363 -139927 -91743 -189137 -142249 -137579 -195515 -221283 -218991 -142406 -132952 -57128 -56018
22378e6018j28J9997k4671p1288l0883Q3790P9826K9040m8837j08975m5221L0136
$$ -56018 -56146 -36149 -60820 -132108 -162991 -79201 625 29665 -19172 -128147 -173368 -143232
22366a43232m499J4821J56022R6981j5068j34680M3758j1022k4771P0071J5882
$$ -143232 -147731 -132910 23112 120093 105025 -29655 14103 3081 -21690 48381 64263
22355F4263l4675J10864K4477p2374n7888l7915q9599k6687m4010m9506J46842
$$ 64263 29588 140452 164929 92555 34667 -3248 -92847 -119534 -163544 -213050 -66208
22344f6208L5639L8245K3534k4648q9699n0548r6683J8447Q8702P2097N532J043
$$ -66208 -30569 7676 31210 6562 -83137 -133685 -230368 -211921 -123219 -51122 -45590 -44547
22332d4547N6157m6358j00466n8402Q0648J47988O1431l9299j1849k4951M317
$$ -44547 11610 -34748 -135214 -193616 -112968 35020 96451 57152 45303 20352 24669
22321B4669P4818k1354O203Q1982j09558j44471k320R8111O4056M4972o1863r3299
$$ 24669 99487 78133 84336 166318 56760 -87711 -90031 8080 72136 117108 55245 -38054
22309c8054l8182P2497k18q2283J05154N2316o2691M5420M5634l0833o496n7325
$$ -38054 -76236 -3739 -3957 -86240 18914 71230 8539 53959 99593 68760 62264 4939
22297D939j1759m2112o6661N0648P3596K910J03210N2790o7369j09109l7847p548
$$ 4939 -6820 -48932 -115593 -64945 8651 11561 114771 167561 100192 -8917 -46764 -54312
22285e4312l679Q2769M5464n3813n2473j9431J3642n054L3671K6076r0239o0379
$$ -54312 -57991 24778 70242 16429 -36044 -55475 -41833 -46887 -13216 12860 -77379 -137758
22273a37758Q1378R7770K3769j05226k4790J5593O2865k1286o622M5587p4348
$$ -137758 -56380 41390 65159 -40067 -64857 -49264 13601 -7685 -14307 31280 -43068
22262d3068q3967M7468J33346J07047L7905L3665J4209j25249r3031o9713o9929
$$ -43068 -127035 -79567 53779 160826 198731 232396 246605 121356 28325 -41388 -111317
22251a11317P2548P9664j46201p0415M1784P4817P9585n0180N9531L3852m4010
$$ -111317 -38769 40895 -105306 -175721 -133937 -59120 20465 -29715 29816 63668 19658
22240A9658J01101o0445o4745l7088O0637K2923K4042J01806M2408j07362j66664
$$ 19658 120759 60314 -4431 -41519 19118 42041 66083 167889 210297 102935 -63729
22229f3729n1099l0768r5776m1604l7789J1533J11817N3454Q2019o6584q9256
$$ -63729 -114828 -145596 -241372 -282976 -320765 -309232 -197415 -143961 -61942 -128526 -217782
22218b17782J0645L8627N4737J78556M7541n2410R6047M2899l8528n9401p1864
$$ -217782 -207137 -168510 -113773 64783 112324 59914 155961 198860 160332 100931 29067
22207B9067k2254r4819l4451n909Q4123N2961j6660K9417J1445m3111o1537k6513
$$ 29067 6813 -88006 -122457 -128366 -44243 8718 -7942 21475 32920 -10191 -71728 -98241
22195i8241P9790Q8296J738L5612N9883n1613r9594J2382L3953N9103J0124M084
$$ -98241 -18451 69845 71583 107195 167078 115465 15871 28253 62206 121309 131433 135517
22183A35517n6138l1025o968J3491j0701k0239j04187N3160J44333K8750n7067
$$ 135517 79379 48354 41386 54877 44176 23937 -80250 -27090 117243 145993 88926
22172H8926K0687k8381p0141M7270M6391R1598Q613M2220k7103j31943l9924k0826
$$ 88926 109613 81232 11091 58361 104752 196350 204963 247183 220080 88137 48213 27387
22160B7387j9294l222m0602J9156J37151K8202k1127p2512L9484o1140J198l559
$$ 27387 8093 4871 -35731 -16575 120576 148778 127651 55139 94623 33483 34681 31122
22148C1122M3055o1095j12134q18J68461P3727k7494j8182m1904q2327q3258p805
$$ 31122 74177 13082 -99052 -99870 68591 142318 114824 96642 54738 -27589 -110847 -118652
22136a18652j0536J5628O6410R1075M6442p0813J016O7064l261M878l4543L4081
$$ -118652 -129188 -113560 -47150 43925 90367 19554 20570 87634 84373 89251 54708 88789
22124H8789L089o4616n0513k5516J3919L4030j5714K014M1074M4601m1683L7201
$$ 88789 91878 27262 -23251 -48767 -34848 -818 -16532 -14518 26556 71157 29474 66675
22112F6675J08682o1336p4892O4950N5024m4207k5919q9533l6504j5303K9599
$$ 66675 175357 114021 39129 104079 159103 114896 88977 -556 -37060 -52363 -22764
22101b2764J16981J01965j44613K0957k3375p585j65651J6387Q807q9234l1288
$$ -22764 94217 196182 51569 72526 49151 41566 -124085 -107698 -98891 -188125 -219413
22090b19413M0992M9698K3320K1435P5006P9283k3176r2545m2548N235N6537m515
$$ -219413 -178421 -128723 -105403 -83968 -8962 70321 47145 -45400 -87948 -82713 -26176 -30691
22078c0691O9078R5431m6646j17331J0263L1662J6574p0184n7446M0240M7398
$$ -30691 38387 133818 87172 -30159 -19896 11766 28340 -41844 -99290 -59050 -11652
22067a1652l9324o4214j00750J11629L1669q3327k2488M8268k2512N095J06953
$$ -11652 -50976 -115190 -215940 -104311 -72642 -155969 -178457 -130189 -152701 -147606 -40653
22056d0653Q0916J807j8617O9073j28010m7935M7099k666l6984l4172R4578O3029
$$ -40653 40263 42070 23453 92526 -35484 -83419 -36320 -38986 -75970 -110142 -15564 47465
22044D7465k5900p6346L3366L2483l0647o4963q8128J5195Q0241k662K7202N5050
$$ 47465 21565 -54781 -21415 11068 -19579 -84542 -172670 -157475 -77234 -79896 -52694 2356
22032B356n7475o1699N0718J22253J1564j51303m8902N1334M5558k7535j09418
$$ 2356 -55119 -116818 -66100 56153 67717 -83586 -132488 -81154 -35596 -63131 -172549
22021a72549q3404P5319J27103Q3996l3625n9329j6150P301O2728j5674p77p0652
$$ -172549 -255953 -180634 -53531 30465 -3160 -62489 -78639 -71338 -8610 -24284 -25061 -95713
22009i5713n8616j24665j8227R5411Q2903L7432J9924p077N8613k9349r4313N5770
$$ -95713 -154329 -278994 -297221 -201810 -118907 -81475 -61551 -68628 -10015 -39364 -133677 -77907
21997g7907R7066N568l2900J7655K3216Q4685n7380k7046J4381M0372K308j10319
$$ -77907 19159 24727 -8173 9482 32698 117383 60003 32957 47338 87710 90018 -20301
21985b0301m7562J438L7055K7203q3311O4667N9317j268r44o682o0207K1087n25
$$ -20301 -67863 -66425 -29370 -2167 -85478 -20811 38506 37238 36294 29612 -30595 -9508 -10033
21972a0033P6645m4788N1437p3883k8777N223N3009r9590N7476Q0613K1993m2139
$$ -10033 66612 21824 73261 -622 -29399 -24176 28833 -70757 -13281 67332 89325 47186
21960D7186Q9506J19895m9938q8740o0512Q5545J684L0690m215r924j62795J5642
$$ 47186 136692 256587 206649 117909 57397 142942 144626 175316 171101 161177 -1618 14024
21948A4024M1445l1206Q249O2870l7930q8029L320J25614j15664p6027M782L3575
$$ 14024 55469 24263 32512 95382 57452 -30577 -27257 98357 -17307 -93334 -88552 -54977
21936e4977k1026K3389M7608L4349K8986n3464m7997P76p7078j101Q1014L5520
$$ -54977 -76003 -52614 -5006 29343 58329 4865 -43132 -42356 -119434 -120535 -39521 -4001
21924d001k1482l3198Q494P8805n9278j17435j11777M3974J21005O1780P829k6724
$$ -4001 -25483 -58681 -50187 28618 -30660 -148095 -259872 -215898 -94893 -33113 -25284 -52008
21912e2008j07194q1317O0692O7089J7370N2594o7199L4021Q1166k503l4086p9460
$$ -52008 -159202 -240519 -179827 -112738 -95368 -42774 -109973 -75952 5214 2711 -31375 -110835
21900a10835j10418O0282J13073O1194l4814k0534l295L4688M1415k8456m2829
$$ -110835 -221253 -160971 -47898 13296 -21518 -42052 -45347 -10659 30756 2300 -40529
21889d0529P4086o9426n4730R3341J20663l051m4059j35339m9420L2400K8544
$$ -40529 33557 -35869 -90599 2742 123405 120354 76295 -59044 -108464 -76064 -47520
21878d7520J3570k1963O4107M1600J8503L657k3727l3316j6262M3848n3730k9256
$$ -47520 -33950 -55913 8194 49794 68297 71954 48227 14911 -1351 42497 -11233 -40489
21866d0489K935p7479N0652p0336L966o1438m9743L5440l489m313q2475j20258
$$ -40489 -37554 -115033 -64381 -134717 -130751 -192189 -241932 -206492 -209981 -214294 -296769 -417027
21854d17027J21035J34763L6022J3182j0031m8294J3818J16837J26494k2568o9486
$$ -417027 -295992 -161229 -125207 -112025 -122056 -170350 -156532 -39695 86799 64231 -5255
21843e255k6044P7611j1657L9635l4590K6523q7697o2306q3150j3120k4177p2481
$$ -5255 -31299 46312 34655 74290 39700 66223 -21474 -83780 -166930 -180050 -204227 -276708
21831b76708K3079l9318R8392J92871j5878o3449p3350J01237K9480l9784N7573
$$ -276708 -253629 -292947 -194555 -1684 -17562 -81011 -154361 -53124 -23644 -63428 -5855
21820e855J10362j4104K9465O97l5135J6243P336o8501m9944J1471O6233j1919
$$ -5855 104507 90403 119868 120565 85430 101673 109009 40508 -9436 2035 68268 56349
21808E6349N2231q8648o3424j7870L4370J3520j922k7924k1924j5696K6299o483
$$ 56349 108580 19932 -43492 -61362 -26992 -13472 -15394 -43318 -65242 -80938 -54639 -61122
21796f1122j1375J20151Q581L5392M884q4873r8582q1550o3500J8779r46n543
$$ -61122 -72497 47654 56235 91627 96511 11638 -86944 -168494 -231994 -213215 -214161 -219704
21784b19704j8728L3192J1214J36644J13568K3828j45772O5200Q4516J50439m4444
$$ -219704 -238432 -205240 -194026 -57382 56186 80014 -65758 -558 83958 234397 189953
21773A89953o6241k7086J0166M4423K9769j09127K6976p0292k1874J6461n1011
$$ 189953 123712 96626 106792 151215 180984 71857 98833 28541 6667 23128 -27883
21762b7883j06413M0254R6796q171O575j2842Q742M65K9998M0526o7463j58232
$$ -27883 -134296 -94042 2754 -5417 1158 -11684 -2942 -2477 27521 68047 584 -157648
21750a57648k612m2740M2264J38154M3484p6391J9846R4568p4899J805j6166R8257
$$ -157648 -160260 -203000 -160736 -22582 20902 -55489 -35643 58925 -15974 -14169 -30335 67922
21738F7922J0014l6983n035r0071K8047K4871r7328J4301J31515J05183J4568
$$ 67922 77936 40953 35918 -54153 -26106 -1235 -98563 -84262 47253 152436 167004
21727A67004r5059j02392l6595m1994J2662L0587Q5351L3789N0734n1379p081
$$ 167004 71945 -30447 -67042 -109036 -96374 -65787 19564 53353 104087 52708 45627
21716D5627n1723o1191J2422l0612j0589P9960O6693L0182M2017J4668r9543r9962
$$ 45627 -6096 -67287 -54865 -85477 -96066 -16106 50587 80769 122786 137454 37911 -62051
21704f2051N6143l4542p7075K6285J06749r2308L6663R0057n064r9236k5418P6856
$$ -62051 -5908 -40450 -117525 -91240 15509 -76799 -40136 49921 44857 -54379 -79797 -2941
21692b941Q3234l9705k6885o1593K1606j5639j25280L804K106m739R7269J98739
$$ -2941 80293 40588 13703 -47890 -26284 -41923 -167203 -163399 -161293 -166032 -68763 129976
21680A29976R210k9583k6046q8919M8226m4662M5631R5331m4429q0533n8179K2999
$$ 129976 139186 109603 83557 -5362 42864 -1798 43833 139164 94735 14202 -43977 -20978
21668b0978o8249j5123P39J5648K5439O8797P584p9979q7849J8961K2521L5598
$$ -20978 -89227 -104350 -103611 -87963 -62524 6273 13857 -66122 -153971 -135010 -112489 -76891
21656g6891K0166n8456J08886j5830m8862k2338K8494M237k2840L3291l287L9498
$$ -76891 -56725 -115181 -6295 -22125 -70987 -93325 -64831 -60594 -83434 -50143 -53430 -13932
21644a3932N8335r856J2508k1973L0256l5104q1665K6822M7467o2728j08295L8814
$$ -13932 44403 34547 47055 25082 55338 20234 -61431 -34609 12858 -49870 -158165 -119351
21632a19351R440l7001o1627p2089M8221J22118J22212m0983j7023j21124J1153
$$ -119351 -109911 -146912 -208539 -280628 -232407 -110289 11923 -29060 -46083 -167207 -156054
21621a56054J53589K7417m3006r6571o7940k57J06806j9822o4067N4319J27868
$$ -156054 -2465 24952 -18054 -114625 -182565 -182822 -76016 -95838 -159905 -105586 22282
21610B2282n7293o987j3425j24321k9737O8176J65353J17104N635j12068O1484
$$ 22282 -35011 -41998 -55423 -179744 -209481 -141305 24048 141152 146787 34719 96203
21599I6203L2392r8595n6735k3640m9406Q591O956J62791o965o4118M3500K2759
$$ 96203 128595 30000 -26735 -50375 -99781 -91190 -84234 78557 71592 7474 50974 73733
21587G3733k8264L8537j0141r8489n1961j48450m2573N7455j9433m8029O6897
$$ 73733 45469 84006 73865 -24624 -76585 -225035 -267608 -210153 -229586 -277615 -210718
21576b10718N1313q6509J06874J36968M9552k0672L8032N5905j2397j08770O6239
$$ -210718 -159405 -245914 -139040 -2072 47480 26808 64840 120745 108348 -422 65817
21565F5817r0609q8026Q272J27016j0289k4278k4938J1246k1183L4770N9474j9451
$$ 65817 -24792 -112818 -104546 22470 12181 -12097 -37035 -25789 -46972 -12202 47272 27821
21553B7821p3648K6074j8307l8800N2726r4620j48785N4733J33460K6503j9766
$$ 27821 -45827 -19753 -38060 -76860 -24134 -118754 -267539 -212806 -79346 -52843 -72609
21542g2609m7563p3474N4874J5475Q0504R2917l2890j1555Q2128R9893p0885l1301
$$ -72609 -120172 -193646 -138772 -123297 -42793 50124 17234 5679 87807 187700 116815 85514
21530H5514M1757j01199j57620o751Q4353l6692K2290O3263K0441m6816j10464
$$ 85514 127271 26072 -131548 -138299 -53946 -90638 -68348 -5085 15356 -31460 -141924
21519a41924m7791P6535M5418p0036o5279O2950P9008N0411l0493R5198Q3924
$$ -141924 -189715 -113180 -67762 -137798 -203077 -140127 -61119 -10708 -41201 53997 137921
21508A37921q811m0764j25211k31487O7052l629N0697j0732R5925M6561L5632
$$ 137921 129110 88346 -36865 -268352 -201300 -204929 -154232 -164964 -69039 -22478 13154
21497A3154Q7598K823p6388k4343L9188j4919Q0470J4172l442n8654r0027j08544
$$ 13154 100752 103575 27187 2844 42032 27113 107583 121755 118313 59659 -30368 -138912
21485a38912O7803n0982o2521L8758R8704J1360K3584J13497k7623j7702o1939
$$ -138912 -71109 -122091 -184612 -145854 -47150 -35790 -12206 101291 73668 55966 -5973
21474e973r5126K8856K6273l9473M596K1330L897P5034q9388n8475j12059j635
$$ -5973 -101099 -72243 -45970 -85443 -80847 -59517 -55620 19414 -69974 -128449 -240508 -242143
21462b42143K01789K14973l3405n1072j2652m7186M0283n3679J15889n6251k03199
$$ -242143 -40354 174619 141214 90142 77490 30304 70587 16908 132797 76546 -126653
21451a26653L5088R9729N9766L3533n9183l5869p5344l9239P3860J19478K2374
$$ -126653 -91565 8164 67930 101463 42280 6411 -68933 -108172 -34312 85166 107540
21440A07540l6833K2290L1349K1693j8003p507L1307k7244q618R271l5302l506
$$ 107540 70707 92997 124346 146039 128036 120529 151836 124592 115974 125245 89943 86437
21428H6437j7682l5112p5844J052Q1771n365M300N5671n9694l2524R4997l3137
$$ 86437 68755 33643 -42201 -41149 40622 35257 39557 95228 35534 3010 98007 64870
21416F4870m4577K0535n7647M3505l8151j6440K1114k1952K6804P5565P6358n7151
$$ 64870 20293 40828 -16819 26686 -11465 -27905 -6791 -28743 -1939 73626 149984 92833
21404I2833j68353l8550O3855J5642n0351m9762Q5084K3854J6981Q1275j6738
$$ 92833 -75520 -114070 -50215 -34573 -84924 -134686 -49602 -25748 -8767 72508 55770
21393E5770r861j5675l3023K8714o933o8519M4568L9596K790n8581L9498j3459
$$ 55770 45909 30234 -2789 25925 18992 -49527 -4959 34637 37427 -21154 18344 4885
21381D885j04961j5588J05246R1296j9653j06934M414P8226J08721l14j46105
$$ 4885 -100076 -115664 -10418 80878 61225 -45709 -41295 36931 145652 145338 -767
21370g67j29179q4447K0144R9155p4600j1653N4189L1589j4218J2562P9464k0665
$$ -767 -129946 -214393 -194249 -95094 -169694 -181347 -127158 -95569 -109787 -97225 -17761 -38426
21358c8426m5959K5323M9029l0679k3639J1148j1135o8467P6884L2012J7504m0123
$$ -38426 -84385 -59062 -10033 -40712 -64351 -53203 -64338 -132805 -55921 -23909 -6405 -46528
21346d6528m8528j722K2511j9739o6199l9922J2160j351M3923J21659p948q1633
$$ -46528 -95056 -96778 -74267 -94006 -160205 -200127 -187967 -189318 -145395 -23736 -31684 -113317
21334a13317O3136K0655l1454J4449j47488l7257J21959O6015J8324J299K5035
$$ -113317 -50181 -29526 -60980 -46531 -194019 -231276 -109317 -43302 -24978 -23679 1356
21323A356r4048l3134J021j3971K6439J60681J09289n8620k9029j50934j11663
$$ 1356 -92692 -125826 -124805 -138776 -112337 48344 157633 99013 69984 -80950 -192613
21312a92613N169N5250k8612p432R9237L8008n361r071L4611J24021m9459l9624
$$ -192613 -187444 -132194 -160806 -168238 -69001 -30993 -36354 -45425 -10814 113207 63748 24124
21300B4124n8230n0671o5152R1863l0333N5105j1038j04942j7361Q9029O6332
$$ 24124 -34106 -84777 -149929 -58066 -88399 -33294 -44332 -149274 -166635 -77606 -11274
21289a1274l7905q5182J2709N0189n8844O806J00593m4954q8627r8928J04172
$$ -11274 -49179 -134361 -121652 -71463 -130307 -123501 -22908 -67862 -156489 -255417 -151245
21278a51245P6929j8106O448M5171R7658N8201N2331p9106K7568o561o8772l8344
$$ -151245 -74316 -92422 -85974 -40803 56855 115056 167387 88281 115849 109288 40516 2172
21266B172j08289j6816K6525N6518J17898J23472j9307j56076j40901j2827Q2533
$$ 2172 -106117 -122933 -96408 -39890 78008 201480 182173 26097 -114804 -127631 -45098
21255d5098l6467k1215J09401k9473n4524l578L9172O2552p3985j20173o3764
$$ -45098 -81565 -102780 6621 -22852 -77376 -80954 -41782 20770 -53215 -173388 -237152
21244b37152q1344j7014K1237J52241Q6737p7114J3135J00400J08264l0530o4024
$$ -237152 -318496 -335510 -314273 -162032 -75295 -152409 -139274 -38874 69390 38860 -25164
21233b5164K1862q4691o4922M6971n7215l2038L4181R3041J12557o755P328M3058
$$ -25164 -3302 -87993 -152915 -105944 -163159 -195197 -161016 -67975 44582 37827 45155 88213
21221H8213K7426M8538l416q2642q9668j44720j5692q131N4463j1107L9448M5154
$$ 88213 115639 164177 160761 78119 -11549 -156269 -171961 -180092 -125629 -136736 -97288 -52134
21209e2134J6328p3469J9597Q9452j0721L4774N072K2300n937p8748m2171p5920
$$ -52134 -35806 -109275 -89678 -226 -10947 23827 28899 51199 45262 -33486 -75657 -151577
21197a51577m9172m2996R6245R7419O9718K9944J07436K2439j9113o8859o0125
$$ -151577 -200749 -243745 -147500 -50081 19637 49581 157017 179456 160343 91484 31359
21186C1359n8146L7235P3968m6128n3721q1606P582Q5818P1543M815L9521n8796
$$ 31359 -26787 10448 84416 38288 -15433 -97039 -89457 -3639 67904 72719 112240 53444
21174E3444j63906l0875Q600O574K6042j0596L890R7507O3833j00319j40637N1874
$$ 53444 -110462 -141337 -132737 -126163 -100121 -110717 -106827 -9320 54513 -45806 -186443 -134569
21162a34569J7400m9622k4181K4496K03089L987j26851m2343J22107J42925l0470
$$ -134569 -117169 -166791 -190972 -166476 36613 40600 -86251 -128594 -6487 136438 105968
21151A05968l7083n1878r2691o3177O4107Q6812J42358J46383j284j12357p9625
$$ 105968 68885 17007 -75684 -138861 -74754 12058 154416 300799 299515 187158 107533
21140A07533j28293r3894J35386l3257n3955m0704n7222r2680O4214P6275M4719
$$ 107533 -20760 -114654 20732 -12525 -66480 -107184 -164406 -257086 -192872 -116597 -71878
21129g1878J38777k2672n4672o4083L5153Q5119R1986M5987p3182j74733j09644
$$ -71878 66899 44227 -10445 -74528 -39375 45744 137730 183717 110535 -64198 -173842
21118a73842j5932n9711J0819k697M9381Q2090R8340j5934L6374J0953n1948k2672
$$ -173842 -189774 -249485 -238666 -241363 -191982 -109892 -11552 -27486 8888 19841 -32107 -54779
21106e4779j2198j1863l1624r5124j502J12885M4321L626J731r3775O2911J28231
$$ -54779 -66977 -78840 -110464 -205588 -207090 -94205 -49884 -46258 -44527 -138302 -75391 52840
21094E2840J7632q4126k9102J1618k4956j5145J0003L3274Q5141j2874n3430m0162
$$ 52840 70472 -13654 -42756 -31138 -56094 -71239 -61236 -27962 57179 44305 -9125 -49287
21082d9287r242q2292J58878Q448l164K601J4263k6169M8204O6432K2593r863
$$ -49287 -58529 -140821 18057 26505 23341 25942 40205 14036 62240 128672 151265 141402
21070A41402j09469n1273P707N2940R1976k6004O4815Q1160l0588j38850m5039
$$ 141402 31933 -19340 -11633 41307 133283 107279 172094 253254 222666 83816 38777
21059C8777M2858M8602o3033q7236m8441J0917r0518j0034L3965k9127K2369L7043
$$ 38777 81635 130237 67204 -20032 -68473 -57556 -148074 -158108 -124143 -153270 -130901 -93858
21047i3858J41347m0792o5490N5250k6305q3881Q149J0261J01349N23K8283j9045
$$ -93858 47489 6697 -58793 -3543 -29848 -113729 -105580 -95319 6030 6553 34836 15791
21035A5791L0636Q0123o1153o5510j00000o506p1017o4752L5934K1585M4551Q4947
$$ 15791 46427 126550 65397 -113 -100113 -106619 -177636 -242388 -206454 -184869 -140318 -55371
21023e5371p3445P4P7093Q486O1828L8999P584k4287M276m2690K5963k362n3437
$$ -55371 -128816 -128742 -51649 -43163 18665 57664 65248 40961 45237 2547 28510 26148 -27289
21010b7289q3842J3606N2826P5335l626K2932J1362L4678m0247j4280j00693j23140
$$ -27289 -111131 -97525 -44699 30636 27010 49942 61304 95982 55735 41455 -59238 -182378
20998a82378L1706J7152n154j8331K3541J0115O8798l5800n5871o8505Q062M3130
$$ -182378 -150672 -133520 -138674 -157005 -133464 -123349 -54551 -90351 -146222 -214727 -206665 -163535
20986a63535N0273p9156N8045R7091J64190l7200j5081J1146M6545M8623j57186
$$ -163535 -113262 -192418 -134373 -37282 126908 89708 74627 85773 132318 180941 23755
20975B3755r7968n0069N3015P8843K0944K459N8799n9292o5072p893R5378Q8731
$$ 23755 -74213 -124282 -71267 7576 28520 30979 89778 30486 -34586 -42479 52899 141630
20963A41630k1259j02208n3983Q4948p8699k01148K5255J9870Q6850Q6295k1777
$$ 141630 120371 18163 -35820 49128 -29571 -230719 -205464 -185594 -98744 -12449 -34226
20952c4226O6021J03065L0751l9576o0720l0133n9855k3841N819O8580k8959j00437
$$ -34226 31795 134860 165611 126035 65315 35182 -24673 -48514 -42695 25885 -3074 -103511
20940a03511J19775J21344P1805m3270r4201l0762K1381j0466k3242M8781K4527
$$ -103511 16264 137608 209413 166143 71942 41180 62561 52095 28853 77634 102161
20929A02161L9274K0271o9789n19O8964j33786o5904P9242L2913R047q102L2258
$$ 102161 141435 161706 91917 91398 160362 26576 -39328 39914 72827 81874 73772 106030
20917A06030R3826P3945n9626j9085m7973q7940Q032J0929q9119n1151P9876L3997
$$ 106030 199856 273801 214175 195090 147117 59177 67209 78138 -10981 -62132 17744 51741
20905E1741r7340m0353K0718Q2486k7851o0854K6302L4485J9951L5159R1821q0419
$$ 51741 -45599 -85952 -65234 17252 -10599 -71453 -45151 -10666 9285 44444 136265 55846
20893E5846j23657j255n7721q9189l8907k5115J2989k7497j2829R0271J14077
$$ 55846 -67811 -69066 -126787 -215976 -254883 -279998 -267009 -294506 -307335 -217064 -102987
20882a02987J01197M214M1220m4472k1487O5736J6857p3295j21810J9189P2147
$$ -102987 -1790 2424 43644 -828 -22315 43421 60278 -13017 -134827 -115638 -43491
20871d3491k8936O886O9407J9856j85j0289J23365n0572o1226l0436N4994p1609
$$ -43491 -72427 -65541 3866 23722 23537 13248 136613 86041 24815 -5621 49373 -22236
20859b2236J9087J415p3127q3822J34154j0437o0612l852L4560n4260J29061J07248
$$ -22236 -3149 -1734 -74861 -158683 -24529 -34966 -95578 -99430 -64870 -119130 9931 117179
20847A17179O175k2471n2506n5619n5997K4815K7651n8348K6282j8300o5842J6680
$$ 117179 123354 100883 48377 -7242 -63239 -38424 -10773 -69121 -42839 -61139 -126981 -110301
20835a10301N619R1878M4993J6972J5817M6000l3041j2173O2004n0725l5672k2505
$$ -110301 -104682 -12804 32189 49161 64978 110978 77937 65764 127768 77043 41371 18866
20823A8866o9640j07102P8130M8662j7826L6462J9104K2186j14563k0000O162
$$ 18866 -50774 -157876 -79746 -31084 -48910 -12448 6656 28842 -85721 -105721 -99559
20812i9559L6034m915N2890N4493N3397j7119n6588J4074N1818k7374j05048l2483
$$ -99559 -63525 -68440 -15550 38943 92340 75221 18633 32707 84525 57151 -47897 -80380
20800h0380N1300J2215j5944l9008k3256Q0035N0702N3406q9873m3825M2544L6679
$$ -80380 -29080 -16865 -32809 -71817 -95073 -15038 35664 89070 -803 -44628 -2084 34595
20788C4595J779J257Q690j5695K9800R755p2644k0028J04547J2736j11028p3691
$$ 34595 36374 37631 46321 30626 60426 70181 -2463 -22491 82056 94792 -16236 -89927
20776h9927j421P8196J12582M5791o3426k5608M8394l3220k5365M0723p447o0201
$$ -89927 -91348 -13152 99430 145221 81795 56187 104581 71361 45996 86719 79272 19071
20764A9071l8121O922n4910J9439N0065r0524l4972l3481j55847O0651K2737L6217
$$ 19071 -19050 -12128 -67038 -47599 2466 -88058 -123030 -156511 -312358 -251707 -228970 -192753
20752a92753j5451R3685N1874n820N0223O730K1112j5660j201K923P320L3147
$$ -192753 -208204 -114519 -62645 -68465 -18242 -11512 9600 -6060 -7261 -4338 2982 36129
20740C6129m4975K046K538q5607j08662r6894M911J15942J66203J93531K3538
$$ 36129 -8846 -6800 -4262 -89869 -198531 -295425 -290514 -174572 -8369 185162 208700
20729B08700m9087n5995r9020l0186J9105P9042J00419k1732J2r714J087p2628
$$ 208700 159613 103618 4598 -25588 -6483 72559 172978 151246 151258 141544 142631 70003
20717G0003j50030m0823J7097J7643J8108P8992M8784o1099k2546j0487K612P5246
$$ 70003 -80027 -120850 -103753 -86110 -68002 10990 59774 -1325 -23871 -34358 -31746 43500
20705D3500P1361o5887n8021l8863n429O6245P367k7219N9184l802p8717k2625
$$ 43500 114861 48974 -9047 -47910 -53339 12906 20273 -6946 52238 48436 -30281 -52906
20693e2906J02935o1666l9437O8296J4482n4444j20238k416L2424L0307L0556
$$ -52906 50029 -11637 -51074 17222 31704 -22740 -142978 -145394 -112970 -82663 -52107
20682e2107j885o5728J5024J1527j6016J5707M3686M166j9597R6430K4533K0883
$$ -52107 -53992 -119720 -104696 -93169 -109185 -93478 -49792 -45626 -65223 31207 55740 76623
20670G6623q3886r7001L0959q0748O7767J54326M751j98N1719O6730n7335q7517
$$ 76623 -7263 -104264 -73305 -154053 -86286 68040 72791 72593 124312 191042 133707 46190
20658D6190J2692n8633L5066q5679j20014L6612j5249K8898Q4936R9144q7553
$$ 46190 58882 249 35315 -50364 -170378 -133766 -149015 -120117 -35181 63963 -23590
20647b3590m5741k4905p9745K4064J25558r952l594L98q8981j3928K4340K262
$$ -23590 -69331 -94236 -173981 -149917 -24359 -34311 -37905 -37507 -126488 -140416 -116076 -113814
20635a13814k1248p5298m2433R549J51P2358K7683M1995m476m0050M4093J3368
$$ -113814 -135062 -210360 -252793 -243244 -243093 -170735 -143052 -101057 -105533 -145583 -101490 -88122
20623h8122J3011k159q2265J70517M5379j23058Q1216O167l9760M4850N4216J36634
$$ -88122 -75111 -77270 -159535 10982 56361 -66697 14519 20686 -19074 25776 79992 216626
20611B16626m3202j35938O7601J1578r9534J9829R5996K2850j50947j48278j44818
$$ 216626 173424 37486 105087 116665 17131 36960 132956 155806 4859 -143419 -288237
20600b88237K6837O5480Q5753J30176R7939k2998m0184J30776n1389l6778L7118
$$ -288237 -261400 -195920 -110167 20009 117948 94950 54766 185542 134153 97375 134493
20589A34493n2356o2420J8469j6612L9283Q9604L0608k6347l2842J4850j3890
$$ 134493 82137 19717 38186 21574 60857 150461 181069 154722 121880 136730 122840
20578A22840l4953L0474R363l7249r8175K2413j3468J8922K1560j0387R6381O5927
$$ 122840 87887 118361 127724 90475 -7700 14713 1245 20167 41727 31340 127721 193648
20566A93648o5203o8218j10024r987R159J06550M2929M545K6680j2370k1861m348
$$ 193648 128445 60227 -49797 -59784 -50625 55925 98854 103399 130079 117709 95848 91500
20554I1500j9900q5796j61024R693q641J411Q4078J54053M6272r4557J656l623
$$ 91500 71600 -14196 -175220 -165527 -174168 -172757 -88679 65374 111646 17089 18745 15122
20542A5122J37133n6464o6891m3062N0354n2817p4440M8467r4479K600k1575q4075
$$ 15122 152255 95791 28900 -14162 36192 -16625 -91065 -42598 -137077 -134477 -156052 -240127
20530b40127j3049j3746j4194J046P9941O4623J4784J55017j1088l731M6754k016
$$ -240127 -253176 -266922 -281116 -280070 -200129 -135506 -120722 34295 23207 19476 66230 64214
20518F4214m565L0566r8440K3104j4086O2813k3494q9408p1831Q6894N0652R5786
$$ 64214 59649 90215 -8225 14879 793 63606 40112 -49296 -121127 -34233 16419 112205
20506A12205k1763j7738j76433n2752Q2165J33541Q8931q590n6719k8686j8890
$$ 112205 90442 72704 -103729 -156481 -74316 59225 148156 139566 82847 54161 35271
20495C5271J16570p0405j05314r3100K5364J08899L8391j13127l0527J07731m6215
$$ 35271 151841 81436 -23878 -116978 -91614 17285 55676 -57451 -87978 19753 -26462
20484b6462j38951M89O8881N5120R2150k1980m0191l4773Q7862l2514o1391Q8145
$$ -26462 -165413 -164924 -96043 -40923 51227 29247 -10944 -45717 42145 9631 -51760 36385
20472C6385J8706n3554j15564k0340m8766n4934J03337J14209M5716k1661m0676
$$ 36385 55091 1537 -114027 -134367 -183133 -238067 -134730 -20521 25195 3534 -37142
20461c7142K3624J04240N2209m8049m5743o0724p2334J1881K227m5097Q0199J21694
$$ -37142 -13518 90722 142931 94882 49139 -11585 -83919 -72038 -69811 -114908 -34709 86985
20449H6985N7667j43824o2459K0750m5573l8139K580n57J28823J48470R7075l2931
$$ 86985 144652 828 -61631 -40881 -86454 -124593 -122013 -122570 6253 154723 251798 218867
20437B18867q3233j68q5493k3637j64N8150o7819j27493L820M0086O0839P2839
$$ 218867 135634 135466 49973 26336 26172 84322 16503 -110990 -107170 -67084 -6245 66594
20425F6594k6104M8321j20396r5309J27692K3295J26335K1254m7013j362r5271
$$ 66594 40490 88811 -31585 -126894 798 24093 150428 171682 124669 123307 28036
20414B8036j2379o3513P2984J2657J097N8988L1354j2873k7419q2321l9956k1467
$$ 28036 15657 -47856 25128 37785 38882 97870 129224 116351 88932 6611 -33345 -54812
20402e4812j5015l8899K1339J5846o094M9208J22157P9745j20117q7284j8275
$$ -54812 -69827 -108726 -87387 -71541 -77635 -28427 93730 173475 53358 -33926 -52201
20391e2201M5457j1767k3033j966l3262M4005j6077J22810K8496l4241q8291p1612
$$ -52201 -6744 -18511 -41544 -43510 -76772 -32767 -48844 73966 102462 68221 -20070 -91682
20379i1682P7267k8008j48170L1471L4410J05335k9738K8256R2153N1460k9748
$$ -91682 -14415 -42423 -190593 -159122 -124712 -19377 -49115 -20859 71294 122754 93006
20368I3006J7034j20381q0880L1303M33O9638l171o8283n432R6094M0352n428
$$ 93006 110040 -10341 -91221 -59918 -59485 10153 6982 -61301 -66733 29361 69713 64285
20356F4285l0845K5217j15365l3909Q4945o4011q087M3342r153J102R190p4861
$$ 64285 33440 58657 -56708 -90617 -5672 -69683 -77770 -34428 -43581 -42479 -33289 -108150
20344a08150n8915N6548N3382j7997o9006l2218K7848K6608n332J25861N9157
$$ -108150 -167065 -110517 -57135 -75132 -144138 -176356 -148508 -121900 -127232 -1371 57786
20333E7786K9338n4428J8359j26092n0241K3001R1620J82211L2899p3191m8295
$$ 57786 87124 32696 51055 -75037 -125278 -102277 -10657 171554 204453 131262 82967
20322H2967q3471p954l5474n386r8935N4476P0724n386l3782Q5304P4424n0700
$$ 82967 -504 -8458 -43932 -49318 -148253 -93777 -23053 -28439 -62221 23083 97507 46807
20310D6807n277j08641l0738J13944j4792j31272l2811J13777o0082l8528O0715
$$ 46807 41530 -67111 -97849 16095 1303 -129969 -162780 -49003 -109085 -147613 -86898
20299h6898p0929k2450P0920Q9149Q9197k1296j56087j03453j1385L6889K7703
$$ -86898 -157827 -180277 -109357 -20208 68989 47693 -108394 -211847 -223232 -186343 -158640
20288a58640N6985J0675L183N5945l786L3902R9262M1355J1934j3119l1954L9301
$$ -158640 -101655 -90980 -87797 -31852 -35638 -1736 97526 138881 150815 137696 105742 145043
20276A45043l0156k571n2252k5688m4725k3630q871k0793L7726Q5861N8643j3410
$$ 145043 114887 112316 60064 34376 -10349 -33979 -42850 -63643 -25917 59944 118587 105177
20264A05177J3399m0583K8683q2557r9423J7414M9619o7655k5417m7306P5892
$$ 105177 118576 77993 106676 24119 -75304 -57890 -8271 -75926 -101343 -148649 -72757
20253g2757O3270P5186M0146J037q5816Q5889O6810q3369Q821m3741j03661R6529
$$ -72757 -9487 65699 105845 106882 21066 106955 173765 90396 99217 55476 -48185 48344
20241D8344K4879k11q1262q204M2211N2364l205q1406l0333P8337Q6831m1817
$$ 48344 73223 73012 -8250 -16454 25757 78121 74916 -6490 -36823 41514 128345 86528
20229H6528r053r5588p1376K3601l1164o164J02904J9032m0279m5244p0748j0710
$$ 86528 77475 -18113 -89489 -65888 -97052 -103216 -312 18720 -21559 -66803 -137551 -148261
20217a48261J10143l6645j29981M8614N8482Q0747N1473J1289j06295j9902J18667
$$ -148261 -38118 -74763 -204744 -156130 -97648 -16901 34572 45861 -60434 -80336 38331
20206C8331J21251p686q3485q8605p5555q6333O1128J28738R8889n0382j86271
$$ 38331 159582 151896 68411 -20194 -95749 -182082 -120954 7784 106673 56291 -129980
20195a29980q2857K6316N3550K8066J3086K0830P4534m6751q9308M6512k1915
$$ -129980 -212837 -186521 -132971 -104905 -91819 -70989 3545 -43206 -132514 -86002 -107917
20184a07917M9489J21720L0442q0679p151k5434j055J4855M2960k6494L2639l323
$$ -107917 -58428 63292 93734 13055 5904 -19530 -20585 -5730 37230 10736 43375 40052
20172D0052k6943m6177N0675k9357O7251P9429m5795o7093j8667L1289o2716l693
$$ 40052 13109 -33068 17607 -11750 55501 134930 89135 22042 3375 34664 -28052 -31745
20160c1745L4831J40989P1063r5624j6135J9379n2848k9914K4742J8312J7630
$$ -31745 3086 144075 215138 119514 103379 122758 69910 39996 64738 83050 100680
20149A00680O3474J02209k3613J9758J00200m1208p6044j54065j62717q4197Q2899
$$ 100680 164154 266363 242750 262508 362708 321500 245456 91391 -71326 -155523 -72624
20138g2624J52158l3249l2149k0137R2005j6780o2496j05102n113P6048J03190
$$ -72624 79534 46285 14136 -6001 86004 69224 6728 -98374 -103487 -27439 75751
20127G5751k9026k0775j20569J7572O1567J12981q276l2762j07977j01002O5460
$$ 75751 46725 25950 -94619 -77047 -15480 97501 89225 56463 -51514 -152516 -87056
20116h7056M1617n5792L610P4232P1817k95K0280q5804K8987p5688j12285o875
$$ -87056 -45439 -101231 -97621 -23389 48428 48133 68413 -17391 11596 -64092 -176377 -183252
20104a83252Q0427J9171J29678M3814k1431n7859l6166M9805P2585l73n4915n8790
$$ -183252 -102825 -83654 46024 89838 68407 10548 -25618 24187 96772 96399 41484 -17306
20092a7306j6722N863m5279K8321j0193j4102J07874P8328k4640n7651j04194
$$ -17306 -34028 -28165 -73444 -45123 -55316 -69418 38456 116784 92144 34493 -69701
20081f9701N3418M1344j37601j07065P4752K0265l9087q3673O9985P8915P2062
$$ -69701 -16283 25061 -112540 -219605 -144853 -124588 -163675 -247348 -177363 -98448 -26386
20070b6386l5114j24602k2582J14968N9882k0445J8731m4215Q427o4729n4029
$$ -26386 -61500 -186102 -208684 -93716 -33834 -54279 -35548 -79763 -71336 -136065 -190094
20059a90094L9085N4485R5555J08706l4640j08372n4205J09945Q8390K0850m965
$$ -190094 -151009 -96524 -969 107737 73097 -35275 -89480 20465 108855 129705 124740
20048A24740o3901J237q2133n6944P7177J07538K1309q7050p6842K2772q4329
$$ 124740 60839 62076 -20057 -77001 176 107714 129023 41973 -34869 -12097 -96426
20037i6426r5227j0126k783J1854k1328O9656R1809O828P0434J31482n856j06057
$$ -96426 -191653 -201779 -204562 -192708 -214036 -144380 -52571 -45743 24691 156173 150317 44260
20025D4260J7486k9338n7145J3789k4604R5141J3231j30781r7134J52850J2420
$$ 44260 61746 32408 -24737 -10948 -35552 59589 72820 -57961 -155095 -2245 10175
20014A0175m6972p674N0805L0458l3357n2435o15r8076q7281N6038L2545J12901
$$ 10175 -36797 -44471 6334 36792 3435 -49000 -49615 -147691 -234972 -178934 -146389 -33488
20002c3488J30545L9495k8352K5986j14484q2769l3056l1820O0219K4668P1717
$$ -33488 97057 136552 108200 134186 19702 -63067 -96123 -127943 -67724 -43056 28661
19991B8661O623k5313N2748m010m3610J7192R109L0809p4096O8348L1497k8448
$$ 28661 35284 9971 62719 58709 15099 32291 41400 72209 -1887 66461 97958 69510
19979F9510M608q1570j64583j2768L8707q8076J8902R7323Q5316k0976J1349K7561
$$ 69510 74118 -7452 -172035 -184803 -146096 -234172 -215270 -117947 -32631 -53607 -42258 -14697
19967a4697L5995K3554O8248K3509n4610J9981l8799J3447p548l8933K0119R1451
$$ -14697 21298 44852 113100 136609 81999 101980 63181 76628 69080 30147 50266 141717
19955A41717j09766j16025l1078l5859j9669J00514Q5481M9805r2896r8400R6727
$$ 141717 31951 -84074 -115152 -151011 -170680 -70166 15315 65120 -27776 -126176 -29449
19944b9449O6485m2101M9494j1120k1140j2535J5945N7086j8135l1633j57909
$$ -29449 37036 -5065 44429 33309 12169 -366 15579 72665 54530 22897 -135012
19933a35012j14449M9822J3228l5354O0347J29447M6550K7154l5213p9706P6879
$$ -135012 -249461 -199639 -186411 -221765 -161418 -31971 14579 41733 6520 -73186 3693
19922C693L0362l668J2555j7843P4478Q5002j88336j04525J5605N1322M2859J0331
$$ 3693 34055 30387 42942 25099 99577 184579 -3757 -108282 -92677 -41355 1504 11835
19910A1835k6695k9758R576J04413L038k4263M0465j024n0176m4552l6682O5406
$$ 11835 -14860 -44618 -35042 69371 72409 48146 88611 87587 37411 -7141 -43823 21583
19898B1583m2994p3631j9187K9934N7654M8656r201j14222m87R1561O6237L3034
$$ 21583 -21411 -95042 -114229 -84295 -26641 22015 12814 -101408 -101895 -10334 55903 88937
19886H8937P8672k0993L8037j87997o1185P4234j4878l9340L2756O7041k553p410
$$ 88937 167609 146616 184653 -3344 -64529 9705 -5173 -44513 -11757 55284 52731 45321
19874D5321j25228M3151J33613k1400o1539L0884m5424p3954O5052l0824J8365
$$ 45321 -79907 -36756 96857 75457 13918 44802 -622 -74576 -9524 -40348 -21983
19863b1983O186q0824l7110l9765J9105q139L5511O7493k0436m4128j9460J60128
$$ -21983 -15797 -96621 -133731 -173496 -154391 -162530 -127019 -59526 -79962 -124090 -143550 16578
19851A6578M0614K2303m7622l9744Q1504J16836N6604l6513j08360j12557l2535
$$ 16578 57192 79495 31873 -7871 73633 190469 247073 210560 102200 -10357 -42892
19840d2892l9403j21885J23550J55295O9104j55061n4972M8815J72819k9716j16727
$$ -42892 -82295 -204180 -80630 74665 143769 -11292 -66264 -17449 155370 125654 8927
19829H927n5980j6683N4823m738j8994J56440j0568j55121P739P2647N0190o5013
$$ 8927 -47053 -63736 -8913 -13651 -32645 123795 113227 -41894 -34155 38492 88682 23669
19817B3669m1826j72429o4591j9313l2785J96620m3786K6996L1167j4694m335
$$ 23669 -18157 -190586 -255177 -274490 -307275 -110655 -154441 -127445 -96278 -110972 -115307
19806a15307J7005O336o2379K3657O8181P0524l1827j5748M0379J16135r0119
$$ -115307 -98302 -91966 -154345 -130688 -62507 8017 -23810 -39558 821 116956 26837
19795B6837l7582P6869N725L460j3129k4235k6419m7388J3122L9694P6948L9434
$$ 26837 -10745 66124 71849 75309 62180 37945 11526 -35862 -22740 16954 93902 133336
19783A33336J5962j3177k5255p0118l2032n8103q5304j64161J50936J12624m6414
$$ 133336 149298 136121 110866 40748 8716 -49387 -134691 -298852 -147916 -35292 -81706
19772h1706k3586M8496L2647P4244o4660n5872Q000N4811J4376m2412J4133l9648
$$ -81706 -105292 -56796 -24149 50095 -14565 -70437 -62437 -7626 6750 -35662 -21529 -61177
19760f1177j08421r381L3511K3186o8528Q4664R8480j44350j27711O4649R1061
$$ -61177 -169598 -178979 -145468 -122282 -190810 -106146 -7666 -152016 -279727 -215078 -124017
19749a24017J07043l1476k600o9469p5726k5283J2553J27542J41302J4329j03815
$$ -124017 -16974 -48450 -51050 -120519 -196245 -221528 -208975 -81433 59869 74198 -29617
19738b9617p3301N4119L4661k0951k2912P7531O2721r38M0104K1905j06520P928
$$ -29617 -102918 -48799 -14138 -35089 -58001 19530 82251 81313 121417 143322 36802 44730
19726D4730o1206l2131O065L2912m3784r7386M1496J23810J16135q1278Q909M3078
$$ 44730 -16476 -48607 -42542 -9630 -53414 -150800 -109304 14506 130641 49363 58272 101350
19714A01350L4669o2227j4504L4341j1902J0607n7043m4047K2437M0096K5673
$$ 101350 136019 73792 59288 93629 81727 92334 35291 -8756 13681 53777 79450
19703G9450q8486m7841L1269K10837L6372m1961Q2717J4128k1409j7353j80717
$$ 79450 -9036 -56877 -25608 185229 221601 179640 262357 276485 255076 237723 57006
19692E7006n5048o9287K1914J20328M8333l2136M9526Q7927r8336o6722K2149
$$ 57006 1958 -67329 -45415 74913 123246 91110 140636 228563 130227 63505 85654
19681H5654k2372n5699j7905O0577q027J5229j8434p1797j0630K3671o1837l7519
$$ 85654 63282 7583 -10322 50255 42228 57457 39023 -32774 -43404 -19733 -81570 -119089
19669a19089J26554R8152N1202r4485q9202J412J19646L5465l5168m1109N4119
$$ -119089 7465 105617 156819 62334 -26868 -25456 94190 129655 94487 53378 107497
19658A07497J6206m6084p1400k4337j00506L147R6896J02641L3737l3413r866
$$ 107497 123703 77619 6219 -18118 -118624 -115477 -18581 84060 117797 84384 74518
19647G4518j3298J7624p795j3620n386j5500j20619R0908O4075l2599M398p2225
$$ 74518 61220 78844 71049 57429 52043 36543 -84076 6832 70907 38308 42706 -29519
19635b9519K686l0778j162P7872J36774M6295j00277K5308O2878J2923m3990m1507
$$ -29519 -26833 -57611 -58773 19099 155873 202168 101891 127199 190077 203000 159010 117503
19623A17503m9079j21373L430J19306P7635n1218M1863p7304o5731m9324j210
$$ 117503 68424 -52949 -49519 69787 147422 96204 138067 60763 -4968 -54292 -55502
19612e5502m8357J6108l6170k3046J41711M9450l9236l352P1852M6201q4568q2641
$$ -55502 -103859 -87751 -123921 -146967 -5256 44194 4958 1606 73458 119659 35091 -47550
19600d7550P7846P9739k160p9146j03159N7419J25314o458j4748n227K4086r3264
$$ -47550 30296 110035 107875 28729 -74430 -17011 108303 101845 87097 81870 105956 12692
19588A2692j22710J8538Q7631J37558m155p4189j4243m7661J25309M1756r2168
$$ 12692 -110018 -91480 -3849 133709 129554 55365 41122 -6539 118770 160526 68358
19577F8358L6165m001P2881M1773K1980K8307q9099p4478M3734m8059j69972M622
$$ 68358 104523 100522 173403 215176 237156 265463 176364 101886 145620 97561 -72411 -67789
19565f7789M0827j19723m1037J04861J33921K3148K0725J380l6890j00009J3035
$$ -67789 -26962 -146685 -187722 -82861 51060 74208 94933 96313 59423 -40586 -27551
19554b7551K7987O9270j3375P5593o0158q1997j34649K4450Q2694l033j5181L6717
$$ -27551 436 69706 56331 131924 71766 -10231 -144880 -120430 -37736 -40769 -55950 -19233
19542a9233m3118o960N4830k653J9564Q7052J0112L7700L9501L0271j19423r6320
$$ -19233 -62351 -69311 -14481 -17134 2430 89482 99594 137294 176795 207066 87643 -8677
19530h677O7923l4666q5417n5257n1488O5811Q4313N2566L1815k206k9029K8804
$$ -8677 59246 24580 -60837 -116094 -167582 -101771 -17458 35108 66923 64717 35688 64492
19518F4492j7637N2089N2445L4217P6311J5316j01434q0362O9386p997p7606J3996
$$ 64492 46855 98944 151389 185606 261917 277233 175799 95437 164823 156826 79220 93216
19506I3216p6919n0711j7881k2937Q9377J10978L7k2639p0180m619M3211M7297
$$ 93216 16297 -34414 -52295 -75232 14145 125123 125160 102521 32341 27722 70933 118230
19494A18230p339M0219Q5787j5873m2697j07007K1075K3356J778l3661m1564j4868
$$ 118230 110891 151110 236897 221024 178327 71320 92395 115751 117529 83868 42304 27436
19482B7436J21269M7299k5753m5062r2116l7827m019j8311O3621k7361O1193l1986
$$ 27436 148705 196004 170251 125189 33073 -4754 -8773 -27084 36537 9176 70369 38383
19470C8383l8143J5246L2883M4516N2306o409k9311o0579n1971K5046J1553n8091
$$ 38383 240 15486 48369 92885 145191 138782 109471 48892 -3079 21967 33520 -24571
19458b4571q3828O3093J5690K0520R1216q1377j15758M8495P8802o1813K1901
$$ -24571 -108399 -45306 -29616 -9096 82120 743 -115015 -66520 12282 -49531 -27630
19447b7630k0214K1521N2385P6283N1522m7176j48614n0014N9894j02991m011
$$ -27630 -47844 -26323 26062 102345 153867 106691 -41923 -91937 -32043 -135034 -139045
19436a39045K3622L7567Q6557Q4011Q2374q0598o4911p1618k7369J20570n203
$$ -139045 -115423 -77856 8701 92712 175086 94488 29577 -42041 -69410 51160 45957
19425D5957l0472n9835n8200M7540j2732N17Q1397L4472K5786r6874M6464P7067
$$ 45957 15485 -44350 -102550 -55010 -67742 -67225 14172 48644 74430 -22444 24020 101087
19413A01087m9806j36596k4365K3896N4025J9917R5704L0944l8089p5031p0697
$$ 101087 51281 -85315 -109680 -85784 -31759 -11842 83862 114806 76717 1686 -69011
19402f9011N4569M5338k2933N2593j6263m9998n1469l2803J3314J06317J28703
$$ -69011 -14442 30896 7963 60556 44293 -5705 -57174 -89977 -76663 29654 158357
19391A58357o9842o03k7910m2480m9031J7771K0779M8347N2957J44l5590n0650
$$ 158357 88515 87912 60002 17522 -31509 -13738 7041 55388 108345 108489 72899 22249
19379B2249K7281J20026n9406N9948K768j28205k0315M5855Q0400m0j06268o3253
$$ 22249 49530 169556 110150 170098 172866 44661 24346 70201 150601 150561 44293 -18960
19367a8960J06707K684j50061j2671L8001o7129l6990L763k7238R9667R7261l523
$$ -18960 87747 90431 -59630 -72301 -34300 -101429 -138419 -134656 -161894 -62227 35034 31511
19355C1511j4202l1374M4977J09802O3638R5j51912p5573j0397M8642N0184J16539
$$ 31511 17309 -14065 30912 140714 204352 204447 52535 -23038 -33435 15207 65391 181930
19343A81930l2763L302r9949J2164K259m1884L2731J9437K4120N1507J2885k3351
$$ 181930 149167 152469 52520 64684 66943 25059 57790 77227 101347 152854 165739 142388
19331A42388M7769K7691P1628j7017q5388L3778P5716k6584o2108q0496J51967
$$ 142388 190157 217848 289476 272459 187071 220849 296565 269981 207873 127377 279344
19320B79344J50665Q9530K9699l3653L2093K00834J62158J54561J24563Q2648
$$ 279344 430009 519539 549238 515585 547678 748512 910670 1065231 1189794 1272442
19310A272442O0863P3957J74682R2167P1083J07279j267J4515O275R6885n663
$$ 1272442 1333305 1407262 1581944 1674111 1745194 1852473 1851206 1865721 1871996 1968881 1963218
19299A963218m4402R356m6978j30506r2701p2378p6322n5869j29753j48264j90408
$$ 1963218 1918816 1928172 1881194 1750688 1657987 1585609 1509287 1453418 1323665 1175401 984993
19288I84993j01250r3679p2955j19920r2717m979M3053J07743l4882j27625j35558
$$ 984993 883743 790064 717109 597189 504472 499493 542546 650289 615407 487782 352224
19277C52224k25012j89322N1856O1638M6799P7994R1391P7163j18747j15697n2945
$$ 352224 127212 -62110 -10254 51384 98183 176177 267568 344731 225984 110287 57342
19266E7342L3327N5375j42811O0698P1838K0938n4181n1581O9156J08050m6660
$$ 57342 90669 146044 3233 63931 135769 156707 102526 50945 120101 228151 181491
19255A81491j00344K3424J8185k4378l8455p6568j50446P452J51614Q7915M9758
$$ 181491 81147 104571 122756 98378 59923 -16645 -167091 -159639 -8025 79890 129648
19244A29648j3321n5331l0238k6153J5344Q8785K6032J7977O6930J6331k0578
$$ 129648 116327 60996 30758 4605 19949 108734 134766 152743 219673 236004 215426
19233B15426J6330N4463l7578j34684j9323l569q7916k4158J9259N9021J12622
$$ 215426 231756 286219 248641 113957 94634 91065 3149 -21009 -1750 57271 169893
19222A69893n3652k9523p8887L3634P3984R4990p3386r3391N0228N1379Q9686
$$ 169893 116241 86718 7831 41465 115449 210439 137053 43662 93890 145269 234955
19211B34955L328o4294m2724N7578J8137r2877r6957j00166m802J24887P7009
$$ 234955 238283 173989 131265 188843 206980 114103 17146 -83020 -87822 37065 114074
19200A14074K4651m8329J9713l4384n152n8111M2768J49319J31651l9142j35442
$$ 114074 138725 90396 110109 75725 70573 12462 55230 204549 336200 297058 161616
19189A61616J2619M9937k8875P946Q128m5229j11023M5952J3048k7840j8549L9292
$$ 161616 174235 224172 195297 203243 211371 166142 55119 101071 114119 86279 67730 107022
19177A07022J06962l576P0468K8834k1676M7578M7496L2696Q8772J7911R2584
$$ 107022 213984 210408 280876 309710 288034 335612 383108 415804 504576 522487 615071
19166F15071J2651l4427J05098J36408N9817j6887O2387o4154n9338P7801L5665
$$ 615071 627722 593295 698393 834801 894618 877731 940118 875964 816626 894427 930092
19155I30092K8829j1120N0034N3992P987J18935l1238j23129m1275l0607m8885
$$ 930092 958921 947801 997835 1051827 1059814 1178749 1147511 1024382 983107 952500 903615
19144I03615o8084J7889j03839j51113q5612l6187J1477o7101k1918l7323L5049
$$ 903615 835531 853420 749581 598468 512856 476669 488146 421045 399127 361804 396853
19133C96853n9454l2458m483J7325R460j8689J8272n600R5915M7539J8162n8279
$$ 396853 337399 304941 300458 317783 327243 308554 326826 321226 417141 464680 482842 424563
19121D24563q9537l6534P5677J38063j207j4949K8090L9530n921l3718N7621O6386
$$ 424563 335026 298492 374169 512232 511025 496076 524166 563696 557775 524057 581678 648064
19109F48064K03304J41702Q3698P6148O4339J949L0176J89668O5386q5363l2711
$$ 648064 851368 993070 1076768 1152916 1217255 1219204 1249380 1439048 1504434 1419071 1386360
19098A386360r5216j57549j58284j51836n1023J33522J14504m4441j3216r9630
$$ 1386360 1291144 1133595 975311 823475 772452 905974 1020478 976037 962821 863191
19088H63191m3689m8838l3990q795m7216m3417K5399j11356j04497q5269j37687
$$ 863191 819502 770664 736674 727879 680663 637246 662645 551289 446792 361523 223836
19077B23836M0899P9137L4722o8702q8953j55606r1381K3445j5777k8261K2388
$$ 223836 264735 343872 378594 309892 220939 65333 -26048 -2603 -18380 -46641 -24253
19066b4253k5679m3613k3808k5993J98581J39694o9102j29111J6869M6359j76509
$$ -24253 -49932 -93545 -117353 -143346 55235 194929 125827 -3284 13585 59944 -116565
19055a16565j04358P6719R9981J67061Q4337n9815L9935l6142m1755j3550q6403
$$ -116565 -220923 -144204 -44223 122838 207175 147360 187295 151153 109398 95848 9445
19044I445N6762j5975j53817j16420J4765Q3439m548m7729J04627J39304j2912
$$ 9445 66207 50232 -103585 -220005 -205240 -121801 -126349 -174078 -69451 69853 56941
19033E6941p4550K3101K5979J3170R7243M2196j16669l3689Q3283O9800P5142
$$ 56941 -17609 5492 31471 44641 141884 184080 67411 33722 117005 186805 261947
19022B61947Q7903q841m5467j28024m9238P7394R4790P6925j08304r1691j49o0851
$$ 261947 349850 341009 295542 167518 118280 195674 290464 367389 259085 167394 167245 106394
19010A06394R4068O433q4451k5378J8793p9362p0662k8159O3301P3619r540J4497
$$ 106394 200462 206895 122444 97066 115859 36497 -34165 -62324 977 74596 65056 79553
18998G9553k3937M2371k6139L8964N0260R987p1356O4403o039k9175P7906n7663
$$ 79553 55616 97987 71848 110812 161072 171059 99703 164106 158067 128892 206798 149135
18986A49135m8978K4175l4190J3393n3280n1855o9771J822L6441L8730o8494o9478
$$ 149135 100157 124332 90142 103535 50255 -1600 -71371 -69549 -33108 5622 -62872 -132350
18974a32350M3425O2765P6001M6391K2880L4664K3487M8576P984K0392L1691j8917
$$ -132350 -88925 -26160 49841 96232 119112 153776 177263 225839 233823 254215 285906 266989
18962B66989j1992r6000l3682M9309N1889j095p066O0753j1022L6917k6170o2225
$$ 266989 254997 158997 125315 174624 226513 225418 218352 279105 268083 305000 278830 216605
18950B16605j29127k9661N1066J5627l1804K4311M9272O4607J1808l8358j02646
$$ 216605 87478 57817 108883 124510 92706 117017 166289 230896 242704 204346 101700
18939A01700o8499m5419M734j7293N0388J01441N9928N4632N3837m4870j50189
$$ 101700 33201 -12218 -7484 -24777 25611 127052 186980 241612 295449 250579 100390
18928A00390J3007K1308j57492P4167J7660l3202M1420k1887k3256j10975r1574
$$ 100390 113397 134705 -22787 51380 69040 35838 77258 55371 32115 -78860 -170434
18917a70434N4061L2099K5609R3032J47676l0004o0426n311N3043l0889R4910
$$ -170434 -116373 -84274 -58665 34367 182043 152039 91613 86302 139345 108456 203366
18906B03366j1183N7777K4276N4420J14138L7405o3264k442J1842o372n0395p7285
$$ 203366 192183 249960 274236 328656 442794 480199 416935 414493 426335 419963 369568 292283
18894B92283j2087N9359K2905O2157J7996J01055l2727k7159P374j0652o7950
$$ 292283 280196 339555 362460 424617 442613 543668 510941 483782 491156 480504 412554
18883D12554k7713j93058j8087J27513r173l0257J12263k4783p813K7527j8688
$$ 412554 384841 191783 173696 301209 292036 261779 374042 349259 341446 368973 350285
18872C50285o880l8308J5209J0626j05744o5712q2946m3222O3562k5507N3820
$$ 350285 343405 305097 320306 330932 225188 159476 76530 33308 96870 71363 125183
18861A25183r022j1156o9305j19469j0107Q5552O6501M6205J40212J0757r8484
$$ 125183 116161 105005 35700 -83769 -93876 -8324 58177 104382 244594 255351 156867
18850A56867L7915l8718p751J42790R9463P1051j5739n3576j3336Q6296n2169
$$ 156867 194782 156064 148313 291103 390566 461617 445878 392302 378966 465262 413093
18839D13093j60422M6532J42540J51876P015j34522n2348P528p6390j1986k8853
$$ 413093 252671 299203 441743 593619 600634 466112 413764 421292 344902 332916 304063
18828C04063l9129P7445o1480J5753N3876m2956J9258N1934J0701n4662j00302
$$ 304063 264934 342379 280899 296652 350528 307572 326830 378764 389465 334803 234501
18817B34501o0190k8796J09880K7255r0402j7285O5393J03705O90l2291N1225
$$ 234501 174311 145515 255395 282650 192248 174963 240356 344061 344751 312460 363685
18806C63685M7304R3457P6809j23694j61703j29475P4487P1383M1182K4545n7801
$$ 363685 410989 504446 581255 457561 295858 166383 240870 312253 353435 377980 320179
18795C20179j25944j01824R1772R2357K750J9793R8147R4777k0350j241m668J4241
$$ 320179 194235 92411 184183 276540 279290 299083 397230 492007 471657 470416 465748 479989
18783D79989J6752N4673Q8911q1386m6588N2582N8388o8430K1885Q0070m603O9719
$$ 479989 496741 551414 640325 558939 512351 564933 623321 554891 576776 656846 652243 721962
18771G21962O6721R9770J47109J53929P9991k7457m0949j67001j22912m7350j32430
$$ 721962 788683 888453 1035562 1189491 1269482 1242025 1201076 1034075 911163 863813 731383
18760G31383j09543K3714m6998r9470M7998P2917r196L8185J49721J9736R6695
$$ 731383 621840 645554 598556 499086 547084 620001 610805 648990 798711 818447 915142
18749I15142o7556j26793j02783r4675k182M7577M376l4383K3796M1646J9602
$$ 915142 847586 720793 618010 523335 521153 568730 573106 538723 562519 604165 623767
18738F23767P2049P802o8915k748J06268N2094o1767N0760Q8261o517N9397j877
$$ 623767 695816 703618 634703 631955 738223 790317 728550 779310 867571 861054 920451 918574
18726I18574j38P981M7820N43O6021J7515l2231l7281N4745J04046r5899L3973
$$ 918574 918436 926417 974237 974780 1040801 1058316 1026085 988804 1043549 1147595 1051696 1085669
18714A085669P5430K3131K4915R2668O7309J2542N7186P789K148K4589r4904j03488
$$ 1085669 1161099 1184230 1209145 1301813 1369122 1381664 1438850 1446639 1448787 1473376 1378472 1274984
18702A274984N7859J0897L2860j6747O0578J4314Q8571O3389J67752Q1301J8895
$$ 1274984 1332843 1343740 1376600 1359853 1420431 1434745 1523316 1586705 1754457 1835758 1854653
18691A854653J91003P4215R5382N2353P5061K7521N4620J20581J72052J05621
$$ 1854653 2045656 2119871 2215253 2267606 2342667 2370188 2424808 2545389 2717441 2823062
18681B823062K8102R4948J81384K21567K21660K20402K63911L12848L83355M74852
$$ 2823062 2851164 2946112 3127496 3349063 3570723 3791125 4055036 4367884 4751239 5226091
18671E226091N70860N16642N00383M82103O48767O79966P93980Q74690R21721
$$ 5226091 5796951 6313593 6813976 7296079 7944846 8624812 9418792 10293482 11215203
18662A1215203J373342J877361K321225K772127L647194M788678N447964M141904
$$ 11215203 12588545 14465906 16787131 19559258 23206452 27995130 33443094 37584998
18654C7584998K364713J938935J273574j319529k592199q25911K109709N422948
$$ 37584998 39949711 41888646 43162220 41842691 39250492 38424581 40534290 45957238
18646D5957238R229787J3274517J7146017K1159870K6662923L5238753M6158697
$$ 45957238 55187025 68461542 85607559 106767429 133430352 168669105 214827802
18639B14827802N1325697L4878914J8285820J4064097J436520l5711369n5711408
$$ 214827802 266153499 301032413 319318233 333382330 334818850 299107481 243396073
18632B43396073m6060195l1875922k6070070k0190995j0765949k267862L599714
$$ 243396073 197335878 165459956 139389886 119198891 108432942 106165080 109764794
18625A09764794M196008J14680k507520m493629j0400395j7359682j7455440j3014486
$$ 109764794 113960802 114075482 111567962 107074333 96673938 79314256 61858816 48844330
18617D8844330q716894n660504l811055k429055j415831o27939k02580k05642
$$ 48844330 40127436 34466932 30655877 28226822 26810991 26183052 25980472 25774830
18609B5774830J04249M65959L82970K74630O91858J370136K579730L755607N112897
$$ 25774830 25879079 26345038 26728008 27002638 27694496 29064632 31644362 35399969 40512866
18600D0512866O593705Q381618J0531211J3061911J5420673J3880700R017819
$$ 40512866 47106571 55488189 66019400 79081311 94501984 108382684 117400503
18593A17400503O716230N592830P60636l588817O46116J0095748J9928884K8276028
$$ 117400503 124116733 129709563 130470199 126881382 127527498 137623246 157552130 185828158
18585A85828158L2792206L6160172M4956335M7921440K3913516p289082j3743821
$$ 185828158 218620364 254780536 299736871 347658311 371571827 364282745 350538924
18578C50538924k2410269n3390643p4089742n9640802l8155560k3282464j4357405
$$ 350538924 328128655 274738012 200648270 141007468 102851908 79569444 65212039
18571F5212039q800329n295212l104283j391287L87459K048866K459557L96341
$$ 65212039 56411710 51116498 48012215 46620928 47008387 49057253 51516810 51913151
18563E1913151j327686j703644l504591p038873p978717n981204l996623k632841
$$ 51913151 50585465 48881821 45377230 38338357 30359640 24378436 20381813 17748972
18555A7748972j787359j244699q40651p48896p20254p41656p91584q30227r47090
$$ 17748972 15961613 14716914 13876263 13127367 12407113 11665457 10873873 10043646 9096556
18546I096556q40605p15818o25928o33327m79677k62338k11455k87045k80892
$$ 9096556 8255951 7540133 6914205 6280878 5801201 5538863 5327408 5040363 4759471
18537D759471k56938j51142j69512k60526k88259j71432q5063j86811q5062m3395
$$ 4759471 4502533 4351391 4181879 3921353 3633094 3461662 3376599 3189788 3104726 3061331
18527C061331J3963j02066p1439j37467l0282j77986j20274m1327K8851r8287
$$ 3061331 3075294 2973228 2901789 2764322 2734040 2556054 2435780 2394453 2423304 2325017
18517B325017j74854j35755j41261k95L1697j00978q7793Q761m4437L437p7861
$$ 2325017 2150163 2014408 1873147 1872852 1904549 1803571 1715778 1724539 1680102 1683539 1605678
18506A605678n853k8350L1260p6900j68500K7708n821o5702K1744j18652j14102
$$ 1605678 1599825 1571475 1602735 1525835 1357335 1385043 1379222 1313520 1335264 1216612 1102510
18495A102510k1569N0285j54248o0012n967m825M1336m8069j7662p0787o1073
$$ 1102510 1080941 1131226 976978 916966 910999 906174 947510 899441 881779 810992 749919
18484G49919M1107m8735M157J2326o4368m7281k1897K3125N0567L2231L8515j5975
$$ 749919 791026 742291 746448 758774 694406 647125 625228 648353 698920 731151 769666 753691
18472G53691j8212j06793O0060L3199p225j3216L0717r307n1782o7727q5949J9169
$$ 753691 735479 628686 688746 721945 714720 701504 732221 722914 671132 603405 517456 536625
18460E36625J50703O2082J10654R5936Q0911k6975m7537m3874o5293p3302j02946
$$ 536625 687328 749410 860064 956000 1036911 1009936 962399 918525 853232 779930 676984
18449F76984j31686J2327K4748M9151k0220o8628m3718j42314k8936R7353R059
$$ 676984 545298 557625 582373 631524 611304 542676 498958 356644 327708 425061 434120
18438D34120j14127J7397O9926p834m8763K3370J2779J572q1036J466l269m2673
$$ 434120 319993 337390 407316 399482 350719 374089 386868 388440 307404 308870 305601 262928
18426B62928K7634P4011J12837k5554q0597q6652p6969J9037P1295K0856l5622
$$ 262928 290562 364573 477410 451856 371259 284607 207638 226675 297970 318826 283204
18415B83204o9718o0566N4553J0824l6163K5921j2986o8570j5985M045L153M8790
$$ 283204 213486 152920 207473 218297 182134 208055 195069 126499 110514 114559 117712 166502
18403A66502Q1934R2085L0637r6881p5393N996Q8839L0818j09332j41767J6214
$$ 166502 248436 340521 371158 274277 198884 204880 293719 324537 215205 73438 89652
18392H9652O140q781M3608o2432q1796k1945J32469J55516R7898q0381j75386
$$ 89652 95792 87011 130619 68187 -13609 -35554 96915 252431 350329 269948 94562
18381I4562M5832P3097N4856q2813j30215Q2039J2110Q057o5097n0012N3547k5289
$$ 94562 140394 213491 268347 185534 55319 137358 149468 157525 92428 42416 95963 70674
18369G0674L7331O9254j2725N6107J23257l3365J7567r793l497k5452L2261j17636
$$ 70674 108005 177259 164534 220641 343898 310533 328100 318307 314810 289358 321619 203983
18357B03983k0450J05398R7827j54568p337j04128j39391l37Q1044p44J6206j3176
$$ 203983 183533 288931 386758 232190 224853 120725 -18666 -19003 62041 61297 77503 64327
18345F4327r0313P4671N4388q8957K5J14510J31296J9370Q5140o7247j03793n9462
$$ 64327 -25986 48685 103073 14116 14141 128651 259947 279317 364457 297210 193417 133955
18333A33955J2703Q7865Q1450p783m1384k0183l868Q3428N315j33639p4432Q0852
$$ 133955 146658 234523 315973 308190 266806 246623 242755 326183 331498 197859 123427 204279
18321B04279m5984j23243O5320R4935j10407K4877R6764n1520K5162l2926l0595
$$ 204279 158295 35052 100372 195307 84900 109777 206541 155021 180183 147257 116662
18310A16662l4181j3991o3195O2709O2969k10699r3396L8379J28014L7473M5444
$$ 116662 82481 68490 5295 68004 130973 -79726 -173122 -134743 -6729 30744 76188
18299G6188N9878P9780O0415m7900j03372m8251r6088j5331Q9823M912j3636J07648
$$ 76188 136066 215846 276261 228361 124989 76738 -19350 -34681 55142 60054 46418 154066
18287A54066q2312n0227J17236k2470n5719Q0405N0405N7008k5515l1626l7632
$$ 154066 71754 21527 138763 116293 60574 140979 191384 248392 222877 191251 153619
18276A53619l6202J3023j16888m4252J5573R846P571m8582l6030L8120J52416
$$ 153619 117417 130440 13552 -30700 -15127 -5281 2290 -46292 -82322 -44202 108214
18265A08214P3116o0607l2438K3295K539J2464j33219q0433j3457J01551J16277
$$ 108214 181330 120723 88285 111580 114119 126583 -6636 -87069 -100526 1025 117302
18254A17302Q6011o828o8847r0901m2744O4198P4029N8179j30181q2576J46907
$$ 117302 203313 196485 127638 36737 -6007 58191 132220 190399 60218 -22358 124549
18243A24549J04891k3843j33895j60924M2525J9591K1539N7613J0320P3980J17690
$$ 124549 229440 205597 71702 -89222 -46697 -27106 -5567 52046 62366 136346 254036
18232B54036j01692l7612K3555K3236N3140M8105M7193r8949j7470m9762R244
$$ 254036 152344 114732 138287 161523 214663 262768 309961 211012 193542 143780 153024
18221A53024m511n6083l2757M1447L6663l2485p8176N3674J08224j5158j12307
$$ 153024 148513 92430 59673 101120 137783 105298 27122 80796 189020 173862 61555
18210F1555l3448k2884J9913P4800m1547k413Q0044M0184j9682l8247k5735j0633
$$ 61555 28107 5223 25136 99936 58389 55976 136020 176204 156522 118275 92540 81907
18198H1907N5662J6533K8418J7493Q623k978l8752K2995J30925k0872l6912l1524
$$ 81907 137569 154102 182520 200013 208636 205658 166906 189901 320826 299954 263042 231518
18186B31518j1252J0500J190J10513m447O3016N5994n2382j08372q3244K9283
$$ 231518 220266 230766 231956 342469 338022 401038 457032 404650 296278 213034 242317
18175B42317L9572L1842J96156r801N5997n683J10841J95308J72946K76237J41838
$$ 242317 281889 313731 509887 500086 556083 550400 661241 856549 1029495 1305732 1447570
18164A447570l260K5923j31878j13485L4839o0694q0374n8438K3787J8866P8232
$$ 1447570 1444310 1470233 1338355 1224870 1259709 1199015 1118641 1060203 1083990 1102856 1181088
18153A181088J28917Q0961J60739O7338O8467J9191M9273J4192N2294L308L5389
$$ 1181088 1310005 1390966 1551705 1619043 1687510 1706701 1755974 1770166 1822460 1825768 1861157
18142A861157O8103N1324j08795r62R4214J8601j18960p7668n7642K4050K18472
$$ 1861157 1929260 1980584 1871789 1870827 1965041 1983642 1864682 1787014 1729372 1753422 1971894
18131A971894L4446J06583L17129K99437K93708L69796N00918P11988R24501J188318
$$ 1971894 2006340 2112923 2430052 2729489 3023197 3392993 3893911 4605899 5530400 6718718
18121F718718J496087J949926K662336L847431N255980O394281P516881R535520
$$ 6718718 8214805 10164731 12827067 16674498 21930478 28324759 35841640 45377160
18113D5377160J3056517J8393098K2744053J1817364P25271J784607j331759k1893612
$$ 45377160 58433677 76826775 99570828 111388192 112113463 113898070 112566311 90672699
18105I0672699l0471614k0937461j2097639p034400m313108k861330k084921j542328
$$ 90672699 60201085 39263624 27165985 20131585 15818477 12957147 10872226 9329898
18097I329898j226509q54529o08260n33876n59447o44116n52989l03389k53410
$$ 9329898 8103389 7248860 6640600 6106724 5547277 4903161 4350172 4046783 3793373
18088C793373m04480k78374j56056j57112k29189k57096j89730j0374j60102j84655
$$ 3793373 3388893 3110519 2954463 2797351 2568162 2311066 2121336 2110962 1950860 1766205
18078A766205k4604r8072J8483k5177p0591J01512R6313q057P1942l8785j09434
$$ 1766205 1741601 1643529 1662012 1636835 1566244 1667756 1764069 1756012 1827954 1789169 1679735
18067A679735j4700r560J6259K36622N4013L5533K5545q3903j78309j45781p7459
$$ 1679735 1665035 1655475 1671734 1908356 1962369 1997902 2023447 1939544 1761235 1615454 1537995
18056A537995j00584l3537O5394O9390j06343l6447j5928L3779K4683P2392l9019
$$ 1537995 1437411 1403874 1469268 1538658 1432315 1395868 1379940 1413719 1438402 1510794 1471775
18045A471775j78705k53281j32368p6328q3764j58505j06934l7800K8545l8003
$$ 1471775 1293070 1039789 907421 831093 747329 588824 481890 444090 472635 434632
18035D34632n8521o8504j50673M0596P0178N4676k6327J8109P702N5657o2982
$$ 434632 376111 307607 156934 197530 267708 322384 296057 314166 321868 377525 314543
18024C14543k4743L430L5138K8962L5431K8229l1752o3455n7589k1480L9936j4505
$$ 314543 289800 293230 328368 357330 392761 420990 389238 325783 268194 246714 286650 272145
18012B72145o4441r551j5619k7097P4190O8794O1733p2441l1527o9382j1133J8470
$$ 272145 207704 198153 182534 155437 229627 298421 360154 287713 256186 186804 175671 194141
18000A94141n738j06889k8993J9090m5549M3534J31477M6523L2060J5405j45339
$$ 194141 188403 81514 52521 71611 26062 69596 201073 247596 279656 295061 149722
17989A49722l6310n1954M2442Q6644j6876J5477k9330N6261J10008K9780k657
$$ 149722 113412 61458 103900 190544 173668 189145 159815 216076 326084 355864 353207
17978C53207m8454O2712q4368j84634l8171J2385J07781J16118P707k2277N6066
$$ 353207 304753 367465 283097 98463 60292 72677 180458 296576 304283 282006 338072
17967C38072J3463L3758p4712J3046n7049q8855M7149P2093M507n4094m9430L8704
$$ 338072 351535 385293 310581 323627 266578 177723 224872 296965 301472 247378 197948 236652
17955B36652R4663k3839l7869k7707j93183o9093J27916P1158J752L5358q778
$$ 236652 331315 307476 269607 241900 48717 -20376 107540 178698 180450 215808 207030
17944B07030o0196M2846l3511L5521R6030j7711j26252j26598l6691P070J06084
$$ 207030 146834 189680 156169 191690 287720 270009 143757 17159 -19532 -12462 93622
17933I3622J42291J9008j382m7536q887M0627o0871m6415J0010M6269Q951p1557
$$ 93622 235913 254921 253539 206003 197116 237743 176872 130457 140467 186736 195687 124130
17921A24130J9834l0067J5999m8937J24272J4604l9653J9681l6221p3500R1222
$$ 124130 143964 113897 129896 80959 205231 219835 180182 199863 163642 90142 181364
17910A81364o6280k922n2328L1496M7704M9655l6318l4399O5294J51883O1893
$$ 181364 115084 112162 59834 91330 139034 188689 152371 117972 183266 335149 397042
17899C97042l4640o4923Q9709R5541J02782L6761m1807k9964j68351j26674j7494
$$ 397042 362402 297479 387188 482729 585511 622272 580465 550501 382150 255476 237982
17888B37982K7268k2778N7004L8691J3142j4585q6086l4764j9935n6315J3301
$$ 237982 265250 242472 299476 338167 351309 336724 250638 215874 195939 139624 152925
17877A52925M8899k8591J7897P5219j8556j78406r6545j2822L8383J14925k5399
$$ 152925 201824 173233 191130 266349 247793 69387 -27158 -39980 -1597 113328 87929
17866H7929k4485o073o2058M4344J25065n1561k8821R7114K0470K9479q0129o8390
$$ 87929 63444 57371 -4687 39657 164722 113161 84340 181454 201924 231403 151274 82884
17854H2884L0502P9597n88o4589J7644J0985m453K861N1308O4366N0183L3526
$$ 82884 113386 192983 192395 127806 145450 156435 151982 154843 206151 270517 320700 354226
17842C54226K7445O2012L9295J01302J1352M137n4870o8513l9071r0753M0615
$$ 354226 381671 443683 482978 584280 595632 599769 544899 476386 437315 346562 387177
17831C87177J18318K313j22632j8878M2975L5944j14673m6816J67595Q4025j9239
$$ 387177 505495 507808 385176 366298 409273 445217 330544 283728 451323 535348 516109
17820E16109o3446L252n9862j02893P1483P7965q1232k0948M6598j08144p2065
$$ 516109 452663 455915 396053 293160 364643 442608 361376 340428 387026 278882 206817
17809B06817N1025j1869r922K0183M7150L954J5889K4400K7991J6907Q976R8868
$$ 206817 257842 245973 236051 256234 303384 307338 323227 347627 375618 392525 401501 500369
17797E00369j1809l6357j18719O1507J5801M9790l187p7746p4138p1853p0585
$$ 500369 488560 452203 333484 394991 410792 460582 457395 379649 305511 233658 163073
17786A63073L0689R0480J86195K77858J06678M1752L6295K5911P3562R4734L971
$$ 163073 193762 284242 470437 748295 854973 896725 933020 958931 1032493 1127227 1131198
17775A131198l600q4804j19233m4435j8044m9571R320Q2207O6749p3214l6512
$$ 1131198 1127598 1042794 923561 879126 861082 811511 820831 903038 969787 896573 860061
17764H60061p9846K7698J1233k6034K056M0713j19456j10823k773O619N7729l6412
$$ 860061 780215 807913 819146 793112 795168 835881 716425 605602 602829 609448 667177 630765
17752F30765O6911n7155q5725J01083M1574L8151n8858l2408j5790J8751P2566
$$ 630765 697676 640521 554796 655879 697453 735604 676746 644338 628548 647299 719865
17741G19865O2330K6313Q9066L5115M1557P1422K213m6690J07475J45545l4342
$$ 719865 782195 808508 897574 932689 974246 1045668 1047881 1001191 1108666 1254211 1219869
17730A219869j29165l2546K6204J05697J68407J61511R8978M0770J41031L4586
$$ 1219869 1090704 1058158 1084362 1190059 1358466 1519977 1618955 1659725 1800756 1835342
17720A835342n8966j4962j60982j70537j8212k4720o0903k1905M2737j8791M5811
$$ 1835342 1776376 1761414 1600432 1429895 1411683 1386963 1326060 1304155 1346892 1328101 1373912
17709A373912J71729l0387O966K5516N2770J6006L3993J37893J1322J2718Q9058
$$ 1373912 1545641 1515254 1522220 1547736 1600506 1616512 1650505 1788398 1799720 1812438 1901496
17698A901496J67675J57640m1865L319J00839J04612N7491J8427J30881L21861
$$ 1901496 2069171 2226811 2184946 2188265 2289104 2393716 2451207 2469634 2600515 2922376
17688B922376J63659j2569O2924J00818J82282J67664J27479K41537L03545L38966
$$ 2922376 3086035 3073466 3136390 3237208 3419490 3587154 3714633 3956170 4259715 4598681
17678D598681L29465M00438N25232O31617P82400P98428Q98370R95230J181322
$$ 4598681 4928146 5328584 5853816 6485433 7267833 8066261 8964631 9959861 11141183
17669A1141183J342966J637816K020910K552970L063920L804661M729887N230889
$$ 11141183 12484149 14121965 16142875 18695845 21759765 25564426 30294313 35525202
17661C5525202M764199L777287K716508J445452j52386j029033o25954J955089
$$ 35525202 40289401 44066688 46783196 48228648 48076262 47047229 46421275 48376364
17653D8376364N740092R801841J4035241J8469156K3266343K9228881L7643507
$$ 48376364 54116456 63918297 77953538 96422694 119689037 148917918 186561425
17646A86561425M7081966M8976383M0934558K9089295J5825543l695495k7662616
$$ 186561425 233643391 282619774 323554332 352643627 368469170 364773675 337111059
17639C37111059m6172092n1178487m3111465l2166943k3232499j5048805o562098
$$ 337111059 290938967 239760480 196649015 164482072 141249573 126200768 119638670
17632A19638670k93471J916500R66920j784203n351195r891714j4162825j6488957
$$ 119638670 119345199 121261699 122228619 120444416 115093221 105201507 91038682 74549725
17624G4549725j5372632j1638271p834658n113153l366618k267176j355377q97179
$$ 74549725 59177093 47538822 39704164 34591011 31224393 28957217 27601840 26704661
17616B6704661o98837m82141k12081J39118K43648L91431R41943J931602L119727
$$ 26704661 26005824 25523683 25311602 25450720 25694368 26085799 27027742 28959344 32079071
17607C2079071M288718N426724P048967R058530J1386558J3139800J2830034J1074758
$$ 32079071 36367789 41794513 48843480 57902010 69288568 82428368 95258402 106333160
17599A06333160Q619333N862386K767362R47725J587600O427764J4126981K1204453
$$ 106333160 114952493 120814879 123582241 124529966 126117566 132545330 146672311 167876764
17591A67876764K6426431L1475218L5614706L4164777K2798582P566423q972964
$$ 167876764 194303195 225778413 261393119 295557896 318356478 325922901 316949937
17584C16949937k2831039l8662418n0458380n2960191m1453214k6810861j6494862
$$ 316949937 294118898 255456480 204998100 152037909 110584695 83773834 67278972
17577F7278972j0280226o567911m286589k520654j059444Q1022N63019L23271
$$ 67278972 56998746 50430835 46144246 43623592 42564148 42645170 43208189 43531460
17569D3531460m19319j611232k707117m088275n183732n299489m243118k858914
$$ 43531460 43112141 41500909 38793792 34705517 29521785 24222296 19979178 17120264
17561A7120264j888342j360885j074808j080022p96929q36251r70604r13195q04456
$$ 17120264 15231922 13871037 12796229 11716207 10919278 10083027 9112423 8199228 7394772
17552G394772o26525n30984m76066m92975k87914j42209k04920j00225o7839k42055
$$ 7394772 6768247 6237263 5761197 5268222 4980308 4838099 4633179 4532954 4465115 4223060
17542D223060k99831j86707j22381j05498o6772j51217k11431j03228j22036o3576
$$ 4223060 3923229 3736522 3614141 3508643 3441871 3290654 3079223 2975995 2853959 2790383
17532B790383o1718q0369M5698M2773r1338j03869k34245j37128M1229p4585j21242
$$ 2790383 2728665 2648296 2693994 2736767 2645429 2541560 2307315 2170187 2211416 2136831 2015589
17521B015589j05483j43321k1622O2472k6028K6721N6258O7550q2504j80767q1962
$$ 2015589 1910106 1766785 1745163 1807635 1781607 1808328 1864586 1932136 1849632 1668865 1586903
17510A586903K4338L7220j52911q4969o4129o9436O137l8598m4501m0657j12903
$$ 1586903 1611241 1648461 1495550 1410581 1346452 1277016 1283153 1244555 1200054 1159397 1046494
17499A046494j3755k6829n5486M3412O5322O794n2498j08169n0929p1173R807
$$ 1046494 1032739 1005910 950424 993836 1059158 1065952 1013454 905285 854356 783183 792990
17488G92990K6475O1245o2434p256r6633r9298P5546M3321J01247k6739p2648
$$ 792990 819465 880710 818276 811020 714387 615089 690635 733956 835203 808464 735816
17477G35816L6648M9297n6880j5481n1509O639L5396p3476j949M4941J2865j7570
$$ 735816 772464 821761 764881 749400 697891 704530 739926 666450 664501 709442 722307 704737
17465G04737j20616n6349M7308J44165L9463r3749l1701J5967P3911K0660m2809
$$ 704737 584121 527772 575080 719245 758708 664959 633258 649225 723136 743796 700987
17454G00987j38179p8295o520N6258O5898M4539Q9916L8392j2590K1099n4201
$$ 700987 562808 484513 477993 534251 600149 644688 734604 772996 760406 781505 727304
17443G27304P413m5477P818O1675k04552j28609l4217j1653j0659j8195j47258
$$ 727304 734717 689240 697058 758733 554181 425572 391355 379702 369043 350848 203590
17432B03590j3240J0767M3652N1864o5329m5634L4722m6452M0420J46567o674
$$ 203590 190350 201117 244769 296633 231304 185670 220392 173940 214360 360927 354253
17421C54253M7431p7275o5332K2990l1686k7781m6912k5602r9365j1675R9718
$$ 354253 401684 324409 259077 282067 250381 222600 175688 150086 50721 39046 138764
17410A38764J30939k876m2976q1818l7207P6216L9351k3962q422O8669N6792M2426
$$ 138764 269703 266827 223851 142033 104826 181042 220393 196431 188009 256678 313470 355896
17398C55896m0065p9413p1244J9248J5084N1532Q9290p7764J0980l1067j4233
$$ 355896 315831 236418 165174 184422 199506 251038 340328 262564 273544 242477 228244
17387B28244l1646m4889k3176L1137P7129n9762l2579L0184m3839q6901R6750
$$ 228244 196598 151709 128533 159670 236799 177037 144458 174642 130803 43902 140652
17376A40652k0393p4985r5774p8019O1911Q2634m8951q7823P2552p079l8612J40908
$$ 140652 120259 45274 -50500 -128519 -66608 16026 -32925 -120748 -48196 -55275 -93887 47021
17364D7021R371Q4949N126n9518k8210M1656j3699p842k0912J8545K7998J5727
$$ 47021 56392 141341 146467 86949 58739 100395 86696 78854 57942 76487 104485 120212
17352A20212M8312R1J1831N2719j8744m7663j26331l3496L5484L8293O4268M4376
$$ 120212 168524 168615 180446 233165 214421 166758 40427 6931 42415 80708 144976 189352
17340A89352m7247M891k6285p3839N1329j9770r0380K0878M1811M0269k4735O0171
$$ 189352 142105 146996 120711 46872 98201 78431 -11949 8929 50740 91009 66274 126445
17328A26445p5564J4451Q6970r7036j05315j8277k726l7801o2475P8613J2892
$$ 126445 50881 65332 152302 55266 -50049 -68326 -71052 -108853 -171328 -92715 -79823
17317g9823J25523R9364O0967p4445j11478j467m1528j23080l9755J0254J57726
$$ -79823 45700 145064 206031 131586 20108 18641 -22887 -145967 -185722 -175468 -17742
17306a7742J03570Q337q4634r9937J27202J89937P4715o1188j18738n2731j20153
$$ -17742 85828 94165 9531 -90406 36796 226733 301448 240260 121522 68791 -51362
17295e1362L7359Q7553j8373k027j5430q5386N1559J8667k1617j19631j4140L8996
$$ -51362 -14003 73550 55177 53150 37720 -47666 3893 22560 943 -118688 -132828 -93832
17283i3832j7395M9313n5112q7296j9975J4601k4381L2184M3643K4390J4625l1005
$$ -93832 -111227 -61914 -117026 -204322 -224297 -209696 -234077 -201893 -158250 -133860 -119235 -150240
17271a50240N3295P3821m9876K6092L5847L8817k7356k2610j62317M9643R875
$$ -150240 -96945 -23124 -73000 -46908 -11061 27756 400 -22210 -184527 -134884 -125009
17260a25009N0981K7573n6464O7947o1225J36015k034K5495K3318n5545n6977
$$ -125009 -74028 -46455 -102919 -34972 -96197 39818 37784 63279 86597 31052 -25925
17249b5925p8657j48089k478J22112M2001O5065R6086r4526m6052J6278J1556
$$ -25925 -104582 -252671 -255149 -133037 -91036 -25971 70115 -24411 -70463 -54185 -42629
17238d2629k1690p2158q9614P8662L8185O6535R0170j31925j22181m2765M3496
$$ -42629 -64319 -136477 -226091 -147429 -109244 -42709 47461 -84464 -206645 -249410 -205914
17227b05914J3045j6418N1345O6533N1891K5636K7430J8415n2565o1754p7960
$$ -205914 -192869 -209287 -157942 -91409 -39518 -13882 13548 31963 -20602 -82356 -160316
17216a60316j5192M4100Q2344K2475q8147j4812K3787j4694N0856j797K360Q0436
$$ -160316 -175508 -131408 -49064 -26589 -114736 -129548 -105761 -120455 -69599 -71396 -69036 11400
17204A1400J00172j13242j46778P2017O4572q545L6904J44696L7010j7489j35654
$$ 11400 111572 -1670 -148448 -76431 -11859 -20404 16500 161196 198206 180717 45063
17193D5063m0091R323M7199m9110R1893n1708j17619j10620J04132R0722m3181
$$ 45063 4972 14295 61494 12384 104277 52569 -65050 -175670 -71538 19184 -23997
17182b3997P9765m5535j1799O9429l2868r5518l1773l0941j8082O8600o23n9415
$$ -23997 55768 10233 -1566 67863 34995 -60523 -92296 -123237 -141319 -72719 -73342 -132757
17170a32757l3014O3426J4089m5637k7292q9882K1487J5590O0103J26040J15609
$$ -132757 -165771 -102345 -88256 -133893 -161185 -251067 -229580 -213990 -153887 -27847 87762
17159H7762L9713M0136Q8147J5287m1740K397k1794J4138j14192j10959J19757
$$ 87762 127475 167611 255758 271045 229305 231702 209908 224046 109854 -1105 118652
17148A18652J18426N9447L306O4021O2566Q3047k3141M6822l1894M376N4163J5869
$$ 118652 237078 296525 299831 363852 426418 509465 486324 533146 501252 505628 559791 575660
17136E75660J54579K49721Q2963J7357j05479K0202j56007J4823K5885j310l461
$$ 575660 730239 979960 1062923 1080280 974801 995003 838996 853819 879704 878394 874933
17125H74933p842L227l3082N5049O9661J9916J73192P382k1899j29870k4855j8921
$$ 874933 867091 870318 837236 892285 961946 981862 1155054 1162436 1140537 1010667 985812 966891
17113I66891j44174j93368j59332j5485M7962K3637p7726j43979L0386k3850n8774
$$ 966891 822717 629349 470017 454532 502494 526131 448405 304426 334812 310962 252188
17102B52188q065k223r537l7380q1699l2810k9323J19547N3027M7219P818p1304
$$ 252188 244123 241900 232363 194983 113284 80474 51151 170698 223725 270944 278762 207458
17090B07458q7826J8541P2645J33902L1494J55262J82320O3240J26329N6702L9491
$$ 207458 119632 138173 210818 344720 376214 531476 713796 777036 903365 960067 999558
17079I99558J02100J3444K0314j36375j26280l2460j58423j00051m1674n886o8908
$$ 999558 1101658 1115102 1135416 999041 872761 840301 681878 581827 540153 534267 465359
17068D65359L830L4898M2281J33389J21667J06365J56948J30539Q91o0076j27100
$$ 465359 469189 504087 546368 679757 801424 907789 1064737 1195276 1196167 1136091 1008991
17057A008991r4176r3730j51275j65730j61912q7880m6666q7346o8520J5901o2089
$$ 1008991 914815 821085 669810 504080 342168 254288 207622 120276 51756 67657 5568
17046E568m8352n650J819Q0480P5588l3269M0320n8536k5744m9022j8514J02238
$$ 5568 -42784 -48434 -46615 33865 109453 76184 116504 57968 32224 -16798 -35312 66926
17034F6926J8590N8814m9300l722n117o1905l7048l6481p6568O9016R0620N694
$$ 66926 85516 144330 95030 91308 86191 24286 -12762 -49243 -125811 -56795 33825 39519
17022C9519M3764k9628J1115m8752r932M2303J0411p3866p7017p6791L1028M7803
$$ 39519 83283 53655 64770 16018 6086 48389 58800 -15066 -92083 -168874 -137846 -90043
17010i0043O9271k9562L2313o1215R4172L0611K5917k9283j02143k241m4434j0350
$$ -90043 -20772 -50334 -18021 -79236 14936 45547 71464 42181 -59962 -62203 -106637 -116987
16998a16987P1554m042M4811L6192k8006M9724q103p4047j3230J02669m3589M568
$$ -116987 -45433 -49475 -4664 31528 3522 53246 45143 -28904 -42134 60535 16946 21514
16986B1514K4549J3668m3051j3514q8105R8279J3027q0850Q352M9814m567p4215
$$ 21514 46063 59731 16680 3166 -84939 13340 26367 -54483 -46131 3683 -884 -75099
16974g5099j13470j07179J3363P6708R6332O6087Q3131J2043r0268j14551L6793
$$ -75099 -188569 -295748 -282385 -205677 -109345 -43258 39873 51916 -38352 -152903 -116110
16963a16110J9390q88o2188M8310K9882l9088P9530m3493j218L224j0753K4471
$$ -116110 -96720 -97608 -159796 -111486 -81604 -120692 -41162 -84655 -85873 -82649 -93402 -68931
16951f8931K0621L916l0953m296J01080p5675n0024N1504P1344q5767l7094N3179
$$ -68931 -48310 -44394 -75347 -79643 21437 -54238 -104262 -52758 18586 -67181 -104275 -51096
16939e1096J3645n958P5060L7428n3594L3828L7764l2129j33541p6412O6669J2088
$$ -51096 -37451 -43409 31651 69079 15485 49313 87077 54948 -78593 -155005 -88336 -76248
16927g6248O2180P9336R0304L5758L7592Q425m3306l2088j7375m4053j40334j4630
$$ -76248 -14068 65268 155572 191330 228922 237347 194041 161953 144578 100525 -39809 -54439
16915e4439k3258P4032J5432n6061r2392l0190n5819K3813N519N3190O1474K8689
$$ -54439 -77697 -3665 11767 -44294 -136686 -166876 -222695 -198882 -193363 -140173 -78699 -50010
16903e0010Q9383J19893k5943p2589J9528L0559k4092k0356o8759N5281K8562
$$ -50010 39373 159266 133323 60734 80262 110821 86729 66373 -2386 52895 81457
16892H1457o2182L3565K80L7667n7087J256J5629Q7385K5461R355o4354j45930
$$ 81457 19275 52840 53120 90787 33700 34956 50585 137970 163431 172786 108432 -37498
16880c7498l19O4100O1314o8246k5101j39275P0475J24683J0820p6043J358L6628
$$ -37498 -37817 26283 87597 19351 -5750 -145025 -74550 50133 60953 -15090 -13732 22896
16868B2896k9493O49M9181k2134j37560o9647J02283N6164R1815K4380L8051r1236
$$ 22896 -6597 -5948 43233 21099 -116461 -186108 -83825 -27661 64154 88534 126585 35349
16856C5349j99066o5792k4662p857J7621j962m3369O5009P5518M3005o4332j7027
$$ 35349 -163717 -229509 -254171 -262028 -244407 -246369 -289738 -224729 -149211 -106206 -170538 -187565
16844a87565P0108Q26q3828K4785J8591K5532L3475J78766K7814j05199o2744
$$ -187565 -117457 -116631 -200459 -175674 -157083 -131551 -98076 80690 108504 3305 -59439
16833e9439j14496K2495K9195P639M7937L8763P2364O6099j17736j04170O0277
$$ -59439 -173935 -151440 -122245 -114606 -66669 -27906 44458 110557 -7179 -111349 -51072
16822e1072P9649j9726m3670K5616n3643j03380l3682O9209o5992l0307N2241
$$ -51072 28577 8851 -34819 -9203 -62846 -166226 -199908 -130699 -196691 -226998 -174757
16811a74757J23495m150k8530L5296O5040O154N2345p4398j1832P7812P3973j8468
$$ -174757 -51262 -55412 -83942 -48646 16394 22548 74893 495 -11337 66475 140448 121980
16799A21980J5970m5063j68447K2847j6013K0105Q8109l1439n3433L606j2935
$$ 121980 137950 92887 -75560 -52713 -68726 -48621 39488 8049 -45384 -41778 -54713
16788e4713M2328J6091K8229N3973l3549j11936q5592O3185k2608J8936J18745
$$ -54713 -12385 3706 31935 85908 52359 -59577 -145169 -81984 -104592 -85656 33089
16777C3089N4431l1835o7348k2296O640n3250J64990P5302o5883o7382j66369
$$ 33089 87520 55685 -11663 -33959 -27319 -80569 84421 159723 93840 26458 -139911
16766a39911q400K7068J2145P2328L5353m6424j8600j44970K4653J11926J7138
$$ -139911 -148311 -121243 -109098 -36770 -1417 -47841 -66441 -211411 -186758 -74832 -57694
16755e7694j0720q889n1097J435j2863R8368M8716p6879j46258N3494M2498j5293
$$ -57694 -68414 -77303 -128400 -126965 -139828 -41460 7256 -69623 -215881 -162387 -119889 -135182
16743a35182O6043P8293k82598J9022K65752K9071o3259j4611p2962k2259K2452
$$ -135182 -69139 9154 -273444 -254422 11330 40401 -22858 -37469 -110431 -132690 -110238
16732a10238l1358K7357K0757j2574P1000k2477N9017P696O4863l2192q8420o5953
$$ -110238 -141596 -114239 -93482 -106056 -35056 -57533 1484 9180 74043 41851 -46569 -112522
16720a12522k7979J0401N7909M3549P9103m6645J2263J0733n6801M1577N5909
$$ -112522 -140501 -130100 -72191 -28642 50461 3816 16079 26812 -29989 11588 67497
16709F7497q4008m4754M2202L9095R3180L7553j34220J4931O11m8652N261k1302
$$ 67497 -16511 -61265 -19063 20032 113212 150765 16545 31476 32087 -16565 -11304 -32606
16697c2606l7306O23l6395k8615L3935O5423K1418p3457r5507K388p885L4887
$$ -32606 -69912 -69289 -105684 -134299 -100364 -34941 -13523 -86980 -182487 -180099 -187984 -153097
16685a53097j5466Q036J10325P0124J20214P2116L275j70400j15646m5987P5075
$$ -153097 -168563 -160527 -50202 19922 140136 212252 215527 45127 -70519 -116506 -41431
16674d1431Q5915j9706k5399k6568j29855P348k5882O196M5229O7419R0877M295
$$ -41431 44484 24778 -621 -27189 -157044 -149696 -175578 -169382 -124153 -56734 34143 38438
16662C8438M27M7167L1444p2327r207Q0814m9121j7565n0336k6999p6028n216
$$ 38438 38865 86032 117476 45149 35942 116756 67635 50070 -266 -27265 -103293 -108509
16650a08509P8124L4687J06065K7616m6806j00766n0895k6081K5008M3255N0615
$$ -108509 -30385 4302 110367 137983 91177 -9589 -60484 -86565 -61557 -18302 32313
16639C2313p0506n6679q3489L3048M6746J6365L3611K8158O1169n6574r9608K9042
$$ 32313 -38193 -94872 -178361 -145313 -98567 -82202 -48591 -20433 40736 -15838 -115446 -86404
16627h6404J3315k7152Q8956N1153k24k5798K1556k7168o9315J3362j4059P7284
$$ -86404 -73089 -100241 -11285 39868 39644 13846 35402 8234 -61081 -47719 -61778 15506
16615A5506M6916m3630o9634l6864M4248J21555l2840l2362O340L6467r02o9617
$$ 15506 62422 18792 -50842 -87706 -43458 78097 45257 12895 19235 55702 54800 -14817
16603a4817N1260o1082j5952n4326p3220j2802J36048M1932j0285K8938l4249
$$ -14817 36443 -24639 -40591 -94917 -168137 -180939 -44891 -2959 -13244 15694 -18555
16592a8555q7957J8266J47960O9795j43124p8699p4814J10122L4667q9528r2981
$$ -18555 -106512 -88246 59714 129509 -13615 -92314 -167128 -57006 -22339 -111867 -204848
16581b04848n2090J02883O1287q056o679N4168K8135o9709n3014q3249j01730
$$ -204848 -256938 -154055 -92768 -100824 -107503 -53335 -25200 -94909 -147923 -231172 -332902
16570c32902N422R1984J05511J55878J4298j58329m0797l2177J8266R3383J59300
$$ -332902 -327480 -235496 -129985 25893 40191 -118138 -158935 -191112 -172846 -79463 79837
16559G9837L1091o3177j33376o1347O030l1533Q6181Q9724J3637M3458M8089r0481
$$ 79837 110928 47751 -85625 -146972 -140942 -172475 -86294 3430 17067 60525 108614 18133
16547A8133p3081O3069k3437j06090j05554N8174O7258m6661K6361j8460Q2712
$$ 18133 -54948 8121 -15316 -121406 -226960 -168786 -101528 -148189 -121828 -140288 -57576
16536e7576j0040n029O1134n9310n2979j9805p007k6934K3867M8101R1609M248
$$ -57576 -67616 -72645 -11511 -70821 -123800 -143605 -150612 -177546 -153679 -105578 -13969 -9721
16524i721j26116l5617J25370O3001j03967k2134P0868J9471j8375j5915o2861
$$ -9721 -135837 -171454 -46084 16917 -87050 -109184 -38316 -18845 -37220 -53135 -115996
16513a15996L5746Q4372m8911j21544R8220J14074j1367q3485l0403P6088J11531
$$ -115996 -80250 4122 -44789 -166333 -68113 45961 34594 -48891 -79294 -3206 108325
16502A08325K4193k8239j03210p6780O856m5571n0546P276P6602N9718J02686
$$ 108325 132518 104279 1069 -75711 -68855 -114426 -164972 -157696 -81094 -21376 81310
16491H1310k1554j01654j3937q416P6727N0379O33J0493M0776Q2575p7263k23805
$$ 81310 59756 -41898 -55835 -64251 12476 62855 63488 73981 114757 197332 120069 -103736
16479a03736o3054k352O563J900l8549P297J73720j1465q4367k604O6830m2110
$$ -103736 -166790 -169142 -162579 -160679 -199228 -191931 -18211 -29676 -114043 -116647 -49817 -91927
16467i1927n067N618k158P6185R0756k2888j89288j65055J21603R9755k3162n8202
$$ -91927 -96994 -91376 -93534 -17349 73407 50519 -138769 -303824 -182221 -82466 -105628 -163830
16455a63830p1365M6602J20248M2821j14316N0944J72166Q0r9144r7650j7369
$$ -163830 -235195 -188593 -68345 -25524 -139840 -88896 83270 83350 -15794 -113444 -130813
16444a30813N1451l0384o1745J6340K6925J4120M641K7151q088Q8676L3110l0780
$$ -130813 -79362 -109746 -171491 -155151 -128226 -114106 -109465 -82314 -90402 -1726 31384 604
16432F04R9027j9791j67930l5814k935Q1446L7874m292j0578J38262J11083P7042
$$ 604 99631 79840 -88090 -123904 -126839 -45393 -7519 -11811 -22389 115873 226956 303998
16420C03998j43153j86107j09839J614J07907N4854K736q0552j66387l3091L7357
$$ 303998 160845 -25262 -135101 -133487 -25580 29274 32010 -48542 -214929 -248020 -210663
16409b10663J27938J25053o3441l4523N0790M2324o1377j61032r4834N2471N3409
$$ -210663 -82725 42328 -21113 -55636 -4846 37478 -23899 -184931 -279765 -227294 -173885
16398a73885N6709K6570P7483K4703q5274m8816R666l3304L9900Q2104O0725R1430
$$ -173885 -117176 -90606 -13123 11580 -73694 -122510 -112844 -146148 -106248 -24144 36581 128011
16386A28011o1879j12304j6910m7499l6066p4582N1515O3846O0693J1263k9150
$$ 128011 66132 -46172 -63082 -110581 -146647 -221229 -169714 -105868 -45175 -33912 -63062
16375f3062J4796L0837O799r8676n2896Q5564J9534O5269N4257O1748K6141n5710
$$ -63062 -48266 -17429 -10630 -109306 -162202 -76638 -57104 8165 62422 124170 150311 94601
16363I4601p5593j7906j5064j3028K0832R0940l7450j62510j10029J04307R156
$$ 94601 19008 1102 -13962 -26990 -6158 84782 47332 -115178 -225207 -120900 -111744
16352a11744O4629J4886O1416L4155k0484k8958j7453j531K2834j3921p0856O1075
$$ -111744 -47115 -32229 29187 63342 42858 13900 -3553 -5084 17750 3829 -67027 -5952
16340e952J4964n4112j1164k6551M1783J0112j59855j48829Q0286J26893l8271
$$ -5952 9012 -45100 -56264 -82815 -41032 -30920 -190775 -339604 -259318 -132425 -170696
16329a70696o4016M1697Q0058M9804M0189l2520m2010N3342l0602L693O4960M0837
$$ -170696 -234712 -193015 -112957 -63153 -22964 -55484 -97494 -44152 -74754 -71061 -6101 34736
16317C4736r6008k3804k7128J1276J3635Q9596Q5583j6617l0962K9693O663j82922
$$ 34736 -61272 -85076 -112204 -100928 -87293 2303 87886 71269 40307 70000 76663 -106259
16305a06259K1839L6429k3173R7134J4787j4658L751N0253l1834M109q701n0139
$$ -106259 -84420 -47991 -71164 25970 40757 26099 29850 80103 48269 52378 43677 -6462
16293f462k28O400k3581o9036j9911l9210K199l172J39240N4974o6050q3950l7942
$$ -6462 -6690 -290 -23871 -92907 -112818 -152028 -149829 -153001 -13761 41213 -24837 -108787 -146729
16280a46729j01182J4680M4457R7872P3746M8059J0302j04528l7401l4255J9076
$$ -146729 -247911 -233231 -188774 -90902 -17156 30903 41205 -63323 -100724 -134979 -115903
16269a15903K2270J5313J6596j124M3053N2096R8282K5285o2364p7294j24450
$$ -115903 -93633 -78320 -61724 -62848 -19795 32301 130583 155868 93504 16210 -108240
16258a08240j4931P027J57079J9642k8175j5347l9879l6486m2120L999o3316J13682
$$ -108240 -123171 -116144 40935 60577 32402 17055 -22824 -59310 -101430 -97431 -160747 -47065
16246d7065m393o8906n0888l3532l5353J12789R2131L4268L981j0745j10527M1918
$$ -47065 -51458 -120364 -171252 -204784 -240137 -127348 -35217 -949 3032 -7713 -118240 -76322
16234g6322O6972k8085k5472K5645n5312n8108N0690p8446M4794M8547L2428M273
$$ -76322 -9350 -37435 -62907 -37262 -92574 -150682 -99992 -178438 -133644 -85097 -52669 -48396
16222d8396j29584k3178J04810L1993M5661L8723p2209o7028O4440n5428o4560
$$ -48396 -177980 -201158 -96348 -64355 -18694 20029 -52180 -119208 -54768 -110196 -174756
16211a74756R3472P4392o8111R459J12650J19380K8511l4314j05997q7768m4009
$$ -174756 -81284 -6892 -75003 -65544 47106 166486 194997 160683 54686 -33082 -77091
16200g7091K0303N7454j912j8496L6629J6283m4092j9622Q6227n1732l2221K7609
$$ -77091 -56788 666 -1246 -19742 16887 33170 -10922 -30544 55683 3951 -28270 -661
16188f61l7780J606j1864k4966P998N6867L4752l3942J19400J13989q2100j63824
$$ -661 -38441 -36835 -48699 -73665 -65667 -8800 25952 -7990 111410 225399 143299 -20525
16176b0525n7399l1530M6640q372n3736R631N5103j6110j9515p3240J03330M0674
$$ -20525 -77924 -109454 -62814 -71186 -124922 -115291 -60188 -76298 -95813 -169053 -65723 -25049
16164b5049j95534l5859l7571M4625J0122P1121R3608M8621J5252R2069j490j02146
$$ -25049 -220583 -256442 -294013 -249388 -239266 -168145 -74537 -25916 -10664 81405 79915 -22231
16152b2231j03373p174k3545P7910L922K4409J51739J10139n9388j18926o199
$$ -22231 -125604 -132778 -156323 -78413 -74491 -50082 101657 211796 152408 33482 27283
16141B7283l4738p5245k0932j4764p5801O109L5566l528J9213K7757n8484l4670
$$ 27283 -7455 -82700 -103632 -118396 -194197 -188088 -152522 -156050 -136837 -109080 -167564 -202234
16129b02234P3840O1370r6150j8680P8063L0981P8198q3385p9179j3335M9714
$$ -202234 -128394 -67024 -163174 -181854 -103791 -72810 5388 -77997 -157176 -170511 -120797
16118a20797O9937l7620P8449L1937J171p9721j4813J6573L3320m7307L0586R3851
$$ -120797 -50860 -88480 -10031 21906 23077 -56644 -71457 -54884 -21564 -68871 -38285 55566
16106E5566p835n7703j42197L6515n8k2204J12394P940r4223J8903J72582R5092
$$ 55566 47731 -9972 -152169 -115654 -115712 -137916 -25522 -17582 -111805 -92902 79680 174772
16094A74772n0915k3511K9058k7861l5431l685r718L2135j6330p2757O1280J15084
$$ 174772 123857 100346 129404 101543 66112 62427 52709 84844 68514 -4243 57037 172121
16082A72121m0253M0845K2058J2150p2267L5173k9018J4301K1847l3821M0618
$$ 172121 131868 172713 194771 206921 134654 169827 140809 155110 176957 143136 183754
16071A83754N3r8307q8975o3668M9549K462k5844J4748N7046J1130P0450J2670
$$ 183754 183807 85500 -3475 -67143 -17594 -15132 -40976 -26228 30818 41948 112398 125068
16059A25068L5521j33819j49560l2407P5930K856p4996M0158O8376J35083J7158
$$ 125068 160589 26770 -122790 -155197 -79267 -76411 -151407 -111249 -42873 92210 109368
16048A09368j203J4444k0984L8608N7055r1529n1915N0811n4335o2004O6630L3325
$$ 109368 108165 122609 101625 140233 197288 105759 53844 104655 50320 -11684 54946 88271
16036H8271j7194j27272K175O292q7942p3823J18123q968o9316O6678L9669l1853
$$ 88271 71077 -56195 -54020 -47728 -135670 -209493 -91370 -100338 -169654 -102976 -63307 -95160
16024i5160n2390r066P0311M1998n285r7888J13599O4002m0790q004j29353k111
$$ -95160 -147550 -156616 -86305 -44307 -49592 -147480 -33881 30121 -10669 -18673 -148026 -150137
16012a50137P2688l4538R73K903M0644R1205M2884L8784L1558r32j08099m1262
$$ -150137 -77449 -111987 -111014 -108111 -67467 23738 66622 105406 136964 136032 27933 -13329
16000a3329j50251l9782K6106J36449m3921k0947Q7636L8132l4291k4089K6484
$$ -13329 -163580 -203362 -177256 -40807 -84728 -105675 -18039 20093 -14198 -38287 -11803
15989a1803n1626J6277k7663n896p582q989N702k7222j4289M7443l8881p909n6744
$$ -11803 -63429 -47152 -74815 -80711 -88293 -97282 -91580 -118802 -133091 -85648 -124529 -132438 -189182
15976a89182J7384L8133Q7018J8664q314O5531l9569J3956O2352k8759m6413O1678
$$ -189182 -171798 -133665 -46647 -27983 -36297 29234 -10335 3621 65973 37214 -9199 52479
15964E2479K8921p9613m6829k1131L8201O2858L7969m2073m6291M4498M3086O138
$$ 52479 81400 1787 -45042 -66173 -27972 34886 72855 30782 -15509 28989 72075 78213
15952G8213o9288k3861m0448l8153p821j5445M2881n6987m4738j0720K2386j017
$$ 78213 8925 -14936 -55384 -93537 -101358 -116803 -73922 -130909 -175647 -186367 -163981 -164998
15940a64998J00889J23856N5675m9007j06412L907K8298j39379l0726J67192j9931
$$ -164998 -64109 59747 115422 66415 -39997 -36090 -7792 -147171 -177897 -10705 -30636
15929c0636p4511O07L0005k0250Q1653q620m4155j3720l7568M2731K7020o9983
$$ -30636 -105147 -104540 -74535 -94785 -13132 -21752 -65907 -79627 -117195 -74464 -47444 -117427
15917a17427J3269j0912K867j8314Q18L0789L5359M4067j0350J0155j46126l8463
$$ -117427 -104158 -115070 -112203 -130517 -129699 -98910 -63551 -19484 -29834 -19679 -165805 -204268
15905b04268R8235o627n1121J08208P042j8905o0052o8899m5144J58823Q2722
$$ -204268 -106033 -112660 -163781 -55573 -48531 -67436 -127488 -196387 -241531 -82708 14
15894A4m6582n400N0022Q5N0841M2254j7449j62284j02188O0685K1331O0858q039
$$ 14 -46568 -51968 -1946 -1861 48980 91234 73785 -88499 -190687 -130002 -108671 -47813 -55852
15881e5852J4712j0761L0099q6378n9309k5031J60660l2286K1063M2379k9135
$$ -55852 -41140 -51901 -21802 -108180 -167489 -192520 -31860 -64146 -43083 -704 -29839
15870b9839J02732R308j54965l3163N7125J04214r0791l8275j2344p2963k7815
$$ -29839 72893 82201 -72764 -105927 -48802 55412 -35379 -73654 -85998 -158961 -186776
15859a86776J76173L6960r7468m4622R8414n4007O6598k2011k5396k0176J21481
$$ -186776 -10603 26357 -71111 -115733 -17319 -71326 -4728 -26739 -52135 -72311 49170
15848D9170L8838P6043p8561p0265o846n1259l4521o2477K0194M5110R7891j6482
$$ 49170 88008 164051 85490 15225 8379 -42880 -77401 -139878 -119684 -74574 23317 6835
15836F835K869q9071j0268J07948l0498o0445k9355l9909j601M2069q834o1151
$$ 6835 9704 -79367 -89635 18313 -12185 -72630 -101985 -141894 -143495 -101426 -110260 -171411
15824a71411j2824k4195Q8242J35022O2941L065j89629m4395N7124m0988r5971
$$ -171411 -184235 -208430 -120188 14834 77775 80840 -108789 -153184 -96060 -137048 -233019
15813b33019m8926J1982O8185O1889o2588K4258O792N1460K0542R5105m4672O9032
$$ -233019 -281945 -269963 -201778 -139889 -202477 -178219 -171427 -119967 -99425 -4320 -48992 20040
15801B0040Q1594J9972l5737m9468M999k0522o0531J02811O9137r1151j15501
$$ 20040 101634 121606 85869 36401 41400 20878 -39653 63158 132295 41144 -74357
15790g4357q5283O1520P8979n2482j32021n186Q2622Q0887M6483k2517j1339k8969
$$ -74357 -159640 -98120 -19141 -71623 -203644 -208830 -126208 -45321 1162 -21355 -32694 -61663
15778f1663L9617J5q09k922R4689n3606r8867L5230O1866R4332R2545n6694j15309
$$ -61663 -22046 -22031 -22840 -25762 68927 15321 -83546 -48316 13550 107882 200427 143733 28424
15765B8424j30994l8109m6816N3006j6512m2708J403P5307M1827k9331K7530P4978
$$ 28424 -102570 -140679 -187495 -134489 -151001 -193709 -192306 -116999 -75172 -104503 -76973 -1995
15753a995q16q5470m0383l6339O4402j7289R6282J55639M6232n0672j12209j10003
$$ -1995 -2811 -88281 -128664 -165003 -100601 -117890 -21608 134031 180263 129591 17382 -92621
15741i2621m929M9963k9864P5841K2688K1155p4065j14433J180p0752J2062L3066
$$ -92621 -97550 -47587 -77451 -1610 21078 42233 -31832 -146265 -145085 -215837 -203775 -170709
15729a70709K3798J5816Q9632Q991o269p8453n7411J14890N4600K7238j6166j6729
$$ -170709 -146911 -131095 -41463 -32472 -38741 -117194 -174605 -59715 -5115 22123 5957 -10772
15717a0772k9916l0435l0405m7775J14743Q4401p6591q1793J3538K4295k4573
$$ -10772 -40688 -71123 -101528 -149303 -34560 49841 -26750 -108543 -95005 -70710 -95283
15706i5283L1085J09780o4338l1017R7776k3485r639o1127p9393L0573O3084M1598
$$ -95283 -64198 45582 -18756 -49773 48003 24518 14879 -46248 -125641 -95068 -31984 9614
15694I614n1831q7364Q930L9836R3320O5280L1516L083j23796m9282J3936m2398
$$ 9614 -42217 -129581 -120651 -80815 12505 77785 109301 112384 -11412 -60694 -46758 -89156
15682h9156N5858O7330R4450p6441p7403L7898K5356l4557o3793L8116J7532N4691
$$ -89156 -33298 34032 128482 52041 -25362 12536 37892 3335 -60458 -22342 -4810 49881
15670D9881M6325L5464q396l6786r7264O357K2118l48K3826j08808q1952N1178
$$ 49881 96206 131670 123274 86488 -10776 -4419 17699 17351 41177 -67631 -149583 -98405
15658i8405K1034N283k5514r8029o2073O959o793Q7291O1979O8758J44549K9803
$$ -98405 -77371 -72088 -97602 -195631 -257704 -250745 -257538 -170247 -108268 -39510 105039 134842
15646A34842J3025j00149m2673J9562j8933j7378M0705L1806k0096n0402Q927
$$ 134842 147867 47718 5045 24607 5674 -11704 29001 60807 40711 -9691 -764
15635g64n2842k3107N6622P6745J03718j04265p0441O4377r814p2982q765L0120
$$ -764 -53606 -76713 -20091 56654 160372 56107 -14334 50043 40229 -32753 -41518 -11398
15623a1398n3527M7661l8972k5280N6556n370p7951j43130m0374P8831J27121
$$ -11398 -64925 -17264 -56236 -81516 -24960 -30330 -108281 -251411 -291785 -212954 -85833
15612h5833O9812j7428j15973k068k0069K762J8915J0269p5166m058P7387M24
$$ -85833 -16021 -33449 -149422 -151490 -171559 -168797 -149882 -139613 -214779 -218837 -141450 -141026
15600a41026M162J29904O3010m1836j30020j2406O7611j7459L9198p4691r2764
$$ -141026 -136864 -6960 56050 14214 -115806 -128212 -60601 -78060 -38862 -113553 -206317
15589b06317M3267J10217M8790Q9185K5990N1803M799j71299j11238M7864M4567
$$ -206317 -163050 -52833 -4043 85142 111132 162935 167734 -3565 -114803 -66939 -22372
15578b2372m6691O7489L2454N6471k9220k5527k1808n7817j7992M8762m3168j67751
$$ -22372 -69063 -1574 30880 87351 58131 32604 10796 -47021 -65013 -16251 -59419 -227170
15566b27170n4587O8081m853N4112j9884k0655O4794M9794l4000j03961q3219
$$ -227170 -281757 -213676 -218529 -164417 -184301 -204956 -140162 -90368 -124368 -228329 -311548
15555c11548N3069J02260M8130p3843J9736K9429N8475J6830n8679m7505m9857
$$ -311548 -258479 -156219 -108089 -181932 -162196 -132767 -74292 -57462 -116141 -163646 -213503
15544b13503k253o619j980K2799J0694R8033k48L8531k9062O5486l4311Q1971
$$ -213503 -215756 -222375 -224355 -201556 -190862 -92829 -93077 -54546 -83608 -18122 -52433 29538
15532B9538N6811K0072m951J23888o1347j29191j17214O9587J21897J239p3232
$$ 29538 86349 106421 101470 225358 164011 34820 -82394 -12807 109090 110329 37097
15521C7097Q97q9485k1309k1236K0579K43L4558n316J4272R7529K0009j38582
$$ 37097 37994 -51491 -72800 -94036 -73457 -73214 -38656 -43972 -29700 67829 87838 -50744
15509e0744r3900J51570L6860m960j6794k6769l7018j02992m673L7448j8875N897
$$ -50744 -144644 6926 43786 38826 22032 -4737 -41755 -144747 -149420 -111972 -130847 -124950
15497a24950Q6364N1045O7176j3173j02924K9719O6013o7208k2309O1967M2785
$$ -124950 -38586 12459 79635 66462 -36462 -6743 59270 -7938 -30247 31720 74505
15486G4505q5002J8439J512M8094M6444p4292L8975j2184l8464j6575L375L2994
$$ 74505 -10497 7942 9454 57548 103992 29700 68675 56491 18027 1452 4827 37821
15474C7821n366J7552q6554r823j16378j6910j3493l9078J23583j4691j19475
$$ 37821 32455 50007 -36547 -46370 -162748 -179658 -193151 -232229 -108646 -123337 -242812
15463b42812k8878l0593p170J50521N5182J6460r6487k8718Q9711N8927O9320
$$ -242812 -271690 -302283 -309453 -158932 -103750 -87290 -183777 -212495 -122784 -63857 5463
15452E463m8563j06355O1992r250P6629Q2049l6954o6350p0029J0020J03754M6083
$$ 5463 -43100 -149455 -87463 -96713 -20084 61965 25011 -41339 -111368 -101348 2406 48489
15440D8489q2565j01095J00932Q785p2766M7450P2105J5990M2181p1462p0594
$$ 48489 -34076 -135171 -34239 -25454 -98220 -50770 21335 37325 79506 8044 -62550
15429f2550j2582n873M5103M6302p6720N0371K8409J05407L7158r0712q9550Q690
$$ -62550 -75132 -81005 -35902 10400 -66320 -15949 12460 117867 155025 64313 -25237 -16547
15417a6547j518l879K1219r2883n5040k2079O7220k1153J4837R8069R4705m1611
$$ -16547 -18065 -21944 -725 -93608 -148648 -170727 -103507 -124660 -109823 -11754 82951 41340
15405D1340j35190j32173o939P7014O6402J42295p8219j54648n0404M0655Q3115
$$ 41340 -93850 -226023 -232962 -155948 -89546 52749 -25470 -180118 -230522 -189867 -106752
15394a06752j3645J23631l6495p5749l3612O8775k7367j08742R3349j984p761
$$ -106752 -120397 3234 -33261 -109010 -142622 -73847 -101214 -209956 -116607 -118591 -126352
15383a26352R9190o927J5719q4687p3112K0394Q8931J9787p2247Q5541Q7220k4738
$$ -126352 -27162 -34089 -18370 -103057 -176169 -155775 -66844 -47057 -119304 -33763 53457 28719
15371B8719n5669j00291J09096J06818p1471j0599L0059n7903l7054p249j0288
$$ 28719 -26950 -127241 -18145 88673 17202 6603 36662 -21241 -58295 -65544 -75832
15360g5832j7103k6329J3827K9325k7234m573j7500N5535Q6035N5128j3535p093
$$ -75832 -92935 -119264 -105437 -76112 -103346 -107919 -125419 -69884 16151 71279 57744 50651
15348E0651J6269n1487L049j1462n9099J5201L0956m8372Q3512J17456J00236
$$ 50651 66920 15433 18482 7020 -52079 -36878 -5922 -54294 29218 146674 246910
15337B46910m1204j00007j63642J2787O6761k0640o0870L3248N3285p6488r8360
$$ 246910 205706 105699 -57943 -45156 21605 965 -59905 -26657 26628 -49860 -148220
15326a48220n0124n4467O0602J15395j6853o5530O9914m5584R2632J18665o4005
$$ -148220 -198344 -252811 -192209 -76814 -93667 -159197 -89283 -134867 -42235 76430 12425
15315A2425o3214L7120N4548l3208j02228q555k0212o192k4518m6706k425O6010
$$ 12425 -50789 -13669 40879 7671 -94557 -103112 -123324 -129516 -154034 -200740 -203165 -137155
15303a37155N409q033O6504Q7149J2417L0355j46682m7130P9108J30136L4852
$$ -137155 -131746 -139779 -73275 13874 26291 56646 -90036 -137166 -58058 72078 106930
15292A06930p4818k4594N2604Q7752j4563j5955Q493K7881L972l4718J27450M0664
$$ 106930 32112 7518 60122 147874 133311 117356 125849 153730 157702 122984 250434 291098
15280B91098j24822j14874M1843m1285M4129r1569p9572R731o4899J6152Q4229
$$ 291098 166276 51402 93245 51960 96089 4520 -75052 -65321 -130220 -114068 -29839
15269b9839l3920N296J0264j66394o2749J83450K3854p3847J2392L9884L0872
$$ -29839 -63759 -58463 -48199 -214593 -277342 -93892 -70038 -143885 -131493 -91609 -60737
15258f0737J7749L5104R1596O42m2429p8141p4520k6862Q4013n6468J25610J19712
$$ -60737 -42988 -7884 83712 84354 41925 -36216 -110736 -137598 -53585 -110053 15557 135269
15246A35269J0456K0649m8443j11683j00878O867m8529N466L4963L0735L2095
$$ 135269 145725 166374 117931 6248 -94630 -87763 -136292 -130826 -95863 -65128 -33033
15235c3033j3768Q409k4377p2189M2201J15324n9943j1066O8134J9008o2213r5518
$$ -33033 -46801 -38392 -62769 -134958 -92757 22567 -37376 -48442 19692 38700 -23513 -119031
15223a19031M2903Q6364K7392r250j8291n1141k1363L2702J15269J23950n1872
$$ -119031 -76128 10236 37628 28378 10087 -41054 -62417 -29715 85554 209504 157632
15212A57632j04720J03265O5170m6520K0262p8719j07075L876L0620J921n5964
$$ 157632 52912 156177 221347 174827 195089 116370 9295 13171 43791 45712 -10252
15201a0252j06697m0439J18220J54794j01314j45850l9508K0907l7568J7380M7520
$$ -10252 -116949 -157388 -39168 115626 14312 -131538 -171046 -150139 -187707 -170327 -122807
15190a22807j8156O5446Q3417P6304O6267j25475j37258m0873J9167l2285P9224
$$ -122807 -140963 -75517 7900 84204 150471 24996 -112262 -153135 -133968 -166253 -87029
15179h7029O9447Q7712M801J4672l7008p6948R5086k9915J3995L1725J3076q2930
$$ -87029 -17582 70130 74931 89603 52595 -24353 70733 40818 54813 86538 99614 16684
15167A6684j5817L8802j01651m2666J21454P7804o2899p1557m1811m9430q9654
$$ 16684 867 39669 -61982 -104648 16806 94610 31711 -39846 -81657 -131087 -220741
15156b20741l764J771N0477N6042N1697K8786j3934J3582K2588Q3758K5677q0911
$$ -220741 -224505 -222734 -172257 -116215 -64518 -35732 -49666 -36084 -13496 70262 95939 15028
15144A5028j44908K124m1960m1818K0466k9400p7349M0589l1926Q9222J04850
$$ 15028 -129880 -127756 -169716 -211534 -191068 -220468 -297817 -257228 -289154 -199932 -95082
15133i5082N5722p1257N0914R9674r8957j20085m3860K7843P3191J6316J7053
$$ -95082 -39360 -110617 -59703 39971 -58986 -179071 -222931 -195088 -121897 -105581 -88528
15122h8528R0129p8859Q5252Q5612m0375j24446o4761n5466K529M698L9128J2664
$$ -88528 1601 -77258 7994 93606 53231 -71215 -135976 -191442 -188913 -184215 -145087 -132423
15110a32423j25198o2229N0580Q4421K5661P700R9915P8242j7794o2424Q281k8910
$$ -132423 -257621 -319850 -269270 -184849 -159188 -151488 -51573 26669 8875 -53549 -45268 -74178
15098g4178j4816n1927o131L1897L8154m5817O2717J09649K7419M108j14834o7680
$$ -74178 -88994 -140921 -147052 -115155 -77001 -122818 -60101 49548 76967 81075 -33759 -101439
15086a01439O7675Q342M0171J2318l2252o0532j358m7238m5257N8280N9890j4018
$$ -101439 -33764 -25422 14749 27067 -5185 -65717 -67075 -114313 -159570 -101290 -41400 -55418
15074e5418k1222J02370l202m4772p5700l0970j9348l7472P2398O0021P818Q046
$$ -55418 -76640 25730 22528 -22244 -97944 -128914 -148262 -185734 -113336 -53315 -45497 -37451
15062c7451j3264p0097q5004P0712J39564P2153l9714j24832j28778o8219j6179
$$ -37451 -50715 -120812 -205816 -135104 4460 76613 36899 -87933 -216711 -284930 -301109
15051c01109P5236J48260J05257k3632j7680k4120N1373l1781n8703J08183N9209
$$ -301109 -225873 -77613 27644 4012 -13668 -37788 13585 -18196 -76899 31284 90493
15040I0493k2240q3913m2374j2679M5232k8376J66684Q9254n6511j48036q8687
$$ 90493 68253 -15660 -58034 -70713 -25481 -53857 112827 202081 145570 -2466 -91153
15029i1153n2191m3721j476J33885O9231k3456j4334l4062k5473n2472m6359O3558
$$ -91153 -143344 -187065 -188541 -54656 14575 -8881 -23215 -57277 -82750 -135222 -181581 -118023
15017a18023O5452J13193L2670o8091j0203m6851q3929M4166J5773J3006N1415
$$ -118023 -52571 60622 93292 25201 14998 -31853 -115782 -71616 -55843 -42837 8578
15006H578K9305N957p873j6970k1965k8519n698O8182N7783k7632O2407M2831
$$ 8578 37883 43840 35967 18997 -2968 -31487 -37185 30997 88780 61148 123555 166386
14994A66386m829r5266j13489o8642q9615L11Q7040O6161j23425o8133R0247R2207
$$ 166386 161557 66291 -47198 -115840 -205455 -205144 -118104 -51943 -175368 -243501 -153254 -61047
14982f1047L5043j28830j08195N8793Q0430Q8508k0218M0383k3994j0545o3104
$$ -61047 -26004 -154834 -263029 -204236 -123806 -35298 -55516 -15133 -39127 -49672 -112776
14971a12776L1336J3434M1094J53567l6255j23822r2271N1316J10331K6211o2696
$$ -112776 -81440 -68006 -26912 126655 90400 -33422 -125693 -74377 35954 62165 -531
14960e31r600M8500K2601m2745j05571j05171o9615j7627J12828M6116o4658q32
$$ -531 -10131 38369 60970 18225 -87346 -192517 -262132 -279759 -166931 -120815 -185473 -186305
14948a86305l778Q7319M0472M2655j23776q5003l2928P4097m9388j35988m5578
$$ -186305 -190083 -102764 -62292 -19637 -143413 -228416 -261344 -187247 -236635 -372623 -418201
14937d18201J77389R3959j6752L2877O3075R3210r0158j16767N9112M8668O3493
$$ -418201 -240812 -146853 -163605 -130728 -67653 25557 -64601 -181368 -122256 -73588 -10095
14926a0095Q239O165n6050k2394M9562L688m7305r4237L7115m9140Q2799L3044
$$ -10095 -1856 4309 -51741 -74135 -24573 -20885 -68190 -162427 -125312 -174452 -91653 -58609
14914e8609K2999M7195j2574j27630L1866O9711L9836n0763m1268K1137M5401
$$ -58609 -35610 11585 -989 -128619 -96753 -27042 12794 -37969 -79237 -58100 -12699
14903a2699m9001n1300K5552L3016J64279J3260n7273R360r9829q2457l8544J07384
$$ -12699 -61700 -113000 -87448 -54432 109847 123107 65834 75194 -24635 -107092 -145636 -38252
14891c8252J28526P9332k3932k1844o5385j32448j00624J5875R761q694j247J09141
$$ -38252 90274 169606 145674 123830 58445 -74003 -174627 -158752 -148991 -157685 -158932 -49791
14879d9791N470M8293j7318l8443R4455J417j44274N8135Q4947j0091N188o747
$$ -49791 -44321 3972 -13346 -51789 42666 44083 -100191 -42056 42891 32800 37988 31241
14867C1241M5174j1774j02236m5975M1898O5088R259j0360L831q7281R63P4974
$$ 31241 76415 64641 -37595 -83570 -41672 23416 32675 22315 26146 -61135 -60172 14802
14855A4802J05649l9471q4967q2125o7249o2575n694N4855M0866M7738l804K9664
$$ 14802 120451 80980 -3987 -86112 -153361 -215936 -221630 -166775 -125909 -78171 -81975 -52311
14843e2311M9954j433l316J491j05969M9186M6379l0242R532n8368j060R813l8858
$$ -52311 -2357 -3790 -7106 -5615 -111584 -62398 -16019 -46261 -36729 -95097 -96157 -86344 -125202
14830a25202q6787J537P1413n0268m2936J5516R7344j9199K3466P6436m717m9334
$$ -125202 -211989 -210452 -139039 -189307 -232243 -216727 -119383 -138582 -115116 -38680 -43397 -92731
14818i2731j9538P6110J28235p2677j56196p511j37726q2031J94911J35694J03028
$$ -92731 -112269 -36159 92076 19399 -136797 -144308 -282034 -364065 -169154 -33460 69568
14807F9568M4465n2210j65546l5783m4314N3653J829K8287o0423N449N7022L0982
$$ 69568 114033 61823 -103723 -139506 -183820 -130167 -128338 -100051 -160474 -155025 -98003 -67021
14795f7021k3233J5386p010J57514l5076n3400O5672m4483j25652j6009J3838
$$ -67021 -90254 -74868 -81878 75636 40560 -12840 52832 8349 -117303 -133312 -119474
14784a19474m7742M4852K553L2718M1684J7507n5302J5527L3134P3037j4939J4174
$$ -119474 -167216 -122364 -119811 -87093 -45409 -27902 -83204 -67677 -34543 38494 23555 37729
14772C7729o0778n2082K0300m4798j41m2450M7690N7257m8027k0433n9280L8680
$$ 37729 -23049 -75131 -54831 -99629 -99770 -142220 -94530 -37273 -85300 -105733 -165013 -126333
14760a26333j0371K394m0934j03691o3389P8584J46977J09506J3656K5703M2574
$$ -126333 -136704 -134310 -175244 -278935 -342324 -263740 -116763 -7257 6399 32102 74676
14749G4676j4521n6j17551M6770L1231n0691J3113K3048M0353m4096o7831j2116
$$ 74676 60155 60099 -57452 -10682 20549 -30142 -17029 6019 46372 2276 -65555 -77671
14737g7671M4455q233j62442L8592P3980J8209k6596k0221J6468n8249M2349o2879
$$ -77671 -33216 -41449 -203891 -165299 -91319 -73110 -99706 -119927 -103459 -161708 -119359 -182238
14725a82238o9659J77558R141q1117m62m9453M3060q9941o7613L1339P8409K7930
$$ -182238 -251897 -74339 -65198 -146315 -146777 -196230 -153170 -243111 -310724 -279385 -200976 -173046
14713a73046p5003K3669P0385L7954p8435M9352Q4904O6797Q534j1785J150L0906
$$ -173046 -248049 -224380 -153995 -116041 -194476 -145124 -60220 6577 15111 3326 4476 35382
14701C5382O0551j19451o6686m627J0974q2203p6276O4301o2939n3332J83542
$$ 35382 95933 -23518 -90204 -94831 -83857 -166060 -242336 -178035 -240974 -294306 -110764
14690a10764J30617L3785p5544j567m2930q1048K1855K6154o5169O2729R470m7909
$$ -110764 19853 53638 -21906 -23473 -66403 -147451 -125596 -99442 -164611 -101882 -92412 -140321
14678a40321L8847l988J3342l1620p0052O9664O9310j38647l049N1639k2606L1775
$$ -140321 -101474 -105462 -92120 -123740 -193792 -124128 -54818 -193465 -196514 -144875 -167481 -135706
14666a35706J09629o7555r5341j7567K8185P2544P4163L764k7365k3396M4563
$$ -135706 -26077 -93632 -188973 -206540 -178355 -105811 -31648 -27884 -55249 -78645 -34082
14655c4082J6173l677J22681P111l9743o5108p2668n929j3786O3032o1813p4423
$$ -34082 -17909 -21586 101095 108206 68463 3355 -69313 -75242 -89028 -25996 -87809 -162232
14643a62232Q2300J3052J0429n9194P101O3848l1567n9382r1662P390M7186K4391
$$ -162232 -79932 -66880 -56451 -115645 -108544 -44696 -76263 -135645 -227307 -219917 -172731 -148340
14631a48340Q0749n7813j9588Q0361J11136k4512N72J03717j21244j53007p2223
$$ -148340 -67591 -125404 -144992 -64631 46505 21993 22565 126282 5038 -147969 -220192
14620b20192k7398K6454k8967K446j3822M6827J59549P6506o8247k3062R6245
$$ -220192 -247590 -221136 -250103 -247657 -261479 -214652 -55103 21403 -46844 -69906 26339
14609B6339J08749J18601L0314j14641m4955q8555r1547j04702k994R3237l2926
$$ 26339 135088 253689 284003 169362 124407 35852 -55695 -160397 -163391 -70154 -103080
14598a03080M6877K0455k3607q7274m6907M5477J04448n1609L194L8241L3457
$$ -103080 -56203 -35748 -59355 -146629 -193536 -148059 -43611 -95220 -92026 -53785 -20328
14587b0328p4117r0414l3896J21429P6257j3103n410K4301J3067J17696M9671
$$ -20328 -94445 -184859 -218755 -97326 -21069 -34172 -39582 -15281 -2214 115482 165153
14576A65153N797o8034n2933o8721P7077L8947k1719l177M7708j25801j13381
$$ 165153 170950 102916 49983 -18738 58339 97286 75567 72390 120098 -5703 -119084
14565a19084l2024l3363R766Q9041J12244p9107n7037Q3921R2503o428m6520o9000
$$ -119084 -151108 -184471 -174705 -85664 26580 -52527 -109564 -25643 66860 60432 13912 -55088
14553e5088J05823J6412l0154m0748m7527J8936l5048l1874L8748l7628o7757
$$ -55088 50735 67147 36993 -3755 -51282 -32346 -67394 -99268 -60520 -98148 -165905
14542a65905n596m147O0658N8922k1379l4863j24364K6128J26423Q7034O0142
$$ -165905 -171501 -175648 -114990 -56068 -77447 -112310 -236674 -210546 -84123 2911 63053
14531F3053r1864q8019l5620L8092p1495J8733K8789j3054j2433m813m7709J59079
$$ 63053 -28811 -116830 -152450 -114358 -185853 -167120 -138331 -151385 -163818 -168631 -216340 -57261
14519e7261J09453M3085j05026L2853M2589l3754N886L2384m5057N9982j9972
$$ -57261 52192 95277 -9749 23104 65693 31939 37825 70209 25152 85134 65162
14508F5162n1820n897M4974L8337J5936k3947j14893L2378k3829o5611J2761M759
$$ 65162 13342 7445 52419 90756 106692 82745 -32148 230 -23599 -89210 -76449 -71690
14496g1690k7661M4769N7520O0812k4325r7668j1234L5751J9190p6782o3326J10897
$$ -71690 -99351 -54582 2938 63750 39425 -58243 -69477 -33726 -14536 -91318 -154644 -43747
14484d3747p820m2378J6055N9109M8855M1170m8723j42826j0251N1731l4848j6088
$$ -43747 -51567 -93945 -77890 -18781 30074 71244 22521 -120305 -130556 -78825 -113673 -129761
14472a29761L3699K0437k354l3189P147J08000L1351N8543l0521m5598J11266
$$ -129761 -96062 -75625 -77979 -111168 -104021 3979 35330 93873 63352 17754 129020
14461A29020k9431j23096J18744M5349N387j36084j02764o4156o7362Q1380J25479
$$ 129020 99589 -23507 95237 140586 145973 9889 -92875 -157031 -224393 -143013 -17534
14450a7534J7472j91836j25509L5899O0509M120P1285J14080P0595O031q1596
$$ -17534 -62 -191898 -317407 -281508 -220999 -216879 -145594 -31514 39081 45112 -36484
14439c6484k6313Q039j497K746O6104N3937K6470o2219j72541j15391J09712J52817
$$ -36484 -62797 -54758 -56255 -53509 12595 66532 93002 30783 -141758 -257149 -147437 5380
14427E380J271j10788m3333M0614k8209N180M4460N8784k8852L6164j1668M6724
$$ 5380 6651 -104137 -147470 -106856 -135065 -129885 -85425 -26641 -55493 -19329 -30997 15727
14415A5727k3817P3104N3954r8974j16234q6280O900J429q3411q3215o2047Q1003
$$ 15727 -8090 65014 118968 19994 -96240 -182520 -175620 -174191 -257602 -340817 -402864 -321861
14403c21861J27297k98q503J4136J1405R9066K2255p489p6132n4789l2463N7271
$$ -321861 -194564 -194862 -203365 -189229 -177824 -78758 -56503 -63992 -140124 -194913 -227376 -170105
14391a70105m918J5554n1046M1020J9839p8934M3490R4747O0904r21N6428m1260
$$ -170105 -175023 -159469 -210515 -169495 -149656 -228590 -185100 -90353 -29449 -30370 26058 -15202
14379a5202O8316k9837j9809J2756N7073n7390J6247R1742q6198m4696J3072Q000
$$ -15202 53114 23277 3468 16224 73297 15907 32154 123896 37698 -6998 6074 14074
14367A4074L4603l555q6019n2024n8042J35555l1214N2909m1963o6856N9185J48459
$$ 14074 48677 45122 -40897 -92921 -150963 -15408 -46622 6287 -35676 -102532 -43347 105112
14355A05112j6853l0423j7569O1333J04751P3153K2833k8434p4153j00773m6740
$$ 105112 88259 57836 40267 101600 206351 279504 302337 273903 199750 98977 52237
14344E2237l454K768L8146J1145O666K3551Q7286N7714j42497n1639J4767M7346
$$ 52237 48783 51551 89697 100842 107508 131059 218345 276059 133562 81923 96690 144036
14332A44036p6172K7639J36425l0816O3572R3838J13684l0075p2375r3116J9693
$$ 144036 67864 95503 231928 201112 264684 358522 472206 442131 369756 276640 296333
14321B96333o4457P977L3569j0390q4476p6872L0863m989J1803P372n4821P2478
$$ 296333 231876 239853 273422 263032 178556 101684 132547 127558 139361 146733 91912 164390
14309A64390l399Q6552L9034K8841J19049J34406n001o6791P6258o5253q6378
$$ 164390 160991 247543 286577 315418 434467 568873 563872 497081 573339 508086 421708
14298D21708k7992J3725j05754j53116k3647K0212j8115r4782j09925O4024R9609
$$ 421708 393716 407441 301687 148571 124924 145136 127021 32239 -77686 -13662 85947
14287H5947j7577O2476j6841M0724Q4811Q5891Q30o9284N2213R2200L3864m8077
$$ 85947 68370 130846 114005 154729 239540 325431 326261 256977 309190 401390 435254 387177
14275C87177m1863N2423r8241m4467l6614o7531o0515l0169n5463L4091L7631
$$ 387177 345314 397737 299496 255029 218415 150884 90369 60200 4737 38828 76459
14264G6459l0607M0388J50484R7315j1658n1749m0847O459m5963k9089j1958P4807
$$ 76459 45852 86240 236724 334039 322381 270632 229785 236244 190281 161192 149234 224041
14252B24041p1077p1869L1771N0077o9132O9939N9846o8521l8687n950l2364M3715
$$ 224041 152964 81095 112866 162943 93811 163750 223596 155075 116388 110438 78074 121789
14240A21789j43219m7536M6155Q5013o885L0624N3869j4294J0443M6145J8623
$$ 121789 -21430 -68966 -22811 62202 55317 85941 139810 125516 135959 182104 200727
14229B00727n6762k7075j0764O7155O7222j1145j47401o2670N8170m6195l8631
$$ 200727 143965 116890 106126 173281 240503 229358 81957 19287 77457 31262 -7369
14218g369O2758L4026j57657p1568J56960J35265M405q5054j18841k0794P7058
$$ -7369 55389 89415 -68242 -139810 17150 152415 156820 71766 -47075 -67869 9189
14207I189Q8713j27557j20424j8865J20193K251j2795j6489J9381P1745R2040
$$ 9189 97902 -29655 -150079 -168944 -48751 -46500 -59295 -75784 -56403 15342 107382
14196A07382Q9117j02683j32654m413O578M5094J21821P5858M21j08063j18276
$$ 107382 196499 93816 -38838 -43251 -36673 8421 130242 206100 206521 98458 -19818
14185a9818o4237N97J4288Q3548L1074k4868K6452L6816J277q5470K8976k4385
$$ -19818 -84055 -83458 -69170 14378 45452 20584 47036 83852 85129 -341 28635 4250
14173D250K032m6007q8585o0220N140L0232M72k4371M3979R95N7485K4591J1057
$$ 4250 6282 -39725 -128310 -188530 -183390 -153158 -152686 -177057 -133078 -132083 -74598 -50007 -38950
14160c8950J2112q4827l5969k5348J06810j2005M4493M8433j7650K4360o6951
$$ -38950 -26838 -111665 -147634 -172982 -66172 -78177 -33684 14749 -2901 21459 -45492
14149d5492j7041M0955o266k7168M4408P6525q2011k6908l9664r1437L0768J10152
$$ -45492 -62533 -21578 -27844 -55012 -10604 65921 -16090 -42998 -82662 -174099 -143331 -33179
14137c3179o8699q8381k1631J7327M6219J23425l1496n4298J58885J7484k1437
$$ -33179 -101878 -190259 -211890 -194563 -148344 -24919 -56415 -110713 48172 65656 44219
14126D4219l7349R7317J84124N026r7315r9258j24266r3232P2387K5303Q981r0710
$$ 44219 6870 104187 288311 293337 196022 96764 -27502 -120734 -48347 -23044 -14063 -104773
14114a04773j7257J56047r36o7679O385R7402l3231p8454k8161J12671L5046q6828
$$ -104773 -122030 34017 33081 -34598 -28213 69189 35958 -42496 -70657 42014 77060 -9768
14102i768j5810M3055O3683J2651l5152n5978M9111N2835M8889k9852k2718k1670
$$ -9768 -25578 17477 81160 93811 58659 2681 51792 104627 153516 123664 100946 79276
14090G9276p9397p3160l9261Q5912M7623r6684k0455k1428K6696M5739M3431N856
$$ 79276 -121 -73281 -112542 -26630 20993 -75691 -96146 -117574 -90878 -45139 -1708 4148
14078D148r0135p5719m733L7915J5340P5466M7170Q0608n0313J4720j8087J6263
$$ 4148 -85987 -161706 -166439 -128524 -113184 -37718 9452 90060 39747 54467 36380 52643
14066E2643n5505N3542L8833l2349m4361j25344J2168k4065O8620J15278r0277
$$ 52643 -2862 50680 89513 57164 12803 -112541 -100373 -124438 -55818 59460 -30817
14055c0817q8863P6600Q5404M6688R8392q5062p9505M0171M7586R9162r0786r7459
$$ -30817 -119680 -43080 42324 89012 187404 102342 22837 63008 110594 209756 118970 21511
14043B1511N8383P8981j7588J65586j4104j02997q5241j63845L0776k6903k607
$$ 21511 79894 158875 141287 306873 292769 189772 104531 -59314 -28538 -55441 -58048
14032e8048J1446O2746K7048m9442K0456J47323k2735r3050k6729J0883j05559
$$ -58048 -46602 16144 43192 -6250 14206 161529 138794 45744 19015 29898 -75661
14021g5661K4536L9739R7660O2377j635N8085J5714K8704N7700l3821l3882L9954
$$ -75661 -51125 -11386 86274 148651 147016 205101 220815 249519 307219 273398 239516 279470
14009B79470j1579p2429j5161l1308r6656K213J25624N36o7501L5827O6303J1021
$$ 279470 267891 195462 180301 148993 52337 54550 180174 180710 113209 149036 215339 226360
13997B26360n5818k9039K5167Q088L6347p1592K1567J5157r2714j5463P1960J04775
$$ 226360 170542 141503 166670 174758 211105 139513 161080 176237 83523 68060 140020 244795
13985B44795P4898L083J3468o7618J4484O1565P3931p2979l9346J27699N4016
$$ 244795 319693 322776 336244 268626 283110 344675 418606 345627 306281 433980 487996
13974D87996l3065M095R9268L2927j10103m0925L969l848Q9631K8548p4748O023
$$ 487996 454931 459026 558294 591221 481118 440193 444162 440314 529945 558493 483745 489768
13962D89768K3616k8117K3426M2130J20319O8661K7764K7543K423M7339J5330
$$ 489768 513384 485267 508693 550823 671142 739803 767567 795110 797533 844872 860202
13951H60202p005O0495O1001K4303p233J43277L7661P8198P7664J61558J38870
$$ 860202 853197 913692 974693 998996 991763 1135040 1172701 1250899 1328563 1490121 1628991
13940A628991K14181K61106M21144N12856O81437P12213P85749J053922J136847
$$ 1628991 1843172 2104278 2525422 3038278 3719715 4431928 5217677 6271599 7408446
13931G408446J424076J913998K094065K163003K181890K064359J671950J277163
$$ 7408446 8832522 10746520 12840585 15003588 17185478 19249837 20921787 22198950
13923B2198950O38220n3244o85939j411506j740380j996820j960315j725132j272272
$$ 22198950 22837170 22783926 22097987 20686481 18946101 16949281 14988966 13263834 11991562
13914A1991562q70336m05666J44028M70875P99769J392430K072832K562463K978480
$$ 11991562 11121226 10715560 10859588 11330463 12130232 13522662 15595494 18157957 21136437
13905B1136437L501493M007084M285731M232211L965515L264610K086723M09252
$$ 21136437 24637930 28645014 32930745 37162956 41128471 44393081 46479804 46889056
13897D6889056j095043k452027l601998m099305m359700m113048l452966k621241
$$ 46889056 45794013 43341986 39739988 35640683 31280983 27167935 23714969 21093728
13889B1093728j719642q44220m9442O14400J341679K062625K908348L778481M704639
$$ 21093728 19374086 18529866 18480424 19094824 20436503 22499128 25407476 29185957 33890596
13880C3890596N538455O155273O687911O481039N697326M285180K397267K69k354090
$$ 33890596 39429051 45584324 52272235 58753274 64450600 68735780 71133047 71133316 68779226
13871F8779226m347559n787765o667273o757150o180633n045559l823476k548442
$$ 68779226 64431667 58643902 51976629 45219479 39038846 33993287 30169811 27621369
13863B7621369j415208j7232R31920J915805L038961M199959N471766O731296
$$ 27621369 26206161 26188929 27120849 29036654 32075615 36275574 41747340 48478636
13855D8478636P696690Q403584Q705143Q113288O702341M652012J657981j452985
$$ 48478636 56175326 64578910 73284053 81397341 88099682 92751694 94409675 92956690
13847I2956690m407071p005678q650494r409947r209511q130388o730387n292473
$$ 92956690 88549619 81543941 72893447 63483500 54273989 46143601 39413214 34120741
13839C4120741l712452k296234r94721J15128R64542J953300K906720L870693
$$ 34120741 30408289 28112055 27117334 27232462 28197004 30150304 33057024 36927717
13831C6927717M942588N718128O298619O275144N757162M439035K645637L75315
$$ 36927717 41870305 47588433 53887052 60162196 65919358 70358393 73004030 73379345
13823G3379345k149158m234367n955678p058262p253577o918626o152638n026338
$$ 73379345 71230187 66995820 61040142 53981880 46728303 39809677 33657039 28630701
13815B8630701l813759k555242j643148o89822n817N85269J415076K145899K697155
$$ 28630701 24816942 22261700 20618552 19928730 19922913 20508182 21923258 24069157 26766312
13806B6766312L422388M019865M249533M079709L621567K666858J199782m58288
$$ 26766312 30188700 34208565 38458098 42537807 46159374 48826232 50026014 49567726
13798D9567726j880294l282609m371370m929831m977591m634117l873529l269318
$$ 49567726 47687432 44404823 40033453 35103622 30126031 25491914 21618385 18349067
13790A8349067k465699j652977j186436n72610k6644K68392N88092J034243J390828
$$ 18349067 15883368 14230391 13043955 12471345 12444701 12713093 13301185 14335428 15726256
13781A5726256J618432J826033J833710J738544J556678Q03523R4830m91813j380666
$$ 15726256 17344688 19170721 21004431 22742975 24299653 25103176 25198006 24706193 23325527
13772B3325527j961260k192480k578902k550192k381198j974979j600090j277153
$$ 23325527 21364267 19171787 16592885 14042693 11661495 9686516 8086426 6809273
13764F809273r00767o71189o77139o87005l93315k87970k07476r7481k47623k74170
$$ 6809273 5908506 5237317 4560178 3873173 3479858 3191888 2984412 2886931 2639308 2365138
13754B365138j95205j57684j17467j35471J1348j06793j07308k1473o7485j84652
$$ 2365138 2169933 2012249 1894782 1759311 1770659 1663866 1556558 1535085 1467600 1282948
13744A282948n3933J25034Q9414j28942j12953r8m1658n3823j25926m5787p6220
$$ 1282948 1229015 1354049 1443463 1314521 1201568 1201470 1159812 1105989 980063 934276 858056
13733H58056L7738o4926o1201L0235m7886K4931l7367P357j5246o4160q4934l016
$$ 858056 895794 830868 769667 799902 752016 776947 739580 746937 731691 667531 582597 579581
13721E79581J10658M6852l0251j08144k8439O0251q180o7157k98m7695J0155K9338
$$ 579581 690239 737091 706840 598696 570257 630508 622328 555171 554873 507178 517333 546671
13709E46671o5156r6667L4294o740Q6782n9443n6059L567m7745j8214m7384k9330
$$ 546671 481515 384848 419142 412402 499184 439741 383682 387249 339504 321290 273906 244576
13697B44576N6809J02786r1751p6342J8600O0884k2664M6292j6294K7833O5113
$$ 244576 301385 404171 312420 236078 254678 315562 292898 339190 322896 350729 415842
13686D15842r510l7865j03826n5156N4288M2022m4238L4477K5219j7934l0402
$$ 415842 406332 368467 264641 209485 263773 305795 261557 296034 321253 303319 272917
13675B72917k4548j03951N4230J6701l1744l3885l6845r1613p836k6804m1439
$$ 272917 248369 144418 198648 215349 183605 149720 112875 21262 13426 -13378 -54817
13664e4817j4635r760Q1001M7075J1448m7953J970L639m9313P1936p0116n2964
$$ -54817 -69452 -79212 1789 48864 60312 12359 14329 17968 -31345 40591 -29525 -82489
13652h2489J03692J02432r1487l1287l0400J06784k3686n6986M5554j2381Q0191
$$ -82489 21203 123635 32148 861 -29539 77245 53559 -3427 42127 29746 109937
13641A09937J29096M0357p2372j1320K9896q5949j02794j9923l3201n0131N2129
$$ 109937 239033 279390 207018 195698 225594 139645 36851 16928 -16273 -66404 -14275
13630a4275N2106K5611r2434o9337j3930J12142p1563p6591M7164L7457K1446
$$ -14275 37831 63442 -28992 -98329 -112259 -117 -71680 -148271 -101107 -63650 -42204
13619d2204O1959O6729j0283n7638j6348N3698k7471K632l854P0121k0135p0464
$$ -42204 19755 86484 76201 18563 2215 55913 28442 31074 27220 97341 77206 6742
13607F742J6414J26281n9235l9363K6715k0761k7783m6870P8956K3731P0670M6305
$$ 6742 23156 149437 90202 50839 77554 56793 29010 -17860 61096 84827 155497 201802
13595B01802K63Q2522o7043j30153l3277P9428j4580k5299q0540o0166m1589k943
$$ 201802 202065 284587 217544 87391 54114 133542 118962 93663 13123 -47043 -88632 -91575
13583i1575L5612J27722J37161n5436q9061K7619K6776J7765L6466L2301K0129
$$ -91575 -55963 71759 208920 153484 64423 92042 118818 136583 173049 205350 225479
13572B25479n8667p3850j9552k6661K9646M146N1244K2390P7751j16110j10827
$$ 225479 166812 92962 73410 46749 76395 80541 131785 154175 231926 115816 4989
13561D989M2902L9243k3360n0687j12677j1434k9817M2948Q0875o245R8150j1671
$$ 4989 47891 87134 63774 13087 -99590 -111024 -140841 -97893 -17018 -23263 74887 63216
13549F3216J3371o9475j03558P2415m375r001n3568n7690L5511J24570Q7360M9981
$$ 63216 76587 7112 -96446 -24031 -28406 -37407 -90975 -148665 -113154 11416 98776 148757
13537A48757o839o577l7548M2188j5556j07805L2152J18947P8172M6807k2283
$$ 148757 141918 135341 97793 139981 124425 16620 48772 167719 245891 292698 270415
13526B70415j71493m2883j50353J9183L431O0018J42946J22922N2161r7147r9725
$$ 270415 98922 56039 -94314 -75131 -71700 -11682 131264 254186 306347 209200 109475
13515A09475r2776o9751L7150R2659j754m0028p760P5198J5134j5952K6388L5327
$$ 109475 16699 -53052 -15902 76757 75003 34975 27215 102413 117547 101595 127983 163310
13503A63310m4670q2278M0774O1109q8137o6574j2006P922R2459J1320n0810r2307
$$ 163310 118640 36362 77136 138245 50108 -16466 -28472 -20550 71909 83229 32419 -59888
13491e9888j07726N7466N3898j28891k7121Q0742L0696L8174M0684O4352o98k0998
$$ -59888 -167614 -110148 -56250 -185141 -212262 -131520 -100824 -62650 -21966 42386 41688 20690
13479B0690K5541k1577m7153j00167P4638J23101J10047M5922M5630M5689n9259
$$ 20690 46231 24654 -22499 -122666 -48028 75073 185120 231042 276672 322361 263102
13468B63102j39576j664M5396k0613O6304K3170M3N1313l3330J8219o5838J3063
$$ 263102 123526 121862 167258 146645 212949 236119 236162 287475 254145 272364 206526 219589
13456B19589m9401L1372L0503m54O2184n102p6896P0160Q5079p6899m3976L3244
$$ 219589 170188 201560 232063 231609 293793 288691 211795 281955 367034 290135 246159 279403
13444B79403J0183l3927L9660k5842K0504q8k7476J70235J33315L308j06393J10713
$$ 279403 289586 255659 295319 269477 289981 289893 262417 432652 565967 569275 462882 573595
13432E73595K3864o1165n9986N4167L8364r2802K4038j35073n2277j2425j9610
$$ 573595 597459 536294 476308 530475 568839 476037 500075 365002 312725 300300 280690
13421B80690P5401l1739J7867J56471J47040P0241L2170M4517k7355q2298m8321
$$ 280690 356091 324352 342219 498690 645730 715971 748141 792658 765303 683005 634684
13410F34684r5l6786Q4184j1464l8353J26419J06754j99103j59751Q0301Q971
$$ 634684 634589 597803 681987 670523 632170 758589 865343 666240 506489 586790 595761
13399E95761K5031O9540J0314k2368P7202J1714k3659l5063J34470K28469L0741
$$ 595761 620792 690332 700646 678278 755480 767194 743535 708472 842942 1071411 1102152
13388A102152j53303j16212j30963l2204l9002m9222j66413P0083l8955n50p9943
$$ 1102152 948849 832637 701674 669470 630468 581246 414833 484916 445961 445411 365468
13377C65468L189o0947P1928J1928J0689L5200R2484J10056m378Q516K088J16269
$$ 365468 368657 307710 379638 391566 402255 437455 529939 639995 635617 644133 646221 762490
13365G62490K9088M48J53734k4400j58270K4752R66q151l9116r702M2025K3795
$$ 762490 791578 792026 945760 921360 763090 787842 788808 780657 741541 731839 773864 797659
13353G97659r2340r2109p3255k6763l1058j962k1162N0967K4671J8424k4680k7415
$$ 797659 705319 613210 539955 513192 482134 480172 459010 509977 534648 553072 528392 500977
13341E00977p459Q949m9065L0330L4034J5616P717L7525k3772O0712L4766o6514
$$ 500977 493518 502467 453402 483732 517766 533382 541099 578624 554852 615564 650330 583816
13329E83816o0304p7431N8567M4405k4621L5859L1742M0011o4992K8123P4474
$$ 583816 523512 446081 504648 549053 524432 560291 592033 632044 567052 595175 669649
13318F69649K6419r86J4810o936Q950j8775l5148j19186j02044q3158M446m7281
$$ 669649 696068 695082 709892 702956 711906 693131 657983 538797 436753 353595 358041 310760
13306C10760r2213Q918q798m6097O0722Q5303j7605K7344J44020Q3342p4762m8234
$$ 310760 218547 227465 218667 172570 233292 318595 300990 328334 472354 555696 480934 432700
13294D32700j3800o6953m5779j2570R4288Q3826n9433j46546q5507l1346j4005
$$ 432700 418900 351947 306168 293598 387886 471712 412279 265733 180226 148880 134875
13283A34875R8772j5330r9725n2577j4128n4990M7211J08705l4175q3803O561
$$ 134875 233647 218317 118592 66015 51887 -3103 44108 152813 118638 34835 41396
13272D1396M5348j0478q1417o3868L4631K269Q7199N4129J9093k996o307p6390
$$ 41396 86744 76266 -5151 -69019 -34388 -32119 55080 109209 128302 125306 118999 42609
13260D2609k958j6044n9284R754K9119J4063M5794K8263k4106r3455n9356J16149
$$ 42609 39651 23607 -35677 -25923 3196 17259 63053 91316 67210 -26245 -85601 30548
13248C0548M6128N9190n6839o4681r215L9521j7739p2636P5117M9094R695M4132
$$ 30548 76676 135866 79027 14346 5131 44652 26913 -45723 29394 78488 88183 132315
$$ [...]
##END NTUPLES=NMR SPECTRUM
##END=
