##TITLE=Analysis number 323465
Compound Code cc 53004
Book Reference 407/139
Project Code adrs
Chemist Name andyw
##JCAMPDX= 6.0         $$ Bruker NMR JCAMP-DX V2.0
##DATA TYPE= NMR SPECTRUM
##DATA CLASS= NTUPLES
##ORIGIN= Bruker BioSpin GmbH
##OWNER= nmr
$$ XWIN-NMR		Version 3.5
$$ Thu Oct 26 08:44:38 2006 GMT Daylight Time (UT+1h)  MAYBRIDGE\nmr@NMR_250MHZ
##.OBSERVE FREQUENCY= 250.131544655141
##.OBSERVE NUCLEUS= ^1H
##.ACQUISITION MODE= SIMULTANEOUS (DQD)
##.ACQUISITION SCHEME= undefined
##.AVERAGES= 16
##.DIGITISER RES= 18
##SPECTROMETER/DATA SYSTEM= dpx250
##.PULSE SEQUENCE= zg30
##.SOLVENT NAME= CDCl3
##.SHIFT REFERENCE= (INTERNAL, CDCl3, 0, 16.4492)
##AUDIT TRAIL= $$ (NUMBER, WHEN, WHO, WHERE, WHAT)
$$ ##TITLE= Audit trail, XWIN-NMR		Version 3.5
$$ ##JCAMPDX= 5.01
$$ ##ORIGIN= Bruker BioSpin GmbH
$$ ##OWNER= nmr
$$ C:\u/data/dgb/nmr/ADRS/1730/pdata/1/auditp.txt
$$ ##AUDIT TRAIL=  $$ (NUMBER, WHEN, WHO, WHERE, WHAT)
(   1,<2006-10-26 08:43:58.73 +100>,<MAYBRIDGE\nmr>,<NMR_250MHZ>,
      <created by zg, POWCHK disabled, PULCHK disabled
       configuration hash MD5:
       49 4B E0 1D 92 C2 6B 37 9F E6 65 BC 52 41 86 1D
       data hash MD5: 64K
       58 1D 53 11 C3 DB 45 58 1D 8A E3 06 57 6B 8B F4>)
(   2,<2006-10-26 08:44:16.09 +100>,<MAYBRIDGE\nmr>,<NMR_250MHZ>,
      <Start of raw data processing
       ef LB = 0.3 FT_mod = 6 PKNL = 1 SI = 32K 
       data hash MD5: 32K
       9E F5 13 79 F2 24 3D 12 11 DF 06 A9 25 9E 01 3A>)
(   3,<2006-10-26 08:44:20.42 +100>,<MAYBRIDGE\nmr>,<NMR_250MHZ>,
      <apk 
       data hash MD5: 32K
       FD 83 F4 C4 28 C3 E3 1D D2 AE C2 B5 67 16 01 A0>)
(   4,<2006-10-26 08:44:21.95 +100>,<MAYBRIDGE\nmr>,<NMR_250MHZ>,
      <abs ABSG = 5 
       data hash MD5: 32K
       1C 1F 81 60 46 E8 2F 54 D4 CE 1D 77 88 A8 23 28>)
$$ ##END=
$$ 
$$ hash MD5
$$ A0 2E 7F 28 37 1C 2D 23 D0 C1 0B 9E 72 8B 4C C4
##$RELAX= 
##$RELAX= 
##$RELAX= 
##$RELAX= 
##$RELAX= 
##$RELAX= 
##$RELAX= 
$$ Bruker specific parameters
$$ --------------------------
##$DU= <C:\u>
##$EXPNO= 1730
##$NAME= <ADRS>
##$PROCNO= 1
##$TYPE= <nmr>
##$USER= <dgb>
##$AMP= (0..31)
100 100 100 100 100 100 100 100 100 100 100 100 100 100 100 100 100 100 
100 100 100 100 100 100 100 100 100 100 100 100 100 100 
##$AQSEQ= 0
##$AQ_mod= 3
##$AUNM= <au_zg>
##$AUTOPOS= <2 >
##$BF1= 250.13
##$BF2= 250.13
##$BF3= 250.13
##$BF4= 250.13
##$BF5= 500.13
##$BF6= 500.13
##$BF7= 500.13
##$BF8= 500.13
##$BYTORDA= 1
##$CFDGTYP= 0
##$CFRGTYP= 5
##$CHEMSTR= <none>
##$CNST= (0..31)
1 1 145 1 1 1 1 1 1 1 1 1 1 1 1 1 1 1 1 1 1 1 1 1 1 1 1 1 1 1 1 1 
##$CPDPRG= <>
##$CPDPRG1= <>
##$CPDPRG2= <>
##$CPDPRG3= <>
##$CPDPRG4= <mlev>
##$CPDPRG5= <mlev>
##$CPDPRG6= <mlev>
##$CPDPRG7= <mlev>
##$CPDPRG8= <mlev>
##$CPDPRGB= <>
##$CPDPRGT= <>
##$D= (0..31)
0 1 0 0 0 0 0 0 0 0.06 0 0 0 0 0 0 0.0002 0 0 0 0 0 0 0 0 0 0 0 0 0 0 
0 
##$DATE= 1161848636
##$DBL= (0..7)
120 120 120 120 120 120 120 120 
##$DBP= (0..7)
150 150 150 150 150 150 150 150 
##$DBP07= 0
##$DBPNAM0= <>
##$DBPNAM1= <>
$$ [...]
##$SUBNAM7= <"">
##$SUBNAM8= <"">
##$SUBNAM9= <"">
##$SW= 20.6930455092707
##$SWIBOX= (0..15)
0 0 3 0 0 0 0 0 0 0 0 0 0 0 0 0 
##$SW_h= 5175.983436853
##$TD= 65536
##$TD0= 1
##$TE= 683.16
##$TE2= 300
##$TE3= 300
##$TEG= 300
##$TL= (0..7)
0 120 120 120 120 120 120 120 
##$TP= (0..7)
150 150 150 150 150 150 150 150 
##$TP07= 0
##$TPNAME0= <>
##$TPNAME1= <>
##$TPNAME2= <>
##$TPNAME3= <>
##$TPNAME4= <>
##$TPNAME5= <>
##$TPNAME6= <>
##$TPNAME7= <>
##$TPOAL= (0..7)
0.5 0.5 0.5 0.5 0.5 0.5 0.5 0.5 
##$TPOFFS= (0..7)
0 0 0 0 0 0 0 0 
##$TUNHIN= 0
##$TUNHOUT= 0
##$TUNXOUT= 0
##$USERA1= <user>
##$USERA2= <user>
##$USERA3= <user>
##$USERA4= <user>
##$USERA5= <user>
##$V9= 5
##$VALIST= <valist>
##$VCLIST= <CCCCCCCCCCCCCCC>
##$VD= 0
##$VDLIST= <DDDDDDDDDDDDDDD>
##$VPLIST= <PPPPPPPPPPPPPPP>
##$VTLIST= <TTTTTTTTTTTTTTT>
##$WBST= 1024
##$WBSW= 4
##$XGAIN= (0..3)
0 0 0 0 
##$XL= 0
##$YL= 0
##$YMAX_a= 490791
##$YMIN_a= -339204
##$ZGOPTNS= <>
##$ZL1= 120
##$ZL2= 120
##$ZL3= 120
##$ZL4= 120
##$ABSF1= 16.44925
##$ABSF2= -4.243923
##$ABSG= 5
##$ABSL= 3
##$ALPHA= 0
##$AQORDER= 0
##$ASSFAC= 0
##$ASSFACI= 0
##$ASSFACX= 0
##$ASSWID= 0
##$AUNMP= <proc_1d>
##$AZFE= 0.1
##$AZFW= 0.1
##$BCFW= 0
##$BC_mod= 0
##$BYTORDP= 0
##$COROFFS= 0
##$CY= 12.5
##$DATMOD= 1
##$DC= 0
##$DFILT= <>
##$DTYPP= 0
##$F1P= 14.0000005364418
##$F2P= -0.99999901652339
##$FCOR= 0.5
##$FTSIZE= 32768
##$FT_mod= 6
##$GAMMA= 0
##$GB= 0
##$INTBC= 1
##$INTSCL= 1
##$ISEN= 128
##$LB= 0.3
##$LEV0= 0
##$LPBIN= 0
##$MAXI= 10000
##$MC2= 0
##$MEAN= 0
##$ME_mod= 0
##$MI= 0
##$NCOEF= 0
##$NC_proc= -4
##$NLEV= 6
##$NOISF1= 0
##$NOISF2= 0
##$NSP= 0
##$NTH_PI= 0
##$NZP= 0
##$OFFSET= 16.44925
##$PC= 1
##$PHC0= -46.66792
##$PHC1= 9.151933
##$PH_mod= 1
##$PKNL= yes
##$PPARMOD= 0
##$PSCAL= 4
##$PSIGN= 0
##$REVERSE= no
##$SF= 250.130018196734
##$SI= 32768
##$SIGF1= 0
##$SIGF2= 0
##$SINO= 400
##$SIOLD= 32768
##$SREGLST= <1H.CDCl3>
##$SSB= 0
##$STSI= 32768
##$STSR= 0
##$SW_p= 5175.98343685301
##$SYMM= 0
##$S_DEV= 0
##$TDeff= 65536
##$TDoff= 0
##$TI= <Analysis number 999999
Compound Code 99
Book Reference 9
Project Code 9>
##$TILT= no
##$TM1= 0
##$TM2= 0
##$TOPLEV= 0
##$USERP1= <user>
##$USERP2= <user>
##$USERP3= <user>
##$USERP4= <user>
##$USERP5= <user>
##$WDW= 1
##$XDIM= 32768
##$YMAX_p= 308468982
##$YMIN_p= -701594
$$ End of Bruker specific parameters
$$ ---------------------------------
##NTUPLES= NMR SPECTRUM
##VAR_NAME=  FREQUENCY,     SPECTRUM/REAL,   SPECTRUM/IMAG
##SYMBOL=    X,             R,               I
##VAR_TYPE=  INDEPENDENT,   DEPENDENT,       DEPENDENT
##VAR_FORM=  AFFN,          ASDF,            ASDF
##VAR_DIM=   32768,         32768,           32768
##UNITS=     HZ,            ARBITRARY UNITS, ARBITRARY UNITS
##FACTOR=    0.157963299565203, 1,           1
##FIRST=     4114.45101862193, 0,            0
##LAST=      -1061.53241823108, 0,           0
##MIN=       -1061.53241823108, -701594,     0
##MAX=       4114.45101862193, 308468982,    0
$$ Real data points
##PAGE= N=1
##DATA TABLE= (X++(R..R)), XYDATA
$$ [...]
28908 -96149 -154395 -154076 -64266 16371 34059 16089 -74409 -29537 111727 196565 231804 95127
28896 95127 84846 57559 -67288 -115413 -114360 30572 -42521 23152 89471 152882 205257
28885 205257 138445 72937 54936 108586 187541 172167 199581 71788 -30015 -119950 -139385
28874 -139385 -297656 -230477 -53582 -81078 19611 -21072 -196779 -270751 -201428 -143743 50953
28863 50953 -91843 -191750 -210963 -230967 -140244 71869 115322 181243 193701 -57088 -156538
28852 -156538 -6883 -147570 -184950 -176021 -433952 -379923 -365367 -161585 -114472 68524 65611
28841 65611 34724 67460 24218 43809 31595 54250 70379 27863 26281 40963 43794 -30105
28829 -30105 -113203 -234510 -242613 -314363 -421754 -292780 -217535 -259428 -234523 -277587 -251759
28818 -251759 -161015 3742 157644 20052 -226408 -241693 -66109 33914 55495 -43043
28808 -43043 -84674 -82704 -161978 -5108 17001 50006 -90699 -146670 -138972 -207020 -213879 -127159
28796 -127159 89682 -44460 -154487 -94347 -2983 -85344 -23245 -158673 -116295 -84917 -169813
28785 -169813 -170671 -152342 -182768 -155096 155711 74920 48042 161750 164135 123444 30265 -30584
28773 -30584 -39501 83530 212660 -36827 -286825 -174279 -127894 -153079 -35761 96821
28763 96821 216733 143986 52703 -8063 73962 142195 52979 -157891 -219965 19195 53068
28752 53068 -48510 -89478 -53834 165917 279013 127592 -34194 -220598 -262435 -330383
28742 -330383 -361247 -263327 -261202 -91973 49657 88634 -44222 -125717 -219626 -242278 -235798
28731 -235798 -237808 -349137 -325560 -172981 7248 11479 -77250 -195873 -323306 -347009 -166473
28720 -166473 -70479 45167 147454 287037 310475 196187 120880 41976 -67324 -210268
28710 -210268 -205406 99627 187395 154856 100365 30659 53923 154525 138939 116641 -26204
28699 -26204 80317 169430 122809 -90571 -80721 10560 73299 41002 -17010 64195 17350
28688 17350 -71618 -121446 -146569 -174067 -183715 -122258 -672 42168 109426 208045 174079 -22864
28676 -22864 -78428 -110443 -154816 -93077 94680 82890 250008 198258 105038 185337 184510 -17716
28664 -17716 -73546 68062 76972 35825 141930 198655 -150895 -168948 43652 21543 141217
28653 141217 222958 172970 31330 33326 111327 49286 128034 116456 56126 91356 87103 65881
28641 65881 154988 33937 -46570 -147170 -280517 -282293 -188043 -19559 22771 -28086 120957
28630 120957 198000 130569 116898 166350 187485 130462 103507 169489 152954 12093 -22802
28619 -22802 -73737 -10421 46858 -11469 15952 112027 134800 362988 506924 463497 321912
28608 321912 115221 76103 258489 297273 148392 181871 111463 210652 254999 159766 54338
28597 54338 1950 80077 41024 -100911 -150607 -116163 59790 59776 228173 388883 303298
28586 303298 289306 261955 147836 914 -116385 -93984 -98466 -81518 68268 274137 274776
28575 274776 183936 37181 122183 143918 111938 287413 282743 237950 236361 131862 121545
28564 121545 155678 281627 308678 415835 271802 91254 214297 298453 205139 94014
28554 94014 88486 -30129 -38242 150079 268034 97550 114231 60759 75597 139984 94301
28543 94301 198841 302161 216939 76768 -68114 -135273 11042 110157 187058 194217 218690
28532 218690 200022 188260 137882 97015 -40151 -187227 -101864 -117407 -266005 -195640 -66233
28521 -66233 -31194 -42667 -27103 10180 -132597 -215854 -65296 74993 162787 69185 70318
28510 70318 6907 -209843 -97003 202159 206123 203295 76492 -136316 -134233 -109597 -85394
28499 -85394 53413 -54270 -50920 -189446 -133335 -176687 -200354 -348349 -310850 -221604 59770
28488 59770 -59014 -322238 -287337 -68705 -13561 -56712 21153 -27333 -53387 -144175 -290997
28477 -290997 -264643 -160953 -57853 -72728 -178483 -239279 -243893 -251732 -181454 -252882 -137243
28466 -137243 -5553 83460 178379 207626 80906 -51738 88203 117509 92502 86892 44874
28455 44874 68078 44742 7836 52 95884 63109 -34567 -82206 -161452 -147397 -251513 -103478
28443 -103478 -79658 -14200 -49702 -17526 -9040 4475 -68881 36851 -3249 36211 60126
28432 60126 -18817 31738 99046 -29258 -177223 -81450 124883 183187 146983 173944 259568
28421 259568 157316 8417 169256 166252 17257 -37751 43388 259932 192732 145715 118519
28410 118519 -42484 -45205 71041 59578 -43369 -9437 46049 17240 -11429 -52459 -227778
28399 -227778 -412118 -358323 -435692 -484226 -296311 -235736 -203558 -20105 -2877 -96292 -83875
28388 -83875 -180088 -284334 -114995 67978 224133 266473 214610 310628 290676 345049 304301
28377 304301 351792 376934 284738 145904 -14060 -206622 -167518 16412 40345 136386 15410
28366 15410 -7916 78211 -45967 -20676 67706 175994 -10936 -35330 -22124 1522 29566
28355 29566 4944 125170 144343 57049 -133567 -55299 47276 -23079 -173374 -398525 -345218
28344 -345218 -218576 -159621 80798 67621 25328 -32329 -133434 -114382 25119 126245
28334 126245 81161 97909 41507 51960 122379 -50223 26383 209677 257686 116938 172616
28323 172616 212910 381140 315689 319866 246764 224848 80014 -128235 -133764 -2777 3699
28312 3699 78899 244058 229170 161466 140731 1715 -36603 46082 11106 8681 -124547
28301 -124547 -317408 -146726 116176 111046 176451 305599 251913 275800 328777 395214 441135
28290 441135 296090 121978 -14603 -4161 34438 -104113 -29586 -122626 -62774 76799
28280 76799 134285 71817 -53391 -217506 -187149 -157675 -248664 -103355 -72145 -128750 -165490
28269 -165490 -238404 -181192 -9970 210515 194507 120390 55078 96812 198737 288684 150578
28258 150578 214393 194127 15437 -111315 -16497 13034 29769 -6865 -16547 233310 250607
28247 250607 205785 64612 -143500 26501 134463 111250 219430 91613 -29236 -75004
28237 -75004 -88230 -25068 -52145 -54337 -146587 -27850 -3276 -133669 -252071 -88170 120768
28226 120768 336978 423882 177994 -19805 30946 146292 145030 21065 -20594 2947 -26044
28215 -26044 -16464 -27064 23950 -9461 65409 65315 123031 14702 -27517 99902 28323 -120909
28203 -120909 -125920 -79724 -60693 -54887 -20483 -22422 -19785 -126927 -90815 83833 47352 -101751
28191 -101751 -24425 113017 162033 208686 207035 105620 -9293 -3460 -62604 -31316 -33252
28180 -33252 68599 160669 244412 196510 -38761 -136703 -108581 67969 29911 -33963 72795
28169 72795 92046 59470 91887 -24120 -42780 7212 -23209 81294 28811 25686 120927
28158 120927 152331 4280 -18955 192334 290302 227176 125827 140363 202012 188767 151076
28147 151076 124531 71569 63489 41282 57921 214339 153664 94361 -13441 59811 79459
28136 79459 23859 -164542 -148924 -17119 24200 -21573 -12139 4621 -103771 6704 18808
28125 18808 -126897 -184887 -288718 -280247 -325983 -207526 -38486 -67031 -47056 103898 260412
28114 260412 299034 292267 187494 221629 331137 333809 398495 212737 63632 119293 215889
28103 215889 111324 91184 69845 94088 50708 130398 173334 100661 -122883 -217076 -135628
28092 -135628 -8829 -48137 -107622 -61153 -52311 54716 54057 83016 191604 77473 143368
28081 143368 117966 168561 148548 64224 -13098 -68715 68269 203410 166597 79654 84652
28070 84652 117759 -71701 -186625 -217204 -401476 -374609 -240768 -141498 -179499 -24888 182312
28059 182312 186338 121104 59773 -32371 -236310 -269483 -187492 -98577 -20975 -179691 -300146
28048 -300146 -230134 -135374 -288865 -207774 4695 146874 155824 92587 -75120 -159442 -31083
28037 -31083 8340 152931 220165 178016 81654 108442 138466 91006 -1189 -44479 100670
28026 100670 172567 22949 -117198 31671 154997 -27578 -93267 104991 179338 140401
28016 140401 185702 283033 326534 179775 30704 -160360 -192720 -239635 -210253 -160434 99331
28005 99331 370788 448377 453157 315561 260210 36074 84642 162759 233194 157444 202143
27994 202143 240463 226030 127554 -46728 -105178 -167848 -59582 202850 241722 184271 114005
27983 114005 -113922 -93651 -89772 -152869 -254867 -160489 36879 -92855 -140932 -17789 213735
27972 213735 239122 -12603 -11346 67123 33689 -43697 -144285 -109686 -31486 56952 -33367
27961 -33367 -73936 -114537 -55431 -113564 -118408 -140110 -125867 -163962 -229926 -400727 -472976 -346978
27949 -346978 -179455 -149580 8691 23337 -32491 -56320 -107095 -3290 132227 201942 185359
27938 185359 119354 116082 -12725 -117570 -91248 -16108 -66669 -103192 118175 37700 -73707
27927 -73707 -140027 -80369 -39277 -212349 -218413 62206 200628 166191 183854 145638 331612
27916 331612 186211 144791 177489 165714 148904 6611 -8400 -44860 -109088 -175994 -208431
27905 -208431 -116581 -173481 -146366 -140303 -127299 -90708 -138417 -186100 -208729 -137118 -32333
27894 -32333 133929 202187 78928 58831 48899 50441 99169 82380 -29634 -159990 -122126
27883 -122126 -163599 -23878 181667 139079 199149 206762 140761 219312 169357 115040 5402
27872 5402 -126407 -110904 -47428 -59679 -112755 -193108 -181909 -10104 5959 -18008 -203588
27861 -203588 -262813 -170972 -134022 -47210 41953 58469 -29400 -146865 -259982 -262966 -150738
27850 -150738 -150873 -25401 20049 59957 29221 -35904 -21139 -9476 -96779 -2848 168278
27839 168278 200045 12284 -29092 -219090 -335720 -397024 -297315 -44485 86888 92614 -7038
27828 -7038 -114692 -82491 -78755 62826 64184 55306 106054 30252 -24929 44221 175113 26038
27816 26038 -23695 -76132 -266991 -184799 42754 184796 165540 178623 159218 157527 142532
27805 142532 80095 122334 -6168 -59780 2445 -91306 -46184 156585 287171 330215 161823
27794 161823 -18818 -41121 -7905 46951 208108 320914 125088 -21543 -50283 179619
27784 179619 -34745 -78540 54352 119577 128535 80847 35684 -10047 47027 105420 13895
27773 13895 -13104 -2638 -125797 -89023 -201470 -199365 -78539 203033 269694 254100 4018
27762 4018 -99732 -77126 -25551 49122 -44809 -89363 13752 89380 233773 274581 335145
27751 335145 251669 131632 50759 118859 192907 47511 30705 -27394 -35307 -4154 -56884
27740 -56884 -91358 88499 265263 165595 -86643 -346150 -388283 -343744 -285348 -244070 -228996
27729 -228996 -419155 -460225 -106847 -628 58990 21997 70262 119252 76667 -44441 -57631
27718 -57631 -73802 -101198 -168112 -337183 -206880 -26614 59928 13291 62535 144669 163677
27707 163677 160879 252825 203191 208531 146035 148470 246827 181176 169675 161713 176389 173438
27695 173438 158782 116001 -38240 -44302 -18216 226913 295994 164112 -1361 -89070 140399
27684 140399 319620 335386 328429 301631 399665 155548 -40552 -20332 39189 57583 -53351
27673 -53351 -123001 -212600 -301875 -244347 -182101 -161431 -128757 -19862 -129696 -128762 -159549 -183226
27661 -183226 -214017 -43004 26687 -136801 -243693 -470158 -559046 -431498 -220101 -96775
27651 -96775 51454 -78295 -220618 -227376 -118719 -139451 -223738 -224907 -127295 -49019 -202864
27640 -202864 -268188 -163635 -42998 128252 114450 65969 91008 126456 149166 336209 346361
27629 346361 198035 61869 -37336 -189833 -159413 -3310 149340 123939 91175 -49403
27619 -49403 -20051 52457 49743 148820 173100 104845 35715 186595 259490 114558 41130
27608 41130 -9859 44114 65067 -84660 -154520 -94924 -37763 125799 38025 6970 60044
27597 60044 -79307 17751 89071 -73001 -357282 -273767 -245230 -98641 -61075 -25067 106342
27586 106342 173457 79976 89636 71700 -39694 -51023 51498 5724 -86349 -204633 -161885
27575 -161885 24700 100661 -99440 -186452 -32899 -224631 -165231 -219873 -212533 -185404 -168134
27564 -168134 -109692 -103540 -140322 -188369 -127935 -119126 13999 -63744 -126212 26241 18764 -31947
27552 -31947 -121248 -95304 1270 28103 -60238 4340 176991 78904 29494 81537 25940
27541 25940 -71051 -26210 71141 -68799 -134080 -220012 -181898 -204186 -250831 -503280 -549384
27530 -549384 -352835 -180469 -106961 -119864 -286275 -299405 -127392 -96578 -117385 -86335 -52675
27519 -52675 -53755 -5535 58212 147933 266048 193796 104103 192551 207513 304251 297081 653
27507 653 -114812 -135888 -65578 113899 299598 330616 340681 346083 263907 117807 -148970
27496 -148970 -282673 -344822 -203117 -131879 -49539 17989 -76564 -179288 16603 7083 -171472
27485 -171472 -177031 -168778 -147367 -130500 -77500 46270 30781 64104 237201 162298 112742
27474 112742 104296 -143020 -303340 -322978 655 82710 48265 -57898 3637 133260 41326
27463 41326 -72093 -60108 89565 213792 223160 255653 137648 -13321 45515 84972 108755
27452 108755 320717 465418 288205 134333 -16178 -141291 -76055 -92304 -80152 -219503
27442 -219503 -317166 -214732 -78589 -23597 63125 165165 208149 199046 96227 22052 290706
27431 290706 262535 53643 37479 -114724 -236205 -181033 -126169 -88763 21923 177218
27421 177218 128363 111774 112291 51237 126319 -29258 -237062 -378582 -392366 -189291 -245305
27410 -245305 -227186 466 -43887 -94667 -93864 -83216 -28237 986 -23459 -24144 -94343 105039
27398 105039 107489 85034 -1387 -74833 -8369 116866 260081 292475 229240 208360 247848
27387 247848 260290 321830 367461 297537 395807 360129 151427 -63058 -193780 -168381 -173351
27376 -173351 -215805 -100900 -176009 -111590 -42382 -52702 165547 279913 470966 487835 446383
27365 446383 340789 271347 255631 77640 -7762 74854 61256 -85606 -66482 -53863 69167
27354 69167 -51310 -111625 88963 118117 -4358 -119063 -5111 218545 350442 512564
27344 512564 577481 397136 261049 132692 -51287 63527 64598 154921 241858 231807 188563
27333 188563 -36203 -127567 -230767 -154707 20553 65981 21770 4771 72953 -17879 -109529
27322 -109529 -109137 -34557 37221 97117 -21022 -73169 -12079 167719 384773 318750 193894
27311 193894 173561 47718 -145188 -267424 -289552 -199864 -22080 -135625 -227513 -125249
27301 -125249 -197489 -224975 -176400 -100435 -100913 -160966 -313029 -279129 -287274 -211337 -174943 -148165
27289 -148165 -85420 -36057 98956 70219 132581 302899 298165 149308 -89532 -147366 -24995
27278 -24995 -95167 -233228 -20638 12672 48519 223373 183340 208314 207262 135025 202860
27267 202860 240793 268992 281524 185836 222370 193730 54813 126158 118944 172779 285788
27256 285788 325115 152306 -103167 -215914 -396643 -469236 -296899 -93178 86155 86158 17745
27245 17745 134079 238943 214881 255852 225795 13130 -147748 -188772 -108051 -297157 -233375
27234 -233375 -79612 -48948 -87600 -185929 -44305 90618 128405 68287 -65707 -177882
27224 -177882 -74614 -62928 -41504 -52316 -19378 87124 38029 -83039 -136860 -14810 -19973
27213 -19973 -230319 -208036 -72194 63120 -61136 -30225 -14137 -48504 -139497 -29196 61182
27202 61182 34269 -131427 -174181 -42079 86981 210006 193230 224316 224516 142015 97435
27191 97435 177284 195343 -11374 -229537 -200361 -182966 -231609 -125646 14036 17742 24007
27180 24007 -91346 -137385 -244972 -194980 -136596 -321345 -251323 -212835 -301762 -331784 -214722
27169 -214722 -52223 111321 97404 87060 40788 26098 -67653 -3784 11731 128278 -79548
27158 -79548 -238097 -291935 -214523 -292979 -246864 -122890 -13354 -94951 14835 9936 -85119
27147 -85119 -389319 -489535 -378101 -221452 -175389 -103821 15730 -3213 -250738 -272298
27137 -272298 -254294 -313846 -138088 16375 69135 -68357 -23535 45622 183906 295834
27127 295834 350817 299477 308970 162110 14904 6103 -84879 -146092 -168080 20874 155742
27116 155742 164901 32528 -22308 21428 -579 -158659 -259378 -164835 -202020 -177370 -79559
27105 -79559 -23218 -16674 -190825 -242368 -251096 -134475 -9340 104356 75846 129173 171491
27094 171491 115072 -56112 -71285 53868 -8374 -43286 -124693 10402 175904 357751
27084 357751 304200 270174 420463 417896 384479 369766 247001 64247 70761 17172 15345
27073 15345 95877 105559 179751 294323 266615 206047 163033 -29730 -93184 -139516 -80538
27062 -80538 -29585 -41951 10257 113761 131189 34175 15644 28721 113180 228091 35701
27051 35701 -152488 -277166 -345038 -202793 -20042 171379 284395 99325 -201310 -133608
27041 -133608 -6066 -21741 -99201 -37133 -69276 -37063 14244 50116 -1583 76528 -9057
27030 -9057 6954 56651 89969 -35057 -137003 -141782 -99272 -119425 -169925 -187138 -188589 -115715
27018 -115715 -17741 76476 54045 -64006 -198767 -188713 -95820 145468 207529 309136 259010
27007 259010 149200 95835 -3578 -216945 -225755 -167010 2374 1589 -331033 -203046 763
26996 763 15048 54943 153990 153300 4367 31874 3619 -115266 -137553 -175211 -28032 -31854
26984 -31854 -10354 21587 -9272 -212141 -157123 -57884 -251306 -235216 -6259 -28628 -101630
26973 -101630 49533 72368 14322 -75036 -120408 -128079 -158305 39792 120368 54883 -81942
26962 -81942 -52491 -112020 -107992 -45244 -77074 -113847 -63046 62640 107746 56038 -76094
26951 -76094 -211187 -111122 117751 32858 73128 29288 8180 64936 -33908 -3874 35429
26940 35429 84000 85963 53785 -21762 46050 -6208 143755 7743 -122600 -79967 -45038
26929 -45038 6728 -27742 -150459 -135684 -46656 1406 52212 33096 227 -118969 -321675
26918 -321675 -70521 42973 162244 192150 35019 9010 162873 280227 305949 171231
26908 171231 -23716 20736 93246 -35217 -189715 -126699 -22619 76329 90995 69777 -58607
26897 -58607 -73616 -49325 2523 206441 273599 381433 459408 326249 175224 -82870 -172441
26886 -172441 -84939 -14322 -78793 -139560 -268409 -191349 -140862 -53688 -24271 -39863 -30434
26875 -30434 60609 145176 344048 374637 140008 191347 154021 80765 -28829 -3866 81843
26864 81843 61121 -87501 -194119 -158266 8494 84125 93603 224126 80507 90323 184189
26853 184189 232575 227102 170346 262389 236970 33542 22272 162840 194444 22781 -49178
26842 -49178 -83696 -79763 -16318 14889 89613 -78840 -222147 -299288 -271402 -55661 70097
26831 70097 31321 -50703 181920 325592 193097 12826 -160843 -192157 -54630 169267
26821 169267 311809 214577 150155 216176 92333 110139 57853 -33761 -146921 -165644 -211203
26810 -211203 -205784 -188954 -86573 308985 271051 167503 53062 20655 148034 224234 39284
26799 39284 92577 159803 57190 -107942 -142071 -67933 67618 165334 28923 -21250 91266
26788 91266 178911 389276 339799 263244 281417 312776 202667 193723 26175 -181316 -72396
26777 -72396 102706 106266 30937 60301 30608 10813 91103 -2069 -53670 -139867 -229075 -240806
26765 -240806 -221836 -232846 -159759 -178305 -156213 100794 212977 196903 228991 -57546 14524
26754 14524 127327 96451 184567 150535 72978 -8642 43053 23879 34246 -71923 -104430
26743 -104430 -190113 -293415 -213289 -158943 -130452 -105230 -132097 -216384 -218237 -114928 -75064
26732 -75064 3540 -36035 -153891 -106389 71982 -22814 942 8193 45452 -90099 -92306
26721 -92306 -66982 -154309 -23990 45169 190117 172250 30466 60965 229296 242739 151264
26710 151264 97291 144903 141893 -12750 -24250 109643 115220 -11674 -84812 -83877 -29098 39552
26698 39552 114019 -131751 -272875 -235216 -186447 -94201 -119456 -212987 -177825 -197196 -297714
26687 -297714 -241650 -170504 -97600 -55071 -163891 -117096 -62626 -139340 -154412 -195174 -343565
26676 -343565 -396437 -174319 -23657 64704 207152 202710 220662 136981 29802 -23218 43697
26665 43697 294126 344961 94972 -84196 -76327 -8144 85708 89118 165592 47221 74165
26654 74165 114285 173670 131806 69170 4076 232928 171454 79334 26592 2796 -34597
26643 -34597 -41306 -46740 -57479 -33798 -138426 -99722 42683 -66649 -259574 -212195 -180649
26632 -180649 -144751 -78628 -14816 -271141 -260140 -226396 -47478 -116570 -106257 -82561 -32654
26621 -32654 2637 93226 159452 -178469 -181366 -96005 67189 23702 -90636 -188391 -274098
26610 -274098 -153381 66365 61494 42937 19176 -3616 -10087 -16561 -14578 23585 -48584 -140778
26598 -140778 -70337 -188445 -252330 -63792 50193 -52099 62090 72382 -67634 -76878
26588 -76878 -108328 6110 207996 201967 204889 142194 70118 -65281 -46781 -188313 -133287
26577 -133287 -139483 -142682 -112609 7989 -151872 -215260 -152938 -164538 -312837 -347131 -348376
26566 -348376 -289055 -154101 913 -15365 9190 20741 -175623 -210363 -145880 -38811 87283
26555 87283 45813 98407 51461 77406 -18602 46482 297826 210807 175589 241501 109463
26544 109463 -104402 -127351 -109804 -162519 -209520 -260378 -284863 -206461 -143663 -272811 -107708
26533 -107708 103095 73603 -183033 -191612 -100619 18164 15421 17396 -123176 -133498 -64967
26522 -64967 -49023 62848 125010 -156321 -169738 -221130 -216909 -34904 189211 227564 12907
26511 12907 -81382 -111437 -61261 42477 38694 -34018 -65663 -103399 -132543 -167986 -283281
26500 -283281 -213735 -55578 40007 -92896 15146 77783 -145892 -298031 -166549 29520
26490 29520 -49356 -211113 -280186 -270852 -209451 -126639 -95831 -116816 -87015 -16670 120732
26479 120732 295188 308634 228711 34758 -32591 -21469 -47160 -166879 -245380 -231681 -269468
26468 -269468 -173967 81783 91453 199273 115561 47611 191228 46171 -290903 -276410 -139834
26457 -139834 -67033 -58329 -90299 -57896 -180832 -183594 -99088 -71752 -141572 -231493 -282798 -142470
26445 -142470 -76297 -44782 93053 47852 -12026 -172316 -244656 -106597 35421 108804 175349
26434 175349 118161 191497 123011 -66119 -100629 -31 55047 42105 -74336 -55121 -75093
26423 -75093 76596 194675 104568 -47458 -95980 4935 111804 231445 184203 -24407
26413 -24407 63216 191301 213432 179959 49854 131531 228959 207356 242987 235452 174102
26402 174102 25330 -278309 -227162 -76538 -162003 -395609 -429745 -378514 -250467 39968
26392 39968 60668 -144737 -132254 -71600 11734 198116 245161 232628 38418 -154433 -50375
26381 -50375 -45534 -155685 -235494 -227116 -239838 -213461 -170995 -239806 -211609 -7625 132767
26370 132767 212461 130741 -119511 -231628 -206257 -89796 -70337 -114515 -134519 -222571 -182323
26359 -182323 -259423 -307863 -331183 -331765 -143793 116277 243173 278293 196730 -1114 7356
26348 7356 -19679 -21637 29761 97173 98282 30713 25954 -121386 -130569 -25540 136539 1180
26336 1180 19860 201205 255965 273939 291284 121202 18038 77190 -349 -29209 -151372
26325 -151372 -242149 -83489 118252 226602 248444 233608 247586 152398 60446 -89853 -202660
26314 -202660 -44350 116679 84806 -74637 -258625 -268167 -2831 210580 320677 364691
26304 364691 103535 -18348 266415 445861 369141 274688 195947 39414 84613 106301
26294 106301 189747 152903 46857 -165772 -257414 -358198 -209385 -57576 -69293 -59611 140108
26283 140108 292543 111890 178497 206264 201175 271229 226604 69119 55767 -71727 -110828
26272 -110828 -76387 31879 122845 52479 117866 165730 10183 -168696 -132670 -95509 -81672
26261 -81672 -65370 -5350 107020 143462 97888 120607 140857 136224 104038 64704 148080 292935
26249 292935 336348 255752 116288 -58077 -77218 -120451 -93809 119585 184815 203664 181270
26238 181270 234906 327170 389009 285370 195196 153758 93259 185680 298310 303065 329547
26227 329547 256328 284308 224654 -32577 -68502 -228878 -373943 -396544 -366590 -356227 -222199
26216 -222199 -181166 -305885 -351540 -385982 -259205 -127939 -162625 -159835 25748 221716 226291
26205 226291 12012 -111350 -90783 2870 -18211 -137684 -283260 -403487 -437009 -430992 -349781
26194 -349781 -305337 -262944 -240149 -175016 -110053 -197238 -252963 -279242 -194806 -35498 188254
26183 188254 234894 229128 94127 -52647 -69567 110055 332416 288854 42656 -22764 112542
26172 112542 29752 60193 220848 328163 418057 349054 296656 254860 310917 216925 70022
26161 70022 69774 -21224 42236 -12377 -161847 -84588 -17718 -55156 1179 223940 234927 181074
26149 181074 140409 25294 27902 52980 157621 86337 73330 276920 180755 52342 -8950
26138 -8950 -150154 -48738 119054 141106 66490 -38028 -9833 16056 -26085 76667 71126
26127 71126 138362 147627 191823 225755 294180 293776 219549 -35213 -286005 -280782 -271862 112745
26115 112745 231575 165333 173770 181858 143903 21526 -184273 -112359 -114333 -182089 -147605
26104 -147605 -260518 -304339 -157782 -83819 -110210 -93103 -127476 -279039 -231918 -139127 -31232
26093 -31232 -56348 -67866 28950 134435 -7401 -108561 65378 160840 96992 176069 233297
26082 233297 130561 18228 -41088 -27184 -56138 -102107 -45406 93560 127459 116773 -18151
26071 -18151 25683 129187 170765 317543 302906 155727 143286 129823 -17729 -161452 -96336
26060 -96336 -126617 -117077 -84183 -130924 -127553 -201138 -102973 86539 272677 93219 -187797
26049 -187797 -324425 -166357 -199569 -265808 -140321 78791 208587 34605 -73142 -4008
26039 -4008 -81956 -219467 -306991 -281309 -34352 48340 -13008 -73541 -255216 -177908 -110299
26028 -110299 -175629 -353939 -258034 -246972 -114427 -82120 76273 141851 5247 25181 -155226
26017 -155226 -326474 -233401 -56867 -149205 -83081 -91328 -63995 -140637 51484 83129 21744
26006 21744 -55164 -20956 15350 129366 320817 379753 160533 63992 45832 80215 -100006
25995 -100006 -123102 -38331 -77433 -67958 135730 39347 -53288 19073 210408 251050 145135
25984 145135 97488 -31075 -420 6814 -21091 -28635 12109 -95223 -135601 -168164 -177596 -189901
25972 -189901 -161419 -26922 104043 -49151 -309985 -309909 -158355 109378 18640 123731 246053
25961 246053 329361 225273 81873 18264 17870 -78367 -217446 -202554 -195730 -97270 -95806 -192702
25949 -192702 31747 251443 112994 -157198 -223165 -33861 182264 225592 32429 46093
25939 46093 139781 51269 59597 64044 16308 -21084 -38899 -50697 -78194 -243632 -221707 -353277
25927 -353277 -446069 -220845 -46039 -20846 4156 -52793 -215684 -174759 -201692 -173896 -23323
25916 -23323 -138327 -151997 -26106 54211 85482 134119 209629 171535 74043 -66218 -49721
25905 -49721 73004 17702 77171 14134 6424 113230 -139704 -340000 -74196 117039 190601
25894 190601 204007 244974 247132 212413 177300 159741 77271 23191 -32645 -53242 -185068
25883 -185068 -200505 -102766 -228723 -133803 -185212 -93370 -107945 -169856 58623 79407 100850
25872 100850 242834 276075 153831 67608 -10765 159072 76186 39628 39832 51306 -4581
25861 -4581 -52004 -239681 -315742 -266407 -188276 -166395 -217388 -174965 -57844 -12101 115697
25850 115697 -4106 117944 119955 161549 -8248 -218073 -270712 -347313 -233434 -6093
25840 -6093 -110861 -160637 59482 163347 296965 181420 56134 117619 4231 -186577
25830 -186577 -360894 -235790 -178561 -348866 -303831 -241176 -2814 55033 53339 133122 93140
25819 93140 -61681 -126470 -257927 -347121 -246298 -111418 -133522 45907 129633 -47077
25809 -47077 -195177 -175729 -113346 -41249 -18833 -58035 19862 148799 188755 98264 -89020
25798 -89020 -244426 -178350 -93832 24563 91388 44482 -52915 118464 182880 100748 -9903
25787 -9903 25411 39895 148455 12341 -51047 7087 210818 69052 39420 6644 -65957
25776 -65957 -201322 -119418 125863 218836 89646 -139125 -295596 -242226 -120727 -53512
25766 -53512 4274 38031 -17319 -63473 -93398 -124378 -180572 -316923 -365452 -234353 1339
25755 1339 148053 44095 68320 3424 -137545 14094 71682 99604 -250 -27791 88259
25744 88259 154712 141125 32496 -271860 -416587 -355839 -244764 -55172 143949 152937 -30293
25733 -30293 -71620 -22326 47874 163871 -5470 -40605 -72091 -62747 73890 151660 27266
25722 27266 94843 191959 178640 94513 46055 108151 151497 24055 -101373 -213336 -149261
25711 -149261 -28771 -71264 -26101 70005 141927 12138 -129597 36022 62139 9269 54909
25700 54909 57388 69682 120004 250005 193646 167188 107619 109680 215984 271438 41181
25689 41181 -287307 -263471 -222479 -249817 -243227 -75522 -113037 -87414 45358 50471 79012
25678 79012 -22346 -177014 -124295 -67848 -34200 -93088 -62915 107345 127768 236007 70285
25667 70285 55702 85570 -35787 -195737 -357369 -467878 -353628 -138348 -65529 16276
25657 16276 74989 157377 133093 -44218 -129699 -72 25792 32209 114716 180600 177980 177400
25645 177400 256453 422396 308973 139098 92815 5685 -41338 -93826 12167 90942 -17897
25634 -17897 -110580 36422 172154 333349 264437 250324 393775 265417 294815 243818 228370
25623 228370 352331 264666 39182 25749 207196 89625 1811 89407 15715 -96183
25613 -96183 -137168 -94549 -50104 -111181 -237700 -221172 -149177 -111563 -155675 -77606 -182942
25602 -182942 -101222 6388 -87353 -53986 174802 189779 -68429 -124299 -126824 -89752 33907
25591 33907 128461 78238 -46847 -98683 85374 205931 32560 53622 218480 185995 103384
25580 103384 186941 172591 105635 6858 -39951 -46179 -6531 141102 100551 -48574 180315
25569 180315 174834 44923 -93506 -199269 -50759 211130 223898 228741 209308 183227 73885
25558 73885 50909 23795 -302 119061 35315 -52166 71939 129578 107612 49939 78794
25547 78794 183272 175940 15499 -31981 -109264 -209427 -210049 -142423 -203365 -180730 -67146
25536 -67146 -33446 -46411 -69022 -192886 -222274 -150936 -45357 -19405 -6354 52234 -37573
25525 -37573 -152365 -96161 -158273 -181179 -255382 -231411 -160514 -41740 -92802 -139948 -232508
25514 -232508 -290807 -223433 -291449 -315065 -218209 -210390 -205612 -56012 115079 165458 48415
25503 48415 12913 3274 -28988 -25642 -20659 -43852 63015 96685 74552 -43498 -149331 -105864
25491 -105864 243961 435525 274338 150174 81571 -38964 24335 125791 60019 -97746
25481 -97746 -186447 -24046 104176 47835 -29221 12534 161705 111525 33712 54438 -25339
25470 -25339 30107 -21035 -48695 -47239 -30965 49275 288011 105750 -173904 -95233 -129914
25459 -129914 -152951 -73822 203 18154 196382 72323 115274 132723 -9789 -5270 128628
25448 128628 35238 -133305 -311443 -148826 -16888 78053 131357 146724 129072 80435 -28880
25437 -28880 65231 117048 82583 -85537 37923 93529 172357 157300 80945 83269 112498
25426 112498 65709 32291 -110120 -127449 -227727 -421603 -112924 30412 -32243 -163368
25416 -163368 -154459 -100771 15617 -83940 -211554 -385809 -257567 -41976 94572 233472
25406 233472 133948 -1660 -164887 -215917 -195099 -141519 -75042 106729 108489 32091 189587
25395 189587 299253 199703 62749 -6468 -29256 -57364 85944 -996 -217260 -316374 -250618
25384 -250618 -254153 -131962 150176 254660 212361 12562 68036 75527 93776 8367 -12076
25373 -12076 36048 126245 37806 -16905 33259 73035 -2447 99555 129826 299802 402079
25362 402079 339056 172730 82726 -14892 -115233 57781 117603 58637 48897 -9798 -62817
25351 -62817 -51097 -127315 -62055 52636 80753 215368 251466 141275 62755 -3238 -63659
25340 -63659 -199646 -74744 68105 175052 218251 161167 91004 -69368 -55526 64745
25330 64745 69409 46840 -3634 -53249 -203156 -189847 -130281 88572 123677 6239 -76709
25319 -76709 -812 59044 1294 57949 -97447 -195120 -110921 -29147 40106 36496 -177261
25308 -177261 -138063 584 35321 99283 30764 -110149 -95803 123669 133190 79432 72910
25297 72910 29139 82277 63876 -95227 -173775 22764 69496 109231 -47353 -41950 13110
25286 13110 5837 -52114 -79664 43660 192127 189934 171040 67661 25848 77208 21961
25275 21961 -40577 -93544 -45117 -48403 -267890 -307486 -318101 -133668 -75940 -102857 -31158
25264 -31158 -127131 -318343 -428606 -520754 -421773 -260790 -63040 -33341 -193515 -223625 -401761
25253 -401761 -290962 -260584 -74335 69093 35146 -159028 -366389 -262945 -89745 -116105
25243 -116105 -177416 58532 201867 204788 345423 437249 435273 304572 147947 87150 12749
25232 12749 -36652 -24856 -38119 -219335 -179490 -84224 -20534 -47892 36257 99770 88356
25221 88356 76183 102146 43446 -8616 58176 285883 260243 215247 117085 113596 136433 176500
25209 176500 152562 -43809 -64157 -112267 -209262 -247281 -103628 -109073 -195093 -239639 -236186
25198 -236186 -281162 -269469 -305402 -139771 -256889 -468492 -433927 -208046 -123422 -146093 -36623
25187 -36623 35868 -105289 -201150 -314184 -125021 -92385 -86864 -58383 -224729 -227576 -311764
25176 -311764 -235302 -162306 15638 -51700 -8276 126459 123378 34712 -4114 -105721 -113625
25165 -113625 -3946 38346 204405 248105 112758 147595 64099 11370 -33783 -35670 -144684
25154 -144684 -74221 -10161 43493 116979 19044 -55884 -181814 -148490 -140271 -110367 5977
25143 5977 62592 54647 110121 113418 178130 112602 -164541 -340844 -372437 -296352 -69222 -36977
25131 -36977 62701 160592 152075 223544 190319 14596 140707 3255 -93856 15879 158623
25120 158623 317970 507325 521517 389022 187098 96470 -81173 -127560 -33668 -7814
25110 -7814 144359 122889 46109 -61288 -78735 52163 144549 171989 6562 -77264 -198668
25099 -198668 -224060 -275520 -377237 -204277 -125168 -134699 -93152 -89075 105385 87185 -44213
25088 -44213 -105077 71471 221291 256416 349126 270194 -3199 -247552 -248530 22283 -18687
25077 -18687 -21605 -21893 -46706 101688 138236 30735 -68142 -260410 -451146 -386132 -212988
25066 -212988 -120075 36917 1774 31489 147030 135763 -167611 -163425 80359 86526 121214
25055 121214 112651 126758 93437 72014 197 -64387 31622 129948 159723 25399 -8411
25044 -8411 -17270 67818 185721 184692 81339 -16650 -213129 -272069 -198470 -162938 -80710 -32125
25032 -32125 -92619 -123034 -283336 -135003 -52192 -11924 9719 92219 144533 158307 97204
25021 97204 204202 277334 304885 -110372 -223938 -192227 -170001 -125358 -176218 31977 328534
25010 328534 238031 -18571 -142573 -112856 -90327 -78288 13236 8312 -94168 -115615 -134013
24999 -134013 -286945 -198717 -144104 -103699 23053 83798 77027 -121041 -176631 -170909 -92930
24988 -92930 -139175 -175528 -78957 87842 210533 139591 55885 48617 -249037 -227307 -271298
24977 -271298 -260878 -206755 34957 151269 -64169 -20542 105629 234864 358204 316996
24967 316996 237530 44931 -41970 -17590 97480 159811 265553 -47242 -40216 123653 241121
24956 241121 60451 84760 248767 114720 -170736 -271451 -155615 53816 210262 340341
24946 340341 386613 446827 451313 379028 274672 121647 12371 3489 -60674 -33620 -19804
24935 -19804 62545 127052 35088 -121983 -78760 139604 212839 18293 -15687 89411 184607
24924 184607 -7275 -114948 -93508 -286837 -123708 -105756 -282719 -355519 -335407 -302050
24914 -302050 -227534 65433 123170 201975 -1168 -35826 -4107 -22400 -15543 -68966 -157862
24903 -157862 -267769 -169864 -9726 -24717 -21806 15820 22756 108087 266199 424374 176113
24892 176113 -166850 -224568 -95787 21245 118403 229074 86790 -141283 -262104 -164614
24882 -164614 -88453 -8326 71283 17040 -20076 4692 -11629 34399 47018 23637 114420
24871 114420 71171 -112145 -236787 -176067 21932 124716 53550 135584 298017 153931
24861 153931 9084 -140407 -208962 -63443 147538 149397 -16291 -78574 -148807 -93311 -164491
24850 -164491 -206980 -198320 -182010 -144230 -1735 32562 -50686 -7326 155262 119714 -120152
24839 -120152 -127647 -62426 -49254 -53683 -58198 -156585 -199748 -39470 -38604 12009 136170 67516
24827 67516 53112 -3528 64841 128453 152912 130629 94349 118378 90737 88986 905 -135993
24815 -135993 -65662 30445 132874 272001 207118 239404 123392 -44188 -222584 -30710
24805 -30710 12617 37778 232060 175952 -33824 -34320 -181220 -377126 -359667 -71043 -366
24794 -366 -48948 -103541 -6521 -67101 -182236 -272788 -95912 22593 -72937 -94989 -182679
24783 -182679 -164341 -189587 -138484 -119047 -225196 -48440 24680 -36934 -143587 -78609 -18830
24772 -18830 -38076 -92762 -11564 137245 288902 228088 68606 -86523 -258229 -157795
24762 -157795 16778 -89189 36288 175591 215957 57779 5443 -57188 -6570 -8633 -48095
24751 -48095 -48592 -78831 -262067 -218054 -49610 -112699 -56443 -114511 -143729 -70709 33727
24740 33727 109326 226616 344496 130387 -39296 101876 173056 82981 -37416 192441
24730 192441 364593 319490 122139 24062 101322 164530 124456 96631 242310 403219 207582
24719 207582 163936 156624 93475 20736 -1733 -129864 -287564 -303652 -128045 -188162 -208012
24708 -208012 -218411 -231412 -279212 -333881 -136816 -222648 -360391 -432313 -378610 -216602 -89233
24697 -89233 1913 82942 -6266 -70009 110377 237295 329003 253139 77668 37780 -107156
24686 -107156 -95588 47999 73206 39150 153757 151795 195715 171582 -46569 -97682 -172603
24675 -172603 -245765 -186144 55397 84452 -39488 75601 88787 22603 -18312 -142517 -130077
24664 -130077 -188420 -197510 -54808 104973 293981 360894 307397 215473 161501 -183 11269
24653 11269 -18867 -89409 -80693 -130923 -181704 -176056 -78159 92708 80821 98560 50208 -68146
24641 -68146 49920 134619 189487 360929 325164 154424 23403 73592 175335 -24811
24631 -24811 -17773 12106 -186925 -264813 -302753 -217622 -186715 -149509 -205161 -229165 -109565
24620 -109565 -9644 105134 152691 150637 119156 31355 42854 -12662 -59909 32313 206688
24609 206688 172616 4587 -98010 -25651 -45847 126498 140494 71471 -13758 120198 330833
24598 330833 387135 162282 5128 13633 -49839 -73440 -162529 34929 299816 348710 194478
24587 194478 99224 68270 6874 -56258 107566 129869 -168555 -177505 -65756 -87410 -184037
24576 -184037 -272676 -393669 -302677 -163358 -64681 33360 3370 -161066 -174986 -189745 -292871
24565 -292871 -262917 -126940 1903 33856 -50616 -23627 -112478 -170897 73925 39095 56112
24554 56112 23501 20165 38542 52157 108150 103442 -61422 89802 113279 17487 -87794
24543 -87794 -53831 -98025 -46561 -147847 -119872 -24664 -104218 -183765 -158547 -213839 -146092
24532 -146092 -69537 22225 -36342 -198404 -139878 -71902 -15076 -101400 -59092 -90494 -153334
24521 -153334 -184830 -66849 4698 112629 205216 10290 -98227 -186395 -136907 -380855
24511 -380855 -512062 -314371 -131522 71361 230496 206563 69943 -34018 -76518 -47684
24501 -47684 -112135 -91523 -33421 9199 19793 74662 -132292 -163214 75873 161431 -8078
24490 -8078 -63196 -56064 -38917 -224140 -202599 105957 227509 250592 153064 156855 280391
24479 280391 314502 285486 177715 -51097 31957 -25398 45951 133085 103136 78442 41404
24468 41404 50605 70425 -74353 -35463 -17887 -38863 -99773 -29099 -21472 -10680 -37040 -71834
24456 -71834 -131902 -108886 83224 84240 32478 -109152 -247241 -389100 -323817 30572 105774
24445 105774 -2874 -56806 29556 -11728 -16769 -124291 -305266 -242133 -118782 -102726 -183236
24434 -183236 -184792 -119268 -186768 -311620 -270448 -183086 -141966 -143969 -213008 -253083 -209326 -140744
24422 -140744 -29347 -63159 -118966 -6097 43023 19358 189134 278917 5073 -226950
24412 -226950 -210945 -212864 -205756 -85940 -173466 -325242 -303934 -207896 -21479 -4177 17369
24401 17369 33987 11373 -101978 -184359 -21097 -9638 -100383 -203398 -167345 -63469 -37097
24390 -37097 -114788 -151417 -79202 -12109 16407 -29209 -18069 13924 61386 -57921 24296
24379 24296 212910 298137 181026 202304 71775 -211374 -227150 -153892 -121417 -157787 71004
24368 71004 155298 8357 -138578 -108455 -193150 -268974 -265269 -208044 -212202 -132804 -145578 -190203
24356 -190203 -67151 -104883 -274630 -243122 -211419 -153405 -40188 89189 -61674 -385140
24346 -385140 -312106 -119082 -182844 -67663 -173225 -31233 79937 -23866 -51515 15507
24336 15507 108544 35889 -62769 -79525 -50001 107039 42527 110595 120909 176460 147399
24325 147399 145627 72425 -115599 -111773 -16907 -53165 -99561 -143701 -95761 58833 -32046
24314 -32046 50190 126657 200605 156537 257198 268541 150295 6400 46852 99428 6485
24303 6485 -187062 -364335 -213984 -10718 227048 168774 90425 243236 250330 19866 -172114
24292 -172114 -45822 72310 1659 -77960 -122095 -130712 39763 110870 113923 9166 -62447
24281 -62447 -16968 -134213 -267612 -328103 -376071 -364218 -306539 -402824 -387332 -175440 -94826
24270 -94826 -122585 -56548 -132695 -276403 -49517 15982 58460 82724 139910 123269 98612
24259 98612 232773 307293 87419 -25274 63478 133739 91766 695 -37344 -22360 -2929
24248 -2929 -39890 -18970 -37676 -202335 -258198 -219863 -203665 -82767 80554 128403 -11794
24237 -11794 -91860 -149371 -163862 -152204 -181638 -162921 -266308 -431344 -403161 -257261 -154264
24226 -154264 -44441 -198184 -203970 -132741 -115612 -173810 -51520 -8997 -68384 57052 -21433
24215 -21433 -55916 69428 116189 -17031 -159848 -232843 -75228 43521 22030 3180 -75903
24204 -75903 125794 220495 182008 47469 42543 148103 198086 173726 -37627 32461 110430
24193 110430 233008 202596 39178 77831 33803 163870 161725 -120779 -257359 -240494 -104236
24182 -104236 -136374 -59752 52523 225572 343731 299174 137135 203251 161331 160572 48432
24171 48432 37096 -73792 -71586 14282 94044 56874 52102 19675 2382 -126599 -387948
24160 -387948 -522779 -348250 -117795 152439 129400 107688 97479 -9299 -196729 -302766
24150 -302766 -336466 -415225 -263517 -204511 -151864 -132671 -97079 -171588 -246314 -57287 250787
24139 250787 87650 -24948 -88706 -124114 -49835 149221 187127 220784 209550 172113 92882
24128 92882 27646 -11982 72641 46434 -943 -19978 -165788 -111483 -70193 5823 -58293
24117 -58293 -12239 13457 213646 151281 -88079 -48388 -25241 -4452 -113210 -170041 -139035
24106 -139035 -259328 -289310 -117942 -166004 -139724 -302137 -237651 -199386 -296339 -350483 -164909
24095 -164909 14414 120082 213524 331142 348566 378825 349534 137860 920 -81560
24085 -81560 111299 70083 -150886 -262586 -194901 -3920 15345 95498 182808 61705 103869
24074 103869 24882 8331 -43401 81865 128895 88027 -62488 -167394 -109728 33485 89793
24063 89793 58138 -135161 -362648 -373301 -257508 -74451 -56856 -235548 -179868 -49202
24053 -49202 123941 49768 -216112 -203380 -120630 -157105 -266650 -312614 -256518 -203006 35309
24042 35309 80927 -103225 -246910 -217485 -208636 -144749 -57560 134521 109175 79213 -59878
24031 -59878 -158729 -46961 36173 5705 -63529 -132342 -51823 43545 65525 136360 -18034
24020 -18034 -22950 50728 53903 46858 4078 -20424 -104985 -291588 -327661 -289304 -258307 -83678
24008 -83678 -215222 -166096 -228439 -299122 -269066 -215012 -69238 -11011 21152 14053 -13822
23997 -13822 -57704 -179367 -238200 -164102 -35992 -83989 -271369 -129618 94964 165165 115358
23986 115358 126069 78438 83854 -124741 -323065 -104607 58835 -186670 -274639 -176521 -203500
23975 -203500 -15036 -54902 -7688 16173 17637 135867 87732 -108799 14316 23925 18573
23964 18573 -75783 -18253 -29765 93922 111924 119178 6900 429 47350 93539 101078 1847
23952 1847 -27879 14619 -139220 -205149 -33614 142543 74305 139807 193093 89947 69242
23941 69242 -27778 -100367 37596 207454 181871 64166 -231998 -266614 -120494 -28274 45677
23930 45677 -69845 -41411 2412 -206423 -245805 -220582 -263705 -305657 -277872 -166912 -94231
23919 -94231 -53824 30217 -2427 23156 20693 -18312 34235 45590 46638 -69278 -222278 -182803
23907 -182803 -207876 -230957 -314449 -363904 -332763 -396038 -535533 -571195 -534516 -407890 -318195
23896 -318195 -330602 -277978 -117767 -152352 -258910 -246049 -357234 -289071 -100585 -4466 -4312
23885 -4312 -31439 133031 207231 81471 -70930 -180547 -168411 -53308 145541 174581 251699
23874 251699 86787 -85055 -135361 -179799 -236255 -161402 9695 153377 206104 127539 60464
23863 60464 102163 51722 94151 -36272 -27574 -71580 18673 5193 11605 54326 61438 144508
23851 144508 61813 150784 417797 360065 126718 -25942 -70959 45011 262701 249869
23841 249869 77713 -27247 -149766 -118975 -66460 48073 -139425 -233402 -210785 -201626 -228128
23830 -228128 -246765 -304651 -170310 -64762 -64537 -174449 -280344 -401109 -205323 -83234
23820 -83234 -76120 7442 152866 103242 13735 -88764 -10868 130364 49741 -196710 -218569
23809 -218569 -168316 -149517 -76702 -91324 -187393 95948 281022 249839 83489 -59210 69171
23798 69171 68595 -15346 -33380 50642 -46723 -80712 -159173 -193701 -70477 -71008 -129333 -26515
23786 -26515 164291 144048 34642 -62775 -83421 -309545 -370206 -278685 -132641 -22232 20866
23775 20866 42552 46443 -104035 -62707 -48982 -139947 -134218 40758 160092 145628 139283 96690
23763 96690 201663 197186 225471 99251 -68356 -183066 -167284 20673 78322 84370 178207
23752 178207 10164 -158262 -53808 43629 43879 40416 -12792 -42245 78935 60760 -71959
23741 -71959 -126022 -15450 76630 9771 -54364 -3568 121093 112457 -96654 -314778 -223661
23730 -223661 -196908 -322392 -322384 -174362 -131380 32972 -22771 -175569 -345654 -343679 -259702
23719 -259702 -230222 -234013 -91794 16209 41819 111585 22338 75277 59451 70303 -24970
23708 -24970 -42921 -19538 -44203 -161715 -189145 -155871 -85277 -34762 22230 123004 233625
23697 233625 271474 104785 144225 167688 121970 115780 90227 116620 -30980 -40711 43060
23686 43060 87709 12373 120043 107319 119149 22797 54940 21596 -26319 62609 15058
23675 15058 -127492 -229055 -156354 45700 59156 -44881 8388 69656 65931 -54351 6003
23664 6003 59491 -31473 -10987 -24253 -94918 89784 65744 -12987 -81746 -25637 26273 -14736
23652 -14736 -94902 -14713 33919 -2617 -60744 -91745 56639 95896 -149156 -89992 156899
23641 156899 288572 211377 38096 3802 34972 9094 1845 -101230 -136094 -178425 -225949
23630 -225949 -142303 -99395 -159462 -238580 -189415 -271611 -157701 -66216 -186405 -97989 23288
23619 23288 125395 -3090 -70770 22964 73033 -165713 -273276 -83767 106704 78004
23609 78004 3035 57095 128126 186524 271351 221791 28157 -51641 -91758 -251481 -122272
23598 -122272 92455 -20353 -116013 -216335 -171413 -81775 10967 69657 23943 -36474 -165605
23587 -165605 -126491 -38288 -131974 -237191 -241079 -137755 136106 151643 43815 39594 61836
23576 61836 109291 -14517 -173441 -147855 -132145 -162704 -122302 -81586 -73235 -59083 22387
23565 22387 136904 204264 218868 131706 -104980 -52242 -6936 58707 225909 193514 62757
23554 62757 78469 -82981 97319 106436 -144586 -254767 -311830 -291809 -104584 -90895 -55243
23543 -55243 71713 171036 138887 1183 -4862 -35220 140520 123125 -90686 -156930 -71260
23532 -71260 -173871 -105649 -10248 40985 -33898 -104575 -229071 -186646 112729 293795 186758
23521 186758 -4753 -119307 -178622 28211 118076 244144 194515 79816 192986 -23073
23511 -23073 -61140 90166 136919 136201 209332 299643 268721 32125 -102142 -229995 -220799
23500 -220799 -178086 -231663 -164649 -104845 -145811 -222187 -192090 -201268 -331550 -382513 -252549
23489 -252549 -173591 -182620 67188 212709 212106 245322 127771 164430 221647 73766 42410
23478 42410 -507 622 62809 44252 81557 -140865 -352315 -326639 -208307 -227367 -177901
23467 -177901 16658 158533 -15576 -191047 -280705 -187650 -120804 -19437 177370 51416
23457 51416 44794 180661 145065 54345 34951 27150 40326 -147604 -360341 -221100 -124397
23446 -124397 -68452 28838 77125 -138665 -231957 -69816 55269 -70750 -224551 -255061
23436 -255061 -278986 -354363 -461802 -484581 -371025 -222064 -17074 90234 141923 163882
23426 163882 152355 117912 211211 152314 195221 264396 176761 24286 44838 56607 59539
23415 59539 70414 167408 132843 170545 120362 217961 294039 168478 65659 -129495 -48820
23404 -48820 113498 30348 -120219 -233416 -416681 -248114 -64194 1660 -101237 -80339
23394 -80339 76616 204524 254710 168411 -73561 -161463 -16513 101649 13847 -177858
23384 -177858 -248870 -136315 50456 -72162 16667 86672 154397 103133 -4420 -70853 -212890
23373 -212890 -263210 -248987 -185588 -287493 -303349 -253394 -155422 -28814 97340 74117 44015
23362 44015 226064 356231 283632 49219 -256886 -325288 -114116 -123049 -298195 -123236
23352 -123236 -52146 148884 220125 231497 147055 19495 -43995 -85961 -148240 -126524 -111653
23341 -111653 -150398 -113579 -196737 -297546 -295885 -224460 -222287 -220925 -211140 -163290 -201516 -143807
23329 -143807 -177068 -155085 -90591 32634 99410 30090 10180 14834 -69007 -179504 -93413
23318 -93413 -132022 -163921 -127248 -96534 -164424 -103103 169929 141403 84454 -305 -25520
23307 -25520 -62704 -10675 107183 -35542 -94517 5771 159802 157196 177500 228795 62807
23296 62807 80305 139234 196985 198746 25208 -179094 -108848 46195 -25883 -66628 -11183
23285 -11183 -67884 -154859 -185645 -187576 -139837 -192287 -184635 -66592 -107925 -111662 -115242 -187984
23273 -187984 -71314 -88596 -257513 -214047 -100379 -104261 -138007 -129142 124346 161294 102661
23262 102661 228763 258426 219446 263244 169370 74996 20365 -229101 -287446 -295213 -304708
23251 -304708 -287600 -3101 195381 161812 47857 3330 -51999 -242048 -300419 -206099 72803
23240 72803 135239 -16600 -49344 -67966 -190410 -95612 6755 6377 -174994 -223098 41169
23229 41169 61325 -26855 -137886 -201253 -208766 -240678 -45015 130479 -16052 -217252 -278188
23218 -278188 -188720 -83402 -90582 -191353 -169810 -131211 -65033 -117617 -237664 -224432 -116005
23207 -116005 -147065 -90350 67069 137405 -17115 -284441 -383745 -416158 -466372 -269240 -212357
23196 -212357 -283463 -171976 67477 172195 44589 -98099 -166957 -121641 -209419 -180315
23186 -180315 -21557 35355 208010 255650 107871 62805 62333 224298 482636 774632 1086198
23175 1086198 1213203 1296486 1408100 1505433 1403035 1347340 1158348 947191 596885 252047
23165 252047 12991 -48821 27298 30830 9742 -16222 -62859 -61224 -158211 -276480 -175528
23154 -175528 -54951 -46905 -63345 165640 171240 47897 -13622 88096 178156 103807 162171
23143 162171 48675 -31474 -20155 -38355 76054 76348 95189 160581 144056 169322 263752
23132 263752 216459 61723 -171150 -229501 -79904 -126123 -78679 -83732 -83149 -159521 -217721
23121 -217721 -305323 -241064 -92062 54665 90641 -24778 -99928 -98100 -123235 -55342 -14706
23110 -14706 25981 79102 185826 90148 5896 64408 58668 27041 -1553 24924 125189
23099 125189 168153 71327 -88796 -108884 10788 147919 98263 26615 112079 -20998 -161126
23088 -161126 -293557 -200866 -115521 -85265 -202739 -129160 -90524 -28841 -115712 -76157 -142944
23077 -142944 -92156 -108247 -133761 -39113 35693 -24181 14276 104039 15449 -110067 -220874
23066 -220874 -281413 -146674 -7284 -8778 48368 -9962 138585 264396 273528 260843 24008
23055 24008 -68112 21163 31752 74091 120283 -65461 -163790 -190170 -61334 81913 19003
23044 19003 -27172 -37675 -31483 -81286 -200527 -165536 -155992 5539 107047 105042 83720 -43334
23032 -43334 -48579 40730 56247 163738 218076 183246 -113 11819 98505 249828 151956
23021 151956 -35823 -163942 -186145 -140956 -33837 -4276 150569 43120 -128601 -202643
23011 -202643 24694 118831 -155265 -170636 15243 59478 120409 117478 165995 106177 182239
23000 182239 185215 332445 309233 -21883 -121665 -17724 -133831 -51438 16979 42408 90110
22989 90110 -36250 -11717 69207 97698 97436 66976 16393 -98335 -183537 -103024 78443
22978 78443 143617 150494 66999 -12271 -55928 -96519 -244728 -216122 -147551 -142785 -38182 7366
22966 7366 -159212 -115226 -61761 -17903 94896 193498 275325 169866 -57783 -186454 -245951
22955 -245951 -268971 -148708 -52836 -51687 -147911 -78763 -135379 80973 262891 126823 61375
22944 61375 -53964 135138 215199 92679 -48296 -88758 -91873 16810 150449 256653
22934 256653 334957 438663 363752 47856 -58137 -23690 36084 69480 33633 216531 283157
22923 283157 264065 158404 122387 155649 216591 193863 203600 24196 -112009 11516 152018
22912 152018 107910 -19034 30226 47824 156716 203665 215147 194932 189964 131747 -21327
22901 -21327 82825 51313 76629 143964 10697 -72862 -137099 -114576 -117568 -127148 38261
22890 38261 132544 -2024 162605 176351 56618 -48534 -147013 -100080 -45268 -67277 -77954
22879 -77954 -107471 -105027 -54895 -142498 -162438 -56002 18252 45439 39117 1185 -44407 -159306
22867 -159306 -210308 -136120 -79308 13720 127831 181138 28544 -139117 -52635 -64673 -109313
22856 -109313 -86994 -19888 -35787 -163998 -111687 -46047 28825 48483 144228 288637 170256
22845 170256 -14145 -81136 -104816 -42905 -59173 -113248 -126770 -300381 -272002 -130390 16052
22834 16052 12665 -149129 -146711 -53769 63449 86666 -72612 -181894 -128542 86057 31626
22823 31626 -60576 -27306 -94763 -11895 96929 200697 79188 -105301 -76181 115599 209294
22812 209294 181047 228264 277944 234263 153158 139315 -47593 -190096 -184483 -104442 136570
22801 136570 169145 188047 152509 145826 150608 -20844 89955 173854 156855 216352 320929
22790 320929 144178 14626 -1515 44239 -112817 -195306 -64191 82571 90191 105476 20005
22779 20005 -12074 -91010 -109058 -89068 -87574 -280102 -334280 -244192 -105274 102316 138523
22768 138523 103916 67528 118094 328620 173917 -144544 -160345 33723 94206 -19166
22758 -19166 -88762 79009 109792 84847 195377 272825 249147 195444 60447 303267 502912
22747 502912 331003 232312 160617 238691 371573 345306 274453 196835 187456 281242 281153 287445
22735 287445 359367 269263 102532 46299 -48936 156509 183402 161763 287318 154354 262149
22724 262149 319400 299282 268945 261996 194224 54787 239315 395905 406488 191109 -91821
22713 -91821 -179329 34298 275976 456797 536636 389656 249684 388572 506457 723167
22703 723167 1045326 1263123 1615588 1873406 2061923 2192861 2022418 1691922 1508245 1298633
22693 1298633 1187281 1090283 958544 804245 746790 659622 647210 708088 903198 1001819
22683 1001819 1080368 1126045 1220236 1156461 975624 804405 883089 1050744 1151828 1139332
22673 1139332 945040 835067 667540 753100 914497 1099786 1081917 1104018 1138047 1214029
22663 1214029 1254739 1298740 1320523 1447981 1453609 1610495 1644026 1615725 1753657 1881177 1855201
22652 1855201 1967107 2354620 2572956 2605313 2513383 2697369 2942624 3084081 3200105 3470925
22642 3470925 3741785 4191827 4856180 5503732 6077464 7036144 8568187 10643380 13300341
22633 13300341 17046588 22846276 31674252 46442870 70952935 106666306 152823255
22626 152823255 207037827 258780801 292454713 304867491 292186975 251370658 199381340
22619 199381340 149179271 104067927 70717951 50282939 38059654 30236506 24933783
22612 24933783 20850765 17908474 15729294 14105129 12812444 11673706 11010469 10524972
22604 10524972 10045044 9581082 9378975 9405334 9699273 10448006 11763708 13962633 16637903
22595 16637903 19779433 22764873 24432635 24796237 23508726 20697186 17200146 13689341
22587 13689341 10513272 8309806 6801073 5888743 5189790 4924955 4682708 4298390 4043828
22578 4043828 3743656 3433995 3211875 3156300 3242870 3193774 2866301 2760674 2671305 2633122
22568 2633122 2640986 2569369 2362275 2380713 2441390 2565393 2550277 2296847 2261234 2224373 1990493
22557 1990493 1818696 1797620 1710805 1633810 1690199 1843460 1835482 1982169 2264848 2589368
22547 2589368 2795822 2839657 2836713 2462941 2131660 1933216 1734816 1475272 1216171 858746
22537 858746 725031 955643 1104434 1096984 1146011 1044873 846034 790092 763290 796541 785541
22526 785541 783968 909073 945136 802821 770554 669778 559908 621964 578853 453900 324492
22515 324492 353405 465820 345955 325810 232372 94285 62623 134452 68480 188358 394898
22504 394898 211370 128573 132521 99472 140080 99820 100665 168792 206852 206110 280477 446799
22492 446799 358635 225440 79731 210030 227746 152517 298859 282742 117981 348814
22482 348814 528666 530857 203064 105204 128172 77809 -139051 -103416 38554 -80105 -121445
22471 -121445 -79354 -423 89546 175921 301600 231846 124714 76210 36273 161596 276564
22460 276564 385257 463887 388491 276596 132811 159794 156859 92776 115159 221863 399807
22449 399807 192168 137962 147715 159553 169022 132345 42741 49299 153626 225895 194771 149722
22437 149722 -27830 71906 176057 282064 336249 259809 64949 -7317 -121292 -100914
22427 -100914 -100297 -58335 54611 44507 50415 135195 176493 84238 82494 7500 -129498 -176042
22415 -176042 -89192 42146 -90702 -45627 38899 94659 111091 -16555 -63964 -26810 -33678
22404 -33678 -142306 -117477 -129752 -226430 -235165 -206395 -113819 -176064 -139575 -104739 -138956 -139724
22392 -139724 45734 195936 170899 241237 336378 300664 174208 163811 69681 92507 250443
22381 250443 77399 -103374 -59595 -9887 138301 52729 -5119 -91492 -160074 -102916 -107689
22370 -107689 -220807 -224326 -115016 -30669 -86759 -142679 -100695 -56469 66780 92187 148058
22359 148058 237582 301072 211833 120213 -44368 -213741 -182348 -60361 -125782 -78155 32322
22348 32322 -65724 -148007 55226 195533 193676 247896 195308 91921 130839 25007 34025
22337 34025 -27029 86675 37434 -87307 -11290 -9235 109310 174403 320535 262011 233697
22326 233697 172721 66078 153078 75529 -63816 -87023 -188865 -311596 -258629 -75979
22316 -75979 58732 119931 270629 168681 187223 177984 20562 -98058 21188 -18741 57169
22305 57169 5905 -83226 -189381 -276279 -127476 110230 124602 19287 79516 154959 45135
22294 45135 70077 228214 263941 101979 93806 27911 21510 38299 92182 -78609 -37415
22283 -37415 192278 24070 -39878 -78802 -98169 -62325 -129106 -37942 95236 -89741 -66965
22272 -66965 38384 38955 134819 149817 144627 87530 -54929 173642 82664 39398 -33035 13850
22260 13850 85768 -37980 51073 -120419 -68758 131261 109377 -69527 -70339 86648 74070
22249 74070 -45578 55551 -37857 -139979 -47653 174503 277225 195333 129487 74672 -1546
22238 -1546 -29430 -66996 90775 133749 83114 14715 66474 66146 -96641 -59333 -156222 -176760
22226 -176760 -275133 -305905 -316013 -344754 -236375 -135135 16454 8778 125790 120182 51537
22215 51537 -6686 -215333 -228693 -117071 79186 95786 -54621 -84035 -33535 -35739 -55372
22204 -55372 88910 292749 47337 -22867 -45727 -292637 -201432 -30938 20591 164311
22194 164311 193186 204915 38722 20228 32893 59258 181646 51582 -110563 -68379 58811
22183 58811 60604 -7850 -264539 -276618 -230433 -261377 -138066 -128244 -228910 -130458 -75433
22172 -75433 -34332 74137 -21687 71481 222619 149153 106135 -67267 3961 75033 153478
22161 153478 249558 193219 72402 13123 6908 -103590 -95232 -84582 -95674 -108821 -263863
22150 -263863 -203706 -182918 -200665 -148287 -117727 -43465 6314 29639 -40738 -128032 22831
22139 22831 125761 122899 199841 185834 138767 11048 -50962 -98104 -62205 -114537 -181136
22128 -181136 -363004 -282744 21027 159042 235029 256507 179040 116018 47314 -124240 -71361
22117 -71361 -99814 -331267 -332956 -161652 -112532 -98056 -109374 -129880 -103121 57725 16420
22106 16420 -65143 -150255 -248785 -199208 -128241 -107977 23920 277459 352675 237973 113618
22095 113618 100507 110478 136420 214599 208257 71215 -38109 -56206 -84402 -25658 14179
22084 14179 115104 116537 -104337 -192831 -160487 -89998 121455 347180 397898 316229 247805
22073 247805 167534 133481 345380 457135 539485 893460 1284691 1479543 1431107 1373992
22063 1373992 1341890 1174733 977155 683293 467806 328466 280049 232866 250782 149113
22053 149113 85386 10545 43556 51416 32224 209796 295555 220150 196151 111290 106759 93291
22041 93291 15393 34842 142893 215822 177943 228201 79484 5329 80817 -76315 -200399
22030 -200399 -297078 -203755 -267605 -93236 91497 -30676 -180158 -101999 106787 160279
22020 160279 86758 75961 92459 -74849 -114335 -101442 -118406 44432 106130 97773 84635
22009 84635 78451 18833 -73311 -100054 -10396 5646 151078 138648 213313 213255 36059 -46447
21997 -46447 14456 131047 109919 74966 97685 88983 12358 156781 245693 182338 -99843
21986 -99843 -204989 -245627 -228542 -158183 -80092 13678 43645 56041 -238382 -304670 -286130
21975 -286130 -276626 -223404 -280880 -266317 -178748 -52304 98811 -5534 -178360 -321170 -368477
21964 -368477 -457927 -411591 -284547 -202909 -186702 -130785 -88777 -103050 -186322 -231499 -276135
21953 -276135 -231871 -130632 -100222 -176778 -246883 -218376 37600 133256 89684 126228 -8169
21942 -8169 903 -4174 53672 -52888 -126054 1891 -26346 -174909 -183358 -86088 57083 100880
21930 100880 170302 24115 -92915 6514 -58661 44044 22138 -61494 -51635 -163304 -181953
21919 -181953 -159669 -224741 -418227 -313241 -49955 42573 103295 102745 -113804 -294837 -462890
21908 -462890 -251642 -188547 -86421 1083 87399 61556 87670 -70185 -195883 -191899 -111700
21897 -111700 -179293 -158150 55184 109792 48924 -29961 -13752 -124031 -190565 -251354 -216470
21886 -216470 -74479 -5451 -75 -11117 -90165 -5953 240045 228088 81177 70690 49558
21875 49558 85331 280171 271650 132970 125704 1477 -71609 74372 198814 324816 133108
21864 133108 -100042 -191764 -241321 -140940 13628 157137 136091 26422 5732 -65937
21854 -65937 -149525 -67766 -78260 -80540 -134877 -47587 111675 118722 189659 164927 135185 185883
21842 185883 23946 -158099 -225951 -271176 -142265 58744 181934 182293 73459 77090 159369
21831 159369 22080 -82188 -246649 -318543 -353308 -228473 -132019 -240592 -224712 -300951
21821 -300951 -192420 -162490 -217180 -174739 -145633 -295460 -336884 -303980 -211007 -34718 -47664
21810 -47664 -186914 -143019 -42823 94254 -3476 -95842 -100631 -35437 -70574 -194718 -158054
21799 -158054 -214512 -253286 -408748 -379178 -230380 -188070 -321376 -214046 38371 5092
21789 5092 -58752 -189014 -65963 60385 49522 26493 89076 -49062 -64683 -69832 -286697
21778 -286697 -291318 -58273 -49519 77554 218835 134186 105909 179621 36565 -106458 -344602
21767 -344602 -351286 -206929 -170279 -208483 -132922 -298721 -351345 -232750 -108906 -66552 -247793
21756 -247793 -356443 -301880 -262740 -162262 -197463 -272439 -347551 -305256 -144727 -146134 -168733
21745 -168733 -40414 15096 36580 -75055 -84435 -68510 -156921 -226038 -82813 138894 168727
21734 168727 82917 -131895 -43622 112398 236881 132478 80737 -21242 -184967 -163563
21724 -163563 23111 82555 188460 167735 139218 -7183 -58923 19992 181282 196326 112943
21713 112943 58643 -74807 -17796 -16440 7646 -65626 -79212 26659 139437 178981 38303
21702 38303 -92005 -41389 18669 2490 6084 146458 156331 -200720 -51528 -33474 68767
21691 68767 160248 135966 67588 -80599 -247254 -199914 -78882 -130583 -148993 53993 8791
21680 8791 -19326 80851 -3112 -62775 28446 160337 194199 243974 196057 252257 291481
21669 291481 167736 144488 -76234 -219081 -172765 -177447 -116721 -112040 -17903 23818 -122545
21658 -122545 -77215 -39594 -333656 -468084 -538520 -236535 114634 81599 -40286 151043
21648 151043 410812 329180 -20872 -180334 110665 288474 152442 -147740 -248231 -299023
21638 -299023 -334626 -264454 -222069 -177888 -251403 -200519 -55086 -188356 -354014 -195329 -172540
21627 -172540 -97707 -19668 71311 66179 78099 44794 -120373 -96331 -76894 32193 55580
21616 55580 -189875 -383612 -256858 -178472 -87199 65420 -16201 45138 135745 43533 -87427
21605 -87427 -122251 -6178 -2571 -111447 -192092 -312683 -213989 -121906 49410 162100 272973
21594 272973 170657 82485 -92479 -72401 -11460 -37990 -181254 -204958 -136896 -37103 127980
21583 127980 243948 274763 297033 254669 124177 58814 -79382 -55428 84998 140948 107654
21572 107654 171893 232356 256394 246455 230939 247119 231865 -21385 -75847 -113928 -45629
21561 -45629 134773 28045 -20562 80864 100655 -123223 -149535 -39853 3906 -89549 -108134
21550 -108134 -108349 -219169 5377 169017 91516 -41938 -84312 46572 7716 -26438 -140214
21539 -140214 -333392 -313748 -327626 -148968 -83174 2458 -22460 -23911 -80506 -152187 -179878
21528 -179878 -44137 104994 99530 -41052 25856 234317 324077 171270 -52965 -118515
21518 -118515 -179815 -5050 33262 -16118 66888 74364 58160 93767 224840 157170 180372
21507 180372 166207 133903 -24448 33727 -43449 19485 -111252 -17755 68500 213472 285764
21496 285764 217118 288577 107654 26469 -73698 -7216 -120968 -181296 -200477 -158110 -176687
21485 -176687 -141091 -67750 -56759 -218702 -214804 -341471 -463409 -540388 -305786 -66108 -31435
21474 -31435 -9743 -84540 -337063 -381234 -349555 -177626 -207748 -159038 -38640 105668 107017
21463 107017 31309 -22301 -86284 -217352 -139304 130140 162779 10217 54972 114055 190974
21452 190974 184245 137627 184656 239379 456922 508176 506666 682765 582440 532917 570417
21441 570417 460895 392494 337266 394450 367742 277234 385507 417912 431311 580478 552930
21430 552930 573683 515381 569692 438346 377961 407461 505833 681441 619721 465855 242746
21419 242746 260588 243457 205572 57568 51550 -76509 -100088 9316 103887 -55073 -229215
21408 -229215 -177446 -178898 -185007 -119163 -160891 -37683 59704 59022 274592 290049 131579 62688
21396 62688 49360 149414 174473 151032 39879 -31780 58436 24094 197443 345079 292905
21385 292905 226918 131965 104726 58262 153755 162196 167411 254593 191440 178286 10216 -176400
21373 -176400 -208355 -66278 16920 56464 -23551 -124486 -119803 -187771 -91995 -14487 58434
21362 58434 11578 -61690 -224443 -157336 -172896 -113941 -38744 -145062 -159581 -112719 -176127
21351 -176127 -259333 -345263 -259878 -47194 166178 119740 168430 258199 244950 219886 85075
21340 85075 -19661 -72534 158441 272036 182565 59775 71122 163908 30671 -105024
21330 -105024 -140576 -246222 -320383 -239515 -205221 -78512 -65835 -178472 -335473 -308101 -243397
21319 -243397 -175996 -19958 -10898 -113116 -163120 -109587 -110757 -155914 -302649 -290045 -81618
21308 -81618 79695 33859 78528 139002 29751 -36716 -11038 78716 65790 9366 6902
21297 6902 145958 110106 113574 122564 141820 114922 197466 311032 234888 66123 -102056
21286 -102056 -209980 -16359 -18420 78135 189708 359659 460823 521985 446237 377145 227303
21275 227303 23237 -79576 -218523 -201170 -113164 -218133 -254940 -77374 16655 102714
21265 102714 124475 43825 22006 -207729 -191555 -104456 -11959 93173 194477 130082 -76305
21254 -76305 -145944 -210552 -97310 45172 256845 130388 169460 175515 113112 104113 32070
21243 32070 -192621 -100670 133873 215811 203581 45403 -151711 -254325 -241881 -100325
21233 -100325 19339 43640 -19970 -108089 -274576 -220822 -218029 -162200 -213276 -267065 -163687
21222 -163687 -63483 -211752 -240812 -197059 -134948 13601 179306 184840 307867 180742
21212 180742 85988 91820 118745 240173 268954 31245 -180015 -204253 29338 158290 -3505
21201 -3505 -270019 -309224 -169765 -102483 8387 57766 262832 159412 14685 -6226 67270
21190 67270 -4096 7827 -71674 -74017 -28697 49457 89505 -81820 -194397 -152586 -109026
21179 -109026 -186611 -108839 -89232 -186549 -210456 -210455 -209298 -83307 84363 44612 143406 68121
21167 68121 -115522 -126630 -63387 -52027 -44688 228090 119776 137699 86242 -30921 134217
21156 134217 136694 -58384 -87338 -18004 88774 147326 18074 -111061 34993 65683 100563
21145 100563 145546 241967 199389 95420 133816 47389 -100049 -80571 62316 120658 222774
21134 222774 142759 112724 147703 159575 126008 -45549 -53790 -100233 -41082 -79110 -56850
21123 -56850 -38647 -88440 -83061 -220189 -207446 -264047 -186015 -271032 -88149 71342 52385
21112 52385 -142941 -65956 103639 129816 140404 111343 18682 81681 88813 98161 113160 32784
21100 32784 -53538 -81406 -104008 -134084 -197822 -225656 -131059 -849 -45718 -60161 77325
21089 77325 -126953 -247512 -100196 -50026 69078 136225 28121 -3684 40435 162637
21079 162637 195575 161327 196456 174057 189428 60946 -61895 -60288 -19289 -33443 -236149
21068 -236149 -223309 93065 317583 292214 165635 4988 -56430 -80147 2945 92213 169013
21057 169013 113854 -78548 -172254 -106858 33042 -9525 -17905 -70336 -84435 -97823 -149059
21046 -149059 -122418 -15263 -82599 243 115898 103530 4766 -100323 31110 176754
21036 176754 161274 98826 76662 -25961 -40008 40994 52255 38479 92877 152136 112034
21025 112034 95973 149368 78859 73955 78430 7441 -7168 -93190 -96100 13026 -81978 -31100
21013 -31100 -90699 -157863 -78046 69194 127779 156451 130559 5559 91907 131111 -70453
21002 -70453 -107595 -11936 -93549 -233125 -112182 -93262 118165 282482 260593 158567 218823
20991 218823 196556 198866 193181 253375 225529 243404 233896 281882 283358 364770 304326 186600
20979 186600 270515 286246 254605 200737 136780 214546 220305 161327 159582 242942 302646 243859
20967 243859 292571 388181 309961 277984 224097 183298 226665 314184 331029 391848 208467
20956 208467 57522 63350 136736 270065 413344 384289 269183 277322 181874 117992 184962
20945 184962 343186 389778 343877 210912 239979 382251 479731 384828 479642 663737 533471
20934 533471 543262 527793 452760 303974 374778 447546 287084 302509 555973 699520 764985
20923 764985 883332 931951 835275 667558 736707 832100 951651 975366 886083 790307 1019101
20912 1019101 1035276 977172 1007326 1188824 1411866 1489211 1461791 1488376 1619514 1616347 1693343
20901 1693343 1843206 1938626 2078322 2164540 2210500 2297138 2503726 2776728 2995252 3202189
20891 3202189 3434256 3704285 3981560 4371126 4792677 5443270 6225738 7227586 8733497
20882 8733497 10708576 13449107 16409174 19664771 23520477 27895270 33278902 39940010
20874 39940010 47298835 54465563 60649515 65095645 68877807 74091000 80231524 85535270
20866 85535270 88443483 87451034 85423647 85756465 87646667 89814383 91308595 91126706
20858 91126706 90646111 90563479 89744353 88928370 89463136 90464497 90586724 88160839 81852455
20849 81852455 75067596 70344598 66554030 62251170 55812565 47512357 40181624 34551870
20841 34551870 30098637 26307308 22707446 19253803 16335010 14037054 12537832 11440535
20833 11440535 10467869 9772163 9223531 8767932 8311687 7912964 7567570 7332768 7070539
20824 7070539 6683166 6356015 6175273 5875849 5650316 5334829 4993615 4820155 4709834
20815 4709834 4687668 4614843 4508681 4401162 4115768 3997040 3838221 3893663 4037709 3819662
20805 3819662 3386539 3042876 2906593 2822987 2797764 2576856 2393794 2339407 2207003 2089724
20795 2089724 2015909 1728438 1522605 1601933 1658477 1758294 1840482 1847879 2026941 1771851 1540878
20784 1540878 1345332 1210498 1126221 1015035 1033147 1121282 1087175 1057717 1052156 1055261 1042086
20773 1042086 1025147 971922 1015823 1076204 916239 859183 843965 919366 797905 679937 643387
20762 643387 670190 736006 640138 658911 845207 1006856 853909 650090 474042 529189
20752 529189 471924 441346 363513 294115 350547 342308 225246 77876 79466 244212 180772
20741 180772 85380 160574 353579 439587 392474 219054 214219 109130 159621 267801 154177
20730 154177 114493 275916 202888 123237 135271 186333 141016 89940 120739 114130 74407
20719 74407 218987 400075 380207 255870 266144 179181 228368 199504 221242 240167 436544
20708 436544 477704 326385 327738 304989 239112 282825 262715 284463 204717 248042 353838
20697 353838 452075 487479 488039 397909 283873 392401 360612 363485 353676 225927 81023
20686 81023 16933 179086 231405 268929 164739 110281 74648 114316 302340 379610 465518
20675 465518 373999 365326 231624 176432 158094 232761 134535 114688 7826 25941 155274
20664 155274 258680 250568 295452 313085 279103 139673 64564 181232 43907 66809 174590
20653 174590 138963 -16589 17419 121074 34361 -30190 -43803 -138473 -61428 -14827 -10466
20642 -10466 60626 161859 171380 69019 -27613 124911 176156 110138 93961 74050 -10455
20631 -10455 -31637 -30295 -22019 -47287 -97542 -55588 -62279 -259765 -306605 -228135 -161071 -253088
20619 -253088 -197710 -12218 211376 309087 236584 141953 9015 -100300 -35482 141676
20609 141676 159251 118375 111019 62948 40001 230121 240966 295124 263342 303978 381574
20598 381574 275512 177886 41190 -36399 38476 158571 113461 170183 127334 -61208 -135609
20587 -135609 -153895 -113524 124274 375916 295423 211639 188588 227103 226790 226737 126466 45706
20575 45706 89296 168986 210485 24855 -129729 -44054 161974 361842 450888 231387 30666
20564 30666 -85361 -201132 -189162 -158741 -38390 2366 5627 -478 -86957 -68857 53962
20553 53962 37121 -51588 -152339 -98209 -72488 -177070 -115364 -165838 -165339 -164511 -85073 -135939
20541 -135939 -119942 -26835 -43142 -176661 -134860 -205601 -117364 -115496 24801 12069 -230825
20530 -230825 -105658 -120002 -202666 -279188 -181575 -166623 -159934 -121699 -119611 -55669 -22682 -40369
20518 -40369 -45898 45066 17876 -128510 -282153 -77926 -14650 -56599 -120338 -52713 54309
20507 54309 47036 -50347 -70725 28629 -27208 -181851 -169225 -49677 170298 170137 243543 471015
20495 471015 313520 2749 -67196 -179094 -246947 -342894 -453450 -352701 -305939 27757
20485 27757 58500 106103 248932 160730 -170004 -359847 -292025 -138760 -204482 -149305 -46798
20474 -46798 -106663 -125860 -225434 -274306 -221108 -23931 127418 99818 14357 167759 222195
20463 222195 42343 -45834 144782 75009 -113122 -147085 -105117 -113593 -170438 -36562 84939
20452 84939 129715 15860 -35610 3146 -46694 -86233 -37826 1657 -92266 -150587 24808
20441 24808 164026 1579 -204334 -335860 -263350 -146535 -105531 -174758 -178821 55040 116663
20430 116663 100469 142584 176757 338641 322572 256836 225514 160212 203932 209823 76405
20419 76405 30088 23498 -76872 -69087 -105724 -81963 91955 143946 -68769 -35819 10142
20408 10142 -51543 113074 52748 -93393 -4843 -7715 -2766 -46407 -45435 -152463 -246350 -208468
20396 -208468 -62989 111459 139639 -203760 -264238 -85497 -35741 273666 221730 79456
20386 79456 -106929 -56885 -143456 -211859 -206468 -153476 11075 120571 199310 250529 129371
20375 129371 67844 117921 189213 146485 24474 -3221 155569 250899 217510 -53130 -195405
20364 -195405 -145300 -16994 51163 98526 49197 126809 92738 231275 249939 148986 19024
20353 19024 -40577 -4372 65957 80546 -919 -67596 132154 -9973 -129934 -299261 -355129
20342 -355129 -130180 35456 -54445 -156650 -287954 -319718 -317015 -219308 -238930 -222924 -132902
20331 -132902 -84050 3424 -18132 90907 140424 59930 17638 -55722 -119881 -156214 -172995
20320 -172995 -168094 -57019 2264 108660 66692 -72736 -93994 76937 375166 358732 202586
20309 202586 150147 173501 127726 97691 413091 501800 376810 336544 374313 353514 421536
20298 421536 493105 356398 255938 208157 203670 353140 290623 186128 157052 163626 194908
20287 194908 314200 440663 552244 733248 676755 519451 354655 436633 448005 417751
20277 417751 344771 409898 434090 580361 659718 547908 512985 519596 417163 354647 339873
20266 339873 262534 185565 316771 187598 160218 162855 60639 60481 168720 250547 183338
20255 183338 231850 361285 502408 500009 347812 378850 384225 267393 205790 92831 46110
20244 46110 -49111 -16696 9674 166073 370826 405129 285813 134876 -24514 -70097 -96359
20233 -96359 -90443 -77651 -79363 -24057 117955 10758 -56454 -22176 -40324 -3640 70301 72588
20221 72588 -26202 -79650 -37209 -62076 -70713 14708 76975 -6834 -92229 -242012 -101868
20210 -101868 -47859 -121791 -125231 -199251 -169571 -84239 175341 169102 221603 116639 73504
20199 73504 75078 77340 19952 142961 260454 253108 185693 88470 -60953 -27738 182145
20188 182145 219985 5909 89286 279676 349050 439977 639157 689285 757086 687504 753936
20177 753936 706102 689968 440141 229277 143255 87826 94114 107502 304836 557955 611401
20166 611401 522150 596707 553255 398041 396310 430133 321928 266244 150986 256886 89045
20155 89045 -6923 -18888 -1138 -23443 -127981 10878 -947 14382 -72709 -1244 13973
20144 13973 134892 295485 344770 412026 351183 333730 285588 321609 387479 418946 440724
20133 440724 481829 470771 518932 427064 419298 295667 414178 628874 738257 771933 811709
20122 811709 1006602 945490 848878 861580 786940 675117 558931 462736 401240 349900 350423
20111 350423 258335 411277 445201 318778 312294 503539 510537 315025 184813 177443 150707
20100 150707 242758 218613 97191 143449 173328 191831 131711 124653 200462 36938 -90726
20089 -90726 -125518 -310524 -278240 -155294 68738 83719 116967 74372 74698 95051 -180688
20078 -180688 -189459 -13349 55554 89105 -54342 -168747 -143310 -55675 -85133 3315 46701
20067 46701 -30960 -146402 -186498 -157192 -154606 -195615 -173954 39126 189029 177184 294828
20056 294828 341074 113839 589 -47768 -103181 -105135 -243313 -351631 -362770 -208126 -145307
20045 -145307 -227141 -211776 -192878 -195033 -206836 -83912 -35847 -125721 -73052 23942 -61808
20034 -61808 -99274 -18367 156702 208994 485776 388868 63903 -88993 -62432 53384 21207
20023 21207 -242086 -76865 -54975 -157903 18103 9850 101953 119426 156074 128303 45901
20012 45901 -69248 -56170 -52480 -165709 -238344 -220254 52561 98973 -14748 -164388 -141566
20001 -141566 -35506 192715 230948 180839 218615 100459 87453 157528 -100852 -158679 -135725
19990 -135725 -140208 -59097 39279 110614 226134 308142 70442 -202712 -283791 -185747 19034
19979 19034 81656 112503 178579 207776 272454 249035 137736 34657 65702 154863 318696
19968 318696 440095 338930 424987 431777 367200 251901 174069 89600 96391 71566 148603
19957 148603 158697 194197 230863 257152 42038 49682 244850 58589 -94689 -130853 -110768
19946 -110768 -9367 -156414 -246730 -166334 -169733 -210592 -79495 34149 171904 4522
19936 4522 33541 144772 -5303 -14592 94232 56241 -76836 -44011 50176 71516 65141
19925 65141 168957 256209 335354 330487 437225 467092 375750 481699 541066 596850 400059
19914 400059 246413 359183 428185 297254 255798 256872 370074 510910 537995 535201 445151
19903 445151 196952 51062 74620 91463 279481 479974 282505 123236 205122 300875
19893 300875 124719 51547 71302 94716 -127425 -88952 36943 50013 139887 194372 120422
19882 120422 19103 96340 246708 106034 50217 18697 105738 347569 492893 576453
19872 576453 448599 562785 474328 409975 571990 578387 474606 541345 882608 1175688
19862 1175688 1214132 896645 803893 536880 344108 406233 481490 603202 462506 493858
19852 493858 604515 559755 538173 627044 617150 416704 197177 249254 182376 246097 371973
19841 371973 553248 567164 485861 266374 -6143 106060 161008 164129 183132 281926 486755
19830 486755 587459 723137 742402 746196 673229 682170 653937 547922 532125 606235 857703
19819 857703 1074213 1161945 1216296 1075933 1000858 1093211 1003045 930958 994566 962007 1014490
19808 1014490 1015539 1060214 1007992 981956 808072 536730 341582 162898 210105 232441 308466
19797 308466 302860 301276 309722 100308 238345 302729 340444 401600 209741 142726 80070
19786 80070 52160 257410 238470 143536 181266 94947 168968 173487 -23028 -69974 31285
19775 31285 96917 10312 62495 267850 465425 369828 298907 240671 163840 159134 190613
19764 190613 382883 532004 451294 368980 292080 109139 206708 205140 316473 414745 336995
19753 336995 85281 108096 144668 143801 180222 312375 330226 266445 281740 258842 386124
19742 386124 324055 270634 196816 296968 529074 635585 683685 737364 644244 650096 780499
19731 780499 867588 976482 1160819 1124735 1009741 1079029 1012781 1079194 1301640 1295210 1253038
19720 1253038 1295757 1144978 1169306 1204185 1251181 1386035 1261261 1105275 1018485 902156
19710 902156 692794 683687 735684 728709 838324 829212 882220 883586 940476 1158850 1297893
19699 1297893 1396101 1374309 1341769 1320328 1525927 1818263 2086425 2320659 2702142 3084108
19689 3084108 3443760 3805267 4266334 4627541 4828445 5280055 5789870 6320529 7035423
19680 7035423 8110892 10128152 13329739 17028470 21008004 24746202 27314964 28490012
19672 28490012 29307374 30572704 34294038 43129057 59031153 81630349 108236446 136641835
19664 136641835 160541888 171447771 171789343 164232559 146879605 124529283 104674482
19657 104674482 88534291 74958076 66951128 64770339 65999781 67431280 65586464 59957762
19649 59957762 52051091 42497082 33454651 26518162 21888902 19018343 17108230 15851767
19641 15851767 15024779 14647052 14636931 14716586 14374154 14262844 14431071 14703635 14950782 15251849
19631 15251849 15616392 16284807 17748747 20597212 25319481 32741828 42574216 53458765
19623 53458765 63990901 71593193 74011716 72637412 69788845 67611175 71088698 83449920
19615 83449920 104586307 133927241 170111127 205242493 232250183 251071747 252869905
19608 252869905 230846790 197795732 160948959 121832927 90514698 71884178 62278711
19601 62278711 58030588 56221600 53760019 49255778 43622727 37185428 30375683 25064569
19593 25064569 21331237 18678935 16921637 15608965 14611573 13863819 13332546 12796112 12095967
19584 12095967 11758481 11241223 10576136 9864183 9367441 8764563 8106202 7551882 7107468
19575 7107468 6739827 6536291 6380297 6026870 5697896 5400272 5245968 4900980 4586575
19566 4586575 4456771 4460994 4506557 4366386 4069792 3840910 3738637 3652858 3465073 3278362
19556 3278362 3262978 3128187 3023674 2782712 2657649 2623007 2693743 2523505 2558883 2444487
19546 2444487 2266500 2338105 2398782 2374706 2136456 1991453 1916982 1932848 1977388 2166218
19536 2166218 2219190 2220777 2066538 1977723 1882205 1737958 1674982 1484772 1506821 1621442 1523578
19525 1523578 1343667 1271987 1294526 1372510 1339435 1373476 1335743 1401653 1385562 1451409 1482780
19514 1482780 1414957 1360424 1360920 1171724 1069655 1098716 932486 793859 949303 982482 1062443
19503 1062443 966548 760797 814997 748958 899375 1111864 1039650 1002471 856527 920456
19493 920456 975564 953084 891235 807838 704945 738962 788700 815641 927087 1023049 852600
19482 852600 801315 657727 593811 706461 858286 1058396 1173267 1149415 1024030 1057674
19472 1057674 979416 1024735 1180953 1173044 974015 1047120 1170056 1137603 1135765 1294237 1180753
19461 1180753 1149951 1144375 1098927 1088558 1098210 902605 816062 772443 823417 841692 911476
19450 911476 1004958 1048101 1021748 906303 836084 824357 917404 898975 1213026 1272496 1072094
19439 1072094 1061270 1130539 1150249 1168178 1269594 1140295 1152989 1170455 1232777 1300846 1257288
19428 1257288 1232985 1291221 1385224 1413026 1494920 1830108 2117894 2339211 2494768 2596769
19418 2596769 2578435 2894372 3149141 3334495 3243833 3326827 3700885 4007468 4335800 4867684
19408 4867684 5646704 7076127 9456179 12281059 15318819 19014873 23502124 28147776
19400 28147776 32697628 36652259 40242324 41864432 41337768 40696434 40180869 38602329
19392 38602329 34973526 32327575 31154960 30866439 31509597 32824819 35009629 37741002
19384 37741002 40718014 43469565 44012422 42712118 41640335 40839319 38377186 33830138
19376 33830138 29626553 26231801 22954667 19949385 17711643 16362930 15822729 16174526
19368 16174526 17158819 18909621 21559354 25767965 32002977 39520450 46327067 51530153
19360 51530153 53618812 52324746 52357488 59033931 76436378 108664710 156158349 210256605
19352 210256605 259503717 297711300 308468982 286421726 256922529 230669848 199812105
19345 199812105 170147529 148861491 137309627 135326657 139670043 143207633 141677378
19338 141677378 137083417 127262017 112171448 98331130 90337971 87634999 87989628 90044383
19330 90044383 92068611 91190320 88705120 86465295 83727063 77317628 67855237 59367956
19322 59367956 52124819 45572999 39555823 34947539 32224190 31647338 33020152 36082389
19314 36082389 40627729 47455950 56895296 67161723 75909997 82017455 83234381 77425516
19306 77425516 69110684 66286862 72612561 87831814 108247072 131077346 156200368
19299 156200368 177485327 188426817 191489383 187005137 163360232 121835198 84666387
19292 84666387 61229586 48059937 41606274 39329821 39232319 39446866 38985916 36629608
19284 36629608 31738538 26223568 22248144 19622072 17522691 16009579 14878655 14182854
19276 14182854 14065979 14361783 14787207 15279785 15440136 15410521 14735206 13399063 12409736
19267 12409736 11970748 12013453 12867012 14438868 16395630 18784904 21154213 22420737 22645809
19258 22645809 21849824 19377596 15626985 12371215 10218796 8847514 8198769 8049964
19250 8049964 7900020 7727191 7397892 7008245 6406827 5923828 5668367 5474345 5086073
19241 5086073 4769037 4599819 4602372 4488899 4274027 4177835 4166649 4029844 3928436 3971295
19231 3971295 3850825 3898238 4108810 4228333 4266197 4303689 4477927 4645825 4684153 4904032
19221 4904032 5236171 5364876 5522480 5856658 6283105 6839873 7789929 9115867 10783528
19212 10783528 13410586 17452272 22575684 28828119 36468013 45620936 56078746 66999452
19204 66999452 78244929 89382830 98050966 104702147 110835755 115846729 117525804 113862762
19196 113862762 106338241 98608099 91311965 83334944 72673155 59838508 48965157
19189 48965157 40997834 34536188 28322088 22776372 18499129 15520710 13492745 12063192
19181 12063192 11001681 10258289 9704434 9096017 8702122 8351881 8186394 8063502 7847013
19172 7847013 7503000 7239289 6901950 6854138 6926855 6817718 6913217 6997562 7120998 7230779
19162 7230779 7359194 7750101 8748173 10252885 12332922 15167506 18835507 23570574 29055561
19153 29055561 35276734 41723178 48029454 54054472 58775634 62458543 66111046 68684406
19145 68684406 68964909 66341209 61845335 57418252 53404918 48569743 42065446 34939085
19137 34939085 29145612 24790122 20871096 16947547 13725074 11243879 9551313 8288951
19129 8288951 7409861 6896341 6420997 5903183 5612002 5430549 5128834 4751386 4466917
19120 4466917 4335505 4197998 4104685 3970482 3808019 3618891 3431758 3362121 3191648 2895514
19110 2895514 2666296 2698266 2604715 2427139 2321902 2313183 2379833 2343405 2348530 2452209 2406366
19099 2406366 2314089 2183087 1964751 1838562 1860072 1943737 1999690 2224377 2120923 2070613
19089 2070613 1807007 1570762 1475127 1549753 1502191 1495932 1633649 1713952 1717806 1703110 1565064
19078 1565064 1530053 1468653 1386577 1066052 858376 736272 738644 806626 868578 879221 801852
19067 801852 749435 755865 836259 842810 561692 312171 362187 501434 474667 628748 713345
19056 713345 737927 621805 714743 765782 652529 706142 735391 683866 689902 643329 691367
19045 691367 562805 490312 614123 816017 709129 584445 493984 597424 540155 445435
19035 445435 512369 873270 874658 617482 457263 540363 743907 774647 680129 726207 730919
19024 730919 721194 783117 757122 954568 1033670 1057048 1054009 1012904 1094236 1191317 1313498
19013 1313498 1404042 1596970 1836037 2276320 2623125 2975703 3173138 3303669 3285273 3461194
19003 3461194 4351223 6247690 8460603 10877598 13399081 15248623 15799111 15398522 14070203
18994 14070203 11787501 9626907 7789976 6273433 5410449 5102480 5075731 5261448 5578251
18985 5578251 5407040 4723702 4108895 3421769 2885820 2631062 2465415 2224217 1963054
18976 1963054 1757830 1575430 1583115 1404826 1344770 1216614 1289518 1389509 1574121 1551702
18966 1551702 1459212 1430873 1315948 1492413 1796990 2218575 2459376 2862992 3370494 4007278
18956 4007278 4441834 4616303 4472063 4468624 4643492 5107567 5937476 7033469 8453086
18947 8453086 9718475 10741721 11565999 11657959 10783273 9332995 7887080 6178269 4707586
18938 4707586 3777691 3219952 2883127 2851703 2771913 2677337 2428638 2247253 2102179 1781658
18928 1781658 1712998 1685107 1615389 1533742 1447992 1361239 1341862 1270817 1098740 1145787 1006146
18917 1006146 935009 915657 894093 1004604 1046858 1137653 973557 753371 645089 603045
18907 603045 594433 485250 579577 744874 895786 709867 551066 635366 749592 749496 693509
18896 693509 778873 542734 573552 497034 394038 298720 351171 334055 363672 494493 472886
18885 472886 398448 394280 411494 446660 320626 321626 458760 417473 343216 498694 513135
18874 513135 496474 501236 475850 580625 600760 461930 200837 398711 462613 454382 568670
18863 568670 566695 451888 398675 428256 450179 470533 410898 594435 630248 587228 618649
18852 618649 648872 620863 625656 624490 840653 802004 701358 985825 1130525 1207485 1188751
18841 1188751 1240640 1221380 1041907 1074096 1180789 1112742 1101319 1148239 1194137 1229306 1331900
18830 1331900 1318823 1031506 795401 720167 643960 715812 835381 619626 555170 436020
18820 436020 267438 129360 237894 394473 479884 677827 571209 588702 758903 790872
18810 790872 636209 680826 629302 739622 845285 736615 729877 745747 749579 580963 387136
18799 387136 427579 540995 644926 614275 736785 850481 1180451 1300794 1138745 984215
18789 984215 1086743 1068515 858644 802110 774774 634472 530441 478788 515525 503840 615729
18778 615729 807181 991385 883592 780218 719555 473028 507666 636152 783408 884031
18768 884031 1081095 1455236 1478316 1093045 736343 507947 381260 370348 373781 70094
18758 70094 75574 139207 207998 239103 285756 238830 71188 77968 32617 -36206 102000 184435
18746 184435 322055 152436 -18688 95352 200026 204835 133197 139051 108094 161682 93428
18735 93428 101763 -37098 -96712 -27210 27598 139365 46308 -74464 -1035 -29538 -14223
18724 -14223 204974 415304 462403 340667 267330 167342 153830 170181 255829 140956 105269
18713 105269 307865 303714 266700 156796 540502 690489 748395 581030 536390 527854 534049
18702 534049 554073 745284 861822 934341 878483 690658 568761 462311 405270 499437
18692 499437 522785 520981 817568 887366 692408 587586 484279 478840 520700 571773 584519
18681 584519 540035 590648 683821 797615 1002028 1221324 1340055 1370884 1373744 1439108 1480655
18670 1480655 1330084 1404482 1505997 1468519 1452336 1461267 1446782 1374144 1374373 1532406 1497156
18659 1497156 1411145 1407401 1429332 1355946 1167701 969465 845199 926890 1076529 913905
18649 913905 698989 807732 882736 1187007 1268835 1001803 890881 930030 986638 1016772
18639 1016772 1058125 1120293 1096327 1030567 980534 997476 1093467 1134655 1352236 1546390 1517999
18628 1517999 1528105 1703424 1887478 1995851 2024762 2012771 1956967 1921807 1968824 1820410
18618 1820410 1626953 1368143 1238276 1381902 1516867 1393989 1165221 1051630 845950
18609 845950 750658 749377 717595 761695 568451 331132 351077 244077 357030 567268 529871
18598 529871 339278 267253 435389 666275 586743 550988 652777 774342 851768 786490
18588 786490 798180 853314 974914 800720 837159 892346 908239 1027891 1098078 1229239 1113755
18577 1113755 932365 931711 715133 666184 872579 708200 507332 398900 243094 260579
18567 260579 190397 146707 129302 220080 244363 378976 504253 608519 520346 425769 514699
18556 514699 492829 386737 405174 428834 450211 552486 489188 259761 209223 90487 101963
18545 101963 103535 -40929 184753 466802 538393 594504 537565 349577 112352 -8282
18535 -8282 -43332 -14337 75130 212430 210458 146111 15834 -22067 55712 -36435 51055 256244
18523 256244 387130 358909 391763 439696 320692 420805 570774 435138 252129 244454
18513 244454 188289 245793 396313 348734 403130 603170 675887 538767 330831 218334
18503 218334 423610 480690 291559 246194 132047 130770 24930 2862 207464 529460
18493 529460 651452 544433 351927 197435 103161 339236 555818 553766 317956 253541
18483 253541 385831 353004 326483 374500 308384 253123 221038 219553 95583 -1204 -20385
18472 -20385 -7937 167128 337702 322188 327869 327127 112152 76620 113651 25412 -98267
18461 -98267 116337 227973 107620 61702 115882 223145 69813 96535 134922 -21924
18451 -21924 -4430 153541 122002 88748 221312 197037 264085 359298 426445 396390 213434
18440 213434 128949 97716 170463 241841 205140 97075 140843 112399 51328 -136307 36212
18429 36212 258816 359223 227681 167465 252464 235807 155186 14108 -49045 -123940 -188634
18418 -188634 -145848 -33330 110636 77290 -11653 164976 43970 100502 230006 370280
18408 370280 270878 1851 111791 369252 293280 166761 145442 2069 24216 74524
18398 74524 218489 303113 184299 40986 59955 44373 175973 196408 24782 -20993 151892
18387 151892 64647 61202 -28112 -168980 -12860 92308 170514 85220 -148468 -150848 -32088
18376 -32088 82522 264753 157387 44442 62673 131621 145527 225592 342100 396418 340193
18365 340193 200545 283978 293133 133194 24749 99645 110351 57051 95036 96471 34385
18354 34385 -100470 -102868 47073 217314 361554 302712 385469 395575 537867 472711 283897
18343 283897 273028 413562 452340 300633 155278 188206 290431 319175 204996 199421 290880
18332 290880 150964 167766 229567 302199 258997 189658 306382 238961 134971 200482 142595
18321 142595 110715 -3648 -80223 11589 157072 296964 211991 246834 476731 432095 389433
18310 389433 203010 107186 179001 163902 135411 102945 115027 172883 276029 473020 441632
18299 441632 402203 312912 173798 61474 31322 -23642 6788 120540 313332 369998 367611
18288 367611 354669 530320 807429 791065 624758 367646 223538 307257 460187 461952
18278 461952 486225 633463 609657 533420 614002 610895 514231 483320 519480 256449 213858
18267 213858 156938 217221 296830 412939 368848 242679 120574 193782 422464 457375 351152
18256 351152 323401 385579 526416 510119 406301 451854 655637 746490 743263 541916 423301
18245 423301 353456 427922 569686 644428 866028 979553 1005131 968080 1067674 1222090 1266270
18234 1266270 1372445 1644021 1818034 1563184 1300154 1355752 1214123 1367371 1462637 1398085
18224 1398085 1461670 1414103 1302357 1358678 1252148 1183933 1173710 1036274 1018168 1147096
18214 1147096 1326313 1333075 1168585 996510 792172 674728 610809 851728 1018392 940332
18204 940332 983178 837285 813554 841296 965947 1065899 1175201 1230580 1289174 1298955 1293916
18193 1293916 1414536 1564434 1670805 1731576 1742512 1793229 1609226 1547292 1499480 1612620
18183 1612620 1577720 1365787 1450394 1314506 1381528 1369229 1170945 983151 976937 804670
18173 804670 783306 961449 1105491 1098566 991049 867236 894537 983743 1093932 939195
18163 939195 1051651 1098667 1057687 1239873 1344721 1150598 1104887 1264496 1411807 1442897
18153 1442897 1802563 1927193 1867410 1829553 1943332 2165552 2420958 2637764 2794611 2797993
18143 2797993 2674578 2316641 2152428 2053930 2147733 2336584 2341794 2408630 2493607 2407643 2552911
18132 2552911 2545070 2544651 2653843 2789169 2845003 2794377 2955803 3357456 3558612 4058373 4889140
18121 4889140 5834306 6789961 8002390 9665775 12280952 16359955 23430950 36974217
18113 36974217 64012394 110702696 167705905 208742315 235136135 233095108 163985212
18106 163985212 97755214 61633959 41581261 30354762 23765734 19583829 16711341
18099 16711341 14692802 13210587 11910141 10965490 10179729 9240644 8594451 8299769 7804214
18090 7804214 7078725 6596470 6237756 6100726 6085947 6042947 5968377 5977852 5693818 5309874
18080 5309874 5158979 5069653 4737292 4419230 4248321 3892602 3559699 3472757 3262722 3206194
18070 3206194 3103484 2870213 2946549 2980286 2953024 2915952 2777320 2665227 2546333 2504809
18060 2504809 2396198 2383475 2405728 2252796 2065413 2077969 2191828 2316066 2177199 2090117
18050 2090117 2169263 2196795 2239562 2093533 1978674 1967724 1823471 1565796 1248257 1095339
18040 1095339 975035 1148582 1192275 1243717 1366425 1523842 1275432 1058998 948894 709668
18030 709668 705222 629529 674378 647465 813435 981748 1073489 1094932 953687 838214 736183
18019 736183 514037 376491 319157 266211 370822 413203 319749 351864 387391 320319 373618
18008 373618 192299 55043 207092 451382 311423 309579 210977 177053 225158 273272 311141
17997 311141 195932 227225 460734 460852 335363 325977 289794 150141 190470 135209 115813
17986 115813 143553 7226 147447 334163 324795 366546 432893 368093 299113 270777 101005
17975 101005 55118 245089 357457 396113 339881 116475 -86063 37904 112316 30774
17965 30774 111456 -45263 -93783 131972 45451 -10183 94861 198518 201620 176858 4822
17954 4822 -101718 -128234 -151249 9902 -117271 -146061 -67731 33997 53450 -42939 -70143
17943 -70143 -94648 -216249 -262233 -231978 -88538 23689 -23293 -12529 33163 111035 208281
17932 208281 223475 238644 314727 255021 236102 265296 184026 -14291 -107269 -34315 30150
17921 30150 79659 20629 -86481 -40107 152776 156122 134079 -20066 116213 111734 118195
17910 118195 84005 -21702 56861 40241 77081 90837 -6891 104197 141041 124713 -33214
17899 -33214 -76607 159956 41952 -92529 39471 119372 7181 -94816 -69122 -107983
17889 -107983 -77750 -59513 14744 114277 114355 -65775 -110907 -133180 -44571 -50166 58744 276819
17877 276819 269673 103907 38153 1294 120915 139849 -39512 -49887 3080 95653 142580
17866 142580 213621 269799 203778 110718 244181 111074 -3607 217290 305597 318499 223810
17855 223810 298193 172704 228066 279770 267207 272410 306312 261322 71540 5907 75551
17844 75551 19829 -290915 -474644 -516467 -353393 -192572 -96134 181634 146520 15776
17834 15776 -30671 127315 126959 -48547 -139928 -207007 -74759 64085 26259 16401 26824
17823 26824 -38734 -93113 -211069 29045 61643 77019 309435 176433 107973 184110 279592
17812 279592 105103 -41113 -31380 7829 58526 255500 336573 242298 197953 109384 105138
17801 105138 151370 104183 70322 -60357 -192186 -126879 196112 4369 -83141 55015
17791 55015 124135 150745 95210 38882 -123880 93107 249643 212291 176253 178693 197663
17780 197663 185590 -73629 -264974 -252471 -2742 101164 155068 151365 156421 170720 120520
17769 120520 86149 298609 391482 372582 1800 -73927 -7415 35329 136775 195247 206674
17758 206674 -49352 -182269 -71142 -117239 -179470 -132245 33133 129781 80547 132912 2098
17747 2098 -2000 -131867 -356792 -504973 -393059 -248130 -185500 -46912 -6072 188886 245624
17736 245624 163793 123267 44658 5966 153614 204926 235847 255242 213708 120490 79858
17725 79858 60642 119019 244607 255345 230019 61310 58237 135541 135698 146964 197734 406244
17713 406244 261826 59900 41097 -24817 -182949 -166624 -227788 -149163 -8614 -39851 -84934
17702 -84934 -54497 -91333 -137769 -36438 -114996 45677 120251 57531 75980 74773 -41173
17691 -41173 -134009 -261458 -219336 132605 313201 132050 87663 164740 183314 207396 66066
17680 66066 -154741 -213040 -139691 -234398 -219722 -235933 -151341 -51268 -69415 -115211 -283335
17669 -283335 -322554 -105742 -279214 -368707 -304627 10962 181082 52894 137170 200758
17659 200758 167854 15777 -182689 -166129 -2399 125711 157723 159050 143160 67903 80080
17648 80080 78071 173125 242473 138575 -33348 -10390 223624 267692 62632 -75437 -37489
17637 -37489 -46861 -9986 -43239 -66707 -40843 8156 51683 60041 41358 -43859 -44379 27880
17625 27880 106714 49304 36645 -69119 -50105 -8906 65977 85720 29342 70601 203342
17614 203342 192194 268585 208977 100502 194554 243742 268793 189298 83731 70375 10631
17603 10631 -5789 119083 83714 21396 -63576 -92951 -90044 41492 233693 283336 140647
17592 140647 -64606 -46967 21119 10603 30172 -104348 -15234 152812 100582 -73889 -137974
17581 -137974 -71870 -67976 -80248 -44779 -17012 47660 78046 66941 77223 95251 15085 95990
17569 95990 172392 214714 211711 355510 385840 258730 196773 307598 388001 348704 306447
17558 306447 222656 139585 166990 215903 219558 280267 223753 85325 16903 51377 198119
17547 198119 267166 147741 -43328 -95832 -241668 -149794 -38494 94482 188674 230610
17537 230610 95868 22372 -56215 -106060 -58388 57209 232375 267886 140845 162530 131297
17526 131297 156840 196239 227492 99634 33705 1458 75286 123183 213056 244632 92941
17515 92941 49028 -3431 -176104 -30322 7073 112663 113466 189995 154398 53111 54672
17504 54672 225715 34601 63778 256072 311114 62151 -31674 124634 -17388 -59047
17494 -59047 4335 49643 87817 76226 7718 127657 -60012 -128587 -164260 -184484 -103315
17483 -103315 -76159 -69231 -24839 10318 15091 27289 -22559 -67645 10862 11005 -62336 -50211
17471 -50211 -194473 -366979 -264086 -341131 -249955 -223726 -238172 -201826 -128034 -18926 93743
17460 93743 45598 -16165 74739 20005 -84874 -49697 -36482 15769 69305 32634 -13904
17449 -13904 94278 173122 209543 396404 541879 822313 1163688 1182838 934690 460638
17439 460638 161907 157337 137497 265211 280593 351883 247390 98786 -80250 -127384 -99226
17428 -99226 -46619 98832 136161 -148034 -229754 -165687 -232017 -310459 -103452 3962 -137731
17417 -137731 -207942 -295095 -193240 -179155 -111554 -80031 -137412 -3166 283294 401994 249930
17406 249930 39150 47509 -51225 -147570 -102077 -290935 -326083 -212305 89110 175947 89019
17395 89019 14386 48867 117323 124936 -18577 134216 210799 195112 235531 160666 58434
17384 58434 23446 -91599 -206464 -116027 56369 -21091 1904 127592 164771 62686 -58625
17373 -58625 -50839 -156902 -417231 -392088 -261793 -5352 118434 96959 135649 178105 206422
17362 206422 146738 95380 75706 5884 85310 33295 -93781 -180964 -143824 1994 -33736
17351 -33736 -231702 -168419 -1714 -7420 -106535 -38372 81042 96689 155 108674 77308
17340 77308 -107550 -68389 43995 177931 200754 192326 126810 237934 157841 -120674 -114448
17329 -114448 -116395 -59448 -213401 -274877 -276480 -197729 -78796 19966 122092 133066 -59113
17318 -59113 -44571 117500 302098 305198 132581 -159951 -147397 54108 144328 126058 185774
17307 185774 261318 326927 333419 258345 335456 338473 218179 175180 90347 123847 292046
17296 292046 194798 53908 119784 124652 184973 39264 17508 75811 109967 160807 222372
17285 222372 32805 -18524 -21219 116340 166646 262751 179517 34170 46164 120021 201945
17274 201945 295561 203396 35402 97522 68422 -78260 -19372 79887 -87501 -260515 -103788
17263 -103788 -71910 -4224 161535 169318 66871 -196594 -138547 -172029 -110055 -99192 -223550
17252 -223550 -272579 -93595 15555 -11866 151982 226568 88399 85018 81727 39566 60016
17241 60016 64953 282876 310221 84307 32787 -6738 -72012 -87064 -74176 72077 182518
17230 182518 58390 119842 107665 71384 90160 30176 -36937 89726 154842 178335 84499
17219 84499 107616 152018 19449 -35284 -10589 31691 -22205 -73989 -156651 -135194 -4560
17208 -4560 37595 -54378 -33341 11326 45970 -97668 -109812 -145776 -308701 -201175 -31761
17197 -31761 40065 -1371 -10198 20428 44916 94943 12594 -21844 -85396 -251212 -254099 -140450
17185 -140450 -148068 -182344 -158877 -188731 -58270 33833 63560 -12674 -12128 -7014 -48443 -18947
17173 -18947 -162292 -167486 -224664 -256451 -90873 81068 159084 187824 143296 107445 19299
17162 19299 -38397 56800 8487 -53824 -26779 80109 -105029 -127821 -61454 -132964 -32743
17151 -32743 63740 194862 259053 307238 240013 160822 1363 -95970 -128345 -175370 -176603
17140 -176603 -198746 -48679 67010 86434 43003 80085 87399 93015 17502 -125627 -73679
17129 -73679 143440 204535 6251 -207012 -232546 -154555 -42137 60026 39971 62194 80792
17118 80792 27027 161649 166884 46960 66716 -62698 -122619 -12788 160128 199364 180934
17107 180934 381793 453691 435939 319699 259938 281633 311256 315587 268195 144782 -16151
17096 -16151 -18742 -85405 -7993 21808 11474 -96128 -162925 -288860 -314322 -339088 -104591
17085 -104591 134620 213362 152914 -3100 -39759 73193 150732 164784 -81819 -189306
17075 -189306 -233474 -189979 -32113 -127722 -132952 -163742 -142505 -241538 -230385 -66153 -146912
17064 -146912 -201619 -202679 -74078 -103662 -215149 -12848 146828 3696 -171158 -36725
17054 -36725 24036 -32996 -38647 -65222 150386 128743 128957 73165 -118442 -230839 -184694 -135298
17042 -135298 -97836 -216274 -496404 -454312 -154688 74379 78831 42381 2347 -102166 -91168
17031 -91168 -197816 -113770 93371 166215 163318 57355 26019 189574 189593 154161 80233 -65229
17019 -65229 -79596 -18256 -103854 -28482 128254 329590 441075 348204 119515 39089 -31412
17008 -31412 29831 153683 91217 -121006 -94620 -70858 -142125 -111857 -7607 27418 60765
16997 60765 169515 302969 229327 144926 135724 167842 311096 211516 95250 -99772 -90269
16986 -90269 -279954 -347397 -84753 32409 226789 148301 -80031 -338185 -345654 -321395 -261316
16975 -261316 -181435 10595 -23094 -105410 -106111 -122154 -181078 -170548 -206151 -252852 -312729 -328014
16963 -328014 -164711 -84422 -277168 -262146 -167565 -85184 4778 154885 273444 301075 125077
16952 125077 -53420 -136484 -206552 -204286 -219521 -171427 -116536 -155094 -89139 -99639 -73649
16941 -73649 -55257 -104557 -23414 -11935 -12972 907 164541 212888 -11922 -166890 -118562
16930 -118562 85083 17776 -210047 -244800 -103615 -156359 -193739 -60744 -54797 -154159 -210934
16919 -210934 -126832 103963 227498 89038 16174 47349 45309 13947 92063 233993 81070
16908 81070 8962 -25949 78874 94993 -156538 -224894 -238316 -160526 -34867 52372 45643
16897 45643 91781 112805 99556 117227 -23838 35066 80406 164844 68733 107831 126362
16886 126362 73830 198506 192727 37256 -109710 -60729 119276 16673 133475 187425
16876 187425 108734 223809 275514 201356 206541 160996 -5202 -33272 -166733 -133136 39768
16865 39768 -170775 -216127 -89501 -132600 -158346 -344658 -438201 -395312 -389060 -331860 -241313
16854 -241313 -66946 50526 -68332 -163483 -15591 85997 197667 262537 77227 -105950
16844 -105950 -200666 58016 143583 114832 124676 -72954 -229907 -155007 11497 3937 -64276
16833 -64276 -36912 28316 41968 3550 103598 145281 110107 113374 -67194 -43858 -35938 26075
16821 26075 173036 292867 158299 73742 56937 63540 27692 -37996 -96 56248 68965
16810 68965 97375 110511 98650 76282 -23742 -13899 102022 -19917 -39510 -49243 -174380
16799 -174380 -87948 -39372 91469 -113835 -173379 -19544 19694 -35969 -12029 40444 86885
16788 86885 112839 83689 203610 219684 22246 -62931 31507 34756 106171 282103 265838
16777 265838 145547 59298 105951 276030 284656 443579 358239 134541 -1844 -28030 -5758
16766 -5758 29796 142270 111137 118016 125113 62424 -660 267598 347972 294556 313167 208751
16754 208751 23667 139226 216217 64182 122315 -109637 -102946 -111676 -25972 54141 39186
16743 39186 85171 207979 261938 240872 51842 -75803 -73173 -18956 -37308 -71022 -52177
16732 -52177 -45969 255 -50794 -28940 21053 69467 -5103 4120 81396 -49834 -202586 -171599
16720 -171599 -156545 -247090 -253460 -237091 -174363 -252623 -228960 1963 234135 299255 367653
16709 367653 428279 292814 132509 62235 35203 -37088 -63860 -31133 5876 3041 -79707
16698 -79707 -34011 -168754 -341247 -369611 -197730 -32456 -14740 -71927 7283 -38170 -35974
16687 -35974 -22208 -147204 -156974 -8202 -42053 53577 170460 104294 2512 -144910 -161945
16676 -161945 17458 165909 -82132 -252105 -127576 92107 179607 107210 -21630 -79616
16666 -79616 -125231 -77856 -81516 40529 7471 -137217 -128200 -126900 -31594 56636 258935 358092
16654 358092 320131 221945 130831 -16955 36484 -6887 -95981 77557 -17167 -151834 -84655
16643 -84655 -246578 -332006 -375712 -269433 -179744 -93416 -161755 -186629 -236660 -298136 -202163
16632 -202163 -154142 -47131 88871 -169361 -178069 -122524 -276933 -226464 -6548 7165 173933
16621 173933 174193 3053 -9739 -39873 12369 116477 64361 -168643 -108664 113750 21716
16610 21716 69455 59807 -39416 -67381 -121590 -89422 -46824 -81442 -168678 -123086 -14944 84577
16598 84577 264185 316627 38855 37673 185772 269346 76621 -120013 -142230 -152341 -144125
16587 -144125 -39154 -99934 50317 54825 26893 -90598 -101793 -104071 -102858 -7247 -31631
16576 -31631 -118329 -144547 -68045 24658 -47797 -148823 -193763 -50575 -89549 -235679 -127909
16565 -127909 -102303 -100016 13772 147205 283249 216744 90779 -83129 -215833 -303950
16555 -303950 -229067 -145711 -53013 19161 47436 -22776 -9508 -63077 -69654 82988 121041
16544 121041 155418 97311 48939 -68999 62641 230477 96814 -59821 93592 125146
16534 125146 65467 53141 26300 82670 236002 173944 38379 -169401 -232654 -1757 5830
16523 5830 2301 203265 190272 112532 142287 125540 12897 -44969 -104218 -72326 -2247 158707
16511 158707 192175 135173 41810 161635 128655 -16147 68220 269899 306277 66071 13052
16500 13052 -51730 25002 161228 156453 163875 167137 121236 118581 69945 -53999 -68300 -69670
16488 -69670 -95192 -78401 12997 -217694 -387941 -344432 -272163 -40429 127099 154901 120296
16477 120296 50053 -189301 -250941 -231271 -188458 -61000 35463 55254 105769 113215 67947
16466 67947 -130330 -25405 41890 269760 205607 86211 8578 52664 122742 149793 142990
16455 142990 95143 -19292 103607 167229 104387 -42605 -119221 -163678 -162387 -129136 -6076
16444 -6076 138855 274121 111466 28074 43701 -9732 25315 134169 72958 89725 32854
16433 32854 29384 82663 272178 324597 223640 307773 223318 32907 -155113 -164334 -161363
16422 -161363 -40033 -83030 -76203 24741 156968 180390 62434 -26825 28428 159647 138179
16411 138179 219101 223028 73871 83174 28035 -117749 -203778 -164652 -155260 -328092 -391406
16400 -391406 -277278 -10916 -73593 -105805 -56342 -125069 -30960 118069 354546 220632
16390 220632 89154 118049 189973 41313 -44953 60859 159089 90990 168777 138832 -100868
16379 -100868 -196008 -238757 -193716 526 119547 126683 119059 -28293 -142269 -171839 -54364
16368 -54364 78810 122292 -96029 -194239 -256003 -303706 -340079 -206408 -159677 -315723 -451716
16357 -451716 -253363 -168497 -279265 -270651 -366253 -289401 -184133 -32665 -145199 -350553
16347 -350553 -299790 -394918 -339559 -140091 148830 291989 91842 51060 61140 55507 -63738
16336 -63738 -75624 -119423 -104550 -20122 5730 -14959 -2951 78130 -59862 -95376 -1326
16325 -1326 76992 -3136 -55506 -7342 80510 3978 102051 204965 64546 37418 68355
16314 68355 130810 249258 312307 217806 36461 65795 21958 -147152 -171960 -163132 -138895
16303 -138895 -134978 -208473 -243787 -208693 -247884 -132307 -100038 -19228 35056 37785 202322
16292 202322 171974 125490 -91177 -30436 138200 110881 45616 150688 87665 60751 174236
16281 174236 320266 184580 109961 43739 73300 141522 97579 -25472 -4705 99928 82568
16270 82568 -50143 -33255 -143844 -46573 -175502 -320251 -419113 -416597 -307299 -217512 -145231
16259 -145231 -57704 -89147 -131898 -178868 -116453 39065 203688 381835 483847 190651
16249 190651 26237 -4768 105978 230475 124657 -73437 -189119 -113884 90399 26908
16239 26908 -141504 -156362 127626 180131 105508 186600 196864 155426 135981 4370 -189941
16228 -189941 -289327 -190872 -149104 -192144 -237146 -352653 -354414 -119181 -80608 39156 -15149
16217 -15149 -38046 -75729 -88465 -154633 -87018 25871 -148525 -53332 148261 103794 49862
16206 49862 86778 37344 193476 285419 313430 87265 -177586 -145396 -34285 -19548 -54160
16195 -54160 -50411 96406 -32480 -79784 -34647 119799 272439 223444 265567 156864 -56455
16184 -56455 -136990 192747 385509 371762 227101 -17923 -453541 -444781 -262553 -187205 -216628
16173 -216628 -311392 -233319 -72142 181912 227014 76967 -47367 9767 71361 -69670
16163 -69670 -69958 53747 -11304 -165900 -192042 -90135 -100390 -85351 -101541 -156884 -188984
16152 -188984 -364898 -292023 71060 287716 55804 -224930 -255123 -118883 31412 136283
16142 136283 264253 122846 61951 24595 213349 193800 97935 126365 76038 101944 113351
16131 113351 131863 176720 310068 250549 -151320 -177072 -99589 -57601 -59891 13789 -9122
16120 -9122 -166547 -30847 -89523 -134795 -129136 -56112 37498 -67218 23858 7024 -220733
16109 -220733 -286635 -134717 100766 252968 218800 10562 -75303 23633 63289 101644 90065
16098 90065 -58601 -270093 -349652 -123819 5935 -54622 -18135 72606 -89457 -88331 -24880
16087 -24880 -94868 -185639 -232773 -156899 -230728 -308043 -230306 -136491 -158184 -233057 -286602 -351550
16075 -351550 -399269 -307997 -258649 -205216 -68719 -114614 -210164 -230277 -256416 -128529 -77007
16064 -77007 -88563 -38686 46265 101482 134917 242153 111685 31318 137741 115985 9783
16053 9783 -37276 -145883 35752 38561 -181057 -230173 -254520 -167977 -60641 -3171 -134964
16042 -134964 -164249 -65777 396 46699 -10405 -99976 -200061 -179454 -111297 -228015 -199387
16031 -199387 -47219 60861 -31589 -43720 -10979 33087 -59709 -174027 -264082 -338369 -231505
16020 -231505 -196356 -151517 10149 124750 190293 139423 202272 227506 332224 356685 310544
16009 310544 169022 252121 271495 83356 -3939 -101078 -162616 -37626 -27666 183168 141302
15998 141302 164466 221345 180259 11612 -54482 -103551 -342755 -265445 -101591 -117446 -120705
15987 -120705 -108274 -92136 28066 43218 76930 80890 238969 100793 -158613 -206064 -44675
15976 -44675 184019 158669 -27595 -86224 -125464 387 82945 146691 181230 111231 24950
15965 24950 146605 148147 118933 57935 33763 -62556 -180727 -71294 -153141 -154143 117269
15954 117269 333852 415555 293407 94702 186093 365560 268617 44177 113762 162878
15944 162878 51787 99437 55972 -139270 17985 129108 203116 338941 140150 110073
15934 110073 54104 113561 163925 47340 -69088 47971 7334 83582 157903 11015 -120102
15923 -120102 -167864 -89279 6869 -145214 -174284 -197358 -178606 -101316 -102619 -11254 55822
15912 55822 24893 124683 11447 -221940 -202378 -18685 117695 231537 244161 218655 190402
15901 190402 69081 -111334 -160536 11298 75973 46621 190659 234899 153584 12465
15891 12465 -19393 75180 136646 99551 146453 144215 103338 52956 -58716 -139618 -231415 -251578
15879 -251578 -168623 -87212 35848 6329 -21916 -16351 -101661 -123506 -264874 -321579 -293793
15868 -293793 -207655 -49926 -140966 -77648 12530 -6278 110702 73316 101688 -11180 -64652
15857 -64652 -56673 -52415 -165132 23600 146278 22277 -172345 -255852 -244215 -281891 -469236
15846 -469236 -546643 -207518 -189026 -266660 -51961 88753 212294 225700 -13191 -41923
15836 -41923 -44194 33525 -115294 -127013 -255864 -221768 -150435 -116009 -90885 -51750 -60994 -107805
15824 -107805 10979 -92068 -66527 1273 -16181 -105501 -20650 -27357 -44954 -64539 -35992
15813 -35992 -54217 127661 165970 217219 185219 36776 74259 170018 285375 356897 303485
15802 303485 -23430 -179833 -252126 -215848 -231176 -272359 -173716 -7369 236870 399473
15792 399473 247258 169518 135449 139821 -38298 -92543 -55520 -269938 -59006 260797 224892
15781 224892 290375 313147 403587 241852 36960 81726 193021 210876 252615 191161 49105
15770 49105 -30300 -37515 -52383 -103941 -66600 14553 215772 194376 -93234 -250175 -131989
15759 -131989 -198369 -64408 -12982 -51276 -18024 20693 39345 -10501 -26577 44174 31761
15748 31761 49142 68837 -208580 -180938 72327 200330 225729 167113 -39723 -36654 197588
15737 197588 290417 125316 45035 172093 192129 24713 -96619 -29334 86516 -14777
15727 -14777 -110453 -33783 -10069 36479 -27278 52889 203217 130812 165843 180265 145743
15716 145743 181377 -21899 -43541 -51861 -172094 -186157 -128708 -166360 -192012 -354011 -412888
15705 -412888 -121469 -75977 -192972 -126875 -44703 -2324 166566 160938 40198 41178 59762
15694 59762 -46359 -14779 -128739 -197054 -252764 -76440 1509 90913 -185253 -241215 -222402
15683 -222402 -230847 -109712 -60241 -61902 -28306 -107933 -167353 -5845 7570 -98876 5477
15672 5477 -100446 -184852 -32991 100814 67268 -60640 -111558 -65000 111474 149669 222464
15661 222464 287987 153978 -62400 -218692 -304667 -329948 -164958 -209194 -140789 184593
15651 184593 292037 325765 122637 -93154 -9939 -38881 61025 164228 298614 268137
15641 268137 220656 159894 197491 141649 32976 -16829 31148 50781 118767 198477 216250
15630 216250 -17948 -219476 -228642 -85497 -43476 -104668 -100429 -13384 158038 86629 -67647
15619 -67647 -108771 -26734 42303 160181 100036 -52770 -222262 -342624 -189188 -94038 -149587
15608 -149587 -150084 -182324 -339729 -361090 -201315 -212985 -188898 -51301 101394 192889 89847
15597 89847 -44714 -59532 -114430 -114055 -93812 -30737 18972 -116947 -150504 -124717 -130923 -94888
15585 -94888 -51775 -91234 -146828 -160526 -220292 -350172 -232362 -163607 -204323 -69983 11827
15574 11827 -44535 51061 -22464 -208552 -96239 40348 100815 73173 54163 58125 228418
15563 228418 348631 198565 -59610 -92714 -145232 -80829 -5914 -22357 -127864 80235
15553 80235 104181 211431 254178 166367 131279 282586 232084 -37604 -229140 -130949 37615
15542 37615 100910 93781 -22644 169432 285901 210802 143568 158632 128157 276645 599030
15531 599030 503177 301650 204620 169967 38523 174312 135170 65838 92397 124472 32071
15520 32071 55546 209889 269668 101557 52543 96872 143406 59800 -77389 -119583 -123812
15509 -123812 -191770 -50046 29821 -50100 -135216 21677 53815 -34182 -50738 -10023 -22460
15498 -22460 29992 -50634 -77653 -61265 -144008 -281473 -222783 -209188 -355116 -153639 -46166
15487 -46166 -102189 17861 31520 29068 24658 24964 -31262 -159647 -59454 64958 64922 39615
15475 39615 -27294 52284 56498 19478 -14171 -89485 -3380 103228 92119 116733 148944 69699
15463 69699 -63574 -23137 -65629 -59748 53676 100014 94153 28330 -4248 -46767 67803
15452 67803 63073 149846 56353 3406 47285 -87996 -133583 -261828 557 246388 255760
15441 255760 276487 126984 73202 -122710 -224576 -166068 -42495 52001 47772 142728 134957
15430 134957 43831 -94609 42330 213853 307485 347035 413913 342249 8510 -44696 91096
15419 91096 56694 73660 77251 75965 9907 -747 46426 -48391 53627 98766 86020 42484
15407 42484 56536 -19095 -83375 -155645 -12039 151381 34214 37754 144296 99606 67573
15396 67573 216396 284570 181641 115285 107288 43726 -126798 -28917 59835 106986 107415 121119
15384 121119 52052 -148033 -48740 79242 262352 349603 188714 10888 -11568 49161
15374 49161 63354 203821 195702 152042 143848 -54901 -116561 2860 77998 57270 108233
15363 108233 172844 11505 -74878 -63270 -247001 -144581 129576 172020 -79969 -206465
15353 -206465 -117108 -77942 -44299 -184056 -117077 117062 184291 23668 -35206 -68920 -181177
15342 -181177 -42842 -69231 -83134 -18990 -107901 -227433 -60360 -124762 -186244 -112750 -146724
15331 -146724 -276877 -345696 -340108 -250980 -120506 -41893 -56836 115259 194622 94582 -19653
15320 -19653 -185223 -463586 -405703 -266840 -175845 -84820 -118554 -201785 -264324 -253474 -231686
15309 -231686 -342751 -169009 7325 45357 -40196 50188 74947 -46105 -18143 111779
15299 111779 22862 -5956 25946 75635 88428 121404 47123 19181 -113082 -161832 -60327
15288 -60327 -63077 -75302 108816 334136 171886 20341 15224 90250 84059 35196 32532 -115626
15276 -115626 -3763 70181 17407 91943 225173 203888 276554 222718 47483 5768 -58317
15265 -58317 -128880 -283570 -279138 -122188 83449 112964 62657 59710 179712 192144 138500
15254 138500 201826 139068 77573 123554 80702 68774 -135916 -95357 10940 6523 -40072
15243 -40072 -5617 53622 47476 -3440 -164848 -135853 -84254 -109223 -135441 -176219 9498
15232 9498 98857 208520 243069 196160 8419 9786 -111216 -149076 -127786 -45439 144403
15221 144403 252530 134582 47561 -34341 72399 129240 285012 277607 154823 133213 87783
15210 87783 546 -45200 -79740 -92215 -105553 -138994 -197699 -71943 -52153 -39695 316
15199 316 121304 62913 -7753 -10346 -85526 -216034 -159301 41544 135190 -82824 -29203
15188 -29203 208868 311158 139442 48263 -85915 -200410 -122128 -45323 -193055 -114362
15178 -114362 -34517 31953 -104916 -241130 -284023 -272918 -112503 -43963 8679 -106867 -156014
15167 -156014 -63233 -104960 -82914 -33758 64725 -61850 -207777 -312174 -488496 -557937 -378210
15156 -378210 -220029 -145806 -20549 29209 -106963 71590 13461 -109062 -225325 -282486
15146 -282486 -220065 -118542 32090 243920 219690 219433 112865 80018 36738 -133412 -260051
15135 -260051 -262543 -127179 7576 -147212 -131380 -114748 -92780 -5679 132938 91601 -21355
15124 -21355 -30111 72164 98468 -7679 -150430 -120176 -43825 -38453 -11700 -15543 -62721 -135128
15112 -135128 -175271 -101380 -68520 -1730 -11863 -208982 -204329 -238203 -202132 -47113 75271
15101 75271 23059 -219643 -252844 -276953 -132079 -81638 -197997 -134284 -57810 -40919 -103682
15090 -103682 -32886 86936 144120 268392 342911 156930 -27877 -47230 -138461 -233772 -132116
15079 -132116 94311 124063 80838 41432 -68904 -5654 73555 99880 117226 169241 150371
15068 150371 193884 103527 -220009 -230116 -105601 -21010 -120323 -73007 -126485 -110906 -152248
15057 -152248 74889 75847 109533 314525 383684 357849 204545 -99411 -181030 -259388 -191191
15046 -191191 -90902 2440 27565 9655 65013 199192 120304 -55627 -242889 -190085 -255039
15035 -255039 -196397 -203 190988 189907 196920 170722 233593 75443 45796 131514 106513
15024 106513 9658 -32504 -21192 12389 124677 187644 146724 81487 163895 170185 120451
15013 120451 183812 222561 162315 195951 109268 145876 188626 91849 -67722 -111804 83501
15002 83501 181099 -29990 -301747 -446134 -314307 -66198 1111 100406 214194 155419
14992 155419 189545 274858 124239 99228 96352 172171 4273 -99285 -68599 105423 246878
14981 246878 29900 -186141 -13148 -63848 -51507 82234 234336 213931 200380 260454
14971 260454 324672 277882 190709 20099 -41573 793 -9163 -94383 -101114 -139281 -160085 -171169
14959 -171169 -84608 82108 203480 198345 102702 108241 -7481 -133891 -122327 -126655 -26943
14948 -26943 -32037 -50003 -26901 -185782 -68441 -46522 -187941 -99412 -82921 -175760 -52483
14937 -52483 8938 -165141 -199658 -201347 -250848 -145916 -44552 -29212 -113449 -192208 -324850
14926 -324850 -175505 -205263 -211734 -69847 -159139 -219251 -99891 -33017 -1613 120720 339957
14915 339957 260760 -53826 -193977 -258176 -207267 -253975 -290178 -303379 -431594 -283194 -199399
14904 -199399 -226739 -26032 4196 -21385 48687 28868 -34507 -104966 -160509 31687 71482
14893 71482 -97427 -224691 -193419 -152180 -157528 29129 102256 64202 138707 264969 242890
14882 242890 190143 136212 230417 331682 264707 123271 106186 24133 117157 70350 66118
14871 66118 -11169 -116251 -45457 7935 -22336 51701 167608 242227 164602 -69949 -177615
14860 -177615 -440 190183 243502 230624 117338 169076 135151 43134 49623 23837 32099
14849 32099 47614 126685 130304 29747 -32281 -327704 -367631 -261075 -158529 -150731 -191687
14838 -191687 -247648 -178369 -97485 -7995 -5863 -22591 49144 120837 51775 125344 218960 347624
14826 347624 406359 206019 -119636 -12343 34290 67853 183939 72716 146294 156757
14816 156757 -726 -181199 -133823 7096 88457 34322 131291 270648 303809 -7823
14806 -7823 -142110 -105300 147907 193071 91580 -93641 102021 259359 326097 195481
14796 195481 107788 86930 88592 177771 275336 141468 -1087 -5333 31376 -79373 -61030
14785 -61030 -25291 79063 91998 22039 -7611 59150 303064 376926 67823 -10422 41474
14774 41474 140090 176574 146643 136368 152808 163536 17102 30078 -20020 -280154 -251966
14763 -251966 -214352 -230993 -205023 -136184 -93052 65575 177789 240269 193890 99702 -35212
14752 -35212 -54960 84596 50577 -15139 -180680 -84038 -49008 36715 260492 459297 423112
14741 423112 364983 293043 247230 290719 248786 261841 15296 -236441 -201025 -269908 -200681
14730 -200681 -101007 61521 222468 -13904 14697 181849 203162 112628 -592 -5535 -86746
14719 -86746 -205445 -232517 -166912 -38989 -127579 -203279 -191862 -214057 -273886 -382299 -259619
14708 -259619 -176341 5532 115034 158804 205693 48880 -94386 -148204 -123911 -27499 90112
14697 90112 43970 -68005 2137 27012 62690 -75561 -258434 -312733 -116461 -256809 -321606
14686 -321606 -403639 -331789 -214884 -174230 167609 265807 130665 39733 -19537 10994 36701
14675 36701 179630 143019 37714 -69281 10505 94434 41538 273752 335525 304783 291012
14664 291012 385137 332363 168621 95125 92512 -24656 -40213 -48358 96211 145857 87178
14653 87178 123068 -110790 -202673 -56830 1008 26679 -7541 -290189 -512315 -360056 -271925
14642 -271925 -270152 -81121 -109832 -99163 -106753 -63583 -154744 -48313 -44848 -155779 -240663
14631 -240663 -132809 -4954 -117244 -129176 -129698 -62957 -115164 83317 201551 283270 192822
14620 192822 568 -158072 -185249 -107333 -60236 -83608 -152274 -232983 -222501 -241806 -254041
14609 -254041 -443189 -513032 -263286 -194853 -119627 -79841 -30798 -69258 6508 60496 -66416
14598 -66416 -236124 -123505 14037 41323 -23975 -82602 53132 90417 33769 144903 166449
14587 166449 130557 153915 221316 267484 261809 226435 80008 -53090 -241756 -342256 -264835
14576 -264835 -176678 -143866 -225273 -344239 -530264 -467733 -300612 -203520 -232884 -208450 -82657
14565 -82657 -53223 50585 60225 61146 30401 -60204 -46327 -46187 14665 -18520 -3825 21107
14553 21107 41982 -93061 -105791 -34690 -146097 -61669 30038 -27313 -62486 31756 55809
14542 55809 -46988 -117038 -43236 -95274 -134256 -223602 -265826 -274526 -275068 -79783 -41296 153263
14530 153263 332316 47680 -285533 -229931 -53279 84014 149496 98729 95148 117510 26193
14519 26193 115461 38192 -139805 -125169 -59499 -120188 -157794 3608 -9141 -98755 -72127
14508 -72127 -106793 -232892 -200329 -18338 29752 -110033 -151881 -61526 -54995 -101467 -124271
14497 -124271 -203840 -316254 -276419 -196019 -296992 -301487 -215302 -64014 -69973 30197 91008
14486 91008 81656 -20040 -44790 -115038 -39724 -98779 -284683 -336101 -220124 -206752 -173729
14475 -173729 -163930 -165393 32881 -10232 -19871 -84511 -176998 -82300 -66472 76458 -23895
14464 -23895 -234129 -152718 -185404 -196511 -188750 -294224 -200974 53676 154099 203664 195695
14453 195695 56702 2263 13740 107847 152885 134402 128727 126406 54135 -39675 178688
14442 178688 272952 244910 213075 192560 128852 94400 12269 -26795 13134 105976 38626
14431 38626 -114706 -254902 -200082 -262207 -156575 -84210 -171499 -74513 133674 204297 100968
14420 100968 29220 -89237 -238794 -121729 -127836 10542 -52405 -162439 -13801 68164
14410 68164 37846 -12308 21262 85335 132449 124808 95214 38918 115676 111591 68422 -18470
14398 -18470 -92565 14117 -62902 -124939 -9020 -61730 -137289 -105505 26665 -2787 -121928
14387 -121928 -151335 49996 123064 -11805 -232754 -189896 -247692 -399991 -423874 -238486
14377 -238486 -74750 -95147 -302762 -386237 -368324 -236361 -179672 -124000 -37047 -50838 -126108
14366 -126108 -147979 55265 337914 295981 108203 65870 -37744 69808 159990 156364 -111234
14355 -111234 -161407 -126450 -11170 48524 106303 37522 -73852 -116658 92365 202801 236875
14344 236875 402765 359490 119776 -74476 -100421 -99937 -250867 -148470 -10276 111284
14334 111284 82639 -33317 50193 89365 74031 113568 47175 -55211 -114846 -308797 -344870
14323 -344870 -335475 -287669 -133135 -127399 -211690 -62202 25880 130517 -14848 -140133 -84293
14312 -84293 -40319 -71222 -30705 111408 162005 184928 72816 -22535 -117168 -61911 80853
14301 80853 -69048 -314130 -173697 -86379 6981 159730 134613 30769 -136163 -342352
14291 -342352 -418221 -319158 -262155 -331719 -71325 130257 150643 -110214 -100128 68139 45487
14280 45487 42309 -115830 -152135 -121498 -110341 -49680 60053 152206 151000 44464 -69541
14269 -69541 -78342 9398 -68659 -92149 -66150 -50437 -105871 1059 161288 155493 158544 177318
14257 177318 66613 28433 121114 232226 267146 162053 169359 59228 -136049 -77374 28149
14246 28149 -14125 -133260 -70508 -240761 -305310 -367833 -280014 -89168 -105210 -108213 -81477
14235 -81477 -78437 -136550 -197507 -77405 -42225 -48071 -14835 50023 84544 59571 -10279 -56346
14223 -56346 -234942 -380222 -253534 -238584 -305932 -158184 20611 75970 16812 -54725 5896
14212 5896 33634 114686 164774 96298 78722 89510 240048 352129 197523 -128856 -343786
14201 -343786 -214228 -127871 -248433 -112494 -57758 40637 232195 319139 12907 -162299
14191 -162299 -190535 -233570 -139174 6208 150538 163118 -36536 -47191 163256 352307
14181 352307 221390 92644 158397 125665 -130839 -56250 98197 68268 -24502 -55127 131710
14170 131710 181568 144117 54638 -15310 -83049 7336 -4754 -138760 -183175 -108794 -132317
14159 -132317 -137444 -62765 114635 225875 335668 261704 170068 -28310 36064 30410 -178672
14148 -178672 -144240 -172620 -83607 -50280 27175 115525 183773 75674 -150766 -285047 -184426
14137 -184426 -41262 -69698 -148793 -189734 -190539 6364 44424 42019 92177 159982 86886 25536
14125 25536 -5982 193915 274149 226090 59378 57905 -81723 -101782 -100621 -24004 90729
14114 90729 -146780 -255748 -149076 -178476 -138088 -96661 -2915 95703 -105899 5222 100112
14103 100112 135972 51625 -65851 17313 -55532 -36272 -10429 19633 27566 -623 11500
14092 11500 44249 33559 211699 146947 72353 -29823 -94978 -47419 -38032 -53155 -57687 60494
14080 60494 -41686 -26574 -18632 -150581 -48177 40753 59054 -152298 -332526 -250969 -61894
14069 -61894 48735 15985 3411 -26694 156866 200499 342142 380380 319553 288852 332037
14058 332037 177505 163805 173031 95197 -91283 -203419 -114650 35438 34440 115957 81934
14047 81934 57483 -81613 -99803 -191127 -228752 -183308 -147811 -248537 -414258 -397061 -392302
14036 -392302 -395156 -188042 -44716 -125448 -159206 -277312 -333770 -233277 -223596 -346354 -278117
14025 -278117 -392622 -296991 -42454 -107257 -239406 -286008 -280396 -292974 -200719 19377 210220
14014 210220 252594 148696 110469 -9717 25570 11270 42304 141812 160866 174985 124842
14003 124842 46157 50889 77810 15522 -134374 -123299 39628 54865 -16536 -90052 -84212
13992 -84212 -68689 14627 114752 16435 34165 60797 -102606 -238944 -193939 -186272 -219634
13981 -219634 -251598 -219745 -255588 -244480 -121582 32661 120795 5060 -25334 -54449 -48126
13970 -48126 -72224 -46757 -66885 -67645 -7276 191428 184967 93851 26495 6722 35047 -46929
13958 -46929 8086 90854 77450 135239 -68837 -133635 -135092 -117150 -72970 57201 -97159
13947 -97159 -183113 -154553 -30573 136236 44786 -88453 -103498 33945 -6046 -13440 -8086
13936 -8086 -41368 -163245 -94616 102897 172877 168600 77671 -16765 -180367 -268867 -135752
13925 -135752 -71542 -238994 -249708 -98062 16982 7702 3836 -54235 -194659 -213317 -216616
13914 -216616 -127524 62325 -100063 -14669 -24225 -122647 -130730 27237 113401 134755 127602
13903 127602 85032 290196 324132 248261 127072 100345 129028 128310 -28445 -187126 -162338
13892 -162338 -92823 -43721 -44739 69180 183189 121754 -147833 -259823 -141622 33549
13882 33549 57654 -144326 -318977 -280048 15202 155083 106960 214854 141920 92362 55469
13871 55469 54874 135114 87007 77410 -39651 -90746 -63419 -125918 -34292 -72695 -145058 -114812
13859 -114812 -46661 -81525 -246985 -225563 -149155 -37515 -189445 -151394 109007 42257 -13068
13848 -13068 -76577 -209508 -237112 -285049 -282337 -268709 -169373 -36101 -72728 -123522 -26559
13837 -26559 -25371 -148125 -179083 -198050 -205824 -160587 -271214 -348353 -293310 -94584 53238
13826 53238 12260 -149527 -282870 -331979 -270893 -175249 -147189 -107623 -88689 -140133 -131589
13815 -131589 -242893 -256008 -69528 8174 117508 283329 191926 42459 95921 229007
13805 229007 228047 272063 289924 412923 496596 361566 231377 30042 52108 -20896 91733
13794 91733 134588 58712 38466 148479 125984 66355 -51502 -107249 -89577 -188231 -213428
13783 -213428 -147369 -48959 49799 -143641 -291342 -160415 88847 93266 120618 58042 9420
13772 9420 -160196 -243496 -345031 -348450 -205228 -67790 -88488 -122520 3835 -42534 -101108
13761 -101108 -173013 -127300 -89967 -189901 -148762 90737 87723 48755 166819 234234 109779
13750 109779 -19496 -33213 -115234 -259270 -177415 -50418 84331 66688 15117 56030 130274
13739 130274 97869 339 -58024 -49119 -63897 -134786 -215461 -353503 -327656 -200897 -32739
13728 -32739 54673 -86957 -178982 -105478 -119845 -148136 113934 231369 70530 51871 176377
13717 176377 90988 -60487 -193856 -286580 -414946 -374324 -348094 -404473 -438231 -255068 -221777
13706 -221777 -186091 -142543 -84652 44546 101880 7038 -61716 -22373 57160 -107880 -114990
13695 -114990 -114370 -150642 -81188 -53492 92800 21407 -126157 -146333 -108746 -92996 -211032
13684 -211032 -281916 -421821 -459080 -356339 -222761 -101874 59464 69650 115431 98534
13674 98534 80462 217740 322913 290367 186666 -96181 -393178 -353944 -179193 -260451
13664 -260451 -180818 -42632 78177 309516 378037 248353 147404 171121 136817 70528
13654 70528 2769 108426 89818 64608 133828 39027 88851 15576 -122627 -144063 -109762
13643 -109762 -76235 -76478 -113815 -27850 -21934 18214 9181 -208160 -193951 -157820 100028 60918
13631 60918 -180777 -268187 23359 212992 80943 13303 -21390 -158623 -260573 -349131
13621 -349131 -233810 -140645 -186142 -128350 -28818 -110692 -169691 -122432 -102701 -299074 -396259
13610 -396259 -244455 -162250 -114118 -110096 -94142 38729 160708 49139 -87064 -52396 129575
13599 129575 216919 16798 -37437 -122123 -199727 -200110 -161122 107899 22437 -50606 -40364
13588 -40364 -108232 -102981 -100928 -116755 44951 -15187 17508 36654 39504 100535 43640 -47514
13576 -47514 -168576 -244021 -333628 -261273 -146045 -70895 -100520 -298583 -212920 -111658 22456
13565 22456 7266 55462 -27873 55325 61986 88105 262326 361532 278012 286369 149059 20820
13553 20820 74913 146842 118492 122118 125319 49919 -95139 -202340 -261991 -91631 66677
13542 66677 109452 54708 251804 185444 -74570 -99263 -137185 -140032 -163759 -158716 -61874 -64134
13530 -64134 -100145 -28858 -48187 -140827 -141 19181 -75293 -67543 12865 -99228 -135719
13519 -135719 -228540 -271915 -223450 -118034 -68655 -126488 -140754 -162956 -218723 -30116 89957
13508 89957 140047 46052 -49592 -85444 -46337 -104109 -255142 -236329 -237535 -180295 -57793
13497 -57793 -136884 -140416 -77430 -172922 -81216 -39630 -192650 -337443 -228662 -148602 -144018
13486 -144018 -257393 -298075 -450097 -423229 -254563 -182300 -31639 157658 193095 282970
13476 282970 79723 49140 133561 25097 -100902 -56795 -105605 -114239 170 76000 80007
13465 80007 34824 12603 27992 -54957 -56800 -65219 -113779 -22200 31413 -9000 97344 115429
13453 115429 173631 -1877 -36183 -20791 -173482 -111579 -75275 -4310 16055 -58683 -1770
13442 -1770 -207244 -346150 -184266 -32324 -174142 -262650 -209247 -184563 -24855 -56258 -34611
13431 -34611 26557 52509 221644 191977 83092 -80811 -167755 -286328 -461822 -372314 -201359
13420 -201359 -87134 -102927 -54566 -150273 -271532 -229455 -263964 -234664 -179420 -144241 -194434
13409 -194434 -197633 36106 5255 -37978 -110862 -129583 -87088 -150649 -96770 -48621 -22656
13398 -22656 79655 171059 80965 -131234 -224459 -130758 -102111 -87586 -32001 184040 148235
13387 148235 -8137 4146 -63222 -299033 -267571 -116026 -101661 -291886 -341684 -289010 -152140
13376 -152140 -66825 -142796 -226911 -182864 35804 228795 277032 185055 36185 49683 -64650
13365 -64650 -170295 -34834 -39945 48666 228599 194018 233648 161304 185998 115168 -30864
13354 -30864 -153104 -132276 -115345 -164224 -103785 45436 -242744 -317687 -29045 115152 150708
13343 150708 155413 131251 88899 -83142 -122988 39930 77412 -6155 -186786 -224934 -100260
13332 -100260 -73291 -119433 -270264 -281716 -215731 -288195 -275881 -239120 -189917 -116039 86291
13321 86291 90896 118811 264817 272195 202735 93563 -30304 -13162 97060 203365 224206
13310 224206 336130 295077 357719 91031 160062 356277 354825 242474 207213 187613 176696
13299 176696 181415 147253 192295 103849 7619 55196 38201 112749 145770 -26168 -123867
13288 -123867 -146340 -4751 10990 -63976 -36012 107635 136489 -97705 -236759 -122399
13278 -122399 64519 82369 -47465 -30041 54866 95248 111400 195722 53226 -126611 -168533
13267 -168533 -83288 -218412 -171729 -122912 17847 161749 95741 -55615 -54830 -42501 -166078
13256 -166078 -350738 -214854 -74827 -82007 -146852 -187389 69538 288113 404780 189742
13246 189742 -50657 14477 83655 114735 153102 74773 175399 197499 43030 28137 90894
13235 90894 147572 -7115 -39756 -35463 7107 45292 -56602 -202845 -263186 -125883 -115664
13224 -115664 -62045 -78457 107720 108718 135403 232150 453003 458601 297068 67930 -8357
13213 -8357 -85288 -106735 -56392 -343 -7061 -59723 -112278 32583 129571 96001 -14734 -110781
13201 -110781 -32900 -119897 -143719 -200396 -25295 61107 73031 32158 162694 226226 199200
13190 199200 68572 222800 298018 268070 183971 320503 275721 140507 1749 61305
13180 61305 -104672 -64961 115535 91481 22666 55500 -45929 -160632 288 6510 -234173
13169 -234173 -147871 39062 54526 193278 111320 19614 -69751 -145868 -193586 -72374 113894
13158 113894 177844 193502 -108469 -241516 -38349 96246 42225 56957 6598 24798 103151
13147 103151 264610 189713 8784 -64667 -91797 -221228 -344545 -192021 -104456 -45524
13137 -45524 35247 185143 151021 48843 142321 123290 145927 166168 76211 -71039 -143592
13126 -143592 -10400 117502 69542 -95640 48018 129863 166592 80761 -207 -37624 -35365
13115 -35365 -10125 167633 300113 496572 518958 386854 271381 -3314 -164875 -114632
13105 -114632 -73536 33113 50469 61733 -143317 -221944 -223856 -308694 -124078 124058 199516
13094 199516 103309 -142040 -75916 42085 60208 39862 -21047 -114678 -76597 104102 258089
13083 258089 123520 154182 210487 89906 206304 276832 154126 90040 -15874 -46508
13073 -46508 62381 164274 160013 68820 56127 85417 106628 223601 143481 -3826 -66784
13062 -66784 -32464 -62092 -81414 -34566 -60585 8214 62064 75487 -16134 -51018 -139 -22136
13050 -22136 -122534 -143209 -114187 121909 153297 154099 238166 229615 184082 28321 -131714
13039 -131714 -238388 -266946 -365262 -291355 -357868 -368350 -171915 -145526 -23842 -88355 -120946
13028 -120946 -112297 -108504 -53650 94594 16325 -33161 -75461 -124883 -152684 -140787 -109315 -107738
13016 -107738 -99008 -51559 29582 21339 -4962 73541 58436 42122 64660 13605 -172739 -69543
13004 -69543 95790 123299 -1221 -84648 -9703 -151521 -108364 -4914 8056 -14961 -57994
12993 -57994 -172682 -285395 -259688 -239372 -140620 -70903 -47487 -188012 -298732 -25753 176518
12982 176518 110497 2623 72015 172639 84124 1593 42251 -1102 -86501 -71024 20539
12971 20539 8037 106848 139823 222719 155483 57031 48735 312566 441398 374984 113566
12960 113566 -11515 -56492 -153845 -276552 -175326 -223504 -136909 -163725 -246631 -346927 -228606
12949 -228606 -187642 -155090 23558 70088 102088 2617 -125004 -57792 33733 -26264 -177581
12938 -177581 -240499 -226585 -232617 -269440 -190098 -80783 -45434 -44872 61815 -6352 -55652 -136160
12926 -136160 -61427 62396 -4367 -111577 20284 85727 155477 202747 107023 97026 61018
12915 61018 85671 31767 -20283 -81975 -79911 -122546 -200186 -75665 -19520 4614 -69623 -100963
12903 -100963 40187 -95439 32175 218076 285592 68573 24356 -81624 -110379 -104304
12893 -104304 56894 -69399 -175034 -151485 -30594 83707 130089 136947 125834 109627 213327
12882 213327 250018 243416 334054 255530 254830 245751 161805 79998 41683 -10863 -159340 -157522
12870 -157522 -112017 -88694 -61559 -5187 -137539 -302900 -509199 -433930 -304840 -229543 -37564
12859 -37564 76902 -99352 -362479 -392734 -401834 -255530 -288699 -153288 168806 202813 -16653
12848 -16653 -59253 237138 249023 314918 288950 111163 -67897 -96802 113337 207668 -43949
12837 -43949 -145273 39561 221128 336556 239756 66160 16046 77992 -28143 -161326
12827 -161326 80850 135445 31919 34757 -45691 -107652 43137 -9902 -38668 -8137 81770
12816 81770 66806 -37032 38764 11024 56654 64868 -69508 -46478 -196356 -137910 -187258
12805 -187258 -352765 -253486 99 95580 -73198 -108764 -139025 -233477 -91983 -40971 34008
12794 34008 26670 -5788 -119131 -40128 75363 25169 -14046 -47124 190237 308118 143553
12783 143553 43716 79976 330314 442223 426044 208018 24611 104503 191505 166956 201990
12772 201990 164073 83813 185250 265042 126710 98921 126323 35183 -22207 147906 103040
12761 103040 -1664 38179 141344 242514 77746 -150956 -432095 -352079 -185005 -117639
12751 -117639 -62011 697 25715 50891 -29897 -80811 -183598 -148565 -154394 -125054 -17722
12740 -17722 17997 -116387 -62854 6741 -104036 -9590 107830 198675 53322 -306280 -413199
12729 -413199 -122242 -4917 81562 100284 275440 366361 149125 -27036 -45682 -14437
12719 -14437 -77460 -125812 56312 253411 204602 42158 -134757 -33595 76943 32391
12709 32391 -66955 -40070 -92234 -69047 175068 77573 756 -18642 10498 -7785 -72577
12698 -72577 4750 35367 -27435 -104157 -124222 -54784 -133760 -54180 46791 106112 122985
12687 122985 83365 170226 208557 125534 12198 -8828 162937 71905 -80387 -49358 -48204
12676 -48204 -32132 -170823 -75727 -44172 -70453 111664 272860 302824 354771 229444 25300
12665 25300 -163035 -119476 84906 143118 143706 75912 -130375 -202190 -229789 -256053 -122683
12654 -122683 -65512 -40888 -62265 -184456 -255271 -26371 185287 176962 140694 84096 75469
12643 75469 42189 -174896 -188124 -143514 -73889 -135142 -120047 -233263 -243359 -181928 -185921
12632 -185921 -254905 -127049 -44690 -113254 -215677 -59395 105850 113463 81420 115905 106475
12621 106475 103563 91706 -38277 47220 58229 -25365 140987 232223 149956 5012 -94230
12610 -94230 -89496 11551 150132 195289 164370 140868 175780 153198 45443 98394 262286
12599 262286 276822 238702 155724 18589 6021 226762 333521 305391 205957 123772 82883
12588 82883 9752 38301 32375 14462 26137 55752 223304 62340 -115019 -53054 -95036
12577 -95036 -257342 -238227 -136966 -185846 -263032 -268791 -101376 -118304 -72507 47526 49022
12566 49022 111514 19371 -129899 -243062 -93614 -100609 -109787 -73919 -59618 -63619 -88071 -136857
12554 -136857 -202523 -276165 -113330 21341 6951 64511 36969 -71480 -93955 36798 20105
12543 20105 -111347 -86554 -17179 108418 5820 -111782 41217 57232 30545 81077 97529
12532 97529 -292 -96261 -48389 73668 74521 20685 81810 93483 87302 208433 117735 89449
12520 89449 165751 253648 146499 -4712 -29747 83835 -79071 -229196 -287956 -263342 26385
12509 26385 68704 -55544 -71933 -122919 -176729 -169007 -7722 1758 67246 25983 -36458 59116
12497 59116 185500 129278 82764 -108798 -276085 -277050 -351832 -492940 -531896 -491999 -421505
12486 -421505 -385546 -227198 -100880 -109875 -143953 -216908 -61740 72430 77561 32372 -54986
12475 -54986 -52790 -127333 -148071 66878 260191 272083 219500 175046 153078 167821 114438
12464 114438 172410 103954 -100085 -107270 -87739 -111297 -150389 -121735 4347 -37245 -45822
12453 -45822 221243 397909 412299 278446 345374 410571 317739 228239 335574 277539 169689
12442 169689 9021 -225529 -261140 -144233 -130335 -21124 58678 135760 235968 156537
12432 156537 146896 115191 81727 13038 121334 18660 53234 -30234 -143135 -59004 -51882
12421 -51882 32099 156538 198101 282370 105471 -105652 -69855 125471 170402 44610 -37759
12410 -37759 -16194 -21962 62616 90617 169441 57339 -24373 -17019 136797 348895 220720
12399 220720 -22263 34719 104094 -44855 68234 -27454 -123901 -17469 44738 43800 35143
12388 35143 -71965 -47722 46776 132655 22994 41559 33114 -78898 -5682 67060 44699
12377 44699 84431 281072 245516 116753 144606 37558 -149872 -217312 22847 300065
12367 300065 383532 285819 42221 -154427 -115710 -122630 -103118 -162883 -167676 -12497 68087
12356 68087 205348 233381 217533 159395 33462 -8368 -135125 -100409 -2370 46708 -41707
12345 -41707 -71033 22316 -42038 16237 34460 -33376 -68527 -57568 27130 35491 -89239 -194828
12333 -194828 -294927 -243261 -331519 -264266 -80950 -170609 -215727 -162399 -138443 -26777 -30909
12322 -30909 -141591 31509 59950 68617 -28203 -60501 -8318 -65857 22404 66972 147587
12311 147587 121038 46560 38466 156938 261823 268727 243207 225473 90484 12265 -198614
12300 -198614 -254843 -167793 -170280 -196883 -230319 -122278 -193118 -101599 51604 53959 -14558
12289 -14558 -56332 16226 134381 -39880 -39075 96607 11585 -108145 -47557 -118759 -184571
12278 -184571 -25963 25737 -55759 -3535 -85046 -246937 -258607 -294213 -410216 -413886 -202074
12267 -202074 -29381 26132 19854 40752 20602 71761 -1249 -153814 -296551 -290421 -252462
12256 -252462 -71354 -112850 -237677 -225339 -225447 -84897 174320 79340 -39894 -7607 -169412
12245 -169412 -318008 -300143 -218819 -167385 -191483 -89004 -21823 8836 38378 67507 16395
12234 16395 34652 140561 257339 146668 -974 -178227 -164138 23287 45150 -38545
12224 -38545 -150924 -139247 -26563 -80617 -87972 56839 271027 271790 180063 59325 30909
12213 30909 -82126 48373 -46732 -53935 20823 -66417 -266024 -171845 -109129 -98882 -80902
12202 -80902 12463 65855 127542 229171 175455 137688 79067 94148 99274 -97703 -176465
12191 -176465 -81909 28440 63188 194833 221294 161375 97365 64469 80400 42100 -76656
12180 -76656 42758 108791 112452 102472 -178162 -218856 -112444 -110033 -272027 -403171 -402597 -253852
12168 -253852 -95233 -100523 -137782 -99381 -125820 -95891 -95530 -125086 -62578 -11968 39920 47949
12156 47949 -15667 -36837 136373 26513 -35847 -82600 -113305 -31355 -121421 50751 209377
12145 209377 -67922 -162457 -45053 115081 167678 50618 12392 -46951 -117512 -30345 43784
12134 43784 72750 162947 200432 20798 -141105 -124240 30318 -119910 -134265 68491 -13530
12123 -13530 -86140 -44693 34017 8786 -174455 -358651 -488489 -290787 -124740 20991
12113 20991 88591 106219 70662 202305 206556 37062 -214164 -287762 -171727 4719 13370
12102 13370 -85380 -79256 -95683 -175673 -19801 81534 -1314 64266 267200 231377 -24592
12091 -24592 8125 53566 107095 243587 178626 54243 -163805 -56475 189001 168472 190472
12080 190472 176453 124460 3394 -80266 99437 301077 317758 210373 53027 -101489
12070 -101489 -323895 -220285 -108237 14573 10887 -128509 -213886 -101923 -93545 126282
12060 126282 231370 243742 135485 -660 -182866 -327536 -337880 -315531 -373392 -255187
12050 -255187 -124764 79860 222073 24976 -38747 -6043 214520 116500 79661 -11242
12040 -11242 -14391 -24628 78269 7476 -122202 -129817 -127549 4807 23714 -45263 64611
12029 64611 17575 -928 -37821 -96203 -137026 -124980 -61616 -50883 -34707 177344 344593
12018 344593 536259 580629 480414 319583 303755 193593 142176 166088 299239 252138
12008 252138 75068 65765 48369 79853 108558 250129 341786 161153 -68888 -134790 -984
11997 -984 -51317 -45045 -52073 -10470 -29677 -112187 -234736 -124913 -160746 -241946 -154391 -56380
11985 -56380 -73449 -22045 95402 18001 42878 -52640 -239125 -274869 -136850 -161630 -53434
11974 -53434 -134313 -221376 -295824 -158427 -50789 66079 139489 186222 241864 151808 -58162
11963 -58162 -121873 -108466 5176 225084 168202 100028 177983 233685 132710 59600 33233
11952 33233 111266 173053 335135 181050 4147 67245 49349 5643 -91364 -81070 -24767
11941 -24767 32614 -30933 18982 30741 -1893 -150925 -124012 31589 253532 383045 305258
11930 305258 254900 119520 61318 -74967 -116565 20596 36524 79903 160603 364052 464929
11919 464929 251161 116743 -88577 -45820 124895 140589 38597 -23368 -203923 -375412
11909 -375412 -418978 -320107 -128723 -49074 -81624 26811 70395 95947 -2614 106189 48102
11898 48102 -197064 -166135 -45924 -30154 27389 217104 408421 390852 340913 130071 119615
11887 119615 15098 -18846 -25112 -91650 -43487 -75257 -98953 47880 177421 201985 83438
11876 83438 -8482 -62320 125396 184030 -6641 -59590 132249 22380 -6013 -77979 -198461
11865 -198461 -135366 166490 61099 61935 80826 134092 -73151 -225081 -147452 -21083 -72495
11854 -72495 -52802 -33050 -198826 -98858 38575 2233 -63130 -50606 19782 120393 104306
11843 104306 -32855 76479 18713 -100236 -224370 -283446 -337717 -199875 87881 129736
11833 129736 19214 -16132 79831 32036 134359 128428 -51152 -69551 -44180 -160020 -154929
11822 -154929 134137 245364 86148 132928 111749 17183 38630 -51024 -214791 -168677 -80004
11811 -80004 -13835 -38050 9557 109234 94471 165289 -125196 -316329 -203939 -130264 -208388
11800 -208388 -137906 -47764 45543 31493 -41267 34760 -75140 -95005 -2402 27839 -42297
11789 -42297 -33399 1659 58196 -74102 -189222 -299176 -102934 -15387 -42823 98309 -5450
11778 -5450 -80497 89651 103370 -39244 39943 -3045 -122818 40479 100023 176322 -55093
11767 -55093 -366441 -328213 -2747 144195 46599 65807 -142652 -404625 -253357 -35433
11757 -35433 -10708 -12752 -16338 -78694 -175806 -80122 44670 44527 97685 141078 40419 27782
11745 27782 -82137 10592 83913 110133 1574 -14693 -77829 88875 45720 -10692 -23423
11734 -23423 -158290 -296660 -127099 115820 125920 70766 263188 243487 122089 -27292
11724 -27292 -57811 27561 27067 77419 -118533 -169088 -330763 -355170 -234777 -117124 -4934
11713 -4934 -113974 -243982 -76531 -15520 -78003 -237707 -126196 120060 169734 163846 216648
11702 216648 88754 93946 57640 -115070 -93231 -4707 -33275 -44440 -50393 -12738 159988
11691 159988 295413 216929 37529 72107 136139 54983 -48929 10388 82104 -40066 -346132
11680 -346132 -255155 -205032 -211109 -45325 62342 -57327 -34302 8902 13282 -129852 -144486
11669 -144486 -86160 -73276 -45333 -19937 -193730 -199816 -126209 34444 44683 39208 6269
11658 6269 132710 235650 411678 338387 273554 43076 -116742 -254368 -287273 -196639 15332
11647 15332 178786 151487 185417 -21088 -26730 63034 -91728 -53365 53570 72927 1676
11636 1676 -88418 -65500 -76891 28641 -109518 -237145 -149099 3734 -27017 -140881 -242343
11625 -242343 -315998 -357758 -414214 -214961 13444 46075 142246 92235 -176631 -485171 -447435
11614 -447435 -177396 -71992 -101810 -95178 10266 73232 -133647 -267252 -39466 -86986
11604 -86986 -111578 2501 -3949 -10509 21733 -28584 126089 152218 19633 150063 41743
11593 41743 -153029 -138945 -187559 -232373 -71517 116346 124118 13768 68054 3947 -173320
11582 -173320 -111563 48233 23426 60789 82590 100455 23207 97285 110786 55306 25836
11571 25836 -46227 -164060 -74766 28594 -99523 -168047 -216279 -226684 -198901 -72540 99962
11560 99962 -4473 -114567 -91051 -149395 -34476 59966 246309 186841 -87075 -195418
11550 -195418 -116718 -37571 -85818 -242881 -138835 -51732 -52950 16786 -35131 -144609 -119261
11539 -119261 37185 -35607 -108494 -101070 -136684 27375 18079 -177909 -223638 -99972 -4363
11528 -4363 180933 161264 -55160 -183584 -40731 3448 61620 -92309 -327158 -276133 -182517
11517 -182517 -31741 98777 124948 75787 114668 18537 -214116 -382717 -293081 -248417 -127212
11506 -127212 56107 88581 132872 253033 120040 137398 292102 226786 142804 149888 104423
11495 104423 71204 323965 392140 129981 -104494 -13977 172674 95573 9527 -22116 -39190
11484 -39190 -9592 25084 57966 132532 2864 -101285 -103565 -128787 -66556 -85488 -299768
11473 -299768 -422939 -340568 -238949 -148500 -108372 -127237 -150905 64742 68440 -95183 -57750
11462 -57750 171803 150722 67775 -41981 -61265 -71439 51112 44142 -86260 -107151 -130478
11451 -130478 -118297 -182247 -81545 -8538 -140871 23548 135333 135443 28917 95816 306880
11440 306880 353744 210938 202692 204893 110152 -120469 -111782 -61293 -72332 -36129 -202890
11429 -202890 -241196 -116002 -131071 -138707 -1168 104981 133008 -80783 -192912 -145997 -191382
11418 -191382 -269090 -175637 -153058 -88325 -36022 -124506 -135810 19743 72891 -43375 -102847
11407 -102847 -85346 43232 39971 24437 -36191 -67580 -82276 16216 -67299 -139533 -14925
11396 -14925 149153 179401 193057 125415 86677 178225 171217 256269 373519 427303 232844
11385 232844 -27920 -139730 -327889 -254811 -17612 91547 10129 -5651 40546 3763
11375 3763 -44433 69854 73481 -134144 -264374 -202554 14583 15061 -94573 -141572 -32164
11364 -32164 67467 69209 8746 -129718 -67429 -45131 -1845 40170 -7161 -4529 -6839 647
11352 647 129828 141053 48853 -78539 -301255 -302873 -229156 -80187 -81513 -165029 -185196 -141567
11340 -141567 -194432 -184325 44082 222536 258777 179178 30859 100463 74045 5226 -228353
11329 -228353 -278157 -335534 -165994 -94796 64973 -8372 -83097 -33741 -40517 -91497 -21856
11318 -21856 109951 121242 164319 237682 145230 67989 -29337 52427 97348 83416 37118
11307 37118 -25414 -117613 -157669 -263645 -191499 -166722 29033 82254 -36217 -27127 24337
11296 24337 82583 4785 40940 -14462 29179 726 -46344 82588 -12910 -39267 -17595
11285 -17595 -35361 -45461 -172025 -278504 -149119 -14401 7276 -29927 5916 -135448 -107756
11274 -107756 -169331 -141024 -43247 23808 15262 164288 -12987 -58435 49590 -9426 -3570
11263 -3570 193236 292198 336998 229261 254340 203538 62966 48609 -90114 -91529 -125303
11252 -125303 -150632 -420340 -479636 -247628 -221962 -208106 -200803 -69331 15473 -64986 9622
11241 9622 51286 -16894 20450 40904 -84226 -51698 -36243 -119070 -62847 -102545 -102453 -105402
11229 -105402 -255616 -313878 -290434 -145485 -221348 -181990 -165828 -187041 -140905 -99396 -90062
11218 -90062 -71169 -87863 -41240 -106549 -80387 56765 83808 127905 146981 -66627 -115240
11207 -115240 -29462 -50778 -19428 -2198 73503 -8941 -32580 -11257 72481 -14329 -4029
11196 -4029 -20872 -165756 -270882 -304308 -291961 -285527 -31361 -19013 -141011 -114984 -83188
11185 -83188 -143346 -192690 -129668 -159499 -22840 -38427 -1675 61220 -52738 20463 120794
11174 120794 19798 -70045 -136451 -103801 110954 229293 339280 326762 207871 168518
11164 168518 173112 224175 -16066 -116100 -70298 -32605 -54721 -110549 -99555 20597 164866
11153 164866 177230 121989 78721 -79641 -279580 -287877 -263949 -101939 149719 151581 121526
11142 121526 90103 12827 -49887 5663 -65524 -101442 -159321 -160599 -200060 -97910 -116881
11131 -116881 -188780 -184816 -312390 -343808 -273593 -252121 -230461 -97951 27741 -45204 -248945
11120 -248945 -209202 -180211 14064 176370 268756 196599 137747 68693 138641 94538 -24965
11109 -24965 91529 168172 56388 86367 188712 121559 -60503 58506 196982 272755
11099 272755 214467 103104 -124739 -262783 -205513 -131014 -95677 -157251 -98635 -81001 -109822
11088 -109822 -164189 -151375 -128006 -95037 -172685 -55811 -59499 -131174 -129440 -32343 -5271 -29239
11076 -29239 469 -135755 -90323 3764 28443 18096 -90901 -93006 -40947 -84857 -59003
11065 -59003 -16583 96661 110293 -9178 55124 139936 138811 271348 145721 213279 169823
11054 169823 312439 228926 83741 19064 40921 -54578 -239188 -186258 -189592 -275420 -256577
11043 -256577 -113995 17315 34535 -39110 -7705 126929 22538 -16298 34336 187820
11033 187820 135817 37374 -1921 -63727 15881 101412 86043 34429 81749 185640 33873
11022 33873 -92069 -179542 -60110 -79201 -165512 -128506 -109829 -57366 -83602 -95742 -247719
11011 -247719 -317510 -363718 -393667 -329719 -163297 -23459 44133 17253 -77379 -70911 -30051
11000 -30051 -65891 -56279 27552 -14837 -156770 -93187 -141968 -149657 5011 95948 103714 184071
10988 184071 118811 -154899 -165359 -213 78571 94018 -17321 -254505 -346533 -396615 -248586
10977 -248586 -209075 -195867 -148040 -22069 72526 107766 22409 -118708 -157895 -271109 -299214
10966 -299214 -284612 -168647 -102036 53309 238012 312736 113697 157227 245867 262848 323934
10955 323934 213747 129568 135258 -97821 -288143 -286192 -294147 -83858 74592 32612 -108052
10944 -108052 -271157 -247732 -201119 -152881 -199142 -117531 -112259 -120223 -359724 -544938 -593824
10933 -593824 -554376 -267183 -39106 -91091 150056 288717 143329 -21207 -13620 -58126
10923 -58126 -216388 -268676 -186132 -27071 34511 73552 235765 262376 228773 136038 20561
10912 20561 -48686 -109248 -107621 83091 21518 -126179 -110759 30885 48582 -35924 -179016
10901 -179016 -144089 69923 153161 153871 188235 202377 144267 139871 175350 -92965 -249143
10890 -249143 8352 211342 148607 -23481 -86548 -100571 -15193 18107 37206 18533 -93393
10879 -93393 -76062 -60971 -265025 -288641 -128390 -11531 56809 49222 -104176 -205414 -127981
10868 -127981 -107279 -55929 139629 142266 -3637 -86481 -104645 16824 36929 -69008 -17416
10857 -17416 103079 196385 194629 320724 185944 90186 27262 160134 35869 -162254 -150835
10846 -150835 -222095 -180013 -156500 25849 312415 450026 310215 165644 133142 21866
10836 21866 -40027 -40146 -140063 -38095 27583 -5134 147727 92803 62405 150012 74793 34834
10824 34834 25438 -53184 -128773 7632 159544 227858 335408 359826 40863 -41221 27984
10813 27984 85435 110844 246456 274265 132849 -78615 -112419 -191416 -228124 -66131 -47903
10802 -47903 -82896 -130349 92012 388964 450052 170674 -92656 -141131 -142693 -240439 -222830
10791 -222830 -274755 -265403 -269815 -162230 38245 21774 90119 76595 199383 84683 121190
10780 121190 211199 223280 44502 -167983 -171530 -10244 187899 180724 -26935 -191464 -122381
10769 -122381 -60918 -35785 42709 -92679 -281930 -362573 -190156 621 28335 -96642
10759 -96642 -143407 -151574 -57593 -16244 165131 270989 245594 227962 156739 36273 -106046
10748 -106046 -158391 -147600 -67713 -44617 -9858 28463 -36803 -93038 4895 -16945 106874
10737 106874 -9858 -163525 -139952 -179766 -187240 -176978 -233603 -135294 -104764 96436 101252
10726 101252 262299 202338 24762 -169303 -220680 -171025 -100698 -80716 -165919 -360799 -146121
10715 -146121 -14658 -87770 -102575 -135615 -160600 -41395 128847 133164 162297 12808 -193052
10704 -193052 -170688 -97452 -162371 -80051 -139580 -138129 -3958 -145679 -137201 13703 -45253
10693 -45253 -209355 -125923 16664 -140073 -43060 28581 -22755 -119308 -39603 12225 31643
10682 31643 -44252 -149811 -98969 -49783 83946 15276 -13107 -90275 -198012 -174702 -70205
10671 -70205 -99788 -192980 -292540 -280102 -227506 -169566 2431 37869 -2779 124784 231341
10660 231341 78783 30300 36297 193747 324748 251936 123541 194337 52916 -51769
10650 -51769 -208037 -291304 -145413 92098 247364 69341 45445 12115 2246 -73130 4605
10639 4605 94180 2251 -41398 -58988 -5526 48882 130076 117908 94921 170381 141337 64242
10627 64242 69300 -97119 -158411 -42038 -102601 -113537 -28600 37584 -83904 -141369 -10177
10616 -10177 175987 228258 212518 196175 220506 161194 65887 -131745 -187715 -245233 -259066
10605 -259066 -245613 -33306 512 -73816 38357 -57763 41384 961 16594 -43065 -64150
10594 -64150 173008 293510 175958 85585 196804 203018 234270 185445 180107 56755 39493
10583 39493 173589 200568 198542 265346 207829 -46815 -265565 -267779 -136847 -135604 -177785
10572 -177785 -176195 -287688 -424362 -193797 68451 94322 127842 220527 189376 116207 78132
10561 78132 -11572 -135532 -112096 -36463 -45842 2604 148229 295092 112295 127413 206702
10550 206702 328707 160888 44799 -47314 -144355 -44883 65084 -108237 -307296 -436222
10540 -436222 -415979 -433896 -208125 -54673 147852 207554 239365 208806 167747 -23164 -33037
10529 -33037 -94035 -57877 169507 156377 11370 -50152 -8449 -12581 49910 136796 73946
10518 73946 -37913 85010 225798 224225 95298 -64144 7764 129720 214692 184120 48703
10507 48703 51530 -34198 -84554 -146514 21664 63953 -78055 -160324 39299 107908 -28160
10496 -28160 -101210 -258356 -287619 -105162 -35614 -3271 -45447 39391 105460 96039 144704
10485 144704 27116 -60063 -167215 -168837 -131807 -266500 -179056 -63567 -269134 -240041 -204129
10474 -204129 -81202 16420 -108459 -166425 -252444 -169165 133839 323551 285399 134856
10464 134856 -8068 8745 -77343 429 76482 15232 -12479 36267 -45323 -123353 -224340
10453 -224340 -103686 80205 91041 -98115 -33780 177907 137779 -98044 -136582 -58612
10443 -58612 7214 110082 172046 270094 323833 121709 26223 226164 138968 81988 161488
10432 161488 165230 24340 -52712 -47635 -18863 -58716 -62962 -168438 -196344 -243973 -166262 12266
10420 12266 -13292 -95156 -76338 -20240 -38603 -51904 -140929 -29280 -57485 -80495 -38271
10409 -38271 45058 69347 40599 -30277 -98194 -201510 -139000 -117795 -125447 -274327 -126309
10398 -126309 -21999 143704 135907 130061 -61586 -185167 -150993 -138626 -38768 -27489 -89484
10387 -89484 -116891 -213811 -264549 -123213 -15051 -64597 -32303 32263 22937 95539 32223
$$ [...]
##END NTUPLES=NMR SPECTRUM
##END=
