##TITLE=Analysis number 323450
Compound Code cc 57804
Book Reference 449/160/2
Project Code adrs
Chemist Name davee
##JCAMPDX= 6.0         $$ Bruker NMR JCAMP-DX V2.0
##DATA TYPE= NMR SPECTRUM
##DATA CLASS= NTUPLES
##ORIGIN= Bruker BioSpin GmbH
##OWNER= nmr
$$ XWIN-NMR		Version 3.5
$$ Wed Oct 25 12:22:22 2006 GMT Daylight Time (UT+1h)  MAYBRIDGE\nmr@NMR_250MHZ
##.OBSERVE FREQUENCY= 250.131544655141
##.OBSERVE NUCLEUS= ^1H
##.ACQUISITION MODE= SIMULTANEOUS (DQD)
##.ACQUISITION SCHEME= undefined
##.AVERAGES= 16
##.DIGITISER RES= 18
##SPECTROMETER/DATA SYSTEM= dpx250
##.PULSE SEQUENCE= zg30
##.SOLVENT NAME= CDCl3
##.SHIFT REFERENCE= (INTERNAL, CDCl3, 0, 16.522)
##AUDIT TRAIL= $$ (NUMBER, WHEN, WHO, WHERE, WHAT)
$$ ##TITLE= Audit trail, XWIN-NMR		Version 3.5
$$ ##JCAMPDX= 5.01
$$ ##ORIGIN= Bruker BioSpin GmbH
$$ ##OWNER= nmr
$$ C:\u/data/dgb/nmr/ADRS/1260/pdata/1/auditp.txt
$$ ##AUDIT TRAIL=  $$ (NUMBER, WHEN, WHO, WHERE, WHAT)
(   1,<2006-10-25 12:22:03.45 +100>,<MAYBRIDGE\nmr>,<NMR_250MHZ>,
      <created by zg, POWCHK disabled, PULCHK disabled
       configuration hash MD5:
       49 4B E0 1D 92 C2 6B 37 9F E6 65 BC 52 41 86 1D
       data hash MD5: 64K
       9B 49 AF 7D 91 50 0D 85 91 D3 95 E6 80 B9 A1 F1>)
(   2,<2006-10-25 12:22:14.65 +100>,<MAYBRIDGE\nmr>,<NMR_250MHZ>,
      <Start of raw data processing
       ef LB = 0.3 FT_mod = 6 PKNL = 1 SI = 32K 
       data hash MD5: 32K
       F3 5B D5 9D 09 0D 08 68 69 68 3A B1 A5 D2 A1 AA>)
(   3,<2006-10-25 12:22:16.36 +100>,<MAYBRIDGE\nmr>,<NMR_250MHZ>,
      <apk 
       data hash MD5: 32K
       D1 FF 4D F3 89 06 09 DB 42 A8 C2 BB 09 C5 15 CA>)
(   4,<2006-10-25 12:22:17.11 +100>,<MAYBRIDGE\nmr>,<NMR_250MHZ>,
      <abs ABSG = 5 
       data hash MD5: 32K
       D4 35 D9 EE 50 AF 0D 49 5F 03 50 AA 62 11 CB 75>)
$$ ##END=
$$ 
$$ hash MD5
$$ 61 A1 92 3F 3B BF C7 D9 FB 09 39 D6 01 DD 76 7E
##$RELAX= 
##$RELAX= 
##$RELAX= 
##$RELAX= 
##$RELAX= 
##$RELAX= 
##$RELAX= 
$$ Bruker specific parameters
$$ --------------------------
##$DU= <C:\u>
##$EXPNO= 1260
##$NAME= <ADRS>
##$PROCNO= 1
##$TYPE= <nmr>
##$USER= <dgb>
##$AMP= (0..31)
100 100 100 100 100 100 100 100 100 100 100 100 100 100 100 100 100 100 
100 100 100 100 100 100 100 100 100 100 100 100 100 100 
##$AQSEQ= 0
##$AQ_mod= 3
##$AUNM= <au_zg>
##$AUTOPOS= <22 >
##$BF1= 250.13
##$BF2= 250.13
##$BF3= 250.13
##$BF4= 250.13
##$BF5= 500.13
##$BF6= 500.13
##$BF7= 500.13
##$BF8= 500.13
##$BYTORDA= 1
##$CFDGTYP= 0
##$CFRGTYP= 5
##$CHEMSTR= <none>
##$CNST= (0..31)
1 1 145 1 1 1 1 1 1 1 1 1 1 1 1 1 1 1 1 1 1 1 1 1 1 1 1 1 1 1 1 1 
##$CPDPRG= <>
##$CPDPRG1= <>
##$CPDPRG2= <>
##$CPDPRG3= <>
##$CPDPRG4= <mlev>
##$CPDPRG5= <mlev>
##$CPDPRG6= <mlev>
##$CPDPRG7= <mlev>
##$CPDPRG8= <mlev>
##$CPDPRGB= <>
##$CPDPRGT= <>
##$D= (0..31)
0 1 0 0 0 0 0 0 0 0.06 0 0 0 0 0 0 0.0002 0 0 0 0 0 0 0 0 0 0 0 0 0 0 
0 
##$DATE= 1161775322
##$DBL= (0..7)
120 120 120 120 120 120 120 120 
##$DBP= (0..7)
150 150 150 150 150 150 150 150 
##$DBP07= 0
##$DBPNAM0= <>
##$DBPNAM1= <>
$$ [...]
##$SUBNAM7= <"">
##$SUBNAM8= <"">
##$SUBNAM9= <"">
##$SW= 20.6930455092707
##$SWIBOX= (0..15)
0 0 3 0 0 0 0 0 0 0 0 0 0 0 0 0 
##$SW_h= 5175.983436853
##$TD= 65536
##$TD0= 1
##$TE= 683.16
##$TE2= 300
##$TE3= 300
##$TEG= 300
##$TL= (0..7)
0 120 120 120 120 120 120 120 
##$TP= (0..7)
150 150 150 150 150 150 150 150 
##$TP07= 0
##$TPNAME0= <>
##$TPNAME1= <>
##$TPNAME2= <>
##$TPNAME3= <>
##$TPNAME4= <>
##$TPNAME5= <>
##$TPNAME6= <>
##$TPNAME7= <>
##$TPOAL= (0..7)
0.5 0.5 0.5 0.5 0.5 0.5 0.5 0.5 
##$TPOFFS= (0..7)
0 0 0 0 0 0 0 0 
##$TUNHIN= 0
##$TUNHOUT= 0
##$TUNXOUT= 0
##$USERA1= <user>
##$USERA2= <user>
##$USERA3= <user>
##$USERA4= <user>
##$USERA5= <user>
##$V9= 5
##$VALIST= <valist>
##$VCLIST= <CCCCCCCCCCCCCCC>
##$VD= 0
##$VDLIST= <DDDDDDDDDDDDDDD>
##$VPLIST= <PPPPPPPPPPPPPPP>
##$VTLIST= <TTTTTTTTTTTTTTT>
##$WBST= 1024
##$WBSW= 4
##$XGAIN= (0..3)
0 0 0 0 
##$XL= 0
##$YL= 0
##$YMAX_a= 514174
##$YMIN_a= -434021
##$ZGOPTNS= <>
##$ZL1= 120
##$ZL2= 120
##$ZL3= 120
##$ZL4= 120
##$ABSF1= 16.522
##$ABSF2= -4.171173
##$ABSG= 5
##$ABSL= 3
##$ALPHA= 0
##$AQORDER= 0
##$ASSFAC= 0
##$ASSFACI= 0
##$ASSFACX= 0
##$ASSWID= 0
##$AUNMP= <proc_1d>
##$AZFE= 0.1
##$AZFW= 0.1
##$BCFW= 0
##$BC_mod= 0
##$BYTORDP= 0
##$COROFFS= 0
##$CY= 12.5
##$DATMOD= 1
##$DC= 0
##$DFILT= <>
##$DTYPP= 0
##$F1P= 14.0000005364418
##$F2P= -0.99999901652339
##$FCOR= 0.5
##$FTSIZE= 32768
##$FT_mod= 6
##$GAMMA= 0
##$GB= 0
##$INTBC= 1
##$INTSCL= 1
##$ISEN= 128
##$LB= 0.3
##$LEV0= 0
##$LPBIN= 0
##$MAXI= 10000
##$MC2= 0
##$MEAN= 0
##$ME_mod= 0
##$MI= 0
##$NCOEF= 0
##$NC_proc= -4
##$NLEV= 6
##$NOISF1= 0
##$NOISF2= 0
##$NSP= 0
##$NTH_PI= 0
##$NZP= 0
##$OFFSET= 16.522
##$PC= 1
##$PHC0= -44.5812
##$PHC1= 2.035582
##$PH_mod= 1
##$PKNL= yes
##$PPARMOD= 0
##$PSCAL= 4
##$PSIGN= 0
##$REVERSE= no
##$SF= 250.13
##$SI= 32768
##$SIGF1= 0
##$SIGF2= 0
##$SINO= 400
##$SIOLD= 32768
##$SREGLST= <1H.CDCl3>
##$SSB= 0
##$STSI= 32768
##$STSR= 0
##$SW_p= 5175.98343685301
##$SYMM= 0
##$S_DEV= 0
##$TDeff= 65536
##$TDoff= 0
##$TI= <Analysis number 999999
Compound Code 99
Book Reference 9
Project Code 9>
##$TILT= no
##$TM1= 0
##$TM2= 0
##$TOPLEV= 0
##$USERP1= <user>
##$USERP2= <user>
##$USERP3= <user>
##$USERP4= <user>
##$USERP5= <user>
##$WDW= 1
##$XDIM= 32768
##$YMAX_p= 393403570
##$YMIN_p= -224614
$$ End of Bruker specific parameters
$$ ---------------------------------
##NTUPLES= NMR SPECTRUM
##VAR_NAME=  FREQUENCY,     SPECTRUM/REAL,   SPECTRUM/IMAG
##SYMBOL=    X,             R,               I
##VAR_TYPE=  INDEPENDENT,   DEPENDENT,       DEPENDENT
##VAR_FORM=  AFFN,          ASDF,            ASDF
##VAR_DIM=   32768,         32768,           32768
##UNITS=     HZ,            ARBITRARY UNITS, ARBITRARY UNITS
##FACTOR=    0.157963299565203, 1,           1
##FIRST=     4132.6476996994, 0,             0
##LAST=      -1043.33573715361, 0,           0
##MIN=       -1043.33573715361, -224614,     0
##MAX=       4132.6476996994, 393403570,     0
$$ Real data points
##PAGE= N=1
##DATA TABLE= (X++(R..R)), XYDATA
$$ [...]
28753e2030L236J2512K232J0491N4695L3702j7123l6208m7483j5802j579L1448
28741b1909P6617M3374j1905o2967j891K3751J4022j1811m8389j3966J7969K1307
28729B4202K3067l044j6312k7396J7056J3262L2667j0234j0676l069K890R671
28717E2084j1346J5955k5049o2769l9053M0223J4627j4763N702J3115K1499k3522
28705a3297l5301k852L5290k9348k9589J3278J0052K8711Q580M2001M468k2012
28693I981l1613m887K4168O92J0145K9565k284Q482K3146J0388j429j8402j6944
28680D1008l0249j8926N611k142K4364j9472m6481q701J6040M717J2520n594Q781
28667a8524P833K6134J5492J2900k1163l9820R340P169J5714n4753j1227M1623
$$ y = [-52030, -48794, -36282, -34050, -23559, 31136, 64838, 47715, 11507, -35976, -51778, -53357, -21909, 54708, 98082, 86177, 23210, 21319, 45070, 59092, 47281, -1108, -15074, 2895, 24202, 47269, 44225, 27913, 517, 17573, 30835, 63502, 53268, 42592, 39523, 42413, 52084, 40738, 56693, 31644, -31125, -70178, -29955, -15328, -30091, -24389, -11274, 10225, -13297, -48598, -51450, -16160, -45508, -75097, -61819, -51767, -23056, -14476, 27525, 31993, 9981, -21632, -26519, -2351, -1659, 8486, 38051, 35767, 44249, 67395, 77783, 76354, 57952, 41008, 10759, -8167, -2556, -4698, 19666, 194, -46287, -54988, -38948, -34231, -21711, -27305, -18524, -10691, 15443, 30935, 43835, 22672, -17148, -7808, -639, 15075, -39678, -50905, -9282]
28655i282J9882k2210l4735N353K7679L1115K302l5117j6304k790O470J7756J6833
28642F952k0912r874J6469L0473N602m575J6942K9132K3446n1673n2219j0188
28630b0425j4160K1049Q476j0896P308J3060J4515m5435p891J6059J9313K7815
28618B8788k1892m9397L198PK5735j9090O850J3204j4825N020j5528k7529J9156
28605d6303K9782J0576k358K3748K1131M291r789l7992j5138j2474J3174q853
28593c0205k0826m03J3834J0236K1737L7058L2287k8023j4632J5171K3393k026
28581E7601k5842k3271K2894L2860K5941R439m8360o3025k5556L0623K272Q505
28569D081j877j0627J4263K6730K5416r228r427P306m175k5774p197K4698K0746
$$ y = [-9282, 10600, -11610, -46345, -40992, -13313, 17802, 20104, -15013, -31317, -34107, -27637, -9881, 6952, -13960, -23834, -7365, 23108, 28710, 24135, 41077, 70209, 93655, 41982, -10237, -20425, -34585, -13536, -5060, -15956, -8648, 4412, 18927, -26508, -34399, -18340, 973, 28788, 6896, -42501, -39303, -39296, -13561, -32651, -25801, -12597, -27422, -22402, -37930, -65459, -46303, -16521, -5945, -8303, 15445, 36576, 40867, 31078, -6914, -22052, -34526, -21352, -30205, -51031, -51434, -37600, -27364, -5627, 31431, 63718, 35695, 21063, 36234, 59627, 57601, 31759, 8488, 31382, 64242, 90183, 99622, 51262, -11763, -37319, -6696, -4424, 4081, 2204, -8423, 5840, 32570, 57986, 48758, 39331, 46637, 42462, 16688, 9491, 34189, 54935]
28556E4935m4178n8962J1485M6314J8147o898r578o374M835k8752r723J9842r070
28543a7977K6926R182j3737k4117o5051L1079N5005J6460j3249k2253K0037K7075
28531B9380j5033m5484k3622j7026J0502k883J7416m68j5530k78j9194L673P591
28518g0956L0039J357p527K8052J5177r642k0126j9794P152M1510k1253k7799
28506e3810Q292K0709j7543m645j1677J6973M0253L8011L20k6094j6144J0941
28494E586J7909j2993L3106k505l0165j1959M5810J6587l3121j9524J390J8227
28482B8348J3929k588j3460J7472M1408m7616q8489k1619L4076K5201j0455k6048
28470d9841M775M5249Q4657M51k2494P265n2848k752J4675J8394j3512j7301K492
$$ y = [54935, 10757, -48205, -36720, 9594, 27741, 20843, 11265, 4891, 9726, -19026, -28749, -8907, -17977, 8949, 18131, 4394, -19723, -84774, -53695, 1310, 17770, 4521, -17732, 2305, 29380, 14347, -31137, -54759, -71785, -61283, -64166, -46750, -47218, -62748, -63026, -82220, -78547, -70956, -40917, -39560, -47087, -19035, -3858, -13500, -33626, -53420, -46268, -4758, -26011, -53810, -45518, -24809, -42352, -46997, -58674, -41701, -1448, 36563, 36883, 10789, -5355, 5586, 23495, 10502, 43608, 41103, 10938, -1021, 44789, 61376, 28255, 8731, 10121, 28348, 42277, 39689, 26229, 43701, 85109, 37493, -50996, -72615, -38539, -13338, -23793, -49841, -45066, 183, 84840, 85291, 62797, 70062, 17214, 14462, 29137, 47531, 34019, 16718, 19210]
28457A9210j7739J5740m063J9413j1302k1087k3332J523J7768k6207k9175L3896
28445b5355J1726K0272L4413K8403j0608l3578k5014m627K6226M0368j314j6377
28433D4535l7904j7245m1423J8008K980k2906J5785P8846K6586m7970J8881k3147
28421A5026k6958p90j3682j4376k7676K3769J6918J4577M81L8195n762o4849p348
28408e2475J3700J2050o420J1275K8599K0469J2305m567m059m5755k2561J2293
28396b5146l2839q14L395j1099O1686K9926k5630j3981k8367k6952K3203M6185
28384d33r524n2088l017J6025K8794L5691J3552K8031j1535l1450j844k1208j481
28371a0487L3088r537j0297n6241K6958L5291k7081j065M700R352K2497M7665
$$ y = [19210, 1471, 17211, 13148, 32561, 21259, 172, -23160, -21637, -3869, -30076, -59251, -25355, -13629, 6643, 41056, 69459, 58851, 25273, 259, -4368, 21858, 62226, 60912, 44535, 6631, -10614, -52037, -34029, -31049, -53955, -38170, 40676, 67262, 19292, 38173, 15026, -11932, -12722, -26404, -40780, -68456, -44687, -27769, -13192, -12711, 25484, 19722, -45127, -52475, -38775, -26725, -33145, -21870, 6729, 27198, 39503, 34936, 30877, -14878, -37439, -25146, -57985, -58799, -55404, -66503, -4817, 25109, -521, -14502, -42869, -69821, -46618, -433, -9957, -62045, -65062, -49037, -20243, 15448, 29000, 57031, 45496, 14046, 12202, -9006, -10487, 22601, 13064, 2767, -53474, -26516, 8775, -18306, -19371, -14671, -5319, 17178, 64843]
28359F4843l9986l6862K31k4990J1362k442l0828K8010J5321Q588L0573Q372j6518
28346A5674j4889L1175j357J4661K4010m9606n4826k060l261N053L3383J071k3388
28333b4360j5721j3024K3532M3171K3684J589J2814k8492k3048N964k312K7201
28321C0998p505k2421J5536j006n563J5311k558k5851K1943J7653j4304k2603
28309c70L0455P397q152k2173k4585o454K387K4653J8690p812K2937k660k9192
28296E121J4628N4988k7909n4950l639N136M5548j033j0391l3102M207J3001M911
28283A6516M3908L1557l9393l227J5825K106P361j9089q440m689o3306n318K6606
28270D17j1809j5723J6334J4989K9754J8495k650j2789l6724k1745J9437k5383
$$ y = [64843, 24857, -12005, -11774, -36764, -25402, -27844, -58672, -30662, -15341, -6753, 23820, 32192, 15674, 785, 31960, 30603, 45264, 69274, 19668, -35158, -37218, -40479, -35426, -2043, -972, -24360, -40081, -53105, -29573, 13598, 37282, 38871, 51685, 23193, 145, 6109, 3797, 30998, 23493, 1072, 16608, 15602, 10039, 25350, 22792, -3059, 18884, 36537, 22233, -370, 30085, 37482, 29330, 7157, -17428, -23882, -21495, 3158, 21848, 14036, 36973, 34313, 5121, 19749, 74737, 46828, -8122, -11761, -6625, 38923, 37890, 27499, -5603, -1396, 11605, 16516, 60424, 91981, 52588, 49361, 65186, 67292, 74653, 55564, 47124, 42435, -20871, -26189, 417, -11392, -27115, -10781, 4208, 33962, 52457, 49807, 37018, 294, -21451, -2014, -27397]
28258b7397j7912p029K1441L2692j4941J5022k6437k2642K2934k1619k235m319
28246e2442J2393M8092k914j1971j0994J3725K9495M034k4608k6522N460K9864
28234A3612J8023K1806K0736M2086j4533l9675n2682K7577J5086n328j2878k7927
28222E903k4894O843J7176P335J7009M312M210j8965m2586j0202O5134K348J4238
28209D7861R537o670j0020n029p227o992l8267j1448K4658j944R528N2511M5768
28196A02266n7628l6487K3436N5230K0620m8143k0830o952k8141j7038k213k7563
28184d3443L7021R140m0340J663N5803J5196m0132j0165Q038J5389o497k1728
28172b0055M723O4924q064l5846j3541K9457L4831L702n0551j5972K1196j5541
$$ y = [-27397, -45309, -52338, -30897, 1795, -13146, 1876, -24561, -47203, -24269, -45888, -48123, -52442, -40049, 8043, 5129, -6842, -17836, -4111, 25384, 29418, 4810, -21712, -16252, 13612, 31635, 53441, 74177, 116263, 101730, 62055, 9373, 36950, 52036, 46708, 33830, 5903, -18991, -12148, 5028, 12363, 29372, 33684, 37894, 18929, -23657, -33859, 31275, 33623, 47861, 57398, 50728, 40708, 35679, 28452, 21460, -16807, -28255, -3597, -5541, 3987, 56498, 102266, 44638, 8151, 31587, 86817, 107437, 59294, 38464, 31512, 3371, -13667, -15880, -43443, -6422, 2718, -37622, -35959, 19844, 35040, -5092, -15257, -7219, 8170, 1673, -20055, -15332, 49592, 41528, 5682, -7859, 21598, 56429, 60131, 9580, -6392, 14804, -737]
28160g37p3161j8675K7755K9525n392r794J2828J4600K8092P778L4812j2920m6299
28147a1588k3618N1938M256j3299L688O602K6956K973K199k6726m150K1017l2909
28134G339m0329L169L683j278K5821J0168R271N118N984M753k0344j9044k5425
28121c1114k269J9978j4583j042J7226K406k7983j9918K3387K6841k9718L189
28109c3600K2600j4222j971m256n173J3896j8836M2215O065k2425k4591k6550
28097f6848j286N4518L9175R680M740r903L43o187J1593L8998N718m0362l3215
28084F964L879q15k207K4272j5308l8411l991o683l3561J7601K9086o396N788
28071a9782k4367j6769j3378K8587K257j6640N953R837P364l4824o134l380O896
$$ y = [-737, -73898, -92573, -64818, -35293, -40685, -50479, -37651, -23051, 5041, 12819, 47631, 34711, -11588, -35206, 16732, 20988, 7689, 11377, 17979, 44935, 47908, 50107, 23381, 19231, 40248, 7339, -32990, -29821, -26138, -27416, -1595, 8573, 17844, 22962, 28946, 33699, 13355, -5689, -31114, -33383, -13405, -27988, -29030, -11804, -9398, -37381, -57299, -33912, -7071, -36789, -33600, -11000, -25222, -27193, -31449, -36622, -22726, -41562, 653, 6718, -15707, -40298, -66848, -68134, -13616, 25559, 35239, 39979, 30076, 30419, 24232, 35825, 74823, 80541, 40179, 6964, 10843, 10028, 7821, 32093, 16785, -21626, -25617, -32300, -65861, -48260, -19174, -25570, -19782, -44149, -60918, -74296, -45709, -43452, -60092, -54139, -44302, -36938, -71762, -77896, -81276, -74380]
28058g4380j347J5290L1926K1613k5034n599J1456K879k1767N701J8926p957J3923
28045a4370M0067L644m2357m8638k7933L8881L4377l7928l002K3726M5286J4431
28033B6184J863j2307j4824j9642o618n057J1080J4458J3846L7493R263l4996
28021B0743j5690J179J9250P573j3413N768K0748k4025k3326j422l0118j2532
28009d5265L8935Q919J1426N477j6567N207k5588r094N674j2064J4437Q835J0892
27996A224K2488L4991k7080l0587M402k1116J765k1756M3379j2428k1685L3016
27984F613j2260j3842m851K0049q027p39O493K6402K0919j5818r38j9245j1996
27971g240K0224M494M73J512O337K8015j6897l0374O227O014K6739o01k0056J4810
$$ y = [-74380, -75727, -60437, -28511, -6898, -31932, -37531, -26075, -23196, -44963, -39262, -20336, -28293, -14370, 25697, 29341, -13016, -61654, -89587, -50706, -16329, -54257, -57259, -33533, 11753, 26184, 28047, 15740, 916, -18726, -25344, -30401, -19321, -4863, 8983, 46476, 55739, 20743, 5053, 6232, 25482, 33055, 19642, 25410, 46158, 22133, -1193, -2615, -32733, -45265, -6330, 2589, 14015, 19492, 2925, 8132, -17456, -26550, -20876, -32940, -18503, -9668, 1224, 23712, 58703, 31623, 1036, 5438, -15678, -13913, -35669, 7710, -4718, -26403, 6613, -5647, -19489, -24340, -4291, -12318, -13057, -6564, 19838, 40757, 24939, 24001, 4756, -7240, 12984, 17478, 17951, 19463, 25800, 53815, 36918, 6544, 12771, 18785, 45524, 44923, 24867, 39677]
27957C9677j9485k0576K5668J8445j2405J3954o759n072k0837j0030K2188J5710
27945D0478j2855k5667m0866o081j1538k3155O947L2828J3324J1840M666j2582
27933b2661j2411K749k0491l171K0503O540K1973L5203k3749m1266J590J4941
27921b0250K2428K6768M5664l6174k0130j4776k2051j4644K6274O243o047L0669
27909B3974k2594l5715n534K9710L4454k541K1804k3179k5385Q605K024p321l184
27896d882K9002L2412j1817j4322j4944m2198L8105M2205k9044m3594k0337J3967
27884b5447K2257m592J9723n191J7334j4540j9671j2432k1791Q712M5347L5318
27872D5027r740J1736j1079k9027o167r77M460K0250P495P99j1047j4564j4942
$$ y = [39677, 20192, -384, 25284, 43729, 31324, 45278, 38519, 33447, 12610, 2580, 24768, 40478, 27623, 1956, -38910, -44991, -56529, -79684, -72737, -39909, -26585, -14745, -10079, -22661, -35072, -32323, -52814, -55985, -35482, -28942, -6969, 28234, 4485, -36781, -35191, -20250, 2178, 28946, 74610, 38436, 18306, 3530, -18521, -33165, -6891, -648, -6695, 23974, 1380, -34335, -39869, -10159, 24295, 21754, 43558, 20379, -5006, 3599, 5623, -1698, -4882, 24120, 56532, 44715, 30393, 15449, -26749, 11356, 53561, 24517, -19077, -39414, -25447, -3190, -7782, 11941, 6750, 24084, 9544, -10127, -22559, -44350, -35638, 9709, 45027, 35287, 47023, 35944, 6917, 750, -227, 4233, 24483, 31978, 32777, 21730, 7166, -7776]
27859g776K5761L2238K2446L3753m8070n808j3893p896k0991J7779k9452k4627
27847b6536n8063J3610M7400K4336K932k6456j1734N2875K8696j5033j5603n7608
27835d1184K6769J3338n179n9852k8041L1686K6421O807n106j5647J5538J0022
27823b4428n980l1099L0576j4331L8740K3367l6782p857J1549J3044M580p232
27811e853J1694K763k2220k8600J957M4848K9592l7875j9131K9125L6205J4250
27799E6755k6214k6952J6452j7685l4943K7630q037J7405R663k1454k6821j830
27787c6031J6378J5577K0302P951L9227O742k7694j9593p893O543J5760j6633
27775B0636m5254k8964o149K2667K1780K2817j4839j7765k286L3294M510p962
$$ y = [-7776, 17985, 50223, 72669, 106422, 58352, 52544, 38651, 30755, 9764, 27543, -1909, -26536, -84599, -70989, -23589, 747, 3679, -22777, -34511, 18364, 47060, 32027, 16424, -41184, -14415, -1077, -6256, -66108, -94149, -62463, -36042, -29235, -34341, -49988, -34450, -24428, -30408, -61507, -30931, -45262, -6522, 16845, -19937, -27794, -16245, -3201, 1379, -5853, 5841, 8604, -13616, -42216, -40259, 4589, 34181, -3694, -22825, 6300, 42505, 56755, 30541, 3589, 20041, 2356, -32587, -4957, -12994, 4411, 14074, -7380, -34201, -36031, -19653, -4076, 16226, 24177, 63404, 70146, 42452, 22859, 14966, 21509, 37269, 20636, -24618, -53582, -59731, -37064, -15284, 7533, -7306, -25071, -27357, 5937, 10447, 2485]
27763B485k3456K2757L9036M8188J9720l9474n7806k9371K4349K4985Q367J7491
27751E7271L0561n256k3285K47l0952j9558j3253L9451K3996k9341l1815k4155
27739b6089K9360L8476j4552J3661j6307J2517J1005j7262m516l702L11J8321
27727D1223l084k573n669k4251k1389L8326O208k9201j2768J6622J8193L3186
27715E4823L850j3937j0168J409L3152K0949l3331k7956k2474J4161N530l2957
27703f949j5228J2101J4913J8358J8696L2424o473j7589l2892m964j7435r954
27691a4992J2975R475J2517j9053j106k0345k382J729J1885M2743j494j3480r433
27678I039K3232p433p144M893j9609O016M2393k0148n1527o996K0764M5470M0732
$$ y = [2485, -20971, 1786, 40822, 89010, 108730, 69256, 11450, -17921, 6428, 31413, 39780, 57271, 87832, 82576, 59291, 59538, 28586, 9028, -4225, 35226, 59222, 29881, -1934, -26089, 3271, 41747, 27195, 40856, 24549, 37066, 48071, 30809, 26293, 22591, 22902, 41223, 38139, 35566, 29897, 5646, -15743, 22583, 28791, -410, -13178, 3444, 21637, 54823, 58673, 44736, 34568, 35977, 69129, 90078, 56747, 28791, 6317, 20478, 26008, -6949, -22177, -10076, 4837, 23195, 41891, 74315, 67842, 50253, 17361, 12397, -5038, -14992, -2017, 7458, 19975, 922, -184, -20529, -22911, -21182, -9297, 33446, 31952, 18472, 9039, 32271, 24838, 17694, 22587, 2978, 8994, 51387, 31239, -20288, -27284, -6520, 38950, 79682]
27665G9682j6131j0561o902k034J3231J0782j2148n050k312J9760L4190j8306
27653H4201m394j2664j4257m2127l7848k3939J402m64N721J9863j0632P012k7066
27640e5192k265P994K8316J6606J159J1775J9201j4652L694R819j2909k5092j0017
27627b1563J5770P668K391J8872j3757l2064j3139j0897L621l604j8435N957L2893
27614b6287J8221N27J1651J7780O707k2771n153m258P75j2085K1577J0240K4962
27601D1886m7291r196N0979o568k9090k8173m968L4232K0103k2921j2650J5936
27589B279j5261J3990k7882L6064L1445j1876o472k6669o187M7374R32m0121o206
27576h590J3608K4574j1680o330M93M0297n0424j0934N96k0196J7708N8795K9425
$$ y = [79682, 63551, 52990, 46088, 44054, 57285, 68067, 55919, 50869, 48557, 68317, 102507, 84201, 79807, 67143, 52886, 10759, -27089, -51028, -49626, -50090, -44369, -24506, -35138, -28126, -55192, -57457, -49463, -21147, -4541, -3382, 8393, 27594, 12942, 16636, 26455, 13546, -11546, -21563, -5793, 1875, 4266, 23138, 9381, -22683, -35822, -46719, -43098, -46702, -65137, -59180, -26287, -8066, -7539, 4112, 21892, 28599, 5828, 675, -3583, -2808, -14893, 6684, 16924, 41886, -5405, -14601, 36378, 29810, 720, -27453, -32421, 1811, 21914, -1007, -13657, 2279, -12982, 1008, -26874, 9190, 40635, 28759, 22287, -4382, -10569, 36805, 37737, -2384, -8590, 5018, 29592, 17912, 11582, 12075, 52372, 1948, -8986, -8390, -28586, -10878, 47917, 77342]
27563G7342j6264l3604k8645m5611M075L1890N6067M320j6036l8575j5670N706
27551a5005K2617l463L855J3262k5558P830j5238j4319j260J6039J8308J0536
27539A7604M0674j215j3498M995L168j2203N586k110k8855o1992K9897L5858N863
27526B3772k3200K6336K0026j2826k7384J4731M7744k476j6070K8915K966J4507
27514I7041l4028l9945r010K58j8006m012j1516J0130R208J9318Q27j6008M248
27501H505r789K6105N635N811j3664k2502J0283j0312Q923r509J6968K5734m1908
27488B80k8487o759j232k5544j7185L8177M3652L9776M260n955O172k3376k8636
27475d857q927O568n675l8793j1637J0935J6978m171j9839J0707K0286r576K1389
$$ y = [77342, 61078, 27474, -1171, -46782, -42707, -10817, 45250, 49570, 33534, -5041, -20711, -15005, 7612, 4149, 8004, 21266, -4292, 3538, -11700, -26019, -27279, -11240, 7068, 17604, 58278, 57063, 43565, 48560, 51728, 39525, 45111, 43001, 14146, -47846, -17949, 17909, 23772, 572, 26908, 46934, 34108, 6724, 21455, 69199, 66723, 50653, 79568, 82534, 97041, 63013, 23068, 14058, 14316, -3690, -7702, -19218, -9088, 120, 19438, 20265, 4257, 8505, -1284, 24821, 30456, 36267, 22603, 101, 10384, 72, 8995, -514, 16454, 42188, 280, -28207, -34966, -36198, -61742, -78927, -40750, 2902, 42678, 46938, 40983, 47155, 23779, -4857, -13784, -7216, -12891, -51684, -63321, -52386, -35408, -39579, -59418, -48711, -28425, -38001, -16612]
27462a6612L243r291K2662J2370J728l9370k498L1127j0012k2537R927K6962K7205
27449C4904Q538k2748k5034N154K2201K1230L3263Q825l1309j6268n431l3869
27437e44K1512l1159j9116N012L1670K7566J7741m852q642j6768l7745L1301J8046
27424C4022j3891j4205L0848K1397k6597m2509J1851N782Q055N993k7984j0136
27412a7374p669j0062N2012J9879l119K2083j2198l9568j3265N032p427m2314
27400e3990M2368L4051K0145Q403j2046j0423j0885n715l4100q742P069K9017
27388E152J6725r781k0175k3337J2800J7384K0221J2823o1895l4958p127J2576
27376e9592J4270L0365J4471P881J5330K0406j296p481n333l1056L295M451K5426
$$ y = [-16612, -13369, -22660, 2, 12372, 14100, -25270, -27768, 3359, -6653, -29190, -19263, 7699, 34904, 43442, 20694, -4340, 814, 23015, 44245, 77508, 86333, 55024, 38756, 33325, -544, 20968, -10191, -29307, -24295, 7375, 34941, 52682, 47830, 39188, 22420, -15325, 15976, 34022, 20131, 5926, 36774, 58171, 31574, -10935, 916, 6698, 14753, 20746, -7238, -17374, -25043, -35105, 16907, 36786, 33667, 55750, 43552, 3984, -9281, -4249, -11676, -53990, -11622, 22429, 42574, 50977, 38931, 28508, 17623, 11908, -22192, -30934, -23865, 5152, 21877, 12096, -8079, -31416, -18616, -1232, 18989, 31812, -30083, -65041, -72168, -59592, -45322, -14957, -486, 7395, 22725, 43131, 41835, 34354, 29021, -2035, 1260, 5711, 31137]
27363C1137l2407j6950J3487k7998j4789k646K1705l009L4915K3496K4511R150
27351F0602j2894k2336m2445Q21N0379K1259k2657m0066L3125Mj2563K7013j4361
27338B5881K09j1045J6012K3585P928l8677m2102N625k025L3027J1321m1073Q798
27325b536R889j3254j0684P555k7236K0544n122O168L0774L8714L0797j2964l1951
27312D0694l2055N458j0771K7164K5524j5217j4510j4953m1305o012N0481L7644
27300E2142J324j5339l7731l1846K0444L8878K0492l3801j1925j8340m4865M254
27288e6313L1654j5399K81J5495l7261M9448N4813J5220l2742j2060J8r695K8331
27275C1790K2266m7571k2522l3061q943M6097q118R22L0778q445J9423j1328K552
$$ y = [31137, -1270, -18220, -4733, -32731, -47520, -50166, -28461, -31470, 3445, 26941, 51452, 60602, 47708, 25372, -17073, -16252, 34127, 55386, 32729, -7337, 25788, 25792, 13229, 40242, 25881, 26090, 15045, 31057, 54642, 62570, 23893, -18209, -12584, -14609, 18418, 29739, -11334, -2536, 7353, -5901, -16585, -9030, -36266, -15722, -20844, -14676, 16098, 54812, 85609, 72645, 40694, 8639, 14097, 3326, 30490, 56014, 40797, 26287, 11334, -29971, -35983, 14498, 52142, 53466, 38127, 396, -31450, -11006, 27872, 48364, 14563, 2638, -15702, -60567, -56313, -24659, -40058, -39777, -24282, -61543, -12095, 42718, 57938, 25196, 13136, 13154, 3459, 31790, 54056, 6485, -16037, -49098, -58041, -11944, -20062, -19140, 11638, 3193, 22616, 11288, 13840]
27262A3840R86J8543K7686J7487J3934L77l0250j9417k5995k8946K4524K7300
27250D0069K1100j9293l1337J3411K8669r24l4480k3228J1265L312J4231n828
27238A6967P510K5701L445L5285j0893o9500j3174K5143J2830N1l1768n532J4156
27225A0221j9149J4842p1L110o297J5753J1821j424R182q493k7114j9807kJ0302
27211g126L0108J4722k345k8727j8531j2432Q943j4798N1165J7327k2922n1957
27199c6573J0426Q896m2429k7032J5972O1063N5686R725l0782n333j1095P770
27187A6294R414j9995J7665J6454l5963J8197j0392K9262j3000K076J0236k0285
27175A9963k2456M960L1773O083n2315p049K293K4412K2381m1633J1356L4484
$$ y = [13840, 14826, 33369, 61055, 78542, 92476, 92853, 62603, 43186, 17191, -11755, 12769, 40069, 61169, 41876, 10539, 23950, 52619, 51695, 17215, -6013, 5252, 8564, 22795, 16967, 24477, 50178, 53623, 88908, 78015, 8515, -4659, 20484, 33314, 33365, 1597, -3935, 10221, -8928, 5914, 5843, 8953, 2656, 18409, 30230, 28806, 37988, 29495, 2381, -17426, -17428, -7126, 22982, 37704, 35359, 6632, -11899, -24331, -15388, -30186, 20979, 38306, 15384, -36573, -26147, -17251, -59680, -86712, -70740, -9677, 46009, 55734, 24952, 19619, 8524, 16294, 25708, 5713, 23378, 39832, 3869, 22066, 11674, 40936, 27936, 30012, 40248, 19963, -2493, 2467, 34240, 40323, -11992, -19041, -16748, 7664, 30045, -11588, -232, 34252]
27163C4252p583j9778j1762K008N962L6755N14k6091J620r685L0406l081j5647
27150A7890P494o044r274q45J754K2475L1675k4716l837k1793k8558O363J0334
27137B918L420L923J4013n47J2643l8116m5038o723K2899N926l648K1532j0753
27124a7551j6429o161M512J2019N6945N1446J4745m9703k1021l1101l6506l006
27112d1811K9233K3186J2817L3655J8640l6917j3873J6742k5117l3043k5746l0476
27100g2710j2507K2347O80J3811L2413M0774j2629k386P459K4238k6892j9598
27088e000O619L7262K0675k5534k6296l3470j1533M5084K6150l3664j4252Q238
27076e721L5553K7110q890k3563j138j6425k2624J5180J3516k0483n6679q147
$$ y = [34252, 26669, 6891, -4871, -2863, 3099, 39854, 40368, 14277, 15897, 6212, 36618, 33537, 17890, 25384, 19340, 10066, 9221, 10975, 33450, 65125, 40409, 36572, 14779, -13779, -7416, 2918, 6338, 10261, 24274, 23727, 36370, -1746, -46784, -53507, -30608, -24682, -28330, -6798, -17551, -33980, -40141, -35629, -23610, 33335, 84781, 99526, 49823, 28802, -2299, -38805, -41811, -12578, 10608, 23425, 57080, 75720, 38803, 24930, 41672, 16555, -16488, -42234, -72710, -85217, -62870, -62190, -48379, -15966, 24808, 12179, 9793, 17252, 41490, 14598, -5000, 1619, 38881, 59556, 34022, 7726, -25744, -37277, 7807, 33957, 293, -13959, -5721, 29832, 56942, 48052, 24489, 23351, 6926, -15698, -518, 12998, -7485, -64164, -72311]
27064g2311K9359L2251K7286K1061K2270K1935l3254j9291N707L8886l8153m0576
27052d830m276K4426J2298j3734q824m647k9523o153K601n302L7093o35j7147
27039a8653J9338L8037R82l328p361o730J0872J3206j0864o6502j2194M8910k1971
27026a6258k8594O832J7565J9067J047M086K1988K6000k6361m1416k6922M5491
27014B525O1l9935l4744j6346L8881Q441J282J0287L5118M6441k4369m9500J872
27001a9986k1612j3102M1814L9561L628J3627J3108m07m5717j5116J8949J0304
26989B5051p830m1824j3499M4393L4487J0810l4295k3585J9892k968J737l6680
26977b4311l2150K1560K6083K6812N820N836J7008k2367k7023j3404j977J797
$$ y = [-72311, -42952, -10701, 16585, 37646, 59916, 81851, 48597, 29306, 35013, 73899, 35746, -4830, -9106, 15320, 27618, 13884, 5060, 413, -29110, -35263, -32662, -37964, -871, -1506, -18653, 685, 38722, 39704, 36376, 29015, 22285, 33157, 46363, 35499, -31003, -43197, 5713, -16258, -44852, -38020, -20455, -1388, -341, 3745, 25733, 51733, 25372, -16044, -42966, 2525, 2586, -37349, -72093, -88439, -49558, -41117, -39835, -29548, 5570, 52011, 27642, -21858, -19986, -41598, -54700, -12886, 26675, 30303, 43930, 57038, 56631, 10914, -4202, 14747, 25051, 17221, -24603, -38102, 6291, 40778, 51588, 17293, -6292, 13600, 10632, 12369, -24311, -56461, -34901, -8818, 17994, 23814, 29650, 46658, 24291, -2732, -16136, -18113, -16316]
26965a6316M736L3098L6871O6454k043l8280j9811n810K7786K201m440l6241n0575
26952b370j6014l105J6452J7338p243J131J249K6760M282j1971o2696N482j2741
26939d3446K4038j2577L0298q940j8772l4257J8892J2307J6530K3842J7626r342
26927A6199o560L1758K579m3101j5978j4556N402J6943M0911m681m4707j5749
26915c1540p903L7304J2545o126P068K688K8536j8888p195q974P363O410n057
26902A6231J5150L527k7406J2761J0531j9068k4066j2062K8158j6568j5703J555
26890b6960J3537K4602r890J0378Q531L654l061k21l9541L152J5544l3799q037
26877d2111R431K1203J3938o442L978K3169N358m2750j5656P784p047M807o819
$$ y = [-16316, -11580, 21518, 58389, 124843, 122800, 84520, 64709, 58899, 86685, 88886, 84446, 48205, -2370, -18384, -21489, -5037, 12301, 5058, 6189, 7438, 34198, 38480, 26509, -36187, -30705, -43446, -19408, -31985, -1687, -10627, -29399, -63656, -44764, -32457, -15927, 7915, 25541, 16199, 9639, 41397, 43976, 875, -15103, -29659, -24257, -7314, 33597, 28916, -15791, -31540, -39443, -2139, 10406, 4280, 11348, 14036, 42572, 23684, 16489, 7515, 14878, 21288, 16231, 31381, 34908, 7502, 20263, 30794, 11726, -12340, -24402, 3756, -12812, -28515, -26960, -13423, 11179, 1289, 11667, 20198, 23852, 20791, 20570, -18971, -15819, -275, -34074, -42111, -32680, -11477, 2461, -3981, -3, 23166, 28524, -14226, -29882, -22098, -29145, -24338, -31157]
26864c1157L1556k0737k0193J0362J8717J7613o513j1647j5164L3949L8936K621
26852D8343k4600k8040j0212J3882q127j6349J3661R645o915m6150k2165K6648
26840e0379J9694L271q198M860K8900L1725m5554k6395j2424O649l553K0759k059
26827c2704K2541K6387r576j6091n536K2675J3695J9339j578L237M061K5561m6827
26814B5184n2343Q439L0913J5925K1665J1953j991K384J4156l4994k9977j2875
26802a561k1724j277M822J3259P354j4754j5836j6673n853O6891Q945j2587j5478
26789d472k2696J371r510P89L2620K1083r377k555J37L057J4602l2112k7965J7480
26775a7548o576k1207J0518L3718J2167P000J1255J126J4028J6146m292L3465
$$ y = [-31157, 399, -20338, -40531, -30169, -11452, 6161, -352, -11999, -27163, 6786, 45722, 48343, 23743, -4297, -14509, -627, -8754, -25103, -11442, -1797, -8712, -54862, -77027, -50379, -30685, -27414, -35612, -30752, -1852, 29873, -15681, -42076, -54500, -47851, -51404, -30645, -32704, -10163, 16224, 6648, -9443, -14979, 7696, 21391, 40730, 39152, 42389, 46450, 72011, 25184, -27159, -18720, 12193, 28118, 49783, 61736, 59745, 62129, 76285, 41291, 11314, -1561, -23285, -24562, -19740, -6481, 873, -13881, -29717, -46390, -52243, 14648, 23593, 11006, -4472, -27168, -25797, -35307, -34518, -1898, 19185, 9808, 7253, 7390, 10447, 25049, -7063, -35028, -17548, -24124, -45331, -34813, -1095, 11072, 18072, 29327, 30453, 44481, 60627, 56335, 89800]
26763H9800j2841j2407m3576J3753R99M909J1236Q936J3964j3222k6942k5785
26751H824j6727j2825L816m4315l5053J0420K5710K4686K2616j9793m2197J3705
26739f1133N9003m11Q041Q517k642l128l3876j1530k0911L2969L2089j6754j4376
26726b4142K5532m63k3994r506K1595p024k2386R461J3690L3524J3447j4173l5106
26713a9545n9349N451L6751L8667J6771k0517l4528k907K412O525K1751L1022
26701B2504J471j5700o34j9050k964M566j6674k9254K0193M5756J6466J5230M1224
26688H3134o7643l9740m392k2016q343M7719L9932o0234n1184M3901K2979j4680
26676c0567k9766L9653M7842r449K1863N6256p124k9724k8658Q671K851m782l0616
$$ y = [89800, 76959, 64552, 20976, 34729, 35728, 40637, 51873, 60809, 74773, 61551, 34609, 8824, -7903, -20728, -16912, -61227, -96280, -85860, -60150, -35464, -12848, -32641, -74838, -61133, -2130, -2541, 5500, 14017, 11375, 8247, -25629, -37159, -58070, -25101, 6988, -9766, -24142, 1390, 927, -23067, -32573, -10978, -18002, -40388, -30927, -17237, 16287, 29734, 15561, -19545, -78894, -73443, -36692, 1975, 18746, -1771, -36299, -39206, -36794, -30269, -8518, 22504, 23975, 8275, 7641, -11409, -14373, -9807, -26481, -55735, -35542, 10214, 26680, 41910, 83134, 15491, -24249, -28641, -50657, -59000, -11281, 28651, -31583, -82767, -38866, -15887, -30567, -60333, -20680, 27162, 17713, 39576, 95832, 88708, 58984, 30326, 38997, 41848, 37066, 6450]
26663F450j0922L4951L083k0647L259o703j6412k069R59j1673r7q065j250J1240
26649a7896k520j7902J1371L5411K9398j9299O942K4144k1277n0143j3516k5321
26637f0608n325j512O861M8565J1873K0994K085j2721j1o139J861J9654j5016
26624A0561K322Q310M3815o513j7053j3889L2548l431j5467l0158J6885L3450
26612F1380k6658k7406J0340j1153j409k2150J34L017K0564N11K6663n124m8872
26599b0163j7185j846j90J4420M1711L0573l6418j9479J6880J4406p776j1846
26587C087J3771K4545k4324l4097J3546L0666p670k1812K5070Q80j5354L5729
26575D4037R360p826o908J8212L316j1684j3665k7376k1484K4274J3772j0081
$$ y = [6450, -4472, 30479, 33562, 12915, 16174, 9471, -6941, -9010, -8051, -19724, -19821, -27886, -29136, -17896, -20416, -38318, -26947, 8464, 37862, 18563, 25505, 49649, 28372, -21771, -35287, -60608, -65933, -67445, -60584, -12019, -146, 20848, 22933, 10212, 10201, 4062, 5923, 25577, 10561, 12883, 21193, 65008, 58495, 41442, 27553, 60101, 56670, 41203, 11045, 27930, 61380, 34722, 7316, 17656, 6503, 5094, -17056, -16922, -13905, 6659, 7170, 33833, 28709, -20163, -37348, -39194, -39384, -24964, 16747, 47320, 10902, -8577, 8303, 22709, 14933, 3087, 16858, 41403, 17079, -17018, -3472, 27194, 19524, -2288, 22782, 23662, 8308, 44037, 53397, 45571, 38663, 56875, 60191, 48507, 34842, 7466, -14018, 10256, 24028, 13947]
26563A3947m3403J792M4743L1285o701l6267j7062k3597J7236j9769J8862n508
26551b4442J2661j472L0713m291J0586p264o432M549L5558N259j5601r223J0378
26538D0979j7944L267l0148J7323L0144k6340o5808l669J4486K2636K6161J0704
26526B1791m201Q375K908L3259J6407K711m5394l0338j8591p713P591L6312L324
26513B6441J0228q07J0589j0696Q946r994p934P67n553k7344J346J346j7158k0824
26499d0647K3609N3832K3409j0268k0438k1295J4341k6954m155L5994m480m0549
26487a7601j6058l528j7327J5530K7842M3126K609k4283k1993j7908j9903N722
26475d3772L0o028M0782k101j4870K591k1441j7922K7650K495l0969r833R010
$$ y = [13947, -29456, -27664, 17079, 48364, 41663, 5396, -11666, -35263, -18027, -37796, -18934, -24442, -11781, -13253, 17460, 13169, 23755, 16491, 10059, 14608, 50166, 55425, 39824, 30601, 40979, 23035, 26302, -3846, 13477, 43621, 17281, -48527, -52196, -37710, -15074, 11087, 21791, 17590, 25965, 28873, 62132, 78539, 81250, 35856, 5518, -13073, -20786, -13195, 23117, 26441, 36669, 35862, 46451, 35755, 44701, 34707, 26773, 27540, 21987, -5357, -4011, -2665, -19823, -40647, -17038, 36794, 60203, 49935, 29497, 8202, 22543, -4411, -8566, 27428, 22948, -17601, -33659, -37187, -54514, -38984, -11142, 31984, 34593, 10310, -11683, -29591, -49494, -43772, -43742, -49770, -8988, -11089, -25959, -23368, -44809, -62731, -35081, -32586, -63555, -73388, -64378]
26462f4378M2538L2939j5147j845k3317K9579L6874J1426k7200q440q309O31l84
26449D967m544o795K9635n965J0020M5304k8874l4873J0016m851k411k2333j0022
26436b0726J9960K9647J4152J9503l4993l7499j3815k2576L9048N944j3524l3459
26424d8338k1479J3590L2895N0215N251m3254n1929k3039L0182M1608M7192J4928
26412D7822l7327k919j5468k3405j043O1318O321j2412j9845j3998l0451j6618
26400e8025J5835J7613J3856j4069l7278J5329J9129p510j149j9380M8503J3710
26388F564l4831P829J586j8066J8817J4290l3630j0416j1689P101M0333J6699
26376D587L795j3319K1500J1449k0809n596J1024j5220k4184O911M8394k6204
$$ y = [-64378, -21840, 11099, -4048, -5893, -29210, 369, 37243, 48669, 21469, 13029, 4720, 5351, 4967, 423, -6372, 23263, 17298, 27318, 72622, 43748, 8875, 18891, 14040, 11629, -10704, -20726, -766, 28881, 43033, 62536, 27543, -9956, -23771, -46347, -7299, -1355, -14879, -48338, -69817, -56227, -23332, 26883, 32134, -11120, -63049, -86088, -55906, -14298, 32894, 47822, 10495, 7576, -7892, -31297, -32340, 28978, 35299, 22887, 3042, -10956, -41407, -58025, -42190, -24577, -10721, -24790, -62068, -46739, -27610, -35120, -36269, -55649, -7146, 6564, -28267, -20438, -18852, -36918, -18101, -3811, -37441, -47857, -59546, -52445, -12112, 4587, 8382, -4937, 16563, 28012, 7203, 1607, 12631, -2589, -26773, -19862, 28532, 2328]
26364B328k8326K4573K6048m1168l2203J3076M0070k0033j343M0177L8837J5459
26352G7495l4926p886r453O115K6515j2252l5413R218m908j4461j1067m725K3323
26339G575j3168l538j0734L277M312j8986J6855j4517k1590q55R947J6857J8786
26326e779j3405m173J8147k5633R95M2546n829o784n718L0355Q424J400k3116
26313A1430P679j3658o549L564j7923q631q010o446K641J3115j3167J9531k934
26300a9358J3305K9736k1079P886J9570L950n019k4551m74l896k469K4928j393
26287B1136J0893R209k948j1151j9497j0562J3259Q281J70m325K794p541k8095
26274a8377k8138j542j9554J9968M205j4296l8145r913K2783L5910K3431p965
$$ y = [2328, -25998, -1425, 24623, -16545, -48748, -35672, 4398, -15635, -16978, 23199, 62036, 77495, 42569, 34683, 25230, 31345, 57860, 45608, 10195, 19413, 14505, 44, -11023, -15748, 7575, -5593, -9131, -19865, -16588, -12276, -31262, -14407, -28924, -50514, -51369, -41422, -24565, -5779, -19184, -23357, -5210, -30843, -29848, 12698, 6869, 85, -5633, 24722, 33146, 34546, 11430, 19109, 5451, -1098, 2466, -15457, -24088, -32098, -38544, -35903, -22788, -35955, -16424, -19358, -6053, 23683, 2604, 10490, 30060, 34010, 28991, 4440, 3966, 70, -2399, 22529, 21136, 32029, 41238, 38290, 27139, 7642, -2920, 10339, 18620, 18790, 14465, 17259, 9718, -18377, -46515, -48057, -67611, -47643, -43438, -57734, -95879, -105792, -83009, -47099, -23668, -31633]
26262c1633k1700j7623j0472L8360K401L3963K7709J1643q137l751r108j3578
26250a926k0101K4619M320l2852r935K680R038N470k519J039O3011O606j5260
26237C4190l6828K7126K0389L104l9911n186m778J9876Q256J2315m3884j0443
26225a5774K4518M111q363L6310j5599k6831n408K96J7569j3984L7008L0271L874
26212F7998j4101q642m843n640k0249L8552K2223j9881j3378l9177j1236J8136
26200I762L0441K0701J4085k8772m9507r955J0885J7205k297N1095J6806j6132
26188F4317n2333m1427k914P78K8359J3517J957K723R382j890j5703n0847L080
26175d1001K690j1279K5329J7271L235J7974j1373M1423J6608k1490k0770K4348
$$ y = [-31633, -53333, -70956, -81428, -43068, -40667, -6704, 21005, 32648, 24511, 20760, 11652, -1926, -22027, 2592, 6912, -25940, -35875, -33195, -24157, -18687, -21206, -20167, 42844, 49450, 34190, -2638, 24488, 44877, 47981, 8070, 2884, -1894, 17982, 26238, 38553, -5331, -15774, 8744, 12855, 4492, 40802, 25203, -1628, -7036, -6740, 10829, -3155, 33853, 64124, 67998, 53897, 45255, 40412, 34772, 14523, 53075, 75298, 55417, 42039, 2862, -8374, 9762, 40203, 60904, 74989, 46217, -3290, -13245, -2360, 14845, 12548, 63643, 80449, 64317, 11984, -29443, -32357, -31579, -3220, 10297, 12254, 14977, 24359, 22469, 6766, -44081, -41001, -38311, -49590, -24261, -6990, -3755, 14219, 2846, 44269, 60877, 39387, 18617, 42965]
26163D2965j5246k3228Q73l2644J2715K0679M518k618r306J6258j0506j6066J7071
26150E465N1213r961L1994P334m3023k4412J366j8871k2216J9971J3880K207j2760
26137B187k4062j4166j0051K3895M0947L1297j113l6845k0173J7159J4747k559
26125B1263L680J0179r297J0449k52K2979J2055k6590j3552j6917k79k706M739
26112A5751j645j0995K3140J4535N422k1988j3664j6369j4270K6197J6556k5686
26100c016k9755Q578M673J4275j7304J9060J7642J0413L533n4682p527L1414J7453
26087A4757j949j0057j4397P45m722L360K4515j5670k132j3502j2548J4827L5960
26074A9187J5192k3677J4479j9071N332L5777J648J135j5282k6649J1759J8319
$$ y = [42965, 27719, 4491, 5364, -27280, -14565, 6114, 10632, 8014, -1292, 14966, 4460, -11606, 5465, 56678, 46717, 78711, 86045, 43022, 18610, 19976, 1105, -21111, -1140, 12740, 14947, 2187, -21875, -36041, -46092, -22197, 18750, 50047, 48934, 12089, -8084, 9075, 23822, 21263, 24943, 35122, 25825, 36274, 36022, 59001, 71056, 44466, 30914, 13997, 13718, 11012, 15751, 14106, 3111, 26251, 40786, 46208, 24220, 10556, -5813, -20083, 6114, 22670, -3016, -32771, -24193, -19520, -5245, -22549, -3489, 14153, 24566, 28099, -26583, -34110, -2696, 14757, 12808, 2751, -11646, -10901, -15623, -12263, 12252, -3418, -5550, -19052, -31600, -16773, 19187, 34379, 10702, 25181, 6110, 11442, 47219, 48867, 50002, 34720, 8071, 19830, 38149]
26062C8149L86m4017L041L9833K0321J6822n801j2861L864N280k7861n7785q93
26049b1522J1674j4456l9957J5949N7756M8733k5708l7373M593r713n16K3882
26037A3342J5443J5962k4155l1313M857l6804K5727K1499k5542j6544R928J5658
26025a1942m605j4170l2175k2091K5272O5692M1674o73k8217J0719O459K710N596
26012D4249j5348K2079M8640q083m8414j0664j608j332p929j2469r463M7720j2713
25999C4665k444k3788j8883o856n794k052L0743J0559l3919p650J7421l5070k1421
25986f4489k4352K1319J190J8195J2984j1395k2522J3474J032l615l0769j0361
25974i9309P1761M0402j8308j0065p219K2635O2945k258L116k9990l151j2387
$$ y = [38149, 38535, -5482, -2441, 37392, 57713, 74535, 68734, 55873, 59737, 65017, 37156, -20629, -21522, -9848, -24304, -64261, -48312, 9444, 58177, 32469, -4904, -311, -10024, -10540, 13342, 28785, 44747, 20592, -10721, -5864, -42668, -16941, 4558, -20984, -37528, -27600, -11942, -16547, -30717, -62892, -84983, -59711, 5981, 47655, 46982, 18765, 29484, 35943, 38653, 44249, 28901, 50980, 99620, 91537, 43123, 32459, 30851, 29519, 21590, 9121, -342, 47378, 34665, 32221, 8433, -10450, -17306, -23100, -25152, 5591, 16150, -17769, -25419, -7998, -43068, -64489, -88841, -67522, -66332, -48137, -35153, -46548, -69070, -55596, -54564, -58179, -88948, -99309, -27548, 12854, -5454, -15519, -22738, -103, 62842, 60584, 63700, 33710, 30559, 18172]
25962A8172j8262r420p062L5642m582R650J0050P005m726l4350m2930o856K7831
25949a9838k6145L880M5921L1641n442M600N480L702k4680n726j7486l3008m9688
25936h6789q879L3493M9084J6262l6762k5905Q781J4312L1137L5999n007m1126
25924a5400K084K327m0017Q644K3191j8733j0229K1238K4591K655m770r6M9098
25911D4583M1720l2333k8849K9541M2438j0009m4399k0522K24m2183n853M1835
25899A6193K8093q245m222r184O833j412l122K333j5207P629K4771j6060l3664
25886e264k3663J5924J8608J6649k4265k3666N550J5852L0775O152j5278O051
25874B3425k779j2929j5370k3231J716L4147L7900j7660j4362l394n8858j3725
$$ y = [18172, -90, -9510, -16572, 19070, 14488, 24138, 34188, 41193, 36467, 2117, -40813, -47669, -19838, -45983, -42103, 3818, 35459, 30017, 34617, 40097, 43799, 19119, 13393, -4093, -37101, -86789, -95668, -62175, -13091, 3171, -33591, -59496, -50715, -36403, -5266, 30733, 25726, -15400, -13316, -10989, -51006, -42362, -19171, -37904, -48133, -26895, -2304, 351, -4419, -4515, 44583, 86303, 53970, 25121, 54662, 97100, 87091, 42692, 22170, 22394, -19789, -25642, 16193, 44286, 36041, 31819, 22635, 29468, 28056, 24934, 27267, 12060, 19689, 44460, 28400, -5264, -28927, -13003, 5605, 22254, -2011, -25677, -20127, -4275, 26500, 32652, 17374, 23425, 20646, 7717, -7653, -30884, -29168, 4979, 42879, 25219, 10857, 7463, -51395, -65120]
25862f5120O7976N501k2209J4280J956J7695O659j6724j9116J9737J5411M224
25850C0270J625j2346j2975p118l8355l6121k4234L7660L8905J7402l989l3477
25838d2753m2447j6168M1536K2460M7091j5443k0147m217p527k4180q414O3293
25826f916n941l583l2723l9688O4150J1024j1437Q638j910K7597O144l5345l7715
25813e7705L773l455P456K9767l7111k5023K7216J1376Q991K6842o721p069j373
25800b3036K8334k3538m65j2509k814K1662J4559k2525j8620J2438L2813k4742
25788a8443l3912J2334J9504J1460M6292L3066k8724j1120J2049o458l4042j1498
25776i492K9163K2123m882K182J2749L8746J6888j8649k3487l3944j6876k6619
$$ y = [-65120, 2856, 8357, -13852, 428, 2384, 20079, 26738, 10014, -9102, 10635, 26046, 30270, 31895, 19549, 6574, -544, -38899, -75020, -99254, -61594, -22689, -5287, -9276, -42753, -85200, -101368, -59832, -37372, 9719, -5724, -25871, -30088, -37615, -61795, -70209, -6916, -12857, -16440, -49163, -88851, -24701, -13677, -25114, -16476, -18386, 9211, 15355, -19990, -57705, -53932, -57387, -49931, -20164, -57275, -82298, -55082, -43706, -34715, -7873, -14594, -21663, -23036, 5298, -18240, -18705, -31214, -34028, -12366, 2193, -20332, -38952, -26514, 6299, -18443, -52355, -40021, -20517, -9057, 37235, 70301, 41577, 30457, 42506, 36048, 2006, -9492, 19671, 41794, 36912, 39094, 51843, 90589, 107477, 88828, 65341, 31397, 14521, -12098]
25764a2098J6695L5514m5690l1272K3925O8558J540n0043k8434M1802Q730j0042
25752A9185k9234P905j9852m057L2915L1460o596j3919N060L3764p96k6265K3179
25739E2749k4001j0329K6959m349k8465j2204O812M930n364o619j8242j5567k7653
25726f1343J2329L2922K4406k062j8292N762l0L1794J6695J1974J2905k7355k7154
25713A2551J2933J1643P686o682M010K563L6067R048j8111o8840l3878R188k0030
25700d1852N576l40J4670L1139k3557k0713K9358J7069m8166j8158J6550M3393
25688D969r318l0757k6792j1203L1979J7765K6976K982j1824J8358K4947q306
25676B9776m1805j2336j7567J1050M9174J1622j9959J6053N0j5983j2451M726
$$ y = [-12098, 4597, 40111, -5579, -36851, -12926, 55632, 57172, 7129, -21305, 20497, 29227, 19185, -10049, -2144, -21996, -26053, 6862, 38322, 31726, 17807, 22867, 56631, 55835, 29570, 52749, 28748, 18419, 45378, 41029, 12564, 360, 7172, 12102, 6738, 119, -18123, -33690, -61343, -49014, -16092, 8314, 6252, -12040, -6278, -6308, 25486, 42181, 54155, 67060, 39705, 12551, 25484, 37127, 44813, 38131, 42141, 44704, 80771, 89819, 71708, 2868, -31010, -21822, -41852, -36276, -36616, -21946, 9193, -14364, -35077, -5719, 11350, -36816, -54974, -38424, 4969, -4349, -35106, -61898, -73101, -41122, -23357, 3619, 6601, -5223, 13135, 38082, 29776, -12029, -24365, -41932, -30882, 18292, 29914, 9955, 26008, 26058, 10075, -2376, 2350]
25664B350R073L951j3590l0455R294K1578K2258K3934j0312k7376j364J8599l2618
25651d678K1371R363l3700j935j2346M795L0360L2402j985k821K753j6155n1795
25638b4371j6404K9456K8353J2687l327r868l3203k3632k543N531J7508r418N0547
25625B1316J7772j9212m5073O049N474J0736R579K3543q35N295j7012M186j0739
25612A1079N007N764n207k2738j3992j9348L513L1485M8894L0560m3527j5724
25600A5766K9469m349m502q435K1852p376k2148L5850j6770k4582l864K2715J6203
25587D9829K7829L0190l2268l5750m7423k5009p333j3513L5781J3955K6920M6161
25575F9369K3743k746l4036l3171O302K3569j392j8267N099o152p195j131k0333
$$ y = [2350, 11423, 15374, 1784, -28671, -19377, 2201, 24459, 48393, 38081, 10705, 9341, 27940, -4678, 16693, 26056, -7644, -9579, -21925, -17130, 13230, 45632, 43647, 40826, 43579, 27424, -24371, -40775, -11319, 17034, 29721, 26394, 16526, -16677, -40309, -42852, -37321, -19813, -29231, 21316, 39088, 19876, -25197, -19148, -13674, -2938, 6641, 30184, 29349, 34644, 17632, 21818, 11079, 16086, 21850, 16643, -6095, -20087, -39435, -35922, -4437, 44457, 75017, 31490, 15766, 45235, 40886, 36384, 27949, 49801, 42425, 20277, 56127, 39357, 14775, 10911, 33626, 49829, 77658, 107848, 75580, 39830, -7593, -32602, -39935, -53448, -17667, -3712, 23208, 69369, 93112, 90366, 56330, 23159, 29461, 53030, 51638, 33371, 38470, 32318, 25123, 23992, 3659]
25562C659j3679M4480l3438J6101M590p140q35K728K7662q472j4065J6554k5198
25549A2947n0744M195M8216k4707O155j8312k7710j186K4099K8947J065K12R090
25536A2267l942K9739R620k749k2343m2467j3018j1301r024Q762P417j0420L8983
25523h476L2390K280K3884j8331J3320K1260l3694k0755k9775P028K3444l3892
25511b1317k4467L4663M2517j3426k5550r812j2284J2363p69k3807J898K9863
25499a0128k729k5134j666K9088J7508j268j6694l3826p517L1945n158K158P984
25486a5437J1931L966K6883J6699j1637j3379J7266J7314j9710K946J0603j8394
25474B9051m9813J6668M0679l466r691k6027J9340R046l7382j7148o465j8701
$$ y = [3659, -10020, 34460, 1022, 17123, 21713, 14573, 13738, 16466, 44128, 35656, 21591, 38145, 12947, -37797, -33602, 14614, -10093, -3938, -22250, -49960, -51146, -27047, 1900, 2965, 3177, 12267, 8325, 38064, 47684, 44935, 22592, -19875, -32893, -44194, -53218, -44456, -37039, -47459, -8476, 23914, 26194, 50078, 31747, 45067, 66327, 32633, 11878, -17897, -10869, 12575, -21317, -45784, -11121, 31396, 17970, -7580, -17392, -29676, -17313, -18082, -41889, -39991, -10128, -12857, -37991, -39657, -10569, 6939, 5671, -11023, -44849, -52366, -20421, -25579, -23421, -15437, -3506, 460, 27343, 44042, 32405, 19026, 36292, 53606, 33896, 36842, 47445, 29051, -20762, -4094, 36585, 33119, 23428, -2599, 16741, 25787, -11595, -28743, -35208, -53909]
25462e3909j3924L0542L4757R274R338K3467L109m2566j6462J7906q584K851J5913
25449A1712L776M0195l184q543k790k9250k6187J7102P788j0980Q618k476j1258
25436e477K5598r116k0741j0514n714K2777J9920m7413K443p516K6492L1577k0759
25423A557L3497J7822J7094q418M837k4470m5191k6127j4264K47O9660L4282j5157
25410D5369l1174Q920L847l1231J0816K3800j66l750j5016k9891K9287M402k1373
25397f160n076M2639j272K674Q803j5318j1702L0562k1335j4182n784J763K1249
25384B6861k808k5302j1J2384J6263j681J2534j4012J6304Q683J1119K0642O49
25371H1625l4828q858k1715m9252k8889R290N262K0317m991k9241N2300L8110
$$ y = [-53909, -67833, -37291, -2534, 6740, 16078, 39545, 42654, 88, -16374, 1532, -7052, -4201, 11712, 15488, 55683, 52499, 43956, 41166, 11916, -14271, 2831, 10619, -361, 8257, 5781, -5477, 20121, 11005, -9736, -20250, -25964, -3187, 16733, -30680, -28237, -35753, -9261, 22316, 1557, 35054, 52876, 69970, 61552, 66389, 41919, -3272, -29399, -43663, -43416, 26244, 60526, 45369, 14195, 23115, 26962, -4269, 6547, 30347, 30181, 26431, 11415, -18476, 10811, 15213, -6160, -11236, 31403, 30131, 32805, 41608, 26290, 14588, 45150, 23815, 9633, 3849, 5612, 26861, 24053, -1249, -1260, 11124, 27387, 25706, 38240, 24228, 40532, 49215, 60334, 80976, 81625, 46797, 37939, 16224, -33028, -61917, -52627, -47365, -27048, -32039, -61280, -8980, 29130]
25359B9130R931l5837J8438O247r566j2772K0110J6034P56l3122j0049r711L5198
25346B4787N774m2635j725N8904J6682m1647J4329L3300q510N299l8335o3218
25334c6995M0765J3868l9935K5764J6230n1050l5574O1395M5120J8810k1255n1818
25322a4675J422K0696J4526k79l173l0828K937j6203L0537L8006L1698k8003M449
25309E1110L994m2133j9707K2826R960K8169k8861j8979M4283K7634p759M4387
25297A14924M587k0778l6038l8864n489L7309L8620k0186o0827n0495j4185j3763
25285f5185L3004J7457K807k6758R295J0510K0366L3469j2733N616j3669j9850
25273e671k3303O899j6234M873N1805N573o203l2946j1407K6747K0234r254J0399
$$ y = [29130, 39061, 3224, 21662, 27909, 18343, 5571, 25681, 41715, 42471, 9349, -700, -10411, 24787, 30561, -12074, -13799, 45105, 61787, 20140, 34469, 67769, 59259, 64558, 26223, -36995, 3770, 17638, -22297, 3467, 19697, -31353, -66927, -5532, 39588, 58398, 37143, -14675, -13253, 7443, 21969, 21690, 18517, -12311, -9374, -25577, 4960, 42966, 74664, 46661, 51110, 55104, 12971, -6736, 16090, 26050, 54219, 25358, 6379, 50662, 78296, 70537, 114924, 119511, 98733, 62695, 23831, 18342, 55651, 94271, 74085, 13258, -37237, -51422, -65185, -32181, -14724, -11917, -38675, -29380, -18870, 1496, 34965, 22232, 27848, 14179, -5671, -28974, -22075, -38309, -33436, 18369, 23942, 17739, -15207, -26614, 133, 20367, 11113, 21512]
25260B1512r622l9637n368L5565J8315K4185p901j5227L855K8445J5575O161k2212
25247E3646m8805l990J9297K8227j8314m7815q618n108j2498R698K3561j8620
25235b9339j7443J8264K0268J8468j3341l2951k0616L9329N778l6460j8377L1522
25223c4898L4408K2948q633J0597L8714P924K690J7962o6375j4763J5890J8024
25211D4488n746j0112j0399K2954P565J1054l7657m2106l0345L1808L6946j3225
25199E225m600k2386K2736P47J065j5724j140K3847L7682K0537j3090l1146k8081
25186d328K1479q005l132j5399Q507l0492O639K9840k1088j4904L2536K8079J7415
25173D7147m080J09p131p424l769m9251J2511K5962n37j7221j2822k3162r181
$$ y = [21512, 11890, -27747, -33115, 2450, 20765, 44950, 37049, 21822, 25677, 54122, 69697, 75858, 53646, 4841, 851, 20148, 48375, 30061, -17754, -26372, -31480, -43978, -34280, -10719, -29339, -46782, -28518, -8250, 10218, -3123, -36074, -56690, -17361, -11583, -48043, -66420, -34898, -490, 22458, 13825, 24422, 63136, 71060, 73750, 91712, 25337, 10574, 26464, 44488, 38742, 28630, 18231, 41185, 48750, 59804, 22147, -19959, -50304, -18496, 18450, 5225, 625, -21761, 975, 1722, 2787, -12937, -14077, 9770, 47452, 67989, 54899, 23753, -4328, 17151, 9146, 6014, -9385, -878, -31370, -24731, 5109, -15979, -30883, 1653, 29732, 47147, 43067, 43176, 36045, 28621, 24852, -24399, -11888, 14074, 13537, -3684, -16506, -39668, -48849]
25160d8849k2024l0769K9035N2014m709k8608L0695o039l1141k2835L4319J0387
25148c8524L1583O533k6675l1327J8741N8294N323m6392j8198L6619j8873N649
25136a7247l3950j4705j1689M4063K5892k9665l4519L9212L3092q984m7843k0547
25124g6890L9252M5876J2302J1497M277P403j7586r849j4906j2530k1799R381
25112b3572N226j0541p81R707K1197p892q011n949j8128J9729L3408Q562j9980
25099B975N624j6791K26K3647M5029O194k1301P47K5925j6847l8450j8159q383
25086i564M196N306K2610K6744r351j3356J59j3261M554l183L580l9193J1951
25073h808M0680Q984j4414N22J0233l221K8431j5644m8203l0232j0854J9893K9084
$$ y = [-48849, -70873, -101642, -72607, -20593, -25302, -53910, -23215, -29254, -60395, -83230, -48911, -38524, -6941, -408, -27083, -58410, -39669, 18625, 23948, -22444, -40642, -4023, -22896, -17247, -51197, -65902, -77591, -33528, -7636, -37301, -71820, -32608, 484, -8500, -56343, -76890, -37638, 8238, 20540, 32037, 36314, 43717, 26131, 16282, 1376, -11154, -32953, -23572, -18346, -28887, -29668, -19961, 1236, -6656, -14667, -20616, -38744, -19015, 14393, 22955, 2975, 8599, -8192, -7966, 15681, 60710, 66904, 45603, 46350, 72275, 55428, 16978, -1181, -9564, -5368, -62, 22548, 49292, 39941, 26585, 26744, 13483, 18037, 14854, 18434, -20759, -8808, 31872, 40856, 26442, 26964, 37197, 33976, 62407, 46763, -1440, -31672, -42526, -22633, 6451]
25060F451j586J7104M574J3257n345m1068j7920p75J5117J536R31j0108o727J0063
25046a4496l539j19J3875k8039l2726j0131J8619K1169L7913j2090m94n915J1856
25033d117K3293p39k6470j2719M3358N8539l6977m839L5486J2283l8090n1270
25021b262l2898j850j2932K6970L3296r318P860k1675j1396Q47k4109j5070r816
25008g2353k1017O455N3771L0612M204p036M693K9036M2193K3605l3648m8857
24996A1658l9539l619o036J141m033J9827m3177j1192K1838k552j020P414K3183
24983b6107r38m29N5222K5466j3302m6170l9244M792M5360j7593M098J444M1958
24970C4557r3n85l4950n4605K8667L8972j3118j1512L334r298k8236L756j1431
$$ y = [6451, 4865, 21969, 26543, 39800, 34455, -6613, -24533, -25308, -10191, -8655, -7724, -17832, -24559, -14496, -18035, -18154, -4279, -32318, -65044, -75175, -56556, -35387, 2526, -9564, -10058, -15973, -4117, 19176, 18437, -8033, -20752, 22606, 81145, 44168, 39329, 74815, 87098, 49008, -2262, -35160, -37010, -49942, -22972, 10324, 1006, 8866, -12809, -24205, -23358, -47467, -62537, -72353, -93370, -86915, -33144, -2532, 1672, -5364, -671, 28365, 70558, 94163, 60515, 11658, -27881, -31500, -37536, -36395, -40428, -20601, -63778, -74970, -53132, -55684, -56704, -49290, -26107, -27045, -27474, 27748, 53214, 39912, -6258, -45502, -40710, 4650, -12943, -8845, -7401, 34557, 34464, 33879, -1071, -55676, -27009, 11963, -1155, -12667, -9333, -18631, -46867, -43111, -54542]
24957e4542O909K5119J8914L1718j53k1990l2068k1974L3373L7551Q86j6985k1270
24944a4512l6234k4412K2864L8745K4460n057k7502n133l72l840j4750j7375K3202
24931c9916K4625j259P774L368k4400j8419L9420p777j8778r861K2524k415j8951
24918d4065k1775L1226M7756n276j0282k133q001o52k5169l3520j6299L6376k412
24905e4226P667J8798K1747M917O561q602j3557J8152K483j4323m19J1142J6084
24892A6424j2155k1422j2624J7826L3539Q572j8740n152p78Q954k7548M910K2228
24879A4034m770M3597P803k0066j3753r021j3438m576n988Q931O737j8417M50
24866h477O398l9283p422j4174J3890P0122J4229j5951k1142k1742m262r420n168
$$ y = [-54542, -47633, -22514, -3600, 28118, 27965, 5975, -26093, -48067, -14694, 22857, 23743, 6758, -14512, -50746, -75158, -52294, -13549, 10911, 5854, -21648, -26781, -27153, -30993, -45743, -63118, -39916, -15291, -16550, -8776, -5408, -29808, -48227, -8807, -16584, -35362, -45223, -22699, -25114, -44065, -65840, -34614, 13142, 7866, -2416, -4549, -12550, -13202, -38371, -71891, -88190, -51814, -54226, -46559, -27761, -6014, -1097, 5464, -3138, -16695, 1457, 3940, -10383, -10802, 340, 16424, 4269, -17153, -29777, -11951, 21588, 30160, 11420, 6268, 5490, 14444, -13104, -8194, 14034, 9264, 52861, 60664, 40598, 26845, 17824, 4386, -190, -6178, 2753, 9490, -8927, -8477, -2079, -41362, -48784, -62958, -49068, 21054, 35283, 19332, -1810, -23552, -27814, -37234, -42402]
24853d2402K6930J2065J597K4434J6193l6616n8878k4732M3737M9868L0890q648
24841C4438n3396J1588K4680l7792L0696j4754l7097j155J3721o642J5680L4019
24829A3986l169n167J7483O464k1814J5809J2345L7519P279m0450l9221M879L3881
24816C9824J5787k7182l0177j9294k2646J8876k539J7329K6914k1210j4702j1020
24804c0040J0831J4046l5961J71L0844K9180k153k1287J7092J5086o756l3600
24792a2547J0855j9647m5226J9395L2186K9408p604N563o845p19j2734L2692L966
24779B8743k3416Q188J1627L172J1596M5115J9415k4543l5126l7478q642K7008
24767B5659j0743k4039J4044j6343L653j8524O088L5896k2875L140N018j1422
$$ y = [-42402, -15472, -3407, -1810, 22624, 38817, 2201, -56677, -81409, -37672, 12196, 43086, 34438, -18958, -7370, 17310, -20482, 10214, -4540, -41637, -42792, -29071, -35713, -20033, 13986, 10817, 5650, 23133, 29597, 7783, 23592, 35937, 73456, 80735, 40285, 1064, 5943, 39824, 55611, 28429, -1748, -21042, -43688, -24812, -27351, -10022, 16892, -4318, -19020, -30040, -19209, -5163, -41124, -40953, -10109, 19071, 16918, -4369, 12723, 27809, 21053, -12547, -1692, -21339, -66565, -47170, -14984, 14424, 6820, 12383, 5538, 4819, -7915, 24777, 28743, 5327, 13515, 25142, 28314, 39910, 85025, 104440, 79897, 44771, 7293, -1349, 25659, 14916, -9123, 4921, -11422, -7769, -26293, -20205, 15691, -7184, -4044, 974, -10448]
24755a0448j3838J4961k3766J2009K8194o318P714J8962r488k752k0375j0842
24743a5987K0835K476p703K056m037j4692j3911J7002M2921M4182q504l5243l1558
24730b163M435M433Q493k6199r185j2547k6703J2519K1218K4800K5433k2474j6901
24717a4841l5727R518K4871k4104j5012m787J9155J5854r187M542M924J2575k6857
24704c9076p063J2261J6291K2230K2813N374j9650j4556l1597N225L7567P867
24692A7686l3407o886K6130k3992J0680l498l4551N961M8054O982l3971q112K3507
24679e417K9904J9086j0231m7494n5266o981N5817K5557j6254j5040j1946J2295
24667b5970L3559M433m3141k3562J2831K8500K5427L943K4661J4965J8369J4078
$$ y = [-10448, -24286, -9325, -33091, -21082, 7112, 794, 8508, 27470, 17982, 15230, -5145, -15987, 4848, 7324, -379, 1677, -2360, -17052, -30963, -13961, 28960, 73142, 64638, 29395, -2163, 2272, 6705, 15198, -11001, -20186, -32733, -59436, -46917, -25699, -899, 24534, 2060, -14841, -50568, -41050, -16179, -40283, -55295, -60082, -40927, -25073, -34260, -29718, -24794, -12219, -39076, -46139, -33878, -17587, 4643, 27456, 32830, 13180, -1376, -32973, -27748, 9819, 17686, -15721, -22607, 3523, -20469, -9789, -13287, -47838, -41877, 6177, 13159, -20812, -28924, -5417, 24487, 43573, 33342, -14152, -69418, -76399, -20582, 4975, -11279, -26319, -38265, -25970, 7589, 12022, -31119, -54681, -41850, -13350, 12077, 16020, 40681, 55646, 74015, 88093]
24655H8093l8249k8486k1019j0806l2560J2787J4881L353R443N076l1499J1519
24643a7467K90j7130q486j7007Q664l9117J6511O4753J415k1307J8397M6895j3724
24630B2687j3973J3290K1153q547k908m1485j9403k4244q439m005M5375J5400
24618e099j5212J6954q32k8585j6633L6629K7662J6989o930K576J1132K2322N44
24605F1517P443n647J390r348m5007k6797N361j8199M1040q618N439J3600k1084
24592A090k4416r109r67j4181L72l107P230k946K3296L7718P582l4625k7070K7147
24578a1986o289J5645j3370j2196L1587K2095L0382R941j8825k2049j3291L7033
24566D8677n4837l1518O792j2165J4055L4154o250j2191K5297l3857l5315K9759
$$ y = [88093, 49844, 21358, 339, -10467, -43027, -30240, -15359, -12006, -2563, 2513, -28986, -17467, -17177, -34307, -42793, -59800, -51136, -90253, -73742, -8989, -7574, -28881, -10484, 36411, 22687, 8714, 22004, 43157, 34610, 31702, -9783, -29186, -53430, -61869, -65874, -20499, -5099, -20311, -3357, -4189, -32774, -49407, -12778, 14884, 31873, 24943, 27519, 38651, 60973, 61517, 68960, 63313, 64703, 55355, 10348, -16449, -11088, -29287, 11753, 3135, 8574, 22174, 1090, -23326, -32435, -33402, -47583, -47211, -50318, -43088, -46034, -22738, 14980, 22562, -12063, -39133, -11986, -18275, -2630, -16000, -28196, 3391, 25486, 55868, 65809, 46984, 24935, 11644, 48677, -6160, -37678, -30886, -43051, -28996, 5158, -1092, -13283, 12014, -21843, -57158, -27399]
24554b7399R068N213j785j9108j0016L279L0968L0679l813K4913q606P911J3416
24541E4720j7290j6731j862J5360j6838m0715k9946L9184J0177l9474J1876K6048
24529e491J8273r375j3694L313L3809L6448n0319o1035J9884J6742L1679J1983
24517C2217N9377j6244k1368k4461k468L017p49l6780O898N9978M202j7790l626
24504D2203k4058m954o960o9975K654N6105J9745l580p784l913k2797j7985J6132
24491b5167m55J448k7438J240L1909j2982j5043K1009P268j32L6212j4467k5496
24478b2094k1686J7269K8739j0133k8492J9161j3493o43K0871P327K9041J2521
24466C8388j4295k5955K6220J0995J7709k3880l5591r475j6256J9308P712k193
$$ y = [-27399, -18331, -13118, -14903, -34011, -44027, -40748, -9780, 20899, 17086, 41999, 33393, 41304, 54720, 37430, 20699, 18837, 34197, 17359, -23356, -53302, -14118, -3941, -43415, -31539, -5491, 12782, 3407, -10287, -6974, 26835, 63283, 12964, -48071, -28187, -11445, 20234, 32217, 91594, 75350, 53982, 29521, 27053, 30070, 29321, -7459, -561, 59417, 63619, 45829, 42203, 18145, 13191, 6231, -63744, -61090, -4985, 14760, 11180, 3396, -517, -23314, -41299, -25167, -25622, -24174, -51612, -50372, -18463, -31445, -46488, -25479, -18211, -18343, 17869, 3402, -22094, -43780, -26511, 2228, -7905, -36397, -17236, -30729, -31372, -10501, -3174, 25867, 38388, 24093, -1862, 24358, 35353, 53062, 29182, -6409, -15884, -32140, -12832, -5120, -7313]
24454g313j6734L561l121P90j0086m32K0069R93k556K908j9499L9416J4153k4231
24440b082J0383J3431K4681j9769l2176M915R856k741l144K8266Q766L4768R093
24427H4247l6970n6166P196J8163K566l2463K2665K2330j9409j530o2786j887
24415e4044K7392j918L3825p280j5851m0348p042p488k7134K4813L0676L5512
24403h887L0634L6038k530k0587l0169K965L378l6473k2675K3209J9070k4230
24391c0257l9248j8243L0236K3870J0667R306m633j5755n827J8887Q255L85j553
24378a3910o899L3078M107o874k0323N769M1277M40K3445j7531l3961j3076k049
24365f507k6399J8020k8Q687j8526Q3j5546Q53L0812M812L0124k7861m0049K572
$$ y = [-7313, -24047, -20486, -23607, -22817, -32903, -33335, -13266, -12273, -14829, -11921, -31420, 7996, 22149, -2082, 8301, 21732, 46413, 26644, -5532, -617, 9239, 6498, 3354, 31620, 40386, 75154, 84247, 47277, -8889, -1693, 16470, 19036, -13427, 9238, 31568, 12159, 10629, -52157, -54044, -26652, -28570, 5255, -2025, -17876, -58224, -65266, -72754, -99888, -75075, -44399, -8887, 21747, 57785, 55255, 34668, 4499, 7464, 10842, -25631, -48306, -25097, -6027, -30257, -69505, -87748, -57512, -33642, -22975, -13669, -18302, -34057, -39884, -20997, -12742, -12357, -13910, -20809, 12269, 16376, 9502, -10821, -5052, 36225, 36665, 60110, 42579, 8618, -4458, -6507, -32906, -14886, -14914, -6227, -24753, -24670, -40216, -39363, -8551, -3739, 26385, -1476, -41525, -38953]
24351c8953L5480L09p0727K6345L2689L8082J0212q043k8300l8082N009M016K6984
24338d979m061p68K2657J294p225q667L2559l01k4496J3574O52j4060l5011l915
24324c2747J5754L2171K6782l596j9179j5220l8309Q150J9942J0211j8893J6640
24312A706N534K0622m67P568L399J582n7887j3446j6181r505K1390L459J2320
24299a9906L6029K8449k922l1029j822J8858L1504n086j4020J025N399o204m4703
24286d428n8645k273K8260J5227K218k6023L4460j2787J2283K6350k164M346J0971
24273B7795K7963j8837l7897K4758r093k0768o789k5936k482Q492j4531j4382
24261f1707M6391L1530L5548K6455j4472k6419J9252j30j5832k9667N859J8976
$$ y = [-38953, -3473, -3164, -73891, -47546, -14857, 23225, 33437, 25394, -2906, -40988, -35979, -31963, -4979, -9040, -9808, 12849, 14143, 6918, -1749, 30810, 30509, 6013, 19587, 20239, 6179, -28832, -32747, -16993, 15178, 41960, 38364, 19185, 3965, -34344, -26194, -6252, 3959, -14934, 1706, 7240, 27862, 27395, 34963, 38362, 39944, -17943, -31389, -47570, -57075, -35685, -32226, -19906, 16123, 44572, 41650, 10621, 8799, 27657, 59161, 54075, 40055, 41080, 46479, 40275, -4428, -63073, -65346, -37086, -21859, -19641, -45664, -11204, -23991, -11708, 14642, 12478, 16824, 27795, 55758, 36921, -976, 23782, 14689, -6079, -12868, -38804, -41286, -32794, -47325, -61707, -15316, 16214, 51762, 78217, 63745, 37326, 56578, 56448, 40616, 10949, 16808, 35784]
24249C5784L3636k2850l0379k6173K9245K6529l789k071j973k5699q840p529K6861
24236B2752K9382o313j7267l3329m7119L04K0254J333N688K5737j5725l6232j3307
24223f3842L014L8058m934j3435j1348K790J7050L656K208j991K489J1259k7372
24210d2398m85K1990N284J062K0114l2307k247L0074J8823j8147k0696M998n405
24197a9340J1276Q311K2598l610r351J0376j8486k9114J4371K6212k5675J550
24185a0882L8592K8963M715j299J0144p555m7647l9758J8336Q6L436j5847j9356
24172c8072J6527N6796J4319j6397n1758k9411O9925L6169l837q246R116k4386
24160C0745J3472j8106l1451J3958J6424m523k4557O652M182J1812K6164k4381
$$ y = [35784, 69420, 46570, 16191, -9982, 19263, 45792, 42003, 39932, 37959, 12260, 3420, -4109, 22752, 52134, 45821, 28554, -4775, -51894, -51590, -31336, -30003, -24315, 1422, -14303, -50535, -63842, -60828, -22770, -27704, -41139, -52487, -49697, -32647, -28991, -26783, -28774, -26285, -15026, -42398, -42883, -20893, -15609, -14547, 5567, -26740, -28987, 1087, 19910, 1763, -18933, -13935, -19340, -8064, 247, 22845, 19235, 9884, 20260, 1774, -27340, -12969, 13243, -12432, -10882, 27710, 56673, 61388, 60089, 70233, 62678, 15031, -24727, -6391, -6305, -2869, -18716, -38072, -21545, 35251, 49570, 33173, -18585, -47996, 21929, 58098, 54261, 46015, 55131, 30745, 44217, 26111, -5340, 8618, 25042, 20519, -4038, 2614, 6796, 18608, 44772, 20391]
24148B0391n9463N084Q249K8258L844K672q465K1837J5273j559k0644k6259l4633
24135d5415J7188J8596k7576L388J4943j1765q491j3616K4307J2616m953K1424
24123F46M8332j0485n3737K0320r213m5125j886L1818j0635k4203l094J0471O295
24110d0496J3110l9104J8819J3399j3419o969q82j8444q383O2464K2755L906Q405
24097A5161Q993J4742O121k9740k7038k3927J1712k5664K8877K0876J1089kq677
24084B523j3181K264j2724M9489J1170n115J1800m2960J3763k1333p459K6787
24072A5024j0336k9262J0554M6151M141m0508R930p285j269l5733L0249m4763
24060e3107J7633K8604k0920J6138q422Q692L8648k5274m6594n509q959J2705
$$ y = [20391, -39072, -33988, -25739, 2519, 6363, 9035, 570, 22407, 37680, 36121, 15477, -10782, -45415, -28227, -9631, -37207, -33819, -18876, -30641, -39132, -52748, -28441, -15825, -20778, 646, 48978, 38493, -15244, 5076, -4137, -49262, -51148, -19330, -29965, -54168, -57262, -46791, -40496, -27386, -66490, -47671, -34272, -47691, -54660, -55542, -73986, -82369, -19905, 2850, 6756, 15161, 24154, 38896, 45017, 15277, -11761, -35688, -23976, -49640, -20763, 113, 11202, 11200, 2523, -10658, -8394, -21118, 28371, 39541, 34426, 46226, 3266, 17029, -4304, -11763, 15024, 4688, -24574, -14020, 32131, 36272, -4236, 5694, -1591, -2860, -38593, -8344, -53107, -35474, -6870, -27790, -11652, -20074, -11382, 27266, 1992, -44602, -50111, -59070, -46365]
24048d6365j5662j1450O7453L6926j6343J4295L9795m8810o2592j4337K2006L9044
24036C960M7383q389L7906J0416l7265n6693m852j7671l3685k2037N251J8148
24024e7528L1033M824l703L1366J2704J6169j3595j3483j0255j1174J9474L3158
24012C8990l1654R259k9322o1416j4758Q241K3607r885m543R288M978L8904r190
23999b7501j2602K6132j4122j9392J5058K2470J1028J2090M292l3962k6312k0685
23987f3506K9206o699K194J2430n0092l9816j334K4118K9506K6469J2465k0787
23975d5846m581L1498K5220l784m8362J9485L2683k1127j0768j6000N412M6205
23963A0035N127l4673l469P502K014K7161J4845j7744O65j6421J6840k0260j6654
$$ y = [-46365, -62027, -73477, -6024, 30902, 14559, 28854, 68649, 19839, -42753, -57090, -35084, 3960, 51343, 42954, 80860, 91276, 54011, -2682, -7534, -25205, -58890, -80927, -75676, -57528, -26495, -21671, -25374, 5992, 18696, 34865, 21270, 7787, -2468, -13642, 5832, 38990, 7336, 16595, -12727, -74143, -88901, -80660, -57053, -66938, -71481, -62193, -57215, -18311, -27501, -40103, -13971, -28093, -47485, -32427, -9957, 1071, 13161, 17453, -16509, -42821, -63506, -34300, -40999, -38805, -26375, -76467, -116283, -117617, -93499, -63993, -37524, -25059, -45846, -50427, -18929, 6291, 2507, -45855, -26370, 6313, -14814, -25582, -41582, -36170, 10035, 15162, -19511, -22980, -15478, -13464, 13697, 28542, 10798, 11463, -4958, 11882, -8378, -25032]
23950b5032k6383J8733N235k3869k1627l791j5262K3393P433k5987K7204M1041
23938a8912P377R94k4018J1709L177J17j6135Q034j4550L5452r023J8430l785
23925a133l5099L0440K0335N649n609P621k4854l4384L968J8647r316r542j7201
23912e0478p365Q490j8117J1408N937m331J6417m006l2611J7339L6643k318j9107
23899d2099k3687M058J5738K9347k2405K3327K1828n628L7732j722o965Q355l2052
23886E827l9752l2791L4794K2142k4626k4306O2331J4529o246L3801j4947j3261
23874A7495o524m0046j0153L6928J5504o991k955j5676J6945k6696j3818j2094
23862d8081P098L8511L1160L966k3244r842j7895k0450K5378P47P89k5796l3460
$$ y = [-25032, -51415, -32682, -27447, -51316, -72943, -76734, -91996, -68603, -61170, -87157, -59953, -18912, -11535, -10541, -34559, -22850, -19673, -19556, -35691, -27657, -42207, -6755, -15778, 2652, -1133, -36232, -5792, 14543, 20192, 14583, 22204, -2650, -37034, -33066, -14419, -23735, -33277, -50478, -57843, -49353, -67470, -56062, -50125, -54456, -38039, -42045, -74656, -57317, -20674, -22992, -42099, -65786, -61728, -45990, -16643, -39048, -15721, 6107, 479, 38211, 36489, 29524, 37879, 5827, -33925, -66716, -31922, -9780, -34406, -58712, 3619, 18148, 11902, 45703, 30756, 17495, 10971, -29075, -39228, -2300, 13204, 6213, 3258, -12418, 4527, -22169, -35987, -48081, -40983, -2472, 28688, 32654, 9410, -432, -18327, -38777, -13399, -12652, -11863, -37659, -71119]
23849g1119K4476O3600l2315k5717o502N047p495K3375N3251N409l076J639r829
23836B0744M489k1411j6313K1517K9939J6214j1919J125M487L998l1390k5962
23824d482m2095j3718N169J1798J7154p977k3155j5974k01Q638J3686Q493o105
23811d8769j1104J015l1959J7719J6799J2866r361J9550K9470J4525J2101j3879
23799H973M702o303l3340j8562J6257k365J8100K776M672k603j868j9403J1160
23786a7804K3985j2647P695J849j1244R782J4145l640k6777j8477P60j3179l5337
23773h0889L2770j2759k0853J1533M1357K8594L0934K1421K527k4487k5001k3718
23761a8571l013l890J1622o353R381O456J385j6729j3710L0358K1456k2836M559
$$ y = [-71119, -46643, 16957, -15358, -41075, -47577, -42530, -50025, -26650, 26601, 32010, 28934, 30573, 20744, 25233, 3822, -12491, 9026, 38965, 55179, 43260, 44385, 48872, 52870, 21480, -4482, -46577, -60295, -55126, -43328, -26174, -34151, -57306, -73280, -73481, -64843, -51157, -42664, -48769, -59873, -58858, -90817, -73098, -56299, -43433, -52794, -33244, -3774, 10751, 22852, 8973, 13675, 7372, -25968, -44530, -28273, -30638, -12538, -9762, -5090, -7693, -9561, -28964, -17804, 6181, -6466, 1229, 3078, -8166, 1616, 15761, 12121, -14656, -33133, -32373, -45552, -80889, -48119, -60878, -81731, -70198, -28841, -247, 30687, 52108, 54635, 30148, 5147, -18571, -21584, -25474, -13852, -20205, -10824, -4368, -2983, -19712, -33422, -3064, 18392, -4444, 115]
23748A15j9039j8640m970L1534J4881P041k1516m0239K804K3662L6654K5616M867
23735D2770k5917k0939K0270K7313m486J1599k7727m2068M736k3566j3963j194
23723e3172K6604k579k0781K1539K0013J1782m657J954M889N1595l3678m3052
23711a9543M695K2220k0867o0575k850K5721j2851P648R506o90j653L477j3684
23698e9446O571J9372K3975K1208p132j4184O31k0151j9152l86Q69K2372l8308
23685f3761m5578n968L8246N903M664K0924J9832K0760J4203j2152j7553l552
23673b4032k7939m0855j3997K2849J9552l1758j6353P2963M4614N831j7377k8279
23661c4781j9641J3684J5461j7650k9733O97L5997N689K0359P746m1764j0459
$$ y = [115, -18924, -37564, -42534, -11000, 3881, 10922, -10594, -50833, -48029, -24367, 12287, 37903, 42770, 16853, -4086, 16184, 43497, 39011, 50610, 22883, -19185, -14449, -38015, -51978, -53172, -26568, -29147, -49928, -28389, -8376, 3406, -1251, 703, 5592, 57187, 23509, -19543, -14848, 7372, -13495, -74070, -76920, -51199, -64050, -56402, -46896, -47586, -49239, -45762, -59446, -52875, -33503, -9528, 11680, 4548, -9636, -9005, -29156, -48308, -48694, -47825, -25453, -63761, -109339, -115307, -77061, -71158, -66494, -45570, -25738, -4978, 9225, -2927, -20480, -24032, -51971, -92826, -106823, -83974, -64422, -96180, -112533, -39570, 5044, 10875, -6502, -34781, -54422, -40738, -25277, -42927, -72660, -71963, -35966, -30277, -9918, -2172, -43936, -54395]
23649e4395q338j9846M305K4048o551p933K071K5888O0073J5491j0961Q399n6889
23636b4638k1289P0406Q90j3521k8158k3918J8044K314k2741k1082K3205j7610
23624e8098J538J1378k9629j7291L7440N8862P766j7729K7j509K828k0506k7123
23611e2046J2159O393j3625j1707J5576k1221J16L6991j6864o309K5205j1174
23599c6506P544K2490j1713K2760j3753k0218P825j7556j0496L3497R334r615
23587a6407l4628K4694K9130L0481k2505j3829j2277K4345P774k1541K1293j5230
23575A300p450k8697o989l227M9669J0248l0679j0025L3005p352K8005k8949k5941
23562b7082m6J8957j501O879K2393L1655L500l9920Q067L6801m5267k1896M1374
$$ y = [-54395, -62733, -82579, -78274, -54226, -60777, -68710, -66639, -40751, 19322, 34813, 23852, 32251, -24638, -45927, 24479, 25369, 11848, -16310, -40228, -22184, -19870, -42611, -63693, -40488, -58098, -56560, -45182, -74811, -92102, -54662, 4200, 11966, -5763, -5736, -7245, -4417, -24923, -52046, -39887, -33494, -47119, -58826, -43250, -64471, -64355, -27364, -44228, -50537, -25332, -36506, -28962, -6472, -18185, 4575, -9178, -29396, -21571, -39127, -49623, -16126, -6792, -16407, -51035, -26341, 2789, 33270, 10765, -3064, -15341, 9004, 16778, -4763, 16530, 1300, -6150, -34847, -41836, -45063, 4606, 14854, -15825, -25850, 7155, -197, 27808, -1141, -27082, -27128, -8171, -9672, -2793, 19600, 51255, 54755, 14835, 22902, 59703, 14436, -7460, 33914]
23549C3914p061l3837l1546k7684R803j2109q016M516l841k8849k7538N2552N8476
23536b1220p194l607r775j0909q48p764K2240j4212M3469L6320K5386m3199k8888
23523b0201Q797l8468l7291K5973L4978R694l4600k2284J5203r710k9210r480
23511a06599K9097r187q770q739Q059K249M03K9971N407l326j686j612k089J3523
23497e3299k504J5025K9430k8033m3429J749l197L1747j8197J189L7414J7102
23485a5003L4643j2905j7542n161J576j265l9462L685J2916q155l5317J1932N1048
23472a9010n819j676q640J4310M8119L0878j9533j0686m616m8881k4095j0126
23460e9775l4113L1666L1508L6564p765l2710m2082k9482J2581N9747J5786k3553
$$ y = [33914, 26853, -6984, -38530, -66214, -56411, -68520, -76536, -72020, -75861, -104710, -132248, -79696, -21220, -28414, -32021, -41796, -52705, -53553, -61317, -39077, -53289, -9820, 26500, 51886, 8687, -20201, -11404, -49872, -87163, -61190, -26212, -16518, -51118, -73402, -58199, -67909, -97119, -106599, -77502, -86689, -95459, -104198, -96139, -93890, -93487, -63516, -58109, -61435, -63121, -64733, -66822, -53299, -55803, -40778, -11348, -39381, -82810, -81061, -84258, -52511, -70708, -69519, -32105, -15003, 19640, 6735, -10807, -15968, -14392, -15657, -55119, -51434, -38518, -46673, -81990, -70058, -19010, -24829, -26505, -35145, -20835, 27284, 58162, 38629, 27943, 23327, -25554, -49649, -59775, -93888, -62222, -30714, 5850, -1915, -34625, -76707, -106189, -93608, -33861, -18075, -41628]
23448d1628N751K3670q202K1284J4121m261J8666j9393P47m9l1606j6739K058
23435c5581J7637J8375J9599L085j8814j4481J674L923N598K0599J1261L630l3898
23422B607l5977L0716R328L7194M338k4861K528j0468m5564L363K8117J9030L2144
23409E2495P743j5885k262O574J9137j1701j9045j2149j7109J1826M6599o970
23397E9253J8046L0763K5557M3091J14297J69499L01337L85338L92381L07705
23387A847267Q9595j94228m03519m01065l23991k15256j02568q5765j9202o0872
23377A30396k1197j9122l5643K9595K9401j0321k2703l1440k7906l8644L3851
23366A6267M213l5971k5852j24j6456L0104J0640k22J7940O682j7334j8475K1358
$$ y = [-41628, -35877, -12207, -20409, 875, 14996, 10735, 29401, 10008, 10755, 10706, -20900, -37639, -35581, -17944, 431, 20030, 23115, 4301, -10180, -8506, -4583, 1015, 21614, 32875, 36505, 2607, -33370, -2654, 6674, 43868, 48206, 23345, 25873, 15405, -30159, -26796, 1321, 20351, 52495, 60238, 44353, 42091, 48665, 67802, 56101, 37056, 24907, 7798, 19624, 66223, 59253, 77299, 108062, 133619, 176710, 291007, 460506, 761843, 1147181, 1539562, 1847267, 1936862, 1742634, 1339115, 938050, 614059, 398803, 296235, 210470, 191268, 130396, 109199, 90077, 54434, 84029, 113430, 103109, 80406, 48966, 21060, -17584, 16267, 20480, -15491, -41343, -41467, -57923, -27819, -17179, -17401, 539, 7221, -10113, -28588, -7230]
23353g230K9522Q871m6707j4787R881R443M415k7437l933M835m7902j5808K9782
23340f7055K9632O010K4126K2204q018Q110k4782j670j7054R118K8094J2268L701
23327B4684k1527k5956o68j6768m8669Q123L0504K3450J5991k862k5476k3886
23315f3060j8351m3782K2795M6695m25j1922Q168m0123p721L3007K1516J0000
23303d3203K6776j6264K043j3282o637N868J2349p826k5988J9968O625K2754L2528
23290A5711K8770J2298k1886j5296K394l642P354n592o170k3529j2324J6553j9786
23277b5145k3649Q712K4166j1619n887p31L4142K2896j2199n2142j1077L2045
23265b0488K778j4357J9265R538n81L661l4650J4652K6482r72k3179l3496Q580
$$ y = [-7230, 22292, 31163, -15544, -30331, -20450, -11007, -6592, -34029, -37962, -33127, -81029, -96837, -67055, -37423, -31413, -7287, 14917, 6899, 15009, -9773, -11443, -28497, -19379, 8715, 20983, 24684, 3157, -22799, -23467, -40235, -88904, -80781, -50277, -26827, -10836, -13698, -39174, -63060, -81411, -125193, -102398, -55703, -56128, -68050, -59882, -100005, -107726, -74719, -53203, -43203, -16427, -32691, -30648, -43930, -50567, -44699, -32350, -40176, -66164, -46196, -39571, -16817, 15711, 44481, 56779, 34893, 19597, 21991, 18349, 25703, 20111, 13941, -9588, -21912, -5359, -25145, -48794, -40082, -15916, -27535, -33422, -34153, -11, 22885, 10686, -41456, -52533, -20488, -17710, -32067, -12802, -3264, -3845, -184, -34834, -20182, 6300, 5328, -17851, -51347, -42767]
23252d2767j0133J1705J7811L1376n1497j4786m860j1328p13K9141j7466k012
23240f5529J3530K2969K2130j1245l5402k3799K934M7695r703j1140l467K6556
23228b4471R530l851j3699K9510J1730j5178J2536M630O285M049j5942J175K8496
23215C4800j6387j9987r995k10j9589J423j0952j95K3536L769m4901o85j1016
23202g0389n705L3431O970J3195P594K2478K174R792l0316k8126o31M840L5999
23189A306J5949j5019j359l7450j1349m0763k6366J0345L8647K8561j7577O817
23177d8258J4017J4046L430j845j7976j3495K6385j7834J5109L4893l748l5587
23165c0863n804K23J5897L1811k9714j9157j3308k463J1750o463m6748K1402M8543
$$ y = [-42767, -52900, -41195, -23384, 7992, -43505, -58291, -63151, -74479, -75192, -46051, -63517, -65529, -51999, -29030, -6900, -18145, -53547, -77346, -74412, -26717, -36420, -47560, -51027, -24471, -14941, -18792, -32491, -2981, 8749, -6429, 6107, 10737, 17022, 21071, 5129, 6304, 34800, 18413, -1574, -11569, -11779, -31368, -29945, -40897, -41092, -17556, -13787, -58688, -59373, -70389, -76094, -42663, -35693, -22498, -14904, 7574, 9748, 19540, -10776, -38902, -39533, -34693, 1306, 17255, 2236, 877, -36573, -47922, -88685, -115051, -104706, -66059, -37498, -55075, -48258, -34241, -20195, -16765, -18610, -36586, -50081, -23696, -41530, -26421, 8472, 4724, -30863, -36667, -36444, -20547, 11264, -18450, -37607, -50915, -53378, -41628, -48091, -94839, -73437, -24894]
23152b4894L62L5147N1797o210n4182m4301l399k7572l7975K436N918J6067N3344
23139c3462K3061j6502l539K0166R885j0209J2503k3832m3546k2820j9394M934
23127a02755L9951K0640j446j5704k8124k9283L538N771o412m3009L6577K5295
23115i4961J6600K8632l056j4545J7560j7002l567r838j8773J8348r633P747K3220
23102e9268q725O190j6788k0126J8660J7133k012p534j2628M363O105M9420p154
23089c2364J0337M3056J8614l6441K2229n536r199j0739J6881O3344P5835Q8411
23077B44428J25112N3970J9663l9507j45531j62476q0016k1531j580j0761l4703
23066e2932j298o382p22k1469k0418L0685K6876q660N876J2039j5660j8876N7540
$$ y = [-24894, -24532, 10615, 62412, 56202, 2020, -42281, -45680, -73252, -111227, -108791, -102873, -86806, -33462, -10401, -26903, -30442, -10276, -391, -10600, 1903, -21929, -65475, -88295, -107689, -102755, -62804, -42164, -43610, -59314, -87438, -116721, -113183, -107412, -113824, -156833, -120256, -94961, -78361, -49729, -52785, -67330, -49770, -66772, -70339, -80177, -98950, -80602, -90235, -82488, -59268, -67993, -61803, -78591, -98717, -80057, -62924, -64936, -72470, -85098, -80735, -74630, -25210, -32364, -22027, 21029, 39643, 3202, 25431, 19895, 10696, -43, 16838, 80182, 156017, 244428, 369540, 423510, 443173, 403666, 258135, 95659, 15643, -5888, -7468, -18229, -52932, -54230, -60612, -61334, -82803, -103221, -72536, -45660, -54320, -48444, -36405, -52065, -70941, -13401]
23053a3401P6328M1704J00965J07821Q7634L1615n2970j18778j13170l7780l8007
23042G1961k9826l5491j5541j2638K9840P865K5756n321j8993m5496J2703n889
23030b1070J2422r815j1621p115K7625J6225l0238j843J1606Q189J7554j9893
23018g974J425K3905n4382o0492n8388l7441k2105l645n517N0387M5553K1858
23006a06816K9487M1704P8898q459l4784l6982j0875P111j1185J5047O8267J0754
22994D2167j9054l971k5649n9911j5742j3443j6945M8744J9572r408J4310J7313
22982b2017O0446N6655j8905k3931J9481k3330P938N322l5119k5087j7288P345
22970h490L1297j0822N792L2624R826j087j0612l8593K6041L7994n751l617k404
$$ y = [-13401, 62927, 104631, 205596, 313417, 401051, 432666, 379696, 260918, 147748, 109968, 71961, 42135, 6644, -8897, -21535, 8305, 16170, 41926, 36605, 17612, -27884, -15181, -21070, -8648, -18463, -30084, -37199, -9574, 6651, -23587, -25430, -13824, -5635, 11919, -7974, -6549, 17356, -37026, -97518, -155906, -193347, -215452, -219097, -224614, -174227, -128674, -106816, -77329, -35625, 43273, 34814, 30, -36952, -47827, -40716, -51901, -36854, 31413, 42167, 23113, 19142, -6507, -66418, -82160, -95603, -112548, -63804, -44232, -53640, -39330, -22017, 38429, 95084, 76179, 52248, 71729, 48399, 56337, 61659, 26540, 1453, -15835, -8490, 22807, 11985, 17777, 50401, 60227, 59140, 48528, 9935, 35976, 73970, 68219, 64602, 62198]
22957F2198j1381o06J0844L015n1672n0653k9334j7530N3312J03616R0840N5971
22945B18620j3371l6596n0983q0548n3929L7249J0291k1825j7213o481l5339k7666
22933g7791m0986k367K4069L6772K8549Q618K1673L459L6611n871n3896l1112
22921e2272K2203J1077L3767J4743M235p509J3628M137J8870P304k7713j0819
22909C1651N671M474M2580L6296K5687O8777O8765J04651J95814L00634M15803
22898A300803M52763L12548M1147l47024m95425l98859k21944j22939o5058n3228
22888D02784n3072l6430N532J5502K0042j4042K8743n160L4210Q6036M8785P1550
22876F04480Q9932Q7018J1026Q011q2450j16014k8004o0246m4545J7298P1468
$$ y = [62198, 50817, 50211, 61055, 64070, 12398, -38255, -67589, -85119, -31807, 71809, 162649, 218620, 205249, 168653, 117670, 37122, -16807, 20442, 30733, 8908, -8305, -14786, -50125, -77791, -118777, -121144, -97075, -60303, -31754, -23136, -1463, 1996, 38607, 32736, -21160, -52272, -30069, -18992, 14775, 29518, 33753, 26244, 39872, 44009, 62879, 70183, 42470, 31651, 37322, 41796, 84376, 120672, 146359, 215136, 283901, 388552, 584366, 885000, 1300803, 1753566, 2066114, 2107261, 1760237, 1264812, 865953, 644009, 521070, 456012, 402784, 349712, 313282, 318814, 334316, 354358, 340316, 369059, 363899, 398109, 484145, 532930, 604480, 694412, 781430, 792456, 800467, 718017, 602003, 573999, 513753, 469208, 486506, 557974]
22865E57974L0762K5767L6480J9856Q4664N1034J5042M0330P2304Q1349R2171
22854A107733J35231R7684P5502O8350R7888J11806J31637J42866J34036J56368
22844B259101K14820K61085L38933M12547M93759O32011Q02087R86339J205891
22835G606573J625209K130672K652880L200420M001209N578213R031291J6059588
22827E1886055K8933676M9865149P4962138Q8077697P3188276K6490579m3240848
22820C50162722r1139316q5970741n8023400l5793638k1994795j3755925q973154
22813C4511753o186725m545008l426444k558594j889312j416304j160552q93569
22805A2435245o16570m55212m20016m17085m96946o36766o84362o59164n66180
$$ y = [557974, 588736, 614503, 650983, 670839, 755503, 806537, 821579, 861909, 934213, 1015562, 1107733, 1242964, 1340648, 1416150, 1484500, 1582388, 1694194, 1825831, 1968697, 2102733, 2259101, 2473921, 2735006, 3073939, 3486486, 3980245, 4612256, 5414343, 6400682, 7606573, 9231782, 11362454, 14015334, 17215754, 21216963, 26795176, 35826467, 51886055, 80819731, 130684880, 205647018, 293724715, 366912991, 393403570, 350162722, 259023406, 173052665, 115029265, 79235627, 57240832, 43484907, 34511753, 28325028, 23780020, 20353576, 17794982, 15905670, 14489366, 13328814, 12435245, 11818675, 11363463, 10943447, 10526362, 10029416, 9392650, 8708288, 8049124, 7482944]
22796G482944m48608m00477m09353l69172l34625l40467l17863k59589k35626
22787D367164j99586j76530j61149j27358j25555j60292j16232j35601j22796
22778C042065o6247j05927r5554j49456j22833q4449q3478n9578p1294n9772m9051
22767B094426k9939j8000n966K2450O461l7004l6740q4853n4029j6434K4901O6233
22755A931506J7856o880P9241J83914K33017M35050N60577M61048K43923k11392
22745C927860n37475n56276m54633l16698k10352j81482j24803n2870r5455j11837
22735A285979o6192j4259k7530o6011k8668k7403o0978l9825k9737l4253j0235
22724H80888M240p75j6532j9328l0323m5419j7472m5026l8520J9637L683k4404
$$ y = [7482944, 7034336, 6633859, 6224506, 5855334, 5520709, 5180242, 4862379, 4602790, 4367164, 4167578, 3991048, 3829899, 3702541, 3576986, 3416694, 3300462, 3164861, 3042065, 2975818, 2869891, 2774337, 2624881, 2502048, 2417599, 2334121, 2274543, 2203249, 2143477, 2094426, 2064487, 2046487, 2040521, 2062971, 2069432, 2032428, 1995688, 1910835, 1856806, 1840372, 1865273, 1931506, 1949362, 1942482, 2021723, 2205637, 2438654, 2873704, 3434281, 3895329, 4139252, 3927860, 3390385, 2834109, 2379476, 2062778, 1852426, 1670944, 1546141, 1493271, 1397816, 1285979, 1219787, 1205528, 1177998, 1111987, 1083319, 1055916, 994938, 955113, 925376, 891123, 880888, 885128, 884353, 867821, 848493, 818170, 772751, 755279, 710253, 671733, 691370, 695053, 670649]
22712F70649j653j707o5252N136J9730K351k4739n3736j5091j5988k4339Q733
22700E04094J0044J2011M7030J06794Q9573L3483j5449o5572m1580m7807l6206
22689E96415l7517j01758q1807k9195j7768m264j0214J6997P85k6625M2598M0430
22677C88077J1770J3736n977k4272k5518j1454k4987o1043k2240j5522k0601j5409
22665A86560N3919M214N0335N7522O3440p915m6708n9930m0260l516L1050k4273
22653B64438l1148j7871m008J1738K2596J3954j3028K7796K485k2215m808K1761
22641B71690P298l7475l5441N4219R479M9547K5678K3098o914n2605o4523m3300
22629B00751l3456r986K1495K5870J2751J136J1768K7870j3322Q059o074j026
$$ y = [670649, 668996, 667289, 602037, 607173, 626903, 629254, 604515, 550779, 535688, 519700, 495361, 504094, 514138, 526149, 573179, 679973, 769546, 803029, 787580, 722008, 680428, 632621, 596415, 558898, 457140, 375333, 346138, 328370, 324106, 313892, 330889, 331674, 305049, 347647, 388077, 399847, 413583, 407606, 383334, 357816, 346362, 321375, 260332, 238092, 222570, 201969, 186560, 240479, 244693, 295028, 352550, 415990, 408075, 361367, 301437, 261177, 257661, 288711, 264438, 233290, 215419, 211411, 223149, 245745, 259699, 246671, 274467, 276952, 254737, 249929, 271690, 278988, 241513, 206072, 260291, 269770, 319317, 344995, 368093, 361179, 308574, 244051, 200751, 167295, 157309, 178804, 204674, 217425, 218561, 230329, 258199, 244877, 252936, 246862, 245836]
22617B45836l4966k3877j65O814M4230K3843J3062L8121Q4858P3844R2561K07485
22605G71646K80871L55791K55521L6348k16366l75437l07139j94064j14047j09459
22595C83665n7989l2259o6615L825O809j2902J9661k9067m0175J4260L3903L1659
22583B54775p973n3414l5631l1193r319K7972K1257K5814j4559j5784j3802l6948
22571A11195n4767L4871L3386k6914J22R623J012j4224l1602J1746K6327k28k668
22558I7879k3536J1454j6464q057O343L2179K7234L073m6439L273q305l5991R729
22545E2372L1359J1496m167K735m466j3046R692j9801K2575L6045l414j0447k9926
22532H1007k6353K0638K334K9879j95n640K7530m933n6623k2778Q067J5484M511
$$ y = [245836, 210870, 186993, 186828, 193642, 237872, 261715, 274777, 312898, 397756, 471600, 564161, 771646, 1052517, 1408308, 1663829, 1700177, 1483811, 1108374, 801235, 607171, 493124, 383665, 325676, 293417, 226802, 230627, 237436, 224534, 244195, 215128, 174953, 189213, 223116, 254775, 246802, 193388, 157757, 126564, 117245, 145217, 166474, 192288, 177729, 161945, 148143, 111195, 56428, 91299, 124685, 97771, 97893, 107516, 108528, 94304, 62702, 74448, 100775, 100547, 97879, 74343, 85797, 69333, 61276, 67619, 99798, 127032, 130105, 83666, 86939, 78634, 42643, 52372, 83731, 95227, 91060, 93795, 89329, 76283, 85975, 66174, 88749, 124794, 121380, 110933, 81007, 54654, 75292, 77626, 107505, 107310, 101670, 129200, 124267, 67644, 44866, 52933, 68417, 72928]
22519G2928Q230J9315L1690K1141l781p387n4487n3825j7595K975K9425M4624
22507I3253r775J168j9601J7096O74l519k1163k3429K1790j4231j177k1345K2140
22494D1881L2445M8879j3422j5337j1593J4354J0561J370m087j9104j7285J4894
22482H3556L550J5868j5725j882j4536P16L4031K1032l2598k6060J0635J3993
22470I2580N893j3466l640L550j1131J9102J7806j0790l1262l496q535P081O215
22457F9907R437l9164R826j4562j2705O6852j1314r104k3622K5640j3316j3651
22445D4224J1260M409j499J4516J1083k4656k9695Q754j0041l2257K3715J0057
22433B9870O852L5399J067m1495K544K2302k1114J0529J6991q996m469K5106n994
$$ y = [72928, 81158, 100473, 132163, 153304, 149523, 142136, 87649, 33824, 16229, 19204, 48629, 93253, 83478, 84646, 65045, 82141, 82815, 79296, 58133, 34704, 56494, 42263, 41086, 19741, 41881, 74326, 123205, 109783, 94446, 82853, 97207, 107768, 109138, 105051, 85947, 68662, 83556, 87106, 102974, 87249, 85367, 70831, 71547, 105578, 126610, 94012, 67952, 78587, 92580, 98473, 85007, 81367, 84917, 73786, 92888, 110694, 99904, 68642, 65146, 56611, 63692, 69907, 79344, 40180, 50006, 35444, 22739, 89591, 78277, 69173, 45551, 71191, 57875, 44224, 55484, 59893, 58394, 72910, 83993, 59337, 29642, 38396, 28355, -3902, 19813, 29870, 36722, 72121, 73188, 31693, 34237, 56539, 35425, 45954, 62945, 53949, 49480, 74586, 68592]
22420F8592K0153o92j3069J852l9143j5053P270K5577j2299N278J4282k630k2259
22407C7859R283n649P617n733J5607K3325n7123L9588K8563l7891k2865K6486
22395E9067K7616k6185j6405J1752j8659J9454K2001j3593J8534J9573K4993j2764
22383A15384l4060J8833k2131n4086l7950j7806r499j2391k0773L5631J8788n6871
22371g6931J5488M9834O4743O0121N5543O5229L1948O1010j8576k3533J0162J4940
22359C09978m5267j00926l7531o896k3246l1487k7738M0964J3195M822m2306m4956
22347H606K049K7392K3572q030k1039L8023J5993J582j1073P214n816n2189p639
22334A8645J4309J5740J2388J215p355K0739j2357k0788j1999J4069j5919K0892
$$ y = [68592, 88745, 88053, 74984, 76836, 37693, 22640, 29910, 55487, 43188, 48466, 62748, 60118, 37859, 47142, 41493, 49110, 43377, 58984, 82309, 25186, 64774, 93337, 55446, 32581, 59067, 86683, 60498, 44093, 55845, 37186, 56640, 78641, 65048, 83582, 103155, 128148, 115384, 81324, 100157, 78026, 23940, -14010, -31816, -41315, -53706, -74479, -38848, -20060, -76931, -61443, -11609, 53134, 113255, 168798, 234027, 265975, 326985, 308409, 284876, 295038, 309978, 264711, 163785, 126254, 119358, 96112, 64625, 36887, 77851, 91046, 95868, 53562, 8606, 10655, 38047, 61619, 53589, 32550, 70573, 86566, 88148, 77075, 84289, 78473, 26284, 18645, 32954, 48694, 61082, 62297, 54942, 75681, 63324, 42536, 30537, 44606, 28687, 49579]
22322D9579K9668N175k2495J4936OJ7473K5833q544J3242k243K7268o3350l9405
22309D7143j5282m827j1175P430j8091k066J2101J8962r658J7774l903K8903N251
22296G2562J2206P996J7715j3335k1116P15k2764N2261N937m7287m3402P282K322
22283C1092M0330M1775l6513l0769J730k3302K2881M6234O223K6531j8326k4071
22271H3815o89k2443j7292K8843K6343j1315k018N470Q746K4131K407J8771J9263
22258A64032O277j3061K7958N1941J06504J27806K12999L30419M06854L84849
22248A806578J41682j25315l60422m38184l28950j90783j06579o9913q1889o7550
22238A78675k1745r56p190l8285O678O971k3101k6293K5946L7573k7272L000L4831
$$ y = [49579, 79247, 84422, 61927, 76863, 76869, 94342, 120175, 111631, 124873, 122630, 149898, 86548, 47143, 31861, 27034, 15859, 23289, 5198, 3132, 15233, 34195, 24537, 42311, 38408, 67311, 72562, 84768, 92764, 110479, 97144, 76028, 76743, 53979, 106240, 112177, 64890, 21488, 28770, 31092, 71422, 113197, 76684, 45915, 47645, 24343, 47224, 93458, 99681, 126212, 107886, 83815, 83126, 60683, 43391, 72234, 98577, 87262, 85244, 90714, 99460, 123591, 125998, 144769, 164032, 170309, 157248, 185206, 237147, 343651, 471457, 684456, 1014875, 1421729, 1806578, 1948260, 1822945, 1462523, 1024339, 695389, 504606, 398027, 328114, 246225, 178675, 156930, 155974, 148784, 110499, 117177, 124148, 101047, 74754, 100700, 138273, 111001, 114001, 148832]
22225A48832j3382j5452k6675K8477J3354l7989o790k8687q470J2618j996j7403
22213D6437k4905K1723j4532j0697m470J5551L1476l1j5156j026k174L984J1294
22200E7474Q604l574P779j2816j3299K0624K4152r2k1136j9074j0698J3783J821
22187E3548n3546k126N4223R401m6650K5814K1251j4928k9760l8681K2082L5728
22175C6356L4402j0850l4061R887L5126K7335j506j9680j0189k609k866k2270
22163C9075j3307j43l3730K5386K8830k2528k4694k216K1238P031K0284J3188
22151E8414j1451k6755l4152n366M0839K5241r926k5965N785L84k1097K8057M7804
22138G1812k9231j0943N92J3873j7412J0952L220k936k4209k9796J209J4968J3336
$$ y = [148832, 135450, 119998, 93323, 121800, 135154, 97165, 90375, 61688, 53218, 65836, 63840, 46437, 21532, 43255, 28723, 18026, 13556, 29107, 60583, 60552, 45396, 44370, 42196, 46180, 57474, 66078, 62504, 70283, 57467, 44168, 64792, 88944, 88852, 67716, 48642, 37944, 51727, 53548, 2, -2124, 52099, 61500, 14850, 40664, 61915, 46987, 17227, -21454, 628, 36356, 70758, 59908, 25847, 35734, 70860, 98195, 96689, 77009, 66820, 64211, 61345, 39075, 25768, 25625, -8105, 17281, 46111, 23583, -1111, -3327, 17911, 24942, 45226, 58414, 46963, 20208, -13944, -19310, 21529, 46770, 36844, 10879, 16664, 17048, -4049, 24008, 71812, 42581, 31638, 32230, 46103, 28691, 39643, 42863, 39927, 15718, -14078, -12869, 2099, 15435]
22125A5435L3098m15k9654n1609j2754O1616J0112j1422J7827m545j7033k1516
22113a0860K2130M597l5387j5436J7274J695J0395k9408m243m722L0260J5137
22101A432K1826M319j8121P886J0264l0061k2076M1619N9396j0913j4489r247
22089D1835M360o010l7365k8850p903J7018M5822L1466l8434k8167K6738K5229
22077D5739P6882J0886l1283l4273k3948k4703j9049j5671q574n8895J7009N1354
22065a4526K6735k0294j0611L6122J2383N948J0709O821j4131j3041o353R513
22053B9275j2139K263o79J6739L495k6127J7741J4940j1730n164k441L0262j0621
22040D5814m0639r996L6291m40J3990M6107J8386j9619l8888J7623L1253K2680
$$ y = [15435, 48533, 48118, 18464, -33145, -45899, 15717, 25829, 14407, 32234, 27689, 10656, -10860, 11270, 15867, -19520, -34956, -17682, -15987, -5592, -35000, -39243, -43965, -13705, 1432, 23258, 27577, 9456, 17342, 27606, -2455, -24531, 17088, 76484, 65571, 51082, 41835, 46195, 40185, 2820, -26030, -33933, -16915, 28907, 60373, 21939, -6228, 20510, 45739, 122621, 133507, 102224, 67951, 44003, 19300, 251, -15420, -23994, -82889, -65880, -14526, 12209, -8085, -18696, 17426, 29809, 35757, 46466, 53287, 39156, 26115, 19762, 29275, 17136, 19399, 18720, 35459, 38954, 12827, 30568, 45508, 33778, 28614, 26173, 56435, 45814, 5175, -4821, 31470, 31030, 45020, 91127, 109513, 89894, 51006, 68629, 99882, 122562]
22028A22562n091m4693j2673l8971l7158L6055J2187K4332k8135j4307J6733k0778
22016A0063R422L362P615q961J1964K5355K297k2282l0560J4832j5355k3834l1445
22003d7527M6425K4072J2790K128J356K9141m0093l2116j88J6446k8888l3743
21991e0197K3220j0382Q523J9608K1411K3871l314j0143M45O455R743J7647K4344
21978H1231j0029k5806L3321n3279n1245M662N26J2482K7326k2878k767l099J3825
21965D270J6033o059J501K4984n887K741j5664J0971j6504O536j278K0844K1508
21952F3996q0232m1511K5013R862L885l639L2307K6852P851J4157j3098k618j4004
21939B8821J7717L895K814l352l9513l15k073J0869K062p33R339j7506l3092k5335
$$ y = [122562, 117471, 72778, 60105, 21134, -16024, 20031, 32218, 56550, 28415, 14108, 30841, 10063, 19485, 22847, 30462, 21501, 33465, 58820, 61117, 38835, 8275, 23107, 7752, -16082, -47527, -1102, 22970, 35760, 37888, 39244, 68385, 28292, -3824, -4012, 12434, -16454, -50197, -26977, -37359, -28836, -9228, 12183, 36054, 32740, 22597, 23042, 29497, 39240, 56887, 81231, 71202, 45396, 78717, 25438, -25807, -21145, -20619, -8137, 19189, -3689, -6456, -9555, 4270, 20303, 14244, 15745, 40729, 34842, 37583, 21919, 32890, 16386, 22922, 21644, 42488, 63996, -16236, -57747, -32734, -22872, -18987, -22626, 9681, 36533, 44384, 58541, 45443, 42825, 28821, 46538, 50433, 53247, 49895, 10382, 10067, 7994, 18863, 20925, 20192, 29531, 12025, -21067, -46402]
21925d6402j4846J5451J4236L5621j64l9225m054K4730J9287j9573k1065L3155
21913b849n105O214J2292M614J8834j3233N911P322J4333m495j1524P589k2013
21900A7890j9665j1650K8636J527j034K8176j7556p529p82l8553o1410k6125J6933
21887i1142N8554N7811P314n3871k1101J5498M560j7810J4374J1631j7296K1335
21875a0143K4655l253j2329l2474m786M7457Q414j4593P393j1724N3174L8693
21863I0484k3442l3603k8452m1411J4892M439O2500K9045Q01l9904k1426J8844
21851C2767j447k4889k578M0854K5979J2206M3331k3024j08124l1371J4295L1573
21839I572k807m96J2080P809J325m9230J0742n009J5225R2042j973k9448j1319
$$ y = [-46402, -61248, -45797, -31561, 4060, 3896, -35329, -39383, -14653, 4634, -14939, -36004, -2849, -7954, -1740, 10552, 15166, 34000, 20767, 26678, 34000, 48333, 43838, 32314, 39903, 17890, -1775, -13425, 15211, 16738, 15704, 43880, 26324, 18795, 18013, -20540, -81950, -108075, -91142, -32588, 25223, 32537, -21334, -42435, -26937, -22377, -40187, -25813, -14182, -31478, -10143, 14512, 11259, -1070, -33544, -38330, 9127, 17541, 2948, 10341, -1383, 51791, 90484, 67042, 33439, 4987, -36424, -21532, -17093, 45407, 74452, 75253, 35349, 13923, 32767, 31320, 6431, 3853, 44707, 70686, 82892, 126223, 103199, -4925, -36296, -22001, 9572, 6765, 6269, 18349, 26158, 27483, -21747, -11005, -16014, -789, 91253, 89280, 59832, 48513]
21826D8513N45Q272l9681j9330l0252K19N4821P691m1334n897J1539L745j582
21813b731k3290J915Q690j3990K072J4051l5819j1889O111K7746J5885j92r711
21800b1152J3273O459m8303r510L8262L1378P677j6131K1165J0118k3755o442
21788C039j010J3965J1110r195q636N26K0869k233l0881n1298K196K8401j523
21775b4670R079J4196K9548K2117l0630k1879j8978L039J081L9154j2917O808
21763A5948j2953k0969N238k6751j514M489j4633N2013J6730m3540k6267j6723
21751f8932L8022K6011l922k971J3806k138l4016p536K8893R46P557j1268J124
21738a4424j7555l0532J5620K7847P143k0551M602L1250L2496R798M44p04k4931
$$ y = [48513, 49058, 57330, 17649, -1681, -31933, -31714, 23107, 30798, -10536, -16433, -4894, -1149, -2731, -26021, -24106, -15416, -29406, -27334, -13283, -49102, -60991, -54880, -27134, -11249, -11441, -21152, -7879, -1420, -49723, -59233, -20971, 10407, 18084, 1953, 23118, 33236, 9481, 3039, 2029, 15994, 27104, 17909, 9273, 9799, 30668, 28435, -2446, -53744, -51548, -23147, -24670, -15591, -1395, 28153, 50270, 19640, -2239, -21217, -18178, -17097, 22057, 9140, 15948, 2995, -17974, -12736, -39487, -41001, -36512, -51145, 868, 17598, -25942, -52209, -68932, -30910, -4899, -8821, -11792, 2014, -124, -34140, -41676, -12783, -11837, -4280, -15548, -14424, -31979, -62511, -46891, -19044, -11901, -32452, -27850, 3400, 35896, 45694, 46138, 45434, 20503]
21725B0503j2404N065K975k7289K224j3727k9839j8210K5732o59j835J5781L1003
21712f80j8k2610k0428K4346Q908K6715n760j3070j2655K717M34J8460K5911J3225
21698D5495q740j7810j7303L4497L6941R95m0920l4489l6452k2160M118N642O3418
21685A3232r770k3785j0435j4847O905L686K252J5618j3677J5318p593k3109O7148
21672B0943N2285k2713m0879j3556j0547o68N6795K3875j3826k0343k5036p135
21660h05k4024M9354K5625J7258j7375p930m891M483K61k0167N5111K2219k8465
21647G0654j662l4477l8467k4328J4499P774L4599J0295l0106l3650R454l266
21635a8681J869Q129K5651M1640M5554J4977k3659k2213l4342k7080q9729j1850
$$ y = [20503, 8099, 13164, 16139, -11150, -8926, -22653, -52492, -70702, -44970, -45629, -47464, -31683, -680, -698, -23308, -43736, -19390, -10482, 16233, 10473, -2597, -15252, -12535, -12101, 6359, 32270, 45495, 36755, 18945, 1642, 36139, 73080, 74075, 33155, -1334, -37786, -59946, -55828, -50186, 13232, 3462, -20323, -30758, -45605, -38700, -35014, -32762, -17144, -30821, -15503, -23096, -46205, 20943, 73228, 50515, 9636, -3920, -14467, -15135, 41660, 65535, 51709, 31366, 6330, -805, -24829, 24525, 50150, 67408, 50033, 42103, 37212, 41695, 41956, 21789, 76900, 99119, 70654, 68992, 34515, -3952, -28280, -13781, -6007, 28592, 38887, 8781, -24869, -15415, -18681, -16812, -8683, 16968, 58608, 104162, 119139, 95480, 73267, 38925, 11845, -77884, -89734]
21623h9734M5084L9021J0064o1118j9632Q399L2262K5648J219k2961K9330L4697
21611C2279L459k1817N859J9187k3830k7364j5915M9528J5184R712l317l0082
21599A2883l24N276M751L298k0052l402L823j5472l046n131J9014j0977o1058
21586g0417L107N0674J9732k5725O549J6435O898k184L0801n634l5422P1J7267
21573A2152K159L1996k6622m5839l5215M049N4625L8566K2527k6565J6754l035
21561D5552K377j1679K0160j694j3080j7869J0861K8773j017k9883M681m128J1005
21548D4059J8667j5554l1232j5276P232l5927J2438k2021j1608Q654K3503Q814
21536h251J121k5447j9822j2942j7182K2903M4688K5745P648L8213K982j6069
$$ y = [-89734, -44650, -5629, 4435, -56683, -76315, -67916, -35654, -10006, -8787, -31748, -2418, 32279, 35738, 13921, 19780, 38967, 15137, -12227, -28142, 21386, 36570, 46282, 42965, 12883, 12559, 17835, 22586, 25884, 5832, 2430, 6253, -9219, -12265, -17396, 1618, -9359, -70417, -67310, -16636, 3096, -22629, -16080, 355, 7253, 5069, 35870, 30236, -5186, -5115, 12152, 14311, 46307, 19685, -26154, -61369, -57320, -2695, 35871, 58398, 31833, 48587, 45552, 47929, 36250, 56410, 54716, 41636, 23767, 34628, 63401, 62384, 32501, 37182, 33054, 44059, 62726, 47172, 15940, 664, 7896, -28031, -15593, -37614, -49222, -40568, -17065, -8251, -7130, -32577, -52399, -65341, -82523, -59620, -14932, 10813, 18461, 56674, 59656, 43587]
21524D3587m468l4729r656j3782j7173J7345L6132j4483l1671j620R79M5260k624
21511A3097k1551o713M680M00L164n22l0196p151K3538L1193L7722J8833j1672
21498E4822l3676k4553j0233P24j3709l1538o844K1691m5065k3896K8454O6939
21486a6884K1009K5055Q28k674p322l3799J388j1861j4935P96J7374j5313k795
21473c9133K3053L6315J5007k1793j8558J9469J3389J2048M10j7052j7743q44
21461D568Q609j0261R602K9034J9523J3125J5880K8292j2714l5654l0720L348
21449D2632j139j0612L507P081k9951j1529J3401M2681J1732l9237l7547K8935
21437A9954j929k2926m3236j6774M4064R146k8736l0001L0484K3262J6754o026
$$ y = [43587, 39119, 4390, -5266, -19048, -36221, -18876, 17256, 2773, -28898, -30518, -29539, 15721, 13097, -8454, -15167, -10487, -10087, -6923, -7445, -37641, -44792, -21254, 9939, 47661, 66494, 54822, 21146, -3407, -13640, -12916, -26625, -58163, -65007, -43316, -88381, -112277, -83823, -16884, 4125, 29180, 30008, 27334, 20012, -13787, -12399, -24260, -39195, -38399, -21025, -36338, -39133, -16080, 20235, 35242, 13449, -5109, 14360, 27749, 39797, 40207, 23155, 5412, 4568, 13177, 2916, 12518, 41552, 61075, 74200, 90080, 118372, 105658, 70004, 39284, 42632, 41493, 30881, 34388, 41469, 11518, -11, 13390, 56071, 67803, 28566, -8981, 19954, 18025, -4901, -48137, -64911, -20847, -11701, -40437, -70438, -39954, -16692, 62, -5964]
21425e964J1956R163j0880j9425L6677K8391M610k7162M288j6321J3039K479K4963
21412E5814l2942j7135K5130J0473l130k6008L7369j415k231m2534n284J5695
21400A3802N111K6818q033L870K5555L35l5707o6339j4842M4610p816R608o118
21387i146R747K7361j7090M261M598k9969l8710k8311J5750L5375J9393j1880
21375a8621k5357p829J1781K6678R850k1423M8094l46J2433J858l1276k8103k4327
21362d6588J9463J6038j7382O820R03K8990n644j4085j5410j4839m19K2577k206
21349b1782L3746J1667P232k0454l3443J4349J1980J9923R978j2916l3097m6850
21337e9667l1456k9853J2260L4342J9334J3672q01Q172N883j1740k0575r354J1127
$$ y = [-5964, 5992, 15155, 4275, -15150, 21527, 49918, 54528, 27366, 31654, 15333, 28372, 30851, 55814, 22872, 5737, 30867, 41340, 38210, 12202, 49571, 48156, 45925, 3391, -1893, 13802, 18913, 45731, 37698, 41568, 67123, 67458, 31751, -34588, -49430, -4820, -12636, -3028, -9146, 601, 27962, 10872, 15133, 19731, -10238, -48948, -77259, -61509, -26134, -6741, -18621, -43978, -51807, -40026, -13348, -3498, -24921, 23173, 22827, 35260, 37118, 5842, -22261, -46588, -27125, -11087, -28469, -21649, -20746, 8244, 2600, -11485, -26895, -41734, -42153, -19576, -21782, 11964, 23631, 30863, 10409, -23034, -8685, 3295, 23218, 33196, 20280, -12817, -59667, -91123, -120976, -108716, -74374, -55040, -41368, -42169, -33997, -28114, -39854, -60429, -69783, -58656]
21324e8656J4799J590R634k3114J7657k356j7793J0272J1265J3921J9235P273
21312C727k0782l610K1457k0J4375n791k1096l8729j9535M117L2986j1270k5638
21299f9809K1843M0109m844k7925J4737N234n936J8547P037Q034k0378j912j4578
21286b9841J4448J6947K546j3144k5447j7133j7377Q847L4309l5130J0608O7017
21274A6650K254l8321J2591j1889j2284J173k493j1835J0127L0894j5026p808
21262b5967O177j8219o1057l1721P9516K3686j1712J023k4435J5504L2474q057
21250b2788j073j3543k7896k8705m74K9698K5757R790J2493N092m898O323k5148
21237c5372Q814K3676k6519N881N083q531P038n6413l748J5675N1508n334k915
$$ y = [-58656, -43857, -42267, -32633, -55747, -38090, -40446, -58239, -47967, -36702, -22781, -3546, 3727, -17055, -20665, 792, 772, 15147, 9356, -11740, -50469, -70004, -65887, -32901, -44171, -69809, -47966, -7857, -12701, -40626, -25889, -20655, -26591, -8044, -1007, 7027, -13351, -15263, -29841, -15393, 1554, 4100, -9044, -34491, -51624, -69001, -60154, -25845, -60975, -50367, 16650, 18904, -19417, -6826, -18715, -30999, -29826, -32319, -44154, -34027, -3133, -18159, -25967, -19790, -38009, -99066, -130787, -51271, -27585, -39297, -38274, -62709, -47205, -14731, -22788, -23861, -37404, -65300, -94005, -94479, -64781, -39024, -29234, -16741, -11649, -16547, -10224, -35372, -26558, -2882, -29401, -23520, -18437, -26968, -19930, -76343, -80091, -64416, -12908, -18242, -21157]
21224b1157J3215j0973k0291k967J5774K748L4523K2190n2629j0002J6964J760
21212a0845p354N804p615l466K0251K6325k581k2875j3869P367Q867J9701K3322
21199D3032K3843m3414q759j0590J2166p894J1760j9161k9067K5808p316o42j9145
21186b9379k2384j189o461P366K9936L687r296l974M132J0693M1301l5358j5573
21173b6499m938J4479n341q731j3673M001q259m024J0818Q543l3492M764K4605
21160c7747k0496L2020M5505r307k2566n609J82K0059J0256M335m2978j9868P466
21147c8748J3887k0636k9761N2356J0414l571K4527J9005j0048O917j689j856
21135B0797j4611K4779j0014n772m120m8953j7981Q507q646k8346k818L6452k646
$$ y = [-21157, -7942, -18915, -39206, -42173, -26399, -23651, 10872, 33062, -19567, -29569, -12605, -10845, -18199, -12395, -20010, -23476, -3225, 23100, 20519, -2356, -16225, -8858, 9, 19710, 43032, 66875, 23461, 14702, 4112, 16278, 8384, 20144, 983, -28084, -2276, -9592, -10234, -29379, -51763, -52952, -59413, -52047, -22111, -18424, -27720, -31694, -27562, -16869, 24432, -10926, -26499, -31437, -16958, -22299, -31030, -44703, -40702, -48961, -52985, -42167, -33624, -67116, -62352, -37747, -58243, -26223, 19282, 9975, -12591, -18200, -18018, 2041, 12297, 16632, -26346, -46214, -38748, -24861, -45497, -75258, -22902, -12488, -16059, 8468, 27473, 17425, 24342, 22653, 20797, 6186, 30965, 20951, 15179, 11059, -37894, -55875, -47368, -56014, -84360, -87178, -50726, -53372]
21122e3372j6029R190k5652n729M611J2955K5573q606J5747L2256M7349m425k2883
21109A0985l2103j8217k5250k9668J2986K5964o525Q442k2158K5344N0824j739
21097a115L446Q414J1308l4800l034J4346j0931O170k8072j7209K86L6155j3509
21084b8545l819K7600o155l4077j3464j618k249K6180J6082J2180k8812l8073
21072g4770K974N21k575K164L5317P613j0176p773J4054p512j5995J1879J4019
21059c0260N282L5819M096Q969j292j5033l7749l0017J7153L6775k0557j8646
21047d5460M2270j0450J4944J0571J8244R046J2246K7536k392m0288o7010j3177
21035d3920K5527J9613n4J180K4298m828N872l8218j7117K4980r876M030k6928
$$ y = [-53372, -69401, -60211, -85863, -91592, -86981, -74026, -48453, -57059, -41312, -9056, 38293, 33868, 10985, -21118, -39335, -64585, -94253, -81267, -55303, -61828, -53386, -75544, -50200, 624, -1115, 2331, 10745, 22053, -12747, -15781, -1435, -12366, -6196, -34268, -51477, -51191, -15036, -28545, -32364, -4764, -10919, -44996, -58460, -60078, -62327, -36147, -20065, -7885, -36697, -74770, -71796, -71275, -73850, -71686, -36369, -28756, -38932, -46705, -32651, -40163, -56158, -44279, -30260, -24978, 10841, 14937, 23906, 22614, 7581, -30168, -60185, -43032, -6257, -26814, -45460, -3190, -13640, 1304, 11875, 30119, 39165, 51411, 78947, 76555, 36267, -30743, -43920, -18393, 1220, 1166, 2346, 26644, 21816, 27688, -10530, -27647, -2667, -12543, -8513, -35441]
21022c5441J2217Q289l3339j228J2295J7748m1467n2817J7993K3558k164L6915
21010c7441J1037j3124k4451P381J6555K7943j6945j8255L495J9024j1630n997
20998d2408L3946K2934j5966n4003K6337L6231p203J6348l4316m2544k8254M0702
20986d8196N5009N77j6423K848l7147p461K4777p288J045j0010l0868K3785L0755
20973a8597j7658l5540n010J5939p287K0478L1297j825L174J4356m803m1019j1914
20960e8409J7393M5437K6821j7216l1447k3465M4604N1203O056R32n80j7827j7808
20947B5694j7558l6101k705K1323J3533R451M6289j4966k1740k0060O096J4793
20935B4049l3790p427j2907l5526K8380J4638k7980o867J1092J9273j1785P900
$$ y = [-35441, -23224, -14935, -48274, -49502, -37207, -19459, -60926, -113743, -95750, -72192, -74356, -37441, -26404, -39528, -63979, -56598, -40043, -12100, -29045, -47300, -43805, -24781, -36411, -42408, -8462, 14472, -1494, -55497, -29160, 7071, -132, 16216, -18100, -60644, -88898, -48196, 6813, 7390, -9033, -6185, -43332, -50793, -26016, -33304, -32259, -42269, -73137, -49352, -18597, -36255, -71795, -76805, -60866, -68153, -47675, -16378, -18203, -15029, -673, -5476, -46495, -58409, -41016, 4421, 31242, 14026, -17421, -40886, 3718, 54921, 60977, 61909, 61329, 43502, 25694, 8136, -27965, -30670, -9347, 4186, 13637, 59926, 44960, 23220, 3160, 9256, 24049, -9741, -17168, -30075, -65601, -37221, -22583, -50563, -57430, -46338, -27065, -38850, -30950]
20923c0950r616j700J0698K6004J5509k8759m5471n912L1509J614m8703j4229
20911a00006K2220M8754J5244J5693p041p305o069M0879L4451j2195l7443P971
20899A5153q331l8000q105J5246K792j720k2354J3179o823j3168J6527K2491o454
20886a9567J9154K6719Q854k0935k6620k0827J4138J0416J0052j3740Q244n685
20874i797l869n6294k7647O0584L3169K3148r559r638j2614j1359m959R284L4743
20861A5192o509L6023J93k2015m5865j9233k46K3979J2952J3784R514K2R581j7296
20847A0076l9595r782k1781J4172K3736J2857R457p393q359J9608K4631M7735
20835G5362K4383k3040j1321P308m2462m6293k9126k4414K246N7331J3370m767
$$ y = [-30950, -40566, -42266, -31568, -5564, 9945, -18814, -64285, -70197, -38688, -37074, -85777, -100006, -77786, -29032, -13788, 1905, -5136, -12441, -18510, 22369, 56820, 44625, 7182, 15153, 6822, -31178, -39283, -24037, -21245, -22965, -45319, -32140, -38963, -52131, -35604, -13113, -19567, -413, 26306, 35160, 14225, -12395, -33222, -19084, -8668, 1384, -12356, -4112, -9797, -13666, -69960, -97607, -37023, -3854, 19294, 9735, 97, -12517, -23876, -28835, -19551, 15192, 8683, 44706, 44899, 22884, -22981, -42214, -42460, -18481, -5529, 8255, 17769, 17791, 27372, 10076, -29519, -39301, -61082, -46910, -23174, -10317, -860, -8253, -16612, 2996, 27627, 75362, 99745, 76705, 65384, 72692, 30230, -16063, -45189, -69603, -67357, -10026, 3344, -1423]
20823a423q680j5075K3407K1748j9445J1676N893j1124p477r069J832j6221N28
20810b3430M5014r900j0128Q641J6350m5310J3028M9867O398j7173l1988r160
20798g791k0792K0J300K165q647L1778K9110j3496j4778R414J176m282k8668m114
20784b7605K381L695k2166q74k0399N99R462O623P191J6618J148j5769k5720J0023
20770e4793K8775j2737k6222j2701N3431J5450J1040j536m822j4396J2436k691
20758h766P259J5441j7466l5514j4416p217R59k7494K7068J0728J2982q903J4101
20745c1238q529J1731J4664o961m9647L5673k414K988k1851J7028L2500J53J9889
20732A3986l5455N720K4274o05k3801l533J0536M581q121k7094n3384j5749M4754
$$ y = [-1423, -10103, -25178, -1771, 19977, 532, 12208, 18101, 6977, -500, -9569, -7737, -23958, -23430, 21584, 11684, 1556, 10197, 26547, -18763, -5735, 44132, 50530, 33357, 1369, -7791, -28583, -28563, -27263, -25098, -33745, -1967, 27143, 13647, -1131, 8283, 9459, 5177, -23491, -27605, -25224, -21529, -43695, -44569, -64968, -64369, -54907, -48284, -41093, -24475, -23327, -39096, -64816, -54793, -26018, -38755, -64977, -77678, -24247, -8797, 2243, 707, -4115, -18511, -6075, -8766, -1507, 13934, -3532, -39046, -53462, -60679, -59720, -87214, -60146, -49418, -36436, -45339, -31238, -39767, -28036, -13372, -20333, -69980, -34307, -36721, -33733, -55584, -38556, -6056, -5903, 13986, -21469, -15749, 8525, 7920, -15881, -19414, -8878, -4297, -12418, -39512, -92896, -108645, -63891]
20719f3891l293L5765R10m4484J9047M3995J7297R70j4624k1809J052J0715M1377
20706B3027P652l1100k5998P910j4720m922R364n971J7873J3195J9782J5568l0109
20693A551j7091p983J4898j0195k7247R231J314M234j908J077m382l9978K785
20680g3694N9540L2417j7374m4746l1987p319J3010K0398N1504j8257j1451K0306
20668g653l749j7159K0799J424M2800P739l347l6071k2037K2874k0414l6808K4373
20655b7229N738n700O935J863j6218J3451J672l333k9920Q552m499K1637J4271
20642a2780K0880j067j3042k9747j4767K1441L9528o286j2254o856j3267j6620
20630d4837k3714J0560L968R602K2849O675k293l182Q579j8832M991J5326J3495
$$ y = [-63891, -67184, -31419, -30509, -74993, -55946, -11951, 5346, 6316, -8308, -30117, -29065, -18350, 23027, 30679, -421, -26419, -18509, -33229, -38151, -28787, -34758, -16885, -3690, 16092, 31660, 1551, -15540, -23523, -8625, -18820, -46067, -36836, -35522, -31288, -33196, -32119, -36501, -76479, -73694, -14154, 18263, 889, -43857, -75844, -83163, -70153, -49755, 1749, -16508, -27959, -7653, -11402, -28561, -7762, -6338, 36462, 44201, 40854, 4783, -17254, 5620, -14794, -51602, -27229, -21491, -27191, -20256, -18393, -34611, -21160, -19488, -22821, -52741, -44189, -48688, -27051, -12780, 8100, 7033, -6009, -35756, -50523, -29082, 10446, 4160, -8094, -14950, -28217, -44837, -68551, -57991, -54023, -44421, -21572, -14897, -17190, -20372, -11793, -30625, -25634, -10308, 3187]
20617C187J5120k2363r885K3918O03j2883N755j8336M952j3403q46l373j3897
20604d1451J8335J9897r890j3962j6339N283Q459J9966L0837j2594m2037n799
20592c9295j1612K6470Q711m1588J3491k718l6822j4536Q267N0020Q519m322j9495
20579e4910r852Q251J2763L4843N189m1990J6773k165J2110j1611k7031k5038
20567h2668J8140L7093Q550K7836J8104J2943k3040j4041N087L2484n511k3114
20555A1863r805j5617j1413M9244L4041j7291m4334n9376l965L0092k3058k5566
20543h5185J6923M613K3170L2873K4686m971k5334K6392L5176l3071k144j4612
20531a484L067L340n1882p975J3265J0325L1987M747j9352l4069J6492J9062k8290
$$ y = [3187, 18307, -4056, -13941, 9977, 10580, -2303, 3452, -14884, -9932, -23335, -24181, -27554, -41451, -23116, -3219, -13109, -27071, -43410, -38127, -29668, -9702, 21135, 8541, -33496, -39295, -50907, -24437, -15726, -57314, -43823, -46541, -83363, -97899, -89632, -39612, -31093, -35415, -54910, -64762, -56511, -43748, -8905, -3716, -45706, -28933, -31098, -18988, -30599, -57630, -82668, -64528, -27435, -18885, 8951, 27055, 39998, 16958, 2917, 8004, 40488, 34977, 11863, 2058, -13559, -24972, 24272, 58313, 41022, -3312, -62688, -66653, -36561, -59619, -85185, -68262, -63649, -40479, -7606, 17080, 12109, -13225, 13167, 48343, 15272, 13128, -1484, 1583, 4923, -46959, -54934, -41669, -31344, 643, 5390, -13962, -48031, -31539, -12477, -40767]
20518d0767l6054L0860l668l4909j1190M2629m229j0653Q301r502L0032M2734
20506C584N988N276J5837j6506k176L2677l0544j7220M603J4031J407l5746l3521
20493e2310N0528M3045J856l1028j8958j2931j3022K1440J3804p797k3373j8857
20481d7603N238K3652K0619j25m3875k1276K3399l4175l4651N351L772P432M0711
20468e1531j8211k9201l2628M5395O5965K8582m9745l1845J8963J0719L1826L477
20456h234k8525k0683K0554K135J9487l7500j1959K5027M2846j9954j9134o370
20444d2310K4027J7043k6377n1326K9139J9408L473K8203J5268j4536k6826l1208
20432e6022k372k6400K9648M9424J101j9944j2257m1781J6554K3144J7015Q94
$$ y = [-40767, -76821, -45961, -49629, -84538, -95728, -53099, -57328, -67981, -59680, -69182, -39150, 3584, 9572, 14848, 30685, 14179, 12003, 44680, 14136, -3084, 1519, 15550, 16957, -18789, -52310, -1782, 41263, 43119, 12091, -6867, -19798, -32820, -11380, 2424, -5373, -28746, -47603, -42365, -18713, 1906, 1781, -42094, -63370, -39971, -74146, -108797, -103446, -99674, -92242, -51531, -69742, -98943, -131571, -86176, -20211, 8371, -41374, -73219, -54256, -43537, -11711, -8234, -36759, -57442, -36888, -34753, -15266, -52766, -64725, -39698, 3148, -16806, -35940, -42310, -18283, -1240, -27617, -78943, -49804, -30396, -26923, 1280, 16548, 2012, -24814, -56022, -58394, -84794, -55146, -5722, -4621, -24565, -36822, -78603, -62049, -38905, -21890, -20996]
20420b0996K222r431j0610j3113L447K0612m817k1450o61j761q992K3366K2828
20407a9356O751Q102J3493J1760k9243J2825l8201K997n911J3038l0175K7907
20395b6013L0626J1566j2738j016J204P493Q898k4255j6202k9757k5923M2637
20383c3480M4184j1291m6554l1777l959K087k668M0197K0302K870M496J4702L489
20370B598l8614l2445N758k4520R78L2285R503N0987P613k6908K4039j0747O47
20357A174J8107J3740p763l5324J3956K9141P216j1380m7318J723J4840j0967
20345a2855K0119j4932j5291r408J506R494l708p699J3981j2455N700j4114p823
20332d7485Q922K6280Q986M526N614N200j186l4498m454j8774j0936K7831Q648
$$ y = [-20996, -18774, -28205, -38815, -51928, -48481, -27869, -32686, -54136, -54797, -56558, -65550, -42184, -19356, -12605, -4503, 8990, 20750, -8493, 4332, -33869, -30872, -36783, -23745, -53920, -26013, 4613, 16179, 3441, 2425, 3629, 11122, 20020, -4235, -20437, -50194, -76117, -33480, 10704, -587, -47141, -78918, -82877, -80790, -83458, -43261, -22959, -20089, -15593, -891, 2598, -36016, -68461, -62703, -87223, -86245, -53960, -44457, 6530, 14143, -12765, 11274, 527, 1174, 19281, 33021, 25258, -10066, 3890, 33031, 40247, 28867, -18451, -16728, -1888, -12855, 7264, -7668, -22959, -32367, -30861, -21367, -25075, -32774, -18793, -31248, -25548, -39662, -47485, -38563, -12283, -3297, 1229, 6843, 12043, 10857, -23641, -28095, -46869, -57805, -29974, -21326]
20319b1326Q134j7812J6853j2610l117K043M1546j5486k3327k7263j9242K1312
20307e0295K8823K1859l6527P035k2270L0632L2338O5j9966m0223K149r210J8772
20294c6818J3897m627J2408L5099l0559J1928j1069j9764J8082p01Q775O591p182
20281c940m0087l5523o485j3661K581J9719J618L603K0927J011k8812L03j0323
20268h9069Q784o473Q344K1197L0672N2140L0762k7865j5986N574o989p505l5444
20255c1858l2916l8394j4178J4050K1860J0357J6580K7814l329l0374O968j0453
20243f3873K5615L1103J0650J2596m3730k3280K6639j534j501Q636Q014j1601
20231b2266k2153J8191J5843k9312o21K5200K5786j6067j8221K056k5359m2577
$$ y = [-21326, -13192, -31004, -14151, -26761, -29878, -27835, 13711, -1775, -25102, -52365, -71607, -50295, -21472, 387, -36140, -29105, -51375, -20743, 11595, 11660, -8306, -48529, -46380, -55590, -36818, -22921, -27548, -15140, 19959, -10600, 1328, -9741, -29505, -11423, -12124, -3349, 3242, -3940, -44027, -79550, -86035, -99696, -97115, -77396, -75778, -72175, -51248, -50237, -79049, -78746, -89069, -80285, -86758, -78414, -57217, -26545, 25595, 56357, 28492, 12506, 18080, 11091, 3586, -31858, -64774, -103168, -117346, -103296, -81436, -71079, -54499, -26685, -30014, -60388, -53420, -63873, -38258, -7155, 3495, 16091, -27639, -50919, -24280, -25814, -27315, -18679, -10665, -22266, -44419, -26228, -10385, -39697, -40318, -15118, 10668, -5399, -23620, -21564, -46923, -89500]
20219h9500l3090L5709N4435P932r935j5161J4596M0522P387j2416M025j6175
20207a1671o0k0006L8009R598l7831L5544k3601l1634j6253K936k0O827k2606
20194g0768k0659j731P940k4622L4939M0333O657l7760p339J9115K1998M5644
20182A3747m949n1751j4775K8640l6988j5648L092k0526j5752j53N910j574J6154
20169i4573K4678J847L969K0537K7857K1112J7883k7248j5753J0317n2137l372
20157f4883N4918j6291j7520j2248k1472j6187J1733L3904L2869j0491R038J7518
20145H88k8161J6763K1564k6877l0145J4644j9016m2061p703M6497K4670k5504
20133e4441j3747k4478O303q67l167L0889J2652M9114r054m6961m844K5098J0516
$$ y = [-89500, -122590, -86881, -32446, -24514, -34449, -49610, -35014, 5508, 12895, 479, 4504, -11671, -11731, -31737, 6272, 15870, -21961, 13583, -10018, -41652, -57905, -54969, -54989, -48162, -70768, -91427, -93158, -85218, -109840, -74901, -34568, -27911, -65671, -73010, -53895, -31897, 13747, 8798, -42953, -57728, -29088, -66076, -81724, -78632, -99158, -114910, -115063, -109153, -110727, -94573, -69895, -68048, -64079, -43542, -15685, 5427, 23310, -3938, -19691, -9374, -61511, -64883, -9965, -26256, -43776, -56024, -77496, -93683, -81950, -48046, -15177, -25668, -16630, 888, -27273, -10510, 11054, -15823, -45968, -31324, -50340, -92401, -100104, -53607, -28937, -54441, -68188, -92666, -86363, -87230, -90397, -59508, -46856, 2258, -6796, -53757, -58601, -33503, -22987]
20120b2987j7533k6662J5606J7210R901l361j5844j4806J6265m512K165L990K007
20107c8561k7628o631O843J2852K8885K5960Q624j2550k3848k3455K409r344j3343
20094f9787J7218k8845L2671J7289K8266K4356P674K620k4385l0696j2417J6269
20082a9767m0340p612q986j7989P065M9851M65J3601J9845p728m2850O522J4468
20069c3455J5142o24k7020l12K1939m635j9379k2191m3178K4955L4158j0475R395
20056e5680N3096l959k9442j8203J4095J8218P02m730p663N122J272N283R362
20043a2527J1664l6112k1850k674J7863j5199j6242k2344J2786M0046J8384k578
20031b8783J0377L277L753q625K7963q12n2282j9320K2358J9096J0689L6810j3908
$$ y = [-22987, -40520, -67182, -51576, -34366, -24465, -27826, -43670, -58476, -42211, -46723, -44558, -40568, -38561, -66189, -72820, -65977, -53125, -24240, 1720, 10344, -2206, -26054, -49509, -47100, -56444, -69787, -52569, -81414, -48743, -31454, -3188, 21168, 28842, 31462, 7077, -23619, -36036, -19767, -60107, -67719, -76705, -94694, -87629, -37778, -37313, -23712, -3867, -11595, -54445, -47923, -33455, -18313, -18937, -45957, -46269, -24330, -28965, -48344, -70535, -113713, -88758, -54600, -65075, -55680, -2584, -6543, -35985, -54188, -40093, -21875, -21173, -25903, -33566, -28444, -27172, -21889, -12527, -863, -36975, -58825, -61499, -43636, -58835, -75077, -97421, -84635, -44589, -26205, -28783, -18406, -15129, -11376, -20001, 7962, 7150, -45132, -64452, -42094, -22998, -12309, 24501, 10593]
20018A0593l3081o414k6690m0782M4919K0488K652K1784j0711p632J2652n914
20006a8136M168l8541k2366j9603K0764J6577O661N4114j8724m0991M26K47J7580
19993c7824r914N892j7143m004K1308j0376l747J0647L6859J1027N1292l952L815
19980E3880k8753m5599j3298J5601J8244K8759J2044l8212j1006J1456j6369j7593
19968c0846j688k336m09K5685r904j1981o897q177j05p419L4625J5517l2734j6969
19954e3638o684M3536L1722Q082j7164m6832m4452L0463P414J2117K5701p727
19942a7462j2502j6071K6909j3346J407J6929m5658o077P820J2303J286K4039
19930b0423Q390k0090K401K287l3182k2254J2547K7324J1693k7052j1495J5146
$$ y = [10593, -22488, -28902, -55592, -96374, -51455, -30967, -28315, -6531, -17242, -24874, -12222, -18136, -13968, -52509, -74875, -94478, -73714, -57137, -50476, 3638, -15086, -56077, -55651, -55404, -37824, -47738, -41846, -58989, -62993, -41685, -52061, -55808, -45161, -8302, 2725, 54017, 50065, 53880, 25127, -20472, -33770, -18169, 75, 28834, 40878, 2666, -8340, 3116, -13253, -30846, -32534, -34870, -35279, -9594, -19498, -31479, -38376, -46553, -46658, -54077, -19452, -3935, -36669, -53638, -60322, -16786, 14936, 23018, 5854, -40978, -85430, -54967, -47553, -35436, -9735, -17462, -29964, -46035, -19126, -32472, -31065, -14136, -59794, -65871, -58051, -45748, -44462, -20423, -12033, -32123, -29722, -27435, -60617, -82871, -70324, -43000, -31307, -58359, -69854, -54708]
19918e4708k4291J6584K8604J6192q935j7309k4143J3902p323L8781M8247l5911
19906a0310k5407k465J4476J3528O117N1693M2663Q694l7741l6996n418K4341
19894D3175R688K5841M4633N9100J2623J011K8610M1580M5974O1708L1806K9757
19882D35506L3631q299P00j165j8233j5669k0451N4045K8460k697j4044K9739
19870E01523j1194m0098K7327L3430N266O245m6934m9938n4211q8169m9050k9823
19858B04374m4956m0731m741k0104k3887j9009k7583J253J8470K0647J2295j2709
19846F3319j0522k7408J56j9710k3240r181j0289j5987n641K0404J3732k074K463
19833b3978Q6194J1475j9968K334j0623p036O023k891n024r999o185k9307O697
$$ y = [-54708, -78999, -62415, -33811, -17619, -26554, -43863, -68006, -54104, -61427, -22646, 25601, -10310, -35717, -38182, -23706, -10178, -4061, 47632, 90295, 98989, 61248, 24252, 18834, 43175, 52863, 78704, 123337, 182437, 195060, 196071, 224681, 266261, 312235, 373943, 405749, 435506, 469137, 460838, 461538, 460373, 442140, 426471, 406020, 460065, 488525, 485828, 471784, 501523, 490329, 450231, 477558, 510988, 516254, 522499, 475565, 425627, 371416, 283247, 234197, 204374, 159418, 118687, 113946, 93842, 69955, 50946, 23363, 24616, 43086, 63733, 76028, 63319, 52797, 25389, 25545, 5835, -17405, -26586, -36875, -52862, -58503, -38099, -24367, -26441, -23978, 62216, 73691, 53723, 56057, 45434, 38398, 44421, 41530, 36506, 26507, 20322, -8985, -2288]
19820b288K5221O765J2121k3593J4819L2838m472l1465o0422o139J2818L2233
19808H436M97n8286j2147L955N101j3139O116K0288L5553J6018n1187K2887R965
19795e943J511j6695P050L36j112k0257j2741L7544r150m1651J7207L3422R186
19782a293K7266j1723l5792l320j420K3066J0847j9343k6432K1991j9548L967
19770c1734K4150J9389l5043r695K6785K2305K9998J300j5273J2630k2001k2560
19758B51J165k3094R123q20j8376p067O336N668K3894J7646M203k7974m7677p83
19744e7505K031n343j6746L0768J9729J0006O014k3564k9395P253K5168N418P033
19731a9133k906p977k4942M22l8721J0662J2218J0950J3348L0616o536J0419n0220
$$ y = [-2288, 22933, 29698, 41819, 18226, 33045, 65883, 61411, 29946, -30476, -36615, -23797, 8436, 8933, -49353, -61500, -57545, -52444, -65583, -59467, -39179, -3626, 12392, -38795, -15908, -5943, -4432, -21127, -14077, -13741, -14853, -35110, -47851, -10307, -19457, -61108, -43901, -10479, -1293, 25973, 14250, -21542, -24862, -26282, -3216, 7631, -11712, -38144, -16153, -35701, -31734, -7584, 11805, -23238, -32933, -6148, 16157, 46155, 47455, 32182, 44812, 22811, 251, 1416, -21678, -12555, -13375, -31751, -38818, -32482, -26814, -2920, 14726, 18929, -9045, -56722, -57505, -55474, -60817, -77563, -46795, -27066, -17060, -11046, -34610, -64005, -56752, -31584, -26166, -19133, -22039, -30016, -54958, -54536, -93257, -82595, -70377, -59427, -46079, -15463, -21999, -11580, -61800]
19718f1800N659O295K4467J4391k5024Q783k3542J9673L0509j5685j7787J234
19706c2827j1490n306o292O283j585J5320M4253k3710k9595j4018K6417R186l8156
19693f1520J3984L5930N315J3114k3847j6776j527K7730R654k4335j7726J7777
19681b2227k251r160p779k8583l2521K8928L7777K0471J8985l25l0392j4825l60
19668d2262K9994j868l3911J7397K7883q765L3290j116k3725j088k7885l2119
19656f4175k6044J4722o417k3352j1298M2145K2547L0274j3753j0417j812j6181
19644f3761M439J24O063k0468l8279J0350O3211K6775m192R600k6082o5636l4908
19631a32764j8165R407P6146Q6744J6399j8494K2218k0404k7648M7618J3577k0717
$$ y = [-61800, -56141, -49846, -25379, -10988, -36012, -27229, -50771, -31098, -589, -16274, -34061, -32827, -44317, -49623, -55915, -49632, -51217, -35897, 8356, -15354, -44949, -58967, -32550, -23364, -61520, -47536, -11606, -6291, 6823, -17024, -33800, -35327, -7597, 2057, -22278, -40004, -22227, -24478, -33638, -41417, -70000, -102521, -73593, -35816, -15345, 3640, 3315, -27077, -41902, -42262, -12268, -14136, -48047, -30650, -2767, -11532, 21758, 20642, -3083, -4171, -32056, -64175, -90219, -75497, -81914, -105266, -116564, -74419, -51872, -21598, -35351, -45768, -47580, -63761, -59322, -59198, -53135, -73603, -111882, -101532, -38321, -11546, -15738, -6138, -32220, -97856, -132764, -150929, -141522, -65376, 21368, 37767, 19273, 41491, 21087, -6561, 41057, 54634, 33917]
19619C3917J2368J6789m308j6345k0052J4376L4091k3188q079J9456J4505K6405
19607I9935L579O499j8277o6160K6619J6019k6080R139P345j7439j4418k0685
19595F076L3705j9836j0607j2721j1635M554J8541n479P680L2149K2917k5897
19583C9447R39j1196l6295j8572k2068r25L9866K3503n854n1092J5239M0035K1082
19570C4109l1612R266k5571j8036l669J7067j4432l0399L7021n526k5280M5779
19558a1283m026J723j0714l3863l142j9875m933N091j5776M8194K9338k1745m605
19545d5616K9833N519q511j3893m9459k8780N014M3012O3506k543j1497O70Q390
19532d355J3437J5531o47j342J454J9693k3944j8252J918R382k900K1713m3422
$$ y = [33917, 46285, 63074, 58766, 42421, 22369, 36745, 70836, 47648, 39569, 59025, 73530, 99935, 103514, 110013, 91736, 25576, 52195, 68214, 42134, 51273, 58618, 41179, 26761, 6076, 39781, 19945, 9338, -3383, -15018, -10464, 8077, 2598, 10278, 42427, 65344, 39447, 40386, 29190, -7105, -25677, -47745, -48670, -8804, 14699, 8845, -42247, -27008, 13027, 34109, 2497, 11763, -13808, -31844, -35513, -18446, -32878, -63277, -26256, -31782, -57062, -11283, -15309, -13586, -24300, -58163, -61305, -81180, -86113, -81022, -96798, -48604, -19266, -41011, -45616, -15783, -10264, -18775, -32668, -82127, -110907, -105893, -62881, 625, -1918, -13415, -12745, -4355, 9082, 24613, 23966, 22624, 24078, 43771, 19827, 1575, 3493, 12875, 9975, 31688, -11734]
19519a1734m2207O079J0305j8053J1928J9718J0730O469k925l1153J477J4035
19507b5331M5014J918J0181k1191p749n609k007J6759O797L0831j9079j6047j6228
19494a741k5361J6139J7164q491J6357M5556l3671J4553J2988j6678k7926r837
19482i48L6558L7936M8955j0379j9656p004k2559L0582Q824k5476l3287P881L672
19469E5099K8424j0105j8677m49K2306J8296J3363j9412l1151l0952k5397K643
19457C988P621J2637l027j8218J4704M0574J5202n618k001j602l0557m0680K5151
19444A8174N2925J053j2044L0164L5097K1036l7086k2952j394O042L0073K4128
19432A45216P083J5967M6906O5392K602N2567P4334K5103j6961R960O8086O6971
$$ y = [-11734, -53941, -47862, -37557, -55610, -43682, -23964, -13234, -6765, -9690, -40843, -39366, -25331, 19683, 21601, 31782, 10591, 2842, -2767, -4774, 11985, 18782, 49613, 30534, 14487, -1741, -27102, -10963, 6201, -2290, 14067, 59623, 25952, 40505, 53493, 36815, 8889, -948, 35610, 73546, 122501, 112122, 92466, 85462, 62903, 93485, 102309, 76833, 43546, 51427, 55099, 83523, 73418, 54741, 54292, 76598, 94894, 108257, 88845, 57694, 26742, 1345, 3988, 11609, 24246, 21219, 3001, 17705, 58279, 73481, 67863, 65862, 64260, 33703, -6977, 18174, 71099, 72152, 60108, 90272, 125369, 146405, 109319, 86367, 84973, 91015, 121088, 145216, 152299, 168266, 215172, 280564, 283166, 335733, 410067, 435170, 418209, 428169, 496255, 563226]
19420E63226N591m7847l4318L8509N7040L4767N2996Q8147P9041L8106K9949O2183
19408I67390N2207M6721N9936J6415m1257K4658J7591L3716P5673P7886J40620
19397A471556J62395J42991J74432J92690K15865K53744K45826K54359K57371
19388C371229K86859L32641L65787M33496N12696O35282Q44873J095927J599261
19379I478051K381418L420649M600938N726040O738267P567548Q564388R729805
19371E8207104J0176608R708749P830104N508672M141046K020672K40758r57168
19363I6876545k168527k638405l402731k929754r60990J138489L203254M385225
19355I3503106M789602L853068K257831J419267m67880k530587m669304p069863
$$ y = [563226, 568817, 520970, 486652, 525161, 582201, 616968, 669964, 758111, 837152, 875258, 905207, 967390, 1019597, 1066318, 1126254, 1142669, 1101412, 1126070, 1143661, 1177377, 1253050, 1330936, 1471556, 1633951, 1776942, 1951374, 2144064, 2359929, 2613673, 2859499, 3113858, 3371229, 3658088, 3990729, 4356516, 4790012, 5302708, 5937990, 6782863, 7878790, 9478051, 11859469, 15280118, 19881056, 25607096, 32345363, 39912911, 48477299, 58207104, 68383712, 78092461, 85922565, 91431237, 95572283, 97592955, 97833713, 96876545, 94708018, 92069613, 88666882, 85737128, 84776138, 85914627, 89117881, 93503106, 98292708, 102145776, 104403607, 105822874, 105354994, 102824407, 98155103, 91085240]
19347I1085240q595490j0339446j0885191r742912q518417p511622o590314n439374
19339B3462474m059054k918004k104010j522984j128749q85317p08750o18874
19331I516732n74425n02358m56484m41861m45600m75343m17933l87388l96445
19322E418895l54119l11523k83185l07964l01695k39930j86344j65300j36216
19313C132619j67199j25173o2430m2660r6323j10446o4586n9211n4952m9575m0486
19302B259578J2622m7133j30j5241l1413l3086n646r91q984l462l2227k8120m3496
19289B022271l7710k8586l639l0256m5959n0241r2532n9156j3796m0014m1506
19278A578876n3107n9639l2791k2692o2067k5228j5581q0042o3509k7902o5949
$$ y = [91085240, 82489750, 72150304, 61265113, 51522201, 43003784, 35492162, 28901848, 23462474, 19403420, 16485416, 14381406, 12858422, 11729673, 10844356, 10135606, 9516732, 8942307, 8439949, 7983465, 7541604, 7096004, 6620661, 6202728, 5815340, 5418895, 5064776, 4753253, 4470068, 4162104, 3860409, 3620479, 3434135, 3268835, 3132619, 2965420, 2840247, 2777817, 2735157, 2638834, 2528388, 2463802, 2404591, 2349639, 2300064, 2259578, 2272200, 2225067, 2224937, 2209696, 2178283, 2145197, 2139551, 2138560, 2129576, 2126114, 2093887, 2065767, 2022271, 1984561, 1955975, 1952336, 1922080, 1876121, 1825880, 1733348, 1674192, 1660396, 1620382, 1578876, 1525769, 1466130, 1433339, 1410647, 1348580, 1323352, 1307771, 1227729, 1164220, 1136318, 1070369]
19267A070369m5815R37l9945l7148j3522l1861k0850m6997j6297L0707K6509k3105
19255H52982J7164k233K6968L8034N971K5240l580O610k7862n942K3470j6166
19243I40656k7034k4495o919j1592K2612L555k8082l9840m194j95J8425J1032
19231H53929m0279l7274J8491J1026k9151m3700l2055m2971n7815j8818k6344
19220E55039n9027k6802K0052k5788p3582m7675l8765j8306O668R524l2304j2876
19208B56158M860K2072N344O649L620l3790l5024Q792J3144l2975M4662J0946
19196B74458J3617J2897K193o559O688j9728k8155K8264K529n750K531M759N0251
19183C37995L0481J3527J2894n433k3513n223L884j7366l2950l9823J5173O1074
$$ y = [1070369, 1024554, 1025491, 985546, 948398, 934876, 903015, 882165, 835168, 818871, 849578, 876087, 852982, 870146, 867913, 894881, 932915, 938886, 964126, 960546, 967156, 939294, 933352, 956822, 940656, 913622, 889127, 882208, 870616, 893228, 896783, 868701, 828861, 824667, 824472, 842897, 853929, 813650, 776376, 794867, 805893, 776742, 733042, 700987, 658016, 600201, 581383, 555039, 496012, 469210, 489262, 463474, 389892, 342217, 303452, 285146, 291814, 301338, 269034, 256158, 261018, 283090, 288434, 295083, 298703, 264913, 229889, 238681, 251825, 218850, 263512, 274458, 288075, 300972, 303165, 296606, 303294, 283566, 255411, 283675, 286204, 280454, 282985, 287744, 337995, 368476, 382003, 394897, 389464, 365951, 360728, 364612, 347246, 314296, 274473, 289646, 350720]
19171C50720M2225m1560m7862J7049J5244j7979j1242L327q381O066K8459j958
19159C34108L1828j1811m7099j5621j3674j2320j2102Q635k0236K0190q183L206
19147B56921l2611p398k1294j4158J616k7035P298L0312J6632J4531m123k9072
19135A91619Q525l5404M217K6102j3245J6631j8687m032Q764R074j5570l6105
19123A41889k2271K8649j0040q821p481N0226O1129j1388j9234k0329m4437J9103
19111A56995j1390m757O8152l4873m6859K5552L847N851j0312j8568q362j6810
19099A08466K69q660P774l0691L5692M3268L2386K0341p416l2789m7822l699k8485
19086H8634J7324j2404k8602K2239K8244K1480p54k1462J5543q052j1091N2977
$$ y = [350720, 392945, 351385, 303523, 320572, 335816, 317837, 306595, 309922, 301541, 307607, 336066, 334108, 365936, 354125, 307026, 291405, 277731, 265411, 253309, 261944, 241708, 261898, 253715, 256921, 224310, 216912, 195618, 181460, 183076, 156041, 163339, 193651, 210283, 224814, 220691, 191619, 200144, 164740, 168957, 195059, 181814, 198445, 179758, 175726, 184490, 193564, 177994, 141889, 119618, 148267, 138227, 129406, 121925, 172151, 233280, 221892, 202658, 182329, 137892, 156995, 145605, 140848, 209000, 174127, 127268, 152820, 156667, 162518, 152206, 133638, 125276, 108466, 108735, 100075, 107849, 77158, 112850, 156118, 188504, 208845, 201429, 168640, 120818, 117119, 88634, 105958, 93554, 64952, 87191, 115435, 136915, 136161, 114699, 130242, 122190, 111099, 164076]
19074A64076q188j6679m485K393J0648K296l3704K7563L8835j5514j9137J5973
19062A64077L5460K4021k3795j4663n67J1494j2142P807L2569n20l7715N685J2509
19049B04220j6191k022m0695j0405k276K601j7901l7098k7459L1983J4518j5089
19037H4186J4459J4212Q70o080n9848k3303O0050L2554l8121q377J4880k0446
19025F5036P326J951j5706l0914j034r96N7996N1730N639l902j0798p823J1815
19012A30320j2835j8900K859o098k451j1558r244L8733M36M382J400J475l5134
18999H3385l0926J4127J0994j5807K8744J3323l2230J1679j3189j4736J0102L2000
18987I7466L1936j5146J4027J3600j7266J9418K2473j1673n108L5505J3672K1636
$$ y = [164076, 155888, 139209, 134724, 137117, 147765, 150061, 116357, 143920, 182755, 167241, 148104, 164077, 199537, 223558, 199763, 185100, 184533, 196027, 183885, 191692, 224261, 223741, 186026, 191711, 204220, 188029, 186007, 145312, 134907, 132631, 135232, 117331, 80233, 52774, 84757, 99275, 84186, 98645, 112857, 113727, 107647, 47799, 24496, 84546, 117100, 78979, 70602, 85482, 65036, 72362, 74313, 58607, 27693, 26659, 25663, 83659, 135389, 141028, 137126, 126328, 118505, 130320, 117485, 98585, 101444, 95346, 92895, 81337, 72093, 110826, 111262, 115644, 117044, 118519, 83385, 52459, 66586, 77580, 61773, 90517, 103840, 71610, 83289, 70100, 55364, 65466, 97466, 129402, 114256, 128283, 141883, 124617, 144035, 166508, 154835, 149727, 185232, 198904, 220540]
18975B20540j6580m6114Q221Q339M381J788k4478Q110L744R810M2980p452j340
18962B11949L3359J8751O253j2972K6592M3386N4419J5128N881K299j8165N1106
18950D37986L9654k733N1533P3540L4144l407L6867P8196M3269N5098Q3486Q5282
18938A012915R2826J37031J05580O2165M8212J16340J22554Q5119J03071J68626
18928B054439J88851K06446K39623L59542M55757N42858O58100R06889J395553
18919G008058K104414L018139L904206M632030N210843N642806O210131O366994
18911D4097621N437405K922103L73816L6900k20856k095927m712382m663999k664816
18902C8509865j199365l51507O57035J998820L389208M127459L669777J703788
$$ y = [220540, 203960, 157846, 166067, 174406, 178787, 180575, 156097, 164207, 167951, 177761, 220741, 213289, 211949, 245308, 264059, 270312, 257340, 283932, 327318, 381737, 396865, 402746, 405045, 386880, 437986, 477640, 474907, 526440, 599980, 634124, 630717, 667584, 745780, 789049, 844147, 927633, 1012915, 1105741, 1242772, 1348352, 1410517, 1458729, 1575069, 1697623, 1782742, 1885813, 2054439, 2243290, 2449736, 2689359, 3048901, 3504658, 4047516, 4705616, 5612505, 7008058, 9112472, 12130611, 16034817, 20666847, 25877690, 31520496, 37730627, 44097621, 49535026, 52457129, 52830945, 52867845, 52646989, 50551062, 45838680, 41174681, 38509865, 37310500, 36958993, 37616028, 39614848, 43004056, 47131515, 50801292, 52505080]
18894E2505080n23146r10346j234417l127574n850970o359200n308035m594304
18886B4597088m364432l839803k916986k073516j426217r60359o88189m97509
18878G830077l86790l25837j83925q2769n5729j3303P4066J76103K35252L31356
18868G598501M99855P82530J225456J914543K804262L826305M683602N405041
18860B8740095N967545O591405P048677O523667M420804J315641J58673R9887
18852F0866394j335731m417868n655231l939871j931767q26876Q6162J610775
18844D4455987L273387M526613M556654K944135J74900r05775j059252k496388
18836E5470261n626519p430324o534853n529460n252452m823150l883411k829615
$$ y = [52505080, 51981934, 51071588, 49837171, 46709597, 40858627, 34499427, 29191392, 24597088, 20232656, 16392853, 13475867, 11402351, 9976134, 9015775, 8327586, 7830077, 7443287, 7117450, 6933525, 6850756, 6795027, 6781724, 6855790, 7031893, 7267145, 7598501, 8098356, 8880886, 10106342, 12020885, 14825147, 18651452, 23335054, 28740095, 34707640, 41299045, 48347722, 54871389, 59292193, 60607834, 60766507, 60866394, 59530663, 55112795, 49457564, 45517693, 43585926, 42759050, 42845212, 44455987, 47729374, 52255987, 56812641, 59756776, 59931676, 59025901, 57966649, 55470261, 49843742, 42413418, 35878565, 30349105, 25096653, 20273503, 16390092, 13560477]
18828A3560477k039056j481317j155860r06353p27647o26746n06289l99380l80462
18819E337367l47267k62053k16635j96800j99049j89663j82598j55387j22929
18810C464986k31058k28163j81691j57306j26965j05794r6050j27310j18986j18948
18800A972715n6174l4184l6704l6369m0725o3986n2746o5448l7763j0628n2687
18789A485301l6604k0914l9227l906j8451n847M0402j8555l8323J187l4590l8595
18777A271878l2497k3589l0630l7125k588L026K5732L1243O3730N4642j391j2218
18765A310213j32309j03422n0794l4680Q769j2311k5293k4991m1411l3228o2748
18754G97795o7507j1917K3049K5577j5459j7925K0510p92m6995m6568k8794J0004
$$ y = [13560477, 11521421, 10040104, 8884244, 7977891, 7250244, 6623498, 6117209, 5717829, 5337367, 4990100, 4728047, 4511412, 4314612, 4115563, 3925900, 3743302, 3587915, 3464986, 3233928, 3005765, 2824074, 2666768, 2539803, 2434009, 2337959, 2210649, 2091663, 1972715, 1916541, 1882357, 1845653, 1809284, 1768559, 1704573, 1651827, 1586379, 1548616, 1537988, 1485301, 1448697, 1427783, 1388556, 1384650, 1366199, 1360352, 1400754, 1382199, 1343876, 1345063, 1310473, 1271878, 1239381, 1215792, 1185162, 1148037, 1145449, 1148475, 1174207, 1205450, 1269180, 1323822, 1322431, 1310213, 1177904, 1074482, 1023688, 989008, 997777, 985466, 960173, 935182, 893771, 860543, 797795, 730288, 718371, 741420, 766997, 751538, 733613, 754123, 753331, 706336, 659768, 630974, 640978]
18742F40978J4600o36L698j4184n9228q6412j2042Q935L782M8443L9524j6229
18730E71229j6893Q75K7840P467k2191p535k042J5271K5867K3223k0907n9664
18718E42540k5501K302j0311l0841k4441l6790L750L9348K7832K2983k3093n245
18706D82533J4222M9959K4002L065l4767j1098K752l0204m1584j741k4349j5152
18694D17638L4732M1392K1160j5809J4664K3101k6266k1013O639M3029k0981m9584
18682D68702n2512j4776o5007l0155J586K426J2568J6631J6758Q314j1118L0772
18670C84189J3821k586k1793J3468j7195k8821l7867l3197l5404M600K2059K2664
18658B83938k7446n0744j9271K2718O5387M9037M6642M1587N1975K1663l3454
$$ y = [640978, 655578, 654942, 658640, 644456, 585228, 498816, 486774, 495709, 499491, 547934, 587458, 571229, 554336, 555211, 583051, 590518, 568327, 560792, 558750, 574021, 599888, 623111, 602204, 542540, 517039, 519341, 509030, 478189, 453748, 416958, 420708, 460056, 487888, 510871, 487778, 482533, 496755, 546714, 570716, 573781, 539014, 527916, 530668, 500464, 458880, 457139, 432790, 417638, 452370, 493762, 514922, 499113, 513777, 536878, 510612, 489599, 496238, 539267, 518286, 468702, 416190, 401414, 336407, 306252, 307838, 310264, 322832, 339463, 356221, 364535, 353417, 384189, 398010, 395424, 373631, 387099, 369904, 341083, 303216, 270019, 234615, 239215, 261274, 283938, 256492, 205748, 186477, 209195, 274582, 323619, 370261, 411848, 463823, 485486, 452032]
18647D52032P254J4606j8338j3103k8160n46n798L0803N607N0422K8268J9209
18635E42256L427k5227k1196j2209J7480L3838K3530k0666k6745k8274k3808j3694
18623D48712k4157n3677j7866J1932K1720K82L803m7887n2961j405J7522k8968
18611B77050m6379k9107l936N852Q081k0516J767J1650J7777j0978l2623k2011
18599A56627L6579K9294k7010q1306k3403L565j749l737M9416M0839J2853L0675
18587B22643m823o199p816j3959k3629j7Q480m573j8587L037P659K3491o939M17
18573A79185j3040k477J2857J4744k347K7311J8404K52l1697M725K3960J0563
18561B42440M24j1878j6682Q463K212P367j8077R315L279j1697p627J8556K1268
$$ y = [452032, 459286, 473892, 455554, 442451, 414291, 413745, 407947, 438750, 444357, 494779, 523047, 542256, 545683, 520456, 499260, 487051, 504531, 538369, 561899, 541233, 514488, 486214, 462406, 448712, 424555, 370878, 353012, 364944, 386664, 386946, 390749, 342862, 289901, 288496, 306018, 277050, 230671, 201564, 197628, 203480, 211561, 191045, 192812, 204462, 222239, 211261, 178638, 156627, 193206, 222500, 195490, 114184, 90781, 94346, 92597, 88860, 138276, 179115, 191968, 222643, 217820, 211621, 203805, 189846, 166217, 166200, 174680, 170107, 151520, 154557, 162216, 185707, 178768, 179185, 166145, 163668, 176525, 191269, 188922, 216233, 234637, 234889, 203192, 207917, 231877, 242440, 242864, 230986, 214304, 222767, 224979, 232346, 214269, 223584, 226863, 215166, 207539, 226095, 247363]
18548B47363Q777P994L2463L1898r483l5229J3582J473o3903n4680L7642L4207
18536B52104m058q343K0667m0157j7330J1959q710j7574M9890N1117n49l3445
18524B55571k9387k7722m017R722j0870K5805L1206r178l3308k8295m151J5420
18512A90796J650L4374K6182J5429L748N5333N11O819M8239M4584M1978J04792
18500E74435L5050K0091L3636K8715J3696j2214n5025l0815k1145k5558q5945
18489D74921l7407m5492k4963k7874m8171m3224j3123l2066l3829k928K6532m518
18477A87858j7243L391J609j4808J0545L5527J6062k782n6813R788K8002q813
18465A92323J1849m556m0956l6202k9294L535K6320J6743j8799n156K4943J7397
$$ y = [247363, 256140, 264134, 296597, 328495, 319012, 283783, 297365, 298838, 234935, 180255, 217897, 252104, 248046, 239703, 260370, 220213, 202883, 214842, 206132, 188558, 238448, 289565, 289016, 255571, 226184, 198462, 194445, 204167, 193297, 219102, 250308, 241130, 207822, 179527, 175376, 190796, 192446, 226820, 253002, 268431, 272179, 327512, 328023, 334842, 383081, 427665, 469643, 574435, 609485, 629576, 663212, 691927, 705623, 693409, 638384, 607569, 586424, 560866, 474921, 437514, 392022, 367059, 339185, 291014, 247790, 234667, 202601, 168772, 165844, 192376, 187858, 170615, 174006, 175615, 160807, 171352, 206879, 222941, 220159, 163346, 173134, 201136, 192323, 204172, 199616, 158660, 122458, 93164, 96699, 123019, 139762, 120963, 115807, 140750, 158147]
18453A58147j5543J7910M9403O1230M0957N8027J5529M589O9651J9933J236M6278
18441E27347M7669m0521k1632l5336n6861m0430p2621n2168k1093M2518j4276
18430B62596m8988l6399m2487q172k8393l6237m1709j497L9549R608J1813j0000
18418F9684J2535j269l0501n204L3345O525l7233L589L3483n108j8933Q103r154
18405E9862J0934m0007k7972J5173L6409J9546J4086L215M0156O4399M1121M0676
18393B77598J341j2040J8763K2397j8082j7031o079k9135k457N6524P372M668
18381C03839L275P051j0891k6412j238J9394j4338n3125l5119k6794l8731K9544
18369A56455M923K840j3277k8715M237L6265j2630K310K1671M706o9115l0325
$$ y = [158147, 142604, 160514, 209917, 271147, 312104, 370131, 385660, 390249, 459900, 479833, 481069, 527347, 575016, 534495, 512863, 477527, 420666, 380236, 307615, 255447, 234354, 276872, 262596, 213608, 177209, 134722, 126550, 98157, 61920, 20211, 18714, 58263, 67871, 79684, 69684, 82219, 80950, 50449, 45245, 78590, 85115, 47882, 51471, 84954, 79846, 60913, 69016, 59862, 70796, 30789, 2817, 17990, 54399, 73945, 88031, 91246, 131402, 195801, 236922, 277598, 278939, 266899, 285662, 308059, 289977, 272946, 266867, 237732, 235275, 291799, 299171, 303839, 307114, 314165, 303274, 276862, 275624, 295018, 280680, 227555, 192436, 165642, 126911, 156455, 161378, 164218, 150941, 122226, 126463, 162728, 150098, 152408, 174079, 178785, 109670, 79345]
18357G9345k3940L2586m026L068j3064J4942j0887J7794k2791R980J3902R782
18345A06691M1638M9542N4351M5757L0975J2914N078J0063q494J7607j6473n1779
18333B97870k7482P527J5897j0854P890J2470l0095L3186J0678J6181K9262o304
18321C56226J0871J3510l199l2157l7709k4176m8960j7140K066p703k2446j4734
18309A74449j9969l8413m1778k4779J1838K2215k6103J226L2050j1259j1827l6556
18297C1094p292L9123L4030k1874j6598K3938J7999K5168J5423j9108j9221j0405
18285I2277m0884k0011K8177O449n678J5637K5704j8152m791P249R93J1479j4457
18272H3992l124j8406j0736j1121j3903Q896N3222K8969j0247K1285j590o291
$$ y = [79345, 55405, 87991, 83965, 87033, 73969, 88911, 78024, 95818, 73027, 83007, 96909, 106691, 148329, 197871, 252222, 297979, 328954, 341868, 346946, 357009, 348515, 366122, 349649, 297870, 270388, 277915, 293812, 282958, 290848, 303318, 273223, 306409, 317087, 333268, 362530, 356226, 367097, 380607, 377408, 345251, 307542, 283366, 234406, 217266, 219332, 211629, 189183, 174449, 154480, 116067, 74289, 49510, 61348, 83563, 57460, 58686, 90736, 79477, 67650, 31094, 23802, 62925, 96955, 75081, 58483, 82421, 100420, 125588, 141011, 121903, 102682, 92277, 51393, 31382, 59559, 66008, 60330, 75967, 101671, 83519, 78728, 85977, 86970, 98449, 83992, 80868, 62462, 51726, 40605, 26702, 35598, 88820, 117789, 107542, 128827, 127237, 120946]
18260A20946j3119n425K842N0358j4119o102k9429L9101Q188m4O958o055J4589
18247A68689J8668J9597J4035J1492k1252M033l626M237j5011J4082n2231k7338
18235A35375K3639K0116K000m7453k1839M3199K5627P405k173l0267j1194k5392
18223A19043R565L0926m887j3932Q236P621m1925j0847K2620k1991J228n233n881
18210I4543L2866k988j56j6250j8997l6174P098l431L1399l3928l7245M0103K5062
18197H1902k4664J1096L693k1900n935M3522K1116J6870P702K2907M876k3100
18185A38085P384J0905l3641J5884p63j2859n678j1489Q676j0626q932j9743J4534
18172I1737O4073j253k819R246J3384l1484n8894r842L1248J7174M5914Q903j5475
$$ y = [120946, 107827, 102402, 105244, 155602, 141483, 135381, 105952, 145053, 153241, 153197, 160155, 154100, 168689, 187357, 206954, 220989, 232481, 211229, 215262, 211636, 215873, 200862, 214944, 162713, 135375, 159014, 179130, 181130, 133677, 111838, 155037, 180664, 188069, 185896, 155629, 144435, 119043, 128608, 159534, 154647, 140715, 148951, 156572, 114647, 103800, 126420, 104429, 105657, 100424, 94543, 127409, 124421, 124265, 108015, 89018, 52844, 59942, 56511, 87910, 53982, 16737, 56840, 81902, 57238, 68334, 72027, 50127, 44192, 87714, 108830, 125700, 133402, 156309, 161185, 138085, 145469, 156374, 122733, 138617, 137854, 124995, 119317, 107828, 116504, 105878, 96946, 77203, 91737, 155810, 154557, 151738, 160984, 174368, 142884, 83990, 74148, 105396, 122570, 168484, 177387, 161912]
18159A61912k4482l2392K478J6880n236k60J2750J0269M6475j3264j2333J864
18147A64661P426k1604l5741o459L6763K4733J5278K6302K0535L3967J3638r149
18135B70350N4716N0534j9992J3131K7045L8974K4742L2473J00538R8951J06798
18124G98260R4280J23925J56117K35212L46726L59122M49387N58513Q53763J468312
18114E443617K667683N013506R246627J4372411J5050853R942762J22313j6919377
18106D4940395j7384875r990610n775360l467575k143771j383643r10860o81570
18098C202131m97422l18505k47296j90007o9246j02966j07000p1353o1093j9671
18088A517572k9521n4085r4369j02348p4752r4120m5277n8119l2964j9215j9912
$$ y = [161912, 137430, 105038, 107516, 124396, 119160, 118900, 131650, 141919, 188394, 175130, 162797, 164661, 172087, 150483, 114742, 108283, 145046, 169779, 185057, 211359, 231894, 265861, 279499, 270350, 325066, 375600, 355608, 368739, 395784, 434758, 459500, 491973, 592511, 691462, 798260, 892540, 1016465, 1172582, 1407794, 1754520, 2113642, 2563029, 3121542, 3975305, 5443617, 8111300, 13124806, 22371433, 36743844, 51794697, 61737459, 61859772, 44940395, 27555520, 17564910, 11789550, 8321975, 6178204, 4794561, 3883701, 3202131, 2704709, 2386204, 2138908, 1948901, 1879655, 1776689, 1669689, 1598336, 1537243, 1517572, 1488051, 1433966, 1339597, 1237249, 1162497, 1068377, 1023100, 964981, 932017, 912802, 892890]
18077H92890n9279k8275j8572n4756m6296m875K2442K014k5916r890o05j1959
18065F56923Q965K9807o637k4334K0099J493L367k424P323j1661l6697j5996j8373
18052F11855j7752j8983L1494M1798l5335j938M7179J2268K9942J8379k72O789
18040G25424M433l567K2927j7150J4990Q5463J7713J6750J5595L3003k0635K91
18028H95237J0953J0625N9123N2874M4511P9014R6311J07893J52753J40737J63275
18017A813306J56887J45912J56145J74798J63410J91128K50058K85108L04567
18008C641319L02371L47945M59895O26276Q26853J146151J650221K381166L271837
17999A4654034M402516N588418O735735P841229Q863871R709629J0128286R568850
$$ y = [892890, 833611, 805336, 786764, 732008, 685712, 680837, 703279, 705293, 679377, 669487, 668882, 656923, 665888, 695695, 689058, 664724, 684823, 686316, 689683, 687259, 694582, 682921, 646224, 630228, 611855, 594103, 575120, 606614, 648412, 613077, 611139, 658318, 670586, 700528, 718907, 718635, 725424, 729857, 726290, 749217, 732067, 747057, 832520, 850233, 866983, 882578, 915581, 894946, 895237, 906190, 916815, 975938, 1028812, 1073323, 1152337, 1248648, 1356541, 1509294, 1650031, 1813306, 1970193, 2116105, 2272250, 2447048, 2610458, 2801586, 3051644, 3336752, 3641319, 3943690, 4291635, 4751530, 5377806, 6204659, 7350810, 9001031, 11382197, 14654034, 19056550, 24644968, 31380703, 39221932, 48085803, 57795432, 67923718, 77492568]
17991G7492568Q134275O204372M133391J970384m23823k904345n226523p139874
17983H2240425q652815r529576r474563q753754p858310o981110n996822m860845
17975B0132630l665935k670103j906787j299419q90068o93692n34992l79815k90771
17966G801048k68282k33432k10255j98672j70592j38158j48986j49617j18854
17957F164200p7101q212J9103J08069J40600K35431L84728M94438P52972J182462
17947I396690J706376K387521L330437M427584N503454O548726P486652Q370584
17939D9158024Q938786Q826718P882387O250612M431054K495220L12184j918249
17931H6376736m000247n881607p380154q331968q652123q177034p361519o502425
$$ y = [77492568, 85626843, 91831215, 95964606, 97934990, 97511167, 94606822, 89380299, 82240425, 73587610, 64058034, 54583471, 45829717, 37971407, 30990297, 24993475, 20132630, 16466695, 13796592, 11889805, 10590386, 9700318, 9006626, 8471634, 8091819, 7801048, 7532766, 7299334, 7089079, 6890407, 6719815, 6581657, 6432671, 6283054, 6164200, 6087099, 6078887, 6097990, 6206059, 6346659, 6582090, 6966818, 7461256, 8214228, 9396690, 11103066, 13490587, 16821024, 21248608, 26752062, 33300788, 40787440, 49158024, 58096810, 66923528, 74805915, 81056527, 85487581, 87982801, 88294985, 86376736, 82376489, 76494882, 69114728, 60782760, 52130637, 43953603, 36592084, 30089659]
17923C0089659n685150m733591l661180k715893j950908j374271r86141p43337
17915H239188n46419m37051l85826l62140l80186l27258k99493k79643k40036
17906D981136k95840l06089k79172k44076k16372j90226j69073k13362j78726
17897B888200j68677j29605j09767q3260j02026q8392r6899p4438p640m2804j02808
17886A881884n4877q2400r8811n2062N402m0868j1156l1742m3296m4267j4138
17875A413669k1099Q103L322m4742m6084k6222j304K2571m0546j5051q252k598
17863A241767j505K5709K5132k2752l0771Q005N047l7569n5344k7607j7462m9846
17851A062804o5723m2892q671k1649n4963n0671k3474l3490m3267K4702l6770
$$ y = [30089659, 24404509, 19670918, 16009738, 13293845, 11342937, 9968666, 8982525, 8239188, 7692769, 7255718, 6869892, 6507752, 6127566, 5800308, 5500815, 5221172, 4981136, 4685296, 4379207, 4100035, 3855959, 3639587, 3449361, 3280288, 3066926, 2888200, 2719523, 2589918, 2480151, 2396891, 2294865, 2206473, 2109574, 2035136, 2027496, 1984692, 1881884, 1827007, 1744607, 1645796, 1593734, 1599136, 1558268, 1547112, 1515370, 1472074, 1427807, 1413669, 1392570, 1400673, 1403995, 1359253, 1313169, 1286947, 1285643, 1308214, 1267668, 1252617, 1244365, 1241767, 1240262, 1265971, 1291103, 1268351, 1237580, 1245585, 1250632, 1213063, 1157719, 1130112, 1112650, 1062804, 997081, 954189, 945518, 923869, 868906, 818235, 794761, 761271, 718004, 742706, 705936]
17840G05936l0104k1563J863J3353L1133r823r744P242N583N15j3770Q176o10
17827F88187k4767K782k9609l5224O668j1896m0193j5575k4809k9897j2007K1401
17815D95061K1667O400k0027m5966j8380P153M4114K8134k2234j8901Q311l9869
17803D45463J4870m102k4583K91K3657J8753J5454L3187J4000Q993L7148N4980
17791F38111L9689N4030J0385N06m2950o2182n7685k8613k1120p1275o0751p214
17779C90931k8446l4212j6562j6157j8737L5186P693N906j4032q006l0296l1140
17767B42128J884k4823N587O281j9678K3753N435n469l9334j3175J0227J5510
17755B08326j9550J1578J2947K009M331K9129k158l572p969r361j6770J5938N6173
$$ y = [705936, 675832, 654269, 656132, 669485, 700618, 690795, 681051, 688293, 693876, 694391, 680621, 688797, 688187, 663420, 666202, 636593, 601369, 608037, 596141, 555948, 540373, 515564, 485667, 473660, 495061, 516728, 523128, 503101, 457135, 438755, 445908, 490022, 518156, 495922, 477021, 485332, 445463, 460333, 456231, 431648, 431939, 455596, 474349, 489803, 522990, 536990, 545983, 583131, 638111, 677800, 731830, 742215, 742721, 699771, 637589, 579904, 551291, 530171, 458896, 398145, 390931, 362485, 328273, 311711, 295554, 276817, 312003, 319696, 325602, 311570, 303564, 273268, 242128, 244012, 219189, 224776, 231057, 211379, 235132, 240567, 235098, 195764, 182589, 192816, 208326, 188776, 200354, 213301, 215310, 219641, 248770, 246612, 243040, 235071, 225710, 208940, 224878, 281051]
17742B81051P927J1803K1974K0080O6610L8656K7361K1705J2733J1796k6675j5608
17730D79413m2765k4094n9632l7763l1319l4730K5934j6818j9470j3880q04m1218
17718A82854k0785k0894j9400j4362Q977j5486k3719k684O797J3013J210R143
17706A04664M0910K816n559j3220m0476k3213L0069r002k6569j7283L0285K6260
17694I9682j0804K2088L0475l3161p549j9166k3209N6940M2238k990k0386l62
17682A33796q442j0783k1199k8897J3471m156k4097K0510N3277K4148J4909j5580
17670A46957j4636n1824l2018k1573M098K7637Q061J9810J8379k7640j3842k7003
17658C6406q921J1094K3520L24j9639M879k6348L4021L2074K086j9330J8269j5307
$$ y = [281051, 288978, 300781, 322755, 342835, 409445, 448101, 475462, 497167, 509900, 521696, 495021, 479413, 436648, 412554, 352922, 315159, 283840, 249110, 275044, 258226, 238756, 224876, 224072, 182854, 162069, 141175, 121775, 107413, 116390, 100904, 77185, 74501, 81298, 94311, 95521, 104664, 145574, 148390, 142831, 129611, 89135, 65922, 95991, 86989, 60420, 43137, 73422, 99682, 88878, 110966, 141441, 108280, 100731, 81565, 58356, 115296, 157534, 154544, 134158, 133796, 125354, 114571, 93372, 64475, 77946, 73790, 49693, 70203, 123480, 147628, 162537, 146957, 132321, 80497, 48479, 26906, 31004, 58641, 66702, 86512, 104891, 77251, 63409, 36406, 27485, 38579, 62099, 62423, 42784, 47663, 21315, 55336, 87410, 89496, 70166, 88435, 73128]
17645G3128l0151M057K7204j052j4300l5710L5173K0045p032n267N710L9220j234
17632A09791j4625k8750k4168r834Q83j5207M695P549O6011M5354K2192q368o2356
17619I3167k6391N174J6493Q081M3654J011l1425l525J0747K3751j9523k5504
17607I5710o868M02j6533k8807O464J9216j320J4215O2116r161o3147m9387j2843
17594A0057L7238J790j3708P317J9313Q979j0181J0234l392o277Q373j3234k909
17581E3600K8257R957k8221l9981k2818Q78K3390J8650J5046p440K076j0899k8275
17568A4220K8272L0577j4167j8689l4767O082K0266Q880l316J4232q003L7200
17556H0787n179J3956L7437J6967k1855o1916m7094J3344M7625l1758l1527K3759
$$ y = [73128, 42977, 47034, 74238, 73186, 58886, 23176, 58349, 78394, 71362, 66095, 71805, 111025, 109791, 95166, 66416, 42248, 32414, 33297, 18090, 22785, 30334, 96345, 141699, 163891, 155523, 93167, 66776, 71950, 88443, 96524, 140178, 141189, 109764, 106239, 116986, 140737, 121214, 95710, 88842, 89244, 72711, 43904, 50368, 69584, 68264, 82479, 144595, 135434, 72287, 22900, 10057, 47295, 49085, 35377, 42694, 62007, 70986, 60805, 71039, 67647, 61370, 69743, 56509, 53600, 81857, 91814, 63593, 23612, 794, 1672, 25062, 43712, 58758, 51318, 53394, 42495, 14220, 42492, 73069, 58902, 40213, 5446, 11528, 31794, 40674, 37358, 51590, 43587, 80787, 75608, 89564, 127001, 143968, 122113, 60197, 13103, 26447, 74072, 42314, 10787, 34546]
17544C4546K7475k2190P470K7822J6375k217j2117M1400K4525j8724j1962m7667
17532F4736p885r674R28l2830J0881J3657j5376o589O0871M2124k7794j1784j2713
17519F8552l5981q593K5667j5951K1340K607j8787P85J2510J51K2332J0879n1189
17506C4322J2001N9870O994k2643K3145k4573l471m456O863o386P235R319k2917
17493G5303L147J4298K494q941k8839m7342N6279J8457m04N3027K3467P2190Q4329
17480C17465Q9480R3456K3831m69L2128J8396j1177j5787l7666k0779l1675l4768
17468D22435n3571k1501n6219o0383k8556l5115o1798l0821J5654J4988j5390
17457H9723j5288j135o245J0089k0023j4759J3309K7765L5701K0648K6884M1482
$$ y = [34546, 62021, 39831, 47301, 75123, 91498, 89281, 77164, 118564, 143089, 124365, 112403, 64736, 56851, 47177, 48105, 15275, 26156, 39813, 24437, 17848, 78719, 120843, 93049, 81265, 68552, 32571, 23978, 49645, 33694, 55034, 57641, 38854, 39639, 52149, 52300, 74632, 85511, 34322, 46323, 106193, 113187, 90544, 113689, 89116, 85645, 81189, 88052, 81666, 88901, 98220, 75303, 78450, 92748, 95242, 86301, 57462, 10120, 66399, 84856, 84452, 137479, 160946, 233136, 317465, 406945, 500401, 524232, 523763, 555891, 574287, 563110, 547323, 509657, 488878, 457203, 422435, 368864, 347363, 291144, 230761, 202205, 167090, 105292, 74471, 90125, 105113, 89723, 74435, 73300, 67055, 77144, 57121, 42362, 55671, 83436, 119137, 139785, 166669, 208151]
17445B08151N8202P7111O9021K5662m9299j14354p2851n6212m0750j2706j7638
17434G4337j3828K9520K9085R251P104N2794L2137J5555n553O0188L4392Q7477
17422D12459Q1584K323p786M255L460m8219n036k8957l4131n0800n0275l5159
17410B43718n8376k6056m5804l9575J5811J4381L5584l4858n2987K2481J8139
17399I2458M236n841M4209m632l0118j1010L1299j3717J557j7540j5797r482j1573
17386E4049n5235j1319L3457P359j013J3018p973k9612j8085r110P171L5839J4591
17373C3137j3694J0536K9317R314K6068J658K902K2015j5017n1299l7011q314
17361I612L520k9278j9340L2129J1412r110K7188K931j8391J9808K5796k6585
$$ y = [208151, 266353, 343464, 412485, 438147, 388848, 274494, 201643, 145431, 104681, 91975, 74337, 60509, 90029, 119114, 128365, 135469, 188263, 220400, 235955, 230402, 290590, 324982, 412459, 494043, 496366, 488580, 492835, 496295, 448076, 443040, 414083, 379952, 329152, 278877, 243718, 185342, 159286, 113482, 73907, 89718, 104099, 139683, 104825, 51838, 74319, 92458, 96694, 90853, 135062, 130430, 100312, 89302, 120601, 106884, 108441, 90901, 75104, 65622, 54049, -1186, -12505, 20952, 28311, 27298, 40316, 32343, 2731, -15354, -24464, -17293, 18546, 33137, 19443, 29979, 59296, 68610, 94678, 96336, 99238, 121253, 106236, 54937, 17926, 9612, 13132, -16146, -35486, -3357, 8055, -1055, 26133, 29064, 10673, 30481, 56277, 29692]
17349B9692j4122P515J5414J7329J9814r030j7906O692l495o381j6066J9219K3644
17336G2319m784N86m592k9789j8817L5135N1728M3403j1951m3551k3181K904p133
17323F2277k4333L4203M9969k7907m4359p248j7716J7201j2084M8780K5928m5454
17311E9257n5794n7532M056N8466K4446M3923K0412j2729l4655l2545r033l306
17299D966K6641J667l5876L691n709J4371L1306j6542J0233l09M043j8954j826
17286A7702k163j4078l3549N5286M2613k6164j4434k7606J7936L2726J8190J4705
17274H1164k6064Q109L2173l9161l1109J4542m2824J2534K2678o516o296L9132
17262E8362M2534N274n2983k6395k665p442J1255L3326J1937j1080l5884O04j1654
$$ y = [29692, 15570, 23085, 38499, 55828, 75642, 66612, 48706, 55398, 51903, 45522, 29456, 48675, 72319, 67535, 68121, 63529, 33740, 14923, 50058, 101786, 145189, 133238, 89687, 66506, 69410, 62277, 37944, 72147, 122116, 94209, 49850, 42602, 24886, 42087, 30003, 78783, 104711, 59257, 3463, -54069, -50013, 8453, 32899, 76822, 97234, 84505, 49850, 17305, 8272, 4966, 31607, 33274, -2602, 1089, -4620, 9751, 41057, 24515, 34748, 34439, 38482, 19528, 17702, 15539, 1461, -32088, 23198, 65811, 39647, 25213, -2393, 15543, 48269, 66459, 81164, 55100, 63209, 95382, 56221, 25112, 39654, -3170, 9364, 32042, 25526, 19230, 58362, 100896, 106170, 53187, 26792, 24127, 16685, 27940, 61266, 73203, 62123, 26239, 26843, 15189]
17249A5189j9406L4735J6102p994m680l1532K2408M7747Q172K1776O853j2179
17237I7191P177j352k3354j0322M449r639J4307J187m6153n7606K898L0482j8387
17224i122K347J3799k4242J0210q690j5630K9698K234j4715J7099L4855n486j1653
17211B0704Q170N791K074J2704j2475k9993o734K3616m285r606J316j9184K272
17198e630j5117O710K271Q180L9865O427k9903k9729J6814K465n767m7820k0332
17185g1566L9831q765L395L0044P946J794L4754K472k7260J307Q901j8078O591
17172A1366K6118J8861N739k4776K398j2124J3945P711l1446M445k1146p964k4287
17159c1160k0804P60J7668J2196M1848J0181J827J0266N638p042j8829O92J0202
$$ y = [15189, -4217, 30518, 46620, 38626, 33946, 2414, 24822, 72569, 80741, 102517, 109370, 97191, 104368, 103016, 79662, 69340, 73789, 64150, 78457, 79644, 33491, -24115, -21217, 9265, -9122, -6775, 7024, -17218, -7008, -15698, -31328, -1630, 604, -14111, 2988, 37843, 32357, 20704, 28874, 34665, 36739, 49443, 36968, 6975, 241, 23857, 19572, 9966, 11282, -7902, -5630, -20747, -14037, -11766, -3586, 36279, 42706, 12803, -16926, -112, 2353, -3414, -51234, -71566, -31735, -40500, -37105, -7061, 885, 2679, 37433, 39905, 12645, 13952, 22853, 4775, 11366, 37484, 56345, 62084, 37308, 39706, 27582, 41527, 49238, 17792, 22237, 1091, -6873, -31160, -51964, -51204, -33536, -21340, 20508, 30689, 32516, 42782, 48420, 41378, 22549, 23241, 33443]
17146C3443j8749L0969K2166r527J020o037j229j7358l217J8863K2824j8955p0865
17133a6652l6182K4763M5733n13k5845j5671j059J5831q243O7063L5430J130K4325
17120A10110K7834J5567k763k9414j7872m603M560k4380j4640r766l581P699m5711
17107A3040m6289l3157n764K8662M5888r075l5524P076L0222J7581J0151j9987
$$ y = [33443, 14694, 45663, 67829, 58302, 59322, 53285, 52056, 34698, 31481, 50344, 73168, 54213, -16652, -52834, -28071, 17662, 17149, -8696, -24367, -25426, -9595, -17838, 49225, 84655, 85785, 110110, 137944, 153511, 150748, 121334, 103462, 98859, 103419, 79039, 64399, 54633, 51052, 58751, 13040, -33249, -66406, -72170, -43508, 2380, -6695, -42219, -35143, -4921, 12660, 22811, 2824]
$$ [...]
##END NTUPLES=NMR SPECTRUM
##END=
