##TITLE=Analysis number 323589
Compound Code cc 57813
Book Reference 449/158
Project Code adrs
Chemist Name davee
##JCAMPDX= 6.0         $$ Bruker NMR JCAMP-DX V2.0
##DATA TYPE= NMR SPECTRUM
##DATA CLASS= NTUPLES
##ORIGIN= Bruker BioSpin GmbH
##OWNER= nmr
$$ XWIN-NMR		Version 3.5
$$ Mon Oct 30 11:11:13 2006 GMT Standard Time (UT+0h)  MAYBRIDGE\nmr@NMR_250MHZ
##.OBSERVE FREQUENCY= 250.131544655141
##.OBSERVE NUCLEUS= ^1H
##.ACQUISITION MODE= SIMULTANEOUS (DQD)
##.ACQUISITION SCHEME= undefined
##.AVERAGES= 16
##.DIGITISER RES= 18
##SPECTROMETER/DATA SYSTEM= dpx250
##.PULSE SEQUENCE= zg30
##.SOLVENT NAME= CDCl3
##.SHIFT REFERENCE= (INTERNAL, CDCl3, 0, 16.4527)
##AUDIT TRAIL= $$ (NUMBER, WHEN, WHO, WHERE, WHAT)
$$ ##TITLE= Audit trail, XWIN-NMR		Version 3.5
$$ ##JCAMPDX= 5.01
$$ ##ORIGIN= Bruker BioSpin GmbH
$$ ##OWNER= nmr
$$ C:\u/data/dgb/nmr/ADRS/1890/pdata/1/auditp.txt
$$ ##AUDIT TRAIL=  $$ (NUMBER, WHEN, WHO, WHERE, WHAT)
(   1,<2006-10-30 11:10:48.67 +000>,<MAYBRIDGE\nmr>,<NMR_250MHZ>,
      <created by zg, POWCHK disabled, PULCHK disabled
       configuration hash MD5:
       49 4B E0 1D 92 C2 6B 37 9F E6 65 BC 52 41 86 1D
       data hash MD5: 64K
       B9 01 5D 79 A8 91 56 FA 0B 89 01 64 16 93 4B 7D>)
(   2,<2006-10-30 11:11:02.56 +000>,<MAYBRIDGE\nmr>,<NMR_250MHZ>,
      <Start of raw data processing
       ef LB = 0.3 FT_mod = 6 PKNL = 1 SI = 32K 
       data hash MD5: 32K
       E3 04 46 D1 2C 85 39 B2 1C 37 F1 50 55 6A D9 32>)
(   3,<2006-10-30 11:11:04.37 +000>,<MAYBRIDGE\nmr>,<NMR_250MHZ>,
      <apk 
       data hash MD5: 32K
       A0 A9 B0 D7 1B EF 34 16 26 48 C4 0A 5F 19 17 B6>)
(   4,<2006-10-30 11:11:05.14 +000>,<MAYBRIDGE\nmr>,<NMR_250MHZ>,
      <abs ABSG = 5 
       data hash MD5: 32K
       03 81 D1 C0 C3 1C F0 08 AF F7 06 97 23 18 81 01>)
$$ ##END=
$$ 
$$ hash MD5
$$ AC E7 9A 31 CB 70 FD CD EB 80 57 A2 C4 F0 5B 00
##$RELAX= 
##$RELAX= 
##$RELAX= 
##$RELAX= 
##$RELAX= 
##$RELAX= 
##$RELAX= 
$$ Bruker specific parameters
$$ --------------------------
##$DU= <C:\u>
##$EXPNO= 1890
##$NAME= <ADRS>
##$PROCNO= 1
##$TYPE= <nmr>
##$USER= <dgb>
##$AMP= (0..31)
100 100 100 100 100 100 100 100 100 100 100 100 100 100 100 100 100 100 
100 100 100 100 100 100 100 100 100 100 100 100 100 100 
##$AQSEQ= 0
##$AQ_mod= 3
##$AUNM= <au_zg>
##$AUTOPOS= <5 >
##$BF1= 250.13
##$BF2= 250.13
##$BF3= 250.13
##$BF4= 250.13
##$BF5= 500.13
##$BF6= 500.13
##$BF7= 500.13
##$BF8= 500.13
##$BYTORDA= 1
##$CFDGTYP= 0
##$CFRGTYP= 5
##$CHEMSTR= <none>
##$CNST= (0..31)
1 1 145 1 1 1 1 1 1 1 1 1 1 1 1 1 1 1 1 1 1 1 1 1 1 1 1 1 1 1 1 1 
##$CPDPRG= <>
##$CPDPRG1= <>
##$CPDPRG2= <>
##$CPDPRG3= <>
##$CPDPRG4= <mlev>
##$CPDPRG5= <mlev>
##$CPDPRG6= <mlev>
##$CPDPRG7= <mlev>
##$CPDPRG8= <mlev>
##$CPDPRGB= <>
##$CPDPRGT= <>
##$D= (0..31)
0 1 0 0 0 0 0 0 0 0.06 0 0 0 0 0 0 0.0002 0 0 0 0 0 0 0 0 0 0 0 0 0 0 
0 
##$DATE= 1162206647
##$DBL= (0..7)
120 120 120 120 120 120 120 120 
##$DBP= (0..7)
150 150 150 150 150 150 150 150 
##$DBP07= 0
##$DBPNAM0= <>
##$DBPNAM1= <>
$$ [...]
##$SUBNAM7= <"">
##$SUBNAM8= <"">
##$SUBNAM9= <"">
##$SW= 20.6930455092707
##$SWIBOX= (0..15)
0 0 3 0 0 0 0 0 0 0 0 0 0 0 0 0 
##$SW_h= 5175.983436853
##$TD= 65536
##$TD0= 1
##$TE= 683.16
##$TE2= 300
##$TE3= 300
##$TEG= 300
##$TL= (0..7)
0 120 120 120 120 120 120 120 
##$TP= (0..7)
150 150 150 150 150 150 150 150 
##$TP07= 0
##$TPNAME0= <>
##$TPNAME1= <>
##$TPNAME2= <>
##$TPNAME3= <>
##$TPNAME4= <>
##$TPNAME5= <>
##$TPNAME6= <>
##$TPNAME7= <>
##$TPOAL= (0..7)
0.5 0.5 0.5 0.5 0.5 0.5 0.5 0.5 
##$TPOFFS= (0..7)
0 0 0 0 0 0 0 0 
##$TUNHIN= 0
##$TUNHOUT= 0
##$TUNXOUT= 0
##$USERA1= <user>
##$USERA2= <user>
##$USERA3= <user>
##$USERA4= <user>
##$USERA5= <user>
##$V9= 5
##$VALIST= <valist>
##$VCLIST= <CCCCCCCCCCCCCCC>
##$VD= 0
##$VDLIST= <DDDDDDDDDDDDDDD>
##$VPLIST= <PPPPPPPPPPPPPPP>
##$VTLIST= <TTTTTTTTTTTTTTT>
##$WBST= 1024
##$WBSW= 4
##$XGAIN= (0..3)
0 0 0 0 
##$XL= 0
##$YL= 0
##$YMAX_a= 452258
##$YMIN_a= -445444
##$ZGOPTNS= <>
##$ZL1= 120
##$ZL2= 120
##$ZL3= 120
##$ZL4= 120
##$ABSF1= 16.45272
##$ABSF2= -4.240452
##$ABSG= 5
##$ABSL= 3
##$ALPHA= 0
##$AQORDER= 0
##$ASSFAC= 0
##$ASSFACI= 0
##$ASSFACX= 0
##$ASSWID= 0
##$AUNMP= <proc_1d>
##$AZFE= 0.1
##$AZFW= 0.1
##$BCFW= 0
##$BC_mod= 0
##$BYTORDP= 0
##$COROFFS= 0
##$CY= 12.5
##$DATMOD= 1
##$DC= 0
##$DFILT= <>
##$DTYPP= 0
##$F1P= 14.0000005364418
##$F2P= -0.99999901652339
##$FCOR= 0.5
##$FTSIZE= 32768
##$FT_mod= 6
##$GAMMA= 0
##$GB= 0
##$INTBC= 1
##$INTSCL= 1
##$ISEN= 128
##$LB= 0.3
##$LEV0= 0
##$LPBIN= 0
##$MAXI= 10000
##$MC2= 0
##$MEAN= 0
##$ME_mod= 0
##$MI= 0
##$NCOEF= 0
##$NC_proc= -4
##$NLEV= 6
##$NOISF1= 0
##$NOISF2= 0
##$NSP= 0
##$NTH_PI= 0
##$NZP= 0
##$OFFSET= 16.45272
##$PC= 1
##$PHC0= -54.67991
##$PHC1= 8.286049
##$PH_mod= 1
##$PKNL= yes
##$PPARMOD= 0
##$PSCAL= 4
##$PSIGN= 0
##$REVERSE= no
##$SF= 250.130017328579
##$SI= 32768
##$SIGF1= 0
##$SIGF2= 0
##$SINO= 400
##$SIOLD= 32768
##$SREGLST= <1H.CDCl3>
##$SSB= 0
##$STSI= 32768
##$STSR= 0
##$SW_p= 5175.98343685301
##$SYMM= 0
##$S_DEV= 0
##$TDeff= 65536
##$TDoff= 0
##$TI= <Analysis number 999999
Compound Code 99
Book Reference 9
Project Code 9>
##$TILT= no
##$TM1= 0
##$TM2= 0
##$TOPLEV= 0
##$USERP1= <user>
##$USERP2= <user>
##$USERP3= <user>
##$USERP4= <user>
##$USERP5= <user>
##$WDW= 1
##$XDIM= 32768
##$YMAX_p= 291054779
##$YMIN_p= -125300
$$ End of Bruker specific parameters
$$ ---------------------------------
##NTUPLES= NMR SPECTRUM
##VAR_NAME=  FREQUENCY,     SPECTRUM/REAL,   SPECTRUM/IMAG
##SYMBOL=    X,             R,               I
##VAR_TYPE=  INDEPENDENT,   DEPENDENT,       DEPENDENT
##VAR_FORM=  AFFN,          ASDF,            ASDF
##VAR_DIM=   32768,         32768,           32768
##UNITS=     HZ,            ARBITRARY UNITS, ARBITRARY UNITS
##FACTOR=    0.157963299565203, 1,           1
##FIRST=     4115.3192993082, 0,             0
##LAST=      -1060.66413754481, 0,           0
##MIN=       -1060.66413754481, -125300,     0
##MAX=       4115.3192993082, 291054779,     0
$$ Real data points
##PAGE= N=1
##DATA TABLE= (X++(R..R)), XYDATA
$$ [...]
18555A427072J8496K7863k5017m7849k1214j3121k3410j9274o188j9008k3283
$$ 1427072 1445568 1473431 1448414 1400565 1379351 1366230 1342820 1323546 1317358 1298350 1275067
18544A275067k6112j7693k6364L927j9879r409K4403J7999J3233J4184K6959O0132
$$ 1275067 1248955 1231262 1204898 1208825 1188946 1179537 1203940 1221939 1235172 1249356 1276315 1336447
18532A336447P7112P8129O6649J01853Q6886J05028J11077J12283J37802J78926
$$ 1336447 1413559 1491688 1558337 1660190 1747076 1852104 1963181 2075464 2213266 2392192
18522B392192J95492K31280K02192K08270K67993L11338L73949M49866O01619
$$ 2392192 2587684 2818964 3021156 3229426 3497419 3808757 4182706 4632572 5234191
18513E234191P76283J007616J297006J550703J879715K202306K494051K719190
$$ 5234191 6010474 7018090 8315096 9865799 11745514 13947820 16441871 19161061
18505A9161061K851644K850807K665757K333833J933651J286144P05868K67461
$$ 19161061 22012705 24863512 27529269 29863102 31796753 33082897 33788765 34056226
18497C4056226j73850n24785p73903q17632o61951m48202j32885J34403K88966
$$ 34056226 33882376 33357591 32583688 31766056 31104105 30655903 30523018 30657421 30946387
18488C0946387L47016K71869N2984l20585p27486j136097j541374j968391k313654
$$ 30946387 31293403 31565272 31618256 31297671 30570185 29434088 27892714 25924323 23610669
18479B3610669k388682k361854k298081k096005j846028j560597j223412r53202
$$ 23610669 21221987 18860133 16562052 14466047 12620019 11059422 9836010 8882808
18471H882808p38847n46628l59868k65010j74239m0471K7014J36113K61721L89576
$$ 8882808 8143961 7597333 7237465 6972455 6798216 6757745 6784759 6920872 7182593 7572169
18461G572169N77562P69214J052015J425975J765814K122878K486677K759971
$$ 7572169 8149731 8918945 9970960 11396935 13162749 15285627 17772304 20532275
18453B0532275L056663L226289L196207K961331K608651K145387J479793Q19726
$$ 20532275 23588938 26815227 30011434 32972765 35581416 37726803 39206596 40026322
18445D0026322L05812j60182n62052r03901r35870p50091m95819j47196J83267
$$ 40026322 40332134 40171952 39609900 38705999 37770129 37020038 36524219 36377023 36560290
18436C6560290M15044M58271L61095R2302m14721q93565j371604j873837k442450
$$ 36560290 36975334 37433605 37794700 37887002 37472281 36578716 35207112 33333275 30890825
18427C0890825k868535l007116k999351k911283k698177k344783k036360j700830
$$ 30890825 28022290 25015174 22015823 19104540 16406363 14061580 12025220 10324390
18419A0324390j391232j097166r07817o90689n32693m13047l16752k76183k10228
$$ 10324390 8933158 7835992 6928175 6237486 5704793 5291746 4974994 4698811 4488583
18410D488583j75189j51117j17666j34120j12241j12582j63094j51969j59445
$$ 4488583 4313394 4162277 4044611 3910491 3798250 3685668 3522574 3370605 3211160
18401C211160j25194r8851j42217j10439p0314p0106r2751m7756n5611n4408k6773
$$ 3211160 3085966 2987115 2844898 2734459 2664145 2594039 2501288 2453532 2397921 2343513 2316740
18390B316740m5637m3284l3242Q178l4267o1131l8242k1991k8722j7064M78J763
$$ 2316740 2271103 2227819 2194577 2202755 2168488 2107357 2069115 2047124 2018402 2001338 2001816 2003579
18378B003579Q335L3700j352L6734M2460J247l4720j4905J8304J4113P53q810
$$ 2003579 2011914 2045614 2044262 2080996 2123456 2124703 2089983 2075078 2093382 2107495 2108248 2099438
18366B099438k7407k065P392j458l7344j3963o970j5275n2871k8186j6093q433
$$ 2099438 2072031 2069966 2077358 2075900 2038556 2024593 2017623 2002348 1949477 1921291 1905198 1896765
18354A896765k0789j0229l401l7326l0620k5371k3051m7124o3114o8689o1103
$$ 1896765 1875976 1865747 1862346 1825020 1794400 1769029 1745978 1698854 1635740 1567051 1505948
18343A505948j4517M212l5783o5491j4601j6503k3170J736k0253j4857j6732m8668
$$ 1505948 1491431 1495643 1459860 1394369 1379768 1363265 1340095 1341831 1321578 1306721 1289989 1241321
18331A241321n7058l8952l6609l5049n2120k8622l0468j9111l7626l2667l1715
$$ 1241321 1184263 1145311 1108702 1073653 1021533 992911 962443 943332 905706 873039 841324
18320H41324m8156k2090m465l9173n3070m9891o56m6660n4427n9394j7890o888
$$ 841324 793168 771078 766613 727440 674370 624479 623823 577163 522736 463342 445452 438564
18308D38564k7300l6230k8414q718j3001J4160j2880m4445O863j9698k8212J2070
$$ 438564 411264 375034 346620 337902 324901 339061 326181 281736 288599 268901 240689 252759
18296B52759L516l9727m3812j5926J6545L4956N838n804R868j7048j0340J7227
$$ 252759 256275 216548 172736 156810 173355 208311 214149 208345 218213 201165 190825 208052
18284B08052J6316K0405l661K4437J4073K0895K5656J2427j1754k0957J3134m870
$$ 208052 224368 244773 241112 265549 279622 300517 326173 338600 326846 305889 319023 314153
18272C14153j4260j4001j3329R37j1616m910K8154J9577J8485k459j1215L036
$$ 314153 299893 285892 272563 273500 261884 256974 285128 304705 323190 320731 309516 312552
18260C12552j225k4084k8926j1988j0809J3519j3634m670M937N039J3711K5334
$$ 312552 311327 287243 258317 246329 235520 249039 235405 230735 235672 240711 254422 279756
18248B79756J7416L5597J1514J4670L0748P836J1230K0390M8180J3358N212o536
$$ 279756 297172 332769 344283 358953 389701 397537 408767 429157 477337 490695 495907 489371
18236D89371Q64K9111J2851j474N947k6725J5251L9063L5161K2942K3981l8652
$$ 489371 490235 519346 532197 530723 536670 509945 525196 564259 599420 622362 646343 607691
18224F07691q530k1429n0788p718K66L513k9718l2458l2024p274k2279k6478p315
$$ 607691 599161 577732 526944 519226 519492 523005 493287 460829 428805 421531 399252 372774 365459
18211C65459k6018J735j0422J5537l725j0979j1926k0938J2361P538j3700j1606
$$ 365459 339441 341176 330754 346291 342566 331587 319661 298723 311084 318622 304922 293316
18199B93316M234q686k3361m378j08k0592j0916N047J866o290K5966J757j1710
$$ 293316 297550 288864 265503 261125 261017 240425 229509 234556 236422 230132 256098 257855 246145
18186B46145P654K2965j4625j1380j5034j7383R392j4933k1823O226K3728j92
$$ 246145 253799 276764 262139 250759 235725 218342 227734 212801 190978 197204 220932 220740
18174B20740o299n379M2935K0054k2647o786Q897K5794L4356M426l0650q267J1690
$$ 220740 214441 209062 251997 272051 249404 242618 251515 277309 311665 316091 285441 277174 288864
18161B88864j1223J5943k713J7287J6629J4984M739r102R55O304q321j7683J8433
$$ 288864 277641 293584 290871 308158 324787 339771 344510 335408 336363 342667 334346 316663 335096
18148C35096J5062K4726N25n377P116J4329L8390K376J6361L3843K7654k82J197
$$ 335096 350158 374884 375409 370032 377148 391477 429867 432243 448604 482447 510101 509819 511016
18135E11016o671K2191P8470K8330Q119K9520N4906K2517K3762P2120J23225J36273
$$ 511016 504345 526536 605006 633336 641455 670975 725881 748398 772160 844280 967505 1103778
18123A103778J32203J61607K27346K78064L54138N06635O73684R91132J602680
$$ 1103778 1235981 1397588 1624934 1902998 2257136 2763771 3437455 4428587 6031267
18114F031267K673435M279459N881596N946508M414824K591888k172834p685415
$$ 6031267 8704702 12984161 18865757 24812265 29227089 31818977 29646143 21960728
18106B1960728p032005m507797k855454j859585j274151q98818o29313m42965
$$ 21960728 14928723 10420926 7565472 5705887 4431736 3532918 2903605 2460640
18098B460640l26251k47934j60102j17728r7768j09988q1939o2513o5897o0767
$$ 2460640 2134389 1886455 1726353 1608625 1510857 1400869 1318930 1256417 1190520 1129753
18088A129753n5921m5309n6455p0758l6571m5235j8927k4627j8207k2025j6343
$$ 1129753 1073832 1028523 972068 901310 864739 819504 800577 775950 757743 735718 719375
18077G19375l1543l3855l4263j4177k6610Q640M145j5096k997M178J6695l9633
$$ 719375 687832 653977 619714 605537 578927 587567 591712 576616 573619 577797 594492 554859
18065E54859k6548l3412j3414R967J0674L263L0488K3472m795k4145M5262N7137
$$ 554859 528311 494899 481485 491452 502126 505389 535877 559349 554554 530409 575671 632808
18053F32808M3482O5745N0742P7261Q3016Q1630O3904O6616M7694l024j3677k4733
$$ 632808 676290 742035 792777 870038 953054 1034684 1098588 1165204 1212898 1209874 1196197 1171464
18041A171464m1202l5453m1587p5464n7740o2641m3719n9443k5067l6870l5648
$$ 1171464 1130262 1094809 1053222 977758 920018 857377 813658 754215 729148 692278 656630
18030F56630j3406O145L098L220K1044N3465Q0095N3372L8774O6424M3428N6443
$$ 656630 643224 649369 652467 655687 676731 730196 810291 863663 902437 968861 1012289 1068732
18018A068732Q7218O9537j735j5105K0216O891k2135m0603m5708l4370l5558n7223
$$ 1068732 1155950 1225487 1223752 1208647 1228863 1235754 1213619 1173016 1127308 1092938 1057380 1000157
18006A000157l4378l4101j6631K0349k1657J1977N1730N0739P3756M6818N9052
$$ 1000157 965779 931678 915047 935396 913739 925716 977446 1028185 1101941 1148759 1207811
17995A207811Q8619N4757K6845O813r525O838O672j2683j3154N064P139j1281
$$ 1207811 1296430 1351187 1378032 1384845 1375320 1382158 1388830 1376147 1362993 1368057 1375196 1363915
17983A363915l0177l3714n975R224J3163K2198L5734L6033N8549Q6199J06609
$$ 1363915 1333738 1300024 1294049 1303273 1316436 1338634 1374368 1410401 1468950 1555149 1661758
17972A661758P6618Q9144J06786J45997J63520J72642J89833K05442K13894J99573
$$ 1661758 1738376 1827520 1934306 2080303 2243823 2416465 2606298 2811740 3025634 3225207
17962C225207K16715K32312K02646J73202J65375J95101J78073K22750K73003
$$ 3225207 3441922 3674234 3876880 4050082 4215457 4410558 4588631 4811381 5084384
17953E084384L22259M74560O34339Q48165J187485J680809K210951K808148L452237
$$ 5084384 5406643 5881203 6515542 7363707 8551192 10232001 12442952 15251100 18703337
17944A8703337M132024M764072N281879N648421N797030N661808N147797M205865
$$ 18703337 22835361 27599433 32881312 38529733 44326763 49988571 55136368 59342233
17936E9342233L012883J708602L96791q20507k079398l329658m401435n158760
$$ 59342233 62355116 64063718 64460509 63640002 61560604 58230946 53829511 48670751
17928D8670751n506152n431878n111333m727447m257436l711150l064471k473917
$$ 48670751 43164599 37732721 32621388 27893941 23636505 19925355 16860884 14386967
17920A4386967j890092j386716j029731p88772n92703m87810l67882k49735j97246
$$ 14386967 12496875 11110159 10080428 9291656 8698953 8211143 7843261 7593526 7396280
17911G396280j29930j06294r4795q1002j7745m6043p0201n2008k8055J3068N6960
$$ 7396280 7266350 7160056 7065261 6984259 6966514 6920471 6850270 6798262 6770207 6783275 6840235
17900F840235J05206K19110L68971O23616R09595J283404J764202K254163K834764
$$ 6840235 6945441 7164551 7533522 8157138 9066733 10350137 12114339 14368502 17203266
17891A7203266L395663L906369M371745M667683M782282M611144M148245L331170
$$ 17203266 20598929 24505298 28877043 33544726 38327008 42938152 47086397 50417567
17883E0417567K293148J238968J25633r67464k034490l016797l890204m477274
$$ 50417567 52710715 53949683 54075316 53107852 51073362 48056565 44166361 39689087
17875C9689087m719565m620464m318141l941106l586538l084739k562545k052880
$$ 39689087 34969522 30349058 26030917 22089811 18503273 15418534 12855989 10803109
17867A0803109j569021j173309q94803p35799n72657l98064l08860k96296k55965
$$ 10803109 9234088 8060779 7165976 6430177 5857520 5459456 5150596 4854300 4598335
17858D598335k44024k24682j93056k19161k32412j99035j92987j86549j97907
$$ 4598335 4354311 4129629 3936573 3717412 3485000 3285965 3092978 2906429 2708522
17849B708522k03769j72381j81263j64389j60776j17510q5549q4236o2034o2498
$$ 2708522 2504753 2332372 2151109 1986720 1825944 1708434 1622885 1538649 1476615 1414117
17839A414117m2989l6861n9315o6017n065N396J7019R078K155K8563j8388l4768
$$ 1414117 1371128 1334267 1274952 1208935 1203870 1209266 1226285 1235363 1237518 1266081 1247693 1212925
17827A212925j4447K5210j0830k1684l5114k7024m9591l7691j4333l3105p1200
$$ 1212925 1198478 1223688 1212858 1191174 1156060 1129036 1079445 1041754 1027421 994316 923116
17816I23116p5954n1815k3625k1248n009q380n7476l1800m98j6151l8951R474
$$ 923116 847162 795347 771722 750474 745465 737085 679609 647809 647311 631160 592209 601683
17804F01683Q760Q082N0687K1072M5526P8903M2988K7753M6491N6634P0053N1048
$$ 601683 610443 618525 669212 690284 735810 814713 857701 885454 931945 988579 1058632 1109680
17792A109680J1255l884l0404m2771j9806j5245o1147p6553q1404j12011q0807
$$ 1109680 1120935 1117051 1086647 1043876 1024070 1008825 947678 871125 789721 677710 596903
17781E96903l6595m8656n9879o5507j9434O677j4244K964N147N4455M0648J9179
$$ 596903 560308 511652 451773 386266 366832 373509 359265 362229 367376 421831 462479 481658
17769D81658n53J1518L1516L1643n060J7081K9198K0654K2241K2194Q9J1429K0785
$$ 481658 481105 492623 524139 555782 550722 567803 597001 617655 639896 662090 662179 673608 694393
17756F94393j5095m1494J736j3178k6947l3366k4437n7100m9563k2651j2766o556
$$ 694393 679298 637804 639540 626362 599415 566049 541612 484512 434949 412298 399532 392976
17744C92976K0453L0044M0960K0633M0156P5508P1080P5491K2841J8320k008n7669
$$ 392976 413429 443473 484433 505066 545222 620730 691810 767301 790142 808462 806454 748785
17732G48785p2293n3291n1059k8865o7159p8271o6727n0390n3863k2501l2172
$$ 748785 676492 623201 572142 543277 476118 397847 331120 280730 226867 204366 172194
17721A72194j5385q915n272j9398j6940N447k5211l9261M321J3402m517k2830
$$ 172194 156809 147894 142622 123224 106284 111731 86520 47259 51580 64982 60465 37635
17709C7635L6132K0686K0212K410O937n083q616o670o137J6535l2525j0161J9209
$$ 37635 73767 94453 114665 117075 124012 118929 110313 103643 97506 114041 81516 71355 90564
17696I0564q390q027q854O525k45p704l1296o652j4119j2146p069K3487K5486
$$ 90564 82174 74147 65293 71818 71573 63869 32573 25921 11802 -344 -7413 16074 41560
17683D1560l0585l6520R731o579j8973j3433j520j9924j0598J3277R082j2435
$$ 41560 10975 -25545 -15814 -22393 -41366 -54799 -56319 -76243 -86841 -73564 -64482 -76917
17671g6917O850K1510K0998J0130J1517O714j4303J8277K515j6943k1310K2073
$$ -76917 -70067 -48557 -27559 -17429 -5912 802 -13501 4776 7291 -9652 -30962 -8889
17659h889K304k3639L807K4092M92l194Q278q246k3932J1692N869q891p651L479
$$ -8889 -6585 -30224 -26417 -2325 -1833 -5027 3251 -4995 -28927 -17235 -11366 -20257 -27908 -24429
17645b4429k613j1083J2891L5642m709j5051P566J6314K3158j7752k363j5155
$$ -24429 -27042 -38125 -25234 10408 5699 -9352 -1786 14528 37686 19934 17571 2416
17633B416k0905j8603J4460K8316l6175K7906P82l5598J7046K4505M002R864l07
$$ 2416 -18489 -37092 -22632 5684 -30491 -2585 -1803 -37401 -20355 4150 8152 18016 17709
17620A7709K2428j4429k1150K5881Q024K9141K4905O735O416j8712J5630L3138
$$ 17709 40137 25708 4558 30439 38463 67604 92509 99244 105660 86948 102578 135716
17608A35716j765p82k50j1979J1934P070m321j7890o622M755j9574K5526J9495
$$ 135716 133951 133169 132919 120940 132874 139944 135623 117733 111111 115866 96292 121818 141313
17595A41313K784J6616J8574M1261K1392M0945Q4814P1628L9034K7487K2502K2486
$$ 141313 144097 160713 179287 220548 241940 282885 367699 439327 478361 505848 528350 550836
17583E50836L088J4367J0183m6391n9930k9963k0537n1641m7871j7708O078k4731
$$ 550836 553924 568291 578474 532083 472153 442190 421653 370012 322141 304433 310511 285780
17571B85780m6598m2194j6068j3100r967j8649O523P574k220J2954J0495j0448
$$ 285780 239182 196988 180920 167820 157853 139204 145727 153301 151081 164035 174530 164082
17559A64082j3818K785j00j6148k7748o796j7452j0940M623n101n419K7590J3998
$$ 164082 150264 153049 152949 136801 109053 102257 84805 73865 78488 73387 67968 95558 109556
17546A09556N401K576J8449L130k3495L0475J2911K4463O290O249J2191K9017
$$ 109556 114957 117533 135982 139112 115617 146092 159003 183466 189756 196005 208196 237213
17534B37213L9036L3100L4564M0644J8572J7134L5489J0130k990k1504l9996j9972
$$ 237213 276249 309349 343913 384557 403129 420263 455752 465882 462892 441388 401392 381420
17522C81420n5514l7400m8163j8824k2518n8664l6217l6958j1974j1243k6649
$$ 381420 325906 288506 240343 221519 199001 140337 104120 67162 55188 43945 17296
17511A7296j8502q022n837J5182J0873R541N086k1882J293l170j8260p168l465
$$ 17296 -1206 -9228 -15065 117 10990 20531 25617 3735 5028 1858 -16402 -23570 -27035
17498b7035l064Q952O955j2839J9217J5752k01j3470p167j1914l507l082J024
$$ -27035 -30099 -21147 -14192 -27031 -7814 7938 7737 -5733 -12900 -24814 -28321 -31403 -30379
17485c0379P709q604J2722o134k1533K5220J8123J0626k0610Q151n615j657l316
$$ -30379 -22670 -31274 -18552 -24686 -46219 -20999 -2876 7750 -12860 -4709 -10324 -11981 -15297
17472a5297J6494n519j7773l839K0175n327j2281j0418k256l382l1602R197l7
$$ -15297 1197 -4322 -22095 -25934 -5759 -11086 -23367 -33785 -36041 -39423 -71025 -61828 -61865
17459f1865k4629J5176K799p48J70j1677R141o757K5713L3128M94M276K8978L0698
$$ -61865 -86494 -71318 -68519 -69267 -69097 -80774 -71633 -78390 -52677 -19549 -19055 -14779 14199 44897
17445D4897N1269M6205L4496J7584N596j7879n651o052j5433k5395L493K1738
$$ 44897 96166 142371 176867 194451 200047 182168 176517 170465 155032 129637 133130 154868
17433A54868O3733O1879K0230J5481j8289j443j1843l1247j7908j0992j0986k1585
$$ 154868 218601 280480 300710 316191 297902 296459 284616 253369 235461 224469 213483 191898
17421A91898j9805k6282m5021m8008K421K9348j168l4970j8084m951k332J0546
$$ 191898 172093 145811 100790 52782 55203 84551 83383 48413 30329 25378 23046 33592
17409C3592r884j3796M350o498K888O828k0015l0428o333J5443Q955q776m795
$$ 33592 23708 9912 14262 7764 10652 17480 -2535 -32963 -39296 -23853 -14898 -23674 -28469
17396b8469j563j9034j9101J3311L5616J9962J1924l092L3833L0075J2984K6991
$$ -28469 -30032 -49066 -68167 -54856 -19240 722 12646 9554 43387 73462 86446 113437
17384A13437J2744L4107N4238N7484O3981K9435K5500K3254L5569N3683M775j5209
$$ 113437 126181 160288 214526 272010 335991 365426 390926 414180 449749 503432 508207 492998
17372D92998K3386j1175k9903k3617n8744j8047j6113m4261o6185k8129k0880
$$ 492998 516384 505209 475306 451689 392945 374898 358785 314524 248339 220210 199330
17361A99330l8553n0263l4240k4430r323j4280k0570l563l618j7251J6572J8596
$$ 199330 160777 110514 76274 51844 42521 28241 7671 4108 490 -16761 -189 18407
17349A8407L181j5009m1293j4781K0093l241L278J4765k277j2828j8772k2342
$$ 18407 21588 6579 -34714 -49495 -29402 -32643 -29365 -14600 -16877 -29705 -48477 -70819
17337g0819K392k384R809M0844L3870P723l4075J642K7572J5694J4919k1313k2452
$$ -70819 -68427 -70811 -61002 -20158 13712 21435 -12640 -10998 16574 32268 47187 25874 3422
17324C422J4142K6143N0044K9374K8724K9701J4092J5430P008J7666K2059j5610
$$ 3422 17564 43707 93751 123125 151849 181550 195642 211072 218080 235746 257805 242195
17312B42195j0850j1768k5626n0131l2185k4899j6700l6634n011j2519l855K1826
$$ 242195 231345 219577 193951 143820 111635 86736 70036 33402 28391 15872 12017 33843
17300C3843j1087k9666l2503l7626J2593L8326L4325J5251j4129j2333Q17K2664
$$ 33843 22756 -6910 -39413 -77039 -64446 -26120 8205 23456 9327 -3006 -2189 20475
17288B0475M883j1377k2003j1586K3897m411j0774J650K5105p220j6844K203m517
$$ 20475 25358 13981 -8022 -19608 4289 -122 -10896 -9246 15859 8639 -8205 -6002 -10519
17275a0519l3951j0438K1864J8045J0122p799m818j3649j9069k6057J0662K2953
$$ -10519 -44470 -54908 -33044 -14999 -4877 -12676 -17494 -31143 -50212 -76269 -65607 -42654
17263d2654K257k3241n835J3324K3622j465p835J554p196j787j6473j8595m632
$$ -42654 -40397 -63638 -69473 -56149 -32527 -33992 -41827 -40273 -47469 -49256 -65729 -84324 -88956
17250h8956K8986J2530K0307J8205j1774r649K8985O999l655j651n322k2769j2649
$$ -88956 -59970 -47440 -27133 -8928 -20702 -30351 -1366 5633 1978 327 -4995 -27764 -40413
17237d0413J6223R488Q750k3637O60K1089M9788k3787k8044O745k4924j606Q678
$$ -40413 -24190 -14702 -5952 -29589 -28929 -7840 41948 18161 -9883 -3138 -28062 -29668 -20990
17224b0990K1450K2513j1701j7248k5124j0451O397j1266L313M309k259l536K0070
$$ -20990 460 22973 11272 -5976 -31100 -41551 -35154 -46420 -43107 -38798 -41057 -44593 -24523
17211b4523J3058j4143k6386k299m615J5122J7941j170p957j4076M3L799K768
$$ -24523 -11465 -25608 -51994 -54293 -58908 -43786 -25845 -27015 -34972 -49048 -49005 -45206 -42438
17198d2438J2761l398k616l383j2796P77Q069J2519J1665k535p831p76p409J4019
$$ -42438 -29677 -33075 -35691 -39074 -51870 -51093 -43024 -30505 -18840 -21375 -29206 -29982 -37391 -23372
17184b3372Q640l253j5532l1792k560J0646J3994K1339Q695n819k1545j1987L588
$$ -23372 -14732 -17985 -33517 -65309 -67869 -57223 -43229 -21890 -13195 -19014 -40559 -52546 -48958
17171d8958l502p241Q724K6689j0234n7825j6463K1588L3294j3522l953R603K6523
$$ -48958 -52460 -59701 -50977 -24288 -34522 -92347 -108810 -87222 -53928 -67450 -71403 -61800 -35277
17158c5277K0196L433k3232r725j7469J4729L110o913q009k6873l0508o244k518
$$ -35277 -15081 -11648 -34880 -44605 -62074 -47345 -44235 -51148 -59157 -86030 -116538 -122782 -125300
17145a25300K5893K0518J6071K8622k7897j7028J1218M0831J8646J492j3857j9889
$$ -125300 -99407 -78889 -62818 -34196 -62093 -79121 -67903 -27072 -8426 -6934 -20791 -40680
17133d0680M040q488j182L2600l0013k4842r555J574K273l036O407l7564m831
$$ -40680 -36640 -45128 -46310 -13710 -43723 -68565 -78120 -76546 -74273 -77309 -70902 -108466 -113297
17120a13297K6488K4797L242n487o244J2420N95J9856j0638q628J7666k4206m47
$$ -113297 -86809 -62012 -58770 -64257 -70501 -58081 -57486 -37630 -48268 -56896 -39230 -63436 -63883
17107f3883J2604L4188O928o381J4016J7266N021j2117j1374O851j6972q247N678
$$ -63883 -51279 -17091 -10163 -16544 -2528 14738 19759 7642 -3732 3119 -13853 -22100 -16422
17094a6422m252J279M059j267r753K1914n504k7227j3473p397j4290j9071K8146
$$ -16422 -20674 -19395 -15336 -16603 -26356 -4442 -9946 -37173 -50646 -58043 -72333 -91404 -63258
17081f3258M0662M938n56l3078M551J3021k3802k274K2625p996K3383P721k2306
$$ -63258 -22596 -17658 -18214 -51292 -46741 -33720 -57522 -59796 -37171 -45167 -21784 -14063 -36369
17068c6369P295L758j5219P091J7152j3453P329j6026j151l144j2375K962p695
$$ -36369 -29074 -25316 -40535 -33444 -16292 -29745 -22416 -38442 -39593 -42737 -55112 -52150 -59845
17055e9845N085L2156k4952k2813J2242K0182k997k5730l666K138K4648J5991
$$ -59845 -54760 -22604 -47556 -70369 -58127 -37945 -40942 -66672 -70338 -68200 -43552 -27561
17043b7561k868j49J0300J0793R052K0490k1856j5958j7318l3498J4907L935R023
$$ -27561 -30429 -30578 -20278 -9485 -433 20057 -1799 -17757 -35075 -68573 -53666 -49731 -40708
17030d0708K4023L794q021m150J992o918K3495J204k6417J347n25j5004r404o773
$$ -40708 -16685 -12891 -20912 -25062 -23070 -29988 -6493 -5289 -31706 -30359 -30884 -45888 -55292 -62065
17016f2065j4757L1540K6292m57j6180M332j7956p368K317J0499R625k2161l1529
$$ -62065 -76822 -45282 -18990 -19447 -35627 -31295 -49251 -56619 -54302 -43803 -34178 -56339 -87868
17003h7868J3275J1114J0509J6926j921j4924j9960J702P631j8424l0450J3574
$$ -87868 -74593 -63479 -52970 -36044 -37965 -52889 -72849 -71147 -63516 -81940 -112390 -98816
16991i8816J4414J7566O985r302J2614J3757L2442Q859l4636r732K8689k8861
$$ -98816 -84402 -66836 -59851 -69153 -56539 -42782 -10340 -1481 -36117 -45849 -17160 -46021
16979d6021J452R593k6742r216K4149L49K0159P189k011l948k0352o455J451J2962
$$ -46021 -44569 -34976 -61718 -70934 -46785 -46436 -26277 -19088 -21099 -25047 -45399 -51854 -50403 -37441
16965c7441K359k7868q071J0002J9170J8552m980m293m105k2995Q437K0361m1163
$$ -37441 -35082 -62950 -71021 -61019 -41849 -23297 -28277 -32570 -36675 -59670 -51233 -30872 -72035
16952g2035j7764r576O047N0141K4562J5446q210l7272n208k569L7480M0642K0380
$$ -72035 -89799 -99375 -93328 -43187 -18625 -3179 -11389 -48661 -53869 -56438 -18958 21684 42064
16939D2064M546k3357n0621l7348J4162J2471j4068r959k3873L724L632J1126
$$ 42064 46610 23253 -27368 -64716 -50554 -38083 -52151 -62110 -85983 -82259 -78627 -67501
16927f7501l08J1052J547k736J3383L771n94J903J8767J7903o347n973l0634k6945
$$ -67501 -67809 -56757 -55210 -57946 -44563 -40792 -41386 -39483 -20716 -2813 -9160 -15133 -45767 -72712
16913g2712j6996R149L019o427J3524J4945j3068q813K1101O382J0989k0399J9764
$$ -72712 -89708 -80559 -77540 -83967 -70443 -55498 -68566 -77379 -56278 -49896 -38907 -59306 -39542
16900c9542m14j8229k8526q95J6407K3885J2949L443j0565l390J2597K6663k2074
$$ -39542 -39956 -58185 -86711 -87606 -71199 -47314 -34365 -30922 -41487 -44877 -32280 -5617 -27691
16887b7691j7649P352j428N012K848j2657j963l8182j3880P798j1308J3002J6935
$$ -27691 -45340 -37988 -39416 -34404 -31556 -44213 -46176 -84358 -98238 -90440 -101748 -88746 -71811
16874g1811K5955J1631R439O448q774n385r10j2394r250J5038m225N220J2798
$$ -71811 -45856 -34225 -24786 -18338 -27112 -32497 -33407 -45801 -55051 -40013 -44238 -39018 -26220
16861b6220N686q666K4671l6291k7193M240j7176J4823K2641k004k5121j0441
$$ -26220 -20534 -29200 -4529 -40820 -68013 -63773 -80949 -66126 -43485 -45489 -70610 -81051
16849h1051p607O798K8210L611j6917M924j0105k9121L4576L4666L585j4387j7657
$$ -81051 -88658 -81860 -53650 -50039 -66956 -62032 -72137 -101258 -66682 -32016 -28431 -42818 -60475
16836f0475r340l029j5375J756J8229K1372q248l166R352m682j684J1522J6635
$$ -60475 -69815 -72844 -88219 -86463 -68234 -46862 -55110 -58276 -48924 -53606 -55290 -43768 -27133
16823b7133q351j4579r979P001L56J0999m876J7922r818k664L971J6640m169j4275
$$ -27133 -35484 -50063 -60042 -53041 -52685 -41686 -46562 -28640 -38458 -41122 -37151 -20511 -24680 -38955
16809c8955J5550J5933k5974j4337J4986J1856m4679K945K4136j0983j8809O974
$$ -38955 -23405 -7472 -33446 -47783 -32797 -20941 -65620 -62675 -38539 -49522 -68331 -61357
16797f1357p287P316K1297J2772n860k0601j677J8064J4975O037k2909j723L426
$$ -61357 -68644 -61328 -40031 -27259 -33119 -53720 -55397 -37333 -22358 -16321 -39230 -40953 -37527
16784c7527j3507j019l439q277R320j010o408J9464J3536O013j6510L637q567
$$ -37527 -51034 -52053 -55492 -63769 -54449 -55459 -61867 -42403 -28867 -22854 -39364 -35727 -44294
16771d4294k404J9051M57k2085k5280r152L8848r078P563N916q571J3554j6762
$$ -44294 -46698 -27647 -27190 -49275 -74555 -83707 -44859 -53937 -46374 -40458 -49029 -35475 -52237
16758e2237r639J1070O40k3683p93M286m137j176j4149q656R617j7612j0663J1959
$$ -52237 -61876 -50806 -50166 -73849 -74642 -70356 -74493 -75669 -89818 -98474 -88857 -106469 -117132 -105173
16744a05173K1178K0875P693q544K9024j3150l1860j9382J4793K7042n54J8876
$$ -105173 -83995 -63120 -55427 -63971 -34947 -48097 -79957 -99339 -84546 -57504 -58058 -39182
16732c9182l599j824m704j8258j2398R835K3895O51r240k681j1294K4504J8747
$$ -39182 -42781 -44605 -49309 -67567 -79965 -70130 -46235 -45584 -54824 -57505 -68799 -44295 -25548
16719b5548k2748P826N156K2098r739j2409K1492K2771j3822m285j7557L559j1054
$$ -25548 -48296 -40470 -35314 -13216 -22955 -35364 -13872 8899 -4923 -9208 -26765 -23206 -34260
16706c4260l4779Q506J529P667j6509N9R559Q511K5131n3800l2743J1174K3911
$$ -34260 -69039 -60533 -59004 -51337 -67846 -67787 -58228 -49717 -24586 -78386 -111129 -99955 -76044
16693g6044J175K0597o640j6230K942K1941O065o942j397r703L931J4155j0631
$$ -76044 -74869 -54272 -60912 -77142 -74200 -52259 -46194 -53136 -54533 -64236 -60305 -46150 -56781
16680e6781J5366K9484j5952L427j1646j1736J2231j0175J6584K3826J1783q222
$$ -56781 -41415 -11931 -27883 -24456 -36102 -47838 -35607 -45782 -29198 -5372 6411 -1811
16668a811k604j9730r872L2136K8555n855l4498k4024k5762N494n356j675J2420
$$ -1811 -4415 -24145 -34017 -1881 26674 20819 -13679 -37703 -63465 -57971 -63327 -65002 -52582
16655e2582j2951N545j1072n966q648q563J3828L6148J6250O905j3069J6471J68
$$ -52582 -65533 -59988 -71060 -77026 -85674 -94237 -80409 -44261 -28011 -21106 -34175 -17704 -17536
16642a7536K491P901j2695j2597j8179Q010K0180p077j6593m946J7601J8843l1840
$$ -17536 -15045 -7144 -19839 -32436 -50615 -42605 -22425 -29502 -46095 -51041 -33440 -14597 -46437
16629d6437j8875J2236R714L426j5726K993j1480j3530K91N231L414J5743J443
$$ -46437 -65312 -53076 -43362 -39936 -55662 -52669 -64149 -77679 -77388 -72157 -68743 -53000 -51557
16616e1557m7419P644O407J3290R850j2337j630K1988K3435N400m23J790j4337
$$ -51557 -98976 -91332 -84925 -71635 -61785 -74122 -75752 -53764 -30329 -24929 -25352 -23562 -37899
16603c7899k3784K1473J9299J9050K8996j2535j8179p223j8142L584j3378Q580
$$ -37899 -61683 -40210 -20911 -1861 27135 14600 -3579 -10802 -28944 -25360 -38738 -30158
16591c0158j2158j7439N971j0559K0553L0699k150j4093r664l6045j652M865r409
$$ -30158 -42316 -59755 -53784 -64343 -43790 -13091 -15241 -29334 -38998 -75043 -76695 -71830 -81239
16578h1239r512K876J6147m542J5140L5571j7953L102K0072m3076k4834O109J4664
$$ -81239 -90751 -87875 -71728 -76270 -61130 -25559 -43512 -40410 -20338 -63414 -88248 -82139 -67475
16565f7475J4558P001j8577j2888j8310j652K3117P002J1827J58P201k0193M1564
$$ -67475 -52917 -45916 -64493 -77381 -95691 -97343 -74226 -67224 -55397 -55239 -48038 -68231 -26667
16552b6667J2941j3176j3599P036J1112j0702j0271K8001L1776R373p827m749
$$ -26667 -13726 -26902 -40501 -33465 -22353 -33055 -43326 -15325 16451 25824 17997 13248
16540A3248j6759j3257j1562L679N416j7246m211K5876n949l1730j4674J0643
$$ 13248 -3511 -16768 -28330 -24651 -19235 -36481 -40692 -14816 -20765 -52495 -67169 -56526
16528e6526K0052J6123j0776J6561K2113K182L419k5678j1532L024N101N330J8233
$$ -56526 -36474 -20351 -31127 -14566 7547 9729 13148 -12530 -24062 -21038 -15937 -10607 7626
16515G626R381j2263l5098j690K4371J9002o564k3442k0363o897j2078J27J8076
$$ 7626 17007 4744 -30354 -32044 -7673 11329 4765 -18677 -39040 -45937 -58015 -57888 -39812
16502c9812o182J696j6705k0845J6350P648k2992J9308m862j1959j1304p15l773
$$ -39812 -45994 -44298 -61003 -81848 -65498 -57850 -80842 -61534 -66396 -78355 -89659 -90374 -94147
16489i4147N094L4301j8425j0660Q397K5013M0937l547q631j3046K1689r771j0224
$$ -94147 -89053 -54752 -73177 -83837 -75440 -50427 -9490 -13037 -21668 -34714 -13025 -22796 -33020
16476c3020O929J5564K8931o260j7503j6939m313r563q41J0660K412n929p90K7273
$$ -33020 -26091 -10527 18404 12144 -5359 -22298 -26611 -36174 -37015 -26355 -23943 -29872 -30662 -3389
16462c389J1626k7429k5749J3113j5816q500L292O791L4882J5670J7442k7609
$$ -3389 8237 -19192 -44941 -31828 -47644 -56144 -52852 -46061 -11179 4491 21933 -5676
16450e676l4235J7301P384J1582K4744k853k2780n977K389j5161k4157J0484r364
$$ -5676 -39911 -22610 -15226 -3644 21100 18247 -4533 -10510 -8121 -23282 -47439 -36955 -46319
16437d6319J1459J5684m170O950L784j7609k4722K268K446k3481J7722j457q20
$$ -46319 -34860 -19176 -23346 -16396 -12612 -30221 -54943 -52675 -50229 -73710 -55988 -57445 -58265
16424e8265J0038k2214N043J2267P717R73j7107j3623Q724K2158j5445N955L9812
$$ -58265 -48227 -70441 -65398 -53131 -45414 -44441 -61548 -75171 -66447 -44289 -59734 -53779 -13967
16411a3967L466j7655r204k1879j2140J4173l506j3963K5325l6536l504L104R414
$$ -13967 -10501 -28156 -37360 -59239 -71379 -57206 -60712 -74675 -49350 -85886 -89390 -86286 -76872
16398g6872L4647K7386j8158o610n968n997P725J1322o502J6467P310L752j3951
$$ -76872 -42225 -14839 -32997 -39607 -45575 -51572 -43847 -32525 -39027 -22560 -15250 -11498 -25449
16385b5449j6449J3115J775p946j0412p976L84n953K6148L733k0601k6287o009
$$ -25449 -41898 -28783 -27008 -34954 -45366 -53342 -52958 -58911 -32763 -29030 -49631 -75918 -81927
16372h1927K141K8411N464J651R405K2830J0013P262j4586P272l264j0930J6778
$$ -81927 -79786 -51375 -45911 -44260 -34855 -12025 -2012 5250 -9336 -2064 -5328 -16258 520
16359E20J459l0540l788j9853k287l930j5560n772J0357l773j903l018J748J1909
$$ 520 1979 -28561 -32349 -52202 -54489 -58419 -73979 -79751 -69394 -73167 -75070 -78088 -76340 -64431
16345f4431R66K2634K283m0841l14J1895K9551K2613L0335J5623j3694k0302q710
$$ -64431 -63465 -40831 -38548 -79389 -79703 -67808 -38257 -15644 14691 30314 16620 -3682 -12392
16332a2392l3872m265L7528R126k1204l6877p339Q613R6m623j526J0023J9200
$$ -12392 -46264 -50529 -13001 -3875 -25079 -61956 -69295 -60682 -60586 -65209 -66735 -56712 -37512
16319c7512o975m806J6760p462J0104J0408p413N586J1650J3252q134l0869k272
$$ -37512 -44487 -49293 -32533 -39995 -29891 -19483 -26896 -21310 -9660 3592 -4542 -35411 -37683
16306c7683J5680j9624m42J9148j6645j4257R267N372j7378q747n939L901L4981
$$ -37683 -22003 -41627 -42069 -22921 -39566 -53823 -44556 -39184 -56562 -65309 -71248 -67347 -32366
16293c2366L7207q830l9450k5524j3695K8341L223k0511J4240J8218K6643j003
$$ -32366 4841 -3989 -43439 -68963 -82658 -54317 -51094 -71605 -57365 -39147 -12504 -13507
16281a3507k4205r645l1449J9855M439M77m345K1727J0271K5228J9077k4746l7005
$$ -13507 -37712 -47357 -78806 -58951 -54512 -54035 -58380 -36653 -26382 -1154 17923 -6823 -43828
16268d3828j1529j4878J59P924n707Q488J5075p93m460J511Q13j6156J527P450
$$ -43828 -55357 -70235 -70076 -62152 -67859 -59371 -44296 -45089 -49549 -48038 -47225 -63381 -61854 -54404
16254e4404J2638r133j1590j0332N324J4368M250J3030L8497R344l1565k4160
$$ -54404 -41766 -50899 -62489 -72821 -67497 -53129 -48879 -35849 2648 11992 -19573 -43733
16242d3733r197J9869L5806j3888L240n820k976K532l1710j2813O629K4075n878
$$ -43733 -52930 -33061 2745 -11143 -7903 -13723 -16699 -14167 -45877 -58690 -52061 -27986 -33864
16229c3864k4553k603j3896Q428M741k2251J4415K720k125N71L7759k613k0944
$$ -33864 -58417 -61020 -74916 -66488 -61747 -83998 -69583 -66863 -68988 -68417 -30658 -33271 -54215
16216e4215N706j3672j2292J3789J9231M546J6288J9575o122N776k1611j3337
$$ -54215 -48509 -62181 -74473 -60684 -41453 -36907 -20619 -1044 -7166 -1390 -23001 -36338
16204c6338O762K9569k0519k5579m533L921n517l258N010j8609N083N032k406
$$ -36338 -29576 -7 -20526 -46105 -50638 -46717 -52234 -55492 -50482 -69091 -64008 -58976 -61382
16191f1382N919J0196k089J266K3482n748K1254K250m2991k7559k977N0276L2791
$$ -61382 -55463 -45267 -47356 -46090 -22608 -28356 -7102 -4852 -47843 -75402 -78379 -28103 4688
16178D688j3708l4625l937J4098J0005j91k731j485q169n080J9006j3754k1974
$$ 4688 -9020 -43645 -47582 -33484 -23479 -23670 -26401 -27886 -36055 -41135 -22129 -35883 -57857
16165e7857Q548J4378j4493O271j2413q244K1646O614L606p611n243O120L170
$$ -57857 -49309 -34931 -49424 -43153 -55566 -63810 -42164 -35550 -31944 -39555 -44798 -38678 -35508
16152c5508p382J1623m785k0862j953J4732m614J4628n508k0199J832k4318K6968
$$ -35508 -42890 -31267 -36052 -56914 -58867 -44135 -48749 -34121 -39629 -59828 -57996 -82314 -55346
16139e5346K0111J4564M920L721R952j9245J408M234l289k2941k1101J7088K1693
$$ -55346 -35235 -20671 -15751 -12030 -2078 -21323 -19915 -15681 -18970 -41911 -63012 -45924 -24231
16126b4231q080k6912j1367q661j7490J8280K3664J9510J1920N630j5433j2788
$$ -24231 -32311 -59223 -70590 -79251 -96741 -78461 -54797 -35287 -23367 -17737 -33170 -45958
16114d5958j0502o86L581N612k0144k2051o630J7712p555O98L697L2533j1933
$$ -45958 -56460 -57146 -53565 -47953 -68097 -90148 -96778 -79066 -86621 -85923 -82226 -49693 -61626
16101f1626L571Q311k58K28j1914Q619L2666P323o647J1757k5355j8910J0886
$$ -61626 -58055 -49744 -50002 -49774 -61688 -53069 -20403 -13080 -19727 -7970 -33325 -52235 -41349
16088d1349l857Q268J2221J3274k5631m603j0137J995M997L339J8724J3071q619
$$ -41349 -45206 -36938 -24717 -11443 -37074 -41677 -51814 -49819 -44822 -41483 -22759 -9688 -18307
16075a8307o837J845J0980P584j7123j7534j5580K2659k836k01j3728Q289K592
$$ -18307 -25144 -23299 -12319 -4735 -21858 -39392 -54972 -32313 -35149 -35350 -49078 -40789 -38197
16062c8197j7186o702K6079J4449j5590k0780n11K8745j3615J1005q039J6883
$$ -38197 -55383 -62085 -36006 -21557 -37147 -57927 -58438 -29693 -43308 -32303 -40342 -23459
16050b3459K5881J963k1434R085m794j1068l248k5957j0631j4343R226J7507J8464
$$ -23459 2422 4385 -17049 -7964 -12758 -23826 -27074 -53031 -63662 -78005 -68779 -51272 -32808
16037c2808k629o553Q01k707K3885J4874J702k1944l5415J1086L3405p039j7880
$$ -32808 -35437 -41990 -41189 -43896 -20011 -5137 -3435 -25379 -60794 -49708 -16303 -23342 -41222
16024d1222k552J3377N099j359j0031q071k1217R140L223J2126M391K499k768
$$ -41222 -43774 -30397 -25298 -26657 -36688 -44759 -65976 -56836 -53613 -41487 -37096 -34597 -37365
16011c7365n389l4759J5771K5401K0837j1284J8335j8132k707J3113r351j5020
$$ -37365 -42754 -77513 -61742 -36341 -15504 -26788 -8453 -26585 -29292 -16179 -25530 -40550
15999d0550j8590k97L5889J9642J1781L147j0610n185j3198n872m022K4886Q103
$$ -40550 -59140 -59437 -23548 -3906 7875 11022 412 -4773 -17971 -23843 -27865 -2979 5124
15986E124j0630Q99l8129k0053p4J4630J7406K1222k1906L123J8690k6601k2303
$$ 5124 -5506 -4607 -42736 -62789 -62863 -48233 -30827 -9605 -31511 -28388 -9698 -36299 -58602
15973e8602j3310J2770O637J6053P34m060Q787J3496l2p034l242J4748P496o132
$$ -58602 -71912 -59142 -52505 -36452 -35718 -39778 -30991 -17495 -17527 -24561 -27803 -13055 -5559 -11691
15959a1691q808P875P079J0034k7712o287j55J4609r602k6077R957J0091j5834
$$ -11691 -20499 -12624 -5545 4489 -23223 -29510 -29665 -15056 -24658 -50735 -40778 -30687 -46521
15946d6521J2236o461K455K3176J8318N249j5005Q746l0660l894L121K0785K3638
$$ -46521 -34285 -40746 -38291 -15115 3203 8452 -6553 2193 -28467 -32361 -29240 -8455 15183
15933A5183k1674k8660j0568j1663M285l220K707K9340K6912j1817m3023J1537
$$ 15183 -6491 -35151 -45719 -57382 -53097 -56317 -53610 -24270 2642 -9175 -52198 -40661
15921d0661K2829o147m311k1826K6324j895n226n67K0582q63k112j9597J5439
$$ -40661 -17832 -23979 -28290 -50116 -23792 -25687 -30913 -31480 -10898 -11761 -13873 -33470 -18031
15908a8031J0490j6082K664J2579r08M583r517J6265o489l100k060L30J3662P222
$$ -18031 -7541 -23623 -20959 -8380 -9288 -4705 -14222 2043 -4446 -7546 -9606 -9276 4386 11608
15894A1608P879j6177n592k8246P23r511k3739J3436L0447k5071J550J1968N910
$$ 11608 19487 3310 -2282 -30528 -29805 -39316 -63055 -49619 -19172 -44243 -42693 -30725 -24815
15881b4815k0179J5304L3728N072J429M1009J5158m5505k984k794k1073M306Q545
$$ -24815 -44994 -29690 4038 9110 10539 51548 66706 21201 18217 15423 -5650 -1344 7201
15868G201J3737O044l0489k0765j956q650J0063M598m7847l3884K7756K7673J5663
$$ 7201 20938 26982 -3507 -24272 -26228 -34878 -24815 -20217 -68064 -101948 -74192 -46519 -30856
15855c0856K2472P738J3196j0388k6350o727J1333R531j0723m1749m57J7038J2111
$$ -30856 -8384 -646 12550 2162 -24188 -30915 -19582 -10051 -20774 -62523 -62980 -45942 -33831
15842c3831j2265J5992j8337k5061m553L8866Q280j3371n943K102R730J3888L295
$$ -33831 -46096 -30104 -48441 -73502 -78055 -39189 -30909 -44280 -50223 -48121 -38391 -24503 -21208
15829b1208J9856Q235k9357l1824j0689n057R340L292L074J0369J8032J5210L2056
$$ -21208 -1352 6883 -22474 -54298 -64987 -70044 -60704 -57412 -54338 -43969 -25937 -10727 21329
15816B1329k1733o931N194Q542R474l6415q681j1331k884J8577K6219n183M830
$$ 21329 -404 -7335 -2141 6401 15875 -20540 -29221 -40552 -43436 -24859 1360 -3823 1007
15803A007k9074p986j303r360O954J0039k377J390J3008j9786R965M588j8232
$$ 1007 -28067 -36053 -37356 -46716 -39762 -29723 -32100 -30710 -17702 -37488 -27523 -22935 -41167
15790d1167K294K2187J7263j0656j5479j2215l498m3268j413J7779L7428J9250
$$ -41167 -38873 -16686 577 -10079 -25558 -37773 -41271 -84539 -85952 -68173 -30745 -11495
15778a1495p728o154j6313M994J7265J9996r765L5049K4663k8230l5586j5314
$$ -11495 -19223 -25377 -41690 -36696 -19431 565 -9200 25849 50512 22282 -13304 -28618
15766b8618m707k1332m04O111J8581J5367k992k1229j6276J1243K3323k580j3803
$$ -28618 -33325 -54657 -55061 -48950 -30369 -15002 -17994 -39223 -55499 -44256 -20933 -23513 -37316
15753c7316l1338j0532K6722j901L554Q192j3493Q612q629J3621J3640k2630m803
$$ -37316 -68654 -79186 -52464 -54365 -50811 -42619 -56112 -47500 -56129 -42508 -28868 -51498 -56301
15740e6301j4387j0251n299P921L4256R406l6457J7228J6964J6718L5603j618
$$ -56301 -70688 -80939 -86238 -78317 -44061 -34655 -71112 -53884 -36920 -20202 15401 13783
15728A3783j3503k0303R062m901j4136j6737m24p933P867m563k1558j7420J6645
$$ 13783 280 -20023 -10961 -15862 -29998 -46735 -47159 -55092 -47225 -51788 -73346 -90766 -74121
15715g4121K374P277L786K0646m10l5488q731K0788J9128j1J1680P743m8573p628
$$ -74121 -71747 -64470 -60684 -40038 -40448 -75936 -84667 -63879 -44751 -44762 -33082 -25339 -73912 -81540
15701h1540M871J5941J4812P863K0276K1656q891j745k845l5700j2138Q41k738
$$ -81540 -76669 -60728 -45916 -38053 -17777 3879 -5012 -6757 -9602 -45302 -57440 -56599 -59337
15688e9337j0623M507J2677J0892J3365J4185J4542J6920J547j7109l0202m0225
$$ -59337 -69960 -65453 -52776 -41884 -28519 -14334 208 17128 18675 1566 -28636 -68861
15676f8861j485J0668J8592J4107k3826J1307m715K5374j2420J1978P421k7063
$$ -68861 -70346 -59678 -41086 -26979 -50805 -39498 -44213 -18839 -31259 -19281 -11860 -38923
15664c8923K3102K1901j1812j8283j2779K153J5603j264j3486N432L7520N287
$$ -38923 -15821 6080 -5732 -24015 -36794 -34641 -19038 -20302 -33788 -28356 9164 14451
15652A4451l6187j8780M0083L1661l0581j8999l6208l0904K5532O798J4214J5669
$$ 14451 -21736 -40516 -433 31228 647 -18352 -54560 -85464 -59932 -53134 -38920 -23251
15640b3251J65K9175r842l811q606l0618l1074j6683O602J3007L8450j743j0754
$$ -23251 -23086 6089 -3753 -7564 -16170 -46788 -77862 -94545 -87943 -74936 -36486 -38229 -48983
15627d8983K6721J4356j4035m5853J6520K8395n839J1790J1606j1275M98N875
$$ -48983 -22262 -7906 -21941 -67794 -51274 -22879 -28718 -16928 -5322 -16597 -16099 -10224
15615a0224J216n213J0785N482l8345k2249J3278Q577K0909Q433k1671n307j1557
$$ -10224 -9008 -14221 -3436 2046 -36299 -58548 -45270 -36693 -15784 -7351 -29022 -34329 -45886
15602d5886J3995O634K8010p731k5003r447P918k8094k0966P317J1796K89M184
$$ -45886 -31891 -25257 2753 -4978 -29981 -39428 -31510 -59604 -80570 -73253 -61457 -61168 -56984
15589e6984J9516N470k3365l3069j2961R831J1584J0922m181L2903L8701L352
$$ -56984 -37468 -31998 -55363 -88432 -101393 -91562 -79978 -69056 -73237 -40334 -1633 1719
15577A719O602j5870r195j5749L662K755j2429n219J7837J4931j4841K079K1779
$$ 1719 8321 -7549 -16744 -32493 -28831 -26076 -38505 -43724 -25887 -10956 -25797 -23718 -1939
15564a939l3066l1534P35M508K1588l648M125k70J8129K6609j0453j7029k3193
$$ -1939 -35005 -66539 -65804 -61296 -39708 -43356 -39231 -39501 -21372 5237 -5216 -22245 -45438
15551d5438j4532L8076L5969J1205k5803k5771J2179K568J2272J4378j4279k3029
$$ -45438 -59970 -21894 14075 25280 -523 -26294 -14115 -11547 725 15103 824 -22205
15539b2205j9212k345J2352k5116k2920J2190M416K6073M377j8356k090k635j528
$$ -22205 -41417 -43762 -31410 -56526 -79446 -67256 -62840 -36767 -32390 -50746 -52836 -55471 -56999
15526e6999M301Q129k3646Q596K4993N149r750J3406J844j4006J5603Q56k193
$$ -56999 -52698 -44569 -68215 -59619 -34626 -29477 -39227 -25821 -23977 -37983 -22380 -21524 -23717
15513b3717j0559L150K8249K3989k314k0214j3356l738J7368k096l171K2676k964
$$ -23717 -34276 -31126 -2877 21112 18798 -1416 -14772 -18510 -1142 -3238 -6409 16267 13303
15500A3303j9085j8524N720J1467J8419j3778L274J5499l5556j8298R523k3918
$$ 13303 -5782 -24306 -18586 -7119 11300 -2478 796 16295 -19261 -37559 -28036 -51954
15488e1954j0186J6700L1298J3016k4190k1314l4431O266K6484J8057j098O130
$$ -51954 -62140 -45440 -14142 -1126 -25316 -46630 -81061 -74795 -48311 -30254 -31352 -25222
15476b5222p595Q557J2829j3357M70l2319L9865K4619j5731L217J3800K847j1689
$$ -25222 -32817 -24260 -11431 -24788 -24318 -56637 -16772 7847 -7884 -4667 9133 11980 291
15463B91R032j4021l920r191J6864J2765k7847K8013K0553k6239l9713j2411R767
$$ 291 9323 -4698 -8618 -17809 -945 11820 -16027 11986 32539 6300 -33413 -45824 -36057
15450c6057j2943j8477R936O988r949j1084J4152M4354j8505J1902K8809k108
$$ -36057 -49000 -67477 -57541 -50553 -60502 -71586 -57434 -13080 -31585 -19683 9126 7018
15438G018p676o05R824p101k401K6069k703j5497l5488N349p059k1347K1544N013
$$ 7018 -658 -1263 8561 1460 -941 25128 22425 6928 -28560 -23211 -30270 -51617 -30073 -25060
15424b5060J0282J2289j938j3627k8173J4077J7046L721j498N964M238o95j4240
$$ -25060 -14778 -2489 -4427 -18054 -46227 -32150 -15104 -11383 -12881 -6917 -2679 -3374 -17614
15411a7614j2893j1646j1486J0082M164j5551J328J6130M916L391R287j6875l5115
$$ -17614 -30507 -42153 -53639 -43557 -39393 -54944 -53616 -37486 -32570 -29179 -19892 -36767 -71882
15398g1882p123j2451P454L2565l527k0894J0255K361K1368O6841K4144k4518
$$ -71882 -79005 -91456 -84002 -51437 -54964 -75858 -65603 -63242 -41874 24967 49111 24593
15386B4593l2598n018Q178J802j252j6842k771j0010k975r464J3270J160K372
$$ 24593 -8005 -13023 -4845 -3043 -4295 -21137 -23908 -33918 -36893 -46357 -33087 -31927 -29555
15373b9555q846Q930J5313k799m5849j6287J4011L9064K2402j4887m0989J3812
$$ -29555 -38401 -29471 -14158 -16957 -62806 -79093 -65082 -26018 -3616 -18503 -59492 -45680
15361d5680J3605j2731M42J0583M680q316J5556o509l0079N45J6489N370k5235
$$ -45680 -32075 -44806 -44364 -33781 -29101 -37417 -21861 -28370 -58449 -57904 -41415 -36045 -61280
15348f1280l2655M2836N3406K1355P92l8340j6915M556q087L548P116N930L1003
$$ -61280 -93935 -51099 2307 23662 24454 -13886 -30801 -26245 -34332 -30784 -23668 -17738 13265
15335A3265j268j8273m3756j6105Q116J2469J3223J8387Q270j1860j2804J2287
$$ 13265 11997 -6276 -50032 -66137 -58021 -45552 -32329 -13942 -5672 -17532 -30336 -18049
15323a8049M134J2618k2066j5998O907k2562m1L5602L1887k3226o212K7821J0783
$$ -18049 -13915 -1297 -23363 -39361 -32454 -55016 -55057 -19455 12432 -10794 -17006 10815 21598
15310B1598m588k3144j7885O164j4406K120J0663m822o852N299j8256J4379k0474
$$ 21598 17010 -6134 -24019 -17855 -32261 -30141 -19478 -24300 -31152 -25853 -44109 -29730 -50204
15297e0204j1427K2793R248N670K3722o01l0097j1124Q032K3572J5946p909N254
$$ -50204 -61631 -38838 -29590 -23920 -198 -799 -30896 -42020 -33988 -10416 5530 -2379 2875
15284B875n616n329J9111j6329k046q807q607o068J1664K3473l2514j4491j1956
$$ 2875 -2741 -8070 11041 -5288 -7334 -16141 -24748 -30816 -19152 4321 -28193 -42684 -54640
15271e4640P77L0721j26q661O507j1466J2221Q094o692O974J7877n342o087j356
$$ -54640 -53863 -23142 -23268 -31929 -25422 -36888 -24667 -16573 -23265 -16291 1586 -3756 -9843 -11199
15257a1199j3618j2451o402J3511J002l3522K0021K8444O001J0256R252k2196
$$ -11199 -24817 -37268 -43670 -30159 -29157 -62679 -42658 -14214 -8213 2043 11295 -10901
15245a0901K3374J2508j3339j2584k1680J0495m003J6173K80R452j1764k1797
$$ -10901 12473 24981 11642 -942 -22622 -12127 -16130 43 323 9775 -1989 -23786
15233b3786J1753K0358p918J604M718j831J0456j1552k7570j9316r798K3711K309
$$ -23786 -12033 8325 407 2011 6729 4898 15354 3802 -23768 -43084 -52882 -29171 -26862
15220b6862R538K6688R977P391l1791j5565J1137k8515K5155J4030L22l7464k6527
$$ -26862 -17324 9364 19341 26732 -5059 -20624 -9487 -38002 -12847 1183 1505 -35959 -62486
15207f2486P743J7328N161j4745k1700J8673K8987q154O804j19K0340K0780N217
$$ -62486 -54743 -37415 -32254 -46999 -68699 -50026 -21039 -29193 -22389 -22508 -2168 18612 23829
15194B3829k9618n948M098o533J2960J2791k3322K242N377J1010J7987k7867l6534
$$ 23829 -5789 -11737 -7639 -14172 -1212 11579 -11743 -9501 -4124 6886 24873 -2994 -39528
15181c9528k3415p277k233K882K0483K394L2863J5637o285l99J968r378k3339
$$ -39528 -62943 -70220 -72453 -69571 -49088 -46694 -13831 1806 -4479 -4878 -2910 -12288 -35627
15168c5627J478J9101K2507J5483k3216l6740J7829Q303o659l549l006j5440k0657
$$ -35627 -34149 -15048 7459 22942 -274 -37014 -19185 -10882 -17541 -21090 -24096 -39536 -60193
15155f0193M0027J4299k2527k1418J367K1620J2291L095J1292K2741j185l4153
$$ -60193 -20166 -5867 -28394 -49812 -48445 -26825 -14534 -11439 -147 22594 21409 -12744
15143a2744k3787p502r048R212J8437J7157j211j6285l1976o649K2190o651K5074
$$ -12744 -36531 -44033 -53081 -43869 -25432 -8275 -9486 -25771 -57747 -64396 -42206 -48857 -23783
15130b3783K3774n057j1235j180Q986O313K695O451j6098J1834K4o88N54j5714
$$ -23783 -9 -5066 -16301 -17481 -8495 -2182 513 6964 -9134 2700 2724 2036 2590 -13124
15116a3124o555k196n494m977J313l100J2228N381q45L5748K2291J3263r606j7234
$$ -13124 -19679 -21875 -27369 -32346 -31033 -34133 -21905 -16524 -17369 18379 40670 53933 44327 27093
15102B7093j4197l4819j9775M300k552R50L0624L4762l1905m34L6477o201k5497
$$ 27093 12896 -21923 -41698 -37398 -39950 -39000 -8376 26386 -5519 -5953 30524 24323 -1174
15089a174O857J3530o84j5990L0436o703m0082L1762p169n856n406m547J2057
$$ -1174 5683 19213 18529 2539 32975 26272 -13810 17952 10783 4927 -479 -5026 7031
15076G031J3753J5444j5721k3875J1679L6038j9884j3009k2601J1698j08l9071
$$ 7031 20784 36228 20507 -3368 8311 44349 24465 11456 -11145 553 445 -38626
15064c8626j8841J5281k1935J5159M980R932l056r552L0567K5287m3243J046K9859
$$ -38626 -57467 -42186 -64121 -48962 -43982 -34050 -37106 -46658 -16091 9196 -34047 -33001 -3142
15051c142n614o745m182j5925k5541L4153M0238j0084j4335k4643O792J3387j6800
$$ -3142 -8756 -15501 -19683 -35608 -61149 -26996 13242 3158 -11177 -35820 -29028 -15641 -32441
15038c2441j1549O226K520N792J0338J6592J6626J3557J4360k7325j4629J8952
$$ -32441 -43990 -37764 -35244 -29452 -19114 -2522 14104 27661 42021 14696 67 19019
15026A9019m180L168j1392L736m02j7619K411K1438L271j5853J4492k895R377
$$ 19019 14839 18007 6615 10351 9949 -7670 -5259 16179 19450 3597 18089 15194 24571
15013B4571p795N991P51k0423k0131K7133J1295m0706k1025N172J3837P941J8679
$$ 24571 16776 22767 23518 3095 -17036 10097 21392 -19314 -40339 -35167 -21330 -13389 5290
15000E290j9258J379j1606K8672J7814n223O810J5715J0799k41j7733k8430M090
$$ 5290 -13968 -12589 -24195 4477 22291 17068 23878 39593 50392 50151 32418 3988 8078
14987H078K4183N235n1745j0059M1645P582k2927k083j8781Q747K9587j1176m896
$$ 8078 32261 37496 -14249 -24308 17337 24919 1992 -91 -18872 -10125 19462 8286 3390
14974C390K884k281k728J3807L3206K304n255J0970K872k5506j8672m60j095j5744
$$ 3390 6274 3993 1265 15072 48278 50582 45327 56297 59169 33663 14991 14531 13436 -2308
14960b308j6311J4516J9583K0919M778P094M9194J6766n8300m2496j637p977J3460
$$ -2308 -18619 -4103 15480 36399 41177 48271 97465 114231 55931 13435 11798 3821 17281
14947A7281R045J3846k1115J75K034j4413j360L504l2001P717L3500J1672j0899
$$ 17281 26326 40172 19057 19232 21266 6853 5493 8997 -23004 -15287 18213 29885 18986
14934A8986q346k9002j5069O550J6146P92P499L609K0654p683k5255l118P432
$$ 18986 10640 -18362 -33431 -26881 -10735 -9943 -2444 1165 21819 14136 -11119 -14237 -6805
14921f805n302J4917K1640K8720J8249J5297j292k7137J77j498j0913k3739J2027
$$ -6805 -12107 2810 24450 53170 71419 86716 85424 58287 58464 56966 46053 22314 34341
14908C4341K0406N310k2817l0417M21P547r771j0847O605k276j5317j541l746
$$ 34341 54747 60057 37240 6823 7244 14791 5020 -5827 778 -1498 -16815 -18356 -22102
14895b2102j551J3555r018j9760k693L1357P938k1354K034K273k566q119K873
$$ -22102 -23653 -10098 -19116 -38876 -41569 -10212 -2274 -23628 -21594 -19321 -21887 -30006 -27133
14882b7133J1151l052L068N367l260K1669K7182k2786j9763m047R899k0287m598
$$ -27133 -15982 -19034 -15966 -10599 -13859 7810 34992 12206 -7557 -11604 -1705 -21992 -26590
14869b6590K0885L7457K536l1550k7474j3813J5043K1974o662K2890J0181j1887
$$ -26590 -5705 31752 34288 2738 -24736 -38549 -23506 -1532 -8194 14696 24877 12990
14857A2990q128j7215K2485r932Q690p049r296J6861J6519J0033j8849j7267j376
$$ 12990 4862 -12353 10132 200 8890 1841 -7455 9406 25925 35958 17109 -158 -1534
14844a534J201J4965q257j8997o882o176O415M190r14J9824k4118o925J4813L0552
$$ -1534 -333 14632 6375 -12622 -19504 -25680 -19265 -15075 -15989 3835 -20283 -27208 -12395 18157
14830A8157l094n198p669J2098J636J3878R828j0063p320j4243k2714M546M6884
$$ 18157 15063 9865 2196 14294 15930 29808 39636 29573 22253 8010 -14704 -10158 36726
14817C6726N580j5134K922J1275P98p738k576P248N341j2721l8504m503J0127
$$ 36726 42306 27172 30094 41369 42167 34429 31853 39101 44442 31721 -6783 -11286 -1159
14804a159J220k6522K183k122L6771K0394j1943j0480j9246r140K6832J7328j2311
$$ -1159 61 -26461 -24278 -26400 10371 30765 18822 8342 -10904 -20044 6788 24116 11805
14791A1805p117O271l36j2019Q886R799k18J5701j0146n291J684j2809k0205J0809
$$ 11805 4688 10959 10623 -1396 7490 17289 17071 32772 22626 17335 19019 6210 -13995 -3186
14777c186M349M307k8237j5639L952N987K8542J5472R187R741O3m6684l1104K4605
$$ -3186 1163 5470 -22767 -38406 -34454 -28467 75 15547 24734 34475 34538 -12146 -43250 -18645
14763a8645J62L2872J7429J5346m589p916j3043j3484k8386n435j3653p039J8394
$$ -18645 -18483 14389 31818 47164 42575 34659 21616 8132 -20254 -25689 -39342 -46381 -27987
14750b7987K5827j0066j7758M107R000J0736J851o877O222R483J4715j1525p558
$$ -27987 -2160 -12226 -29984 -25877 -16877 -6141 -4290 -11167 -4945 4538 19253 7728 170
14737A70p373J1415p508k8451r631J0670L0220J5275k7961J0818j8798K1116K1416
$$ 170 -7203 4212 -3296 -31747 -41378 -30708 -488 14787 -13174 -2356 -21154 -38 21378
14724B1378j8186o125l667K0452K9072Q677r985k3422k5004q978J2732K2095K124
$$ 21378 3192 -2933 -6600 13852 42924 51601 41616 18194 -6810 -15788 -3056 19039 21163
14711B1163l851R770P921Q107k6171O070J3787j5583l1874J9870N836k7778k4672
$$ 21163 17312 27082 35003 43110 16939 23009 36796 21213 -10661 9209 15045 -12733 -37405
14698c7405L7456K4209k656k0857k700l664l707J2026O412J320J5273J4762q652
$$ -37405 51 24260 21604 747 -1953 -5617 -9324 2702 9114 10434 25707 40469 31817
14685C1817o4634j2714J8647j0677L4469L5686m262J2057q460k8291P697q292
$$ 31817 -32817 -45531 -26884 -37561 -3092 32594 28332 40389 31929 3638 11335 3043
14673C043l0517k0610j9545L4624J3229K0730N640n213l7335l9261M841L0900
$$ 3043 -27474 -48084 -67629 -33005 -19776 954 6594 1381 -35954 -75215 -70374 -39474
14661c9474K3454j0553l871J8400O470O99N456k1024J8665P144J7213l281j1013
$$ -39474 -16020 -26573 -30444 -12044 -5574 -4875 581 -20443 -1778 5366 22579 19298 8285
14648H285J877o156n487n69k144J9424M552j782j1420J988j9338j9909L4690r647
$$ 8285 10162 4006 -1481 -2050 -4194 15230 19782 18000 6580 8568 -10770 -30679 4011 -5636
14634e636M871O83n408k5305J224p854Q062L9085N685j4281j40N151R127q311
$$ -5636 -765 -82 -5490 -30795 -29571 -37425 -29363 9722 15407 1126 986 6137 15264 6953
14620F953O594N452R171j0688k0206R415l1854m074Q683J0101J3791l15m269M578
$$ 6953 13547 18999 28170 17482 -2724 6691 -25163 -29237 -20554 -10453 3338 3023 -1246 3332
14606C332l3468k254n303j2423K6780K6944O536K4213j3525n94k1559m380J3052
$$ 3332 -30136 -32390 -37693 -50116 -23336 3608 10144 34357 20832 20238 -1321 -5701 7351
14593G351P730N596l36L788k6364l730K849k9153J5559J3670k5597j4481J3201
$$ 7351 15081 20677 20341 24129 -2235 -5965 -3116 -32269 -16710 -3040 -28637 -43118 -29917
14580b9917K9075J0242j8136k0951j2408J4771K557J0448J9762K0503j0207k270
$$ -29917 -842 9400 -8736 -29687 -42095 -27324 -24767 -14319 5443 25946 15739 13469
14568A3469q48O202l275K706j5547j0708K3242l59k8754l4774N714q474k2R371
$$ 13469 12621 18823 15548 18254 2707 -8001 15241 14882 -13872 -48646 -42932 -51406 -51428 -42057
14554d2057L5531N4319L215l889O159M214l1372l4144J5125J5996l096J432J5243
$$ -42057 -6526 47793 51008 47119 53278 57492 26120 -8024 7101 23097 20001 21433 36676
14541C6676K6529j7517j1645j1757j9591j8788j1751J3416n525L2679L0369o480
$$ 36676 63205 45688 34043 22286 2695 -16093 -27844 -14428 -19953 12726 43095 36615
14529C6615R736j0236j713L262r547j3272j0235J9064K4405M796O870k5267m0017
$$ 36615 46351 36115 34402 37664 28117 14845 4610 23674 48079 52875 59745 34478 -5539
14516e539l5212r754K7115P424M307K8699j8335m55J8389J0883j6422j2260J912
$$ -5539 -40751 -50505 -23390 -15966 -11659 17040 -1295 -1750 16639 27522 11100 -1160 752
14503G52L2912K1584J6372M420r416q564l1123j6060M954n781q749N717J561L6055
$$ 752 33664 55248 71620 76040 66624 58060 26937 10877 15831 10050 1301 7018 8579 44634
14489D4634O997k5832k5029n283m111p428K0897K8907K3064R247J5199p41j8064
$$ 44634 51631 25799 770 -4513 -8624 -16052 4845 33752 56816 66063 81262 80521 62457
14476F2457j4142j7853j014j6897k702M22r850j9168K2381J6883j4911N241J3711
$$ 62457 48315 30462 29448 12551 9849 10271 421 -18747 3634 20517 5606 10847 24558
14463B4558j972j8465L5305K5569m812n948K0278K9693J3259k5974n497l0992
$$ 24558 22586 4121 39426 64995 60183 54235 74513 104206 117465 91491 85994 55002
14451E5002L780K4251R630k0415k7738L970J9740O347K0381N225j6056j7888N828
$$ 55002 58782 83033 92663 72248 44510 48480 68220 74567 94948 100173 84117 66229 72057
14438G2057J8413R149J5227L9964j6769K134Q132l0232J2802K6992J0821J0317
$$ 72057 90470 99619 114846 154810 138041 140175 148307 118075 130877 157869 168690 179007
14426A79007o862J9619J6552L3186P325K3183J7966j0104K3428L0949K5791K8821
$$ 179007 172145 191764 208316 241502 248827 272010 289976 279872 303300 334249 360040 388861
14414C88861P5626J10376J01455J41410J63391J82794J80858J89759J86000J72717
$$ 388861 464487 574863 676318 817728 981119 1163913 1344771 1534530 1720530 1893247
14404A893247J35376R2954P1981K7470o454j3316j1136l7729m5837l5262q4050
$$ 1893247 2028623 2121577 2193558 2221028 2214574 2201258 2190122 2152393 2106556 2071294 1987244
14393A987244j18883j37500j38235j60760k05911j76896j93337j40360n9735o9800
$$ 1987244 1868361 1730861 1592626 1431866 1225955 1049059 855722 715362 655627 585827
14383E85827q4989p1447l1261l5580m8257k8709k2649j5487K3701k8165l7819
$$ 585827 500838 429391 398130 362550 314293 285584 262935 247448 271149 242984 205165
14372B05165j8154L268q003p888j732J4328l8728m5559j9661P680J1606J7990
$$ 205165 187011 190279 182276 174388 172656 186984 148256 102697 83036 90716 102322 120312
14360A20312m292m862n354J3295n328Q817k0222j1711M820K6077J0128k5514k2830
$$ 120312 116020 111158 105804 119099 113771 122588 102366 90655 95475 121552 131680 106166 83336
14347H3336J2373m772l2381R887m905m0984L694J7441L4452K028k534K721j5873
$$ 83336 95709 90937 58556 68443 63538 22554 26248 43689 78141 80169 77635 80356 64483
14334F4483n624R036K5937m533O388J5023j2451J0507j2777p274R140k8224j6401
$$ 64483 58859 67895 93832 89299 95687 110710 98259 108766 95989 88715 97855 69631 53230
14321E3230J2629J7021J0752j752j5809j9218j7367N706j899j0718Q759M4096
$$ 53230 65859 82880 93632 91880 76071 56853 39486 45192 43293 32575 41334 85430
14309H5430O168P333o330k5718l361q619m311j6317k5496l1037J328n044J1758
$$ 85430 91598 98931 92601 66883 63522 54903 50592 34275 8779 -22258 -20930 -25974 -14216
14296a4216K3274J3899N374O154L1800J9906K2229j9211R636M284K398j2395l644
$$ -14216 9058 22957 28331 34485 66285 86191 108420 89209 98845 103129 105527 93132 89488
14283H9488R888k305p301r785J1779p514j0807o440M445J4473l296r738j0458
$$ 89488 99376 97071 89770 79985 91764 84250 73443 67003 71448 85921 82625 72887 62429
14270F2429k4762k994M394j1672J7708J585j989k239P621O506j7037m0762l0011
$$ 62429 37667 34673 39067 27395 45103 46688 44699 42460 50081 56587 39550 -1212 -31223
14257c1223J2393K1134o1K2798j1358l1810q062K967j4886k073J4845K8311L5700
$$ -31223 -18830 2304 2243 25041 13683 -18127 -26189 -23222 -38108 -40181 -25336 2975 38675
14244C8675K6650j2904l5218j684J4436o968m686J5502K4946J0908J621Q268j8266
$$ 38675 65325 52421 17203 15519 29955 22987 18301 33803 58749 69657 71278 79546 61280
14231F1280K870M060J2845K095j1971j3495k6836K1040j26l9339j3499L7507R940
$$ 61280 64150 68210 81055 83150 71179 57684 30848 51888 51762 12423 -1076 36431 46371
14218D6371k881k6875K0448J866L6635P72k3144N377R204k845n583L0995L6881
$$ 46371 43490 16615 37063 38929 75564 76336 53192 58569 67773 64928 59345 90340 127221
14205A27221J8690m157L6475M0337K1106o71J7312N0011N0778J5841n651J555
$$ 127221 145911 141754 178229 218566 239672 239001 256313 306324 357102 372943 367292 368847
14193C68847j5160k3851k1417l3827p1561m0054j4135R778l576q298L562k9770
$$ 368847 353687 329836 308419 274592 203031 162977 148842 158620 155044 146746 150308 120538
14181A20538k2656j121K4584J1481j202L2563M3666K3636O742k8612k2075m0156
$$ 120538 97882 96761 121345 132826 131624 164187 207853 231489 238231 209619 187544 147388
14169A47388r709j7597r42n537P605k8225L011j7846l2526J5182P178k3124k4302
$$ 147388 137679 120082 119140 113603 121208 92983 95994 78148 45622 60804 67982 44858 20556
14156B0556K0955m89K9359K7045r574k6076M9702J5490k6419k9864p434K8944
$$ 20556 41511 41022 70381 97426 87852 61776 111478 126968 100549 70685 63251 92195
14144I2195R238K61J7037j781j665k3915M083m550m422J126l106K0409P932m146
$$ 92195 101433 101694 118731 116950 115285 91370 95453 90903 86481 87607 84501 104910 112842 108696
14130A08696k4641j0850J3204J9062j5120j3923k7732k1756R782L7950J6864k7811
$$ 108696 84055 73205 86409 105471 90351 76428 48696 26940 36722 74672 91536 63725
14118F3725K1146M5322k4104l1355O514R110l6047k2344J0389J7332R719N22Q030
$$ 63725 84871 130193 106089 74734 81248 90358 54311 31967 42356 59688 69407 69929 77959
14105G7959n505q98J165j1792r524P266j5355r727R221k591J5943K7248k5714
$$ 77959 72454 71556 72721 60929 51405 58671 43316 33589 42810 40219 56162 83410 57696
14092E7696o323m611J2390j6517j1679j5297R283L6903R432k2875O52J5080Q349
$$ 57696 51373 46762 59152 42635 30956 15659 24942 61845 71277 48402 49054 64134 72483
14079G2483m830m007J7686J1018m982K2069J9401l95j8127j0899k2486J1919k176
$$ 72483 67653 63646 81332 92350 87368 109437 128838 128443 110316 99417 76931 88850 86674
14066H6674J3830j0704l5190N61p988Q253O993J8642J8611Q455P55n574R530r729
$$ 86674 100504 89800 54610 55171 47183 55436 62429 81071 99682 108137 108892 103318 112848 103119
14052A03119k1687k2686j5423K1582L6805K847j8383j6184l1799K5501J3582o587
$$ 103119 81432 58746 43323 64905 101710 104557 86174 69990 38191 63692 77274 70687
14040G0687O353J4376j608J6729O342m1446j4530K4397J6443J688K231j281l095
$$ 70687 77040 91416 89808 106537 112879 71433 56903 81300 97743 99431 101662 100381 97286
14027I7286k3243P137m551j712L356K888O32J2605K3513K4257K4193J3239q274
$$ 97286 74043 81180 76629 74917 78273 81161 81793 94398 117911 142168 166361 179600 171326
14014A71326K33k936j3705J7271R328L1799L1786N1704N3778O8346J17241J31387
$$ 171326 171559 168623 154918 172189 181517 213316 245102 296806 350584 418930 536171 667558
14002F67558J49221J76129K24965K51401K03495J08823K745p8752j88855k47633
$$ 667558 816779 992908 1217873 1469274 1672769 1781592 1784337 1705585 1516730 1269097
13992A269097k16479k05129j68091j07394r3846p7605m4829n2808k2565k2547
$$ 1269097 1052618 847489 679398 572004 478158 400553 355724 302916 280351 257804
13982B57804l3895j7243j1666K354m904j1348k3612l1754m493k673J1142J0381
$$ 257804 223909 206666 195000 197354 192450 181102 157490 125736 121243 118570 129712 140093
13970A40093k8728k6291N446J256m6J848K5068J720J1323k07k161n521m101J104
$$ 140093 111365 85074 90520 91776 91730 93578 118646 120366 131689 131482 129321 123800 119699 120803
13956A20803m392J9516j8015j7517j5658J286K276Q764J0791k0635j8423K0688
$$ 120803 116411 135927 117912 100395 84737 86023 88299 97063 107854 87219 68796 89484
13944H9484l803j2247J3283J9051m931k6133k089P277K000J2993L90K1437K3752
$$ 89484 85681 73434 86717 105768 100837 74704 72615 79892 81892 94885 95275 116712 140464
13931A40464k264j346k1386K082J3876o067j1419l194J9050k778o885J5001J2344
$$ 140464 138200 136854 115468 117550 131426 125359 113940 110746 129796 127018 120133 135134 147478
13918A47478k3801j9671n841k0040j3551n840l823J3406P383P450j1449K496Q668
$$ 147478 123677 104006 98165 78125 64574 58734 54911 68317 75700 83150 71701 74197 82865
13905H2865L3607k640j6145j697J36J7791L221j719k6654j1334K4217J8850K210
$$ 82865 116472 113832 97687 95990 96126 113917 117138 115419 88765 77431 101648 120498 122708
13892A22708l906K6201L1477K9914M1041O6748O2395N9521K4724J9528L2540r505
$$ 122708 118802 145003 176480 206394 247435 314183 376578 436099 460823 480351 512891 503386
13880E03386m7979o5464m5426o2231k5225Q994j7411l371l263l8413l1317l1452
$$ 503386 455407 389943 344517 282286 257061 266055 248644 245273 242010 203597 172280 140828
13868A40828l8475k2011J2392K4126L405J102j8153j8771j0852j7333K3969N797
$$ 140828 102353 80342 92734 116860 120265 121367 103214 84443 73591 56258 80227 86024
13856H6024l2275J7375M0793P838r180j5650j8082L2544j6303l4327k1853N799
$$ 86024 53749 71124 111917 119755 110575 94925 76843 109387 93084 58757 36904 42703
13844D2703K7471Q694j3434K9993J4466p516l682m329J0340q445l0218K187l408
$$ 42703 70174 78868 65434 95427 109893 102377 98695 94366 104706 96261 66043 68230 64822
13831F4822M471j1773J04J8465p689O018N793k1211J7418L1047j9231k7568P589
$$ 64822 69293 57520 57624 76089 68400 74418 80211 59000 76418 107465 88234 60666 68255
13818F8255j0166k745K3754M1052q025k6760L262j3531k033p160J0401j921J4610
$$ 68255 58089 55344 79098 120150 112125 85365 88627 75096 73063 65903 76304 74383 88993
13805H8993L2152m245j5969l2423l3524k3205k1342K8628K7487J2218K8579J9209
$$ 88993 121145 116900 100931 68508 34984 11779 -9563 19065 46552 58770 87349 106558
13793A06558n559r370O480J3839O75J2391J903m5220j6304n317P601M117p537
$$ 106558 100999 91629 98109 111948 112623 125014 126917 81697 65393 60076 67677 71794 64257
13780F4257o865j2076p783Q268J4444M451J6341J2393j1764r285L2525J466q025
$$ 64257 57392 45316 37533 45801 60245 64696 81037 93430 81666 72381 104906 106372 98347
13767I8347L043j1840r257J772j1208o1o81P203L41k144Q20J3105j5626j4206
$$ 98347 101390 89550 80293 82065 70857 70796 70115 77318 77659 75515 76335 89440 73814 59608
13753E9608J5103j1248J4285j7520k2583m77r382R536R07K4952P298N693K3363
$$ 59608 74711 63463 77748 60228 37645 37168 27786 37322 38229 63181 70479 76172 99535
13740I9535M219l2996l570j0442k2239j4876P968K0649L0167J2381j6632J8966
$$ 99535 103754 70758 67188 56746 34507 19631 27599 48248 78415 90796 74164 93130
13728I3130K5935J5774J2918p064j2011j1019r736K7161k131j2683j211p330j2891
$$ 93130 119065 134839 147757 140693 128682 117663 107927 135088 132957 120274 119063 111733 98842
13715I8842l611q888p201R408Q000L5961L3276j0084l423j396q334l817J2958
$$ 98842 95231 86343 79142 88550 96550 132511 165787 155703 152280 150884 142550 138733 151691
13702A51691K7073J410J5817j9531j0518L938j9116k202M335K1845J8110k6251
$$ 151691 178764 180174 195991 176460 165942 169880 150764 148562 152897 174742 192852 166601
13690A66601l3378k82L8572N511n400J157j1885P392J693p20m538q002p452j6010
$$ 166601 133223 132941 171513 177024 171624 172781 160896 168288 169981 169261 164723 156721 149269 133259
13676A33259R99J1406k2763k7025O928L4798O565k1735k8795k9387q324K3193
$$ 133259 134258 145664 122901 95876 102804 137602 144167 122432 93637 64250 55926 79119
13664G9119q036j8889j1280L4401M0371k377p088j9767j1072k719k5214m753m77
$$ 79119 71083 52194 40914 75315 115686 113309 106221 86454 75382 72663 47449 42696 42219
13651D2219K5213J2084j1884j0367k3076R761J7073K4281K312L111J8564l4923
$$ 42219 67432 79516 67632 57265 34189 43950 61023 85304 87616 90727 109291 74368
13639G4368j1618Q445M0118q571l6462j1059k4465k6290J827r913K2046J2610
$$ 74368 62750 71195 111313 102742 66280 55221 30756 4466 6293 -3620 18426 31036
13627C1036P146j5190N210K2132L0835J2582q213q274M832m455o294J0314M328
$$ 31036 38182 22992 28202 50334 81169 93751 85538 77264 82096 77641 71347 81661 85989
13614H5989J1059J6452j1898j7592J7511J642j2356j3829K4403K9088l4881p444
$$ 85989 97048 113500 101602 84010 101521 103163 90807 76978 101381 130469 95588 88144
13602H8144l337j1887J0167J3921J2437j2517p323p168N497J3022q769j8134j4279
$$ 88144 84807 72920 83087 97008 109445 96928 89605 82437 87934 100956 92187 74053 59774
13589E9774J6993K218K0257L0766K599n5310k8154K0922R300Q0k251J5115K300
$$ 59774 76767 78985 99242 130008 132607 77297 49143 70065 79365 79445 77194 92309 94609
13576I4609r802j140k204O391J6745n488l1755J8518L3249o579k5988q816K6145
$$ 94609 84807 83667 81463 87854 104599 99111 67356 85874 119123 112544 86556 77740 103885
13563A03885R424O645j3528q656R370j2131J7405m183J8834K522j209l5382j5631
$$ 103885 113309 119954 106426 97770 107140 95009 112414 108231 127065 129587 128378 92996 77365
13550G7365L076O182J8412l0978r502M6528K1927j8004k5380J8903L7534k1472
$$ 77365 80441 86623 105035 74057 64555 111083 133010 115006 89626 108529 146063 124591
13538A24591R80J5791j8205K4243P951j6656j1974l5704k1866R906L427R175K4187
$$ 124591 125571 141362 123157 147400 155351 138695 126721 91017 69151 79057 82484 91659 115846
13525A15846j6079q32K7675P983j5638k5336j4750J6135J6504L4315J9112j199
$$ 115846 99767 98935 126610 134593 118955 93619 78869 95004 111508 145823 164935 163736
13513A63736k053n976l473n297n566j5469j3150O710J0157L459J1201J694J54
$$ 163736 161683 155707 152234 146937 141371 125902 112752 119462 129619 133078 144279 145973 146127
13500A46127L865k6556M903o161n566J1204j2871j1236j0599M083r984j032Q270
$$ 146127 149992 123436 128339 122178 116612 127816 114945 103709 93110 97193 87209 86177 94447
13487I4447K7382L092k3635J1125J1701J1680M327j1050p498j3801j8753J9949
$$ 94447 121829 124921 101286 112411 124112 135792 140119 129069 121571 107770 89017 108966
13475A08966K6197J4847k1734k2011J421J6096K2448J339k6799l983J1166O476
$$ 108966 135163 150010 128276 106265 107686 123782 146230 147569 120770 116787 127953 134429
13463A34429j1237O809J9464l128r550l205J504K120J6193k2735k2339l357M205
$$ 134429 123192 130001 149465 146337 136787 133582 135086 137206 153399 130664 108325 104968 109173
13450A09173P081n56P487m462K511r541j5620l202J3695J7904J9929K3075j4876
$$ 109173 116254 115698 123185 118723 121234 111693 96073 92871 106566 124470 144399 167474 152598
13437A52598k2429j2228O433j734l1047j6603M850K7645N0953M4148l603P456
$$ 152598 130169 117941 124374 122640 91593 74990 79840 107485 158438 202586 198983 206439
13425B06439J1164j3039m1487k5161j0407Q610L8262J8034k3868j02n758k6244
$$ 206439 217603 204564 163077 137916 127509 136119 174381 192415 168547 168445 162687 136443
13413A36443k1841M942l3177J3026R311o651k0708J0263J8695K4912J0647q934
$$ 136443 114602 119544 86367 99393 108704 102053 81345 91608 110303 135215 145862 136928
13401A36928p273M1342J2455n1696m9147j0284L4779L8302R714M112k0878k5987
$$ 136928 129655 170997 183452 131756 82609 72325 107104 145406 155120 159232 138354 112367
13389A12367J0232J5881K6844K2054j2257j6332J2308q206k7899j864n652j3597
$$ 112367 122599 138480 165324 187378 175121 158789 171097 162891 134992 133128 127476 113879
13377A13879j4701O483K4508L9300K3283J3065O243j7227N88j3992j0541k86m237
$$ 113879 99178 105661 130169 169469 192752 205817 212060 194833 195421 181429 170888 170602 166365
13364A66365l885P818K047r227Q007j1357j1362J4942j7146J8751K2486j7639
$$ 166365 162480 170298 172345 163118 171125 159768 148406 163348 146202 164953 187439 169800
13352A69800j4723J6601L0794P480k0620j631R691J4779j7258j8214m946J6174
$$ 169800 155077 171678 202472 209952 189332 187701 197392 212171 194913 176699 171753 187927
13340A87927J712R350N908j1884k2692M423R342N743n763l0758j7770J580m432
$$ 187927 189639 198989 204897 193013 170321 174744 184086 189829 184066 153308 135538 137118 132686
13327A32686j2192J0600K9188O349J4902J9861M5275M2078J8802L174J600l7369
$$ 132686 120494 131094 160282 166631 181533 201394 246669 288747 307549 310723 312323 274954
13315B74954k6508j1792J3160L057j735J3822Q214P46K1743Q685K1951M049n834
$$ 274954 248446 236654 249814 252871 251136 264958 273172 273918 295661 304346 326297 330346 324512
13302C24512j0672J8347L7464N6856N2808J7844J8912O9201J06190J48897J48836
$$ 324512 313840 332187 369651 426507 479315 497159 516071 585272 691462 840359 989195
13291I89195J25532J58780J54585J93797J35721L9052L1543m5460j07896j47681
$$ 989195 1114727 1273507 1428092 1621889 1757610 1796662 1828205 1782745 1674849 1527168
13281A527168j77643j53196j71232j33381j20090j21912q8800o4006m3489j5181
$$ 1527168 1349525 1196329 1025097 891716 771626 649714 560914 496908 453419 438238
13271D38238r084L058l6373j2404o644j5323l2251O624J7841k6844l0131j240
$$ 438238 429154 432212 395839 383435 376791 361468 329217 335841 353682 326838 296707 295467
13259B95467j0317K219O083R719k3429p208N215l702r160J5018K2798j1126q447
$$ 295467 285150 287369 293452 303171 279742 272534 277749 274047 264887 279905 302703 291577 283130
13246B83130j0447J3198J1196r072k9534J6293P802j4215j454P646J8646J1384
$$ 283130 272683 285881 297077 288005 258471 274764 282566 268351 266897 274543 293189 304573
13234C04573j2250N743J2233j2296K472n370q588J8470M959j0547K0420p967R196
$$ 304573 292323 298066 310299 298003 300475 295105 286517 304987 309946 299399 319819 311852 321048
13221C21048J6657J6699p416J484Q729j1880N284M377j9485K8098K4193J389K5232
$$ 321048 337705 354404 346988 348472 357201 345321 350605 354982 335497 363595 387788 389177 414409
13208D14409J1972o575K6933O1385O9628P9604R1911J00852R0218J21461Q1850
$$ 414409 426381 419806 446739 508124 577752 657356 749267 850119 940337 1061798 1143648
13197A143648J5120j061k8968l8107n7714n2532m5892l6053K922L5757M519J8655
$$ 1143648 1158768 1157707 1128739 1090632 1032918 980386 934494 898441 901363 937120 941639 960294
13185I60294L7875K6824K5980J2883O441L1115K8137L5778M8102j4642j3938K4464
$$ 960294 998169 1024993 1050973 1063856 1070297 1101412 1129549 1165327 1213429 1198787 1184849 1209313
13173A209313J6162K3062M3043K0467J9036N150j8887n5597o8750n7836n1922
$$ 1209313 1225475 1248537 1291580 1312047 1331083 1336233 1317346 1261749 1192999 1135163 1083241
13162A083241p4715m8074j0760l6326j9637k1195j0692l1l0503O160R971k1999
$$ 1083241 1008526 960452 949692 913366 893729 872534 861842 861811 831308 837468 847439 825440
13150H25440M433J573J4055j0224K3511M8643N5479J11016R1043P3174M5001n299
$$ 825440 829873 831446 845501 835277 858788 907431 962910 1073926 1164969 1238143 1283144 1277845
13138A277845o3159r9082q7245o8775p8483r6255p8619k4960n41k6715l8520n6264
$$ 1277845 1214686 1115604 1028359 959584 881101 784846 706227 681267 680726 654011 615491 559227
13126E59227k2093j5870j0558j081J7874J2636J7073m061P956L2180N9747K2950
$$ 559227 537134 521264 510706 509625 527499 540135 557208 553147 561103 593283 653030 675980
13114F75980L4420K514Q793j3698k2963j0334L825l9119n4140l3254r113n527
$$ 675980 710400 712914 721707 708009 685046 674712 678537 639418 585278 552024 542911 537384
13102E37384j3814M102J5491J1825Q256K768k89j8696l6547l9158j1268J133k5093
$$ 537384 523570 527672 543163 554988 563244 566012 565723 547027 510480 471322 460054 461187 436094
13089D36094K230J3199J4214J7247k5370j2248p328k2307L220R918m415j5529
$$ 436094 438324 451523 465737 482984 457614 445366 438038 415731 418951 428869 424454 408925
13077D08925Q210O958K6409J6502M3025K4920L852k012p062J3565K7233l2475
$$ 408925 417135 424093 450502 467004 510029 534949 538801 536789 529727 543292 570525 538050
13065E38050J3568L989j05p866J386j0256R051M421J2560j6031l38J318J9657
$$ 538050 551618 555607 555502 547636 549022 538766 547817 552238 564798 548767 548429 549747 569404
13052E69404K6840J1316K119k700J7622L1694l446o398m2363n3796k3086j7459
$$ 569404 596244 607560 609679 606979 624601 656295 652849 646451 604088 550292 527206 509747
13040E09747K0598j4142k1313j096M095j2381J7777M4566J9531K8885N3506K0476
$$ 509747 530345 516203 494890 493794 497889 485508 503285 547851 567382 596267 649773 670249
13028F70249J2029N5432L4426m177k5058J6575J2957J4789J4326N0063L6099K4174
$$ 670249 682278 737710 772136 767959 742901 759476 772433 787222 801548 851611 887710 911884
13016I11884j0511l9297K131j0885j0804J8366j2145J8130N479J3102M045j9558
$$ 911884 901373 862076 864207 853322 842518 860884 848739 866869 872348 885450 889495 869937
13004H69937j200J3347L6477K4525l07N293L870J4012K514k549o066J7356L1405
$$ 869937 868737 882084 918561 943086 942779 948072 951942 965954 968468 965919 959853 977209 1008614
12991A008614R545K3761M1480L5312M7474L1945J0719r834n133k9414N906J5960
$$ 1008614 1018159 1041920 1083400 1118712 1166186 1198131 1208850 1199016 1193883 1164469 1170375 1186335
12979A186335J8188k8799J3384L3106K49p013M9171J4732J4265k6015j1454n047
$$ 1186335 1204523 1175724 1189108 1222214 1222463 1215450 1264621 1279353 1293618 1267603 1256149 1251102
12967A251102p084k3054j3293j0614j1047R101L9531L1164L9739Q8418N7553N1279
$$ 1251102 1244018 1220964 1207671 1197057 1186010 1195111 1234642 1265806 1305545 1393963 1451516 1502795
12955A502795K3255J6453M1963M0712O8358M1999O075K138J0282K382o044J973
$$ 1502795 1526050 1542503 1584466 1625178 1693536 1735535 1741610 1743748 1754030 1756412 1750368 1752341
12943A752341j1939j4027J107K7266L0456Q3k066M0409P6943P3374O5589M6367
$$ 1752341 1740402 1726375 1727482 1754748 1785204 1785287 1783221 1823630 1900573 1973947 2039536 2085903
12931B085903J2292K1849M4357L549k8884l0168k3859M512J5342J4794R241J4259
$$ 2085903 2098195 2120044 2164401 2167950 2139066 2108898 2085039 2089551 2104893 2119687 2128928 2143187
12919B143187L4579L8154K5580M8867O8577N2125N3152N7257N5432J1481M6558
$$ 2143187 2177766 2215920 2241500 2290367 2358944 2411069 2464221 2521478 2576910 2588391 2634949
12908B634949O2706O3214O7017R6498J01129R9032J39636J16607J27002J30882
$$ 2634949 2697655 2760869 2827886 2924384 3025513 3124545 3264181 3380788 3507790 3638672
12898C638672J07473J38794J55116J38937J60014K04029K01715K63079K74496
$$ 3638672 3746145 3884939 4040055 4178992 4339006 4543035 4744750 5007829 5282325
12889E282325L09978L38665L78952M66986M95979N22495N99080P30600Q53004
$$ 5282325 5592303 5930968 6309920 6776906 7272885 7795380 8394460 9125060 9978064
12880I978064J006478J216374J443141J681826J957237K309276K652311L094892
$$ 9978064 10984542 12200916 13644057 15325883 17283120 19592396 22244707 25339599
12872B5339599L700556M618804N968253Q028359J1086547J5275256K0416086K5943482
$$ 25339599 29040155 33658959 39627212 47655571 58742118 74017374 94433460 120376942
12864A20376942L0897548L3968869L4017596L0431272K3585393J4268688L508471
$$ 120376942 151274490 185243359 219260955 249692227 273277620 287546308 291054779
12857B91054779p833833j8309552k6433389l1497986l3406020l2233869k8447291
$$ 291054779 283220946 264911394 238478005 206980019 173573999 141340130 112892839
12850A12892839k3024683j7451732j2815068r395540o943541n339796m216536
$$ 112892839 89868156 72416424 59601356 50205816 43262275 37922479 33705943
12843C3705943l434237k906687k526608k204321j970551j767965j517223j315237
$$ 33705943 30271706 27365019 24838411 22634090 20663539 18895574 17378351 16063114
12835A6063114j158867j015347q47331p66839o82444n98328n34155m97509m66882
$$ 16063114 14904247 13888900 13041569 12274730 11592286 10993958 10459803 9962294 9495412
12826I495412m00934l99352l34732l17032l07308k78818k65985j98539j70794
$$ 9495412 9094478 8695126 8360394 8043362 7736054 7457236 7191251 6992712 6821918
12817F821918j51044j00687j28266j33405j07761r3078o2521l9438k7560O382
$$ 6821918 6670874 6570187 6441921 6308516 6200755 6107677 6045156 6005718 5978158 5984540
12807E984540N1019O8631P7329R2484J54966J80857J06209O5690M9973m7202j07843
$$ 5984540 6035559 6104190 6181519 6274003 6428969 6609826 6716035 6781725 6831698 6784496 6676653
12796F676653j35862j49518j62273r8453p1266n5950o1660M450P4711J09984J35225
$$ 6676653 6540791 6391273 6229000 6130547 6059281 6003331 5941671 5946121 6020832 6130816 6266041
12785F266041J34399J40553J30853J27986J38589J78463J64728K03083K27379
$$ 6266041 6400440 6540993 6671846 6799832 6938421 7116884 7281612 7484695 7712074
12776G712074K64638L25123L33335L60551M20664M30964M36327M57913N09832
$$ 7712074 7976712 8301835 8635170 8995721 9416385 9847349 10283676 10741589 11251421
12767A1251421N88832O73882Q25363R92388J136698J323811J545947J855164K283451
$$ 11251421 11840253 12514135 13339498 14331886 15468584 16792395 18338342 20193506 22476957
12758B2476957K854476L673808M805898O319172Q323259J0836217J3821531J6925981
$$ 22476957 25331433 29005241 33811139 40130311 48453570 59289787 73111318 90037299
12750I0037299J9413849K0005914J7662408J2149563L885223n578795j3099328
$$ 90037299 109451148 129457062 147119470 159269033 163154256 157575461 144476133
12743A44476133j6356081j6028299j3786676j0774617p567391m379726j412105
$$ 144476133 128120052 112091753 98305077 87530460 79963069 75583343 74171238
12736G4171238J229488L478801N218860O379542O776517O407649N501070M402780
$$ 74171238 75400726 78879527 84098387 90477929 97254446 103662095 109163165 113565945
12728A13565945L437077K920872L138543L979760N383256P089437Q741203R772680
$$ 113565945 117003022 119923894 123062437 127042197 132425453 139514890 148256093 158028773
12720A58028773R357116P276524L651716q63512n442775q824072j0265518r936743
$$ 158028773 167385889 174662413 178314129 177450617 172007842 163183770 152918252 142981509
12712A42981509q565212o693768m656302k890160j624589j028893j032439j678231
$$ 142981509 134416297 127722529 123066227 120176067 118551478 117522585 116490146 114811915
12704A14811915k812775m150707n329079n897964n683178m588371k714608k21543
$$ 114811915 111999140 107848433 102519354 96621390 90938212 86349841 83635233 83413690
12696H3413690K823596O383893J0258548J4022076J6868517J7620724J5315194
$$ 83413690 86237286 92621179 102879727 116901803 133770320 151391044 166706238
12689A66706238R626669J346562q107111j6234261k0360502k0415746j8276940
$$ 166706238 176332907 177679469 169572358 153338097 132977595 112561849 94284909
12682I4284909j5403865j2643566j0211073q137501o418447n063856m034262l242150
$$ 94284909 78881044 66237478 56026405 47888904 41470457 36406601 32372339 29130189
12674B9130189k688288k214936j911513j689655j498923j311793j132618r82058
$$ 29130189 26441901 24226965 22315452 20625797 19126874 17815081 16682463 15700405
12666A5700405q91017p93381p08826o64539o28002n94113n37149n42695n16385
$$ 15700405 14809388 14016007 13307181 12642642 12014640 11420527 10883378 10340683 9824298
12657I824298m47521l91207l87682l91147l70437l52834l07464k72075k53409
$$ 9824298 9376777 8985570 8597888 8206741 7836304 7483470 7176006 6903931 6650522
12648F650522k44268k17762j95439k03594k11048j71120j21335j23307j25967
$$ 6650522 6406254 6188492 5993053 5789459 5578411 5407291 5285956 5162649 5036682
12639E036682j32062j37094j04083j13540j07383j35102j82627j31674j05158
$$ 5036682 4904620 4767526 4663443 4549903 4442520 4307418 4124791 3993117 3887959
12630C887959q4486r9266j07553j35828r9123q6039p1944o1376n8985o7591k5316
$$ 3887959 3803473 3704207 3596654 3460826 3361703 3275664 3203720 3142344 3083359 3015768 2990452
12619B990452j8251K2297j0647l2369m0160j9087L6954M3158K0797N67l201j0878
$$ 2990452 2972201 2994498 2983851 2951482 2911322 2892235 2929189 2972347 2993144 2993711 2990510 2979632
12607B979632p1208p5202p4575m6592r5114j25602n4394m8682q6480m6402j9657
$$ 2979632 2908424 2833222 2758647 2712055 2616941 2491339 2436945 2388263 2301783 2255381 2235724
12596B235724k6851j831N149N353k4977j4140N134K149k488o824o13O284L0915
$$ 2235724 2208873 2207042 2212191 2217544 2192567 2178427 2183561 2185710 2183222 2176398 2175785 2182069 2212984
12583B212984L3525N1333M7795M1809L6256r658l2161j2279j2979l643J3712O922
$$ 2212984 2246509 2297842 2345637 2387446 2423702 2414044 2381883 2369604 2356625 2352982 2366694 2373616
12571B373616l675m1272n2318q6784p6180q8274q2666q4714o4413m8751l4757
$$ 2373616 2369941 2328669 2276351 2189567 2113387 2025113 1942447 1857733 1793320 1744569 1709812
12560A709812m4806m9214o0977m8464j5968L9312M3057N6040L8886J867j437j4201
$$ 1709812 1665006 1615792 1554815 1506351 1490383 1529695 1572752 1628792 1667678 1669545 1668108 1653907
12548A653907r3674j40973p7756j05484j32442j12952n5544q3756q1442m0047
$$ 1653907 1560233 1419260 1341504 1236020 1103578 990626 935082 851326 769884 729837
12538G29837m5407n6332l0782k814l181j2155m3591k5110J7472r623n160K3527
$$ 729837 684430 628098 597316 594502 591321 579166 535575 510465 527937 518314 513154 536681
12526E36681j469j088n354r987L049R244j4093l9613j7134l2643k1795L0126j9763
$$ 536681 535212 534124 528770 518783 521832 531076 516983 477370 460236 427593 405798 435924 416161
12513D16161K099J940j1532l1923j3164K8978K5545R480R349K4198K979j0499
$$ 416161 418260 420200 408668 376745 363581 392559 418104 427584 436933 461131 464110 453611
12501D53611m282k0450k3889m6289k2152J5000k164K0516J939j8044J5720r240
$$ 453611 449329 428879 404990 358701 336549 351549 349385 369901 371840 353796 369516 360276
12489C60276l8630k0393J9669J216j9177j4734n340l019j6265p211k696J8508
$$ 360276 321646 301253 320922 322138 302961 288227 282887 279868 263603 256392 253696 272204
12477B72204P497J729j663J4739J9396K6628L8428L9899O9602L7604M0438L2655
$$ 272204 279701 281430 279767 294506 313902 340530 378958 418857 488459 526063 566501 599156
12465E99156K7645K9317L5824O9783O1411N1250K0669k8677j04523j05395q8436
$$ 599156 626801 656118 691942 761725 823136 874386 895055 866378 761855 656460 568024
12454E68024m5430j5368l538K6820J783K4594L4618K1385j3883l5454j5533j1166
$$ 568024 522594 507226 503688 530508 532291 556885 591503 612888 599005 563551 548018 536852
12442E36852n359L1858K2331L8088O8542O2702N3507O6163J23481J49679J50864
$$ 536852 531493 563351 585682 623770 692312 755014 808521 874684 998165 1147844 1298708
12431A298708J74847J86744J67634J14101O4318M4478M16n0268j02498j28749
$$ 1298708 1473555 1660299 1827933 1942034 2006352 2050830 2051246 2000978 1898480 1769731
12421A769731j57324j71022k12825k09040j56017j17190j07688o7277o0346j4283
$$ 1769731 1612407 1441385 1228560 1019520 863503 746313 638625 571348 511002 496719
12411D96719k1787n1294l1052j5356k55J1163L9603L2713K2439K8426L7905K2152
$$ 496719 474932 423638 392586 377230 376975 388138 427741 460454 482893 511319 549224 571376
12399E71376j3592j7313k5544m9955m4318m7248l6002k8704n367k6275r753k1476
$$ 571376 557784 540471 514927 464972 420654 373406 337404 308700 303333 277058 267305 245829
12387B45829l2517k0532J806o490o346j0561j9028J0792L5035j1525r578J7453
$$ 245829 213312 192780 194586 188096 181750 171189 152161 162953 197988 186463 176885 194338
12375A94338j8632j7403j3527J5494L6183O137j7185p382n0097J5905N1373J5523
$$ 194338 175706 158303 144776 160270 196453 202590 185405 178023 127926 143831 195204 210727
12363B10727J0877J4984M015O538p620J4517M893P737j9351k6652j9477j9565
$$ 210727 221604 236588 240603 247141 239521 254038 258931 266668 247317 220665 201188 181623
12351A81623k6366J5192L9485J6650j6249k4784l0181J8411O6762J2499k5008
$$ 181623 155257 170449 209934 226584 210335 185551 155370 173781 240543 253042 228034
12340B28034L482J1026J640l711n961O431j2984p827J059P676l957N608q591r642
$$ 228034 231516 242542 244182 240471 234510 240941 227957 220130 221189 228865 224908 230516 221925 212283
12326B12283n912r487P61L1422j9266J4036K299j140k779r500n910J0710J0273
$$ 212283 206371 196884 197645 229067 209801 223837 226136 224996 222217 212717 206807 217517 227790
12313B27790l055j6471l0330p446n276j2503j2912q643K6268K0713K3039J7146
$$ 227790 224735 208264 177934 170488 165212 152709 139797 131154 157422 178135 201174 218320
12301B18320Q336L1207J7603J8051K0418O6738P6641Q5737O9815Q8168Q7762P2309
$$ 218320 226656 257863 275466 293517 313935 380673 457314 543051 612866 701034 788796 861105
12289H61105M3907q010m7465o7891n9961k7495n2239m2688k6383l8834k4612o814
$$ 861105 905012 897002 849537 781646 721685 694190 641951 599263 572880 534046 509434 502620
12277E02620J7018M1216N7949K7214P294M6465L4812M6277L1123K448K7840N0961
$$ 502620 519638 560854 618803 646017 653311 699776 734588 780865 811988 814436 842276 893237
12265H93237O4606O1889O1914M2484M5477J9128m7917n0118l0646o0948m5282
$$ 893237 957843 1019732 1081646 1124130 1169607 1188735 1140818 1090700 1060054 999106 953824
12254I53824l2437k0993l1487J3298n914M376r296k9346m103j8185k8846l0499
$$ 953824 921387 900394 868907 882205 876291 880667 871371 842025 837922 819737 790891 760392
12242G60392m2618k7034J4951O920k1375M5214P0406M2705M2023P3355Q9087M4194
$$ 760392 717774 690740 705691 712611 691236 736450 806856 849561 891584 964939 1054026 1098220
12230A098220K9170n9881j12108j32774j35954p9957l8160l7766m2274m0323n8225
$$ 1098220 1127390 1067509 955401 822627 686673 606716 568556 530790 488516 448193 389968
12219C89968l5543j8400j0349k523l104n5061m9249k5081J628M665K1155J0009
$$ 389968 354425 336025 325676 323153 320049 264988 215739 190658 192286 196951 218106 228115
12207B28115M771J2632j3083k5673j5074q376K5673J8407P363j2789m645L903
$$ 228115 232886 245518 232435 206762 191688 183312 208985 227392 234755 221966 217321 221224
12195B21224k1806k8998k3575m879R92N215k090j569K644J6701p146j3955l322
$$ 221224 199418 170420 146845 141966 142958 148173 146083 144514 147158 163859 156713 142758 139436
12182A39436q4M190L1418K1855k3722j9287j6869L4212K6146l6922j9032J602
$$ 139436 139352 143542 174960 196815 173093 153806 136937 171149 197295 160373 141341 142943
12170A42943J8265m949r146J9338L648P232r092j6938Q989O832j4236J0541j4265
$$ 142943 161208 156259 147113 166451 170099 177331 168239 151301 160290 167122 152886 163427 149162
12157A49162k2617n173j3759m62Q585J9630m86k8592n333J5002Q266o938R618
$$ 149162 126545 121372 107613 107151 115736 135366 134880 106288 100955 115957 124223 117285 126903
12144A26903Q183j5338m168k4829k714J0631J2798k6633m365K3452O107j2910
$$ 126903 135086 119748 115580 90751 88037 98668 111466 84833 80468 103920 110027 97117
12132I7117j1439K7151J2517j5968l1618M318J8415Q946j9064n138K5639j8068
$$ 97117 85678 112829 125346 109378 77760 82078 100493 109439 90375 85237 110876 92808
12120I2808k6296R023l209M562O404j2806o632R586J1172q427k748P575o857K7856
$$ 92808 66512 75535 72326 76888 83292 70486 63854 73440 84612 76185 73437 81012 74155 102011
12106A02011r129j5519k1550K2004J1249n606O697j3407r279N645J4616Q311M047
$$ 102011 92882 77363 55813 77817 89066 83460 90157 76750 67471 73116 87732 96043 100090
12093A00090m654j2147K0241j3924l3391k9305j5214L0224L6828J0677K371k8954
$$ 100090 95436 83289 103530 89606 56215 26910 11696 41920 78748 89425 91796 62842
12081F2842k02K7789j5236J157N368K2665M0086k2312k6077k3511j0093K2127
$$ 62842 62640 90429 75193 76350 81718 104383 144469 122157 96080 72569 62476 84603
12069H4603R171k1737k4914J592R082K0536K3280J3422L13j840j4452J368J769
$$ 84603 93774 72037 47123 48715 57797 78333 101613 115035 115348 113508 99056 100424 102193
12056A02193j3772k6297L106K6723N121j6345k2599l0509j3779K2469J8679J901
$$ 102193 88421 62124 65230 91953 97074 80729 58130 27621 13842 36311 54990 56891
12044E6891l0952m799R207k5212k0102K0451J3298K058K2118J6445l472p508K2892
$$ 56891 25939 21140 30347 5135 -14967 5484 18782 20840 42958 59403 55931 48423 71315
12031G1315q650N050j263k4963k6466j1767O288M417j4414j363L7044K1958O418
$$ 71315 62665 67715 66452 41489 15023 3256 9544 13961 -453 -1816 35228 57186 63604
12018F3604j7190m669o324q922j2004J0703J9314M895j5445j6008L5169M2749
$$ 63604 46414 41745 35421 26499 14495 25198 44512 49407 33962 17954 53123 95872
12006I5872O746Q332o397P517j968j5875j7916k2116R06M678J0246j7054l2416
$$ 95872 102618 110950 104553 112070 110102 94227 76311 54195 55101 59779 70025 52971 20555
11993B0555j1030O308L4861K9719l876M539l576J7279N654j2394o299J2815J4182
$$ 20555 9525 15833 50694 80413 76537 81076 77500 94779 100433 88039 81740 94555 108737
11980A08737Q37L510J6708O576k2581k6793j314J8858K5160L2269O8093R9322
$$ 108737 109574 113084 129792 136368 113787 86994 85680 104538 129698 161967 230060 329382
11968C29382J25659J06892P0323P057o5767r7688r9866j10201m6397l290k1757
$$ 329382 455041 561933 632256 639313 573546 475858 375992 265791 219394 216104 194347
11957A94347n4713j6390j3385q554K8177O709k0264K4753j6200k7502j999n749
$$ 194347 139634 123244 109859 101305 129482 136191 115927 140680 124480 96978 94979 89230
11945H9230l822K1156K3030p404k5257o165j0811J4384Q315N255j4446p425P4
$$ 89230 85408 106564 129594 122190 96933 90768 79957 94341 102656 107911 93465 86040 86114
11932H6114j985q317l1490j0004L6362J6031k0860J3557L2119K8979Q927k6986
$$ 86114 84129 75812 44322 34318 70680 86711 65851 79408 111527 140506 149433 122447
11920A22447j0564J060j157m208j033j4722k7165J2428p859k6620J6174J5034
$$ 122447 111883 112943 111786 107578 106545 91823 64658 77086 69227 42607 58781 73815
11908G3815K6607q18o321k5939m204K3573N4098J2374M731K1298Q936j6720p227
$$ 73815 100422 99604 93283 67344 63140 86713 140811 153185 157916 179214 188150 171430 164203
11895A64203q090k8309l7011q868r141k332q720K2218M4743J9730j6656k6553
$$ 164203 156113 127804 90793 81925 72784 70452 61732 83950 128693 148423 131767 105214
11883A05214p433j1634J8218j9613q293o354O410K1669J263j313n624l3062m5249
$$ 105214 97781 86147 104365 84752 76459 70105 76515 98184 99447 98134 92510 59448 14199
11870A4199J2260K4462J7278R385k379Q235K1294j5475l3683R755J4244J3700
$$ 14199 26459 50921 68199 77584 75205 83440 104734 89259 55576 65331 79575 93275
11858I3275J0680K6518M508l1384l9048j322j62Q98j3101L465L2119K2001O557
$$ 93275 103955 130473 134981 103597 64549 63227 63065 63963 50862 54327 86446 108447 115004
11845A15004P381N414P376L4198k063k4342k2332j1027l653P709J463o754N969
$$ 115004 122385 127799 135175 169373 167310 142968 120636 109609 105956 113665 115128 108374 114343
11832A14343k6011j8232P118O354J6845J9744K1814L7580R212J3384J3781J1109
$$ 114343 88332 70100 77218 83572 100417 120161 141975 179555 188767 202151 215932 227041
11820B27041J9051M0959L5790M563L6453L8015K3753J7875m357l6900l0896l1552
$$ 227041 246092 287051 322841 327404 363857 401872 425625 443500 439143 402243 371347 339795
11808C39795n1518N531j7127j9473l005k488o143p12M123K9146J0492J462J0810
$$ 339795 288277 293808 276681 257208 254203 251715 245572 244860 248983 278129 288621 290083 300893
11795C00893R764r269K2922Q895J4944K4298L0012o019J1885L3054L2857L7617
$$ 300893 310657 301388 324310 333205 348149 372447 402459 396440 408325 441379 474236 511853
11783E11853J6529m243j4322l9471j9543J5567o427j9233j1477J955p910j5907
$$ 511853 528382 524139 509817 470346 450803 466370 459943 440710 429233 431188 423278 407371
11771D07371k1337k8238J6581N732r725J4484L987L1027M8107L6903K7075K7638
$$ 407371 386034 357796 374377 380109 370384 384868 388855 419882 467989 504892 531967 559605
11759E59605O7540J17456J53118J59150J54814J47333J33852O6960J4980j5169
$$ 559605 627145 744601 897719 1056869 1211683 1359016 1492868 1559828 1574808 1559639
11749A559639n9140q3826j08592o0919K6534K6535L5727L0477J6259O607j1159
$$ 1559639 1500499 1416673 1308081 1247162 1273696 1300231 1335958 1366435 1382694 1389301 1378142
11738A378142j9178l3558q641k429N024M934k423J9447J5865R610K7486K2193
$$ 1378142 1358964 1325406 1316765 1314336 1319360 1324294 1321871 1341318 1357183 1366793 1394279 1416472
11726A416472M9003P8832R3292J11797J15804M6075O83J2882k0288k0103j4569
$$ 1416472 1465475 1544307 1637599 1749396 1865200 1911275 1911958 1924840 1904552 1884449 1869880
11715A869880l7532p217J8404L0238j7872k2477p7783o9999p5163q7690p8110
$$ 1869880 1832348 1825131 1843535 1873773 1855901 1833424 1755641 1685642 1610479 1522789 1444679
11704A444679q6267r3811q0098l6897k6189k3855N969K1696L0337k841Q476R0326
$$ 1444679 1358412 1264601 1184503 1147606 1121417 1097562 1103531 1125227 1155564 1152723 1161199 1251525
11692A251525R8548J01367Q1896N5136O627m4334l9671m8026m8953o1488p8488
$$ 1251525 1350073 1451440 1533336 1588472 1595099 1550765 1511094 1463068 1414115 1352627 1274139
11681A274139q4058o7706r2539j05834p1294p0799q0670q7244m7534k5318j8274
$$ 1274139 1190081 1122375 1029836 924002 852708 781909 701239 613995 566461 541143 522869
11670E22869k9660j27J3253l559j9092m998k288l5909j4419K3181J9885n386M2623
$$ 522869 493209 493082 506335 502776 483684 478686 476398 440489 426070 449251 469136 463750 506373
11657E06373L6629L0556L9591J8743J4333k5538n3490l6197k962J4727K5464J4373
$$ 506373 543002 573558 613149 631892 646225 620687 567197 531000 528038 542765 568229 582602
11645E82602j9198k3190k7712n0217k4658k1018j5541m822k5697k0282J5015J3354
$$ 582602 563404 540214 512502 462285 437627 416609 401068 396246 370549 350267 365282 378636
11633C78636P195p209r578k0133J8404K0487J423o093o409p267j6858j6310J9703
$$ 378636 385831 378622 369044 348911 367315 387802 389225 383132 376723 369456 352598 336288 355991
11620C55991q610j290l0124k2581J8270J1492m594Q085M3628O522K4670K0418
$$ 355991 347381 346091 315967 293386 311656 323148 318554 326639 370267 376789 401459 421877
11608D21877j1457k9966m326k3478j8947n187N154K694Q638L2898J2137l739k696
$$ 421877 410420 380454 376128 352650 333703 328516 333670 336364 345002 377900 390037 386298 383602
11595C83602j4887M197L4237o377m3026k425K2561J1240k9186K413K2970m2088
$$ 383602 368715 372912 407149 400772 357746 355321 377882 389122 359936 362349 385319 343231
11583C43231p159L0076J9752K5447k0447K936L3024M8981K3619K3443K0240K1837
$$ 343231 336072 366148 385900 411347 390900 393836 426860 475841 499460 522903 543143 564980
11571E64980l705j3612j6687l692r72l7821n7941j8923J5081j3909j2186k3333
$$ 564980 561275 547663 530976 527284 526312 488491 430550 411627 426708 412799 400613 377280
11559C77280J2872N0539K7336p620J0066j940j9894r196M2082J2953Q558P264
$$ 377280 390152 440691 468027 460407 470473 468533 448639 439443 481525 494478 503036 510300
11547E10300n630L0184P843q314K4254M439J8648R768q199n427N40l854k5362
$$ 510300 504670 534854 542697 534383 558637 563076 581724 591492 583293 577866 578406 574552 549190
11534E49190j2180N375L9615L6637J0827J0722J2328P453J4306j0083j4948J4761
$$ 549190 537010 542385 582000 618637 629464 640186 652514 659967 674273 664190 649242 664003
11522F64003K5353k415k350R322N2668M3811K6582L4065J9691M4419O4972M9734
$$ 664003 689356 686941 684591 693913 746581 790392 816974 851039 870730 915149 980121 1029855
11510A029855N7948M9535N1688R6831J36334J65907K11947K17195J91931J21459
$$ 1029855 1087803 1137338 1189026 1285857 1422191 1588098 1800045 2017240 2209171 2330630
11500B330630O8454M3826l7154j41581j49887j23786r2366r3048o6207l1773j2527
$$ 2330630 2399084 2442910 2405756 2264175 2114288 1990502 1898136 1805088 1738881 1707108 1694581
11489A694581J3827M3361Q3995Q1541R4815N7300N813N421O576J7976o040K1795
$$ 1694581 1708408 1751769 1835764 1917305 2012120 2069420 2075233 2080654 2087230 2105206 2099166 2120961
11477B120961N1831M8743R9229J52824J54524J27566J10839M1351J0048n2656
$$ 2120961 2172792 2221535 2320764 2473588 2628112 2755678 2866517 2907868 2917916 2865260
11467B865260q5676r4859n9069m8738l6481j3969j3297K7781J9502L9744J5254
$$ 2865260 2779584 2684725 2625656 2576918 2540437 2526468 2513171 2540952 2560454 2600198 2615452
11456B615452Q306L0625M2986O1452J18263J76796K30903K53941K34272J59624
$$ 2615452 2623758 2654383 2697369 2758821 2877084 3053880 3284783 3538724 3772996 3932620
11446C932620J39436R9047P0410J243l9604q0940j12141j50131j48110j42574
$$ 3932620 4072056 4171103 4241513 4242756 4203152 4122212 4010071 3859940 3711830 3569256
11436C569256j14182p0319j4564l8470k2082p459j3665k1840k6438p2826n4178
$$ 3569256 3455074 3384755 3370191 3331721 3309639 3302180 3288515 3266675 3240237 3167411 3113233
11425C113233m1035l259O0130N7848P5830J03245J00075Q0629P4229M3721J3092
$$ 3113233 3072198 3068939 3129069 3186917 3262747 3365992 3466067 3546696 3620925 3664646 3677738
11414C677738k8792p0721l7892l8721k0236m2210m6905M392K9171R531K2452j232
$$ 3677738 3648946 3578225 3540333 3501612 3481376 3439166 3392261 3396653 3425824 3435355 3457807 3456575
11402C456575J4731K2695j0752J0193j2663k943j1340M007M9366R0490J24010
$$ 3456575 3471306 3494001 3483249 3493442 3480779 3477836 3466496 3470503 3519869 3610359 3734369
11391C734369J49605J39994J09057M4729j3043n9429p9373n3405j29321j41661
$$ 3734369 3883974 4023968 4133025 4177754 4164711 4105282 4025909 3972504 3843183 3701522
11381C701522n6561m8521m9900j4752J8032N6977R0230J09128R3797Q1264P7453
$$ 3701522 3644961 3596440 3546540 3531788 3549820 3606797 3697027 3806155 3899952 3981216 4058669
11370D058669P7742M6999O8335O7851O3609K8415J2883N5164N8725J2596m980
$$ 4058669 4136411 4183410 4251745 4319596 4383205 4411620 4424503 4479667 4538392 4550988 4546008
11359D546008n681M1916Q6763R4560P6362J21630J30648R8014J17054J07428J66036
$$ 4546008 4540327 4582243 4669006 4763566 4839928 4961558 5092206 5190220 5307274 5414702 5580738
11348E580738J84345J83426K21248K67870L16868L61854L83828L80487M23433
$$ 5580738 5765083 5948509 6169757 6437627 6754495 7116349 7500177 7880664 8304097
11339H304097M64029N19511O04213P07587Q41130R87154J123752J307136J523222
$$ 8304097 8768126 9287637 9891850 10599437 11440567 12427721 13551473 14858609 16381831
11330A6381831J797927K235147K799640L537600M611236O061236Q045113J0606236
$$ 16381831 18179758 20414905 23214545 26752145 31363381 37424617 45469730 56075966
11322E6075966J3683630J7003101J9784527K0874964J9175511J4250363O436299
$$ 56075966 69759596 86762697 106547224 127422188 146597699 160848062 167284361
11315A67284361k921598j1097492j5719185j6654991j5275641j2677741r422104
$$ 167284361 164362763 153265271 137546086 120891095 105615454 92937713 83515609
11308H3515609n871593k437035N64191L044577M810285N680374N668696M928386
$$ 83515609 77644016 75206981 75771172 78815749 83626034 89306408 94975104 99903490
11300I9903490L746468K438997J406184P29755N07198J171667K895367N565559
$$ 99903490 103649958 106088955 107495139 108224894 108732092 109903759 112799126 118364685
11292A18364685Q712298J1651752J3542622J3437680J0895527O075543j22259
$$ 118364685 127076983 138728735 152271357 165709037 176604564 182680107 182557848
11285A82557848o190959j0540526j2368480j1807875r742573p091816m683652
$$ 182557848 176366889 165826363 153457883 141650008 131907435 124815619 120131967
11278A20131967l019030k190671k160606k766972l750066m802683n754926o312710
$$ 120131967 117112937 114922266 112761660 109994688 106244622 101441939 95687013 89374303
11270H9374303o249021n289850l587266j267427J485068M631965Q024854J1391764
$$ 89374303 83125282 77835432 74248166 72980739 74465807 79097772 87122626 98514390
11262I8514390J4231878J5819372J5345000J2029062N872623k201230j0608703
$$ 98514390 112746268 128565640 143910640 155939702 161812325 159611095 149002392
11255A49002392j7045507j9717102j8901913j6263220j3225008j0502302q201947
$$ 149002392 131956885 112239783 93337870 77074650 63849642 53347340 45145393
11248D5145393o336093m918800l858622l111916k589492k208714j884696j619000
$$ 45145393 38809300 33890500 30031878 26919962 24330470 22121756 20237060 18618060
11240A8618060j425507j259853j075684q92089p51607o04747m91517l61609k56975
$$ 18618060 17192553 15932700 14857016 13964927 13213320 12608573 12117056 11755447 11498472
11231A1498472k14785k15209k78393l91515m67331n85138o25095o25368n79856
$$ 11498472 11283687 11068478 10790085 10398570 9931239 9346101 8721006 8095638 7515782
11222G515782m99166m37861l75456k92407k33921j72472j79043j25320j49753
$$ 7515782 7016616 6578755 6203299 5910892 5676971 5504499 5325456 5200136 5050383
11213E050383j27099j13516j47191j57120j50311j49407j42863j17533q6752o1288
$$ 5050383 4923284 4809768 4662577 4505457 4355146 4205739 4062876 3945343 3858591 3797303
11203C797303r8905j17536q0175r6027q7678n2681p0406n9485r4319j19205n6694
$$ 3797303 3698398 3580862 3500687 3404660 3316982 3264301 3193895 3134410 3040091 2920886 2864192
11192B864192m3436n7789l9505p1413m2281m4153n2986j6431k7304j6034J789
$$ 2864192 2820756 2762967 2723462 2652049 2609768 2565615 2512629 2496198 2468894 2452860 2454649
11181B454649o94m6556p3588o6005n4317m1112n4487k178l6654n3889q1627o4164
$$ 2454649 2453955 2407399 2333811 2267806 2213489 2172377 2117890 2115712 2079058 2025169 1943542 1879378
11169A879378m9641j4512K849K8205K8575Q0975J37045J00948N8202k0708l9168
$$ 1879378 1829737 1815225 1818074 1846279 1874854 1955829 2092874 2193822 2252024 2231316 2192148
11158B192148j8764o4956j20483j44385j15838q0905o0586n7370k2910m3562l1566
$$ 2192148 2173384 2108428 1987945 1843560 1727722 1646817 1586231 1528861 1505951 1462389 1430823
11147A430823j0318l2720j2276j0405j6595j3638j5172N24J9420l5657o1316o7751
$$ 1430823 1420505 1387785 1375509 1365104 1348509 1334871 1319699 1320223 1339643 1303986 1242670 1174919
11135A174919n4110l4249n6888m1476m3267l1161r182l7674m9408p001j2639m3339
$$ 1174919 1120809 1086560 1029672 988196 944929 913768 904586 866912 817504 810503 797864 754525
11123G54525j2135k8900j8291j5622j6194k8391l422l0316m4101j8807k9379R365
$$ 754525 742390 713490 695199 679577 663383 634992 631570 601254 557153 538346 508967 518332
11111E18332J2204J9243J2584p858k1647o674j6934j3847J6554r904j5479j3287
$$ 518332 530536 549779 562363 554505 532858 526184 509250 495403 511957 502053 486574 473287
11099D73287J8787P6020P4299N3056O7478Q9812M1202p062o3575r1235j15622
$$ 473287 492074 568094 642393 695449 762927 852739 893941 886879 823304 732069 616447
11088F16447j01000n4337j9093n206R139L082j734j9040k9521k9342l670o979
$$ 616447 515447 461110 442017 436811 445950 449032 447298 428258 398737 369395 365725 358746
11076C58746l2097j1071N681l5440j8435l324Q746m586J4145M1862J0372L26O931
$$ 358746 326649 315578 321259 285819 267384 264060 272806 268220 282365 324227 334599 334925 341856
11063C41856m416J0807l86O681j2620L3399L9214J2643L384j05J9111p385l5131
$$ 341856 337440 348247 347861 354542 341922 375321 414535 427178 430562 430457 449568 442183 407052
11050D07052j0704R836k8144n0177l2024p489k1446l0890J2723P513P953k428
$$ 407052 396348 406184 378040 327863 295839 288350 266904 236014 248737 256250 264203 261775
11038B61775J6801n732j8290m7804N807K4302K107J163R080J3567J963m19K007
$$ 261775 278576 272844 254554 206750 212557 236859 238966 240129 249209 262776 264739 264320 266327
11025B66327J2210j9091M520j578J4420J1004K2055M4195K3947P475K71M930p337
$$ 266327 278537 259446 263966 262388 276808 287812 309867 354062 378009 385484 385755 390685 383348
11012C83348o14k04l3085J0038k6378o0519j8573r156m8336k0726l443Q790L714
$$ 383348 382734 382530 349445 359483 333105 272586 254013 244857 196521 175795 172352 181142 184856
10999A84856J6710J3801q749j1099l2723j0959o51K4573J2502R783p760j5365
$$ 184856 201566 215367 206618 195519 162796 151837 151186 175759 188261 198044 190284 174919
10987A74919L2622L8524J1674j4427k965K5317K9942J7654l0144j7096J517Q442
$$ 174919 207541 246065 257739 243312 240347 265664 295606 313260 283116 266020 267537 275979
10975B75979K2078K1468M8241M1855k8455J0898M1120L1608N5494K8585M6469
$$ 275979 298057 319525 367766 409621 381166 392064 433184 464792 520286 548871 595340
10964E95340O8606N0368Q5112P8045J08669J51339K61362M15512N60254Q62165
$$ 595340 663946 714314 799426 877471 986140 1137479 1398841 1814353 2374607 3236772
10954C236772J257191J591603J733572J441082P42936l20240j447256j888078
$$ 3236772 4493963 6085566 7819138 9260220 10003156 9682916 8235660 6347582
10946F347582j648994j210527p98188n21729l61382k50084j74510j24773j16413
$$ 6347582 4698588 3488061 2689873 2168144 1806762 1556678 1382168 1257395 1140982
10937A140982j34193j30960o1053p0897o8446n0236k8528j4652P211k95K9211
$$ 1140982 1006789 875829 814776 743879 675433 625197 596669 582017 589228 588933 618144
10926F18144J2149q844N983M26l6089n8487o286R26k9152q617l9063p2182j7352
$$ 618144 630293 621449 627432 627858 591769 533282 526996 527922 498770 490153 451090 378908 361556
10913C61556l1003J1905K1378p366m401O555k9362j7744K999o251j8844j8067
$$ 361556 330553 342458 363836 356470 352069 358624 329262 311518 314517 308266 289422 271355
10901B71355J8015J7284M764K1687K9410L3254L2719P1193L8072M1107O9162J08054
$$ 271355 289370 306654 311418 333105 362515 395769 428488 499681 537753 578860 648022 756076
10889G56076Q4639R1941O4580N0671M6743J3545L2585J7068n085m491j026l8879
$$ 756076 840715 932656 997236 1047907 1094650 1108195 1140780 1157848 1152763 1148272 1147246 1108367
10877A108367p9099j15716n5163m2893m3304k9640j4320K7191J5967j4633j5425
$$ 1108367 1029268 913552 858389 815496 772192 742552 728232 755423 771390 756757 741332
10866G41332J6193J9611M473Q398K1021M4374L3303K5541K2347K0134j1005j5465
$$ 741332 757525 777136 781609 790007 811028 855402 888705 914246 936593 956727 945722 930257
10854I30257l823k4207l9123k3044r462l9329k6916j7476j5070j4063j1279j2433
$$ 930257 926434 902227 863104 840060 830598 791269 764353 746877 731807 717744 706465 694032
10842F94032l1399k7597K0264J4150K9852R6396J04715O3037N8012O8497J0544
$$ 694032 662633 635036 655300 669450 699302 795698 900413 963450 1021462 1089959 1100503
10831A100503j1592l6252k2921k2089q992m1769q6810q8756p6177o3069p1448
$$ 1100503 1088911 1052659 1029738 1007649 998657 956888 870078 781322 705145 642076 570628
10820E70628p0768p5576o9321k6178k4997m1007l8988q95k8262m6806N104J776
$$ 570628 499860 424284 354963 328785 303788 262781 223793 222898 194636 147830 152934 154710
10808A54710k0410l5543j1882q828k759O256o181p406j1899J8959k8j217J3399
$$ 154710 134300 98757 86875 78047 75288 81544 75363 67957 56058 75017 74989 73772 87171
10795H7171M824L7617K8641K7416N159J1125J6202L1548k6278m1082l1604n0424
$$ 87171 91995 129612 158253 185669 190828 201953 218155 249703 223425 182343 150739 100315
10783A00315j9060K7240L4386r836L145K1198j9958k2861j6868J4748L1505j1870
$$ 100315 81255 108495 142881 133045 136190 157388 137430 114569 97701 112449 143954 132084
10771A32084k0361K8683j74j4933J0083J0780J8468M55m7525k7247R498N959j36
$$ 132084 111723 140406 140232 125299 135382 146162 164630 165085 117560 90313 99811 105770 105634
10758A05634K460k405k4109K5511M0137M00o943l074n070R071M597J8150K9795
$$ 105634 108094 105689 81580 107091 147228 147628 140685 137611 132541 141612 146209 164359 194154
10745A94154k230k8879j426p359K1543j5047l0063k2518l831k1506q08M870n666
$$ 194154 191924 163045 161619 154260 175803 160756 130693 108175 104344 82838 82030 86900 81234
10732H1234J3250K6694k03j799M376q366P119J6569M060j2503K164j2210N419
$$ 81234 94484 121178 120975 119176 123552 115186 122305 138874 142934 130431 132595 120385 125804
10719A25804J5193J8725p241k6598J1361r746L087K0390r640j1292j2285j8903
$$ 125804 140997 159722 152481 125883 137244 127498 130585 150975 141335 130043 117758 98855
10707I8855p989P275J334J6260J6872J374l9650j6726j21J1882l126P064j5477
$$ 98855 90866 98141 99475 115735 132607 133981 94331 77605 77484 89366 86240 93304 77827
10694G7827m509R594J0105Q56J502j3346q184J4539J5163J842M419l1363j3672
$$ 77827 73318 82912 93017 93873 95375 82029 73845 88384 103547 105389 109808 78445 64773
10681F4773j5927P441p606Q835J3336O171J9379j8543M366J0899L8598Q035j3908
$$ 64773 48846 56287 48681 57516 70852 77023 96402 77859 82225 93124 131722 139757 125849
10668A25849k8859j1283L571R482J7353l311j3992k1252P183K6997L243r397o813
$$ 125849 96990 85707 89278 98760 116113 112802 98810 77558 84741 111738 114981 105584 98771
10655I8771m077j3982k6800K4368Q171k0089K6859n16r396j1420L392M926K0403
$$ 98771 94694 80712 53912 78280 86451 66362 93221 92705 83309 71889 75281 80207 100610
10642A00610o672M420N441j1248k5583O530k020J3222N956K9723J1914k3170k2703
$$ 100610 93938 98358 103799 92551 66968 73498 71478 84700 90656 120379 132293 109123 86420
10629H6420k415J0351P044N634j3085j6895J6087K3178k9533k5672k4294j8430
$$ 86420 84005 94356 101400 107034 93949 77054 93141 116319 86786 61114 36820 18390
10617A8390J0874o252J137J2548J8722l901J1246J6281j3794k5324k2837J847
$$ 18390 29264 23012 24149 36697 55419 51518 62764 79045 65251 39927 17090 18937
10605A8937R31P046k0814J1196K6290K216j4958O970K477K3268K6616m492j1512
$$ 18937 19868 26914 6100 17296 43586 45802 30844 37814 40291 63559 90175 85683 74171
10592G4171J2511j6466p452R837o861l3277L424J6928j6672q369j2257l163M751
$$ 74171 86682 70216 62764 72601 65740 32463 35887 52815 36143 27774 15517 12354 17105
10579A7105N587J9397K6459k0161M715J749K0275K6986L8892k8631k7823j5853
$$ 17105 22692 42089 68548 48387 53102 54851 75126 102112 141004 112373 84550 68697
10567F8697L569K987L0762J3339k8446j3779J788k634N704k1971k1862r702J9584
$$ 68697 72266 75253 106015 119354 90908 77129 78917 76283 81987 60016 38154 28452 48036
10554D8036r144j5308L83K8614m610N336J103P282K9318J9165J030p661l0387
$$ 48036 38892 23584 23967 52581 47971 53307 54410 61692 91010 110175 111205 103544 73157
10541G3157J0182o316j9092M663K627L404j8185J3244K1169K868J2301K702J8901
$$ 73157 83339 77023 57931 62594 65221 68625 50440 63684 84853 87721 100022 102724 121625
10528A21625K5649Q642j1371J5370j643j0683P325K5557l670Q708K5097L5266
$$ 121625 147274 155916 144545 159915 158272 147589 154914 180471 176801 185509 210606 245872
10516B45872Q3692P4628P4208J04437M3724k7085o5936p9484r2106q4213n2697
$$ 245872 329564 404192 478400 582837 626561 599476 533540 454056 361950 277737 225040
10505B25040l8198l0344l9818k4926j65j0073k0196p726k54J8857M922N420O02
$$ 225040 186842 156498 116680 91754 91589 81516 61320 53594 53340 72197 77119 82539 83141
10492H3141q158P40l6917J7643P206l367L755Q107J6465J2599M015J0475q156
$$ 83141 74983 75723 38806 56449 63655 60288 64043 72150 88615 101214 105229 115704 107548
10479A07548j3k2877l6646j5025K8709K3306r947k04K1163l738k4921L886Q798
$$ 107548 107535 84658 48012 32987 61696 85002 75055 74851 96014 92276 67355 71241 80039
10466H0039L640J464O687K5245K9607j0921m624O340M579K2767l981k0002l6929
$$ 80039 83679 85143 91830 117075 146682 135761 131137 137477 142056 164823 160842 140840 103911
10453A03911l6013l472j2910M043j335m76L622R254P466R085l601P504J1538Q03
$$ 103911 67898 64426 51516 55559 54224 53748 57370 66624 74090 83175 79574 87078 98616 99419
10439I9419j6230m731J1382j4594j8107j8879r163M568N366K7981o531k3833R225
$$ 99419 83189 78458 89840 75246 57139 38260 29097 33665 39031 67012 60481 36648 45873
10426D5873K6232P287n919J43N295J486J6300J1967J0032j2039J610j1949l0720
$$ 45873 72105 79392 73473 73616 78911 80397 96697 108664 118696 106657 108267 96318 65598
10413F5598Q774L3328K0409k7250m9051l356K3646n986l244j468L3668l791R79
$$ 65598 74372 107700 128109 100859 51808 48452 72098 66112 62868 61400 95068 91277 92256
10400I2256N147J4221k912j5245r152J1489j5502k3038p365J0363K8619M894n867
$$ 92256 97403 111624 108712 93467 84315 95804 80302 57264 49899 60262 88881 93775 87908
10387H7908K2151K196l5211j6610k493J8112J1974M1463j4485r900J1910o564
$$ 87908 110059 112255 77044 60434 57941 76053 88027 129490 115005 105105 117015 110451
10375A10451j4251q523P883J0479j2528k0347n85K939J7023K7765M446q509p788
$$ 110451 96200 87677 95560 106039 93511 73164 72579 75518 92541 120306 124752 116243 108455
10362A08455o942J2677K5781M031k1763j7948l782J8490K9611Q747o332K005J5223
$$ 108455 101513 114190 139971 144002 122239 104291 100509 118999 148610 157357 151025 153030 168253
10349A68253N921J6844J3479M3293J5735M0307K7911J3549j588K0967N4522O3849
$$ 168253 174174 191018 204497 247790 263525 303832 331743 345292 343704 364671 419193 483042
10337D83042M2933N3056R0737J09174J35324J93831K83031M12983N33182O46763
$$ 483042 525975 579031 669768 778942 914266 1108097 1391128 1804111 2337293 2984056
10327B984056P22931P77221Q21465P71977O07389L99020J72864q6256l53162n64569
$$ 2984056 3706987 4484208 5305673 6077650 6685039 7084059 7256923 7170667 6817505 6252936
10317F252936p03588p94474p96684p17505o58820n35772m28995l22438j78617
$$ 6252936 5549348 4754874 3958190 3240685 2581865 2046093 1617098 1294660 1116043
10308A116043j16616o5625j14417j19035m7855m7147m8142o8548l8747o628j3390
$$ 1116043 999427 933802 819385 700350 652495 605348 557206 488658 449911 443283 429893
10297D29893l4366m2792m4406r810L912l2617k5538k1162n791M248J220j0823
$$ 429893 395527 352735 308329 298519 302431 269814 244276 223114 217323 221571 222791 211968
10285B11968K3757N023k7996l3477N818k1372P283N786J3994P801K109k0706l157
$$ 211968 235725 240748 212752 179275 185093 163721 171004 176790 190784 198585 200694 179988 176831
10272A76831M1827N9882M9519O0920J03719N1568M8347M8666L7920J2335k8445
$$ 176831 218658 278540 328059 388979 492698 544266 592613 641279 679199 691534 663089
10261F63089l5776m0933o8623q2713o7648p2407k6154k4326m261k8518j6076Q32
$$ 663089 627313 586380 517757 435044 367396 294989 268835 244509 240248 211730 195654 196486
10249A96486l581j2673q873k1634k0198l545J7364J7985q888l8739r638j8506
$$ 196486 192905 180232 171359 149725 129527 125982 143346 161331 152443 113704 104066 85560
10237H5560N342j570K0842R617m339L747j9502k1220J3216R907J4995J4326m1095
$$ 85560 90902 89332 110174 119791 115452 119199 99697 78477 91693 101600 116595 130921 89826
10224H9826K2472J8760k3505Q185j7232k0548j3173K3062N70q953J1507R573l7757
$$ 89826 112298 131058 107553 115738 98506 77958 64785 87847 88417 79464 90971 100544 62787
10211F2787n887L530R443Q42M892j2919K0615j2889k5515O59R291R260K5444J0847
$$ 62787 56900 60430 69873 70715 75607 62688 83303 70414 44899 45558 54849 64109 89553 100400
10197A00400J1881j6216O733j9895K116p573J3800r668k0035k0017k0852j8475
$$ 100400 112281 96065 102798 82903 85019 77446 91246 81578 61543 41526 20674 2199
10185B199l711L378l750L0792K2733J8212j0289l3452k2012l827L3831N5599j9356
$$ 2199 -1512 1866 -1884 28908 51641 69853 59564 26112 4100 273 34104 89703 70347
10172G0347k6250L73P811J6880k321K1762o975m0253K0977K7931j8449l5510r178
$$ 70347 44097 44470 52281 69161 66840 88602 81627 41374 62351 90282 71833 36323 27145
10159B7145M440m436k0514p454J73O050l096J9717J2692l771J1505J0417Q58j1330
$$ 27145 31585 27149 6635 -819 -646 5404 2308 22025 34717 30946 42451 52868 53726 42396
10145D2396o553K5244k1017j8674R826L8151K998r555l106R632L671L1286M422
$$ 42396 35843 61087 40070 21396 31222 69373 72371 62816 59710 69342 73013 104299 108721
10132A08721m7268k4080L843Q428j8348r903l292J969K8620j7453j4589N441k337
$$ 108721 61453 37373 41216 49644 31296 21393 18101 20070 48690 31237 16648 22089 19752
10119A9752j0762k006Q124k410L568P857O915K4963P000j0640R887J3035j4974
$$ 19752 8990 6984 15108 12698 16266 24123 31038 56001 63001 52361 62248 75283 60309
10106F0309k5564M924o226j2477Q498J7502n534j879K5926N767k8675j2180q394
$$ 60309 34745 39669 33443 20966 29464 46966 41432 39553 65479 71246 42571 30391 21997
10093B1997j3335K0754J6435J8475r884l1504j8490Q977K3731j2350K17L6342
$$ 21997 8662 29416 45851 64326 54442 22938 4448 13425 37156 24806 25023 61365
10081F1365O557R547r816l7559r209L9500M062l182K4250k6972l3513j211m545
$$ 61365 67922 77469 67653 30094 20885 60385 64447 61265 85515 58543 25030 23819 19274
10068A9274M172k170L858L333j826P295Q293J2086l7969j4108M662J8604R443
$$ 19274 23446 21276 25134 28467 26641 33936 42229 54315 16346 2238 6900 25504 34947
10055C4947L820J7336J0062k4887k7356L821K4976J5491j6310k7674N735J3600
$$ 34947 38767 56103 66165 41278 13922 17743 42719 58210 41900 14226 19961 33561
10043C3561j336k042l7635j3695J3343r776K8131K4781K2831K7992J0331J8706
$$ 33561 32225 30183 -7452 -21147 -7804 -17580 10551 35332 58163 86155 96486 115192
10031A15192k0205k9840n454j7283O434p954j0735M835M044L834j4176l0299P921
$$ 115192 94987 65147 59693 42410 48844 40890 30155 34990 39034 42868 28692 -1607 6314
10018F314J9847J2376r054K4057K2103j6948k305p323m3717O56L530L435J9921
$$ 6314 26161 38537 29483 53540 75643 58695 56390 49067 5350 6006 9536 12971 32892
10005C2892K8150r770j0545o874L1698o390k4075j0169j4885K2308K4810L763
$$ 32892 61042 51272 40727 33853 65551 59161 35086 24917 10032 32340 57150 60913
9993F0913m997k0418k300P795l018P385j0694m1083j251L1358J7371k3356j4980
$$ 60913 55916 35498 33198 40993 37975 45360 34666 -6417 -7668 23690 41061 17705 2725
9980B725K6250K4164j5968O297J7683J9928j5722l8117K3036J4265l5859m515
$$ 2725 28975 53139 37171 43468 61151 81079 65357 27240 50276 64541 28682 24167
9968B4167N868J8887K0946K3788k0120r417p583j9819l1175J6025j416j6217O785
$$ 24167 30035 48922 69868 93656 73536 64119 56536 36717 5542 21567 20151 3934 10719
9955A0719J6404P763J1811J5010Q365J1662K3700J8116R932k2100J062J2983L775
$$ 10719 27123 34886 46697 61707 70072 81734 105434 123550 133482 111382 112444 125427 129202
9942A29202O957K2959M6339K0705r904J5811k6339K715L2880L9118K3460M0510
$$ 129202 136159 159118 205457 226162 216258 232069 205730 208445 241325 280443 303903 344413
9930C44413P767l9381k1782m2791l8192q32k6000J4896K1554j8634n614j399o562
$$ 344413 352180 312799 291017 248226 210034 209202 183202 198098 219652 201018 195404 194005 187443
9917A87443j1585n770j9268J1242N681M827O870j3419l0072j9528J5860j1596
$$ 187443 175858 170088 150820 162062 167743 172570 179440 166021 135949 116421 132281 120685
9905A20685l3811j2521L830J5564K1466k491N40k038j1270j4461j1052O948K7778
$$ 120685 86874 74353 78183 93747 115213 112722 113262 111224 99954 85493 74441 81389 109167
9892A09167J7466K959K7769J4360k3735k307J4326M1637J8693l1247j2297l2995
$$ 109167 126633 129592 157361 171721 147986 145679 160005 201642 220335 189088 176791 143796
9880A43796k6249J824k5009K289J3362J2558K1757M358m265m225N233K0988j4141
$$ 143796 117547 119371 94362 96651 110013 122571 144328 148686 144421 140196 145429 166417 152276
9867A52276j9092k0551J14j0418l0471j2977O406K3989J1539J4176K109K0222
$$ 152276 133184 112633 112747 102329 71858 58881 65287 89276 100815 114991 117100 137322
9855A37322J5879j7876j6935l360Q58Q445J9789J191j1932R197j0825o833j4261
$$ 137322 153201 135325 118390 115030 115888 124333 144122 145313 133381 142578 131753 124920 110659
9842A10659L1752K9059J6054K9926L5337N5962P0822J00194P8546L4643O61p3670
$$ 110659 142411 171470 187524 217450 252787 308749 379571 479765 558311 592954 593615 519945
9830E19945j23514r5003p4974n7549k6733r575P058K1272J9234j6140k5658j2534
$$ 519945 396431 301428 226454 168905 142172 132597 139655 160927 180161 164021 138363 125829
9818A25829O000k4839J4360L695o283m988J3302p346k1024j5948K3211J1876o076
$$ 125829 131829 106990 121350 125045 118762 113774 127076 119730 98706 82758 105969 117845 111769
9805A11769J0799J1992O667m470n403P471R510j4409P940j7869l0015L187M994
$$ 111769 122568 134560 141227 136757 131354 138825 148335 133926 141866 123997 93982 97169 102163
9792A02163R560K2117k0918j8238j2809j8070K6366j0763J605K4592N710p161
$$ 102163 111723 133840 112922 94684 81875 63805 90171 79408 81013 105605 111315 104154
9780A04154K592K6518J4197j2917p67J190j5310N400m903l0975M843K4197l0122
$$ 104154 106746 133264 147461 134544 133777 134967 119657 125057 120154 89179 94022 118219 88097
9767H8097j4394l880J7708K1882l447J195k1136j9327m45K8688K3761l6696k3819
$$ 88097 73703 69823 87531 109413 105966 107161 86025 66698 66253 94941 118702 82006 58187
9754E8187J3170j2630k9429L6723M1483J1177j498M632r636j2499p629N991M831
$$ 58187 71357 58727 29298 66021 107504 118681 117183 121815 112179 99680 92051 98042 102873
9741A02873M232J1751J3126L0997K8738J5809P133j1156j4734j5777J3757L0772
$$ 102873 107105 118856 131982 162979 191717 207526 214659 203503 188769 172992 186749 217521
9729B17521K4767K4882K388M0389O6079N2306l813O931L4559J5492l6128l7002
$$ 217521 242288 267170 269558 309947 376026 428332 424519 431450 466009 481501 445373 408371
9717D08371m7473l6019j5190m9498k9015k3203j3580l0762o271m847q074J2691
$$ 408371 360898 324879 309689 260191 231176 207973 194393 163631 157360 152513 144439 157130
9705A57130J2164k9478J514n463P237J0083M81k8675l1242O833Q655K501J9651
$$ 157130 169294 139816 141330 135867 143104 153187 153668 124993 93751 100584 109239 111740 131391
9692A31391J6553l965R490p426J6169N890j6691r647P723p4K0660J4242l1295
$$ 131391 147944 143979 153469 146043 162212 168102 151411 141764 149487 149413 170073 184315 153020
9679A53020l2667k6878J802L1371L8272r324r04J8593J3320j8210j1863L0970
$$ 153020 120353 93475 95277 126648 164920 155596 154692 173285 186605 168395 156532 187502
9667A87502M471k3958J1593J2760L719k548n131j9453l938J4078K2639r500L142
$$ 187502 191973 168015 179608 192368 196087 193539 188408 168955 165017 179095 201734 192234 195376
9654A95376M538M456M207m419L343l0967m719J8268K4248Q244l1982k6063J4366
$$ 195376 199914 204370 208577 204158 207501 176534 171815 190083 214331 222575 190593 164530 178896
9641A78896J2173j1883j2205P643N727j520j3447j6563N214K8315K3221J6273
$$ 178896 191069 179186 166981 174624 180351 178831 165384 148821 154035 182350 205571 221844
9629B21844L812n988J3475J6494k8814j1956m239J5453k1471J972o053p690j9681
$$ 221844 225656 219668 233143 249637 220823 208867 204628 220081 198610 200582 194529 186839 167158
9616A67158O655p44L4758J913j2848J7481L593j7918j8492l430j3880L132K2873
$$ 167158 173813 173069 207827 209740 196892 214373 217966 200048 181556 178126 164246 167378 190251
9603A90251K6695j3950k0670O265K1377J876l349o088P270O286L47k5101N259
$$ 190251 216946 202996 182326 188591 209968 211844 208495 202407 209677 215963 216310 191209 196468
9590A96468L416q348k0439P811K1875R370J8249l3562K7276L1427m453o682J5999
$$ 196468 199884 191536 171097 178908 200783 210153 228402 194840 222116 253543 249090 242408 258407
9577B58407K2717l005N340p634n58o519J2584r023k8423j071J3029M609j7475
$$ 258407 281124 278119 283459 275825 275267 268748 281332 272309 243886 242815 255844 260453 242978
9564B42978k3644J929J802L1571J7127k4314j6989L0585J195m048m828r616J3075
$$ 242978 219334 221263 223065 254636 271763 247449 230460 261045 262240 258192 253364 243748 256823
9551B56823Q330k6046k9927K4107L9339O804P19j4084J278K899K6792j3788j2079
$$ 256823 265153 239107 209180 233287 272626 279430 280149 266065 267343 270242 297034 283246 271167
9538B71167Q00L7155L7289J1340j1466k9677j6345J1244J8616p574L276K5354
$$ 271167 271967 309122 346411 357751 346285 316608 300263 311507 330123 322549 325825 351179
9526C51179J5889q214k3498k6875m992L036j5059l260J9188K3897K2518J4652
$$ 351179 367068 358854 335356 308481 303489 306525 291466 288206 307394 331291 353809 368461
9514C68461k8214l6909O749k41k0767j3169l225J0586L6576L1097l4431L685J4588
$$ 368461 340247 303338 310087 309846 289079 275910 272685 283271 319847 350944 316513 320198 334786
9501C34786j5695j3068J5568o257l186K0327J5082K1201J6680l1018j2709l2789
$$ 334786 319091 306023 321591 315334 312148 332475 347557 368758 385438 354420 341711 308922
9489C08922j7703L0120L3911L1306N856r07Q290p441j130J4835k0807Q390J0508
$$ 308922 291219 321339 355250 386556 392412 391505 399795 392354 391224 406059 385252 393642 404150
9476D04150N399M3084k6801k4394K5544q463r129j266J4507j4753Q722J4954N680
$$ 404150 409549 452633 425832 401438 426982 418519 409390 408124 422631 407878 416600 431554 437234
9463D37234p438j0188m013K8674K8660J1332O896j702r471r718J1565k939j6476
$$ 437234 429796 419608 415595 444269 472929 484261 491157 489455 479984 470266 481831 478892 462416
9450D62416j5218K1934j3044m620M1094P477j2018l370J9200M97j849k0486k1618
$$ 462416 447198 469132 456088 451468 492562 500039 488021 484651 503851 504348 502499 482013 460395
9437D60395L1239O519J102O718k440j3399K465K4638k863j7386P520J8178k394
$$ 460395 491634 498153 499255 505973 503533 490134 492599 517237 514374 496988 504508 522686 520292
9424E20292n981k604k2860L094M8251M0918K3256O601M790J7088j0364m833K5673
$$ 520292 514311 511707 488847 491941 540192 581110 604366 610967 615757 632845 622481 617648 643321
9411F43321P728R582r75J147O05J9827J449j019q762k2120j5220L7889J0581k4708
$$ 643321 651049 660631 659656 660803 661408 681235 682684 681665 672903 650783 635563 673452 684033 659325
9397F59325r919J411J7975P244J9423M422J0474L1909L7592J5463J5065K794j4497
$$ 659325 649406 650817 668792 676036 695459 699881 710355 742264 779856 795319 810384 813178 798681
9384G98681J706K443k1849J4146Q344j6811L103J3611J1002m079J267K1830n197
$$ 798681 800387 802830 780981 795127 803471 786660 789763 803374 814376 810297 811564 833394 828197
9371H28197N696K984n732J4707J7095J8979K2490k6538k1089K836J1527L4926
$$ 828197 833893 836877 831145 845852 862947 881926 904416 877878 856789 859625 871152 906078
9359I06078O771j3274l774J2833K6218q55K064J7851M856J9924J8986q929n843
$$ 906078 912849 899575 895801 908634 934852 933997 936061 953912 958768 978692 997678 988749 982906
9346I82906m498J8729J5043J1599N253k7696J2166J3208K7014M0885O184j6120
$$ 982906 978408 997137 1012180 1023779 1029032 1001336 1013502 1026710 1053724 1094609 1100793 1084673
9334A084673J643L6026O369r39N916K2468o447P461q42J1452K5861J5802K2019
$$ 1084673 1086316 1122342 1128711 1127772 1133688 1156156 1149709 1157170 1156328 1167780 1193641 1209443 1231462
9321A231462m2591j022L4685J2771P266K2531J5142K1748P611P938n665R425M3710
$$ 1231462 1188871 1187849 1222534 1235305 1242571 1265102 1280244 1301992 1309603 1317541 1311876 1321301 1365011
9308A365011J7051M283L430L8848K7357L7358J9430m807P187J1462O803O460j0185
$$ 1365011 1382062 1386345 1389775 1428623 1455980 1493338 1512768 1507961 1515148 1526610 1533413 1539873 1529688
9295A529688P383J3573K3220M7718M0868L8492R461J3814R581K8753L4239O6127
$$ 1529688 1537071 1550644 1573864 1621582 1662450 1700942 1710403 1724217 1733798 1762551 1796790 1862917
9283A862917K4666J873L0737M8179J1899J1708m42R655K8768L2616O7021M8275
$$ 1862917 1887583 1889456 1920193 1968372 1980271 1991979 1991537 2001192 2029960 2062576 2129597 2177872
9271B177872J4026n530K9111M4583N3751K3014m616J1398M9521N9279J9567L6771
$$ 2177872 2191898 2186368 2215479 2260062 2313813 2336827 2332211 2343609 2393130 2452409 2471976 2508747
9259B508747L0820M1001P2863M1407L5589K2815O0696L9787K0492K9205L3929
$$ 2508747 2539567 2580568 2653431 2694838 2730427 2753242 2813938 2853725 2874217 2903422 2937351
9248B937351O6015M1120L3208N5004O6571N2610O1044N6851N9453P4114M6349
$$ 2937351 3003366 3044486 3077694 3132698 3199269 3251879 3312923 3369774 3429227 3503341 3549690
9237C549690M0285N0050O1108O2546O7012O5498O3663P4448Q1009R2123Q2611
$$ 3549690 3589975 3640025 3701133 3763679 3830691 3896189 3959852 4034300 4115309 4207432 4290043
9226D290043P8576O5567N6703P1677J19433J07723R8459J16606J05474P5026J04308
$$ 4290043 4368619 4434186 4490889 4562566 4681999 4789722 4888181 5004787 5110261 5185287 5289595
9215E289595J21645R9076J14491J32477J37704J29993J07521J00530J32113J57115
$$ 5289595 5411240 5510316 5624807 5757284 5894988 6024981 6132502 6233032 6365145 6522260
9205F522260J91853J58230J78462J82762J59213K07119K20969J92969K09471K18707
$$ 6522260 6714113 6872343 7050805 7233567 7392780 7599899 7820868 8013837 8223308 8442015
9195H442015K51904K53868K46370K85692K50058K84370L09604L05985K96958K96844
$$ 8442015 8693919 8947787 9194157 9479849 9729907 10014277 10323881 10629866 10926824 11223668
9185A1223668L17962L56838L98001M11702M06867M30048M43508M84409M94474
$$ 11223668 11541630 11898468 12296469 12708171 13115038 13545086 13988594 14473003 14967477
9176A4967477N22000N53749N58584N89533O04499O38176O81799P13396P62263
$$ 14967477 15489477 16043226 16601810 17191343 17795842 18434018 19115817 19829213 20591476
9167B0591476Q25221Q71196Q93071R39819R56242J019918J109394J128333J191944
$$ 20591476 21416697 22287893 23180964 24120783 25077025 26096943 27206337 28334670 29526614
9158B9526614J237102J298650J394401J483275J532279J598862J653860J684153
$$ 29526614 30763716 32062366 33456767 34940042 36472321 38071183 39725043 41409196
9150D1409196J755872J835148J884409J948460J970056J972991J995098K034368
$$ 41409196 43165068 45000216 46884625 48833085 50803141 52776132 54771230 56805598
9142E6805598K003101J923952J847627J835060J718866J555231J403301J242006
$$ 56805598 58808699 60732651 62580278 64415338 66134204 67689435 69092736 70334742
9134G0334742J008756P45953N48783K90168K6857k66552n04023p35693r08079
$$ 70334742 71343498 72089451 72638234 72928402 72955259 72688707 72184684 71448991 70540912
9125G0540912j095451j298609j501602j592563j689202j791573j869993j882755
$$ 70540912 69445461 68146852 66645250 65052687 63363485 61571912 59701919 57819164
9117E7819164j930112j949026j919848j860801j841592j829077j800811j699893
$$ 57819164 55889052 53940026 52020178 50159377 48317785 46488708 44687897 42988004
9109D2988004j689884j598618j550244j488818j430309j367916j288529j209895
$$ 42988004 41298120 39699502 38149258 36660440 35230131 33862215 32573686 31363791
9101C1363791j166198j132452j096897j075320r79277r37280r04892q86088q33467
$$ 31363791 30197593 29065141 27968244 26892924 25913647 24976367 24071475 23185387 22351920
9092B2351920p90531p38219o85894o59992o65531o30128n97366n71344n46131
$$ 22351920 21561389 20823170 20137276 19477284 18811753 18181625 17584259 17012915 16466784
9083A6466784n34499n07085m57828m36889m59646m31508m30811m12119l39974
$$ 16466784 15932285 15425200 14967372 14530483 14070837 13639329 13208518 12796399 12456425
9074A2456425l26737l29272l13336l00096l30072k96039k92573k54261k63451
$$ 12456425 12129688 11800416 11487080 11186984 10856912 10560873 10268300 10014039 9750588
9065I750588k30287k00876k26492k24443j92316j81493j50772j47264j56678j71862
$$ 9750588 9520301 9319425 9092933 8868490 8676174 8494681 8343909 8196645 8039967 7868105
9055G868105j35919j68820j94983k01257j98890j93868j99424j59471j45577j41107
$$ 7868105 7732186 7563366 7368383 7167126 6968236 6774368 6574944 6415473 6269896 6128789
9045F128789j47987j58392j18206j12325j28625q9090j38396j19435j17006q5657
$$ 6128789 5980802 5822410 5704204 5591879 5463254 5374164 5235768 5116333 4999327 4913670
9035D913670n6397j08011j09153r0632p7383r9354j04770p2292n6861n7477o7632
$$ 4913670 4857273 4749262 4640109 4549477 4472094 4372740 4267970 4195678 4138817 4081340 4013708
9024D013708p5643r6861p3235l1186m9255q7398p3594m9186p7296n0379k2615
$$ 4013708 3938065 3841204 3767969 3736783 3687528 3600130 3526536 3477350 3400054 3349675 3327060
9013C327060j8522l2693m6242p9598m5101k7183k2317k7381p4302r0289o2384
$$ 3327060 3308538 3275845 3229603 3150005 3104904 3077721 3055404 3028023 2953721 2863432 2801048
9002B801048l8240n9474o7772k3518k5051m1826m7887l2079m2574l6894m3610
$$ 2801048 2762808 2703334 2635562 2612044 2586993 2545167 2497280 2465201 2422627 2385733 2342123
8991B342123n9883k9603l4424j6752l2681l2032j0585k8977j2876n3767n2137
$$ 2342123 2282240 2252637 2218213 2201461 2168780 2136748 2126163 2097186 2084310 2030543 1978406
8980A978406J2918l463j2245m3604m2441k8094m027j8703n2410m3689k0337j1481
$$ 1978406 1991324 1987861 1975616 1932012 1889571 1861477 1857450 1838747 1786337 1742648 1722311 1710830
8968A710830l6152l1681L783k2453j4335l0132j9385l671j3616m6042l659j0919
$$ 1710830 1674678 1642997 1646780 1624327 1609992 1579860 1560475 1556804 1543188 1497146 1493487 1482568
8956A482568k3333m2873l2913l281j6097l5434k1329j3625j1362l5213k4590l4389
$$ 1482568 1459235 1416362 1383449 1380168 1364071 1328637 1307308 1293683 1282321 1247108 1222518 1188129
8944A188129q324l1292J66J6635n692R62j1683j3318L097n4086l4831J8977O720
$$ 1188129 1179805 1148513 1148679 1165314 1159622 1160584 1148901 1135583 1138680 1084594 1049763 1068740 1075460
8931A075460l8170l508n136R834L2530l5400l9388r822J0229n381o4058j7153
$$ 1075460 1037290 1033782 1028646 1038480 1071010 1035610 996222 986400 996629 991248 927190 910037
8919I10037j559l3715K651O276J2008K9491j6460l5956j0020k2328q344K1798
$$ 910037 908478 874763 877414 883690 895698 925189 908729 872773 862753 840425 832081 853879
8907H53879J0313n746o3212k7167n374J2250K0118N63j8531j8995l8761j9171
$$ 853879 864192 858446 795234 768067 762693 774943 795061 795624 777093 758098 719337 700166
8895G00166J3891M77P031J7347j7212m0499q101J9770j9468k7565J6854K5346
$$ 700166 714057 714534 721565 738912 721700 681201 673100 692870 673402 645837 662691 688037
8883F88037J6675j9143M061J5422k0766k7848l5186m570J3279p56j8850K2262
$$ 688037 704712 685569 689630 705052 684286 656438 621252 616682 629961 629205 610355 632617
8871F32617L5257J6635J6707K2425J8249J3324M8336m379N535N577p054l7740
$$ 632617 667874 684509 701216 723641 741890 755214 803550 799171 804706 810283 803229 765489
8859G65489k6846j3587P496M0779M9651R1669R8282P1079K7294l5112q0237j13590
$$ 765489 738643 725056 732552 773331 822982 914651 1012933 1084012 1111306 1076194 995957 882367
8847H82367r1930o3154n8194l9624l1627j2796j4361l0485q993J6756k757j5299
$$ 882367 790437 727283 669089 629465 597838 585042 570681 540196 531203 547959 545202 529903
8835E29903j3870n339L452j6089n942L823n783j4180n955K823j1410j551r34j9377
$$ 529903 516033 510694 514146 498057 492115 495938 490155 475975 470020 472843 461433 459882 458948 439571
8821D39571l209O178k9052J0360K507q915q278j1579K0993L3382N761k5026j1302
$$ 439571 436362 442540 413488 423848 426355 417440 409162 397583 418576 451958 457719 432693 421391
8808D21391J3442J9883J0106J3071j6279J291j4456k9708l299N325r680j3450
$$ 421391 434833 454716 464822 477893 461614 462905 448449 418741 415442 420767 411087 397637
8796C97637q704K6988J0163m1854n4917k8238Q532J1973o143m0711j40J2560M4966
$$ 397637 388933 415921 426084 384230 329313 301075 309607 321580 315437 274726 274586 287146 332112
8783C32112J9532R654k485k4976k1853J7349M993N444j5194r407r89J0408j372
$$ 332112 351644 361298 358813 333837 311984 329333 334326 339770 324576 315169 314180 324588 323216
8770C23216l8728q411J7954L4064n899r972M287J099k489m580m881m176p828P030
$$ 323216 284488 276077 294031 328095 322196 312224 316511 317610 315121 310541 305660 301484 293656 300686
8756C00686L507R695J4357J4870N162m3733l8578K996J7112J1156j4286L0239
$$ 300686 304193 313888 328245 343115 348277 304544 265966 268962 286074 297230 282944 313183
8744C13183K1738n274j2102j4340m750Q863J3952K1976P729q759j7433j6417Q975
$$ 313183 334921 329647 317545 303205 298455 307318 321270 343246 350975 342216 324783 308366 317341
8731C17341j5337J349R343j3635j5151q921O175l718j3860J5122K0488k7620j0224
$$ 317341 302004 303353 312696 299061 283910 274989 281164 277446 263586 278708 299196 271576 261352
8718B61352J9965J5615o942j3266K7653K9913J1789o550k115k720j0482k0599
$$ 261352 281317 296932 289990 276724 304377 334290 346079 339529 337414 334694 324212 303613
8706C03613l4110J218J1086J0949n635K372l050j0472J6531j0924J0581M0848
$$ 303613 269503 270721 281807 292756 287121 289493 286443 275971 292502 281578 292159 333007
8694C33007J0474J5890j8058l243J8204k8864k5312J3913N378l983r181Q035P825
$$ 333007 343481 359371 341313 338070 356274 327410 302098 316011 321389 317406 308225 316260 324085
8681C24085J8674k507j483j5592k7473j6731j521L6682J2953n089K1782M6490
$$ 324085 342759 340252 338769 323177 295704 278973 277452 314134 327087 321998 343780 390270
8669C90270j9774K1414J3002r424K0257J7941j9920J3553J7280m526k3162p486
$$ 390270 370496 391910 404912 395488 415745 433686 413766 427319 444599 440073 416911 409425
8657D09425l945j6647L467J7664k9141k355n489l344l209J3549J7423J2267L7446
$$ 409425 405480 388833 392300 409964 380823 378468 372979 369635 366426 379975 397398 409665 447111
8644D47111R359q489j2963j9082M369M3855J6376M125L188K6823K2653j0332j1309
$$ 447111 456470 447981 435018 415936 420305 464160 480536 484661 487849 514672 537325 526993 515684
8631E15684j8417j5742k4204m0228l720J1248J5994q05k3265j0092O649K959k415
$$ 515684 497267 481525 457321 417093 413373 424621 440615 439810 416545 406453 413102 416061 413646
8618D13646K6320N4095k365j7115J6145J9282m1j5145R743K8664N3171N2310N1459
$$ 413646 439966 494061 491696 474581 490726 510008 509967 494822 504565 533229 586400 638710 690169
8605F90169L6111R107o830O2343P7856N8973O8441Q1673N8430Q5473Q4660J05118
$$ 690169 726280 735387 728557 790900 868756 927729 996170 1077843 1136273 1221746 1306406 1411524
8593A411524J30535J19715R0261J02185Q5048m775n6425n3335n5077m7923r8478
$$ 1411524 1542059 1661774 1752035 1854220 1939268 1934493 1878068 1824733 1769656 1721733 1623255
8582A623255j25397j18861j10770j15268j10375q5873q0275o6603m8703m3430
$$ 1623255 1497858 1378997 1268227 1152959 1042584 956711 876436 809833 761130 717700
8572G17700l6476l2370n6864l7352k893j2640n6664p071k0319j9201k1736j4378
$$ 717700 681224 648854 591990 554638 551745 539105 482441 475370 455051 435850 414114 399736
8560C99736J6917J4420J481k0249l8539l3314l101P057Q694k0014K0194J7936
$$ 399736 416653 431073 432554 412305 373766 340452 337351 344408 353102 333088 353282 371218
8548C71218K734J3614R9k5395j1654J2180K3110j500j5606k6780j3259l1222j9925
$$ 371218 373952 387566 387665 362270 350616 362796 385906 384406 368800 342020 328761 297539 277614
8535B77614l5519j366L1959R987j3156j4004k3088k0799J881K601J4875K2475
$$ 277614 242095 240729 272688 282675 269519 255515 232427 211628 213509 216110 230985 253460
8523B53460L258l795J8069J339k9056J0051K3230R655j5062m1193k9455Q014O8612
$$ 253460 256718 252923 270992 272331 243275 253326 276556 286211 271149 229956 200501 208515 277127
8510B77127J6731r998l3398l1287J5395J705p564P719J2537J5148j2804L364j9926
$$ 277127 293858 283860 250462 219175 234570 236275 228711 236430 248967 264115 251311 254675 234749
8497B34749j0456q86j0743l1782k7194R75L2627L7377l51j758P990O62j3075j0583
$$ 234749 224293 223407 212664 180882 153688 154663 187290 224667 224316 222558 230548 231210 218135 207552
8483B07552K162k068Q056j690k7577k0164K3506J9459p532P872J1024M707k335
$$ 207552 209714 207646 215702 214012 186435 166271 189777 209236 201704 209576 220600 225307 222972
8470B22972j8149J7344M9577O9386P6002Q2675Q8695N5487O8407M3018J3533p0237
$$ 222972 204823 222167 271744 341130 417132 499807 588502 643989 712396 755414 768947 698710
8458F98710p9810p1424j13412q4618k8352j5154m2390l2058j3823K561r345o197
$$ 698710 618900 547476 434064 349446 321094 305940 263550 231492 217669 220230 210885 204688
8446B04688J482K865K3442J2011N58K7546r161P521L370J5428N5759M3093J8091
$$ 204688 206170 209035 232477 244488 245046 272592 263431 270952 274322 289750 345509 388602 406693
8433D06693N1151M1662n356l4009m7237n2021p875K0569Q79j216Q402P8678R7353
$$ 406693 457844 499506 494150 460141 412904 360883 353008 373577 374456 373240 381642 460320 557673
8420E57673J41351K04507K03013J50463Q6813k0634j68422k39782j98346r2865
$$ 557673 699024 903531 1106544 1257007 1343820 1323186 1154764 914982 716636 623771
8410F23771p2817o9360o6768m4734l7143p073J8133j9654j2989j2859J9159M271
$$ 623771 550954 481594 414826 370092 332949 325876 344009 324355 311366 298507 317666 321937
8398C21937k430j829L4275N1077M9374K7342K0484J497j6776m8889k1710l5126
$$ 321937 319507 317678 351953 403030 452404 479746 500230 501727 484951 436062 414352 379226
8386C79226l7509k0967j8824p283M3544L1276J9587r107L0564L7641M4764R8994
$$ 379226 341717 320750 301926 294643 338187 369463 389050 379943 410507 448148 492912 591906
8374E91906R4941J21759J33193J29674J16131Q0470Q2178J79080L16325M75298
$$ 591906 686847 808606 941799 1071473 1187604 1268074 1350252 1529332 1845657 2320955
8364B320955M69306L69248J79146j23838m31398n54471m76041l50013k69314j87840
$$ 2320955 2790261 3159509 3338655 3214817 2783419 2228948 1752907 1402894 1133580 945740
8354I45740j37126j01515n3863n3305m6346m3095m5085l9001l9173j3597m684
$$ 945740 808614 707099 653236 599931 553585 510490 465405 426404 387231 373634 368950
8343C68950k247R093K0156J1522O901K521L0392K2847K2577L0359J6170K9999
$$ 368950 366703 375796 395952 407474 414375 416896 447288 470135 492712 523071 539241 569240
8331E69240P9159J13305J63114K08966K99097M35443N01340M45049K85458L5272
$$ 569240 648399 761704 924818 1133784 1432881 1868324 2369664 2814713 3100171 3135443
8321C135443k87042n25338n11534m04984k99525k05763j54962j09329r2338o1176
$$ 3135443 2848401 2323063 1811529 1406545 1107020 901257 746295 636966 544628 483452
8311D83452n9233m3766m4903m3691l467O704J8575L743k5631k2214l1395k8613
$$ 483452 424219 380453 335550 291859 288392 295096 313671 317414 291783 269569 238174 209561
8299B09561k692p995k8703Q161N985n826N500k4952j8290K3393K2335m0119j3067
$$ 209561 206869 198874 170171 178332 184317 178491 183991 159039 140749 164142 186477 146358 133291
8286A33291k0559Q615L6554L300k4467k7731k1578J2067k67j345J6236J2316J8552
$$ 133291 112732 121347 157901 161201 136734 109003 87425 99492 99225 97880 114116 126432 144984
8273A44984n463j6915k4597n906K3026J3598k035M04j7108j7621q480l888R286
$$ 144984 139521 122606 98009 92103 115129 128727 126692 127096 109988 92367 83887 79999 89285
8260H9285q413j3533J3310Q161k807q14J1697K9517o483k0833o375j2956J9102
$$ 89285 80872 67339 80649 88810 86003 85189 96886 126403 119920 99087 92712 79756 98858
8247I8858J2252J038K069n337j3289k490k9076m543Q753Q827L2624M6022J2857
$$ 98858 111110 112148 114217 108880 95591 93101 64025 59482 68235 77062 109686 155708 168565
8234A68565j56k3490l9511k3034L643p525N867J26j0874k3010J0821L0779K0729
$$ 168565 168409 144919 105408 82374 86017 78492 84359 84485 73611 50601 61422 92201 112930
8221A12930K532J664j6226O094r211J2809J7096M195l4822k1633l0839O569K0717
$$ 112930 115462 117126 100900 106994 97783 110592 127688 131883 97061 75428 44589 51158 71875
8208G1875P703k2925k3877J5282Q850J89Q802n550K6220K1012m237j6211k8024
$$ 71875 79578 56653 32776 48058 56908 57097 65899 60349 86569 107581 103344 87133 59109
8195E9109J2019r24j1563J0545L2369O254j1934J0901j2531j4760l485l128n307
$$ 59109 71128 70204 58641 69186 101555 107809 95875 106776 94245 79485 76000 72872 67565
8182F7565p828P39n94l62n256k1537j4401Q92M128j9886J3443K3788J8592l956
$$ 67565 59737 60476 59882 59520 54264 32727 18326 19218 23346 3460 16903 40691 59283 55327
8168E5327l205J6216n908o186J0311Q330m01J649k781J718m797K4608K2023R947
$$ 55327 52122 68338 62430 56244 66555 74885 74484 76133 73352 75070 70273 94881 116904 126851
8154A26851J278k1380k6458m0129j6239J2027K7147K8720Q377J8299R372J985
$$ 126851 128129 106749 80291 40162 23923 35950 63097 91817 100194 118493 127865 129850
8142A29850k698K745k1184j6616J0638k3545k610k3099o066k1471j0435K1761
$$ 129850 127152 129897 108713 92097 102735 79190 76580 53481 47415 25944 15509 37270
8130C7270J1374j156J9133Q266j5405O309J0881J5979N403k4902l3386j1871Q745
$$ 37270 48644 47488 66621 74887 59482 65791 76672 92651 98054 73152 39766 27895 36640
8117C6640J3368K6508K9744j1612j8199J0626Q774K5130K4443J1068k0153M098
$$ 36640 50008 76516 106260 94648 76449 87075 95849 120979 145422 156490 136337 140435
8105A40435l113o39q10j1782k0547k100m232Q286l2547l1956R407M571Q198J2610
$$ 140435 137322 136683 135873 124091 103544 101444 97212 105498 72951 40995 50402 54973 63171 75781
8091G5781j6088n361N746J1361J2572K2802k7569k618J3292M520j1105P315m728
$$ 75781 59693 54332 60078 71439 84011 106813 79244 76626 89918 94438 83333 90648 85920
8078H5920Q186J3829R014O173k2094j6414J8461r982J6616L432m228N08J2199
$$ 85920 94106 107935 116949 123122 101028 84614 103075 93093 109709 113141 108913 109421 121620
8065A21620J1098J5305K640J5422j2821K831Q25J2790k6408m4967k5002L0656
$$ 121620 132718 148023 150663 166085 153264 156095 156920 169710 143302 98335 73333 103989
8053A03989L2581N915R505P058l251k3153k9551J2708M2499K2974L985k1312n462
$$ 103989 136570 142485 151990 159048 155797 132644 103093 115801 158300 181274 185259 163947 158485
8040A58485j0570P371M7400M3520J1105j2387l2575K8578M8907q254M74j5660
$$ 158485 147915 155286 202686 246206 257311 244924 212349 240927 289834 281580 282054 266394
8028B66394j4807M635J4318J3715r154O57k0105q348R143J3047N128J0599j6250
$$ 266394 251587 256222 270540 284255 275101 275758 255653 247305 256448 269495 274623 285222 268972
8015B68972k2432m166q977j7180J3507J4651r572q583J9337J5123j2496n372K5253
$$ 268972 246540 242374 233397 216217 229724 244375 234803 226220 245557 260680 248184 242812 268065
8002B68065J5296J0365J9637J4702K4785K1636K2700L7173L9855J5646J123M8310
$$ 268065 283361 293726 313363 328065 352850 374486 397186 434359 474214 489860 490983 539293
7990E39293L6686J2155q920o5715k1555R704R324J0069j1897j5317m5942l8885
$$ 539293 575979 588134 579214 513499 491944 501648 510972 521041 509144 493827 447885 409000
7978D09000k9459k8110p815m6382J8866L5126j3447M25J3549j7237j4389N291
$$ 409000 379541 351431 343616 297234 316100 351226 337779 338204 351753 334516 320127 325418
7966C25418O53J1890J0791k047O401l3056k49J8537M8953p97k7731K0349L9453
$$ 325418 326071 337961 348752 346705 353106 320050 319801 338338 387291 386494 358763 379112 418565
7953D18565L0150L4169K7070J1118J1509K3629k1286j5627J7962J6091k4868o6131
$$ 418565 448715 482884 509954 521072 532581 556210 534924 519297 537259 553350 528482 462351
7941D62351m3089j6844K2085P627j6870k0692k8223l7622l1134p063n47K0487
$$ 462351 419262 402418 424503 432130 415260 394568 366345 328723 297589 290526 289979 310466
7929C10466j1704m2467j3459J8414N74k5560J5166r25k1993Q92J7923K4095k092
$$ 310466 298762 256295 242836 261250 261824 236264 251430 250505 228512 229404 247327 271422 269330
7916B69330k6943l221J6488J1853L2171M217R320k659R933j6343k5001o772p46
$$ 269330 242387 239166 255654 267507 299678 303895 313215 310556 320489 304146 279145 272373 271627
7903B71627k6r180k3019K712o792r99p160k4345k2460k6049N642K0335K0767n737
$$ 271627 271601 262421 239402 242114 235322 234323 227163 202818 180358 154309 159951 180286 201053 195316
7889A95316j4581O220K1113N583j3667k2266k2435j4301L874l385N634r692j3419
$$ 195316 180735 186955 208068 213651 199984 177718 155283 140982 144856 141471 147105 137413 123994
7876A23994l528J2204q036m620j8906J2584o491j1470k5070j340J3097K660m54
$$ 123994 120466 132670 124634 120014 101108 113692 107201 95731 70661 69321 82418 85078 84624
7863H4624o73j874L469q949k116L5582J0170n123m0803j8411K497q547R702J6585
$$ 84624 83951 82077 85546 76597 74481 110063 120233 115110 74307 55896 58393 49846 59548 76133
7849G6133K528L8367K774j7353L421Q025l6196j7429j5518J0901j754j4934J3361
$$ 76133 78661 117028 119802 102449 105870 113895 77699 60270 44752 55653 53899 38965 52326
7836E2326K1843j4822l0800j7058R743p700J1331q790J3284J992l1413l5817J8760
$$ 52326 74169 59347 28547 11489 21232 13532 24863 16073 29357 31349 -64 -35881 -17121
7823a7121K0998q545J6784K4741j688j5794K5572J2930J9399l994J1030L343j0606
$$ -17121 3877 -4668 12116 36857 35169 19375 44947 57877 77276 73282 84312 87655 77049
7810G7049j8967r717n3593K724J8522j8605j1648m703J6672l1794k7038J3449
$$ 77049 58082 48365 -5228 -2504 16018 -2587 -14235 -18938 -2266 -34060 -61098 -47649
7798d7649k278M0805L1238K3088m608k6576j5050o280L105J0173m122K4458j690
$$ -47649 -49927 -9122 22116 45204 40596 14020 -1030 -7310 -4205 5968 1846 26304 24614
7785B4614l916J3434j3074Q238j226r812k1585J587l656M012L789j415J7336K9992
$$ 24614 20698 34132 21058 29296 28070 18258 -3327 -1740 -5396 -1384 2405 990 18326 48318
7771D8318m555j3097J2818k7637j4210q602q321Q185p293q106L472n812J5409
$$ 48318 43763 30666 43484 15847 1637 -6965 -15286 -7101 -14394 -22500 -19028 -24840 -9431
7758i431J1514l719o838J6391K2706o931j1616j1409P972q839j7024J5083Q146
$$ -9431 2083 -1636 -8474 7917 30623 23692 12076 667 8639 -200 -17224 -2141 6005
7745F005P272j5696j3220k8714J5540L1497L958O110M755j1940n945J1495k0617
$$ 6005 13277 -2419 -15639 -44353 -28813 2684 6642 12752 17507 5567 -378 11117 -9500
7732i500p883j9441L000J6813K0325O597k1127K3527K970j0547J029J8064j9031
$$ -9500 -17383 -36824 -33824 -17011 3314 9911 -11216 12311 15281 4734 5763 23827 4796
7719D796j6000j4619m081J096L396J9474J2217P417j1587j5941R514J9001K0921
$$ 4796 -11204 -25823 -29904 -28808 -25412 -5938 6279 13696 2109 -13832 -4318 14683 35604
7706C5604J0293l708k0439j1618P346r535P71p211o962k1o308j0872J9677L076
$$ 35604 45897 42189 21750 10132 17478 7943 8714 1503 -5459 -5480 -11788 -22660 -2983 93
7692I3O832j1649L169P825N432L177j3742L995q500k4386J3317K8664P730J2148
$$ 93 6925 -4724 -1555 6270 11702 14879 1137 5132 -3368 -27754 -14437 14227 21957 34105
7678C4105n847k5010J3026J677j2178l2913o880J104R320L837j7709q545q452
$$ 34105 28258 3248 16274 17951 5773 -27140 -34020 -32916 -23596 -19759 -37468 -46013 -54465
7665e4465L4978J2760P270k392m259k947J3098N687j148j1566l140K4214j6900
$$ -54465 -19487 -6727 543 -1849 -6108 -9055 4043 9730 8582 -2984 -6124 18090 1190
7652A190r420q470L87M709j5497P893M2458R58l1567R091J1918j5380l5877J4820
$$ 1190 -8230 -16700 -16313 -11604 -27101 -19208 23250 24208 -7359 1732 13650 -1730 -37607 -22787
7638b2787J8820r086J2673k660l9479O931J9352j3402L780K76J6094R579J998
$$ -22787 -3967 -13053 -380 -3040 -42519 -35588 -16236 -29638 -25858 -25582 -9488 91 2089
7625B089j6878n122j992J1367J2909M559k07j6933k180K4891J9622O230j3037
$$ 2089 -14789 -19911 -21903 -10536 2373 6932 6725 -10208 -12388 12503 32125 38355 25318
7612B5318l103j1026r153k0924K1930J5330J0925j8827k3637K586k3725j2740
$$ 25318 22215 11189 2036 -18888 3042 18372 29297 10470 -13167 -10581 -34306 -47046
7600d7046j0166K561K986J0317J2117j145J211J5596K1724J2172q389k882j2806
$$ -47046 -57212 -54651 -51665 -41348 -29231 -30376 -29165 -13569 8155 20327 11938 9056 -3750
7587c750r512k2228j0976P742K1854j0750l365k0505k4674J0467K8126J9052J0937
$$ -3750 -13262 -35490 -46466 -38724 -16870 -27620 -30985 -51490 -76164 -65697 -37571 -18519 -7582
7574g582Q585o81k1058K261J7914K1218P359j1028q618Q650p031m5402j0673K5455
$$ -7582 1003 322 -20736 -18475 -561 20657 28016 16988 8370 17020 9989 -35413 -46086 -20631
7560b0631J0049k0485N013K711j6345J4264j1252k0181Q044J3180k737N452k0574
$$ -20631 -10582 -31067 -26054 -23343 -39688 -25424 -36676 -56857 -48813 -35633 -38370 -32918 -53492
7547e3492o692J7198J987k22k4672J225j435j2057J8258K5447j656p620k049o451
$$ -53492 -60184 -42986 -40999 -41221 -65893 -64668 -66103 -78160 -59902 -34455 -36111 -43731 -45780 -52231
7533e2231r912J3215R642J5601j709j1900J3056m971L5541J9409k5778j8979o819
$$ -52231 -62143 -48928 -39286 -23685 -25394 -37294 -24238 -29209 6332 25741 -37 -19016 -25835
7520b5835r301J7479J8049M893M72J580O581j2710o303n520j7968J2821j9373
$$ -25835 -35136 -17657 392 5285 5757 7337 13918 1208 -5095 -10615 -28583 -15762 -35135
7507c5135k2136J1139Q554J9055K9597K023N159N409Q862l620m171j4033j8168
$$ -35135 -57271 -46132 -37578 -18523 11074 13097 18256 23665 32527 28907 24736 10703 -7465
7494g465K2392J003k8961n8366j4210J5293K1794Q701M234J0606N04j1267q340
$$ -7465 14927 15930 -13031 -71397 -85607 -70314 -48520 -39819 -35585 -24979 -24475 -35742 -44082
7481d4082M002K1288K672J153O558J3919k8376m071L457J252j647k5081N773K3158
$$ -44082 -40080 -18792 -16120 -14967 -8409 5510 -22866 -26937 -23480 -22228 -23875 -48956 -43183 -20025
7467b0025J8533J1158j6737k3552k3426L6963J7513Q874j6939o151n34j3946P139
$$ -20025 -1492 9666 -7071 -30623 -54049 -17086 427 9301 -7638 -13789 -14323 -28269 -21130
7454b1130M927l69N471j6132j7913j0168j339J8479Q518J6860l7062l513K730
$$ -21130 -16203 -16572 -11101 -27233 -45146 -55314 -56653 -38174 -29656 -12796 -49858 -53371 -50641
7441e0641K6015J4089L751J8351k64p142k6158M474j9883j1013J0147o991J5659
$$ -50641 -24626 -10537 -6786 11565 11301 4159 -21999 -17525 -37408 -48421 -38274 -45265 -29606
7428b9606L014L1153J9334O711k2753l0090j180p811m2028p008K151N316r183
$$ -29606 -26592 4561 23895 30606 7853 -22237 -23417 -31228 -73256 -80264 -78113 -72797 -81980
7415h1980K8122K2410j7395k1271q239k401J4664R12J3786J9178M593j5836J0373
$$ -81980 -53858 -31448 -48843 -70114 -78353 -80754 -66090 -65178 -51392 -32214 -27621 -43457 -33084
7402c3084n58l904j4471J7128K8017K3733j2451o195j5020K4391L71k7584l4404
$$ -33084 -33642 -37546 -52017 -34889 -6872 16861 4410 -1785 -16805 7586 7957 -19627 -54031
7389e4031J8669K2701K2716M64K4507M79j0248J830l8267K653k7936k0791j64
$$ -54031 -35362 -12661 10055 10519 35026 35505 25257 27087 -11180 -8527 -36463 -57254 -57418
7376e7418R580P983M3597J9576N001k5284k1381K0200K3047k0888K2459P682k4660
$$ -57418 -47838 -39855 3742 23318 28319 3035 -18346 1854 24901 4013 26472 34154 9494
$$ [...]
##END NTUPLES=NMR SPECTRUM
##END=
