##TITLE=Analysis number 323025
Compound Code cc 58926
Book Reference 494/64
Project Code adrs
Chemist Name craigr
##JCAMPDX= 6.0         $$ Bruker NMR JCAMP-DX V2.0
##DATA TYPE= NMR SPECTRUM
##DATA CLASS= NTUPLES
##ORIGIN= Bruker BioSpin GmbH
##OWNER= nmr
$$ XWIN-NMR		Version 3.5
$$ Mon Oct 16 20:39:53 2006 GMT Daylight Time (UT+1h)  MAYBRIDGE\nmr@NMR_250MHZ
##.OBSERVE FREQUENCY= 250.131544655141
##.OBSERVE NUCLEUS= ^1H
##.ACQUISITION MODE= SIMULTANEOUS (DQD)
##.ACQUISITION SCHEME= undefined
##.AVERAGES= 16
##.DIGITISER RES= 18
##SPECTROMETER/DATA SYSTEM= dpx250
##.PULSE SEQUENCE= zg30
##.SOLVENT NAME= CDCl3
##.SHIFT REFERENCE= (INTERNAL, CDCl3, 0, 16.522)
##AUDIT TRAIL= $$ (NUMBER, WHEN, WHO, WHERE, WHAT)
$$ ##TITLE= Audit trail, XWIN-NMR		Version 3.5
$$ ##JCAMPDX= 5.01
$$ ##ORIGIN= Bruker BioSpin GmbH
$$ ##OWNER= nmr
$$ C:\u/data/dgb/nmr/ADRS/650/pdata/1/auditp.txt
$$ ##AUDIT TRAIL=  $$ (NUMBER, WHEN, WHO, WHERE, WHAT)
(   1,<2006-10-16 20:39:07.11 +100>,<MAYBRIDGE\nmr>,<NMR_250MHZ>,
      <created by zg, POWCHK disabled, PULCHK disabled
       configuration hash MD5:
       49 4B E0 1D 92 C2 6B 37 9F E6 65 BC 52 41 86 1D
       data hash MD5: 64K
       1B BF 7B 0F D8 97 DC F0 51 D6 58 97 22 7E 25 89>)
(   2,<2006-10-16 20:39:22.27 +100>,<MAYBRIDGE\nmr>,<NMR_250MHZ>,
      <Start of raw data processing
       ef LB = 0.3 FT_mod = 6 PKNL = 1 SI = 32K 
       data hash MD5: 32K
       56 AC C8 E8 05 F7 2D 80 3A 50 B3 C4 C8 73 6E 63>)
(   3,<2006-10-16 20:39:26.63 +100>,<MAYBRIDGE\nmr>,<NMR_250MHZ>,
      <apk 
       data hash MD5: 32K
       74 15 29 AC 21 E2 0B 06 C3 E1 5E 2A 84 24 1C 9F>)
(   4,<2006-10-16 20:39:28.39 +100>,<MAYBRIDGE\nmr>,<NMR_250MHZ>,
      <abs ABSG = 5 
       data hash MD5: 32K
       80 D3 51 F0 B7 8E 61 AD 22 3F AC 4B 98 AE C1 81>)
$$ ##END=
$$ 
$$ hash MD5
$$ 93 6E C1 D5 40 8E 34 F7 24 8B 22 BB FA FD 95 3F
##$RELAX= 
##$RELAX= 
##$RELAX= 
##$RELAX= 
##$RELAX= 
##$RELAX= 
##$RELAX= 
$$ Bruker specific parameters
$$ --------------------------
##$DU= <C:\u>
##$EXPNO= 650
##$NAME= <ADRS>
##$PROCNO= 1
##$TYPE= <nmr>
##$USER= <dgb>
##$AMP= (0..31)
100 100 100 100 100 100 100 100 100 100 100 100 100 100 100 100 100 100 
100 100 100 100 100 100 100 100 100 100 100 100 100 100 
##$AQSEQ= 0
##$AQ_mod= 3
##$AUNM= <au_zg>
##$AUTOPOS= <49 >
##$BF1= 250.13
##$BF2= 250.13
##$BF3= 250.13
##$BF4= 250.13
##$BF5= 500.13
##$BF6= 500.13
##$BF7= 500.13
##$BF8= 500.13
##$BYTORDA= 1
##$CFDGTYP= 0
##$CFRGTYP= 5
##$CHEMSTR= <none>
##$CNST= (0..31)
1 1 145 1 1 1 1 1 1 1 1 1 1 1 1 1 1 1 1 1 1 1 1 1 1 1 1 1 1 1 1 1 
##$CPDPRG= <>
##$CPDPRG1= <>
##$CPDPRG2= <>
##$CPDPRG3= <>
##$CPDPRG4= <mlev>
##$CPDPRG5= <mlev>
##$CPDPRG6= <mlev>
##$CPDPRG7= <mlev>
##$CPDPRG8= <mlev>
##$CPDPRGB= <>
##$CPDPRGT= <>
##$D= (0..31)
0 1 0 0 0 0 0 0 0 0.06 0 0 0 0 0 0 0.0002 0 0 0 0 0 0 0 0 0 0 0 0 0 0 
0 
##$DATE= 1161027545
##$DBL= (0..7)
120 120 120 120 120 120 120 120 
##$DBP= (0..7)
150 150 150 150 150 150 150 150 
##$DBP07= 0
##$DBPNAM0= <>
##$DBPNAM1= <>
$$ [...]
##$SUBNAM7= <"">
##$SUBNAM8= <"">
##$SUBNAM9= <"">
##$SW= 20.6930455092707
##$SWIBOX= (0..15)
0 0 3 0 0 0 0 0 0 0 0 0 0 0 0 0 
##$SW_h= 5175.983436853
##$TD= 65536
##$TD0= 1
##$TE= 683.16
##$TE2= 300
##$TE3= 300
##$TEG= 300
##$TL= (0..7)
0 120 120 120 120 120 120 120 
##$TP= (0..7)
150 150 150 150 150 150 150 150 
##$TP07= 0
##$TPNAME0= <>
##$TPNAME1= <>
##$TPNAME2= <>
##$TPNAME3= <>
##$TPNAME4= <>
##$TPNAME5= <>
##$TPNAME6= <>
##$TPNAME7= <>
##$TPOAL= (0..7)
0.5 0.5 0.5 0.5 0.5 0.5 0.5 0.5 
##$TPOFFS= (0..7)
0 0 0 0 0 0 0 0 
##$TUNHIN= 0
##$TUNHOUT= 0
##$TUNXOUT= 0
##$USERA1= <user>
##$USERA2= <user>
##$USERA3= <user>
##$USERA4= <user>
##$USERA5= <user>
##$V9= 5
##$VALIST= <valist>
##$VCLIST= <CCCCCCCCCCCCCCC>
##$VD= 0
##$VDLIST= <DDDDDDDDDDDDDDD>
##$VPLIST= <PPPPPPPPPPPPPPP>
##$VTLIST= <TTTTTTTTTTTTTTT>
##$WBST= 1024
##$WBSW= 4
##$XGAIN= (0..3)
0 0 0 0 
##$XL= 0
##$YL= 0
##$YMAX_a= 391376
##$YMIN_a= -416779
##$ZGOPTNS= <>
##$ZL1= 120
##$ZL2= 120
##$ZL3= 120
##$ZL4= 120
##$ABSF1= 16.522
##$ABSF2= -4.171173
##$ABSG= 5
##$ABSL= 3
##$ALPHA= 0
##$AQORDER= 0
##$ASSFAC= 0
##$ASSFACI= 0
##$ASSFACX= 0
##$ASSWID= 0
##$AUNMP= <proc_1d>
##$AZFE= 0.1
##$AZFW= 0.1
##$BCFW= 0
##$BC_mod= 0
##$BYTORDP= 0
##$COROFFS= 0
##$CY= 12.5
##$DATMOD= 1
##$DC= 0
##$DFILT= <>
##$DTYPP= 0
##$F1P= 14.0000005364418
##$F2P= -0.99999901652339
##$FCOR= 0.5
##$FTSIZE= 32768
##$FT_mod= 6
##$GAMMA= 0
##$GB= 0
##$INTBC= 1
##$INTSCL= 1
##$ISEN= 128
##$LB= 0.3
##$LEV0= 0
##$LPBIN= 0
##$MAXI= 10000
##$MC2= 0
##$MEAN= 0
##$ME_mod= 0
##$MI= 0
##$NCOEF= 0
##$NC_proc= -4
##$NLEV= 6
##$NOISF1= 0
##$NOISF2= 0
##$NSP= 0
##$NTH_PI= 0
##$NZP= 0
##$OFFSET= 16.522
##$PC= 1
##$PHC0= -44.12004
##$PHC1= 3.083719
##$PH_mod= 1
##$PKNL= yes
##$PPARMOD= 0
##$PSCAL= 4
##$PSIGN= 0
##$REVERSE= no
##$SF= 250.13
##$SI= 32768
##$SIGF1= 0
##$SIGF2= 0
##$SINO= 400
##$SIOLD= 32768
##$SREGLST= <1H.CDCl3>
##$SSB= 0
##$STSI= 32768
##$STSR= 0
##$SW_p= 5175.98343685301
##$SYMM= 0
##$S_DEV= 0
##$TDeff= 65536
##$TDoff= 0
##$TI= <Analysis number 999999
Compound Code 99
Book Reference 9
Project Code 9>
##$TILT= no
##$TM1= 0
##$TM2= 0
##$TOPLEV= 0
##$USERP1= <user>
##$USERP2= <user>
##$USERP3= <user>
##$USERP4= <user>
##$USERP5= <user>
##$WDW= 1
##$XDIM= 32768
##$YMAX_p= 527111577
##$YMIN_p= -376317
$$ End of Bruker specific parameters
$$ ---------------------------------
##NTUPLES= NMR SPECTRUM
##VAR_NAME=  FREQUENCY,     SPECTRUM/REAL,   SPECTRUM/IMAG
##SYMBOL=    X,             R,               I
##VAR_TYPE=  INDEPENDENT,   DEPENDENT,       DEPENDENT
##VAR_FORM=  AFFN,          ASDF,            ASDF
##VAR_DIM=   32768,         32768,           32768
##UNITS=     HZ,            ARBITRARY UNITS, ARBITRARY UNITS
##FACTOR=    0.157963299565203, 1,           1
##FIRST=     4132.6476996994, 0,             0
##LAST=      -1043.33573715361, 0,           0
##MIN=       -1043.33573715361, -376317,     0
##MAX=       4132.6476996994, 527111577,     0
$$ Real data points
##PAGE= N=1
##DATA TABLE= (X++(R..R)), XYDATA
$$ [...]
15667D3159n5631k3544o0510k7244j45470j4114J27863Q1554K822M4034r0335
$$ 43159 -12472 -36016 -96526 -123770 -269240 -283354 -155491 -73937 -71115 -27081 -117416
15656a17416Q7660J15147J5382l319k6299o2946k2801N6191J7176q2177J2383
$$ -117416 -29756 85391 100773 97454 71155 8209 -14592 41599 58775 -23402 -11019
15645a1019J07433K9588l8522l9803R8093l7909j61943j13649m2671K7811Q8198
$$ -11019 96414 126002 87480 47677 145770 107861 -54082 -167731 -210402 -182591 -94393
15634i4393k2196m9847M6868L844k0157R4963N7302q8329K2803J9033M8342J0271
$$ -94393 -116589 -166436 -119568 -115724 -135881 -40918 16384 -71945 -49142 -30109 18233 28504
15622B8504k813l6983m878L4564k6569J8412k3807r1916o487M9209J2382k752
$$ 28504 25691 -11292 -16170 18394 -8175 10237 -13570 -105486 -111973 -62764 -50382 -53134
15610e3134m2237m1853L1291K1697l4549m5592J30328N323J3755k4088q115r38
$$ -53134 -95371 -137224 -105933 -84236 -118785 -164377 -34049 -28726 -14971 -39059 -47174 -48112
15598d8112r6276m205P9726n914J42162j261q0386k6721K0521N5385j3191L376
$$ -48112 -144388 -148593 -68867 -74781 67381 66120 -14266 -40987 -20466 34919 21728 25104
15586B5104M234m3989j5031Q6261k3463j05473o6541K6824J1830p8471o2097N1986
$$ 25104 29338 -14651 -29682 56579 33116 -72357 -138898 -112074 -100244 -178715 -240812 -188826
15574a88826K5791O0093O501M9250N3638R5025r1605n6614N1808k736l0372O621
$$ -188826 -163035 -102942 -96441 -47191 6447 101472 9867 -46747 5061 2325 -28047 -21426
15562b1426K4226n1440j11019L7310Q8819O775j0651J6652o7692M4144L8901k4690
$$ -21426 2800 -48640 -159659 -122349 -33530 -26755 -37406 -20754 -88446 -44302 -5401 -30091
15550c0091N1430M4376L9258K8849p4723r712N5225n7384o6672K833O7578l9891
$$ -30091 21339 65715 104973 133822 59099 49387 104612 47228 -19444 -16611 50967 11076
15538A1076L049R433L2515o3898m4643n3109K9994M9477k7997J7029K1372n1499
$$ 11076 14125 23558 56073 -7825 -52468 -105577 -75583 -26106 -54103 -37074 -15702 -67201
15526f7201N3691k4231j2167o160p5372N4543J68273q637K0797M736O114M611
$$ -67201 -13510 -37741 -49908 -56068 -131440 -76897 91376 82739 103536 108272 114386 118997
15514A18997l89j08486l2605Q3226p714j18472o1862R5894L5213m7201p0604N0593
$$ 118997 118608 10122 -22483 60743 53029 -65443 -127305 -31411 3802 -43399 -114003 -63410
15502f3410R2038K8113J1624K9940N0904q8050k8965q6545K372J24685J11510
$$ -63410 28628 56741 68365 98305 149209 61159 32194 -54351 -51979 72706 184216
15491A84216M3860j58755j63902L9308Q4407J5924n441j70131n950M0843j2151
$$ 184216 228076 69321 -94581 -55273 29134 45058 39617 -130514 -136464 -95621 -107772
15480a07772n3009P9045J72581j0857m8325p406J9072q900K5119K7795l5558r3721
$$ -107772 -160781 -81736 90845 79988 31663 24257 43329 34429 59548 87343 51785 -41936
15468d1936L6643M0460n9162o4836n5019Q0734Q061q9468k4499k109m0306N2240
$$ -41936 -5293 35167 -23995 -88831 -143850 -63116 -55055 -144523 -169022 -171131 -211437 -159197
15456a59197M8987N5093K0486P8834m9768j75203P9156J7854l4831Q3430L1927
$$ -159197 -110210 -55117 -34631 44203 -5565 -180768 -101612 -83758 -118589 -35159 -3232
15445c232l5609M2672j0938j39121j2735P294M5003J7054m091N0493p6650M947
$$ -3232 -38841 3831 -7107 -146228 -158963 -151669 -106666 -89612 -93703 -43210 -119860 -114913
15433a14913K380J1038O540K8241k8266L201K1001J8053L5861L2156N6671j23273
$$ -114913 -112533 -101495 -94955 -66714 -94980 -91779 -70778 -52725 -16864 15292 71963 -51310
15421e1310Q356N9451p1743P1505M200o0287J2081k0924q8081Q5464J05679j768
$$ -51310 -42954 16497 -55246 16259 20459 -39828 -27747 -48671 -136752 -51288 54391 52623
15409E2623j11083o5655j2811J33566o4172J8782O9781J8900P14N0114o9973p1563
$$ 52623 -58460 -124115 -136926 -3360 -67532 -48750 21031 39931 40645 90759 20786 -50777
15397e0777J4239J0731P197j0361r1858K2800L9137L2096L7625L9100k4099p749
$$ -50777 -36538 -25807 -18610 -28971 -120829 -98029 -58892 -26796 10829 49929 25830 18081
15385A8081n643P21O734m3197M878n7038R3667Q7370r322j2751n6586j39067j1563
$$ 18081 12438 13159 19893 -23304 -18426 -75464 18203 105573 96251 83500 26914 -112153 -123716
15372a23716J7768K6631p530o3764k748K5374k5601O2971O0184q282n6006m546
$$ -123716 -105948 -79317 -86847 -150611 -153359 -127985 -153586 -90615 -30431 -38713 -94719 -99265
15360i9265r895Q3086J38509K2796r0185j20624j1883M5652k5041j05662J13958
$$ -99265 -109160 -26074 112435 135231 45046 -75578 -87461 -41809 -66850 -172512 -58554
15349e8554N9967l1534m5347o1397J04260M2201L442J0527l1757k3248K3328L6649
$$ -58554 1413 -30121 -75468 -136865 -32605 9596 13038 23565 -8192 -31440 -8112 28537
15337B8537O5035l2962l9974p6134n1662N6972N8619j462K5294n260n2006K7538
$$ 28537 93572 60610 20636 -55498 -107160 -50188 8431 6969 32263 27003 -25003 2535
15325B535P3522J6620K4984l4678p2743r201o0024n5698L8070N4652k7930J744
$$ 2535 76057 92677 117661 82983 10240 1039 -58985 -114683 -76613 -21961 -49891 -48147
15313d8147L7580O5714l567K2899J7567k9756k1279q2746o7585L7388m0133O3372
$$ -48147 -10567 55147 51580 74479 92046 62290 41011 -41735 -109320 -71932 -112065 -48693
15301d8693J05023m0695p5100N6415M4718J17525K8272k3954n574n9516p792n5752
$$ -48693 56330 15635 -59465 -3050 41668 159193 187465 163511 157937 98421 90629 34877
15289C4877J4052K7101L6948M4144q6352n0268M1044m9024m1858J11940j8911
$$ 34877 48929 76030 112978 157122 70770 20502 61546 12522 -29336 82604 63693
15278F3693j41730r5471J88094L4021J5698o9081K8867K0933r5995n2307K4992
$$ 63693 -78037 -173508 14586 48607 64305 -4776 24091 45024 -50971 -103278 -78286
15267g8286M2221M8339J8047k5249P745K0078Q597m1749j47652M7188R0296l9477
$$ -78286 -36065 12274 30321 5072 12817 32895 41492 -257 -147909 -100721 -10425 -49902
15255d9902l1804M3629m1709l6430O6215n2574k7123K7622K264j14090J0769q146
$$ -49902 -81706 -38077 -79786 -116216 -50001 -102575 -129698 -102076 -99812 -213902 -203133 -211279
15243b11279R0366J04503m6975k3610P3222J42918j181q5612p5634J507Q6751
$$ -211279 -120913 -16410 -63385 -86995 -13773 129145 127964 42352 -33282 -31775 54976
15232E4976O9731R7717j44942m4309l8658j2939J27482N5216o3398o0742p4949
$$ 54976 124707 222424 77482 33173 -5485 -18424 109058 164274 100876 40134 -34815
15221c4815J6998j02102j08776L3971J13445R4585O3315L0496j939L6144m9498
$$ -34815 -17817 -119919 -228695 -194724 -81279 13306 76621 107117 105178 141322 91824
15210I1824o5833M1988R8357l9721p1643N1365j3414J1173J5401m1475m9608r437
$$ 91824 25991 67979 166336 126615 54972 106337 92923 104096 119497 78022 28414 18977
15198A8977N4293q3342o6632J24792R3015K6013j12099j22778R2078K0681o5295
$$ 18977 73270 -10072 -76704 48088 141103 167116 55017 -67761 24317 44998 -20297
15187b0297r5850M865R0681L2755l8595k689J6719J182N393Q554O1826K2838J4650
$$ -20297 -116147 -111282 -20601 12154 -26441 -29130 -12411 -11229 -5836 2718 64544 87382 102032
15174A02032r722m1196L8608n7949N4996N9048j19038m0255N0056Q0800J3186
$$ 102032 92310 51114 89722 31773 86769 145817 26779 -13476 36580 117380 130566
15163A30566j07459O870r6255j74198L35M9681N2967J9475P0731O5466o4474j17362
$$ 130566 23107 29977 -66278 -240476 -240141 -190460 -137493 -118018 -47287 18179 -46295 -163657
15151a63657M7403J42468J14541j2585j26483n2743j5162k9537n9010j505J8405
$$ -163657 -116254 26214 140755 128170 1687 -51056 -66218 -95755 -154765 -156270 -137865
15140a37865K3664J9332k2316j240r938P3057K8356p601l5159O5466N0247P8017
$$ -137865 -114201 -94869 -117185 -118425 -128363 -55306 -26950 -34551 -69710 -4244 46003 124020
15128A24020N9457r7430j14540j22857M6934K3941j4011J5437m1247L8324N1925
$$ 124020 183477 86047 -28493 -151350 -104416 -80475 -94486 -79049 -120296 -81972 -30047
15117c0047n9122p4822p1268o4125l2J4759M1037K8514K6770k870P9689J00893
$$ -30047 -89169 -163991 -235259 -299384 -299416 -284657 -243620 -215106 -188336 -191206 -111517 -10624
15105a0624M6535j3212p1283N825K5072p9597R00M1513R2529j20415p7879o207
$$ -10624 35911 22699 -48584 -42759 -17687 -97284 -96384 -54871 37658 -82757 -160636 -166843
15093a66843m3164N7526J05414Q017K3347M5942j0253p9380N7476M5799l6536
$$ -166843 -210007 -152481 -47067 -39050 -15703 30239 19986 -59394 -1918 43881 7345
15082G345j29284l7183J16882N1605K0163k1306j8896l303N3467r560n0604K5444
$$ 7345 -121939 -159122 -42240 9365 29528 8222 -10674 -13977 39490 29930 -20674 4770
15070D770J18571o8329n4318j5350m0692n5587j20376q676R5163O0873M4133L9402
$$ 4770 123341 55012 694 -14656 -55348 -110935 -231311 -239987 -144824 -83951 -39818 -416
15058d16j33592m9444K3373J16052R9164J7721L834q8801j50426L7731R2827j4170
$$ -416 -134008 -183452 -160079 -44027 55137 72858 76692 -12109 -162535 -124804 -31977 -46147
15046d6147m5232J12373P441L8471q6014j17318j3119J51837o7061O9966J7846
$$ -46147 -91379 20994 28435 66906 -19108 -136426 -149545 2292 -64769 5197 23043
15035B3043p1734L2700l1143l7233J00229m8303j79493j6773J1444j3946m9207
$$ 23043 -48691 -15991 -47134 -84367 15862 -32441 -211934 -228707 -217263 -231209 -280416
15024b80416J20981L6481k2866R1721M231q7525K5725J62149J18141q6301j47402
$$ -280416 -159435 -122954 -145820 -54099 -49868 -137393 -111668 50481 168622 82321 -65081
15013f5081m2453Q3275L0808j22006M8815j7086j6080Q0152J44839R245q8468
$$ -65081 -107534 -24259 6549 -115457 -66642 -83728 -99808 -19656 125183 134428 45960
15002D5960j6874m4267M0603j9611q3313l1458K5310Q3631n1156n0878l9267P5450
$$ 45960 29086 -15181 25422 5811 -77502 -108960 -83650 -19 -51175 -102053 -141320 -65870
14990f5870m5680n6386N943m5434N4471J18102J05355j00733r9159k0098J32458
$$ -65870 -111550 -167936 -161993 -207427 -152956 -34854 70501 -30232 -129391 -149489 -17031
14979a7031q4133j10618l2855K3391K0393N2220J74682J00295l6003j67035q5939
$$ -17031 -101164 -211782 -244637 -221246 -200853 -148633 26049 126344 90341 -76694 -162633
14968a62633p0743J141R853K4637J21054J9648o1293n8254k0013j00583m4528
$$ -162633 -233376 -232235 -222382 -197745 -76691 -57043 -118336 -176590 -196603 -297186 -341714
14957c41714J39422J50069N4289k7592k139Q326j6896O2949O1207R101o960Q0393
$$ -341714 -202292 -52223 2066 -25526 -27665 -19339 -36235 26714 87921 97022 90062 170455
14945A70455L4709j46876j76525K5624m0068j19620K8185Q0234r183r156J15984
$$ 170455 205164 58288 -118237 -92613 -132681 -252301 -224116 -143882 -153065 -162221 -46237
14934d6237R9942N4637J9539j8061r7750L8129k5227j61610j11149J9683o117
$$ -46237 53705 108342 127881 109820 12070 50199 24972 -136638 -247787 -228104 -234221
14923b34221P6232L6154M1484M6662M594k3995P914J14963o5715p6472M0532k5804
$$ -234221 -157989 -121835 -80351 -33689 -29095 -53090 -45176 69787 4072 -72400 -31868 -57672
14911e7672K7710N3582j03383n9844j38514O862J08287Q8596O4395m2237O4356
$$ -57672 -29962 23620 -79763 -139607 -278121 -271259 -162972 -74376 -9981 -52218 12138
14900A2138j2094M8557L1049K6166L3336o316j7529r074m1863n7458p818J690
$$ 12138 44 48601 79650 105816 139152 132836 115307 106233 64370 6912 -906 784
14888G84r2396o5146O3218L8691r8510J923O1813O2429J08624J5710j4119o7532
$$ 784 -91612 -156758 -93540 -54849 -153359 -151436 -89623 -27194 81430 97140 83021 15489
14876A5489j4301p0333N6241m4320j29317J2412L2435J5718P452P8987L3733p4426
$$ 15489 1188 -69145 -12904 -57224 -186541 -174129 -141694 -125976 -118524 -39537 -5804 -80230
14864h0230p1035o5778Q4569J57999N9543o4985m7413j29191l173K5613L0063
$$ -80230 -151265 -217043 -132474 25525 85068 20083 -27330 -156521 -159694 -134081 -104018
14853a04018L1032m5567K8828P3106M2051N1835J5702l5624K0837K7313k7429
$$ -104018 -72986 -118553 -89725 -16619 25432 77267 92969 57345 78182 105495 78066
14842G8066n4953n5609q658K6047k1173P3924Q1867m6150N430O8908j15626j15989
$$ 78066 23113 -32496 -41154 -15107 -36280 37644 119511 73361 78791 147699 32073 -83916
14830h3916o0218j12000J443K8376j697J06102l4736J0265Q0223M405N8432J7688
$$ -83916 -144134 -256134 -254691 -226315 -228012 -121910 -156646 -146381 -66158 -61753 -3321 14367
14818A4367j08624l4256J14206J4756k8432M9797O9117n2916p3836j8899J0609
$$ 14367 -94257 -128513 -14307 449 -27983 21814 90931 38015 -35821 -54720 -44111
14807d4111K2433k785k6653L025j198M7254J4834j2294K558m0767Q632K4961k7422
$$ -44111 -21678 -24463 -51116 -48091 -49289 -2035 12799 505 3063 -37704 -29072 -4111 -31533
14794c1533q6395P7706L6136p6963L573J1284r8901n3603j2872O9423J89857m4715
$$ -31533 -117928 -40222 -4086 -81049 -77476 -66192 -165093 -218696 -231568 -162145 27712 -17003
14782a7003q4657m6491Q3991O4827r2756p0287M5547P5984L9563L2099M0916m6485
$$ -17003 -101660 -148151 -64160 667 -92089 -162376 -116829 -40845 -1282 30817 71733 25248
14770B5248p8310L3108m7230O804j6603Q070J4112k8356K8446M206N637n1638
$$ 25248 -53062 -19954 -67184 -60380 -76983 -68913 -54801 -83157 -54711 -50505 -44868 -96506
14758i6506M8608n3942l5056m5080Q1777N537m2360J6788K5437j5249R5479J58075
$$ -96506 -47898 -101840 -136896 -181976 -100199 -94662 -137022 -120234 -94797 -110046 -14567 143508
14746A43508K4573m5569j07984p4579l8851J47498R816j23282j03987l3693M6327
$$ 143508 168081 122512 14528 -60051 -98902 48596 58412 -64870 -168857 -202550 -156223
14735a56223P4609L9047q009M6078K8984j0290k3494P0634Q223m4279j26072Q362
$$ -156223 -81614 -42567 -50576 -4498 24486 14196 -9298 61336 69559 25280 -100792 -92430
14723i2430Q4873N6539K2395J6369o6186j02746O8052L0410l1558o5916n2949
$$ -92430 -7557 48982 71377 87746 21560 -81186 -13134 17276 -14282 -80198 -133147
14712a33147k1067P2250J11696j7491l0991m1443j02172O7572J0467M4515j5303
$$ -133147 -154214 -81964 29732 12241 -18750 -60193 -162365 -94793 -84326 -39811 -55114
14701e5114l7255m9366k3562N9800J024q6790o4586R1737J30025J5842j16592
$$ -55114 -92369 -141735 -165297 -105497 -104473 -191263 -255849 -164112 -34087 -18245 -134837
14690a34837P9996m6700m0899Q8146o270m4885K8586K1679R0374k0977j8838l99
$$ -134837 -54841 -101541 -142440 -54294 -60564 -105449 -76863 -55184 35190 14213 -4625 -5024
14678e024k493N5293n6260M7349m5507j07722j368R8822j02096l8134m703P1317
$$ -5024 -7517 47776 -8484 38865 -6642 -114364 -115732 -16910 -119006 -157140 -161843 -90526
14666i0526O9139l3382N4269J35967L9436p5728l3170K986J4166n1305j20886
$$ -90526 -21387 -54769 -500 135467 174903 99175 66005 68991 83157 31852 -89034
14655h9034L958L1530K6828p4465j12402p2864o6692R953l3129J59841J21777
$$ -89034 -85076 -53546 -26718 -101183 -213585 -286449 -353141 -343188 -376317 -216476 -94699
14644i4699N1523k3694o0758L0451O6938l6405k6798L274j9337N5415n7357p1026
$$ -94699 -43176 -66870 -127628 -97177 -30239 -66644 -93442 -90168 -109505 -54090 -111447 -182473
14632a82473L5322M866J22455O8941L3922O8612l2903m0405o0998K3061l5904
$$ -182473 -147151 -142285 -19830 49111 83033 151645 118742 78337 17339 40400 4496
14621D496j2885k5131j048L1580M0911n7278k2659k9890K1099J25975J6279p9049
$$ 4496 -8389 -33520 -34568 -2988 37923 -19355 -42014 -71904 -50805 75170 91449 12400
14609A2400o0911P429k848j04910L3288k3913K7936M2722n1893j43866J28133
$$ 12400 -48511 -41082 -43930 -148840 -115552 -139465 -111529 -68807 -120700 -264566 -136433
14598a36433O5740J6129L3573J4393L7759n698l4357q2501N2847j8987L2646J5742
$$ -136433 -70693 -54564 -20991 -6598 31161 25463 -8894 -91395 -38548 -57535 -24889 -9147
14586i147K434q6460o0128j29358K5799J00338J06180k1201R5466o7236n4551
$$ -9147 -6713 -93173 -153301 -282659 -256860 -156522 -50342 -71543 23923 -43313 -97864
14575i7864l8650K0656p5724N3398L0702K5706J9464k5299r3543L9687O2470o6771
$$ -97864 -136514 -115858 -191582 -138184 -107482 -81776 -62312 -87611 -181154 -141467 -78997 -145768
14563a45768j00376n500P9504J17079M9135r9075M6500Q9468R877j13977q204
$$ -145768 -246144 -251644 -172140 -55061 -5926 -105001 -58501 30967 40844 -73133 -81337
14552h1337M9855j26399r0587M8655J91785J20417J344p0413m2115n4932p3114
$$ -81337 -31482 -157881 -248468 -199813 -8028 112389 113733 43320 1205 -53727 -126841
14541a26841n1834p3548r6647J8329M6581R0152l0166J21745O1563r1092n726
$$ -126841 -178675 -252223 -348870 -330541 -283960 -193808 -223974 -102229 -40666 -131758 -137484
14530a37484O916K0387Q3361n558R07R6360k4775q8327K8791K263R039j2773J0377
$$ -137484 -130568 -110181 -26820 -32378 -31471 64889 40114 -48213 -19422 -17159 -8120 -20893 -10516
14517a0516n4101l4896o7968K9000Q2945N613J12305n1788j66405M7717J60746
$$ -10516 -64617 -99513 -167481 -138481 -55536 -49923 62382 10594 -155811 -108094 52652
14506E2652J00901j30246q2556J24627M8877j26420o6267Q0108P8745p266o9933
$$ 52652 153553 23307 -59249 65378 114255 -12165 -78432 1676 80421 73155 3222
14495C222j4209p0662n4568J3191J5234N6557n8023M533K5043N6722j8522K3555
$$ 3222 -10987 -81649 -136217 -123026 -107792 -51235 -109258 -104725 -79682 -22960 -41482 -17927
14483a7927N3136M0014K0582K5458p3223j09757j52629L8149R4721P9649L4830
$$ -17927 35209 75223 95805 121263 48040 -61717 -214346 -176197 -81476 -1827 33003
14472C3003l0056Q5049M7597O436J2641k1040R741n7739l9680K0344j225N4757
$$ 33003 2947 87996 135593 142029 154670 133630 143371 85632 45952 66296 65071 119828
14460A19828M592M2273K6011j9976l7895j67427M7494J5738j02172J2546p3511
$$ 119828 124420 166693 192704 172728 134833 -32594 14900 30638 -71534 -58988 -132499
14449a32499J09818O4006j16353J9089R8772m9281L8847O2207n4289n1971N732
$$ -132499 -22681 41325 -75028 -55939 42833 -6448 32399 94606 40317 -11654 -5922
14438e922k3954j0868O3095P188o9595r4445p747M1074l447J25030J4358L899
$$ -5922 -29876 -40744 22351 29539 -40056 -134501 -142248 -101174 -104621 20409 34767 38666
14426C8666n881j11381k71l331P8571K7254n7997k6852L5179k6883p7991k4958
$$ 38666 32785 -78596 -78867 -82198 -3627 23627 -34370 -61222 -26043 -52926 -130917 -155875
14414a55875L2319l187N5635K6972j5453K5298R340K5418O2422j1166m3932r2619
$$ -155875 -123556 -126743 -71108 -44136 -59589 -34291 -24951 467 62889 51723 7791 -84828
14402h4828p0584M953J15349K588j42010K3256r592N121M3568K1038j8084k4801
$$ -84828 -155412 -150459 -35110 -32522 -174532 -151276 -160868 -155747 -112179 -91141 -109225 -134026
14390a34026m7495M1355J00719K5502R6091L5017n3826Q808K1873q4680j83376
$$ -134026 -181521 -140166 -39447 -13945 82146 117163 63337 72145 94018 9338 -174038
14379a74038o8664J7858k635N8540M0270R6882N0491k8133l1998J01844O4354
$$ -174038 -242702 -224844 -227479 -168939 -128669 -31787 18704 -9429 -41427 60417 124771
14368A24771m9315n2260o5726p2661j07167K6143P3O6929J01027q8139p8611k9445
$$ 124771 75456 23196 -42530 -115191 -222358 -196215 -196142 -129213 -28186 -116325 -194936 -224381
14356b24381N4344r972L5M254j3049M5286L8098o752j3297k790N3429j4294l217
$$ -224381 -170037 -180009 -179974 -175720 -188769 -143483 -105385 -112137 -125434 -128224 -74795 -89089 -92306
14343i2306n2322m3664K3093O1560j3664Q589L6778k0420n0740N5778P7811k9928
$$ -92306 -144628 -188292 -165199 -103639 -117303 -108714 -71936 -92356 -143096 -87318 -9507 -39435
14331c9435o3487j6349K6575l129l9327O3600M4631k2417k2673J5715n9680K1539
$$ -39435 -102922 -119271 -92696 -95825 -135152 -71552 -26921 -49338 -72011 -56296 -115976 -94437
14319i4437J23446K0031r7636o689n306k0237k169O3711q7951j8802O3218m7345
$$ -94437 29009 49040 -48596 -55285 -60591 -80828 -82997 -19286 -107237 -126039 -62821 -110166
14307a10166n0536o6599N3476Q3731N4406n7012l5065J09275J6525Q936l5877
$$ -110166 -160702 -227301 -173825 -90094 -35688 -92700 -127765 -18490 -1965 6971 -28906
14296b8906m1289J8361l4829m2000O8516J03751m2450K5933l6392l669J815Q3742
$$ -28906 -70195 -51834 -86663 -128663 -60147 43604 1154 27087 -9305 -12974 -11159 72583
14284G2583o9805j00171r6973R2780Q9089l3746l0458K0155Q8944L9543l1689
$$ 72583 2778 -97393 -194366 -101586 -12497 -46243 -76701 -56546 32398 71941 40252
14273D0252p2572k4787P0355K0152q8241J3527k871q6560l2098M7207P7556N8376
$$ 40252 -32320 -57107 13248 33400 -54841 -41314 -44185 -130745 -162843 -115636 -38080 20296
14261B0296l8065j12796k7273N2281L7106M2534l8957L8413L7766M0658k883J3945
$$ 20296 -17769 -130565 -157838 -105557 -68451 -25917 -64874 -26461 11305 51963 49080 63025
14249F3025n2582n364J6597M0836k0719o5682P9142l9250l3928m9980O3069O8329
$$ 63025 10443 5079 21676 62512 41793 -23889 55253 16003 -17925 -67905 -4836 63493
14237F3493j1544j0650n8469k0472L8703q8121n0341L7072K0855L5959n2283j0691
$$ 63493 51949 41299 -17170 -37642 1061 -87060 -137401 -100329 -79474 -43515 -95798 -106489
14225a06489j3454J3494m541K3609Q2772m1502l5006j847k8087q1088l5808j7012
$$ -106489 -119943 -106449 -110990 -87381 -4609 -46111 -81117 -82964 -111051 -192139 -227947 -244959
14213b44959O7626J04475K7301l4953l2783k9106K0272j6321n905M1761m4190
$$ -244959 -177333 -72858 -45557 -80510 -113293 -142399 -122127 -138448 -144353 -102592 -146782
14202a46782j3930m3913j3287M1482m9118L4260n66O6117J3394J23730J6028l1732
$$ -146782 -160712 -204625 -217912 -176430 -225548 -191288 -191854 -125737 -112343 11387 27415 -4317
14190d317J4957k5136n7423K5143q7133o1071n0704l8569Q0463J75670L710p6649
$$ -4317 10640 -14496 -71919 -46776 -133909 -194980 -245684 -284253 -203790 -28120 -24410 -101059
14178a01059m4745M1174L410O984J3422n0820J6411O3938N1783K880m7544K7835
$$ -101059 -145804 -104630 -101220 -94236 -80814 -131634 -115223 -51285 498 3378 -44166 -16331
14166a6331j41N9560l6414o3617l7513n2237M6335L2317m4803J1850K9285R6543
$$ -16331 -16472 43088 6674 -56943 -94456 -146693 -100358 -68041 -112844 -100994 -71709 24834
14154B4834j10127j25448M7583M7294J9443J22484p9058q9974Q2186J39509R5218
$$ 24834 -85293 -210741 -163158 -115864 -96421 26063 -52995 -142969 -60783 78726 173944
14143A73944j2607j33322j57512l2887L2090J6850l8350J00460o5346p0600j7642
$$ 173944 161337 28015 -129497 -162384 -130294 -113444 -151794 -51334 -116680 -187280 -204922
14132b04922N0582J9673L9989J8139J4497Q8180N2394k6986l6057p1129k0717
$$ -204922 -154340 -134667 -94678 -76539 -62042 26138 78532 51546 15489 -55640 -76357
14121g6357O2770M0094j5559r2618o9868M4842J8806P4245o773N2778J7406L5161
$$ -76357 -13587 26507 10948 -81670 -151538 -106696 -87890 -13645 -20418 32360 49766 84927
14109H4927K5437L6787m8408M702l3821L2332J809o8182O4258m4673o9139N669
$$ 84927 110364 147151 98743 103445 69624 101956 103765 35583 99841 55168 -13971 -8302
14097h302K4638o9256q6760j1535P2305N5399K2657L1779O0410r8748p4811j0733
$$ -8302 16336 -52920 -139680 -151215 -78910 -23511 -854 30925 91335 -7413 -82224 -92957
14085i2957L88l6083j3353Q2386N8641p0831l8809k4826n702j9056N4913O0254
$$ -92957 -92569 -128652 -142005 -59619 -978 -71809 -110618 -135444 -141146 -160202 -105289 -45035
14073d5035J6330L0439J6255o0147l3988l830Q4260R4183r4375p4834j4823K9604
$$ -45035 -28705 1734 17989 -42158 -76146 -79976 4284 98467 4092 -70742 -85565 -55961
14061e5961J90297Q0216n2824p0251q7637j593p5528M6658L5465J02983n827q9936
$$ -55961 134336 214552 161728 91477 3840 2247 -73281 -26623 8842 111825 105998 16062
14049A6062k1345J6088K0960N3261k4256q9525n2334o583L3706k4738m2893O1909
$$ 16062 -5283 10805 31765 85026 60770 -28755 -81089 -87672 -53966 -78704 -121597 -59688
14037e9688J8550L8858J9375j11272r971j3662p581K4348p6710l0414Q0313P9488
$$ -59688 -41138 -2280 17095 -94177 -104148 -117810 -125391 -101043 -177753 -208167 -127854 -48366
14025d8366r4878L9277M7848K0511L5558N1097O5876r1840j28896K9092Q7858
$$ -48366 -143244 -103967 -56119 -35608 -50 51047 116923 25083 -103813 -74721 13137
14014A3137J1027L2091P6284L2428P8521j01840j06076R90J9288m7582r336Q2878
$$ 13137 24164 56255 132539 164967 243488 141648 35572 36562 55850 8268 -1068 81810
14002H1810L1696j09606p575N687q3861L7898n1337k0336N0083q9360L214N6471
$$ 81810 113506 3900 -3675 2012 -81849 -43951 -95288 -115624 -65541 -154901 -151687 -95216
13990i5216R3273m1753o1555m0748R9089O7911o5228l1815n0286Q796k6681m0934
$$ -95216 -1943 -43696 -105251 -145999 -46910 21001 -44227 -76042 -126328 -117532 -144213 -185147
13978a85147R611J00079J19248P493l4909J6314l5890l7264j7283N7403l7462
$$ -185147 -175536 -75457 43791 51284 16375 32689 -3201 -40465 -57748 -345 -37807
13967c7807k3485Q084o5147n559N2352L2247j463p6801j16981L7641L1028L7098
$$ -37807 -61292 -53208 -118355 -123914 -71562 -39315 -40778 -117579 -234560 -196919 -165891 -128793
13955a28793q812K6413k6483P0239M1273P6709j235m5765Q0635N8221j29861k1388
$$ -128793 -137605 -111192 -137675 -67436 -26163 50546 49311 3546 84181 142402 12541 -8847
13943h847P7307K5446n9695l2876j6912J3893l117n4878N0151Q672L339K8973
$$ -8847 68460 93906 34211 1335 -15577 -1684 -4801 -59679 -9528 -856 2483 31456
13931C1456m8429q9677p4695P0342O9683N6440J10284j9233m3933m6881P8452
$$ 31456 -16973 -106650 -181345 -111003 -41320 15120 125404 106171 62238 15357 93809
13920I3809n7301k1480N6195P5160j3888k7141N8820o1382j7956m253j1667Q8687
$$ 93809 36508 15028 71223 146383 132495 105354 164174 102792 84836 80583 68916 157603
13908A57603o7056j13096j00190l5754J0542j4354N288J49282Q77o463K3209O4216
$$ 157603 90547 -22549 -122739 -158493 -147951 -162305 -157017 -7735 -6858 -13321 9888 74104
13896G4104k3070M8597L1323J3490R635N5408Q3553j3566n5859m6447O3485j588
$$ 74104 51034 99631 130954 144444 154079 209487 293040 279474 223615 177168 240653 239065
13884B39065M8693N0720j56848r0239k8880P505J05301l4558j43395j16793P7455
$$ 239065 287758 338478 181630 91391 62511 70016 175317 140759 -2636 -119429 -41974
13873d1974m039L0766J6315J7516J0036l3123J6176O4050j0423l3311P4126Q4833
$$ -41974 -46013 -15247 1068 18584 28620 -4503 11673 75723 65300 31989 106115 190948
13861A90948J382q1274K3088J479J1585N0528O3437r0285K0123N1395k4631l4274
$$ 190948 192330 111056 134144 135623 147208 197736 261173 170888 191011 242406 217775 183501
13849A83501n3715n9593n9850J5437k7548J0070o104K7368n5112P1625k745N3033
$$ 183501 129786 70193 10343 25780 -1768 8302 2198 29566 -25546 46079 43334 96367
13837I6367J21117j44319l6362M7420N0414R957K6732m495N9115m4681p1m3135
$$ 96367 217484 73165 36803 84223 134637 144594 171326 166831 225946 181265 181194 138059
13825A38059n1525O4264j0960N546m2807p6753m2637P3819L3305P7019J23013
$$ 138059 86534 150798 139838 145384 102577 25824 -16813 57006 90311 167330 290343
13814B90343J6591L5345n6855n4076p6101L6204J8828M4457L7584q6354o6909
$$ 290343 306934 342279 285424 231348 155247 191451 210279 254736 292320 205966 139057
13803A39057R6681K9551k7236l7039j6312l1744P5950k9328j4787q3735L1966
$$ 139057 235738 265289 238053 201014 184702 152958 228908 199580 184793 101058 133024
13792A33024r562N6757k6088r5902J8842J81540J07836n3536o1869J2367o5541
$$ 133024 123462 180219 154131 58229 77071 258611 366447 312911 251042 263409 197868
13781A97868L6095l6565k2718M1906R7328n2043o7519n9409L1360o2303q9509
$$ 197868 233963 197398 174680 216586 313914 261871 194352 134943 166303 104000 14491
13770A4491J8350P0217o0160K417N6391K1226m7959L9382l4233K8410l0655L4052
$$ 14491 32841 103058 42898 45315 101706 122932 74973 114355 80122 108532 77877 111929
13758A11929O3582Q178M2183O7713K3513j19239j42196m9746N7434q29N0375L5060
$$ 111929 175511 183689 225872 293585 317098 197859 55663 5917 63351 62522 112897 147957
13746A47957j05709n5277j7614L3252j6435O6141O9701P4920L5289n3810l1658
$$ 147957 42248 -13029 -30643 2609 -13826 52315 122016 196936 232225 178415 146757
13735A46757j49409l9172R9046N8537K3177J976r7496k1363L7272J5121l3932
$$ 146757 -2652 -41824 57222 115759 138936 140912 43416 22053 59325 74446 40514
13724D0514p7861N8559R151p3475k7831R4459L0029m4875o0291p709j488J6360
$$ 40514 -37347 21212 30363 -43112 -70943 23516 53545 8670 -51621 -59330 -60818 -44458
13712d4458J09369Q2428M4017J8739j68619M354R5783l5160n89L1948m7732L0181
$$ -44458 64911 147339 191356 210095 41476 45830 141613 106453 105864 137812 90080 120261
13700A20261J4022j66146j9886O6266m4149M6962K0229M2793P3394j0168M9711
$$ 120261 134283 -31863 -51749 14517 -29632 17330 37559 80352 153746 143578 193289
13689A93289m9960q1523j9853l2540L433J449J3049J18178M0490O775K0060j17484
$$ 193289 143329 61806 41953 9413 12846 14295 27344 145522 186012 192787 212847 95363
13677I5363Q029j4883q0996N236r979L4687m0040m0159N6237O5068n2511j7896
$$ 95363 103392 88509 7513 12749 2770 37457 -2583 -42742 13495 78563 26052 8156
13665H156L3517l5069k2993p7140L4319N9722n1115o9264R1419O0621j2499O9607
$$ 8156 41673 6604 -16389 -93529 -59210 512 -50603 -119867 -28448 32173 19674 89281
13653H9281k557k8327j68924K6208K22545j2174j02419p5863k8471P4104P0333
$$ 89281 86724 58397 -110527 -84319 138226 126052 23633 -52230 -80701 -6597 63736
13642F3736l7965J8085p2039m9077l5137M7106m8980L5444M8300N3528J02680
$$ 63736 25771 43856 -28183 -77260 -112397 -65291 -114271 -78827 -30527 23001 125681
13631A25681R1441J25904j6394j33375n4192M3216L2756O4976n191m6913k2049
$$ 125681 217122 343026 326632 193257 139065 182281 215037 280013 274822 227909 205860
13620B05860l8560j857L2290Q3178j9714K1641r8877r4587L7292M73P0338j1002
$$ 205860 167300 165443 197733 280911 261197 282838 183961 89374 126666 127139 197477 186475
13608A86475j7988q3231L8383m0220j23743M1099J12835O0003P7827O1592n6779
$$ 186475 168487 85256 123639 83419 -40324 775 113610 173613 251440 313032 256253
13597B56253p4588Q7609R465j815K5033l2119j2028r9080l5538P6279N1147m0464
$$ 256253 181665 269274 278739 276924 301957 269838 257810 158730 123192 199471 250618 210154
13585B10154J898l5664q9702P6011O1788k1249o7874p6431j5333J31498m6820
$$ 210154 212052 176388 86686 162697 224485 203236 135362 58931 43598 175096 128276
13574A28276n1734j2806N3026N5384R515l6366M656Q1337o4119r8824J26599J11992
$$ 128276 76542 63736 116762 172146 181661 145295 149951 231288 167169 68345 194944 306936
13562C06936m7276p9556o619R963K7352L4922M0113o2734j39518j735M4290L0046
$$ 306936 259660 180104 173485 183448 210800 245722 285835 223101 83583 81848 126138 156184
13550A56184O1604O8692r5845m7023O8346Q3527J20851M3596m8731n7656n0880
$$ 156184 217788 286480 190635 143612 211958 295485 416336 459932 411201 353545 302665
13539C02665j29351Q6437k357J01674L9860l3496j12799j0474Q6050o1134J634
$$ 302665 173314 259751 257394 359068 398928 365432 252633 242159 328209 267075 268709
13528B68709P3033O8777J11230L7903O57k0549L8367l1857O6204Q0849R981O0669
$$ 268709 341742 410519 521749 559652 560309 539760 578127 546270 612474 693323 703304 763973
13516G63973J621M5192q969L4596J24127M3231j9259N6932Q8837J07654Q8666
$$ 763973 765594 810786 801817 836413 960540 1003771 984512 1041444 1130281 1237935 1326601
13505A326601J17325Q6471Q8152l9273L7875K04241K53833K46931J19747J06181
$$ 1326601 1443926 1530397 1618549 1579276 1617151 1821392 2075225 2322156 2441903 2548084
13495B548084J50007K92127M05247L95863N51584P39683P60877R15241J096832
$$ 2548084 2698091 2990218 3395465 3791328 4342912 5082595 5843472 6758713 7855545
13486G855545J339606J740010K073934K250273K293944K116363J831896J469934
$$ 7855545 9195151 10935161 13009095 15259368 17553312 19669675 21501571 22971505
13478B2971505J091982Q29271P50866M23457K56604Q126m83670r64611j275811
$$ 22971505 24063487 24892758 25643624 26067081 26323685 26331811 25848141 24883530 23607719
13469B3607719j305194j348506j109218q54409n23498k00078K72703Q07546J217782
$$ 23607719 22302525 20954019 19844801 18990392 18466894 18266816 18539519 19347065 20564847
13460B0564847J991018K922771L789597M392324M752271M789618M391213L811594
$$ 20564847 22555865 25478636 29268233 33660557 38412828 43202446 47593659 51405253
13452E1405253K977126J834290O83273l24736j186387j881724k290167k761523
$$ 51405253 54382379 56216669 56899942 56575206 55388819 53507095 51216928 48455405
13444D8455405l297018l759988l944049l803356l499224k893949k240974j556710
$$ 48455405 45158387 41398399 37454350 33650994 30151770 27257821 25016847 23460137
13436B3460137j102286o50788M0244N65139J111516J540250J687540J587801J267332
$$ 23460137 22357851 21707063 21747307 22312446 23423962 24964212 26651752 28239553 29506885
13427B9506885Q54394L87984K7739m11190n42285m89949n65829o25504r60693
$$ 29506885 30361279 30749263 30777002 30365812 29823527 29333578 28767749 28142245 27181552
13418B7181552j091072j382091j786513k116548k128587j889040j493438j199857
$$ 27181552 26090480 24708389 22921876 20805328 18676741 16787701 15294263 14094406
13410A4094406r09852o57782m54064j73639r104K47615M71916P80929J202101
$$ 14094406 13184554 12526772 12072708 11899069 11889965 12137580 12609496 13390425 14592526
13401A4592526J571467J782728K010747K091968J899283J688325J287340R87848
$$ 14592526 16163993 17946721 19957468 22049436 23948719 25637044 26924384 27912232
13393B7912232R35773J013680R67503P73015O67031L84769k06829q94087j343727
$$ 27912232 28848005 29861685 30829188 31602203 32269234 32654003 32447174 31553087 30209360
13384C0209360j829879j872245j662166j335204q72714l42815L36966R94516J565876
$$ 30209360 28379481 26507236 24845070 23509866 22637152 22294337 22631303 23625819 25191695
13375B5191695K145383K991777L718841M163852M422082M340018L771635L476719
$$ 25191695 27337078 30328855 34047696 38211548 42633630 46973648 50745283 54222002
13367E4222002L134329K727481K139713J270172O1260j099384k365623l718581
$$ 54222002 57356331 60083812 62223525 63493697 63554957 62455573 60089950 56371369
13359E6371369m522149m942009m987181m646018m015060l184507k494322j847964
$$ 56371369 51849220 46907211 41920030 37274012 33258952 30074445 27580123 25732159
13351B5732159j212869p39847j62286L05521P04079J273427J608538J565990J323000
$$ 25732159 24519290 23779443 23617157 23922678 24626757 25900184 27508722 29074712 30397712
13342C0397712J054139O92763L29523j58978l22031l66691n77025j024746j439459
$$ 30397712 31451851 32144614 32474137 32315159 31993128 31626437 31049412 30024666 28585207
13333B8585207j919466k284146k439333k549329k324119k024909j720765j396640
$$ 28585207 26665741 24381595 21942262 19392933 17068814 15043905 13323140 11926500
13325A1926500j236111j087770p68730o64949n21466n08481o21344m36187l56321
$$ 11926500 10690389 9602619 8833889 8168940 7647474 7138993 6517649 6081462 5725141
13316E725141k59525k21806k43550l94650j84180k05251j90702o7818r5939k07482
$$ 5725141 5465616 5243810 5000260 4605610 4421430 4216179 4025477 3957659 3861720 3654238
13306C654238k01592p6820j70579j46885j47148j79634j77121l2225M8362K6614
$$ 3654238 3452646 3375826 3205247 3058362 2911214 2731580 2554459 2522234 2570596 2597210
13296B597210l9445j51127j42758k43743r8467J27274J2201o6467j39411j37795
$$ 2597210 2557765 2406638 2263880 2020137 1921670 2048944 2061145 1994678 1855267 1717472
13286A717472p4233K9254p446l4706j79674n562L4700M8882q463o383j06934n0656
$$ 1717472 1643239 1672493 1665047 1630341 1450667 1445105 1479805 1528687 1520224 1513841 1406907 1356251
13274A356251j36796r2304p8540k3778j04732L2084J72930L1990M9326m843j22977
$$ 1356251 1219455 1127151 1048611 1024833 920101 952185 1125115 1157105 1206431 1201588 1078611
13263A078611j90486n5439Q1044J88957R960p3993p2244k7183M6176m6179o3533
$$ 1078611 888125 832686 913730 1102687 1112647 1038654 966410 939227 985403 939224 875691
13252H75691p9431l6493j0371J25624Q6346J643j09060j24880r7795l9697N2002
$$ 875691 796260 759767 749396 875020 961366 963009 853949 729069 631274 591577 643579
13241F43579L9414k4020o268j4265l7403m8806p53k710j9632l6621L1890M1378
$$ 643579 682993 658973 652705 638440 601037 552231 551478 548768 529136 492515 524405 565783
13229E65783L760L6389M7095j02713j03677m9517j282J00835J04848l262q198
$$ 565783 569543 605932 653027 550314 446637 397120 395838 496673 601521 598259 590061
13218E90061L0787q2569j69927r9203O7467J13429m9178p6784l2098l0836N8942
$$ 590061 620848 538279 368352 269149 336616 450045 400867 324083 291985 261149 320091
13207C20091K9563l1441p739K9143Q2190J0916m034j17822l7592p2130j9470J02361
$$ 320091 349654 318213 310474 339617 421807 432723 428689 310867 273275 201145 181675 284036
13195B84036K3397J7917j0576k3084k1716N5066Q341k4641R397j14652k6822K2178
$$ 284036 307433 325350 314774 291690 269974 325040 333381 308740 318137 203485 176663 198841
13183A98841O2815J08390m405j79658l3063J1332r824r320m2273M2480o6664P824
$$ 198841 261656 370046 365641 185983 152920 164252 154428 145108 102835 145315 78651 86475
13171H6475M4440J53892J90051o8186j11280o6676j37552J0819N8856M9034M9928
$$ 86475 130915 284807 474858 406672 295392 228716 91164 101983 160839 209873 259801
13160B59801P5280K3929J71082P7462n7232n0048p0723K179q1525q0224o9161
$$ 259801 335081 359010 530092 607554 550322 500274 429551 431730 350205 269981 200820
13149B00820J8532J08733J7314j34780p3967J1532m5864o479l2864j4278R4146
$$ 200820 219352 328085 345399 210619 136652 148184 102320 95841 62977 48699 142845
13138A42845K2536q5486j5105j5334O5464L1894k4430j60058L519N7806j711n5888
$$ 142845 165381 79895 64790 49456 114920 146814 122384 -37674 -34155 23651 21940 -33948
13126c3948n964Q4108J01089J1877K8099m7899n9930J06920Q1136J8774N9227
$$ -33948 -39912 44196 145285 157162 185261 137362 77432 184352 265488 284262 343489
13115C43489N5205J08798O3932m2634k6825q092J1008L7263K3876j4795l1511
$$ 343489 398694 507492 571424 528790 501965 493873 504881 542144 566020 551225 519714
13104E19714j2316p2252r4001j35590L8478L5883K1119o7530j16351p5654J14810
$$ 519714 507398 435146 341145 205555 244033 279916 301035 233505 117154 41500 156310
13093A56310L4056l4636m2498R4194Q245j56569q457m9852n7608q417M381J43466
$$ 156310 190366 155730 113232 207426 215671 59102 50645 793 -56815 -65232 -60851 82615
13081H2615O7529n3139M7748M3242n6854j47218j2329O5782P1326k5875p29J02298
$$ 82615 150144 97005 144753 187995 131141 -16077 -28406 37376 108702 82827 82098 184396
13069A84396J21077J32964j5360o6685J7934p6273j10300j33341P799M8934m5131
$$ 184396 305473 438437 423077 356392 374326 298053 187753 54412 62211 111145 66014
13058F6014q2091j04551p339J15175J21198n606n5370o381J0072J7978n974p171
$$ 66014 -16077 -120628 -127967 -12792 108406 102800 47430 41049 51121 69099 63125 55954
13046E5954K6306J2721m5570l3431J01731p0245L8317Q4717L3854m7022m1196
$$ 55954 82260 94981 49411 15980 117711 47466 85783 170500 204354 157332 116136
13035A16136R042o7636J9885O7825M0552N2407j01474n1639J6391o501n4866l4614
$$ 116136 125178 57542 77427 145252 185804 238211 136737 85098 101489 94988 40122 5508
13023E508P4054O8843O5089R9035L0156m6329p1791N259L4119J2173J6324m675
$$ 5508 79562 148405 213494 312529 342685 296356 224565 229824 263943 276116 292440 287765
13011B87765k9819L8961L3210j428q1216M0496N4738o8225L3163L9711K3099n7966
$$ 287765 257946 296907 330117 328689 247473 287969 342707 274482 307645 347356 370455 312489
12999C12489l9557m4750J237o0596q4031k0744L2631R7171L8358j8332j35465
$$ 312489 272932 228182 229419 168823 84792 64048 96679 193850 232208 213876 78411
12988G8411l5550P5242O5004J37749M8011r2525p5461K4239q1489K24j3130K7137
$$ 78411 42861 118103 183107 320856 368867 276342 200881 225120 143631 143855 130725 157862
12976A57862L0554O4658q7750r274J0926o8681j39459J7178R6940j7592J7109
$$ 157862 188416 253074 165324 156050 166976 98295 -41164 -23986 72954 55362 72471
12965G2471M2444l0638J183j1936J4315M0528O3439K6755L4246m5750j14187j09686
$$ 72471 114915 84277 85460 73524 87839 128367 191806 218561 252807 207057 92870 -16816
12953a6816K9407N0175J31248l3993K962j7155j1999p4336p3077P1864P1013M0290
$$ -16816 12591 62766 194014 160021 162983 145828 133829 59493 -13584 58280 129293 169583
12941A69583M128p9803j4585K1780j4495R8156J06343J0451r9807j31305K5889
$$ 169583 173711 93908 79323 101103 86608 184764 291107 301558 201751 70446 96335
12930I6335K6017l7405L2003Q8755O9293Q9296r843R6773N2016k14556l0529M4497
$$ 96335 122352 84947 116950 205705 274998 364294 354451 451224 503240 288684 258155 302652
12918C02652p9937O8189R0934K1881J6201Q671j9228n5473k2472l8358q4642m7656
$$ 302652 222715 290904 381838 403719 419920 428591 409363 353890 331418 293060 208418 160762
12906A60762j01492J81772J55782n9227p9561j04418n8365L6016J51519k1563
$$ 160762 59270 241042 396824 337597 258036 153618 95253 131269 282788 261225
12896B61225r1034m1773J6284j14408P0205Q0262K1617o6820L0378K4064M7546
$$ 261225 170191 128418 144702 30294 100499 180761 202378 135558 165936 190000 237546
12885B37546k2010q2767q0547l4727n0063M7240J8247O8954p502K9722R6865M0438
$$ 237546 215536 132769 52222 17495 -32568 14672 32919 101873 94371 124093 220958 261396
12873B61396n2207j27838l7298r1996k5404Q9234P7561p8725m4436n3790Q7150
$$ 261396 209189 81351 44053 -47943 -73347 15887 93448 14723 -29713 -83503 3647
12862C647Q1943R399k6875j7948R5938J5715l2170K1750k2481M8385p480o8283
$$ 3647 85590 94989 68114 50166 146104 161819 129649 151399 128918 177303 169823 101540
12850A01540j4743N6710K9981K708o6746j7347K5699L4189K0957j9766r9131p3234
$$ 101540 86797 143507 173488 176196 109450 92103 117802 151991 172948 153182 54051 -19183
12838a9183k7282l5462J4836O5360R8225k9342k4675N4148j6690n3395N3012n9330
$$ -19183 -46465 -81927 -67091 -1731 96494 67152 42477 96625 79935 26540 79552 20222
12826B0222P431r2659m5630M5841K4954m2571m6413j1433O3226r1854k1703J11245
$$ 20222 27653 -65006 -110636 -64795 -39841 -82412 -128825 -140258 -77032 -168886 -190589 -79344
12814g9344R7191M5861j8579j0378n0481K8651m9845l5903p3121N6565k2660n118
$$ -79344 17847 63708 45129 34751 -15730 12921 -36924 -72827 -145948 -89383 -112043 -117161
12802a17161M1764N7918J2114o0394l4527P5741R4270L5324m7219K646K9442n3028
$$ -117161 -75397 -17479 -5365 -65759 -100286 -24545 69725 105049 57830 60476 89918 36890
12790C6890p8343J9019M2049J1337M678n6021K4366R7513L78r7509K2781l2404
$$ 36890 -41453 -22434 19615 30952 35630 -20391 3975 101488 101866 4357 27138 -5266
12778e266M8503k7492p9227j2820Q3882o9919p6485K7354K9264J23720L2881M7047
$$ -5266 43237 15745 -63482 -76302 7580 -62339 -138824 -111470 -82206 41514 74395 121442
12766A21442m1023q579r7382m9500N2670K5436l7579K8016N233j01686l8983k4030
$$ 121442 80419 71840 -25542 -75042 -22372 3064 -34515 -6499 -1266 -102952 -141935 -165965
12754a65965m4390L8347J12442O1030J7121J00066M7687J4969r917k3244j14245
$$ -165965 -210355 -172008 -59566 1464 18585 118651 166338 181307 171390 148146 33901
12743C3901J1227j02630j452O504N6456j7318j26157p4133J45000N3708M0082
$$ 33901 45128 -57502 -58954 -52450 4006 -13312 -139469 -213602 -68602 -14894 25188
12732B5188L5110l2876j21067K2439L7267N3218j2298n9239o8641N2025N9172
$$ 25188 60298 27422 -93645 -71206 -33939 19279 6981 -52258 -120899 -68874 -9702
12721i702n0851Q6588J9541m7394m5284n3815K4831M0771O0336p9204l761J9235
$$ -9702 -60553 26035 45576 -1818 -47102 -100917 -76086 -35315 25021 -54183 -57944 -38709
12709c8709J2671J4281J0228J14255o5695k28974j19169K9508J29997K1573J5182
$$ -38709 -26038 -11757 -1529 112726 47031 -181943 -301112 -271604 -141607 -120034 -104852
12698a04852j4435n5780J25615K5301r6504k0937K7630L0083J00079O9805K8876
$$ -104852 -119287 -175067 -49452 -24151 -120655 -141592 -113962 -83879 16200 86005 114881
12687A14881j1459M589K3313J266k6328r4435m2616J5739q0608L6696L1582M9650
$$ 114881 103422 108011 131324 132590 106262 11827 -30789 -15050 -95658 -58962 -27380 22270
12675B2270P1604j00553K3583O1167N817N6993k4619m4977j14934P971O6804r459
$$ 22270 93874 -6679 16904 78071 83888 140881 116262 71285 -43649 -35678 31126 21667
12663B1667k2760n3105p4133J04406L5100j05271o6820Q7170Q1325K6987l5637
$$ 21667 -1093 -54198 -128331 -23925 11175 -94096 -160916 -73746 7579 34566 -1071
12652a071p2256K8792L7108j11915p2154L0174L241P5l9859Q5119l8978l5607
$$ -1071 -73327 -44535 -7427 -119342 -191496 -161322 -158081 -158006 -197865 -112746 -151724 -187331
12640a87331m4905m9626p0325R6314J45610P3590Q0878l1069K5048r2287j62932
$$ -187331 -232236 -281862 -352187 -255873 -110263 -36673 44205 13136 38184 -54103 -217035
12629b17035l9251J9998O8527J08122j2678q5844m6675K4923L2039O0399K3520
$$ -217035 -256286 -236288 -167761 -59639 -72317 -158161 -204836 -179913 -147874 -87475 -63955
12618f3955N0615M8849l500J617n5606l389m4934J9207J35574O6407o2690m6508
$$ -63955 -13340 35509 32009 33626 -21980 -25369 -70303 -51096 84478 150885 88195 41687
12606D1687q6435j325K6787P858J9056q6108k3861O3862O2145J2860r0001j8629
$$ 41687 -44748 -46073 -19286 -11428 7628 -78480 -102341 -38479 23666 36526 -53475 -72104
12594g2104K9226N7362p052J5470p1183r2590o956J4947q8593Q7540R3071M9439
$$ -72104 -42878 14484 7432 22902 -48281 -140871 -147827 -132880 -221473 -133933 -40862 8577
12582H577R1851K3621p9504k8774n5051L1632Q9645Q851q2009l8602k133O151
$$ 8577 100428 124049 44545 15771 -39280 -7648 81997 90848 8839 -29763 -31896 -25745
12570b5745q4167j5108O790n0608M5567P9749k7296N9379J23975j29320j08145
$$ -25745 -109912 -125020 -118230 -168838 -123271 -43522 -70818 -11439 112536 -16784 -124929
12559a24929Q3954L3256P4444Q412q7282p1935J81226N7130o1015O9923M3399
$$ -124929 -40975 -7719 66725 75137 -12145 -84080 97146 154276 93261 163184 206583
12548B06583k4627j0841R903j07149r8331m0272M8385k808J2473K1730n1275J29121
$$ 206583 181956 171115 181018 73869 -24462 -64734 -16349 -19157 -6684 15046 -36229 92892
12536I2892J22656l9814j49787j66555K9129J29091p0505r405j6303l2436j1346
$$ 92892 215548 175734 25947 -140608 -111479 17612 -52893 -62298 -78601 -111037 -122383
12525a22383j1243R6063R1937r9899j16008J41350M7568l5259m8363K0291P5495
$$ -122383 -133626 -37563 54374 -45525 -161533 -20183 27385 -7874 -56237 -35946 39549
12514C9549m2105n9412J0246J1611l4231n1557m665O0212L8715K5653m7474n778
$$ 39549 -2556 -61968 -51722 -40111 -74342 -125899 -130564 -70352 -31637 -5984 -53458 -59236
12502e9236J43001P98p3968j7739n741p935K9757Q4776N3771j8651r6008m1724
$$ -59236 83765 84563 10595 -7144 -12885 -20820 8937 93713 147484 128833 32825 -8899
12490h899k41p3839n7683j700Q9178J4353M461J7018q6341R5268P8162m8048r918
$$ -8899 -9140 -82979 -140662 -142362 -53184 -38831 -34370 -17352 -103693 -8425 69737 21689 11771
12477A1771l7769r8986j043R4093M448K1323p7977j2446J5206Q7047j0134o132
$$ 11771 -25998 -124984 -126027 -31934 -27486 -6163 -84140 -96586 -81380 5667 -4467 -10599
12465a0599J0833J9772O8807K2547k1160K226j387K847j10474l9275O3262R6681
$$ -10599 234 20006 88813 111360 90200 92426 91039 93886 -16588 -55863 7399 104080
12453A04080N223r6716p3833O9974R6957L2696o8488Q4129O4184j1639m8742o7921
$$ 104080 109303 12587 -61246 8728 105685 138381 69893 154022 218206 206567 157825 89904
12441H9904j43055l6117N7110J22615O4372L7886N2906o4723j7003L3882o4583
$$ 89904 -53151 -89268 -32158 90457 154829 192715 245621 180898 163895 197777 133194
12430A33194M5710L9426k01415j28154m5312j101O4680J04836o5438J27867M2653
$$ 133194 178904 218330 16915 -111239 -156551 -157652 -92972 11864 -53574 74293 116946
12419A16946j5606m405m5307k5517o2815N4132J04465m1816q7969j409L8028M5433
$$ 116946 101340 96935 51628 26111 -36704 17428 121893 80077 -7892 -9301 28727 74160
12407G4160O6155n6542P2140o5012j00752P936M6754K4888n8271R2288P823O9869
$$ 74160 140315 83773 155913 90901 -9851 -1915 44839 69727 11456 103744 111567 181436
12395A81436R3876o6070n6550O8053n9430n6644P8010O377k7306p1440j4140J7774
$$ 181436 275312 209242 152692 220745 161315 104671 182681 189058 161752 90312 76172 93946
12383I3946L6784R477r942M7737P1148J0957m1983j585j03755r6359o4855j6905
$$ 93946 130730 140207 130265 178002 249150 260107 218124 216539 112784 16425 -48430 -65335
12371f5335R7879j4560P966J5446o0210K2424R30P685j145m155j0201m8141p4227
$$ -65335 32544 17984 25950 41396 -18814 3610 4540 12225 11080 6925 -3276 -51417 -125644
12358a25644Q5972J46388K0484j0823n3278k8719j3970o7655k9120O1519K2393
$$ -125644 -39672 106716 127200 116377 63099 34380 20410 -47245 -76365 -14846 7547
12347G547O2622N4644k2874l4432L9816j06159j9232l4373Q0295N01m663J4794
$$ 7547 70169 124813 101939 67507 107323 1164 -18068 -52441 27854 28355 23692 38486
12335C8486l6343n2709L8537J23561J11440N0458j01990q6186l5327L2767L279
$$ 38486 2143 -50566 -12029 111532 222972 273430 171440 85254 49927 82694 85973
12324H5973J23635n3698j42384L010L0791k993p2164o9103o3903q202R2982k8616
$$ 85973 209608 155910 13526 16536 47327 44334 -27830 -96933 -160836 -169038 -76056 -104672
12312a04672o036L4665Q7952J4667N4075K8041L395N3127J1398j06919j21295
$$ -104672 -110708 -76043 11909 26576 80651 108692 112087 165214 176612 69693 -51602
12301e1602j00740l4618K7895J01386L3769j56722N5581J48318P1078m4438P85
$$ -51602 -152342 -186960 -159065 -57679 -23910 -180632 -125051 23267 94345 49907 50692
12290E0692j4198p7145J5736O1955O9876M3082j38046q7669M3163M4485M4676
$$ 50692 36494 -40651 -24915 37040 106916 149998 11952 -75717 -32554 11931 56607
12279E6607Q073M6030m2922M4336m4853r6643j08662J6816Q7625O5788M7633k3199
$$ 56607 64680 110710 67788 112124 67271 -29372 -138034 -121218 -33593 32195 79828 56629
12267E6629P8752j2801j02010M5606o908l8612K4427o056n4482M3649j034j12219
$$ 56629 135381 122580 20570 66176 59268 20656 45083 39027 -15455 28194 27160 -85059
12255h5059K610R9493O8360j02602j17386J8467N9678Q236J673J2894m1107o4982
$$ -85059 -82449 17044 85404 -17198 -134584 -116117 -56439 -48203 -46530 -33636 -74743 -139725
12243a39725J0639M7816R7338Q9062J8012p9295k9889j6516J62831k016q7720
$$ -139725 -129086 -81270 16068 105130 123142 43847 13958 -2558 160273 158257 70537
12232G0537m4648l3427N482Q0771K0141J0932J1683J1102k6165n3585l657j7309
$$ 70537 25889 -7538 -2056 78715 98856 109788 121471 132573 106408 52823 49166 31857
12220C1857m5018q7069k2696K2447R8574Q1202m0133k1944m8855L9157O2339M4684
$$ 31857 -13161 -100230 -122926 -100479 -1905 79297 39164 17220 -31635 7522 69861 114545
12208A14545M085p0850L212M4907p5263P3349j5253P167P1200l3058n3020r0596
$$ 114545 118630 47780 50992 95899 20636 93985 78732 85899 157099 124041 71021 -19575
12196a9575Q303M3009k421M2133M6237J3366M6426M0836P941m6275j2021p7225
$$ -19575 -11272 31737 29316 71449 117686 131052 177478 218314 226255 179980 167959 90734
12184I0734l8328j7444j1720L7529J35134p0818r9060L7777N8669Q0797J9475
$$ 90734 52406 34962 23242 60771 195905 125087 26027 63804 122473 203270 222745
12173B22745p267k658j8450K8549r2228L6605l6721j3939n6004j8784j8296M2710
$$ 222745 215478 212820 194370 222919 130691 167296 130575 116636 60632 41848 23552 66262
12161F6262M3025J47326N5522o8820q4485M1348M7653m7413r4881R636P5968L6316
$$ 66262 109287 256613 312135 243315 158830 200178 247831 200418 105537 115173 191141 227457
12149B27457m4127k6295L7838j12762j97950J1423K9682m2221o3Q5284M8811J15741
$$ 227457 183330 157035 194873 82111 -115839 -104416 -74734 -116955 -117018 -31734 17077 132818
12137A32818K8934q8083q991k8790m8402k4902K5882K478k0855J6753J2156Q9599
$$ 132818 161752 73669 64678 35888 -12514 -37416 -11534 -9056 -29911 -13158 -1002 88597
12125H8597k4821m7943k7315J8215l5621n565K2274J54337J18183L922q2433j2292
$$ 88597 63776 15833 -11482 6733 -28888 -34453 -12179 142158 260341 264263 181830 169538
12113A69538n8790L3711j9868N3324J34327J12227O8545j4768p6398J1354m0011
$$ 169538 110748 144459 124591 177915 312242 424469 493014 478246 401848 413202 373191
12102C73191q9166j10090n7115r892J8891n172J5603M2429M5116o8059q2995P282
$$ 373191 284025 173935 116820 106928 125819 120647 136250 178679 223795 155736 72741 80023
12090H0023L06K7566J09167q843L6379J7321j7991j9831l4980K0202L3018M8968
$$ 80023 80329 107895 217062 208219 244598 261919 243928 224097 189117 209319 242337 291305
12078B91305j11574j28637j00478l4191P958M6175K2804J2037J04372o2706o6158
$$ 291305 179731 51094 -49384 -83575 -75617 -29442 -6638 5399 109771 47065 -19093
12067a9093N1417j4363j3092O0165J8239q5468n2345k4598R4924N7339k9845r266
$$ -19093 32324 17961 4869 65034 83273 -2195 -54540 -79138 15786 73125 43280 34014
12055C4014M7376R048o805P4680l7466j06216K1028N5892M0314j00323M0091k1423
$$ 34014 81390 90438 83633 158313 120847 14631 35659 91551 131865 31542 71633 50210
12043E0210p6266M9864J05278J56743M2003m5009K3830l3239q1256n0125M8349
$$ 50210 -26056 23808 129086 285829 327832 282823 306653 273414 192158 142033 190382
12032A90382L9842k008m3825o3303k8212Q939R2653K6866M3631J2800K2177P2756
$$ 190382 230224 228216 184391 121088 92876 101815 194468 221334 264965 277765 299942 372698
12020C72698n0573j4441l465L2116O0766k6811N0162K0692p0622k6482J04715
$$ 372698 322125 307684 304219 336335 397101 370290 420452 441144 370522 344040 448755
12009D48755J8105j98752m4072N1408j8942p8846r9392o1438j2914Q1039J50700
$$ 448755 466860 268108 224036 275444 256502 177656 78264 16826 3912 84951 235651
11998B35651L898m6322k009P5889M7081l1390j0193k3085o7953o3052j09105p3555
$$ 235651 239549 193227 191218 267107 314188 282798 272605 249520 181567 118515 9410 -64145
11986f4145L2660L2966o6755j4322M036J01767Q4579M9848J6160m2035p9447k1453
$$ -64145 -31485 1481 -65274 -79596 -75560 26207 110786 160634 176794 134759 55312 33859
11974C3859M3971O1630J3317k8936o6659p9467p469r7173o486J20900J16304m1060
$$ 33859 77830 139460 152777 123841 57182 -22285 -29754 -126927 -133413 -12513 103791 62731
11962F2731m6519Q479J0891J9269q0993l3194J14612O8895J02145J41377m5321
$$ 62731 16212 24691 35582 54851 -26142 -59336 55276 124171 226316 367693 322372
11951C22372j04007Q715p5683j38344l0098N6933L5493L103L4146N808P5534J21618
$$ 322372 218365 227080 151397 13053 -17045 39888 75381 78484 112630 118438 193972 315590
11939C15590M5827j64005n1674J96005N2231j09418J43763K4026k00777j45359
$$ 315590 361417 197412 145738 341743 393974 284556 428319 452345 251568 106209
11929A06209o147O6625N6634k7126m4266O2743M025K1624k3863m8293p1108j6812
$$ 106209 100062 166687 223321 196195 151929 214672 218697 240321 216458 168165 97057 80245
11917H0245k464m6640j7035k2472K4225Q2667J6149K9058K8195r7540n2238K849
$$ 80245 77781 31141 14106 -8366 15859 98526 114675 143733 171928 74388 22150 24999
11905B4999J07944L1983j9390J46082L4562r0373j19380j17972n2363J74493O3300
$$ 24999 132943 164926 145536 291618 326180 235807 116427 -1545 -53908 120585 183885
11894A83885k609j9357k9760j10724j15546M2240r943p325J15202m455J4772Q0844
$$ 183885 181276 161919 132159 21435 -94111 -51871 -61814 -69139 46063 41608 56380 137224
11882A37224K4656o4164o1153o2421L3841Q1580J49253O66j44195q8755M219M6365
$$ 137224 161880 97716 36563 -25858 7983 89563 238816 239482 95287 6532 10751 57116
11870E7116L9359K2549R206M6764j4891R5946J01069j1215j71285q9740M1556
$$ 57116 96475 119024 128230 174994 160103 256049 357118 345903 174618 84878 126434
11859A26434k2642J8513J15234J20193M5647q8452j21008j0011J01005o7611o4129
$$ 126434 103792 122305 237539 357732 403379 314927 193919 183908 284913 217302 153173
11848A53173M5291Q4337k6811m4591k6834J9217P5928M3920p3718j08171Q3950
$$ 153173 198464 282801 255990 211399 184565 203782 279710 323630 249912 141741 225691
11837B25691L7292o8365O9082L5875N4590p5489j38135J6927J09513J40614m0727
$$ 225691 262983 194618 263700 299575 354165 278676 140541 157468 266981 407595 366868
11826C66868j89502p2421K6118m8688J01259Q1915m2352L010O6115M8158n5573
$$ 366868 177366 104945 131063 82375 183634 265549 223197 226207 292322 340480 284907
11815B84907j46216p5584M3623O5623o3848j7951j8432k16J953J8794j3280O4089
$$ 284907 138691 63107 106730 172353 108505 90554 72122 71906 73859 92653 79373 143462
11803A43462P9705K3597m0964j06323k2461l7704L378j2021o4432q6444L0561
$$ 143462 223167 246764 205800 99477 77016 39312 42690 30669 -33763 -120207 -89646
11792h9646N4584J13176P3036N5363j5729j5228j2106J10498M0765r1040R367
$$ -89646 -35062 78114 151150 206513 190784 175556 163450 273948 314713 223673 233040
11781B33040L3001J73094J6445j66090p8599M8352Q791L3723r1095o5058K5124
$$ 233040 266041 439135 455580 289490 210891 259243 268034 301757 210662 145604 170728
11770A70728J0295O8892o704m2536M4211J21571j63306j52674N0292J44213L2028
$$ 170728 181023 249915 243211 200675 244886 366457 203151 50477 100769 244982 277010
11759B77010O6401r7265k2652j3551K8957J05678J7533J22250K9427n5586R7392
$$ 277010 343411 246146 223494 209943 238900 344578 362111 484361 513788 458202 555594
11748E55594K7247k6881l7941k0809K6509J9330r5774o2701m7692P5952m3875
$$ 555594 582841 555960 518019 497210 523719 543049 447275 384574 336882 412834 368959
11737C68959O242P5302J01322P0994j00490q2735K3682l7255P5225M1929p5712
$$ 368959 375201 450503 551825 622819 522329 439594 463276 426021 501246 543175 467463
11726D67463P6768J07149O8931J9397j676o6658l0174M0964P8941L7425M0731
$$ 467463 544231 651380 720311 739708 738032 671374 641200 682164 761105 798530 839261
11715H39261J76547J33312j5287N256O9076k956N7263P6108N8713J51025J33863
$$ 839261 1015808 1149120 1133833 1139089 1208165 1205209 1262472 1338580 1397293 1548318 1682181
11704A682181P1189N5340p742j0614K26245K53764K10375K41374L25449K93498
$$ 1682181 1753370 1808710 1800968 1790354 2016599 2270363 2480738 2722112 3047561 3341059
11694C341059L44313M01740O47433P36479Q16771J002836J311506J714035K001083
$$ 3341059 3685372 4087112 4734545 5471024 6287795 7290631 8602137 10316172 12317255
11685A2317255K552850L081807L651574M456012M867815M316601K699564M07321
$$ 12317255 14870105 17951912 21603486 26059498 30927313 35243914 37943478 38350799
11677C8350799j714485k924336l290679l214718k776046k074229j606379j077007
$$ 38350799 36636314 33711978 30421299 27206581 24430535 22356306 20749927 19672920
11669A9672920l72031K46857R37424J700966K471872L147009L583840L690899
$$ 19672920 19300889 19547746 20485170 22186136 24658008 27805017 31388857 35079756
11661C5079756L298761K080377K08923j757437l005337l426137l513647l203604
$$ 35079756 38378517 40458894 40667817 38910380 35905043 32478906 28965259 25761655
11653B5761655k924148k740465k468842k197120j884322j487535j261113r96933
$$ 25761655 22837507 20097042 17628200 15431080 13546758 12059223 10798110 9801177
11645I801177q66921p73913n58840m76207l04864k39258k39461j83414j78142
$$ 9801177 8934256 8160343 7601503 7125296 6820432 6581174 6341713 6158299 5980157
11636E980157j72918o6864J3004J5575R214N5208J07282N4472J57628J61086K62657
$$ 5980157 5807239 5740375 5753379 5768954 5778168 5833376 5940658 5995130 6152758 6313844 6576501
11625F576501M38811N48034O46783P56877P65106J098913J487629J853813K273325
$$ 6576501 7015312 7563346 8210129 8967006 9732112 10831025 12318654 14172467 16445792
11616A6445792K648683L166875L765867M360336M733329M353068L329993J375393
$$ 16445792 19094475 22261350 26027217 30387553 35120882 39473950 42803943 44179336
11608D4179336l19188j358850j797087j992307j940225j598115j004927j8261
$$ 44179336 43860148 42501298 40704211 38711904 36771679 35173564 34168637 34150376
11600C4150376R52834K188493L637246N109269O465310P210322O852979N295919
$$ 34150376 35103210 37291703 40928949 46038218 52503528 59713850 66566829 71862748
11592G1862748L157900Q69877j895008m590905o429080o895884o218220m914473
$$ 71862748 75020648 75890525 73995517 69404612 62975532 56079648 49861428 44946955
11584D4946955l821813k743962j592270o76744K24608Q41502J275879J411938
$$ 44946955 41125142 38381180 36788910 36112166 36336774 37178276 38454155 39866093
11576C9866093J440652J023839n7971j525419k957996l632747l566918l301017
$$ 39866093 41306745 42330584 42272613 40747194 37789198 34156451 30589533 27288516
11568B7288516l075983k891986k404802j978754j653105j501639j320255j128450
$$ 27288516 24212533 21320547 18915745 16936991 15283886 13782247 12461992 11333542
11560A1333542q50412p61710n40302n73049n05699l55846l15870l14692l07261
$$ 11333542 10483130 9721420 9181118 8608069 8102370 7746524 7430654 7115962 6808701
11551F808701j92586j19809k10580j24759o1896m0930j7890L2066Q78J94991L02347
$$ 6808701 6616115 6496306 6285726 6160967 6099071 6058141 6040251 6072317 6073195 6268186 6570533
11540F570533L58572L83128M47564N52875P43853J169764J415462J618638K005249
$$ 6570533 6929105 7312233 7759797 8312672 9056525 10226289 11641751 13260389 15265638
11531A5265638K411889K645950L006428L484783L948737M165925L417900J796848
$$ 15265638 17677527 20323477 23329905 26814688 30763425 34929350 38347250 40144098
11523D0144098k84128k047846l034664l309717l275061k947347k372077j656940
$$ 40144098 39859970 37812124 34777460 31467743 28192682 25245335 22873258 21216318
11515B1216318r69774k64764M73561J048321J763205K376314K912384L480805
$$ 21216318 20246544 19981780 20455341 21503662 23266867 25643181 28555565 32036370
11507C2036370L584773L162706J734195n93850k762567m140053m364926l927469
$$ 32036370 35621143 38783849 40518044 39924194 37161627 33021574 28656648 24729179
11499B4729179l398012k844217k197818j869493j706467j468084j171443j081524
$$ 24729179 21331167 18486950 16289132 14419639 12713172 11245088 10073645 8992121
11491H992121r48076p61226n95037n46489o36513m52391l17639k53493k11980
$$ 8992121 8044045 7282819 6687782 6141293 5504780 5052389 4734750 4481257 4269277
11482D269277l52307k31882j61387k03452k43386j73639j7673n1976j71035q5508
$$ 4269277 3916970 3685088 3523701 3320249 3076863 2903224 2885551 2833575 2662540 2577032
11472B577032j5128m0216m536m570k751p4763q097p2229j33271p0433n1869j28275
$$ 2577032 2561904 2521688 2517152 2512582 2509831 2435068 2426971 2354742 2221471 2151038 2099169 1970894
11460A970894j13278j07235K4225J05483Q7960N9693K0406J831K9906K8757L0940
$$ 1970894 1857616 1750381 1774606 1880089 1968049 2027742 2048148 2049979 2079885 2108642 2139582
11449B139582j8833j08605k2043p7090P9831K53033J92966J58837J96923K15827
$$ 2139582 2120749 2012144 1990101 1913011 1992842 2245875 2438841 2597678 2794601 3010428
11439C010428L02495M66518O18765Q73656J053938J256057J173425R15838L71405
$$ 3010428 3312923 3779441 4398206 5271862 6325800 7581857 8755282 9671120 10042525
11430A0042525k06886n89340q78614r07633q81708p46276o01383l87368l42785
$$ 10042525 9835639 9246299 8367685 7460052 6578344 5832068 5230685 4843317 4500532
11421D500532j96668l4077L1935J03389J62599J50678L18687N65259P72358Q98959
$$ 4500532 4303864 4269787 4301722 4405111 4567710 4718388 5037075 5602334 6374692 7273651
11411G273651J325332J939227K322424K598442K450256J677748N57441r29100
$$ 7273651 8598983 10538210 12860634 15459076 17909332 19587080 20144521 19215421
11403A9215421j942493k227512k130796j850695j513880j072732q56909p00153
$$ 19215421 17272928 15045416 12914620 11063925 9550045 8477313 7620404 6920251
11395F920251n18626l63279l01363k35832l1012j46401M7270K29351K36822L87912
$$ 6920251 6401625 6038346 5736983 5501151 5470139 5323738 5371008 5600359 5837181 6225093
11385F225093Q52247J118437J250675J490807J326732Q08516J90185n72040j011854
$$ 6225093 7077340 8195777 9446452 10937259 12263991 13072507 13262692 12690652 11678798
11376A1678798j106764q99039o26849k50492K7018N02561R03046J425415J950292
$$ 11678798 10572034 9672995 9046146 8795654 8822672 9325233 10228279 11653694 13603986
11367A3603986K622359K904500K488915J424940k9793j485698k265868k469010
$$ 13603986 16226345 19130845 21619760 23044700 23014907 21529209 19263341 16794331
11359A6794331k281761j853612j391398r37157p34522m25107l25584j68751J11206
$$ 16794331 14512570 12658958 11267560 10330403 9595881 9170774 8845190 8676439 8787645
11350H787645L03421L86964O62047R55808J283854J865386K677452L663434M867010
$$ 8787645 9091066 9478030 10140077 11095885 12379739 14245125 16922577 20586011 25453021
11341B5453021N780882N779596M469659K070113j092849l697282n147311n151628
$$ 25453021 31233903 37013499 41483158 43553271 42460422 38763140 33615829 28464201
11333B8464201m601503l627445k763757k156434j653070j245890j011575p58623
$$ 28464201 23862698 20235253 17471496 15315062 13661992 12416102 11404527 10645904
11325A0645904n33770l19243j63037J07790L72539M54728P67869J187091J750930
$$ 10645904 10112134 9792891 9629854 9737644 10110183 10564911 11332780 12519871 14270801
11316A4270801K350615K726918K537437J935389N68039q99631j960158k535379
$$ 14270801 16621416 19348334 21885771 23821160 24389199 23489568 21529410 18994031
11308A8994031k591875k265521j622304j007268p78700n24086J4118O91896J158422
$$ 18994031 16402156 14136635 12514331 11507063 10728363 10204277 10218395 10910291 12068713
11299A2068713J485356J443379P92771j110p92590j289982j579340j607647j434028
$$ 12068713 13554069 14997448 15790219 15789109 14996519 13706537 12127197 10519550 9085522
11290I085522j018722o48409m17360m11795l52416k21510J9437J36786J20126
$$ 9085522 8066800 7418391 7001031 6589236 6236820 6015310 6034747 6171533 6291659
11281F291659K44120L14834N51438Q31697J313553J821924K482883K839029L208208
$$ 6291659 6535779 6850613 7402051 8233748 9547301 11369225 13852108 16691137 19899345
11272A9899345K905408J738430r4597j641073k674553l048774k840087k279010
$$ 19899345 22804753 24543183 24448586 22807513 20132960 17084186 14244099 11965089
11264A1965089j729607j333533j007283p64381o03776m57593k85963k09563K383
$$ 11965089 10235482 8901949 7894666 7130285 6526509 6068916 5782953 5573390 5575773
11255E575773R02M5584J93954L03576N56553R01488J066136J216951J305042J212232
$$ 5575773 5576675 5622259 5816213 6119789 6676342 7577830 8643966 9860917 11165959 12378191
11245A2378191N63429k63532r33473j261569j559182j366795j056940q95344p79754
$$ 12378191 12941620 12678088 11744615 10483046 8923864 7557069 6500129 5604785 4825031
11236D825031o17350m32190l02052l04813l01488j46385j66013j00008j39630
$$ 4825031 4207681 3775491 3473439 3168626 2867138 2720753 2554740 2454732 2315102
11227B315102k11164k30972m1419q7494j09158m1403p2532p3109l6895o5032k8978
$$ 2315102 2103938 1872966 1831547 1744053 1634895 1593492 1520960 1447851 1410956 1345924 1316946
11216A316946j23689j03913q0897m0021K5927q716j89258o6824P9374Q5095N7377
$$ 1316946 1193257 1089344 1008447 968426 994353 985637 796379 729555 808929 894024 951401
11205I51401p0181n8690k6504l0038n9675l6180k7119R3978L2771l4264j609l1067
$$ 951401 881220 822530 796026 765988 706313 670133 643014 736992 769763 735499 733890 702823
11193G02823j59456N813L4564R199J8529m5457m2084N0464M313r343K1363J16580
$$ 702823 543367 549180 583744 592943 611472 566015 523931 574395 578708 569365 590728 707308
11181G07308j06265k5702o6514n8431P7394J26006q39l5978l4317Q520J7649N2225
$$ 707308 601043 575341 508827 450396 527790 653796 652957 616979 582662 591182 608831 661056
11169F61056J73412j28578j22393r6665l2049M2273J15097J26556O3172j16961
$$ 661056 834468 705890 583497 486832 454783 497056 612153 738709 801881 684920
11159F84920p4043R924m3852j22000Q3084L2575m8038j8803O0087J3044n3785
$$ 684920 610877 620801 576949 454949 538033 570608 522570 503767 563854 576898 523113
11148E23113o2526k2329M7510j3386J3366r9202J7713P4260J15L4205L2763j1585
$$ 523113 460587 438258 485768 472382 485748 386546 404259 478519 478634 512839 545602 534017
11136E34017o8779m459j7597j51015m6143l0567p4789p6152l4280Q1837M6324
$$ 534017 465238 460779 443182 292167 246024 215457 140668 64516 30236 112073 158397
11125A58397l8889N2748R5213k1372m0270r649k9538l2976q7335p4895K1835J11404
$$ 158397 119508 172256 267469 246097 205827 196178 166640 133664 46329 -28566 -6731 104673
11113A04673N6939M097p24p1489m0994P1879K6489o7902l7683M7763O7751k4822
$$ 104673 161612 165709 164985 93496 52502 124381 150870 82968 45285 93048 160799 135977
11101A35977k9734J1242m7311L6417K6019k1519N0159J29165P2265o9747o9743
$$ 135977 106243 117485 70174 106591 132610 111091 161250 290415 362680 292933 223190
11090B23190o8820n7026j9567Q637k5614K5429Q6275P1482J45248l3413k2788
$$ 223190 154370 97344 77777 86414 60800 86229 172504 243986 389234 355821 333033
11079C33033q6587j29294R3348j7438m9489k2772J07829j4960P0576Q2092L5103
$$ 333033 246446 117152 210500 193062 143573 120801 228630 213670 284246 366338 401441
11068D01441j08723l9134J8768p2873q6857Q0903M232p7792j1694l8159j09478
$$ 401441 292718 253584 272352 199479 112622 193525 197757 119965 108271 70112 -39366
11057c9366n546J02898N0216N081o6779K1639l1699m4013L7248j2485M4361K7096
$$ -39366 -44912 57986 108202 113283 46504 68143 36444 -7569 29679 17194 61555 88651
11045H8651m4573j2083J00245J3371p6130J7126n1402k0116l2981m5161K5365
$$ 88651 44078 31995 132240 145611 69481 86607 35205 15089 -17892 -63053 -37688
11034c7688l1528j0377N1914J51676q9088l8533q6066k1243o6086O9812J36857
$$ -37688 -69216 -79593 -27679 123997 34909 -3624 -89690 -110933 -177019 -107207 29650
11023B9650J64288M3329n4008n2146p6209p66J14548O7392q5087k3775l548N0636
$$ 29650 193938 237267 183259 131113 54904 54138 168686 236078 150991 127216 123668 174304
11011A74304J7246l6391j8262o2460q0319r655O5134J28042J3575j34470o4846
$$ 174304 191550 155159 136897 74437 -5882 -15537 49597 177639 191214 56744 -8102
11000h102n86K4823m2842N6767K4511M7928J07888K4441j39492l787M3911J0500
$$ -8102 -8688 16135 -26707 30060 54571 102499 210387 234828 95336 91549 135460 145960
10988A45960n5970p4344R24n0021K5312J78392M4790N5197j7829k2771q1128O360
$$ 145960 89990 15646 16570 -33451 -8139 170253 215043 270240 252411 229640 148512 154872
10976A54872M358n8150N2277j8924J0313J0550p4081N2267O3161m578J5988m2792
$$ 154872 159230 101080 153357 134433 144746 155296 81215 133482 196643 192065 208053 165261
10964A65261n3972R499n1814J0855P688j2111o7768J01502N1207k6812m6907n4539
$$ 165261 111289 120788 68974 79829 87517 75406 7638 109140 160347 133535 86628 32089
10952C2089J7518R4147o1986o259L0230Q0126o0398m3611p410M6589J8089p1207
$$ 32089 49607 143754 81768 75509 105739 185865 125467 81856 74446 121035 139124 67917
10940F7917n6351k4326M7835O3985p1228M6404J23053J6351K3024l2456M9091
$$ 67917 11566 -12760 35075 99060 27832 74236 197289 213640 236664 204208 253299
10929B53299N9980j9056L8445O0182Q601m1207O6502O5696m1292r4296j03036
$$ 253299 313279 294223 332668 392850 401451 360244 426746 492442 451150 356854 253818
10918B53818q6728o7571L7761O9919n6914p5661l0501L029Q0949Q4617k523r0273
$$ 253818 167090 99519 137280 207199 150285 74624 44123 47152 128101 212718 210195 119922
10906A19922L5897Q5032K9165r6351j04584O2679Q0121p6315M7310O447O3821
$$ 119922 155819 240851 270016 173665 69081 131760 211881 135566 182876 189323 253144
10895B53144J49358K3719p4202j19579m4658N135J2845O4063o6169j05733K9856
$$ 253144 402502 426221 352019 232440 187782 192917 205762 269825 203656 97923 127779
10884A27779O5524J2159P5588l5176m3668j08221l9000m0374K5665R8654M0363
$$ 127779 193303 205462 281050 245874 202206 93985 54985 14611 40276 138930 179293
10873A79293J9185M077q4035N179N9769Q4139K9308o4287r375M2794L7890J322
$$ 179293 198478 202555 118520 123699 183468 267607 296915 232628 223253 266047 303937 305259
10861C05259j12278K4828p180Q9672J3548j34767q0629M9510R093K0668O3283
$$ 305259 192981 217809 210629 300301 313849 179082 98453 147963 157056 177724 241007
10850B41007l309j00367K0973k3792j5434j4102j5214j7159k5027o7505N5836
$$ 241007 237698 137331 158304 134512 119078 104976 89762 72603 47576 -19929 35907
10839C5907K0665K8160M1633r0004n6469J40870J46058j2858k18812K7363J43765
$$ 35907 56572 84732 126365 36361 -20108 120762 266820 253962 35150 62513 206278
10828B06278J532j48470j13946k215L0463n3728n1112q6611J30860Q5983Q3830
$$ 206278 207810 59340 -54606 -56821 -26358 -80086 -131198 -217809 -86949 -966 82864
10817H2864m3869J5607O2450O7281J06426k1092j30820m4805K2575k9874J42143
$$ 82864 38995 54602 117052 184333 290759 269667 138847 94042 116617 86743 228886
10806B28886J42037n6790o4556J1872k9226j040L860m6319K4058P1245K6313n8886
$$ 228886 370923 314133 249577 261449 232223 231183 235043 188724 212782 284027 310340 251454
10794B51454J5812k6119J2479J25546P0470Q4236J23471R8207K99843M65562M00427
$$ 251454 267266 241147 253626 379172 449642 533878 657349 755556 1055399 1520961 1921388
10783A921388K87031K90566K55444J66797j04632k08001k08506k85324k99471
$$ 1921388 2208419 2498985 2754429 2921226 2816594 2608593 2400087 2114763 1815292
10774A815292l79860l23792l64917j46595r833l5866q5989q3002j393l9089j06864
$$ 1815292 1435432 1111640 746723 600128 590295 554429 468440 385438 384045 344956 238092
10763B38092o0148Q5732K0215j1591k006q523j6806L4492J0116l353J1376o3146
$$ 238092 177944 263676 283891 272300 270294 261771 244965 279457 289573 286220 297596 234450
10751B34450l003J31729M2996l6030L8966P667N1514n509p2763j36281j02938
$$ 234450 231447 363176 406172 370142 409108 416775 468289 462780 390017 253736 150798
10740A50798J19465P8889p5809p1308P178J05419L3167j08779l8185K5274K1392
$$ 150798 270263 349152 273343 202035 209213 314632 347799 239020 200835 226109 247501
10729B47501l6625p6678k7921N4549L5788K3622K1981K8906q3936p8827k2403
$$ 247501 210876 134198 106277 160826 196614 220236 242217 271123 187187 108360 85957
10718H5957L3481K6008N2555J3023n7352j41214L1174O0321L2926l6058n4757
$$ 85957 119438 145446 198001 211024 153672 12458 43632 103953 136879 100821 46064
10707D6064n4719M5332J10016j9941o9682P9774M2149n891m6590m7936j5753k5843
$$ 46064 -8655 36677 146693 126752 57070 136844 178993 173102 126512 78576 62823 36980
10695C6980k3601n4162J19201J44576J68668K6934n8537K0621l1385j09763l951
$$ 36980 13379 -40783 78418 222994 391662 418596 360059 380680 349295 239532 235581
10684B35581K1038O2452n172o0511n7487M0527J7214O6744j09834j07297p8415
$$ 235581 256619 319071 313899 253388 195901 236428 253642 320386 210552 103255 24840
10673B4840J75475P9161k5829J2435J0668m6332p1313p7926K529N4217Q5719m1953
$$ 24840 200315 279476 253647 266082 276750 230418 159105 81179 83708 137925 223644 181691
10661A81691m9467K7298K5011K7758q3858o2985K404J30366O4136k9210K8050
$$ 181691 132224 159522 184533 212291 128433 65448 67852 198218 262354 233144 261194
10650B61194q8398L8118O1215m9567m9952n9102m0117R0159R8251J2616K6491
$$ 261194 172796 210914 272129 222562 172610 113508 73391 163550 261801 274417 300908
10639C00908Q9106K4937N6910J68967Q0166P7464m013j14343l2743o1394p0216
$$ 300908 390014 414951 471861 640828 720994 798458 794445 680102 647359 585965 515749
10628E15749k12622j25021j1593M2826L0577K7049r095p2p30m3039J7480R1485
$$ 515749 303127 178106 166513 209339 239916 266965 257870 257798 257068 214029 231509 322994
10616C22994P604n2116k9305m6756j7891m9356p5507M4876Q4730J12203p1018
$$ 322994 330598 278482 249177 202421 184530 135174 59667 104543 189273 301476 230458
10605B30458p1875j7852r1948l8004Q5767P7500R8082P279J5427r6123k6089J7240
$$ 230458 158583 140731 48783 10779 96546 174046 272128 279407 294834 198711 172622 189862
10593A89862j4968L2426l7063J6610J03654R3590p8026m247L1461l3926r5336
$$ 189862 174894 207320 170257 186867 290521 384111 306085 301838 333299 299373 204037
10582B04037o9508Q804m0446r2218P1979o9153l7912j170m9398O6950P6674N9912
$$ 204037 134529 143333 102887 10669 82648 13495 -24417 -25587 -74985 -8035 68639 128551
10570A28551N3269J53049J29306k2439q4440j13704N0551Q4419N346l9729j9830
$$ 128551 181820 334869 464175 441736 357296 243592 294143 378562 383908 344179 324349
10559C24349N4658R4783M2046J1666q0327r6024l0560o6939O502P5112n0021j6696
$$ 324349 379007 473790 515836 527502 447175 351151 320591 253652 260154 335266 285245 268549
10547B68549P2019L5192n3233Q13J2828J2857P0751K7878P2104J40799L166R989
$$ 268549 340568 375760 322527 323340 336168 349025 419776 447654 519758 660557 663723 673712
10535F73712p4599m5948m0963J8454m8512l3471m876P453K0122o131j35825O5209
$$ 673712 599113 553165 512202 530656 482144 448673 443797 451250 471372 465241 329416 394625
10523C94625J35475R8488P278l5866M58N2623o3133l3349K2726R2833K34601K0497
$$ 394625 530100 628588 635866 600000 600458 653081 589948 556599 579325 672158 906759 927256
10511I27256M359m966j7497n4831N3257M8897r8714o993r220o9602o7081O8127
$$ 927256 931615 926649 909152 854321 907578 956475 857761 850768 841548 771946 704865 772992
10499G72992j5098o9018m9671Q2886J4213j5404l9877K4206j8361q7859k7928
$$ 772992 757894 688876 639205 722091 736304 720900 681023 705229 686868 599009 571081
10488E71081m215Q7920J85711J27373J4412j08384j13614n6089k9050K4265k1064
$$ 571081 566866 654786 840497 967870 982282 873898 760284 704195 675145 699410 678346
10477F78346J8172k9808K3251M7439K1762k7927j387K4503J16463J07125J7280
$$ 678346 696518 666710 689961 737400 759162 731235 729848 754351 870814 977939 995219
10466I95219j6369J5956J03251J1219N8776Q135j01261J34772J01773M3194J668
$$ 995219 978850 994806 1098057 1109276 1168052 1176187 1074926 1209698 1311471 1354665 1356333
10455A356333K3541J10502Q643k0816L7101P911P4251j6829k2468O3725k8214
$$ 1356333 1379874 1490376 1499019 1478203 1515304 1523215 1597466 1580637 1558169 1621894 1593680
10444A593680m5246J2544L7847J5161J1255Q8254J54848Q8268M313J7890J58434
$$ 1593680 1548434 1560978 1598825 1613986 1625241 1713495 1868343 1956611 1960924 1978814 2137248
10433B137248P7682M5785J31503J74561R5762K04423J08537N2193Q5413P2168
$$ 2137248 2214930 2260715 2392218 2566779 2662541 2866964 2975501 3027694 3113107 3185275
10423C185275J1271Q6001J74464R1056L06262K33653K12335K18793K53817K95703
$$ 3185275 3196546 3282547 3457011 3548067 3854329 4087982 4300317 4519110 4772927 5068630
10413E068630L38238M13576M66958N00017M23849N34610O39179P16081R55312
$$ 5068630 5406868 5820444 6287402 6787419 7211268 7745878 8385057 9101138 10056450
10404A0056450J156216J170171J052897J338271J633020J684567J587290J813978
$$ 10056450 11212666 12382837 13435734 14774005 16407025 18091592 19678882 21492860
10396B1492860K153341K670319L216747L879046M890891O661217R522966J3712386
$$ 21492860 23646201 26316520 29533267 33412313 38303204 44964421 54487387 68199773
10388F8199773K0496233L2189138M9980382O8856852P3246529N4514007M5605074
$$ 68199773 88696006 120885144 170865526 239722378 312968907 367482914 413087988
10381D13087988O1583209N2440380o004807n1984589m4639002l5710736n6811568
$$ 413087988 474671197 527111577 521106770 469122181 424483179 388772443 331960875
10374C31960875p3819746o1364901m2825719l0031035k1500597j5779559j2010681
$$ 331960875 258141129 196776228 153950509 123919474 102418877 86639318 74628637
10367G4628637r350367p555993o385289n154870m124895l629283l181315k696117
$$ 74628637 65278270 57722277 51336988 46182118 42057223 38427940 35246625 32550508
10359C2550508k291459k147441k046559j641600j475682j409674j414193j243549
$$ 32550508 30259049 28111608 26065049 24423449 22947767 21538093 20123900 18880351
10351A8880351j053875q01976p99152q24262o86992p72171q10322o26294n57812
$$ 18880351 17826476 17024500 16225348 15401086 14714094 13941923 13131601 12505307 11947495
10342A1947495n41235n51781m52629k59310k73219k66130m20950l44409j99619
$$ 11947495 11406260 10854479 10401850 10142540 9869321 9603191 9182241 8837832 8638213
10333H638213k48930j99499k81544l06985k67827k87431k47531j90459j42393
$$ 8638213 8389283 8189784 7908240 7601255 7333428 7045997 6798466 6608007 6465614
10324F465614j48029k28758j19940j13637k19679j01735o9651j61173k01641k25299
$$ 6465614 6317585 6088827 5968887 5855250 5635571 5533836 5464185 5303012 5101371 4876072
10314D876072k61677r4477j4337k8332j69611q3791m3316p9510j24632j27469
$$ 4876072 4614395 4519918 4505581 4477249 4307638 4223847 4180531 4101021 3976389 3848920
10304C848920o8810j03921j62334j48808j46028k8173o4857o4528p0846L3933
$$ 3848920 3780110 3676189 3513855 3365047 3219019 3190846 3125989 3061461 2990615 3024548
10294C024548k1221n3523r4239m8469j40791j66637q6734j7429j20815n1521j3192
$$ 3024548 3003327 2949804 2855565 2807096 2666305 2499668 2412934 2395505 2274690 2223169 2209977
10283B209977l6312o1914m0866n6453L389Q5330p1396j9612M1321L6393j9311
$$ 2209977 2173665 2111751 2070885 2014432 2017821 2103151 2031755 2012143 2053464 2089857 2070546
10272B070546L9966Q7160N7594n7810j75590k1310N5665k01635j46269j54285
$$ 2070546 2110512 2197672 2255266 2197456 2021866 2000556 2056221 1854586 1708317 1554032
10262A554032j3235J09900P2968r9164p1575k8526P2565J10968o40K9192M7153
$$ 1554032 1540797 1650697 1723665 1624501 1552926 1524400 1596965 1707933 1707293 1736485 1783638
10251A783638l3276j89408o2459M5035L096r1301p6080j58280j09591L6931k2815
$$ 1783638 1750362 1560954 1498495 1543530 1546626 1455325 1379245 1220965 1111374 1148305 1125490
10240A125490m4533J2928Q107J45483K275P234P745p8586m6137J3501Q383R6641
$$ 1125490 1080957 1093885 1101992 1247475 1249750 1256984 1264729 1186143 1140006 1153507 1161890 1258531
10228A258531R750j19351k2465j1220m0278L701j9368N1633l6273j23200j883
$$ 1258531 1268281 1148930 1126465 1115245 1074967 1078668 1059300 1110933 1074660 951460 949577
10217I49577N3434r2654j3536j9885k5973J3388R0132l3942k3309Q7902N8794
$$ 949577 1003011 910357 896821 876936 850963 864351 954483 920541 897232 985134 1043928
10206A043928j6353m3665L5530l9664L8120O7556p9966r4172j06532p6000m0714
$$ 1043928 1027575 983910 1019440 979776 1017896 1085452 1005486 911314 804782 728782 688068
10195F88068r900J5613J04141N0883J28991J04271n5749M9273M9923K8572J9064
$$ 688068 678168 693781 797922 848805 977796 1082067 1026318 1075591 1125514 1154086 1173150
10184A173150O2925P7398j446l5270L4098R7804J16862N7054J20168P7713K0766
$$ 1173150 1236075 1313473 1312027 1276757 1310855 1408659 1525521 1582575 1702743 1780456 1801222
10173A801222L8975J54779J76612Q0263J99147L42727L96013L43817L74638N13286
$$ 1801222 1840197 1994976 2171588 2251851 2450998 2793725 3189738 3533555 3908193 4421479
10163D421479O76023Q27067Q22739R28609R45101P31540O69654M79583N11217
$$ 4421479 5097502 5924569 6747308 7675917 8621018 9352558 10022212 10501795 11013012
10154A1013012M57005M72008L37415K60970L13349K39827J64247m5680j66068
$$ 11013012 11470017 11942025 12279440 12540410 12853759 13093586 13257833 13212153 13046085
10145A3046085l21504p0410K42589N67359R13996J239889J443198J557889J593839
$$ 13046085 12724581 12654171 12896760 13464119 14378115 15618004 17061202 18619091 20212930
10136B0212930J741727J863767J944495J866560J797953J418316R69585L36593
$$ 20212930 21954657 23818424 25762919 27629479 29427432 30845748 31815333 32151926
10128C2151926p2596l37586o99152r21883q83745q30699p59447q99267r67845
$$ 32151926 32079330 31741744 31042592 30120709 29236964 28406265 27646818 26747551 25779706
10119B5779706r60524q89320l97101K03721P42267J219696J375907J323009J061541
$$ 25779706 24819182 23929862 23532761 23736482 24478749 25698445 27074352 28397361 29458902
10110B9458902Q40410P15852P44013O73674N51447K92932L9327l36694p00912
$$ 29458902 30299312 31015164 31759177 32432851 32984298 33277230 33316557 32979863 32278951
10101C2278951j099409j492088j758956j842768j751287j572732j316786j261978
$$ 32278951 31179542 29687454 27928498 26085730 24334443 22761711 21444925 20182947
10093B0182947j181990j001367p62543l61115l3421L10337M32439L98120L82309
$$ 20182947 19000957 17999590 17237047 16875932 16842511 17152848 17585287 17983407 18365716
10084A8365716J92898Q187k1584J05214K94563M59874P70036J091027J359179
$$ 18365716 18558614 18566801 18545217 18650431 18944994 19404868 20174904 21265931 22625110
10075B2625110J065140N69814K4812l49576l28636l2888J73377L79789N43689
$$ 22625110 23690250 24260064 24284876 23935300 23606664 23573776 23747153 24126942 24670631
10066B4670631N72193N17271J85963j70994m80813p75901o92189k32113J01443
$$ 24670631 25242824 25760095 25946058 25775064 25294251 24518350 23826161 23594048 23695491
10057B3695491O60515J167910J565370J919450K016191K306423K726974K982332
$$ 23695491 24356006 25523916 27089286 29008736 31024927 33331350 36058324 39040656
10049C9040656K990832K732271K312217J775551J294564Q87898K77867k53190
$$ 39040656 42031488 44763759 47075976 48851527 50146091 51033989 51311856 51058666
10041E1058666n02069o05427p07284r71323j443883j973053k119228k019051j679399
$$ 51058666 50556597 49951170 49243886 48272563 46828680 44855627 42736399 40717348 39037949
10032C9037949r04212k02037N70323J114268J208365J149939J045811J025389
$$ 39037949 38133737 37931700 38502023 39616291 40824656 41974595 43020406 44045795
10024D4045795J186683J476387J459649J262101R77009K64001n39672j344683
$$ 44045795 45232478 46708865 48168514 49430615 50407624 50671625 50131953 48787270
10016D8787270k106641k509230k574198k529498k427000k438879k586231k396241
$$ 48787270 46680629 44171399 41597201 39067703 36640703 34201824 31615593 29219352
10008B9219352k121098j859233j348407q21703m15363j31542j3909p6817p3017
$$ 29219352 27098254 25239021 23890614 23068911 22653548 22522006 22508097 22431280 22358263
9999B2358263l84852n99328n09854m00207n46269n41438m38887n62962p55079
$$ 22358263 21973411 21374083 20864229 20464022 19917753 19376315 18937428 18374466 17619387
9990A7619387j035564j239921j395986j375568j316632j071261q42108p18361
$$ 17619387 16583823 15343902 13947916 12572348 11255716 10184455 9342347 8623986
9982H623986n60672l95573j76929p14l1808j09941j99263J4950q385k88279m04124
$$ 8623986 8063314 7667741 7490812 7490098 7458290 7348349 7149086 7164036 7155651 6867372 6463248
9971F463248m02023m59261n19825n03152m03813l18948l76114k31430j29329j10516
$$ 6463248 6061225 5601964 5082139 4578987 4175174 3856226 3480112 3248682 3119353 3008837
9961C008837j37940j05993k36285j09688j8809L3297j48377j5649J0752n1905
$$ 3008837 2870897 2764904 2528619 2418931 2400122 2433419 2285042 2269393 2280145 2228240
9951B228240l3369k4906p4026j20594m9860n5440n8740l0431m9464n4601o8363
$$ 2228240 2194871 2169965 2095939 1975345 1925485 1870045 1811305 1780874 1731410 1676809 1608446
9940A608446o5050j3423k2894o2473Q2860o5038j69835o1223m0355L5009M3682
$$ 1608446 1543396 1529973 1507079 1444606 1527466 1462428 1292593 1231370 1191015 1226024 1269706
9929A269706N747N0164j59507j13906q660L876M6045l328n3459L2243J2693K6006
$$ 1269706 1275453 1325617 1166110 1052204 1043544 1047420 1093465 1090137 1036678 1068921 1081614 1107620
9917A107620J0148n4990j3697l6541o1999N4880p9561p9640j0765Q7529l7421
$$ 1107620 1117768 1062778 1049081 1012540 950541 1005421 925860 846220 835455 922984 885563
9906H85563q2388l5421k1721P3684o2678n8876J16319l098p7171K6597N2129M8918
$$ 885563 803175 767754 746033 819717 757039 698163 814482 811384 734213 760810 812939 861857
9894H61857m6023o2271Q797j26638m3063N8757J00428N6078j28550p8367O6397
$$ 861857 815834 753563 762360 635722 592659 651416 751844 807922 679372 601005 667402
9883F67402p8433l6967L8361J2056j13671J24068J34667J6812J143Q6932M1571
$$ 667402 588969 552002 590363 602419 488748 612816 747483 764295 765438 852370 893941
9872H93941l742k2785L0669m4712m5355n9138l6704r065N2374J37402N9811P1586
$$ 893941 890199 867414 898083 853371 808016 748878 712174 703109 755483 892885 952696 1024282
9860A024282M1938m8679l5107l2577l0639L3076J43387J63274L83982M66282N05717
$$ 1024282 1066220 1017541 982434 949857 919218 952294 1095681 1258955 1642937 2109219 2614936
9849B614936M51848J70551l19877m67470k84734k72329j92789l9474m9897L1541
$$ 2614936 3066784 3237335 2917458 2449988 2165254 1892925 1700136 1660662 1610765 1642306
9839A642306J59433J4261n2450O3712K12157J31767K41963K65627K56198L09855
$$ 1642306 1801739 1816000 1763550 1827262 2039419 2171186 2413149 2678776 2934974 3244829
9829C244829L64301N50728O30774Q79599R64888J180035J364371J724962K301716
$$ 3244829 3609130 4159858 4790632 5670231 6635119 7815154 9179525 10904487 13206203
9820A3206203K530439K779023K848820K137943R23840m43388j320277j819811
$$ 13206203 15736642 18515665 21364485 23502428 24426268 23982880 22662603 20842792
9812B0842792j945581k033343j929903j569082j331222j124751q27948o01659
$$ 20842792 18897211 16863868 14933965 13364883 12033661 10908910 10080962 9479303
9804I479303m10622k08521J45296L17354N35860P25751R43464J369143J876805
$$ 9479303 9068681 8860160 9005456 9322810 9858670 10584421 11527885 12897028 14773833
9795A4773833K278538K468868K410519K000376J294060j4384j301911j878129
$$ 14773833 17052371 19521239 21931758 23932134 25226194 25211810 23909899 22031770
9787B2031770j947741j795235j684476j593274j596203j442174j218687j049910
$$ 22031770 20084029 18288794 16604318 15011044 13414841 11972667 10753980 9704070
9779I704070q11871p42819p01167n61053l36230k01615j77571j86900q7856j5165
$$ 9704070 8892199 8149380 7448213 6887160 6550930 6349315 6171744 5984844 5896988 5881823
9769E881823K2793R6134J73322K32938K43122L05128L31667M29847O43781Q32040
$$ 5881823 5904616 6000750 6174072 6407010 6650132 6955260 7286927 7716774 8360555 9192595
9759I192595J097796J349233J690188K039505K579610K991763L667348M253445
$$ 9192595 10290391 11639624 13329812 15369317 17948927 20940690 24608038 28861483
9751B8861483M679950M665094L753369K110875M7615j691823k608025k997724
$$ 28861483 33541433 38206527 41959896 44070771 44118386 42426563 39818538 36820814
9743C6820814k844407k698274k292367j862869j497596r94923l25355J30557O37583
$$ 36820814 33976407 31278133 28985766 27122897 25625301 24630378 24305023 24435580 25073163
9734B5073163J266164J724695K295713K400445K201672J911838J815178K095322
$$ 25073163 26339327 28064022 30359735 32760180 34961852 36873690 38688868 40784190
9726D0784190K632826L004956K814563J828167J48328j743249l226423l708036
$$ 40784190 43417016 46421972 49236535 51064702 51213030 49469781 46243358 42535322
9718D2535322l673034l459370l165388k826837k453689j923588j401208q73601
$$ 42535322 38862288 35402918 32237530 29410693 26957004 25033416 23632208 22758607
9710B2758607m10839j51387j1331J42851K34726Q6139l10570r94724j589095j665767
$$ 22758607 22347768 22196381 22185050 22327901 22562627 22648766 22338196 21343472 19754377 18088610
9700A8088610j580653j418995j127718r62305q20645o18539m35814k80578k21474
$$ 18088610 16507957 15088962 13961244 12998939 12178294 11559755 11123941 10843363 10621889
9691A0621889j01247L04621M85867P07124R89259J201062J545067J711319J876291
$$ 10621889 10520642 10825263 11311130 12018254 13007513 14208575 15753642 17464961 19341252
9682A9341252K145584J943806J130978K47700k94488q00621r94108q53125q59155
$$ 19341252 21486836 23430642 24561620 24809320 24514832 23714211 22720103 21866978 21007823
9673B1007823p22600k48704L07377P77688J195161J545906J830503K318831K783923
$$ 21007823 20285223 20036519 20343896 21121584 22316745 23862651 25693154 28011985 30795908
9664C0795908K963119K566635J650366M60113n02435q38608p59212m30478j39554
$$ 30795908 33759027 36325662 37976028 38436141 37933706 37095098 36335886 35905408 35765854
9655C5765854p3322o86378j504038k265281k457825k289614j854676j494562j142831
$$ 35765854 35692532 35006154 33502116 31236835 28779010 26489396 24634720 23140158 21997327
9646B1997327p25562j86071L07452P72894J085098J482674J779151J890089J830209
$$ 21997327 21271765 21085694 21393146 22166040 23251138 24733812 26512963 28403052 30233261
9637C0233261J149839J13256j265821k370541k975089k915122k630885k324508
$$ 30233261 31383100 31496356 30230535 27859994 24884905 21969783 19338898 17014390
9629A7014390k073952j639513j437325j333289r85756q12050o72142n78223m82703
$$ 17014390 14940438 13300925 11863600 10530311 9544555 8732505 8060363 7482140 6999437
9620F999437k79704k49640l01090k35426l26375k10160o9083j91756j79997m3609
$$ 6999437 6719733 6470093 6169003 5933577 5607202 5397042 5327959 5136203 4956206 4912597
9610D912597L3441M4066J21364J32911K05243L00109L71697M86869N97649O89249
$$ 4912597 4946038 4990104 5111468 5244379 5449622 5749731 6121428 6608297 7205946 7895195
9600G895195Q39121R17318J044653J164004J257755J179799R71428K67728o00140
$$ 7895195 8734316 9651634 10696287 11860291 13118046 14297845 15269273 15537001 14936861
9591A4936861j224892j383786j359355j284480j069438r37755o50475m35158m09321
$$ 14936861 13711969 12328183 10968828 9684348 8614910 7677155 7026680 6591522 6182201
9582F182201l22836k06473n8703J40907K36499L96755N26680O32681Q92897R89595
$$ 6182201 5859365 5652892 5594189 5735096 5971595 6368350 6895030 7527711 8420608 9410203
9572I410203J154343J267723J209525J046408M46886l19755j056837j460754j511812
$$ 9410203 10564546 11832269 13041794 14088202 14535088 14215333 13158496 11697742 10185930
9563A0185930j350045j099587r21126q82350p60243o45783o06024m87708k53882
$$ 10185930 8835885 7736298 6815172 5932822 5172579 4526796 3920772 3433064 3179182
9554C179182k39986k18787j83641k16161l2321j91051k23591r5153p3982n7223
$$ 3179182 2939196 2720409 2536768 2320607 2288286 2097235 1873644 1778491 1704509 1647286
9544A647286q2661j18195p8514K1490o7194j35968q251O810l2698j0699l793l2068
$$ 1647286 1564625 1446430 1367916 1389406 1322212 1186244 1177993 1184803 1152105 1141406 1137613 1105545
9532A105545M6390R9405j278p1131j25052r3703j10823m5038J10226O8976j09865
$$ 1105545 1151935 1251340 1250062 1178931 1053879 960176 849353 804315 914541 983517 873652
9521H73652n3621K807m5199k6303j16556r2630Q8865O8044o0045l1891j090m4368
$$ 873652 820031 822838 777639 751336 634780 542150 631015 699059 639014 607123 606033 561665
9509E61665n38N9842J00205m7025q3385j381R9109l3506p4559l1463j5214p0836
$$ 561665 561127 620969 721174 674149 590764 589383 688492 654986 580427 548964 533750 462914
9497D62914j73741Q090J10084Q837N7909m7308k5122J29119m6504j01504o8854
$$ 462914 289173 297263 407347 416184 474093 426785 401663 530782 484278 382774 313920
9486C13920q00j8098N2059J6564j210j90k5346o3760l2983k6531r780R7536P3426
$$ 313920 313120 295022 347081 363645 362435 362245 336899 273139 240156 213625 203845 301381 374807
9473C74807j5146j59554q0365R1321K8459M3698j9199j6563k6149O2828o0234
$$ 374807 359661 200107 119742 211063 239522 283220 264021 247458 221309 284137 223903
9462B23903j05123M2239P6954K1483l102M3693K9827l3448p4952P6230J38638
$$ 223903 118780 161019 237973 259456 256354 300047 329874 296426 221474 297704 436342
9451D36342k6941j10389n7703J553Q8428j63530p8442K7375J02170J51393j520
$$ 436342 409401 299012 241309 242862 331290 167760 89318 116693 218863 370256 368736
9440C68736o9335o2301k7157o783M8461j0033K3393R520k5996K4989N8276j3434
$$ 368736 299401 237100 209943 203160 251621 241588 264981 274501 248505 273494 331770 318336
9428C18336n6322l7621j4696j2330j3658Q0919P563P2887l3469j03021m1879K7203
$$ 318336 262014 224393 209697 197367 183709 264628 272191 345078 311609 208588 166709 193912
9416A93912M2150l9101o3968P9211Ql1821j1249j5317j550p6486m2003P261P7262
$$ 193912 236062 196961 132993 212204 212212 180391 169142 153825 152275 75789 33786 41047 118309
9403A18309Q8578j0384m021P2066k0181k5117Q4509R0841q0744k6571K2107p0737
$$ 118309 206887 196503 192482 264548 244367 219250 303759 394600 313856 287285 309392 238655
9391B38655p0312K4792k5322k5446M7415j8711N31Q3551O7692k8112l9475r3487
$$ 238655 168343 193135 167813 142367 189782 171071 171602 255153 322845 294733 255258 161771
9379A61771o1922J08248R3663J4095L1181m2022L1143k2993m6886j2405n4664
$$ 161771 99849 208097 301760 315855 347036 305014 336157 313164 266278 253873 199209
9368A99209O0052J03615N3726k5790n5880J1038J2346n9499L1233p9693p5619
$$ 199209 259261 362876 416602 390812 334932 345970 358316 298817 330050 250357 174738
9357A74738o0468K3537O623k7777K6167l2120L112J02363L7883p187K3636k2686
$$ 174738 114270 137807 144430 116653 142820 110700 113812 216175 254058 246871 270507 247821
9345B47821o209K0799N1806K3428q0162l0909M8734R015L7569k4031o0106N0833
$$ 247821 241612 262411 314217 337645 257483 226574 275308 284323 321892 297861 237755 288588
9333B88588J01494J06031J25331K6085m684r2783q7256o3376o1432J2620n3099
$$ 288588 390082 496113 621444 647529 642845 550062 462806 399430 337998 350618 297519
9322B97519L790P7055J04624l6513l3328J4390n4399J9346J0242l7265M2005Q9716
$$ 297519 301309 378364 482988 446475 413147 427537 373138 392484 402726 365461 407466 497182
9310D97182k3561N406k49K9856N0886J19080J04600m3719j29966m5071p0983o4085
$$ 497182 473621 479027 478778 508634 559520 678600 783200 739481 609515 564444 493461 429376
9298D29376j2322R5037O4707K7945J0323J7765o7467J6280N0825O6995o8121l5643
$$ 429376 417054 512091 576798 604743 615066 632831 565364 581644 632469 699464 631343 595700
9286E95700K546N1905k0010K2945k4843j4707O8412J08847P4140q2142j20256
$$ 595700 598246 650151 630141 653086 628243 613536 681948 790795 864935 782793 662537
9275F62537N8705J51704Q3336J2280j4096M0304Q8764K4171O9283O2382N4905
$$ 662537 721242 872946 956282 968562 954466 994770 1083534 1107705 1176988 1239370 1294275
9264A294275l1348N546J15039N8631J37924P5415n8493j1190R3630J71399O5475
$$ 1294275 1262927 1268473 1383512 1442143 1580067 1655482 1596989 1585799 1679429 1850828 1916303
9253A916303J26177K33670J32635J07176J52714K36216K32448K22626K93831L70407
$$ 1916303 2042480 2276150 2408785 2515961 2668675 2904891 3137339 3359965 3653796 4024203
9243D024203L39286L23798M53453M80879O50748P95695R31024R90711J127723
$$ 4024203 4363489 4687287 5140740 5621619 6272367 7068062 7999086 8989797 10117520
9234A0117520J519151J816972K084969K554467L124262L639159L988830L973577
$$ 10117520 11636671 13453643 15538612 18093079 21217341 24856500 28845330 32818907
9226C2818907L587715K526206Q91137j023788k511077l358435l605805l494195
$$ 32818907 36406622 38932828 39823965 38800177 36289100 32930665 29324860 25830665
9218B5830665l279450k803565k417951k060898j723955j477330j195394j077611
$$ 25830665 22551215 19747650 17329699 15268801 13544846 12067516 10872122 9794511
9210I794511r44835q05829o46121p27291n88100n21353l36775l00931m00737l23099
$$ 9794511 8849676 8043847 7397726 6670435 6082335 5560982 5224207 4923276 4522539 4199440
9200D199440k51310k32684k88043j70580j97503j77197m6792p0842k47100j62702
$$ 4199440 3948130 3715446 3427403 3256823 3059320 2882123 2835331 2764489 2517389 2354687
9190B354687m6713j08876j02190j06927o5863J1973R0664q4777q8537p0175j95951
$$ 2354687 2307974 2199098 2096908 1989981 1924118 1936091 2026755 1941978 1853441 1783266 1587315
9179A587315j36289j2059N5475j13165q1657l3678L7519J11373p079j34091p8925
$$ 1587315 1451026 1438967 1494442 1381277 1299620 1265942 1303461 1414834 1407755 1273664 1194739
9168A194739j16277j01481j8890n5821P3185K7148l1223n1327m298n8511k0714
$$ 1194739 1078462 976981 958091 902270 975455 1002603 971380 920053 915755 857244 836530
9157H36530k647n553J15651J4434j43403k9094J6229k9928l0184j755N6843j939
$$ 836530 833883 828330 943981 958415 815012 785918 802147 772219 742035 740280 797123 795184
9145G95184j298j13163k3156M0319M0603J6341k3228p9682L3558J15667k4633
$$ 795184 793886 680723 657567 697886 738489 754830 731602 651920 685478 801145 776512
9134G76512j64070j35305M9573J1661O7899o2039q5415k8360j919r0186l54j8451
$$ 776512 612442 477137 526710 538371 606270 544231 458816 430456 428537 338351 337997 319546
9122C19546J22321J55372J4415j01468j62764K3703m1014p0927N6849M5132k1568
$$ 319546 441867 597239 611654 510186 347422 371125 330111 259184 316033 361165 339597
9111C39597n8465o5342M87J47602M6164q8564l1784N9550l399m8029Q3164o3551
$$ 339597 281132 215790 216277 363879 410043 321479 289695 349245 345846 297817 380981 317430
9099C17430J6050M660n9741r408J048l906l5003k389k2835M5250K9037p7610J9705
$$ 317430 333480 338140 278399 268991 270039 266133 231130 228741 205906 251156 280193 202583 222288
9086B22288L5021r0583m0464O7406J21821M2716n4641m270o5124k9189k6106L7355
$$ 222288 257309 166726 126262 193668 315489 358205 303564 299294 234170 204981 178875 216230
9074B16230O0518j8107q9043n2773o007k3922K2988P492O0605J10838N4460j09560
$$ 216230 276748 258641 169598 116825 110818 86896 109884 117376 177981 288819 343279 233719
9062B33719K2861K7951j20217j29380K5648L5357J42869l9321p975L299K4931
$$ 233719 256580 284531 164314 34934 60582 95939 238808 199487 191512 194811 219742
9051B19742q5551J715M6339M483o8548r5316J57l3431N2079P5591J29166R3910
$$ 219742 134191 135906 182245 186728 118180 22864 23021 -10410 41669 117260 246426 340336
9039C40336j1202p1952m4337n0551r1848M3320J5966N360m7777p5522O9625J5302
$$ 340336 329134 257182 212845 162294 70446 113766 129732 135092 87315 11793 81418 96720
9027I6720j9419o9281o0416K3457j5308Q3343M6661K0535K5194l3315O0403j2460
$$ 96720 77301 8020 -52396 -28939 -44247 39096 85757 106292 131486 98171 158574 146114
9015A46114l2338l6449K3527Q8058K0444p3556p0965l6897K6767l2605j20084
$$ 146114 113776 77327 100854 188912 209356 135800 64835 27938 54705 22100 -97984
9004i7984j9268J03654P4240j7715K3757m7737O2308n1116j30468m2528K2884
$$ -97984 -117252 -13598 60642 42927 66684 18947 81255 30139 -100329 -142857 -119973
8993a19973L9898J8283J03964L5766O5181n2639o8838p9004L4201J4432k479P3398
$$ -119973 -80075 -61792 42172 77938 143119 90480 21642 -57362 -23161 -8729 -11208 62190
8981F2190k1145k5098m301L6691l3116N3072M4401M8836j44914K0065J15907j450
$$ 62190 41045 15947 11646 48337 15221 68293 112694 161530 16616 36681 152588 151138
8969A51138j47850O4332p875l7756r240j5539J2603L5598l3200l6554M913j1199
$$ 151138 3288 67620 59745 21989 12749 -2790 9813 45411 12211 -24343 -19430 -30629
8957c0629N520K241j6757K8999Q1140O442o806n5943M645K3056J280P8011q0617
$$ -30629 -25109 -22868 -39625 -10626 70514 76956 70150 14207 18852 41908 43188 121199 40582
8944D0582N1000J24008L7407n1713j8202k7444j1044K6164j03180j5715p93R7095
$$ 40582 91582 215590 252997 201284 183082 155638 144594 170758 67578 51863 51070 148165
8932A48165p4021j29097K9025J21734K540r3621j13642j00092O5467Q9248p1619
$$ 148165 74144 -54953 -25928 95806 98346 4725 -108917 -209009 -143542 -54294 -125913
8921a25913O0464j1835Q2458J65563o4539o2150p6678j8719j1714O8980O6774
$$ -125913 -65449 -77284 5174 170737 106198 44048 -32630 -51349 -63063 5917 72691
8910G2691n367o9709L4877L1598j7148l9182p9536l1319O6016J2270j5255J13387
$$ 72691 67324 -2385 32492 64090 46942 7760 -71776 -103095 -37079 -24809 -40064 73323
8898G3323J7219o8418m6791O4179m420m5271n8625K8644J18094r153k8469M1889
$$ 73323 90542 22124 -24667 39512 35092 -10179 -68804 -40160 77934 68781 40312 82201
8886H2201J6477q4727L2601k0651k0982M7888K0642K4590l697k5727k5531k3116
$$ 82201 98678 13951 46552 25901 4919 52807 73449 98039 94342 68615 43084 19968
8874A9968J3443M4385L4793L5108r4106p6837J9557j774n136m5212P8750P9369
$$ 19968 33411 77796 112589 147697 53591 -23246 -3689 -5463 -10599 -55811 22939 102308
8862A02308r7481K9566O2030l5940J4033N1347n4886l5289j4307K4282N5644p0054
$$ 102308 4827 34393 96423 60483 74516 125863 70977 35688 21381 45663 101307 31253
8850C1253k8704K214R6516J9291l9424p5726L1910Q2967l0700k315n9040p2915
$$ 31253 2549 4763 101279 120570 81146 5420 37330 120297 89597 87282 28242 -44673
8838d4673P1398N3628l4362Q7325P4868P787j7450o909J17904L4571J8972m3347
$$ -44673 26725 80353 45991 133316 208184 215971 198521 191612 309516 344087 363059 319712
8826C19712j65383k6698n3055K2798K9574k9386K16o5486N4138N4770k6903j4940
$$ 319712 154329 127631 74576 97374 126948 97562 97778 32292 86430 141200 114297 99357
8814I9357M511k0146J5286j3155p1024j4067L6208l3432q6683L4325J19053J7724
$$ 99357 103868 83722 99008 85853 14829 762 36970 3538 -83145 -48820 70233 87957
8802H7957o6384J9218M6370p2092j2126m2236m4118M5187P2458M1662N2441r873
$$ 87957 21573 40791 87161 15069 2943 -39293 -83411 -38224 34234 75896 128337 118464
8790A18464P052J12814l8989j59391o5587O476J4702l439J03645K4004l5568k6887
$$ 118464 125516 238330 199341 39950 -25637 -19161 -4459 -7898 95747 119751 84183 57296
8778E7296j444p7495L2303J43447J8652o6065m0300P3099J6117l0910o2467j7098
$$ 57296 55852 -21643 10660 154107 172759 106694 66394 139493 155610 124700 62233 45135
8766D5135L9286N9039P7669j25489l1509R7069J5540p344K6860j12057o3371N0403
$$ 45135 84421 143460 221129 95640 64131 161200 176740 169396 196256 84199 20828 71231
8754G1231J4011J7213j1936j7515n6679r7P560J02485L5914j3234j6216o37m5113
$$ 71231 85242 102455 90519 73004 16325 16228 23788 126273 162187 148953 132737 132100 86987
8741H6987j7667k1998n0535P6643J02694r241Q1904q7236o6890j16172j4929K7762
$$ 86987 69320 47322 -3213 73430 176124 166883 248787 161551 94661 -21511 -36440 -8678
8729h678m8072O8415j9653M7777O9383J03873p5277n3352J7708j1240O5139M350
$$ -8678 -56750 11665 -7988 39789 109172 213045 137768 84416 102124 90884 156023 160373
8717A60373r9532P9820n5400m1904k607p1831m1056N0697m946j1730k4468J8651
$$ 160373 60841 140661 85261 43357 40750 -31081 -72137 -21440 -26386 -38116 -62584 -43933
8705d3933J7370k378J47969P3569l4727k1107j13643L9210O3680M3234m2067J09906
$$ -43933 -26563 -28941 119028 192597 157870 136763 23120 62330 126010 169244 127177 237083
8693B37083P4827J29165J74745m5571j11241n2696r8166j39209o6250M9848k4366
$$ 237083 311910 441075 615820 570249 459008 406312 308146 168937 102687 152535 128169
8682A28169J8385L5463O2646J02297L5402l9142M4968M4972k4913M0419L0623
$$ 128169 146554 182017 244663 346960 382362 343220 388188 433160 408247 448666 479289
8671D79289m2933o6879L4202K8658k6326j17873p9513M2603n0384m0079m8733
$$ 479289 436356 369477 403679 432337 406011 288138 208625 251228 200844 160765 112032
8660A12032J33278K5300m2919j5832k4890K7898J8291L2569K4745P498J10624
$$ 112032 245310 270610 227691 211859 186969 214867 233158 265727 290472 297970 408594
8649D08594J02459K03178Q3741q1033j58896j5946j49185j02693J6352o1839m9273
$$ 408594 511053 714231 797972 716939 558043 542097 392912 290219 306571 244732 195459
8638A95459j8960K1545Q0590Q7825n1860m3666k9776p7562j14954r1557P2024
$$ 195459 176499 198044 278634 366459 314599 270933 241157 163595 48641 -42916 29108
8627B9108R2924Q9008q6314n2930o2276J01283j019p5428j7608l3991R9169R5808
$$ 29108 122032 211040 124726 71796 9520 110803 109784 34356 16748 -17243 81926 177734
8615A77734J0152o0993j8977n2282J44945K9279P0392R5107J04541P6396J67496
$$ 177734 187886 126893 107916 55634 200579 229858 300250 395357 499898 576294 743790
8604G43790L06263M05714J07904k15731k18712l00943j33128J2175O5346j00387
$$ 743790 1050053 1455767 1563671 1347940 1129228 828285 695157 707332 772678 672291
8594F72291r3485R3108Q8905m9656J4374K9697r9971r8497p673o8891j2192j02983
$$ 672291 578806 671914 760819 711163 725537 755234 655263 556766 549093 480202 468010 365027
8582C65027q8087m4280L8181P8155k6973j5284j2004L2416n1503k3876j08619
$$ 365027 276940 232660 270841 348996 322023 306739 294735 327151 275648 251772 143153
8571A43153n0677j6402J08050N2123j20384l3590J5445Q4380m0458J8848K6539
$$ 143153 92476 76074 184124 236247 115863 82273 97718 182098 141640 160488 187027
8560A87027R5556J21657J68156M9129k5062j70275j01311p8324n8313j13755j1862
$$ 187027 282583 404240 572396 621525 596463 426188 324877 246553 188240 74485 62623
8549F2623P8813K3427r4617N2695j2124k2665q7162O4245l404O2038P2645l2896
$$ 62623 141436 164863 70246 122941 110817 88152 990 65235 61831 123869 196514 163618
8537A63618K644N4252k9726k7877L5884k941o3587j4981J26298P4860P8472P6632
$$ 163618 166262 220514 190788 162911 198795 195854 132267 117286 243584 318444 396916 473548
8525D73548L1390p6001l5932j29324m5890P3034N9057j30898j16844j0251N4554
$$ 473548 504938 428937 393005 263681 217791 290825 349882 218984 102140 91889 146443
8514A46443p611l281j7879M091R6320K8660o303N234m6086q8749l4795P2999M626
$$ 146443 138832 135551 117672 121763 218083 246743 240440 245674 199588 110839 76044 149043 153669
8501A53669l0420p7996k5266P5937K8617q2673J0082O5080k3146n4717K1535L1006
$$ 153669 123249 45253 19987 95924 124541 41868 51950 117030 93884 39167 60702 91708
8489I1708L8316M6667O2910l3050Q525o4196r5102l7266j0808L470k7570J13771
$$ 91708 130024 176691 239601 206551 215076 150880 55778 18512 7704 11174 -16396 97375
8477I7375N2586o9539l2844j0698p53K2989J30916K1366k9956r689j5946q6243
$$ 97375 149961 80422 47578 36880 36127 59116 190032 211398 181442 171753 155807 69564
8465F9564m1957N495Q1568k2058j06382n7540j4828j1571k632Q6689L5793J9359
$$ 69564 27607 33102 114670 92612 -13770 -71310 -86138 -97709 -100341 -13652 22141 41500
8453D1500m8305n5904p5887r7908M4911Q6768R2385m0278j6204J36360R8954j27578
$$ 41500 -6805 -62709 -138596 -236504 -191593 -104825 -12440 -52718 -68922 67438 166392 38814
8441C8814R976m7998m1184N402Q708M2967j1589n8675p1002j5391M5686M305Q5709
$$ 38814 48790 792 -40392 -34990 -26282 16685 5096 -53579 -124581 -139972 -94286 -89981 -4272
8428d272J21465l4626l0251k9608K6218J3577j56358j17075N1570R4955L7345
$$ -4272 117193 82567 52316 22708 48926 62503 -93855 -210930 -159360 -64405 -27060
8417b7060k331M8810J14321M2815r1304j5695l4434k8291l6659O126O8438K2978
$$ -27060 -29391 19419 133740 176555 85251 69556 35122 6831 -29828 -23702 44736 67714
8405F7714k1343K2094l5547m9921n4901n4760N5068R6624J18314K6956j17151
$$ 67714 46371 68465 32918 -17003 -71904 -126664 -71596 25028 143342 170298 53147
8394E3147n3537J04838N6914o3499K6891k5680q7896p05N7966L4357J2672K750
$$ 53147 -390 104448 161362 97863 124754 99074 11178 10473 68439 102796 115468 118218
8382A18218j04542j22958M2149M6748K3078M627K1444l0810k3703l0920j3688
$$ 118218 13676 -109282 -67133 -20385 2693 7320 28764 -2046 -25749 -56669 -70357
8371g0357O515O3917j3927p5730q7175K1685l8101R5873Q5852R3857N0825o5119
$$ -70357 -63842 75 -13852 -89582 -176757 -155072 -193173 -97300 -11448 82409 133234 68115
8359F8115k689J1923r8635l6725P1371O2984K3661O85K0570J9092K074r2915k7483
$$ 68115 65426 77349 -21286 -58011 13360 76344 100005 100690 121260 140352 142426 49511 22028
8346B2028O5634j0994n5648p3128o7280P5032N137M954M0228j8892n8703j1536
$$ 22028 87662 76668 21020 -52108 -119388 -44356 -39219 -34265 5963 -12929 -71632 -83168
8334h3168K6534O7466L0789o0686j21675N188k3388J11616J41869j1133l5428
$$ -83168 -56634 10832 41621 -19065 -140740 -135552 -158940 -47324 94545 83412 47984
8323D7984o9835L3147m2620j34918N9199J10918N5975q4769q8682O3868Q2868
$$ 47984 -21851 11296 -31324 -166242 -107043 3875 59850 -24919 -113601 -49733 33135
8312C3135P182m0404l713k4360J24662J06260P3706j34877m6341K5605p4844j69053
$$ 33135 40317 -87 -3800 -28160 96502 202762 276468 141591 95250 120855 46011 -123042
8300a23042o1875M429P2369M2071Q4272m122m2813O6571M7525l5518j10015P3801
$$ -123042 -184917 -180488 -108119 -66048 18224 14102 -28711 37860 85385 49867 -60148 13653
8288A3653J4065n6173Q400J1529R7014m523k1519J02145l407j13913j18535j9713
$$ 13653 27718 -28455 -20055 -8526 88488 83965 62446 164591 161184 47271 -71264 -90977
8276i0977K6239l2902l7943k5973P0177j1887J06091L1140j001p9765L3185N2326
$$ -90977 -64738 -97640 -135583 -161556 -91379 -103266 2825 33965 32964 -46801 -13616 38710
8264C8710n5083p8639j25211Q8119J57915J08064P188l2167J075k2827l1422p2564
$$ 38710 -16373 -95012 -220223 -132104 25811 133875 141063 108896 109971 87144 55722 -16842
8252a6842O8809o2108Q6851O5933k2690N1099L478j05016j18681M2580J14407
$$ -16842 51967 -10141 76710 142643 119953 171052 174530 69514 -49167 -6587 107820
8241A07820r6357m3468L6684N9030r5137j811K7708N1399o6843J5999K3710K2431
$$ 107820 11463 -32005 4679 63709 -31428 -33239 -5531 45868 -20975 -4976 18734 41165
8229D1165n523p1748p8715J0471J00320O891j8784q4951q5838J3093J34197L5065
$$ 41165 35642 -36106 -114821 -104350 -4030 2861 -15923 -100874 -186712 -173619 -39422 -4357
8217d357r8577N2647p4611m7047J30809K6892K2838o9118l617Q6775L0007l4941
$$ -4357 -102934 -50287 -124898 -171945 -41136 -14244 8594 -60524 -64141 22634 52641 17700
8205A7700l956l7660p1033O9186L5911j9338r5537j2598N5951l5473p8626Q23
$$ 17700 13744 -23916 -94949 -25763 10148 -9190 -104727 -117325 -61374 -96847 -175473 -174650
8193a74650L6176J36403K9367J4716J35238J4215o1633j8776M8467q9256o9664
$$ -174650 -138474 -2071 27296 42012 177250 191465 129832 111056 159523 70267 603
8182F03N8666K2406Q7732P3255n4223j02026j26025N34j05888m939L2931J40858
$$ 603 59269 81675 169407 242662 188439 86413 -39612 -39078 -144966 -149905 -116974 23884
8170B3884O4344m0772j16222O5268l1746k8563L4514M5874J1372K6255L6852J1447
$$ 23884 88228 47456 -68766 -3498 -35244 -63807 -29293 16581 27953 54208 91060 102507
8158A02507o062K9909j0633J9681m7739k0164q1803k5375k8033K6634q304q2139
$$ 102507 96445 126354 115721 135402 87663 67499 -14304 -39679 -67712 -41078 -49382 -131521
8146a31521O0349Q8087N7301k9373M0740M7660P9926J19912O6796L2607o8872
$$ -131521 -71172 16915 74216 44843 85583 133243 213169 333081 399877 432484 363612
8135C63612l1437p6256k5744o0791m7163n9891O245M8496N10L2004N0804L1301
$$ 363612 332175 255919 230175 169384 122221 62330 68575 117071 117581 149585 200389 231690
8123B31690l9478m3346l688k5657j25702o1591M3150M7879M0334l1761j03417
$$ 231690 192212 148866 145178 119521 -6181 -67772 -24622 23257 63591 31830 -71587
8112g1587M838M4032M2696j10540o4402j9343P6296J37316o4259k388J03496J1959
$$ -71587 -66749 -22717 19979 -90561 -154963 -174306 -98010 39306 -24953 -27341 76155 88114
8100H8114k9171L9037J00630P5009J53556P6445J4049k5177p792m2458n2613r7996
$$ 88114 58943 97980 198610 273619 427175 503620 517669 492492 484700 442242 389629 291633
8088B91633q3439j30526k9970J2901l6301K6702M785n267J8459n2082P5861K4454
$$ 291633 208194 77668 47698 60599 24298 51000 55785 50518 68977 16895 92756 117210
8076A17210j10365n2870k2632J5429R9538j2882K240J3907M1753k7702n3889m1859
$$ 117210 6845 -46025 -68657 -53228 46310 33428 35668 49575 91328 63626 9737 -32122
8064c2122q4976j3819L5129P7472N8558n140o3777r814M3993j2646J13978J90399
$$ -32122 -117098 -130917 -95788 -18316 40242 35102 -28675 -38489 5504 -7142 106836 297235
8052B97235r033L2980N4286J4051k4016j46211j16415k3147O2987K9218O2575
$$ 297235 288202 321182 375468 389519 365503 219292 102877 79730 142717 171935 234510
8041B34510m8077m551j5262l583K3119M0639j10350j12121m0795Q010P2083O4361
$$ 234510 186433 181882 166620 163037 186156 226795 116445 4324 -36471 -28461 43622 107983
8029A07983M5400j5453o07L4977K1699M0812J0061m0025l7770j06753j86983J6503
$$ 107983 153383 137930 137323 172300 193999 234811 244872 204847 167077 60324 -126659 -110156
8017a10156J10150J4119o2474N5190L3139n2420o6022Q4197O2535k7472n1744
$$ -110156 -6 14113 -48361 6829 39968 -12452 -78474 5723 68258 40786 -10958
8006a0958j5199L0988K620J5872J4772J5134L5150O8638n529N941k1596J038k5073
$$ -10958 -26157 4831 7451 23323 38095 53229 88379 157017 151488 157429 135833 136871 111798
7993A11798o7316o8419m0599J66514O3494j14r6225r731m1622L7379R911J2258
$$ 111798 44482 -23937 -64536 101978 165472 165358 69133 59402 17780 55159 65070 77328
7981G7328m833n4925m6462K1331M0834N0757n2634o3447q7236L6610M9092R30
$$ 77328 72495 17570 -28892 -7561 33273 84030 31396 -32051 -119287 -82677 -33585 -32655
7969c2655N552K3289M0076m2133j828K0568l3612m6185N4190K0914l1898m8323
$$ -32655 -27103 -3814 36262 -5871 -7699 12869 -20743 -66928 -12738 8176 -23722 -72045
7957g2045N3396L9852j08782K642O8037O6369R3207l5877m2947J6092L2487O208
$$ -72045 -18649 21203 -87579 -84937 -16900 49469 142676 106799 63852 79944 112431 118639
7945A18639o2388l6802o335k3717l8552M844J623L1518J64209P6613n5594m5120
$$ 118639 56251 19449 13114 -10603 -49155 -44311 -42688 -11170 153039 229652 174058 128938
7933A28938p3131m3151m3805o1749N242j13340N9102P4915J6558M310j216J1173
$$ 128938 55807 12656 -31149 -92898 -87656 -200996 -141894 -66979 -50421 -46111 -47327 -36154
7921c6154N7297m0603m6388Q094k6976j17108j08340k7899J0354J30670Q6359
$$ -36154 21143 -19460 -65848 -57754 -84730 -201838 -310178 -338077 -327723 -197053 -110694
7910a10694P4963J11736P9665j4368m3281R6853k9923p2845L9039k2250p881L9248
$$ -110694 -35731 76005 155670 141302 98021 194874 164951 92106 131145 108895 101014 140262
7898A40262m6737l30r1852l7095M0192L0860N0029r4456r1889N5927J13083Q2317
$$ 140262 93525 93195 1343 -35752 4440 35300 85329 -9127 -101016 -45089 67994 150311
7886A50311q9674r9466l4282O4192J38879j5966J5198j4168j7069m8751J13042
$$ 150311 60637 -38829 -73111 -8919 129960 113994 129192 115024 97955 49204 162246
7875A62246M29j20063j20819N8467K9643n7873j2910P1463M2949l9531k7567O5664
$$ 162246 162675 42612 -78207 -19740 9903 -47970 -60880 10583 53532 14001 -13566 52098
7863E2098M9379j28029m8737Q7547M6277J17764q8414k7497k1074l847O1522L5487
$$ 52098 101477 -26552 -75289 12258 58535 176299 87885 60388 39314 35467 96989 132476
7851A32476j07231m7716K7342n6805m3671J103P6437J45278k6533j58877k7230
$$ 132476 25245 -22471 4871 -51934 -95605 -94502 -18065 127213 100680 -58197 -85427
7840h5427k0899J14651K5150J4393q5610j8077J7214M4277l1259K6857N6125J9855
$$ -85427 -106326 8325 33475 47868 -37742 -55819 -38605 5672 -25587 1270 57395 77250
7828G7250K728M0383j9419n7231j8564L1071j8615j8779k4505n4488n515M8123
$$ 77250 79978 120361 100942 43711 25147 56218 37603 18824 -5681 -60169 -65684 -17561
7816a7561J00832o8941l6455L4517O8938K3204K2427j6440j2281k658L2458r7953
$$ -17561 83271 14330 -22125 12392 81330 104534 126961 110521 98240 95582 128040 30087
7804C0087n8518j60480m9279J69079J40041k013k8017m0797J0294J00593J0091
$$ 30087 -28431 -188911 -238190 -69111 70930 68917 40900 103 10397 110990 121081
7793A21081k8549J304Q1624L0696q829n1771q4271r9457n795n232J2953R5956
$$ 121081 92532 93836 175460 206156 197327 145556 61285 -38172 -43967 -49199 -36246 59710
7781E9710l1427p9350N5730K8136m6632O287L9882l6086L8479Q9740P3120l8135
$$ 59710 28283 -51067 4663 32799 -13833 -7546 32336 -3750 34729 124469 197589 159454
7769A59454K4059p7800r8700l5458o2847k3425M5267m314k5896M0254N1551P6249
$$ 159454 183513 105713 7013 -28445 -91292 -114717 -69450 -73764 -99660 -59406 -7855 68394
7757F8394m1201q4474n1682j0063L1911R5256K6936l1956j6072n3933J3550O0175
$$ 68394 27193 -57281 -108963 -119026 -87115 8141 35077 3121 -12951 -66884 -53334 6841
7745F841j3973k2218j9090N2417L5789j6402o7169p5740o735Q3788J8665O0611
$$ 6841 -7132 -29350 -48440 3977 39766 23364 -43805 -119545 -126280 -42492 -23827 36784
7733C6784J3929n5460p0761k5617j0737l0791l7464O0647J19742K9615j9237N0728
$$ 36784 50713 -4747 -75508 -101125 -111862 -142653 -180117 -119470 272 29887 10650 61378
7721F1378j2844j411Q7238p3248j08210r3775l3603J5226R0907J23142R5029J7162
$$ 61378 48534 47123 134361 61113 -47097 -140872 -174475 -159249 -68342 54800 149829 166991
7709A66991o7285j0405j37832j00921l163J31568N9144n8293K8228K3446k8279
$$ 166991 99706 89301 -48531 -149452 -152615 -21047 38097 -20196 8032 31478 3199
7698C199J14118l2262j01574r2185p7709O4175J20152m139p3262p8240n3752R3225
$$ 3199 117317 85055 -16519 -108704 -186413 -122238 -2086 -6225 -79487 -157727 -211479 -118254
7686a18254P3719M464M3930o5811r1683L905O3937L4491j5608j840n2053l9424
$$ -118254 -44535 -40071 3859 -61952 -153635 -149730 -85793 -51302 -66910 -68750 -120803 -160227
7674a60227J63331R2505k8950r9974N7036n4330j01156P9034R704N9947O5248
$$ -160227 3104 95609 66659 -33315 23721 -30609 -131765 -52731 -43027 16920 82168
7663H2168M4091O2081p5095q531O6319k4830M1642J8239J1230m7655n7289n805
$$ 82168 126259 188340 113245 104714 171033 146203 187845 206084 217314 169659 112370 106565
7651A06565l1940o1576j05332J13389O9382n9471n1356L1803r983m2026L9236
$$ 106565 74625 13049 -92283 21106 90488 31017 -20339 11464 1481 -40545 -1309
7640a309O3076O877L4905l8169l4702J9275l2536l5599l1956N4557R4371k2606
$$ -1309 61767 68644 103549 65380 30678 49953 17417 -18182 -50138 4419 98790 76184
7628G6184j05964r3002M0306M3425O3975L7848K9464M2605L1542j67487j59096
$$ 76184 -29780 -122782 -82476 -39051 24924 62772 92236 134841 166383 -1104 -160200
7617a60200R9912L2218Q3086k044n705n9855j8957M8606K9084M413j9361l6556
$$ -160200 -60288 -28070 55016 52972 47267 -12588 -31545 17061 46145 50558 31197 -5359
7605e359j3760l0395L6864l7578j1439l3544o0711L7042Q8168m1527n2628l986
$$ -5359 -19119 -49514 -12650 -50228 -61667 -95211 -155922 -118880 -30712 -72239 -124867 -128853
7593a28853o324p1845n239P298Q569K101M7790Q8233K0389r9488J9331K6912M2878
$$ -128853 -135177 -207022 -212261 -204963 -196394 -194293 -146503 -58270 -37881 -137369 -118038 -91126 -48248
7580d8248R3630J4172L8351k4153j01492r207m0909l9037J02062L9467q8320o4172
$$ -48248 45382 59554 97905 73752 -27740 -36947 -77856 -116893 -14831 24636 -63684 -127856
7568a27856m0118k4417p4179J06850J42863m5039k3719j9335L2514J0254o6228
$$ -127856 -167974 -192391 -266570 -159720 -16857 -61896 -85615 -104950 -72436 -62182 -128410
7557a28410n9853L5001J00219O2911M8988j5901j22477l9461O9265o7463n7689
$$ -128410 -188263 -153262 -53043 9868 58856 42955 -79522 -118983 -49718 -117181 -174870
7546a74870N4454J06578k5309j6857J3045J58020J41691n2373M3215q6767o7882
$$ -174870 -120416 -13838 -39147 -56004 -42959 115061 256752 204379 247594 160827 92945
7535I2945o4937j7776L3717J1541l1674o2694J00020L9643k5921j3832j7995K969
$$ 92945 28008 10232 43949 55490 23816 -38878 61142 100785 74864 61032 43037 46006
7523D6006N7710K617j10626q7472J2614R9998Q1971J4692k7510K6913m3526j26380
$$ 46006 103716 106333 -4293 -91765 -79151 20847 102818 117510 90000 116913 73387 -52993
7511e2993N8210N2800j05028J4599M8005l6744q3057j45818J13558J69093M8218
$$ -52993 5217 58017 -47011 -32412 15593 -21151 -104208 -250026 -136468 32625 80843
7500H0843M5262m1934m1622o0409M0796o8572p1627q5337J8986J7914J10634L1624
$$ 80843 126105 84171 42549 -17860 22936 -45636 -117263 -202600 -183614 -165700 -55066 -23442
7488b3442j83454j02412P4051M8793J745J00669n3630j633q3079K1839l5892Q3205
$$ -23442 -206896 -309308 -235257 -186464 -184719 -84050 -137680 -139313 -222392 -200553 -236445 -153240
7476a53240M3690m1584R533j2888P8424M3627l7255J2133Q2936O1697r4926o3704
$$ -153240 -109550 -151134 -141601 -154489 -76065 -32438 -69693 -57560 25376 87073 -7853 -71557
7464g1557m2079j5115N22O6294p454j2864J5399P9413p5479q6260K9331Q766j5928
$$ -71557 -113636 -128751 -128229 -61935 -69389 -82253 -66854 12559 -62920 -149180 -119849 -111083 -127011
7451a27011n2473K733R6397J36906r129p6762j08637j0116L3424L4117J03371
$$ -127011 -179484 -176751 -80354 56552 47423 -29339 -137976 -148092 -114668 -80551 22820
7440B2820K8678n7939r4721j2383l3033J9267R339N4904J02782K8253n7002r7049
$$ 22820 51498 -6441 -101162 -113545 -146578 -127311 -117972 -63068 39714 67967 10965 -86084
7428h6084J83P4797L9531m356n9532j3431j975k2008j8639P0439K4134k7608J04684
$$ -86084 -85901 -11104 28427 24071 -35461 -48892 -50867 -72875 -91514 -21075 3059 -24549 80135
7415H0135k9461j32329K0304J06818K4688Q6673j8512p3739n2807p6561M2688
$$ 80135 50674 -81655 -61351 45467 70155 156828 138316 64577 11770 -64791 -22103
7404b2103M8329k1473l8056j53834k0791J31125M9505K9137O9554P1711r3958
$$ -22103 26226 4753 -33303 -187137 -207928 -76803 -27298 1839 71393 143104 49146
7393D9146m7183o494J9126K2658p4671j77137j5553J40350J80564o283p1019k1917
$$ 49146 1963 -4531 14595 37253 -37418 -214555 -230108 -89758 90806 84523 13504 -8413
7381h413P7404O9828j9537m6797q4623q1699K4096O0703N9031o3067M2591M8661
$$ -8413 68991 138819 119282 72485 -12138 -93837 -69741 -9038 49993 -13074 29517 78178
7369G8178n7153K4626M9627N2590l7746o4830k0223j3469o1919l645l6634O7356
$$ 78178 21025 45651 95278 147868 110122 45292 25069 11600 -50319 -53964 -90598 -23242
7357b3242P78m1790k0621N0303j47686K1706L613J49146J96939p066o2937m342
$$ -23242 -22464 -64254 -84875 -34572 -182258 -160552 -156939 -7793 189146 182080 119143 114801
7345A14801M5209j2972q7333P2024L0536q9752m7147K4078L572L1863J1672k5955
$$ 114801 160010 147038 59705 131729 162265 72513 25366 49444 53016 84879 96551 70596
7333G0596l9o342m825l3811j7509l2582k0904L8178k52K4760r315L872j25054
$$ 70596 70557 64215 59390 25579 8070 -24512 -45416 -7238 -7490 17270 7955 11827 -113227
7320a13227K3189J17589Q417q9223j6252L1419L8089M2523k9575J4354L2050p9155
$$ -113227 -90038 27551 35968 -53255 -69507 -38088 1 42524 12949 27303 59353 -19802
7308a9802Q316o4114q3950o5084P3632P2025j6123l1168J0738M7946j5049o690
$$ -19802 -11486 -75600 -159550 -224634 -151002 -78977 -95100 -126268 -115530 -67584 -82633 -89323
7296h9323P6078R0222L1480m7242P642r1823p8924L5592J01942o0742K4300O1549
$$ -89323 -13245 76977 108457 61215 68857 -22966 -101890 -66298 35644 -25098 -798 60751
7284F0751o2861l0133j8581m7471j19l1463J03137r860L4095l6895n3291J0087
$$ 60751 -2110 -32243 -50824 -98295 -98414 -129877 -26740 -36600 -2505 -39400 -92691 -82604
7272h2604O9408j5635O4984O2713q5199p6894n9642q9913K1449R1286P0630l0689
$$ -82604 -13196 -28831 36153 98866 13667 -63227 -122869 -212782 -191333 -100047 -29417 -60106
7260f0106j9357m3277k0384p488L2020L1716N7076M1109l3018P599p0859j3683
$$ -60106 -79463 -122740 -143124 -150612 -118592 -86876 -29800 11309 -21709 -14110 -84969 -98652
7248i8652q4293R41Q7514o741o4044j6175k1667M3462k2967O2770M4436j3855
$$ -98652 -182945 -182004 -94490 -101231 -165275 -181450 -203117 -159655 -182622 -119852 -75416 -89271
7236h9271n7987K8448M2155p6573K0116L9982L1220J67025j4716Q150j5222m5426
$$ -89271 -147258 -118810 -76655 -153228 -133112 -93130 -61910 105115 90399 98549 83327 37901
7224C7901R899J524J04996K0150q6220q3381P68O5502P9763K9606m8599m6772
$$ 37901 47800 49324 154320 174470 88250 4869 5637 71139 150902 180508 131909 85137
7212H5137j43738n9540O2880L8449r2295m4530O4332Q4588M6618l9160m508q48
$$ 85137 -58601 -118141 -55261 -16812 -109107 -153637 -89305 -4717 41901 2741 -1767 -2615
7200b615j07515j6312P7293O7771R206j9633l5920j36123p2762J09792Q6375L5990
$$ -2615 -110130 -126442 -49149 18622 27828 8195 -27725 -163848 -236610 -126818 -40443 -4453
7188d453j24129o8731j4717R99J07346Q5506n6383m255P5639R1151r8368M059
$$ -4453 -128582 -197313 -212030 -211031 -103685 -18179 -74562 -78817 -3178 87973 -10395 -6336
7176f336N0378M061p213j22710q8698M1911P8022J00535N5629O139j4159j11913
$$ -6336 44042 48103 40890 -81820 -170518 -128607 -50585 49950 105579 111718 97559 -14354
7164a4354P9528L768n1798o7024Q1845R2211p8622r8618L5930P3150P7557K6781
$$ -14354 65174 68942 17144 -49880 31965 124176 45554 -53064 -17134 56016 133573 160354
7152A60354p5019j12167L5629P5779P1103o1969q6544m3724O4064Q8891n7010
$$ 160354 85335 -26832 8797 84576 155679 93710 7166 -36558 27506 116397 59387
7141E9387j1040L5671o099k4177j8383k3862N0303j3931j16073J5176M0580L2637
$$ 59387 48347 84018 77919 53742 35359 11497 61800 47869 -68204 -53028 -12448 20189
7129B0189j8691k0827o4826J9740J29789L072l5205r3465l0862M1520O998j0628
$$ 20189 1498 -19329 -84155 -64415 65374 68446 33241 -60224 -91086 -49566 -42568 -53196
7117e3196L7805M1651J5373q5916N658L7598l3500N9610Q3218k909o4661j3970
$$ -53196 -15391 26260 41633 -44283 -38625 -1027 -34527 25083 108301 105392 40731 26761
7105B6761o6579j19264m6462J01384P6842M6431K6335M2182j05577j22245N7604
$$ 26761 -39818 -159082 -205544 -104160 -27318 19113 45448 87630 -17947 -140192 -82588
7094h2588p19P0608R9234L3310j1790j4956o3159M052M5700k5325o2658P4205
$$ -82588 -83307 -12699 86535 119845 108055 93099 29940 33992 79692 54367 -8291 65914
7082F5914o3991o0582O0438M173J017M5304j283n5555j33125O7714J82013M2529
$$ 65914 1923 -58659 1779 5952 6969 52273 50990 -4565 -137690 -69976 112037 154566
7070A54566m4315j62280P152J10230M417n4312o5005J2082R823L1333N142p4005
$$ 154566 110251 -52029 -44877 65353 69770 15458 -49547 -37465 -27642 3691 8833 -65172
7058f5172q4724J41292L9311j5828j14113j15238k0438j4723R557O6479P3270
$$ -65172 -149896 -8604 30707 14879 -99234 -214472 -234910 -249633 -240076 -173597 -100327
7047a00327N2782O4002J9948k4705m2145P695o5468r8657j8246j6264L9919L2986
$$ -100327 -47545 16457 36405 11700 -30445 -22750 -88218 -186875 -205121 -221385 -181466 -148480
7035a48480O1204M9142q0794n5549K2147P9164K2748k7319m2074l3550l4685r414
$$ -148480 -87276 -38134 -118928 -174477 -152330 -73166 -50418 -77737 -119811 -153361 -188046 -197460
7023a97460J1036J29740m6388R104J2421o2857M970j8335k8854j12774K1313Q3164
$$ -197460 -186424 -56684 -103072 -93968 -81547 -144404 -139434 -157769 -186623 -299397 -278084 -194920
7011a94920N2710Q1739l237n3963q1830l9943O9931O9257n0766l4713p148q7912
$$ -194920 -142210 -60471 -63708 -117671 -199501 -239444 -169513 -100256 -151022 -185735 -192883 -280795
6999b80795K1705J05315L5278p7154K1332m4468K4974P8798j8953m953J06276
$$ -280795 -259090 -153775 -118497 -195651 -174319 -218787 -193813 -115015 -133968 -138921 -32645
6988c2645k2549k3923o9910K3501J19402K4836m0895J1584p96o3984L9761n298
$$ -32645 -55194 -79117 -149027 -125526 -6124 18712 -22183 -10599 -11395 -75379 -35618 -40916
6976d0916n9759J3974L0727J36008o3106p8131l5696p8121q3124J46524M0443
$$ -40916 -100675 -86701 -55974 80034 16928 -61203 -96899 -175020 -258144 -111620 -71177
6965g1177q401o8527j00208L6158Q8625M0856M2352N8043r5021K2166K4403j12159
$$ -71177 -79578 -148105 -248313 -212155 -123530 -82674 -40322 17721 -77300 -55134 -30731 -142890
6953a42890r842J17101J51371J1020p1610k8934l149N6133j4099q1634l5060L8777
$$ -142890 -152732 -35631 115740 126760 55150 26216 23067 79200 65101 -16533 -51593 -12816
6941a2816J599K3744j3933L281L7515P4445P399l5079m9463J6551R5344O5394
$$ -12816 -11217 12527 -1406 1875 39390 113835 121234 86155 36692 53243 148587 213981
6929B13981r3399r0759r403n7429m7281J6386N6456N9512j8253M9143j1768L9439
$$ 213981 120582 29823 20420 -37009 -84290 -67904 -11448 48064 29811 78954 67186 106625
6917A06625p8959n3402j1544O7391J5150j3517j28257L3743M7167r7451J247J03575
$$ 106625 27666 -25736 -37280 30111 45261 31744 -96513 -62770 -15603 -113054 -111807 -8232
6905h232K238n8787r530K7418k273J4887M8357k650r060j6554l8869j1375p0134
$$ -8232 -5994 -64781 -74311 -46893 -49166 -34279 14078 11428 2368 -14186 -53055 -64430 -134564
6892a34564J1560K6242L6079L9421j9143j4477r74J64649l1899J804m6465O111
$$ -134564 -123004 -96762 -60683 -21262 -40405 -54882 -55856 108793 76894 78698 32233 38344
6880C8344L2157J2908K6357L4050l4884q150N481P1279j22300k06304J9255M4052
$$ 38344 70501 83409 109766 143816 108932 100782 106263 177542 55242 -151062 -131807 -87755
6868h7755j0563l69j1399L9598L2467K4678K2151j2719k4743J2452q393l2191
$$ -87755 -98318 -98687 -110086 -70488 -38021 -13343 8808 -3911 -28654 -16202 -24595 -56786
6856e6786J0691K5098j17305J9764J20939K5556J4765q2101o5327M0257k1490
$$ -56786 -46095 -20997 -138302 -118538 2401 27957 42722 -39379 -104706 -64449 -85939
6845h5939q2702M6800p5482O1839J64614j8820q0018Q4483N3242k1788o097J306
$$ -85939 -168641 -121841 -197323 -135484 29130 10310 -69708 14775 68017 46229 40132 41438
6833D1438q8312m1516J49393J13081q3483q6482j8838K0686j19722M4976L6185
$$ 41438 -46874 -88390 61003 174084 90601 4119 -14719 5967 -113755 -68779 -32594
6822c2594J00163o8336m5150N2834M3274j3957P792J5704q2362n0487K4978l9104
$$ -32594 67569 -767 -45917 6917 50191 36234 44026 59730 -22632 -73119 -48141 -87245
6810h7245n4420J03905Q7130o5479p181k8665K5743Q9361J8550j02667o9540l7496
$$ -87245 -141665 -37760 49370 -16109 -23290 -51955 -26212 63149 81699 -20968 -90508 -128004
6798a28004J16058P8298P524m1888k15K2890Q713m4354L5749J196j06495p6365
$$ -128004 -11946 66352 73876 31988 31773 54663 63376 19022 54771 55967 -50528 -126893
6786a26893Q3516k6129k2871M0292l1904k8908N4928j2934q2877l9355J7077O2493
$$ -126893 -43377 -69506 -92377 -52085 -83989 -112897 -57969 -70903 -153780 -193135 -176058 -113565
6774a13565R6771N2971q597N658K1292J6926k7755L6641l0694J2166R7L7827N8687
$$ -113565 -16794 36177 27580 33238 54530 71456 43701 80342 49648 61814 61911 99738 158425
6761A58425m2739j03350n4970N2364P0761j512r0054j14008K5351L1363o697q3725
$$ 158425 115686 12336 -42634 9730 80491 78979 -11075 -125083 -99732 -68369 -75066 -158791
6749a58791K5453K52744M0280p4496j64842j15736L7485N8397M0863n7540m4060
$$ -158791 -133338 119406 159686 85190 -79652 -195388 -157903 -99506 -58643 -116183 -160243
6738a60243K6823P8902J02784j0900m8200l4497o1553l5958O6497J4368m9318
$$ -160243 -133420 -54518 48266 37366 -10834 -45331 -106884 -142842 -76345 -61977 -111295
6727a11295j3860j1495P9199P2088p2779Q669J36443J59946J14904r1646r4957
$$ -111295 -125155 -136650 -57451 14637 -58142 -49473 86970 246916 361820 270174 175217
6716A75217l6386O1099q0116j11606o5313K1398N3157N7148o3647N4789J06430
$$ 175217 138831 199930 119814 8208 -57105 -35707 17450 74598 10951 65740 172170
6705A72170k9517j6871q55l5573n0868k1681n6767l3627L0083K6420l0720n503
$$ 172170 142653 125782 124927 89354 38486 16805 -39962 -73589 -43506 -17086 -47806 -53309
6693e3309M186K9656P4358p6019j2397L1196j559n4722L55R5983K9638K0254K1956
$$ -53309 -49123 -19467 54891 -21128 -33525 -2329 -3888 -58610 -58255 37728 67366 87620 109576
6680A09576q83m2822q1324o3587M3925J18911r5179n9685R3008j5193R63L3705
$$ 109576 108693 65871 -15453 -79040 -35115 83796 -11383 -71068 21940 6747 7710 41415
6668D1415L6991L1872N6169k3895k0262K0075j14010m1321o2280k3156J02537
$$ 41415 78406 110278 166447 142552 122290 142365 28355 -12966 -75246 -98402 4135
6657D135M852k6778K5963J41023r275r0089n8106L65K1443L8859k9077j95530
$$ 4135 8987 -17791 8172 149195 139920 49831 -8275 -7910 13533 52392 23315 -172215
6645a72215o8318J11962O2940P4654j0691j7124K8166L7238r5524J4839l061q7524
$$ -172215 -240533 -128571 -65631 9023 -1668 -18792 9374 46612 -48912 -34073 -37134 -124658
6633a24658M769O6361j8613K4098N345L114k6059q2171l4546P7858j3546K0056
$$ -124658 -119889 -53528 -72141 -48043 -42698 -39584 -65643 -147814 -182360 -104502 -118048 -97992
6621i7992J04866j9580k6642p8107N4253O5105l4236n7969O3966l0482l068K3586
$$ -97992 6874 -12706 -39348 -117455 -63202 1903 -32333 -90302 -26336 -56818 -59886 -36300
6609c6300N2857K1900k7410P7771K3595p5852L0582P1529m9943m0443k6344Q2076
$$ -36300 16557 38457 11047 88818 112413 36561 67143 138672 88729 48286 21942 104018
6597A04018m679n5252L9116m3317p5005n7234P6422J7380J41237k0502j0219P2033
$$ 104018 99339 44087 83203 39886 -35119 -92353 -15931 1449 142686 122184 111965 183998
6585A83998Q864n8378L2700K2471m0701l6738j10491r0287J4515q511l5240J02
$$ 183998 192862 134484 167184 189655 148954 112216 1725 -88562 -74047 -82558 -117798 -117696
6573a17696n325o595k7143l7788P029R9235J07240j5200M8313q614n029l4067
$$ -117696 -123021 -129616 -156759 -194547 -187518 -88283 18957 3757 52070 43456 38427 4360
6561D360m8509J5277N0818l1367r2711l5314l0456K1428j3174L4549n5064l91
$$ 4360 -44149 -28872 21946 -9421 -102132 -137446 -167902 -146474 -159648 -125099 -180163 -180554
6549a80554N6398M3438P1743n247j1146q1878n0956K237O2046M8493k1456J14379
$$ -180554 -124156 -80718 -8975 -14222 -25368 -107246 -158202 -155965 -93919 -45426 -66882 47497
6537D7497R6147o2007j11877k4375m3673O019R593l125q015R4325n7235P844o5963
$$ 47497 143644 81637 -30240 -54615 -98288 -92269 -82676 -85801 -93816 509 -56726 -48882 -114845
6524a14845K8072P2068K5998N9385O6134j18891m1265o8611N2042O9765o3771
$$ -114845 -86773 -14705 11293 70678 136812 17921 -23344 -91955 -39913 29852 -33919
6513c3919j04705k9011O1938J39862K7127Q935O0759k7546n7445k8627n8844j03207
$$ -33919 -138624 -167635 -105697 34165 61292 70227 130986 103440 45995 17368 -41476 -144683
6501a44683q5897N2966J27792M908q1468j0654O8509O2538j40263p691M7899O1012
$$ -144683 -230580 -177614 -49822 -44914 -126382 -137036 -68527 -5989 -146252 -153943 -106044 -45032
6489d5032K3970j01859n5299K7474J83636P6749q2423K1686J6009o6423l9039
$$ -45032 -21062 -122921 -178220 -150746 32890 109639 27216 48902 64911 -1512 -40551
6478d0551J49340N5661j35056j28437J0554J0966J5926R856j4717P0166O7263
$$ -40551 108789 164450 29394 -99043 -88489 -77523 -61597 -51741 -66458 3708 70971
6467G0971m8988l4396m2166N9210K337R0868L885q2981l0649K6441N6418J933
$$ 70971 21983 -12413 -54579 4631 6968 97836 101721 18740 -11909 14532 70950 72883
6455G2883P0729j31359j28683N1031N0009K4451o2515j5734k9041n5520M8285
$$ 72883 143612 12253 -116430 -65399 -15390 9061 -53454 -69188 -98229 -153749 -105464
6444a05464J28508N5268M3627K4186M9841q252q5814j45425M3444K1147N3675
$$ -105464 23044 78312 121939 146125 195966 187714 101900 -43525 -81 21066 74741
6433G4741K9371J7753N1748j10999k6117m5872j0198l4859k0909j6314l8733J24108
$$ 74741 104112 121865 173613 62614 36497 -9375 -19573 -54432 -75341 -91655 -130388 -6280
6421f280J6398R285l8587m0456M4043J8031r6417k3007P4031K4070Q5507P4362
$$ -6280 10118 19403 -19184 -59640 -15597 2434 -93983 -116990 -42959 -18889 66618 140980
6409A40980n7532r9364n1838M5998O855k8575q8964K0757O2789L9569l1865J7228
$$ 140980 83448 -15916 -67754 -21756 -14901 -43476 -132440 -111683 -48894 -9325 -41190 -23962
6397b3962j415L6689R506k2201n1335j63926m8134Q8828J72298J18327L5364p348
$$ -23962 -25377 11312 20818 -1383 -52718 -216644 -264778 -175950 -3652 114675 150039 142691
6385A42691n9216q8940m2407R97r4838q7231l7411P040L6628J14418K4813l1691
$$ 142691 83475 -5465 -47872 -46875 -141713 -228944 -266355 -259315 -222687 -108269 -83456 -115147
6373a15147O7294K0091k1770J6500K6745j3444K8318R9201M9164l1593j3410j9785
$$ -115147 -47853 -27762 -49532 -33032 -6287 -19731 8587 107788 156952 125359 111949 92164
6361I2164q5675j7510k0321n4938L8640J1425J9023j1823j9662p1269n8964K7969
$$ 92164 6489 -11021 -31342 -86280 -47640 -36215 -17192 -29015 -48677 -119946 -178910 -150941
6349a50941N3852Q5010K3012J0232k1778N0299l3145n3287P7180M413l5280m4508
$$ -150941 -97089 -12079 10933 21165 -613 49686 16541 -36746 40434 44847 9567 -34941
6337c4941r061J9931P414j20292q8496l2636O2497M4775o213j0905m7709K116
$$ -34941 -44002 -24071 -16657 -136949 -225445 -258081 -195584 -150809 -157022 -167927 -215636 -213520
6325b13520J07658J02698J1631N2834r6199L7332J5410j8217o1174L862P262R998
$$ -213520 -105862 -3164 8467 61301 -34898 2434 17844 -373 -61547 -57685 -50423 -40425
6313d0425J0001J8315j6671l602m0329o9041O5383k3252r23j18021O3458O8902
$$ -40425 -30424 -12109 -28780 -32382 -72711 -141752 -76369 -99621 -100544 -218565 -155107 -86205
6301h6205L0310O8996k9139n4887L4925N6958L5953o71J9108K121o0952o6200
$$ -86205 -55895 13101 -16038 -70925 -36000 20958 56911 56240 75348 77469 16517 -49683
6289d9683K9690n4540N2008j0660L5515N6271Q1385n8737q3620o3024k0121J00422
$$ -49683 -19993 -74533 -22525 -33185 2330 58601 139986 81249 -2371 -65395 -85516 14906
6277A4906K8364l6137m6480N6460N7834R996m1325p21m6575n8790l4363m4840
$$ 14906 43270 7133 -39347 17113 74947 84943 43618 42897 -3678 -62468 -96831 -141671
6265a41671R9103R2563N3751J621N0222n8088m4865j12839j20666J8941Q5046
$$ -141671 -42568 49995 103746 105367 155589 97501 52636 -60203 -180869 -161928 -76882
6254g6882j7290M7107L9920j8232q18m0814o024o7521q9213J56099L9484j02284
$$ -76882 -94172 -47065 -7145 -25377 -26195 -67009 -73033 -140554 -229767 -73668 -34184 -136468
6242a36468q611l2829P4713O7309l2119J4112p0717m1031J03761N4019n8279l0864
$$ -136468 -145079 -177908 -103195 -35886 -68005 -53893 -124610 -165641 -61880 -7861 -66140 -97004
6230i7004L1858J22608p6069m4078M4953l6739l9563k604O84O1211n0352q1266
$$ -97004 -65146 57462 -18607 -62685 -17732 -54471 -94034 -96638 -95954 -34743 -85095 -166361
6218a66361L943K8899N7412K4613Q661n9316J17580J28133J1173j44567p3541
$$ -166361 -162418 -133519 -76107 -51494 -42833 -102149 15431 143564 154737 10170 -63371
6207f3371J818n8306m930Q4736k497n0864O7714m8759r84P9019J3013k5301j6338
$$ -63371 -61553 -119859 -124789 -40053 -42550 -93414 -25700 -74459 -75443 3576 16589 -8712 -25050
6194b5050j12700p0302K9091N2261J01943O2887k9516K1275q5866m8351l522m0167
$$ -25050 -137750 -208052 -178961 -126700 -24757 38130 8614 29889 -55977 -104328 -107850 -148017
6182a48017m8645l8174K4752R4956J31090M3844J8155p2103J0844J02316J865
$$ -148017 -196662 -234836 -210084 -115128 15962 59806 77961 5858 16702 119018 120883
6171A20883q6185r714R0786L5588p1801p7140r9935K942J74131M6766q1516n1083
$$ 120883 34698 24984 115770 151358 79557 2417 -97518 -94576 79555 126321 44805 -6278
6159f278k2464K3027K338M5389q1229k9857L5926M4547l4753q4442m2984m1166
$$ -6278 -28742 -5715 -3377 42012 -39217 -69074 -33148 11399 -23354 -107796 -150780 -191946
6147a91946M9531R3490P3616N6798K2908j2740n6627l9793R192n8192r5673p6392
$$ -191946 -142415 -48925 24691 81489 104397 91657 35030 -4763 4429 -53763 -149436 -225828
6135b25828J48243J72154L5352l2159P3166j9306p8697j10668n2001j54975L2433
$$ -225828 -77585 94569 129921 97762 170928 151622 72925 -37743 -89744 -244719 -212286
6124b12286J41412P3972K2588K9611k4039n6660m593j7581J06191p4k0111L1841
$$ -212286 -70874 3098 25686 55297 31258 -25402 -29995 -47576 58615 58541 38430 70271
6112G0271M1999p333J877p280l0684j33517j28098P4991J69770P2055o6490l2913
$$ 70271 112270 104937 106814 99534 68850 -64667 -192765 -117774 51996 124051 57561 24648
6100B4648Q4981j9881p4926o9066m496P2998o485O0726P6993j9676l1415L0565
$$ 24648 109629 89748 14822 -54244 -58740 14258 7773 68499 145492 125816 94401 124966
6088A24966q8294j12428N155n8117O3367L8451q501N4217J0083m6549l9544J05129
$$ 124966 36672 -75756 -70601 -128718 -65351 -26900 -35401 18816 28899 -17650 -57194 47935
6076D7935O0303j4371k3984L9925n3025n9051m9556o4552j14754j4269O2836J01759
$$ 47935 108238 93867 69883 109808 56783 -2268 -51824 -116376 -231130 -245399 -182563 -80804
6064h0804L3048J9413j39101N7170R4591r618M2495K2057P6177K385k9499n8845
$$ -80804 -47756 -28343 -167444 -110274 -15683 -25301 17194 39251 115428 117813 88314 29469
6052B9469M7992n5786p0797J3422J5999l920m5313r3837N874J01016P7972n6867
$$ 29469 77461 21675 -49122 -35700 -19701 -23621 -68934 -162771 -156897 -55881 22091 -34776
6040c4776l7013j6166J4947q638K1177J1441r862m1248J38273J15519q0858k1761
$$ -34776 -71789 -87955 -73008 -81646 -60469 -49028 -58890 -100138 38135 153654 72796 51035
6028E1035o4217l6419n5062l0958J41300R6296k0177P555o7593r441m3414k0617
$$ 51035 -13182 -49601 -104663 -135621 5679 101975 81798 89353 21760 12319 -31095 -51712
6016e1712M2442n3187l6014l0462J31829M7144m82J5322k3831l9829N9068P1912
$$ -51712 -9270 -62457 -98471 -128933 2896 50040 49558 64880 41049 1220 60288 132200
6004A32200j2574m2078k3248P1465p9792l3701k4554j9980n3669o0112J28456
$$ 132200 119626 77548 54300 125765 45973 12272 -12282 -32262 -85931 -146043 -17587
5993a7587N3756M369q987m1316M6300K2482n1995p1399k7799M4384J05164K5225
$$ -17587 36169 40538 31551 -9765 36535 59017 7022 -64377 -92176 -47792 57372 82597
5981H2597l1902l5952J2867J156j1649j6735L5239P7364n1212k7363l9237l0821
$$ 82597 50695 14743 27610 28766 17117 382 35621 112985 61773 34410 -4827 -35648
5969c5648P5644R4775R6868m861q4859k7304m1693j03281o0120R8303N3159M7576
$$ -35648 39996 134771 231639 226778 141919 114615 72922 -30359 -90479 7824 60983 108559
5957A08559j44155m3843L1747N3610k9292Q359J18768p107r974R409K5486q1261
$$ 108559 -35596 -79439 -47692 5918 -23374 -15015 103753 96646 86672 96081 121567 40306
5945D0306p4585m0774N0070j25907m3140J03709Q2104M5103j31392N6754M0096
$$ 40306 -34279 -75053 -24983 -150890 -194030 -90321 -8217 36886 -94506 -37752 2344
5934B344n4493O178J06727l0480j33454J1015L9260P715L1026J3627P5025l8820
$$ 2344 -52149 -45971 60756 30276 -103178 -92163 -52903 -45188 -14162 -535 74490 35670
5922C5670J7830M4885l2175o2284j548O6083L8697J5617Q74k6698p1826p9878
$$ 35670 53500 98385 66210 3926 2378 68461 107158 122775 123649 96951 25125 -54753
5910e4753L6640Q1159L0527M2303J2014K8985q4321r6171l536P7816M7160o6323
$$ -54753 -18113 63046 93573 135876 147890 176875 92554 -3617 -7153 70663 117823 51500
5898E1500p1960j6116K9399n9105l7031R7583N1262r3860K0206L6338M2750o6898
$$ 51500 -20460 -36576 -7177 -66282 -103313 -5730 45532 -48328 -28122 8216 50966 -15932
5886a5932o1860j4308p483k1890M2421R3409L1120L5101N8738j16344M199k2297
$$ -15932 -77792 -92100 -99583 -121473 -79052 14357 45477 80578 139316 22972 27171 4874
5874D874J4927N5763J7064q6880l3810k100K4840J6110j02467k5519m347O8124
$$ 4874 19801 75564 92628 5748 -28062 -30162 -5322 10788 -91679 -117198 -121545 -53421
5862e3421N8495N357L1751O9595P2680m8471j46950R2795J08307j29783r7505
$$ -53421 5074 10431 42182 111777 184457 135986 -10964 81831 190138 60355 -37150
5851c7150p119L2655k8729J2789L2272k042k1968k8173p7183M5213J29991J08499
$$ -37150 -44269 -11614 -40343 -27554 4718 2676 -19292 -47465 -124648 -79435 50556 159055
5839A59055k5498r0967p1998j01595j46577J11265J49096J07109J9159q6297k018
$$ 159055 133557 42590 -29408 -131003 -277580 -166315 -17219 89890 109049 22752 20734
5828B0734p3161J1902O1854N433n1498r7434m7643L5718R5790P8752l6320j35259
$$ 20734 -52427 -40525 21329 26762 -24736 -122170 -169813 -134095 -38305 40447 4127 -131132
5816a31132l2454N6400m2875l177M2017R6283j4625n828K4795k2683m1604M3611
$$ -131132 -163586 -107186 -150061 -153238 -111221 -14938 -29563 -35391 -10596 -33279 -74883 -31272
5804c1272O8000K4755K3761M5411r8150q9258K2629J3967k7067k892l087m0499
$$ -31272 36728 61483 85244 130655 32505 -56753 -34124 -20157 -47224 -50116 -53203 -93702
5792i3702q382k5670P2946K0495o3399K3845m4358j305Q2627J9013q6308q5923
$$ -93702 -102084 -127754 -54808 -34313 -97712 -73867 -118225 -119530 -36903 -17890 -104198 -190121
5780a90121M834P6828M6751L2515L3447J9810j394r3010J7227o703J1005o911
$$ -190121 -185287 -108459 -61708 -29193 4254 24064 22670 -70340 -53113 -59816 -48811 -55722
5768e5722k0905J0513l8963L7034o2329l6620O9528L2903l1464K1892M6836J6971
$$ -55722 -76627 -66114 -105077 -68043 -130372 -166992 -97464 -64561 -96025 -74133 -27297 -10326
5756a0326q1917L0074O5695K1004j5639k4437k4051k7469l4910k272l8042l3287
$$ -10326 -92243 -62169 3526 24530 8891 -15546 -39597 -67066 -101976 -104248 -142290 -175577
5744a75577J8884Q0946L6333K3322o0208K0646k118l7172N9788j8260r091k071
$$ -175577 -156693 -75747 -39414 -16092 -76300 -55654 -57772 -94944 -35156 -53416 -62507 -64578
5732f4578M7807j0880N2341J12642m8273p3996n6727P6223P5081j3051p9361j02591
$$ -64578 -16771 -27651 24690 137332 89059 15063 -41664 34559 109640 96589 17228 -85363
5720h5363O5237J25148K92j19172m9132N0464j07944l4932O2075L5553o9854R0247
$$ -85363 -20126 105022 105314 -13858 -62990 -12526 -120470 -155402 -93327 -57774 -127628 -37381
5708c7381k356r9203q2840O4806n095L666L6215K7726Q41M7253n5855l7340J21361
$$ -37381 -39737 -138940 -221780 -156974 -162069 -158403 -122188 -94462 -93621 -46368 -102223 -139563 -18202
5695a8202M7431M7996j35555Q569K1092q0361O5403R6523J4082q7637m4230k3481
$$ -18202 29229 77225 -58330 -49761 -28669 -109030 -43627 52896 66978 -20659 -64889 -88370
5683h8370J07148J06543K0819r4159j53533l9471q8880M1585Q1902l596k6914
$$ -88370 18778 125321 146140 51981 -101552 -141023 -229903 -188318 -106416 -110012 -136926
5672a36926k532Q0730K8988J3629J4740N2347m6550j9711L4736M7785r5765l2652
$$ -136926 -139458 -58728 -29740 -16111 -1371 50976 4426 -15285 19451 67236 -28529 -61181
5660f1181O7969L7866K6507M5698j24333j54776l1351R4326Q4385l144L3614K4065
$$ -61181 6788 44654 71161 116859 -7474 -162250 -193601 -99275 -14890 -18034 15580 39645
5648C9645m5173n5291J4266l0836l3542N351Q7884R29J1873Q5959m060n7886l6999
$$ 39645 -5528 -60819 -46553 -77389 -110931 -105580 -17696 -16767 -4894 81065 77005 19119 -17880
5635a7880K4684j9512m8620M4324J3259L9871j9002n2557n9623N4014L8708l2789
$$ -17880 6804 -12708 -61328 -17004 -3745 36126 17124 -35433 -95056 -41042 -2334 -35123
5623c5123k8523K8711P5080K1187N3841o6395m8869n6867j8987n3511M580r70
$$ -35123 -63646 -34935 40145 61332 115173 48778 -91 -56958 -75945 -129456 -124876 -125846
5611a25846L5337N2537P9251L8370n0823q7135q2886K8654J49825P9651p3581
$$ -125846 -90509 -37972 41279 79649 28826 -58309 -141195 -112541 37284 116935 43354
5600D3354j05785R870M1405J04576J23559j468j28257j07708M9005P4584n4151
$$ 43354 -62431 -52561 -11156 93420 216979 215511 87254 -20454 28551 103135 48984
5589D8984r1558j48119n8522K7531P1675l216K6457P3486L2872o7447j698l6578
$$ 48984 -42574 -190693 -249215 -221684 -150009 -153225 -126768 -53282 -20410 -87857 -89555 -126133
5577a26133O1218J11878m5480N4568M6580L4057j9732l9222M292q7361L1654o4009
$$ -126133 -64915 46963 1483 56051 102631 136688 116956 77734 82026 -5335 26319 -37690
5565c7690q2428k7737J27115Q4877O4745k7031j49066o3644N8866J4887k0553
$$ -37690 -120118 -147855 -20740 64137 128882 101851 -47215 -110859 -51993 -37106 -57659
5554e7659N647k1603O4405J3001P62J515l8073Q5020j2829j47445j33912M1804
$$ -57659 -52012 -73615 -9210 3791 4553 6068 -32005 53015 40186 -107259 -241171 -199367
5542a99367O0919p8357o821R7516J41510Q0700r2415q7553j4709R2220o1723m2604
$$ -199367 -138448 -216805 -223626 -126110 15400 96100 3685 -83868 -98577 -6357 -68080 -110684
5530a10684L8194N1959j8385P8651N1450P902M3471m2677m2401K6042p9360p0669
$$ -110684 -72490 -20531 -38916 39735 91185 99087 142558 99881 57480 83522 4162 -66507
5518f6507J8430J59983N0867N7474k8494l7962n1385j13562K7200q4677p8562
$$ -66507 -48077 111906 162773 220247 191753 153791 102406 -11156 16044 -68633 -147195
5507a47195j3965J05021J11276l0151p7139j04146K9533J30149k458K1350O6523
$$ -147195 -161160 -56139 55137 24986 -52153 -156299 -126766 3383 925 22275 88798
5496H8798n435k0774J1482o4113J38739N48m6590L5734K3275m783L1007Q1982
$$ 88798 83363 62589 74071 9958 148697 149245 102655 138389 161664 156881 187888 269870
5484B69870o6311k6177N502o3037r0040K8589J1288p9294R906j5628k1987K7055
$$ 269870 203559 177382 182884 119847 29807 58396 69684 -9610 296 -15332 -37319 -10264
5472a0264N684L864j3154o3485r351J7096j3704J2669K6688L2242o8899j21562
$$ -10264 -4580 -716 -13870 -77355 -86706 -69610 -83314 -70645 -43957 -11715 -80614 -202176
5460b02176O611l8130J17623N0044K4591k1053K8397q7540L4264O8514L7390p161
$$ -202176 -195565 -233695 -116072 -66028 -41437 -62490 -34093 -121633 -87369 -18855 18535 11374
5448A1374k306k9077r8355k3226J4547k4028m2412N2203J51700R6586j9121n4427
$$ 11374 9068 -20009 -118364 -141590 -127043 -151071 -193483 -141280 10420 107006 87885 33458
5436C3458l9216N3316K1061l377l9221o0o0155P181P5214r0834q109n353k5685
$$ 33458 -5758 47558 68619 65242 26021 25961 -34194 -27013 48201 -42633 -50742 -56095 -81780
5423h1780n6159m3551j253l4440j4191l4757J65666J86502j20321j15957N2974
$$ -81780 -137939 -181490 -182743 -217183 -231374 -266131 -100465 86037 -34284 -150241 -97267
5412i7267J20859p2368n5245L5536K5233P6659l8756j4039n8209L3797J4117J2047
$$ -97267 23592 -48776 -104021 -68485 -43252 33407 -5349 -19388 -77597 -43800 -29683 -17636
5400a7636O8375L935j09439l3072M0497n4462l5661q376K2299R4045O1012N8146
$$ -17636 50739 54674 -54765 -87837 -47340 -101802 -137463 -145839 -123540 -29495 31517 89663
5388H9663j8366q5320l1634j2635L0384K408P4717k724n7926n5883p8227J00142
$$ 89663 71297 -14023 -45657 -58292 -27908 -25500 49217 46493 -11433 -67316 -145543 -45401
5376d5401K4006k5224N5459P1552Q516j73O8408j2510R267m8063J3206M151q4064
$$ -45401 -21395 -46619 8840 80392 88908 88735 157143 144633 153900 105837 119043 123194 39130
5363C9130j57486m2485m4689J9398L4268J00589k5903Q5948K7781r7630j3285
$$ 39130 -118356 -160841 -205530 -186132 -151864 -51275 -77178 8770 36551 -61079 -74364
5352g4364m1538m7644N4719L8894Q6145N594L4590n530n0398j2278Q8811m9145
$$ -74364 -115902 -163546 -108827 -69933 16212 21806 56396 50866 468 -11810 77001 27856
5340B7856n2046l6864P1805K7149L5879L6247j1016m3620m1123M5040J4127L065
$$ 27856 -24190 -61054 10751 37900 73779 110026 99010 55390 14267 59307 73434 76499
5328G6499j44997k3691K9210Q629N0841l7615j51326p0191K0196Q8982J16102
$$ 76499 -68498 -92189 -62979 -54350 -3509 -41124 -192450 -262641 -242445 -153463 -37361
5317c7361L0906n5637o1779J0139J56573J8386j3002k8795J1943j3101m1886N8482
$$ -37361 -6455 -62092 -123871 -113732 42841 61227 48225 19430 31373 18272 -23614 34868
5305C4868R6768k3035K0868N7014k1825j58534l8349l491m6870L3136M6152j8172
$$ 34868 131636 108601 129469 186483 164658 6124 -32225 -35716 -82586 -49450 -3298 -21470
5293b1470r2749N0275l5034j46471L8241O8371M390N8346J50263R9210N2519j21150
$$ -21470 -114219 -63944 -98978 -245449 -207208 -138837 -134447 -76101 74162 173372 225891 104741
5281A04741M452o0185j13618n0492P1094l9914o6988M2001O3666m412P8412K6889
$$ 104741 109193 49008 -64610 -115102 -44008 -83922 -150910 -108909 -45243 -49655 28757 55646
5269E5646m3656o3625P609P8620m4701q2341Q7924R4254J5357K1865p8870r0936
$$ 55646 11990 -51635 -44026 34594 -10107 -92448 -4524 89730 105087 126952 48082 -42854
5257d2854j10430K5061R5304M255q621j493M1311M7409J4876m857N277M4659N353
$$ -42854 -153284 -128223 -32919 -28664 -37285 -38778 2533 49942 64818 59961 65238 109897 115250
5244A15250o7998j1567r821o3483p0864m5561K0655N2069r9862L7681O3537M1404
$$ 115250 47252 35685 25864 -37619 -108483 -154044 -133389 -81320 -181182 -143501 -79964 -38560
5232c8560J30298L2372o7275q9882K0143J378j17016j52278j4085R6820J15058
$$ -38560 91738 124110 56835 -33047 -12904 -11526 -128542 -280820 -294905 -198085 -83027
5221h3027N1651M5642L6693l4627k8948Q0607K919K4291J0279q0403l9270Q0740
$$ -83027 -31376 14266 50959 16332 -12616 67991 70910 95201 105480 25077 -14193 66547
5209F6547o133k7869J2453m8486N1197N515j28358k0944o4143K7781P7617J14081
$$ 66547 60414 32545 44998 -3488 47709 53224 -75134 -96078 -160221 -132440 -54823 59258
5197E9258R7012p8089j01078k2871r3524J08276R7036M7541R148J1763j247j0244
$$ 59258 156270 78181 -22897 -45768 -139292 -31016 66020 113561 122709 134472 133225 122981
5185A22981j01962q2304J9824R1362m7691m9217R2958O917m3551N9857K4768p3150
$$ 122981 21019 -61285 -41461 49901 2210 -47007 45951 52868 9317 69174 93942 20792
5173B0792m3621r2839Q4780R7436O4725j21448j26968m4881J2263M4971Q1065
$$ 20792 -22829 -115668 -30888 66548 131273 9825 -117143 -162024 -149761 -104790 -23725
5162b3725o042L376N0297o0163q2253m2904j0945Q8703M6159K5294O9891L3848
$$ -23725 -29767 -26391 23906 -36257 -118510 -161414 -172359 -83656 -37497 -12203 57688 91536
5150I1536k7130l7787J17145q1675j17613R9962Q4946M1995l9980j7021m307m6294
$$ 91536 64406 26619 143764 62089 -55524 44438 129384 171379 131399 114378 110071 63777
5138F3777j48474K3041O9509j13829M763J01226P1732j49224L0485j1515N0599
$$ 63777 -84697 -61656 7853 -105976 -101213 13 71745 -77479 -46994 -58509 -7910
5127g910J0707m2922k6229K7396j09587j05560J5538L7810K9564N7920K727n1696
$$ -7910 2797 -40125 -66354 -38958 -148545 -254105 -238567 -200757 -171193 -113273 -110546 -162242
5115a62242O1249n534L9418K7174p5495j4635p200J00505P4278K6796M0283K251
$$ -162242 -100993 -106527 -67109 -39935 -115430 -130065 -137265 -36760 37518 64314 104597 106848
5103A06848O5533Q1971o1188m5486m2611o1863k5722N0712M5192n9242q4104j7913
$$ 106848 172381 254352 193164 147678 105067 43204 17482 68194 113386 54144 -29960 -47873
5091d7873Q9845m295M3084p6144l6105r8211P545M5940N9719J25842R3261p6580
$$ -47873 41972 37677 80761 4617 -31488 -129699 -122154 -76214 -16495 109347 202608 126028
5079A26028m489K9986k458q7877m9345K2043m7086l1053K1632L8039O4618o1330
$$ 126028 121539 151525 149067 61190 11845 33888 -13198 -44251 -22619 15420 80038 18708
5067A8708q1684J84066l7645o1410m1972N5220L8652K8250J8869l9499p9687m2703
$$ 18708 -62976 121090 83445 22035 -19937 35283 73935 102185 121054 81555 1868 -40835
5055d0835K7565N8275L7867L2319q0154j22968K1399l5745o451O8043o8286J1017
$$ -40835 -13270 45005 82872 115191 35037 -87931 -66532 -102277 -108728 -40685 -108971 -97954
5043i7954O8437m4079j2490J5557M8667J7510L434k0911J06291j1668q5665l4258
$$ -97954 -29517 -73596 -86086 -70529 -21862 -4352 -918 -21829 84462 72794 -12871 -47129
5031d7129L1651J13759p1695m3862o0166J4062K3337j4034L096k7466j6907K4278
$$ -47129 -15478 98281 26586 -17276 -77442 -63380 -40043 -54077 -50981 -78447 -95354 -71076
5019g1076j6856L6112R0868j08713o1372R110o1130n4464J27214M6878M0329k1435
$$ -71076 -87932 -51820 39048 -69665 -131037 -121927 -183057 -237521 -110307 -63429 -23100 -44535
5007d4535L8375n9684l9403N0261m9953L8955M7778J6679j0698K0314m2367P8409
$$ -44535 -6160 -65844 -105247 -54986 -104939 -65984 -18206 -1527 -12225 8089 -34278 44131
4995D4131P9788Q3966l7047o333p4531n8647m00J13506j070q5794m2966o791j10901
$$ 44131 123919 207885 170838 164505 89974 31327 30927 144433 143363 57569 14603 7812 -103089
4982a03089j1039N9476m391N6737J84316L499M1751m7089j68728j0574j6386P1155
$$ -103089 -114128 -54652 -59043 -2306 182010 185509 227260 180171 11443 869 -15517 55638
4970E5638l194j40757J9223k3565K1599J87k5659P779j18110N1389J55154J17317
$$ 55638 52444 -88313 -69090 -92655 -71056 -70869 -96528 -88749 -206859 -155470 -316 117001
$$ [...]
##END NTUPLES=NMR SPECTRUM
##END=
