##TITLE=Analysis number 323403
Compound Code cc 60423
Book Reference 470/119
Project Code adrs
Chemist Name mikem
##JCAMPDX= 6.0         $$ Bruker NMR JCAMP-DX V2.0
##DATA TYPE= NMR SPECTRUM
##DATA CLASS= NTUPLES
##ORIGIN= Bruker BioSpin GmbH
##OWNER= nmr
$$ XWIN-NMR		Version 3.5
$$ Tue Oct 24 11:58:38 2006 GMT Daylight Time (UT+1h)  MAYBRIDGE\nmr@NMR_250MHZ
##.OBSERVE FREQUENCY= 250.131544655141
##.OBSERVE NUCLEUS= ^1H
##.ACQUISITION MODE= SIMULTANEOUS (DQD)
##.ACQUISITION SCHEME= undefined
##.AVERAGES= 16
##.DIGITISER RES= 18
##SPECTROMETER/DATA SYSTEM= dpx250
##.PULSE SEQUENCE= zg30
##.SOLVENT NAME= CDCl3
##.SHIFT REFERENCE= (INTERNAL, CDCl3, 0, 16.522)
##AUDIT TRAIL= $$ (NUMBER, WHEN, WHO, WHERE, WHAT)
$$ ##TITLE= Audit trail, XWIN-NMR		Version 3.5
$$ ##JCAMPDX= 5.01
$$ ##ORIGIN= Bruker BioSpin GmbH
$$ ##OWNER= nmr
$$ C:\u/data/dgb/nmr/ADRS/1160/pdata/1/auditp.txt
$$ ##AUDIT TRAIL=  $$ (NUMBER, WHEN, WHO, WHERE, WHAT)
(   1,<2006-10-24 11:58:15.97 +100>,<MAYBRIDGE\nmr>,<NMR_250MHZ>,
      <created by zg, POWCHK disabled, PULCHK disabled
       configuration hash MD5:
       49 4B E0 1D 92 C2 6B 37 9F E6 65 BC 52 41 86 1D
       data hash MD5: 64K
       CA 2D 66 81 6D 02 3C 01 F3 0E 8A 70 AE 78 51 E1>)
(   2,<2006-10-24 11:58:28.62 +100>,<MAYBRIDGE\nmr>,<NMR_250MHZ>,
      <Start of raw data processing
       ef LB = 0.3 FT_mod = 6 PKNL = 1 SI = 32K 
       data hash MD5: 32K
       DC 6F DB 90 F0 FB 80 0F F0 3A 23 54 88 10 D6 C0>)
(   3,<2006-10-24 11:58:30.36 +100>,<MAYBRIDGE\nmr>,<NMR_250MHZ>,
      <apk 
       data hash MD5: 32K
       55 EC 12 8C 65 A9 1B 26 27 8D CC ED 25 9F EF 4B>)
(   4,<2006-10-24 11:58:31.18 +100>,<MAYBRIDGE\nmr>,<NMR_250MHZ>,
      <abs ABSG = 5 
       data hash MD5: 32K
       36 2C F9 2B 6A FF D8 8E 11 0D 75 92 61 C9 3F 35>)
$$ ##END=
$$ 
$$ hash MD5
$$ D0 A4 10 D5 EE 4F 63 41 B9 97 4F 5E AF A5 C9 17
##$RELAX= 
##$RELAX= 
##$RELAX= 
##$RELAX= 
##$RELAX= 
##$RELAX= 
##$RELAX= 
$$ Bruker specific parameters
$$ --------------------------
##$DU= <C:\u>
##$EXPNO= 1160
##$NAME= <ADRS>
##$PROCNO= 1
##$TYPE= <nmr>
##$USER= <dgb>
##$AMP= (0..31)
100 100 100 100 100 100 100 100 100 100 100 100 100 100 100 100 100 100 
100 100 100 100 100 100 100 100 100 100 100 100 100 100 
##$AQSEQ= 0
##$AQ_mod= 3
##$AUNM= <au_zg>
##$AUTOPOS= <21 >
##$BF1= 250.13
##$BF2= 250.13
##$BF3= 250.13
##$BF4= 250.13
##$BF5= 500.13
##$BF6= 500.13
##$BF7= 500.13
##$BF8= 500.13
##$BYTORDA= 1
##$CFDGTYP= 0
##$CFRGTYP= 5
##$CHEMSTR= <none>
##$CNST= (0..31)
1 1 145 1 1 1 1 1 1 1 1 1 1 1 1 1 1 1 1 1 1 1 1 1 1 1 1 1 1 1 1 1 
##$CPDPRG= <>
##$CPDPRG1= <>
##$CPDPRG2= <>
##$CPDPRG3= <>
##$CPDPRG4= <mlev>
##$CPDPRG5= <mlev>
##$CPDPRG6= <mlev>
##$CPDPRG7= <mlev>
##$CPDPRG8= <mlev>
##$CPDPRGB= <>
##$CPDPRGT= <>
##$D= (0..31)
0 1 0 0 0 0 0 0 0 0.06 0 0 0 0 0 0 0.0002 0 0 0 0 0 0 0 0 0 0 0 0 0 0 
0 
##$DATE= 1161687495
##$DBL= (0..7)
120 120 120 120 120 120 120 120 
##$DBP= (0..7)
150 150 150 150 150 150 150 150 
##$DBP07= 0
##$DBPNAM0= <>
##$DBPNAM1= <>
$$ [...]
##$SUBNAM7= <"">
##$SUBNAM8= <"">
##$SUBNAM9= <"">
##$SW= 20.6930455092707
##$SWIBOX= (0..15)
0 0 3 0 0 0 0 0 0 0 0 0 0 0 0 0 
##$SW_h= 5175.983436853
##$TD= 65536
##$TD0= 1
##$TE= 683.16
##$TE2= 300
##$TE3= 300
##$TEG= 300
##$TL= (0..7)
0 120 120 120 120 120 120 120 
##$TP= (0..7)
150 150 150 150 150 150 150 150 
##$TP07= 0
##$TPNAME0= <>
##$TPNAME1= <>
##$TPNAME2= <>
##$TPNAME3= <>
##$TPNAME4= <>
##$TPNAME5= <>
##$TPNAME6= <>
##$TPNAME7= <>
##$TPOAL= (0..7)
0.5 0.5 0.5 0.5 0.5 0.5 0.5 0.5 
##$TPOFFS= (0..7)
0 0 0 0 0 0 0 0 
##$TUNHIN= 0
##$TUNHOUT= 0
##$TUNXOUT= 0
##$USERA1= <user>
##$USERA2= <user>
##$USERA3= <user>
##$USERA4= <user>
##$USERA5= <user>
##$V9= 5
##$VALIST= <valist>
##$VCLIST= <CCCCCCCCCCCCCCC>
##$VD= 0
##$VDLIST= <DDDDDDDDDDDDDDD>
##$VPLIST= <PPPPPPPPPPPPPPP>
##$VTLIST= <TTTTTTTTTTTTTTT>
##$WBST= 1024
##$WBSW= 4
##$XGAIN= (0..3)
0 0 0 0 
##$XL= 0
##$YL= 0
##$YMAX_a= 325877
##$YMIN_a= -410733
##$ZGOPTNS= <>
##$ZL1= 120
##$ZL2= 120
##$ZL3= 120
##$ZL4= 120
##$ABSF1= 16.522
##$ABSF2= -4.171173
##$ABSG= 5
##$ABSL= 3
##$ALPHA= 0
##$AQORDER= 0
##$ASSFAC= 0
##$ASSFACI= 0
##$ASSFACX= 0
##$ASSWID= 0
##$AUNMP= <proc_1d>
##$AZFE= 0.1
##$AZFW= 0.1
##$BCFW= 0
##$BC_mod= 0
##$BYTORDP= 0
##$COROFFS= 0
##$CY= 12.5
##$DATMOD= 1
##$DC= 0
##$DFILT= <>
##$DTYPP= 0
##$F1P= 14.0000005364418
##$F2P= -0.99999901652339
##$FCOR= 0.5
##$FTSIZE= 32768
##$FT_mod= 6
##$GAMMA= 0
##$GB= 0
##$INTBC= 1
##$INTSCL= 1
##$ISEN= 128
##$LB= 0.3
##$LEV0= 0
##$LPBIN= 0
##$MAXI= 10000
##$MC2= 0
##$MEAN= 0
##$ME_mod= 0
##$MI= 0
##$NCOEF= 0
##$NC_proc= -4
##$NLEV= 6
##$NOISF1= 0
##$NOISF2= 0
##$NSP= 0
##$NTH_PI= 0
##$NZP= 0
##$OFFSET= 16.522
##$PC= 1
##$PHC0= -48.02597
##$PHC1= 5.159039
##$PH_mod= 1
##$PKNL= yes
##$PPARMOD= 0
##$PSCAL= 4
##$PSIGN= 0
##$REVERSE= no
##$SF= 250.13
##$SI= 32768
##$SIGF1= 0
##$SIGF2= 0
##$SINO= 400
##$SIOLD= 32768
##$SREGLST= <1H.CDCl3>
##$SSB= 0
##$STSI= 32768
##$STSR= 0
##$SW_p= 5175.98343685301
##$SYMM= 0
##$S_DEV= 0
##$TDeff= 65536
##$TDoff= 0
##$TI= <Analysis number 999999
Compound Code 99
Book Reference 9
Project Code 9>
##$TILT= no
##$TM1= 0
##$TM2= 0
##$TOPLEV= 0
##$USERP1= <user>
##$USERP2= <user>
##$USERP3= <user>
##$USERP4= <user>
##$USERP5= <user>
##$WDW= 1
##$XDIM= 32768
##$YMAX_p= 330567153
##$YMIN_p= -152783
$$ End of Bruker specific parameters
$$ ---------------------------------
##NTUPLES= NMR SPECTRUM
##VAR_NAME=  FREQUENCY,     SPECTRUM/REAL,   SPECTRUM/IMAG
##SYMBOL=    X,             R,               I
##VAR_TYPE=  INDEPENDENT,   DEPENDENT,       DEPENDENT
##VAR_FORM=  AFFN,          ASDF,            ASDF
##VAR_DIM=   32768,         32768,           32768
##UNITS=     HZ,            ARBITRARY UNITS, ARBITRARY UNITS
##FACTOR=    0.157963299565203, 1,           1
##FIRST=     4132.6476996994, 0,             0
##LAST=      -1043.33573715361, 0,           0
##MIN=       -1043.33573715361, -152783,     0
##MAX=       4132.6476996994, 330567153,     0
$$ Real data points
##PAGE= N=1
##DATA TABLE= (X++(R..R)), XYDATA
$$ [...]
20068 -4523 -11582 5810 10586 -16953 -24559 -42248 -86627 -76512 -93964 -126786 -103525 -71597
20056 -71597 -79803 -47604 -15864 20780 3003 -16898 -8722 18986 2286 -10542 1918 3229
20044 3229 -2704 -6994 -15514 -15190 -54981 -61186 -44776 5314 -7835 -13197 -27522 -18178 -5256
20031 -5256 -4637 -533 -30486 -87109 -62529 -30996 -44518 -49447 -66025 -83076 -70585 -31879 -6573
20018 -6573 17969 46901 28031 44318 36773 50152 43288 -15657 -11714 14676 -3216 -31087
20006 -31087 -13558 -24114 -29565 -5364 -24633 -31089 -8641 -2039 -28318 -39691 -36744 -64907
19994 -64907 -40617 -32463 -49770 -75933 -58271 -32829 -29816 -6157 -8136 -3297 994 5196 8821
19981 8821 -24581 -31055 -22219 -980 14473 12294 7106 17648 19858 -3010 -3192 -21506 -53625
19968 -53625 -41656 -26091 8992 12991 5588 5227 14351 7916 -16853 -18238 -36176 -55204 -13034
19955 -13034 -4559 5180 -16931 -33155 -33538 -50971 -52717 -48004 -43979 -43436 -57364 -89587 -90445 -73551
19941 -73551 -56442 -40505 -15201 792 -40187 -31803 -75993 -89824 -53128 23857 6976 -29738
19929 -29738 -21418 60 17234 -2028 7218 4853 4267 -38167 -57016 -35456 -10955 -3123 18034
19916 18034 -32722 -46501 -24125 -17466 -18986 -24107 -40754 -35473 -19476 -24244 -31825 -37058 -42518
19903 -42518 -29797 -37952 -25240 16630 8826 -30399 -20022 -22008 -9317 -36462 -43727 -18458
19891 -18458 -14533 -26676 -6129 -57977 -29533 -9743 -22396 -50443 -58598 -50340 -6979 4380
19879 4380 -23432 -9472 23856 8852 -8900 -38857 -10376 261 -12070 -20533 -8053 -14138
19867 -14138 -5352 -437 -25421 -33508 -11456 -36363 -33879 -18518 -56883 -34304 -20952 -19911 -22515
19854 -22515 -26103 -50687 -44412 -41416 -37054 -9088 -11540 -41104 -58060 -67234 -26120 -44141 -68367
19841 -68367 -48521 -44795 -60213 -68838 -38866 -3321 -9073 -21967 -9403 -1300 -3233 -15335 -31108
19828 -31108 -44910 -633 18588 7889 -32953 -28649 -32676 -37083 -37770 -75611 -67232 -19228 31333
19815 31333 6904 11578 30871 -21204 11176 40693 -14885 -27655 -26675 -31026 -46934 -54249 -48090
19802 -48090 -17685 -34665 -49663 -2978 18003 3151 -50550 -71675 -67553 -40110 -20097 -17978
19790 -17978 -25601 -18284 -6389 -5334 26269 -12527 -29996 -33656 -22624 7324 -3027 4783 28080
19777 28080 10308 -28387 -52231 -66119 -51180 -56580 -99803 -76202 -48811 -11594 -10377 -11209
19765 -11209 6213 24182 22050 13383 -28624 -39791 -36955 -51569 -33805 -32339 -56408 -41420
19753 -41420 -17419 -3594 20031 19355 38048 -6178 -11185 -19595 -20561 -3904 22722 40274 76446
19740 76446 60950 -5624 -31373 -15606 -5929 23233 39819 14484 -5523 -16021 -20215 -50901
19728 -50901 -60549 -92463 -78829 -60719 -48005 -49675 -88067 -62430 -73729 -84078 -44203 -5354
19716 -5354 -12815 -49340 -58123 -39207 -8488 -36771 -7995 -20960 -32278 -34327 11245 7713 -9123
19703 -9123 -28107 -42804 1540 28760 13051 -7044 -13064 -13535 -52078 -22718 16320 26994
19691 26994 45850 37726 35400 44506 -3036 -28659 -473 -19160 -47709 -16324 -11412 -11624 5827
19678 5827 11880 10490 17094 8612 -32040 -59499 -16000 -9200 -31134 -4034 22941 18946 16953
19665 16953 -6938 -13447 -13635 -28163 -16843 -18706 -61267 -40523 -47702 -47040 -65641 -22591 -47637
19652 -47637 -90543 -66275 -99497 -107695 -65966 -65660 -65755 -7280 -13020 -56681 -46895 3715 4473 2843
19638 2843 -7904 -24514 -8211 -6576 -28074 -32993 21295 6307 -31497 -45423 -39990 -26905
19626 -26905 -11333 11418 43961 53899 50594 -8636 -36732 -3080 1624 5551 396 7849 -18077
19613 -18077 -20969 -30772 -23073 -37101 -34197 -34171 -30167 -38015 -19277 16384 12311 -4909 -10825 -12448
19599 -12448 -3527 490 8109 -19955 -15717 14462 -10366 -33294 -21858 5782 37242 42154 19127
19586 19127 -6668 26772 17951 -3052 -24966 -23611 -27003 -36854 -40827 -37801 -37115 -26858 -10856
19573 -10856 -1063 4709 -32659 -41534 -36867 -33504 -44381 -3870 39762 40455 59085 45959 21372
19560 21372 19738 5789 -5097 9962 -3536 -40543 -38299 -41145 -48485 -47783 -45230 -49328 -43807
19547 -43807 -37543 -76576 -107283 -102602 -48744 -43264 -29169 -46047 -54621 -30110 -16192 -36435
19535 -36435 -24894 -45069 -63616 -64890 -37474 -24742 -5230 -11200 65 16225 35758 15727
19523 15727 -3220 -49156 -99338 -81177 -44541 -31783 -30320 -29803 -38811 -17159 -24250 -69518 -64983
19510 -64983 -32560 25120 44035 25840 -1767 -33599 -32278 -31364 -28455 -860 -17428 -24803 -12595
19497 -12595 -19707 -3603 32158 10191 6396 -9704 -43577 -60320 -39644 -31734 -8764 -35851
19485 -35851 -59964 -57199 -36752 -13163 1191 -1483 39591 43320 4370 -19676 -33219 -55630
19473 -55630 -41749 -50123 -83561 -85329 -64491 -28430 -35600 -42634 -65910 -106584 -78053 -56545
19461 -56545 -28631 -4456 -22688 25090 19091 -46941 -57117 -52610 -42323 -24983 -2024 -9629
19449 -9629 9137 20058 4524 -554 -13372 -22074 -25447 -60558 -77828 -61292 -41145 -65416
19437 -65416 -54561 -29699 -52772 -80017 -59718 -22591 -1934 6785 5749 -25555 -30405 -38709
19425 -38709 -35988 -21266 -21236 -7601 60631 68717 42740 45414 25289 7588 3573 20115 535
19412 535 -40054 -37915 -64711 -78175 -37135 -6332 5830 1889 10938 30673 12474 -20571 -35836
19399 -35836 -16840 -1273 2320 608 -16126 -22204 -21151 -15042 14498 34372 41006 8209 -30222
19386 -30222 -42526 -16078 565 -9127 -23770 -30485 -4963 -909 8953 16418 6398 -28039 -18144
19373 -18144 3386 -9134 -3235 7007 -13043 -16127 -16019 -26321 -54822 -33242 4859 -4363 -46457
19360 -46457 -72729 -75774 -63850 -78710 -65744 -54140 -54209 -63869 -43191 17775 39924 37631 5779
19347 5779 855 17405 1216 -22300 -44110 -28639 -43465 -72842 -55541 -25485 3803 -23048
19335 -23048 -16684 18484 -4055 4881 20727 57856 67736 31775 -2605 4907 26848 49417
19323 49417 5868 1313 9666 -9926 -21682 -33344 -24526 14787 40138 84347 85987 43942
19311 43942 8133 -16363 -16515 -12493 -28267 -23699 -23300 4601 26480 -6491 -6437 12575 8966 -9426
19297 -9426 -33124 -84039 -114698 -74861 -66022 -63495 -62287 -34192 -35831 -37865 -42393 -60074 -85446
19284 -85446 -72930 -49677 -33806 -27105 -43087 1554 37342 34615 20611 4298 -35614 -39415
19272 -39415 -21556 -41642 -43269 -34722 -37795 -61656 -41101 -27190 -41877 -52404 -47306 -51311 -10548
19259 -10548 45528 61553 19469 -19192 -11569 -22914 5890 7199 12657 4608 -16454 -41797
19247 -41797 -61595 -47532 -21969 5296 -419 -33453 -43644 -51301 1098 32121 9435 -19530
19235 -19530 4922 56840 50250 2832 -4116 -15078 3532 41920 48587 25591 31844 31535 26206
19222 26206 19982 20751 23861 15934 -8332 11818 29779 37793 48342 51933 64172 76307 46940
19209 46940 43750 5771 -16988 -9626 31521 64284 50110 31356 50851 35582 35468 62140
19197 62140 67037 70274 49063 16358 48223 54476 75334 89226 65956 44724 85820 138379
19185 138379 176111 240567 247422 259101 260676 242729 243728 293502 315634 296324 287430 315636
19173 315636 370904 370194 352461 288049 235221 216911 214299 239205 251636 240438 209755 188379
19161 188379 146700 143547 111598 111899 124942 115403 97161 90679 109631 103861 77080 63517 114465
19148 114465 156718 137408 119896 106271 93545 85941 117877 152643 135865 142196 199265 276205
19136 276205 365027 413616 491583 553493 615162 641188 622326 560912 529035 492473 467336
19125 467336 448645 433071 469166 494264 469100 464726 496482 467520 420495 370879 297719 246194
19113 246194 197463 168682 153281 178661 204731 182636 156165 133586 126970 98413 82302 80432
19101 80432 112185 80139 46412 41630 48423 36197 18566 43153 74508 99020 133101 147791
19089 147791 146992 170061 169785 177783 211424 233414 222679 243028 265604 269665 241990 266047 274738
19076 274738 247441 260912 256041 284761 308677 280997 222192 169119 117911 117931 104718 70431
19064 70431 57554 72417 109289 106932 89972 101547 118975 105827 58442 42715 30240 16875
19052 16875 22119 37611 70846 42863 36043 61212 77056 88117 87104 74727 56290 65768
19040 65768 61680 70861 77118 86803 70005 29852 26532 14863 18188 50057 34601 23186 6055
19027 6055 32944 36316 26707 51019 21470 33538 27229 2933 6343 30394 22784 76283 83813
19014 83813 59497 77395 84682 59153 58924 53211 72156 50262 34181 32498 49172 34759 11151
19001 11151 -3620 2809 3494 -14753 46512 87308 90346 47795 62774 82551 93416 102586 104901
18988 104901 99126 118664 113428 75981 62468 81813 117703 77043 37717 28718 52288 73449
18976 73449 42685 35606 35363 76678 85381 61193 52748 74449 82267 84358 52083 30837 29609
18963 29609 46959 54159 58352 47113 36628 39547 31108 47202 49691 29401 44226 31776 -10531
18950 -10531 -9667 -12684 1962 20015 6050 -27159 -20639 23876 50947 68912 64580 62339 59193
18937 59193 72174 99781 123153 142553 131968 101688 39173 25453 13972 6534 11381 -10449
18925 -10449 -6442 41718 79293 32230 3839 32212 13105 13418 -1332 -8858 16178 25296 17043
18912 17043 29019 52152 31246 -4981 20563 49861 50414 76318 83783 73964 66804 33071 20370
18899 20370 -8088 -27372 -37094 -58814 -27910 1934 14326 23377 27748 7316 -8113 -17496
18887 -17496 19542 38910 45147 47955 42868 43388 28372 33261 32966 23217 3021 16549 47116
18874 47116 81248 115957 99516 34181 50147 89196 53399 43618 36002 11880 5418 3231
18862 3231 17815 14816 -2475 -3093 26895 34452 8447 2599 2606 11438 13973 -17574 -34814 -87404
18848 -87404 -108981 -70073 -5604 1307 18560 2799 -44418 -40743 14894 61485 42885 45146
18836 45146 88106 72720 54623 51135 97435 81871 37087 383 -22398 -37629 -17743 3379
18824 3379 6413 5434 12389 57204 76130 82781 80772 57127 65192 81002 77933 62064 49314
18811 49314 13235 -11005 -7808 -14608 -37243 -42308 -60786 -48733 -55079 -79724 -72535 -60711 -86042
18798 -86042 -76019 -41759 -28807 -27285 -20269 -9479 2062 -125 4086 -9314 -13615 -14763 -32682
18785 -32682 -22229 -15264 -12720 -6102 23191 45981 49777 64076 85002 77023 65640 91287 90526
18772 90526 86876 115782 178269 189929 176213 186439 178242 120115 72499 21852 -23735 -2002
18760 -2002 45181 34650 38749 16492 -44767 -61204 -53062 -3105 746 -39030 -18142 3031
18748 3031 24952 46278 67776 51220 -2469 -5777 6374 20923 32622 65797 69501 66712
18736 66712 72620 69632 47522 8629 11413 28226 21084 -14110 -14859 25039 50346 63953 87597
18723 87597 90536 99312 73093 105721 99987 111462 122407 120788 112752 101873 114676 128897 149425
18710 149425 137910 168146 179410 186896 152794 128981 130121 139063 123867 102205 108094 137293
18698 137293 137374 76019 51051 63792 140006 141474 123890 131355 115729 87764 82355 47450 48769
18685 48769 60558 71029 66143 59881 71630 72419 116077 134491 150167 166869 164177 160819 196513
18672 196513 270702 305555 320696 302212 288822 295296 309504 282335 295409 367666 423139 461093
18660 461093 524539 584959 630477 710412 784767 827393 839464 815490 835765 888356 912373
18649 912373 931923 998989 1045372 1087008 1197411 1422076 1683665 1939583 2239810 2586269
18639 2586269 3057162 3707798 4581744 5809346 7450971 9694079 12860981 17026811 21498247
18630 21498247 25495132 29110702 31567240 31804117 30377303 28236063 25006417 22369670
18622 22369670 21746979 23270521 26291345 29165727 31824365 34004893 34050853 31426555
18614 31426555 27890016 23070800 17604072 13265838 10207809 8128621 6725189 5743011
18606 5743011 5085631 4677088 4355504 4093182 3826808 3573737 3408308 3279737 3196858 3176475
18596 3176475 3219846 3337992 3437431 3593555 3829393 4179838 4608810 5232301 6135118 7375326
18586 7375326 9136246 11574091 15009575 19600228 24403793 28705014 32606890 35098178
18578 35098178 35058913 33346445 30845955 27143412 24361949 23797998 25482747 28633876
18570 28633876 31698881 34449753 36511688 36304576 33405122 29479047 24182816 18383251
18562 18383251 13791568 10543796 8297558 6757239 5679613 4916113 4362795 3939949
18554 3939949 3586025 3262385 2981044 2748901 2527157 2339732 2163540 2019807 1920551 1773725
18544 1773725 1668566 1565054 1517135 1445428 1362257 1244618 1150938 1080887 1043297 1001829 951115
18533 951115 893304 857764 809745 743013 723025 721677 699004 677232 623786 590173 569646 571710
18521 571710 554480 502108 474641 504073 478569 478976 483018 454876 429076 395876 360650 393190
18509 393190 429922 399335 405267 397080 380163 326412 306075 330931 319785 340672 351591 292704
18497 292704 265651 262255 247754 262357 284765 293437 311581 335705 321292 298995 282906 287873
18485 287873 285420 295279 270804 264083 267647 252050 267346 254147 259269 225500 224849 243770 232527
18472 232527 212939 200250 188659 192973 189378 191886 173044 180794 199836 175379 172494 179218 202674
18459 202674 224100 205736 180245 182723 140449 117410 69507 89274 136431 166225 164967 184442
18447 184442 200612 187431 167902 162715 188221 183015 184559 190941 175016 186030 200351 195164
18435 195164 191609 230443 218665 165026 159920 156251 137243 134447 137435 151728 158254 157973 159439
18422 159439 149550 140923 73539 59152 68940 80225 70697 81151 87298 67467 29122 51200
18410 51200 31101 35416 6391 9113 20084 66823 92995 72666 63536 84762 76487 92470
18398 92470 67317 32721 7083 257 46377 114487 127082 63535 47327 94169 76193 27596
18386 27596 1921 32623 54929 71030 92324 124244 103861 79085 87048 68326 51227 66397
18374 66397 83720 99734 120810 90920 78810 63690 44909 43539 21115 19069 2226 12994
18362 12994 10116 -11799 -10299 37460 37291 239 -50212 -99320 -107262 -85399 -58246 -48316 -18802
18349 -18802 -16997 9978 35393 43566 4062 -8396 10720 44576 42695 48298 87867 112175
18337 112175 119902 66012 2285 7410 12729 49202 49108 61426 85996 111447 100533 83188 62084
18324 62084 85114 92448 82221 68722 59885 73868 112569 149071 109040 72355 64857 80306
18312 80306 103940 82109 57475 48148 56348 64855 71508 87398 89128 102136 107632 76303 83845
18299 83845 105739 146001 159777 144785 103674 79606 59276 71655 120659 120259 123850 115942
18287 115942 110311 113638 150089 179474 217201 198636 191742 138003 103374 95996 93893 116090
18275 116090 155250 180799 188455 158584 160638 163595 152130 137001 160470 166751 125347 122056
18263 122056 178130 213669 221913 244686 273791 270732 320006 364887 370147 406185 460297 533629
18251 533629 566431 585129 621355 635568 645160 636702 584456 583511 650276 765999 826894 890441
18239 890441 1046707 1195851 1324842 1454493 1580942 1779132 2096281 2543685 3119699 3886223
18229 3886223 4938260 6395065 8419709 10951527 13114268 14168449 14869879 15456538
18221 15456538 14647381 12523793 10700619 9648396 9465603 10202571 11762085 13562761
18213 13562761 14483377 14685560 14877200 14339851 12074862 9348173 7211471 5724475 4704243
18204 4704243 3996965 3528451 3188981 2937047 2763304 2660331 2570718 2488010 2466810 2484039
18194 2484039 2535091 2574422 2610293 2714541 2911649 3174583 3539060 4009860 4692940 5659563
18184 5659563 6861906 8464542 10696213 13625901 16607382 18508165 19931769 21530927
18176 21530927 22274895 21442405 21045218 22266865 24730686 27145036 29443092 32137807
18168 32137807 33526531 32033173 29719750 27736335 24952233 22187858 20895947 21142412
18160 21142412 21598443 21247776 20867166 20520539 18476078 14907430 11702315 9283510 7578540
18151 7578540 6397373 5534730 4857221 4369813 4024948 3763844 3593132 3448425 3341083
18142 3341083 3271096 3263871 3280389 3357297 3466604 3591459 3755439 4013455 4409259 5010094
18132 5010094 5816298 6909234 8429109 10524665 13360887 16776670 19534338 20950196
18124 20950196 22076827 22985669 21811975 19218824 17396279 16972432 18039507 20640634
18116 20640634 24725171 29597044 34394649 40618150 49748408 55897162 53804588 51324554
18108 51324554 51935474 45913767 33089179 23321076 16932569 12801281 10099424 8200268
18100 8200268 6838119 5901803 5199771 4603569 4122047 3697096 3345399 3103922 2848297
18091 2848297 2615195 2415979 2254060 2124338 1975076 1804707 1701985 1607010 1472252 1361896
18081 1361896 1276692 1235266 1186989 1121348 1088909 1040264 1036012 1012825 978098 978982 995351 994455
18069 994455 991016 982916 970267 929301 907120 893665 844231 825235 809879 805936 791235 769973
18057 769973 753556 748943 758190 703323 677990 678484 660200 650451 627875 612951 580152 554478
18045 554478 507599 479091 467909 463835 440464 397127 350059 344529 359413 372573 353492 357040
18033 357040 339612 328045 337320 336840 355580 342616 306031 291848 285709 252537 190413 197823
18021 197823 211542 250926 239357 208467 201234 207354 244643 251813 266133 245079 197638 207866
18009 207866 254511 279303 307781 305057 319468 346925 355363 353146 353167 346212 293363 265031 268804
17996 268804 264206 266463 274836 298972 273221 242716 217949 179683 175125 185926 211183 227026
17984 227026 250196 254498 205211 193837 188847 184253 175695 183597 176500 163539 184681 179664 206269
17971 206269 206496 177886 183458 146133 91070 81923 119511 149624 144797 151661 217604 261083 230190
17958 230190 195058 205997 204202 211542 204227 206223 164866 110310 129493 174601 161816 135934
17946 135934 123969 116123 126656 140123 125684 155677 161449 144445 124759 123640 166310 183493
17934 183493 212986 224394 206586 188959 168542 155644 162241 190067 162163 168856 192469 172791
17922 172791 106304 78252 88853 76733 76168 109025 76521 92050 119078 141958 135754 88207
17910 88207 74536 100058 108305 132902 165834 184688 192806 189078 196705 158625 175251 206225
17898 206225 199962 198815 222059 238024 268741 269341 265737 252560 254878 203264 168104 197570 180574
17885 180574 203460 189654 144519 138869 136268 101432 91704 109876 168087 141784 140060 130081
17873 130081 93377 104596 101544 107057 98724 93370 115023 119939 126561 137548 136345 145800 141237
17860 141237 189364 233087 271636 281353 314693 317067 346173 291737 249691 244008 250828 265076
17848 265076 252038 217734 211631 158428 125461 149337 205495 225874 166298 166729 158459 147483
17836 147483 133245 151571 133260 143419 162068 155407 160678 132787 141487 137987 124854 133834
17824 133834 124150 150160 178608 202668 193495 155050 134381 120641 93197 82454 104967 87247
17812 87247 50063 55312 48815 77458 95846 101261 123915 100086 74606 78553 77917 65654 109898
17799 109898 127145 110692 92798 63987 67067 67732 63128 47075 59497 73472 60107 45818
17787 45818 61569 73988 78115 42477 63658 109418 106836 107910 93238 71748 23154 1630
17775 1630 50539 72305 58809 41426 64010 54683 27974 26065 3160 301 4177 29366 41263
17762 41263 88537 86428 44332 38246 25122 70295 139334 162376 122891 82155 99464 73173
17750 73173 23698 5480 53594 38696 38495 44665 58015 57974 33194 54181 59941 53672 88326
17737 88326 116866 79515 70096 67408 55456 77864 75360 68130 64737 80326 87878 111430 124789
17724 124789 94857 47871 48139 113902 141646 153001 176195 156328 143137 110477 76331 73861
17712 73861 97427 111240 126201 154718 145537 124354 73790 63189 89529 103632 118894 97789
17700 97789 88424 98121 135515 125968 115953 119311 133249 145307 143949 159858 177416 174560 157824
17687 157824 174660 166182 151255 156335 167794 214175 229230 248948 284172 280248 259785 248760
17675 248760 260409 251090 280359 338950 388634 387054 347791 325350 365104 426804 402882 412088
17663 412088 418343 436185 480137 504443 562689 592065 593615 621982 635184 648920 700906 797949
17651 797949 920644 1022343 1095136 1136110 1243277 1385116 1511090 1633776 1781779 1953476
17641 1953476 2186198 2461757 2797453 3266365 3888850 4707700 5778384 7101162 8879304
17632 8879304 11320781 14522548 18477655 23113791 28018199 32853870 37304360 40874470
17624 40874470 43363281 45058190 45951705 45947024 45348769 44232339 42069100 38570983 34143372
17615 34143372 29082345 23736975 18891320 14958456 11991838 9857614 8301008 7143505
17607 7143505 6272396 5626533 5067711 4597908 4261437 3964522 3700553 3477506 3281033
17598 3281033 3138166 3020285 2923687 2840148 2769759 2726229 2743195 2743590 2770095 2814554 2858862
17587 2858862 2947520 3125849 3381734 3751069 4263872 4945801 5876367 7120473 8822027
17578 8822027 11112717 14049493 17661257 21713519 25909545 29943030 33464358 35990959
17570 35990959 37529206 38380593 38485224 37850039 36894833 35505207 33232493 29988487 26093937
17561 26093937 21804205 17548457 13896613 11020380 8904193 7358020 6190559 5287397
17553 5287397 4609822 4073056 3681510 3409231 3142178 2864733 2649460 2460355 2268179
17544 2268179 2116183 1953447 1812511 1697661 1609450 1482211 1348371 1250406 1181110 1141252
17534 1141252 1104852 999967 900317 906390 897133 861180 774478 740278 700444 648615 626576
17523 626576 604160 579208 571817 556888 560949 584462 540339 522198 487662 450337 422705 422338
17511 422338 442745 471943 487605 473566 432289 414547 382738 346025 345108 371477 348008 332445
17499 332445 355854 391830 377027 372392 356876 361462 360676 366835 333529 329157 357836 369847 352465
17486 352465 307012 267521 240159 223839 218287 232353 272449 290900 267596 223147 222404 247775
17474 247775 265490 256824 271620 297420 297322 279839 225259 206798 249160 254243 245132 236263 255075
17461 255075 260160 243227 237882 199751 218413 246231 224367 233194 256350 271518 306549 335736
17449 335736 322255 299053 343881 408657 466785 472353 505631 564921 561242 531718 467714 418906
17437 418906 396213 370756 360426 375904 415606 429701 423848 380975 362238 320955 309200 326278
17425 326278 368773 374709 377369 392862 405993 450391 497831 559943 591699 654110 713080 738874
17413 738874 727549 733785 761589 859096 913437 982599 1068387 1270845 1473812 1725950 2058164
17402 2058164 2499860 3083001 3878798 4953932 6333213 8185992 10739976 14077260 17470751
17393 17470751 19921048 21796711 23675290 24640238 24179884 23707685 23348591 22502177 21518856
17384 21518856 20626384 18471368 14802418 11290008 8683208 6864192 5595701 4716141
17376 4716141 4088900 3647321 3322914 3068481 2884491 2773125 2686423 2592984 2513711 2454044
17366 2454044 2406533 2399934 2425327 2490228 2533656 2639509 2816344 3038673 3388855 3846523
17356 3846523 4455526 5349057 6499904 8007455 10059926 12888077 16667969 21169350
17348 21169350 25428572 29483053 34155193 38412819 40337205 41302997 42574808 42706196
17340 42706196 41354213 40190647 38409895 34619037 30498495 27050837 23042690 18319231
17332 18319231 14199195 11148510 8981008 7437022 6305418 5494340 4926744 4489118
17324 4489118 4152194 3854173 3601175 3381446 3184959 3029649 2952317 2838873 2704077 2614503
17314 2614503 2543143 2498882 2451765 2486449 2593489 2758970 3017437 3359565 3946037 4757732
17304 4757732 5794773 7187659 9125597 11749421 14691559 16948837 18502802 20037508
17296 20037508 21142927 20840650 20137274 19750009 19054537 18140096 17385134 15978797 13138341
17287 13138341 10082353 7663234 5927809 4704805 3873880 3308581 2900205 2545310 2273433
17278 2273433 2047835 1865785 1771289 1661654 1562751 1438024 1336561 1264947 1185527 1127852
17268 1127852 1074945 1052726 1016889 1001138 965443 909598 863497 813104 783674 739042 732790
17257 732790 690219 657259 618675 575806 555392 547812 513337 496359 475796 446830 395716 382666
17245 382666 410750 394893 365029 361176 383019 387387 393123 406689 392517 389014 407959 401370
17233 401370 354294 337993 364056 365462 349894 323129 324079 349814 364920 334208 313445 355304
17221 355304 415312 414931 386033 384739 421725 492572 514968 519677 537476 592084 562495 581847
17209 581847 578349 539878 515561 491455 457225 418924 391412 389238 374835 350929 345605 348447
17197 348447 335674 300885 278530 252912 205644 192055 183731 193581 220788 228331 227052 224040
17185 224040 198714 232167 231569 206269 225326 240631 232871 234447 262723 283986 278461 255275
17173 255275 248277 241363 237667 292289 324674 351266 366648 380556 389628 382124 435856 475324
17161 475324 507466 516993 517715 502831 514894 472219 409598 378505 364300 351856 340263 298399
17149 298399 258683 239748 221831 243603 228056 161598 154278 108540 99805 116308 125080 120200
17137 120200 104617 148016 196266 172135 156800 144741 164786 229967 238974 248916 252218 233269
17125 233269 240176 276158 309593 325272 314230 333522 329322 340725 374728 364345 328357 330496
17113 330496 290815 291289 251082 223557 266081 281180 224916 168098 152495 186099 228324 253125
17101 253125 210421 180724 161799 99136 80571 95031 132815 131018 85199 83809 109416 95554
17089 95554 93565 105922 107171 90697 115285 104348 85789 106717 168182 155964 135309 110766
17077 110766 114203 196314 250603 240605 257616 271931 261683 276169 305546 310165 326536 312055
17065 312055 292300 262930 224040 183042 166541 185956 139036 140923 143520 107738 89422 89774
17053 89774 111364 102202 78912 83742 110612 169914 144484 107214 99187 94143 38588 41438 82100
17040 82100 63611 82508 117653 127498 160048 212103 261244 257777 274977 293649 265162 237108
17028 237108 259453 281074 311906 324664 304987 259189 230845 179315 126835 123215 141835 115906
17016 115906 125081 122367 79280 86519 80216 83314 79313 75558 56832 41307 55929 100436 126902
17003 126902 138250 166293 173904 150679 187433 198093 186274 122746 79415 95561 127212 132281
16991 132281 162960 224230 226126 199956 228781 291162 269365 245323 250838 268041 242292 222895
16979 222895 213162 200409 175084 165420 149913 146333 147772 143272 146850 166878 169177 110312 64250
16966 64250 37839 58295 78681 62025 34987 40153 29126 42689 46022 22001 56633 69336
16954 69336 115164 134620 94712 64588 62866 46861 46541 51171 89583 111896 101540 76341
16942 76341 68935 87945 83832 77127 75322 97812 135279 141014 141883 123850 147452 175398 143983
16929 143983 132144 103885 100294 134144 121623 78049 64048 84584 72811 66085 90748 100502
16917 100502 125257 79584 77540 56349 27667 31175 60055 62241 90454 74685 33554 -21342
16905 -21342 -14288 -21782 1619 23860 43357 17713 10824 5912 13713 27590 9579 11331 36256
16892 36256 26031 -11905 -19440 3449 26613 51892 69321 49336 34078 14354 -475 17907
16880 17907 41522 93320 94306 114239 130726 122459 156399 188044 193536 174641 146316 149551 153787
16867 153787 118321 107217 104704 65495 43657 2810 -10630 13324 7018 -6052 -21065 -51440
16855 -51440 -47856 -27333 -2953 -5406 31920 58828 60638 64631 60733 66998 57014 37978 24828
16842 24828 43098 60026 73470 62497 59189 94264 122198 134695 146789 116985 103845 103547
16830 103547 138728 146292 136898 189031 206853 174455 168816 164595 148479 151378 183279 222548
16818 222548 202032 141019 135055 127425 123563 145167 138499 114271 64288 54897 58686 53186 18398
16805 18398 -19308 -9724 -675 11450 61093 86038 66475 60284 40965 40335 41302 66103 91303
16792 91303 104566 101438 80583 71141 80417 68908 60173 41647 47697 93560 139392 151294 126014
16779 126014 140222 154509 142947 134449 139516 126679 125433 115746 109325 56579 -8657 -21954
16767 -21954 -1995 10477 -11360 -5661 31987 27251 54582 90714 82049 52705 30685 35707
16755 35707 32486 -17819 1562 20663 26484 32676 27541 27889 39479 -11284 -28772 -19827 5154
16742 5154 17050 21814 5569 -15312 5096 35465 34658 39012 12918 -34239 -45452 -21076 -6551
16729 -6551 12283 -8490 -25279 -34355 -45841 -45796 -45431 -13010 -11140 7076 -5261 -19646 20803
16716 20803 3260 -2784 7327 -31154 -45479 -10220 12543 27541 24379 4275 22554 38612
16704 38612 29841 6642 -9767 -7463 19297 30788 20373 31013 49651 15181 1938 38108
16692 38108 35234 3705 -3067 5390 41316 44381 27428 18132 -4422 -11109 -30150 -44540 -65509
16679 -65509 -78699 -42621 -22706 6847 20187 2580 -5390 -3635 25681 29841 45846 20974
16667 20974 -8401 -16542 -14942 -45390 -18047 -411 22816 63491 35122 -6350 -14495 -11979
16655 -11979 -26849 -16484 5369 -601 18594 20710 45219 53791 33868 3839 11243 4069 -32280
16642 -32280 -11519 -28742 -38165 -26677 -14893 -27027 -36694 -47644 -7597 38564 6572 4318
16630 4318 30331 23541 39946 11699 -11500 3481 11029 29325 28507 20304 27693 40236 30670
16617 30670 20612 -22593 -28343 -7190 13766 -15604 -39926 -34024 -22439 -3337 18671 28163
16605 28163 19543 53817 74415 51858 48979 41790 5093 1836 14476 22966 4927 -3174 1550
16592 1550 11895 14010 24844 -30697 -47363 -41425 -25987 -54542 -76403 -51632 -11307 -17735
16580 -17735 -17260 -20261 -3923 -9272 -37249 -19082 32909 61248 15425 -33478 -14566 41803
16568 41803 70617 55657 55288 88617 50085 16934 17169 810 -6378 -4150 2141 -1994 -4081
16555 -4081 -10548 -1877 4413 -1667 -10852 -31697 -17900 -37219 -28468 -19723 -16122 -51302 -55404 -31733
16541 -31733 -1664 1501 -5648 -13754 -837 -22813 -12852 9140 -4280 9608 26105 47633
16529 47633 58697 26149 9211 -25460 -19106 19627 242 -5682 -11922 6547 18302 14228
16517 14228 3371 -22602 -36263 -69011 -51003 -39002 -26752 -41716 -76111 -75102 -66699 -65173
16505 -65173 -34956 -23867 -9306 -9096 -26858 -9680 -8878 -1484 -15259 -22812 -16179 -13802 -18913
16492 -18913 -47934 -19181 5511 33004 2638 -5674 697 -4779 16230 -24084 -40878 -72374
16480 -72374 -75592 -66112 -67965 -54771 -72229 -93212 -50648 -18214 -9341 -9547 -18695 -2460 -19325
16467 -19325 11004 38926 -2175 14272 67426 80039 43613 29846 -21186 -51925 -16645 -285
16455 -285 -4282 -22466 -19434 -13156 9775 5402 -12642 -2659 -27101 -39292 -47098 -23135 9595
16442 9595 -18790 -30681 -15685 -31038 -18544 12032 43323 31936 -14153 -8285 14951 24074
16430 24074 24526 15916 5852 6908 -18844 -37116 -22362 -16003 16850 52820 60021 42813 1947
16417 1947 17340 25697 22376 11682 -15754 -34312 4027 16380 13707 12668 20403 3257 -20857
16404 -20857 -31754 -16822 2459 39379 30372 -1967 -7091 -16361 13682 3903 -28870 -22446 1244
16391 1244 -7797 11640 37629 37504 41209 49629 78742 87415 75173 59724 59223 32084 25304 28493
16377 28493 -8234 13493 6303 -19787 -3869 9249 13861 -6333 -11002 15137 31068 19562
16365 19562 21975 38443 36023 24364 4969 -16284 -40237 -41272 -33698 -7898 -13493 -7298 -16527
16352 -16527 2742 705 -43923 -51742 -11738 -6773 -64086 -38495 -32647 -47509 -48582 -16254 189
16339 189 15374 -29753 -40591 -1016 27338 36626 14484 27955 -10642 -32979 -36454 1520
16327 1520 42125 7572 -35819 -62334 -53973 -38519 33412 84652 28384 -23114 -59976 -76211
16315 -76211 -45410 1138 27334 46854 25372 -10091 -35860 -41210 -60703 -78266 -57691 -59409
16303 -59409 -64376 -58324 -35299 -52952 -72408 -51306 -37926 -44546 -24827 -2367 24780 -15087
16291 -15087 -20103 -23927 -5396 27248 46349 15101 -17933 17191 60469 13472 -28021 -45096
16279 -45096 -58033 -45003 -65020 -46918 -22087 42552 62193 25982 40204 23193 25991 33063
16267 33063 26072 -1454 -19924 -27412 8276 34514 20072 9017 -5690 -15276 -33315 -26175
16255 -26175 -20857 -47825 -35312 -15257 -18484 -24367 -13279 22881 22254 5619 -7621 12553 16881
16242 16881 -17199 -35296 -56866 -15822 -6255 5643 -5810 -30068 -62266 -83509 -88669 -67893
16230 -67893 -27784 -31472 -51076 -23229 3991 -12988 -17717 -7728 2483 11425 2375 2135 -2507
16217 -2507 -4728 -63035 -50789 -58516 -37768 -4861 13240 53146 35236 -3576 -9558 11745
16205 11745 -15157 -13384 -39998 -46443 -38525 361 38512 23978 -4206 -31100 -48329 -18420
16193 -18420 -57601 -84407 -64629 -28405 4063 4051 -5621 -18760 -8736 11609 -20914 -58772
16181 -58772 -54587 -37536 -18351 23558 24301 15595 24452 22639 14191 17043 -15746 -15593 -8210 12078
16167 12078 -1503 -35070 -22052 -8269 4078 -4556 -40837 -41492 -21858 -20658 -26877 -24422 -21912
16154 -21912 4029 29521 16771 10979 -16763 -51866 -16258 50120 109716 95235 57403 53757
16142 53757 -8841 -64270 -32191 11877 198 5916 10920 30592 6509 -3960 3661 -10809
16130 -10809 -22749 -34614 -38162 -56082 -78233 -89671 -69336 -65714 -96398 -40997 11107 -6150
16118 -6150 -4397 -299 2208 -5418 -30472 -25306 3502 318 -7031 -353 -7933 -1452 18620 22167
16104 22167 -41865 -72879 -35245 -23818 -8688 -20317 -7431 -16278 -4496 -28025 -52073 -29460
16092 -29460 -23125 -3482 -3201 -43204 -38506 -26639 -8463 -6922 10462 9048 19616 19861 5200
16079 5200 -23976 -19198 1743 29145 25154 -799 3055 -6762 -14140 -24885 -44036 -36703 -14729
16066 -14729 23434 50911 23166 15962 -29768 -53984 -19974 30312 85183 81555 47508 9894
16054 9894 14949 -1557 -21932 -63243 -38283 -32417 -54697 -73499 -49190 -33155 -14586 -20941
16042 -20941 -21601 -32733 -53303 -68915 -52877 -35993 -5198 -3398 11587 26406 12770 -10522
16030 -10522 -9451 5118 34229 45477 33165 23853 843 -5744 -12521 -8110 -6631 -10933 -4183
16017 -4183 24670 36403 61193 27238 -23365 -43246 -64419 -60858 -52545 -44113 -21261 -6846
16005 -6846 -3534 -2621 8688 58333 40994 -763 -1244 8721 -5485 -6968 10139 -34249 -49632
15992 -49632 -51152 -35708 -2268 -12419 8846 15999 28618 -4610 -16257 -7228 -27959 -22657
15980 -22657 -34939 -69830 -97958 -74130 -44083 -14541 -25845 -42249 2627 31564 19027 -34194
15968 -34194 -37564 -56683 -63244 -39510 -49363 -44629 -20413 -19864 -5895 -4636 -9748 19017 3510
15955 3510 -22482 -16510 -33435 -81636 -80711 -60269 -48909 -32441 -25118 -8036 -39482 -68993 -71787
15942 -71787 -65574 -80526 -64771 -24030 -49434 -40317 -16624 -6157 14883 21704 32561 7481
15930 7481 22477 10396 -30083 -38623 -39875 -80375 -94737 -46251 18884 13526 22642 13383 7067
15917 7067 -13313 -16975 -60348 -94869 -68797 -21964 -11406 81 3304 6204 -12289 5287
15905 5287 -22177 -54273 -55824 -58757 -66944 -52931 -16190 47047 26584 -23259 -43249 -44375 -6465
15892 -6465 -10714 -2878 326 56234 26070 -15875 -45911 -36662 -27995 2961 35510 32347 -20364
15879 -20364 -74243 -94768 -76397 -32751 3945 -2917 -11618 -53132 -79953 -65522 -49120 -49040 -12523
15866 -12523 -9104 -29252 -28707 -4690 27649 37800 14084 3690 1336 143 -27641 -47689 -55236
15853 -55236 -38207 -42863 -36033 -33984 -69517 -75444 -105191 -95165 -78054 -77373 -46193 -56586 -58893
15840 -58893 -57936 -63327 -69697 -59079 -61967 -56696 -21584 51389 49814 76151 49532 8337 18001
15827 18001 -7200 -43465 -37162 -34927 -26538 -27919 -58231 -65619 -10200 23415 50881 70180 71007
15814 71007 32700 26381 15327 -11220 -6658 -22313 -54234 -69232 -27622 -10787 -58225 -28801
15802 -28801 41222 14043 -37000 -43197 -6849 21375 20072 37845 63683 64862 25598 -203
15790 -203 17378 33535 20732 -17643 -10110 25277 48881 15972 18442 -286 -25658 -44426
15778 -44426 -38741 28175 33649 14516 24626 31087 -5820 -21591 8703 17980 21384 -8221 -31296
15765 -31296 -18679 -9380 -6117 -4883 -4161 -7178 -637 -9906 3264 -26624 -39714 -25793 -44423
15752 -44423 -62437 -41565 -28650 -31692 -21717 -15762 -8676 15491 29454 41508 35345 21022 8690
15739 8690 18205 495 21623 47996 57219 78465 89074 56006 45977 29142 30544 2504
15727 2504 21144 42417 40081 16573 12991 -17445 -55900 -40019 -42003 -51903 -62607 -38775 -40529
15714 -40529 -66308 -63776 -93267 -76926 -37547 -4703 18767 -10545 -28205 -11767 -41577 -38297
15702 -38297 -34092 -54418 -83460 -106820 -99692 -61105 -62899 -73029 -67619 -15652 -2196 -19838
15690 -19838 -34092 -30734 -39382 -33043 -45822 -34486 -18065 -20477 -69155 -100585 -71589 -45848
15678 -45848 -23388 29238 6266 -4224 4718 -8033 -6653 18916 47154 54013 51268 42824 14376
15665 14376 -25342 -61762 -62508 -54519 -36262 -9505 64239 59026 72910 63670 29844 8184 556
15652 556 -1092 8161 18939 1996 -17355 -46389 -37220 -41325 -36877 -2415 9167 17727 4923
15639 4923 -24694 -51694 -25028 26217 31762 10067 14284 -3100 -28583 -71862 -87777 -70689
15627 -70689 -90812 -75844 -45498 -60393 -59001 -27455 -965 29306 23073 32435 -6588 4129
15615 4129 -11921 -25126 16550 18514 25971 39421 32998 14116 8977 6403 -12231 -1958 24637
15602 24637 -17252 -53664 -49456 -39537 -47951 -40259 -18428 -44736 -55048 -41026 -22601 -34977
15590 -34977 -67689 -94640 -60357 -9309 10699 16861 1831 -2915 602 16480 24445 44621
15578 44621 37037 25976 -6287 -53339 -56214 -58777 -69993 -46783 -41557 -45082 -35712 5675 -24986
15565 -24986 -69812 -51782 -29312 -19857 -11339 -33665 -40129 -57115 -29119 -12724 -1305 24476
15553 24476 24713 9230 4341 15727 9330 -15346 7020 -25794 -74560 -68989 -89439 -86064 -51444
15540 -51444 -52349 -3944 22118 -24132 -12778 -6727 21175 11487 -15583 -26622 -31054 12425 37881
15527 37881 22777 -715 -7828 -14238 -36414 -7250 -8250 -25008 -45552 -55179 -44049 23266
15515 23266 -4826 -43088 -63092 -39800 -60051 -69415 -51872 -54755 -15129 -5082 -7328 -10258
15503 -10258 -10499 -17740 -15359 -24474 -39365 -63521 -55927 -46171 -40833 -34630 -18121 -2248 15278
15490 15278 -21128 -11024 -24883 -19989 -41639 -52161 -75843 -49698 -12709 -15813 -19825 21917
15478 21917 12741 -10414 -45365 -68191 -42243 3849 -19834 -34009 -7868 -23694 -70763 -92610
15466 -92610 -29441 6811 3331 -23258 -13046 8068 14062 2655 -5475 13445 17086 -4043
15454 -4043 221 -4445 120 3685 -4872 -7935 -26676 -13811 28347 38791 -10317 -34387 -26953
15441 -26953 -39906 -67184 -57604 -50275 -46861 -18702 80 -28381 -76928 -94511 -66090 -90466
15429 -90466 -64666 -63031 -47894 -24240 -46317 -13715 -33504 -51401 -47498 -32404 7433 35816
15417 35816 52322 21638 11984 -10380 -18147 -30442 -14336 6060 8131 -20207 -34275 -53010
15405 -53010 -46069 -15294 20756 10636 3963 10631 5040 14815 22201 7005 -1825 -34598 -50242
15392 -50242 -84631 -44916 -20878 -8502 16292 7265 -14526 -9732 -7580 -29271 -15811 -41282
15380 -41282 -60123 -63589 -37567 -1063 2952 -11306 -29468 -34232 -30391 -23724 -7412 10657 4969
15367 4969 -30448 -40910 2466 16359 -9630 15473 48280 38720 14596 14511 37001 40904 -3142
15354 -3142 -67872 -81036 -71433 -81465 -78328 -86616 -94538 -65310 -46184 -26323 1860 13035 25708
15341 25708 8150 24382 52604 55317 41912 -3379 -11885 2055 8641 -32155 -52881 -37316
15329 -37316 -11862 -9661 -25451 -16454 38532 31973 -22967 -59804 -22081 4370 23699 15060
15317 15060 4497 -14665 5610 14829 3898 27539 33166 4341 754 50793 42070 32994 -4434
15304 -4434 -2617 16392 20941 22881 42921 54422 40919 33620 18867 1109 -4291 -11452 -10574
15291 -10574 -14000 18048 45548 48131 78529 69096 46610 11062 -16090 -38299 -31904 -26204 -38063
15278 -38063 -49525 -12183 -19203 -45286 -76117 -89120 -90655 -101937 -87941 -84895 -79431 -43855
15266 -43855 -17597 -60108 -29386 821 -11549 -16121 -20967 -34415 -35757 -10420 -18324 -43436
15254 -43436 -26552 20690 33006 11818 -4522 -35079 -27344 -16999 -29668 -54300 -75576 -52988
15242 -52988 -21616 -5511 -11156 -21968 -3528 -1895 -31053 -44843 -42159 -16265 -13240 -55889
15230 -55889 -62151 -35699 -6358 26891 44886 32270 24956 17660 -5765 -30676 -17077 -12120
15218 -12120 -8113 -4524 -21194 -28622 -27218 -68976 -72039 -36147 -14421 -2828 -7203 24043 9272
15205 9272 -1034 -10481 -21767 -13553 -14557 -49127 -96811 -101336 -87681 -49022 -57506 -58115 -30230
15192 -30230 -17233 -21837 14127 20810 22751 35472 23224 -23375 -42409 -50884 -38658 -37616 -48634
15179 -48634 -18596 -1555 -8244 -50020 -58371 -54492 -61513 -67022 -84141 -91167 -66840 -28196 -55191
15166 -55191 -120780 -81390 -63776 -68643 -41258 -23476 -12357 -8521 -27194 -51212 -51524 -30220
15154 -30220 -10136 7254 6914 -8921 -48234 -29748 -26005 8777 -6926 -22679 -13795 21370
15142 21370 7967 7676 -6339 -17972 -49919 -53400 -50817 -76694 -93894 -108114 -64428 -21772
15130 -21772 -43658 -57404 -34230 -35323 -34657 -50396 -55079 -92695 -108522 -69322 -11967 -3319 20633
15117 20633 58172 21976 -42017 -54706 -38252 -20433 -46141 -58089 -32613 -9645 11815 25642
15105 25642 3531 -79775 -77949 -14177 -10854 -7728 9093 23746 -21494 -21176 4866 -14672 -48602
15092 -48602 -49660 -3591 -23690 -59239 -58179 -48424 -7806 12693 156 -25558 -35411 -25139
15080 -25139 -26732 -15081 5996 -6251 -62206 -54731 -26554 -45173 -59597 -72599 -54952 -27971
15068 -27971 -4618 -9379 -4365 -27620 -33586 -31292 -58034 -50008 -9156 14707 12917 -55291 -65658
15055 -65658 -25883 2961 23074 44283 59938 34164 3083 9214 -21090 -36801 -19624 -15528
15043 -15528 -8778 11656 16335 7150 17216 42608 47076 34933 -16793 -50594 -23090 -24836 -25983
15030 -25983 -26760 -15128 -25360 -32804 -23456 3440 -3924 -55860 -62751 -6137 -19184 -62372 -69962
15017 -69962 -64638 -42714 10051 34107 22649 -20187 -46322 -26578 -44195 -35767 -18121 -32217
15005 -32217 -39316 -62739 -85620 -84441 -56211 -49786 -63323 -48435 -53927 -39553 -14632 13819
14993 13819 37466 18183 -22305 7183 35562 33770 1273 -11755 -7108 -40543 2964 17226
14981 17226 -13022 -43514 -89895 -66455 -63015 -47782 2801 20902 -22295 -15810 -29824 -74048
14969 -74048 -88779 -86399 -72241 -13921 -7426 -17320 -18054 -33383 -61524 -109181 -110713 -76483 -72115
14956 -72115 -89212 -74247 -77188 -105256 -92617 -33064 -14823 -41074 -43986 -56968 -65219 -70340
14944 -70340 -81897 -57390 -38847 -54972 -66785 -48914 -70911 -54203 -28962 -32822 -37524 -36207
14932 -36207 -32487 -10998 -15732 13035 15835 38011 45953 39889 4694 -23331 -38547 -50375 -61650
14919 -61650 -43761 -62013 -49497 -36689 -43312 -57159 -55226 -42773 -32783 -24161 -26594 -53668 -84757
14906 -84757 -74847 -65133 -44421 -46824 -36189 -27300 -3128 -14301 -34578 -42083 -65117 -87130 -70057
14893 -70057 -50851 -42987 -26258 -6335 -2333 48539 11458 -10921 -32310 -11191 4030 -57727
14881 -57727 -32400 -9945 -21156 -56813 -94038 -105490 -82094 -50880 -54261 -27128 -12531 2392
14869 2392 743 -558 15654 -1183 -31445 -66626 -66214 -26726 -44103 -49640 -83066 -101680 -74793
14856 -74793 -97953 -109349 -76885 -56053 -13487 -18267 -46897 -33143 -63532 -99744 -77104 -33926
14844 -33926 -35678 -14317 6534 4794 -21486 -54950 -42048 -31905 -39018 -50148 -63538 13152
14832 13152 34928 16313 15913 14652 7170 -6417 23787 19140 10434 24925 24460 -4343 -23985
14819 -23985 -25354 19298 58788 40514 34023 17111 -4459 9355 -1996 -38745 -60041 -58779
14807 -58779 -66706 -57574 -28443 -18796 -54864 -51787 -5869 21920 6603 -15556 -57839 -70946
14795 -70946 -83598 -76910 -18338 19287 4446 24283 38973 24819 -3270 -22678 -12795 5434
14783 5434 295 -5373 5106 -32122 -64391 -44848 -28968 -15799 -22189 -23162 -29366 -44522 -40452
14770 -40452 -6727 5400 22093 -21728 -65042 -78065 -75620 -57084 -32745 -20466 -29128 -6204
14758 -6204 5297 45954 35876 -1722 -6022 14247 -17059 -32063 -9921 -29784 -30657 -56168
14746 -56168 -89796 -44753 9932 29029 31612 -12961 22463 48615 69351 94996 72907 52057
14734 52057 41462 10878 6633 14656 9502 -18829 -79596 -99462 -79737 -60812 -53583 -57365 -51165
14721 -51165 -69473 -30231 -53536 -21133 -9026 -40037 -46844 -38260 -49335 -19572 -21287 -12597
14709 -12597 -29803 -42852 -39425 -63171 -61821 -47025 -60972 -53771 -48351 -25269 -31279 -44634 -41477
14696 -41477 -2120 8879 -2790 -42168 -94124 -98467 -51812 -4834 -15135 -21560 -31628 -23084
14684 -23084 -33866 -1361 40786 17728 -11046 -38844 -56633 -28427 8293 -11479 -17850 -28101
14672 -28101 -25030 -36752 -29235 -35048 -30072 -31951 -67597 -49200 -31359 -32217 -16755 -37883 -56441
14659 -56441 -58032 -57798 -8436 24447 -5155 -33894 -14076 -5213 25974 25205 21016 8001 4582
14646 4582 -21408 -26093 -25897 -65726 -56159 -16263 -20676 -6279 -13651 -55773 -66104 -77750 -72850
14633 -72850 -73229 -69995 -103832 -105397 -96341 -62266 -53316 -58152 -79531 -90003 -68389 -30274 -32863
14620 -32863 -50242 -60252 -39538 -32713 -21094 -49849 -87485 -87454 -96030 -73543 -40978 -36203 -71202
14607 -71202 -99454 -84920 -36280 -39445 -60721 -33117 -20896 6668 -21095 -50215 -59217 -66634
14595 -66634 -68440 -55854 -19434 4298 -7389 -6575 -11516 6166 11854 -22249 -48355 -6538 9585
14582 9585 -11158 -19171 -20217 -16499 -35117 -47905 -64118 -43002 -3255 -1501 -10583 -26815 -48034
14569 -48034 -48232 -32026 -17877 -53622 -75736 -81432 -45248 -24745 -21744 -57681 -67122 -61856 -46863
14556 -46863 -37947 -50376 -65483 -54198 -38423 -57314 -78840 -74674 -79180 -51183 -38955 -57811
14544 -57811 -96003 -119154 -121896 -119716 -116550 -90695 -62288 -24164 -26308 -23646 -20274 -29019 -38112
14531 -38112 -82592 -54690 -55879 -56221 -44693 -69353 -97802 -85460 -50306 -13409 -6340 -20979
14519 -20979 -47097 -37125 -13705 -16237 -13043 -13976 -56665 -78522 -133258 -140283 -90167 -44945 -58156
14506 -58156 -53333 -62723 -33716 -763 -10459 -33604 -44850 -39057 -10921 7971 7006 -44184 -35039
14493 -35039 -21091 -15863 -5320 -35800 -29738 -34497 -66505 -6694 14312 -19675 -2929 43973
14481 43973 11416 -12378 -39966 -78769 -66462 -68631 -84163 -84808 -52427 -14529 9941 -25491
14469 -25491 -58779 -70066 -60729 -74313 -60795 -60523 -26498 4398 -45337 -56955 -46781 -12074
14457 -12074 -26896 -49066 -78880 -85586 -44895 -40926 -34832 -41909 -67688 -64854 -26660 -47177 -29192
14444 -29192 -5087 -40657 -55754 -74332 -91733 -53339 -25637 -41514 -54797 -50171 -37746 -47979
14432 -47979 -77773 -53972 -70369 -63296 -22500 51 -2193 4755 -8061 -22948 -41961 -49533
14420 -49533 -61248 -55488 -23112 -18587 -69271 -106853 -102333 -88751 -91295 -67052 -41513 -38888 5136
14407 5136 -2656 -23267 -56903 -40211 -2858 -19337 -25888 -11789 -30470 -80089 -72898 -115854
14395 -115854 -110662 -93132 -68431 -58939 -39000 -8191 -4592 -6115 19825 15424 29522 48190
14383 48190 14190 -20651 -18356 -24798 -33536 -31828 -35565 -17520 -31453 -33280 -22322 -26518 -83929
14370 -83929 -117677 -113444 -101151 -67306 -27535 -11911 -36505 -52730 -55486 -72123 -94209 -83914
14358 -83914 -79384 -37084 -18429 -30452 -42476 -19392 -1516 -24712 -19182 -16361 -19852 -45991
14346 -45991 -69990 -76437 -70500 -29902 17976 33772 17608 -24239 -23781 -12632 -27089 -20298 -22408
14333 -22408 -22464 -44584 -43532 -12343 5625 -26567 -28863 -89590 -113637 -93665 -40085 -12081 -15395
14320 -15395 -14699 -15832 -19970 -55083 -60143 -20104 7122 -21798 -40512 29326 35432 14565 -3453
14307 -3453 12961 -23806 -52249 -58812 -59170 -20397 4748 -25845 -64707 -36694 -21030 -46370
14295 -46370 -50754 -25631 -49497 -48598 10813 -12550 -68797 -69766 -12036 21911 3175 -25671 -36400
14282 -36400 -23497 7961 -4337 -20277 -31597 -27108 -904 -55519 -62719 -65022 -60654 -23862
14270 -23862 -21667 -41910 -43823 -45202 -12226 -12620 -48345 -60350 -50206 -7026 -24507 -47985 -35575
14257 -35575 -35209 -33902 -27895 -41972 -67887 -76873 -84211 -82457 -15946 3949 -12094 -6417 -29410
14244 -29410 -20615 322 -18841 -55022 -87753 -66175 -46242 -27841 -75709 -107498 -86730 -45212
14232 -45212 -21239 -35870 -54390 -25014 -41794 -26532 -61515 -65174 -61149 -80570 -90636 -66031
14220 -66031 -17506 -4423 -5874 -27588 -41538 -61266 -46987 -33183 -24977 -34410 -26687 -26925 -26030
14207 -26030 -31549 -26496 -5685 -42220 -76535 -92602 -87399 -70471 -94995 -91956 -17181 -12739 -26123
14194 -26123 -32193 -36049 -47855 -27716 10929 6356 -74095 -90323 -58492 -28785 -44744 -52131
14182 -52131 -29885 -37991 -52727 -80022 -96984 -52742 -38042 -87911 -85782 -43923 -29916 -29050
14170 -29050 -32032 -26618 -43197 -75822 -65515 -7954 -15945 -61622 -53984 2817 -11922 -34441
14158 -34441 -30239 -3552 -36198 -37447 -37278 -53674 -55371 -63001 -43482 -13934 24141 7599 -21713
14145 -21713 -16242 -7841 -3040 -20757 5559 36838 19007 -15288 -57746 -108900 -106856 -124445
14133 -124445 -81565 -51961 -73802 -65736 -73417 -73770 -76371 -102102 -87304 -105104 -128961 -101792
14121 -101792 -29505 -31213 -86819 -105063 -81999 -37092 -9070 -18510 -40146 -84419 -76955 -38798
14109 -38798 -8609 -11344 -5664 -39571 -53021 -58152 -72568 -66171 -49306 -29351 -18502 -29703
14097 -29703 -42328 -46763 -55965 -33236 -21145 -5215 -14972 -40492 -115743 -126005 -122919 -87187
14085 -87187 -119726 -88216 -64183 -79322 -68837 -51536 -32551 -40049 -48516 -30167 -47874 -33334
14073 -33334 -19838 9718 -12098 -48159 -71632 -85070 -82556 -30280 -13677 -3869 -26705 -41086
14061 -41086 -51704 -88671 -81544 -61128 -32946 -20737 -13278 -9298 -26827 -41359 -36398 -93776
14049 -93776 -119419 -95273 -79780 -101356 -90217 -85273 -69396 -62933 -39589 -32790 -22944 -8899
14037 -8899 -42695 -30290 -2655 407 3633 19493 -3702 12449 5028 1050 24674 24284 37296
14024 37296 24378 38375 26986 11860 19930 79935 82217 89794 111607 81658 104499 105313 120703
14011 120703 104268 77793 59830 24140 17895 31342 44065 -1997 -41764 -28599 3839 -10624
13999 -10624 -3638 13510 3871 -1327 -41431 -64811 -102489 -74587 -23109 7801 481 4784 -8120
13986 -8120 -30960 -48096 -41450 -11319 1365 -31696 -52056 -21460 19173 23144 35262 70331
13974 70331 84426 138258 203038 279805 370360 434246 458312 453647 463670 420458 336314 249891
13962 249891 190764 111840 69511 44658 52094 49456 9000 1566 -771 21175 33128 42324
13950 42324 19057 -7310 -15015 14007 9914 -30783 -41377 -27837 -3890 -32605 -49690 -14245
13938 -14245 -40574 -57977 -63834 -52900 -23333 -13665 41940 64671 66224 99449 130590 178887
13926 178887 235704 314399 430872 451102 468616 509353 485181 364612 244289 181290 158651
13915 158651 120809 113713 76174 31733 475 9999 14714 -5409 -19446 -18178 -3266 -16800
13903 -16800 -22469 125 -31868 -50803 -42681 22411 42604 36256 20651 17075 -965 -60369
13891 -60369 -49899 -1631 17217 -7239 -39115 -46124 -43373 -23250 -14897 12018 63261 100425
13879 100425 114585 130892 133750 116133 85964 42580 -15101 -27266 450 -5094 -8649 -30292
13867 -30292 -19376 24387 29647 -23229 -76512 -58533 -18084 -11307 -18822 -56001 -79060 -46181
13855 -46181 -41321 -59260 -76711 -63320 -40441 -63527 -75901 -55967 -30061 -32027 -49748 -47858
13843 -47858 -12581 -14641 -77935 -105613 -71917 -94400 -106833 -97969 -79507 -62133 -84337 -85675
13831 -85675 -90332 -114388 -68759 -76441 -125919 -104713 -75385 -57252 -69973 -64960 -11641 5258
13819 5258 13535 -6277 -10380 3923 4399 3080 -10277 -38288 -69906 -96340 -82065 -48500 -63937
13806 -63937 -81277 -74238 -85028 -100592 -98412 -80422 -29712 497 -25490 -58296 -29038 -16823
13794 -16823 -26517 -42009 -72491 -26845 -32918 -76055 -55081 -44721 -50014 -55651 -64266 -21247 1000
13781 1000 15879 20402 -29930 -84717 -98173 -72460 -34931 -11515 -17895 12551 -22467 -48584
13769 -48584 -36986 -16608 -35173 -50709 -12082 32741 28486 37977 58912 70700 67654 59663
13757 59663 78880 89825 83131 69036 38977 22988 39291 12190 -20845 -13132 -15405 -53629
13745 -53629 -61308 -49708 -29462 -41572 -42482 -7348 -46617 -99695 -135605 -73438 -10362 -16807
13733 -16807 -42954 -52373 -82494 -108576 -83131 -46446 -35440 3851 55059 43906 21244 16439
13721 16439 16793 5978 -16740 -24680 -14384 23621 55277 53172 14972 5299 -6535 -23507 -44876
13708 -44876 14606 15520 -4402 -17625 -21157 -3249 10562 15400 835 -61488 -87147 -83991 -61513
13695 -61513 -65770 -103040 -141356 -134519 -138668 -144465 -124750 -131375 -152783 -149120 -112183 -83522 -57414
13682 -57414 -66239 -99022 -70120 -46293 -61269 -40046 11235 31992 43156 37744 25724 8207
13670 8207 48876 32109 23277 -10349 -29622 3308 2625 -20993 -46375 -54850 -88812 -75628 -33279
13657 -33279 -30281 -65370 -75168 -63746 -61271 -103455 -109015 -110586 -92594 -70941 -56129 -69669 -99272
13644 -99272 -68470 -35073 -11861 23674 41789 46259 76232 52185 18491 66923 81340 59741
13632 59741 60956 85318 77115 87293 92940 97921 71819 36268 15337 -4809 26915 34485 36864
13619 36864 55766 69356 90132 95354 75831 43228 58879 46550 41857 56625 45136 56198
13607 56198 38496 38449 59495 57510 89073 97962 119851 143336 151485 176968 211033 241914 329728
13594 329728 393874 435812 415782 377007 386145 369195 333567 341975 374566 354849 370480 393688
13582 393688 328253 324864 339203 364938 385395 378857 408794 463407 506834 530476 568220 636853
13570 636853 728399 832973 914937 1040938 1259094 1525349 1870494 2286920 2808288 3450157
13560 3450157 4271046 5352140 6706652 8488177 10874413 14143738 18512458 23387576
13552 23387576 27094520 28941646 29909769 29742991 26584408 21225323 16156652 12332375
13544 12332375 9638397 7767145 6411498 5424032 4727110 4219734 3789327 3412745 3133202
13535 3133202 2973710 2841058 2732065 2605299 2549347 2538599 2542340 2539885 2617417 2716668 2844262
13524 2844262 3069649 3389684 3830461 4364093 5052888 5974615 7166724 8624055 10449714
13515 10449714 12802110 15869586 19932776 25231110 32180431 41668436 54661614 70474434
13507 70474434 83650637 89529469 92245377 93368103 85079282 66915829 49665466 36982744
13499 36982744 28294660 22411781 18372880 15465982 13307848 11695867 10350796 9180745
13491 9180745 8207209 7442790 6839172 6304645 5867865 5554604 5232694 4973132 4834769
13482 4834769 4752323 4683888 4661941 4775907 4981370 5307049 5793364 6479069 7347948 8468583
13472 8468583 9908200 11692245 13945747 16931529 20894755 26049767 32877968 42147060
13464 42147060 54818096 70701648 84929325 91641545 94340126 95834872 89068445 71020007
13456 71020007 52799396 39222318 29901466 23675638 19389454 16303592 14019308 12293825
13448 12293825 10861265 9556861 8437981 7506224 6723930 6072623 5503760 5030663 4634852
13439 4634852 4310998 4041825 3804465 3642903 3551854 3512505 3457034 3461006 3588209 3753093
13429 3753093 3985882 4297746 4693652 5241731 5929200 6869975 8189147 9942126 12180441
13420 12180441 15199118 19295811 24324042 28837240 31290914 32340041 32692397 30526283
13412 30526283 25161740 19284984 14674587 11478871 9260523 7728803 6643092 5837985
13404 5837985 5243181 4710857 4141491 3584321 3170626 2815568 2484358 2233281 2044962
13395 2044962 1903138 1733581 1589628 1452011 1385273 1325689 1222610 1173828 1133390 1086542
13385 1086542 1006933 974904 984621 969219 916817 863368 842781 858209 860073 824511 812174 826463
13373 826463 818150 833061 846881 816615 771802 718763 651582 648214 696783 691522 666329 676695
13361 676695 683054 680008 641691 604596 585484 534550 494609 460706 422959 376507 363895 354667
13349 354667 333044 328117 311596 275865 259912 271469 308291 313915 293312 285656 280005 295997
13337 295997 296838 297305 305048 302412 278915 249563 248800 273174 302221 286453 293991 290015 289214 297018
13323 297018 317629 330227 344605 361248 334079 295008 292287 283806 274431 276747 264423 245860
13311 245860 226222 202017 193692 186545 179298 151629 117878 113706 116260 98965 102650 112318 144467
13298 144467 134568 131012 151014 161773 148934 111344 79123 95779 99571 82468 70239 84867
13286 84867 97947 118024 146001 150891 136992 129423 160117 180036 175537 194832 206005 182601
13274 182601 156355 170322 150960 108105 68022 50821 42425 70490 91546 104050 77642 66732
13262 66732 48701 77326 86970 29733 1081 -5845 -2856 6986 -6384 5659 33322 50021
13250 50021 67286 88562 62058 50929 26709 -15109 -35643 -6184 -117 3453 1869 -6655
13238 -6655 -17918 -186 27594 3302 -4594 66821 110824 140745 130474 89333 59149 27760
13226 27760 17895 21850 22901 51579 65750 43113 78689 44366 26454 25010 51846 70696
13214 70696 52865 22532 -10949 -33858 -35932 -25106 -24130 -26130 -31181 10982 60947 84720 43316
13201 43316 -22364 3689 13978 -10310 -31308 -96049 -82443 -54698 -32659 -39014 -13296 -13824
13189 -13824 -6273 -50556 -17182 -1273 30223 71555 62572 40134 74766 117334 123224 132451
13177 132451 133401 135812 106491 71042 64343 42976 24032 -10640 -19422 -22854 10092 38030 25717
13164 25717 21031 59433 78524 78747 45617 11773 13219 -2897 4475 7733 -11322 -353 -45109
13151 -45109 -62130 -45171 -23300 -11746 -19573 -3240 -39806 -59896 -61377 -33140 -7364 33203
13139 33203 35920 57023 99865 147784 168845 107195 86049 116252 140862 154340 115973 99109
13127 99109 74767 39460 17080 -6659 2826 39228 64614 22579 -7481 -22723 -48469 -30314
13115 -30314 -14699 23022 43223 21845 807 -4614 8886 32910 11248 -9847 12174 19748
13103 19748 11657 9008 10339 10755 -6252 -2721 55433 77052 55811 55637 28759 46777 79969
13090 79969 33041 -30613 -17085 5971 16959 45419 96414 131157 154435 182996 186187 155441
13078 155441 141261 155470 118265 111189 63808 14173 -5505 -30910 -43428 -63509 -67015 -14646
13066 -14646 21114 33959 6149 -2991 40707 49727 40109 1919 -21901 -7405 -28839 -34247
13054 -34247 -18166 -6603 6880 -8607 -11170 24026 18547 35030 34004 29702 20590 36090 47046
13041 47046 106358 139082 200517 341680 432439 481239 461225 462846 469719 388967 301283 221616
13029 221616 169731 152632 108020 107280 65858 29468 44161 45859 23273 9353 11689 19460
13017 19460 -17016 -41449 -24123 15766 62777 67499 71743 42196 -33910 -32992 -13507 -1408
13005 -1408 32458 39625 57998 67723 80705 46860 39559 28704 79285 140765 208836 252532
12993 252532 322536 407278 452320 463354 479583 496515 426330 335834 280816 228566 166379
12982 166379 156735 123696 78817 6310 9946 27154 21311 8014 9730 14652 -10771 -10106 495
12969 495 -2627 23525 23749 13640 18588 13581 10339 18659 16400 35979 80946 68820 11442 -10315
12955 -10315 -15493 -5871 -8406 -9141 -10890 32020 66335 53248 59472 69171 132415 144455 121006
12942 121006 127554 118577 77127 48982 -712 -32793 -53173 -62432 -57161 -42770 -29065 -53556
12930 -53556 -104012 -106262 -67956 -47500 -26828 -59120 -78315 -58335 -27813 11493 34644 -3918
12918 -3918 -5550 -16058 21684 38339 -896 -38470 -28502 -53625 -44920 -16709 -402 7138 -7672
12905 -7672 -11750 -12517 -758 37570 34889 4758 -23535 -67933 -60487 -29776 -3731 4578 14358
12892 14358 -8102 -12191 -33477 -24290 16199 -6114 -34296 -40488 -22768 -16526 -13231 -33121 -11878
12879 -11878 19127 40043 11215 -25561 -56818 -47393 9932 7908 7427 11673 3743 -36806 -25464
12866 -25464 -47950 -27308 4198 -1712 -46482 -59000 -35061 -9892 -34088 -83013 -48393 881
12854 881 38658 31263 -8920 -26787 -81576 -43030 -23672 -17547 -36233 -32853 -17023 8187 16805
12841 16805 -9675 -16148 21739 8425 5082 4983 -11078 -22157 -45385 -52297 -59825 -71518 -87528
12828 -87528 -71420 -49235 -46938 -20724 873 24813 25604 -11351 -54263 -44169 -27239 -40026
12816 -40026 -72319 -65511 -74156 -54215 -26919 -3252 -22263 -3238 -13223 -14944 3730 -20175
12804 -20175 10198 3180 -9139 -24306 -42431 -16474 16622 24778 48688 19373 -33086 -43419
12792 -43419 -41978 -28093 469 566 -41185 -72025 -77530 -62419 -37289 -2785 -8757 -35415 -59265
12779 -59265 -64310 -35996 -6577 -1371 -1168 -4171 -13322 -1845 9920 5759 13226 -5374 40294
12766 40294 74832 56146 8606 -39067 -72427 -51626 -25720 9753 6561 16718 56362 87154
12754 87154 103405 114609 147746 149446 130865 109640 53339 28702 32109 24436 -14766 5200
12742 5200 28139 28465 9075 5283 14873 3486 -16873 -28180 -28529 -17686 -4334 11185 -9486
12729 -9486 -49876 -67183 -70816 -54199 -29193 -43236 -60384 -59839 -32346 4857 -6137 -32406
12717 -32406 -33547 -17107 -16323 15621 35651 6163 5282 15388 46106 40519 18870 3320 30734
12704 30734 54893 64041 48064 24504 50122 58656 68523 51771 46516 52747 52043 46518 13278
12691 13278 22122 47124 18850 -16904 -36125 -10143 10814 27756 2529 -5216 29090 37989
12679 37989 -24667 -51168 -22170 7713 24120 20928 29487 49127 28237 8921 22588 42098
12667 42098 24844 -947 -20870 365 21918 51739 62191 41297 34903 38370 23186 -14765
12655 -14765 -70871 -85901 -75409 -55981 -17993 -6521 -5873 19418 13617 18516 13904 6844 22570
12642 22570 40142 75161 69630 40450 34175 29127 17865 14638 18424 -2223 5000 22126 7931
12629 7931 -12104 -42688 -84483 -57925 -36495 -10417 -4029 -12045 -21524 39772 51594 23621
12617 23621 2402 49747 77297 70785 41142 44941 105924 176827 203052 188754 189955 220452
12605 220452 236898 243898 207708 183161 185003 198662 224737 220697 209613 194751 146084 151455
12593 151455 164129 164923 148583 141670 133210 97392 88930 99431 125465 113671 135208 139030 152440
12580 152440 169886 144171 152149 169008 203041 212419 168063 184612 199818 223329 205267 214228
12568 214228 164425 121916 116585 110323 108694 91982 96608 121613 125966 120701 125708 140176 139644
12555 139644 165663 197875 194721 223195 249578 242916 249896 265213 285279 262924 257850 269049
12543 269049 290439 262163 203973 149175 125054 103646 103993 85704 66925 37711 41492 41665
12531 41665 11252 36491 36597 50379 17603 -26468 -46853 -50153 -52796 -25258 22099 2100
12519 2100 -23653 -51805 -15733 24499 46338 30969 4278 1482 -14947 -9697 3720 -22191
12507 -22191 -56577 -41856 -14703 -51919 -66108 3576 16675 -36306 -62540 -58921 -42657 -154
12495 -154 14899 16565 18247 29610 25969 560 12348 27190 17334 -3610 -4264 -25536 -34854
12482 -34854 -36390 12843 28921 30500 36895 32420 5926 -7585 13629 18972 43027 27233 44964
12469 44964 67650 83486 97505 111549 59556 9420 -5553 -46673 -78631 -45472 8128 33865
12457 33865 43258 31121 46660 15113 3273 33029 83872 104921 100235 120412 144139 147481
12445 147481 178826 201093 221105 267398 286058 268120 240311 203418 202630 211716 233186 223105
12433 223105 192500 153213 136475 144529 161361 164337 145473 110295 110581 136815 167582 175888
12421 175888 173007 184983 151510 161527 181041 163190 138290 146089 179974 187762 199671 237347
12409 237347 290084 325250 357105 360878 332994 327355 356790 357361 344364 313494 261756 251452
12397 251452 267780 296144 293025 199009 169212 187716 216083 219533 212304 187839 148036 125173
12385 125173 112738 130113 173100 193306 193142 228539 231027 212120 213161 220503 241552 243300 260395
12372 260395 290465 317536 322520 331856 343669 327130 318395 300920 249227 185374 136842 115469
12360 115469 121802 112994 111768 82492 56659 37570 63611 80092 78596 69490 85360 81902 90579
12347 90579 68395 33411 19311 23307 52005 70771 81725 90568 101540 115238 149359 154501
12335 154501 140900 160499 151575 151023 164284 191616 227776 236111 273423 319738 305044 279813
12323 279813 267300 227602 214269 197143 161996 184202 198127 189945 185834 156732 156584 168385
12311 168385 163020 164621 172972 176359 212587 201144 165809 176000 201080 176422 161790 184699
12299 184699 192938 203912 233270 148769 107567 104822 99474 98945 94303 105680 135240 151857 148194
12286 148194 153345 150079 141116 163217 157065 154223 175702 182910 206478 225073 212185 205235 225189
12273 225189 221394 215606 176372 161787 185345 192879 250169 267816 231399 247804 264259 272897
12261 272897 319219 291170 258761 262509 300950 361117 395490 396475 439432 436584 417685 380147
12249 380147 373914 384172 373327 395867 404009 411897 409437 409303 423465 401173 388979 404323 396141
12236 396141 360654 342917 363405 395075 461635 440443 423922 473585 526573 551784 574526
12225 574526 581360 582332 572166 603781 643102 639419 678295 717425 762546 823317 882317 935445
12213 935445 995250 1100489 1179175 1204256 1250203 1369521 1472622 1568117 1645397 1754393 1913016
12202 1913016 2093779 2271373 2483777 2743151 3086144 3505353 3977716 4537066 5285538
12193 5285538 6240684 7388794 8708685 10275497 12241715 14695744 17688344 21286293
12185 21286293 25483259 30191774 35116744 39835566 43922962 47013314 48836491 49325229
12177 49325229 48578688 46969822 44935108 42895652 41104362 39624745 38391425 37242964
12169 37242964 35932034 34398552 32618779 30679125 28714559 26934356 25477281 24456561
12161 24456561 23982698 24080876 24684604 25859636 27555314 29692702 32158384 34712879 37156712
12152 37156712 39319860 40953611 41919985 42051717 41379511 39941306 37921276 35523130
12144 35523130 32930406 30357866 28038238 26179552 24787866 23944135 23671598 23947463
12136 23947463 24781297 26114123 27890353 30014909 32299781 34656922 36909911 38965679
12128 38965679 40839796 42574351 44331440 46272620 48477451 50841816 53087566 54908625
12120 54908625 55764007 55264314 53291904 49846006 45076371 39594723 33985774 28741770
12112 28741770 24152520 20334890 17247129 14804638 12850502 11282452 9964625 8869290
12104 8869290 7941981 7124124 6476389 5895810 5379403 4930100 4534493 4213169 3928843
12095 3928843 3691443 3459489 3229070 3059386 2909674 2727651 2583010 2502306 2409156 2317736
12085 2317736 2200004 2090675 2022964 1960637 1880886 1809181 1760046 1722701 1688597 1603963 1545566
12074 1545566 1542936 1524202 1502524 1504303 1517937 1489653 1429446 1389433 1380090 1349585 1355040 1347286
12062 1347286 1336795 1322787 1316202 1304026 1293309 1300719 1320410 1343567 1310043 1315594 1319213 1328728
12050 1328728 1357515 1347087 1373967 1388798 1420912 1497701 1562441 1616031 1617348 1651475 1732336
12039 1732336 1835133 1930591 2027021 2143824 2295857 2517172 2779556 3047111 3327921 3686550
12029 3686550 4095980 4608377 5236304 6020851 7039764 8255629 9737267 11583421 13908873
12020 13908873 16785675 20316261 24482206 29145477 34128488 38977651 43099220 45967452
12012 45967452 47264927 46848922 44737972 41269461 37114641 32892330 28966988 25658619
12004 25658619 23067305 21152845 19658111 18580479 17804325 17129250 16593688 16139346 15851742
11995 15851742 15801139 16059760 16634587 17612067 18983460 20730419 22888498 25319064 27902134
11986 27902134 30625995 33490339 36510531 39622318 42854839 46185630 49495257 52506039
11978 52506039 55002418 56690994 57346670 56833398 55265280 52879819 49848620 46449645
11970 46449645 42987836 39737084 36738878 34012386 31497592 29144800 26867119 24644649
11962 24644649 22518812 20610318 19015279 17844237 17058925 16647222 16599935 16834565 17286783
11953 17286783 17986428 18847773 19899980 21220404 22889998 24972469 27588990 30805374
11945 30805374 34675999 38998992 43395187 47376733 50241996 51530278 51023919 48706329
11937 48706329 44661628 39488763 33883370 28496745 23721500 19767364 16573134 14096924
11929 14096924 12195053 10642492 9372874 8308357 7460761 6737534 6102055 5544195 5078094
11920 5078094 4682071 4314953 3997305 3744392 3483843 3251552 3028883 2836449 2681444
11911 2681444 2516474 2387829 2281114 2153559 2036613 1991868 1905288 1778503 1680601 1589915
11901 1589915 1533972 1505796 1450345 1398072 1333135 1253063 1203722 1165005 1147619 1109491 1075238
11890 1075238 1065876 1064525 1066030 1064534 1052451 1015571 1036244 1027544 969879 933471 933758 958115 985173
11877 985173 1000343 986718 932509 870204 862277 816620 792682 782603 750468 731517 699035 673302
11865 673302 658068 662893 679761 626962 583690 577841 596099 639978 634618 590254 553412 503279
11853 503279 498317 523827 558415 556772 533133 512888 486468 514085 537214 560082 554149 527718
11841 527718 542949 571400 573936 539246 552093 560595 542231 573347 597636 565970 546170 561879
11829 561879 615642 622320 559990 541294 530780 512184 515255 520977 476670 427506 466535 471316
11817 471316 417353 380960 396158 442319 469337 431973 397440 385712 381923 405645 389692 373284
11805 373284 380263 421193 454481 465964 458681 467651 467905 462510 476662 480562 482976 481523 471305
11792 471305 464507 451489 457949 478196 469252 462388 443535 401532 373392 362172 347911 350198
11780 350198 349606 333147 336627 308904 272946 259277 277066 258233 288264 297575 274286 254468
11768 254468 265482 239462 249675 259663 280102 300801 277852 231615 221170 276198 293387 295909
11756 295909 343435 395528 407596 378526 379537 380274 386976 409528 443140 440826 429235 399221
11744 399221 394804 376728 343449 337416 369620 381606 361729 362698 380930 362710 312994 264859
11732 264859 259657 238011 236068 239417 266855 278710 263943 248293 239610 258599 287544 309209
11720 309209 345039 395916 408986 398872 377599 361562 340380 305233 291212 291098 245895 215605
11708 215605 225543 221627 215356 226366 234697 241024 232489 240084 285218 301605 296917 343234 414745
11695 414745 431594 380307 382968 372521 350609 355649 387348 384862 379838 344956 322427 321694 265459
11682 265459 239179 221290 222298 188981 169823 170742 145380 144895 142223 154156 117867 98820 134517
11669 134517 138580 125223 119383 76795 69311 97134 104643 102228 78875 65171 64840 74015 98311
11656 98311 97324 55661 46794 51392 40942 38822 75188 85241 66280 79446 32334 20452 24416
11643 24416 10399 6900 32158 88530 79006 38532 17385 35369 57554 65737 82353 73264
11631 73264 35785 48026 47734 21902 34875 48317 73542 86852 64632 42195 46323 85473
11619 85473 117545 82051 71873 76422 98251 108167 59178 6486 -3900 13361 45292 47499
11607 47499 36770 53702 29747 -7532 17736 64729 103507 93601 79448 60313 18992 40563
11595 40563 11908 23590 48041 49114 82889 73803 88784 141561 183544 174106 117156 153047
11583 153047 185099 190809 204325 264345 294802 272672 224291 220227 242003 269193 267469 228424
11571 228424 172035 181597 171669 131973 110583 127647 112883 122159 131944 104116 148797 174761
11559 174761 159237 186283 174029 155254 161087 132581 143879 120610 133345 180872 217288 260127
11547 260127 269318 261335 260090 285655 318268 352768 326161 295077 299793 311359 311263 286243 300620
11534 300620 259896 204438 205330 193309 202199 186524 181206 179983 170351 133034 136868 163197 134975
11521 134975 105737 105961 122486 141659 154935 158068 166379 179339 183179 212924 227502 195957
11509 195957 217494 246964 280965 293431 284212 286310 271577 234270 194848 149240 136273 133534
11497 133534 121163 104186 114663 104847 136665 123748 66458 31835 45440 86063 108465 119656
11485 119656 86672 43021 50590 60483 93759 122545 114090 103191 59283 37308 43693 31892
11473 31892 9821 2608 -31038 -3543 7121 -4634 -18242 -13503 -19484 -8524 45212 38162
11461 38162 41654 64504 49241 57317 64957 50886 30036 2218 32151 30642 26216 64152 77632
11448 77632 56061 11836 10440 3276 29100 32227 28847 54402 7185 -47792 -71624 -88456
11436 -88456 -74248 -25287 28742 19857 72954 70756 49119 80426 60089 32809 7052 47390
11424 47390 40207 6177 20503 23191 21653 32987 15919 18819 42817 51106 18562 3578 50690
11411 50690 70149 57701 36397 56024 66184 37056 23217 13999 28155 38674 33176 1373
11399 1373 -5874 -32460 -36909 -12897 26400 24610 24622 -4202 4402 -8738 -5809 18165 63628
11386 63628 95526 88666 48793 34678 30782 7911 28832 61080 47595 37131 20046 42271
11374 42271 81842 74569 60642 67023 48862 42153 38225 27505 15219 9893 -3910 2965 15427
11361 15427 -17797 -24348 17395 52225 67139 35542 27088 22276 106179 175968 173146 106982
11349 106982 46706 22785 24177 24307 21323 24170 7473 30411 46218 63986 56329 36370 38961
11336 38961 17665 30532 76434 83966 88880 113991 113737 111396 144311 163700 203399 218056 234644
11323 234644 254032 252822 260356 281551 294301 290678 292677 263397 214007 217543 246336 247974 203955
11310 203955 200719 225591 235704 203391 185313 176723 163617 145124 145111 136104 155447 170681 214928
11297 214928 257585 252157 223381 242524 272545 293292 290777 254764 235028 282575 294095 273694
11285 273694 268001 214425 205273 238123 231864 210782 210714 215887 193984 214769 218612 213658 237700
11272 237700 277598 271105 274609 290512 283075 288110 285931 292606 320663 305496 298677 279742 294977
11259 294977 287226 246655 234834 224375 205145 166362 149256 166922 176106 139053 101365 98319
11247 98319 93071 97910 107179 114301 90600 54903 59566 73111 37426 62037 68145 63030 91716
11234 91716 156242 217766 207156 195328 219929 217609 213317 246560 306038 326869 348556 327367
11222 327367 305767 285237 273564 276334 255937 259978 245241 207764 188135 193714 226564 210889
11210 210889 221515 266033 291573 332512 385413 383946 362404 314421 267143 267635 266836 266864 263974
11197 263974 297511 337263 357008 385518 453937 489760 493344 522962 548980 522022 475549 482035
11185 482035 438826 427792 405723 393946 331483 299217 307085 297171 295935 287357 294907 286084 325000
11172 325000 329082 339999 369212 354733 362537 361837 345860 303858 291971 310675 296087 275349
11160 275349 254699 260920 259426 262871 251656 289299 355196 387352 380725 401920 393248 361815
11148 361815 373537 360167 351027 344894 285725 275692 292687 373238 354789 356191 384020 388882
11136 388882 351866 347719 334502 306120 292905 270361 250242 194189 137186 117444 133821 181948
11124 181948 173859 134755 119451 132069 132176 101266 129020 141709 117913 95282 86543 101322
11112 101322 103101 80972 114824 131635 124790 126751 138070 86950 35723 3931 3176 84000
11100 84000 136152 151329 118052 108167 98923 74519 67624 85738 91575 36722 43306 36895 26518
11087 26518 1612 19051 49206 96067 115045 161660 193000 236295 249144 304137 357675 391976
11075 391976 421175 434655 411491 367963 288392 289982 304533 301915 302039 325966 329922 300977
11063 300977 296255 369524 472194 538658 598947 654152 700637 755190 777507 775093 812567 785378
11051 785378 713023 626677 524802 461207 395251 376844 349514 324013 290029 244775 207957
11040 207957 207824 219851 224072 226808 233712 233928 269609 266967 255332 245466 241360 248416 248341 237767
11026 237767 174715 166100 200239 194915 219404 242412 259637 305805 323183 328368 312060 326435
11014 326435 342853 353467 356971 392173 419621 426670 402941 318784 270781 288292 338408 342416
11002 342416 358651 378027 380474 348738 334615 323841 325393 322857 327553 323460 325733 340967 379864
10989 379864 382966 381180 383670 416979 428875 435187 424733 432486 446053 446098 434156 424746 468110
10976 468110 469003 471189 464269 473750 481165 470523 478163 470101 459241 479543 532649 569389 581751
10963 581751 606326 666684 655601 628600 666918 738892 748780 733750 735913 758173 789578 807001
10951 807001 818380 842907 864033 862195 902758 930730 968468 1021577 1131382 1211096 1226284
10940 1226284 1301507 1372674 1480804 1614846 1741323 1869843 2042772 2198089 2352023 2548727
10930 2548727 2766887 3015121 3289245 3593446 3961439 4464576 5081447 5798522 6696543
10921 6696543 7772325 9049532 10612992 12594303 14962768 17899396 21466827 25812455
10913 25812455 30816051 36234022 41656891 46591463 50570631 53171165 54164688 53693962
10905 53693962 52135969 49977620 47653356 45622614 43956563 42501394 41089612 39505940
10897 39505940 37647105 35415453 32810459 30074631 27436794 25144558 23378946 22262229
10889 22262229 21852986 22137922 23110757 24685491 26893128 29574931 32574123 35734871
10881 35734871 38771432 41402058 43341415 44436784 44505046 43579452 41742853 39194670
10873 39194670 36161995 32937613 29846746 27093609 24945493 23446297 22637815 22529075
10865 22529075 23053115 24163267 25795714 27886080 30269130 32698420 34970255 37018208
10857 37018208 38716382 40124595 41302969 42484540 43862081 45502652 47247144 48911236
10849 48911236 50149665 50511605 49568288 47151094 43531965 38983519 33947337 28949640
10841 28949640 24388192 20571308 17512241 15129876 13203326 11648040 10343703 9283735
10833 9283735 8444899 7699242 7037877 6476095 6089572 5729152 5342970 5042086 4782232
10824 4782232 4585051 4429367 4280211 4173915 4098316 4053458 4026744 4062634 4143209 4263862
10814 4263862 4384847 4492275 4662787 4882336 5194654 5507900 5926217 6526956 7249701
10805 7249701 8194201 9363019 10738955 12437393 14513535 17033368 20083339 23768958
10797 23768958 28069885 32777671 37521831 41845100 45253297 47311748 47663341 46349857
10789 46349857 43647773 40035752 35990116 32037321 28575633 25738449 23495256 21759661
10781 21759661 20516416 19754558 19343232 19238858 19454794 20008058 20945140 22181505 23658567
10772 23658567 25348773 27132357 28985030 30818996 32581500 34250621 35903213 37601738
10764 37601738 39351882 41024887 42604575 43997644 45060351 45672914 45815694 45478401
10756 45478401 44671452 43523993 42121237 40667627 39195602 37747558 36392046 35120077
10748 35120077 33839993 32501157 31091558 29587315 28012889 26422745 24851331 23397980
10740 23397980 22100011 21014093 20268453 19927077 19998842 20458099 21336888 22750519 24828440
10731 24828440 27556964 30930177 34870578 39284596 43882059 48208431 51648034 53734884
10723 53734884 54086985 52432311 48975305 44193164 38631630 32982751 27790857 23422743
10715 23422743 19911528 17080987 14790737 12949649 11440757 10200414 9158228 8270037
10707 8270037 7506732 6866631 6328013 5902127 5488708 5140044 4835363 4504874 4206812
10698 4206812 3941317 3629068 3365635 3115567 2897909 2745413 2602644 2503023 2424269 2340158
10688 2340158 2252451 2151770 2093749 2013744 1926514 1861055 1770595 1691824 1639724 1565308 1518164
10677 1518164 1511383 1514304 1512234 1496245 1465007 1442060 1419022 1389244 1342570 1325733 1311237 1288214
10665 1288214 1240639 1191236 1203454 1227541 1220602 1168104 1101443 1104028 1076761 1045088 1022690 1021665
10653 1021665 1010482 975519 894358 813301 804112 831012 831602 846705 847954 840778 762997 753000
10641 753000 773053 807916 842053 814270 813635 796734 771707 743265 756953 766123 794330 810636
10629 810636 765299 776753 791137 803995 858370 883103 904757 935372 974765 995903 968105
10618 968105 905881 892275 866325 824148 791942 770029 790318 769167 744534 721614 717110 685727
10606 685727 698768 667387 679726 711782 675255 627528 619095 612150 617407 654426 631877 641880
10594 641880 653122 615932 608895 603836 582293 584293 581254 585540 594819 629887 665472 674639 648989
10581 648989 599796 610850 641845 650370 649518 646183 606471 593389 585690 536009 519361 518242 523061
10568 523061 516927 496150 444051 394381 323140 286542 313538 326616 324737 273389 217957 265539
10556 265539 270736 260096 231006 161045 103682 115054 122392 123517 122256 100995 95553 112710
10544 112710 163796 222805 264485 327407 397633 486806 551174 638112 728671 836948 917518
10533 917518 943332 932402 853710 726220 599182 538158 508209 450780 398051 418688 420641
10522 420641 412683 401387 372744 298437 262438 273137 258871 231853 243908 258812 262456 264590
10510 264590 253551 273133 335400 350707 359676 362710 392708 412379 417071 436584 428135 472461
10498 472461 501859 538574 578683 602711 654942 728036 798339 837790 889894 922138 968467
10487 968467 1010977 1006284 926758 823963 740935 721595 689592 670826 645096 639802 622519 608215
10475 608215 572726 573616 583010 624705 614372 606319 617433 650245 670648 646436 640717 631531 631392
10462 631392 624334 615001 580988 576281 630813 669960 649077 644050 638518 641550 608935 561440 527564
10449 527564 574640 578379 577117 605091 669419 687664 667517 700059 703037 730642 742214 775503
10437 775503 829463 856652 884489 939946 967386 943138 955573 989699 1020995 1064428 1091177
10426 1091177 1133782 1165035 1177609 1174608 1222605 1272138 1264344 1238338 1256902 1330234 1403485 1459513
10414 1459513 1567006 1632469 1710966 1781117 1854493 1906322 1993931 2100757 2174491 2266458 2370088
10403 2370088 2425997 2431654 2479696 2597616 2773187 2950635 3169233 3446382 3740484 4023034
10393 4023034 4332039 4691920 5137972 5684596 6241921 6855396 7617231 8469661 9456335
10384 9456335 10708682 12161183 13821103 15688119 17911626 20487721 23530576 27083052
10376 27083052 31428749 36919209 44093218 53529039 65970693 82262382 103300883 130491487
10368 130491487 165517861 208985354 256397969 296154255 319985413 330567153 327493098
10361 327493098 300948379 252777671 200323221 155667196 121421476 96163100 77734270
10354 77734270 64241227 54245309 46749791 41007648 36530281 32966804 30027205 27532463
10346 27532463 25264428 23131742 21090707 19089437 17219306 15547302 14056270 12788560
10338 12788560 11698010 10754150 9962706 9285144 8703287 8198211 7775704 7387999 6993999
10329 6993999 6606209 6271734 5970270 5649977 5363600 5158770 5001221 4818023 4591815
10320 4591815 4421660 4309171 4172699 4005908 3909924 3799074 3663885 3476310 3347799 3235144
10310 3235144 3081374 2971996 2879161 2815355 2794842 2721314 2644125 2557982 2478890 2410158 2344374
10299 2344374 2272223 2185381 2122898 2039482 1908287 1832330 1795159 1745994 1704209 1659147 1641307
10288 1641307 1667030 1634701 1580202 1515855 1455688 1369752 1336422 1350883 1348798 1312647 1302462
10277 1302462 1295524 1280418 1261649 1260102 1263395 1235927 1212369 1211962 1214976 1262076 1346484 1388793
10265 1388793 1465229 1547871 1670191 1836443 2075359 2363351 2529664 2573716 2589697 2603696
10255 2603696 2411837 2101045 1807047 1591605 1440532 1270782 1147329 1061571 1002183 968794
10245 968794 936008 923509 917870 879991 877158 912247 916148 930795 888919 871879 904626 899847
10233 899847 901161 895789 899619 857621 779588 714000 693222 690919 672154 650036 587546 555939
10221 555939 553310 588096 568058 529239 539575 547332 556413 526814 523060 537757 507463 473617
10209 473617 455098 410455 397981 409236 413151 385258 363293 386911 378008 377567 398391 392119
10197 392119 382191 364391 396946 449307 454852 483413 508264 504349 483464 505314 537491 571167
10185 571167 600991 630230 679066 625829 607952 645927 696161 694732 649472 618182 573128 536212
10173 536212 526875 482747 445253 476333 472887 482447 512977 515963 504113 458001 406375 346789
10161 346789 345772 345335 326901 330190 353682 359348 324939 308774 301552 322316 292732 299316 309680
10148 309680 299696 273202 291541 300609 296473 309875 335528 350769 378695 394372 378163 396699
10136 396699 427548 487728 548620 580772 572168 595392 566748 500811 428980 386783 353086 333242
10124 333242 324131 370022 410578 394331 389753 358004 356690 328733 346282 366469 372906 365540
10112 365540 377828 386799 401029 412577 415463 406351 434156 453158 403811 369072 361657 374683
10100 374683 396214 453259 472119 478838 472487 462798 463958 493709 529992 540213 553260 576454
10088 576454 565593 526304 488422 473027 448817 451151 460787 480852 506776 500198 465101 436440
10076 436440 440293 442968 409415 405861 410603 387312 366719 379153 398483 399906 429194 443005
10064 443005 486492 535314 522255 469606 442233 389181 346955 340195 333237 304537 270416 257276
10052 257276 228104 246216 315399 323164 330380 341000 331759 317756 293010 267915 295351 315987
10040 315987 359098 351230 290835 272862 283918 288074 276013 252120 246129 288807 306781 348036
10028 348036 364738 347302 311072 328418 383930 365472 320064 293657 283548 256219 269642
10017 269642 314002 304057 285568 261334 255956 273493 240710 213310 215311 183182 173180 175764
10005 175764 175970 193025 229999 239086 210221 178532 186269 196435 181710 137898 84722 108168
9993 108168 165561 197400 200335 169001 143836 148806 160320 183083 142421 101638 122910 122675
9981 122675 120568 158943 160587 157705 164041 210094 187652 149784 150582 148777 163037 181561 197401
9968 197401 219961 210426 189845 147939 120428 141326 186040 224838 273876 250635 241715 250641
9956 250641 253903 226899 247185 274510 287308 318503 402057 461200 526718 557821 640336 779017
9944 779017 952271 1137179 1327053 1528545 1676240 1743136 1742339 1635190 1462550 1263500
9934 1263500 1058794 886470 810417 780687 689729 572822 506809 458496 382788 333915 334206
9923 334206 388094 404098 353905 309730 286730 287708 317349 305370 285710 278815 280256 260420
9911 260420 250619 271440 310328 286857 298329 285156 285174 224597 182367 207231 224537 224364 231457
9898 231457 226366 237648 228925 207425 158444 156380 200842 249818 269775 261653 243831 253256 263787
9885 263787 261759 328861 365397 355095 382191 399787 413469 482837 498637 462944 443069 373215
9873 373215 339757 348265 347274 345697 318947 304158 331202 291217 268677 267697 245561 268952 304724
9860 304724 317584 318104 320540 337110 298006 285114 336670 367632 368340 417576 388806 388084 377591
9847 377591 356311 380008 417069 448348 439341 431950 419653 435722 488015 450981 408136 361027
9835 361027 354641 340882 338579 370194 351623 305125 291523 280758 261512 270486 260399 263311
9823 263311 308114 354424 382270 380984 397143 400202 433717 454406 448900 480615 499398 511612
9811 511612 537577 552392 567323 553251 524937 529270 512903 459046 419651 433690 434981 419349
9799 419349 410664 415875 390419 422813 439151 475628 468530 485067 505916 471646 483279 526164
9787 526164 545597 559464 579278 558085 539678 504426 470997 471317 506475 555885 569448 584135
9775 584135 566997 514484 495925 510118 522208 550056 616401 647622 655113 658293 677184 691237
9763 691237 699907 742699 801122 860339 890596 954811 1035399 1131319 1204036 1354950 1493666
9752 1493666 1690247 1932764 2210640 2473394 2820701 3260910 3764740 4409786 5221319 6234249
9742 6234249 7415841 8836591 10448843 12083836 13484088 14531673 15128104 15176114 14606712
9733 14606712 13596938 12381976 11154607 10109989 9337981 8834050 8562672 8378625 8249808
9724 8249808 8169767 8140645 8139942 8267522 8598909 9106790 9824679 10795687 11902890 13104666
9714 13104666 14323246 15515907 16553210 17421680 18244975 19127131 20143854 21318413 22658850
9705 22658850 24208011 25926967 27525402 28762505 29468160 29637401 29284714 28461800 27297840
9696 27297840 26056170 24950539 24131428 23678532 23395140 23159508 22951159 22655199 22170312
9687 22170312 21646963 21193266 20826064 20462409 20173097 19964240 19828437 19702705 19702801 20087230
9677 20087230 20833577 21977426 23611301 25673611 28114857 30923175 33957216 37013770
9669 37013770 39834148 42226679 43967762 44840532 44712709 43678608 41857694 39384919
9661 39384919 36461534 33305551 30221771 27444809 25113132 23308290 22028620 21158415
9653 21158415 20638664 20391712 20285710 20287363 20347913 20424791 20542628 20800331 21216409 21680392
9643 21680392 22050073 22330522 22426704 22361740 22244911 22270622 22663413 23378650 24368780 25441959
9633 25441959 26456777 27258032 27688773 27630291 27143416 26306030 25211216 23875700 22539761
9624 22539761 21337317 20262834 19335978 18538088 17745189 16794599 15699103 14582226 13478084
9615 13478084 12424729 11517583 10813047 10363736 10064236 9966112 10003854 10133866 10324028 10578717
9605 10578717 10886119 11261890 11756662 12444532 13272482 14178310 15173243 16158303 16917771
9596 16917771 17254278 17191680 16756885 15957242 14804384 13525141 12307371 11249334 10350086
9587 10350086 9617542 9037478 8556095 8108224 7688537 7306162 6959296 6581102 6216794
9578 6216794 5898250 5602087 5299885 5023982 4732771 4450027 4221270 4028514 3829785 3651973
9568 3651973 3431062 3240697 3094409 3011088 2887947 2747807 2611942 2529330 2436147 2350071
9558 2350071 2264471 2201515 2119642 2023916 1968141 1914977 1874082 1774590 1700672 1650743 1605929
9547 1605929 1545174 1495053 1413002 1355649 1312617 1273359 1252634 1235941 1207390 1167595 1133434
9536 1133434 1148419 1166226 1162850 1109829 1085657 1025610 1045406 1030499 1051421 1025934 962604 948841
9524 948841 966818 922097 893807 879278 869821 865419 862179 846719 805027 756642 767884 767718 725737
9511 725737 688629 699457 724482 763494 743189 699255 643815 598477 601586 605885 605257 583010
9499 583010 582562 603359 607677 601026 600957 597009 606021 623421 620176 599733 619560 614595 630635 626620
9485 626620 626933 619763 585217 565920 559976 578147 581129 524460 469402 415832 393788 392460 405144
9472 405144 384550 395507 421693 417093 404918 410067 429247 437143 395263 347638 357147 378682
9460 378682 399439 383753 336903 310058 336095 342723 345269 366587 357937 376201 408024 373494
9448 373494 331070 346569 337881 306984 306779 296802 272881 292747 300160 292348 251967 223517 202751
9435 202751 212724 193136 206979 247067 249841 255155 241139 210199 176799 169428 209251 222959
9423 222959 199570 197869 202432 223192 235144 235557 234454 213930 202806 193637 203320 221731 251970
9410 251970 228103 233462 210047 180971 183050 176031 162413 120893 102982 104515 106176 144309 175687
9397 175687 177150 167791 178377 204057 216191 168970 166447 166225 164195 165324 134773 128621 154090
9384 154090 145760 102574 101583 102501 74282 69807 118721 124276 139440 127661 91850 105921 121648
9371 121648 103931 133770 145102 145250 177922 179278 153918 179497 193950 176734 168230 150651
9359 150651 124105 119953 110202 101540 143176 100393 69780 49377 35737 62524 67772 86312
9347 86312 117729 128801 188543 199291 171390 185514 177778 161315 179327 211910 257688 276944
9335 276944 272169 237279 198035 190253 203672 209139 229071 241713 236763 209459 196386 175107
9323 175107 145934 160812 217567 233084 226849 243181 223755 197457 213920 219076 256853 252373
9311 252373 248322 286023 295947 299302 334736 327715 288662 285515 307119 303736 313103 330506 346510
9298 346510 371115 351256 345166 357910 352595 357881 347792 323792 293883 270353 249331 247830
9286 247830 244988 219635 278529 270117 245101 238396 250185 251953 272305 271241 286092 274284 273987
9273 273987 287981 317964 347137 369797 394519 393666 413144 414631 393437 366779 404875 424639
9261 424639 394095 334142 386963 391929 361413 346263 325142 312774 324336 343334 370215 360539
9249 360539 340938 345035 372781 398629 395164 415961 419403 436368 427565 423453 424414 434472 439565
9236 439565 422431 461914 516620 570970 681221 750845 789988 804414 815493 791916 724365
9225 724365 628482 549903 484242 440318 374853 384572 398573 344337 333657 314061 308697 302685
9213 302685 283698 252008 234458 228128 205030 217670 243408 230320 213911 191366 204331 239106
9201 239106 263964 304906 313581 297986 314139 364934 367604 340671 339578 368093 407641 460829
9189 460829 539768 688797 873139 1049309 1150406 1186371 1245870 1278250 1116397 862890
9179 862890 676936 594444 510794 407553 335056 321799 323010 312723 312682 303227 293278 264186
9167 264186 273585 268295 221833 195493 168649 149212 167673 173730 177871 173003 166713 157804 199318
9154 199318 213432 214730 200990 189000 187404 211872 200867 206957 234325 316753 375155 387926
9142 387926 456066 539248 569085 590112 648595 633208 548597 438317 342351 308583 248887
9131 248887 227797 178330 175054 177795 157136 167110 192511 213418 177004 122897 139594 155031
9119 155031 131967 129316 86112 169584 236739 211851 155120 154144 170233 162257 128312 64096
9107 64096 70386 107290 128624 115576 118768 132158 98382 59187 80615 132676 135909 159264
9095 159264 155565 178211 232713 243488 219758 205388 149806 115635 111018 128849 149237 179913
9083 179913 143680 90600 100079 138603 172304 139432 105090 97696 72037 40272 63570 72398
9071 72398 60233 34234 54657 94968 111138 98120 78638 54269 42342 38309 34300 56561
9059 56561 81573 94107 102730 88845 79901 71769 74725 100860 108428 102823 128103 135181 144218
9046 144218 138663 163239 198374 242092 252054 254791 254906 241048 205660 261591 273513 238453 229244
9033 229244 202303 112992 92080 122912 121989 96005 85500 80380 90856 58585 28202 54794
9021 54794 27902 25313 -613 -14970 14992 41161 38391 17710 22272 15839 10313 50268 70853
9008 70853 89678 100620 82593 74485 75328 110521 127813 109360 109276 134343 168231 165058 148467
8995 148467 175518 199128 195904 179778 189649 213199 214287 221780 189738 152254 84731 49765
8983 49765 57423 58296 34478 31826 35849 49512 38629 21547 -5842 -43899 -78629 -67047 -69957
8970 -69957 -81937 -91170 -106848 -81552 -70381 -42149 -22524 -40741 -14713 3125 35083 58844
8958 58844 65149 70419 75511 69707 99246 119124 129918 150127 163985 158497 160475 178425 185125
8945 185125 156371 134295 189795 221510 186132 187810 160120 139663 133058 134556 139321 133185 114436
8932 114436 88089 57311 36951 73004 93060 55881 12558 2414 32380 50136 48270 90438
8920 90438 107831 106297 75340 83449 115394 121171 157931 202336 208839 231266 283923 301242 309133
8907 309133 294539 281980 252911 227622 190605 227338 236021 218266 244462 286770 250625 214651
8895 214651 208011 185240 187890 179215 182300 214753 275673 315881 314719 258127 247735 231933 235659
8882 235659 245083 242498 238229 281829 337303 371829 413125 466232 515641 558780 614422 682440
8870 682440 749105 817975 856024 890845 973370 1022567 1031731 1008735 960753 964203 953686 976652
8858 976652 1039840 1125032 1230596 1345490 1424076 1575594 1709829 1842523 2008265 2245096
8848 2245096 2594866 3087500 3646666 4378964 5199816 6176175 7412565 8949803 10871762
8839 10871762 13439209 17001511 21787661 28101562 36687966 48599022 64491952 80969040
8831 80969040 91010054 95374149 98590583 96126709 81064051 61821211 46137011 34933500
8823 34933500 27179344 21796862 17982307 15210480 13178990 11660451 10502996 9573906
8815 9573906 8832253 8242826 7719234 7278879 6938379 6666160 6478468 6383684 6301030 6315176
8805 6315176 6490854 6771114 7194437 7838322 8795893 10073643 11610572 13369363 15534413
8796 15534413 18301365 21795744 26538457 33131688 42055041 53878282 69932915 92670908
8788 92670908 124475525 159966093 181107983 189108360 197000824 196219085 165256764 124292042
8780 124292042 91239813 67802707 51682731 40653315 32965203 27483771 23511036
8773 23511036 20553382 18311912 16522436 15025710 13743176 12657761 11578240 10561365
8765 10561365 9750984 9055921 8451564 7992365 7648287 7476506 7373580 7337207 7480553 7752055
8755 7752055 8184454 8790488 9555690 10495212 11724455 13315599 15522581 18558540 22714239
8746 22714239 28210349 35639051 45939943 60014194 76163659 87640462 92328360 95205213
8738 95205213 95006556 83240786 64291520 47675303 35582107 27174582 21354606 17294860
8730 17294860 14394637 12282027 10742052 9551544 8595925 7787868 7068760 6468832 5868626
8721 5868626 5297441 4818915 4391387 4059087 3787893 3523789 3314290 3125791 2935339 2777383
8711 2777383 2629836 2499074 2411275 2290770 2189885 2068321 1961651 1910587 1847993 1797339
8701 1797339 1761049 1714427 1638266 1543576 1459886 1383374 1377182 1359524 1294727 1260030 1230267 1200642
8689 1200642 1143589 1142036 1117084 1069636 1043729 1028163 1041745 1029463 1003305 962125 929672 891883
8677 891883 875428 829617 784447 765574 770132 728710 700154 701541 674791 654267 649682 673409
8665 673409 675414 675919 677897 686630 665126 701265 694560 663441 664368 712069 755210 779533 764532
8652 764532 741182 705095 649997 635311 641225 667112 698564 712244 744607 783132 746125 692091
8640 692091 635407 602419 607892 561768 517643 497634 488522 459173 448125 428779 444142 463839
8628 463839 439933 417541 401355 361025 368202 376157 360360 345853 354906 392336 411798 415682
8616 415682 394738 399348 450388 468500 458535 463985 478843 476812 489818 491428 486139 512184 517036
8603 517036 525537 555959 595035 678223 736909 752030 739296 740594 683974 596146 563216 550101
8591 550101 497935 455936 446210 415074 379078 363704 386762 341444 304373 249445 211958 192000
8579 192000 172686 157102 146099 120321 107319 148904 192513 239708 264741 254531 252255 237283
8567 237283 256504 277469 228076 201964 184622 154292 192085 218635 214224 250430 287749 342076
8555 342076 321029 325865 376854 373744 341656 327365 327051 315956 296663 240195 190405 173253
8543 173253 166211 165021 141893 144920 87298 57794 66498 88990 112154 143514 146293 142761 135313
8530 135313 109998 122170 163493 149308 132631 129220 117141 149744 143820 145058 115192 87319
8518 87319 86882 96470 99901 93383 130597 152067 130400 99989 107733 132478 163573 163098 199592
8505 199592 231108 220770 215547 206826 165201 156020 181978 184860 162260 162401 150190 185371 188927
8492 188927 180898 155526 105311 104938 110054 87247 87472 95743 122922 93490 125925 161913 149337
8479 149337 91764 81485 23914 -34151 -14475 14171 30442 75362 81960 69107 79086 82880
8467 82880 85941 60983 54509 56097 62947 47394 62436 57415 62318 102124 108115 106899 64187
8454 64187 32453 68924 102289 119395 130023 129090 128842 134941 138015 145593 128677 143209 125586
8441 125586 109986 97255 139421 117905 136591 163248 155182 126636 147608 173827 181018 243156
8429 243156 359802 457011 515311 559949 572150 588861 549319 466823 369640 276425 218890
8418 218890 205362 158289 101745 114921 135240 115612 97744 91407 80710 95898 120796 161467
8406 161467 185267 185387 155387 135555 105822 107132 146526 147497 133453 150058 147093 157290 191569
8393 191569 180430 216742 248045 271427 271008 313975 354564 461402 577647 706108 879136
8382 879136 1040183 1102513 1145609 1184107 1079698 859976 644322 525469 451717 364056 289656
8371 289656 229225 204322 158050 117667 119145 130397 131808 154345 154888 152949 162618 151148 166772
8358 166772 174514 169598 184409 161542 132279 125747 165100 194265 179171 198261 224208 226159
8346 226159 240276 263357 259025 251055 254304 245325 273956 323519 421455 470383 505561 545218
8334 545218 583630 527419 424602 341004 298341 249458 225230 199522 149954 162584 153486 154776
8322 154776 146586 182289 186598 150487 101626 96685 122096 128304 115204 124371 184580 194662 170600
8309 170600 138966 110226 102439 122224 153753 178432 167865 142378 119948 85019 45632 42815
8297 42815 60813 40899 53114 75712 75226 109752 92146 86611 66626 74796 77609 93152 132943
8284 132943 106017 109723 100278 79651 99746 126671 109388 113986 165694 147208 134612 148503
8272 148503 156312 123833 103310 79911 84517 122260 116163 92297 82824 63766 46431 77929
8260 77929 88170 97703 92243 59649 51435 87944 106404 65414 67658 78991 58594 90065 79314
8247 79314 56214 91745 99809 84004 104844 128223 119705 109452 122344 150088 131184 101722
8235 101722 122534 138906 118016 133635 161380 160580 129183 144789 152833 154973 159546 148499 117537
8222 117537 101228 93631 87113 64342 56216 76499 108214 141003 145524 133383 152941 182036
8210 182036 217397 161460 130610 140476 138317 107747 92875 98778 70058 17995 15720 41355
8198 41355 38665 59746 80392 69175 74531 71893 85551 82704 75472 111915 152357 162128 123624
8185 123624 86434 78531 50385 31344 14055 15300 34007 64388 69941 52296 17754 40013
8173 40013 91208 100405 97077 94830 101586 116484 133012 154685 162350 178261 235816 248668 219939
8160 219939 207878 180005 159030 140390 114014 93022 89077 83150 62394 48331 47287 70842
8148 70842 90066 88399 103818 143976 153255 91415 27041 20702 37884 42254 71893 71721 72658
8135 72658 68366 81605 75587 38337 23714 36050 23601 28713 45678 57468 81793 63262
8123 63262 66211 52604 47190 54837 35936 44078 108218 156934 153745 150620 145471 126137 95404
8110 95404 70868 14075 -35246 -42094 1103 30328 13619 31847 57514 66749 66913 70924 76141
8097 76141 90733 96492 101579 76507 60073 100119 76444 69217 50051 17593 35221 34055 41517
8084 41517 50708 43615 49240 79510 82829 114232 138832 145627 170445 153551 85722 57607 50472
8071 50472 45127 5889 -15823 -30705 -19438 -2906 19912 36411 47867 49055 23681 57172
8059 57172 120103 122223 140073 143332 120909 76421 47140 52776 54419 70864 83751 100242 88170
8046 88170 78550 35619 19344 35633 55003 71266 64497 67667 109883 112724 109985 118326 122067
8033 122067 72736 60845 40264 59276 93467 97025 82700 87696 110932 112752 97905 59212
8021 59212 61990 70971 51270 68559 61021 59355 67403 65748 88895 88821 89766 70961 41029 80808
8007 80808 87847 91756 88004 89595 101986 95492 84203 81583 68180 42334 56663 86427 92943
7994 92943 105906 127732 138118 178597 180286 190522 219689 220338 211948 165192 116211 98661 61412
7981 61412 76996 89889 74321 20898 17202 84999 121650 141060 142875 109887 111890 138793
7969 138793 143278 98050 79359 99734 85607 89860 100023 94500 127288 109284 121175 105833
7957 105833 86435 86925 135138 97496 62524 87824 119183 128731 87811 99000 96488 107948
7945 107948 108527 112291 115617 127233 109802 104828 119409 92484 95206 110434 117884 103591 125430
7932 125430 160051 149548 118358 74996 51083 89195 99749 76025 83836 78009 42057 33839
7920 33839 62014 91299 112876 124864 96579 99312 105468 96941 91385 92173 80216 71256 81276
7907 81276 50818 45912 52089 65836 67710 92961 103570 58799 2732 4357 25124 29456 -16149
7894 -16149 -14100 21845 34971 22842 5199 -5000 31911 34555 18632 37340 76497 62018
7882 62018 52166 30341 8879 34713 32012 38587 33180 50070 26570 13403 6869 -9979 39067
7869 39067 51584 36735 5624 36200 68262 69631 41758 46763 53162 51628 46869 32252 32618
7856 32618 51029 31773 28200 13443 -18624 17326 24041 24831 54517 50631 7918 21773 54318
7843 54318 64111 53041 70708 42594 19565 38909 45798 74974 73558 30986 14773 24754 39903
7830 39903 10372 659 -12945 -49078 -78340 -55462 -23372 -19995 -15243 23329 39186 19601
7818 19601 765 -17872 -15859 7569 31178 143 21776 48685 55410 49952 35902 2622
7806 2622 18228 46158 32270 -24334 -37825 -22385 -11502 -5417 39438 -10104 -40636 -27367
7794 -27367 -9068 -17539 -19912 1988 33943 53153 59977 44393 20618 21765 10720 -2750 -3724
7781 -3724 47219 86310 77117 87737 89926 64858 76744 58337 13349 12242 23408 48041 25533
7768 25533 36114 46451 42410 45245 54945 58181 35560 10907 7561 47820 23480 26027 1502
7755 1502 -10716 29873 37558 23444 30397 25546 41038 -3582 -17045 -28791 -32666 -37144 -26144
7742 -26144 12466 46507 42079 38407 28842 32721 46363 19070 4560 28070 44140 56220 34644
7729 34644 -46751 -79046 -48392 -12477 17258 31169 23132 -35953 -29659 4738 31010 26691
7717 26691 12784 -13927 -36339 -12784 -15123 18467 4840 -22186 -24127 14206 36757 31455
7705 31455 23132 16027 20386 38775 81343 91725 73685 37079 34367 18740 19292 31932 3565
7692 3565 -31459 -14412 21900 27460 42020 26684 5373 39101 24201 -14612 -22049 -9297
7680 -9297 9649 -7761 5037 13031 12081 24771 14413 11361 8601 351 24179 14539 19853 46458
7666 46458 59161 83267 90497 87336 53224 1678 12370 16173 44216 58240 46985 69158
7654 69158 70053 47337 34678 32134 43247 20777 -19745 -36502 23013 24892 22981 25253 16919
7641 16919 -1659 17496 49556 50425 33097 27832 43096 49086 15355 -25633 4512 14657 14183
7628 14183 15294 16137 -7152 19138 44958 27303 21896 23384 70277 65038 40809 58308 55296
7615 55296 47921 38510 8138 -23646 1916 51369 58121 40657 -28267 -37420 -20639 -495 -2778
7602 -2778 -11871 -13495 -17914 -14213 510 19209 42056 42614 9901 10069 -14101 -61712 -63068 -46317
7588 -46317 -17521 -10569 44864 87642 40898 -13804 -5458 34560 54003 24208 75990 94328
7576 94328 96621 64713 25439 12615 -10930 -6427 3062 -10055 -28378 -13179 2520 11128 17991
7563 17991 11147 4977 632 26383 17580 15018 -2168 25575 8371 27403 43533 -4765 -14068
7550 -14068 2307 41634 54910 55683 30882 17515 -1472 -15543 14 48534 77259 101577
7538 101577 80460 78664 65422 43159 13472 -117 4660 13318 11585 22865 5940 5028 18337
7525 18337 5624 -39344 -73519 -103948 -103280 -99818 -45062 890 -11020 -4262 -11814 -39217 -24353
7512 -24353 705 -4807 33342 23877 28881 30312 -22472 -51639 -17517 -9565 11168 21324 -11270
7499 -11270 6800 19522 13779 -14563 -14573 -12320 74 50763 75679 73593 74022 71016 41720 37001
7485 37001 -34993 -49350 -18765 13142 37178 91042 83652 56813 44529 63264 33942 42733
7473 42733 63540 36778 -27158 -40341 1575 31577 48118 31139 33857 27145 40581 60721
7461 60721 20163 18801 47131 31684 -5635 -9416 -17315 33446 54746 25148 40674 43765 3064
7448 3064 -10669 -16632 -31768 -27742 -18132 -29490 -18851 -2558 -47531 -49906 -27910 -21299 5852
7435 5852 9586 38853 85414 67358 23961 31152 29423 7386 5795 11289 -14495 -31577 -27969
7422 -27969 -5469 6942 -20510 -41096 -63906 -61962 -45799 -31030 1941 300 12209 8959
7410 8959 9027 -5695 -14175 -16329 -25686 -39127 -36624 -19830 5023 6743 15124 29539 40020 35238
7396 35238 -15442 -44397 -43528 -19303 26118 42429 29098 26445 -18581 -53367 -49372 -30079 6569
7383 6569 34762 38373 40724 27024 13247 3114 -20441 -29083 -21814 -24579 -38352 -22808 -28596
7370 -28596 -29974 -23906 -992 -11659 -19603 47112 22943 -12359 -14447 3158 -11931 29838 53362
7357 53362 38293 13430 -20586 -16214 3458 22393 14876 128 -9223 -3752 3770 49971 50417
7344 50417 52958 51898 45752 44066 25917 4053 -842 12776 15264 -2879 -11147 -43534 -86828
7331 -86828 -127081 -113726 -66366 -15568 -6409 -23888 5079 20200 1569 -5936 -19453 -40707
7319 -40707 -58090 -45601 -34835 -50999 -30239 21468 14472 9986 31035 34569 -189 3674 17794
7306 17794 21361 3297 23061 42078 19229 1119 -50817 -81102 -60240 -10481 5681 -3548
7294 -3548 -25516 5316 -7835 -30224 -41282 -22137 8868 32486 50773 35896 6895 -4245
7282 -4245 2064 -2761 12174 1052 -4337 18147 19377 -19029 -21232 -25947 -13162 7236 -2435
7269 -2435 -5223 -4662 -53997 -64555 -33783 -25071 -54319 -80491 -47114 -650 13392 32464 32988
7256 32988 6094 -16646 -9505 31370 59701 18944 -8596 334 43703 62758 18567 -19868
7244 -19868 -27030 -9561 -17647 -36282 -6280 61470 44614 10721 -7358 -28688 -7722 15194
7232 15194 1054 -252 -12611 -4961 -20427 -44838 -32470 -4032 -3455 12571 34303 25839 29270
7219 29270 49721 30973 -20767 -37395 -13245 -3239 -2990 44834 62986 14123 261 52582
7207 52582 45469 50333 64159 59743 32170 30901 3052 13571 33990 25355 -969 -35302 -32503
7194 -32503 -7519 15372 41229 16921 -2486 -14947 -6154 30901 38944 4191 30012 23656
7182 23656 27436 26647 30072 37953 24945 12188 13885 20450 65891 65014 59578 25579 -4990 33
7168 33 -6395 -4272 -5114 -18585 -7158 5020 16080 21774 -4977 -34076 -26036 -8870 41677 51685
7154 51685 30329 22872 -29767 -56384 -42498 -22944 16437 23920 10492 -8439 8576 -7891
7142 -7891 15658 6298 -3639 4087 27651 18206 10343 -12519 -10893 -13623 -22689 -53802 -50079 -4062
7128 -4062 -4446 5589 25081 -5640 -22422 -22158 -1705 -680 -11073 -37426 -45189 -23601 -20990
7115 -20990 -29743 -20335 -11162 -370 -23156 -32274 -23981 -59918 -54422 -24708 -41861 -52756 -45151
7102 -45151 -26372 -27166 -36253 -50067 -25196 -3934 -14868 12953 54400 53830 23334 7140 19116
7089 19116 44123 43684 7153 39436 31748 -5042 5222 -11728 -20824 37003 85663 47804 -6596
7076 -6596 -3594 -11125 17428 14621 -20831 -13797 7958 36312 14783 -5507 -33726 -57489 -50772
7063 -50772 -32420 -60859 -65280 -53364 -49016 -61650 -22156 5994 -8558 -24465 -47767 -27545
7051 -27545 6283 -25303 -20451 -15352 -17911 -14650 -1258 -18462 -54856 -66320 -28356 7955 -3116
7038 -3116 15621 45312 34578 28183 30035 38519 22310 -14627 24259 10483 -11210 -44895 -56456
7025 -56456 -51887 -38289 -12851 19160 6517 -24376 3767 21716 1059 -35479 -29098 5180
7013 5180 16033 -14778 -36805 -37911 -31674 -41966 -28477 18331 21457 46085 49051 43713 -7427
7000 -7427 -12466 9784 -17439 -21210 42553 37697 23010 21105 6206 -657 59075 57771 47169
6987 47169 62655 52875 29217 -4510 -22013 9515 37506 43559 48141 42083 35816 10299 -3873
6974 -3873 -3998 -7242 -174 16372 14020 37552 75032 82664 93938 102613 72978 44349 18444
6961 18444 6338 -1218 17061 7301 2657 -29267 -60530 -38488 -6162 11772 21981 8179
6949 8179 6725 -27698 -15435 -382 -1420 -29766 -29714 -36119 -35108 -13451 8626 15254 23311 41867
6935 41867 68881 95770 65207 89505 86830 69070 90020 87830 58046 38894 14385 22943
6923 22943 58912 70864 81791 43683 -9800 -28528 -24571 -48526 -57154 -22690 5768 56017
6911 56017 50749 59405 53903 30705 -25460 -21196 -21263 -7797 48176 71238 43979 37629 63018
6898 63018 55624 41434 21296 3720 17902 44000 14102 10424 38039 26147 12740 1839
6886 1839 3283 5959 -13355 4488 -6252 21534 38979 1392 19375 51806 31372 9476
6874 9476 -13825 -19787 27081 719 -38646 -43888 -38807 -9866 20451 13287 15897 40641 25450
6861 25450 53909 53097 52677 44848 315 2239 -22164 -74868 -57247 -49737 -21306 26244 78805
6848 78805 81255 48065 20325 2716 48042 84223 122966 166889 186237 163051 129395 100006
6836 100006 83935 58321 21635 -19402 8136 -8431 -55444 -31397 27891 9518 8542 16145
6824 16145 47281 71985 84730 103906 107013 130578 156066 138968 125968 78730 49598 54820
6812 54820 83955 78939 58743 36652 46681 82681 78704 60662 62258 64422 83145 82152 96790
6799 96790 101020 75533 98866 103633 117895 128367 135122 108586 53296 40552 48312 36436 32572
6786 32572 12894 34089 69136 49774 76240 109374 132949 97016 71291 37185 41674 65024
6774 65024 105044 129516 136996 149710 166349 154731 135088 96854 103322 126104 153235 180922
6762 180922 166685 137942 153997 141598 89804 82847 85326 88452 63303 63867 79138 73628 96137
6749 96137 101167 83652 61970 84286 88329 116606 128309 91752 87102 83553 88807 87686 58350
6736 58350 35136 28447 48166 22700 6008 38815 35478 5160 -27747 -2730 18868 -2774
6724 -2774 9430 35067 32119 16197 9899 17952 31726 34031 29031 43847 12657 -2964 16743
6711 16743 39141 45407 41911 -17093 -18339 -9921 -31167 -57139 -22120 22967 53466 35911 14523
6698 14523 -33411 -63259 -31068 7515 4675 7306 -7188 -25107 -14826 -150 4430 3708 10815
6685 10815 49385 65282 59842 45647 932 -17038 7374 41191 56578 61865 43207 22961
6673 22961 13440 -6798 -19119 -9060 -6205 24139 19938 -16640 10093 15153 18335 9613 7566
6660 7566 1613 -14465 -22837 4076 5555 -11778 -19261 -30219 -3632 5780 7994 10610 -20210
6647 -20210 -3109 9334 24060 6389 6554 -9888 -19070 -1367 -1266 -2747 21881 49491 14418
6634 14418 7702 55434 72053 38538 20077 726 20434 20418 27611 20472 1327 -44653 -63811
6621 -63811 -53171 -49309 -24736 -27419 -42404 -8225 -24761 -38557 -43848 -32423 -42158 -39414 -10742
6608 -10742 20716 44191 62826 46417 28495 33252 12718 -9299 2101 1680 -44586 -71842
6596 -71842 -58826 -46244 -4003 36767 41870 59720 52551 6578 34593 35729 40613 11652 -10970
6583 -10970 -28813 -8110 33851 33583 13554 16669 9601 6948 16011 54630 64370 48761 47720
6570 47720 27474 67789 118372 80586 37315 6879 -31509 -19832 -20340 -40485 -76345 -61105
6558 -61105 -42450 -30276 -12248 3936 -33661 -62547 -59615 -79224 -77234 -31223 34529 24201
6546 24201 -6727 15233 38905 41439 19304 -20945 -21784 12655 38616 12738 -6891 -56812
6534 -56812 -70810 -42267 -6637 48404 63086 26206 -448 -25011 -20197 4360 34796 27280
6522 27280 1513 -25370 -21763 9401 26378 22304 32766 26890 -8729 -14264 -25192 1984 9569
6509 9569 7059 21269 27921 7934 9127 24733 13957 -19749 -31632 -52444 -56368 -21027 -9437
6496 -9437 -15739 -32825 -45229 -415 15734 -13815 -44635 -94109 -123524 -99673 -67272 -27257
6484 -27257 -14010 -33640 -68181 -67413 -78417 -76207 -107443 -108775 -55361 3103 -3337 10102 5689
6471 5689 4826 27233 57989 41115 40715 51699 37143 7434 1719 -23808 -41337 -33475 -44861
6458 -44861 -33350 510 17804 8999 13156 60832 51398 39360 12929 -14868 16113 38626
6446 38626 4354 -22618 5602 15201 -9491 -17439 1854 11748 -4429 -1011 -7610 -8360 9350
6433 9350 10407 -10940 -23918 -4396 2741 -592 36166 53049 49451 56678 66900 36870 394
6420 394 -29051 -5624 21074 14330 832 21168 5890 -29468 -7053 -13947 -45872 -3302 48294
6407 48294 47987 39522 27401 41593 43870 53506 29085 -20149 -25549 6916 42983 14146 17277
6394 17277 70664 50724 33997 44801 29421 8375 24896 21156 34338 21775 169 31161
6382 31161 50283 4976 4855 -4909 -28209 -8222 -12084 -18396 -37945 -16436 34007 22967 8432
6369 8432 16649 33256 34110 6941 995 4825 6560 -7962 -30273 -29196 -56825 -38140 -22323
6356 -22323 -39436 -52487 -29431 -16564 -11056 -26635 -33983 -37993 -2 -10234 939 28445
6344 28445 33208 5464 -51716 -56838 -57637 -74913 -45466 -29045 -52180 -40517 -549 29442 17771
6331 17771 -5563 -8783 -18353 -52047 -60988 -27988 -19945 -3763 9345 -3658 24342 25864 -5520
6318 -5520 -12324 -26907 14174 1881 -15584 -47933 -71685 -19657 38682 4729 -6461 3993
6306 3993 21884 272 11272 18911 -16893 -10297 -14098 -28574 -33475 12569 25068 -25927 -63615
6293 -63615 -39781 -20187 -16002 -9660 15626 38188 29487 -458 -10358 -11610 -23514 -9300 40238
6280 40238 52884 49558 2251 -19371 -18777 -23251 -29541 -31030 -35678 -37190 60 2636 -35052 -41908
6266 -41908 -57864 -82472 -75602 -67396 -43104 -5449 -10916 -52349 -70388 -36936 -55956 -66543
6254 -66543 -68457 -49618 -77624 -76961 -58338 -52625 -51600 -49881 -41749 -4459 -6962 -40638 -17469
6241 -17469 11717 26982 17198 31658 48895 8575 -3279 25121 -13240 -52560 -51421 -31188
6229 -31188 25687 16636 -12794 -5358 -10604 -11957 32876 25371 21165 22921 -23413 -41502 -28300
6216 -28300 -40969 -31407 4623 4594 -487 -25716 -25902 -30732 2885 -10929 -15305 -6861 -3758 26249
6202 26249 28657 20549 19030 25059 37350 69589 40834 7943 -6018 -30004 2835 27507 25809
6189 25809 -3362 -5819 5955 -12139 9379 -39179 -68211 -67013 -33359 -16747 -17993 -21149 -34030
6176 -34030 -29028 -27961 -28881 -55410 -62517 -68220 -47896 -45576 -38446 -11751 42491 64931 52159
6163 52159 72751 75807 77264 28968 -5581 528 -2714 3374 -31993 -40085 -52603 -32660 -3631
6150 -3631 -39880 -40519 15786 -18073 -8654 10169 -3885 -172 9773 39216 37897 51497 76250
6137 76250 84108 55196 22454 -11848 -19777 -7000 -855 6210 -5236 -8191 2942 -15310 -21411
6124 -21411 -46703 -44162 -39277 -10008 326 -48712 -41465 -37144 -8700 -20068 -17868 -10955 -11694
6111 -11694 -33020 -61017 -48934 -67218 -34319 -16734 -56306 -38674 1291 -6161 8508 -21240
6099 -21240 -14966 -32283 -62979 -70425 -72355 -58565 -17444 16258 27033 -8062 -9066 -17523 -52773
6086 -52773 -57442 -53360 -23404 9216 32353 31312 -21627 -36580 -11558 -11383 -19676 4135 32332
6073 32332 -3220 11756 48697 48660 35945 4816 -40091 -43982 -31067 -79 -2131 -28740 -54614
6060 -54614 -55740 -15288 43486 -330 -64751 -87463 -58110 -37121 -14649 15847 35530 50408
6048 50408 10831 4384 -29596 -26920 -61386 -102881 -90263 -62982 -58845 -57326 -50849 -22790 -14965
6035 -14965 -39341 -48970 -21684 -53621 -50538 -42746 -58850 -45451 -12054 -14903 -44443 -69283 -72070
6022 -72070 -76599 -70440 -36246 -41656 -52251 -13689 30344 20175 -14693 -42290 -58114 -44015
6010 -44015 -25929 -29045 -17139 -17634 -3530 14270 21243 22851 21637 43726 16492 -1536 22207
5997 22207 57551 66436 -514 -51314 -30265 -8826 4396 29693 58793 47716 23532 -319
5985 -319 -8556 -21986 -29886 -31501 -15234 21433 -1973 -3272 32700 30415 -1055 -32390 -80838
5972 -80838 -72756 -68017 -74657 -56972 -32682 -13982 -19653 -59550 -39701 -32011 -1322 28284 47820
5959 47820 36003 18700 -12117 -19310 -24734 -14042 19280 41700 32698 31134 40237 -6487 -16892
5946 -16892 11560 -5630 6211 5156 -33187 -70570 -71012 -45958 -43815 -41431 -23854 -25299 -34451
5933 -34451 -45777 -26468 -43551 -55359 -50225 -25215 -30491 -41474 -29446 -39548 -36190 -32012 -3980
5920 -3980 63573 55228 9529 4960 19943 -13611 -11904 20989 -13937 5816 23661 -3935 -27395
5907 -27395 -18789 8095 53019 30361 42282 30395 5113 -30449 -55631 -65089 -34909 -23888
5895 -23888 -45067 -38265 -26657 -452 14909 11155 9180 5545 16543 -227 -67758 -71745 -53209
5882 -53209 -84791 -107883 -71788 -16211 -23066 -40195 -26372 -8846 -5343 -3368 16396 19948 30552
5869 30552 18226 10835 19481 -24325 -39968 -1138 8785 7242 11125 18599 -6755 -24236 -48557
5856 -48557 -16771 -17140 -27259 -15008 19725 30665 8837 -48 -4301 -8182 -13532 -11998 -38604
5843 -38604 -34140 -7943 -16995 -46022 -25442 -29475 -23792 -33621 -34710 -41849 -43285 -12615 -17177 -63846
5829 -63846 -89308 -60947 -41530 -26671 -29738 -7244 20572 13588 5820 -8181 1395 20205 10398
5816 10398 -4750 -23104 -26102 23551 21500 -8950 7841 27390 -1648 -4621 -42725 -18806
5804 -18806 -9220 9302 5229 -12354 -58886 -78559 -62605 -53330 -99231 -100735 -66200 -74290 -35325
5791 -35325 -4582 14864 9399 16818 28662 -2705 4156 6114 1406 -4410 -12297 -4686 5977
5778 5977 -11271 -25993 -12007 -14129 5480 -4529 10084 15622 64239 75602 81163 76436 20464
5765 20464 20215 24199 47805 18783 1546 -10438 -3356 -30843 -44725 -41797 -13876 17966 62823
5752 62823 86408 55279 57125 37506 56326 79257 78933 46885 45871 38806 5624 2690 -9475
5739 -9475 15030 35478 16780 21638 -22415 -50742 -50049 -31252 6094 12302 -459 -1811 20777
5726 20777 26036 -38856 -95015 -80313 -62882 -46621 11153 32332 11551 41021 66509 68382
5714 68382 56492 21377 -2691 -11841 -27399 -35441 -32997 -30268 -48442 -44799 -5161 -20895 -18135
5701 -18135 12656 43503 11566 -28492 -48093 -34040 6158 28810 37787 66016 49499 49134
5689 49134 32500 28970 30676 40685 14075 -4549 29441 32884 32844 49887 21804 10709 3837
5676 3837 15481 36460 61596 42092 18478 47797 22839 -29890 -41981 -42313 -41568 2004 8714
5663 8714 24845 -6718 -25338 -26570 -25823 -14472 -15256 -9050 2078 30994 35598 15250 28226
5650 28226 33277 -7244 4498 15476 11475 26537 73400 39457 8937 14680 14367 24555 37773
5637 37773 14869 -6880 -23550 -32583 -29951 -12391 8906 11572 -15762 -25343 -57735 -86157 -76513
5624 -76513 -44093 -16087 -13879 -87358 -111510 -96807 -97128 -83297 -71653 -79418 -82526 -66385 -35914
5611 -35914 -81074 -82792 -57565 -61755 -81665 -74785 -56192 -48604 -33600 -22318 -6692 -22052 -6399
5598 -6399 -19658 -4441 5474 -6552 -7342 -37093 -40921 4099 27317 8796 -36189 -59077 -74774
5585 -74774 -21616 27349 44385 64387 57880 40730 33176 45164 59965 43959 20465 5565
5573 5565 -7565 11686 10142 -43646 -15875 -27095 -72317 -67063 -5694 -3399 -25566 -15738 -6649
5560 -6649 22954 2533 5982 38742 39395 -9656 -41621 -23994 -14860 3858 -1708 -20695 -52297
5547 -52297 -29476 -11082 17368 17099 17815 6452 -7054 -3085 -9998 -30553 -41770 -39207 -30443
5534 -30443 -32785 -27533 -37033 -32006 -1536 -9649 -1760 4150 1931 17186 26943 8884 -15216 19257
5520 19257 -3287 -12862 21615 16205 -31406 -35774 -8901 -7555 8573 -4554 -15601 -25588 -29245
5507 -29245 -30859 -67475 -55007 -47111 -15891 -1163 6530 -19791 -48963 -38946 -31273 -14542 8322
5494 8322 23582 22235 33796 41840 57054 37002 10667 11272 8199 -5885 -12209 2828 -28731
5481 -28731 -59578 -35955 -58678 -59290 -47250 -39438 -25978 -23195 19024 -6798 -16238 15290 -6262
5468 -6262 -39754 -52010 -19025 3395 11409 -9011 -9437 8565 -13057 -37955 -26214 -26397 2106
5455 2106 -26473 -23919 -6052 16692 38979 47591 16831 -22061 -17226 1967 -19423 -6752 -10753
5442 -10753 -15867 -23313 -58906 -64621 -51569 -59530 -46643 -54515 -16949 -61185 -87729 -90902 -38928
5429 -38928 -12855 47559 23445 -57156 -63867 -57490 -82566 -103748 -62922 -3513 -583 -8317 -6538
5416 -6538 417 8399 -22191 -20340 -44673 -93820 -84298 -26759 -14332 3006 39374 27618 10912
5403 10912 29220 8311 -32823 -45794 -69682 -58276 -44959 -38743 -38511 -43201 -46999 -21214 -22186
5390 -22186 -31083 -39117 -51398 -2212 51446 67226 50614 21196 26564 21508 -1906 -41228 -65122
5377 -65122 -87456 -76786 -72888 -15704 2408 -3132 -18994 -17039 16778 -22914 -46464 -54929 -52358
5364 -52358 -24274 1869 16109 7772 -456 -10276 -7168 -9912 -45921 -63209 -51806 -45235 -15736
5351 -15736 -33849 -44756 -53514 -72034 -65268 -28094 18761 4513 -43107 -40084 -27651 -16084
5339 -16084 2610 31439 -2870 -11027 -7256 -15037 -9740 -27214 -42721 -51656 -36410 9260 20685
5326 20685 4642 -28620 -38009 -70294 -62223 -62956 -27437 -8339 -42154 -67977 -57951 -58937 -52425
5313 -52425 -65007 -50160 290 29605 17153 -4974 -41608 -70670 -60364 -60646 -34088 32017
5301 32017 52468 11398 -5142 -2490 -4145 -26574 -36950 -32122 25439 5795 18678 -20959
5289 -20959 -42771 -13393 39794 -12756 -61216 -58441 -21998 16715 8528 -5311 -10518 -3800 -7858
5276 -7858 9188 40947 50683 55115 56391 63139 45148 -2574 -13687 -7552 -25209 -29889 -36906
5263 -36906 -17339 7596 22809 -4719 -7171 6327 -43074 -55693 -23738 -38858 -49150 -30758
5251 -30758 -2608 12932 3403 15990 10459 -1871 -16528 -21053 -40568 -40039 -28362 -21705 -44612
5238 -44612 -19054 4609 5418 4316 -25303 -10232 -13567 -23058 -27725 -60511 -57270 -51971 -36037
5225 -36037 -17535 -944 -14061 -40647 -54434 -43540 -50486 -54535 -52631 -63122 -22709 -40437
5213 -40437 -67690 -75944 -51982 -28786 6128 7520 9204 4748 -23491 -4621 19900 20852 6615
5200 6615 30857 29764 25056 34522 30507 34554 33205 -155 -28696 -15289 1066 -35495 -73118
5187 -73118 -40492 -4851 30648 38802 37509 32209 14748 15613 -10165 4278 -6067 -8008 -21200
5174 -21200 -44158 -35899 -41693 5314 3845 -28108 -60129 -56676 -52616 -51578 -71239 -41453 23028
5161 23028 3214 -14452 -39926 -52370 3263 42302 -9050 -30485 4397 7019 -15375 -36604
5149 -36604 -25520 -26373 -54018 -57589 -23210 -39912 -85966 -91338 -106109 -82696 -50963 -49006 -4887
5136 -4887 7414 -37396 -20734 -5727 -31822 -3794 -6971 -39265 -41472 2836 44296 30825
5124 30825 14617 -31206 -62279 -58900 -68751 -81569 -80194 -63659 -78593 -82631 -75984 -37035 -40221
5111 -40221 -39576 -31309 -24136 -46009 -54611 -18289 -37286 -55896 -56315 -60295 -44715 -37274 -22492 -31111
5097 -31111 -35815 2661 24691 -19357 -26189 -31892 -31075 -8656 23538 -2857 -17231 -32437 -37270
5084 -37270 -33716 -44355 -24994 -3803 16473 20396 3985 -20188 -21588 -23807 -24515 -5678 33819
5071 33819 44623 29992 14391 14530 -43607 -61262 -10420 -20757 -51402 -39410 -25984 -48297
5059 -48297 -69644 -79529 -72454 -66733 -59509 -99423 -77012 -59558 -71068 -26907 8606 -15167 -9809
5046 -9809 6387 4835 -7062 -34352 -21561 4949 4724 24377 38029 27414 -2182 -9578 -31366
5033 -31366 -58908 -27852 2786 -26310 -23717 -935 -19618 -20157 8000 38217 22731 4642
5021 4642 -11591 45001 72727 117459 90121 59297 34259 -16280 -40149 -70053 -80433 -91223
5009 -91223 -59310 -37831 -35253 -19215 -10426 -1520 3026 16883 49671 88152 58997 49860 38815
4996 38815 47213 71556 36228 10805 12068 -970 -2958 14382 24761 26738 5048 -13855 -27680
4983 -27680 -17270 -934 17823 43784 27673 -6508 -18543 402 -32240 -35016 -29785 -49359
4971 -49359 -37426 -50871 -45863 -6469 -13754 11424 -13912 -12717 -19742 -47001 -55723 -54014 -21250
4958 -21250 -28869 -29106 -22129 -19949 -11633 -40504 -39823 -274 2722 -29556 -42793 -63649 -33785 -12932
4944 -12932 2969 -2394 32729 5050 -16366 -15667 -31968 -84236 -86054 -69960 -55891 -10566 19057
4931 19057 -1508 -12819 17917 14566 5414 -8801 10403 31024 26308 32049 26865 2165 -7616
4918 -7616 17162 17144 -8428 -7081 -15455 -2213 25277 43266 46736 49027 22511 -5677 -2238 22797
4904 22797 26043 27129 26372 4444 -1597 23820 14734 -6406 -16905 -13074 12931 27140 -20977
4891 -20977 -63873 -35392 -21007 -39880 -67919 -52528 -44395 -34555 4419 24842 -3321 -66308
4879 -66308 -42490 16689 15719 724 11938 19207 29413 24358 15578 8861 3038 25560 15135
4866 15135 -49 -7315 -29377 -26607 -25243 -34044 -7189 12895 -26767 -28321 -45396 -37331 -19023
4853 -19023 23033 -2033 -46056 -47198 -34236 -65507 -54219 -30567 -23353 -5127 49619 55439
4841 55439 50765 8613 -5628 10081 3703 8266 12993 24313 12917 21828 21602 4733 -433
4828 -433 -439 -35142 -79569 -53314 -23210 -34178 -30380 -36384 -33927 -52503 -33654 -15393 -35761 -50604
4814 -50604 -45526 -61098 -78555 -44768 -2099 -7581 16751 19639 5766 -12005 -30620 -28343 -6240
4801 -6240 -32979 -52403 -30327 9088 12809 14280 -2753 -28859 -53173 -69691 -69257 -11701 6258
4788 6258 -1697 -6110 -36059 -73342 -99964 -97918 -59302 -27476 -31993 -26199 6899 8037 -52175
4775 -52175 -102444 -81457 -66600 -62626 -92930 -76378 -82733 -66021 -77130 -16418 3707 -13527
4763 -13527 -1360 8369 3858 -12211 -55880 -79451 -77420 -39363 -15956 4772 -4229 1056 19479
4750 19479 -2794 13343 10820 10345 -9830 1213 15904 -8838 -37985 -19924 -56258 -81454
4738 -81454 -74461 -55713 -55829 -67380 -72607 -67597 -56819 -41217 -61393 -45204 -1079 32074 38750
4725 38750 43878 14303 -7523 -8941 -1840 -26377 -48450 -59751 -77227 -96249 -44672 -26254
4713 -26254 -29526 -38766 -36679 -38311 -12944 37457 45657 29546 6376 -20455 -6880 8316 -22605
4700 -22605 -19075 -6929 -34351 -60107 -57966 -73299 -60638 -34670 -52000 -80420 -47876 -39017
4688 -39017 -55632 -71844 -85186 -58128 -23986 1464 -14831 -29983 -8320 -7756 16757 -5358
4676 -5358 3682 3389 47427 55993 18809 -38188 -76913 -46842 1311 5051 -39928 -71560 -58342
4663 -58342 -40386 -34911 -56571 -75195 -45881 828 -7774 -50635 -64899 -78969 -51406 -29778
4651 -29778 -29670 1530 24895 17813 -13391 -41066 -58472 -23691 9806 10284 8702 20197 15542
4638 15542 32496 12455 -18162 -21657 -28503 -52649 -44564 -41649 -17984 8681 27789 19786 -838
4625 -838 -23335 -45008 -15684 -12091 -34484 -19730 -39922 -39187 -6139 -10208 -42206 -72451 -86953
4612 -86953 -83855 -31532 -28717 -26112 -30265 -39161 -37857 -24713 -20825 -27849 -402 -6165 395 10090
4598 10090 -22260 -23191 15796 1413 -36339 -57063 -27872 -4645 -22099 -31156 -43971 -51306 -36349
4585 -36349 -42341 -62946 -49127 -10697 -37011 -68518 -41169 5577 1295 17654 52546 12633
4573 12633 -32980 -58954 -64556 -68688 -50771 -17447 -25126 -23350 -28106 -17669 4252 10272 -20277
4560 -20277 29379 61223 81064 112484 110442 64215 17065 -5571 10770 -10155 -13837 -4409
4548 -4409 -3570 811 -5156 -5452 19793 12609 13055 4489 36009 39145 21773 14221 8062 30121 -204
4533 -204 -17062 -8583 -18688 23976 67068 48058 -3945 -1532 -4337 4508 13543 664 -3260
4520 -3260 -26117 -31350 -42703 -5213 -38977 -39912 -22542 -23874 -28922 -25965 -52012 -24411 -59033
4507 -59033 -44089 -29492 -22832 -10626 6750 -16027 -16406 -19393 -56059 -89191 -79054 -71368 -20134
4494 -20134 6975 -33783 -45127 -49089 -45514 -41984 -58915 -43662 -14148 -50795 -75167 -44728
4482 -44728 -58673 -28108 8799 -49187 -47964 -31607 -21264 -8515 -40031 -29167 2095 -22238
4470 -22238 -44080 3289 -7836 -9786 -8574 -18357 -4706 -40066 -2057 18122 -16191 -11646 -20539
4457 -20539 -9405 -7295 -20257 -21577 -7661 39517 56337 60960 34821 36769 16348 -24591 -24989
4444 -24989 -69435 -45523 -5787 -5394 -27583 -46445 -49503 -57400 -29349 1537 17293 -29595 -63501
4431 -63501 -54604 -62246 -58823 -48946 -43079 -35356 -11244 -853 -31575 -55507 -34242 -21574 -555
4418 -555 -18986 -18850 -17479 -23903 -1103 42643 46855 45091 38724 8790 -17681 27767 63157 78292
4404 78292 59639 13970 3018 18480 29119 48719 48593 -2209 -19569 39377 51169 20079
4392 20079 -33088 -60715 -67918 -18225 11281 9778 27377 28098 31272 26456 -10605 -2579 -14712
4379 -14712 -31277 -14785 -10921 -6599 9010 -6030 -33931 -1015 17943 11797 16672 3862 8536
4366 8536 816 -23831 -29887 -973 23087 17830 29035 19478 -61781 -115272 -53156 -42649 -60153
4353 -60153 -40512 -58826 -75018 -58696 -46874 -36912 -11275 -5780 26690 41923 13758 -44923
4341 -44923 -68419 -75858 -68411 -63367 -62605 -31135 -9757 -7945 -25883 -31261 -31785 -32106 -14466 -20068
4327 -20068 -73870 -70179 -26980 14033 17148 -26949 -24788 -14566 12960 20281 -16465 -44496 -30729
4314 -30729 -48662 -61547 -52872 -29825 -33743 -34698 -34400 -32635 -42309 -60971 -54430 -1922 59834 60923
4300 60923 24566 11604 12312 18633 51334 58734 59036 26552 24122 15991 14901 29026 -354 -8907
4286 -8907 -243 10414 32984 17473 -7174 -30312 -40802 -75212 -91416 -77651 -52164 -46141
4274 -46141 -55716 -38227 -30967 -10826 -42743 -48140 -28212 7214 18483 -13559 -13970 -30335 -32360
4261 -32360 -35330 -742 -4168 6916 15147 26936 13069 26826 8220 -36060 -65054 -44929
4249 -44929 -40905 -19035 -11731 -25368 -378 -16019 -31919 -67325 -66082 -57677 -38302 -35880 -43272
4236 -43272 -49559 -49864 -23574 -35200 -42446 -40771 -42042 -51572 -50907 -4988 11487 -2264 -7312 25107
4222 25107 8565 -34274 -35812 -25580 -34554 -4699 22282 -7495 -48638 -65545 -59880 -80226
4210 -80226 -80367 -71356 -90019 -58001 16775 58526 26563 5831 -6080 -27936 -18243 10523 -14753
4197 -14753 -48555 -42678 -26454 -6425 -45263 -82742 -38479 -38877 -53611 -41571 -2840 11191
4185 11191 8655 -24709 -38370 -45279 -14608 -644 -44382 -65210 -42810 -46742 -44118 -13123 -5231
4172 -5231 -15116 27178 16978 -12430 -19654 -53029 -54253 -39297 -16244 -36784 -37626 -19764 -28791
4159 -28791 -18781 4867 -20712 -11279 16012 36742 31006 -4738 -26491 -38442 -24402 -11792
4147 -11792 -12416 -10576 8973 4314 12051 -2081 31278 4325 -16020 -21236 -36650 -52710 -39784
4134 -39784 -21074 29749 51569 4476 -1752 10071 3847 -1170 -23334 17706 475 -11406
4122 -11406 45096 61155 31081 1875 15357 -6459 -34081 -49940 -30649 -14442 -14014 27342
4110 27342 26436 17148 15401 1596 -7910 -23491 -30975 -56756 -62367 -20415 -19169 -6952 -20843
4097 -20843 -56445 -57167 -39665 5922 -8306 -28407 -18626 -29761 -43401 -32845 -7219 -9917 -6963
4084 -6963 3297 3220 -51022 -32181 20336 32202 29938 -7851 -26046 -23026 6005 18313 3915
4071 3915 -21256 -46564 -49059 -28951 -12980 15460 26169 2620 -4705 10312 -10344 -12461 -1459
4058 -1459 -37919 -63559 -66661 -26312 -20877 -38382 -33816 11622 15496 7771 -15007 -12421 12672
4045 12672 8089 -18108 -33074 -48038 -8851 9355 18854 1267 -9565 -61743 -65104 -46943
4033 -46943 -63947 -40076 15136 50512 62443 68074 53151 6622 -10122 13563 12671 663
4021 663 -21207 -9071 3994 12909 48196 62671 9015 -14048 -22464 -17003 7161 1973 -34220
4008 -34220 -29129 -7139 -1614 28089 43895 6304 -52913 -38049 -50443 -58768 -45306 -49194 -46664
3995 -46664 -49273 -56515 -39342 -47080 -93511 -66803 -60279 -31419 -17978 -32346 -47499 -52368 -43677
3982 -43677 -39892 -38569 -44757 -52493 -59599 -47004 -34053 -23974 -22593 -41837 -26090 -7264 -25839
3969 -25839 -12879 -18612 -15471 -35382 -24758 -18295 8839 2117 142 21394 12680 -28101 -70904
3956 -70904 -63141 1513 44609 28504 6605 -5951 -33371 -13045 24894 -17059 -53039 -50301
3944 -50301 -48699 -30847 -18808 -28663 -26237 -48684 -51798 4233 15264 -5368 3277 5011 14552
3931 14552 16340 33555 -3299 884 9392 -11633 -46656 -6874 -3297 -17951 -14252 -12822 -26601
3918 -26601 -26789 5418 -11935 -6860 6332 -27810 -24802 886 -11280 -6951 5014 -40223 -43643
3905 -43643 -59353 -37712 -2591 18409 17610 20599 -9014 12326 8149 -24113 -49415 -58250 -60081
3892 -60081 -55812 -62879 -41891 -18405 -17500 -20525 19084 50625 64524 52100 29182 15510 -4607
3879 -4607 -49393 -59682 -53565 -35544 -10159 -14625 -38062 -34022 -8021 18660 15323 -3511 2253
3866 2253 9140 36515 36251 5296 -60158 -101445 -32722 6075 -13164 -15027 -7593 5644 3070
3853 3070 -6151 15233 35431 489 6391 -17356 -43270 -37689 -22820 18187 16069 -5863 -35960
3840 -35960 -27323 -10261 -8047 -35848 -27643 -34603 -42714 -54860 -35738 -20160 -15028 -40875 -47787
3827 -47787 -63283 -29397 -28251 -38069 -43389 -47960 -32754 -41445 -23144 -6101 16252 12548 20770
3814 20770 10654 12941 -972 21311 44137 53310 -18932 -50772 -17593 4247 22204 20229
3802 20229 2122 12690 -5883 -40745 -16407 -1360 7921 21710 48157 30158 39490 29662
3790 29662 11203 24105 -10094 -56295 -43809 -14579 -3781 -37493 -5890 1824 203 15012
3778 15012 -2457 -6525 10677 9805 3000 3730 4880 -20267 -35362 -12628 17315 -5989 -6277 19200
3764 19200 -47315 -65135 -47420 -23746 -3992 18580 -447 -28153 -36998 -9710 -20574 -44691
3752 -44691 -47017 -35950 -37584 -7182 3709 1439 -18342 -18923 -24368 -1677 25915 -7136 -73198
3739 -73198 -112852 -70485 -15382 -24403 -25669 3616 47948 13013 -9862 -34614 -56744 -43425
3727 -43425 -31242 -3240 1819 29471 30671 7315 -1234 11131 44957 46147 22958 28302 18459
3714 18459 22822 36274 22227 -18017 6287 25396 -24844 -36224 11981 -6655 -19196 4602
3702 4602 21111 -30447 -50277 -4358 23056 42595 49086 37980 14066 -18317 -24204 4069
3690 4069 -26264 -58943 -30183 -29613 -32012 -47513 -48510 -35019 -27632 -31883 -12233 -9190 -36070 -24995
3676 -24995 -21193 -24155 -49264 -34869 -26014 -33742 -49388 -45824 -34928 -53591 -57842 -51491 -76641
3663 -76641 -66744 -61028 -11214 -10366 -30984 6015 1915 12319 47910 54353 10574 15182 15249 -5331
3649 -5331 -25540 -44149 -73160 -87346 -60814 -14932 44349 42603 33791 -7368 -13619 -7315 -16794
3636 -16794 -19742 -43447 -43099 25957 66523 27454 -22665 -28801 16314 12728 -2692 -2187 -21423
3623 -21423 -62436 -49157 7851 -13258 -21088 14806 24190 40735 52230 23056 17389 40503
3611 40503 17016 -31080 -71634 -92475 -59101 -35585 -28656 -24138 -1437 24865 29223 39662
3599 39662 20481 -12354 4559 1900 10130 20106 23451 21812 31891 54007 26594 -818 -5861
3586 -5861 -23147 -30769 -23678 15900 28364 2609 -44752 -36468 -38937 -53309 -34670 -31117 -13470
3573 -13470 -23733 -53369 -33464 14491 38245 34563 33500 13189 -25498 -15575 -24073 -26905 -3991
3560 -3991 -35809 -43471 -24662 -27642 -9219 15644 27965 24628 -9108 -5630 447 12540 16780
3547 16780 13502 -25821 -41917 -60251 -16938 20764 12612 759 -27600 1485 5682 507 -26301
3534 -26301 -34341 -24626 -3866 10993 50003 40506 -24899 -65623 -35275 -42775 -57541 -37933 -39742
3521 -39742 -10051 -9636 -17380 -42130 -33429 -16001 -2199 -5850 23640 33707 45531 33304 49260
3508 49260 54004 38041 32431 23412 -6497 -74048 -72527 2198 25229 20538 17434 2808 -12621
3495 -12621 -10067 2689 -2861 -49606 -25878 -864 31378 21627 29839 15684 23375 44970 17977
3482 17977 -10944 -31562 -24407 -45552 -50309 -39593 -11677 -1134 5999 15901 11951 9074 2727
3469 2727 28472 20106 -5028 -40223 -68085 -42269 -4446 -18516 21055 52345 59024 34320
3457 34320 31448 9099 -36872 -45452 -30577 -18957 12307 42750 47027 72249 69693 28762 20603
3444 20603 31436 761 -3824 604 14136 10583 21367 42102 88694 62171 16190 877
3432 877 16173 -24996 8088 47445 37211 27281 6545 -14648 -13791 25698 34903 -7812 -59463
3419 -59463 -58167 -32761 -16437 -44894 -76268 -88155 -78624 -67679 -32167 2901 20291 -3026
3407 -3026 -39286 -34305 -83 -8541 -30748 -6253 26517 41384 22711 21272 53930 43048 11665
3394 11665 3466 77 6991 -1442 -2177 13073 -20069 -16162 -28831 -26947 7521 11824 -5009 -33726
3380 -33726 -51183 -38203 -28687 -30404 -19635 -10892 36447 24766 -6008 -26803 -28447 -47279 -53088
3367 -53088 -36323 -8778 -23507 -46103 -27485 -16327 -3002 -33945 -41028 -45887 -60642 -56772
3355 -56772 -65246 -74190 -60609 -46227 -12591 23096 27927 -8619 3423 -14662 -42443 -18458
3343 -18458 8175 -29089 -24102 -20243 -21711 -19756 -5907 -20694 -36422 -21525 -25884 -24776 -61852
3330 -61852 -42648 -32472 -43226 -36374 -52316 -20466 10796 15755 -3078 -37558 -81129 -88946
3318 -88946 -68356 -59177 -40720 -32866 -29012 -12014 17412 21503 32321 24982 26661 46601 41213
3305 41213 31059 36216 35790 -1715 31 33770 8788 -19413 -22186 -7098 -8482 -20997 2421
3292 2421 36547 9740 -46436 -47803 -55458 -43476 6618 -28302 -67454 -64987 -27124 -36227 4276
3279 4276 -15220 -43931 -25510 18029 1469 36966 24212 3548 16208 -14161 -5264 -4511 -22198
3266 -22198 -29717 -9300 -5392 -9817 -28570 -24755 19896 8251 9613 34713 52793 43452 -13705
3253 -13705 -12653 7051 -39046 -63725 -18971 -26302 -51934 11150 29463 -8310 -17982 -16809 -14213
3240 -14213 701 29707 15132 -14794 -30267 -26069 -31714 -60631 -60421 -39001 -19344 -53212 -79200
3227 -79200 -77741 -47688 -42335 -66767 -52894 -70885 -77909 -33227 -36992 -30411 -3549 5942 -27270
3214 -27270 -44686 -31249 -10026 3832 9606 1943 -13217 -7931 27991 11574 -23254 17328
3202 17328 11412 -29949 -11037 7269 20229 54255 26723 19392 56381 43681 8322 -48301
3190 -48301 -86041 -45363 -15539 -8412 -28284 -1483 33557 -18267 -22880 -30057 -37135 -41673 -36830
3177 -36830 -26974 -29471 -39743 -28305 -15734 -28120 -18113 17356 5913 -34638 -39605 -45837 -66243
3164 -66243 -79904 -54658 -28683 -42668 -78443 -64719 -75775 -56543 -10737 -21467 -18443 6370
3152 6370 49025 46170 18027 4105 6843 -6073 -12348 -8794 -15497 -48263 -26192 -10426 -6238
3139 -6238 -12187 -26899 -8850 14198 26853 11447 -26038 -9468 43721 22655 3879 34134
3127 34134 39665 31574 30625 51495 2454 -17100 -31411 -32812 -34434 -60775 -37157 8328 36576
3114 36576 41533 38618 13213 -14873 2264 26423 52959 53010 59795 31170 34748 67533 64289
3101 64289 40616 7842 -12985 -24805 -12126 -11398 -8076 14964 24868 27661 15788 22250 33150
3088 33150 35574 -8349 -36425 -37671 -42235 -41816 -5885 -5184 12591 11415 -4256 -37575 -74599
3075 -74599 -39328 11324 -4203 -28770 -44059 -51899 -11688 25792 63760 18476 -57860 -77770
3063 -77770 -28155 30212 29254 24562 29109 39622 39810 29350 4038 12297 21488 7198 -6026
3050 -6026 -2881 3102 -19778 -38846 -28220 -18700 1020 28803 17819 -19547 -25296 -20791 -39843
3037 -39843 -39667 10986 22105 9454 -28971 2686 -6066 -33186 -40775 -37190 -53412 -53006 -20429
3024 -20429 -45717 -34830 -3037 -294 29402 46537 70619 41547 27232 9879 2799 -8103
3012 -8103 -33499 -51647 -68974 -44135 757 22398 40176 47951 79005 36510 27381 44308
3000 44308 26181 18128 26322 -756 8951 72415 67581 46777 51436 66457 6790 -20503 -9813
2987 -9813 -13155 -1899 3005 3452 18898 29660 15772 8096 28932 54228 56187 59657 43696
2974 43696 7234 -21972 -23249 -2540 11924 28731 5420 13353 32724 37188 47801 30147
2962 30147 -25713 -37817 423 -14882 -67228 -57183 -32709 -34409 -39458 -63236 -33665 -10095
2950 -10095 -26108 -34209 -1385 5478 -3603 -24352 -68284 -55585 -21074 -16410 -13685 -54496 -53526
2937 -53526 -41757 -34607 -36162 -36477 -26691 -7745 -662 14891 432 -7600 -25127 -8652 2636
2924 2636 39235 56470 46211 24386 22125 33730 29805 9569 -13906 -19211 -20172 -44530 -56808
2911 -56808 -55198 -21548 2051 17468 4032 -43215 -62743 -54280 -42879 -10581 23798 9150
2899 9150 8761 -1408 -20624 -8155 18745 31095 17630 29588 54351 57452 9475 -18387 -32737
2886 -32737 -28036 10160 17933 -4672 -7905 -56530 -40719 -6815 -25792 -35823 -10335 -6883 -48831
2873 -48831 -86677 -47771 -56191 -29677 -6770 -22013 -36783 -49532 -63169 -32913 -19191 -8434
2861 -8434 10046 29841 74086 84951 -1797 -2315 13191 -3391 -23840 -35608 -32548 4399 37353
2848 37353 2291 -452 -10552 -37277 -51721 -34529 5037 4486 -21151 -79539 -66566 7916
2836 7916 -15238 -37563 -21786 -14641 -39749 -73964 -77550 -65423 -64634 -14329 -13098 -50454 -78136
2823 -78136 -93005 -46004 -57553 -91181 -60100 -24425 -30922 -19472 -11721 4393 2372 -17939
2811 -17939 -1547 17200 -10693 -28720 -23068 -46201 -44888 -46474 -52547 -39697 -636 66331 40304
2798 40304 1353 -717 244 9364 7694 -18268 -19126 19307 57285 41803 45457 33728 9458
2785 9458 8153 25297 16535 10097 -20186 -26357 861 -18782 -41344 -43301 -62251 -42458 -16220
2772 -16220 -39289 -51832 -59681 -70781 -44431 -18745 -15066 -9044 28094 76390 91165 54320
2760 54320 36142 22231 8464 8129 44873 61982 57516 56586 16456 26130 11985 9489 17488
2747 17488 13186 4273 7769 19441 1776 2144 -2216 -3390 2850 9465 33351 35310 3771 313
2733 313 20010 11033 23326 63651 25194 -13271 4621 3731 95 17378 -7206 -32950 -24687
2720 -24687 -1957 12139 -1621 36545 -10406 -61932 -58198 -24173 -33581 -57918 -18690 -5473
2708 -5473 -16399 -19115 -36521 -33245 -9353 -20831 -1626 7289 10792 2402 9708 -2145 -12996
2695 -12996 -41356 -41670 3059 13748 27067 64120 84755 97724 80703 43123 34014 13405
2683 13405 -3793 -17986 -9583 -8198 -24390 -29277 -46154 -2355 13743 22759 48016 56806 64766
2670 64766 12487 -17644 -1132 8249 37296 17971 -20155 -11541 -16714 -28133 -7112 -25256
2658 -25256 -27885 3123 22864 18780 10804 2360 6004 15150 41112 49330 34888 -22259 -56250
2645 -56250 -89725 -81095 -37139 -25344 -4094 21614 30456 21667 27395 48772 42510 -13272 -34561
2632 -34561 -7500 18438 30307 53543 73228 87452 61994 39890 29069 33996 44277 31069
2620 31069 21856 36043 36461 -505 6424 14729 11150 -5280 -26395 -3074 58163 63395 45914
2607 45914 21978 15119 -6473 -30902 -54672 -42823 -23442 -7474 -11274 -47352 -3273 -8207
2595 -8207 -12957 -22457 -17830 -31271 -48280 -56226 -54208 -70569 -70422 -80347 -53933 -4917 10526 -1265
2581 -1265 12257 6000 -19863 -1535 -39928 -18548 5192 58623 67199 34251 -25890 -60947
2569 -60947 -62129 -54313 -31115 7397 4178 3686 -35503 -22820 -22182 4929 -6473 -229 -17765
2556 -17765 -46747 -50512 -39199 -23471 -11600 -14813 20199 24986 27304 37080 24339 -14565 -8298
2543 -8298 3459 -3737 -24676 -30257 -23393 -8151 10333 11113 11093 23691 -14981 -46227 -60170 -72856
2529 -72856 -75474 -77287 -13923 14865 29303 46150 13355 18048 5066 2625 15959 16611 5223
2516 5223 -3795 -34715 -51753 -23907 29846 62324 73846 72819 70437 30779 8305 -10002 -2618
2503 -2618 18154 40123 41283 4481 2554 42539 73660 101100 97006 71059 48788 26861 -14936
2490 -14936 -67709 -27850 25855 50707 13822 16976 35827 31563 15659 -20031 -41455 -35778
2478 -35778 -11796 5919 3089 -25150 -31306 -10423 -6419 -5248 10587 53946 83064 57853 25936
2465 25936 43670 40250 33886 28090 3269 -9611 -9459 -24169 -34792 -25583 -4287 -9698 -39780
2452 -39780 -49726 -25094 -9720 -13976 -29882 -35285 -9355 1386 -19561 -32933 -27268 -1442 -15541
2439 -15541 -26361 -68734 -58656 -9243 7094 19737 4770 33626 24114 -12321 20192 59364
2427 59364 58795 48646 46422 19775 -3841 -18295 16191 19851 32956 23689 38320 37921 42056
2414 42056 44509 20129 34934 40251 34313 16064 -761 -29841 -26665 23934 55827 71314 62840
2401 62840 69997 52844 31991 25773 46330 37869 19487 32661 34685 66251 27944 -19827 -18414
2388 -18414 -13943 24632 49958 50475 56108 56323 31495 3643 27152 -1399 -27787 -18637 -21809
2375 -21809 17197 41180 41778 36781 26999 31018 32174 38529 72894 71261 45646 -1448 -51548
2362 -51548 -47287 -10534 6879 12892 8145 1087 8476 17801 -13654 -12093 -3943 17399 4970
2349 4970 7575 9326 -6179 -14800 3063 -10679 -37964 -58699 -41362 -1617 20938 6176 -1739
2336 -1739 4780 16423 45726 32629 26887 34331 33983 30602 58652 74391 62361 14777 -14730
2323 -14730 -9650 -44243 -48101 -50145 -24923 -27884 -35669 -57287 -25890 -15447 -24016 -34656 -16484
2310 -16484 -8382 -17696 -5212 -30881 -34330 -31731 3785 12689 41118 29893 13995 5966 -24333
2297 -24333 -14689 -4603 5203 -10534 -6578 21614 16532 14640 -1529 -10823 -806 -22952 -14016
2284 -14016 2868 -5236 -2498 -6281 20247 20631 21273 5475 -7715 -11136 6891 3347 46121 61849
2270 61849 66864 64500 48326 29756 22398 8570 -9251 -22484 1118 15601 -6577 216 203
2257 203 -15233 -28462 -21123 39490 31890 14745 -18980 -1121 2903 -14428 -12212 -34797 -13201
2244 -13201 -1996 -19427 -9844 4708 -2229 -7989 -34315 -28464 -19847 -40193 -72546 -66366 -68032
2231 -68032 -82724 -89159 -70969 -38155 -10256 -26767 -65992 -36494 -1159 26333 24427 11869
2219 11869 21955 54922 59270 60270 53288 39316 17390 -6082 -27467 -9224 -6804 -11189 13018
2206 13018 -3505 -24128 -42211 -19881 -15623 -23224 -37113 -22094 -18085 -26157 20985 18072 6563
2193 6563 37266 11882 15506 25267 8005 12524 66267 35853 9531 -18726 -23720 -2915 -6586
2180 -6586 -23582 -37494 -65634 -60448 -52628 -37118 5663 37910 31710 -19218 -36426 -24467 13605
2167 13605 33090 -8027 -23057 16898 46809 47392 13960 -19339 -52673 -26600 28289 42684
2155 42684 33896 13881 -27143 -35317 11184 48088 33521 16318 25253 16962 28923 70813 53516
2142 53516 12979 11996 -19109 -39693 -64549 -53036 -46443 -40989 -21987 -38808 -2023 -353 5062
2129 5062 16620 33329 -740 -36683 -33652 -24725 -24966 -2070 -26261 -42426 -67222 -73353 -74000
2116 -74000 -49740 -8933 -12519 -22418 -18569 -28417 -11169 27863 -6211 -13326 -24307 -56747 -45389
2103 -45389 -44254 -8449 909 -3045 16268 32194 -8608 -32513 -35793 -17188 15673 2161 5436
2090 5436 -35410 -45695 -16003 16332 251 7001 -15403 -35275 -44664 -71324 -87931 -88527 -44894
2077 -44894 -22559 -26677 -23595 -13273 -28129 -21699 -13520 523 48456 35741 4707 -23540 -46992
2064 -46992 -32241 -21 -22324 -57536 -19926 35728 3106 -37594 -41213 -42350 -41410 -19393 -1354
2051 -1354 -40417 -79573 -70554 -25289 30000 44760 73619 55610 2680 -1471 19076 17180 -9363
2038 -9363 -32410 -42177 9685 30670 -10896 1475 7875 -20531 14038 18129 33102 25458 11375
2025 11375 16466 42452 11193 -18479 16185 6702 -35583 -65193 -50352 -28785 -13882 -2198
2013 -2198 8330 8307 29358 59436 56073 45192 26224 -8880 -14033 -2017 37791 55386 112507
2000 112507 97863 43768 8142 979 -29813 -12885 -6779 60300 61270 15680 12900 31712 50326
1987 50326 20911 -19236 -17324 19436 32698 44484 28368 -2475 -21498 -22868 -12666 313
1975 313 -26132 -58002 -48091 -49729 -28936 -22498 -16580 -16002 -18439 -7406 -25921 -23037 -20885 -34773
1961 -34773 -46644 -42583 -24011 -27789 -29001 -27663 -8920 -14168 -23587 4175 0 15849 9499
1948 9499 18588 22548 4468 -18049 -43845 -51466 -21882 12804 26975 20594 -11901 -17720 23842
1935 23842 41558 39140 16811 -31870 -38604 -25080 -8144 16591 18281 27808 27609 25093 38245
1922 38245 -10876 -53768 -37579 -42265 -32518 -9242 43095 23582 -3301 -25122 -11466 -28130
1910 -28130 4395 64957 36248 27500 46546 55708 46058 33419 54386 19310 -15626 -4884
1898 -4884 27191 40401 78623 74630 46482 -13625 -27559 14808 22579 34776 5602 6498 15892
1885 15892 10230 -22590 -2953 10539 12286 7268 27562 20294 -12931 -16432 -16227 -18886 -3760
1872 -3760 34196 15628 -5334 -27047 -14519 4339 -625 4436 -7133 4380 20336 3236
1860 3236 6065 121 6053 20317 39353 22560 47762 61733 87600 66823 -1971 -36956 -26428
1847 -26428 -35733 -38376 -28129 -21098 -34287 -60823 -63175 -25781 -14529 1837 -26532 -35418 -68517
1834 -68517 -67193 -37223 -17459 -3837 8292 7994 6027 -19130 -24339 -49769 -55858 -22102 26790
1821 26790 39877 39564 -4929 -44072 -62561 6588 6404 10517 12363 -24538 -60742 -28930 13983
1808 13983 12537 -5254 -5615 -20812 -20033 35581 68317 65811 9429 -12123 2008 -10563 8626
1795 8626 -8113 -35091 -45502 -50487 -46745 -6709 -18118 -46194 -20109 -2173 -25831 -42492
1783 -42492 -11532 12828 -19308 -6573 -18041 -19545 17581 6575 -21072 11302 47488 71312
1771 71312 37459 -17050 -35637 -40874 -17097 -8334 25482 23943 12825 15218 13470 25452 6004
1758 6004 -39434 -25714 -1646 15099 -2855 24980 67153 93773 33418 22831 28994 2486
1746 2486 -23421 30754 24764 -8550 -44809 -33404 -39071 -27960 21873 36238 28928 47071 81307
1733 81307 71202 42100 -26838 -35357 22647 35342 38649 38280 42578 48877 42733 10368 -15012
1720 -15012 -18846 -33955 -47883 -15492 27810 79016 105050 48072 66209 78535 50789 32601
1708 32601 12673 -530 7475 49078 63149 44567 43706 69635 78899 75110 68633 42789 -1005
1695 -1005 13620 7478 -28831 -38429 10328 22903 39174 55362 31061 -5737 22819 25648 8312
1682 8312 -12735 -32774 -36598 -48083 -57190 -49758 -7767 -281 7245 51435 55449 31418 -215
1669 -215 57171 82041 44141 41267 29759 -12630 -32580 -4600 21739 36744 25211 81781
1657 81781 74264 14090 -2431 766 9314 25305 -1847 -13038 -15169 7612 34704 58041 70507
1644 70507 34229 19998 -511 -3941 3822 11882 1049 14652 -14136 -40560 -42690 -40121 -32165
1631 -32165 28200 66041 54815 67285 92382 100962 35528 -4143 -23205 -17649 -31309 3360
1619 3360 -3894 21869 30631 17958 -15333 -44956 -16386 -16017 -31017 -33218 -19113 -20952 -8708
1606 -8708 21356 39108 19702 -13733 -13805 -18670 -31408 -48023 -29211 13364 10995 4767 2321
1593 2321 -34200 -21795 10579 29792 18270 14972 37790 30497 -10017 -15059 10615 22720 14265
1580 14265 31785 37465 3340 48007 42232 19698 31423 7762 18242 41295 61850 24851
1568 24851 -17141 -15532 -23786 12716 30549 -6334 -34868 -37236 -19996 -14995 -17858 -26685 -16924
1555 -16924 -1349 -2766 8404 28587 15872 20386 32909 31713 68889 68802 25654 10706 1471
1542 1471 -6752 -21102 -36360 -22940 22326 25638 4366 -524 38813 66033 55702 59784 71093
1529 71093 66311 70844 53160 25079 12033 23557 47900 56657 79860 47736 16196 25438 22646
1516 22646 8958 2972 33751 83788 62081 26804 32388 17778 -20749 -4463 27480 42814
1504 42814 33566 -8795 -5926 23611 14024 7925 20076 1219 -12104 -14115 30420 45824 15202
1491 15202 -2954 244 -27883 -59182 -40950 -16454 -7476 -38538 -37727 -41740 -39729 -27090 -27899
1478 -27899 11497 28882 23957 20632 29617 23847 -3803 8583 -14473 -32975 -25477 14786 18434
1465 18434 33225 42940 25037 11191 -23584 -18508 -49610 -72771 -85076 -86254 -89001 -47148 -3453
1452 -3453 37044 21818 -16802 -2870 30532 21181 -16088 7793 23888 21680 -4009 27506
1440 27506 62359 34694 34953 49126 -8095 -29351 -16335 -27669 -47131 -12186 8893 26383
1428 26383 -6713 -1492 -17036 -39559 -60809 -36965 -22666 -28226 -29727 -30958 -29094 -3944 11127
1415 11127 10480 -14792 16601 72258 80991 65020 41439 -2406 5753 5262 736 -20060 -35265
1402 -35265 -16697 22940 36909 56801 27138 -11437 -44772 1151 5484 -48446 -30815 -39187
1390 -39187 -22803 3621 17455 31174 9462 2773 15512 31265 55488 39866 39820 58206 44248
1377 44248 36243 22562 20804 -9506 -36959 -68042 -68715 -15100 13990 42681 33509 54454 61780
1364 61780 21300 -10541 -2161 -2952 -36964 -28169 14778 11164 30756 23987 4995 13013 26458
1351 26458 71089 100032 30203 -8722 -3598 4650 25010 24035 40050 16458 6513 -11097 -18337
1338 -18337 -40245 -25549 2114 41903 37007 20221 29421 51345 31083 31608 38595 47117 36621
1325 36621 41211 22174 50670 36558 37681 44923 23991 -10890 -34778 -43573 -30111 18673 39705
1312 39705 27159 51322 61266 62509 79920 81154 81110 31765 8650 24401 63563 66467 52795
1299 52795 30989 -11235 -39886 -39794 -21356 16189 25255 -23396 -26891 12140 25199 44126 51292
1286 51292 29900 26901 61590 67284 40653 11298 22995 20308 19252 20270 868 26960 41235
1273 41235 41282 33739 35955 29977 11234 2314 18693 23679 15060 37939 30061 46697 61853 48603
1259 48603 64393 68475 75102 59139 14172 -15714 -1178 10767 33213 46772 44408 21658
1247 21658 -4278 -50563 -31342 -27852 -18691 14772 -2816 -5288 -9752 32565 54334 33490 17042
1234 17042 -8231 -24272 -12106 -49980 -39468 -5303 22840 11720 -24570 -17725 -34084 -34128 -10225
1221 -10225 15354 39214 56640 85250 70921 49686 87721 77113 51988 41957 16038 37272
1209 37272 55369 49679 18999 62374 34193 -25703 -26130 -13877 2513 33330 35471 32667 17335
1196 17335 8425 -10652 -15869 6689 28755 -7706 -19505 -13484 -8034 23021 72777 25360 -11017
1183 -11017 -27526 -24604 -15502 -31748 -40712 -35901 -40187 -28820 -19464 -11953 20256 50631 24466
1170 24466 18129 3554 4817 24515 29716 30127 44642 60291 61119 29373 14022 14509 19164 44058
1156 44058 16404 -10697 -1332 18848 7971 -9326 -6263 -5446 -6719 -10552 -1522 32201 51908
1143 51908 36399 27046 19367 5210 -21653 -2992 -2478 -3192 -9210 -65241 -70368 -50186 -12345
1130 -12345 28796 24848 17069 -951 12758 57292 78867 70125 26324 -1329 13018 -2529
1118 -2529 21584 21100 1112 28745 22742 -19366 -42372 -29472 -14814 -33264 -39830 -4300 -8537
1105 -8537 -20538 -28744 -46148 17063 34639 7364 -38713 -67641 -67426 -63270 -43371 -33177 -17339
1092 -17339 31163 40851 44504 17539 3453 51013 57287 15026 9371 17318 13952 13606 27421
1079 27421 -4194 -50818 -56327 -48078 -2336 27345 32310 98750 99855 61868 68883 80590 69366
1066 69366 33715 31505 54926 63316 33694 42066 47354 9863 12270 34979 8799 -4329 -26931
1053 -26931 -9038 20375 14894 30933 40473 3551 -6833 51724 62099 54283 62923 56210 56011
1040 56011 53121 48879 38561 53955 67137 51177 12732 5557 31597 25530 38560 36770 42421
1027 42421 20067 6521 4385 7785 29782 41396 62669 38968 15813 -1088 10976 28108
1015 28108 41245 22629 32115 27262 15441 23587 10352 5954 11948 23838 5846 40901 30309
1002 30309 27585 -4681 -29838 -1353 54327 58690 58844 49810 51676 60715 55271 56652 77561 59832
988 59832 23877 -12552 -23539 -13899 -3953 -17294 -34841 106 -702 20538 33082 21035 16768
975 16768 26053 502 15620 4914 -17662 -17015 4272 32866 32705 51450 47905 -16076 -18488
962 -18488 -37910 -64260 -42109 -9311 -21752 -1276 -9502 1050 14490 11641 43023 6088
950 6088 -23206 -20262 -34038 -14194 13277 25926 20285 26621 58145 82252 74869 31907 38884
937 38884 56169 16353 26789 14263 4523 -9705 -603 8047 17575 41288 56536 55593 42894
924 42894 31938 40263 38800 48100 64802 49240 43205 36131 24604 44547 55646 5939 -42405
911 -42405 -18675 921 -4577 7589 5593 -15243 -423 25805 47795 40477 72178 47779 12647
898 12647 -13121 -9588 -214 -740 15568 51116 65057 65126 58793 62879 69291 51523 32560 7291
884 7291 -12914 4416 37558 70734 98511 86910 67762 52793 27931 13006 23043 22774 23235
871 23235 40213 44355 7851 -12093 -30911 -7899 -36404 -50339 -20116 -4873 30671 49461
859 49461 42030 29316 16314 22658 47717 53295 31920 10222 17738 18247 24706 65485 103253
846 103253 89807 58711 42309 20625 -4908 15511 26344 34365 49893 63525 69944 59981
834 59981 37024 45660 66564 57134 29281 6408 -41794 -31844 5171 13082 -7911 -2967 -6133
821 -6133 -13113 -9535 1759 5429 6556 -13015 -7173 9461 7696 -28 8731 36548 -29270 -53516
807 -53516 -23167 -4472 43527 6082 -64525 -41470 -797 12123 33222 26999 21728 45973
795 45973 48364 19404 9786 -11965 -23736 -27419 -44055 -36977 -6977 14115 -9985 -13237 5390
782 5390 40727 63540 58849 4037 -3213 17197 46603 23621 -31174 -65202 -43644 -13935 7010
769 7010 -66 -10390 -789 -10916 -19845 -22171 -7694 15861 -2352 -63198 -73054 -41362 -19297
756 -19297 29026 5407 -6940 10171 9683 -30928 -32034 12 -4471 -24017 -40354 -16524 1671
743 1671 -19202 -18560 -40963 -55204 -48591 -31000 -18317 15943 47736 56807 18545 4178 5137
730 5137 -5339 -33918 -6912 53584 90493 61400 68241 92947 103571 108187 116724 80793 56017
717 56017 42254 85353 79997 55791 43059 5659 -20898 -6740 -40687 -41253 -41128 -39089 -52514
704 -52514 -55498 -35929 -18748 -45505 -79466 -70463 -60448 -41593 -32779 -24398 15326 35199 37733
691 37733 84756 82142 72454 18275 -8857 10093 29903 31344 4212 -4330 20813 36263 24941
678 24941 22219 12610 -7618 -1908 -8260 37065 70507 42574 -16159 -6758 25118 19222 -28716
665 -28716 -47985 -24730 -6609 -10663 27806 73541 73844 54452 30057 3330 -23488 -31576 -69188
652 -69188 -60757 -34633 8684 13817 -1686 -8014 -33735 -20143 -8228 30358 42667 65992 82687
639 82687 23925 4259 18453 29703 40689 41209 28935 5206 25509 25660 18624 5085 6713
626 6713 9391 39730 54938 40390 16204 23021 3690 -3361 31123 31769 21000 -19509 -36696
613 -36696 7589 398 -24104 -11133 -10261 -9212 -35338 -42324 -5678 31080 33037 17080 7675
600 7675 -7622 -51191 -50373 -38464 -41929 -6912 7240 -3853 -21833 -31543 -29147 11628 -24452
587 -24452 -43336 -2124 25723 26373 49044 54645 18407 -27270 -60686 -50194 -3673 -1198 16270
574 16270 21475 -15306 -77800 -93892 -61238 -34531 -39496 -16622 -13787 -46736 -4870 49023 61507
561 61507 54722 25644 20128 -16169 -42907 2117 19127 -12118 -58063 -27673 -4701 -52037
549 -52037 -61195 -82064 -85600 -68709 -66626 -47389 -45267 -45383 -68501 -57848 -18752 -39185 -43806
536 -43806 -1417 47649 53874 29718 31495 32144 -13673 -12653 32798 60551 55947 16272 56187
523 56187 71605 55697 35296 29687 56188 70871 25561 27041 50411 37829 9164 -27399
511 -27399 -23899 -29478 -24878 48967 54426 57868 61175 73239 18850 -9667 -16180 -14178 -13078 -29022
497 -29022 -17909 -7378 1043 18205 8963 -570 17322 33501 -16059 -45034 602 25868 14825
484 14825 16239 34786 45175 23758 6224 9975 -21411 -6526 -14108 -21464 -4434 -10356 -3787
471 -3787 -23079 5100 9331 20390 -12550 -58154 -9150 48117 67182 42028 26438 17618 38445
458 38445 38110 43894 49069 37656 32802 26120 42473 43154 3031 -6517 -13991 -22923 -21718 2792
444 2792 25662 35808 26420 26392 40426 56283 46549 38034 25646 16932 2809 -25535 -281 5573
430 5573 4700 -4499 -11793 -4013 13154 48274 61675 36924 -1301 -17222 -19322 -12629 -5313 28502
416 28502 29649 37106 12100 -34767 -50107 10059 24089 49474 73202 49265 68221 43295
404 43295 42851 45081 33064 8251 11150 -7171 2774 15349 7287 1481 10253 44400 35773 21636
390 21636 50047 37335 6236 -4806 821 30148 24258 -27622 -63743 -41310 7341 33720
378 33720 57754 34156 34057 74932 26326 -33556 9204 15040 -41052 -54009 -55910 -35163 -10044
365 -10044 -16746 -35368 -48454 -59251 -86091 -66459 -26104 -14536 40215 75518 49677 37462
353 37462 33003 31615 24650 14575 5058 -2656 7439 -10398 5104 -6693 -14702 -6025 -38332
340 -38332 -94332 -67792 -41511 -20404 24810 39225 46802 29824 34143 23641 5281 -16718
328 -16718 -33484 -46964 -35277 -5323 3189 8039 10319 4598 -20631 -23947 2067 29022 35105
315 35105 3810 -23019 -24158 -9037 -14379 -6846 -15510 -28566 -24491 2976 -15410 -29020 -13832
302 -13832 21687 25001 27539 26121 28759 41581 46914 23088 10739 3419 755 39352 46218 14286
288 14286 -1486 -17856 -23992 618 -19984 -27407 -7498 46687 64173 58931 17504 -1 -33110
275 -33110 -19659 -15980 22779 36612 34517 21145 49913 39536 1079 44014 48682 41927 37844
262 37844 35913 33815 14733 56976 82590 96223 80962 66094 53491 23318 5243 2965 48238
249 48238 73197 60404 32928 23670 25770 42399 32808 28469 9509 -21784 -26956 7077 50449
236 50449 52023 27200 5131 35759 45577 46725 33698 31030 13691 32860 46874 23175 11131
223 11131 25624 11940 -12109 -2674 16403 14371 24984 20334 12986 23906 37105 41246 16082
210 16082 8832 4941 14992 12307 7738 -11520 -12914 26353 23651 17220 3334 -1954 -18842 -32950
196 -32950 -18779 -11995 -6657 1797 -14005 -10213 19241 24726 6244 -23161 -12902 2615 5034
183 5034 9539 33844 25559 17405 21879 26303 23955 32188 16169 11880 26050 50648 70568 34417
169 34417 -14523 -22812 -38723 -32387 -21593 -39716 -52076 -52160 -45513 -27730 -28980 -27931 -19052 -26025
155 -26025 -35363 -22414 -8344 -22391 -40198 -32143 -27972 -36812 -42154 -23030 21934 19009 6593
142 6593 -2920 -9174 -9300 5684 -3799 -20082 -17129 -25422 -27200 -33247 -28013 -14074 8223 14272
128 14272 3735 10678 48697 72723 68232 76142 76421 80987 86773 52516 44276 43304 33688 7013
114 7013 6644 37713 68619 53496 42869 31023 9484 35447 53277 29831 4635 15712 -1850
101 -1850 2927 14167 8119 -3482 2646 22018 12677 -12017 -3313 15844 33870 43216 20366
88 20366 -20868 -15999 -4076 -12248 -5400 23499 31964 24910 5242 21250 34541 45550 47570
75 47570 23220 16511 23022 37487 51058 37432 22685 -1517 -1019 8648 26466 19822 19226 19304
61 19304 28272 27087 18474 15724 7702 12079 22565 43797 62613 54366 31284 16643 16908 28006
47 28006 8708 748 -12727 -7994 3200 39458 73478 71888 45130 36989 17895 25618 21509
34 21509 22387 15118 2572 7602 19577 15664 22954 13797 -4845 4063 23090 39162 18736 2247
20 2247 10113 18169 17855 7337 4101 5433 -18226 847 27103 13085 1579 1656 6020 -16545
$$ [...]
##END NTUPLES=NMR SPECTRUM
##END=
