##TITLE=Analysis number 330405
Compound Code btb 12469
Book Reference b
Project Code adrs
Chemist Name stores
##JCAMPDX= 6.0         $$ Bruker NMR JCAMP-DX V2.0
##DATA TYPE= NMR SPECTRUM
##DATA CLASS= NTUPLES
##ORIGIN= Bruker BioSpin GmbH
##OWNER= nmr
$$ XWIN-NMR		Version 3.5
$$ Thu Nov 22 11:01:15 2007 GMT Standard Time (UT+0h)  MAYBRIDGE\nmr@NMR_250MHZ
##.OBSERVE FREQUENCY= 250.131544655141
##.OBSERVE NUCLEUS= ^1H
##.ACQUISITION MODE= SIMULTANEOUS (DQD)
##.ACQUISITION SCHEME= undefined
##.AVERAGES= 16
##.DIGITISER RES= 18
##SPECTROMETER/DATA SYSTEM= dpx250
##.PULSE SEQUENCE= zg30
##.SOLVENT NAME= CDCl3
##.SHIFT REFERENCE= (INTERNAL, CDCl3, 0, 16.4512)
##AUDIT TRAIL= $$ (NUMBER, WHEN, WHO, WHERE, WHAT)
$$ ##TITLE= Audit trail, XWIN-NMR		Version 3.5
$$ ##JCAMPDX= 5.01
$$ ##ORIGIN= Bruker BioSpin GmbH
$$ ##OWNER= nmr
$$ C:\u/data/dgb/nmr/ADRS/2060/pdata/1/auditp.txt
$$ ##AUDIT TRAIL=  $$ (NUMBER, WHEN, WHO, WHERE, WHAT)
(   1,<2007-11-22 11:00:45.02 +000>,<MAYBRIDGE\nmr>,<NMR_250MHZ>,
      <created by zg, POWCHK disabled, PULCHK disabled
       configuration hash MD5:
       76 6E 9A 78 1E 09 19 81 EC 84 63 8F B0 6A 59 2D
       data hash MD5: 64K
       37 B2 2F A1 BF C4 10 38 53 63 D3 31 1E 42 62 5E>)
(   2,<2007-11-22 11:01:03.33 +000>,<MAYBRIDGE\nmr>,<NMR_250MHZ>,
      <Start of raw data processing
       ef LB = 0.3 FT_mod = 6 PKNL = 1 SI = 32K 
       data hash MD5: 32K
       58 4E 82 10 4E 6C F1 59 D1 23 D6 92 76 E5 A6 61>)
(   3,<2007-11-22 11:01:05.29 +000>,<MAYBRIDGE\nmr>,<NMR_250MHZ>,
      <apk 
       data hash MD5: 32K
       F0 C6 1A 8F 45 DA 9C 42 8A 5E 2C 43 E7 35 F8 EB>)
(   4,<2007-11-22 11:01:06.02 +000>,<MAYBRIDGE\nmr>,<NMR_250MHZ>,
      <abs ABSG = 5 
       data hash MD5: 32K
       39 F9 11 EA 03 76 40 4A 9D D3 51 CB A8 E3 3A C6>)
$$ ##END=
$$ 
$$ hash MD5
$$ 15 D4 E5 67 1A 59 09 FC 6B 14 68 E4 61 72 8F 8E
##$RELAX= 
##$RELAX= 
##$RELAX= 
##$RELAX= 
##$RELAX= 
##$RELAX= 
##$RELAX= 
$$ Bruker specific parameters
$$ --------------------------
##$DU= <C:\u>
##$EXPNO= 2060
##$NAME= <ADRS>
##$PROCNO= 1
##$TYPE= <nmr>
##$USER= <dgb>
##$AMP= (0..31)
100 100 100 100 100 100 100 100 100 100 100 100 100 100 100 100 100 100 
100 100 100 100 100 100 100 100 100 100 100 100 100 100 
##$AQSEQ= 0
##$AQ_mod= 3
##$AUNM= <au_zg>
##$AUTOPOS= <11 >
##$BF1= 250.13
##$BF2= 250.13
##$BF3= 250.13
##$BF4= 250.13
##$BF5= 500.13
##$BF6= 500.13
##$BF7= 500.13
##$BF8= 500.13
##$BYTORDA= 1
##$CFDGTYP= 0
##$CFRGTYP= 5
##$CHEMSTR= <none>
##$CNST= (0..31)
1 1 145 1 1 1 1 1 1 1 1 1 1 1 1 1 1 1 1 1 1 1 1 1 1 1 1 1 1 1 1 1 
##$CPDPRG= <>
##$CPDPRG1= <>
##$CPDPRG2= <>
##$CPDPRG3= <>
##$CPDPRG4= <mlev>
##$CPDPRG5= <mlev>
##$CPDPRG6= <mlev>
##$CPDPRG7= <mlev>
##$CPDPRG8= <mlev>
##$CPDPRGB= <>
##$CPDPRGT= <>
##$D= (0..31)
0 1 0 0 0 0 0 0 0 0.06 0 0 0 0 0 0 0.0002 0 0 0 0 0 0 0 0 0 0 0 0 0 0 
0 
##$DATE= 1195729242
##$DBL= (0..7)
120 120 120 120 120 120 120 120 
##$DBP= (0..7)
150 150 150 150 150 150 150 150 
##$DBP07= 0
##$DBPNAM0= <>
##$DBPNAM1= <>
$$ [...]
##$SUBNAM7= <"">
##$SUBNAM8= <"">
##$SUBNAM9= <"">
##$SW= 20.6930455092707
##$SWIBOX= (0..15)
0 0 3 0 0 0 0 0 0 0 0 0 0 0 0 0 
##$SW_h= 5175.983436853
##$TD= 65536
##$TD0= 1
##$TE= 295.16
##$TE2= 300
##$TE3= 300
##$TEG= 300
##$TL= (0..7)
0 120 120 120 120 120 120 120 
##$TP= (0..7)
150 150 150 150 150 150 150 150 
##$TP07= 0
##$TPNAME0= <>
##$TPNAME1= <>
##$TPNAME2= <>
##$TPNAME3= <>
##$TPNAME4= <>
##$TPNAME5= <>
##$TPNAME6= <>
##$TPNAME7= <>
##$TPOAL= (0..7)
0.5 0.5 0.5 0.5 0.5 0.5 0.5 0.5 
##$TPOFFS= (0..7)
0 0 0 0 0 0 0 0 
##$TUNHIN= 0
##$TUNHOUT= 0
##$TUNXOUT= 0
##$USERA1= <user>
##$USERA2= <user>
##$USERA3= <user>
##$USERA4= <user>
##$USERA5= <user>
##$V9= 5
##$VALIST= <valist>
##$VCLIST= <CCCCCCCCCCCCCCC>
##$VD= 0
##$VDLIST= <DDDDDDDDDDDDDDD>
##$VPLIST= <PPPPPPPPPPPPPPP>
##$VTLIST= <TTTTTTTTTTTTTTT>
##$WBST= 1024
##$WBSW= 4
##$XGAIN= (0..3)
0 0 0 0 
##$XL= 0
##$YL= 0
##$YMAX_a= 353970
##$YMIN_a= -363043
##$ZGOPTNS= <>
##$ZL1= 120
##$ZL2= 120
##$ZL3= 120
##$ZL4= 120
##$ABSF1= 16.45116
##$ABSF2= -4.242012
##$ABSG= 5
##$ABSL= 3
##$ALPHA= 0
##$AQORDER= 0
##$ASSFAC= 0
##$ASSFACI= 0
##$ASSFACX= 0
##$ASSWID= 0
##$AUNMP= <proc_1d>
##$AZFE= 0.1
##$AZFW= 0.1
##$BCFW= 0
##$BC_mod= 0
##$BYTORDP= 0
##$COROFFS= 0
##$CY= 12.5
##$DATMOD= 1
##$DC= 0
##$DFILT= <>
##$DTYPP= 0
##$F1P= 14.0000005364418
##$F2P= -0.99999901652339
##$FCOR= 0.5
##$FTSIZE= 32768
##$FT_mod= 6
##$GAMMA= 0
##$GB= 0
##$INTBC= 1
##$INTSCL= 1
##$ISEN= 128
##$LB= 0.3
##$LEV0= 0
##$LPBIN= 0
##$MAXI= 10000
##$MC2= 0
##$MEAN= 0
##$ME_mod= 0
##$MI= 0
##$NCOEF= 0
##$NC_proc= -2
##$NLEV= 6
##$NOISF1= 0
##$NOISF2= 0
##$NSP= 0
##$NTH_PI= 0
##$NZP= 0
##$OFFSET= 16.45116
##$PC= 1
##$PHC0= 170.764
##$PHC1= 4.665631
##$PH_mod= 1
##$PKNL= yes
##$PPARMOD= 0
##$PSCAL= 4
##$PSIGN= 0
##$REVERSE= no
##$SF= 250.130017718848
##$SI= 32768
##$SIGF1= 0
##$SIGF2= 0
##$SINO= 400
##$SIOLD= 32768
##$SREGLST= <1H.CDCl3>
##$SSB= 0
##$STSI= 32768
##$STSR= 0
##$SW_p= 5175.98343685301
##$SYMM= 0
##$S_DEV= 0
##$TDeff= 65536
##$TDoff= 0
##$TI= <Analysis number 999999
Compound Code 99
Book Reference 9
Project Code 9>
##$TILT= no
##$TM1= 0
##$TM2= 0
##$TOPLEV= 0
##$USERP1= <user>
##$USERP2= <user>
##$USERP3= <user>
##$USERP4= <user>
##$USERP5= <user>
##$WDW= 1
##$XDIM= 32768
##$YMAX_p= 320647335
##$YMIN_p= -63675
$$ End of Bruker specific parameters
$$ ---------------------------------
##NTUPLES= NMR SPECTRUM
##VAR_NAME=  FREQUENCY,     SPECTRUM/REAL,   SPECTRUM/IMAG
##SYMBOL=    X,             R,               I
##VAR_TYPE=  INDEPENDENT,   DEPENDENT,       DEPENDENT
##VAR_FORM=  AFFN,          ASDF,            ASDF
##VAR_DIM=   32768,         32768,           32768
##UNITS=     HZ,            ARBITRARY UNITS, ARBITRARY UNITS
##FACTOR=    0.157963299565203, 1,           1
##FIRST=     4114.92905007868, 0,            0
##LAST=      -1061.05438677433, 0,           0
##MIN=       -1061.05438677433, -63675,      0
##MAX=       4114.92905007868, 320647335,    0
$$ Real data points
##PAGE= N=1
##DATA TABLE= (X++(R..R)), XYDATA
$$ [...]
17209G084j9805p012K2836o376M173N769m209n050j2794o933J8325R662m230j0886
17195i446l015q31k4669n158K3707l995q171O831M139k084M529k116Q092r57q986
17180b2130P25Q856P728r676j5238l938J660J1773J1724L227Q898O777j1319q187
17166i120l359L567L265P507O115p154l337r31N488k485n804j99q55J245j5175
17151b1232J722N167K4303O134k6135o879k332J0203J7984j1011r319m3j2008
17138b3446k3202P217L8465J3358O694M833j3258n499j3909j4934N556P496m761
17125a5390P365N169l69K538n537j1554J3738J6399r35p583j4115j2114j3288
17112c5676J5694m75J1558o58p982l475q392J5220j154l019J604q207L576k577
$$ plain form
17209 7084 -12721 -19733 3103 -3273 900 6669 2460 -2590 -15384 -22317 -3992 5670 1440 -9446
17195 -9446 -12461 -13292 -37961 -43119 -19412 -23407 -31578 -24747 -20608 -22692 -18163 -20279 -12187 -13144 -22130
17180 -22130 -21405 -12549 -4821 -14497 -29735 -33673 -32013 -20240 -8516 -5289 3609 10386 -933 -9120
17166 -9120 -12479 -8912 -5647 1860 7975 821 -2516 -3447 2041 -444 -6248 -6447 -7302 -6057 -21232
17151 -21232 -19510 -14343 9960 16094 -10041 -16920 -19252 -9049 8935 -2076 -11395 -11438 -23446
17138 -23446 -46648 -39431 -966 12392 19086 23919 10661 5162 -8747 -23681 -18125 -10629 -15390
17125 -15390 -8025 -2856 -3225 -687 -6224 -17778 -4040 12359 11424 3841 -10274 -22388 -35676
17112 -35676 -19982 -20457 -8899 -9557 -17539 -21014 -29406 -14186 -15340 -18359 -16755 -24962 -21386 -23963
17098b3963O613R90J570m689q413P993J7113j382j2344p618L64q475J839n782
17084c6184K081m500L536J0736K460j8273J5350R559m60L02K241o267k366O977
17070a4808J9167J2091k8824m408P116j8169J787j1282k095J2811J0735N908m121
17057a4092k4050J0738K8852k354M001j1871p085J140J0118O53R48Q431j71l919
17043A339o609p400o269m047J5450J3760j0793n120p27j345q38p906m289k700
17029b7494J143K0640K484j1709p518J2095J5003M586m9K606m250j6154m072P401
17015e288m76j0625j2811R315m88r140J0789J6077K1878l193n295J2647q765j0070
17001D555j1732k7133J763J6106J0757R770K73j4933m511O508M260Q165Q266n226
$$ plain form
17098 -23963 -17350 -16360 -14790 -19479 -27892 -19899 -2786 -4168 -16512 -24130 -23766 -32241 -30402 -36184
17084 -36184 -34103 -38603 -35067 -24331 -21871 -40144 -24794 -15235 -15695 -15393 -13152 -19419 -21785 -14808
17070 -14808 4359 16450 -12374 -16782 -9666 -27835 -26048 -37330 -39425 -26614 -15879 -9971 -14092
17057 -14092 -38142 -27404 1448 -906 3095 -8776 -15861 -14721 -4603 -3950 -3002 5429 5258 1339
17043 1339 -5270 -12670 -18939 -22986 -7536 6224 -4569 -9689 -10416 -11761 -12599 -20505 -24794 -27494
17029 -27494 -26351 -5711 -3227 -14936 -22454 -10359 4644 9230 9181 11787 7537 -8617 -12689 -5288
17015 -5288 -5764 -16389 -29200 -19885 -20373 -29513 -18724 -2647 19231 16038 10743 23390 14625 4555
17001 4555 -7177 -34310 -32547 -16441 -5684 4086 4359 -10574 -15085 -8577 -4317 3848 12114 6888
16987F888j3073r530J7097J3828J617p430j9753j8690k445N245M795J494M438
16974a5519K518P608k033j2301Q539J56O782k031p885j5583q543Q065L628Q580
16960a8019J5440J100j7140p017J7338m127N593J92j911p111r70Q0J29J1763k73
16945d933q818m650K732K2996l128k880o219o017o262R731J6252n404j2467N669
16931c398o723k4606k1385J7383K4222J460j0486K944j6198j8842J8386K1378
16919a5865J7601J9473j8818k012J2000o454M579q344k8278j2318R709K1964M496
16906b267M420r337j6700L798J7031j5497O92N142o345L681K0534Q523o369O614
16892A3920k957K082Q845r955q243Q541J1144l562j0255p531O203K749J4564q251
$$ plain form
16987 6888 -6185 -15715 1382 15210 16827 9397 -10356 -29046 -31491 -26246 -21451 -19957 -15519
16974 -15519 -13001 -5393 -7426 -19727 -11188 -11032 -4250 -6281 -14166 -29749 -38292 -30227 -26599 -18019
16960 -18019 -2579 -1479 -18619 -25636 -8298 -12425 -6832 -6640 -8551 -15662 -16632 -16552 -16423 -4660 -4933
16945 -4933 -13751 -18401 -15669 7327 4199 1319 -4900 -10917 -17179 -7448 8804 3400 -9067 -3398
16931 -3398 -10121 -34727 -56112 -38729 -14507 -13047 -23533 -20589 -36787 -55629 -37243 -15865
16919 -15865 1736 21209 2391 379 12379 5925 10504 2160 -26118 -38436 -28727 -6763 -2267
16906 -2267 2153 -7184 -23884 -20086 -3055 -18552 -17860 -12718 -19063 -15382 5152 13675 7306 13920
16892 13920 10963 13045 21890 11935 3692 12233 23377 19815 9560 2029 8232 10981 25545 17294
16878A7294j8754k5151P302K1982P397N348o363L942n724M80j123j7057k816J573
16864a1670p257L573m725J534K1254O651N68R57O903j3137r135k725k204n330
16850a4743P477K872j462N242j7648p641J307J0490J994J6330J3544p879j2180
16837b297R86N716j0106P340J5462o731j690J244q609P86J4273J0805k37m440
16823B2502p092pR087l882j8827o502R96N091P605P000M679r200J8516p593j1205
16808A1168J520L273k471j2718j3071m675n833O293L3292K2699j0231q21j469
16795B6956P924j1548p288M838M368r051J1072r149j6867n407M660J2187n926
16782F769j095O636j1175k4562m548j65J265N808J8012J5123m260j6006J252J1204
$$ plain form
16878 17294 -1460 -26611 -19309 2673 10070 15418 9055 12997 7273 7753 6630 -10427 -13243 -11670
16864 -11670 -18927 -15354 -20079 -18545 2709 9360 9928 10885 17788 4651 -4484 -7209 -9413 -14743
16850 -14743 -7266 -4394 -5856 -614 -18262 -25903 -24596 -14106 -12112 4218 17762 9883 -2297
16837 -2297 -1311 4405 -5701 1639 17101 10370 8680 9924 1315 2101 16374 27179 26942 22502
16823 22502 15410 15403 24490 20608 1781 -4721 -3725 1366 8971 15971 20650 11450 29966 22373 11168
16808 11168 12688 15961 13490 772 -12299 -16974 -22807 -16514 16778 39477 29246 28425 26956
16795 26956 34880 23332 16044 20882 25250 16199 27271 18122 1255 -4152 508 12695 6769
16782 6769 5674 12310 1135 -23427 -27975 -28140 -26875 -21067 -3055 12068 7808 -8198 -6946 4258
16768D258Q65r172J3884l589q541O034P949j9347j3844j953L4739L0164k2477
16755A8970j2905o777o257J4427K462j4195j7007j4873P695J6686J8721L384p90
16742I541k9461p312J1935L189K3717J4812J091J473r135j7567J0877o152k1104
16729a4096J4872K3419J3752P426k4404l4585l40R831J8145Q85k3977j4690L051
16716b0711J1465K0466j5887l0702k4815O591J8784J3162K7180J6847j280j3474
16704G626o101K788r25R496K5229k3028r568M794J6502K1256j2236j6089j7609
16691B135p042N62J1570L725p773k1142Q53J6692k202k3220j0320L917J4290j524
16677a9479O178J6879J442j1380J5068M319j4481N062K145o752k7085m657J0921
$$ plain form
16768 4258 5123 -4049 9835 6246 -2295 3739 11688 -7659 -21503 -23456 11283 41447 18970
16755 18970 6065 -712 -6969 7458 9920 -4275 -21282 -36155 -28460 -11774 6947 10331 9541
16742 9541 -19920 -27232 -15297 -12108 11609 26421 27512 28985 19850 2283 13160 7008 -14096
16729 -14096 776 24195 37947 45373 20969 -13616 -13956 -4125 14020 14905 -9072 -23762 -20711
16716 -20711 -9246 11220 -4667 -35369 -60184 -53593 -34809 -21647 5533 22380 21100 7626
16704 7626 1525 4313 3388 12884 38113 15085 5517 10311 26813 48069 35833 19744 2135
16691 2135 -4907 -4345 7225 10950 3177 -17965 -17112 -420 -2622 -25842 -36162 -32245 -17955 -19479
16677 -19479 -13301 3578 5020 -6360 8708 13027 -1454 3608 5753 -999 -28084 -32741 -21820
16664b1820j011L76Q469J2785k72k021n180j0227n272K398j9205j2073J7301K1129
16650a4623L0895n070k1333j6796L026J8530m052n139R551j0273j2616j1798P230
16637c2468J8417n40n235n868J4890l816p362J2944r90q78J1023l819K460k195
16623c437m585O687L849L152J419J0832l079l0980j3937K211M014J5960Q685j178
16609c87M978k931p748M639m73q560j2886M54l793n4J3075k116k3861m389P782
16594c6270J8740p083k20P042J061m58O901m788j4691J3928J4792k784p721m078
16580a5629O133O303k85n29P945K968p598K92O629J1304j2621M136M395R544k292
16565B0695q691O906L143j9720k795K289p204N945P634R724J0282l887K042j3454
$$ plain form
16664 -21820 -22831 -22455 -13986 -1201 -1473 -3494 -8674 -18901 -24173 -21775 -40980 -53053 -35752 -14623
16650 -14623 16272 11202 -10131 -26927 -23901 -5371 -9423 -14562 -5011 -15284 -27900 -39698 -32468
16637 -32468 -14051 -14591 -19826 -25694 -10804 -14620 -21982 -9038 -10028 -10906 117 -3702 -1242 -3437
16623 -3437 -8022 -1335 2514 5666 7085 17917 14838 -16142 -30079 -27868 -23854 -7894 791 -387
16609 -387 4591 1660 -6088 -1449 -1922 -10482 -23368 -22914 -26707 -26761 -13686 -15802 -39663 -44052 -36270
16594 -36270 -17530 -24613 -24833 -17791 -16730 -17188 -10287 -15075 -29766 -15838 -1046 -3830 -11551 -15629
16580 -15629 -9496 -3193 -3478 -4007 3938 6906 -692 -400 6229 17533 4912 9048 13443 22987 20695
16565 20695 12004 18910 22053 2333 -462 1827 -5377 568 8202 17926 28208 24321 26363 12909
16551A2909N008n403k2184j3146Q572J2951K1994L730p985K864p18j1590j2432
16538e430l017M078L580J1363P244n607J0357q45n797m292k6315j2542P094N109
16524a5020O433m361J0j5594J5940J0870O812k09j0683j1694L942r994J3404j279
16510a1423j2087M682Q803K699J9039Q852j9390j2827J3893Q503p032k051o39
16497A022Q692p713j3061O142L268J0218M33P103l824l986N503J946j7459J878
16483A62J1886o844L677j5655j7967J2655N598k33m581k707J0317R22j0333J1275
16469a828J0769O633m563r688k2083o91O378J2465k624n533K580j4836o332J1483
16455a7870r82k826r612J8104J2771J1522l716j4652j6067J5660r66m792K3139
$$ plain form
16551 12909 17917 12514 -9670 -22816 -14244 -1293 20701 24431 16446 19310 18592 7002 -5430
16538 -5430 -8447 -4369 -789 10574 17818 12211 22568 21723 15926 11634 -14681 -27223 -20129 -15020
16524 -15020 -8587 -12948 -12938 -28532 -12592 -1722 5090 4881 -5802 -17496 -13554 -23548 -10144 -11423
16510 -11423 -23510 -18828 -10025 -7326 11713 20565 1175 -11652 2241 10744 3712 1661 1022
16497 1022 9714 2001 -11060 -4918 -1650 8568 9001 16104 12280 8294 13797 15743 -1716 162
16483 162 12048 5204 8881 -6774 -24741 -12086 -6488 -6721 -11302 -14009 -3692 -2770 -13103 -1828
16469 -1828 8941 15574 11011 1323 -20760 -21451 -15073 -2608 -5232 -10765 -8185 -23021 -29353 -17870
16455 -17870 -18852 -21678 -31290 -13186 -415 11107 7391 -7261 -23328 -7668 -8634 -13426 9713
16442I713j6358K78P548J3453O633l295J219K871m538j2998j5028J4705M730j6945
16428h012J420K430K18q442J2921O775p635j12J5805p541n230L444J1235k0455
16414c179k4921N444J0201J0257M899p84j5259O229K1959L883j4980k0174j2530
16401b8955l847Q718N614J4427J5351J0308l773m489j1386j5078M038J0780P74
16388B482l874N53m457q884n648P574l04j3522k746j19J8355N476K820n64p030
16373i888k347J2965J0557J1520Q646j0099k1664Q62l901q976J4738L684k68j0026
16359d197J107j9507p977J7169K0391p781j4030r507l261n740N662J0325J4573
16346b773J5418j343j2344P291P929k9608j6481j5195K188M769K8056m015M865
$$ plain form
16442 9713 -6645 -6367 1181 14634 21267 17972 19191 22062 17524 4526 -10502 4203 8933 -8012
16428 -8012 -6592 -4162 -3944 -12386 535 7310 -325 -437 15368 7827 2597 6041 17276 -3179
16414 -3179 -28100 -22656 -12455 -2198 2701 1917 -13342 -7113 14846 18729 3749 -16425 -28955
16401 -28955 -32802 -24084 -18470 -4043 11308 21616 17843 13354 1968 -13110 -9072 1708 2482
16388 2482 -1392 -839 -5296 -14180 -19828 -12254 -12558 -26080 -28826 -28945 -10590 -5114 -2294 -2858 -9888
16373 -9888 -12235 730 11287 22807 31453 21354 -310 552 -3349 -12325 2413 6097 5829 -4197
16359 -4197 -3090 -22597 -30574 -13405 6986 -795 -14825 -24332 -27593 -33333 -27671 -17346 -2773
16346 -2773 12645 11302 -1042 6249 14178 -15430 -31911 -47106 -44918 -40149 -12093 -16108 -11243
16333a1243J7519P719r128k2398J9436Q952Q839l431J1459J2775j1253n24j587
16320B7135r51j3432Q658L342j0442j0202r630L328J6314K676R535k843j0472
16307A3016j5748L016L611J557J989N358K113N25j3011j3402n092j0626J005o111
16293c1800L91K144J4043J4992Q808J4780M792p612k2581o114q656R579n392m797
16279a7423p091q611j008J8794L348j0547P454K6816M249j0696q611M031j3111
16266a2406o829l099Q730K0296K1519n754r9J8160m726j1479j1355n799M822O62
16252A2643k2389l892l714k2992q710l165J7347J3637j177L11r135M292N094k869
16238b4719O58K627P138N315L681J1702J728l099k674n586k300q52K671j0204
$$ plain form
16333 -11243 6276 13995 4867 -17531 1905 10857 19696 16265 27724 40499 29246 28722 27135
16320 27135 26184 12752 21410 24752 14310 4108 -5522 -2194 14120 16796 26331 23488 13016
16307 13016 -2732 284 3895 5452 7441 12799 14912 15437 2426 -10976 -16068 -26694 -25689 -31800
16293 -31800 -31409 -29265 -15222 -230 8578 23358 28150 20538 -2043 -8157 -16813 -7234 -12626 -17423
16279 -17423 -24514 -33125 -34133 -15339 -11991 -22538 -15084 11732 15981 5285 -3326 705 -12406
16266 -12406 -19235 -22334 -13604 6692 28211 22457 22358 40518 35792 24313 12958 7159 11981 12643
16252 12643 -9746 -13638 -17352 -40344 -49054 -52219 -34872 -21235 -22412 -22101 -31236 -26944 -21850 -24719
16238 -24719 -24061 -21434 -14296 -8981 -5300 6402 8130 5031 2357 -3229 -5529 -6381 -3710 -13914
16224a3914J296m142J3609r853Q817m094L810j1061o064R880R328K984l192J4767
16210A2171j1537l5914k067P665R892k0J938J7233q483J515J7457j1612k2926
16197b4688K632K3544J4557J3790p004k4482k391J767K0271K085r687K812O771
16184A9977o254K375N949J220K885n932M919J7452K1545r377k3549j2871m287
16171A4052p530k1015R934J0674o186j5130l409K1918K0687j2248k3066j5210
16159b6529l562m239P741R051M944n982J502m397N0j086K417p378L061J9976J1866
16144G435l745P698n446k4255j1354J6399K8913J0207q019Q792n774j5955j164
16131C732J2937R739j399l921L428n62j4625r946j59J6775j685j2988q567J2691
$$ plain form
16224 -13914 -12618 -16760 -3151 -13004 -4187 -8281 -4471 -15532 -21596 -11716 -2388 596 -2596 12171
16210 12171 634 -35280 -37347 -29682 -19790 -19810 -17872 -639 -9122 -7607 9850 -1762 -24688
16197 -24688 -22056 1488 16045 29835 22831 -1651 -4042 -2275 17996 20081 10394 13206 19977
16184 19977 13723 16098 22047 23267 26152 20220 25139 42591 64136 54759 31210 18339 14052
16171 14052 6522 -14493 -4559 6115 -71 -15201 -18610 3308 23995 11747 -11319 -26529
16159 -26529 -30091 -34330 -26589 -17538 -12594 -18576 -17074 -21471 -21421 -22507 -20090 -27468 -24407 -4431 7435
16144 7435 3690 11388 5942 -18313 -29667 -13268 15645 25852 17833 26625 20851 4896 3732
16131 3732 16669 26408 25009 21088 24516 23954 9329 -617 -776 15999 14314 1326 -7241 5450
16117E450J0213q198j0513r573L646L438P535Q095q141l151L595k094j1844m971
16103a6513J771K1557P135l926k41K657j570O20k896o461L333N599n818R048N06
16088A4801n012r000m740J8487q400j0699N449P742J2476o703K187j0419p315
16075a146M510P642Q539O298j2789j2864n273j9739K415K3788j808K216J6114
16062A7903j1748q011k899K875q287q020j0812J5102L371J4273L0737J2374r451
16049C7407j5889p494j2009N934M049j7163K362O65J800N108o12q075j737P202
16035A548N112O202O48r409L124R099j2397J4631J5160L005j5437k1808j5916
16022a6438j5649K854k318j038Q803J0625K5808q71k4525j1305R351J0836j0081
$$ plain form
16117 5450 15663 7465 -3048 -12621 -8975 -5537 1998 10093 1952 -1199 2396 302 -11542 -16513
16103 -16513 -14742 6815 13950 10024 9783 12440 10870 11490 8594 2133 5466 11065 5247 14295 14801
16088 14801 9789 789 -3951 14536 6136 -4563 886 8628 21104 14401 16588 6169 -1146
16075 -1146 3364 11006 19545 25843 13054 190 -5083 -24822 -22407 1381 -427 1789 17903
16062 17903 6155 -1856 -4755 -1880 -10167 -18187 -28999 -13897 -10526 3747 34484 46858 37407
16049 37407 21518 14024 2015 7949 11998 -5165 -2803 -2138 -338 4770 4158 -3917 -5654 1548
16035 1548 6660 12862 13510 4101 7225 16324 3927 18558 33718 36723 21286 -522 -16438
16022 -16438 -32087 -29233 -31551 -32589 -23786 -13161 12647 11776 -12749 -24054 -14703 -3867 -13948
16009a3948J0315K580K146M941k976O894m30j5459q988J2158K0201k075j8674
15996c315j3085J1593P096o467r42R146J8071j3930O254L087o145K269j932J461
15982A3161R371j0291j7844J2276j2508j8280k955J6113k44j5838Q612K4197N540
15969A1310p082L655Q663l324N876n468m370O609J4404j0473k2259o25J2233J5191
15955B4340P578p741q87j3029k0237R99O397Q748j65p622N46P154r36N328K472
15940A2945K121k5462L5Q035l08o749J460J491J8467o405j0178L732K2834l01
15926B1717k860j100o957N590r015N962J7056q224j3259Q62j1396k022o387j371
15912a1404k387J5657M685J029P335k9o769j8158k006M957l818l076O988N973
$$ plain form
16009 -13948 -3633 -1053 1093 6034 3058 9952 9522 -5937 -14925 -2767 17434 15359 -3315
15996 -3315 -16400 -4807 2289 -4178 -5120 4026 22097 8167 14421 17508 11363 13632 11700 13161
15982 13161 22532 12241 -5603 6673 -5835 -24115 -27070 -10957 -11201 -27039 -18427 5770 11310
15969 11310 4228 7883 16546 13222 19098 13630 9260 15869 30273 19800 -2459 -3084 9149 24340
15955 24340 31918 24177 23290 10261 -9976 -8977 -2580 6168 6003 -1619 -1073 6081 5145 10473 12945
15940 12945 15066 -10396 -10361 -2326 -2634 -9383 -7923 -6432 12035 5630 -4548 -816 22018 21717
15926 21717 18857 17757 10800 16390 7375 13337 30393 22169 8910 9772 -1624 -3646 -10033 -11404
15912 -11404 -13791 1866 6551 7580 14915 14886 8117 -10041 -12047 -7090 -10908 -13984 -6996 -1023
15898a023p275q902K0915J2650j8583k0008m067J8735K2272j7784j5511n916J1053
15885a3444r5q254Q953L50M808J6799M376J322o864j2068J3660N145k0884R280
15871C084j595K507r43j5299j882j8216r450j69L013P143L349j874J2193K8477
15857A0338J4653j7338m927o014M796P315j547j1816n714j3215j842O194J4040
15844e077K4878q25k1761j0367L005J2330J6233M474q684m757j222m008R68P239
15830A2426J3791n129P697j6856l657M911K064n507k814j2834J876J1047Q352
15817A5367J074J299j1940j6230j2746L472K127J525l870K3432N197o726k963
15804i82j4310M622L856K510p23m436K581k852K01l437l052J3838j1994L517j4071
$$ plain form
15898 -1023 -8298 -17200 3715 16365 -2218 -22226 -26293 -7558 14714 -3070 -18581 -24497 -13444
15885 -13444 -13539 -21793 -12840 -12490 -7682 9117 13493 14815 7951 -4117 9543 14688 -6196 3084
15871 3084 1489 3996 3053 -12246 -14128 -32344 -41794 -41963 -38950 -31807 -28458 -30332 -18139 10338
15857 10338 24991 7653 2726 -3288 1508 8823 7276 -4540 -10254 -23469 -25311 -19117 -5077
15844 -5077 19801 18976 -2785 -13152 -10147 2183 18416 22890 14206 9449 8227 4219 5187 12426
15830 12426 26217 21088 28785 11929 8272 13183 15247 9740 6926 -5908 -4032 7015 15367
15817 15367 16441 17740 5800 -10430 -23176 -19704 -17577 -16052 -19922 3510 8707 1981 -982
15804 -982 -15292 -10670 -6814 -4304 -5027 -9463 -6882 -9734 -9533 -12970 -16022 -2184 -14178 -10661 -24732
15789b4732R677J5929J50Q040P812p24Q122L905m316k2439J0182J4676n317k0067
15775H98p724j4938J1789O214M922Q209Q831o5j1025j881q17R996j396N570r321
15760I262j6011K3683L1649j0531k1651q700N322N024m769p597o589Q052J1545
15747A8689j699J7075n317j1438j873q550n498N874L100O551j2458L418m946j0805
15733g877J997J1626K1140j6746j1598p180k909J0995K2765q155j0493j116L580
15720F029K0300M426j486j1860j5892q774n672o527L771J2380Q529K0623j82m934
15706B0731q644q472r62k07m442N272R371r705n961K781L530j0127m524L380P981
15691BL878l748L161k379j8676N983J3427L41R812K047q206j0919l877o617r005
$$ plain form
15789 -24732 -15055 874 1024 9064 16876 16152 24274 28179 23863 1424 11606 26282 20965 898
15775 898 -6826 -21764 -9975 -3761 1161 9370 18201 18136 7111 5230 4413 14409 13013 18583 9262
15760 9262 -6749 16934 48583 38052 16401 7701 13023 18047 13278 5681 -908 7144 18689
15747 18689 16990 34065 28748 17310 15437 6887 1389 7263 10363 16914 4456 7874 2928 -7877
15733 -7877 -5880 5746 26886 10140 -1458 -8638 -11547 -552 22213 14058 3565 2449 6029
15720 6029 26329 30755 29269 17409 1517 -7257 -12929 -19456 -15685 -3305 5224 25847 25665 20731
15706 20731 12087 3615 2653 2446 -1996 3276 12647 2942 -3019 -238 3292 -6835 -11359 -7979 2
15691 2 3880 132 3293 914 -17762 -11779 1648 1989 11801 13848 5642 -5277 -9154 -15771 -24776
15676b4776J1129j593J1563J3517o486p200L146p01K920K429P367n907Q76p517
15662a233l737j5686p268P251Q487l156J9307N43k3472O874J6751j3056o878R751
15648e522j681N542O202K494O619j1862n838j5390J576K4862J0836o196M047j0541
15634E148j0130j1707K174J0594N274j1654p032J3023M880J4808j636j1888r208
15621g354k636M161n193m232J3990J1314k660q886m962J7576J749p679k849O425
15607H764J1668N889j5581k5775J813Q156O06j426Q208K077m512J900K759J482
15593F028M869o913l285j2347n141J0984O644q424m756M739k763j6128J3751K5379
15579A2637J2544P048j5677j8954p26j4563o245J0593q354m76O289J0840J1002
$$ plain form
15676 -24776 -13647 -15240 -3677 9840 3354 -3846 -700 -1401 1519 3948 11315 5408 6284 -1233
15662 -1233 -4970 -20656 -27924 -20673 -12186 -15342 3965 4508 -18964 -12090 4661 -8395 -15273 -5522
15648 -5522 -7203 -1661 4541 7035 13654 1792 -4046 -19436 -17860 7002 17838 11642 15689 5148
15634 5148 -4982 -16689 -14515 -3921 1353 -10301 -17333 -4310 570 15378 13742 1854 -7354
15621 -7354 -9990 -5829 -11022 -15254 -1264 10050 7390 -1496 -6458 11118 12867 5188 2339 8764
15607 8764 20432 26321 10740 -15035 -13222 -5066 -4460 -5886 2322 4399 -113 1787 4546 6028
15593 6028 10897 3984 699 -11648 -16789 -5805 839 -7585 -12341 -7602 -10365 -26493 -12742 12637
15579 12637 25181 32229 16552 -2402 -3128 -17691 -23936 -13343 -21697 -22173 -15884 -5044 5958
15566E958J3123l16p230o059k73Q351o403N48l82p108n744j6271k391K2614J3441
15551A1858R205l255m127K107m31j4110r876q87j674N36j0227J0548L408N706
15537a219j28q416n292K0911Q549j581r487O17L302R379l920k1362p932o727l088
15522b6394O646R179k391m519M704J1088M755P586M686l763m104j5864j2162j1172
15508c1725n853R941J5739M192P527j802P534J1383j6180j4046m0J8719Mo471
15494a078p404Q471P964p564n763K713j5759j24K3520L803j7232L520p802r938
15480b2673J1767p42N881R321J0786k853j5145o219K548p238j0453J7250Q082
15467C12L156J4703q620j1105J2066K0882j6783p104J5871J3487n233J1874m891
$$ plain form
15566 5958 19081 18765 11535 5476 5203 13554 7151 7699 7317 209 -5535 -21806 -24197 -1583 11858
15551 11858 21063 17808 13681 15788 15357 1247 -8629 -9516 -11190 -10654 -20881 -10333 -6925 -1219
15537 -1219 -1347 -9763 -15055 5856 14405 12824 3337 3954 7256 16635 12715 -8647 -16579 -23306 -26394
15522 -26394 -19748 -10569 -12960 -17479 -12775 -1687 3068 10654 15340 11577 7473 -8391 -20553 -31725
15508 -31725 -37578 -27637 -11898 -7706 -179 -1981 5553 16936 756 -13290 -13330 5389 5393 -1078
15494 -1078 -8482 -11 7953 389 -5374 -2661 -18420 -18544 4976 8779 -8453 -4933 -12735 -22673
15480 -22673 -10906 -11648 -5767 3554 14340 11487 -3658 -9877 -7329 -14567 -25020 -7770 312
15467 312 3468 18171 9551 -1554 10512 31394 14611 7507 23378 36865 31632 43506 38615
15454C8615j1253j2079m091J0407k2764j2454J4308R56l769o577j285q98R526
15441a358K5836Q159j8797j7302k537l081n645j1772n377j7102J6771K8592j4627
15428a8240R658P511Q593J5004m376o578n888j621r201P446J4936J2644l488k0813
15414E587k781k922O664o005K42j842r18Q491j152j91l736m812K646J0000Q378
15399A7649J983j3113o239k114J2777J1834N889J4644o800j9694k085j3318l1560
15386c0147J23J7524N795J498R617K0698J3017q194m938p552m950J073M876M971
15372B3411M8j5236o670j1043M414j0483O391J4128J3109J0674j1346j3799p704
15359d106K46l894p406J3016O464K740N60r853l490N624P633J932j4994k4203
$$ plain form
15454 38615 27362 15283 11192 21599 -1165 -13619 689 1645 -2124 -8701 -9986 -10884 -1358
15441 -1358 24478 32637 13840 -3462 -5999 -9080 -14725 -26497 -31874 -48976 -32205 -3613 -18240
15428 -18240 -8582 -1071 7522 22526 18150 11572 5684 4063 -5138 2308 17244 29888 26400 5587
15414 5587 2806 -116 6548 543 785 -1057 -1975 6516 5364 5173 1437 -3375 -729 9271 17649
15399 17649 19632 6519 280 -1834 10943 22777 28666 43310 36510 16816 14731 1413 -30147
15386 -30147 -30024 -12500 -6705 -5207 4410 25108 38125 29931 24993 17441 12491 13564 18440 23411
15372 23411 23459 8223 1553 -9490 -5076 -15559 -9168 4960 18069 28743 17397 3598 -4106
15359 -4106 -3860 -7754 -15160 -2144 4320 7060 7620 -2233 -5723 -99 7534 9466 -5528 -29731
15345b9731m236R116j084K661M361J1370R235j0071j8492J0300M213J0131K796
15332E69P950J0444J1568M457J594Q536L189M15K272l137J1816O16N141J2168
15318G7598Q97n046o838q102j0449j2727l225L531j6547k1729P529J3952p086
15305A1758n768n342M239J3567J2550J2805j9536j7966J5725Q93q835N675J2986
15292C2751o72j0355k2221N034P076J3097j4837p112L026J7041l455j5612L970
15279G731K252j1518p449m736J0471J4585K564j1668r813M018n791j125m220k056
15265a6755q879k968J8645K3455j858J7818M578j0235j0485O21n606j1662J590
15252a741J2216j1831k0186J503J3892M424K1744N156r457k2693j32L156Q377
$$ plain form
15345 -29731 -33967 -24851 -25935 -23274 -18913 -7543 1692 -8379 -26871 -16571 -12358 -2227 569
15332 569 8519 18963 30531 34988 36582 45118 48307 48722 50994 47857 59673 60289 65430 77598
15318 77598 78495 73449 66611 58509 48060 35333 32108 35639 19092 -2637 4892 18844 11758
15305 11758 5990 648 4887 18454 31004 43809 24273 6307 22032 22925 14090 19765 32751
15292 32751 32079 21724 -497 4537 11613 24710 9873 2761 5787 22828 19373 3761 7731
15279 7731 9983 -1535 -8984 -13720 -3249 11336 13900 2232 -7581 -3563 -9354 -10479 -14699 -16755
15265 -16755 -25634 -28602 -9957 13498 11640 29458 34036 23801 13316 13937 8331 -3331 -1741
15252 -1741 10475 -1356 -21542 -20039 -6147 -1723 20021 25177 15720 -6973 -7105 -3949 4428
15239D428R4o061L182j6357o986N173J6326O681N305J0876j8581k2063N45K586
15225a4852M075j5058O665l188M02m787k629O761q39m364L21P248J2475K916r221
15210a4075L767L149Q844p283M056Q362q058p95n497R34p61R293p280r374p321
15195b2039L6153J2911q323j8044l446N014o23r494r080j574j705m079J0054R014
15181e261R667J3222Q688N609j7996n781N832J796p774k4039j0975L698J8339
15168d975k613j2548J0636Q555O300R106j079j2484P170j1800j2908L019K6149
15155A2528n954J304Q580J8672n085P87k4426q919J021o065j6507J0209K0354
15142F499R279q442O15j3270j0836J685Q60q288k085n862J1303j8828J5459N628
$$ plain form
15239 4428 4522 -1539 1643 -14714 -21700 -16527 -201 6480 11785 22661 4080 -17983 -17438 -14852
15225 -14852 -10777 -25835 -19170 -22358 -21956 -26743 -29372 -22611 -23450 -27814 -27493 -20245 -7770 -4854 -14075
15210 -14075 -10308 -7159 1685 -5598 -1542 6820 -1238 -2033 -7530 -6596 -7357 1936 -5344 -14718 -22039
15195 -22039 14114 27025 18702 658 -2788 2226 1603 -7891 -16971 -18545 -20250 -24329 -14275 -5261
15181 -5261 4406 17628 26316 31925 13929 8148 13980 15776 8002 -16037 -27012 -23314 -4975
15168 -4975 -7588 -20136 -9500 -945 5355 14461 13382 898 8068 -3732 -16640 -13621 12528
15155 12528 6574 7878 16458 35130 30045 30832 6406 -2513 -1492 -7557 -24064 -13855 6499
15142 6499 15778 7336 7951 -5319 -16155 -14470 -13610 -21898 -23983 -29845 -18542 -37370 -21911 -16283
15128a6283k501J344j014j269M873l405J8218m318j1908R555l767k448O513J0989
15114D579J0442P71J2642o939j2823j0302P320N412q885P192l004N484k906k3485
15100a4502p53m854J0855Q663q321j956k963M270J1723K042p020q304p37j301
15086a3158j4430n779O991J4193J4042K3177Q191j518p734j5896n537j1617q449
15073a7524O654Q031Q701r065j5361m986J1535L595j1787J260J0440K092L031
15060c384j1490j268L168K0329J0746j0278k1038J2107J1245j0596k0789J368
15048a9880M464n862M343k355J2994J3974r625j8350M377Q277L690K218L870L239
15034E374Q167j480J449p185K633L090m190j3601j3236n032J5942K5485J1391
$$ plain form
15128 -16283 -18784 -17440 -18454 -19723 -14850 -18255 -37 -4355 -16263 -6708 -10475 -12923 -6410 4579
15114 4579 15021 15792 28434 21495 8672 -1630 5690 11102 2217 9409 6405 11889 8983 -14502
15100 -14502 -15255 -20109 -9254 -591 -8912 -10868 -13831 -9561 2162 4204 -2816 -11120 -11857 -13158
15086 -13158 -27588 -33367 -26376 -12183 1859 25036 33227 31709 23975 8079 2542 -9075 -17524
15073 -17524 -10870 -2839 5862 -3203 -18564 -23550 -12015 -8420 -20207 -18947 -8507 -6415 -3384
15060 -3384 -14874 -16142 -12974 7355 18101 7823 -13215 -1108 10137 -459 -21248 -19880
15048 -19880 -15416 -21278 -16935 -19290 -6296 7678 -1947 -20297 -15920 -7643 -3953 -1735 2135 5374
15034 5374 13541 12061 13510 6325 8958 12048 7858 -5743 -18979 -24011 -8069 17416 28807
15021B8807K1141r03J1208j041j9183O711J5081n889j8300m779O988O252j659
15008D4434R728K5888K1969M2673N0721K3387K7568M8270K6507p8330j16901n1675
14996G4239k1646j3169j6022j1326m045r941o107N829J3742L0132j3319q341q885
14983A1141j1338q758Q802J6316R7l466p954O906j5488j4321O189J5498r91J7015
14969A9648J2141o605j4777k1967j2645P126K5380J6035o319j1698j3892n174
14957a2747J0207k239j1661J6774r20j0737j177l964J1826R613p553J0364p005
14944G81q843M857K318N509n189M019J7267J4743P653k2708m649O780P93j878
14930B1453k2015J955J9714p198p317q666r501J2389k2444K245K0804J5671L885
$$ plain form
15021 28807 49948 49045 60253 59212 40029 46740 61821 55932 37632 32853 39841 46093 44434
15008 44434 54162 80050 102019 144692 195413 218800 246368 294638 321145 242815 125914 74239
14996 74239 52593 39424 23402 12076 8031 -1910 -8017 -2188 11554 41686 28367 20026 11141
14983 11141 -197 -8955 -153 16163 16260 12794 4840 11746 -3742 -18063 -11874 3624 2633 19648
14969 19648 31789 25184 10407 -11560 -24205 -17079 8301 24336 18017 6319 -7573 -12747
14957 -12747 -2540 -4779 -16440 334 -586 -11323 -12500 -16464 -4638 4975 -2578 7786 781
14944 781 -8062 -3205 -887 4622 -567 3452 20719 35462 43115 20407 15758 22538 23331 21453
14930 21453 -562 1393 21107 13909 6592 -2074 -11575 814 -21630 -19385 1419 17090 20975
14917B0975n185p663Q429j892J326k094J2533l394j2215m211p028L23J2392M685
14903A6981M821l102L894m390j6143k6604J4695K00r219J3076N240q950j0669
14890b0170J3210N727L308K79l706q433j602O466k226j3306m451J0282m08J4359
14876f71m86k149J965j8704k0665N580J8023K538k687Q115K6370K210k650O185
14862B2974k1804j1686P648j118J713K0655K256j1586r442K386j7720p106J8344
14849d486M692j1439Q102J2899P223L143k013j8258j3089j525M564j657K943j138
14835a0039J2447J4433N759p291j0671r182j0913j3961j451L0253L3789L283r091
14822B7365q912j2739l635q91Q52R018P523L053K530m799O187r10k1063j7934
$$ plain form
14917 20975 15790 8127 16556 14664 15990 13896 26429 23035 10820 6609 -419 -96 12296 16981
14903 16981 21802 18700 22594 18204 2061 -24543 -9848 -9648 -18867 -5791 -551 -9501 -20170
14890 -20170 -6960 -1233 2075 2354 -1352 -9785 -11387 -4921 -7147 -20453 -24904 -14622 -15030 -671
14876 -671 -1157 -3306 -1341 -20045 -40710 -35130 -17107 -14569 -17256 -9141 17229 19439 16789 22974
14862 22974 1170 -10516 -2868 -3986 -2273 18382 20638 9052 -390 1996 -15724 -22830 -4486
14849 -4486 206 -11233 -3131 9768 16991 20134 18121 -137 -13226 -14751 -10187 -11844 -8901 -10039
14835 -10039 2408 16841 22600 15309 4638 -4544 -15457 -29418 -30869 -616 33173 36456 27365
14822 27365 18453 5714 2079 1188 2040 11058 18581 21634 24164 19365 25552 24642 3579 -14355
14808a4355K582R110J4413o137j7063N198N734j168j415J8127m347j4717o569
14795a0607j365J1786o898k948L965J0729J1338J1004M915o439q976J0506l190
14782B3820l7027j7828l347P837Q178K1067N416j1620j1342j8052p069N189j193
14769c5971r753j388N987M901J3433J2220J746r109J148o443l237P953J203M829
14755a2481R082M67l97Q557L055r228K93J5013q567r95R148K0230j5304j0127
14741H746N450J379m318k001J9034J6217j3445k1402k1073k666J447M877K394
14728e361Q197J9423k68k0707r799L788k260J718m737l935J2769J897O301j416
14714E610J7743l572m791m378m822M862j265j1054J1694O897j9668J1316P692
$$ plain form
14808 -14355 -11773 -2663 11750 5613 -11450 -6252 -518 -1686 -3101 15026 10679 -4038 -10607
14795 -10607 -11972 -186 -7084 -10032 -6067 4662 16000 27004 31919 25480 16504 27010 23820
14782 23820 -13207 -31035 -34382 -26545 -18367 2700 8116 -3504 -14846 -32898 -39967 -34778 -35971
14769 -35971 -45724 -47112 -41125 -36224 -22791 -10571 -8825 -17934 -16786 -23229 -26466 -18513 -17310 -12481
14755 -12481 -3399 -2932 -3329 5228 8283 -945 -652 14361 5794 4799 13947 34177 18873 8746
14741 8746 14196 15575 11257 9256 28290 44507 31062 9660 -11413 -14079 -12632 -7755 -5361
14728 -5361 2836 22259 21991 1284 -8515 -4727 -6987 -5269 -10006 -13941 -1172 725 7026 5610
14714 5610 23353 19781 14990 10612 5790 10652 9387 -1667 10027 16924 -2744 8572 16264
14701A6264j6171K838m074N770J1769M008j3934k2469k1407m781M954Q915J0731
14688a7587K1144J5452K570r065O221O12j55J664K551j5319j60Q959o777n07q142
14673A461j436P427l743r514n364N388J826n050o352J600N896J536j2290k618
14659b1233j1178n34J8647K6535Q847N14O732j5475j7864k022J1528K446n459
14646A484M243M116k492q38j7161j6302J0496R166M85J1070j0651r144o283J6047
14632e764P389j4446j0577J1029K6219n23j0925p850J3346J4783j949j840O059
14619B4951P63k3281M394K0196j5756k8000K138P03J1620K084k702J5249P720
14606B0079J8155q347k0046q009K436J1136j5059J058J235n174k2657J968J3868
$$ plain form
14701 16264 93 2931 -1143 4627 16396 20404 6470 -15999 -37406 -42187 -37233 -28318 -17587
14688 -17587 3557 19009 21579 12514 18735 19347 19192 20856 23407 8088 7928 16887 10110 9603 1461
14673 1461 25 7452 3709 -5805 -11169 -5781 -3955 -9005 -15357 -13757 -7861 -6325 -18615 -21233
14659 -21233 -32411 -32945 -14298 12237 21084 21598 28330 12855 -5009 -7031 4497 6943 1484
14646 1484 5727 9843 7351 6513 -10648 -26950 -16454 -7288 -6803 4267 -6384 -15528 -21811 -5764
14632 -5764 1625 -12821 -23398 -12369 13850 13327 2402 -5448 7898 22681 20732 18892 24951
14619 24951 25714 2433 6827 27023 11267 -16733 -14595 -13892 -2272 -188 -2890 12359 20079
14606 20079 38234 29887 9841 1832 4268 15404 345 1403 2638 -2536 -25193 -23225 -9357
14593i357K681N118K5271O07r277k9459q852J4711J6301K411j6398m854o105L539
14579a3663M937l862R021l982m358l341R749J714K972O779J0099L549m690K159
14565A7083J1043n740k70N841k5081k4789j1455K007J3606J3767O77l297J1900
14552E292Q485k727j3215L187j3801J125J257J6377K3576J6332r516k8688j5932
14539h248J2215m987J442J262k0296o54l725K493Q350o688J084J3349n662n60
14525a0625L689K5873n04k4402l911J1205m154p82m086R210K4968p202k941K976
14511A9314j9051n112O080M359J6218j1613P392P393M065q601l2127n99J4858
14498B576M965p36J0219l19j7987k0744J0718J2113j1913J492K2153qo275J511
$$ plain form
14593 -9357 -6676 -1558 23713 24320 15043 -14416 -23268 -8557 7744 10155 -6243 -11097 -17202 -13663
14579 -13663 -8726 -12588 -3567 -7549 -11907 -15248 -5499 -3785 -813 5966 16065 19614 14924 17083
14565 17083 28126 22386 22116 27957 2876 -21913 -33368 -31361 -17755 -3988 -3311 -6608 5292
14552 5292 13777 11050 -2165 1022 -12779 -11654 -10397 5980 29556 45888 36372 7684 -8248
14539 -8248 3967 -1020 422 1684 -18612 -19266 -22991 -20498 -12148 -18836 -17752 -4403 -10065 -10625
14525 -10625 -6936 18937 18433 -5969 -9880 1325 -2829 -3611 -7697 1513 26481 19279 16338 19314
14511 19314 263 -4849 1231 5590 21808 10195 17587 24980 29045 20444 -11683 -12282 2576
14498 2576 7541 6805 17024 16705 -1282 -22026 -11308 805 -11108 -9616 12537 12529 6254 7765
14484G765j2553J347K1787J5493j1238J980o720M149j1957j5232j1304k893J215
14471a8161O598L454r239n442Q543P771j0129M539o097m747J9167J5287R179r529
14457A1194j8840j2594L969K5706N957J686K816j362J8103j0369k600p0k351k808
14443A8437k831k4274n471J3087P997o590j8628R276Q579N505q719m762O201r048
14429a1241m949M045K446J0206L290k4893l402Q840J8994N334q767J345j424k0676
14415b0852O485J2459M065k485P805j837J0866J8607r747j0540n860k67j0551
14402a852m03J4614l864j9543J431P247M713R165J6133k467j8869j8034k6898
14389c8627k61K0425Q303J386n240J5072J736J1305j2023p331M203M27O18o923
$$ plain form
14484 7765 -4788 -3441 18346 33839 22601 24581 17861 22010 10053 -5179 -16483 -19376 -18161
14471 -18161 -11563 -8109 -17348 -22790 -14247 -6476 -16605 -12066 -18163 -22910 -3743 11544 20723 11194
14457 11194 -7646 -20240 -16271 9435 15392 17078 19894 18532 36635 26266 23666 23596 21245 18437
14443 18437 15606 -8668 -14139 -1052 6945 355 -18273 -8997 -418 5087 -3632 -8394 -2193 -11241
14429 -11241 -16190 -12145 -9699 507 3797 -21096 -24498 -15658 3336 8670 -97 1248 -176 -20852
14415 -20852 -14367 -1908 2157 -328 7477 5640 16506 35113 25366 14826 8966 8699 -1852
14402 -1852 -2255 12359 8495 -11048 -9617 -2370 2343 11508 27641 25174 6305 -11729 -38627
14389 -38627 -38888 -18463 -10160 -8774 -14014 1058 2794 14099 2076 -5255 -1052 -625 -7 -6930
14375f930j8441n186J8210Q266P381q588J504l33m179n666K3183m864K201O459
14361A3017M731J7675n026j6790j1476P806L854k4823L728l059L539l259m144
14348a4227M177Q7k25K490N343j6064m565Q884P925K428n414J1595k10R445o282
14333E387j4433j11K134K7209P078o382n393j2772q858j677L30R521L81K883k456
14318B841m233J860k759p642o933J4819J1796L746J3389j4713r487R20J0J599
14304E213Q198j4168l697k84q725K956J4241j3710k216J308M853r346j9406j9086
14290e3869J4118L8043R089j4883j4865m601O386N218k69L992M679p974N554K887
14276f495K628l1278j3203K2983J1199m77P82J3104J2485j2042J1854l294p617
$$ plain form
14375 -6930 -25371 -30557 -12347 -4081 3300 -5288 -3784 -4117 -8296 -13962 9221 4357 6558 13017
14361 13017 17748 35423 30397 13607 2131 9937 13791 -11032 -7304 -10363 -6824 -10083 -14227
14348 -14227 -10050 -9963 -10188 -7698 -2355 -18419 -22984 -14100 -6175 -3747 -9161 2434 2224 11669 5387
14333 5387 -9046 -9157 -7023 20186 27264 20882 15489 2717 -6141 -7818 -7488 2033 2414 5297 2841
14318 2841 -1392 468 -2291 -9933 -16866 -2047 9749 13495 26884 12171 2684 3604 3614 5213
14304 5213 13411 -757 -4454 -4738 -13463 -10507 3734 -9976 -12192 -10884 -6031 -15377 -34783 -53869
14290 -53869 -39751 -1708 7381 -7502 -22367 -26968 -20582 -15364 -15633 -11641 -6962 -14936 -9382 -6495
14276 -6495 -3867 -35145 -48348 -25365 -14166 -14643 -13861 -757 11728 -314 11540 8246 629
14263F29K613k507j4251j0098J1238P795N512o110n432O501r358j644K9754J2780
14249B7422j5790r097n112R760j059n374J617l551n736k007j2695N315M572j3996
14235b5731L165J1773J1706j093j3203p078O442J6937N083k1987j8708m940L180
14222c4454J0275O636J7195P831J9280P74j5942o832l892j099J1274O718o232
14209A1532j4231l607O154J9847p007R762J9966j5462j0632j344j1633j1634l619
14196a1908J1658Q411p393N103j5287o108j4667J8L940K1763M761J97j4689q0
14182a4281q92O286J3532J0687O472n832j0105j6890N623J5275O454O90R757k752
14168B4024r545k98l82K697m60L460J7004j960j8179l555n037l307j6232j2925
$$ plain form
14263 629 3242 735 -13516 -23614 -12376 -4581 931 -5179 -10611 -4110 -13468 -15112 14642 27422
14249 27422 11632 2535 -2577 7183 6124 750 2367 -1184 -6920 -8927 -21622 -16307 -11735 -25731
14235 -25731 -22566 -10793 913 -180 -13383 -20461 -14019 2918 8001 -13986 -32694 -37634 -34454
14222 -34454 -24179 -17543 -348 7483 26763 27537 11595 4763 871 -228 11046 17764 11532
14209 11532 -2699 -6306 -152 19695 12688 22450 42416 26954 16322 14978 3345 -8289 -11908
14196 -11908 -250 8161 768 5871 -9416 -15524 -30191 -30173 -26233 -4470 291 488 -14201 -14281
14182 -14281 -15173 -8887 4645 15332 21804 15972 5867 -11023 -5400 9875 16329 17019 26776 24024
14168 24024 14479 14181 13799 16496 16036 19496 36500 34540 16361 12806 7769 4462 -11770 -24695
14154b4695j0886J646O509J3090j796M07o151N809K182M239J9253Q341k059P238
14140B3127k4j3727l569l551q106l783j6387j1974J373k348J3467K3703J3823
14127A2024O42j1909q711J973P919O447j660P193k68L105j1333j3506j92q327
14113a6603O664J1394q472l005o195M823Q008l30J0628R956q997O438R945n36
14099B3718o941m118r735Q930N012j0704k0338j0960P130L512O288N102q458Q837
14085b725J0340M729l749l819j431K766j4753P04j6767J0437K1587l906j8164
14072a4751m038P928k964n878M258J6851J2552j910K751p837J4668j412j7931
14059B287j3890k239L373K577L523l562L641K420J6194p218p159P016q996K923
$$ plain form
14154 -24695 -35581 -33935 -27426 -14336 -16132 -15725 -21876 -16067 -13885 -9646 9607 17948 15889 23127
14140 23127 23103 9376 5807 2256 -5850 -9633 -26020 -37994 -36621 -38969 -25502 -1799 12024
14127 12024 12666 757 -7954 -5981 1938 8385 6725 13918 13650 16755 5422 -8084 -8276 -16603
14113 -16603 -9939 1455 -7017 -10022 -16217 -11394 -3386 -3716 6912 16868 7871 14309 24254 23718
14099 23718 16777 12659 2924 11854 16866 6162 -14176 -25136 -18006 -14494 -8206 -3104 -11562 -2725
14085 -2725 7615 12344 8595 4776 3345 6111 -8642 -7938 -24705 -14268 7319 3413 -14751
14072 -14751 -18789 -10861 -13825 -19703 -15445 1406 13958 12048 14799 6962 21630 20218 2287
14059 2287 -11603 -13842 -10469 -7892 -4369 -7931 -4290 -1870 14324 7106 -53 6963 -2033 890
14045H90L816J2571l116q922J279l989J3362J0797j4947j0997k663k563J697k904
14031e689q791l624L852j009J524n561J5990J3757p978K515L947J2544r915j1959
14017c97M030L909R941Q621J313k586l46R352P134k1388k3609N268J322n171k5750
14002b8357o764J1620K4367J5387N533j9047j2134q891J4263P565n410j497k417
13989e782J283K0554k173p711p348j925M346K0655N428o220j6063j0671p722l076
13975a6425O06M433K7584L19k1258J3740J4607n316j5456k17j875m06K98j394
13961g60j1262p605j166J3899L614J1358P496R815j900o048j2837r056J0992o503
13947C7K598M176R708n657N977j907R467o522p586q50r372p935M866n360J5894
$$ plain form
14045 890 4706 17277 14161 5239 6518 2529 15891 26688 11741 744 -1919 -4482 -2785 -5689
14031 -5689 -14480 -18104 -14252 -15261 -13737 -19298 -3308 10449 2471 4986 8933 21477 11562 -397
14017 -397 3633 7542 17483 26104 27417 24831 24485 33837 40971 19583 -4026 1242 2564 -2607 -28357
14002 -28357 -35121 -23501 866 16253 21786 2739 -9395 -18286 -4023 3542 -1868 -3365 -5782
13989 -5782 -4499 16055 13882 6171 -1177 -3102 1244 21899 27327 21107 5044 -5627 -13349 -16425
13975 -16425 -15819 -11386 16198 16517 -4741 8999 23606 18290 2834 2617 742 336 634 -760
13961 -760 -12022 -19627 -20793 -6894 -3280 8078 15574 25389 23489 17441 4604 -4452 6540 37
13947 37 2635 6811 16519 10862 16839 14932 24399 17877 10291 9441 69 -7866 -3000 -8360 7534
13932G534K1014n675k0668l807o777R645J4397J167j0039q302o66J214L35J2786
13918A2158k6473j4067J073R573P012M47n129M523R913l607k807J1941Q849k643
13904A0763P967J7453n806k4068j8533m183J5791M783p804L290k369j9689k86
13891b2691N428j044P786J9907j1404k2692m658q38J9436J8530o342n336J830
13878b088p727J1290L074j3868J2979J483J4932J0403j1253j0826q361L665L489
13865G192K434M663M701j425J805p982q598l319k008k0221m653J1487J0731J2215
13851G022m785p276P054K413J740M934j0197p281J9089O405P257J2101j6208k1078
13837A190p923O815p738R851P079J5747j2458j1046q720l586M177J030q862J0777
$$ plain form
13932 7534 28548 22873 2205 -1602 -8379 1266 15663 16830 6791 -1511 -2177 -963 -628 12158
13918 12158 -14315 -28382 -27309 -17736 -10724 -10277 -15406 -10883 -970 -4577 -7384 4557 13406 10763
13904 10763 18730 36183 30377 6309 -12224 -16407 -616 4167 -3637 -347 -2716 -22405 -22691
13891 -22691 -17263 -18307 -10521 9386 -2018 -24710 -29368 -30206 -10770 7760 1418 -3918 -2088
13878 -2088 -9815 1475 4549 -9319 3660 5143 20075 30478 19225 8399 38 3703 7192
13865 7192 9626 14289 18990 17565 19370 11388 2790 -529 -2537 -22758 -27411 -15924 -5193 7022
13851 7022 2237 -5039 2015 4428 6168 11102 905 -6376 12713 19118 26375 38476 22268 1190
13837 1190 -6733 82 -7656 2195 9274 25021 12563 1517 -7203 -10789 -6612 -5582 -14444 -3667
13823c667K0019p684k0427l390N130l854M644N538J0902P661K843j4101J6759
13810B0373O033j1750m463j893o305n202p63J573j463J2964L008L720J4850j8419
13796A2263j3369M875K3909r632k0550q547N491J0164m110k925J1432L068j588
13783A0481j2290k2974p23J9167J4952r967K0870J3420m318O979j5455l165J1345
13770B8322N768j8571k1241L024m099r856J2018J7940J0034K017j604j5134N364
13757A3982j064o851j381j3634n091J0561j0234j6475J812M216J146K4238J4124
13744A5349n183O12J3158p500j5829o959L925J3232q743r424r556j3980J0670
13731b0228J8449o93k4J8015J397J1543q576l890O744L121Q091j2082L377j0824
$$ plain form
13823 -3667 16352 8668 -11759 -15149 -10019 -13873 -9229 -3691 7211 14872 17715 3614 20373
13810 20373 26406 14656 10193 8300 1995 -3207 -3970 -2397 -3860 9104 12112 15832 30682 12263
13796 12263 -1106 3769 27678 18046 -2504 -11051 -5560 4604 494 -2431 9001 12069 10481
13783 10481 -1809 -24783 -25506 -6339 8613 -1354 19516 32936 28618 35597 20142 16977 28322
13770 28322 34090 15519 -5722 -2698 -6797 -16653 -4635 13305 23339 25356 23752 8618 13982
13757 13982 12918 6067 4686 -8948 -14039 -3478 -13712 -30187 -28375 -24159 -23013 1225 15349
13744 15349 10166 10778 23936 16436 607 -6352 -2427 10805 2062 -7362 -16918 -30898 -20228
13731 -20228 -1779 -2472 -2496 15519 16916 28459 19883 15993 22737 25858 33949 21867 25244 14420
13717A4420K682j016k0090k061Q987n368k769K324k900R981J3919m791N995j1929
13703G384j6700p506j923K199O987j10L18m952Q707J1189J4389j3235p388m663
13689e304J2538m54j2591k0869k818n409J0315J886k455j210R55J2085P985P228
13675A882j0335j495J2524J0264l1375j4994J6856J9945J2366m877M377j0346
13663D792R42J4142J1374j88k0773o151J2340m31r353K593j24L693P736n874O925
13648B1643K668O423p033o072k4896j6663k650N062J3189J8434N931L741o709
13635A3068j1903L678M087n544L33q146n790R884P181L240p592j4485j1316n154
13621b8459m136J2745J4318J4540p169q606J6079N119k3993K766j715m191N793
$$ plain form
13717 14420 17102 16086 -4004 -6065 2922 -2446 -5215 -2891 -5791 4190 18109 13318 19313 7384
13703 7384 -9316 -16822 -18745 -16546 -9559 -9669 -9351 -14303 -5596 5593 19982 6747 -641 -5304
13689 -5304 7234 6780 -5811 -26680 -29498 -34907 -24592 -22706 -25161 -26371 -25416 -13331 -5346 1882
13675 1882 -8453 -9948 2576 12840 -18535 -33529 -16673 3272 15638 10761 15138 4792
13663 4792 5734 19876 31250 31062 10289 4138 16478 16047 6694 9287 9163 12856 20592 14718 21643
13648 21643 24311 30734 23701 17629 -7267 -23930 -26580 -21518 -8329 10105 16036 19777 13068
13635 13068 1165 4843 8930 3386 3719 -4427 -10217 -333 6848 10088 2496 -11989 -23305 -28459
13621 -28459 -32595 -19850 -5532 9008 1839 -6767 9312 14431 -9562 -6796 -8511 -12702 -6909
13608f909n762M183r325j2407R486m431l334K7927J6769J217K15k973O327J683
13594B2666P646L698j717J768N917n310j3487N819K909m884P928l958O695J6748
13580E2438j2726P01Q000j9547k2259M909K2338p705j8140o035R778l302j907
13567F543J600p739k696J076R548m537p451p046k595J431R322J703J3751K740
13553A5650M134N703q579l1757k0597L855Q027Q513K1534Q027p690k5056k53J6389
13539b100N273Q02o12M93q052l99J3370O135j301k295L066j67P528N378P331j780
13523C2670j3454j3280n728j0272L564J5380j317l936N49J1005O815k2624o789
13510g417K847n56J7432P968j2424n550m738j2k470M094J0331J2898J6223j1672
$$ plain form
13608 -6909 -12671 -8488 -17813 -30220 -20734 -25165 -28499 -572 16197 17414 17629 14656 20983 22666
13594 22666 30312 34010 32293 34061 39978 34668 21181 27000 29909 25025 32953 28995 35690 52438
13580 52438 39712 40413 48413 28866 6607 11516 33854 26149 8009 1974 11752 8450 6543
13567 6543 8143 404 -2292 -1216 8332 3795 -3656 -10702 -13297 -11866 -2544 -841 12910 15650
13553 15650 19784 25487 16908 -14849 -35446 -31591 -23564 -15051 6483 14510 6820 -18236 -18489 -2100
13539 -2100 3173 3975 3363 3856 -4196 -4595 8775 14910 13609 11314 14380 14213 21741 27119 34450 32670
13523 32670 19216 5936 208 -10064 -6500 8880 7563 3627 4176 15181 21996 -628 -7417
13510 -7417 -4570 -5126 12306 20274 7850 2300 -2438 -2450 -4920 -826 9505 22403 38626 26954
13496B6954p924J146j0088l961j7851N432J4852O637R28M921k0483o24K571J580
13482D090o2k826J107j25m639J2575M840j3708k0963L240Q796P504n474L281N381
13467C017k862N402J1432j3427J921J3169O700j0624n674k377j3155Q529P817
13454I868J27m699L756j872J479J3251j7186k6047j309M911j692R736R378K890
13440B591P430J639L317j0943j6566Q95K7429M286n929o363j8448N19R682O344
13426E883J367O438j2189j0359k601k368J3858J1842j314J1299m550o472j4855
13413d021m231j455j2834J693J0827O631N860q875j3158j3135O4P380L943k154
13399b3465R691O252J8863O030j5800j0966J6112L261j590j1859r20q89k225P696
$$ plain form
13496 26954 19030 20176 10088 6127 -11724 -6292 8560 15197 16125 21046 563 -61 2510 4090
13482 4090 4028 1202 2309 2184 -2455 10120 14960 1252 -19711 -16471 -7675 -171 -5645 -2364 3017
13467 3017 155 5557 16989 3562 5483 18652 25352 14728 9054 6677 -6478 2051 9868
13454 9868 9995 5296 9052 7180 8659 21910 4724 -21323 -22632 -17721 -19413 -9677 -299 2591
13440 2591 10021 11660 14977 4034 -12532 -11637 15792 20078 14149 7786 -10662 -10143 -461 5883
13426 5883 7250 13688 1499 -8860 -11461 -13829 29 11871 10557 21856 17306 10834 -4021
13413 -4021 -8252 -9707 -22541 -20848 -10021 -3390 2470 -6405 -19563 -32698 -32634 -25254 -21311 -23465
13399 -23465 -13774 -7522 11341 17371 1571 -9395 6717 9978 8388 -3471 -4391 -5280 -7505 191
13385A91J3509k825q850j0689Q136L398K325J27j019L787L4r211o894N200K5950
13370B3169J0703j4626j4411j0204J0218J0730j1152J0602L219j6207j1504O212
13358c251J698p471q330J501n589J178j798P571m776J5101J3654q605J3964j1029
13344C818r206J0244j2383j6240l455P891J2652Q693j3398N12O373q642q111j1675
13330c2927n346K1500K4809N489M088R942n543j4009N031j0989j421p458j2739
13317a9573j3315j1524J1072J4736J9542m660n749l951k852R320J951N682L296
13304C975p025L351p228j3295J2048K6160M425l462r175k0642J2058P846p242
13291A794q965J4261K6666j074j7732j8552N233m932n402N645O469J2951j0008
$$ plain form
13385 191 13700 10875 2025 -8664 -528 2870 5195 5322 4303 8090 8124 -1087 -7981 -2781 23169
13370 23169 33872 19246 4835 -5369 4849 15579 4427 15029 18248 2041 -9463 -3251
13358 -3251 -1553 -9024 -17354 -15853 -21442 -20264 -22062 -14491 -19267 -4166 9488 883 14847 3818
13344 3818 -5388 4856 -7527 -23767 -27222 -19331 -6679 2014 -11384 -10872 -4499 -13141 -21252 -32927
13330 -32927 -38273 -16773 8036 13525 17613 27555 22012 8003 13034 2045 624 -6834 -19573
13317 -19573 -32888 -44412 -33340 -18604 938 -3722 -9471 -13422 -16274 -6954 -5003 679 3975
13304 3975 -3050 301 -6927 -20222 -8174 17986 22411 18949 9774 -10868 1190 9036 1794
13291 1794 -7171 7090 33756 32682 14950 -3602 1631 -3301 -8703 -3058 3411 16362 6354
13278F354J311P696p759J620K929R818m611j3714m979j2281j8003P134J9928K853
13264a704n230J809R66r769j852J7390m550r321R44N968N322r12r860L501q980
13249a6278Q196o869J136K6265L347m204J668j2913o272J2520j0069k351j2001
13236a7825J0329K4199L949n001nP120k41j2649j4532q210p767O583N10q73M173
13221a0240r427p609P855J6090n790N823J3511p433j4008K8152J9251l2719L303
13208F759N331M281K946n593K793k0O582q757o724Q560l522p744l896k1042N454
13193a4592K5251j072N61O76L800k314p571n963R953M166m352L510j1056j8720
13179a7723M526K2879J4201r262j6899J4133J5261j8616j2159q776R1J0276k731
$$ plain form
13278 6354 7665 15361 7602 9222 12151 21969 17358 3644 -1335 -13616 -31619 -24485 -4557 -1704
13264 -1704 -6934 -5125 -4159 -13928 -15780 1610 -2940 -12261 -11317 -5349 -27 -939 -10799 -7298 -16278
13249 -16278 -8082 -14951 -13815 12450 15797 11593 13261 348 -5924 6596 -3473 -5824 -17825
13236 -17825 -7496 16703 20652 15651 15646 22766 22525 9876 -4656 -12866 -20633 -14050 -13540 -14413 -10240
13221 -10240 -19667 -27276 -19421 -3331 -9121 -3298 10213 2780 -11228 16924 36175 3456 6759
13208 6759 12090 16371 19317 13724 16517 16497 23079 14322 7598 16158 12636 4892 996 -20046 -14592
13193 -14592 10659 9587 10148 10824 14624 12310 4739 -1224 8729 12895 8543 12053 997 -17723
13179 -17723 -13197 9682 23883 14621 -2278 11855 27116 8500 -3659 -12435 -12344 -2068 -4799
13166d799K094M907p629j7901J0792O743J5665n532j103j124K886l781p400Q647
13152B465o14l809l373J4033J1366r240j9340l426J6615M363J7450j96j2061j2094
13138B139k5922J14R346J047J1787L566k590j5310j709K3757J4186j6870j3721
13125a0180N378m685n332q060K492j519J6684J1815R34l898R400l240k9915J7060
13111c066J0465L341L900j1749m892j2447j4718q068J6802p263J94J1850m605
13098b0256N229P046q798P303J6232J3007o983j5628J086J4355j5114q217M84
13085a0254R055K38l09j609L65j2871O49K962o508q7P991j4236j1621R804J6589
13070i842J6571J902q927j7701l630J0516l187j2225J1103K450O781M727Q807
$$ plain form
13166 -4799 -2705 2202 -5427 -23328 -12536 -5793 9872 4340 3237 2113 4999 1218 -6182 2465
13152 2465 1851 -1958 -5331 8702 20068 10828 -8512 -11938 4677 9040 26490 26294 14233 2139
13138 2139 -23783 -23669 -14323 -13276 -1489 2077 -513 -15823 -17532 6225 20411 3541 -10180
13125 -10180 -4802 -9487 -14819 -22879 -20387 -21906 -5222 6593 7527 3629 13029 9789 -20126 -3066
13111 -3066 7399 10740 14640 2891 -2001 -14448 -29166 -37234 -20432 -27695 -27501 -15651 -20256
13098 -20256 -15027 -7981 -16779 -9476 6756 19763 12780 -2848 -1762 12593 -2521 -10738 -10254
13085 -10254 -1199 -961 -1270 -2879 -2514 -15385 -14736 -11774 -18282 -18369 -10378 -24614 -36235 -26431 -9842
13070 -9842 6729 8631 -296 -17997 -21627 -11111 -14298 -26523 -15420 -12970 -6189 -1462 7345
13057G345L246M18k707J319L811J0212J0393j0150n052k4259k8324l818K4264
13044a3302K5078O315q255K642n85n377q053j9128l009J9063O642J000N658l389
13030E300J546j1084k753j3924J1121K2878P243q621p577m362N655J7482l111
13017A9793p663j6570r891N603Q303N804o066k2434j422K590O529L377L478J7415
13003H846n37L232N981K410j730r272o006m26o085k04J0441r393j3459l587K1611
12988A822J3975j8003j2267J650k3089J2914K6740j462Q956N044j4217j3603P152
12975d388J3530k668J63N705R920J1541J1257Q187q041j8957M992N132j4292r424
12961A2657O957J7282r016l4642k017J7947J2305r492o466N059J2350j348l466
$$ plain form
13057 7345 10591 11009 8302 9621 13432 23644 34037 23887 18835 -5424 -33748 -37566 -13302
13044 -13302 11776 18091 9836 12478 11893 6516 -1537 -20665 -23674 -4611 2031 3031 8689 5300
13030 5300 6846 -4238 -6991 -20915 -9794 13084 20327 11706 4129 -233 5422 22904 19793
13017 19793 12130 -4440 -14331 -8728 -425 5379 -687 -23121 -24543 -21953 -15424 -12047 -8569 8846
13003 8846 8309 11541 17522 19932 18202 8930 2924 2498 -3587 -3791 6650 -2743 -16202 -19789 1822
12988 1822 15797 -2206 -14473 -12823 -35912 -22998 3742 2280 11236 16280 2063 -11540 -4388
12975 -4388 9142 6474 6637 12342 22262 33803 45060 53247 45206 26249 31241 36373 22081 12657
12961 12657 19614 36896 27880 -6762 -8779 9168 21473 11981 5515 10574 22924 21576 18110
12948A8110q200r605p448Q796K0202Q646j407j7548j8320K885J568j1668N880
12935h109P836l139J782J7155J1288j3283p167j3719N74p819k970M574J4595Q378
12921I976L275o95m995j2011j2966j1005J2372J1495J917J816Q58j88O09p285
12907f827j5099k868J4271R900l66j2046l913K474L790m920P012m130l969K0009
12893C318M267K813n052M446j2605n147N368r56j1252j5600Q304J2360Q654J1871
12879A0789J764N741m312q689k908k799n188R16K1759J5939j595k657j2088j7748
12865a076j3860j6613N947j136k743J1560K943K753J0539j3895r783L3567J0768
12852A8971j229L999l616q102p585j7568l303J8160J6577N003l700n945k029j742
$$ plain form
12948 18110 9910 305 -7143 1653 21855 30501 29094 11546 -6774 -3889 -2321 -13989 -8109
12935 -8109 -273 -3412 -1630 15525 26813 13530 6363 -7356 -6782 -14601 -17571 -12997 1598 9976
12921 9976 13251 12556 7561 -4450 -17416 -28421 -16049 -4554 -2637 -821 37 -151 458 -6827
12907 -6827 -21926 -24794 -10523 -623 -989 -13035 -16948 -14474 -10684 -15604 -8592 -12722 -16691 3318
12893 3318 7585 10398 5346 9792 -2813 -7960 -2592 -3548 -14800 -30400 -22096 -9736 -1082 10789
12879 10789 12553 18294 13982 5293 2385 -414 -5602 -4686 17073 33012 31417 28760 16672 -1076
12865 -1076 -14936 -31549 -25602 -26738 -29481 -17921 -14978 -12225 -1686 -15581 -25364 8203 18971
12852 18971 17742 21741 18125 10023 2438 -15130 -18433 -273 16304 21307 17607 11662 9633 7891
12838G891j1554r677K503K6883K8757o186q861o109J3523n075l1248k6342N953
12825a9542J4215P053J3525M540k8292j539R892O87m736o558l214J1970k9p854
12811i882J1208Q137j4752J0281R711k033Q858m891o951j443J007n87R527l759
12797A4431j863l902n018J548L877J3463j5249j1152N639R444m86J4107K396p380
12783A9855j4435j8345N305L39N800J046l516O233J2281J1J861j6897r028K596
12769f894K033J6306J67q715N24N105P904K389p943j4799L389j1080r517O833
12755a4298J554j0052j3373L970L764j219Q795Q535P155m391j2203K062J7758
12742a943j6858o782M682K682j0246Q237R688K650r299J539R349K169M493M293
$$ plain form
12838 7891 -3663 -13340 -10837 16046 44803 38617 29756 23647 37170 32095 847 -25495 -19542
12825 -19542 -5327 1726 15251 19791 -8501 -10040 -148 539 -4197 -10755 -13969 -1999 -2028 -9882
12811 -9882 1326 9463 -5289 4992 14703 12670 21528 16637 9686 8243 9250 8663 18190 14431
12797 14431 12568 8666 3648 5196 9073 22536 7287 -3865 1774 11218 10732 24839 27235 19855
12783 19855 5420 -12925 -7620 -7281 -1481 -435 -3951 2282 14563 14574 16435 -462 -9490 -6894
12769 -6894 -4861 11445 11612 2897 3421 8526 16430 18819 10876 -3923 -534 -11614 -21131 -14298
12755 -14298 -12744 -22796 -36169 -32199 -28435 -29654 -20859 -12324 -5169 -9560 -21763 -19701 -1943
12742 -1943 -18801 -25583 -20901 -18219 -28465 -20228 -10540 -7890 -17189 -15650 -6301 -4132 361 4654
12728D654k343l085l668R473r538j0648j0893n968K0221J3416j2886J29q040k0324
12714c9500L526J9570K1670R980k0771j1627J0052N145K294J821o212j3731Q795
12701h988q49l733R409P896J154M163j909j7853o672Q796J3791K451J2389p213
12687A2832m835J86L583L44L0J0154m651j6512J864L927j2253r619K03r502P006
12672a7243q333Q700J2733R183O975P439q756r269J0976m580k2176j2859p19J3730
12658a4199r70L859m34Q768l859j428r83N89J2955P089j0315J3563J096n054p417
12643C260J8738Q689J941L636R645j6276j2480j6697l206l094M93l970j123p272
12629a7716O210N306L775K433k242p228m53m93J2601l169o161Q717J3940J454
$$ plain form
12728 4654 2311 -774 -4442 5031 -4507 -15155 -26048 -32016 -11795 1621 -11265 -11136 -19176 -39500
12714 -39500 -35974 -16404 5266 15246 -5525 -17152 -7100 -1955 339 2160 -4052 -17783 -8988
12701 -8988 -9837 -13570 -4161 3735 4889 9052 7143 -10710 -17382 -8586 5205 7656 20045 12832
12687 12832 7997 8183 11766 12110 12140 22294 17643 1131 2995 6922 -5331 -14950 -14747 -24249 -17243
12672 -17243 -25576 -16876 -4143 5040 12015 19454 10698 1429 12405 7825 -14351 -27210 -27929 -14199
12658 -14199 -15169 -11310 -11744 -2976 -6835 -8263 -9246 -8657 4298 11387 1072 14635 15731 10677 3260
12643 3260 21998 30687 32628 36264 45909 29633 17153 456 -2750 -5844 -5351 -9321 -10444 -17716
12629 -17716 -11506 -6200 -2425 8 -2234 -9462 -9915 -10408 2193 -976 -7137 1580 15520 16974
12615A6974m625p712j5343L980Q57j977r059j740L313l076q016J1575J5946L707
12601D804K82N665Q747j1679m109J1253n752k0657J32J83k451l302L610l670l299
12586b0243j1537q136J4501J5890J081r944R235J3496n310j5347R37L529K909
12573h939K321Q238J842j641k008J145J40r391k880J1298L514r227k692J0076
12559A796r60N065J039k589K232p51r690J9332J0905n626m609m720J1635J4510
12545C7569P334J1813m661j7959j3718J340J4822L777j2799j2819m868m670q764
12532c603p286o938J31P608K736m228L634M096J0999q485l090M245q692L391Q592
12517C110P509Q866q234l3148n67J7578Q206K0305K463j3345j4436o592l973P422
$$ plain form
12615 16974 12349 4637 -10706 -6726 -5869 -7846 -16905 -18645 -15332 -18408 -26424 -14849 1097 4804
12601 4804 5086 10751 19498 7819 3710 14963 9211 -11446 -11314 -11131 -13582 -16884 -13274 -16944 -20243
12586 -20243 -31780 -39916 -25415 -9525 -8444 -18388 -9153 4343 -967 -16314 -15377 -11848 -8939
12573 -8939 -6618 1620 3462 1821 -187 958 1098 -8293 -11173 125 3639 -5588 -8280 1796
12559 1796 836 5901 6940 4351 6583 5832 -3858 15474 26379 20753 16144 11424 23059 37569
12545 37569 44903 56716 52055 34096 20378 21718 36540 40317 27518 14699 9831 5161 -3603
12532 -3603 -10889 -17827 -17696 -10088 -7352 -11580 -7946 -3850 7149 -1336 -4426 -181 -8873 -5482 3110
12517 3110 10619 19485 11251 -21897 -22464 -4886 3320 23625 26088 12743 -1693 -8285 -12258 -4836
12503d836l638M144k165n403L089j1150M983J5354j224q076J2568J1345j736j5948
12489b693m935K771J1171M743K993n621r479N749N838j9179j2474P776J1741M404
12475B805L299L056K1668J0303p218j2622j4448kO424J707j2551m016m557J149
12461e003M803J3535J1933j820o84k2769m020R914r378j6746k588J0004Q107P961
12447C249p041J802K539J33l129J0949k4185k6246M771J8462K6888K2276p226
12434B3242j7576p517J3098r11M652j309j046J4490j3254j2893j3557k601o40
12421a5822J373p773J3477J4625o48r574j427N091J5643j1542J0556N482P645
12408B7106j1821k1160M152J2497l561j4862p652J9565O35o243O952L0130P676
$$ plain form
12503 -4836 -8474 -4330 -6495 -11898 -8809 -19959 -14976 378 -846 -8922 3646 14991 13255 -2693
12489 -2693 -7628 -4857 6314 11057 14050 8429 -1050 4699 10537 -8642 -21116 -13340 -1599 2805
12475 2805 6104 9160 30828 41131 33913 21291 6843 6841 13265 14972 2421 -1595 -6152 -5003
12461 -5003 -200 13335 25268 23448 22764 -5 -4025 5889 -3489 -20235 -22823 -12819 -4712 3249
12447 3249 -3792 -1990 549 682 -2447 8502 -15683 -41929 -37158 -18696 8192 30468 23242
12434 23242 5666 -1851 11247 10336 14988 13679 12633 27123 13869 976 -12581 -15182 -15822
12421 -15822 -14449 -22222 -8745 5880 5232 -4342 -5769 -678 14965 3423 13979 19461 27106
12408 27106 15285 -5875 -1723 10774 7213 -7649 -15301 4264 4899 -1344 5608 35738 43414
12395D3414k52k7129j0654M604O554L390j6471p940O108Q797j7878r366M680J9344
12381G201K4071l254p939J0926L712K759o422k007N764j288O411q89j2279o865
12367A9901m219k058m48j66j883j57m259j3195j1494Q183K4847j2368j7857J2127
12353c046J251K781l713M721m039Q887J4150k410j4388J177k448k236M764k787
12339B664J5186m259j0599n06j3190l51R494o814J2547K4230r186j3831k9460
12326b4075J8337J4036q095J6254K2196j3781J099j1143L584k221j1126r031O809
12313B843R767j2210p530l035Q137K418O633j1808L116O18N910J0880n023P874
12299A8590J7766j0593j3692j9362j6224j697J3839O204Q734k543P56m426j998
$$ plain form
12395 43414 43162 16033 5379 9983 16537 19927 3456 -4484 1624 10421 -7457 -16823 -12143 7201
12381 7201 31272 28018 20079 31005 34717 37476 31054 29047 34811 33523 39934 39045 26766 19901
12367 19901 15682 13624 13176 13010 11127 10970 6711 -6484 -17978 -9795 15052 2684 -15173 -3046
12353 -3046 -1795 986 -2727 1994 -2045 6842 20992 18582 4194 5371 2923 687 5451 2664
12339 2664 17850 13591 2992 2486 -10704 -11055 -1561 -8375 4172 28402 19216 5385 -24075
12326 -24075 -5738 8298 203 16457 38653 24872 25971 14828 18412 16191 5065 -3966 2843
12313 2843 12610 400 -7130 -10165 -2028 390 7023 -4785 -1669 -1051 4859 15739 10716 18590
12299 18590 36356 25763 12071 -7291 -23515 -25212 -11373 -5169 3565 1022 1778 -2648 -4646
12286d646K488N291J1960j753j1352k2386J3479P12j2646j044j2632J7910K2442
12273G823L066J3642J1952j5521l443R772j4730q002Q913q973p85j5286q290R265
12259a0597K1011J7738k875M611j9165j0272J7134P537n725j3532J7657K2315
12247D5837j3032k4186j1272N789K5553o876k532o635j1450o495m575J6547Q328
12234A5001J3477L378k5328k1078R097J2993p528j5391K373m632J0029L621j5844
12221a9832k140O277J4440N836P800r562P810K256j422j6614J344Q232K372j0615
12207c818P064Q472j1919j9704j3171J3447J7108J6497M979K791k647q692j6012
12194e605j5724p78R595m592q630k528O368J0655J6766n796n913K2252P161j9544
$$ plain form
12286 -4646 -2158 3133 15093 13340 1988 -20398 -6919 -6207 -18853 -19897 -32529 -14619 7823
12273 7823 10889 24531 36483 20962 17519 27291 12561 4559 13472 4499 3714 -11572 -19862 -10597
12259 -10597 10414 28152 25277 29888 10723 451 17585 25122 19397 5865 23522 45837
12247 45837 32805 8619 -2653 3136 28689 21813 19281 12646 1196 -5299 -9874 6673 15001
12234 15001 28478 31856 6528 -14550 -5453 7540 12 -15379 -13006 -17638 -7609 -3988 -19832
12221 -19832 -21972 -15695 -1255 4581 12381 2819 10629 12885 11463 -5151 -3807 4425 6797 -3818
12207 -3818 3246 11718 -201 -19905 -33076 -19629 -2521 13976 18955 21746 19099 10407 -5605
12194 -5605 -21329 -22107 -12512 -17104 -25734 -28262 -21894 -11239 5527 -269 -6182 16070 23231 3687
12180C687j2789l219J8333J3547k443J031j2477j1194O378J7834R18Q885q161
12167B0330L056J5125N488p277o834q680q049l762M105R736n894K674L301O301
12153B9620J0145O46r57J0678j154j1145j2873K0667R624k1592j9136o285n7q47
12139G334Q824J4657j0002M462j042P74N458n431j4590N296j4770j7341J3288
12126c083J0000M504L099J7175O517L25j1896j7143j164K250k280J1431Q319j1197
12112A6857Q9O204k6634j7344J5197p15L425Q653k3443j6827J4727J1407K0565
12099A2161J6376N183j5065j6722M741j8555J649J2554N850j012L113K29J89P306
12085A7997l840k5171j7778P815K0804J607K089J2020J6889K225j8344j0687j3480
$$ plain form
12180 3687 -9102 -12321 6012 19559 17116 18147 5670 -5524 854 18688 19606 28491 20330
12167 20330 23386 38511 43999 36722 29888 21208 13159 9397 13502 23238 17344 20018 23319 29620
12153 29620 39765 40411 39454 50132 48978 37833 24960 45627 55251 33659 14523 8238 8181 7334
12139 7334 16158 30815 20813 25275 24233 25007 30465 25034 10444 15740 970 -16371 -3083
12126 -3083 6917 11421 14520 31695 38212 38537 26641 9498 8334 10584 8304 19735 28054 16857
12112 16857 16946 23150 -3484 -20828 -5631 -6346 -2921 5732 -17711 -34538 -19811 -8404 12161
12099 12161 28537 33720 18655 1933 6674 -11881 -10232 2322 8172 7160 10273 10502 10691 17997
12085 17997 14157 -11014 -28792 -20977 -173 1434 3523 15543 32432 34657 16313 5626 -7854
12072g854K4723R520k215k7208j3168K222L565K5426q370j6256p487J0345K9516
12059B2759j2793j736j003p40M163q890J5362p076j6871J6143Q448K555k74M439
12045B4486P619r466j1070k873j281R618K829n544k2688j185M817L3006J1328
12032C9596P200k244j5729j3496j0664j0083J4522J4353p868p237J587K2637M630
12019C7204j901Q093k250k368j4044k2799J3745J5639k092j2718j4823j7948q981
12006b5243K1869O502m572k571o757r232M423J2250J0135M556o52p836M893O37
11992H402J5019N800k5899k5857o369q683Q019N457J561N733P185J0829q069q163
11978a5035Q54J205J770J27Q930K633j5205K336M715j2245J2052L347k632m438
$$ plain form
12072 -7854 16869 26389 24174 -3034 -16202 -13980 -10415 15011 6641 -9615 -17102 -6757 22759
12059 22759 9966 8230 7227 6487 10650 1760 17122 10046 -6825 9318 17766 20321 20047 24486
12045 24486 32105 22639 11569 8696 7415 17033 19862 14318 -8370 -9555 -4738 28268 39596
12032 39596 46796 44552 28823 15327 4663 -5420 9102 23455 15587 8350 9937 32574 37204
12019 37204 35303 43396 41146 38778 24734 1935 15680 31319 29227 16509 1686 -16262 -25243
12006 -25243 -3374 3128 -1444 -4015 -10772 -20004 -15581 -3331 6804 11360 10708 2872 7765 8402
11992 8402 23421 29221 3322 -22535 -28904 -37587 -29568 -24111 -22550 -16817 -9632 1197 -6872 -15035
11978 -15035 -14181 -12976 -11206 -11079 -2149 484 -14721 -12385 -7670 -19915 -7863 -4516 -7148 -11586
11964a1586L426j17M680J4710J1709R622j7668k3987L679J512O450M525J681J2773
11950B1409n917K117j18j8279J637K22l13r498R066J2835m609j5187M019K3904
11936B1288M363P40k4773m037k612l462q541P24Q963l696L295J6995l931q486
11922c170Q867m34l909n029J3653J799O841M583k5504r983M197J8940Q301j7741
11908A411o255R842L697j1294m473J0190O309q56k1144q336m842J4360K3085N105
11894A6799R560Q179q92P627n96j7933p232k238j4144m137J3729k214k2670j2677
11880b8839K594j7705J663J6298M034K246P59p283L045J7775K743P798j1125q368
11866a4365L449r20K362P586K472j5354j9764M587k328J2104J5905o305M89K0327
$$ plain form
11964 -11586 -8160 -8277 -3597 11113 22822 32444 14776 -9211 -5532 -4020 2430 6955 8636 21409
11950 21409 15492 17609 17491 -788 849 1071 758 -8740 326 13161 8552 -6635 -2616 21288
11936 21288 25651 26391 1618 -2419 -5031 -8493 -17034 -16310 -7347 -11043 -7748 9247 5316 -3170
11922 -3170 5697 5263 1354 -3675 9978 11777 18618 23201 -2303 -12286 -8089 10851 19152 1411
11908 1411 -4844 4998 8695 -2599 -7072 3118 9427 8571 -12573 -20909 -25751 -11391 11694 16799
11894 16799 26359 34538 33646 41273 40677 22744 15512 13274 -870 -5007 8722 6508 -16162 -28839
11880 -28839 -26245 -43950 -42287 -25989 -21955 -19709 -18950 -26233 -23188 -5413 -2670 5128 -5997 -14365
11866 -14365 -10916 -11836 -9474 -1888 584 -14770 -34534 -29947 -32275 -20171 -4266 -10571 -10082 10245
11852A0245M156r833J7762P212r509N898j553j4576j0942l07P347N300k039j4467
11838e306j215J7339O215N846k0983q913J291J2311P327j0645m489L563O990l374
11824E957j829l823p491R806N949j6976Q455K0828o294l80n748l370j123J2470
11810A6431q996m754p858J4584J5777r893r267O616N451J028P185o137k3274j2466
11796a5573R902J4236N04M658p165j3073J6578N397j5884J8j0875k0799P511J9473
11782e092L068n620l76q5L739J3098n863L799O110J9345j730j9908j3048j7043
11768a9606J1571R254N500r750l121L047J2257J005J3685m148j8249J518k638
11755C25J0699L009n277l927J423l059j684j6448J3209P469n852j4573J2900J8452
$$ plain form
11852 10245 14401 4568 22330 29542 20033 25931 24378 9802 -1140 -1447 5900 11200 9161 -5306
11838 -5306 -6521 10818 17033 22879 1896 -7017 -5726 6585 13912 3267 -1222 2341 9331 5957
11824 5957 4128 305 -7186 2620 8569 -8407 48 20876 14582 14202 8454 5084 3961 16431
11810 16431 7435 2681 -5177 9407 25184 15291 6024 12640 18091 19119 26304 20167 -3107 -15573
11796 -15573 -5671 8565 9069 13727 6562 -6511 10067 15464 -420 -402 -11277 -32076 -24565 -5092
11782 -5092 -2024 -7644 -8020 -8105 -4366 8732 2869 6668 12778 32123 30393 10485 -2563 -19606
11768 -19606 -8035 1219 6719 -3031 -6152 -3105 9152 10157 23842 19694 1445 2963 325
11755 325 11024 14033 8756 4829 6252 3193 1509 -14939 -1730 5739 -113 -14686 -1786 16666
11741A6666j826N568K453J0265K37k12n933k149o596j0304J0103M916K034O283
11727C1505o028q290Q315q658r555j1353j4946K1523J3248j299j7027k7349j967
11714c1881J3114N311l237L473J107p447O847k73Q584p920j72J1916J3769R36
11700A4127k241K291j326J333O855k598J0591J673r037j66q876J1660J0749l859
11686C1176o604j4695m884j829r963K741J1778P327n618K046L731r579Q114j1663
11672B078q206k582M598J689l869l581l062J6481k289n20K739R030J4883J4979
11658D2368j343j0370k1054j1696J2063K692j2085N833J1211l720O747R605K868
11645C3119l942J0768n458n343L850k2402K814L11o309M284M772M374L441n683
$$ plain form
11741 16666 14840 20408 22861 33126 33363 33151 27218 25069 18473 8169 18272 23188 25222 31505
11727 31505 25477 17187 25502 16844 7289 -4064 -19010 2513 15761 14462 -2565 -29914 -31881
11714 -31881 -18767 -13456 -16693 -13220 -12113 -19560 -12713 -12986 -4402 -12322 -12494 -578 13191 14127
11700 14127 11886 14177 12851 14184 21039 18441 29032 30705 21668 21502 12626 24286 35035 31176
11686 31176 24572 9877 4993 3164 -6799 -4058 7720 15047 9429 11475 15206 5627 13741 2078
11672 2078 -6128 -8710 -4112 -2423 -6292 -9873 -12935 3546 1257 737 3476 12506 27389 42368
11658 42368 41025 30655 9601 -2095 9968 12660 575 6408 17619 13899 20646 30251 33119
11645 33119 29177 39945 34487 29144 32994 10592 13406 13717 7408 11692 16464 20838 24279 18596
11631A8596o548p432L491j2882n852N055Q228J8810k986N179J4653J850K470j0180
11617C2452k2337j4209L242R276J0291K599k194o004L80o219Q15j6006J016J5995
11603I097K7366j46j7713J8866n49l0153j486J2366q664J1334L0L535l177r86
11589A9720p212j889k234k870N481M87o766j6802m878r076M589J3689J8052K1557
11575C1848q668k0706j439N052P585k232p154K0029L755M564K564j8093l0224
11562a3119j7312J3241J1199N902J2436J1189L779O190m446k99J0812J2733j0920
11549D1385K394P446q430j2344m520M900l323p80L346o959J989Q53J064n262J5793
11534C7552j5461j5825j1277o213p542N277K3032n68k715n432p241n790L4J955
$$ plain form
11631 18596 12048 4616 8107 -4775 -10627 -5572 2656 21466 18480 23659 38312 40162 42632 32452
11617 32452 10115 -4094 -852 8424 18715 21314 19120 13116 13496 7277 8092 -7914 -6898 9097
11603 9097 36463 36317 18604 37470 36921 6768 5282 17648 8984 20318 20348 23883 20706 19720
11589 19720 12508 10619 8385 5515 10996 11483 4717 -12085 -16963 -26039 -21450 -7761 10291 31848
11575 31848 23180 2474 1035 6087 13672 11440 4286 24315 28070 32634 35198 17105 -13119
11562 -13119 -30431 -17190 -5991 -89 12347 23536 27315 33505 29059 28760 39572 52305 41385
11549 41385 43779 51225 42795 30451 25931 30831 27508 26728 30074 23115 25104 25957 27021 21759 37552
11534 37552 22091 6266 -5011 -11224 -18766 -13489 9543 8975 6260 828 -6413 -12203 -12169 -10214
11520a0214p036J2455R547j431M256J0344O98J670q356J3466K5528n596j1456
11507C3875j2320J985P388p040j8897p345K1757N79j5966N519j07K0917J4326
11494D4671m859j5754j6905l528n537m230j890N179Q039J390N258J2596J0788
11481C5218o036r769K656J2251j732P993J2921j4848j0814j6367N567J6321Q803
11468D2164N443o366K716m858m523k48j2375N680k9369M038J0674J0359r742J739
11454A5332k989r278J2187P028J3369R652N667q088k4484j7331m115J2196K2975
11441C2121j0406j6150k5476J3856N690Q437o616J0539P315j0733n492o530O679
11428C234O600O35L411R679n309r748J1032L526r101P81P727m774q106j601Q990
$$ plain form
11520 -10214 -17250 -4795 4752 3321 7577 17921 18619 20289 11933 25399 50927 45331 33875
11507 33875 21555 23540 30928 23888 4991 -2354 19403 19982 4016 9535 9428 30345 44671
11494 44671 39812 24058 7153 3625 -1912 -6142 -8032 -2853 5186 6576 11834 24430 35218
11481 35218 29182 19413 22069 34320 32588 40581 53502 38654 27840 11473 17040 33361 42164
11468 42164 47607 41241 43957 39099 34576 34328 21953 27633 -1736 2302 12976 23335 13593 15332
11454 15332 12343 3065 15252 22280 35649 45301 50968 42880 18396 1065 -3050 9146 32121
11441 32121 21715 5565 -19911 -6055 -365 8072 1456 11995 19310 8577 3085 -3445 3234
11428 3234 9834 10469 13880 23559 18250 8502 19534 23060 13959 14740 22467 17693 9587 7986 16976
11413A6976J8015J636k2317p616o098J932K652q542K57K502J2243L831J2995J1942
11399D0408o17n481J3407R234k12o340k4821K004Q302j082K440P664L968m950
11385D3924J4769q816j6190r145m817Q811k373j8006j4879p688q391L591J5282
11372c928J6650J7023O550q452M385J2407j2531r031o741L323K9880R223r986
11359D8772r861l423J2076K6784J8045r541k7793j5606m535l980k1925k6132l242
11346b0361Q203P506O426P429n212p551j90K3272n929j600J2358l067o768J167
11332A5683p413j3387o913R7J1974K6012J5512J2213r07j4274j6748l21J0165
11319C1693j3787j0535M689N233J3493o059r578Q815j211j706R839L786o429j0092
$$ plain form
11413 16976 34991 36627 14310 6694 596 2528 5180 -3362 -3105 -603 11640 15471 28466 40408
11399 40408 39791 34310 47717 56951 56739 50399 25578 27582 35884 34802 37242 44906 48874 43924
11385 43924 58693 49877 33687 24542 19725 28536 26163 8157 -6722 -14410 -22801 -19210 -3928
11372 -3928 12722 29745 36295 27843 32228 44635 32104 23073 16332 19655 49535 58758 48772
11359 48772 38911 35488 47564 74348 92393 82852 55059 39453 34918 30938 9013 -17119 -20361
11346 -20361 -12158 -4652 1774 9203 3991 -3560 -3750 19522 13593 11993 24351 21284 14516 15683
11332 15683 8270 -5117 -12030 -11933 41 26053 41565 53778 52871 38597 21849 21528 31693
11319 31693 17906 7371 12060 17293 30786 24727 15149 23964 22753 21047 30886 34672 28243 18151
11305A8151M196J2880k859r669K746J0244K2834N912p433j1742j9858o271l377
11292A5754N718J4074K449j5403n652j0822r371N599J6350J4783K0069K0993Q080
11279H2621o018r752M395j0197p187p998j995j9984J0140K1058R36p227j7999
11266C0793r923N57j970J2378L085j6659m517K8801J0257O60J4639N09n877p957
11252E4776M318j892O748J0552p815J224N009J0858r713J2977J6486J9677J2885
11239A36090j534J7911K3028Q76J1398L9881K2908K1049K7513L9564N1552N9512
11227D49748J18602J82069K23418K32133J89948J62277J46779n922l48839m81874
11217H68339l38008j79507r8406o3944m2949k6851p236m225j0996j7982L30K147
$$ plain form
11305 18151 22347 35227 32368 22699 25445 35689 58523 64435 57002 45260 25402 19131 15754
11292 15754 21472 35546 37995 22592 16940 6118 -3253 2346 18696 33479 53548 74541 82621
11279 82621 76603 66851 71246 61049 53862 45864 43869 23885 34025 55083 56019 48792 30793
11266 30793 20870 21427 19457 31835 34920 18261 13744 42545 52802 53462 68101 68610 62733 54776
11252 54776 59094 57202 63950 74502 66687 67911 72920 83778 74065 87042 103528 123205 136090
11239 136090 134556 152467 175495 176371 187769 227650 250558 271607 299120 338684 390236 449748
11227 449748 568350 750419 973837 1205970 1395918 1558195 1704974 1699052 1350213 868339
11217 868339 530331 350824 252418 188474 145525 118674 111438 107213 96217 78235 78565 80712
11205H0712j6055k6146J749J8351J3106n662j5452p180L084P077j605k752J2733
11192F1960Q599n841J0610J0937K962j2173j0257r884Q329N63J897J1416m025
11179G5093k9300Q836r662K730R046k528L681L232n999j212O618n853p258j1747
11165C5677K632K2426n373k4554j7702o817j156J6791J1263J0211L320p010P35
11152D0443M86j0285P450R488j6146k1794j7956r270K4485K9869J1853j410Q374
11139E5587j3581n022J1517J8582P937L029r585l0201l656J9522J3468n084j0043
11126E2470Q079q209j0104J5169J5311q518M668N068k5664j3706p056l039M795
11113B9264K146N179J0884j2309j63p994K5695J1032J2253M283j2649j157k2521
$$ plain form
11205 80712 64657 38511 40260 58611 71717 66055 50603 43423 46507 53584 51979 49227 61960
11192 61960 70559 64718 75328 86265 89227 77054 66797 56913 65242 65805 67702 79118 75093
11179 75093 45793 54629 44967 47697 56743 54215 57896 61128 55129 53917 60535 54682 47424 35677
11165 35677 38309 60735 55362 30808 13106 6289 5133 21924 33187 43398 46718 39708 40443
11152 40443 40929 30644 38094 47582 31436 9642 -8314 -17584 6901 36770 48623 47213 55587
11139 55587 42006 36984 48501 67083 75020 78049 68464 38263 34607 54129 67597 62513 52470
11126 52470 60549 52340 42236 57405 72716 64198 68866 73934 48270 34564 27508 24469 29264
11113 29264 31410 36589 47473 35164 35001 27007 52702 63734 75987 80270 67621 66464 43943
11100D3943o066q960n475J4843K6093K7180l485r444L237M683l963j6726j4637
11087E1223O102O334N048J0792o135j285j4192J2690J9520J9280L4603J9991J5627
11074A79598K3781K3629N1947O4037K1358k0474m8482m3414n0218n5950m9139
11063I6673p711J689M922O092j3096r824Nl258q795m7J4630R34k2564K485J3485
11048G5620r180j3432k175k8905j7414J0545J7494J9604J7280j6081j2751r876
11036C0729K585K2142p010j876Q76k647k0703O777j1676j4773L322J2439m958
11023A5227k666L023m856J5437J0218k112N685K0389J3529J6267K5296r186O463
11010A12714J4751k0188j1116Q807j7414l0140J161k274Q448K8518J9223j0844
$$ plain form
11100 43943 37877 28917 23442 38285 64378 91558 88073 78629 81866 86549 82586 65860 51223
11087 51223 57325 63659 68707 79499 73364 72079 57887 70577 90097 109377 143980 163971 179598
11074 179598 203379 227008 278955 342992 364350 343876 295394 251980 201762 145812 96673
11063 96673 88962 90651 95573 101665 88569 78745 78750 75492 66697 66650 81280 82214 59650 62135 75620
11048 75620 66440 53008 50833 21928 4514 15059 32553 52157 69437 53356 40605 30729
11036 30729 33314 55456 48446 46570 47446 44799 24096 30873 19197 4424 7746 20185 15227
11023 15227 12561 15584 10728 26165 36383 34271 39956 60345 73874 90141 115437 106251 112714
11010 112714 127465 107277 96161 104968 87554 57414 58575 56301 64749 93267 112490 101646
10998A01646j7266k137J1967K9177k001q744j0493Q202q759N90K042L254J1924
10985A19402K3739J1134N645j5352j0008J2380k346k221K098J0118K6579J3140
10973A94308j4626K915K1475m329r539k0198k2400j543N55J5088p351P381N909
10960A67645J1721o834J5088J2302r125j1547m466R827Q166J0800J8200J4170
10948B35947p034J5051J4971j2028l1105l3836n1886m2678r481K2351L9062Q278
10936A47612k148j244j1474K3438K3716R345o170p306J0605J1778J3258J0889
10924B22299J1422J8155J6814j8897k3462j3118r204J8791J2495L583o871J0896
10912B42903K8083J1624N732J1260K9289O939q760m593O716l550j953M551O940
$$ plain form
10998 101646 84380 82243 94210 123387 121386 112642 102149 110351 101592 102182 104224 107478 119402
10985 119402 143141 154275 159920 144568 134560 146940 144594 142373 144471 154589 181168 194308
10973 194308 179682 182597 204072 199743 190204 170006 147606 146063 146618 161706 154355 161736 167645
10960 167645 179366 172532 187620 199922 190797 179250 174784 184611 192777 203577 221777 235947
10948 235947 228913 243964 258935 246907 215802 181966 130080 87402 77921 100272 139334 147612
10936 147612 145464 144220 132746 156184 179900 189245 183075 175769 186374 198152 211410 222299
10924 222299 233721 251876 268690 249793 226331 213213 204009 222800 235295 238878 232007 242903
10912 242903 270986 282610 288342 299602 328891 335830 327070 322477 329193 325643 323690 328241 335181
10899C35181J9508N317m324J5763L5676J4026J9933r09o58J980O253M684J0558
10886D62988J0084K8062K9224J3862K5495J2851J8572J5073J1919J4683K0147
10875F62960J4895R510K5054M7902M3760L8432J0823K7319J8990K5815M2127N0711
10863A018298Q5027R7507J20297J15830J04156R6386J15315J15509J41513J34993
10853B144831J41397J68431K10873K47027K73540L24953L84564M45963N43008
10844D884587O45673P28045P86370Q50978R60362J100105J194463J274235J465326
10835A3890144J795654K146269K322807K629649L533494M648519N364812N534628
10827D1865976N340624N405918O675241R554047J4428341K2864736L6062680M7392361
$$ plain form
10899 335181 354689 360006 355682 371445 407121 421147 441080 440171 439513 441493 447746 452430 462988
10886 462988 473072 501134 530358 544220 569715 582566 601138 616211 628130 642813 662960
10875 662960 677855 687365 712419 760321 804081 842513 853336 880655 899645 925460 967587 1018298
10863 1018298 1103325 1200832 1321129 1436959 1541115 1637501 1752816 1868325 2009838 2144831
10853 2144831 2286228 2454659 2665532 2912559 3186099 3511052 3895616 4341579 4884587
10844 4884587 5530260 6258305 7044675 7895653 8856015 9956120 11150583 12424818 13890144
10835 13890144 15685798 17832067 20154874 22784523 26318017 30966536 36331348 41865976
10827 41865976 47206600 52612518 59287759 68841806 83270147 106134883 142197563 189589924
10819A89589924M4134486L1744849K8241058K6937018j7760646q4262301q8640669
10812A29983719n1644828k6726895j5027019r285605o105210m074296k775310
10805A4344556k139288j747495j351034j001723p22586n02521l85450l69106m02180
10796E723173m38046o68377q49018p15322m34151k63784j83158j80256j62802
10787A828259j12208r1110j11264r6950r8512q9627j04263q3556n1642n2245n0684
10776H86198n7186k9468l8693O581J6425J4112J145j5653n3019n0270m7230m9385
10764E83557n7289l3492l9448o268M201k0751k8895k1784j4446k4411l2035k1621
10752B87318j5126k1054P72n575j6140k099l80J7240J1842j0891l2028k3674j759
$$ plain form
10819 189589924 233724410 265469259 293710317 320647335 302886689 218624388 129983719
10812 129983719 78338891 51611996 36584977 27299372 21194162 17119866 14344556
10805 14344556 12205268 10457773 9106739 8105016 7382430 6879909 6494459 6125353 5723173
10796 5723173 5285127 4616750 3767732 3052410 2618259 2354475 2171317 1991061 1828259
10787 1828259 1716051 1624941 1513677 1416727 1318215 1228588 1124325 1040769 989127 936882 886198
10776 886198 829012 799544 760851 767432 783857 797969 799114 783461 730442 680172 632942 583557
10764 583557 526268 492776 453328 447060 451261 430510 401615 379831 365385 340974 308939 287318
10752 287318 272192 251138 251910 246335 230195 228096 227716 244956 256798 245907 213879 190205 188446
10739A88446n56p916l776L813l566j385o760j0429q92m314j5517J123J55k2983
10725A15443p379Q141m6p898J6111L1553J5502p500k4857o149n089k0539l680
10712A03613r031J724K1400N700J0716J3194l130J499k697m71J4149N846m879
10699A57633j3050j826J3489K1156m845J0341K5039j0044j7851l9815o8860n0580
10687B0787l027K1135P71j3909j5405n17J8257j389L384P662o329J370N610o418
10673C1982R473Q255p247j9175o829R883K26J3302m940r255o300k4674j8467r961
10659c3727o54L0219J8769Q468q078l003K4350J2147M523R320J4568k0272k2256
10646C4374O460l082j9311l880j4109j4505J0076N568J8423O430q100Q162J6866
$$ plain form
10739 188446 187890 179974 176198 180011 176445 175060 168300 157871 156979 152665 137148 138271 138426 115443
10725 115443 108064 116205 116159 108261 124372 155925 171427 163927 139070 132921 127832 107293 103613
10712 103613 94582 96306 117706 123406 134122 147316 144186 145685 142988 142517 156666 162512 157633
10699 157633 144583 142757 156246 177402 172557 182898 207937 197893 180042 140227 71367 20787
10687 20787 17760 38895 39666 25757 10352 9835 28092 26703 30087 37749 31420 32790 38400 31982
10673 31982 41455 49710 42463 23288 16459 26342 26568 39870 34930 25675 19375 -5299 -23766 -33727
10659 -33727 -34381 -4162 14607 23075 14997 11994 36344 48491 53014 62334 76902 56630 34374
10646 34374 40834 37752 18441 14561 452 -14053 -3977 1591 20014 26444 18344 26506 43372
10633D3372n772n148k2505o016k823O941L479Q434n55j7023o849O611K5877K5523
10619E3546J1754R642J8093K5390J0814m156j5934j7782n63K462K941J636N893
10606A03736j539l237k3350j3717r196n540j7480p555j0664K5443J5695l693l992
10593D4911Q451M294r4M494l824J1129q574l0604j3131j7645J400r537K509o412
10579a2633p238r575j2538J5313M603N648J3490K1204l137k2170n029L349M524
10566d189O583l8k163p815P9k8574k7558K710J1255L1975J4831L036J921k432
10552c79p816L510K2845r940o155p802j608l168L546q997p602k629R496k188J518
10537a7369J077r602K984J236K4758J542J1248k892o336P756m162j462n315j9151
$$ plain form
10633 43372 37600 32452 9947 3931 1108 8049 11528 19962 19407 2384 -4465 2146 28023 53546
10619 53546 65300 74942 93035 118425 129239 125083 109149 91367 90804 93266 96207 97843 103736
10606 103736 102197 98960 75610 61893 52697 47157 29677 22122 11458 36901 52596 48903 44911
10593 44911 53362 57656 57562 62056 58232 69361 60787 30183 17052 -593 807 -8730 -6221 -12633
10579 -12633 -19871 -29446 -41984 -26671 -22068 -16420 -2930 18274 15137 -7033 -12062 -8713 -4189
10566 -4189 2394 2356 193 -7622 -7543 -36117 -63675 -60965 -49710 -17735 -2904 132 2053 -379
10552 -379 -8195 -4685 18160 8220 2065 -5737 -7345 -10513 -6967 -15964 -23566 -26195 -16699 -18887 -17369
10537 -17369 -16292 -25894 -22910 -21674 3084 4626 15874 12982 6646 14402 10240 8778 3463 -15688
10523a5688k510K791J4175O915J280P183J224l519k2439m802L954p053m53O707
10509a2235K371J9636N713L416R880L1097L632n348j3716J195J5584K593n445
10496E8373j194P16m109l413J0146j1179j3244q137o467l012M401r085l3718J753
10482a8169J534J2424L873P939l691J1470j827J965N641O000J565j150O404J206
10468C5184P662K735j70m869j0806j7685Q758J9510P593j062J734j1702K056j0524
10454B8414j8273L42J3499j8018j0132O09q916o537m88l791l785J2916Q721R799
10440D360j0991J4212O314j1356l195M146N570J9707K123q50P382N12l467J7805
10426E2272J1319K209J7296J8403J0122N48J7029M8066M3180K1506J5629M3042
$$ plain form
10523 -15688 -18198 -15407 -1232 5683 6963 14146 15370 11851 -10588 -15390 -11436 -18489 -18942 -12235
10509 -12235 -9864 9772 15485 18901 28781 59878 63510 58162 44446 45641 61225 63818 58373
10496 58373 57179 57895 53786 50373 60519 49340 36096 27959 21492 18480 22881 13796 -19922 -18169
10482 -18169 -16635 -4211 -338 7601 3910 15380 13553 15518 21159 27159 28724 27574 33978 35184
10468 35184 42846 45581 45411 40542 29736 12051 20809 40319 47912 46850 48584 36882 38938 28414
10454 28414 10141 10483 23982 5964 -4168 -3559 -12475 -19012 -19500 -23291 -27076 -14160 -5439 4360
10440 4360 -6631 7581 13895 2539 -656 3490 9060 28767 30890 30040 37422 37934 34467 52272
10426 52272 63591 65800 83096 101499 111621 112169 129198 177264 220444 241950 257579 300621
10414C00621P2095Q4946J28128J76863K20605K28876J73770J57070J27523r9534
10404A570963m12961m60766k77160j43145q0865n0785l9106j7690k3984j4244
10394E0257j2639j629j120q903r78j0044r865k992L667P248j5209k7921r198J0518
10380b8808q428j258J4656J6249J1760N741j43J1679j3116q950Q587J436p636
10367A769q807J8039Q33J889N502j2950j403j1024k1126L115j5208p440L64J2015
10353c4432J1773r608N102K6675M1131o327l776Q916k219r130j5879L18J4088
10340B6632K680k0308j674P582l93j5800k1225j3425m560K2849J6906K4709J7927
10327D1900q049k4570k6696J8471P196j6511j202K3638P431r846P421J1048L156
$$ plain form
10414 300621 372716 457662 585790 762653 983258 1212134 1385904 1542974 1670497 1570963
10404 1570963 1158002 697236 420076 276931 196066 145281 106175 88485 64501 50257
10394 50257 37618 35989 34869 25966 24988 14944 5079 2087 5754 13002 -2207 -30128 -39326 -28808
10380 -28808 -37236 -38494 -23838 -7589 4171 9912 9769 21448 8332 -618 7969 9405 1769
10367 1769 -7038 11001 11834 13723 19225 6275 4872 -6152 -27278 -24163 -39371 -46811 -46447 -34432
10353 -34432 -22659 -32267 -27165 -490 40641 34314 30538 39454 37235 28105 12226 12544 26632
10340 26632 29312 9004 7330 14912 14519 -1281 -22506 -35931 -40491 -17642 -736 23973 41900
10327 41900 33851 9281 -17415 1056 8252 -8259 -9461 14177 21608 11762 19183 30231 33387
10314C3387l0278m791J1625P146o645J1297J8806J7544M75k0045k0000j1295r55
10301F271J4536J435o462k2442J3118o468n372J0244O338l380p167P686j2231
10288c894n424j826p410j1487Q341K2107Q185P09r024p465J337N683J3174r61
10274A2045k1482r440L891l536l16R9J1383O853J444Q255l888n596m20k491j6710
10259a9909N259J2197J697q111k85J9513r852j2679k631O144M292n238N44J4705
10245E646p205k3387J378J2549J123r149J5561R37j8789J8064K6341r278j4489
10232f98N609j972j128J3056J3372l305q092O3N921j5480j6313m420N838j649
10218i198L921L344P745l372k3097Q817M432k1101L628O459L625M461j839k852
$$ plain form
10314 33387 3109 -1682 9943 17089 10444 21741 40547 58091 58566 38521 18521 7226 6271
10301 6271 20807 22242 15780 -6662 6456 -12 -5384 4860 11198 7818 651 8337 -3894
10288 -3894 -9318 -11144 -18554 -30041 -21700 407 8592 9301 277 -7188 -5851 -168 13006 12045
10274 12045 -9437 -18877 -14986 -18522 -18838 -18739 -7356 -503 941 9196 5308 -288 -708 -3199 -19909
10259 -19909 -14650 -2453 -756 -8867 -9152 10361 509 -12170 -14801 -8657 -4365 -9603 -9059 5646
10245 5646 -1559 -24946 -23568 -11019 -9896 -19045 -3484 -2547 -21336 -3272 23069 13791 -698
10232 -698 4911 2939 1811 14867 28239 24934 16842 16905 22826 7346 -8967 -13387 -7549 -9198
10218 -9198 -5277 -1933 5812 2440 -20657 -11840 -7408 -28509 -24881 -18422 -14797 -10336 -12175 -15027
10204a5027L965J1185q733j9505k3324J1133K9611M086K010K773O517j9630m716
10191a9655J1128k411M962J0479O691k60l300n010j6392J0509K2901M707j8965
10178E384k0284j857j0929k834J2665K0832R911k1313J209j1679j3768J7707O310
10165h646n845N278j111J5506K8758K445k2242k7645J011L5399J7373j8122o303
10152A5856L62j4511O555J259j1777Q594n91L430N244j6054j6924j212O172J0838
10138b759J3613m218k898q866p888O083K187l148j5702P168j3791K335N076M791
10124a8017p036K2008K6840K510p421j6090l661j3139j2087L382J7973n46N514
10111B30j3305j9302n884l521J3643J9140j25m988M873P234O184J039r850r435
$$ plain form
10204 -15027 -11062 123 -8610 -28115 -51439 -40306 -10695 -6609 -4599 -1826 4691 -14939 -19655
10191 -19655 -8527 -10938 -5976 4503 11194 10934 7634 2624 -13768 -3259 19642 24349 5384
10178 5384 -14900 -16757 -27686 -30520 -17855 2977 12888 -8425 -7216 -18895 -32663 -14956 -8646
10165 -8646 -14491 -9213 -10324 5182 33940 36385 14143 -13502 -12491 22908 40281 22159 15856
10152 15856 16218 1707 8262 9521 -2256 6338 5747 9177 14421 -1633 -18557 -19769 -13597 -2759
10138 -2759 10854 6636 3738 -5128 -13016 -6933 -4746 -7894 -23596 -16428 -30219 -27884 -22808 -18017
10124 -18017 -25053 -3045 23795 26305 18884 2794 -867 -14006 -26093 -22711 -4738 -5284 230
10111 230 -13075 -32377 -38261 -41782 -28139 -8999 -9124 -14112 -9239 -2005 4179 5218 -4632 -14067
10097a4067K6482L0996L529k0863j4136j8293q894R096j2041K069J1332K0794
10085A6004J1642J603r084j4893o720o74N047j770j2374n180l870L636R746R105
10071B218P564J8606Q924J464m050j4010k284R906l461j1774k947r681K538R677
10057A2690J9711m163j2519p928k181K3598M637J7258K2090K4987K7076K2776
10045A48032L496p4302l9400M441j2242j8448o351p008K304J382q746K060n80
10032e362k816J962K0633J5018Q018j1490j9179K369q873L419J7643j820j5318
10019D204p633l220o762J943O116J2654j972k337R258o156j1072J690r622o018
10005a8927K9287O697q316j3818n652J0199Q863j071k0624M60l259M233M724J7480
$$ plain form
10097 -14067 12415 43411 46940 26077 11941 -6352 -15246 -6150 -18191 -16122 -4790 16004
10085 16004 27646 29249 20165 5272 -1448 -2122 2925 1155 -11219 -16399 -20269 -16633 -6887 2218
10071 2218 9782 28388 37312 38776 34726 20716 18432 28338 24877 13103 10156 475 3013 12690
10057 12690 32401 28238 15719 7791 5610 29208 33845 51103 73193 98180 125256 148032
10045 148032 151528 77226 37826 42267 30025 11577 5226 -1782 522 1904 -6842 -4782 -5362
10032 -5362 -8178 -6216 14417 29435 37453 25963 6784 9153 280 3699 21342 19522 4204
10019 4204 -3429 -6649 -13411 -11468 -5352 7302 5330 2993 12251 6095 -4977 -3287 -12909 -18927
10005 -18927 10360 17057 8741 -5077 -10729 -530 8333 7262 -13362 -12902 -16161 -11928 -7204 10276
9991A0276p647n698j2614J8538O340J9336J9541k690m921j0256k0837q069j7641
9978a6342j8908J7706m066P148J7143J7074N256k5595l984R690j1370R504J4412
9965A7668L304p240j2162j8256o979J275K5672R568j1642r210r881J6170J0268
9952H555j0949j4511J4804P779m400M142L247l456k278K1147j052l070q601N133
9938A6490J6306K498k347k0281m453J0949J0737R671o049k8221J0425N856j5072
9925F509l394J588j3709k2873k2905Q029J1544L271J2014O127j5529R144O064
9912a4120k068N890K3176M682j6790j2807N652M218Q659P270n408J8878M221M34
9898C1887q023j1501q383j1201J4781K1849l005N339P007j7004k8919k1525j3422
$$ plain form
9991 10276 2629 -3069 -15683 2855 9195 28531 48072 45382 40461 30205 9368 1299 -16342
9978 -16342 -35250 -17544 -21610 -14462 2681 19755 25011 -584 -4568 5122 -6248 3256 17668
9965 17668 20972 13732 1570 -16686 -23665 -22390 3282 12850 1208 -8002 -17883 -1713 8555
9952 8555 -2394 -16905 -2101 5678 1278 5420 8667 5211 2933 24080 23028 19958 11357 16490
9938 16490 32796 35294 32947 12666 8213 19162 29899 39570 33521 5300 15725 21581 6509
9925 6509 3115 4703 -9006 -31879 -54784 -46755 -35211 -31940 -19926 -13799 -29328 -20184 -14120
9912 -14120 -16188 -10298 12878 17560 770 -12037 -6385 -2167 6492 13762 8354 27232 31453 31887
9898 31887 23864 12363 3980 -7221 7560 29409 26404 31743 38750 21746 -7173 -28698 -42120
9885d2120J2529M324Q906J2604J1731j286k760K957J112j635q632j6118l485P341
9871a4532Q431P438Q524K213r668L904m322R987l780R484Q208o240r625O72O447
9856A7141K327n503j1288l841q665J1694J5283l881J8634K480k2215n480p53q104
9842b171j601J4622J4610j5952k0859J2527n871q606L389q890M306J0723N190
9829A417J1532J0820q000n061j1941j7721j8810J341J683J0339R960J2468j0097
9816a2070J0388J1854J4540j0671j0248j1211O294j60n704N317j500M663R783
9803A1275J7457n398j6916n126n953R915P768j1800j2337K025L266J8160J3559
9790B5895n528J273J604M354J373o328j5109l288K4527o743k1853k0881J136J1541
$$ plain form
9885 -42120 -29591 -25267 -16361 -3757 7974 6688 3928 6885 7997 6362 -2270 -18388 -21873 -14532
9871 -14532 -6101 1337 9861 12074 2406 6310 1988 11975 8195 17679 25887 19647 10022 10694 17141
9856 17141 19468 13965 2677 -1164 -9829 1865 17148 13267 31901 34381 12166 6686 5933 -2171
9842 -2171 -3772 10850 25460 9508 -11351 1176 -4695 -13301 -9912 -18802 -14496 -3773 1417
9829 1417 12949 23769 15769 10708 -1233 -18954 -37764 -36423 -34740 -24401 -14441 -1973 -12070
9816 -12070 -1682 10172 24712 14041 3793 -7418 -1124 -1284 -6988 -1671 -3171 1492 11275
9803 11275 28732 23334 6418 1292 -4661 5254 13022 1222 -11115 -9090 -5824 12336 25895
9790 25895 20367 21640 23244 27598 28971 22643 7534 4246 28773 22030 177 -20704 -19568 -8027
9776h027O03p175o41K470R45P579n336J0334l94p136p111m323o529J7838K2185
9761A5282j1378q552P765n069n547J498R565L08j1011J29n570R437J1927J0957
9747A9741j8318k0904n59J5868J0516k60L306J0798N785q199j5467j151k776J0312
9733H692Q59j3760l747l548J9319J019q500n304N320J119p509Q557r725j1453
9719a8661J1376K1265P730j3524q634J1517p064j0339r122N452N845j6606M561
9706a6204O086L246O915j75J1276q84j2535j6786J741K9611j4M662J3150J4807
9692D4896j297j0670k3930j5604J1733r44J3692q037j8624j8637n425N763n887
9679c2971J1543J7130K1824M892k1497j50N993j279M656o346P0J3965r15k544
$$ plain form
9776 -8027 -7424 -14599 -15240 -12770 -11825 -4246 -9582 752 358 -6778 -13889 -18212 -24741 -6903 15282
9761 15282 3904 -4648 3117 -1952 -7499 -6001 3564 3872 -7139 -7010 -12580 -3143 8784 19741
9747 19741 1423 -19481 -20040 -4172 6344 6084 9390 20188 25973 17774 2307 1156 -1620 8692
9733 8692 9551 -4209 -7956 -11504 7815 8834 334 -4970 350 1469 -6040 2517 -7208 -18661
9719 -18661 -7285 13980 21710 8186 -448 11069 4005 -6334 -15456 -10004 -4159 -20765 -16204
9706 -16204 -10118 -6872 43 -132 11144 10260 -2275 -19061 -17320 12291 12277 16939 30089 44896
9692 44896 43599 32929 8999 -6605 5128 4184 17876 9839 -8785 -27422 -32847 -27084 -32971
9679 -32971 -21428 -4298 17526 22418 921 771 6764 5485 10141 3795 3865 17830 16915 14371
9665A4371p7j0955N993r009K0410J6547j4239j0597k0151l1043J7809K5724n397
9652f14m747J1097J479m596p061n192P227J93R344N345L863m197O52m504l839
9637D450P58J4557L096j544j5622l1035O11N737J1539P080L675J1239O60m41P338
9622B2098j5646O971J3101j663R347r464j2562q600O533L429Q811j513k293J537
9608B0086j0502n988k8616j0391M79J4673J8403p892M291K0668n395l785j370
9595D661J8053L594j2329q02k8771r740L952M682K2904J7925O342o412n095o027
9581A2937m815j8593J843J6563j985J250n497O300p946q474j0241r857J9056J9697
9567A0238J154o944N354j1868k925J7835o166k2208n868Q157J4793j74l287J444
$$ plain form
9665 14371 14294 3339 9332 323 20733 37280 23041 12444 -7707 -38750 -20941 4783 -614
9652 -614 -5361 5736 7215 2619 -4442 -9634 -2407 -2214 7130 12475 16338 12141 12793 8289 4450
9637 4450 5208 19765 22861 21317 5695 -25340 -24729 -18992 -7453 -373 3302 14541 15201 14760 22098
9622 22098 6452 13423 26524 24861 34208 24744 12182 3582 10115 13544 22355 20842 18549 20086
9608 20086 9584 3596 -25020 -35411 -34932 -20259 -1856 -9748 -5457 15211 9816 6031 4661
9595 4661 22714 26308 13979 13177 -15594 -25334 -21382 -16700 6204 24129 30471 24059 18964 12937
9581 12937 8122 -10471 -8628 7935 5950 7200 1703 8003 57 -8417 -18658 -28515 -9459 10238
9567 10238 11392 4448 9802 -2066 -4991 12844 6678 -15530 -21398 -13241 1552 1378 -1909 -465
9553d65m350O309Q650J0685j4590K145M549Q307J884j6536j2712k119J0603K3057
9539B5417P666k4200r993j5744j2703L932J4233K8277m636p463K868J0485j2596
9526E543l857N567m696q045m519N407J8626o232k805N29j597j6617j7132k019
9512c1847K125K2374K418J2930J2324o377j9144K434j961R51O200l545r16J7021
9498A4987r842j3242J4462M517J8549o13N572O416r826k2552j0503P16P510J7957
9484B4108q862k5832J5414J1423N516J5402K824j7122L439O255r272o500M223
9471B1016p609J5120J3204m847j6608N775J058N97j596k1322j5547J451l900J375
9457a1833L081k785j9103n531m197K1921J6131M871P23j5260j7562K0436K0860
$$ plain form
9553 -465 -4815 1494 10144 20829 6239 8384 12933 21240 23124 6588 -6124 -8243 2360 25417
9539 25417 33083 8883 -1110 -16854 -29557 -25625 -11392 16885 12249 4786 7654 18139 5543
9526 5543 1686 7253 2557 -5488 -10007 -4600 14026 7794 4989 5518 3921 -12696 -29828 -31847
9512 -31847 -29722 -7348 -4930 8000 20324 13947 -5197 -2763 -4724 -3773 2427 -1118 -2034 14987
9498 14987 5145 -8097 6365 10882 29431 28818 34390 40806 30980 8428 -2075 -1359 6151 24108
9484 24108 15246 -10586 4828 16251 21767 37169 39993 22871 26310 32565 23293 16793 21016
9471 21016 13407 28527 41731 36884 20276 26051 27109 27706 26110 4788 -10759 -9308 -13208 -11833
9457 -11833 -8752 -11537 -30640 -36171 -40368 -18447 -2316 2555 3278 -11982 -29544 -9108 11752
9444A1752p128J2588L357k4707j3845j2595R291J4132J0571J2842j6635k223R359
9431F759o226l209l155O562O429m367j1757q689r811J5346K6005K6907k9176M07
9417A2025J6251N42r422l976p56J3242J950o159q315J4452K339o137l0853j7754
9403b2571N855J0534J4687J457n102k416p932O214o320k3844j0563p278O270P689
9389c3320J4489P428l535J3996O849P481n239K705M12j3440j53Q074K009l93n44
9374F819p027Q32Q402M766P101o69L739j1480n078j1254M78R33M846k407J052
9359A053N707j506m534J3800J1931J1372j092l835j9804r987P346k605L864R478
9345B1188m956n594n859P044j3015P313K826j971J204q105J371j1646j1065n078
$$ plain form
9444 11752 4624 17212 20569 -4138 -17983 -30578 -21287 -7155 3416 16258 -377 -2600 6759
9431 6759 533 -2676 -5831 731 7160 2793 -8964 -17653 -27464 -12118 13887 40794 11618 12025
9417 12025 28276 28818 19396 15420 14664 27906 29856 23697 15382 29834 32173 26036 -4817 -22571
9403 -22571 -16716 -6182 8505 9962 4860 2444 -5488 726 -5594 -29438 -40001 -47279 -41009 -33320
9389 -33320 -18831 -11403 -14938 -942 5907 13388 8149 10854 11266 -2174 -2327 5747 7756 7363 6819
9374 6819 -208 624 9026 13792 20893 20224 23963 12483 7405 -3849 -3371 -2438 2408 1 1053
9359 1053 6760 5254 720 14520 26451 37823 36731 32896 13092 3105 10451 7846 11710 21188
9345 21188 16232 10638 4779 11823 -1192 6121 8947 6976 8180 75 1446 -10200 -21265 -26343
9331b6343q781j3663J230K5971J5652N987q890J5009K0371J0952L250j4639R815
9318C5921K3730K825j9088l8590k2262J4074J0516J361r229O682J7361M806j9439
9305H668p543P391N166M887K62l595o067n60K7424R385o26j5897q05k484l0099
9290d493J2008J7674j6798n504p128j0269R39K197M487M054o729K9492J1915j3266
9276A8579N547O990k2628j0746L832Q752j4228N365K976r952J3245Q629J8905
9263C5266j033j2764N384O765j8139q667j905J5216N660k650K777k5268m814J7128
9249A2956P616P470q812q960j2850J0505J0068K7774p344k0458J0232o645k897
9236A8655J4369n707k0501l74J44J661m306P426K506j176J2892O184L775N74J375
$$ plain form
9331 -26343 -35124 -48787 -47557 -21586 -5934 53 -8837 6172 26543 37495 40745 26106 35921
9318 35921 59651 62476 43388 4798 -17464 -3390 7126 8487 -742 5940 23301 28107 8668
9305 8668 1125 8516 13682 18569 18831 15236 9169 8609 36033 45418 44792 28895 28090 25606 -4493
9290 -4493 7515 25189 8391 2887 -4241 -14510 -13571 -11374 -6887 -2833 -9562 19930 31845 18579
9276 18579 24126 31116 8488 -2258 1574 10326 -3902 1463 4439 -5513 7732 16361 35266
9263 35266 34233 21469 26853 33618 15479 6812 4907 20123 25783 23133 25910 642 -4172 12956
9249 12956 20572 28042 19230 10270 -2580 7925 17993 45767 38423 17965 28197 21552 18655
9236 18655 33024 27317 6816 6442 6586 8247 3941 11367 13873 12697 25589 31773 35548 36122 37497
9221C7497l279j858O04r144n978j9069j0690L921J3605J7572J5268j7133n146
9208A6170N087m568K572m260n855j0681m497J1791J3159Q17m653J3919l795p385
9194A7821j1485o682Q119R500M033k885M179n413j197J4459J4424j4589L679R861
9180D3824n482k0059j3383M788J0445K96L97J7360o150o928P215J3786j0724j666
9166C3719J4262r740j3910N143J5088N294l682k3600j7916R427M524J159K519
9153B2287J863P119P906L386J6449K0404J297j6324j0068j3715j3396j288J3285
9140C9205J2766j163K115J188K018L28j630R216o619K558j2990J748J4349L980
9126F7069J3354j154j1213Q347J5107J0489M071J4599n81j1422J2280K5657K9341
$$ plain form
9221 37497 34218 32360 32964 23820 17842 -1227 -11917 -7996 5609 23181 38449 21316 16170
9208 16170 21257 16689 19261 15001 9146 -1535 -6032 5759 18918 19735 15082 29001 25206 17821
9194 17821 6336 -346 7773 17273 21306 18421 22600 17187 15990 30449 44873 30284 33963 43824
9180 43824 38342 18283 4900 9688 20133 20429 20826 38186 32036 25108 32323 46109 35385 33719
9166 33719 47981 38241 24331 29474 44562 49856 46174 22574 4658 14085 18609 19768 22287
9153 22287 24150 31269 39175 42561 59010 79414 80711 64387 54319 40604 27208 25920 39205
9140 39205 51971 50808 52923 54111 56129 56457 54827 64043 57424 59982 46992 48740 63089 67069
9126 67069 80423 79269 68056 76403 91510 101999 106070 120669 120088 108666 120946 146603 175944
9113A75944P979N011L494J7538J3186K3624K3996J2519L0204L3343L4163L5218
9101D16219M7843O0987P2587R6357J32296J24713J39356J30959J44055J74076
9091A539448K40502L56556N38451Q04894J007119R51345P21230N86328L93694
9082G139567n91793j806366j685949j036239o00577l77395k29751j41669j11667
9073E58161r8937o0246m4728m6752l8367l4501j5430j4938k6820k1989j9933j1535
9061A23985j2571k177j3752j792n298m506m496j169l749j2920M011m203n122o716
9047D9525o234O799J2558Q55P145L147r971j3673q308O776J0522J919J4539k0736
9033E4863j225j825o126N493k60N688R39j3554l723n547k844J0718m679j2878
$$ plain form
9113 175944 183923 188934 192428 209966 223152 246776 270772 283291 313495 346838 381001 416219
9101 416219 464062 525049 597636 693993 826289 951002 1090358 1221317 1365372 1539448
9091 1539448 1779950 2136506 2674957 3479851 4486970 5438315 6159545 6745873 7139567
9082 7139567 6547774 4741408 3055459 2019220 1418643 1041248 811497 669828 558161
9073 558161 459224 398978 354250 307498 269131 234630 219200 204262 177442 155453 135520 123985
9061 123985 111414 109237 95485 93693 88395 83889 79393 78224 74475 61555 65566 61363 56241 49525
9047 49525 43291 50090 62648 63503 70648 73795 63824 50151 41843 48619 59141 61060 75599 54863
9033 54863 53638 51813 45687 51180 50920 56608 57547 43993 40270 34723 31879 42597 37918 25040
9019B5040L12O76m294n339k432M323J9769j719M876O624j948k3242R814K0997
9005E3457N439q656j5133m940O096K4583J779q287j5460m837l910j898j1287L781
8991B0727L032P057N366p903r941R75j843j622p810m874J0596N060K698q274J3642
8976B6886K439m483o024p827L123J7981P37k2049j5224j0246o513K911L3071J240
8962A6022O94N004Q149j398l287j1619j7166m769k676J6677J1598j1043J49J1192
8948A7527k405r337j2288N115K636k034p271J3563R989n434j8610o088j3333Q388
8934a9582M275m975j3069L773J3439J593O780j453p55J3089J4862n471N605J0561
8920B8672L811j2804o168n012m48Q215O788k0040j0362j845l26Q132j5714p367
$$ plain form
9019 25040 25352 26028 21734 16395 13963 18286 38055 36336 41212 47836 45888 22646 32460 53457
9005 53457 58896 50240 35107 30167 36263 60846 62625 54338 38878 34041 30131 28233 16946 20727
8991 20727 23759 30816 36182 28279 18338 19313 17470 15848 8038 3164 13760 18820 21518 13244 26886
8976 26886 29325 24842 18818 10991 14114 32095 32832 10783 -4441 -14687 -21200 -18289 14782 16022
8962 16022 16716 21720 29869 28471 25184 13565 -3601 -8370 -11046 5631 17229 6186 6335 17527
8948 17527 15122 5785 -6503 -1388 1248 -786 -8057 5506 15495 10061 -8549 -14637 -27970 -19582
8934 -19582 -15307 -20282 -33351 -29578 -16139 -14546 -7766 -9219 -9974 3115 17977 12506 18111 28672
8920 28672 32483 19679 13511 8499 8051 16266 23054 3014 -7348 -9193 -9519 -1387 -17101 -24468
8906b4468J3609J5599J6025r317n695J3435P723k27M674p226j5438p513q294K76
8892f837M030m546K196p43m853J449P977R051j724p8P15J56K384j4230m796L690
8876f159N737R372m111J3033J1256r971j1240J801J6838k990m2R088j3982o931
8862A1699J7160J724j1564k6694j5703J2826P376m290K963o011M010P587Q876
8849I959K216N916m603M056J0262J2458K95j0071k9570p601M019j2096J8550K0457
8835B4247M979j5338k2520p93m779M822M102J3863J5656l6q178j1938k73J0288
8821A4102p85o608O7K115l545j934Q038m14j6295j0377K3735l57j0872m811K600
8806e341j265L078J8547R754l124l232l457n340k851N645Q788j1623j2083j4550
$$ plain form
8906 -24468 -10859 4740 20765 11448 5753 19188 26911 26684 31358 24132 8694 1181 -7113 -6837
8892 -6837 -2807 -7353 -5157 -5900 -10753 -9304 -1327 7724 6000 5922 6637 6793 9177 -5053 -9849 -6159
8876 -6159 -422 8950 4839 17872 29128 19157 7917 9718 26556 23566 23524 32612 18630 11699
8862 11699 28859 30583 19019 -7675 -23378 -10552 -3176 -7466 -4503 -10514 -6504 1083 9959
8849 9959 12175 18091 13488 17544 27806 40264 40559 30488 918 -6683 -2664 -14760 3790 24247
8835 24247 29226 13888 -8632 -9425 -14204 -9382 -5280 8583 24239 24203 16025 4087 3814 14102
8821 14102 13317 6709 6776 8891 5346 3412 11450 11036 -5259 -15636 8099 7742 -3130 -7941 -5341
8806 -5341 -6606 -3528 15019 24773 21649 18417 14960 9620 6769 12414 21202 9579 -2504 -17054
8792a7054J5551K2770n423k45J416L903J2867K5j4860q010l935j1720P360j6419
8778a3774j0819O680R124J1375J2350Q649P01m863j6545k067o914M424L364M440
8764F125l213k936l144M639P551J6186j705K166j202j3548j443j9792j5732J1526
8750a4522K5341P146N985j1978l574l525n412L105n407q675R995Q384k187l167
8736A509l58R606J2652o6n757o097r901m28L454K832q156q075J8477J6478o729
8721A9441p384o382L804j698M621Q808J474j388j4331o985O609q771j171L94o836
8706i795j992J0361N904j8510n011R803J505L682J1224K070p549q609J7340N768
8692A6191j1712m850K312P21r115J897R070r238j1269J890J2780K081P516O768
$$ plain form
8792 -17054 -1503 21267 15844 15599 17015 20918 33785 33810 18950 10940 7005 -4715 2645 -13774
8778 -13774 -24593 -17913 -8789 2586 14936 23585 24286 19423 2878 811 -6103 -1679 1685 6125
8764 6125 2912 -24 -3168 1471 9022 25208 23503 25669 24467 10919 9476 -10316 -26048 -14522
8750 -14522 10819 17965 23950 11972 8398 4873 -539 2566 -2841 -11516 -1521 6863 4676 1509
8736 1509 1151 10757 23409 23343 17586 11489 1588 1160 4614 7446 -710 -8785 9692 26170 19441
8721 19441 12057 5675 9479 7781 12402 21210 22684 21296 6965 -20 6589 -2182 -3353 -2959 -9795
8706 -9795 -11787 -1426 4478 -14032 -19043 -9240 -7735 -4053 7171 9241 1692 -6917 10423 16191
8692 16191 4479 -371 1941 2662 -6453 -4556 4514 -4724 -15993 -14103 -1323 758 8274 15042
8678A5042j2753p740l788j199o228J4997J4808J6799P197j7422j1015o430j3804
8665a1536l339l758m405j301k461j1977r467J9386K1130j760m469Q511O119M717
8651E390K310n95o392J4996O828o588j1253k2481n927J4062J7099p896j2124l296
8637a5867l751N065J2938M352N01K132J5001P862k7552j6197K0736N910j282j621
8623H227o387j7310l130L490K692p868M833K1872Q826O696Q742Q32o359n913k0671
8608a428j6068l05o46R779R709J8683J2334J3531O449j4234O41n159l300j0914
8594A9072l477N557j2810K02J3184j8499n32P332L98m987j6481r358J9948O267
8580E816k6201j6711J5079J5083P208m419r04J232N308j425j4949m383J0564R675
$$ plain form
8678 15042 2289 -5451 -9239 -10438 -16666 -1669 13139 29938 37135 19713 8698 2268 -11536
8665 -11536 -14875 -18633 -23038 -24339 -26800 -38777 -48244 -28858 -7728 -9488 -13957 -5446 673 5390
8651 5390 7700 7105 713 15709 22537 15949 4696 -17785 -23712 -9650 7449 -447 -12571 -15867
8637 -15867 -19618 -14553 -1615 2737 3238 5370 20371 28233 681 -15516 5220 11130 9848 8227
8623 8227 1840 -15470 -18600 -15110 -12418 -20286 -15453 6419 15245 21941 30683 31515 25156 19243 -1428
8608 -1428 -17496 -17801 -18447 -8668 1041 19724 32058 45589 52038 37804 38445 33286 29986 19072
8594 19072 15595 21152 8342 8544 21728 3229 2697 10029 10427 5440 -11041 -20399 -451 5816
8580 5816 -20385 -37096 -22017 -6934 274 -4145 -5049 -3817 1491 66 -14883 -19266 -8702 973
8566I73J9848o274K422J6675m944l1850J940O24M090l237o06P402K900L937P510
8551B1410l669J466L033K323n208j555K245j1932j7358j3559j5470K105Q907p790
8537c5052P485J0280L145m583j6792J252R871L922Q83J5490N408r00R732k320
8523G821r082m992m693L380J746J3538O584r615q26m94J3750L03K384n68j306
8508A7930O870K4658k3870k2632K413j1472l555K6949j505j2112R068J8791o53
8495C0880j5243L339j1113j2250R926k782p397k148l77j2432J2160K848M389J2652
8481A2452K0842k497j0546j0972k3029o821J1717J7520Q598J1842j7719L60q46
8468A0901j7138n695k360j2797q874J2180J2334K8114K3362j7752k4675p904M274
$$ plain form
8566 973 20821 14547 16969 33644 28700 -3150 -1210 -586 3504 267 -339 7063 9963 13900 21410
8551 21410 17741 19207 22240 24563 19355 17800 20045 8113 -9245 -22804 -38274 -36169 -27262 -35052
8537 -35052 -27567 -17287 -14142 -18725 -35517 -34265 -24394 -20472 -19589 -4099 1309 409 10141 7821
8523 7821 -1261 -6253 -10946 -7566 -5820 7718 14302 4687 3861 3367 17117 17420 19804 19236 17930
8508 17930 24800 49458 25588 2956 5369 -6103 -9658 17291 15786 3674 12742 31533 30880
8495 30880 15637 18976 7863 -4387 5539 2757 -4640 -6788 -7165 -19597 -7437 -4589 -200 12452
8481 12452 33294 30797 20251 9279 -13750 -20571 -8854 8666 17264 29106 11387 11747 10901
8468 10901 -6237 -11932 -14292 -27089 -35963 -23783 -11449 16665 40027 22275 -2400 -10304 -6030
8455f030Q735j3034o152M995n836P461J4806o814O84R072o368j5885q65J6313
8441A082P095n946Q268J3992n773j2997M73p82j5013J9143J1040m500j9171j3516
8427a6605n292m423m573k853J441K527P996J6571J0057N830o974l664J346N135
8413F519O040K2435P34M173p329O23R685q72j3806L117J0218l352j0449j3886
8399A3850q417o933j73J1000p36j0006k8692m079J4265P315J5540k2069M307J1690
8385c138j597P479j3837l218K696o640l025L311J8993J0192P505R319j6666j3765
8371b391M866M508N245L03j4161J478Q72o266r364L925Q609J2478L647q815k0025
8356a5091q277L708j6341Q736Q540P118j645R190J4769J2378j0229o875n68M529
$$ plain form
8455 -6030 2705 -10329 -16481 -11486 -17322 -9861 4945 -1869 -1185 7887 1519 -14366 -15231 1082
8441 1082 8177 2231 10499 24491 18718 5721 6194 5412 -9601 9542 20582 16082 -3089 -16605
8427 -16605 -21897 -26320 -30893 -33746 -32305 -29778 -21782 -5211 4846 10676 3702 38 1384 6519
8413 6519 12559 34994 35728 39901 32572 33195 42880 42008 28202 31319 41537 38185 27736 13850
8399 13850 5433 -1500 -1673 9327 8591 -1415 -30107 -34186 -19921 -12606 2934 -19135 -14828 -3138
8385 -3138 -4735 2744 -11093 -14311 -11615 -18255 -21280 -17969 1024 11216 18721 28040 11374 -2391
8371 -2391 2475 6983 12228 12531 -1630 -152 720 -5546 -14910 -10985 -2376 10102 13749 4934 -15091
8356 -15091 -23368 -19660 -36001 -27265 -18725 -11607 -13252 -4062 10707 23085 12856 5981 5413 9942
8342I942m971l031j0988o286J2947J2915p532O070J3059l657o915k148Q44l971
8328F278k2187N200J1853j4213p108O806K2605m21o729J7723N206j1411p806O304
8314A2100O033Q31m438p179m060M406K122j7304L588J1220J774Q654p570Q078
8300A8255m544o478K0116J2832j5025j4443l094o82k350N837R646p139N19j4515
8286a065L207J2139M699q521L199n053k005M8O059q849L32m122j3262J8583n177
8271B12j5848K940K984J0103j4720j5532J7907K0362q614j0497n27Q456k663p961
8257a3398J2871Q416j0181k818o300p077q757J3459L282O635P0j3249O57J462
8243a4928J1900Q069O552Q172p337M855L041j1297j0809l430j0971m025m28R13
$$ plain form
8342 9942 4971 1940 -9048 -15334 -2387 10528 2996 9066 22125 18468 11553 9405 10249 6278
8328 6278 -15909 -10709 1144 -13069 -20177 -13371 9234 8813 2084 19807 25013 13602 5796 12100
8314 12100 18133 18964 14526 7347 3287 7693 9815 -7489 -3901 7319 9093 17747 10177 18255
8300 18255 13711 7233 27349 40181 25156 10713 7619 6937 4587 10424 20070 12931 13450 -1065
8286 -1065 2142 14281 18980 10459 13658 8605 6600 6648 12707 3858 4190 68 -13194 5389 212
8271 212 -15636 -12696 -9712 391 -14329 -29861 -11954 8408 -206 -10703 -11230 -2774 -5437 -13398
8257 -13398 -527 7889 -2292 -5110 -11410 -18487 -27244 -13785 -10503 -3868 -3798 -17047 -16390 -14928
8243 -14928 -3028 5041 11593 19765 12428 17283 20324 9027 -1782 -5212 -16183 -20208 -20636 -19723
8229a9723p112p173l938R537J7739J6193m352n23J2418J653j8004r85M809J1857
8215A2396Q770J2327J813j5955j5675j1178P603L413p784m77J0085M606r866p258
8201g180J6812Q57o462N508Q189m070j0561M454q312k409J7702K2797o573j8099
8187A2653o041j1280N155N006M187M38l664J334R068q777j2800N889R024l714
8173F478k127K2385j1381k7728q413K3606O336k642K1335j1216q702q124j482
8160a675j6275q127J7127Q528J0582J28Q287O945R448q600j6376k3525J0761J6301
8146A3529O393M178K208j8734p914M568j931K585k186k268N267R205k276r464
8132C160J1628r187j0142q042K3J0769l158j5990n563l414L250K0579Q910j1385
$$ plain form
8229 -19723 -26835 -34008 -37946 -28409 -10670 5523 1171 648 13066 14719 -3285 -4270 539 12396
8215 12396 21166 33493 35306 19351 3676 -7502 101 3514 -4270 -4747 5338 9944 78 -7180
8201 -7180 9632 10489 4027 9535 17724 13654 3093 7547 -765 -3174 14528 37325 30752 12653
8187 12653 6612 -4668 487 5493 9680 10118 6454 7788 16856 8079 -4721 1168 10192 6478
8173 6478 4351 26736 15355 -12373 -20786 2820 9156 6514 27849 16633 7931 -193 -1675
8160 -1675 -17950 -26077 -8950 -422 10160 10288 18575 25520 34968 26368 9992 -13533 -2772 13529
8146 13529 19922 24100 26308 7574 -340 4228 2297 4882 2696 428 5695 14900 12624 3160
8132 3160 14788 5601 -4541 -12583 -12560 -1791 -4949 -20939 -26502 -29916 -26666 -6087 2823 -8562
8118h562J6791J2454n955j1938o186K721P892j2099j208k551J123N448o765j607
8104a0442J1845q97N367k90j6090l727Q099m904K722N767J3126n147k6594l400
8090b4565n082J7050J4592J5980k167j3210l312J810j732K193J3551J8359l04
8077C3163k2286k949j987L33j0943l170k076N645L255J1226M695N681j9165q779
8063g357k746J1198R644j663J2733q105j4219M587P74j4474m291L762j9R781J4309
8048A3914R30L805j155q959k2315p147J2044J6230q169o976l25l776q366j5833
8034c6098J7218J6419p189m733J6452K5677O088j5101j7775j0434k05K319J1321
8021C959K3409m46j9796j4097Q223J5232O091K50j5038l93m791o275m04O149k866
$$ plain form
8118 -8562 8229 20683 14728 2790 -3396 -675 7217 -4882 -6090 -8641 -7518 -2070 -8835 -10442
8104 -10442 1403 506 5873 5583 -10507 -14234 -6135 -11039 -8317 -2550 10576 5429 -21165 -24565
8090 -24565 -29647 -12597 1995 17975 15808 2598 -714 1096 -636 1557 15108 33467 33163
8077 33163 10877 7928 5941 6274 -4669 -7839 -9915 -4270 -1015 10211 14906 20587 1422 -7357
8063 -7357 -10103 1095 10739 9076 21809 13704 -515 4072 4846 -9628 -13919 -10157 -10176 -395 13914
8048 13914 14844 18649 17494 8535 -13780 -20927 -8883 7347 -822 -7798 -8123 -11899 -20265 -36098
8034 -36098 -18880 -2461 -9650 -14383 2069 27746 33834 18733 958 -9476 -9681 -7362 3959
8021 3959 27368 26922 7126 -6971 1252 16484 22575 22825 7787 7394 2603 -3672 -4076 2073 -793
8006g93n00p746j069j882L422K4137m828r223K304Q637n57L459m281j4362q671
7991a1953j1665L534J0447j3170n311K0074J6595M426p937O458O551j0605Q456
7978A5900Q887j1498m779r682M089J5500N173j6065l347k782o100j699K040J1023
7964F660J0131J321m400q253J282r773M3p889j4596L234J4652J3533J2826j1164
7950G607j9888r435O62O093n027L232J2075r947k049J2853J6315P519j1015q505
7936D90O011p357K3321R030K72P946j7666k1924m496m711O3K060R077q200j2769
7921a8853J19J4270Q763Q304k3j2599l232k1999j625J6062R893O137R647k715
7907A2149k0488j7976K0731K7624k133q991o273Q159L156O523J5022p386j9330
$$ plain form
8006 -793 -1293 -9039 -10108 -11990 -8568 15569 10741 1518 3822 12459 11902 15361 11080 -3282 -11953
7991 -11953 -23618 -20084 -9637 -22807 -28118 -8044 8551 12977 5040 11498 18049 7444 15900
7978 15900 24787 13289 8510 -1172 2917 18417 23590 7525 4178 1396 -4704 -6403 -4363 6660
7964 6660 16791 18112 13712 5459 6741 -3032 -2989 -10878 -25474 -22240 -7588 5945 18771 7607
7950 7607 -12281 -21716 -21054 -14961 -19988 -16756 -4681 -14628 -16677 -3824 12491 20010 8995 490
7936 490 6501 -856 22465 31495 31767 39713 22047 123 -4373 -9084 -9021 -6961 2116 -6084 -18853
7921 -18853 -18734 -4464 4299 12603 12580 -19 -3251 -25250 -26875 -10813 -920 5217 14864 12149
7907 12149 -8339 -26315 -5584 22040 19907 10916 4643 12802 15958 22481 37503 30117 10787
7894A0787j6859j65o836j0655J6876P94n241l055j718R27J2307j240O726K0967
7880B3615l729j3937j98J3134J5765l096q843k3166Q150L098q857k947K679j2923
7866a1255k1287n02R923J8831M7N626K040n064O044j1934k550K1736R571o544
7852A4682l583M829j4409k2243R084J3997m480J769K5089Q697k0707q437M696
7839H984L043j3742j1606p343K0659K166o105K9302N746j1268L973N550j4078
7826A5281j641l31N989j297q840l861R349L619O986p279p076K899O326Q06P39
7811B1669O097k448k8379j8420J2033n771O83m149J2862J2270J0847j2199k541
7798B554n773k0095m928n7j3185Q447L0877j5248j8846o26J5926L008k866N960
$$ plain form
7894 10787 -6072 -6237 -13073 -23728 -6852 -6058 -11299 -14354 -16072 -15145 -2838 -4078 2648 23615
7880 23615 19886 5949 5751 18885 34650 31554 22711 -455 7695 10793 1936 -1011 1668 -11255
7866 -11255 -32542 -33044 -23121 -4290 -4243 1383 3423 -1641 4403 -7531 -10081 11655 21226 14682
7852 14682 11099 15928 1519 -20724 -11640 2357 -2123 -354 24735 33432 12725 4288 8984
7839 8984 12027 -1715 -13321 -20664 -5 2161 -3944 25358 31104 19836 23809 29359 15281
7826 15281 13640 13309 19298 18001 9161 5300 14649 18268 25254 17975 10899 13798 20124 20930 21669
7811 21669 27766 25318 -3061 -21481 -9448 -15219 -14536 -18685 -5823 6447 17294 5095 2554
7798 2554 -3219 -23314 -28242 -28299 -41484 -33037 -2160 -17408 -36254 -36880 -20954 -17946 -20812 -14852
7784a4852K801j4393r302O310K476J5497J198J3293R141n531M453J1230j680r977
7770A0664j2237k954P450R249m99r632L830k519M336j94q467j947R320J2847j1536
7755G711j4000P238P407q130p481j2409l8M690J63K0347k796l678k057k3540p794
7740c4367J6191r885M471k126l596J7471J7686p346k0086J9137J8840l223j0901
7727B266m941L374j338j1497p883L635j5555K612J8929K627j0609j529J2220R629
7713A940l295p49J474m322k0379j2602l283N057K409N368J1730K248j294q607
7699b4305J1646R830Q186J757j2357n279J1690R66p62j3506J8155l644j1383j3173
7685b2179R40M683K1971P129k1723j920R250k747J147M140j4879o085n635J2132
$$ plain form
7784 -14852 -12051 -26444 -35746 -29436 -26960 -11463 -10265 3028 12169 6638 11091 22321 20641 10664
7770 10664 -1573 -4527 2923 12172 11673 2041 5871 3352 7688 7494 -973 -2920 6400 19247 7711
7755 7711 -6289 949 8356 226 -7255 -19664 -19702 -15012 -14849 5498 2702 -976 -3033 -26573 -34367
7740 -34367 -18176 -28061 -23590 -25716 -29312 -11841 5845 -1501 -21587 -2450 16390 13167 2266
7727 2266 -2675 699 -639 -12136 -20019 -16384 -31939 -29327 -10398 -7771 -18380 -19909 -7689 1940
7713 1940 -1355 -2104 -630 -4952 -25331 -37933 -41216 -36159 -33750 -28382 -16652 -14404 -15698 -24305
7699 -24305 -12659 -2829 5357 7114 -5243 -10522 1168 2134 1372 -12134 6021 2377 -9006 -22179
7685 -22179 -21239 -16556 5415 12544 -9179 -11099 -1849 -4596 -3449 691 -14188 -20273 -25908 -13776
7671a3776K282o014N580L0705O02l5883q153j481k416P386o537R695R996J680
7657f334k736O469j0067j344P63l851l176o863J7559J5640J1611j7201k1551N476
7643a5605K195q536K334R155J6623K0649j3523k7494j4506q201R885Q735k307
7630b0596Q466p634J3565J4270m234R089J2368m736k5103m026J627k808R694N661
7616E603J2713J8390o35n45k0099k0794l078J1593M478j0452J0091J710p511p976
7602f512J1668q707l766L265j4964j3687J7091n428K894J0043L571M124l325j6852
7588b0585n873M428J868k2251l181J0273J3184J3618K961J9356L53o253r691j1146
7574a2939j4159o327M345q454L695J7853j1435K722J5181p661j4519J3427J7709
$$ plain form
7671 -13776 -11494 -17508 -11928 18777 19379 -16504 -24657 -26138 -28554 -21168 -27705 -18010 -8014 -6334
7657 -6334 -9070 -2601 -12668 -14012 -13249 -17100 -20276 -27139 -9580 6060 17671 470 -21081 -15605
7643 -15605 -13410 -21946 -19612 -10457 6166 26815 13292 -14202 -28708 -36909 -27024 -18289 -20596
7630 -20596 -12130 -19764 -6199 8071 3837 12926 25294 20558 -4545 -8571 -6944 -9752 -58 5603
7616 5603 18316 36706 36071 35526 15427 -5367 -8445 3148 7626 -2826 7265 8975 1464 -6512
7602 -6512 5156 -3551 -7317 -4052 -19016 -32703 -15612 -21040 -18146 -8103 -4532 -408 -3733 -20585
7588 -20585 -26458 -22030 -20162 -42413 -45594 -35321 -22137 -8519 -5558 13798 14151 7898 -1793 -12939
7574 -12939 -27098 -33425 -29080 -37534 -33839 -15986 -27421 -24699 -9518 -17179 -31698 -18271 -562
7561e62Q860n316l562Q936L489j3089m431q51R967j3487j3838k43N207J6068r16
7546c768n550j020n322J448l825K100M880R920J3077N036j4420m271K094J925
7532B304J1166j2602n902N519q931k214J3357P888m590n445j4376K732K874j3832
7518b2052j822K0625l68o09J3228j0955j6129J2044j162L839k212k2138q012Q105
7504b7618R600J6618L69k799M919P4p651j3392p583K948Q280J5338n405m473j0984
7489b1759O383K1801P253l463k978J7441R688k8277j9244J4436P445J804N24j1518
7475d64j4900j2411j1055L954J2443K1016K173j2752q787O256j4706O361R607
7462a3265J0698n767N612M82m913k545j3366k6380q283J2280J961J7685J7068
$$ plain form
7561 -562 8298 2982 -580 8356 11845 -1244 -5675 -6526 3441 -10046 -23884 -24127 -18920 -2852 -3768
7546 -3768 -9318 -10338 -15660 -14212 -18037 -15937 -11057 -1137 11940 16976 2556 -1715 379 2304
7532 2304 13470 868 -5034 485 -8446 -10660 2697 10585 5995 550 -13826 -11094 -8220 -22052
7518 -22052 -23874 -3249 -3617 -4226 9002 -1953 -18082 -6038 -7200 -3361 -5573 -27711 -35723 -27618
7504 -27618 -18018 -1400 -1031 -3830 1089 1163 -6488 -19880 -27463 -24515 -16235 -897 -6302 -10775 -21759
7489 -21759 -15376 6425 13678 10215 7237 24678 34366 6089 -13155 1281 8726 10530 11054 -464
7475 -464 -15364 -27775 -38830 -34876 -22433 -1417 756 -11996 -20783 -14527 -29233 -22872 -13265
7462 -13265 -2567 -8334 -2722 -2240 -7153 -9698 -23064 -49444 -57727 -45447 -43486 -25801 -8733
7449h733K0931o744j6552R59J983j5230l212J2842J4190J310mk850R948Q64k132
7434G570K123n308r057M289P818K376l198j6716j0429M163k104L703Q549K964
7420c257J0795J1227P040m340j8739m704p029K502K313M777j339L872J567q954
7406d269P877M727j415j8964n512P226J5299J480R883m395j5629N480K357L442
7392G587R616J0886M186j6406q585j0287p260j792J4462j0324j6149J553P428
7379a5085o627j9254M011J6607O426J5580R910l876l366j2309m088j000J8603
7366E532R285M323m808j0642j9298j4331j5409P836L2386j8P677J6390k015m483
7352A2425o498k6024j4586l407J1693J2439Q38l536n417N353J671n407j174J0306
$$ plain form
7449 -8733 12198 5454 -11098 -10139 -8156 -23386 -26598 -13756 434 1744 1740 -1110 8838 9702 7570
7434 7570 9693 4385 -4672 -383 7435 9811 6613 -10103 -20532 -16369 -18473 -14770 -6221 -3257
7420 -3257 7538 18765 25805 21465 2726 -1978 -9007 -6505 -4192 585 -754 3118 4685 -4269
7406 -4269 3608 8335 6920 -12044 -17556 -10330 4969 6449 16332 11937 -3692 1788 4145 7587
7392 7587 17203 28089 32275 15869 7284 -3003 -10263 -12055 2407 -7917 -24066 -22513 -15085
7379 -15085 -21712 -40966 -36955 -20348 -13922 1658 11568 7692 4326 -7983 -12071 -13071 5532
7366 5532 14817 19140 14332 3690 -15608 -29939 -45348 -37512 -5126 -5144 2533 18923 16908 12425
7352 12425 5927 -20097 -34683 -38090 -26397 -13958 -13120 -16656 -22073 -16720 -15049 -20456 -21630 -11324
7338a1324j428N62O451Q773K090j7970r308j3116P239J9383j739p566N070J0803
7324b080M62m967J6818N210j3724L292K833m434P437l393j2992j86K254k53o646
7309a0369r205N388O609P566m9m12J5833O659k0748M964P061m428j629o64J6089
7294B2665j1904o763J1020J3394j1502r497j3002J306n527m375P317K552m775
7281i091k5j0815q081O992J657R661m349O195J9401N762j0607r665M714J1060
7267A2809M320j135R54J9239p083m551j8057q195P248l541q583J154K909j213
7253c725j658J194J8132K478j0567j1464K420P506Q570o869p832o167K098j062
7239f946j0554o359L390M620K689j0825J3243k631Q644K149N206n623m35J7171
$$ plain form
7338 -11324 -12752 -12190 -5739 3034 5124 -12846 -22154 -35270 -28031 -8648 -10387 -17953 -12883 -2080
7324 -2080 -1618 -6585 10233 15443 1719 5011 7844 3410 10847 7454 -5538 -5724 -3470 -3723 -10369
7309 -10369 -19574 -14186 -7577 -11 -60 -472 15361 22020 1272 6236 13297 8869 7240 6576 22665
7294 22665 10761 3998 15018 28412 16910 7413 -5589 -4283 -9810 -14185 -6868 -4316 -9091
7281 -9091 -9116 -19931 -28012 -21020 -19363 -9702 -14051 -7856 11545 17307 6700 -2965 1749 12809
7267 12809 17129 15994 16948 36187 29104 24553 6496 -1699 5549 2008 -6575 -5421 -2512 -3725
7253 -3725 -5383 -4189 13943 16421 5854 -5610 -3190 4316 12886 6017 -1815 -7982 -5884 -6946
7239 -6946 -17500 -23859 -20469 -15849 -13160 -23985 -10742 -13373 -4729 -2580 2626 -2997 -3432 13739
7225A3739j54j96N773j597Q4j9832j5527K932k406N565J1845j177k0117m141J409
7210b3800J3320R232l2873q830J6579J48L608K900n909k864O026K441p58J6696
7196d084q937j1165Q606Q346j4792j745p52J2662m474n649j3832j0822J1782J1561
7182b3295m347J2234j780j09O697M390J2065k214p90J8334R401j9061j1147L915
7168D293J245K991m377m704q242p243j2889Q556M700J5459J3221l036j0313o668
7154g007j2132J3418P891r582K942o050J628J420N398J822o564J1924J6461K440
7140B4009N51o664j9893j7766M627J1848p601l768q115P917J9556N20j5338R341
7126g76M757P545m657n390q485j965j250p339L1487n105j7663p452k838J052k491
$$ plain form
7225 13739 13585 13389 19162 17565 17649 -2183 -17710 -14778 -17184 -11619 226 -951 -21068 -25209 -23800
7210 -23800 -10480 -1248 -34121 -42951 -26372 -26224 -22616 -19716 -25625 -28489 -22463 -20022 -20780 -4084
7196 -4084 -13021 -24186 -15580 -7234 -22026 -23771 -24523 -11861 -16335 -21984 -35816 -46638 -34856 -23295
7182 -23295 -27642 -15408 -17188 -17297 -10600 -6210 5855 3641 2851 21185 30586 11525 378 4293
7168 4293 5538 8529 4152 -552 -8794 -16037 -28926 -20370 -15670 -211 13010 9974 -339 -7007
7154 -7007 -19139 -5721 2170 -7412 -4470 -10520 -8892 -7472 -2074 -252 -6816 5108 21569 24009
7140 24009 24560 17896 -1997 -19763 -15136 -3288 -10889 -14657 -22772 -14855 4701 5221 -10117 -776
7126 -776 3981 11526 6869 1479 -7006 -8971 -10221 -17560 13927 8822 -8841 -16293 -19131 -18079 -20570
7111b0570P639L096K678J0405J6153k7n784m467n929M773j6596j2498L529N144
7097a2454K0093K148l040k5321J066N559J4122J0305J9872O065k0273j0163j5567
7084g588p648Q320J2838j083k024n127M350k313J3816l972p83R539k21m916j1221
7069A967o772J1054P218j2972r304n035l219r030J1219J315m489j0445O228R076
7055a3189J9769M08k6043j6161j4017Q937M499J0414J0601J3564J1042k223j2639
7042e038L171j2866j398J3336K5452l591K571L392l352m156j8j0951k1312n911
7028b0671k891J2136J0581o322J3974m352j5921j3615p875J9073L412N276j261
7015h456j693J445q760l560N457P516k563j569k1511j0199K1957J4873L327N518
$$ plain form
7111 -20570 -12931 -9835 -7157 3248 19401 19374 13590 9123 3194 7967 -8629 -21127 -17598 -12454
7097 -12454 7639 9787 6747 -18574 -17508 -11949 2173 12478 32350 38415 18142 7979 -7588
7084 -7588 -15236 -6916 5922 4839 2815 -2312 2038 -275 13541 9569 8786 18325 18104 13188 1967
7069 1967 -4805 6249 13467 495 -8809 -13844 -17063 -26093 -14874 -13559 -18048 -28493 -22265 -13189
7055 -13189 6580 6988 -19055 -35216 -49233 -40296 -35797 -25383 -14782 -1218 9824 7601 -5038
7042 -5038 -1867 -14733 -16131 -2795 22657 19066 21637 25029 21677 17521 17503 6552 -14760 -20671
7028 -20671 -23562 -11426 -845 -7167 6807 2455 -13466 -27081 -34956 -15883 -12471 -7195 -8456
7015 -8456 -10149 -8704 -17464 -21024 -15567 -8051 -10614 -12183 -33694 -43893 -21936 -7063 -3736 1782
7001A782J614L110L669j8548j1649o226m615j47m4J2315p796j6078K4910J9464
6987A761O49j5150L610L003J2482J5133q375j1462M463q68N260k717Q63l982j1056
6972f386j3093m133j0743N708K5857O35m166K0733M094j5047K54r352L655N304
6958C320j9153j2590J6021Q596j5156j9864J2686K3537J5493N554k0064k9441
6946c1061q437J7918J9280J8316j0609K289R23j3512j0197J4499j4118k3545j7287
6933e5541P794J3540K5933J7732P840l013k0451r100J724P51J085N244N551P516
6919F605j0419k2394n822Q900J2450J8495j5492j2799K5528M465L461p978q388
6906c388Q971j8016p230K2166o378q522m92j6474N538J8920J5634q429M348Q637
$$ plain form
7001 1782 3396 6506 10175 -8373 -20022 -26248 -30863 -31010 -31054 -18739 -26535 -42613 -17703 1761
6987 1761 2410 -12740 -9130 -6127 6355 21488 13113 1651 6114 5246 10506 7789 8652 4670 -6386
6972 -6386 -19479 -23612 -34355 -28647 -2790 -2155 -6321 14412 18506 3459 3713 -5639 -1984 3320
6958 3320 -15833 -28423 -12402 -3806 -18962 -38826 -26140 -2603 12890 18444 -1620 -31061
6946 -31061 -39498 -21580 -2300 16016 5407 7696 8619 -4893 -15090 -591 -14709 -38254 -55541
6933 -55541 -47747 -34207 -8274 9458 17298 14285 -6166 -15266 -13542 -12791 -11706 -6462 -911 6605
6919 6605 -3814 -26208 -32030 -23130 -10680 7815 -7677 -20476 5052 9517 12978 5000 -3388
6906 -3388 5583 -12433 -19663 2503 -3875 -12397 -12889 -29363 -23825 -4905 10729 2300 6648 15285
6892A5285j1682Q746j421n577j6736j7407J590K3987J3686o100j7752j6607Q122
6879b1866J2854N217J3095J0903J1998j7300K702O723O57j5830n907N378J4540
6866B3164J526r582j8039J101J0183J9896J987j4380j6257n341L440j0808P150
6853e960P923p852L845J169j609M058M71q504n422Q839Q11M550Q0j1647J7516
6838H268Q907j703P814r681k4907J4636J2131p565j0786N2P806K6L094l047j3697
6823h652p372M403j0588Q017K02K196K2918J6117n41j5345j9167o474J853j759
6809a4192L917O062J3170J152r526M106j7882r907j412L477K8083P402n16j4897
6795i63p78K820r647N117m46j1633p454L138p247N408J5986N906j1788K084p093
$$ plain form
6892 15285 3603 12349 10928 5351 -11385 -28792 -27202 -3215 10471 4371 -13381 -29988 -21866
6879 -21866 -9012 -3795 9300 20203 32201 14901 17603 24326 24983 9153 3246 8624 23164
6866 23164 24690 15108 -2931 -1830 8353 28249 30236 15856 -401 -5742 -2302 -13110 -5960
6853 -5960 1963 -5889 -2044 -875 -2484 1574 2045 -6459 -11881 -3042 -2231 2319 2399 -9248 8268
6838 8268 17175 15472 23286 13605 -11302 3334 15465 7900 -2886 -2834 4972 4998 8092 5045 -8652
6823 -8652 -16024 -11621 -22209 -14192 -13990 -11794 11124 27241 26700 11355 -7812 -14286 -12433 -14192
6809 -14192 -10275 -4213 8957 10109 583 4689 -13193 -23100 -24512 -21035 7048 14450 13934 -963
6795 -963 -1741 1079 -8568 -3451 -3897 -15530 -22984 -19846 -27093 -21685 -5699 207 -11581 -9497 -16590
6780a6590j5708Q645J4723L279O429L061m378m729J3823l585j259r717L858n428
6766g576o880J119K408P977j899l096m688K710L079k4191j3822Q075J6059L817
6752a6908J4551K2839r627j5911J652K0888M167p787R808J4190p658j6351o861
6739F992J0875r603n293R63M848k570j189J2162K0567N938p813R351J1125J8028
6725G4381L3078J2651J9401M5115N2903M1674K7087K9351K389r924n6839r9464
6713A71803o3898k7320j4910k2618q500k0132k164Q426n678r970R242L207j917
6700A5571K590M302M377J7517j569r948o144j2777q854k341J3879J4561p73j5969
6686A4422j9411k2851o348J4939N796J924o504n068J4166J8410l748j3707k5350
$$ plain form
6780 -16590 -32298 -23653 -8930 -5651 778 3839 -539 -5268 8555 4970 3711 -6006 -2148 -7576
6766 -7576 -14456 -13337 -10929 -2952 -4851 -7947 -12635 -9925 -6846 -31037 -44859 -36784 -20725 -16908
6752 -16908 -2357 20482 10855 -5056 -3404 17484 21651 13864 23672 37862 30204 13853 6992
6739 6992 17867 8264 2971 3934 8782 6212 5023 17185 37752 43690 35877 45228 56353 74381
6725 74381 107459 120110 139511 184626 237529 279203 306290 335641 338030 328106 271267 171803
6713 171803 107905 80585 65675 43057 34557 14425 12261 20687 15009 5039 14281 17488 15571
6700 15571 18161 22463 26840 44357 42788 32840 26696 13919 5065 2724 16603 31164 30391 14422
6686 14422 -4989 -27840 -34188 -19249 -13453 -11529 -18033 -23101 -8935 9475 5727 -7980 -33330
6673c3330k579J2489n144Q892K3452q482p811J601m981o48j713N607J1961J1802
6659A1116j2481j444n896j9410J0734J4762K077J4047q600m217q572q533N652
6646a0765J0364L059k319k7775M693J8645n068j1183M854J5483J5740j736j3888
6633A04j3166r474J9644J3029q000R730J2731M752K124j2073o404l190l146q086
6619a425p877j8725j1930J2057L939L018j372J9056J9832R66k138k38p708k1034
6605a3579K694J2430J923o833j449O456R067K102j3513j3707R036m064Q8J2727
6591C378K68j5947l086q114L354l279n702P018J8541J3159j713o590J121n54k3499
6576b1645j110P346K23R489o594r630J0981n702n358j735J1654N092J2949N901
$$ plain form
6673 -33330 -35909 -23420 -28564 -19672 3780 -4702 -12513 -10912 -15893 -16541 -18254 -12647 -686 11116
6659 11116 -1365 -2809 -8705 -28115 -17381 -2619 -542 13505 4905 688 -7884 -16417 -10765
6646 -10765 -401 2658 339 -27436 -22743 -4098 -9166 -20349 -15495 -12 15728 13992 104
6633 104 -13062 -22536 -2892 10137 2137 11867 24598 29350 31474 19401 12997 9807 6661 -1425
6619 -1425 -9302 -28027 -39957 -27900 -23961 -20943 -22315 -3259 16573 17539 15401 15163 7455 -13579
6605 -13579 -10885 1545 3468 -3365 -4814 1642 10709 12811 -702 -14409 -5373 -9437 -9349 3378
6591 3378 3646 -12301 -15387 -23501 -20147 -23426 -29128 -22110 -3569 9590 7877 1287 2408 1854 -21645
6576 -21645 -22755 -15409 -15186 -5697 -12291 -21921 -10940 -16642 -22000 -23735 -12081 -6989 5960 11861
6562A1861J1369j1612l8362J226k915j0733r220K4235J6449j3531J037P515M397
6549h284M147K431Q980P604r599p353M699P186L038l51J1962m251k1018k3623
6535b4432k290P913J6312J965M234n520q851j1060P346l144j3280J995M646N576
6521a8590P224O511J8607k038K88P922m58m969q531J0571j1699r730J2107p050
6507A65M15m727l134M174p33k295L97p173K296j7740J16n815J0314M564M302O643
6491h231Q660P596L119j0489k6313p426J353n506P329J3900j038l438N213l080
6477a8351L146J0442J4809R31J890l463q667o777J3783O544j1688O243O813J1515
6463B7170O1k8384p909K647P92P892k577M493j232m062m894J733j1089k910n78
$$ plain form
6562 11861 23230 11618 -26744 -25518 -28433 -39166 -48386 -24151 -7702 -21233 -20196 -12681 -8284
6549 -8284 -4137 -1706 7274 14878 5279 -2074 2625 9811 12849 12498 24460 20209 -809 -24432
6535 -24432 -26722 -18809 -2497 -532 3702 -1818 -10669 -21729 -14383 -17527 -30807 -28812 -24166 -18590
6521 -18590 -11366 -4855 13752 11714 12002 19924 19466 14497 5966 16537 4838 -4892 7215 165
6507 165 580 -4147 -7281 -3107 -3840 -6135 -5738 -12911 -10615 -28355 -28239 -34054 -23740 -19176 -14874 -8231
6491 -8231 429 8025 11144 655 -25658 -33084 -31731 -37237 -29908 -16008 -17046 -20484 -15271 -18351
6477 -18351 -15205 -4763 10046 10977 12867 9404 737 -6040 7743 14287 2599 8842 15655 27170
6463 27170 27231 -1153 -9062 -6415 -5623 2269 -308 4185 2953 -1109 -6003 -4270 -15359 -18269 -18847
6448a8847r122n970J9050K4668K236O926J762p656n777r780o686M84R813O882
6434G983J1134J0346j7290n218J385j7484m424J2087O193Q837j8559r735m239
6421a8984L372O703K5304O226j2417j9975j2142J2523J1038Q877m570o399j9204
6408a9648P968N677P900l523J2684j327j2882r338P715o080k353j0694Q771l884
6394a9014N186j957o940r91N956L205k346m868m390M818J1239K379j866k8087
6380c7676O916K9709K3220r228j4681k0447N148J2579J2848R572j201m977R671
6367B1453L805J887j3005j5969N024P741r998k3174j4026N846J1799L0602J5293
6354B7278J963r679n759k0322j0048l25O964l171O552K6417n298j6836J284k070
$$ plain form
6448 -18847 -27969 -33939 -14889 9779 12015 18941 20703 13047 7270 -2510 -9196 -8712 1101 7983
6434 7983 19117 29463 12173 6955 8340 -9144 -13568 -1481 4712 13549 -5010 -14745 -18984
6421 -18984 -15612 -8909 16395 22621 10204 -9771 -21913 -9390 1648 10525 5955 -444 -19648
6408 -19648 -11680 -6003 1897 -1626 11058 9731 -3151 -12489 -4774 -10854 -13207 -23901 -15130 -19014
6394 -19014 -13828 -15785 -22725 -23716 -17760 -14555 -16901 -21769 -26159 -21341 -10102 -7723 -9589 -37676
6380 -37676 -30760 -1051 22169 12941 -1740 -22187 -17039 -4460 8388 17960 16759 11782 21453
6367 21453 25258 27145 14140 -1829 3195 10936 938 -22236 -36262 -30416 -18617 11985 27278
6354 27278 29241 19562 13803 -6519 -16567 -16892 -9928 -13099 -6547 19870 14572 -2264 -980 -3050
6340c050j485J2640o278L496k204j2280k1893p464L0230J2915j7414j165R074
6327d878j2050l324O075o543P465O889K783m845J0072o338q421R022J158n830
6313h765L104O048k848Q089M325L818Q256Q650J010J3042j0896k3589j6975j4512
6299b1243l330L395o05K949J6430N552k9292j947J2724j493J1094K4767L569j1117
6285A1453j0154j606l796n303P329j0664J8319K075q077M001J659p850j3333l524
6271a9471m315O411Q279j341q151J8023j220r212j2674J051K0824J7305O960N563
6257B8032j583n46j0593k0456k904J6867J3982R83m727n366k354j077j7227o037
6243a3006J4259p051j3674J9521P728o132j395p57Q053q35M515j8182j3856J4086
$$ plain form
6340 -3050 -4535 8105 1827 5323 3119 -9161 -31054 -38518 -8288 4627 -12787 -13952 -4878
6327 -4878 -16928 -20252 -14177 -20720 -13255 -6366 -3583 -8428 1644 -4694 -13115 -4093 -2935 -8765
6313 -8765 -5661 387 -2461 5628 9953 13771 22027 30677 31687 44729 33833 10244 -6731 -21243
6299 -21243 -24573 -21178 -21783 -18834 -2404 3148 -26144 -28091 -15367 -16860 -5766 19001 22570 11453
6285 11453 1299 -307 -4103 -9406 -2077 -12741 5578 7653 -424 3577 5236 -2614 -15947 -19471
6271 -19471 -23786 -17375 -9096 -10437 -18588 -565 -1785 -10997 -23671 -22620 -1796 15509 22469 28032
6257 28032 26449 25903 15310 -5146 -8050 8817 22799 23782 19055 13689 11335 10258 -6969 -13006
6243 -13006 1253 -5798 -19472 49 7777 1645 250 -507 7546 6711 11226 -6956 -20812 -6726
6229f726Q312K58K831J0213j4106j5584L884m497j8239m28n614J3253J4808L7
6215a1598j3515R400k318j809N675J7822J0042j2910r869j458J0069Q373K01r878
6201a773j1384M346j4180j5824J3382l345O168K0433O631Q802j672Q603k3336
6188c149p761L807l202o354r444J3098J8526N683o404q607J656N029K258P49Q178
6173A4063M82r627K648o363l718J162j0641q402r49R906K0439k124N377n775Q208
6158A4686J2155j8438j3104O110k933j4896P763L390o154r897m417m125m065J669
6144c2256J5471J0831k2531O460l831J8517K4344j0620J4686R868k282j2986j1841
6131C830M739q864p675j3604j158Q776m072n385q163L224N210j216Q584j2086
$$ plain form
6229 -6726 1586 1844 4675 14888 782 -14802 -10918 -15415 -33654 -34082 -39696 -26443 -11635 -11598
6215 -11598 -25113 -15713 -18031 -19840 -14165 3657 13699 789 -9080 -10538 -469 7904 8105 -1773
6201 -1773 -13157 -8811 -22991 -38815 -25433 -28778 -22610 -2177 4454 13256 11584 20187 -3149
6188 -3149 -10910 -7103 -10305 -16659 -26103 -13005 5521 11204 4800 -3807 -2151 2878 5136 5885 14063
6173 14063 14545 4918 7566 1203 -2515 -1353 -11994 -20396 -21345 -11439 9000 6876 12253 6478 14686
6158 14686 26841 8403 -4701 1409 -1524 -16420 -8657 -5267 -11421 -21318 -25735 -29860 -33925 -32256
6144 -32256 -16785 -5954 -28485 -22025 -25856 -7339 17005 6385 21071 30939 28657 15671 3830
6131 3830 8569 -295 -7970 -21574 -22732 -13956 -18028 -23413 -31576 -28352 -23142 -24358 -15774 -27860
6117b7860K876j329p598L965K8405J5364j0881r636L983Q776m484o216L735j5368
6103a6268m158J5558J4540K724L25M68k828o646o803J361r552R08J1186O70p737
6088f252o292n550J7811N604n04k508r36O574L025k0655j8863Q00J6928L319L430
6073d069O626k532J1256p948m932n936K382J1879m318q994j0818J6473L531n346
6059b746k454l746J5204Q84j283L562o057n664j1835k024l35J1028o060j3306
6045b4832J2578K883m717k458J1631N998l799M575n710m79j3764n384N123J2878
6031e477m254j1031r590O033Q321J3032M341n12j1659q704L338J0425J2155o730
6017c12k134K176M753r127o247l536M720L331m235R021J0011o940p445J1453J0944
$$ plain form
6117 -27860 -24984 -26313 -33911 -29946 -1541 13823 2942 -6694 -2711 6065 1581 -4635 -900 -16268
6103 -16268 -20426 -4868 9672 12396 12721 13189 10361 3715 -3088 -1727 -11279 -10371 815 1485 -6252
6088 -6252 -12544 -18094 -283 5321 4817 2309 1373 7947 10972 -9683 -28546 -27746 -10818 -7499 -4069
6073 -4069 2557 25 11281 3333 -1599 -7535 -5153 6726 2408 -6586 -17404 -931 2600 -2746
6059 -2746 -5200 -8946 6258 7142 5859 9421 3364 -2300 -14135 -16159 -16494 -5466 -11526 -24832
6045 -24832 -12254 -9371 -14088 -16546 -4915 1083 -2716 1859 -3851 -4330 -18094 -23478 -18355 -5477
6031 -5477 -9731 -20762 -30352 -24319 -15998 -2966 1375 863 -10796 -19500 -16162 -5737 6418 -312
6017 -312 -2446 -270 4483 -4644 -10891 -14427 -9707 -6376 -10611 -1590 8421 1481 -5964 5489 16433
6002A6433Q030o259k603o6k6047r152n074k593K1900Q907N260M068N476r565k2749
5987a4034j5355J2702J1028j0223J0694J0203k640p373r269J88J6861J1071J943
5974A5796r721k35N115l563P29P910k335K666q817j8300l407R66M863K1875N592
5959A9134o093M21j62O708n622q616P295k000O551Q594l06j5372j4340q741m323
5944a6872R55j8042q381J5791J9454L535j2254o065J06R378J8825k496q405j576
5930f047N8N127L395j8659r832J3282R440J3095j9648j0104K892P096j2697j7271
5916c9873j5626K4846K2259P939K789Q14q219K281K694N633K7249J053j1356k5735
5902c252r126r136Q696P151j327j5217n725K833J382m717Q989M594j202m443l322
$$ plain form
6002 16433 24463 18204 15601 15535 -10512 -19664 -24738 -27331 -5431 3476 8736 12804 18280 8715 -14034
5987 -14034 -29389 -16687 -5659 -15882 -5188 5015 2375 -4998 -14267 -14079 2782 13853 15796
5974 15796 6075 5840 10955 7392 8121 16031 13696 16362 7545 -10755 -14162 -13196 -8333 13542 19134
5959 19134 13041 13462 13300 20008 14386 5770 13065 11065 17616 26210 25904 10532 -3808 -12549 -16872
5944 -16872 -15917 -33959 -42340 -26549 -7095 -3560 -15814 -21879 -21773 -12395 6430 3934 -4471 -6047
5930 -6047 -5989 -862 2533 -16126 -25958 -12676 -3236 9859 -9789 -19893 -17001 -9905 -22602 -39873
5916 -39873 -55499 -30653 -8394 -455 2334 3148 -5071 -2790 -96 5537 32786 33839 22483 -3252
5902 -3252 -12378 -21514 -12818 -5667 -6994 -22211 -27936 -25103 -23721 -28438 -19449 -14855 -16057 -20500 -23822
5887b3822l945M961m918o993P150J0603Q700J1204J0976k4494k9951J1399K2458
5874f672Q57m517p063N356M256L734J533j2476J1745J0889N393M282o475j2029
5860a187j2862p963L470R787J3268l824J91O263n723n811m220n582P882K1860
5846A5549J0849j935R139P768O181K652j5190j3617k894J0794j4689J0221r832
5833A4996j7666k712M909j1892Q80Q72Q8P685L587m481j0545K971J2295O254J2877
5818B0118o268k1158o500n628L309Q76N746m499L550P04J212j4948K352Q750R888
5803b496P144j4461k2284j0269J3383Q642p812R463Q035k478J2783J2555K081
5790A4286j07L544j2425j0416L174K0365K6921m343j5256j047N121j7082j9891
$$ plain form
5887 -23822 -27767 -22806 -27724 -34717 -27567 -16964 -8264 2940 13916 -10578 -40529 -29130 -6672
5874 -6672 -5815 -10332 -17395 -12039 -7783 -4049 -2516 -14992 -3247 7642 13035 17317 10842 -1187
5860 -1187 -14049 -22012 -18542 -8755 4513 689 880 7143 1420 -4391 -8611 -14193 -6311 15549
5846 15549 26398 24463 33602 41370 47551 50203 35013 21396 18502 29296 14607 24828 14996
5833 14996 -2670 -5382 -473 -12365 -11485 -10613 -10525 -2840 747 -3734 -14279 -11308 987 7241 20118
5818 20118 13850 -7308 -13808 -19436 -16127 -15251 -9505 -14004 -10454 -9750 -8538 -23486 -21134 -12384 -2496
5803 -2496 4648 -9813 -32097 -42366 -28983 -20341 -28153 -18690 -10655 -13133 -350 12205 14286
5790 14286 14179 17723 5298 -5118 -1944 18421 45342 40999 25743 24696 29817 12735 -7156
5777g156O24R48k423M660J4903k415p267n160o875J1034J4986K725L478j42j1770
5762A0150j3828M658O346r33j3217J3426K770K020J5070R96j7513j6184O569m661
5748d331J566L751M640j1365P713J6497j448J68r69P302M660l705p242k058j7355
5733b176O139j679Q942j6872J740J5055J3344J3576k4148J0066P323j5548j615
5720A4147k342k609J1734r314n110m196j4740m769J4370j3686j0091J4949Q177
5707c480L148r018l313j182P110O26N74o234N582R310Q311R664j622j5281j4138
5692i943Q77o415N174J3001n413N8J5761N584k5639n016N862L125o812n159M577
5677a0378J826m286j139k0941l071P683j1921J1842L6429L441q634K397k1934
$$ plain form
5777 -7156 -6532 -5584 -8007 -3347 11556 9141 1874 -3286 -10161 873 15859 18584 22062 21920 10150
5762 10150 -3678 980 7326 6393 -6824 6602 9372 11392 26462 27458 9945 -6239 330 -4331
5748 -4331 -2765 986 5626 -5739 1974 18471 17023 17191 16222 23524 28184 24479 17237 15179 -2176
5733 -2176 3963 2284 11226 -5646 -3906 11149 24493 38069 13921 23987 31310 15762 14147
5720 14147 11805 9196 20930 11616 6506 2310 -12430 -17199 -2829 -16515 -26606 -11657 -3480
5707 -3480 -332 -9350 -12663 -13845 -6735 -6109 -5535 -11769 -6187 3123 11434 21098 19476 4195 -9943
5692 -9943 -9066 -15481 -10307 2694 -2719 -2661 13100 18684 -6955 -11971 -6109 -2984 -9796 -14955 -10378
5677 -10378 -8552 -12838 -13977 -34918 -37989 -30306 -42227 -30385 6044 9485 851 3248 -18686
5664a8686R880K534k783M03J63J134l447l893m919j2625m043P514p068K7717K5059
5649A6940R120k824K414q462l722Q957L768p647r655o106r385J438q172o967J7305
5634b998J4045k897j87J1962P398l957m532K753m509R754o028j4511k3108P885
5620h930j4226M693P146l631J055k348O735L997K116M150k086L308L017J5137
5606B0133j1185K387J3859O265l416j720Q617j5649j2167m36K93o550r873j371
5592a0813p247J430j1294J3570N981q273j5590n77R707O73R192L348J7416N691
5578A3214j2674j5069j2642k946J8041K5152n560k8952j699Q838Q584R574K310
5565F171q666q502J2865j710J5570R130j1182j7052j8805m744J2498K204r700
$$ plain form
5664 -18686 -8806 -6272 -9055 -8652 -8489 -7355 -10802 -14695 -19614 -32239 -36282 -28768 -35836 -8119 16940
5649 16940 26060 23236 25650 17188 13466 22423 26191 18544 8889 2783 -6602 -5164 -13336 -20303 -2998
5634 -2998 11047 8150 7963 19925 27323 23366 18834 21587 17078 26832 20804 6293 -16815 -8930
5620 -8930 -23156 -18463 -11317 -14948 -13893 -16241 -9506 -5509 -3393 757 -1329 1979 4996 20133
5606 20133 8948 11335 25194 31459 28043 26323 34940 19291 7124 6688 6981 431 -9442 -10813
5592 -10813 -18060 -16630 -27924 -14354 -8373 -16646 -32236 -32813 -23106 -22433 -13241 -9893 7523 13214
5578 13214 540 -14529 -27171 -30117 -12076 13076 7516 -21436 -23135 -14297 -5713 3861 6171
5565 6171 -2495 -10997 1868 158 15728 24858 13676 -3376 -22181 -26925 -14427 -12223 -21923
5552b1923J2150J9662j465j0315j8216J1304L3818P399n886j7989j5648R780k860
5539a89q432J3717J8432R80o651J2982r209j5472m098j0150Q809J5812J2319j7430
5525A1420j8943j8406K402k677R263N520J9345J1462j5674M070R803m209J0885
5512B4261k346j5993q142M842P002O616p074k3835j163K1621k546j5866N675Q152
5498A204p349L516M738K288j6526k724J4531J1094r632Q065p391j9560r866J4642
5484a2970J696J6831R78n706J5849K309p455j737j3622m154q626o752l321P070
5470a9610j1198J9661J9167Q522Q763j2965j1249p649m4J1065R16j738l564j6028
5456a5951J1326o77k137p552o075p350O325P854J5895R918J327j6084j3763O049
$$ plain form
5552 -21923 -9773 9889 8424 -1891 -20107 -8803 25015 32414 26528 8539 -7109 2671 -189
5539 -189 -8621 5096 23528 24508 17857 30839 21630 6158 2060 -8090 719 16531 28850 11420
5525 11420 -7523 -25929 -23527 -26204 -16941 -11421 7924 19386 3712 7782 17585 13376 24261
5512 24261 21915 5922 -2220 2622 9624 16240 9166 -14669 -15832 5789 3243 -12623 -6948 1204
5498 1204 -6145 -2629 2109 4397 -12129 -14853 -322 10772 1140 9205 1814 -17746 -27612 -12970
5484 -12970 -11274 5557 6535 829 16678 18987 11532 9795 -3827 -7981 -16607 -23359 -26680 -19610
5470 -19610 -30808 -11147 8020 16542 25305 12340 1091 -6558 -6602 4463 5379 3641 77 -15951
5456 -15951 -4625 -5302 -7439 -14991 -21066 -28416 -22091 -14237 1658 11576 12903 -3181 -16944 -10895
5442a0895J6815O046o087j7195k7136j5495J3132J9296J2145J3800J2495K024
5430A8945k828o167j5385R61o156O621J5969r017L603K852p938j887M358j014
5416B917k501o966K804k107j4913q809r517M68R86K669r054l07J7524M494J3610
5401h702k265k733P461M421l033L435o94n244K666J1523J8355j836j465j164K564
5386B3289m143j3663j4524j1882r363L249J1867J074M153o652o248J3259L3200
5373B3616j5304j111L4l093K412Q939q157j2581p506Q030n130j9490J3497N409
5359a0435j6741J388J2740K4534P789k248K107M924q579j8886J775R912j0261
5346a981j256R943q852o552K867k382l061m356O72q10n805J0623J1654P120J7061
$$ plain form
5442 -10895 5920 11966 5879 -11316 -38452 -53947 -40815 -21519 -9374 4426 16921 18945
5430 18945 16117 9950 -5435 -4474 -10630 -4009 11960 2943 6546 9398 1460 -427 3931 2917
5416 2917 416 -6550 -3746 -5853 -20766 -29575 -39092 -38624 -37638 -34969 -44023 -44330 -26806 -22312 -8702
5401 -8702 -10967 -13700 -6239 -1818 -4851 -1416 -2110 -7354 -4688 6835 25190 23354 21889 20725 23289
5386 23289 19146 5483 -9041 -20923 -30286 -27037 -15170 -14096 -9943 -16595 -22843 -9584 23616
5373 23616 8312 7201 7235 4142 6554 15493 7336 -5245 -12751 -4721 -9851 -29341 -15844 -10435
5359 -10435 -27176 -25788 -13048 11486 19275 17027 19134 24058 15479 -3407 -1632 8280 -1981
5346 -1981 -3237 6706 -2146 -8698 -5831 -8213 -11274 -15630 -14958 -15768 -21573 -10950 704 7824 24885
5331B4885P440k6036r313P914j5173r48J5799R964l541j1275n587j744J2666K2081
5317B7132k97l0697j6959n342Q57O198J5008Q319p399k167l153J812o035M788
5303g935M791k124J4666r198o894j83N562j5622j1955R804J4287J9068J4651j69
5289B8749j6414k4274J0835J1792j4665O734M2j0212O08l110j0111N477R304l250
5275h495L196J812R409N958m530K501j6625j5158k0766m880J3591P807L435N831
5261a6914K5004J2215n766j6625r604j1316J7174N238K455J1344j3611j7522k833
5248b0761M542n129q5N034K815j0575n082P637J7616k483J2452K857M202m117
5234H923j7022L14O717P869L584j2921J4001Q160n798q131j2311K549j881l997
$$ plain form
5331 24885 32325 6289 -3024 4890 -10283 -11231 4568 14532 10991 -284 -5871 -7615 5051 27132
5317 27132 26835 -3862 -20821 -26163 -25306 -19108 -4100 4219 -3180 -5347 -8500 -6688 -12723 -7935
5303 -7935 -3144 -5268 9398 200 -6694 -6877 -1315 -16937 -28892 -19088 -4801 14267 28918 28749
5289 28749 12335 -11939 -1104 10688 -3977 2757 2799 -7413 -6805 -9915 -20026 -14549 -5245 -8495
5275 -8495 -5299 -3487 5922 11880 7350 9851 -6774 -21932 -42698 -47578 -33987 -26180 -22745 -16914
5261 -16914 8090 20305 14539 -2086 -11690 -23006 -5832 -594 1861 13205 -406 -17928 -20761
5248 -20761 -16219 -21348 -21433 -16399 -13584 -24159 -29241 -21604 -3988 -6471 5981 8838 13040 8923
5234 8923 -8099 -7785 -1068 6801 10385 -2536 11465 19625 13827 5696 -6615 -4066 -5947 -9944
5220i944j2332J0581J5536j328k863M471m796j1519K557j5378J5608K6711q445
5207H859k1232R649J3765q254J737P38p425r957Q803J5188N755n824j1470j7002
5193a6670K593L85M933K2381l68j8745n731j2412M384K227m29R896J5499k189
5179E754r141Q089q099K595M83K529k126j6262P008N844P740j1984m578J2738
5165E90K881j3393n298r571L158L693J3256J4103J3270j2157j3339J0983J3121
5152B1297J0596j8920p963J0718J1467L487j4989l641p665j9172r12J975N264
5139h458O090p179m207R099o878m47L965l594n778K617O476L5052P765o595l0208
5124b280j4110l919K4931O373j7934n821j111l587J2205j018P283J1015m264j1655
$$ plain form
5220 -9944 -22276 -11695 3841 2513 -350 4121 -675 -12194 -9637 -25015 -9407 17304 8859
5207 8859 -12373 -2724 11041 2787 4524 5262 -2163 -12120 -3317 11871 17626 11802 332 -16670
5193 -16670 -14077 -13692 -8759 13622 13254 -5491 -11222 -23634 -19250 -17023 -17452 -7556 7943 5754
5179 5754 -3387 4702 -3397 -802 -319 2210 84 -16178 -9170 -3326 4414 -7570 -12148 590
5165 590 3471 -9922 -15220 -24791 -21633 -17940 -4684 9419 22689 10532 -2807 8176 21297
5152 21297 31893 12973 5010 15728 27195 30682 15693 12052 4387 -14785 -15697 -13722 -8458
5139 -8458 -2368 -9547 -13754 -4655 -11533 -11980 -8015 -11609 -17387 -14770 -8294 26758 34523 27928 -2280
5124 -2280 -16390 -20309 4622 10995 -6939 -12760 -13871 -17458 -5253 -6271 1012 12027 7763 -3892
5110c892J7020J2636J338J107j4693n364k0980k7149j686J3992O529R239J0734
5097a169J1155J339m222l73j3543p626k544J1602J0841J917J0811q316K024o27
5083A1269K797o447J0388j8085J1251m835N2K3641J3768p362n060o516j5034j5040
5069e213n457j0937J2593Q646L050o019j1593J3456J6124j8165j3516L5535J8763
5056C7267j8026j0941m588l689o558m78J5232k298J1190N821P10J0027K647j6586
5042A9730j0662j6215J5853L522q22O943M777n663m057o515j391K959Q206J971
5028A8636J463N98j8438m918J5281m962k7544l366N749J8445o664O609J1467N50
5014A2906j4043l194J029K998j583j673J1866r712k6412l054J307P009M077J8706
$$ plain form
5110 -3892 13128 25764 27102 28209 13516 8152 -12828 -39977 -41663 -27671 -21142 -11903 -1169
5097 -1169 9986 11325 7103 6730 -6813 -14439 -16983 -5381 5460 7377 18188 9872 11896 11269
5083 11269 14066 7619 18007 -78 11173 6338 6390 30031 43799 36437 31377 24861 9827 -5213
5069 -5213 -10670 -21607 -9014 -368 2682 -3337 -14930 -1474 14650 -3515 -17031 18504 37267
5056 37267 19241 8300 3712 23 -6535 -7013 8219 5921 17111 22932 23642 33669 36316 19730
5042 19730 9068 -7147 8706 12228 11406 18349 23126 17463 13406 6891 5500 8459 16665 18636
5028 18636 20099 20697 2259 -2659 12622 7660 -19884 -23250 -17501 944 -5720 889 12356 12906
5014 12906 -1137 -4331 -3302 -304 -1887 -3560 8306 -1406 -27818 -30872 -29565 -22556 -18479 227
5000B27N326J518J1935m178j8535M101J1285R510p513k5814j3539J4328J9251
4987G902n298m446p852r065N378L427J2394M682j910n29j4623k0146K5108J3176
4973H198p566k0824k0072OL86J0088L37j3658J4147Q661N026J354J2390J5613
4959A4086n644m638k0298l036J2755L971J1474n317k2172M952J8230K2944j8048
4946I259j6952q311J2199L443l660m571j6617j205Q074J775O672L0096r663j7880
4932g341M04J1359j594N039m77j8504m924m507Q970j772Q333N937q194j5310R885
4917a2696N585J2926J356m647N680m748j1503o319q963K717J6360J4090n935o981
4903c078o244j8502j940n541N895K0949k558k947P133k662n806O287k779L637
$$ plain form
5000 227 5553 7071 19006 14828 -3707 394 11679 21189 13676 -12138 -25677 -11349 7902
4987 7902 2604 -1842 -9694 -18759 -13381 -9954 2440 7122 5212 4683 -9940 -30086 -4978 8198
4973 8198 632 -20192 -40264 -40258 -39872 -29784 -29447 -43105 -28958 -20297 -15271 -13917 -1527 14086
4959 14086 8442 3804 -16494 -19530 -6775 -2804 8670 3353 -18819 -13867 4363 27307 9259
4946 9259 -7693 -16004 -3805 -362 -4022 -8593 -25210 -26415 -18341 -16566 -9894 20202 10539 -7341
4932 -7341 -6937 4422 2828 7867 7390 -11114 -16038 -20545 -11575 -13347 -5014 923 -7271 -22581 -12696
4917 -12696 -7111 5815 7171 2524 8204 3456 -8047 -14366 -23329 -20612 -4252 9838 3903 -3078
4903 -3078 -9322 -27824 -29764 -35305 -29410 -8461 -11019 -13966 -6833 -9495 -15301 -9014 -11793 -8156
4889h156j4189q120K200K6641K2967j2607k5625k616lJ9089J9600p209n934m918
4875A120k3730L843K0558P445p077j2214p342M631j6642J2399J0940n500l410
4862a4979j662k544j770n783L787m138j1714j3085k940K8300j049q575K276P056
4848b6820j5153J3J9129J5147M624o40r519p705k857J566J6806J284j8691J900
4834b0916Q049P090j1513j195M968Q872M524j6707L010O689J2380M507p599j1281
4820i122k188l34m795R622J8741o449j4490m088P005Q494N182p412k2017J1432
4806a0419L3004r397j5950J1975k215p170L578j1447p768K2244J3294j716j576
4793A6437j9087n031n439J203J1385P058J6858m807j721o107o554O573J3759n282
$$ plain form
4889 -8156 -22345 -30465 -28265 -1624 21343 8736 -16889 -19505 -19508 -419 19181 11972 6038 1120
4875 1120 -22610 -18767 1791 9236 2159 -10055 -17397 -12766 -29408 -17009 -6069 -11569 -14979
4862 -14979 -16641 -19185 -20955 -26738 -22951 -27089 -38803 -51888 -54828 -26528 -27577 -36152 -33876 -26820
4848 -26820 -41973 -41960 -22831 -7684 -3060 -3700 -13219 -20924 -23781 -22215 -5409 -4125 -22816 -20916
4834 -20916 -12867 -5777 -17290 -18485 -13517 -4645 -121 -16828 -13818 -7129 5251 9758 2159 -9122
4820 -9122 -11310 -11644 -16439 -6817 11924 5475 -9015 -13103 -6098 2396 7578 166 -21851 -10419
4806 -10419 22585 13188 -2762 9213 6998 -172 3406 -8041 -15809 6435 19729 18013 16437
4793 16437 -2650 -7681 -13120 -11917 -532 6526 23384 18577 16856 10749 4195 10768 24527 19245
4779A9245q272k458P894Pl004P945j3421n364J953k564J448J3076j0775k6856
4765b1146m544Q066L45M866J203p022j6874K821N464o121r088L331P027K5511
4751f161J2756r668r352K490R1Q621j0200m545p022o071J5888o23j8818j0074
4737d2688L0496K3082J6091j819k3606j3893O817o720l808r264R179J3295R587
4724F749P16j2356n328j215J4350n064p51J4787l202q087m30j2346j3557O582
4710a9152R558M026J0635m756q2P450K0518K869j1573k7074r166K817N372L603
4696d955P642r89q752j3149m750P546m446n215P348O076M263j803k538n056q62
4681a9640k232J0982J413J1703O525k191l462k378J1164q356j0716L973j0217
$$ plain form
4779 19245 10973 8515 16409 16416 13412 21357 7936 2572 4525 1961 3409 16485 5710 -21146
4765 -21146 -25690 -17624 -17279 -12413 -11210 -18232 -35106 -32285 -26821 -32942 -42030 -38699 -31672 -6161
4751 -6161 6595 -3073 -12425 -9935 -9844 -1223 -11423 -15968 -22990 -29061 -13173 -13796 -32614 -42688
4737 -42688 -12192 10890 26981 25162 1556 -12337 -5520 -12240 -16048 -25312 -16133 -2838 6749
4724 6749 7465 -4891 -10219 -11434 2916 -2148 -2899 11888 8686 599 169 -12177 -25734 -19152
4710 -19152 -9594 -5568 5067 311 229 7679 28197 31066 19493 -7581 -16747 -13930 -8558 -4955
4696 -4955 2687 1698 -7054 -20203 -24953 -17407 -21853 -27068 -19720 -13644 -9381 -11184 -13722 -18778 -19640
4681 -19640 -21872 -10890 -9477 2226 8751 6560 3098 720 11884 3528 -7188 -3215 -13432
4668a3432j1566J3710M047J3749K392j2821o621m201Q631L031K247j0845o875
4655a8554R808K367j670J3392o503p049N465m683j2065P361j0996k2187J047J6072
4641b8195J7527K012j4147m392J7215J4133O902j393K694j3808o983j1347k0369
4628d0151L390J6083J4973K7073j721K104k750N734q929j6131j6863K412o874
4615b1650J310L2407O698j0839k466J2573P074o382j8192o267m165M193J3525
4602G819p47j3113j7016J6470J1533L612Q155J325j5031N708R251k601j4534r461
4588h630p941j6937p549Q880J8396P091J2395k300j9165J5132M06j6275K1724
4575E227J1282L922J258O673P00n239l010j0811r093j5581m544K2805j131o664
$$ plain form
4668 -13432 -24998 -11288 -7241 6508 8900 -3921 -10542 -14743 -6112 -3081 -834 -11679 -18554
4655 -18554 -8746 -6379 -8049 5343 -1160 -8209 -2744 -7427 -19492 -12131 -23127 -45314 -44267 -28195
4641 -28195 -10668 -8656 -22803 -27195 -9980 4153 11055 9662 12356 -1452 -8435 -19782 -40151
4628 -40151 -36761 -20678 -5705 21368 19647 21751 19001 24735 15806 -325 -17188 -14776 -21650
4615 -21650 -20340 12067 18765 7926 5460 18033 25107 18725 533 -5734 -9899 -5706 7819
4602 7819 7072 -6041 -23057 -6587 4946 8558 16713 18038 3007 8715 17966 15365 831 -8630
4588 -8630 -16571 -33508 -41057 -32177 -13781 -6690 5705 3405 -15760 -628 -222 -16497 5227
4575 5227 16509 20431 21689 28362 29062 23823 20813 10002 909 -14672 -19216 3589 2458 -4206
4561d206J2787J4657j3172r906j794n793k901Q003J971J1238K703k2327j0918
4548a9658J1270J1443K3445R394l974r641j0918o986q01r178L905R287q236M208
4534C560R710k355j196K2861j0930j6036j1448l250J3052l790p218R592n635J812
4520a271j0398j5409M360J0036J5638P896k465j2677J2429N180K92J0216P210
4507C1037j9622k5082j0457K502P256J1601p19q258L426m555M40k254k0117o74
4493c5476J9723p886l0922J3239K3897J7012J7486N985J1303n6k6206k9348j4148
4480c5397n704J0349J1910N333j6936p602L099J641Q381P110L287J4620J0021
4467A0112k55r565M576M435M872j8608O242M814o521L406r488k1068N05J8641
$$ plain form
4561 -4206 8581 23238 10066 160 -1634 -7427 -10328 -2325 -354 10884 13587 -8740 -19658
4548 -19658 -8388 3055 26500 35894 31920 22279 11361 4375 3574 -5604 -1699 7588 -648 3560
4534 3560 13270 10915 9719 32580 21650 5614 -5834 -9084 3968 178 -7040 2552 -3083 -1271
4520 -1271 -11669 -27078 -22718 -12682 2956 10852 8387 -4290 8139 13319 13611 23827 31037
4507 31037 11415 -13667 -24124 -21622 -14366 -2765 -3484 -11742 -8316 -12871 -12431 -14685 -34802 -35476
4493 -35476 -15753 -23639 -54561 -41322 -17425 -413 17073 23058 34361 34305 8099 -21249 -35397
4480 -35397 -41101 -30752 -18842 -13509 -30445 -38047 -34948 -33307 -24926 -17816 -14529 91 10112
4467 10112 9857 292 4868 9303 14175 -4433 1809 6623 102 3508 -5980 -27048 -26543 -7902
4453g902J8879l395l629M417L225Q5k2183J804m926j1962l928K0819N703r003
4439a1996k866J7189k317K466J7169J796R044j4118m018r456j0247J6559n047
4426D158o922p625k147P286Q461k835j4965r571P683J843J801R684J1643J820
4412A0314p006j0333K762j042J2485O076r693m030K118j0359p029M752J576J8398
4398H989o461j5636M124k304J0465J3261Q596j1172m013J091R69n843o530l096
4384g560k2904Q056L1164R841R31j1072k5874N062k85O45J1800M723j823R031
4370A1735O112N962j2286j4934J0697L056j0846r813j4217R873n10K857J448J751
4356i115Q252l141p790q325j897j5190K0681K6194K1162J181k936p638J716o636
$$ plain form
4453 -7902 10977 7582 3953 8370 11595 11680 -10503 -8699 -13625 -25587 -29515 -8696 -2993 -11996
4439 -11996 -14862 2327 10 2476 19645 21441 30485 16367 12349 2893 -7354 9205 4158
4426 4158 -2764 -10389 -12536 -5250 3211 376 -14589 -24160 -16477 -14634 -12833 -3149 8494 10314
4412 10314 3308 -7025 -4263 -5305 7180 13256 3563 -467 1651 -8708 -15737 -10985 -9409 8989
4398 8989 2528 -13108 -8984 -11288 -823 12438 21034 9862 5849 6940 7909 2066 -4464 -7560
4384 -7560 -30464 -22408 8756 18597 19528 8456 -17418 -12356 -12641 -11996 -196 4527 2704 11735
4370 11735 17847 23809 11523 -3411 7286 10342 -504 -10317 -24534 -14661 -15171 -12314 -10866 -9115
4356 -9115 -863 -4004 -11794 -20119 -22016 -37206 -16525 9669 30831 32012 29076 21438 23154 16518
4342A6518l143M245M787j319j1628q516j9156K978Q219J971P052J2357j0780j7388
4328a3803M287k382L335J2330q439J9850O522q109j6396L778j5297k235Q602J6389
$$ plain form
4342 16518 13375 17620 22407 21088 9460 944 -18212 -15234 -7015 -5044 2008 14365 3585 -13803
4328 -13803 -9516 -11898 -8563 3767 -4672 15178 21700 13591 -2805 973 -14324 -16559 -7957 8432
$$ [...]
##END NTUPLES=NMR SPECTRUM
##END=
