##TITLE=Analysis number 330400
Compound Code cc 02263
Book Reference 535/195
Project Code adrs
Chemist Name janh
##JCAMPDX= 6.0         $$ Bruker NMR JCAMP-DX V2.0
##DATA TYPE= NMR SPECTRUM
##DATA CLASS= NTUPLES
##ORIGIN= Bruker BioSpin GmbH
##OWNER= nmr
$$ XWIN-NMR		Version 3.5
$$ Thu Nov 22 09:57:27 2007 GMT Standard Time (UT+0h)  MAYBRIDGE\nmr@NMR_250MHZ
##.OBSERVE FREQUENCY= 250.131544655141
##.OBSERVE NUCLEUS= ^1H
##.ACQUISITION MODE= SIMULTANEOUS (DQD)
##.ACQUISITION SCHEME= undefined
##.AVERAGES= 16
##.DIGITISER RES= 18
##SPECTROMETER/DATA SYSTEM= dpx250
##.PULSE SEQUENCE= zg30
##.SOLVENT NAME= CDCl3
##.SHIFT REFERENCE= (INTERNAL, CDCl3, 0, 16.4528)
##AUDIT TRAIL= $$ (NUMBER, WHEN, WHO, WHERE, WHAT)
$$ ##TITLE= Audit trail, XWIN-NMR		Version 3.5
$$ ##JCAMPDX= 5.01
$$ ##ORIGIN= Bruker BioSpin GmbH
$$ ##OWNER= nmr
$$ C:\u/data/dgb/nmr/ADRS/2030/pdata/1/auditp.txt
$$ ##AUDIT TRAIL=  $$ (NUMBER, WHEN, WHO, WHERE, WHAT)
(   1,<2007-11-22 09:56:57.97 +000>,<MAYBRIDGE\nmr>,<NMR_250MHZ>,
      <created by zg, POWCHK disabled, PULCHK disabled
       configuration hash MD5:
       76 6E 9A 78 1E 09 19 81 EC 84 63 8F B0 6A 59 2D
       data hash MD5: 64K
       34 3E 6A 1B F8 AC C7 FF D7 02 64 A8 85 AB 70 94>)
(   2,<2007-11-22 09:57:16.54 +000>,<MAYBRIDGE\nmr>,<NMR_250MHZ>,
      <Start of raw data processing
       ef LB = 0.3 FT_mod = 6 PKNL = 1 SI = 32K 
       data hash MD5: 32K
       64 E7 70 2F DB D9 29 7B 8D C2 F9 3C D2 24 3B 8B>)
(   3,<2007-11-22 09:57:18.15 +000>,<MAYBRIDGE\nmr>,<NMR_250MHZ>,
      <apk 
       data hash MD5: 32K
       55 3F 0E 83 56 3A 7B C4 C2 89 A8 7B C7 C1 3F 28>)
(   4,<2007-11-22 09:57:18.87 +000>,<MAYBRIDGE\nmr>,<NMR_250MHZ>,
      <abs ABSG = 5 
       data hash MD5: 32K
       6E 1F B5 C2 7F DC C7 FF 07 B9 98 27 B9 40 3C 1F>)
$$ ##END=
$$ 
$$ hash MD5
$$ E1 71 82 71 B4 48 CC 55 5D 43 F4 D2 D1 8A 3D 2F
##$RELAX= 
##$RELAX= 
##$RELAX= 
##$RELAX= 
##$RELAX= 
##$RELAX= 
##$RELAX= 
$$ Bruker specific parameters
$$ --------------------------
##$DU= <C:\u>
##$EXPNO= 2030
##$NAME= <ADRS>
##$PROCNO= 1
##$TYPE= <nmr>
##$USER= <dgb>
##$AMP= (0..31)
100 100 100 100 100 100 100 100 100 100 100 100 100 100 100 100 100 100 
100 100 100 100 100 100 100 100 100 100 100 100 100 100 
##$AQSEQ= 0
##$AQ_mod= 3
##$AUNM= <au_zg>
##$AUTOPOS= <3 >
##$BF1= 250.13
##$BF2= 250.13
##$BF3= 250.13
##$BF4= 250.13
##$BF5= 500.13
##$BF6= 500.13
##$BF7= 500.13
##$BF8= 500.13
##$BYTORDA= 1
##$CFDGTYP= 0
##$CFRGTYP= 5
##$CHEMSTR= <none>
##$CNST= (0..31)
1 1 145 1 1 1 1 1 1 1 1 1 1 1 1 1 1 1 1 1 1 1 1 1 1 1 1 1 1 1 1 1 
##$CPDPRG= <>
##$CPDPRG1= <>
##$CPDPRG2= <>
##$CPDPRG3= <>
##$CPDPRG4= <mlev>
##$CPDPRG5= <mlev>
##$CPDPRG6= <mlev>
##$CPDPRG7= <mlev>
##$CPDPRG8= <mlev>
##$CPDPRGB= <>
##$CPDPRGT= <>
##$D= (0..31)
0 1 0 0 0 0 0 0 0 0.06 0 0 0 0 0 0 0.0002 0 0 0 0 0 0 0 0 0 0 0 0 0 0 
0 
##$DATE= 1195725416
##$DBL= (0..7)
120 120 120 120 120 120 120 120 
##$DBP= (0..7)
150 150 150 150 150 150 150 150 
##$DBP07= 0
##$DBPNAM0= <>
##$DBPNAM1= <>
$$ [...]
##$SUBNAM7= <"">
##$SUBNAM8= <"">
##$SUBNAM9= <"">
##$SW= 20.6930455092707
##$SWIBOX= (0..15)
0 0 3 0 0 0 0 0 0 0 0 0 0 0 0 0 
##$SW_h= 5175.983436853
##$TD= 65536
##$TD0= 1
##$TE= 295.16
##$TE2= 300
##$TE3= 300
##$TEG= 300
##$TL= (0..7)
0 120 120 120 120 120 120 120 
##$TP= (0..7)
150 150 150 150 150 150 150 150 
##$TP07= 0
##$TPNAME0= <>
##$TPNAME1= <>
##$TPNAME2= <>
##$TPNAME3= <>
##$TPNAME4= <>
##$TPNAME5= <>
##$TPNAME6= <>
##$TPNAME7= <>
##$TPOAL= (0..7)
0.5 0.5 0.5 0.5 0.5 0.5 0.5 0.5 
##$TPOFFS= (0..7)
0 0 0 0 0 0 0 0 
##$TUNHIN= 0
##$TUNHOUT= 0
##$TUNXOUT= 0
##$USERA1= <user>
##$USERA2= <user>
##$USERA3= <user>
##$USERA4= <user>
##$USERA5= <user>
##$V9= 5
##$VALIST= <valist>
##$VCLIST= <CCCCCCCCCCCCCCC>
##$VD= 0
##$VDLIST= <DDDDDDDDDDDDDDD>
##$VPLIST= <PPPPPPPPPPPPPPP>
##$VTLIST= <TTTTTTTTTTTTTTT>
##$WBST= 1024
##$WBSW= 4
##$XGAIN= (0..3)
0 0 0 0 
##$XL= 0
##$YL= 0
##$YMAX_a= 376452
##$YMIN_a= -506110
##$ZGOPTNS= <>
##$ZL1= 120
##$ZL2= 120
##$ZL3= 120
##$ZL4= 120
##$ABSF1= 16.45282
##$ABSF2= -4.240353
##$ABSG= 5
##$ABSL= 3
##$ALPHA= 0
##$AQORDER= 0
##$ASSFAC= 0
##$ASSFACI= 0
##$ASSFACX= 0
##$ASSWID= 0
##$AUNMP= <proc_1d>
##$AZFE= 0.1
##$AZFW= 0.1
##$BCFW= 0
##$BC_mod= 0
##$BYTORDP= 0
##$COROFFS= 0
##$CY= 12.5
##$DATMOD= 1
##$DC= 0
##$DFILT= <>
##$DTYPP= 0
##$F1P= 14.0000005364418
##$F2P= -0.99999901652339
##$FCOR= 0.5
##$FTSIZE= 32768
##$FT_mod= 6
##$GAMMA= 0
##$GB= 0
##$INTBC= 1
##$INTSCL= 1
##$ISEN= 128
##$LB= 0.3
##$LEV0= 0
##$LPBIN= 0
##$MAXI= 10000
##$MC2= 0
##$MEAN= 0
##$ME_mod= 0
##$MI= 0
##$NCOEF= 0
##$NC_proc= -4
##$NLEV= 6
##$NOISF1= 0
##$NOISF2= 0
##$NSP= 0
##$NTH_PI= 0
##$NZP= 0
##$OFFSET= 16.45282
##$PC= 1
##$PHC0= 170.1588
##$PHC1= 6.666787
##$PH_mod= 1
##$PKNL= yes
##$PPARMOD= 0
##$PSCAL= 4
##$PSIGN= 0
##$REVERSE= no
##$SF= 250.130017301739
##$SI= 32768
##$SIGF1= 0
##$SIGF2= 0
##$SINO= 400
##$SIOLD= 32768
##$SREGLST= <1H.CDCl3>
##$SSB= 0
##$STSI= 32768
##$STSR= 0
##$SW_p= 5175.98343685301
##$SYMM= 0
##$S_DEV= 0
##$TDeff= 65536
##$TDoff= 0
##$TI= <Analysis number 999999
Compound Code 99
Book Reference 9
Project Code 9>
##$TILT= no
##$TM1= 0
##$TM2= 0
##$TOPLEV= 0
##$USERP1= <user>
##$USERP2= <user>
##$USERP3= <user>
##$USERP4= <user>
##$USERP5= <user>
##$WDW= 1
##$XDIM= 32768
##$YMAX_p= 427770901
##$YMIN_p= -232352
$$ End of Bruker specific parameters
$$ ---------------------------------
##NTUPLES= NMR SPECTRUM
##VAR_NAME=  FREQUENCY,     SPECTRUM/REAL,   SPECTRUM/IMAG
##SYMBOL=    X,             R,               I
##VAR_TYPE=  INDEPENDENT,   DEPENDENT,       DEPENDENT
##VAR_FORM=  AFFN,          ASDF,            ASDF
##VAR_DIM=   32768,         32768,           32768
##UNITS=     HZ,            ARBITRARY UNITS, ARBITRARY UNITS
##FACTOR=    0.157963299565203, 1,           1
##FIRST=     4115.34410729423, 0,            0
##LAST=      -1060.63932955878, 0,           0
##MIN=       -1060.63932955878, -232352,     0
##MAX=       4115.34410729423, 427770901,    0
$$ Real data points
##PAGE= N=1
##DATA TABLE= (X++(R..R)), XYDATA
$$ [...]
18536D44634J7672M1252K943M3964l9274r6371J1679M8481p0533j24626n402L4313
18524C08732M2333j904O170n6220j4987m1909L141N8947J02686n689j02362o2644
18512B36294P9277O0761K9501j1083j2843n9693l4167O2203K8080K9897j2724
18501C95503O220k5218j4557j7490m4155J3400K8190j5192K2206r5l8126l422
18489C07264N7390j2625o7902J6842j9904l3620M3801O1181q5O595J9728k4432
18477C54233j06796n2943l3242O2621J22416J1701j16961k3443J3846j4176k2689
18466A94567l770n647O8762J9277J7673j4475l1312J7818M1508J3806J8336j8946
18454C17597q1166r661K4866P141K1149J48111J46819Q3641K7321l3026m4485
$$ plain form
18536 444634 462306 503558 506501 550465 511191 414820 426499 474980 404447 279821 274419 308732
18524 308732 351065 349161 355331 299111 284124 242215 245356 304303 406989 401300 298938 236294
18512 236294 315571 376332 405833 394750 381907 322214 288047 350250 378330 408227 395503
18501 395503 401723 376505 361948 344458 300303 313703 341893 326701 348907 348812 310686 307264
18489 307264 364654 352029 284127 300969 281065 247445 291246 352427 352342 358937 378665 354233
18477 354233 247437 194494 161252 223873 346289 357990 241029 217586 231432 217256 194567
18466 194567 190797 185150 253912 273189 290862 276387 245075 262893 304401 318207 336543 317597
18454 317597 236431 226770 251636 258777 279926 428037 574856 658497 685818 652792 608307
18443F08307r1474o7170j9988L726j4680j3718M1876J04163J11389r596j0126
18432F42709N8602O5519k0213R311l0001j1426P624Q3983R5756R7319Q7474N8061
18420A144718J2212R084J960K8860K1871k4111J58491K67628K77313J72276K321
18409B072623r8337q1303k9254P5876J22806K05727K57381L16047L38932L44615
18399C525113L90455M35687O08880P57025P77414P49991N84294O79663J105472
18390I613994J705816K435955L151104M343496O682379J1119208J9300808L0291393
18382H8644153L7889797L7178203K0542904o162787k7164983l7258519l3483944
18375H0184824k4057015j4756664q437013m963431l258723k386138j837482j125155
$$ plain form
18443 608307 516833 449663 429675 433401 418721 405003 446879 551042 662431 652835 642709
18432 642709 701311 766830 746617 755928 725927 714501 722125 806108 901864 999183 1086657 1144718
18420 1144718 1156930 1166014 1167974 1196834 1218705 1194594 1353085 1620713 1898026 2070302 2072623
18409 2072623 1974286 1892983 1863729 1939605 2062411 2268138 2525519 2841566 3180498 3525113
18399 3525113 3915568 4351255 4960135 5717160 6494574 7244565 7828859 8508522 9613994
18390 9613994 11319810 13755765 16906869 21250365 27932744 39051952 58352760 88644153
18382 88644153 126533950 163712153 184255057 178092270 150927287 113668768 80184824
18375 80184824 56127809 41371145 32934132 27970701 24711978 22325840 20488358 19363203
18367A9363203j45600R48341K101851L584068N740538R611133J6685912K7613357
18359H5502803L7512211M0129213K8786328J745995k3019515l8110257l8495889
18352I4050889k9509883j9240352j1376806o873314m512650l256591k624917k334978
18344A4321398j988945j595555j126966p73533o05244n17456o13321p26900p71223
18335E602255p11845o44117m84305k81303j63663j51067o0600J01058J05203K09485
18325C521101K19590J81323J35763j40558m82206n95670m71017l66671j69557
18316A832098p9181o0419Q7807J81555K42086M37467Q39932R15394K35814n13204
18306D119349p96933q06133n33372k83924j24832l0647r00q099j19326j23511
$$ plain form
18367 19363203 19217603 20165944 22267795 25851863 31592401 41203534 57889446 85502803
18359 85502803 123015014 163144227 191930555 193676550 170657035 132546778 94050889
18352 94050889 64541006 45300654 33923848 27050534 22537884 19281293 16656376 14321398
18344 14321398 12332453 10736898 9609932 8836399 8231155 7713699 7100378 6373478 5602255
18335 5602255 4890410 4246293 3761988 3480685 3317022 3165955 3105355 3206413 3311616 3521101
18325 3521101 3740691 3922014 4057777 3917219 3435013 2839343 2368326 2001655 1832098
18316 1832098 1752917 1692498 1780305 1961860 2203946 2641413 3481345 4396739 4632553 4119349
18306 4119349 3322416 2516283 1982911 1698987 1574155 1543508 1542608 1534509 1415183 1291672
18296A291672p4039p740o4200m6062J01662J13791O3974K19777L75492O94939
18286B669266R79335P77697n2054p60880r47773o91451m02860l16484k00685r7087
18276I57024r4282p4381l3018m581n8378p5976j0319P4254L6852J9773O1015P0264
18264H68247r1489j22295J0324l8764j34581n7774n726L3122M8029M2934J08864
18253F60891M7930l1099p3370j01889l9286p577o795k049m4332J7518K8559N906
18241D54407J7387R5557N9620l495l3620l9253j5765n3850q3847k6533r580j0115
18229C50913J5635J926j5780j6271M210K5722K1446N0897P0113J62399J34531
18218H05741M5712p79L7163M1106J1925p2717n5547n1031q727n7123j04470K3729
$$ plain form
18296 1291672 1217633 1209893 1145693 1099631 1201293 1315084 1379058 1598835 1974327 2669266
18286 2669266 3648601 4426298 4374244 3613364 2665591 1974140 1571280 1254796 1054111 957024
18276 957024 862742 788361 755343 750762 692384 616408 606089 680343 717195 736968 797983 868247
18264 868247 776758 654463 664787 626023 491442 433668 427942 461064 509093 552027 660891
18253 660891 708821 677722 604352 502463 463177 455600 448805 446756 402424 419942 448501 454407
18241 454407 471794 567351 626971 623476 589856 550603 534838 480988 397141 370608 361028 350913
18229 350913 366548 368474 352694 336423 340633 366355 387801 438698 508811 671210 805741
18218 805741 851453 850674 887837 928943 940868 868151 812604 761573 752846 695723 591253 614982
18206F14982P2746K719o2289m5290o2376n6538n9796P706m2519L5174j2138p7073
18194C15308l0784n2789K3149M4361l6111l8636L3092k9259q5521m3103J2018
18183A11725L5995J5833k3150M1642L6679k222k2018L6182O0472O2248O5220J8799
18171D37405L4387M2398o8236J24174J57885N4753N7908k3795n1265l4385k9576
18160G01653P4273J03703J79304R2427q8118j25200j32739r7743Q413j692O6395
18149G80676K763p7995j35433n2664l4334m374N2779L8209J4879K5669m3535m1034
18137E25606M1309M4963P5236M8422J9719N3579L6044J03453L4544J5284J29966
18126A128125J09514J15202K18534L11717L82147M76401N81411P12371R29974
$$ plain form
18206 614982 687728 690447 628158 582868 520492 463954 404158 411864 369345 404519 392381 315308
18194 315308 284524 231735 254884 299245 263134 224498 257590 228331 142810 99707 111725
18183 111725 147720 163553 140403 182045 218724 216502 194484 230666 291138 353386 418606 437405
18171 437405 471792 514190 445954 570128 728013 782766 840674 816879 765614 731229 701653
18160 701653 775926 879629 1058933 1151360 1063242 938042 805303 707560 715973 714281 780676
18149 780676 783439 705444 570011 517347 483013 478639 531418 569627 584506 610175 566640 525606
18137 525606 566915 611878 687114 735536 755255 808834 844878 948331 982875 998159 1128125
18126 1128125 1237639 1352841 1571375 1883092 2265239 2741640 3323051 4035422 4965396
18117D965396J412454K049954L116059M813731P961943J4931163L0724456M8893910
18109A18869066J5461609k3378799l6732822l1056052j6045796q162597m660372
18102A4294237k955726k033253j565444j210077r89783q30470o84536m92254l20757
18093C211937k54924l32804k00244j21225j59943k13585k33336q8607M2979O9903
18083A720151l9109j17979j59953j19077m3947l2764j7702p8672j46129j49198
18073H15621o4694r1162M0696J9012N2740J8642L9314R296l0023o636j2210Q1148
18061H71744J32966P5834o9673r6614q6301o6141j8778K6807M1242q2987j69452
18050E58647r7158k5692n2256p3231O0284L075o8676J2515K9010n7930m4420m8214
$$ plain form
18117 4965396 6377850 8427804 11543863 16357594 24319537 39250700 69975156 118869066
18109 118869066 134330675 110951876 74219054 43163002 27117206 18954609 14294237
18102 14294237 11338511 9305258 7739814 6529737 5539954 4709484 4024948 3532694 3211937
18093 3211937 2957013 2624209 2423965 2302740 2142797 1929212 1695876 1607269 1650248 1720151
18083 1720151 1681042 1563063 1403110 1284033 1240086 1207322 1189620 1110948 964819 815621
18073 815621 750927 659765 700461 719473 772213 790855 830169 839465 809442 802806 790596 871744
18061 871744 1004710 1080544 1010871 914257 827956 761815 743037 769844 811086 728099 558647
18050 558647 461489 435797 383541 310310 370594 373669 304993 317508 346518 288588 244168 195954
18038A95954r302L1394K164K2411o57R269N4206l522l6254k5814M8017L3768p936
18025C13698k1127p327L0611k3027o5462l1932k3554L1080l1987N6754J9841k5263
18013B22305j6908L7302k4856Q2020Q3650J6010k5853m7771j7870K1226r3958
18002B35297o1177P2663k9135J0775R1313Q90j5114P188L9993l3386m060m2397
17990B72850K7793M4633R8401Q7348K78336L13754J63023p5681k03213k04184
17980H03060j56274n4343o6487l7510n6521n5052o8754Q6931M1535l5350k6454
17969C74781K0870M771N4970O4298J4978R117m3958m3978K8778L1317n6714m5120
17957D14110R604M5068P1667N9309J09763J33962J51755K67928K43924K9682j47998
$$ plain form
18038 195954 186652 218046 220210 242621 241964 251233 305439 301917 265663 239849 287866 321634 313698
18025 313698 292571 285244 315855 292828 227366 195434 171880 202960 170973 227727 247568 222305
18013 222305 205397 242699 217843 299863 383513 399523 373670 325899 308029 329255 235297
18002 235297 174120 246783 217648 228423 319736 320626 305512 312700 352693 319307 315247 272850
17990 272850 300643 345276 443677 531025 809361 1123115 1286138 1210457 1007244 803060
17980 803060 646786 592443 525956 488446 431925 376873 308119 395050 436585 401235 374781
17969 374781 395651 400422 455392 519690 534668 543785 499827 455849 484627 515944 459230 414110
17957 414110 423714 468782 540449 599758 709521 843483 995238 1263166 1507090 1536772 1388774
17946A388774j37133j62807j03565m5549n2137n9689Q5974O3022J57479K34323
17936A368692Q4363k0153P0226J74284J70930J40650J69839J76800K20398K20701
17926B776730L14860N65838P53515R54047J219033J738458K672097M163929O935654
17917B2094161J1858950J6450795J1565147j954572j1129039j2450987q370259
17910B8064196l673469j56945L305168P998758J3073694J1542425K36193j0209227
17902E0180793j3575717j1094380o831374m043136k544469j580968r44341n33805
17894I032603q6220K29109N56549R56041J541436K412058L763017O308894J0944719
17885C5658206J5419298J1495589j087536j0227416j1928373q142371l382422
$$ plain form
17946 1388774 1251641 1088834 985269 939720 887583 827894 913868 976890 1134369 1368692
17936 1368692 1453055 1432902 1503128 1677412 1848342 1988992 2158831 2335631 2556029 2776730
17926 2776730 3091590 3657428 4410943 5364990 6584023 8322481 10994578 15158507 22094161
17917 22094161 33953111 50403906 61969053 60014481 48885442 36434455 28064196
17910 28064196 24390727 24233782 27538950 35537708 48611402 60153827 60390020 50180793
17902 50180793 36605076 25510696 18679322 14636186 12091717 10510749 9566408 9032603
17894 9032603 8946383 9175492 9732041 10688082 12229518 14641576 18404593 24713487 35658206
17885 35658206 51077504 62573093 61485557 51258141 39329768 31187397 27804975
17878B7804975J54608L466543P861148J4026173J8524845J5305758Q505876p77083
17870I4872843j2858296j8344538j6921193j1454490n717902j765816J737924
17863B9548532O175700J1323270J1265472J268964q881313j2683498j0765757
17856B7251370o747335l983171k535994j742785j264155q47076n53675j80717
17848I396462K38452P25925J193143J909404L277792O168099J1265260J4852846
17840D9027383Q188399m184475j1248928j1376491p073942k884358K755K788956
17832B3239299O669283J1718772J1984726K160118q513849j2745442j1074182
17825B3438725p038985m159410k612256j770510j256917r48547p04837n32630
$$ plain form
17878 27804975 27959583 31426126 39287274 53313447 71838292 87144050 95649926 94872843
17870 94872843 82014547 63670009 46748816 35294326 29576424 27810608 29548532
17863 29548532 35724232 47047502 58312974 59581938 50700625 38017127 27251370
17856 27251370 20504035 16520864 13984870 12242085 10977930 10130854 9577179 9396462
17848 9396462 9634914 10360839 11553982 13463386 16741178 22909277 34174537 49027383
17840 49027383 57215782 53031307 41782379 30405888 23331946 20447588 20450343 23239299
17832 23239299 29908582 41627354 53612080 55772198 47258349 34512907 23438725
17825 23438725 16399740 12240330 9628074 7857564 6600647 5652100 4947263 4414633
17817D414633l83398l41246l49512l16261k72486k58354k00390j42312j29050
17808B021624j67109j06081j44827k33091j25012m3303j4722k0926m8501m8655
17798A069397J6602K6654L8967J4621M1900J10126P5976p573o7452j66325j51877
17787A001016j19641m6695l5378m0838n232m1501r1560j18810k058n313O2904
17776E56894k5027n2397Q694K8077N6035l8531O5400R2800K5779O9279J22454
17765I09457J38239J3814j21697j88632j44922m2432m4298l5026o836k2025q0102
17754C75540j1391J4037q412J2585K3823l336q299O831k0435J4681J6776J1896
17742D24296n2300j03620l3580J1071L8388L7908j2434n9965j5042N3446k9939
$$ plain form
17817 4414633 4031235 3689989 3340477 3024216 2751730 2493376 2292986 2150674 2021624
17808 2021624 1854515 1748434 1603607 1370516 1245504 1202201 1187479 1166553 1118052 1069397
17798 1069397 1085999 1112653 1151620 1166241 1208141 1318267 1394243 1386670 1319218 1152893 1001016
17787 1001016 881375 834680 799302 758464 753232 711731 620171 501361 499303 493990 556894
17776 556894 531867 479470 488164 516241 572276 533745 599145 691945 717724 787003 909457
17765 909457 1047696 1061510 939813 751181 606259 563827 519529 484503 477667 455642 375540
17754 375540 364149 378186 369774 382359 406182 402846 394547 401378 380943 395624 412400 424296
17742 424296 371996 268376 234796 245867 284255 322163 309729 249764 234722 288168 258229
17731B58229m4968o2920M763J8314N4158N5917l9173o5871p9578K3244M7238j9796
17719A49557N6848k855Q288K0559j0131K6395j197l1045K1990O5491J6830n0098
17707B70632o3364p621O2605O5071J4186k1679N7259P366n8552M4751J03718J63381
17695F37753J34921J46705J16242J57536R3613q7960k03321j51848j09407j05596
17685F28638q2683p5073l9J3852l6591m2908j060K5998K7052o7085J5847M775
17673D10723K857J63343J94418K20987J36723M8939j7869r0441j31189j54517
17663G83974r2834j12576m4890l1306j3412l2421m5336n8920K2066N8419o0722
17652C72042j9378j3755l7206k9228M7501J8870n0787o6209j0209l7047J0173
$$ plain form
17731 258229 213261 150341 155104 173418 227576 283493 244320 178449 98871 122115 169353 149557
17719 149557 206405 203550 211838 232397 222266 248661 247464 216419 238409 303900 320730 270632
17707 270632 207268 199647 262252 327323 341509 319830 377089 384455 325903 370654 474372 637753
17695 637753 772674 919379 1035621 1193157 1286770 1198810 995489 843641 734234 628638
17685 628638 545955 470882 470843 484695 448104 405196 404136 430134 457186 390101 405948 410723
17673 410723 413580 576923 771341 992328 1129051 1177990 1160121 1069680 938491 783974
17663 783974 691140 578564 533674 502368 488956 456535 411199 352279 374345 432764 372042
17652 372042 352664 338909 301703 272475 319976 338846 288059 221850 211641 174594 184767
17641A84767M6812K9307P508K8076l9961k8750j9372Q8806N6556r753p3004l6925
17629B34067L7784M8424Q3484Q8881K0494n1047q235j02076j6795N7225o799m590
17617C80817L1878Q4878K8137q339K0335M7207J4244j8648L5897j0554K428J38012
17605G46292J07927N9074J24549J03794J12840P0861j6085J1311J18483K17934
17595A656980K36525Q4368L915N8693R6678K27618L54945L12882J70987J50202
17585C353793J02843J96983M64499P01599P95506O89649P26697R81254J475913
17576I488736K203999L361663N256920Q458608J3762837J7437292J0948076J465802
17568G2383933j750321L304145J5769437K7787958J3804072j1351622k1286434
$$ plain form
17641 184767 231579 260886 268394 296470 256509 227759 208387 297193 353749 343996 270992 234067
17629 234067 271851 320275 403759 492640 513134 462087 453852 351776 334981 392206 385407 380817
17617 380817 412695 497573 525710 517371 537706 584913 599157 580509 616406 605852 608280 746292
17605 746292 854219 913293 1037842 1141636 1254476 1325337 1309252 1320563 1439046 1656980
17595 1656980 1893505 1977873 1981788 2040481 2137159 2364777 2719722 3032604 3203591 3353793
17585 3353793 3456636 3653619 4118118 4819717 5615223 6304872 7031569 8012823 9488736
17576 9488736 11692735 15054398 20311318 28769926 42532763 59970055 70918131 72383933
17568 72383933 70633612 73937757 89707194 117495152 131299224 119947602 98661168
17561I8661168j8229406n606335L391167L59124r432188j4136334j3310350q604650
17553C3092196m200494j026030J565213M778324R419563J4506539J2595449L247079
17545G3977839k008084j83111R511891K2833807K0767336n105004j8407097k0454562
17537H0933015j0215042M30791K074749o820065j3377149j4328221j0908291o770101
17529B1019686m112821k637197j608805q87858o09334m47231n06322p97137j020176
17520H392805j098406j007209p95683o15506m62651k99003k78333l14342k16168
17511C305504j71389k26909k04269j85479j28640K8645R8048K24588L15254M39792
17501C495145M52249L22214k527l83470o34660o43742n67585l91795j87289r3668
$$ plain form
17561 98661168 80431762 74825427 78216594 78575718 69143530 55007196 41696846 33092196
17553 33092196 28891702 27865672 29430885 34209209 43628772 58135311 70730760 73977839
17545 73977839 71969755 71786644 81298535 104132342 124899678 119794674 101387577 80933015
17537 80933015 70717973 71148764 73223513 66403448 53026299 38698078 27789787 21019686
17529 21019686 16906865 14269668 12660863 11773005 11163671 10716440 10210118 9412981 8392805
17520 8392805 7294399 6287190 5491507 4876001 4413350 4114347 3836014 3521672 3305504
17511 3305504 3134115 2907206 2702937 2517458 2388818 2417463 2515511 2740099 3055353 3495145
17501 3495145 3947394 4269608 4267081 3883611 3248951 2605209 2037624 1645829 1458540 1364872
17491A364872j01626j42191j46000r4427k844l6815n5720k3305p8910J0039k7054
17480F66019k2544k3445N1290J3435n0963l4231N9054k933n8358m549p2953k3739
17468D96083j6319r2599p0248L5584k2287K1802P6646K8734n637m0827n7610J386
17456C54708j1281m6550k9074J7187N1406j989o168J1291P545M6103J17367J26408
17444F36953K04064K13853o8632j39576j80101j30733m9429L715k7695k5629M3461
17433D80251j517n2620k9462K902J154m3184J8842O4058L8248n1579j0633n903
17421D10557L8376n2066j01016Q632n0924n1831L5236K8694j4553K7565k4207
17410B54463J4183k3190j5819K0427R8886M0273r0478m8506j4588K0435K1601
$$ plain form
17491 1364872 1263246 1121055 975055 880628 877784 840969 785249 761944 683034 693073 666019
17480 666019 643475 620030 671320 684755 633792 599561 658615 655682 597324 592775 519822 496083
17468 496083 479764 387165 316917 352501 330214 352016 428662 457396 451759 410932 353322 354708
17456 354708 343427 296877 267803 284990 336396 334407 328239 339530 347075 393178 510545 636953
17444 636953 841017 1054870 986238 846662 666561 535828 486399 490114 462419 436790 480251
17433 480251 478734 426114 396652 399554 400708 357524 376366 440424 478672 427093 416460 410557
17421 410557 448933 396867 295851 304483 253559 201728 236964 265658 251105 278670 254463
17410 254463 268646 245456 229637 250064 348950 389223 298745 250239 235651 256086 277687
17399B77687k8814j5186P313M270J1903M974O9493O8445P2469o995o5678l3968
17387C65913k4242o6329m1160N0458K8513N0149J02905k8100l3738n7802m7263
17376B99304m3822j6009P6142l6878k1670M2785K1317j1485j0146P035O9990J7677
17364C94240k2891o18L8719P2794K3180n599k0311m3471j283N106J1884J9168
17352D70918l4733J1678P9120O7137J1703K1616J0123l878p4372r2529r4725r4790
17340B77268J026m568M7121P7707Q3775j0625k9118p8884j31173l8850L0230Q611
17328B32520M44r230n3723j4699N0715n4330j4464K9901M4582N3293L302l5897
17316B32414Q3176P6012k7991j6763r980j7653O182J4405j8435L4224J00278L0616
$$ plain form
17399 277687 248873 233687 241000 245270 257173 262147 331640 400085 472554 465559 399881 365913
17387 365913 341671 275342 234182 284640 313153 363302 466207 438107 404369 346567 299304
17376 299304 255482 239473 315615 278737 257067 299852 321169 309684 299538 306573 376563 394240
17364 394240 371349 370731 409450 482244 505424 499825 479514 436043 434760 439866 451750 470918
17352 470918 436185 447863 526983 594120 605823 627439 637562 633684 559312 466783 372058 277268
17340 277268 278294 273726 320847 398554 482329 471704 442586 363702 232529 193679 223909 232520
17328 232520 232964 223734 170011 155312 206027 151697 137233 167134 211716 265009 268311 232414
17316 232414 315590 391602 363611 346848 336868 319215 325397 339802 321367 355591 455869 486485
17304D86485n7066l0474k115p3489k4013J1596j0277k1337j01786p4135m8795
17293E4594L9615M2564M8009l9782k4005M4110n803m9336o1168k1806K9513O9728
17281A26233l871n4849J6637o7922o283j6668j3745K2068M1522L5987l39L625
17269H2395M5247L0401l2682l8942j8175k43k6774M0676K1617n4103k3142p129
17257A9146K8105J6800K1906M1067j923m8476k7577j333L0104j9906l7794K8570
17245D8689J5923J550j6548N277j9782o156J1620K4900L0549m576j86J1019j5622
17232H6657J5591J7201j2614K9243J75k9734K7668k0891J2581l5951k0412M1778
17220A11292j6081l9266J2412k4760n080l4387m5004K9784M037J0441L3307p401
$$ plain form
17304 486485 429419 398945 396830 323341 299328 310924 300647 279310 177524 103389 54594
17293 54594 94209 136773 184782 145000 120995 165105 159302 109966 48798 26992 56505 126233
17281 126233 122362 67513 84150 16228 9945 -6723 -20468 1600 43122 79109 78770 82395
17269 82395 127642 158043 125361 86419 68244 68001 41227 81903 103520 49417 26275 19146
17257 19146 47251 64051 85957 127024 125101 76625 49048 47715 77819 57913 20119 48689
17245 48689 64612 66162 49614 54891 35109 28953 40573 65473 96022 91446 91260 102279 86657
17232 86657 102248 119449 106835 136078 136253 106519 134187 113296 125877 89926 69514 111292
17220 111292 95211 55945 68357 43597 38517 4130 -40874 -11090 -7053 3388 36695 29294
17208B9294j5854k7780O739M3614K6149j2208j816J8169N0882Q007l9228J8260
17196A04228j0421k4863J3639k4847m8917l2196j1129o751Q395M7140J3863P689
17184C5830O0205j958m221m4752k7647L0273N4402k3226n3206l0804P7947N4808
17172A27651J6360m8090k0429j5714J412m515O021l967k1016J3934L9158J8608
17160A09413J4166k313j7978q211r036M210m1210P716L7064J3576l1840K4989
17148A00546L1788l1721K3394j1297l5142j1963m5423j3984j7128j3965p15Q175
17136a7435N6597L4244j3960J3751K9178J7020l1520N2433J3596n7088M0311r750
17124A27377q6780k5271Q687q524K0133R726k6953M856k9245k866M0654J4308
$$ plain form
17208 29294 13440 -14340 -7601 36013 62162 49954 48138 66307 117189 125196 85968 104228
17196 104228 93807 68944 82583 57736 8819 -23377 -34506 -41257 -32862 14278 28141 35830
17184 35830 96035 94077 89856 45104 17457 47730 102132 78906 25700 -5104 72843 127651
17172 127651 144011 95921 75492 59778 61190 56675 62696 58729 37713 51647 90805 109413
17160 109413 123579 121266 103288 95077 86041 90251 49041 56757 93821 107397 75557 100546
17148 100546 132334 100613 124007 112710 77568 65605 20182 6198 -10930 -24895 -25610 -17435
17136 -17435 39162 73406 59446 73197 102375 119395 87875 140308 153904 96816 137127 127377
17124 127377 40597 15326 24013 15489 35622 45348 18395 23251 -5994 -8860 31794 46102
17112D6102O75l6841N1398N173K0150M3636q0336n6179J8007L0055L4992k1708
17100E5124k3595K1965j3957m6460n929k7160o75N9698L0663L2138k6711k7734
17088B7367N7334K604j3422j2563N6703L5075n0915r876k9243l9465l1962K0140
17076A1777J8270L3070M4060j8958N824M195o5244j4004n1186n7089L2043Q0630
17064B3388J1174L6717j2172l5865p45j4872k8336J6689O589l071J8251o979m3173
17051c2405j7995o169J2220L1670J03779J49703J28444N8274O0830n6916j8855
17040D12580Q3797O6977J52266l8748j31733j10520j9715O4503K578l5920p5173
17029C70892j52050q0472j9115q180R993N7521P8035P3815K7136O138N654L2270
$$ plain form
17112 46102 46777 9936 61334 66507 86657 130293 49957 -6222 11785 41840 76832 55124
17100 55124 31529 53494 39537 -6923 -12852 -40012 -40687 19011 49674 81812 55101 27367
17088 27367 84701 87305 73883 61320 118023 153098 102183 92307 63064 23599 -8363 11777
17076 11777 30047 63117 107177 88219 94043 98238 32994 18990 -32196 -89285 -57242 23388
17064 23388 34562 71279 59107 23242 22497 7625 -20711 -4022 2567 -504 17747 10768 -32405
17051 -32405 -50400 -56569 -44349 -12679 91100 240803 369247 427521 488351 431435 412580
17040 412580 496377 563354 715620 676872 545139 434619 414904 479407 481985 446065 370892
17029 370892 218842 138370 119255 111075 121068 178589 256624 330439 357575 363713 369367 401637
17017D01637J6727K3328J20331R4943m0489j07470q4661k0863j6003J1250l2004
17006C66726o7128m9022n8978o4555k3473N067j7450j9690r001k8454n8216m974
16994b9148Q6255N2188P508j9416m442K5220m8854n4782n0869J1236k1221k6930
16982g3255P0509N9412K783j7803j1632M0827j4695m4448R558J0834j1724l2813
16970a2447K8990Q0568M8010n7616m5712l9701o563k2580N7171n1526L6492M4422
16958E9508l8760J2812j1044j6386n4820K038J8817j3749J7338M9773J15q437
16946A7205j525K3095p576m96j9733M2262j5120k1182k4320O8380M0701m0521
16934F1170l0103l5049j3118K3349j3378P841K6779m7968k6600K6433o075k281
$$ plain form
17017 401637 418364 441692 562023 656966 616477 509007 424346 403483 387480 398730 366726
17006 366726 299598 250576 191598 127043 103570 108637 91187 71497 62496 34042 -24174 -29148
16994 -29148 57107 109295 116803 97387 92945 118165 69311 14529 -36340 -25104 -46325 -73255
16982 -73255 -2746 56666 59449 41646 30014 70841 56146 11698 21256 32090 20366 -12447
16970 -12447 16543 97111 145121 87505 41793 2092 -4471 -27051 30120 -21406 15086 59508
16958 59508 20748 33560 22516 6130 -48690 -46652 -27835 -41584 -24246 25527 25642 17205
16946 17205 15680 38775 31199 30703 10970 53232 38112 16930 -7390 60990 101691 61170
16934 61170 31067 -3982 -17100 6249 -7129 712 27491 -20477 -47077 -20644 -26719 -29000
16922b9000M7083l4722q256K0768K8165K1826J0536q458L0311k6446k7933N803
16910B9677k2565m503K3063J45l0555q4504j5515N5784J4199L0727l0874m8404
16898h3325N4352O5107K9806j0171p842K1827k2338o6211l0607k9522L4890M328
16886c9706n9M9523j3513j5671O0079m8645m2220M9785m211k3946p326L3254N9210
16873E6554M948n1930J9720K9128M2667k2082n791j4930o436j8480J4408k7517
16861B0259J035j6153O637l7812L3566K2447L4182l636l0228p841P264J079K1032
16848E1831L836l7311k7604K0595L8256l9103l3100L6753L6J6065j6732l5474
16836b1952L177j8924m8634L3505L2640J8493P5100K0302j7961l7360k4418J6273
$$ plain form
16922 -29000 18083 -16639 -24895 -4127 24038 45864 56400 47942 78253 51807 23874 29677
16910 29677 7112 2609 25672 25817 -4738 -89242 -104757 -48973 -34774 -4047 -34921 -83325
16898 -83325 -28973 36134 65940 55769 47927 69754 47416 -18795 -49402 -78924 -44034 -39706
16886 -39706 -39765 9758 -3755 -19426 40653 -7992 -50212 -427 -4638 -28584 -35910 -2656 56554
16873 56554 61502 9572 29292 58420 101087 79005 73214 58284 51848 33368 47776 20259
16861 20259 21294 5141 11778 -26034 7532 29979 64161 60525 30297 22456 29720 30799 51831
16848 51831 55667 18356 -9248 11347 49603 10500 -22600 14153 14189 30254 13522 -21952
16836 -21952 -18775 -37699 -86333 -52828 -20188 -1695 73405 93707 75746 38386 13968 30241
16824C0241j4951Q234L9980j2656l4511N9586k1385m3045J2517L1326J5235p4320
16812c749j9861P1391j957m1489k0047k0823m823j053k2880m973L1966l8115J8335
16799e8078N355K7724L354M8285j066P292J4216k6302k6175j1979k7551l133k4131
16786g2189J5735L4830l062O180K7204n7020n3847L0423O7272M9128m3007J5400
16774A7047O754N4018P853j8704j8860k3316k5467m793M508l4658j0289m0479
16762h6386L0482K7073k3357Q3558Q31p1369L6266K3391j1252j8072q1100n1378
16750a41313J5756k717N7148J2445K3913O9642K0047p080L557j9924o6253L909
16738c0870m325n175j1111K6668j310l1184n825J5660j2867o415k1365J7298q265
$$ plain form
16824 30241 15290 23524 63504 50848 16337 75923 54538 11493 24010 55336 70571 -3749
16812 -3749 -23610 47781 45824 4335 -15712 -36535 -41358 -42411 -65291 -70264 -38298 -76413 -58078
16799 -58078 -52723 -24999 -21645 26640 25574 32866 47082 20780 -5395 -17374 -44925 -48058 -72189
16786 -72189 -56454 -21624 -24686 -18506 8698 -48322 -102169 -71746 -4474 44654 1647 17047
16774 17047 23801 77819 85672 66968 48108 24792 -675 -5468 -960 -35618 -45907 -86386
16762 -86386 -55904 -28831 -52188 31370 32201 -39168 -2902 20489 9237 -8835 -89935 -141313
16750 -141313 -125557 -128274 -71126 -58681 -34768 34874 54921 47841 51398 31474 -34779 -30870
16738 -30870 -35195 -40370 -51481 -24813 -26123 -57307 -63132 -47472 -60339 -66754 -88119 -70821 -79086
16725g9086j3792M8444N5152Q1764O9168j3855n8835l7749k8484p470p691Q955
16713A6521J4991l828P813M913m895k4341k9211K6611K1023L4988j9950m1233
16701C402m0475P430j7146M4116P4384O1170k2114o0596k9449k1797o262L0007
16689B2670O646K6263J9081M6416k0016p1252p0700O2289L6137K8700J035J1765
16677I9034q6277p5340j1184J1493K8348P580K0542Q571N725j2111j194m9293
16665e4106m1199j8586N6623k6509J0094R647l98J1097N431L1738j4780J1631
16653a9317j0780J4548R196J9316N288n2258J2233K99k4852o3384k7064L737M4550
16640h8488L3865M5920L2722l2336m103k5270J5768L0995N5028M4581o5522N187
$$ plain form
16725 -79086 -92878 -44434 10718 92482 161650 147795 88960 51211 22727 15257 7566 16521
16713 16521 31512 27684 35497 40410 35515 11174 -18037 8574 29597 64585 44635 3402
16701 3402 -37073 -29643 -46789 -2673 71711 132881 110767 50171 20722 -1075 -7337 22670
16689 22670 29316 55579 74660 121076 101060 29808 -40892 21397 57534 86234 87269 99034
16677 99034 12757 -62583 -73767 -62274 -33926 -26346 -5804 2767 8492 -3619 -4813 -54106
16665 -54106 -95305 -113891 -57268 -83777 -73683 -64036 -64434 -53337 -47906 -16168 -30948 -19317
16653 -19317 -30097 -15549 -6353 12963 18251 -34007 -21774 -21475 -46327 -109711 -136775 -133038 -88488
16640 -88488 -54623 -8703 24019 -8317 -12420 -37690 -21922 9073 64101 108682 43160 48347
16628D8347j549K785k8234L915l7657O0942J8710l8378l7853J9924j4419q0789
16616h4256j0574P7844M3083n6620l1409k9297O2087Q8109K25q6081j4617M0567
16604i39M0434j6958L9305m4015p7567M2153L1016J7219J3853j5401M005K812
16592C5917n5708j8473o143K776M1183K323L1069M1357k0162n5478o9304n3129
16580a23772r681N9411L7785L5351q432l0378J2874J4876m7670J5004K9590l2325
16568d7367J0616k1650M7279J06L9203P0581j4384j08168n6175M5990K4042N481
16556d446K1250L7173P4871K3825l3495m1786J6436k2121K0370o436p9999k0713
16544a5071Q0551O7548N3845n3043m8446j2936k3727l0411q159k179k0104k9616
$$ plain form
16628 48347 46798 49583 21349 25264 -12393 48549 67259 28881 -8972 10952 -3467 -84256
16616 -84256 -94830 -16986 26097 -30523 -61932 -91229 -29142 58967 59192 -26889 -41506 -939
16604 -939 39495 22537 61842 17827 -59740 -17587 13429 30648 44501 29100 33105 35917
16592 35917 -19791 -38264 -44407 -41631 -448 1875 32944 74301 54139 -1339 -70643 -123772
16580 -123772 -133453 -74042 -36257 -906 -9338 -39716 -26842 -11966 -59636 -44632 -15042 -47367
16568 -47367 -36751 -58401 -11122 -11016 28187 98768 84384 -23784 -79959 -33969 -9927 -4446
16556 -4446 16804 53977 128848 152673 119178 77392 93828 71707 92077 85641 5642 -15071
16544 -15071 65480 133028 186873 133830 85384 72448 48721 18310 10151 7972 -12132 -41748
16532d1748q323J3803K011O0157k2632p3519O228M5324J1953q958m1324K9925
16520b7103O9359N2301k7811p525k3716j2643r331j6865K8287M7274M618j4370
16508F2475n1584n0425n2623M3340J1272K4436J4558l1493k5104j5063m6678K1380
16496i5509N4609j647J0922J1264l968K0913M7802L6664k6788p0649m3196j2087
16484g1670j0534M3479L2738R302m261j4623K5078J9405l8800N5878N4168k1043
16472G9117k7642N925j7430O053m0811j4325N68m8323o795o779k8670L8015N419
16459e5678J3352O0839O4372j3305p8029J9651J9476n2721M7890K8173K1226r761
16447F5485j5025l8804Q35j2374K1577K5110K1073N9775j5991o0433q57k2088
$$ plain form
16532 -41748 -50071 -36268 -34257 25900 3268 -70251 -64023 -18699 -6746 -15704 -57028 -27103
16520 -27103 42256 94557 66746 59221 35505 22862 13531 -3334 24953 72227 76845 62475
16508 62475 10891 -39534 -92157 -48817 -37545 -13109 1449 -30044 -55148 -70211 -116889 -95509
16496 -95509 -40900 -42547 -31625 -20361 -24329 -3416 44386 81050 54262 -16387 -59583 -71670
16484 -71670 -82204 -38725 -5987 3315 -946 -15569 9509 28914 -9886 45992 100160 79117
16472 79117 51475 57400 39970 46023 5212 -9113 -8545 -56868 -63663 -70442 -99112 -61097 -55678
16459 -55678 -42326 18513 82885 69580 -8449 11202 30678 -22043 25847 54020 75246 65485
16447 65485 50460 11656 12491 117 21694 46804 67877 127652 111661 51228 50371 28283
16435B8283L859L9114l6585k9074k9665j981Q0336j6765j04857j6843P8909P8124
16423G2855K2978J6246k7670p2378n4364K5529K6258p1689O520j5738J8332N9860
16411F739K1809r9176L0902K2992k6839K1962n00k2364K8919K6026k2164l464
16399a5158l4j9048o7775k4305Q851J6741L4472R1626L4147l2483l1862K9426
16387B4598K4690l0198m2335M870N1840j5830p4019N43M6037k2785M9134r506
16375G039j1372l6236l3604L9456O5726N3662n0146l4771m8626L303R1084j2427
16363C3088p9139M7203P0641r596m0355J0018r883k9497m2515n7588J1010N6094
16351d0519O3407o796p8743p8331o2191J9690K0110P1766J4556N2678L3362J7613
$$ plain form
16435 28283 32142 71256 34671 5597 -24068 -26049 54287 37522 -67335 -84178 -5269 72855
16423 72855 95833 112079 84409 12031 -42333 -16804 9454 -62235 -55715 -71453 -53121 6739
16411 6739 28548 -70628 -39726 -16734 -43573 -21611 -22111 -44475 -15556 10470 -11694 -15158
16399 -15158 -15192 -34240 -102015 -126320 -117469 -100728 -66256 25370 59517 27034 -4828 24598
16387 24598 49288 19090 -23245 -18375 33465 17635 -56384 -55841 -9804 -32589 16545 7039
16375 7039 -4333 -40569 -74173 -34717 31009 84671 34525 -246 -48872 -45569 45515 33088
16363 33088 -46051 1152 71793 62197 21842 31860 21977 -7520 -50035 -107623 -96613 -40519
16351 -40519 22888 16092 -62651 -140982 -203173 -183483 -163373 -91607 -77051 -24373 8989 26602
16339B6602P665l580J1105L6233o0533L8278m138m4491k7877k5341m7415K0068
16327g3424k039L71N479O8756L2833p2235n1179p71N1117j9901k189Q4482J7984
16314C9284M3245j8378p6834M473l4220p730J096r412K8085l8432L9297J8044
16302a1482J632p553m4510K1015R6567J9606j9731n2124k3257M095j8993L8108
16290C373L544N179L6370j4945J0691l4243m3701L2314l603m1039p0321R061O9231
16277c8089q1817l0077O0073M290l67K9430l5027K2706R3530M5969N928m6661
16265B9888L3968j0725q1069J236K6885P60J595L0903Q3846K5831m7895l6474
16253E8749L714j1597p989N1675o3639l5445L0079j6456n8115m083J6755N979
$$ plain form
16339 26602 34267 30687 41792 78025 17492 55770 51632 7141 -20736 -46077 -93492 -73424
16327 -73424 -75463 -75092 -69613 -857 31976 -40259 -91438 -92209 -41092 -60993 -63182 21300 39284
16314 39284 82529 64151 -12683 -8210 -42430 -50160 -49064 -58476 -30391 -68823 -29526 -11482
16302 -11482 -9850 -17403 -61913 -40898 55669 75275 55544 3420 -19837 -15742 -34735 3373
16290 3373 6917 12096 48466 33521 44212 9969 -33732 -1418 -5021 -46060 -116381 -107320 -38089
16277 -38089 -119906 -149983 -89910 -85620 -85987 -56557 -91584 -68878 24652 70621 76549 29888
16265 29888 63856 53131 -27938 -26702 183 943 2538 33441 117287 143118 95223 58749
16253 58749 62463 50866 42877 94552 30913 -4532 25547 9091 -49024 -53107 -36352 -30373
16241c0373l0709k9275L3304R7923J0800l6448J6698m8604j3103m6664k8458P3275
16229c1634N2375l684m1228l5613L3163N8472J458k7155R55k7397m0135k2868
16217h3291K4840j9807L2125R4083N0488M551j5517p720n8524J0349L4465m7945
16205A8097M060K0114J331l5259J0560K3613k5636l8402l6203K0999L4452L7519
16193C5245J353j6784M791n006m1589o3211J7265M0486O391M2764m3197k6575
16181d8067R551K2107K8876N22j317k8179j3426K3074M0842o2330o2439L8051
16169e2735L7856O663p675K8868L5639j0998L4k2076q3645L8132N7106J8117R206
16156E4492L8565j0988p25m7467L1567q912K611l1347n0438L7081L1989o5874
$$ plain form
16241 -30373 -61082 -90357 -57053 40870 51670 15222 31920 -16684 -29787 -76451 -104909 -31634
16229 -31634 20741 17057 -24171 -59784 -26621 31851 33309 6154 7109 -20288 -60423 -83291
16217 -83291 -58451 -78258 -46133 47950 98438 102989 87472 79752 21228 31577 66042 18097
16205 18097 22157 42271 43602 8343 18903 42516 16880 -21522 -57725 -36726 -2274 35245
16193 35245 36598 19814 24605 19599 -21990 -85201 -67936 -27450 -21059 21705 -21492 -48067
16181 -48067 -38516 -16409 12467 12989 11672 -16507 -29933 -6859 33983 -28347 -90786 -52735
16169 -52735 -14879 -8216 -15891 12977 48616 37618 37652 15576 -68069 -29937 27169 45286 54492
16156 54492 93057 82069 81344 33877 65444 56532 59143 27796 -22642 14439 46428 -19446
16144a9446m5439m0668J8450N1243l1033l4401L9423N430M432j00036J2904L4466
16132a04675K1847j4409L7119J07961J5580m0777m854L74P330J1129J7095k343
16120E1377k0147O8728j1825n6723l6641m3066N044K3769O3737j9536O676K7658
16108E9051J4726p608k0752j2115K5392J6554J142k3686j2716n5951l3945M2449
16096g459j1549m8104m6431M0388N8003M3537K4952j3721j4332m959j7821m3227
16084d0723K85j7125K3668r512l6164J1900K6098k2056j0163M9209n903n3646
16072h4132L0878R3563J3213L246r1082o4725M105K3511q99M208P7700J1807M3049
16059F4442P5625q442p0196m452L5922r237m3599l8687k0502m0414r992N1219
$$ plain form
16144 -19446 -64885 -105553 -87103 -35860 -66893 -101294 -61871 -56441 -52009 -152045 -139141 -104675
16132 -104675 -82828 -97237 -60118 47843 63423 22646 17792 18166 25496 36625 53720 51377
16120 51377 31230 99958 88133 31410 -5231 -48297 -43253 -19484 44253 24717 31393 59051
16108 59051 73777 66169 45417 33302 58694 75248 76390 52704 39988 -15963 -49908 -7459
16096 -7459 -19008 -67112 -113543 -73155 -15152 28385 53337 39616 25284 20325 2504 -40723
16084 -40723 -40438 -57563 -33895 -43407 -79571 -67671 -41573 -63629 -73792 -24583 -30486 -84132
16072 -84132 -53254 40309 53522 56768 -34314 -99039 -94934 -71423 -72322 -68114 9586 21393 64442
16059 64442 140067 131625 61429 56977 92899 83662 40063 1376 -19126 -59540 -69532 -18313
16047a8313j9039j508n253p4149j7893L7841L6120N0165K091r734j1252Q4849
16035E3925j2445l3132l2858L4636l5134M07J6673m4124j1996K0146N3704L0361
16023D0163k0747l5200J7752N9381N381J2070l6685j1835n8345O9619O5784k5443
16011H1895j6173J7423M460q2062j5557M5983J9884l1167N1938n2452J269J4431
15999C9872p637j0958l3783l2541j3833J230J7640j0169K272K3321k1524O336
15987c9774n912O93M1387R5032l3517q437j7517k7066k2021l4514l0893N0684
15975c1855P967j4700J08073L171o4167k4136k7379q072J8687N1103l9150l9294
15963e9752N7726J2464p5378K9647M6137L7808M3144k5319p1019K9168J2237m0480
$$ plain form
16047 -18313 -37352 -38860 -44113 -118262 -136155 -98314 -62194 -12029 -9938 -19672 -30924 53925
16035 53925 41480 8348 -24510 10126 -25008 -24601 -7928 -52052 -64048 -43902 9802 40163
16023 40163 19416 -15784 1968 61349 66730 78800 42115 30280 -28065 41554 107338 81895
16011 81895 65722 83145 87605 5543 -10014 35969 55853 24686 76624 24172 25441 39872
15999 39872 32235 21277 -12506 -45047 -58880 -57650 -40010 -50179 -47907 -24586 -46110 -39774
15987 -39774 -45686 -44993 -3606 91426 57909 49472 31955 4889 -17132 -51646 -82539 -31855
15975 -31855 -23888 -38588 69485 72656 8489 -15647 -43026 -51098 -32411 18692 -20458 -59752
15963 -59752 -2026 10438 -64940 -35293 10844 48652 91796 66477 -4542 24626 36863 -3617
15951c617l2051o7522l2250m2848P6770P5016J0275l6591l1694j3525L2164M6077
15939a9796K4559l5838J568l3776J5608K4673l6363P633j4357m2278R565O5952
15927c2850O6434r140m1372K4913k4778M8283K8741k2447k8216l5145J4329j4942
15915b6190m731N7653L1150k4412l5800J5759R524L4304L3726N928p9113m4950
15903b7152m3955K7452N6719J6905l5936L445M8424k5891m891J8601j1829l226
15891A8666M4104K1353k4795n3442J1739m39J1590j2621K4255K4618K3223j3941
15879G4310j0959j0318J2669J9847p6449p911J5579m8034j7912L693M5671N117
15867E303k8760J5013M9598K1702n7216m9614M5563k346M399j7646K8230R167
$$ plain form
15951 -3617 -35668 -103190 -135440 -178288 -101518 -26502 -16227 -52818 -84512 -98037 -65873 -19796
15939 -19796 4763 -31075 -29507 -63283 -47675 -23002 -59365 -51732 -66089 -108367 -98802 -32850
15927 -32850 33584 24444 -16928 7985 -16793 31490 60231 37784 9568 -25577 -11248 -26190
15915 -26190 -30921 26732 57882 33470 -2330 13429 22953 57257 90983 96911 17798 -27152
15903 -27152 -71107 -43655 13064 29969 -5967 -2522 45902 20011 15120 33721 21892 18666
15891 18666 62770 84123 59328 5886 17625 17186 28776 16155 40410 65028 88251 74310
15879 74310 63351 53033 65702 85549 9100 1189 16768 -31266 -49178 -45485 186 5303
15867 5303 -23457 -8444 41154 62856 5640 -43974 1589 -757 3642 -14004 14226 23393
15855B3393j3367k2163k4897n9655j3129m0252M037P7383j616O0356M9073O484
15843D5647r4215j1494M5232L3060m2654m898L3694m3921q51L0012m169k4342
15831c8899N2625p240n1592Q686K3045Q4539L1784j4450n4478l6124j379j4477
15819a7960k8709N2483J2205K6019k1867j8500q0702O835k7475L4640L5500k6903
15807e4434M0635J3708m0837j1491l850L4528K4189k39M462N5129M60p302J9108
15794G4066j0802j5876j6515r554J2177l4056l9306j089J7733n6863N7060N0295
15782B7270n0827r818L0715q4014K4056M6472j0670k2037j2993O604l9479K8352
15770f6369J10933P1079N769k3232k5193r4176k9226Q760P7106K7893m8053N0417
$$ plain form
15855 23393 10026 -12137 -37034 -96689 -109818 -150070 -146033 -68650 -70266 -9910 39163 45647
15843 45647 -48568 -60062 -14830 18230 -24424 -29322 4372 -39549 -40400 -10388 -14557 -38899
15831 -38899 13726 6486 -45106 -36420 -13375 71164 102948 88498 34020 -2104 -3483 -17960
15819 -17960 -46669 5814 18019 44038 22171 3671 -77031 -70196 -97671 -63031 -27531 -54434
15807 -54434 -13799 -91 -40928 -52419 -56269 -21741 2448 2209 6671 61800 62260 54958 74066
15794 74066 63264 47388 30873 21319 33496 -560 -39866 -40955 -23222 -80085 -23025 27270
15782 27270 -23557 -33375 -2660 -86674 -62618 -16146 -26816 -48853 -61846 -55242 -94721 -66369
15770 -66369 44564 115643 121412 98180 72987 -21189 -50415 -41655 35451 63344 15291 65708
15758F5708k7925J1645k799m5911q9480K9814O491J1566N7753J5118j7140m3170
15746b8330N3231o745j3399K129L7849L2947j1700k8891n384L6555L0842m0497
15734E8607r401J146K2706K5067k1253n0209l2079P3353j0980m4399R367n5919
15722c3994m4029k786Q8373O1028l058m0731K6606L3819O915m5662R972J4150
15710G0603O2617l8974p5038r520J1906k1097n2591k9059N6547P0435k6766k9571
15698a0508P025k7347l4544p415L3520O3846K5089M967K6358Q547m8870l0644
15686A0024j3881j3084L4343R740p5039Q109N4070k075n4808k8045j5722n1467
15674a37835p471j3239J1547N3768J5017L6050L7984n7904l6387K2869L0897J9687
$$ plain form
15758 65708 37783 49428 46629 718 -88762 -58948 -52457 -40891 16862 31980 14840 -28330
15746 -28330 24901 18156 4757 6886 44735 77682 65982 37091 31707 68262 99104 58607
15734 58607 49206 50352 73058 98125 76872 26663 -5416 67937 56957 12558 21925 -33994
15722 -33994 -78023 -80809 7564 68592 65534 24803 51409 85228 92143 46481 56453 70603
15710 70603 133220 94246 19208 9688 21594 497 -52094 -81153 -24606 45829 19063 -10508
15698 -10508 -3483 -30830 -65374 -72789 -39269 24577 49666 54633 80991 89538 40668 10024
15686 10024 -3857 -16941 17402 27142 -47897 -39788 14282 12207 -42601 -70646 -86368 -137835
15674 -137835 -145306 -158545 -146998 -93230 -78213 -42163 -4179 -62083 -98470 -75601 -44704 -25017
15662b5017l8647l0671L4352P8048J3626L1508M5650K4939m4532k7458k1593n885
15650C4320l8412J7494j2340K1788L6759j3779p42p713j4225M5432K5209M0768
15638A34559n1386p3253K7275m550r933L5138k4367k0540M1479P127k6634K855
15626C7770j0009K5329J9952J6180N6696m4825o4389m6055r546j3595K9411j500
15614d581J3014j0099l1944n711l720K1442J9660L0927M610O1083k6408n0020
15602A8253k4680M86J7643k8267J77M7816j7730m7327j8427p082K9049n933k5552
15589f1574K4656K7534k4510l0668k2788L8687Q77k2762K9114N1885K0429J3637
15577D4517L9507l4474r2851k5749j4492J9050l1139m6540O0500N1548K5420j0471
$$ plain form
15662 -25017 -63664 -94335 -59983 18065 31691 63199 108849 133788 89256 61798 40205 34320
15650 34320 -4092 13402 1062 22850 59609 45830 45088 37375 23150 68582 93791 134559
15638 134559 83173 9920 37195 32645 22712 57850 33483 12943 54422 61549 34915 37770
15626 37770 27761 53090 73042 89222 145918 101093 36704 -9351 -18897 -32492 -3081 -4581
15614 -4581 8433 -1666 -33610 -39321 -43041 -21599 -1939 28988 33598 94681 68273 18253
15602 18253 -6427 -5941 11702 -16565 -16388 31428 13698 -33629 -52056 -59138 -30089 -36022 -61574
15589 -61574 -36918 -9384 -33894 -64562 -87350 -48663 -47786 -70548 -41434 10451 30880 44517
15577 44517 84024 49550 -43301 -69050 -83542 -64492 -95631 -142171 -81671 -30123 -4703 -15174
15565a5174j7717J111l6697J6789o964l6103J1030K6188j1845M141M7790J806
15553a5645M3766K3505l2622p4285J2430R3814k435j4933K365k0595k0613K7207
15541B1959j6613q986m3388p280J3363l189j1746L7412L952n6460n5133L5424
15529i0685L6237n4922k5009N4520K1490L0838O4866p273j608l343k4995n0769
15517e0653M1921L2199o2976k8207l766K1785R623r505L8421M3394o3175J0101
15505b0838M6279J9852j39Q9399M7043l518o7320q6705j7339M6425j8744o0700
15493b6305j2599j1972j3890m5076N5380M5302L4297K7967j0793k626K4705J2434
15481G6824J5480K0712L543o3603j5685J7959m9874j1263j0138M906M5139L7400
$$ plain form
15565 -15174 -32891 -31780 -68477 -51688 -58652 -94755 -83725 -57537 -69382 -65241 -17451 -15645
15553 -15645 28121 51626 19004 -55281 -42851 50963 48528 33595 35960 15365 -5248 21959
15541 21959 5346 -3640 -47028 -54308 -40945 -44134 -55880 -18468 -14516 -70976 -126109 -90685
15529 -90685 -54448 -109370 -134379 -79859 -58369 -27531 37335 30062 28454 25111 116 -50653
15517 -50653 -8732 23467 -39509 -67716 -71482 -49697 -40074 -49579 -11158 32236 -30939 -20838
15505 -20838 25441 45293 45154 134553 181596 178078 110758 24053 6714 53139 34395 -26305
15493 -26305 -38904 -50876 -64766 -109842 -54462 -9160 25137 53104 42311 39685 64390 76824
15481 76824 92304 113016 116559 52956 37271 55230 5356 -5907 -16045 -11139 34000 71400
15469G1400m9693k6252l6784O512J6271n8310j0873L5736K344O855J5711L0240
15457C157K1786m4145j5636k5829M3551K5696n1808k87L3507k5210L1198K5773
15445B1753j5894L7595P9057K8705n2144j8545K6596j1026p4496p610k2951M1157
15433C2197K5619k1538o9165n7899N1617K7526K4968o299n0266K7264O5100m1100
15421H024n8198p053J7981L6547L940n1896m3428K0641m309J653O2104M254o677
15408a6417L3315O7715q0336k0973L1505l727m3398m6488K5652J8178N458K9293
15396b23K4006j2875m5758k5600j2485J1868K8874R137m3207k8929J7240M3808
15384c4144N8014J2860j1012l1903p11j3933n1881l6122M071P9738k7002K6268
$$ plain form
15469 71400 21707 -4545 -41329 -34817 -18546 -76856 -87729 -51993 -49649 -42794 -27083 3157
15457 3157 24943 -19202 -34838 -60667 -17116 8580 -43228 -43515 -10008 -35218 -4020 21753
15445 21753 5859 43454 122511 151216 99072 80527 107123 96097 21601 13991 -8960 32197
15433 32197 57816 36278 -32887 -90786 -39169 -11643 13325 7026 -43240 -15976 49124 8024
15421 8024 -50174 -57227 -39246 -2699 1241 -50655 -94083 -73442 -77751 -76098 -13994 -9740 -16417
15408 -16417 16898 84613 4277 -16696 14809 11082 -32316 -78804 -53152 -34974 -29516 -223
15396 -223 23783 10908 -34850 -60450 -72935 -61067 -32193 -23056 -66263 -95192 -77952 -34144
15384 -34144 23870 36730 25718 -6185 -6896 -20829 -72710 -108832 -104761 -25023 -52025 -25757
15372b5757j9948L0005J7289j8420Q94L4093J1001r821M907M457M7113k8368p1863
15359b4418n0831k6772M6455N3208j9562m9670K4412K3571L3168J9191l8454J1314
15347A612K0037k636k3025l0804k350m7120M3372L4456L430J2083L9415M5806
15335I4276J0771n5889p8629j032l667K2202n437k0359j684N2791j9163n8176
15323f3996k4027L4790L8874L0175N0387j1257n2064k5153k1374K6995M2924K7456
15311E3730k3070m2993n6086n8079K9478J6982J5370K7619J6432K8064L3182k1943
15299A8686l4930m2030M6675M5098q255k2143l1806l4162J0858o37Q3392N9255
15287I0001N674m491l8341r439K8084k7179l8604n9152o7115N5014N7823N6085
$$ plain form
15372 -25757 -45705 -15700 1589 -16831 -15937 18156 29157 19336 24243 28700 75813 47445 -24418
15359 -24418 -75249 -102021 -55566 -2358 -21920 -71590 -47178 -23607 9561 28752 -9702 1612
15347 1612 21649 19013 -4012 -34816 -37166 -84286 -40914 -6458 -3028 9055 48470 94276
15335 94276 105047 49158 -29471 -30503 -34170 -11968 -17405 -37764 -39448 13343 -5820 -63996
15323 -63996 -88023 -53233 -14359 15816 66203 54946 2882 -22271 -43645 -16650 26274 53730
15311 53730 30660 -12333 -68419 -126498 -97020 -80038 -64668 -37049 -20617 7447 40629 18686
15299 18686 -16244 -58274 -11599 33499 25244 3101 -28705 -62867 -52009 -52646 30746 90001
15287 90001 95675 91184 52843 43404 71488 44309 5705 -53447 -120562 -65548 -7725 48360
15275D8360l0001j0341m9690n2663N98J9402R1387M9815m8591n851J457k3151
15263i269j2144R44J2213n054m8416j7028L400j761J1615m4308K2118p89j2877
15250a01356O4128K3182l3692k1322j7482m5534O503N9685J0332j1200m2942p629
15238a17327L3570M9864k1884J1708O4045N8767J0135l3930l9371L6009K8295
15227G9881j02412j1741Q267K7389k2364p4670n55N1981M4551J5384o8481K9282
15215b3488O544N645K6335N2699N0711l7056l280l979o0602K6073N2441K2945
15203A14988K646m0512j5715o6139q0252o3696M4930K9482n3494l364N4720K5381
15191e1025q211L1252n4292n8987M4723L1600n508k4213o3749M080N0691J1167
$$ plain form
15275 48360 18359 8018 -41672 -94335 -93737 -74335 17052 66867 18276 12425 13882 -9269
15263 -9269 -21413 -20469 -8256 -13310 -61726 -78754 -75354 -77115 -65500 -109808 -87690 -88479 -101356
15250 -101356 -37228 -14046 -47738 -69060 -86542 -132076 -125573 -65888 -55556 -66756 -109698 -117327
15238 -117327 -83757 -33893 -55777 -44069 19976 78743 88878 54948 15577 51586 79881
15227 79881 -22531 -34272 -26005 1384 -20980 -95650 -96205 -44224 327 15711 -52770 -23488
15215 -23488 -16944 -11299 15036 67735 118446 81390 78110 74131 13529 39602 92043 114988
15203 114988 117634 77122 61407 -4732 -84984 -148680 -103750 -74268 -127762 -131126 -76406 -51025
15191 -51025 -59236 -27984 -82276 -141263 -96540 -64940 -70448 -94661 -158410 -154330 -103639 -92472
15179i2472K2588M5858J013j2123k7152J5276J3929J8749L282K8108M2640n1260
15167H436o0123N9590K0774K9581m0806j9501j5119k9876O3961L2178p8524l7298
15155f6727O5855J5739j3534K6202l2199o5547M3284O0968J4525k826K4902L0914
15143A01556l4512m5195Q560m904p269Q639j2751m5761k7731L7336Q7210n4227
15131A0951L5808P558n1823j7328q1804K8372M3400n4562k0612k226P362L5578
15119e9326K6898J2078l9976l0746L8619P534M2379O1798k8893j9874m0157K0298
15107i368N3418p3267l4277l5509j6696M5495p808n5100r631O3812M2063k1239
15095e8107o653L8205Q0343j909n5201l0174k1901p346j2354K4569J3714N8549
$$ plain form
15179 -92472 -69884 -24026 -23013 -35136 -62288 -47012 -33083 -14334 -11052 17056 59696 8436
15167 8436 -51687 7903 28677 58258 17452 -2049 -17168 -47044 16917 49095 -29429 -66727
15155 -66727 -872 14867 1333 27535 -4664 -70211 -26927 34041 48566 45740 70642 101556
15143 101556 67044 21849 30409 25505 18236 26875 14124 -31637 -59368 -22032 65178 10951
15131 10951 46759 54317 2494 -14834 -96638 -68266 -24866 -79428 -100040 -102266 -94904 -59326
15119 -59326 -32428 -20350 -60326 -91072 -52453 -44919 -2540 59258 30365 10491 -29666 -9368
15107 -9368 44050 -29217 -63494 -99003 -115699 -70204 -78012 -133112 -142743 -78931 -36868 -58107
15095 -58107 -64760 -26555 53788 51879 -3322 -33496 -55397 -62743 -75097 -50528 -36814 21735
15083B1735k4486j6819O3117K2628N70o019k5415k1382j9750N087J9632K9901
15071D8799l1201n4739J0147j8010l2305m2141M0610N0834n6882L105k101J1189
15059g2695N1842K0683K2637k6263j5657M4189l4418k5500N0715N0020L1591p3180
15047B3964n8521K3986L6711O05j5778n501j0474O2612J5249M3146n5127o8366
15035g494n6623j8961q59N022O147j989L9581O6013k8403k5830k7683k5146J3320
15022f2905J2004l5356k8961L7286N3623l5022m5246M2120J8j1188N4593K4912
15010E878n7363k171K2555J8385K007k1264q065P223M5630M981r314j3045p0500
14997g5063L2946N0321j4258j224l3041j6764k4576j0722L1533L3624j7743o7034
$$ plain form
15083 21735 -2751 -19570 43547 66175 66745 60726 35311 13929 -5821 -734 18898 48799
15071 48799 17598 -37141 -26994 -45004 -77309 -119450 -78840 -28006 -84888 -81783 -83884 -72695
15059 -72695 -20853 -170 22467 -3796 -19453 24736 -9682 -35182 15533 65553 97144 23964
15047 23964 -34557 -10571 26140 26745 10967 5466 -5008 57604 72853 115999 60872 -7494
15035 -7494 -64117 -83078 -83937 -78915 -72768 -74757 -35176 30837 2434 -23396 -51079 -76225 -62905
15022 -62905 -50901 -86257 -115218 -77932 -24309 -59331 -104577 -62457 -62439 -73627 -19034 5878
15010 5878 -51485 -53656 -31101 -12716 -10709 -31973 -40038 -32815 12815 17796 8482 -4563 -75063
14997 -75063 -42117 8204 -6054 -7278 -40319 -57083 -81659 -92381 -60848 -27224 -44967 -112001
14985a12001j4611P4994k1245l9496K641rO8139K4634J4095J6349k0972K9142
14973B1660j1799M503J4296M542k2225p076j6080k5429n0782n4964n789M8701
14961a00442k1275l9972j799Q0664K6532n3106p285O7718O0587l6314K9014j0965
14949f643k1764m6703l7702J9944M8114R045J2648p208l2808J0562K5306J6247
14937a0962j3715K0190k5555l3267L0281K3649j1528J6946m0250j7207P757L0100
14925b3561O7096P808o5082l8407p278J3777J17111m6343r8656n018N2329K7113
14913H89J7874k323j0181J9094P87k576K5850R174l5810J097L4142L2286n0725
14900C9578M0834M2568m4366o1051m858j0501k9903K6370N6302j7333j051j2180
$$ plain form
14985 -112001 -126612 -51618 -72863 -112359 -109718 -109727 -41588 -16954 -2859 13490 -7482 21660
14973 21660 9861 14364 28660 33202 10977 3901 -12179 -37608 -88390 -143354 -149143 -100442
14961 -100442 -121717 -161689 -163488 -82824 -56292 -109398 -116683 -48965 11622 -24692 4322 -6643
14949 -6643 -28407 -75110 -112812 -92868 -44754 -35709 -23061 -30269 -63077 -52515 -27209 -10962
14937 -10962 -24677 -4487 -30042 -63309 -33028 -9379 -20907 -3961 -44211 -61418 -53661 -23561
14925 -23561 43535 51343 -13739 -52146 -59424 -45647 71464 25121 -73535 -78553 -26224 889
14913 889 18763 16440 6259 25353 26140 23564 49414 58588 22778 23875 58017 90303 39578
14900 39578 80412 122980 78614 17563 12705 2204 -27699 -1329 54973 37640 36589 24409
14888B4409n4922n6687m170o6382J6748Q8604j3613j0050r170l557K2219p341
14876g3912M6261J3671J1089K2129j0236r440j3212n3581N747K9506L5665j4105
14864a0418l0347J199K2857P760j7707l4329K0246J8740N382M578K9799M449M4945
14851F7154j7583j01435l9693Q597N6245L6239M1020J9562J8849o1115j1265j0354
14839F221O735M8529j385K1108j2535o1427K9235J5771j3442N7791l0122k7068
14827C9411l3754K087l4203M62l751O833J2751j0902k3868n8220o595J4243k2760
14814a18266J3242j947l2305k4266L4880N7639M3751L0284k0354p809J1456L9621
14802B5926Q3980K1165m0378j8436K5593k7281l7093l5279q0273P992Q8136J2347
$$ plain form
14888 24409 -30513 -87200 -91370 -157752 -141004 -52400 -66013 -76063 -85233 -88790 -66571 -73912
14876 -73912 -27651 -13980 -2891 19238 9002 -438 -13650 -67231 -61484 -31978 3687 -10418
14864 -10418 -40765 -39566 -16709 -8949 -26656 -60985 -40739 -21999 -16617 -12039 17760 22209 67154
14851 67154 49571 -51864 -91557 -82960 -26715 9524 50544 70106 88955 27840 16575 6221
14839 6221 12956 61485 60100 81208 68673 7246 36481 52252 38810 96601 66479 39411
14827 39411 5657 7744 -26459 -25997 -29748 -22915 -10164 -21066 -44934 -103154 -109749 -95506 -118266
14814 -118266 -105024 -106971 -139276 -163542 -128662 -71023 -27272 3012 -17342 -25151 -13695 25926
14802 25926 109906 131071 90693 72257 97850 70569 33476 -1803 -82076 -74084 14052 26399
14790B6399K3499J558m1890k538N4166J409R05n1238o5274j9878M6153R916j9209
14777c6022L4734J4646o4289n5868K9379M3583o039M0249J540k9995q1493N7659
14765e1916J14771K8301k5290j4978l5230k172j7M2374o382p9350m686O408Q7156
14752E8989P4826N357L3623p0621q0757l5931L43L433n3055J0229Q138K5323N6083
14739C5980N1792L4024k5787l2730O624Q952j9238K354j8448l0875p0717J2892
14727d5177J2808O48L8574K0697l3014m2798j3782O0285K4965O4768O1179l2379
14715A16774m6273m7836n9095M33r824j457O1646J4855J2100M0664o3050k9843
14703a0906j723m287l2160L220K3998P563j1742l308J8173k4107r228l6495P452
$$ plain form
14790 26399 49898 51456 9566 7028 61194 62603 63508 12270 -53004 -72882 -26729 -16813 -36022
14777 -36022 -1288 13358 -50931 -106799 -77420 -33837 -39876 373 1913 -28082 -109575 -51916
14765 -51916 62855 91156 65866 50888 15658 13486 13469 55843 49461 -29889 -34575 -28167 58989
14752 58989 133815 139172 172795 102174 21417 -14514 -14171 -10738 -63793 -53564 -45426 -20103 35980
14739 35980 87772 121796 96009 63279 69903 78855 59617 61971 43523 12648 -58069 -45177
14727 -45177 -32369 -31721 6853 27550 -5464 -48262 -62044 -1759 23206 87974 149153 116774
14715 116774 70501 22665 -36430 -35997 -45821 -47278 14368 29223 41323 81987 18937 -10906
14703 -10906 -12629 -16916 -49076 -45856 -21858 -14295 -26037 -29345 -11172 -35279 -44507 -81002 -73550
14690g3550P6L2650J6324K4638K9366n9772j5970l5431j2620N2903K5445K5729
14678I788N050r3414J7737K8073K9187K3559N9379l6422j5177M3388j8480k692
14666D9976Q824m8378n7118j443j4717P5821j4802k5088m3320n2783M6799j8890
14654i5119m4384J0303O7587N2762J5108K505j2167K3184m9470k9648M4447O9472
14642E4580j567j1134p9543p3563m005j6635Q7125j8260j1714k4931l9057J6251
14630a22453M8377M5475K9312O178k6385M2333j7801k9081j1660r497J809P0718
14618B7325n4602m3942l5580k0107j0271k1911l2283N5874M6822j6209o365O9849
14606d1400N0535K6024p0104n0400L948K5085M6361k4756j1958L2687J0932R217
$$ plain form
14690 -73550 -73474 -40824 -24500 138 29504 -30268 -46238 -81669 -94289 -41386 -15941 9788
14678 9788 14838 -78576 -60839 -32766 -3579 19980 79359 42937 27760 71148 52668 49976
14666 49976 58800 10422 -46696 -48139 -62856 12965 -1837 -26925 -70245 -123028 -76229 -95119
14654 -95119 -139503 -129200 -61613 -8851 6257 8762 -3405 19779 -29691 -59339 -14892 54580
14642 54580 53013 41879 -37664 -111227 -115232 -131867 -44742 -63002 -74716 -99647 -138704 -122453
14630 -122453 -74076 -28601 711 6889 -19496 22837 5036 -24045 -35705 -45202 -43393 27325
14618 27325 -27277 -71219 -106799 -126906 -137177 -159088 -191371 -135497 -88675 -104884 -111249 -41400
14606 -41400 9135 35159 -34945 -85345 -81397 -56312 -9951 -34707 -46665 -13978 -3046 6171
14594F171K9339M436n0153j7973n1479k3163K0537K8920l5746L1605k3619r388
14582i0513o650m9867K1971P2276P8787L7967j9831p903j8356Q89j5999j4752
14570a1981P99J1424L9754o718k690l5398J6268K3715O819l7145K7613r716j8679
14557D065N408K4820o3602n6575q5113J2947L9377P6863K169j0252J6010j1429
14545d5312m7060r637K7967M9748J528k4033j1333N2512K2432k1968l3155j1850
14533e0161Q819j4908K8195J6879r123K0262k4736m8995j5191N990K5881L2326
14521b4762j8469J1369N2920K9350n679Q149K2564o3046k7863m585K4677O9491
14509G4116J9354J4184K8521m207m3240N5380M3310m24J24453J28321N4658P2441
$$ plain form
14594 6171 35510 39946 -10207 -28180 -79659 -102822 -82285 -53365 -89111 -57506 -81125 -90513
14582 -90513 -97163 -147030 -125059 -52783 26004 63971 44140 36237 17881 18770 2771 -11981
14570 -11981 -11182 242 39996 33278 30588 -4810 11458 35173 41992 4847 32460 22744 4065
14557 4065 9473 34293 -29309 -85884 -170997 -158050 -118673 -41810 -39641 -49893 -33883 -45312
14545 -45312 -92372 -102009 -74042 -24294 -22766 -46799 -58132 -5620 16812 -5156 -38311 -50161
14533 -50161 -41342 -56250 -28055 -11176 -20299 -37 -24773 -73768 -88959 -82969 -57088 -24762
14521 -24762 -43231 -31862 21058 50408 44729 52878 75442 12396 -15467 -20052 4625 74116
14509 74116 93470 107654 136175 131968 88728 144108 187418 186994 311447 439768 494426 566867
14497E66867M4190K4455N2150K457l2596m228k927j2756m1898q324k6280j1057
14485E50053l5713m8294q2032m1398m8175j27480r6342k9240m0120m6014k7728
14474g2483M5644J3518L5813J9409k5473m8806k0555M249l146N9176K7046j8457
14462A5935M2705P9139k9125n4407r842n4683p5120M963P0825R428m5912m4981
14450i1075m1234N4965J9074K6176O0218k5788K0589K6526k11m7074n9571o6500
14438a23905J3484R631p89J2564m6055P049j7594J1875P0577K3677K1350J15394
14426I7258M865p8270n7300k0925J7724K9028K4354k8946O7591r385k5557J2042
14414C2479J5386J4733Q180l2545p028n312J4090j0853J7218j7262k4997q1664
$$ plain form
14497 566867 611057 635512 687662 690119 657523 653295 650368 637612 595714 587390 561110 550053
14485 550053 514340 466046 384014 342616 294441 166961 70619 41379 1259 -44755 -72483
14474 -72483 -26839 -13321 22492 41901 16428 -32378 -52933 -48684 -51830 7346 34392 15935
14462 15935 58640 137779 108654 54247 44405 -10278 -85398 -80435 -9610 -182 -46094 -91075
14450 -91075 -132309 -77344 -58270 -32094 28124 2336 22925 49451 49240 2166 -57405 -123905
14438 -123905 -110421 -100790 -101579 -89015 -135070 -128021 -145615 -133740 -63163 -39486 -18136 97258
14426 97258 102123 23853 -33447 -54372 -36648 -7620 16734 -12212 55379 45994 20437 32479
14414 32479 47865 62598 70778 38233 31205 25893 39983 29130 46348 29086 4089 -77575
14402g7575O291O6277K9642j836k859n0302m8559n804O2204O315o766j0112J0759
14389b2325m2086j2613P1947J1444o7737q684L7914N0749K5852m9110J0291L5983
14377D1625n3571k4046M3914j0244O428O881k1921l9217j545j3865R248M6232
14365a0081j777j0228j409O022o5057k2666K7890J7812K0661K419k5158o887l1504
14352i9963k3208J2064M6229K2714J5779L5225J0129J9645J9298j9832o8198m7402
14340g7520K3191N0596K0213L4767j0760K0051j6539O210j5857k7487j3931M1344
14328C4278O2948L7330l9556o5150n5593N623R094M4825m425j6610n9825n1702
14316i8763q272q793L9302N6651O9457P5773n0180j3952N3704k0522o2682m5259
$$ plain form
14402 -77575 -71284 -5007 24635 22799 19940 -30362 -78921 -84725 -22521 -16206 -22972 -33084 -22325
14389 -22325 -64411 -77024 -5077 6367 -61370 -70054 -32140 18609 44461 -4649 5642 41625
14377 41625 -11946 -35992 7922 -2322 4106 10987 -10934 -50151 -51696 -65561 -56313 -10081
14365 -10081 -11858 -22086 -23495 -17473 -82530 -105196 -77306 -59494 -38833 -36414 -61572 -68459 -99963
14352 -99963 -123171 -111107 -64878 -42164 -26385 8840 18969 38614 57912 38080 -30118 -77520
14340 -77520 -54329 -3733 16480 51247 40487 60538 43999 50209 34352 6865 -7066 34278
14328 34278 97226 134556 95000 29850 -25743 -20120 -11026 33799 29374 12764 -47061 -98763
14316 -98763 -107035 -115828 -76526 -19875 49582 125355 75175 61223 114927 94405 31723 -13536
14304a3536l0480j8215R427j7345k5588k2083j9640M0619K6802m509J8360P754
14292d8434p4912l2352J9083k8044o703M0249M0841N7152K0768j2444K570J3341
14280h885M6884n8634n7983j3304L9182P83K4306M012k2506m2769j5639L4290
14268g0263N5636j6595p0090o5322o5718K4570M4273P0189R1416r2787l5869K9687
14256a00873P2909J7516O3200l1965n3407k4953K7424J0180J1206k8280l8006
14245g5049j3627M8286o917M911l7534L5645J1457k996J4386m114l9607J5662
14233d9497J0187K879p223P0462P2861n3198l7631m1564j835j5258k5767L7065
14221c8519N2034l8015p3340M0673J9473L1602K8813P290L2505r4320o7392r002
$$ plain form
14304 -13536 -44016 -62231 -52804 -70149 -95737 -117820 -137460 -96841 -70039 -74548 -56188 -48434
14292 -48434 -123346 -155698 -136615 -164659 -171362 -131113 -90272 -33120 -12352 -24796 -22226 -8885
14280 -8885 37999 -20635 -78618 -91922 -52740 -51957 -27651 -23639 -46145 -88914 -104553 -70263
14268 -70263 -14627 -31222 -101312 -166634 -232352 -207782 -163509 -93320 -1904 -94691 -130560 -100873
14256 -100873 -27964 -10448 52752 20787 -32620 -57573 -30149 -19969 -8763 -37043 -75049
14245 -75049 -88676 -40390 -47307 -42396 -79930 -44285 -32828 -35824 -21438 -25552 -65159 -49497
14233 -49497 -39310 -36431 -43654 26808 99669 46471 8840 -32724 -34559 -49817 -75584 -38519
14221 -38519 13515 -24500 -97840 -57167 -37694 -6092 22721 30011 62516 -31804 -99196 -108198
14209a08198L3139K5843K1105m2531M5601K6182k731M0690P5674l6757p1917k5344
14197a9244K0194j3932L05L8642k4028p1266N864l1113j8410j204N4093K1795
14185c8304K8017K0549L3505J2152K3788o1339m7003O731m117j3600K7820j5253
14173b7054k4477n0315Q8818j0908K4841o3936m3094N376P1681Q6998J3176R766
14161H0872j407n7281n7281l8315N980L630M203j4694M2293M8925j8431L70L4762
14148C3626j8264p7009o8977K6618k6410P4596K5727Q06j2222k3826l5618K3166
14136g7787M0195K7772k2476k573j0299o089J4248Q7421M9014l7682m0676n0006
14124b8938j6556K3747j6102p111K939R841m424p3500O552M1855l8473r121N8716
$$ plain form
14209 -108198 -75059 -49216 -28111 -70642 -25041 1141 -1590 39100 114774 78017 6100 -19244
14197 -19244 950 -12982 -12677 25965 1937 -69329 -63465 -94578 -112988 -114192 -60099 -38304
14185 -38304 -10287 10262 43767 55919 79707 18368 -28635 -21904 -26021 -39621 -11801 -27054
14173 -27054 -51531 -101846 -13028 -23936 905 -63031 -106125 -100749 -29068 57930 71106 80872
14161 80872 79465 22184 -35097 -73412 -67432 -63802 -59599 -74293 -32000 16925 -1506 -1136 33626
14148 33626 15362 -61647 -130624 -104006 -130416 -55820 -30093 -29287 -41509 -65335 -100953 -77787
14136 -77787 -37592 -9820 -32296 -34869 -45168 -51257 -37009 50412 99426 61744 21068 -28938
14124 -28938 -45494 -21747 -37849 -44960 -42021 -32180 -36604 -110104 -103552 -61697 -100170 -109291 -50575
14111e0575l8794m3764J2065K1450q022O871Q9257M9045j8238o435p18K4221l42
14098C6021L751m1713k6544l5497J0220N0140O7910Q5076M0285P485K7537L1153
14086B55824n192K9434J6080J1432j8681l6357k1302J5406p105J5193p423r375
14074B37934l7777n4250l5661l5413J4191L2316m4404q273k1508j7742j4723Q794
14062B3484q016l2118k5883j516l501K5560K6664o44p648J5298K8604L0223L421
14049G3928m3071n2252M5208P003m9688l4109O5001q840j1173l1310m3862L751
14037g9414K5296n2843k4684N5336L8782k386j655L4020M306j93N694M8318N3915
14024A04492r6510o0930J9775k843J1556L8375J3101J7002n907k1733k872J988
$$ plain form
14111 -50575 -89369 -133133 -121068 -99618 -107640 -100769 -11512 37533 19295 12860 12142 36363 36021
14098 36021 39772 -1941 -28485 -63982 -53762 -3622 64288 149364 189649 197134 224671 255824
14086 255824 250632 280066 296146 307578 288897 252540 231238 246644 239539 254732 247309 237934
14074 237934 200157 145907 110246 74833 89024 121340 76936 68663 47155 29413 14690 23484
14062 23484 15468 -16650 -42533 -44049 -47550 -21990 4674 4030 -3618 11680 40284 70507 73928
14049 73928 30857 -21395 23813 30816 -18872 -52981 12020 3180 -7993 -39303 -83165 -79414
14037 -79414 -54118 -106961 -131645 -76309 -37527 -39913 -41568 -7548 -3242 -3435 2259 50577 104492
14024 104492 7982 -52948 -33173 -36016 -24460 13915 27016 44018 38111 16378 13506 15494
14012A5494J8069L6268q695m1168J687n5622o404K6137p684J0794K5248p0962
14000e6838L4761P9860n7984n2072N476m9872l539L3602J4768N7729M733n0090
13988c9466l8770K6444L3696R91n616j4011k2621K5839M3664K3260L9705k4062
13976D9053o9933l3357K2431K1753L7678O8111L9415J5592l665m6307j04429l7556
13964d1214M6035Q4237K3409J3540J8081L0941J8515K8086j3435M674k8782l4919
13952A49168J1342j9947M217q267K5340R639n3095j0120k2581j2709n7261k0554
13940d828j4734j4216L2462P74n3296M8836P1586M7939l0552m835k8o6713j5133
13927b738J862N1016n085p2838m709K0353k2046j2848Q322k2165l0062J7632P5785
$$ plain form
14012 15494 33563 69831 61136 19968 21655 -33967 -40371 -14234 -21918 -11124 14124 -56838
14000 -56838 -22077 57783 -201 -52273 -46797 -96669 -100208 -66606 -51838 5891 10624 -39466
13988 -39466 -78236 -51792 -18096 -17105 -22721 -36732 -59353 -33514 10150 33410 73115 49053
13976 49053 -20880 -54237 -31806 -10053 27625 95736 135151 150743 147078 100771 -3658 -41214
13964 -41214 4821 89058 112467 126007 144088 175029 193544 221630 208195 212869 184087 149168
13952 149168 160510 140563 144780 136513 161853 171492 118397 108277 85696 72987 15726 -4828
13940 -4828 -19562 -33778 -1316 -542 -53838 -5002 66584 114523 83971 79136 79108 12395 -2738
13927 -2738 -876 50140 45055 -27783 -32492 -12139 -34185 -47033 -38711 -60876 -90938 -73306 2479
13914B479J5628m1969L8391L7271n645j7867J128n867L5997k6265n8174o6090
13902i0983p176L1972Q202M4184K5620m7371P212M8504O3522J8554M351m4457
13890F2134R886M4069l829n3134q3391K3370L1300j0937j8706m7411L2630O2707
13878D8688j1870R668k690L1229J4168L4294J10105O3395L9385O3137L6502L4310
13866D70321m2770r4816o6119o0169l4471L2721m8733m7798O3681L2427o9261
13855A35013k1647L8478L0910m8644n8318j8975J0023r003l2416J257P732j3378
13843B1032l0702M0636K8851P2389n3743n1019j1315L7633N9682O3898K4290P529
13831B09161n9542P126K2227L8674K4224l1300m01O4691M6131o0734j2622K8186
$$ plain form
13914 2479 18107 -23862 14529 51800 46155 28288 29416 23549 59546 33281 -24893 -90983
13902 -90983 -98159 -66187 -57985 -13801 11819 -35552 -28340 20164 83686 102240 106591 62134
13890 62134 72020 116089 112260 59126 -24265 -895 30405 19468 762 -46649 -14019 48688
13878 48688 36818 46486 43796 75025 89193 123487 233592 296987 336372 399509 436011 470321
13866 470321 427551 332735 266616 206447 171976 204697 155964 108166 171847 204274 135013
13855 135013 113366 151844 182754 134110 75792 56817 66840 57837 25421 26678 34410 21032
13843 21032 -9670 30966 59817 132206 78463 27444 16129 53762 113444 177342 201632 209161
13831 209161 149619 156745 178972 217646 241870 210570 210169 274860 320991 260257 247635 275821
13819B75821M0604J25059Q6156O7953R9968J76015K35674K23599L67537N60715
13809B259101O86719P71462O71842L82383r163l98572o42570o89743o46169n60644
13799A824646m39593l46569k23703j01124r4568n8567o3909n5138r1146l4124
13789C16205m2306p3149r5322j02695K4178L3954K6637J8987O211k2032m4204
13778D6464r8596n328J2897j0341l2921r468Q5517R2968J0957J7326n09l478M0242
13765A45730J9326n7934q5652J7221L9527K7926j8154M235j6227m2149o6751p5879
13753a08781K274Q4581M1468P206K0061r02j5381L602j749k5273K0044M8413Q5727
13740A61290k4277o1784l4700k2159j1380j7872P50L2943L259m9023k296J5353
$$ plain form
13819 275821 316425 441484 527640 595593 695561 871576 1107250 1330849 1698386 2259101
13809 2259101 2945820 3717282 4389124 4771507 4762344 4363772 3721202 3031459 2385290 1824646
13799 1824646 1385053 1038484 814781 713657 619089 560522 496613 441475 350329 316205
13789 316205 273899 200750 105428 2733 26911 60865 87502 106489 112700 90668 46464
13778 46464 -52132 -57460 -44563 -54904 -87825 -97293 -11776 81192 92149 109475 108966 105488 145730
13765 145730 165056 107122 21470 38691 78218 106144 87990 92225 75998 33849 -32902 -108781
13753 -108781 -106507 -21926 19542 26748 46809 45907 30526 34128 32379 7106 27150 75563 161290
13740 161290 137013 75229 40529 18370 6990 -10882 -10132 22811 26070 -22953 -25249 -9896
13728i896j4461j1985O515L2629j930l371l5944k8064K686J0989R424L8540K4098
13715A9230j5434k2619J7255K1362m4186n3874L806J0152n8263L838O3404L3530
13703b1799J8099j9664k6462k0670P1427M8186n738j5864J3665J0807K982k4493
13691C0476m4017l8212L723r750L5733N708K0188M5650M619M8400O1785o7980
13679I6323o8554l6133M5363M656P088O1342O2325Q6721L2572K1199J20180J73805
13667F06887K14432J54315K15759J92476P1781K5444j00622j42973k22928k02180
13657H12391k02815j35549j08441l0580o8938j267n2845k2219m793m1068k5562
13646A18314m3127j3488L4431J7294l2392o8140m4362l4264O5149O1942o6589
$$ plain form
13728 -9896 -24357 -36342 -29827 2802 872 -2499 -38443 -66507 -63821 -52832 -43408 -4868 19230
13715 19230 3796 -18823 -1568 19794 -24392 -78266 -74460 -64308 -122571 -118733 -55329 -21799
13703 -21799 -3700 -23364 -49826 -70496 931 49117 43379 27515 41180 51987 54969 30476
13691 30476 -13541 -51753 -48030 -57780 -22047 -16339 3849 49499 54118 102518 164303 96323
13679 96323 27769 -8364 36999 41655 48743 110085 172410 259131 291703 312902 433082 606887
13667 606887 821319 975634 1191393 1383869 1455650 1481094 1380472 1237499 1014571 812391
13657 812391 609576 474027 365586 335006 266068 264801 211956 189737 184944 143876 118314
13646 118314 75187 61699 96130 113424 81032 12892 -31470 -65734 -585 61357 -5232
13635e232J0072K5579J595j4408k8280k0708j9475n629k1741M4150M5975n8456
13623d6558K3329R008M9138o775N3352L761m1169m7260K7297M2217M2066K5389
13611A33795r3586n5279L7849M071J5208M3015K2877N7772K1114k1827p8146o6237
13599B0626p4324M4911K6834O6330j4083r4858K0602K3120l9101k5244K3879R840
13587a1468L4515q257m4122k7785k2130m9435l990J5648J04298L9367p128n8989
13575c9476R950K4362m1344K1184L2702N730m4277k492k270L5004K3298M0720
13563F3091K9885k857k4337m3334K019J0361j8902M5443P2139L2607l0987q4790
13551E0338p514n6751L977l70m1474O4626M811j4787j0502M9385N2646Q955m0703
$$ plain form
13635 -5232 4840 30419 32014 17606 -10674 -31382 -50857 -56486 -78227 -34077 11898 -46558
13623 -46558 -23229 -14221 34917 28142 81494 85255 44086 -3174 24123 66340 108406 133795
13611 133795 40209 -15070 22779 26850 42058 85073 107950 165722 186836 165009 86863 20626
13599 20626 -53698 -8787 18047 84377 70294 -24564 -3962 19158 -19943 -45187 -21308 -11468
13587 -11468 23047 14790 -29332 -57117 -79247 -128682 -132672 -117024 -12726 26641 19513 -39476
13575 -39476 -29526 -5164 -46508 -25324 7378 13108 -31169 -33661 -35931 -927 22371 63091
13563 63091 92976 90119 65782 22448 24467 34828 15926 61369 133508 166115 135128 50338
13551 50338 42824 -13927 -9950 -10320 -51794 12832 17643 2856 -7646 41739 94385 103340 62637
13538F2637k8557j310N2144M496j6982O2437j4691k0463K7446k0286K3910l5028
13526I5753k956K9988m039O2159J17942J36947J86305L34186K76837K12339J34306
13515A579767N1250j28286k32778k50935k57834k02624j43539n1505o0765l4918
13505B67833m2850k6830J9774K3098Q46m7698n4154k2083l3534n300K72N1176
13493A30550M0544j2991p8938k8654K7584q560p047j8951J0220M8818J5842k4063
13481I4354M9243j6938k3110N327O8026M0099N964O8701N7776O2753J38205J26891
13469F77291K53287L23518L74363L70645K63232N0006j26017k6639J00881M5651
13459B306218k6771k10799m40747l84815l22075k33190j56651j27072n3980m6108
$$ plain form
13538 62637 34080 32770 84914 89410 72428 134865 120174 99711 127157 106871 130781 95753
13526 95753 92797 122785 118746 180905 298847 435794 622099 956285 1233122 1445461 1579767
13515 1579767 1631017 1502731 1269953 1019018 761184 558560 415021 363516 302751 267833
13505 267833 224983 198153 217927 241025 241871 194173 140019 117936 84402 79102 79374 130550
13493 130550 171094 158103 79165 50511 78095 69535 62488 43537 53757 102575 118417 94354
13481 94354 143597 126659 103549 108876 176902 217001 222965 291666 349442 412195 550400 677291
13469 677291 930578 1254096 1628459 1999104 2262336 2312342 2186325 2159686 2260567 2306218
13459 2306218 2279447 2068648 1627901 1243086 921011 687821 531170 404098 350118 304010
13449C04010q0337J1846j039m3673K250l5017m3616k5651p5315j5030L2121L8474
13437F9023k5319l1797o433L4968K2856l4475r1523m500Q9980L3102K0052l9256
13425C6678o8614J8316m0309k318K4330k8260J3695R273L2491P9108k2874l9853
13413A1663m8863N8968L4507j9451J7101j677P087M6977q836k0388N442k2740
13401E9790o056m8266k2171J7992J6832j1527n591l6647k5180r308p014M3876
13389c3270N5524J7858k720K5181M873n6690m9804J5347j2499j6354l4537J8032
13377f9059L5116Q9233Q1768O954o1706k6339R229j3188j6993l4200p5448N9878
13365a4755O2659m5138j1867J0812k1328k2003K3525O0464k3594l1154j2723J3365
$$ plain form
13449 304010 223673 235519 234480 190807 193057 158040 114424 88773 13458 -1572 30549 69023
13437 69023 43704 11907 5474 40442 63298 28823 -62700 -67200 22780 55882 75934 36678
13425 36678 -31936 -13620 -53929 -56247 -31917 -60177 -46482 -37209 -4718 74390 51516 11663
13413 11663 -37200 21768 56275 36824 53925 52248 59335 106312 97476 77088 82530 59790
13401 59790 53734 5468 -16703 1289 18121 6594 1003 -35644 -60824 -70132 -77146 -33270
13389 -33270 22254 40112 37392 62573 67446 10756 -39048 -23701 -36200 -52554 -87091 -69059
13377 -69059 -33943 55290 137058 144012 82306 55967 65196 52008 35015 815 -74633 -14755
13365 -14755 47904 2766 -9101 1711 -19617 -41620 -18095 42369 18775 -12379 -25102 -11737
13353a1737R141l4808n051L5941R4468K1179M7088P972l8230m1997J4979J0630
13341A09575K0308J7708n892n2785p2989l2460K4669l309m4313N935j4355p537
13329e5445K063R558j0074K8837J2060p069L0030N1952J0857L0623k2997J0544
13317I0939l0876j0756o999J6274m5881m2932L207l3099J2906M8137M2447O613
13305D9980L9985K9950j1751q6944r654m6667J8156J8859R285n695q910K1058
13293A7652P8160K8334j4521j211P0277R9728L4173J22J8397m1499q1374O408
13281B14646O1996j1889q2482o1154p9483P897k2908o970j8143k0210o695k1939
13269d7334l6904L6236M9396J2102R394o9509J3143J6062m9013K1530O2649l4497
$$ plain form
13353 -11737 -2596 -37404 -42455 -6514 87954 109133 156221 164193 125963 83966 98945 109575
13341 109575 129883 147591 141699 88914 15925 -16535 8134 4825 -39488 -33553 -47908 -55445
13329 -55445 -53382 -43824 -53898 -25061 -13001 -20070 9960 61912 72769 103392 80395 90939
13317 90939 60063 49307 42308 58582 12701 -30231 -27024 -60123 -47217 920 43367 49980
13305 49980 89965 119915 108164 21220 11566 -35101 -16945 1914 11199 5504 -3406 17652
13293 17652 95812 124146 109625 108414 178691 278419 312592 312714 331111 289612 208238 214646
13281 214646 276642 264753 182271 121117 41634 49531 26623 19653 1510 -18700 -25395 -47334
13269 -47334 -84238 -48002 1394 13496 22890 -46619 -33476 -17414 -66427 -44897 17752 -16745
13257a6745Q115M6342M6421M0439l3697m6172N4814k0476m6444m6801O3648J2865
13245F2309o9104n1485K4612j001J5227M1036K9458K2517n5869q98J8545O5786
13233A01133L4773q7751K7711j2287o6027j0874K7326K1484k0655K9430M1718
13222H5981n4666k783l3845k4015J5310j1507M0338N2467k2444K1268k2610l2586
13210A0908M262O7751J0256l8870M8032R69j2961K3847K9023K6886k5731m5284
13198I9088n2532L2059K2471k5230l9920j1566m9530J997N8768L7653Q071K9424
13186A10753R3661M6102k892k578k5854N2162j5686o8718j2775n1872k3729n886
13174I2688J1808K2415o8815K3021m669k601M7570m471k9106l0801L0745K8888
$$ plain form
13257 -16745 -8630 37712 84133 124572 90875 44703 99517 79041 32597 -14204 49444 62309
13245 62309 -6795 -58280 -33668 -34669 -19442 21594 51052 73569 17700 16802 35347 101133
13233 101133 135906 48155 75866 63579 -2448 -13322 14004 35488 14833 44263 85981
13222 85981 31315 28532 -5313 -29328 -14018 -25525 14813 67280 44836 66104 43494 10908
13210 10908 15170 82921 93177 54307 102339 103308 90347 114194 143217 170103 144372 99088
13198 99088 46556 78615 101086 75856 35936 24370 -25160 -23163 35605 73258 81329 110753
13186 110753 204414 250516 247624 245046 219192 271354 255668 186950 174175 122303 98574 92688
13174 92688 104496 126911 58096 81117 76448 73847 121417 116946 87840 57039 87784 116672
13162A16672j7699q7296n1562J2637L8928Q6780j8175j1601k1611q7905M86Q1467
13150D1121N4599M5881J3345l0986q959L0485p710M3003k8800J8078j299M0481
13138B09239j929K9420n1002p7557J8760J299n871L1049O2325J2246K7747M8864
13126C04590k8525k3304O388L3159j2382n6062q380K6635P86N0647M6203k7523
13114C12232r99L8332L3119M9478l9056l3664K5104J8038J4795J815J0775k0043
13102D09926j9264N427L3772K9453N5483J0145L4119N9177L7291K7429K5626j0192
13090F98392M7675J0542Q514Q4799J1932L794j3125P7400J00908Q2015P7590K0442
13078A210878Q0658J01643Q8735R6615J13999J16466J43183J56476J76172J76855
$$ plain form
13162 116672 98973 11677 -39885 -27248 11680 98460 80285 68684 47073 -40832 -40346 41121
13150 41121 95720 141601 154946 123960 115001 145486 137776 180779 151979 170057 168758 209239
13138 209239 207310 236730 185728 108171 126931 128230 122359 153408 215733 227979 255726 304590
13126 304590 276065 252761 259149 292308 279926 223864 215484 242119 242905 293552 339755 312232
13114 312232 311233 349565 382684 432162 393106 359442 384546 402584 417379 419194 429969 409926
13102 409926 390662 396089 429861 459314 514797 524942 559061 618238 655529 682958 708584 698392
13090 698392 746067 756609 765123 849922 861854 865648 852523 929923 1030831 1112846 1190436 1210878
13078 1210878 1291536 1393179 1481914 1578529 1692528 1808994 1952177 2108653 2284825 2461680
13068B461680J01553J49053K19693J91891K15204K42316L64133M21157M45446
13059D812126M58815M92396N35222N36546O35714Q08925J023917J264657J656702
13050A2225020K011793K272414K482146K605758K884614L654178M984070O813835
13042C9933828R187377J2860473J8655856K8190974M4519937O7824345Q3311359
13035C04484149P0898849M1072376K031828k1075367j0000147J5230227K1522463
13028D24164378L606523l3612525o9486824p8603116o7433874m7450078l0641217
13021A00543267k0138487j4013618j0305729q023173o319552n040489m166331
13014C2535888l534118l151937k880082k764948k494892k148292j819694j391009
$$ plain form
13068 2461680 2563233 2712286 2931979 3123870 3339074 3581390 3945523 4366680 4812126
13059 4812126 5270941 5763337 6298559 6835105 7470819 8279744 9303661 10568318 12225020
13050 12225020 14236813 16509227 18991373 21597131 24481745 28135923 33119993 39933828
13042 39933828 49121205 61981678 80637534 108828508 153348445 221172790 304484149
13035 304484149 375382998 416455374 418487202 397411835 387411688 402641915 424164378
13028 424164378 427770901 394158376 324671552 246068436 178634562 131184484 100543267
13021 100543267 80404780 66391162 56085433 48062260 41742708 36702219 32535888
13014 32535888 29001770 25849833 22969751 20204803 17709911 15561619 13741925 12350916
13006A2350916j190316j073137r24790p11384o19511n23141m19252l92974m32647
12997F063764l07051k25150k63242k46267k43664k60101k81523k78632j75934
12988C782200j43166q6380j66417j38052j31329j47705j46300j46010p0121n2892
12978B553828q7825p5869k0281k8171p0734j07757n4040j5951L0036L5335M2901
12967B201472p338n4120l6656k4948K7791M1077o5760j31822j41212j40176j52827
12956A515481n9395k5624l6412q6264q2690n3256q0458l1317k0123k3130j1793
12945A005019k8918O393L9184n986j10494m0581N0595J2797j8489m0137J0761
12934H80144N8182P328j6595m173n0240j2638L6811L5223J4428O079J217L7379
$$ plain form
13006 12350916 11160600 10087463 9162673 8451289 7831778 7308637 6889385 6496411 6063764
12997 6063764 5756713 5531563 5268321 5022054 4778390 4518289 4236766 3958134 3782200
12988 3782200 3639034 3552654 3386237 3248185 3116856 2969151 2822851 2676841 2606720 2553828
12978 2553828 2466003 2390134 2369853 2341682 2270948 2163191 2109151 2093200 2123236 2158571 2201472
12967 2201472 2194134 2140014 2103358 2078410 2106201 2147278 2081518 1949696 1808484 1668308 1515481
12956 1515481 1456086 1430462 1394050 1307786 1225096 1171840 1091382 1060065 1039942 1016812 1005019
12945 1005019 976101 982494 1021678 1015692 905198 864617 915212 928009 909520 869383 880144
12934 880144 938326 945654 929059 924886 874646 862008 898819 934042 948470 954549 955766 993145
12922I93145J8112l4688n933q1869L203m205p7984p6836N590o6839m7063o314
12910F18319K1436K6859J3826K7379m4615K7623K8559l5242p975n2241n7559p6983
12898D89386K9059j7110r5797j2496J6823Q7866N6422l1350N1463P957q0086j06672
12886C95465k8667j7762K542K3575k7809L5470K0533k9148n1355k8680L4702J9933
12874C48799l4486N1714K4937J06210J39271O8453R8213r58J3330O581r65k0984
12862H00115o9586p6478o1605m0124j12436o2601j2251q222j9118l7290k9072
12851B71332m5666J83J04221L8558p4189m7563M5745K9227m754J6804o2207p8139
12839A93552M1917P673k1033k586k4755j5705l5595r4203J671N4880O3001N4159
$$ plain form
12922 993145 1011257 976569 970636 888767 891970 887765 809781 732945 738535 671696 624633 618319
12910 618319 639755 666614 680440 707819 663204 690827 719386 684144 676169 623928 566369 489386
12898 489386 518445 501335 405538 393042 409865 497731 554153 522803 574266 582223 502137 395465
12886 395465 366798 349036 351578 375153 347344 382814 403347 374199 322844 294164 328866 348799
12874 348799 314313 366027 390964 497174 636445 704898 803111 802153 815483 822064 821099 800115
12862 800115 730529 654051 592446 552322 439886 377285 365034 356812 337694 300404 271332
12851 271332 225666 225849 330070 368628 294439 246876 292621 321848 317094 333898 271691 193552
12839 193552 235469 243142 222109 219523 194768 179063 143468 49265 50936 105816 168817 222976
12827B22976k0145M8928k6977j2802m7490k7285j2879R820N1213L6946P463k3160
12815B06608j3206J7002k2615M9156L7828J1200n915n4273n4667k9387J9661K3204
12803A84596J4606J9500R053k0519j5403n771J2908j8258J9043j5251k2583K1632
12791A83553O8736L3473N44q0728o2872m7551j8021M3928K735j2333k4855j4617
12779G1992N3412L9017J1509j0575J6434J7945K1063K0953m859K7810k6098K6408
12767B65011N0824j5415j0836o8898j6k5977n2966l9100J7475m587l6286p841
12755G1388M3683L3482K2553k1932l8706M7979P1804r832j0875R875k4719j694
12743A93006l8996k5655R135l5681j9612K326L8991L7775L5165O7557P0005N5373
$$ plain form
12827 222976 202831 251759 224782 211980 164490 137205 124326 134146 185359 222305 229768 206608
12815 206608 193402 210404 187789 236945 274773 285973 280058 225785 171118 141731 161392 184596
12803 184596 199202 218702 227755 207236 191833 186062 198970 180712 199755 184504 161921 183553
12791 183553 252289 285762 286306 205578 142706 95155 77134 121062 123797 111464 86609 71992
12779 71992 125404 164421 175930 165355 181789 199734 220797 241750 236891 264701 238603 265011
12767 265011 315835 300420 289584 220686 220670 194693 141727 102627 120102 115515 79229 71388
12755 71388 115071 148553 171106 149174 110468 158447 230251 220419 209544 219419 194700 193006
12743 193006 154010 128355 137490 101809 82197 84523 123514 161289 196454 264011 334016 389389
12731C89389l848Q268J5257P096o6194o3187J5110j0747q791r7539m1832j4304
12719A28678o5972m5613O5709K7810k2980Q6988M5130j5849M8532K163J0520l5246
12707B29870N679m6271j5422L919L7899j4625k5791l4328k1602m0765p026N4990
12695A26527O9779l3565k0974Q416R883l5990j739N484O6019L8289K7073N4200
12683C13402L2305j2277m3014o6018j4546L5589M947o0355k1822m7668q794L7521
12671A49270K5643k4507m760R916J3383k9791m7460n5484R7k80l824P6040M6252
12658A54495m5995j3432J47N673J9709k7430L4067L1125l5409l9404O917l5150
12646E5313N6560K283J3484L4447o9504N2294N7724k6440j7972R0166P9373r348
$$ plain form
12731 389389 385541 393809 409066 416162 349968 286781 301891 291144 282353 184814 142982 128678
12719 128678 62706 17093 82802 110612 87632 174620 219750 203901 252433 254596 265116 229870
12707 229870 235549 189278 173856 177775 215674 201049 175258 140930 119328 78563 71537 126527
12695 126527 196306 162741 141767 150183 160066 124076 122337 127821 193840 232129 259202 313402
12683 313402 345707 333430 290416 224398 209852 245441 250388 190033 168211 120543 111749 149270
12671 149270 174913 150406 145646 155562 168945 139154 91694 36210 36307 36027 32203 108243 154495
12658 154495 108500 95068 95215 100888 120597 93167 127234 158359 122950 83546 90463 55313
12646 55313 111873 114156 127640 162087 92583 144877 202601 176161 158189 248355 327728 318380
12634C18380j8084P2276L9092o4718k6812q2453k5769l5909l3397o495k4547O036
12622A17600O3985O615k0676M3617J0046q997j04884j470K7425N7613k734K8164
12610B16304m7040m4897K5709N937L4484J73377J22834N3659M5084J58603K79569
12599A023623M37797M03447K03604J0142Q006j8299K0878J32906P3845j02295
12589B193654k90649l97560l42458k93914j81481j23616p1786o4081p6705l2436
12579C18968m5281j4377k5636p5025J7949K0139j9797n1714K6945k0066j6258
12568A15847M3376j6855l4981j0769j4069Q810l0785j3453n595J4892k0716n791
12556B9911P1470k8155l4639o644Q2968M2342M0301k8165p0228j8100L8133j4918
$$ plain form
12634 318380 300296 372572 411664 346946 320134 237681 211912 176003 142606 136111 111564 117600
12622 117600 181585 188200 167524 211141 221187 212190 107306 105836 133261 190874 188140 216304
12610 216304 169264 124367 150076 156013 190497 363874 486708 540367 585451 744054 1023623
12599 1023623 1461420 1864867 2068471 2078613 2086619 2068320 2089198 2222104 2295949 2193654
12589 2193654 1903005 1505445 1162987 869073 687592 563976 492190 428109 351404 318968
12579 318968 273687 259310 233674 158649 176598 196737 176940 125226 152171 132105 115847
12568 115847 159223 142368 107387 96618 82549 91359 60574 47121 41526 56418 35702 29911
12556 29911 101381 73226 38587 31943 114911 157253 197554 169389 99161 81061 119194 104276
12544A04276J3541N8636J00331m9201n6762l2486n4928N44L3209j0085p286j1907
12532H7882r245L3586O835o7294R340O799l6657J9118L7667J7221L6323K7906
12520A69481K1924O712n4040l7741K9716k2206j7835J4801J6183k1468r0980K1008
12508C5555L8321N458m325O3767l6098n9618k041M6677J408j707m6242j4269K6158
12495E3044J7381l0917k8998J1366L5750J3399j2772n625l3644k8639j2777N1966
12483B9534L8289o3768l4195K9420K9851K4391k1232K1731Q9979m8859o8247J9919
12471D6813M27p0683K7630j2654J5305K8842L4133N6521M4110r801j569M0957
12459B00031j8112n4662j3277k3358k1920L3302p163l5944k4560n8514k2702k759
$$ plain form
12544 104276 117817 176453 276784 227583 170821 138335 83407 83951 117160 107075 99789 87882
12532 87882 78637 112223 119058 51764 61104 67903 31246 50364 88031 105252 141575 169481
12520 169481 191405 198117 144077 106336 136052 113846 96011 110812 126995 105527 14547 35555
12508 35555 73876 79334 75009 138776 102678 43060 41019 87696 89104 87397 41155 26886 53044
12495 53044 70425 39508 10510 21876 57626 71025 58253 52628 18984 -9655 -22432 29534
12483 29534 67823 4055 -30140 -720 29131 53522 32290 54021 144000 95141 26894 46813
12471 46813 47240 -23443 4187 -8467 6838 35680 69813 126334 170444 160643 159074 200031
12459 200031 181919 127257 113980 90622 68702 102004 94841 58897 34337 -24177 -46879 -49638
12447d9638L2075L8053j1443L77O663n5744m865k48M2582J1456J7376L1062l1913
12434B5793R225k9285k1895j3240l9071M6575Q6699L6626M9210j7469o7207k8161
12422C7800k0845J0036M2779k1351m2790m1872m627O848L0626J9386L881R471
12410B9342K0529L3820M0094K9854l4563n6307m0711m7837k3185J5424K8439K9182
12398B4081L9739K1446m1650J1767P2311o2194q319k7747m4045n062N3042n540
12386B7829l5538j7955N2278L8526L438n6041J1762m217j3469p4594n919M5373
12374b8527q123n0106k8569Q1130L8588p582j414o7833P132N4229L2873J7127
12362C8925k1366j453J3200n399r484K2110L7649R873J2227L670l6995j687J4567
$$ plain form
12447 -49638 -17563 20490 9047 9424 16087 -39657 -44522 -44770 -2188 9268 26644 57706 25793
12434 25793 35018 5733 -16162 -29402 -68473 -21898 64801 101427 150637 133168 65961 37800
12422 37800 16955 26991 69770 48419 5629 -36243 -40870 -34022 -3396 15990 19871 29342
12410 29342 49871 83691 123785 153639 119076 62769 22058 -25779 -48964 -33540 -5101 24081
12398 24081 63820 85266 43616 55383 127694 65500 57181 29434 -14611 -19673 33369 27829
12386 27829 -7709 -25664 26614 65140 68578 12537 24299 20082 6613 -67981 -73900 -28527
12374 -28527 -36650 -86756 -115325 -34195 4393 -3189 -4603 -72436 -65304 -11075 21798 38925
12362 38925 17559 16106 29306 23907 14423 36533 74182 84055 96282 99952 62957 61270 75837
12349G5837L559k4577j9660J1471j2186l6658l1848k9307J23081R0149k7742m9678
12337G2441q4824k5097O2056K0177n1572L6255M0671K4675l239o940k6661r263
12325D8679J0693K4116l3166l2688n1781k0517K4536l3575m819k3308N1209M9278
12313H657M8060K9898m1712L004m0120j3473j3585p164L1918j0862J4852k1014
12301a1541L5741L246o8030N5380M8195k0764p0748k4246k328J2886k707K1524
12289b3392O3289L3829l1738n6612K622L3695Q142n2108J0195K6099P693L045
12277B4759l4831L3708n7466n3552q171O7637J1089o2730k7471k1475K769N833
12265a19901K6762K3003J7540m6872m8886k5409O3651O1622K825j810K1807K8269
$$ plain form
12349 75837 79396 54819 35159 46630 34444 -2214 -34062 -63369 59712 149861 122119 72441
12337 72441 -12383 -37480 24576 44753 -6819 29436 70107 94782 91543 84603 57942 48679
12325 48679 59372 83488 50322 17634 -34147 -54664 -30128 -63703 -68522 -91830 -40621 8657
12313 8657 56717 86615 44903 47907 7787 -5686 -19271 -26435 5483 -5379 9473 -11541
12301 -11541 24200 27446 -40584 14796 62991 42227 -28521 -52767 -55095 -42209 -44916 -23392
12289 -23392 39897 73726 41988 -14624 -12002 21693 29835 -22273 -12078 14021 21714 24759
12277 24759 -10072 23636 -33830 -87382 -95553 -27916 -16827 -79557 -107028 -128503 -125734 -119901
12265 -119901 -93139 -70136 -52596 -99468 -148354 -173763 -110112 -48490 -45665 -47475 -25668 2601
12253B601l4207m2980K8274M0465L629j2744j6446N2028L2401l4124Q073L2504
12241E9474k9993N458K9333n992L8201M4515q348n1679k8226n9605n7532K4826
12229c9568K0137Q105q097K5464J1497J250n2228j8585Q122M3021J1955k48j483
12216I342m3222O426K7643O8291Q092j2582n3841K9223m75K0003m459O33O943
12203F2017m6228o0372l9890K0022P3526J6541o7790P112L3736j1086L6069l8099
12191a4442k4838Q53J7126J8752m9201M775r327n9487P4018J5799O379J9030o5574
12178f6137k060N0201Q820o66J7690L7976M584l1035k9186K1427o1117n0884k7697
12165a28084m752L2000K9865P6431M0004Q986K535j2398n2709n1399P651J6097
$$ plain form
12253 2601 -31606 -74586 -46312 -5847 -2218 -14962 -31408 20620 53021 18897 26970 59474
12241 59474 29481 34939 64272 58280 96481 140996 132648 80969 52743 -6862 -64394 -39568
12229 -39568 -19431 -11326 -19423 6041 17538 18788 -33440 -52025 -43903 -882 11073 10825 9342
12216 9342 -33880 -27454 189 68480 76572 63990 10149 39372 38897 58900 54441 55074 62017
12203 62017 15789 -44583 -84473 -64451 9075 25616 -42174 -35062 -1326 -12412 23657 -14442
12191 -14442 -39280 -38427 -21301 -2549 -51750 -46975 -56302 -115789 -41771 -25972 -19593 -563 -66137
12178 -66137 -68197 -17996 -9176 -9842 7848 45824 50408 19373 -9813 11614 -49503 -100387 -128084
12165 -128084 -132836 -100836 -70971 5460 45464 54450 56985 44587 -8122 -59521 -51870 -35773
12153c5773o781n8670M8305R1151L1771J7175l5132j0251l2934R793m3227j2209
12141c6782J3290o132n517m271J0000k1360K9831k31l8466M5752M2223k3767k2835
12128a8265K3171j59K8651K7110l0636n3881j8423J8591l6688l7782J3667N6079
12116b8565j0648l503j9014l1078N1907M5691J5570m8263r803J1899N9198k0082
12104A3309l4505N8937N6905j6514k3424k1812K4727J3058l6417k1177J7656m953
12092B5790j4955l8217j4552O3408R293K8797N4035L2491o1072n9361q207m370
12080A3080p7016o6376Q110N7320N8021k7458j2077M3292J0134k5667m0492J1430
12068d7699K2332N54q729n2659q908J5410p33N633O6958L8783J09k7090k8003
$$ plain form
12153 -35773 -42554 -101224 -52919 38232 70003 87178 52046 41795 8861 18654 -24573 -36782
12141 -36782 -23492 -29624 -35141 -39412 -29412 -50772 -20941 -21172 -59638 -13886 28337 4570 -18265
12128 -18265 4906 4747 33398 60508 29872 -24009 -42432 -23841 -60529 -98311 -84644 -28565
12116 -28565 -39213 -42716 -61730 -92808 -40901 4790 20360 -27903 -37706 -25807 33391 13309
12104 13309 -21196 37741 94646 78132 54708 32896 57623 70681 34264 13087 30743 25790
12092 25790 10835 -27382 -41934 21474 30767 59564 113599 146090 85018 25657 17450 13080
12080 13080 -63936 -130312 -122202 -64882 -6861 -34319 -46396 -3104 7030 -18637 -59129 -47699
12068 -47699 -25367 -24813 -33542 -86201 -95109 -79699 -80432 -74799 -7841 30942 31051 3961 -24042
12055b4042N8743N5737J3625m0092J1167K634m3767m6865n8O5534l8974j1115
12043B527J2438j4979l0754P588N7246K8394l2572k2453m052p212n4820k7974
12031h6623J8128J3291j6422k622k6974K7171R452J4923K2136N415P7909L0540
12019H6324l8894r5614n2074M9433M2315o8693k6953K7315J0132M5466L1243L9602
12007D9602j2243L046k182m5537L078j7883r8496q666O2268O3121L2616K1185
11995D9909k5098k3692j564P473J2627p965l8099M6590J0885R480l749M246n9519
11982a8476L8196L1023j2478k4908k5294N8701K668m3699o308l560k5846j2551
11970d2532O6370Q6132n536l4874m745K2368L3590l2379j7097l9358q4602k6220
$$ plain form
12055 -24042 34701 90438 104063 63971 75138 77772 34005 -12860 -12918 52616 13642 2527
12043 2527 14965 -14 -30768 -23180 34066 62460 29888 7435 3383 -3829 -58649 -86623
12031 -86623 -68495 -55204 -71626 -74248 -101222 -74051 -64599 -49676 -27540 -22125 55784 86324
12019 86324 47430 -48184 -100258 -50825 -8510 -77203 -104156 -76841 -66709 -21243 10000 49602
12007 49602 37359 40405 38223 -7314 -4236 -22119 -120615 -129281 -67013 -3892 28724 49909
11995 49909 24811 1119 -445 7028 19655 11690 -26409 20181 31066 40546 36797 41043 -18476
11982 -18476 19720 50743 38265 13357 -11937 46764 49432 5733 -575 -4135 -29981 -42532
11970 -42532 23838 109970 104434 69560 64815 87183 120773 88394 71297 31939 -52663 -78883
11958g8883M3071O3396j5511l0507j4103k7395Q153P621J352o4039N5914J3484
11946c7447M72l4605l3777P1236N4719k3082K0988p142j4024N4231L9877J1461
11934A02907J929k086j3394j2661P997r585p8019k6791j1748m1995K0948K2504
11922c9994J117K423j6876j5192J6165P6060M9098J4071o2219r273o937l6212
11910b7769J5840R038j3093m3368N2811L5030O971R54n8245J4713J5563P232K6844
11897D2521j09502k1571O1265M227K7694r020n7138j2811O6889M6410j7280m1195
11885a9511K4474Q233o0488l8440M0553N5322J2492j5633k1137j8082R351L2063
11873I197L650k1347k7740k0753M4294Q857J0114o893m4463M3652Q47J2917L241
$$ plain form
11958 -78883 -35812 27584 12073 -18434 -32537 -59932 -51779 -44158 -42806 -106845 -50931 -37447
11946 -37447 -36975 -71580 -105357 -34121 20598 -2484 18504 11362 -2662 51569 91446 102907
11934 102907 104836 102750 89356 76695 84692 75107 -2912 -29703 -41451 -83446 -62498 -39994
11922 -39994 -38877 -36454 -53330 -68522 -52357 23703 72801 86872 24653 15380 8443 -27769
11910 -27769 -11929 -2891 -15984 -59352 -6541 28489 35460 36414 -21831 -7118 8445 15677 42521
11897 42521 -66981 -88552 -27287 -23060 4634 -4386 -61524 -74335 -7446 38964 21684 -19511
11885 -19511 4963 13196 -47292 -85732 -45179 10143 22635 7002 -14135 -32217 -22866 9197
11873 9197 12847 -8500 -36240 -56993 -12699 -3842 6272 -621 -45084 -1432 -585 12332 15573
11860A5573j5853L2788J2213p1792l9125J424N2340L5831J724o248j5317J5934
11848A9492N267n9268l1341J9460Q765m2241L161R30K9789j578K3592L4245J3844
11835B4117k6796o923L5552K3977n957j8341J0727L0473j4269k318k8033l3743
11823a1534k6454k9172Q612r726J3704M2287J10407j2068p4100j4401J2614k9357
11811a9188k9288M162j7457K1723J0724k1940m5421J5916O6347q872K7552M72
11799D730K2876j8800J3446k8449p2474o2966l6587Q918Q9565J25415K2090n0506
11787A7258o3192l00O017j5357L87o2695j6889K4407K0898O8743O5536n4484n092
11774a4763J5240l0045R655j5249L8584L9405J6562J2340p845j1212k2603j753
$$ plain form
11860 15573 -280 32508 44721 -27071 -66196 -64772 -12432 23399 25123 18875 3558 19492
11848 19492 24759 -34509 -65850 -46390 -37625 -79866 -76705 -75775 -45986 -47564 -23972 10273 24117
11835 24117 -2679 -9602 25950 49927 43970 25629 36356 66829 52560 50242 22209 -11534
11823 -11534 -37988 -67160 -58548 -68274 -54570 -12283 98124 86056 11956 -2445 10169 -19188
11811 -19188 -48476 -44314 -61771 -40048 -29324 -51264 -96685 -80769 -14422 -23294 4258 4730
11799 4730 27606 8806 22252 -6197 -78671 -141637 -178224 -169306 -79741 45674 67764 17258
11787 17258 -45934 -46234 -40217 -55574 -55187 -117882 -134771 -110364 -89466 -20723 44813 -9671 -14763
11774 -14763 477 -29568 -19913 -35162 3422 42827 59389 71729 63884 52672 30069 28316
11762B8316j6111m6175l6229L6880L1666l3954R266J1869j5240j3867k9739M6538
11750b6780N4022K1001l2848j9836J5798K7469K7915k3246n7147N475O1532j8167
11738C5188n9739k338l1056O3M1819N1262J5323K2057J5516n4050o6814l1853
11726f4622J7754N7772L1018L5765J1321R519m6596j7986L3053n2531m634R2174
11714A02007O2037m4144o0992j8285k3578L489N0400j0933k8388j5190k8863k1849
11702c4289k0449K3225J3615L4004m5432j4191O452j1872l0373L4842R342K843
11690c2283j4000K4033j9025k9744m5053k8135L4226l2690M7023N1649m6175J1836
11678g8338K1260P4242K9444K938j0914k5430j0143O599O26J1184J4592N2822
$$ plain form
11762 28316 12205 -33970 -70199 -33319 -1653 -35607 -26341 -14472 -29712 -43579 -73318 -26780
11750 -26780 27242 48243 15395 -4441 11357 38826 66741 43495 -13652 -8177 53355 35188
11738 35188 -24551 -26889 -57945 -57882 -16063 35199 50522 72579 88095 34045 -32769 -64622
11726 -64622 -46868 10904 41922 77687 89008 98527 51931 33945 66998 14467 9833 102007
11714 102007 164044 119900 58908 40623 17045 20534 70934 60001 31613 16423 -12440 -34289
11702 -34289 -54738 -31513 -17898 16106 -29326 -43517 -37065 -48937 -79310 -44468 -35126 -32283
11690 -32283 -46283 -22250 -41275 -71019 -116072 -144207 -109981 -142671 -95648 -43999 -90174 -78338
11678 -78338 -57078 17164 46608 49546 38632 13202 3059 9658 10284 21468 36060 88882
11666H8882L4211j3800j6251k3605k3453J614M2905j5883j5998k6907k4233l8452
11654c0970J809L797n9518j7622Q808M5424M1279m041j7616L462K5176K5324l2400
11641g088J1746M6542K8816n4163k1714k1321p6852J5474L6570J3075j2283k1850
11629f3048l3454m664O7768j1706p0167l0443P7645M9655J7087O3629J5393p0883
11617F812n8027j5496N161j2777k1104M0078O2282N7047l3117n0204N6879L1612
11605F9146k387L4598l0602J5437J571j9129j3565n3539m4581o377M6987L5861
11593C3420L9414K613r288k639r118k9929j5008K143K1378o4763k2921K0839k7814
11580f1673Q669k3151k2072j393J3578J1547k6133k364N2168L3116p666J3357
$$ plain form
11666 88882 123093 109293 93042 69437 45984 47598 90503 74620 58622 31715 7482 -30970
11654 -30970 -29161 -25364 -84882 -102504 -93696 -48272 -6993 -11034 -28650 -25188 -12 25312 -7088
11641 -7088 4658 51200 80016 25853 4139 -17182 -94034 -78560 -41990 -28915 -41198 -63048
11629 -63048 -96502 -101166 -33398 -45104 -115271 -145714 -68069 -18414 -1327 62302 77695 6812
11617 6812 -51215 -66711 -61550 -74327 -95431 -55353 6929 63976 30859 -19345 37534 69146
11605 69146 66759 101357 70755 86192 87763 68634 55069 1530 -43051 -49428 -2441 33420
11593 33420 72834 75447 66159 63520 54402 24473 9465 11608 32986 -31777 -54698 -33859 -61673
11580 -61673 -53004 -76155 -98227 -99620 -86042 -74495 -100628 -102992 -50824 -17708 -25374 -12017
11568a2017K8831j9760J5388M8014k2219k7359j5358L3023N5432K1730j2549o2300
11556C0856r5705J5963R9279j12l4521j4257m7356J0403N8136K60n2384O4127
11544C4689O6314o5529k9001L8328o86K2882K5569J7922k9039q5615K3544J2787
11532C2165M586p70K7970P89k3026M3591k5215J5418O2548J8458r9668k5528r073
11519B2245k7585j4729p9442m3954Q035r582k0272M639J7133k6450O8313N0587
11507e1062m3963K1934K1629l9059r626J5784K6391j7579k7384j1997N5458M0894
11495a8580j7811o877L3221J3516k6272K701o19J2174k4l7856j8469k3551l1660
11482a20107k3433J4729M0481l9747q839M457J1752P3282k7683n377J3485N1656
$$ plain form
11568 -12017 16814 -2946 12442 60456 38237 10878 -4480 28543 83975 105705 93156 30856
11556 30856 -64849 -48886 50393 50281 15760 1503 -45853 -35450 22686 22946 -29438 34689
11544 34689 101003 35474 6473 44801 44115 66997 92566 110488 81449 -4166 19378 32165
11532 32165 36751 35981 63951 64740 41714 85305 60090 75508 138056 156514 56846 31318 22245
11519 22245 -5340 -20069 -99511 -143465 -135430 -145012 -165284 -160645 -143512 -169962 -101649 -51062
11507 -51062 -95025 -73091 -51462 -90521 -100147 -84363 -57972 -75551 -102935 -114932 -59474 -18580
11495 -18580 -36391 -43268 -10047 3469 -22803 -20102 -20721 -8547 -8571 -46427 -64896 -88447 -120107
11482 -120107 -143540 -128811 -88330 -128077 -136916 -132459 -120707 -47425 -75108 -80485 -67000 -15344
11470a5344M2694p7457m0399n556J08N6658J2209J3667l8163j6713K7639l1058
11458g1715l8336L935o271M6919L4067N3206Q267l2502o29j0544L2178M5219N628
11445F9422l4266n1504p0407M2261J9209m8279j6933L1461O5646L3304Q372j6084
11433C2202J464J1132o1833q133M5171k16k6446M3781O171N0490j8412k6916k598
11420D5857j1366K38K3704k4814n5814j6183n4277O042K4421L1593j9076J1525
11408c8150M108l1816L2128J8392J5655J4571L4154n325j04828L1963Q5348r598
11396D6602n5021j2080K0777K0098o0314n8968J4594j7869k3572Q8242N8673k1038
11384A24n9484r290K0858O8819L4707k7585l898n589k7283l5640l2132m1501M1207
$$ plain form
11470 -15344 27350 -50107 -90506 -96062 -95954 -39296 -27087 -13420 -51583 -68296 -40657 -71715
11458 -71715 -110051 -106116 -112387 -65468 -31401 21805 30072 -2430 -3059 -13603 18575 63794 69422
11445 69422 35156 -16348 -86755 -44494 -25285 -73564 -90497 -59036 6610 39914 48286 32202
11433 32202 33666 44798 -17035 -25168 20003 19787 -6659 37122 43293 93783 75371 48455 45857
11420 45857 34491 34729 58433 33619 -22195 -38378 -92655 -86613 -62192 -30599 -49675 -38150
11408 -38150 -34042 -65858 -33730 -15338 317 14888 49042 43717 -61111 -29148 56200 46602
11396 46602 -8419 -20499 278 20376 -39938 -98906 -84312 -102181 -125753 -37511 21162 124
11384 124 -59360 -68650 -47792 21027 55734 28149 24251 18662 -8621 -44261 -76393 -117894 -76687
11371g6687L6345K839j1697K5288K4376l807p7571K3265K6189L6805j4599p0241
11359g9495P9666L5364o774J7256j3564l9952k520L7886L7109l8027R500J7535
11347E3984m3415j4207j9558J4423K173k4352L1902L7405R409j5500j6056Q126
11335B4334j5796j3056l1056L6509R8221l1079p714O611J2796j0679r8908k6883
11323e6700J5639o141L1413l2311j5289K4990K3118K3243M3905J1108J9570n6906
11311B5639m2555N4309p9612o4830P482O5114j2317o2892m434N8911K4726L459
11299b7000M4401K8258K4366m099m6386p1696j13256O9783Q2498O759j526l9160
11287d7058n0756j6540k1562j1133j1414R342L0295O4762J2600p5011o3960L7411
$$ plain form
11371 -76687 -40342 -37503 -49200 -23912 464 -3343 -80914 -57649 -31460 5345 -9254 -79495
11359 -79495 171 35535 28761 46017 32453 -7499 -10019 27867 64976 26949 36449 53984
11347 53984 10569 -3638 -23196 -8773 -6600 -30952 950 38355 47764 32264 16208 24334
11335 24334 8538 -4518 -35574 935 99156 68077 60363 66974 79770 69091 -29817 -56700
11323 -56700 -41061 -47202 -15789 -48100 -63389 -38399 -15281 7962 51867 62975 82545 25639
11311 25639 -16916 37393 -42219 -107049 -99567 -34453 -46770 -109662 -114096 -55185 -30459 -27000
11299 -27000 17401 45659 70025 65926 19540 -52156 -165412 -95629 -13131 -6372 -7898 -47058
11287 -47058 -97814 -114354 -135916 -147049 -158463 -149121 -118826 -54064 -41464 -116475 -180435 -143024
11275a43024J741N3756J08851P8955L5475K5690n314j01261J6213q230k5341n5341
11263a7830k3647L2581k9809n7375R053L4190M9627J3201k8627P099k398n3320
11251f7255J1640L6469Q347r144J2190J4825M0405N40j7088r8393k5027N6953
11239c5538J4475r046J7070k322J3634J6363p365N1138K0661l0183L0977n3036
11227B6828j8046j4693m4625j7543o418N8159P4984k5411q9801K2135O3873L2941
11215F2383J5764l0894l4836M879l3397j1332k4840p978m3692l1218P344m448
11203a32265M7625L9201o2015K1142M9154K1464M8015m902o780m0134m9392j1339
11191h0226J3691M3634R7085j1882j3316K9986n9105n9207J0672N4838L0116O9681
$$ plain form
11275 -143024 -141283 -87527 21324 100279 135754 161444 156130 54869 71082 62852 37511 -17830
11263 -17830 -41477 -8896 -38705 -96080 -87027 -52837 -3210 9991 -18636 -11537 -13935 -67255
11251 -67255 -55615 -19146 -10799 -19943 -7753 7072 47477 48017 30929 -67464 -92491 -35538
11239 -35538 -21063 -30109 -13039 -15361 -1727 14636 7271 58409 79070 48887 79864 26828
11227 26828 8782 -5911 -50536 -68079 -74497 -16338 58646 33235 -56566 -34431 29442 62383
11215 62383 78147 47253 12417 17296 -16101 -27433 -52273 -60251 -103943 -135161 -127817 -132265
11203 -132265 -84640 -45439 -107454 -86312 -37158 -15694 32321 27419 20639 -19495 -68887 -80226
11191 -80226 -66535 -22901 74184 62302 48986 78972 19867 -39340 -28668 26170 56286 125967
11179A25967J219p6419j4709k8856l4934p099K1288M1008m527O8799m5893k1736
11167B4108l64o6652n6847K6148P3647l2520N6349J4189k9093n981l7341N682
11155b8675L8998P7370M4609n5155l1241k6184o722L2467J5630n8718L312q0676
11143g4985n6611L019n629l605M4922Q6950J7959j492n0439L0542j9301J8679
11131i991j02275j3533R0232j1155m884K9959M0744P9282j0496n4487m6933m8689
11119f2226L4652L9259L0456L0176L5069m9897q8369q1775K3905M557M0866N8730
11107A5403L2752l9981J4412J5648J507l5480k0416J7305K815L1295j7765n0355
11095c2860k2356l7970m5407O273q553K2204N3160N5899M9983J5348n1446n5337
$$ plain form
11179 125967 127186 50767 36058 7202 -27732 -34831 -13543 27465 22938 91737 45844 24108
11167 24108 23744 -42908 -99755 -73607 40 -32480 23869 38058 8965 2984 -34357 -28675
11155 -28675 10323 87693 132302 77147 45906 19722 13000 45467 61097 2379 5691 -74985
11143 -74985 -131596 -128577 -134206 -137811 -92889 -5939 12020 10528 -39911 -9369 -28670 -9991
11131 -9991 -112266 -125799 -35567 -46722 -51606 -21647 19097 98379 87883 33396 -13537 -62226
11119 -62226 -27574 11685 42141 72317 107386 57489 -30880 -112655 -88750 -84193 -43327 15403
11107 15403 48155 8174 22586 38234 39741 4261 -16155 1150 3965 35260 17495 -32860
11095 -32860 -55216 -93186 -138593 -132320 -140873 -118669 -65509 -9610 40373 55721 4275 -51062
11083e1062L8740L751N068l5683J323L3187K6080m5506K9942M2346L1243m602
11071G4827n1657k6252N8405n032p7189j9390R9652M4870r966p3327m2409j3800
11059d1268M3158R016r939n5280j3877P0152K7952l0283k3776p596n5902k133
11047h9776k2458O0807M9610p650r930O702K752P257L9640r533l955o0876j4200
11034e1610K2706k4963l512M564O3151N7862j2966o5190k1308j9685l925J8366
11022c6510j4101n8177O4249L5308Q5223n380o0333r84J5000n6728O23L1556l0609
11009c0863l1757o853m688J8280K1021L8839m1229L409N7873p128j8704n4133
10997e5933J5369K1131J0401n7225k6421L556J15201Q622m9002k3637O4011O9974
$$ plain form
11083 -51062 -12322 -8571 -3503 -39186 -37863 -4676 21404 -24102 5840 48186 79429 74827
11071 74827 23170 -3082 55323 50291 -26898 -46288 53364 98234 88268 14941 -27468 -41268
11059 -41268 1890 10906 967 -54313 -68190 1962 29914 -369 -24145 -31741 -87643 -89776
11047 -89776 -112234 -51427 -1817 -9467 -19397 -12695 -9943 -2686 36954 27421 23466 -37410 -51610
11034 -51610 -28904 -53867 -57379 -52815 10336 68198 55232 -9958 -31266 -50951 -54876 -36510
11022 -36510 -50611 -108788 -44539 -9231 75992 70612 10279 9295 24295 -32433 -31810 -254 -30863
11009 -30863 -62620 -69473 -74161 -55881 -34860 3979 -37250 -33841 24032 16904 -1800 -55933
10997 -55933 -40564 -19433 -9032 -66257 -92678 -89122 26079 34701 -14301 -37938 26073 96047
10985I6047o5072m8063m4039j2406N2512O1809m0311n3985l992M4302K1344n2482
10973d4336O641J8665k8173L4652k2283k5273N4454N4005n7464o5652L3619N3574
10961A2429n4555N2231O1065k9248k9271L9022l3441m3691K0987k5881K9163M0573
10949C9383J2889j5045m1956K069K230j79k5973m5173R385k9991K0430M0775J4552
10936a6604M0966n6923n4628J4143L9493n067P941J3585j5999l4153N1733K1463
10924E950O193l9712k6988J0617K1097K6192j8753m6263J0175j9274k6298M0537
10912e6527J5354L2194k1032k7964r103M5128l6734m0895N643j4692r911L0946
10900h7593J5215P693Q897L1587K7823K0865K0209P938l2651o854L743J8424L5184
$$ plain form
10985 96047 30975 -17088 -61127 -73533 -21021 40788 477 -53508 -57500 -13198 8146 -44336
10973 -44336 -37695 -19030 -47203 -12551 -34834 -60107 -5653 48352 -9112 -74764 -41145 12429
10961 12429 -42126 10105 71170 41922 12651 51673 18232 -25459 -4472 -30353 -1190 39383
10949 39383 52272 37227 -4729 -2660 -430 -609 -26582 -71755 -62370 -92361 -71931 -31156 -16604
10936 -16604 24362 -32561 -87189 -73046 -33553 -38620 -30679 -17094 -33093 -67246 -15513 5950
10924 5950 12143 -27569 -54557 -43940 -22843 3349 -15404 -61667 -51492 -70766 -97064 -56527
10912 -56527 -41173 -8979 -30011 -57975 -67078 -21950 -58684 -99579 -93936 -108628 -118539 -87593
10900 -87593 -72378 -64685 -55788 -24201 3622 24487 44696 52634 19983 13129 16872 35296 70480
10887G0480K8883k2719m8096J9919j9632n9215m1958j6896K4365Q5423K8144m9786
10875a088l4493K1059L7733j8161k2483L2721L5015J6042o1760M9042m3632q8262
10863g8267j6267L8419N7198M3714M359o8284k6670K1104L3302K7705p592l2086
10851c365n62L782J0020o57k1387k7646J1324O3546J9772p9309j0491J9895J979
10838a3099L1190J2160p1293l7975K3036O3748K1187Q643K0089l4656r101N652
10826A9581j4580j6093n3162J3616P0877m0978o0051j5782O1741K7033o5974j1461
10814h5233O7174L8100p6056m9594R7305L0118q304n1981J9325j9748L742L8040
10802B888M5201J7002k9079n4107R366N9920J4802K456m2286q7916n7036J0063
$$ plain form
10887 70480 99363 76644 28548 48467 28835 -30380 -72338 -89234 -64869 20554 48698 -1088
10875 -1088 -35581 -14522 23211 5050 -17433 15288 50303 66345 4585 53627 9995 -78267
10863 -78267 -94534 -56115 1083 44797 49156 -19128 -45798 -24694 8608 36313 28721 -3365
10851 -3365 -3927 -145 9875 9218 -12169 -39815 -28491 35055 54827 -24482 -34973 -15078 -13099
10838 -13099 18091 30251 -41042 -79017 -55981 7767 28954 37597 57686 23030 13929 19581
10826 19581 5001 -11092 -64254 -50638 20239 -20739 -80790 -96572 -34831 -7798 -73772 -85233
10814 -85233 -18059 20041 -56015 -105609 -8304 21814 13510 -38471 -19146 -38894 -35152 2888
10802 2888 48089 65091 36012 -18095 -8729 51191 65993 68449 26163 -61753 -118789 -108726
10790a08726K5476L0294L2079K3875l9972O3274R0218k4350j7069M442j6970m6792
10778A5779K9099O2545l7821L871j4980j55k0466K8068l1395l0962K7803o1106
10766b9720k6604P0082J093M16p46K6488k1183M3169J6073j5275K1419l8746k9162
10753A7304J3924J6360l1957Q449j4922o3850M0377M9887q0211l2367K9412K8880
10741a8714L7107l917L2897l9213n0158m8804K4436L6356o868p6374K5279P2713
10729a5260j2729j9378J775j4680J6433k2562N879L2829j5635L6355Q0585o784
10717F6828m4971J0067M9356o5577j8633K5427Q0425P8415k8490j1780m9799j24888
10705c3620J4133R649K4496L4019j4383l8541j6427N8380j7220l6461j1489L6323
$$ plain form
10790 -108726 -83250 -52956 -20877 2998 -36974 26300 116518 92168 75099 79541 62571 15779
10778 15779 44878 107423 69602 73473 58493 58338 37872 65940 34545 3583 31386 -29720
10766 -29720 -56324 13758 14851 15267 14521 41009 19826 62995 79068 63793 85212 46466 17304
10753 17304 31228 47588 15631 24080 9158 -54692 -14315 35572 -44639 -77006 -47594 -18714
10741 -18714 18393 14476 47373 8160 -41998 -90802 -66366 -30010 -36878 -113252 -87973 -15260
10729 -15260 -27989 -47367 -45592 -60272 -43839 -66401 -60522 -27693 -43328 -6973 73612 66828
10717 66828 21857 31924 81280 15703 -2930 22497 102922 181337 152847 141067 91268 -33620
10705 -33620 -19487 -9838 14658 48677 34294 -4247 -20674 37706 20486 -15975 -27464 8859
10693H859L003k2906K2477Q8520r191J9481j5177Q716l767M6245j8109j39065
10681a0914j1613k4828k714k9021K113R4960M7374Q458J693p5651n165k3345n097
10668c3750l1546k6031K2725J15440m2724n5016J5509J5917O356j8483J129j4454
10656d4928L8935l137K3395Q1210N6230k04l5219j0816l6009l6627O768K1241
10644F0839k1300n4789K410Q576l107K4569O7251K5614p3000l4571P4627r862
10632F7257n9793l540k3330j0673J3884J724N6990j691m919m6865O739M2833K3566
10619F2182M2450K9606k9385l8972l4870L5285L9737J2689k1356n3931k3787O8264
10607H7912J507l406o5177m6830P165O1503J02992N5173m1957J5670L1244k988
$$ plain form
10693 8859 11862 -11044 11433 99953 90762 110243 95066 103782 100015 146260 128151 -10914
10681 -10914 -22527 -47355 -50069 -79090 -76977 17983 65357 73815 75508 -143 -5308 -28653 -33750
10668 -33750 -65296 -91327 -68602 46838 4114 -50902 -35393 -19476 -13120 -31603 -30474 -44928
10656 -44928 -5993 -9130 14265 95475 151705 151501 116282 105466 69457 32830 39598 60839
10644 60839 39539 -15250 -12840 -4264 -7371 17198 84449 110063 37063 2492 77119 67257
10632 67257 7464 3924 -19406 -30079 -16195 -14471 42519 40828 35909 -10956 -4217 38616 62182
10619 62182 104632 134238 104853 65881 31011 66296 106033 118722 97366 43435 19648 87912
10607 87912 89419 86013 20836 -25994 -18829 42674 145666 200839 158882 174552 205796 202808
10595B02808k6649j0751N0433O0769K7762q698p0582p3737K518p4763q1322k7937
10583c0149L7593Q2813O6499L5004n7766p7268r2060M3857K3432m0608n1922l6241
10571i6816N8377R0012J6896m1947J2735O5008r079r6851k9575K1789M3230M3989
10559G7768J06191J1875K061L9054L3207J09723K50264L35070K67739n2096j99902
10548I80954k22429k44104j64989o4118o0907p0346j4995k3795m9264l184k4086
10537C8737J1541K3740R9195J0197m9838n7893m2855l4405k6819J0241l7799K4197
10525c1761l9653m2038N7359o743L6460O9439J2258K8415K1639o229m733n4917
10513C9496o4969o3311l000J6713L3979N1255N246m2791P1661P2977K7797q6094
$$ plain form
10595 202808 176159 165408 215841 276610 304372 295674 225092 151355 153873 79110 -2212 -30149
10583 -30149 7444 90257 156756 191760 133994 56726 -35334 8523 31955 -8653 -60575 -96816
10571 -96816 -38439 51573 68469 26522 39257 104265 95186 -1665 -31240 -9451 33779 77768
10559 77768 183959 195834 197895 236949 270156 379879 630143 965213 1232952 1180856 980954
10548 980954 758525 514421 349432 285314 224407 154061 139066 115271 66007 62823 38737
10537 38737 50278 74018 173213 183410 133572 75679 32824 -1581 -28400 -18159 -55958 -31761
10525 -31761 -71414 -113452 -56093 -62836 -26376 43063 55321 83736 105375 99146 94413 39496
10513 39496 -25473 -88784 -91784 -75071 -41092 10163 15409 -27382 44279 117256 145053 58959
10501E8959m2186K8458J6154q019l0577j8746q158L3363P4592m8771n4088j1926
10489a0945J9270O6273N5111j7257n8350K7197m4322n9363j8544O6691O0332M4054
10477A30147m5604n5551K1001L4326j5958J1589L2152J8144k9830o266l7207J6763
10465G3706m0116K4968k1346J0693k7511n1891M8734J209k8228j8865J5089j2756
10453b6314q47m1343j8079O4205L6405M4853P6720N5453j4990p4114j1838Q101
10441I8212J1950L1162L0212j3535o4318J6786j6591K2002O4970l370l7144O011
10429A46347P774j6185l6095l2286j0619m2973K8579Q326N7859j9276j2725r082
10417F9644m750N574K6139J2757q990k4911m059K1859j5405o4421j013L5919M5576
$$ plain form
10501 58959 16773 45231 61385 53366 22789 4043 -4115 29248 103840 55069 981 -10945
10489 -10945 8325 74598 129709 112452 54102 81299 36977 -22386 -40930 25761 86093 130147
10477 130147 84543 28992 49993 84319 68361 79950 112102 130246 100416 94150 56943 73706
10465 73706 33590 58558 37212 47905 20394 -31497 17237 18446 -9782 -28647 -13558 -26314
10453 -26314 -27161 -68504 -86583 -22378 14027 58880 135600 191053 176063 101949 90111 98212
10441 98212 110162 141324 171536 158001 93683 110469 93878 115880 180850 177480 140336 146347
10429 146347 154121 137936 101841 69555 58936 15963 44542 52868 110727 91451 78726 69644
10417 69644 64894 70468 96607 109364 100374 75463 71404 93263 77858 13437 12424 48343 93919
10404I3919K4775n664N3997R164l9309K3912j1487P015K0847N4363n2122m3792
10392A35618K8619k7149N1097K7810m1514p5902J3860k5105p87K1614k0345K778
10380I0594m0406j3909o5309n74Q32j581M2458K3233K0066J2990o9574r974P1917
10367F0763M1484k7547j6662Q798M7552M7703K9853P6716j7789r4477j7650k3588
10355A15156j0114J5753P534j7132l5289O902J1112J00025L8120l3774k6836L125
10343A74582o121l0602L7805j4490n8921j8060k3025j8828L5738L5079j6013k9673
10331F7471K2717L1075Q0344M907p8729k5972k6389L8702J8069j2654l7919N1736
10319A33358N0677O7987L1374q5015p3900K6584R35o610K0235o6797l466R2397
$$ plain form
10404 93919 118694 113030 167027 176191 136882 160794 149307 156322 177169 231532 179410 135618
10392 135618 164237 137088 188185 215995 174481 98579 112439 87334 86547 108161 87816 90594
10380 90594 50188 36279 -29030 -29604 -28772 -30353 12105 35338 55404 68394 -1180 -11154 60763
10367 60763 102247 74700 58038 66836 114388 162091 191944 268660 250871 156394 138744 115156
10355 115156 105042 120795 128329 111197 75908 82810 93922 193947 232067 198293 171457 174582
10343 174582 168461 137859 175664 161174 102253 84193 61168 42340 78078 113157 97144 67471
10331 67471 90188 121263 201607 206514 127785 101813 75424 114126 132195 119541 81622 133358
10319 133358 184035 252022 283396 198381 124481 151065 152000 145390 165625 98828 95362 187759
10307A87759l131m4853k7866l7043J6582j990J0317L9069N0454K2921k9981j03795
10295G8443p5768O192j8685l12O6822J8443j5068M7319r883m4366J8253M6307
10283A17697M2046L7047p020j33348p5620J162Q645q053r569L8982K142n4723
10271d0612l1941k8592P5365N0732o978K5452N7693K6794K2714k4203k1757l8380
10259F6287m7658K3219L3666L0948j1418N7195m8432n9485K0974R27k3917M5739
10247H8045J0080l0394p861j5276R827j8610L2919k0229L3049M7407m0053k1029
10235F7875L8977k62K492k0196K2059R2896Q408n6811p9127l8838J1711L8687
10223H7871M894r442R019J1265l3471n8593k34M6956L3939J0656N670j0763j8585
$$ plain form
10307 187759 184628 139775 111909 74866 91448 89458 99775 138844 189298 212219 182238 78443
10295 78443 2675 8867 -9818 -10130 56692 75135 60067 107386 97503 53137 71390 117697
10283 117697 159743 196790 189770 56422 -19198 -18036 -9391 -17444 -27013 11969 14111 -40612
10271 -40612 -72553 -101145 -25780 24952 17974 43426 101119 127913 150627 126424 104667 66287
10259 66287 18629 41848 75514 106462 95044 152239 103807 44322 65296 66223 42306 88045
10247 88045 98125 67731 59870 44594 54421 35811 68730 48501 81550 128957 88904 67875
10235 67875 106852 106590 109082 88886 110945 203841 212249 155438 76311 37473 49184 87871
10223 87871 92765 83323 92342 103607 70136 11543 11309 58265 92204 102860 108530 97767 79182
10210G9182J2662J8963q5599o5933J4047L7626O755M3432N016m5420m0294N0714
10198C1151O3397P8342P826j8620o290j3234j5967j6930k3220J4324K0625j0718
10186A10686J059l4406m8304m9729K0456K7041M6572m346M4648j2626o2745j9964
10174A8342M9315k8842p4970l264O563Q473J5415r652M2045M9045J0258N5935
10162A38663L9316r812j1037m098j998N5741Q230o9551j21195p5234J3468m1215
10150g8722L5125L4364k0260M8879K2440j3566N7448J0841n6859O5748Q0707m5941
10138A40204m4576J3099J7416J8031j4832l4827L6641M3902m1536l5512j1458
10127H6552l9979l5748p685M2918R5588M5707l292n8482l1966K5722o6457j6964
$$ plain form
10210 79182 91844 110807 25208 -40725 -26678 10948 17703 61135 66151 20731 -19563 31151
10198 31151 94548 172890 180716 162096 155806 142572 126605 109675 86455 100779 121404 110686
10186 110686 111745 77339 29035 -20694 -238 26803 73375 69029 113677 101051 38306 18342
10174 18342 67657 38815 -36155 -39419 -32856 -24383 -8968 -18620 23425 72470 82728 138663
10162 138663 177979 168167 157130 153032 151034 206775 215005 145454 24259 -50975 -37507 -78722
10150 -78722 -43597 -9233 -29493 19386 41826 28260 85708 96549 39690 105438 186145 140204
10138 140204 95628 108727 126143 144174 129342 94515 131156 175058 133522 98010 86552
10127 86552 46573 10825 3140 46058 141646 187353 184061 125579 93613 119335 52878 35914
10115C5914O5425j1275l8557N496L2858J3270L0736Q547n3042q2329K9329K6147
10103F2519n89J6940l9853J190J3964k9292R260j8227q060J1071J1902L1262j7705
10090D4382J869k3723K2239L2154j2539J9352l876q6734L8027K2343k102K2981
10078G4373m330Q354K11m9993L005N2875L7730m9621o8102j3209P40P878J4785
10065A4696J4796M4231P534p4358K2654N0474k9176l1159K6218k9682J9231N0168
10053H5627K7148J6787K0120L0014L3364j774m4974n0656m5803j1180k8297L3466
10041F3842N619N6218M5321j3414l264k1313k8965R0558J0941k5170m697l0400
10029A45276l7797r906j8042p0408J7910O0668l7890K6932M4977m618m5166J8803
$$ plain form
10115 35914 101339 90064 51507 57003 89861 103131 133867 142414 89372 7043 36372 62519
10103 62519 61930 78870 39017 40207 54171 24879 34139 15912 7852 18923 30825 62087 44382
10090 44382 46251 22528 44767 76921 64382 83734 79858 -6876 31151 53494 51392 74373
10078 74373 70043 78397 78608 28615 31620 84495 122225 72604 4502 -8707 -7967 -89 14696
10065 14696 29492 73723 81257 6899 29553 80027 50851 19692 45910 16228 35459 85627
10053 85627 112775 129562 149682 179696 213060 211286 166312 115656 69853 58673 30376 63842
10041 63842 69461 125679 171000 157586 154322 133009 104044 194602 205543 180373 175676 145276
10029 145276 107479 97573 79531 9123 27033 87701 49811 76743 121720 117102 71936 90739
10017I0739M2945K9546m5878n0419O7763J2290l1860m2665j9511k3018l0999L4165
10005C3098M7261L7518O6719L3396l592l9223j2005J9291n8650m7864n720N1754
9993A21983j437K0741k5492j5729J869J8245K1770L8233M0899n0490j05545N94
9981F5641K3706K3544n2442m2448q639J29423J1596r147m2933m4370K4477l2857
9969D5551M0474Q2403l932n6430k9110P472o1529J4977N5788M8380j964Q785P236
9956A58101m1098Q254k441N194l1082M9829m5963n6269M636M1040n454m0355k963
9943D1429K7472j2325k2471l13J309J0124K6228K9107J936L7753j2575K3200N4620
9930B05494p2843l6176j3555K1980P2024N3790P1049J0452K8510r129k0198R424
$$ plain form
10017 90739 133684 163230 117352 66933 134696 146986 115126 72461 52950 29932 -1067 33098
10005 33098 80359 117877 184596 217992 214400 175177 163172 182463 123813 75949 70229 121983
9993 121983 120546 141287 115795 100066 101935 120180 141950 180183 221082 170592 65047 65641
9981 65641 89347 112891 60449 18001 9362 138785 150381 141234 98301 53931 78408 45551
9969 45551 86025 168428 164496 108066 78956 86428 24899 39876 95664 144044 142080 150865 158101
9956 158101 117003 125257 122816 128010 96928 146757 100794 44525 49161 90201 84747 44392 41429
9943 41429 68901 56576 34105 33792 35101 45225 71453 100560 102496 140249 127674 150874 205494
9930 205494 132651 96475 82920 104900 176924 230714 301763 312215 340725 331596 311398 320822
9918C20822k0730P099J03914J31256J8448j23397j57961k4686k7727m9352N7538
9907B35224k519R928o679n0664R092l9226l6123l1190P0334o46P931K5573j6701
9894A74334n6097p5145o982J0746q957N0315J8847m592m4825O3358O8870L3186
9882B23058k8605j0667J1618M783M0136j0852J1132m1340n3879o0090K6884L5352
9870A47530m3014P2605M8427q2528r0785j022J0405J8733J2025J5277O584n3576
9858F0661l6027M8581J0283o1976m0405Q0369M9032j3692q505K3891M7721j1370
9846A48563k753k8267k664M9823Q5228O9434p608m5589j2822L5481l3962k9045
9834B25819p333L7718P1979o558K2564m3421m7050m1239q869k3247j5049M5814
$$ plain form
9918 320822 300092 307191 411105 542361 560809 437412 279451 254765 227038 177686 235224
9907 235224 232705 242633 235954 185290 194382 155156 119033 87843 158177 157531 165462 191035 174334
9894 174334 118237 43092 36110 46856 37899 88214 107061 102469 57644 121002 189872 223058
9882 223058 194453 183786 195404 200187 240323 229471 240603 199263 145384 85294 112178 147530
9870 147530 104516 177121 225548 143020 52235 51213 61618 80351 92376 107653 114237 60661
9858 60661 24634 73215 83498 21522 -18883 61486 110518 96826 88321 112212 159933 148563
9846 148563 145810 117543 114879 164702 249930 319364 311756 266167 253345 288826 254864 225819
9834 225819 218486 256204 328183 321625 344189 300768 253718 212479 203610 180363 165314 211128
9822B11128q203l9062N5678k5199j06507l2713M7242M4106K0091L2787L8501l8542
9810A99307m1133k272l5166k6002m9967M5320J7512L1302N824R39k0608k6241
9798I8815L5575M6963J1404m67K5236l301l3315J1207j8515J4732l6975L881N549
9785A60789O235k3695M0984m5588m018J1765J3405R854J8094q2313L976M2143
9773A51631K9068M8100k5211j869M9977j6032m6927k8854N052L4251j3080j2754
9761A73352O9485M2884o533p1155o431k4335L318K2200k3867n6178j5607L5061
9749A42194k2872L8502P4322K6985k0270p5675k3271q682L1952K6719j3285R550
9737A86169J4102n876M182J8844L0321l3149r415k3186l0133j4496Q329M2567
$$ plain form
9822 211128 202925 163863 219541 194342 87835 55122 102364 146470 166561 199348 237849 199307
9810 199307 158174 155902 120736 94734 44767 90087 107599 138901 144725 145664 125056 98815
9798 98815 134390 181353 192757 192290 217526 214225 180910 192117 173602 188334 151359 155240 160789
9785 160789 167024 143329 184313 138725 134707 146472 159877 169731 187825 105512 109488 151631
9773 151631 180699 228799 203588 201719 251696 235664 188737 159883 164935 199186 186106 173352
9761 173352 242837 285721 279188 208033 201602 177267 180585 202785 178918 122740 107133 142194
9749 142194 119322 157824 232146 259131 238861 163186 139915 131233 163185 189904 176619 186169
9737 186169 200271 194395 198577 217421 247742 214593 205178 181992 151859 137363 145692 188259
9725A88259N0111j068o4j6554n89R848j6055N9243L3309j6653k1039R458o647
9712B71559j21n7916K2005K2161k2250k942O8705J00401Q8676O4782L9058N8931
9700F53049M9720R295L691L2666m4822p7763m9129n5300n9631m8845j13935p0529
9688B28467k0521r756n1189J3692Q1932P9707L5851j6371k201L1068j9989k8344
9676C22346m0337k5424R23N2473L824j3178n6818k8928Q241l73l0660m3201L1461
9663A80349N7412N1729J2414r397p7j1725L9016K168m8356l5277m9080j9873O4315
9650B33618M8469j3190j4323q498O451K7212J2073M8616m0233K292P2879p95j6496
9637C58075j5457q2360l7520M643K9256L0710J1946J6871J7650n9563K7480L5770
$$ plain form
9725 188259 238370 237302 237238 220684 220095 229943 213888 273131 306440 289787 268748 278206 271559
9712 271559 271438 213522 235527 257688 235438 232496 301201 401602 490278 555060 594118 653049
9700 653049 702769 712064 715755 748421 703599 625836 576707 521407 461776 412931 298996 228467
9688 228467 207946 198190 147001 160693 242625 322332 358183 341812 339611 370679 350690 322346
9676 322346 282009 256585 257508 309981 313805 300627 243809 214881 223122 222749 192089 148888 180349
9663 180349 237761 289490 301904 292507 292430 280705 319721 321889 273533 238256 189176 169303 233618
9650 233618 282087 268897 254574 246076 252527 279739 291812 340428 300195 302487 375366 374571 358075
9637 358075 342618 260258 222738 227381 256637 287347 299293 316164 333814 274251 301731 337501
9625C37501K7222p2648o1671j0964l2699j2850L7787N1263N6713j3048k3671j4329
9613B68606M46k276j204p64j360K4179Q954j9913O106K0454K3629l1329j25K391
9599B97794r494N8216N8538P8881l8975p9234J6670k533N992p7011N2760O0602
9587D22206l816L8603K6505N315o3555j27095m5300K8107k0988k1325M306K4646
9575B67609O3306m072Q9156L9171n2319K548L8125l0521n1029j1060j2529L6253
9563C74638K187K4348M8860m0546p2092j6176Q5892R1880L5229r0070m0777L9881
9551D43254J7666l2153O001k5895o5029j3587q462j1356n1700L2565N7236N4401
9539D02941k651k563M9647L7055R865l6453p2095k4570L8443J07665M5707j1293
$$ plain form
9625 337501 364723 292075 230404 219440 186741 173891 211678 262941 319654 306606 282935 268606
9613 268606 269052 266776 265572 264808 263448 287627 296581 276668 282774 303228 326857 295528 295403 297794
9599 297794 288300 346516 405054 483935 444960 365726 382396 379863 385855 308844 361604 422206
9587 422206 418390 456993 483498 488813 425258 298163 252863 280970 259982 238657 242963 267609
9575 267609 330915 326843 415999 455170 402851 405399 443524 413003 361974 350914 338385 374638
9563 374638 376825 401173 450033 409487 337395 321219 407111 498991 534220 444150 403373 443254
9551 443254 460920 428767 434768 408873 343844 330257 321795 310439 258739 291304 348540 402941
9539 402941 400290 397727 447374 484429 494294 457841 385746 361176 399619 507284 552991 541698
9527E41698P802o2935j4344M234j7137K2056K5200j2750J4345m2163M6929O640
9515E19575J285M3955M817l791n4211m5357k8309k1223L0105P9674j5859O0475
9503E71136l3757J3015J0036o7021L5016N5677r417L1402N0488L9736p6502p4513
9491E45296K8843j2921O3223n854m6740L078k3199J3739O0350o30m0472M4209
9479F28922O9440N419m3226L2524m496k7491M7294J1205j6797O1934J7860n6344
9467G26244k3490k5363l3905M553j7825O1917N8336N7083l7343m2387K8792n322
9455G51290L3526k7117p5876P04N1491P8024N956l3563j1978N1824J9313J0338
9443H53932K0294K3810M114J7075k1900N124M174M9407J9735j1466Q3555P6935
$$ plain form
9527 541698 549500 486565 472221 476455 459318 481374 506574 493824 508169 466006 512935 519575
9515 519575 520860 564815 569632 565841 511630 466273 437964 416741 446846 526520 510661 571136
9503 571136 537379 550394 560430 493409 528425 584102 574685 606087 656575 696311 619809 545296
9491 545296 574139 561218 624441 618587 571847 574925 551726 565465 625815 625185 584713 628922
9479 628922 698362 703781 660555 693079 688583 661092 708386 719591 702794 764728 782588 726244
9467 726244 702754 677391 643486 648039 630214 692131 750467 807550 770207 727820 756612 751290
9455 751290 784816 757699 681823 682527 734018 812042 817998 784435 772457 824281 843594 853932
9443 853932 874226 898036 902150 919225 897325 902449 906623 956030 975765 964299 1047854 1124789
9431A124789j33l2120K8398L9572l730q289J5741Q4689L9422J812K9268M5886
9419A365305n6666j8675j7078l8757l351r210l2008K714Q002K1310p0032j5892
9407A135662Q6071L0026J7643N5262P572M522O22k8457k3962M7423M6584L4871
9395A413839o529K245L2084K4008P411K9763P2187L7703R8083k1619K2254j8831
9383A692598J8270R1254M3713l0359K7966K3579j85j8640k5990k4130k4957L4222
9371A807341J0047r0831j9819k5258M286j0289M3188K3965M6313o5193p9365L6760
9359A681145M7130N7040j4291O2810K0158l5223K6833K7474Q6081L9988R8417
9348B097562Q2528P7014R9357N3326N6626Q7203R5752Q0098O7357L7327j037n2777
$$ plain form
9431 1124789 1124656 1092536 1120934 1160506 1156776 1148487 1164228 1248917 1288339 1290151 1319419 1365305
9419 1365305 1308639 1289964 1272886 1234129 1230778 1221568 1189560 1192274 1200276 1221586 1151554 1135662
9407 1135662 1221733 1251759 1269402 1324664 1332236 1336758 1337380 1308923 1284961 1332384 1378968 1413839
9395 1413839 1407310 1409555 1441639 1465647 1473058 1502821 1575008 1612711 1710794 1689175 1711429 1692598
9383 1692598 1710868 1802122 1845835 1815476 1843442 1867021 1866836 1848196 1822206 1798076 1773119 1807341
9371 1807341 1817388 1726557 1706738 1681480 1685766 1675477 1718665 1742630 1788943 1723750 1644385 1681145
9359 1681145 1728275 1785315 1771024 1833834 1853992 1818769 1845602 1873076 1959157 1999145 2097562
9348 2097562 2180090 2257104 2356461 2409787 2466413 2553616 2649368 2729466 2796823 2834150 2833113 2780336
9336B780336k7409j6292m7832m5302j14969p8381L1864k8802o0016p8823k273
9325B312101j2660k059J6262j289j1540k9879N7024Q3797k0113K5176P853O049
9313B430722O7074Q3604J5805M7853p263m4409q1251j4018j1559j9461k870k5743
9301B438484j3743p2047j8040M1902L9543k9597L043k4887O874j8164o4414J134
9289B290088K1206O6130J3168P9309j9701l8088m1901L260P3993Q7532J7784m9645
9277B503135m6376K554R4582J15891Q9454Q8233O9303R2152Q9951L7011Q3730
9266C219620Q8286P0651L9476J9308M5663K2406Q185K6701N4017P6081J15575
9255C785969J0046K3158J32911J31107N1112M0459M9314P977P1037K6649K9310
$$ plain form
9336 2780336 2752927 2736635 2688803 2643501 2528532 2450151 2482015 2453213 2393197 2314374 2312101
9325 2312101 2299441 2297382 2313644 2312355 2300815 2270936 2327960 2411757 2391644 2416820 2424673 2430722
9313 2430722 2497796 2581400 2597205 2645058 2637795 2593386 2512135 2498117 2486558 2467097 2464227 2438484
9301 2438484 2424741 2352694 2334654 2376556 2416099 2386502 2389545 2364658 2371532 2353368 2288954 2290088
9289 2290088 2311294 2377424 2390592 2469901 2450200 2412112 2370211 2373471 2447464 2534996 2552780 2503135
9277 2503135 2456759 2459313 2553895 2669786 2759240 2847473 2916776 3008928 3098879 3135890 3219620
9266 3219620 3307906 3378557 3418033 3437341 3483004 3505410 3513595 3540296 3594313 3670394 3785969
9255 3785969 3796015 3819173 3952084 4083191 4134303 4174762 4224076 4232053 4303090 4329739 4359049
9244D359049N0817J10533L5429J10001Q4485k5455j5526M5562J0100O8517N4712
9233D888224L639m9095J8944L7914J0901L1192J9183j6226J5287K45n253J17571
9221E072526J22753M0492q08M2772R6287J12814J20927O6111Q4373P3724J41160
9210E973131N6743O8509Q2703P0203Q7298L1476N3798Q8406P1575K4209N0161
9199F658212N4011J38035N8295Q0278J03447O2800M3473M8585Q4848J21944J28294
9188G582222J18092J38368R2850J74405J84300J40474Q7780J22100J32383J89165
9178H962139K14290J88725J46372K13857K47781K06403J61650J67660J42876K16267
9168A0868020J85239J96834J77868K75396K33453K29951K53747K45732K49524
$$ plain form
9244 4359049 4409866 4520399 4555828 4665829 4750314 4724859 4709333 4754895 4764995 4833512 4888224
9233 4888224 4891863 4842768 4861712 4899626 4910527 4941719 4960902 4944676 4959963 4960208 4954955 5072526
9221 5072526 5195279 5235771 5234963 5277735 5374022 5486836 5607763 5673874 5758247 5831971 5973131
9210 5973131 6029874 6098383 6181086 6251289 6338587 6370063 6423861 6512267 6583842 6608051 6658212
9199 6658212 6712223 6850258 6908553 6988831 7092278 7155078 7198551 7247136 7331984 7453928 7582222
9188 7582222 7700314 7838682 7931532 8105937 8290237 8430711 8518491 8640591 8772974 8962139
9178 8962139 9176429 9365154 9511526 9725383 9973164 10179567 10341217 10508877 10651753 10868020
9168 10868020 11053259 11250093 11427961 11703357 11936810 12166761 12420508 12666240 12915764
9159A2915764K69755K83305L02240L29207L42090L44333L32920L52890M14460
9150A5886964L32366L86439M37849L90562M41013M46432M56666N09542N55607
9141A9843440N53697N59613O18317O43809O89656O52971P13498P63842P27242
9132B5766085P50272Q16553Q42318Q33808Q87909R75001J050623J038696J008294
9123C3969559J023659J130405J184399J184335J301760J291909J261035J335837
9115D3682898J453167J457002J549008J542213J502272J530834J580787J648039
9107E5946220J595221J587704J621580J566704J505610J450701J501353J411987
9099F8187080J323475J334410J163145J052467R81885Q72794P47778N81838M41740
$$ plain form
9159 12915764 13185519 13468824 13771064 14100271 14442361 14786694 15119614 15472504 15886964
9150 15886964 16219330 16605769 17043618 17434180 17875193 18321625 18778291 19287833 19843440
9141 19843440 20397137 20956750 21575067 22218876 22908532 23561503 24275001 25038843 25766085
9132 25766085 26516357 27332910 28175228 29009036 29896945 30871946 31922569 32961265 33969559
9123 33969559 34993218 36123623 37308022 38492357 39794117 41086026 42347061 43682898
9115 43682898 45136065 46593067 48142075 49684288 51186560 52717394 54298181 55946220
9107 55946220 57541441 59129145 60750725 62317429 63823039 65273740 66775093 68187080
9099 68187080 69510555 70844965 72008110 73060577 74042462 74915256 75663034 76244872 76686612
9090G6686612L16607J75844q8023k30666k88949m56960n74224p64397r80938j036382
9080G2758524j109133j137785j200163j362281j450315j460614j549233j558829
9072F1930171j506642j562585j606063j639197j662891j643052j612764j492046
9064D9204931j372676j439435j413248j398746j438803j311381j257753j217336
9056C8355553j200897j086003j152242j115252j092142j052499r73807q98253
9048B9784458q01896q30530q13990p80433q21610p49795p26073o75784o83908
9039B2900439o93047o59819n76257n90645m95898m94394n25781m96878m83666
9030A7884054m39282m24944l98286m72208m32523l93035l40629l30290m07011
$$ plain form
9090 76686612 77003219 77179063 77091040 76860374 76571425 76114465 75540241 74775844 73794906 72758524
9080 72758524 71649391 70511606 69311443 67949162 66498847 65038233 63489000 61930171
9072 61930171 60423529 58860944 57254881 55615684 53952793 52309741 50696977 49204931
9064 49204931 47832255 46392820 44979572 43580826 42142023 40830642 39572889 38355553
9056 38355553 37154656 36068653 34916411 33801159 32709017 31656518 30682711 29784458
9048 29784458 28982562 28152032 27338042 26557609 25735999 24986204 24260131 23584347 22900439
9039 22900439 22207392 21547573 20971316 20380671 19884773 19390379 18864598 18367720 17884054
9030 17884054 17444772 17019828 16621542 16149334 15716811 15323776 14983147 14652857 14245846
9021A4245846l68800l33633k67466k45180l50343l23160k42762k63969k09307
9012A1641226j81661k13841j40309j11164l5943L9985K8739n7551j80518k13520
9002A0575443l51580m13779l64150k90016k21728k60405k07926j78420j98604
8993H088835j72214j09706k05003j57998j58120j74896j63679j58904j21716o8391
8983F598208l9072j52533j61203j34194j40507m4058k9356q8163j30327j22183
8973E556612j37878p5155p7721K6712q262j01050j25284k0298m8960j2801q7860
8962D888055o7772j01196n6206j8646n2998k9743n9183n0955j39371o4656k9215
8951D218114o0044k6190j6679l9540o7790j7616m1791l8145l5750p7743l3274
$$ plain form
9021 14245846 13877046 13543413 13275947 13030767 12680424 12357264 12114502 11850533 11641226
9012 11641226 11459565 11245724 11105415 10994251 10958308 10998293 11027032 10969481 10788963 10575443
9002 10575443 10223863 9810084 9445934 9155918 8934190 8673785 8465859 8287439 8088835
8993 8088835 7916621 7806915 7601912 7443914 7285794 7110898 6947219 6788315 6666599 6598208
8983 6598208 6559136 6406603 6245400 6111206 5970699 5926641 5897285 5809122 5678795 5556612
8973 5556612 5418734 5343579 5265858 5292570 5284308 5183258 5057974 5037676 4988716 4975915 4888055
8962 4888055 4820283 4719087 4662881 4644235 4591237 4561494 4502311 4451356 4311985 4247329 4218114
8951 4218114 4158070 4131880 4115201 4075661 4007871 3990255 3948464 3910319 3874569 3796826 3763552
8940C763552n9515n2786p3439p4821k4653l2530l7539N739k462p1389l3869j7006
8928C289282q794N6222k8264n1503o3387p2372k6430l1507J7756M9643K6715P1904
8916C229265l892k5756J8145k7274m9125P71k3798o6230r6835l4265J1545j9721
8904B912830j48807m2600L9178j4560j3363j6533o3930l5429K963l3017l5316
8893B551416N641J3685m7294m8033l8495P411k9866n3439L756Q1351P8487J2044
8881B536664K8279M921n9157k6101J3852O3705M5808J9006K7148J4556J4488j1357
8869B671812M2129L2352L6547J49613J77182K11828K93600M60383P84921J092182
8859E952549J814411K911952M249618L921637K92593k841892m025864l328491
$$ plain form
8940 3763552 3704037 3651251 3577812 3502991 3478338 3445808 3408269 3414008 3411546 3340157 3306288 3289282
8928 3289282 3280488 3336710 3308446 3256943 3193556 3121184 3094754 3063247 3081003 3130646 3157361 3229265
8916 3229265 3225373 3199617 3217762 3190488 3141363 3142134 3118336 3052106 2955271 2921006 2932551 2912830
8904 2912830 2764023 2721423 2760601 2746041 2732678 2716145 2652215 2616786 2619749 2586732 2551416
8893 2551416 2557057 2570742 2523448 2475415 2436920 2444331 2414465 2361026 2364782 2446133 2524620 2536664
8881 2536664 2564943 2569864 2510707 2484606 2498458 2562163 2607971 2626977 2654125 2668681 2683169 2671812
8869 2671812 2713941 2746293 2782840 2932453 3109635 3321463 3615063 4075446 4860367 5952549
8859 5952549 7766960 10678912 14928530 18850167 19142760 16300868 12275004 8946513
8851H946513k101548j335736q68264o55523m58208k10280k16553k04974j74143
8842B721284j84622j49402l3887o6831o3073n9352r8562j28540n0652k5524j5334
8831A845505o3545o9281j5067K8710p0052r1776m5355L0438K3380n6118l356L778
8819A517261r6947j06701K0108M5396K1444l0662j08868m5208J7255K777j4331
8808A221524k1746n9815n7595l798L2574p311L9454K4390K0424m7045k2781o0484
8796A057791n9408r2956l688J6562J7760j9984R993l2845J411M625P0670k5365
8784I44566r265n320m7768O69p680j2522Q342j4175k4053p788P306N958k3873
8771H14397k0879m6496l3719n234Q8774M1480K1478k3427k3490j8726j7783N2966
$$ plain form
8851 8946513 6844965 5509229 4640965 3985442 3527234 3316954 3100401 2895427 2721284
8842 2721284 2536662 2387260 2353373 2286542 2223469 2164117 2065555 1937015 1886363 1860839 1845505
8831 1845505 1781960 1712679 1697612 1726322 1656270 1564494 1519139 1549577 1572957 1516839 1513483 1517261
8819 1517261 1420314 1313613 1333721 1379117 1400561 1369899 1261031 1215823 1233078 1235855 1221524
8808 1221524 1199778 1139963 1082368 1078570 1111144 1103833 1143287 1167677 1188101 1141056 1118275 1057791
8796 1057791 998383 905427 901739 918301 936061 916077 926070 893225 894636 899261 969931 944566
8784 944566 935301 929981 882213 882882 875202 862680 871022 856847 832794 825006 832312 838270 814397
8771 814397 793518 747022 713303 708069 796843 838323 859801 836374 812884 794158 776375 829341
8759H29341L028o346k132K1031m2695r7282n737J2801j4071J2035J3848m1270
8747F82551J2667j3533o5649L640O7959L3478k6054j1228k6224N9669k2436k2209
8735F72631R299J1246J8598K215p0789K125L3405O2877l1027n4836o3708J7115
8723F09151R063k5549p1412n397O565o228L9697L6529l0662M7899K895Q501J992
8710F23044o5866k3324J3622K1706N7037l4820k1300q1857P9703Q7653k3233q3128
8698E49237o0159m985r002Q757m7392L7117J15097Q5927L474p8629n3101m0752
8686E05589N1624L2158r723L1685K1109k4494p91l0682K5892o382k8142l411J2807
8673E77239L320L153L2971J7912M9730m6477l6057k5081R952l8646n840K0340
$$ plain form
8759 829341 832369 826023 823891 844922 802227 704945 699208 712009 697938 709973 723821 682551
8747 682551 695218 681685 616036 619676 687635 721113 695059 683831 657607 717276 694840 672631
8735 672631 681930 693176 711774 713989 643200 645325 678730 741607 710580 655744 592036 609151
8723 609151 618214 592665 521253 515856 522421 516193 555890 592419 561757 609656 612551 621052 623044
8710 623044 557178 533854 547476 569182 626219 591399 570099 488242 567945 655598 632365 549237
8698 549237 489078 484093 475091 483848 436456 473573 588670 674597 678071 599442 546341 505589
8686 505589 557213 589371 579648 611333 632442 607948 607157 576475 602367 595985 567843 564432 577239
8673 577239 580559 583712 616683 634595 684325 637848 601791 576710 586662 548016 542176 562516
8661E62516K1332k8590m6453j2914K2532K4699o988K834M218N7547J7538o3875
8649E54396j5596l6500N0497M5330K8117m4296l56K8363m4794p8622n9868m867
8637D21804O1311L0513o450N3127N3782j4977n4225l3771j1472K4738k3480l0620
8625D70280N219l635J7132K6639M4507n334L0397L8058j0117j9109j2727m4021
8613E37289Q5180j0213K0525O9078J962J580r742n3629n3859L9557Q4811j9486
8601F93053o0567J9463j3670j6157N5898j1814m8345o4749n438j8014P9722J14773
8589G24155M466k1845n0676p2193j4236L4449n456j6333n055q1361j9220k488
8577D74207J6820k6263p7165n341m4830O7774N8375j487K4780j9271n6643j2057
$$ plain form
8661 562516 583848 555258 508805 495891 518423 543122 536134 538968 543186 600733 618271 554396
8649 554396 538800 502300 552797 598127 626244 581948 581592 609955 565161 486539 426671 421804
8637 421804 483115 513628 507178 560305 614087 599110 544885 511114 499642 524380 500900 470280
8625 470280 475499 471864 488996 515635 560142 554808 585205 623263 613146 594037 581310 537289
8613 537289 622469 612256 632781 701859 703821 705401 695659 642030 588171 627728 712539 693053
8601 693053 632486 651949 638279 622122 678020 666206 617861 553112 547674 529660 609382 724155
8589 724155 728621 706776 656100 583907 569671 604120 598664 582331 577276 495915 476695 474207
8577 474207 491027 464764 387599 382258 337428 405202 463577 462090 486870 467599 410956 398899
8565C98899O599k0799K0232J5345O321m3825o7424l3650P2319L4866m3915k8654
8553C16314j5562K5639L4695j4789N8537k6548L119k6957r2754J2741k8565K725
8541B48595N8616K4344j6165J4900k9499n0583Q342Q61K058O524K6798k3133n6066
8528B15592O262K723j2917R739J3891R922Q908J9873N683L9587L7273j9369p1962
8515B65205r2537L6941P5137L9515m2195o0834l9116l8426k976j8173N7044N5951
8503B35536k3118o19J871l1480J099M329J2471r448R287L7744l3196M9888L9355
8490B93719K3777N602l2202m0370j8050q076j8601M969k4557N6244M208l2090
8478B14573N1333J6907J3380J0117m0323J8379k3216k1579J6132k7202J053l3838
$$ plain form
8565 398899 405498 384699 404931 420276 426597 382772 315348 281698 354017 388883 344968 316314
8553 316314 300752 326391 361086 346297 404834 378286 381405 354448 261694 274435 245870 248595
8541 248595 307211 331555 315390 330290 300791 250208 258550 259411 261469 267993 294791 271658 215592
8528 215592 221854 224577 211660 221399 235290 245212 254120 273993 279676 319263 356536 337167 265205
8515 265205 172668 209609 284746 324261 282066 221232 182116 143690 140714 122541 179585 235536
8503 235536 212418 211799 213670 182190 183289 187618 200089 190641 199928 237672 204476 254364 293719
8490 293719 317496 323098 290896 250526 232476 224400 205799 210768 186211 242455 246663 214573
8478 214573 265906 282813 296193 306310 265987 284366 261150 239571 255703 228501 229554 195716
8466A95716O1632L5299n835j8136k5383J660K1279p981l2178p370m7947o9238
8454A01518P0813N6151J1095n2472j1697K4577J1905j6725q248j395Q1279J7691
8442B84492j3592m2008j2805j1322K7683l2667l137n521R797L1509m7464j3487
8430A71478J8609J393N9856J8028p127K328k4638J1243J6652L6575J9324q284
8418C15437n3996N834M5159J0749l8356l8378R512k2401k7527m3203k5248L4163
8406A71745N0878J2756P068l7045L5994J6264l993P1550J0115n9752j08204J2345
8394A79721q080o4949j7858J10433M4266Q308k3849L36J1530J4658J9502m084
8382B69934o7786j4448K6059L1840L316L1143J3850j5880l860Q825p354l3242
$$ plain form
8466 195716 257348 292647 286812 268676 243293 244953 266232 258251 226073 218703 170756 101518
8454 101518 172331 228482 239577 187105 175408 199985 211890 195165 186917 185522 266801 284492
8442 284492 270900 228892 216087 204765 232448 199781 196644 191123 200920 232429 184965 171478
8430 171478 190087 191480 251336 269364 262237 264565 239927 251170 267822 304397 323721 315437
8418 315437 261441 267275 312434 323183 284827 246449 255961 233560 206033 162830 137582 171745
8406 171745 222623 235379 242447 205402 241396 257660 253667 325217 335332 275580 167376 179721
8394 179721 171641 106692 88834 199267 243533 251841 227992 228328 239858 254516 274018 269934
8382 269934 202148 187700 213759 245599 248915 280058 293908 278028 274168 282993 275639 242397
8370B42397n7126n7664m8613K7403k9329M6448L0990L4535J3663J2389j3429J209
8358B02873J2161l2587q0158P574J8377O0870J772k2083P420O313J2265N635K7162
8345B27594J1153l15J0169m743o1952n2165L8873Q2795M013L2484n2907j3345
8333B21654N5066k0673q242L4933m5658o0349p3673J5470P9466n5756j9641M9316
8321A71913l0126J1523j8619R081M1240k4689M8501n1006l3750N9333Q3488m365
8309B62524l3252j5777k6120j8856J794j2265L3672J4313O746r1455N926J4947
8297A42197j3617R069P771L4426L0711K9418j1091k9027J5431l5866K553n3300
8285A28675Q977J795N804j2715k785k3257j1584M3064K1011l4081J3058N4634
$$ plain form
8370 242397 185271 127607 78994 106397 77068 123516 154506 189041 202704 215093 201664 202873
8358 202873 215034 182447 102289 109863 128240 189110 190882 168799 176219 182532 194797 200432 227594
8345 227594 238747 238432 248601 243858 181906 129741 168614 251409 255422 287906 234999 221654
8333 221654 276720 256047 247805 282738 237080 176731 103058 118528 197994 142238 122597 171913
8321 171913 141787 153310 134691 143772 185012 160323 208824 157818 124068 183401 266889 262524
8309 262524 229272 213495 187375 168519 170313 158048 191720 206033 212779 121324 127250 142197
8297 142197 128580 137649 145420 179846 210557 239975 228884 199857 215288 179422 181975 128675
8285 128675 137652 139447 145251 132536 129751 106494 94910 137974 158985 124904 137962 192596
8273A92596K4663p4255m6930m1560L3027K2661m279k8026j9724O8077M9083j3249
8261A62084m9143O0016K8665k2197m0501m506K3788L9359L3671j6800K075j908
8249B14603m7322l2552l9257L5998o919M3575L2540k8466n2752j5951j7240N19
8237H6776r73m1503J2350K7157K3097r808q1500P1508R4946K0801o278K9229k9564
8224A96238l5523m0579k9614J9352L0668K7472m4081o2458k9560R731J1636j3726
8212C9556r684m3629P4678O552J465r028J1181j2317O9443Q858o3740m1081L6390
8199F8644J9478K8780P6797K2261p3202n5446m4418j8267K9120K7487K8103N7745
8187A67082K052m8522M2902O247l4562J5304o3646J6620J5511O3613l5418q0058
$$ plain form
8273 192596 217259 143004 96074 54514 87541 110202 105923 77897 58173 126250 175333 162084
8261 162084 112941 172957 201622 179425 138924 134418 158206 197565 231236 214436 216511 214603
8249 214603 167281 134729 95472 131470 124551 168126 200666 172200 119448 103497 86257 86776
8237 86776 85803 44300 56650 83807 106904 97096 15596 87104 182050 202851 196573 225802 196238
8224 196238 160715 120136 90522 109874 140542 168014 123933 61475 31915 41646 53282 39556
8212 39556 29872 -13757 60921 67473 68938 59910 71091 58774 128217 137075 73335 32254 68644
8199 68644 88122 116902 193699 215960 142758 87312 42894 24627 53747 81234 109337 167082
8187 167082 169134 120612 163514 169761 135199 150503 86857 103477 118988 182601 147183 67125
8175F7125l2643J4686O281J498J3871n897K7677k67l463p2297j1024N5192N0455
8162A11194o3324j2963L2465j642k7560K0458N0323m1218N180j512J8733M9162
8150A39296J0336J1019j8261j9043k7899r72J3613p752O819k9483m4721k2375
8138A0577p3896O6211K4058P460m1484k2910L5646J8695J8526P2827j67p5057
8126D0486K6391N8012m4817p1779L6240O2284J3736l2527l2871J7237M0867L2390
8114A45649M512K2011M9875K3665K887k1632j013N792n740j6847M6716l4896l5218
8101A85761p1032l9616M6009K6361j7467P214j393j6777k731J5052k3591j3445
8089I4345k4220O475j9029j7123J4772K9112k1200q954m7126m1312L0250L1690
$$ plain form
8175 67125 34482 49168 55449 56947 70818 64921 92598 92331 88868 16571 5547 60739 111194
8162 111194 47870 34907 67372 65730 38170 58628 108951 67733 72913 71401 90134 139296
8150 139296 149632 160651 142390 123347 95448 94476 108089 100337 107156 77673 32952 10577
8138 10577 -63319 2892 26950 34410 -7074 -29984 5662 24357 42883 115710 115543 40486
8126 40486 66877 124889 80072 8293 44533 106817 120553 88026 55155 72392 113259 145649
8114 145649 150161 172172 222047 245712 248599 226967 225954 231746 226006 209159 255875 220979 185761
8101 185761 114729 75113 121122 147483 130016 137230 135837 119060 116329 131381 107790 94345
8089 94345 70125 76600 57571 40448 55220 84332 63132 54178 7052 -34260 -4010 27680
8077B7680l9336k1030K8398P2553l7619J7629J0599k1452L7291l2024k7822N1170
8065F6037L228N5069M9192j9880l4460l916L3919M0886l9680l4254J9875J4459
8053A50475k5088m2325K0258O5175L459J7188O6233N69k7211Q075N740j6069J840
8040B28319p957n5399K3776M16P251J0841J9656r361n3403L1011K6602m7217K4664
8027A99199l6169q922M2798k6549q5362n2201Q968P9577l3928K9919L3096n90
8015A49836L6571K2471j7271j0545m786J7675J6376L6734k47k7093n1073J2443
8003A81091N9778N3958L0971J18984P4355P2612P1806l1066j03383j10266j00583
7992C18257k0969K1294R0979N503k5382R525K5401N2760J2899j07624q6049p5075
$$ plain form
8077 27680 -11656 -32686 -4288 68265 30646 48275 58874 37422 74713 42689 14867 66037
8065 66037 69265 124334 173526 153646 119186 115270 149189 190075 150395 116141 136016 150475
8053 150475 125387 83062 103320 168495 171954 189142 255375 255944 228733 236808 242548 226479 228319
8040 228319 220362 164963 188739 189155 196406 207247 226903 217542 164139 195150 221752 174535 199199
8027 199199 163030 154108 196906 170357 84995 32794 41762 121339 87411 117330 150426 149836
8015 149836 186407 208878 191607 181062 176276 193951 210327 247061 246814 219721 168648 181091
8003 181091 240869 294827 325798 444782 519137 591749 663555 632489 529106 418840 318257
7992 318257 297288 318582 409561 415064 389682 399207 424608 477368 490267 382643 296594 221519
7980B21519p616P424p1455O447m4112o8612K6321L4424K1125J3497o082l5938
7968I6942L4362k9615m7560k5580K8780P653j5520J6296Q0826K0876N3727J8078
7956B39265O0018J54005M3821L6106j6980k4325n3181k1394n8231n7155p4694
7945B27255K5475J5302K1234K9255j4539m4036l9759m9466O6840M1636K2888o7421
7933B34664q7992Q397K2707j2210k9597m7456k2058J0079P30l1771L5318M3082
7921A23893k8515m347K4082P0847R56k5012K4116J2722J9024O8205p660p2488
7909B05823p7661k9685K265N6741m349M0780j3234m9868J03715j6880j15902j6607
7897H5138L092O865k4006k2182j6004M1814J9188l6513n5341q67N6114N8385J9821
$$ plain form
7980 221519 213903 221327 149872 156319 112207 43595 69916 104340 125465 138962 132880 96942
7968 96942 131304 101689 54129 28549 57329 64982 49462 65758 146584 167460 221187 239265
7956 239265 299283 453288 497109 533215 516235 491910 438729 417335 359104 301949 227255
7945 227255 252730 268032 289266 318521 303982 259946 220187 170721 237561 279197 302085 234664
7933 234664 146672 155069 177776 165566 135969 88513 66455 76534 77264 45493 80811 123893
7921 123893 95378 91031 115113 185960 186916 161904 186020 198742 217766 285971 278311 205823
7909 205823 128162 98477 100742 157483 153134 193914 180680 130812 234527 217647 101745 85138
7897 85138 88230 95095 71089 48907 32903 74717 93905 57392 2051 1184 57298 115683 135504
7884A35504J5202l4723j777m35n9722j8145J9204K1116k6763m5913j2797N4812
7872D5563l6036j8531J3457q683j0898k1672M988L137M020J1789K58O5636M4350
7859I7378l9030J9964R573k1666l5532k3l305K0562k0617M7701k3534N111M5453
7846A02035k1230J6527O545J0844M317l3428m2693J0750l7748K537k964k1037
7834e545j9211k6688l2361Q1640J768l0441K8248N0531P8090L2440n2071m7888
7822E8512J608l5787j8068K2132J5865k896n5707o1325m78Q0423J5370k7018l8306
7809d5675j0170O479J6509M7722N250l0303m2413O0183L8914J5608M8178j1775
7797I8507l100k3859m8260k0834P670K5402M2543J4526l9826m6205O914L63L3957
$$ plain form
7884 135504 150706 115983 114206 113771 54049 35904 55108 76224 49461 3548 -9249 45563
7872 45563 9527 -9004 4453 -4230 -15128 -36800 -31812 -28675 -24655 -12866 -12608 53028 97378
7859 97378 58348 78312 87885 66219 30687 30664 27359 47921 27304 75005 51471 56582 102035
7846 102035 80805 97332 103877 114721 119038 85610 42917 53667 15919 18456 15492 -5545
7834 -5545 -24756 -51444 -83805 -2165 -397 -30838 -2590 47941 126031 158471 106400 58512
7822 58512 60120 24333 6265 28397 44262 41366 -14341 -75666 -76144 4279 19649 -7369 -45675
7809 -45675 -55845 -49366 -32857 14865 20115 -10188 -52601 7582 46496 62104 110282 98507
7797 98507 95407 71548 23288 2454 10124 35526 78069 92595 52769 6564 13478 13841 47798
7784D7798l0582j4938Q274N7487O6225M118p7075j2532j6294J3223K7099J5357
7772H8160L683o0365m069Q0178q1361j05957P5908J32088J0546l4809j9649l4445
7760D9908l2661K7750L8275J2721K8226j6209n3369l325q6589k0234P9922O2376
7748H6791P422m6016p892N8994J1218n6950l3990n4421m9942M6071M9778m170
7736F893M0321k493q7898j7946N646O2989N1463m0348m0159K3167O0930K9587
7724I2152o615k8279n4718P444K0072k739K4838M0269p213m0143q9403m906M0594
7711h647L2873J303L0324K8773K1897Q485J3650l485N439j11955j4457K1717M117
7698C0034l3218o850L34k5601P2840N820N862L3026m5421q3025K972N4460K9343
$$ plain form
7784 47798 17216 2278 10552 68039 134264 138382 61307 48775 32481 45704 72803 88160
7772 88160 91843 31478 27409 107587 26226 -79731 -3823 128265 138811 104002 84353 49908
7760 49908 17247 44997 83272 95993 124219 108010 54641 51316 -35273 -55507 24415 86791
7748 86791 94213 48197 40305 99299 110517 53567 19577 -34844 -84786 -38715 11063 6893
7736 6893 47214 44721 -43177 -61123 -55477 7512 58975 18627 -21532 1635 62565 92152
7724 92152 85537 57258 2540 9984 30056 27317 52155 92424 85211 45068 -44335 -49241 -8647
7711 -8647 24226 25529 55853 84626 106523 115008 128658 125173 130612 18657 4200 25917 30034
7698 30034 -3184 -10034 -9700 -35301 37539 43359 49221 82247 36826 -46199 -43227 11233 40576
7685D0576J3380m533j1662L5552p883m2922m2708L2055r915J560k2280j643k868
7672b3291p6949j1625j5518J3348Q1621M9879k1857j4786m114N020j3633N447
7660b6458j1784k3578K6474P0618K1017P212P373p1893n2558L6729L0448J1195
7648B4795P418L3971Q717j9295n023L5294l7563q2619l064J3058J0008N3292R744
7635D8733l8943j0997r421J9746L2465j4334k6029j2200o2389N3312K4484m8563
7623d4136J5566L1774j8403J096l4455J1360N8299O0851k6541p4878J1717k5705
7611c3455M781l3047l7191O0788K7512j9616l4584k4892M7843J2262O101N196
7599a8302N779L4811L7622j2911K5785l619K9890j1188m5501m3367M779j5536
$$ plain form
7685 40576 53956 49423 37761 73313 65430 22508 -20200 11855 1940 3500 -18780 -20423 -23291
7672 -23291 -100240 -111865 -127383 -114035 -32414 17465 -4392 -19178 -23292 -18272 -31905 -26458
7660 -26458 -38242 -61820 -35346 35272 56289 63501 70874 -1019 -53577 -16848 13600 24795
7648 24795 32213 66184 74901 55606 50583 85877 48314 -34305 -37369 -24311 -14303 38989 48733
7635 48733 9790 -1207 -10628 9118 41583 27249 1220 -10980 -73369 -20057 4427 -44136
7623 -44136 -28570 3204 -15199 -14103 -48558 -37198 21101 81952 55411 -19467 -7750 -33455
7611 -33455 -28674 -61721 -98912 -38124 -10612 -30228 -64812 -89704 -41861 -29599 -23498 -18302
7599 -18302 -12523 22288 59910 46999 72784 69165 99055 87867 42366 -1001 3778 -11758
7587a1758j5242M2815L1715J4581k9610M325L9560L0202l5348k6736L0295o0711
7575A4088j7521P2362O2887l7759k0149j8030k8557K9051m466k8626R622J923
7563C4825J095k8484k7980j2572M995L0351R139j6950m604n1492L4097K2867J4349
7550I636l132q2K0090M4333K5447m2472n0130J1254k1587m011j3051l4208P266
7537e0647J8877J1592K6143l2541m6949N5295K0278l6501j0504K1398M3308M3415
7525F3164K4769j9429R959o4081j0672j8116L4712l92l1355J4071j7547p786j178
7512b3881o754m4418m5315j2375M8861Q1262L4673M0298J6750l691K4060k579
7500A06891l8538n0854K4766O3279l2515K288K724n7099M1958M573j7823k4182
$$ plain form
7587 -11758 -27000 15815 47530 62111 32501 36826 76386 106588 71240 44504 74799 14088
7575 14088 -3433 68929 131816 94057 73908 55878 27321 56372 51906 23280 32902 34825
7563 34825 35920 7436 -20544 -33116 -28121 2230 11369 -5581 -10185 -61677 -27580 -4713 9636
7550 9636 6504 6422 26512 70845 96292 53820 3690 14944 -6643 -10654 -23705 -57913 -50647
7537 -50647 -31770 -20178 5965 -26576 -73525 -18230 2048 -34453 -44957 -23559 19749 63164
7525 63164 87933 68504 78463 14382 3710 -14406 20306 19914 -11441 2630 -14917 -22703 -23881
7512 -23881 -30635 -75053 -120368 -132743 -83882 -2620 32053 72351 89101 85410 109470 106891
7500 106891 68353 17499 42265 105544 73029 75317 78041 20942 62900 67473 49650 25468
7488B5468q3071J6115N2897L2941n692O399K2253L319j4874M2363L7712m4163
7476I1667r5337L596M5413k0286J105j9487o2172l0130R57R0523K3101r294K1085
7463D0741J3854l3906k5799J33k2690j8813P47j6320O061K3321J01091O3262K4029
7450A55711o6261l1317K9570p391k1720k3751p2483L7515J3240j5802m4410K0376
7438b6723o9541n3959N202J1304j1672K2831M5032K8313P170N1923N5131k9712
7426C5299L18p387j9966n8108n7061O1132K8477l11l5354l7872K6072O626O5448
7413G313m5654l134k031K761j2464K1990J03983N8331N257k2901m9950o4306k6278
7400b7083K8250m5037J2726L2166m5586J2535M8787k2036k2308K4088m4388Q3190
$$ plain form
7488 25468 -57603 -41488 11409 44350 38658 45057 67310 70629 55755 98118 135830 91667
7476 91667 -3670 -74 45339 25053 26158 6671 -55501 -85631 -84674 5849 28950 19656 40741
7463 40741 54595 20689 -5110 -4977 -27667 -46480 -45733 -62053 -55992 -32671 68420 131682 155711
7450 155711 89450 58133 87703 80312 58592 34841 -37642 -127 13113 -2689 -47099 -26723
7438 -26723 -96264 -150223 -145021 -133717 -145389 -122558 -77526 -49213 -42043 9880 65011 35299
7426 35299 35617 28230 8264 -49844 -106905 -45773 -17296 -17607 -52961 -90833 -64761 -58135 7313
7413 7313 -38341 -41475 -43506 -40745 -53209 -31219 72764 131095 136352 113451 63501 -805 -27083
7400 -27083 1167 -43870 -31144 1022 -44564 -32029 16758 -5278 -27586 -3498 -47886 35304
7388C5304K9712m4827J5648j2910l4335M659J3348P114P762m5245n0202j2290
7376h6262M9376N3060P752n4700j9803j4229M6692M0212J1791m4090k1583j0450
7364d2234M5290M9715j4743n5295n2978N4631M6156J4440K66m6382l080k7605
$$ plain form
7388 35304 65016 20189 35837 22927 -11408 -6749 6599 13713 21475 -23770 -73972 -86262
7376 -86262 -36886 16174 23926 -30774 -50577 -64806 -18114 22098 33889 -10201 -31784 -42234
7364 -42234 3056 52771 38028 -17267 -70245 -15614 30542 44982 45248 -1134 -4214 -31819
$$ [...]
##END NTUPLES=NMR SPECTRUM
##END=
