##TITLE=Analysis number 330369
Compound Code cc 04901
Book Reference 546/62
Project Code adrs
Chemist Name craigr
##JCAMPDX= 6.0         $$ Bruker NMR JCAMP-DX V2.0
##DATA TYPE= NMR SPECTRUM
##DATA CLASS= NTUPLES
##ORIGIN= Bruker BioSpin GmbH
##OWNER= nmr
$$ XWIN-NMR		Version 3.5
$$ Mon Nov 19 12:44:30 2007 GMT Standard Time (UT+0h)  MAYBRIDGE\nmr@NMR_250MHZ
##.OBSERVE FREQUENCY= 250.131544655141
##.OBSERVE NUCLEUS= ^1H
##.ACQUISITION MODE= SIMULTANEOUS (DQD)
##.ACQUISITION SCHEME= undefined
##.AVERAGES= 16
##.DIGITISER RES= 18
##SPECTROMETER/DATA SYSTEM= dpx250
##.PULSE SEQUENCE= zg30
##.SOLVENT NAME= DMSO
##.SHIFT REFERENCE= (INTERNAL, DMSO, 0, 16.522)
##AUDIT TRAIL= $$ (NUMBER, WHEN, WHO, WHERE, WHAT)
$$ ##TITLE= Audit trail, XWIN-NMR		Version 3.5
$$ ##JCAMPDX= 5.01
$$ ##ORIGIN= Bruker BioSpin GmbH
$$ ##OWNER= nmr
$$ C:\u/data/dgb/nmr/ADRS/1830/pdata/1/auditp.txt
$$ ##AUDIT TRAIL=  $$ (NUMBER, WHEN, WHO, WHERE, WHAT)
(   1,<2007-11-19 12:43:46.11 +000>,<MAYBRIDGE\nmr>,<NMR_250MHZ>,
      <created by zg, POWCHK disabled, PULCHK disabled
       configuration hash MD5:
       76 6E 9A 78 1E 09 19 81 EC 84 63 8F B0 6A 59 2D
       data hash MD5: 64K
       B4 62 A4 96 0D A2 85 BD 89 02 DC 81 3B 45 8C EC>)
(   2,<2007-11-19 12:44:08.39 +000>,<MAYBRIDGE\nmr>,<NMR_250MHZ>,
      <Start of raw data processing
       ef LB = 0.3 FT_mod = 6 PKNL = 1 SI = 32K 
       data hash MD5: 32K
       2B 44 E5 90 BD 7C 8B 33 DB 3A 49 14 F9 22 C3 BD>)
(   3,<2007-11-19 12:44:11.04 +000>,<MAYBRIDGE\nmr>,<NMR_250MHZ>,
      <apk 
       data hash MD5: 32K
       45 4B 24 07 5D 10 92 38 A2 FA C6 AA 92 2E AE 2B>)
(   4,<2007-11-19 12:44:12.42 +000>,<MAYBRIDGE\nmr>,<NMR_250MHZ>,
      <abs ABSG = 5 
       data hash MD5: 32K
       3F A1 75 0C 15 CD 5E C1 EB 14 05 26 6F 7F DF 8F>)
$$ ##END=
$$ 
$$ hash MD5
$$ C6 7C 27 33 88 95 4E B2 70 D0 C2 8C 45 18 55 75
##$RELAX= 
##$RELAX= 
##$RELAX= 
##$RELAX= 
##$RELAX= 
##$RELAX= 
##$RELAX= 
$$ Bruker specific parameters
$$ --------------------------
##$DU= <C:\u>
##$EXPNO= 1830
##$NAME= <ADRS>
##$PROCNO= 1
##$TYPE= <nmr>
##$USER= <dgb>
##$AMP= (0..31)
100 100 100 100 100 100 100 100 100 100 100 100 100 100 100 100 100 100 
100 100 100 100 100 100 100 100 100 100 100 100 100 100 
##$AQSEQ= 0
##$AQ_mod= 3
##$AUNM= <au_zg>
##$AUTOPOS= <32 >
##$BF1= 250.13
##$BF2= 250.13
##$BF3= 250.13
##$BF4= 250.13
##$BF5= 500.13
##$BF6= 500.13
##$BF7= 500.13
##$BF8= 500.13
##$BYTORDA= 1
##$CFDGTYP= 0
##$CFRGTYP= 5
##$CHEMSTR= <none>
##$CNST= (0..31)
1 1 145 1 1 1 1 1 1 1 1 1 1 1 1 1 1 1 1 1 1 1 1 1 1 1 1 1 1 1 1 1 
##$CPDPRG= <>
##$CPDPRG1= <>
##$CPDPRG2= <>
##$CPDPRG3= <>
##$CPDPRG4= <mlev>
##$CPDPRG5= <mlev>
##$CPDPRG6= <mlev>
##$CPDPRG7= <mlev>
##$CPDPRG8= <mlev>
##$CPDPRGB= <>
##$CPDPRGT= <>
##$D= (0..31)
0 1 0 0 0 0 0 0 0 0.06 0 0 0 0 0 0 0.0002 0 0 0 0 0 0 0 0 0 0 0 0 0 0 
0 
##$DATE= 1195476223
##$DBL= (0..7)
120 120 120 120 120 120 120 120 
##$DBP= (0..7)
150 150 150 150 150 150 150 150 
##$DBP07= 0
##$DBPNAM0= <>
##$DBPNAM1= <>
$$ [...]
##$SUBNAM7= <"">
##$SUBNAM8= <"">
##$SUBNAM9= <"">
##$SW= 20.6930455092707
##$SWIBOX= (0..15)
0 0 3 0 0 0 0 0 0 0 0 0 0 0 0 0 
##$SW_h= 5175.983436853
##$TD= 65536
##$TD0= 1
##$TE= 295.16
##$TE2= 300
##$TE3= 300
##$TEG= 300
##$TL= (0..7)
0 120 120 120 120 120 120 120 
##$TP= (0..7)
150 150 150 150 150 150 150 150 
##$TP07= 0
##$TPNAME0= <>
##$TPNAME1= <>
##$TPNAME2= <>
##$TPNAME3= <>
##$TPNAME4= <>
##$TPNAME5= <>
##$TPNAME6= <>
##$TPNAME7= <>
##$TPOAL= (0..7)
0.5 0.5 0.5 0.5 0.5 0.5 0.5 0.5 
##$TPOFFS= (0..7)
0 0 0 0 0 0 0 0 
##$TUNHIN= 0
##$TUNHOUT= 0
##$TUNXOUT= 0
##$USERA1= <user>
##$USERA2= <user>
##$USERA3= <user>
##$USERA4= <user>
##$USERA5= <user>
##$V9= 5
##$VALIST= <valist>
##$VCLIST= <CCCCCCCCCCCCCCC>
##$VD= 0
##$VDLIST= <DDDDDDDDDDDDDDD>
##$VPLIST= <PPPPPPPPPPPPPPP>
##$VTLIST= <TTTTTTTTTTTTTTT>
##$WBST= 1024
##$WBSW= 4
##$XGAIN= (0..3)
0 0 0 0 
##$XL= 0
##$YL= 0
##$YMAX_a= 269018
##$YMIN_a= -291326
##$ZGOPTNS= <>
##$ZL1= 120
##$ZL2= 120
##$ZL3= 120
##$ZL4= 120
##$ABSF1= 16.522
##$ABSF2= -4.171173
##$ABSG= 5
##$ABSL= 3
##$ALPHA= 0
##$AQORDER= 0
##$ASSFAC= 0
##$ASSFACI= 0
##$ASSFACX= 0
##$ASSWID= 0
##$AUNMP= <proc_1d>
##$AZFE= 0.1
##$AZFW= 0.1
##$BCFW= 0
##$BC_mod= 0
##$BYTORDP= 0
##$COROFFS= 0
##$CY= 12.5
##$DATMOD= 1
##$DC= 0
##$DFILT= <>
##$DTYPP= 0
##$F1P= 14.0000005364418
##$F2P= -0.99999901652339
##$FCOR= 0.5
##$FTSIZE= 32768
##$FT_mod= 6
##$GAMMA= 0
##$GB= 0
##$INTBC= 1
##$INTSCL= 1
##$ISEN= 128
##$LB= 0.3
##$LEV0= 0
##$LPBIN= 0
##$MAXI= 10000
##$MC2= 0
##$MEAN= 0
##$ME_mod= 0
##$MI= 0
##$NCOEF= 0
##$NC_proc= -4
##$NLEV= 6
##$NOISF1= 0
##$NOISF2= 0
##$NSP= 0
##$NTH_PI= 0
##$NZP= 0
##$OFFSET= 16.522
##$PC= 1
##$PHC0= 164.2097
##$PHC1= 7.930902
##$PH_mod= 1
##$PKNL= yes
##$PPARMOD= 0
##$PSCAL= 4
##$PSIGN= 0
##$REVERSE= no
##$SF= 250.13
##$SI= 32768
##$SIGF1= 0
##$SIGF2= 0
##$SINO= 400
##$SIOLD= 32768
##$SREGLST= <1H.DMSO>
##$SSB= 0
##$STSI= 32768
##$STSR= 0
##$SW_p= 5175.98343685301
##$SYMM= 0
##$S_DEV= 0
##$TDeff= 65536
##$TDoff= 0
##$TI= <Analysis number 999999
Compound Code 99
Book Reference 9
Project Code 9>
##$TILT= no
##$TM1= 0
##$TM2= 0
##$TOPLEV= 0
##$USERP1= <user>
##$USERP2= <user>
##$USERP3= <user>
##$USERP4= <user>
##$USERP5= <user>
##$WDW= 1
##$XDIM= 32768
##$YMAX_p= 330141590
##$YMIN_p= -403198
$$ End of Bruker specific parameters
$$ ---------------------------------
##NTUPLES= NMR SPECTRUM
##VAR_NAME=  FREQUENCY,     SPECTRUM/REAL,   SPECTRUM/IMAG
##SYMBOL=    X,             R,               I
##VAR_TYPE=  INDEPENDENT,   DEPENDENT,       DEPENDENT
##VAR_FORM=  AFFN,          ASDF,            ASDF
##VAR_DIM=   32768,         32768,           32768
##UNITS=     HZ,            ARBITRARY UNITS, ARBITRARY UNITS
##FACTOR=    0.157963299565203, 1,           1
##FIRST=     4132.6476996994, 0,             0
##LAST=      -1043.33573715361, 0,           0
##MIN=       -1043.33573715361, -403198,     0
##MAX=       4132.6476996994, 330141590,     0
$$ Real data points
##PAGE= N=1
##DATA TABLE= (X++(R..R)), XYDATA
$$ [...]
16058A07833j9882l8621n9285j991m8298j4769N8040J3636Q481N6793P9763N2782
$$ 107833 87951 49330 -9955 -11946 -60244 -75013 -16973 -3337 5144 61937 141700 194482
16046A94482r9017K1108q195m0320k6161J9401n0425m2631J20325Q2310o3686
$$ 194482 95465 116573 108378 68058 41897 61298 10873 -31758 88567 170877 107191
16035A07191q9196k2615j3331L7213j1513j46004k9088M8636l341n090J9679n8805
$$ 107191 17995 -4620 -17951 19262 7749 -138255 -167343 -118707 -122048 -127138 -107459 -166264
16023a66264P4600J91568k5175j19018j35109P829L5503l6121M8261R8382j8564
$$ -166264 -91664 99904 74729 -44289 -179398 -171569 -136066 -172187 -123926 -25544 -44108
16012d4108k8442O929K0266R0312J396j01950o5982P9400K0593n0164l1959L6669
$$ -44108 -72550 -65621 -45355 44957 46353 -55597 -121579 -42179 -21586 -71750 -103709 -67040
16000f7040P124j734j791M4599M1724O5641q451j26120K1840Q3369n0717K7376
$$ -67040 -59916 -61650 -63441 -18842 22882 88523 80072 -46048 -24208 59161 8444 35820
15988C5820J9701p1135n6431P4597L221k4947j1104M8949k6402J3359r3669m8372
$$ 35820 55521 -15614 -72045 2552 5773 -19174 -30278 18671 -7731 5628 -88041 -136413
15976a36413K5431q978j09737m128Q2619R5528j0624k9319n0276o490l1118k9045
$$ -136413 -110982 -119960 -229697 -233825 -151206 -55678 -66302 -95621 -145897 -152387 -183505 -212550
15964b12550M0705n09k6376N2788Q5118J13274R2363m3607o1725o4695M2698R1738
$$ -212550 -171845 -172354 -198730 -145942 -60824 52450 144813 101206 39481 -25214 17484 109222
15952A09222r2667r0924J7784N8296r6544p7399Q8268P5457O254n1452j10587
$$ 109222 16555 -74369 -56585 1711 -94833 -172232 -83964 -8507 -2253 -53705 -164292
15941a64292L9033J21793P9605o418j24777n5062j3053M3393K9730o5773k7531
$$ -164292 -125259 -3466 76139 69721 -55056 -110118 -123171 -79778 -50048 -115821 -143352
15930a43352O3732L2650Q3458o653k651j0015m5680r0346m6326P3400J01908K6595
$$ -143352 -79620 -46970 36488 29835 27184 17169 -28511 -118857 -165183 -91783 10125 36720
15918C6720R564j8159M657L7167N980J4357o8516Q6356M5216r6603j18758J555
$$ 36720 46284 28125 32782 69949 75929 90286 21770 108126 153342 56739 -62019 -60464
15906f0464k5617J4339J14813m4610m1214k1145K0900J3599j08416L3295R1022
$$ -60464 -86081 -71742 43071 -1539 -42753 -63898 -42998 -29399 -137815 -104520 -13498
15895a3498n9703p3206j620J40619K0461J0897k9591O2216j5098q4266O7793o3738
$$ -13498 -73201 -146407 -148027 -7408 13053 23950 -5641 56575 41477 -42789 25004 -38734
15883c8734p8417N271K611P0575J6164l7155m7936l3057k2180m527J27465R6076
$$ -38734 -117151 -111880 -109269 -38694 -22530 -59685 -107621 -140678 -162858 -167385 -39920 56156
15871E6156j0193m0334Q3679j3254j39792o2754j5767N7688M0919q4938k2808
$$ 56156 45963 5629 89308 76054 -63738 -126492 -142259 -84571 -43652 -128590 -151398
15860a51398k379n4202K4647P9784J5171L7545q9298q3360l4716N0661M9470O8495
$$ -151398 -153777 -207979 -183332 -103548 -88377 -50832 -140130 -223490 -258206 -207545 -158075 -89580
15848h9580Q1515P8612M3275l5630m9592L1653N1602J8333n3525p6129j4920n3625
$$ -89580 -8065 70547 113822 78192 28600 60253 111855 130188 76663 534 -14386 -68011
15836f8011K6593O7231O213P2206N1800M7709j6017j81877r1031m6010n019O9875
$$ -68011 -41418 25813 32026 104232 156032 203741 187724 5847 -85184 -131194 -136213 -66338
15824f6338J16533J03508r2597r0534K1350l7631r2002l7862J72284J26617L2191
$$ -66338 50195 153703 61106 -29428 -8078 -45709 -137711 -175573 -3289 123328 155519
15813A55519n4497J1489o4678J0249J4170j19073M1614M9713r0280R623J6662
$$ 155519 101022 112511 47833 58082 72252 -46821 -5207 44506 -45774 -36151 -19489
15802a9489r3183O7253J0080n491L3023J01234O0556j01064J2437j16710m4019
$$ -19489 -112672 -45419 -35339 -40830 -7807 93427 153983 52919 65356 -51354 -95373
15791i5373N6531l3958r903R3455k7408o9280M7948Q9384j24129k8541J3082o9047
$$ -95373 -38842 -72800 -82703 10752 -16656 -85936 -37988 51396 -72733 -101274 -88192 -157239
15779a57239k6884J3376P675K0597J73463J41948N4377P325j02527o9731r3816
$$ -157239 -184123 -170747 -163072 -142475 30988 172936 227313 234638 132111 62380 -31436
15768c1436q0469r404k1077j04065N1213J03860N4408p7862k2905K4141R9281
$$ -31436 -111905 -121309 -142386 -246451 -195238 -91378 -36970 -114832 -137737 -113596 -14315
15757a4315Q5759J4140R0295L1945k7168j5491j32647j00339k2098l9327K8792
$$ -14315 71444 85584 175879 207824 180656 165165 32518 -67821 -89919 -129246 -100454
15746a00454r411j2204M0933J5838Q8797M6956j22102J09332o864p8886o5251
$$ -100454 -109865 -122069 -81136 -65298 23499 70455 -51647 57685 50821 -28065 -93316
15735i3316M252J5645N0390L258K2112j06137K7662N5304N5835o4359N517K6585
$$ -93316 -89064 -73419 -23029 -19771 2341 -103796 -76134 -20830 35005 -29354 -23837 2748
15723B748k9484K6676l576p369m7831j038K519n0871l9938j31127Q047M9313p5929
$$ 2748 -26736 -60 -3636 -11005 -58836 -59874 -57355 -108226 -148164 -279291 -271244 -221931 -297860
15710b97860L467L0414J39375L9463J28410O8917r2529K88J7339J0642Q5455P5611
$$ -297860 -294393 -263979 -124604 -85141 43269 112186 19657 19945 37284 47926 133381 208992
15698B08992j82875r9420Q817n2935K8724N3716R6270m567j29211j31741M2386
$$ 208992 26117 -73303 -64486 -117421 -88697 -34981 61289 56722 -72489 -204230 -161844
15687a61844J24853K7361L9592j7331R014q1447q098J12935J32316M227o1442
$$ -161844 -36991 -9630 29962 12631 21645 -59802 -67900 45035 177351 181578 120136
15676A20136n4453n4350m3257K9238O6010K7531m6447q5311n7188n7146J11256
$$ 120136 65683 11333 -31924 -2686 63324 90855 44408 -40903 -98091 -155237 -43981
15665d3981L2959k5899L5737k465O6971o0645m7159J5953r358M1047L660j5946
$$ -43981 -11022 -36921 -1184 -3649 63322 2677 -44482 -28529 -37887 3160 6820 -9126
15653i126J0172J12417n488j16636o2903m1516p4941N4272J41920R7845J2563
$$ -9126 1046 113463 107975 -8661 -71564 -113080 -188021 -133749 8171 106016 118579
15642A18579k6259j28427l9957o766M5072Q157j2945J6540j19027j8393J09872
$$ 118579 92320 -36107 -76064 -82830 -37758 -29601 -42546 -26006 -145033 -163426 -53554
15631e3554J42482K9524n9862j20391o5834K92N7264P5968O3921M6474K2912k7356
$$ -53554 88928 118452 58590 -61801 -127635 -127343 -70079 5889 69810 116284 139196 111840
15619A11840p3668O2009O40Q5678q7648j36531N3773L5858k235J1818q6415j01487
$$ 111840 38172 100181 100821 186499 98851 -37680 16093 51951 49716 61534 -24881 -126368
15607a26368j9830J609Q2848k6707K4989J9028K4843l5010j04229k3748L0596
$$ -126368 -146198 -144589 -61741 -88448 -63459 -44431 -19588 -54598 -158827 -182575 -151979
15596a51979m0573m7233M8620J15075N6491m1262r1622l1670l6873J1186O717
$$ -151979 -192552 -239785 -191165 -76090 -19599 -60861 -152483 -184153 -221026 -209840 -203123
15585b03123N0517R6144J24542n5931N7603l9782L4666J19285m8971J3236p8231
$$ -203123 -152606 -56462 68080 12149 69752 29970 64636 183921 134950 148186 69955
15574F9955o0401O4546m3058q0202p7148j8584J18485J28077l9810o0860M3240
$$ 69955 9554 74100 31042 -49160 -126308 -144892 -26407 101670 61860 1000 44240
15563D4240O4229r5454j17382o58J2132J12934K0607q645M7787j0393k0307k0456
$$ 44240 108469 13015 -104367 -105025 -92893 20041 40648 32003 79790 69397 49090 28634
15551B8634k3026m9061K4433Q6776o4171m6462p1778l1472K766r473R8412L8454
$$ 28634 5608 -43453 -19020 67756 3585 -42877 -114655 -146127 -143361 -152834 -54422 -15968
15539a5968o5050m1596K9023m5090P1344M1737O5140O5560J4220K5162l280K3209
$$ -15968 -81018 -122614 -93591 -138681 -67337 -25600 39540 105100 119320 144482 141202 164411
15527A64411l0777j44663j29261K5741P0593O6263M1812J12478m8782j64446P9186
$$ 164411 133634 -11029 -140290 -114549 -43956 22307 64119 176597 127815 -36631 42555
15516D2555l8013j3711r2184L0754k6080K8651o7040o2124O5465L0007l0136L8197
$$ 42555 4542 -9169 -101353 -70599 -96679 -68028 -135068 -197192 -131727 -101720 -131856 -93659
15504i3659J6511q3327n7874j4520K4425N9975M8814j8646m9594J2056J03027
$$ -93659 -77148 -160475 -218349 -232869 -208444 -148469 -99655 -118301 -167895 -155839 -52812
15493e2812J32179m6313K6612m6553l4855q0501m1622J10796m7081o928l8279
$$ -52812 79367 33054 59666 13113 -21742 -102243 -143865 -33069 -80150 -87078 -125357
15482a25357l707J10767N2181k7042p2852J1698J54039J1672j01973o8265j0669
$$ -125357 -129064 -18297 33884 6842 -66010 -54312 99727 111399 9426 -58839 -69508
15471f9508P1308K7915O075q1005j7272L3636M4805N8421o2716j55162j4267N417
$$ -69508 1800 29715 35790 -45215 -62487 -28851 15954 74375 11659 -143503 -157770 -152353
15459a52353q857R559R1884J28028O5055m1839m3713O9372p891j4223m0189P3141
$$ -152353 -161210 -151651 -59767 68261 133316 91477 47764 117136 109245 95022 54833 127974
15447A27974n3569n8741p893j42014J0910K9180Q1774J55564n84l280o5590j05114
$$ 127974 74405 15664 7771 -134243 -123333 -94153 -12379 143185 142601 139321 73731 -31383
15435c1383p7501n2940N1908k7751l9403L6542Q3607M7188j33311r649L550J25725
$$ -31383 -108884 -161824 -109916 -137667 -177070 -140528 -56921 -9733 -143044 -152693 -149143 -23418
15423b3418M1608j15822l1406R529j5801N9551P5228N8092k7804m4035n7712J5167
$$ -23418 18190 -97632 -129038 -119509 -135310 -75759 -531 57561 29757 -14278 -71990 -56823
15411e6823j9987N4495K5856J1659n1660j08636N955M0140J1567O919o7047K6532
$$ -56823 -76810 -22315 3541 15200 -36460 -145096 -139141 -99001 -87434 -80515 -147562 -121030
15399a21030M2744O2168J06316q9760k8469J4109j2217j4108l0455L7374p413
$$ -121030 -78286 -16118 90198 438 -28031 -13922 -26139 -40247 -70702 -33328 -40741
15388d0741N4429j4844q9514J373O0397k1102k3043q414m3491o0362O8659P2094
$$ -40741 13688 -1156 -90670 -89297 -28900 -50002 -73045 -81459 -124950 -185312 -116653 -44559
15376d4559N4143Q0587p3792r2014M9687Q8880m4677n0103J8022P6251J7303p2322
$$ -44559 9584 90171 16379 -75635 -25948 62932 18255 -31848 -13826 62425 79728 7406
15364G406o4769M647N4879J17094Q058l7693j80963L6304O534K2312j8478j3181
$$ 7406 -57363 -52716 2163 119257 127315 89622 -91341 -55037 -48503 -26191 -44669 -57850
15352e7850n7058m4234K5099N186k3046Q994N1290O9992R14n6568J03855m8148
$$ -57850 -114908 -159142 -134043 -128857 -151903 -142909 -91619 -21627 -20713 -77281 26574 -21574
15340b1574m9370k827k9600M3688n851l2442J12839J20033P0702M1913q1778p2232
$$ -21574 -70944 -73771 -103371 -59683 -65534 -97976 14863 134896 205598 247511 165733 93501
15328I3501m0992N5781K9092n3841q7616P6309J14531O113r8097r1877j3794p9630
$$ 93501 52509 108290 137382 83541 -4075 72234 186765 192878 94781 2904 -10890 -90520
15316i0520k0636P6013J13077K2794k7241L636m7415N356r8278J03318L1758r0933
$$ -90520 -111156 -35143 77934 100728 73487 77123 29708 35064 -63214 40104 71862 -19071
15304a9071o7743o4843j0145N9372O5451K7785k2397j905j03172q470J58666R5820
$$ -19071 -86814 -151657 -161802 -102430 -36979 -9194 -31591 -33496 -136668 -145138 13528 109348
15292A09348j27845j8978o5738m2147q4012J4085J04988o1713j3657K8317j5339
$$ 109348 -18497 -37475 -103213 -145360 -229372 -215287 -110299 -172012 -185669 -157352 -172691
15281a72691J09690K0197O7171j3752n0102L2751k7605K3771j02440l9915J6426
$$ -172691 -63001 -42804 24367 10615 -39487 -6736 -34341 -10570 -113010 -152925 -136499
15270a36499J3259j3344l0285P1957J40994q311n090q2833o6070O6902R5000r241
$$ -136499 -123240 -136584 -166869 -94912 46082 37771 32681 -50152 -116222 -49320 45680 36439
15258C6439j01484p1799r906N0042J54857k6890j1061R927q3423n1394j10151
$$ 36439 -65045 -136844 -146750 -96708 58149 31259 20198 30125 -53298 -104692 -214843
15247b14843l0760L2886L0237Q190R0404m6601k9239N1649P0776M837R6163l3326
$$ -214843 -245603 -212717 -182480 -174290 -83886 -130487 -159726 -108077 -37301 -32464 63699 30373
15235C0373j16372R3404O5550J9249l2657K2302j4928j1190m5482j6882k9417
$$ 30373 -85999 7405 72955 92204 59547 81849 66921 55731 10249 -6633 -36050
15224c6050k7336k7547N417N7941K6224J49607Q9107j09040j00546n3392K8045
$$ -36050 -63386 -90933 -85516 -27575 -1351 148256 237363 128323 27777 -25615 2430
15213B430O7539N7762M1048J2391J6964n8998j18202j3725o4484j10491n36J22836
$$ 2430 69969 127731 168779 181170 198134 139136 20934 7209 -57275 -167766 -168302 -45466
15201d5466L7626l4050M555N4990k1405J7108q5779m9054J13393Q40l5473j2210
$$ -45466 -7840 -41890 -37335 17655 -3750 13358 -72421 -121475 -8082 -7242 -42715 -54925
15189e4925L6202O065k0786K8052R9772K0317l8936r8440p6130k5019q0884L8529
$$ -54925 -18723 -12658 -33444 -5392 94380 114697 75761 -22679 -98809 -123828 -204712 -166183
15177a66183M1234p3846O1629K0862n8278O6874J32656Q5202p7267n0281j2326
$$ -166183 -124949 -198795 -137166 -116304 -174582 -107708 24948 110150 32883 -17398 -29724
15166b9724P5387M412k1249o0041m5253m1960J32472J3265k8681j6396L6661K9062
$$ -29724 45663 50075 28826 -31215 -76468 -118428 14044 27309 -1372 -17768 18893 47955
15154D7955j27789j626J4503n1632l8224K2314M3524k0988J4436N8444k6128j171
$$ 47955 -79834 -81460 -66957 -118589 -156813 -134499 -90975 -111963 -97527 -39083 -65211 -66382
15142f6382j5198o44p5651L3394J9095n4140P007J02634P681n5129J4130K7326
$$ -66382 -81580 -82224 -157875 -124481 -105386 -159526 -152519 -49885 -42204 -97333 -83203 -55877
15130e5877Q131k8739K0499Q8054p8366q6919R7759J25835j35418p0920Q2279
$$ -55877 -47746 -76485 -55986 32068 -46298 -133217 -35458 90377 -45041 -115961 -33682
15119c3682O3339k5642K2374j4725l7824m7648n2264l1153K9421K726J11575P1434
$$ -33682 29657 4015 26389 11664 -26160 -73808 -126072 -157225 -127804 -125078 -13503 57931
15107E7931j8514M2115r2423p8726O0592l1332l5585K2085O0361Q2249J27059
$$ 57931 39417 81532 -10891 -89617 -29025 -60357 -95942 -73857 -13496 68753 195812
15096A95812j8485Q844J915m4229o1600m7281r507K9638k196k403K100j2895p8245
$$ 195812 177327 186171 188086 143857 82257 34976 25469 55107 52911 50508 52608 39713 -38532
15083c8532O2848P0000l9961N797J2358r9240p2353j6029M100k5949K6837q965
$$ -38532 24316 94316 54355 60152 72510 -26730 -99083 -115112 -111012 -136961 -110124 -119089
15071a19089j2927n8974K7491Q2131O7160O2475K2856k894J656N1749k5355m0005
$$ -119089 -132016 -190990 -163499 -81368 -14208 48267 71123 68229 69885 121634 96279 56274
15059E6274K2004P488r6750k8518L4239n073O2305L8750k7380J8642k9660j3654
$$ 56274 78278 85766 -10984 -39502 -5263 -10336 51969 90719 63339 81981 52321 38667
15047C8667k3765n9094J8672K5488L4676l324m3715j27197k6639R7663p60o7685
$$ 38667 14902 -44192 -25520 -32 34644 31320 -12395 -139592 -166231 -68568 -69328 -137013
15035a37013J0264L7330r9918J04121N8549J4309p19p3856K3691j7003Q0349l7585
$$ -137013 -126749 -89419 -189337 -85216 -26667 -12358 -13077 -86933 -63242 -80245 104 -37481
15023c7481j16532j6272m2064P3355K9051n7990n5857p447O9025N3971k7554n26
$$ -37481 -154013 -170285 -212349 -138994 -109943 -167933 -223790 -231237 -162212 -108241 -135795 -136321
15011a36321j2610J02701O4207j995l6661m9710O9035K2231j8766L3110M3213
$$ -136321 -148931 -46230 17977 15982 -20679 -70389 -1354 20877 2111 35221 78434
15000G8434N800j39664m6611o1167N960K4431k2587j6391N0809k0525L9161M0173
$$ 78434 84234 -55430 -102041 -163208 -157248 -132817 -155404 -171795 -120986 -141511 -102350 -62177
14988f2177Q4576K3003j5039j217K514r3425N3506Q9264O909j0921o6107j6372
$$ -62177 22399 45402 30363 29146 31660 -61765 -8259 81005 87914 76993 10886 -5486
14976e486m6763m7467N9069n8817M448J16785J16812N1948n4896o3920P460l6926
$$ -5486 -52249 -99716 -40647 -99464 -95016 21769 138581 190529 135633 71713 79173 42247
14964D2247j7365l1767o0589l4906O3273p8843K172R9356N2298M3202j1908O6170
$$ 42247 24882 -6885 -67474 -102380 -39107 -117950 -115778 -16422 35876 79078 67170 133340
14952A33340Q0389j1089j60137j9796R7381k4216o7222j04386j0658m480J4301
$$ 133340 213729 202640 42503 22707 120088 95872 28650 -75736 -86394 -90874 -76573
14941g6573o3749l290L9319Q8469L7562k2509L2767n270J5941m6085j3129O1527
$$ -76573 -140322 -143612 -104293 -15824 21738 -771 31996 26726 42667 -3418 -16547 44980
14929D4980K8701L5772l6533m8857O9951P6853q5693j10289j20559j1360O2261
$$ 44980 73681 109453 72920 24063 94014 170867 85174 -25115 -145674 -157034 -94773
14918i4773l7528k8564k2103k6273M8173Q6158J6274q2381l274j08502K1712J11425
$$ -94773 -132301 -160865 -182968 -209241 -161068 -74910 -58636 -141017 -144291 -252793 -231081 -119656
14906a19656K6755J37056R804j4868N7623l5341j28322Q765L2043N4945P6116
$$ -119656 -92901 44155 53959 39091 96714 61373 -66949 -58184 -26141 28804 104920
14895A04920J1542p5384K2237J4574j9306O2885M4440j7103q3507J19332O746
$$ 104920 116462 41078 63315 77889 58583 121468 165908 148805 65298 184630 191376
14884A91376k7495P0217l8350j12122j89910j30987O949k1606o535M0039K7443
$$ 191376 163881 234098 195748 83626 -106284 -237271 -230322 -251928 -258463 -218424 -190981
14873a90981j5159O7216J18693n445k4306j2014K1182J1537q5040p1781M2799
$$ -190981 -206140 -138924 -20231 -25676 -49982 -61996 -40814 -29277 -114317 -186098 -143299
14862a43299l2761P4746J2252P4410n393N2735J639p0708k3613M7798L4187k2466
$$ -143299 -176060 -101314 -89062 -14652 -20045 32690 34329 -36379 -59992 -12194 21993 -473
14850d73P9537j5325J988K0019j07129n8637K3126M2826j0747q1045l4548O551
$$ -473 79064 63739 65727 85746 -21383 -80020 -56894 -14068 -24815 -105860 -140408 -133857
14838a33857m5728p7230Q198J92700J10562p1354L2593q2879J0184N3886j0968
$$ -133857 -179585 -256815 -248617 -55917 54645 -16709 15884 -66995 -56811 -2925 -13893
14827a3893O0305L1645n3855n0413l114M0086O0491j03816p661M584K3779j2702
$$ -13893 46412 78057 24202 -26211 -29325 10761 71252 -32564 -40225 -35641 -11862 -24564
14815b4564k0878M554J00953J21821j28081r9498K4320R9109n9000l1240l9685
$$ -24564 -45442 -40888 60065 181886 53805 -45693 -21373 77736 18736 -12504 -52189
14804e2189n990k373N7459Q3079M0851k1534l129o5478l2969k6261O7323P9848
$$ -52189 -58179 -60552 -3093 79986 120837 99303 96174 30696 -2273 -28534 38789 118637
14792A18637j74040j0442J71969J8559j04160q3053o5691J20387M1364l988l027
$$ 118637 -55403 -65845 106124 124683 20523 -62530 -128221 -7834 33530 29542 26515
14781B6515j2645k6313l6001m6935K5197J09191l824j5740M3942k3101o2345L2195
$$ 26515 13870 -12443 -48444 -95379 -70182 39009 35185 19445 63387 40286 -22059 10136
14769A0136M3373k203j9401k8772j8125j0528O3994J55607j03039K769L235R312
$$ 10136 53509 51306 31905 3133 -14992 -25520 38474 194081 91042 93811 97046 106358
14757A06358o012k1737r2044o6767j19646j2122J29665J00944Q5206o286j04517
$$ 106358 100346 78609 -13435 -80202 -199848 -211970 -82305 18639 103845 97559 -6958
14746f958j00073M9765k4369p4025l5599M9919O2402P7228O0689R927m848n9480
$$ -6958 -107031 -57266 -81635 -155660 -191259 -141340 -78938 -1710 58979 68906 64058 4578
14734D578k1378p1637k4995Q8509P8580P2413n6264O257N5552M9306m7888k0064
$$ 4578 -16800 -88437 -113432 -24923 53657 126070 69806 76063 131615 180921 133033 112969
14722A12969r495j3307l7933p4651l5341K1297j2558J5177j5935o6085K3292j3922
$$ 112969 103474 90167 52234 -22417 -57758 -36461 -49019 -33842 -49777 -115862 -92570 -106492
14710a06492l0827j9395M3346o552j9385K9563M6981J028P9702M1930m4607J36
$$ -106492 -137319 -156714 -113368 -119920 -139305 -109742 -62761 -61733 17969 59899 15292 15428
14698A5428j9672l050l5200n8770J2622N3762K1452k6131M8511M9896R0912j8767
$$ 15428 -4244 -7294 -42494 -101264 -88642 -34880 -13428 -39559 8952 58848 149760 130993
14686A30993n373k0621l4088j04894n0895J00575k5133K1098j2438J6604K8346
$$ 130993 125620 104999 70911 -33983 -84878 15697 -9436 11662 -776 15828 44174
14675D4174j5403P17L4744k7389M746o1782o6539P5481j1535j05411j17746K2749
$$ 44174 28771 29488 64232 36843 41589 -20193 -86732 -11251 -22786 -128197 -245943 -223194
14663b23194L9953J37122Q5295P2135P24q1309o8476K7729J8991l3810j9491m8650
$$ -223194 -183241 -46119 39176 111311 112035 30726 -37750 -10021 8970 -24840 -44331 -92981
14651i2981J8022k0792o993l9875l8110N7999J39479J9408q3488k2883O610o0227
$$ -92981 -74959 -95751 -102744 -142619 -180729 -122730 16749 36157 -47331 -70214 -63604 -123831
14639a23831R971J3642Q886K2572n128L771J3047K7735k2652j14587J65918L3361
$$ -123831 -113860 -100218 -91332 -68760 -73888 -70117 -57070 -29335 -51987 -166574 -656 32705
14627C2705N6109P2007L3409k0081q1871j7730p0340o5728N2599J10346m0371
$$ 32705 88814 160821 194230 174149 92278 74548 4208 -61520 -8921 101425 61054
14616F1054J1956j04196k6175N0348l2905l3945Q7313m3344n6652J043Q5157K17
$$ 61054 73010 -31186 -57361 -7013 -39918 -73863 13450 -29894 -86546 -85503 -346 -129
14604a29M463k0182m0889j7171k0356m1863n0210M1035R3052Q159M0022L4848
$$ -129 4334 -15848 -56737 -73908 -94264 -136127 -186337 -145302 -52250 -44091 -4069 30779
14592C0779l221o5151o0676O9197n2024L3589R4718J466L0738m5159j26127n6094
$$ 30779 27558 -37593 -98269 -29072 -81096 -47507 47211 48677 79415 34256 -91871 -147965
14580a47965J89935J32824n0046k6506Q7025P3465K3447j39182j05304N3294N0391
$$ -147965 41970 174794 124748 98242 185267 258732 282179 142997 37693 90987 141378
14569A41378l9796p191M5783l9647j25657k7043O8359k0663O0682J10518J85O868
$$ 141378 101582 94391 140174 100527 -25130 -52173 16186 -4477 56205 166723 166908 173776
14557A73776k1260J274j09856j17840L3885Q3040o3789j8043K2059J14586k2444
$$ 173776 152516 153790 43934 -73906 -40021 43019 -20770 -38813 -16754 97832 75388
14546G5388j11332l0484J31090m8879r9146O2067o1909m6039K768R4926k072N370
$$ 75388 -35944 -66428 64662 15783 -83363 -21296 -83205 -129244 -126476 -31550 -33622 -28252
14534b8252p704P7394P4605J9759r2103K8835K6708N4844J1541j19138j19499
$$ -28252 -35956 41438 116043 135802 43699 72534 99242 154086 165627 46489 -73010
14523g3010k935L3070M8090k8110n4127O7362K6994M308L5157j13199q2521Q0218
$$ -73010 -75945 -42875 5215 -22895 -77022 -9660 17334 21642 56799 -56400 -138921 -58703
14511e8703q678K9384L6358P3552k0266o0137n6112m5J20284N3542j1506l3851
$$ -58703 -67381 -37997 -1639 71913 51647 -8490 -64602 -64647 55637 109179 97673 63822
14499F3822K3379r2747M0426k1757l3490j20894n4231R0231J29651J21821j6981
$$ 63822 87201 -5546 34880 13123 -20367 -141261 -195492 -105261 24390 146211 129230
14488A29230q3054l7218k0647j1156j08327Q5900M6882N1089k9113q6632n983
$$ 129230 46176 8958 -11689 -22845 -131172 -45272 1610 52699 23586 -63046 -69029
14477f9029K5502j1040N3311K816J03658J04063N9978j49520j67858j3598Q2853
$$ -69029 -43527 -54567 -1256 1560 105218 209281 269259 119739 -48119 -61717 21136
14466B1136o7287l2765l8604J23987P4104J7288q5571J6252q268J209q9442N17
$$ 21136 -46151 -78916 -117520 6467 80571 97859 12288 28540 20272 21481 -67961 -67444
14454f7444Q7540l279K5380L4858K015j3348q4918m1000l5740r546K5455P6510
$$ -67444 20096 16817 42197 77055 79070 65722 -19196 -60196 -95936 -105482 -80027 -3517
14442c517o7570n5494q4540P730O0415N7172j555L8286M4613N4589n390O7272
$$ -3517 -71087 -126581 -211121 -203391 -142976 -85804 -87359 -49073 -4460 50129 44739 112011
14430A12011J0410N1038r8221n203K9061j5904K8232M8510o0106j53178j37608
$$ 112011 122421 173459 75238 70035 99096 83192 111424 159934 99828 -53350 -190958
14419a90958R2013O9647m60K233J2804j9999p2672J43441P2730p6885M2839q6132
$$ -190958 -98945 -29298 -29758 -27525 -14721 -34720 -107392 36049 108779 31894 74733 -11399
14407a1399j62884n7365K1039Q6916N1439R2477l4255j0146J9722L6897K79k8647
$$ -11399 -174283 -231648 -210609 -123693 -72254 20223 -14032 -24178 -4456 32441 32720 4073
14395D073j00715m8034J01039r8770J9359R6907J4895r567J1828K0051K4330M5078
$$ 4073 -96642 -144676 -43637 -142407 -123048 -26141 -11246 -20813 -8985 11066 35396 80474
14383H0474J28262m628q4666l8981r7540j23937O8234J43865k8652L788P4399
$$ 80474 208736 204108 119442 80461 -17079 -141016 -72782 71083 42431 46219 120618
14372A20618L6154N4999O430q8367k33o677j2273o1494o0268o4337p8016K7300
$$ 120618 156772 211771 218201 129834 129601 122924 110651 49157 -11111 -75448 -153464 -126164
14360a26164Q963M9926j5087K1455L5023l7342k049J5893n4293k0097K6059m355
$$ -126164 -117201 -67275 -82362 -60907 -25884 -63226 -65275 -49382 -103675 -123772 -97713 -102068
14348a02068m107k1953L3761K2992M9709q9665M3566J54333J07628o8847n9899
$$ -102068 -106175 -128128 -94367 -71375 -21666 -111331 -67765 86568 194196 125349 65450
14337F5450k8958n6295J9765L4828l4506l1465q9657l4288J6134j9520M5516J82380
$$ 65450 36492 -19803 -38 34790 284 -31181 -120838 -155126 -138992 -158512 -112996 69384
14325F9384L9496m9390q1151n6768o805O5286K9430k04314K2658J18914J8095
$$ 69384 108880 59490 -21661 -78429 -85234 -19948 9482 -194832 -172174 -53260 -35165
14314c5165J07341M6061q7044M046J9894m6429J13158R216j13499m3110k7177
$$ -35165 72176 118237 31193 35239 55133 8704 121862 131078 17579 -25531 -52708
14303e2708n9265N076J03419j04579o9635J69054L1365K1827J9920J1699j4076
$$ -52708 -111973 -106897 -3478 -108057 -177692 -8638 22727 44554 64474 76173 62097
14292F2097K161J12039n6230o7638O5218j3811j25806P990M5124o3397m7975J06824
$$ 62097 64258 176297 120067 52429 117647 103836 -21970 -13980 31144 -32253 -80228 26596
14280B6596l3940r3593M9213J1548L9999J7368j5182L4499N7001o0073l0899R553
$$ 26596 -7344 -100937 -51724 -40176 -177 17191 2009 36508 93509 33436 2537 12090
14268A2090M2330Q55L9162J5961N8621O003q7843j09531j6752J29600j1795j16380
$$ 12090 54420 55275 94437 110398 169019 175022 87179 -22352 -39104 90496 78701 -37679
14256c7679m3410M3292Q7649p4689L9425K8598q4784m2274L5369k2457m0385L2778
$$ -37679 -81089 -37797 49852 -24837 14588 43186 -41598 -83872 -48503 -70960 -111345 -78567
14244g8567j31022Q7717P3763O3909J4016k5239M8799N0129o861k7907O4566q1745
$$ -78567 -209589 -121872 -48109 15800 29816 4577 53376 103505 96644 68737 133303 51558
14232E1558m6722K5320k1252P2617m1321k9782o9879j0865j6960K3284k1293n9278
$$ 51558 4836 30156 8904 81521 40200 10418 -59461 -70326 -87286 -64002 -85295 -144573
14220a44573k6358J65474L4319M2171j4785J4439k6l6426q911k394p4777n8355
$$ -144573 -170931 -5457 28862 71033 56248 70687 70661 34235 25324 22930 -51847 -110202
14208a10202J82743R1053p1740p0474j37910j5330J20810O9659j7183j7006o4283
$$ -110202 72541 163594 91854 21380 -116530 -131860 -11050 58609 41426 24420 -39863
14197c9863L6410L5494L1942R561M2377K7050j06997k08634l4561J11212K1120
$$ -39863 -3453 32041 63983 73544 115921 142971 35974 -172660 -207221 -96009 -74889
14186g4889k3271P6562L0965p2154R9952O7456o6393q1573l4095k0148K2448N9553
$$ -74889 -98160 -21598 9367 -62787 37165 104621 38228 -43345 -77440 -97588 -75140 -15587
14174a5587L1398K6695j35798K9455R3316M8575N1001N610P924r5131n578j5816
$$ -15587 15811 42506 -93292 -63837 29479 78054 129055 134665 142589 47458 41880 26064
14162B6064m7432J00314N1801O5077q6326l9405R3184O8165j47370j10252m6711
$$ 26064 -21368 78946 130747 195824 109498 70093 163277 231442 84072 -26180 -72891
14151g2891k9139J0034l8910j2107N5389J18340O5068o4195j06802l3787m0228
$$ -72891 -102030 -91996 -130906 -143013 -87624 30716 95784 31589 -75213 -109000 -149228
14140a49228j368R3570J6264M0809k486j17578N9666J08853K7775L5319k6060
$$ -149228 -150596 -57026 -40762 47 -2439 -120017 -60351 48502 76277 111596 85536
14129H5536J0100Q0709q5615j93206j41429p5717M1807K9260J49339R6698q675
$$ 85536 95636 176345 90730 -102476 -243905 -319622 -277815 -248555 -99216 -2518 -11193
14118a1193K1681r8037p3829P3251l8579m2953P4461L1987K9127K9753k8455R1942
$$ -11193 10488 -87549 -161378 -88127 -126706 -169659 -95198 -63211 -34084 -4331 -32786 59156
14106E9156o2273k1919J7834J6588n8661n3561m0254P7330R2015j0516M0093j6277
$$ 59156 -3117 -25036 -7202 9386 -49275 -102836 -143090 -65760 26255 15739 55832 39555
14094C9555j06781j6650N3920J7766n8893k3876O3106Q4278M7974J62765j2839
$$ 39555 -67226 -83876 -29956 -12190 -71083 -94959 -31853 52425 100399 263164 250325
14083B50325p0518j47558k8339l4736M112K574N354L5821Q8949o5987j10774j20118
$$ 250325 179807 32249 3910 -30826 -26714 -24140 -18786 17035 105984 39997 -70777 -190895
14071a90895p518m9759K1095J01554K413L1130R2925N7572O800j02209m6444o5755
$$ -190895 -198413 -248172 -227077 -125523 -123110 -91980 945 58517 65317 -36892 -83336 -149091
14059a49091J12265O6577o4990r9645J1412J09991j911O9241k40o5790k0911R5911
$$ -149091 -36826 29751 -35239 -134884 -123472 -13481 -15392 53849 53609 -12181 -33092 62819
14047F2819M214O168o6891p0661n2875L2197j981L6599j8440M520k3928P5199
$$ 62819 67033 73201 6310 -64351 -117226 -85029 -87010 -50411 -68851 -64331 -88259 -13060
14035a3060m255n2150J4917k7161o5266K5234J16492Q0769R8774n7014m9426p771
$$ -13060 -17315 -69465 -54548 -81709 -146975 -121741 -5249 75520 174294 117280 67854 60083
14023F0083k6239j4698J12421J4281J8525r0872m8473J3407L4604Q0612j24365
$$ 60083 33844 19146 131567 145848 164373 73501 25028 38435 73039 153651 29286
14012B9286o7563q2255k4299O6928J0074L4920L0746J7098J06531O6083r0165
$$ 29286 -38277 -120532 -144831 -77903 -67829 -32909 -2163 14935 121466 187549 97384
14001I7384o4553m2184J41418O7019l5641j8146j35925J134m7889K0457M1505
$$ 97384 32831 -9353 132065 199084 163443 145297 9372 10506 -37383 -16926 24579
13990B4579n661O7000P5093n2504l9476q519m8115l9123L3764L8072j8952j5399
$$ 24579 18918 85918 161011 108507 69031 60512 12397 -26726 7038 45110 26158 10759
13978A0759l5956J6407k6984K9365O4464q2113j12695Q2848O8527k2540j5299
$$ 10759 -25197 -8790 -35774 -6409 58055 -24058 -136753 -53905 14622 -7918 -23217
13967b3217m3q5763L019R4689J7489o2619j4033K1064P564O845j843m091J2793
$$ -23217 -23260 -109023 -106004 -11315 6174 -56445 -70478 -49414 -41850 -35005 -36848 -40939 -28146
13954b8146p529J6422L1376Q0986j2112m6539j05563k5971N4858n9404L7365J2747
$$ -28146 -35675 -19253 12123 93109 80997 34458 -71105 -97076 -42218 -101622 -64257 -51510
13942e1510j27463J9171O7291N4354k5891j06443Q1687J81764j9569k7848K3432
$$ -51510 -178973 -159802 -92511 -38157 -64048 -170491 -88804 92960 73391 45543 68975
13931F8975m5626M872o6739q3776J39136Q3654k4399Q0476j5359n1522M0849n6317
$$ 68975 23349 28221 -38518 -122294 16842 100496 76097 156573 141214 89692 130541 74224
13919G4224o2421p3356j5393p615L0251J10337j1246j9235L6734R5042k6730N476
$$ 74224 11803 -61553 -76946 -84561 -54310 56027 44781 25546 62280 157322 130592 136068
13907A36068J8164K2356q9304m9186j826K5986m0120n5531k1210K7392p6842n7646
$$ 136068 154232 176588 87284 38098 36272 62258 22138 -33393 -54603 -27211 -104053 -161699
13895a61699R1921J40938L694l93j12001m8332O8863P5942J4818l2288q109j9066
$$ -161699 -69778 71160 74854 74461 -37540 -85872 -17009 58933 73751 41463 33354 14288
13883A4288Q4255R719l6249Q63k5483j22289l0185O0031P391L3174p3627Q066
$$ 14288 98543 108262 72013 72876 47393 -74896 -105081 -45050 -37659 -4485 -78112 -70046
13871g0046R6710J1329k9349J6823J2437k9916j03625N813K6094k7662Q957O5995
$$ -70046 26664 37993 8644 25467 37904 7988 -95637 -89824 -63730 -91392 -82435 -16440
13859a6440M2562j6559o8384K0464M4578R6454j1678l8837K7942k703P406N0390
$$ -16440 26122 9563 -58821 -38357 6221 102675 90997 52160 80102 77399 84805 135195
13847A35195n6551j38924J6455J9301m8947m2503L3797j9242L6178R3563j7681
$$ 135195 78644 -60280 -43825 -24524 -73471 -115974 -82177 -101419 -65241 28322 10641
13836A0641o5037L5358j5000L4322l3820o5493Q0657L6341r2524q2558n7272J53250
$$ 10641 -54396 -19038 -34038 284 -33536 -99029 -18372 17969 -74555 -157113 -214385 -61135
13824f1135P6520J488m2695J19322q1375j04250Q7283K6536M2814M7254q0316
$$ -61135 15385 16873 -25822 93500 12125 -92125 -4842 21694 64508 111762 31446
13813C1446p7222m1937N986k0890l8723k6199N7282N0838K0272R982q465m0358
$$ 31446 -45776 -87713 -81727 -102617 -141340 -167539 -110257 -59419 -39147 -29165 -37630 -77988
13801g7988J59277J96438q520r3107j4514o9022O1935L8489k4666M851r294m9335
$$ -77988 81289 277727 269207 176100 161586 92564 154499 192988 168322 173173 163879 114544
13789A14544o3575l5453p6321j29426M7243m686m507o4264k21R7586J92123N4396
$$ 114544 50969 15516 -60805 -190231 -142988 -147674 -152181 -216445 -216666 -119080 73043 127439
13777A27439k1544j38999P1313P2874K1092j0181j1905j21562j18554P5342P4371
$$ 127439 105895 -33104 38209 111083 132175 121994 110089 -11473 -130027 -54685 19686
13766A9686o1009j2270k866J10368Q9191o9062J6670K103K0343J1p3257m4389
$$ 19686 -41323 -53593 -56459 53909 143100 74038 90708 92811 113154 113165 39908 -4481
13754d481j1446O280J08720M2640q7133j20788k2301k2826J17699Q0513j6098
$$ -4481 -15927 -9647 99073 141713 54580 -66208 -88509 -111335 6364 86877 70779
13743G0779m9556o7955J18973o5334j08971p6587J3571J47650K2918k422m8319
$$ 70779 21223 -46732 72241 6907 -102064 -178651 -165080 -17430 5488 3066 -45253
13732d5253P7748m5332m9679J1848p7783l9288J12704J37960P1187N5122j07926
$$ -45253 32495 -12837 -62516 -50668 -128451 -167739 -55035 82925 154112 209234 101308
13721A01308o4993l5702j1839j1146j9056K9973q8360p54R0936R3097J8832o3334
$$ 101308 36315 613 -11226 -22372 -41428 -11455 -99815 -100569 -9633 83464 102296 38962
13709C8962m3366J574L6754J1721p486l5134L79o027Q144j169k8688M5916J26346
$$ 38962 -4404 -2830 33924 45645 38159 3025 3404 -2623 5521 4352 -24336 21580 147926
13696A47926n2101k342j3536n6207j43093m729O4524N1280J2042K0291o7502m7567
$$ 147926 95825 93483 79947 23740 -119353 -124082 -59558 -8278 3764 24055 -43447 -91014
13684i1014Q8288N8034j780k5247n4006n483j06944Q2513J03509O2838m8986l445
$$ -91014 -2726 55308 53528 28281 -25725 -31208 -138152 -55639 47870 110708 61722 58277
13672E8277l3411p8665M7874M3874J0770m2725M4089J9178n4564L9420M4622o7882
$$ 58277 24866 -53799 -5925 37949 48719 5994 50083 69261 14697 54117 98739 30857
13660C0857l4542n0295P358Q5485Q0519O3032L46q3119j34785M17M9468P0921
$$ 30857 -3685 -53980 -46622 38863 119382 182414 182760 99641 -35144 -34727 14741 85662
13648H5662M2548n134L5176O938l0579j28249p5931K0332Q1981n1552o0356n3942
$$ 85662 128210 123076 158252 165190 134611 6362 -69569 -49237 32744 -18808 -79164 -133106
13636a33106p587M6178j5469N8150J1164L1253O0533p9644J25034R2027q7796
$$ -133106 -140693 -94515 -109984 -51834 -40670 -9417 51116 -28528 96506 188533 100737
13625A00737R8090J1854j14981j02808j13995j534Q7240Q103P3422P825o8840
$$ 100737 198827 210681 95700 -7108 -121103 -122637 -35397 -27294 46128 53953 -14887
13614a4887q5438K2143O8199N9019J9362n7619o5648L8014J9805p2714K2852L0042
$$ -14887 -100325 -78182 -9983 49036 68398 10779 -54869 -16855 2950 -69764 -46912 -16870
13602a6870n6632m2921Q9788K12936j1217r6565o9493J0135R6462l5682q0592
$$ -16870 -73502 -116423 -26635 186301 175084 78519 9026 19161 115623 79941 -651
13591f51j26467N1824Q7730K8840k7353n1500M6534J40802P218n4826j6276N8759
$$ -651 -127118 -75294 12436 41276 13923 -37577 8957 149759 156977 102151 85875 144634
13579A44634k8915l908r1757n8667P6823J6797m1186n3044O7639L3150j532J562
$$ 144634 115719 111811 20054 -38613 38210 55007 13821 -39223 28416 61566 60034 61596
13567F1596j54747p8632K3358J28887J60099r982j07049J781j2530L1631R4371
$$ 61596 -93151 -171783 -148425 -19538 140561 130579 23530 25311 12781 44412 138783
13556A38783R249m3650m4164k0572p2225n7110Q6860K2759n657n477n249m5019
$$ 138783 148032 104382 60218 39646 -32579 -89689 -2829 19930 14273 8796 3547 -41472
13544d1472j15735J12443R1231Q721p1221k7228P2057n4807q645M4539p8839J41128
$$ -41472 -157207 -44764 46467 55188 -16033 -43261 28796 -26011 -34656 9883 -68956 72172
13532G2172J2972j24006L2808P3889o5707j28990Q3692k1732K9098Q0764O3251
$$ 72172 85144 -38862 -6054 67835 2128 -126862 -43170 -64902 -35804 44960 108211
13521A08211J3257p2605p6661R2402M151j92066J3595R3737n0423l6588k7681
$$ 108211 121468 48863 -27798 64604 68755 -123311 -109716 -15979 -66402 -102990 -130671
13510a30671Q2488J17398o0897J4025O408j4034O1998k3569K1524j7265l7887
$$ -130671 -48183 69215 8318 22343 28751 14717 76715 53146 74670 57405 19518
13499A9518L4574L6006l2231l2706K1744N7827m9078J8939k8059J7711j09156
$$ 19518 54092 90098 57867 25161 46905 104732 55654 74593 46534 64245 -44911
13488d4911l2347j0437q605r6238m4344l6639N6194m034q269R0971P7435o8019
$$ -44911 -77258 -87695 -96300 -192538 -236882 -273521 -217327 -221361 -229630 -138659 -61224 -129243
13476a29243N0831M9235L4689R0506m3624l1267l1435K4271L6926l9710n67l0903
$$ -129243 -78412 -29177 5512 96018 52394 21127 -10308 13963 50889 11179 10612 -20291
13464b0291k0959K1364K489o3549k8578q662J33541M8404K7998p2270k1217K7388
$$ -20291 -41250 -19886 -17397 -80946 -109524 -118186 15355 63759 91757 19487 -1730 25658
13452B5658L7617l2468Q634N3915J8061j08709q0680m7878J4119l1712J06353
$$ 25658 63275 30807 39441 93356 111417 2708 -77972 -125850 -111731 -143443 -37090
13441c7090O3303q6099j9351K7097o3853l3909J06102O3393M2368p1145j05983
$$ -37090 26213 -59886 -79237 -52140 -115993 -149902 -43800 19593 61961 -9184 -115167
13430a15167L1827N3544o7012q7853N654Q6707R0092k3561Q4139m3662m1419M1137
$$ -115167 -83340 -29796 -96808 -184661 -179007 -92300 -2208 -25769 58370 14708 -26711 14426
13418A4426m2983j1035O2193J08128o1209o8227m8349k1750P2192n018k0948K459
$$ 14426 -28557 -39592 22601 130729 69520 1293 -47056 -68806 3386 -1632 -22580 -20121
13406b0121J09215K7016l5619l3021j1932q4752J9071L7658K1564J7474O0991
$$ -20121 89094 116110 80491 47470 35538 -49214 -30143 7515 29079 46553 107544
13395A07544l368j00366k9285N2544J8937J6939N8442N611q9035l8989J16781
$$ 107544 104176 3810 -25475 27069 46006 62945 121387 126998 37963 -1026 115755
13384A15755M9220n9991j06942q8874P9557j0181L4065P6009m7177L6922q2888
$$ 115755 164975 104984 -1958 -90832 -11275 -21456 12609 88618 41441 78363 -4525
13373d525o6153j07905R349J13457J26516Q408j15047N9475L6492O3314k6947
$$ -4525 -70678 -178583 -169234 -55777 70739 79147 -35900 23575 60067 123381 96434
13362I6434k9319L0899O5005L654r475k5263l313K3053m8129J5901J38137m1114
$$ 96434 67115 98014 163019 166673 157198 131935 128622 151675 103546 119447 257584 216470
13350B16470n1572K6322k26610j07089j3482l6088P4288K00644Q3048m5490j16834
$$ 216470 164898 191220 -35390 -142479 -155961 -192049 -117761 82883 165931 120441 3607
13339C607j7041m974Q281k9345K0819j911l5522o114J9084J2288J2329O392k4954
$$ 3607 -13434 -18408 -10127 -39472 -18653 -20564 -56086 -62200 -43116 -30828 -18499 -12107 -37061
13326c7061m8204P0548P4161J12396M1819p8237q1096o1588p6065n4435J5651
$$ -37061 -85265 -14717 59444 171840 213659 135422 54326 -7262 -83327 -137762 -122111
13315a22111M1222R4029J1947p4639J338J62576L4698l2794j5112N043k8279j38554
$$ -122111 -80889 13140 25087 -49552 -48214 114362 149060 116266 101154 106197 77918 -60636
13303f0636l3819N6782P0030O662O8418q547n3678l1319o5345j15805K5902O3439
$$ -60636 -94455 -37673 32357 39019 107437 98890 45212 13893 -51452 -167257 -141355 -77916
13291g7916J31329Q7974K1336l2844k5884l0278J2848q8581n2917Q0547j9442
$$ -77916 53413 141387 162723 129879 103995 73717 86565 -2016 -54933 25614 6172
13280F172R1425J4090r3537M556j6130l1861M9832Q2823K6876R6579q8746j52189
$$ 6172 97597 111687 18150 22706 6576 -25285 24547 107370 134246 230825 142079 -10110
13268a0110p9209K8725M727j25964J3484J73723J97338j2183j38881K405k2159
$$ -10110 -89319 -60594 -55867 -181831 -168347 5376 202714 190531 51650 54055 31896
13257C1896L1610r747J2566j1665P801O7899m1756j192Q2193O5395p0654k5647
$$ 31896 63506 53759 66325 54660 62461 130360 88604 87412 169605 235000 164346 138699
13245A38699k1047K828k9008k0767j00660J1784J13577n0888p8188l84J9012m1729
$$ 138699 117652 120480 91472 70705 -29955 -18171 95406 44518 -33670 -34054 -15042 -56771
13233e6771j8678j9393Q0306o803j0313P0696N0024k7598p1998L0979P560p7916
$$ -56771 -75449 -94842 -14536 -21339 -31652 39044 89068 61470 -10528 20451 28011 -49905
13221d9905J0445M072j30707N6786J26266R4418J240N767l6320j30917l6244m8055
$$ -49905 -39460 -35388 -166095 -109309 16957 111375 112615 118382 82062 -48855 -85099 -133154
13209a33154q680M4124P3239J05617L2636j01797o9231J087o9385N5104L7310
$$ -133154 -141834 -97710 -24471 81146 113782 11985 -57246 -56159 -125544 -70440 -33130
13198c3130n0427K8605K9946M5289M7640l2315p1928J4702M6600P6304N109K857
$$ -33130 -83557 -54952 -25006 20283 67923 35608 -36320 -21618 24982 101286 106395 109252
13186A09252q8854p7894J1362N0182J3159J5857R5751P6597j17685o1422q2517
$$ 109252 20398 -57496 -46134 4048 17207 33064 128815 205412 87727 26305 -56212
13175e6212j4373N1877N7866J0394K8867J6774N6070m7443N919o2831l0685N757
$$ -56212 -70585 -18708 39158 49552 78419 95193 151263 103820 109739 46908 16223 21980
13163B1980k5001l0930J277M5902M487q9177J9193j4018n8137M0795J62112K4225
$$ 21980 -3021 -33951 -32674 13228 17715 -71462 -52269 -66287 -124424 -83629 78483 102708
13151A02708M2185p5184m1742P5023n9037k0355L6863m6746k3178Q9246r505l6080
$$ 102708 144893 69709 27967 102990 43953 23598 60461 13715 -9463 79783 70278 34198
13139C4198j19384o5690P4406p0387N7263J21420j07321p8785L3973J88563l6486
$$ 34198 -85186 -150876 -76470 -146857 -89594 31826 -75495 -154280 -120307 68256 31770
13128C1770n4918o2735M6717J32303j7142m1717l7514p5399M5568P7591k0839
$$ 31770 -23148 -85883 -39166 93137 75995 34278 -3236 -78635 -33067 44524 23685
13117B3685P1567l677L5718j43692j02726L9453M6434M264L811l963o0188r4771
$$ 23685 95252 91575 127293 -16399 -119125 -79672 -33238 -28974 -25163 -29126 -89314 -184085
13105a84085K1833J10786j3059N8933J5617O1823m7199L9196m9609J3141n4988
$$ -184085 -162252 -51466 -64525 -5592 10025 71848 24649 63845 14236 27377 -27611
13094b7611J1572N2187N9726j2655l6046J6340o3069l1598K4588j6422K9056J4667
$$ -27611 -16039 36148 95874 83219 47173 63513 444 -31154 -6566 -22988 6068 20735
13082B0735K6105m3740J23337K0910l0297o35n7810r0056j54386K1549M3580n6645
$$ 20735 46840 3100 126437 147347 117050 116415 58605 -31451 -185837 -164288 -120708 -177353
13070a77353n2202p677L8527J35358K7863J4581K1284k0344j69540K1403Q7775
$$ -177353 -229555 -237232 -198705 -63347 -35484 -20903 381 -19963 -189503 -168100 -80325
13059h0325M0715m746r4177O5435K8508k2884L3237L9643J0260N9605P1382n5234
$$ -80325 -39610 -44356 -138533 -73098 -44590 -67474 -34237 5406 15666 75271 146653 91419
13047I1419J00553m6221q3354o0153O8214M7619j25787j65734J12951J23448J07105
$$ 91419 191972 145751 62397 2244 70458 118077 -7710 -173444 -60493 62955 170060
13036A70060K1265p6708k5674M7377N9934k1222l1277o1887L3147J02072n1757
$$ 170060 191325 114617 88943 136320 196254 175032 143755 81868 115015 217087 165330
13025A65330p6235j4683J35093l8451j54854n2935j6982K770O7729K8764m1755
$$ 165330 89095 74412 209505 171054 16200 -36735 -53717 -50947 16782 45546 3791
13014C791j1027l222q640p361K8349J00449L4009r1744M0665K0411Q337J1791
$$ 3791 -7236 -10458 -19098 -26459 1890 102339 136348 44604 85269 105680 114017 125808
13002A25808N7806L1845J3984j17243o5287J6875K243k1189Q7238O6583Q9282
$$ 125808 183614 215459 229443 112200 46913 63788 66031 44842 132080 198663 287945
12991B87945O4075n0952j03755l8583q511o6125j2797m5162m8530M8595Q2903
$$ 287945 352020 301068 197313 158730 150219 84094 71297 26135 -22395 26200 109103
12980A09103M5859L99M8953L608q4683L4472P499l2704Q6349j6637n1432l3527
$$ 109103 154962 155361 204314 207922 123239 157711 165210 132506 218855 202218 150786 117259
12968A17259M6429M9620j576r2952o1510l9145N3677J18687n5348J5683J2710
$$ 117259 163688 213308 211732 118780 57270 18125 71802 190489 135141 150824 163534
12957A63534q4810m9571k1196j3317n5340J03187Q7559N6368o7333p0640p0555
$$ 163534 78724 29153 7957 -5360 -60700 42487 130046 186414 119081 48441 -22114
12946b2114R6516P245j03673r6616M0484L4089O8893Q3617q8274j83429N8283
$$ -22114 74402 81647 -22026 -118642 -78158 -44069 24824 108441 20167 -163262 -104979
12935a04979J11203M9547L6550j18325J9157n325l5993k0571K3312R1610j7898
$$ -104979 6224 55771 92321 -26004 -6847 -12172 -48165 -68736 -45424 46186 28288
12924B8288j41453R5918J51793M5000p7733J5738q069j40601J23860J456j00240
$$ 28288 -113165 -17247 134546 179546 101813 117551 109482 -31119 92741 94197 -6043
12913f043j5300P7777l2252j0111L5759J2192L9457P185K3799N414q916L3936
$$ -6043 -21343 56434 24182 14071 49830 62022 101479 108664 132463 137877 128961 162897
12901A62897m1090m6780l5864M114K5956K8737k9302n8818K1755l8338j24576
$$ 162897 121807 75027 39163 43277 69233 97970 68668 9850 31605 -6733 -131309
12890a31309q8617L9259Q9763p314R342J0756q1283O7539J51380R4269m4963j11279
$$ -131309 -219926 -180667 -90904 -98218 -88876 -78120 -159403 -91864 59516 153785 108822 -2457
12878b457M2460R4664P3444p7035l1977n0959r6748k8825O9612J38337O1990k572
$$ -2457 40003 134667 208111 131076 99099 48140 -48608 -77433 -7821 130516 192506 189934
12866A89934q4565m6281J598k2679Q492R2374L9134L3645Q425q4972L2301L9321
$$ 189934 105369 59088 60686 38007 46499 138873 178007 211652 220077 135105 167406 206727
12854B06727j0093K2989k6457N8876M173j7841O597K1721J2267K421l0280j43964
$$ 206727 196634 219623 193166 252042 256215 238374 244971 266692 278959 281380 251100 107136
12842A07136p9020P9732J35496j967n486M677k6913k3335m265J5887O1725k8733
$$ 107136 28116 107848 243344 241377 235891 240568 213655 190320 186055 201942 263667 234934
12830B34934p8575j17955q3850O444q375R8051O6948O9279l3996o3178m7597N3540
$$ 234934 156359 38404 -45446 -39002 -47377 50674 117622 186901 152905 89727 42130 95670
12818I5670J622j7884o0991k7506o5643J1536L2140p795j3466J14830J55896l5460
$$ 95670 97292 79408 18417 -9089 -74732 -63196 -31056 -38851 -52317 62513 218409 182949
12806A82949n7537q0003l7544L4900k1001q5141P575J2559n2026Q5731J05644
$$ 182949 125412 45409 7865 42765 21764 -63377 -55802 -43243 -95269 -9538 96106
12795I6106O1383N8690n8593j63223k3482N7566K578L1819K4163r5254M4675j1681
$$ 96106 157489 216179 157586 -5637 -29119 28447 31025 62844 87007 -8247 36428 24747
12783B4747m3824J6011L6056j40171R774K00255O1275K9223o1868n9371j4742
$$ 24747 -19077 -3066 32990 -107181 -97407 102848 164123 193346 131478 72107 57365
12772E7365R3847r981j6443Q7940m4215q2920L4176m4911K0065m1280O2936K0724
$$ 57365 151212 141231 124788 212728 168513 85593 119769 74858 94923 53643 116579 137303
12760A37303J3169l3251k1907j07105l4861n0768o0818J17903R3357L5456K569
$$ 137303 150472 117221 95314 -11791 -46652 -97420 -158238 -40335 53022 88478 91047
12749I1047m7904K3633J17815n2200r843j06009p4182L8286O0278o2824j3665
$$ 91047 43143 66776 184591 132391 122548 16539 -57643 -19357 40921 -21903 -35568
12738c5568J11490L422j9879J8380L5866K288l2591L5165J05730j9962p3460k4141
$$ -35568 75922 79344 59465 77845 113711 115999 83408 118573 224303 204341 130881 106740
12726A06740p0548Q7535O5009m1389k0617K6585O2174r1070p3936o0561j6340
$$ 106740 36192 123727 188736 147347 126730 153315 215489 124419 50483 -10078 -26418
12715b6418k6684J115R0233M5660Q085K7775L7487K0198M5070O0717J2799j01748
$$ -26418 -53102 -51987 38246 83906 91991 119766 157253 177451 222521 283238 296037 194289
12703A94289j02492j17243O5649J22223P0912q2314j61661j49077N039M1238J09044
$$ 194289 91797 -25446 40203 162426 233338 151024 -10637 -159714 -154675 -113437 -4393
12692d393P3878j5031m3410K1094M0087M2367j02866m4284j148J54151J42655
$$ -4393 69485 54454 11044 32138 72225 114592 11726 -32558 -33706 120445 263100
12681B63100o5044q2560M9562J7097j15596k9438K8527L2979j4695J4468J5168
$$ 263100 198056 115496 165058 182155 66559 37121 65648 98627 83932 98400 113568
12670A13568J003M8390O6476j23476j12939J24403M2989j12837k9268M9113M6528
$$ 113568 114571 162961 229437 105961 -6978 117425 160414 47577 18309 67422 113950
12659A13950J2787O1766m7882k7454R7348P0141o4897k955J0405j19820j0527
$$ 113950 126737 188503 140621 113167 210515 280656 215759 212804 223209 103389 92862
12648I2862O6583k4729q344M4501O963N9956o243k1773j2325j18411n9780n4276
$$ 92862 159445 134716 126372 170873 177836 237792 231549 209776 197451 79040 19260 -35016
12636c5016K2998P9985R6001n402r8306j01247O3699J6718k1469q6078R4880Q7413
$$ -35016 -12018 67967 163968 158566 60260 -40987 22712 39430 17961 -68117 26763 114176
12624A14176J4857R4710M0851k255l7880L8502J1424j28027o5683N8789l6992
$$ 114176 129033 223743 264594 262339 224459 262961 274385 146358 80675 139464 102472
12613A02472m6789J1943n8990J54976J01011J6312o8576l9848M2970m4478k5147
$$ 102472 55683 67626 8636 163612 264623 280935 212359 172511 215481 171003 145856
12602A45856K4324p0879l6479J10972o4205N1393M319K5136l2047j0674p1754
$$ 145856 170180 99301 62822 173794 109589 160982 165301 190437 158390 147716 75962
12591G5962O3623j4371m7879P2093L6781l3209m4698r0925N7905P1251j17191
$$ 75962 139585 125214 77335 149428 186209 153000 108302 17377 75282 146533 29342
12580B9342O8695l9987M1371M0821J9331Q2754K3181q1390K4979R4167k6407q2681
$$ 29342 98037 58050 99421 140242 159573 242327 265508 184118 209097 303264 276857 194176
12568A94176m9910j0135J47152P3427j38648n5619K8487j9529M2565K0304l3560
$$ 194176 144266 134131 281283 354710 216062 160443 188930 169401 211966 232270 198710
12557A98710n3082j52689r2376J9276J55263J07032J60277p4341n1912J08488
$$ 198710 145628 -7061 -99437 -80161 75102 182134 342411 268070 216158 324646
12547C24646j9125J1238k3133p0971m0061P704k794J3905k4595J611Q8277K1271
$$ 324646 305521 316759 293626 222655 182594 190298 187504 201409 176814 178425 266702 287973
12535B87973l3911r3635J0810k7172M4382Q2647l7823K8201Q3833m534o8402n1019
$$ 287973 254062 160427 171237 144065 188447 271094 233271 261472 345305 340771 272369 221350
12523B21350p5908m4169L4702K6756j12285l9611M8031J22809P6293j2301J1093
$$ 221350 145442 101273 135975 162731 50446 10835 58866 181675 257968 245667 256760
12512B56760J3155L358j11899p9074N0363k515K7629K3384J05015n632k6937J4428
$$ 256760 269915 273273 161374 82300 132663 130148 157777 181161 286176 280544 253607 268035
12500B68035j01662o9742k8238k292l6711r4352J6596J88218J7417n3373k6907
$$ 268035 166373 96631 68393 66101 29390 -64962 -48366 139852 157269 103896 76989
12489G6989m9442M1787J43510L7070k7449p4628O1056N8691n9511j14471R7961
$$ 76989 27547 69334 212844 249914 222465 147837 208893 267584 208073 93602 191563
12478A91563M8549O8061l8996r0912P8362R2599m5996q143q7206n7959P4680P1952
$$ 191563 240112 308173 269177 178265 256627 349226 303230 295087 207881 149922 224602 296554
12466B96554l5967r5501n7969L268j0375J0539K4162j15325o7459Q9224J20878
$$ 296554 260587 165086 107117 110385 100010 110549 134711 19386 -48073 41151 162029
12455A62029k596J16726J04753l685K2637l7274O180j8276k9526J15415K3598
$$ 162029 159433 276159 380912 377227 399864 362590 368770 350494 320968 436383 459981
12444D59981o2390m4701n0925J12111M1180j35938p4943n8638p7207M3344J18085
$$ 459981 397591 352890 301965 414076 455256 319318 244375 185737 108530 151874 269959
12433B69959p141k762K9610m9328r8739J1374K9658J10574J43017j4883n2705
$$ 269959 262818 260056 289666 240338 141599 152973 182631 293205 436222 421339 368634
12422C68634j7148O6746q128n4095n4193L4086M0103n538j633L6058J9097q341
$$ 368634 351486 418232 410104 356009 301816 335902 376005 370467 368834 404892 423989 415648
12410D15648J0779N1174J3464q6622r3421n3418M3713l2311O68K9530p027J47561
$$ 415648 426427 477601 491065 404443 311022 257604 301317 269006 269674 299204 292177 439738
12398D39738M0295l1256j04355r3621J2293M4847m0010j04338L4333O5126o943
$$ 439738 480033 448777 344422 250801 263094 307941 267931 163593 197926 263052 256109
12387B56109q2535k6454O6494M8605j46579J6683J75771J36339M5987j3006o4628
$$ 256109 173574 147120 213614 262219 115640 132323 308094 444433 490420 477414 412786
12376D12786n2110J24865R736m2009n9119K685j4032K2741j9761J7098K1901m1579
$$ 412786 360676 485541 495277 453268 394149 396834 382802 405543 385782 402880 424781 383202
12364C83202N7862K6102K7149o2255j4972m1400J740L680n0853q8773N4424J00346
$$ 383202 441064 467166 494315 432060 417088 375688 377428 381108 330255 241482 295906 396252
12352C96252J3778K8532K2725J6341m4157q030J4546m3668j1064K8784k2184j51147
$$ 396252 410030 438562 461287 477628 433471 425441 439987 396319 385255 414039 391855 240708
12340B40708N0186Q8536K1463K8691J32604j1990N4778L1077p2808o5344o5806
$$ 240708 290894 379430 400893 429584 562188 550198 604976 636053 563245 497901 432095
12329D32095q0049K5910k5970q4768R1460j3207K3693L0587J32942J0044j27994
$$ 432095 352046 377956 351986 267218 358678 345471 369164 399751 532693 542737 414743
12318D14743p6515J2550M6051J1538M9990M5351J06972J593r2722o4343N5479
$$ 414743 338228 350778 396829 408367 458357 503708 610680 612273 519551 455208 510687
12307E10687m3086j41840j13460L8564J21819P8662n5690m7253K5901O0978L6441
$$ 510687 467601 325761 212301 250865 372684 451346 395656 348403 374304 435282 471723
12296D71723O2403J4326J3912o9745M0257n904K0776l1421m7249J2597L5959O6235
$$ 471723 534126 548452 562364 492619 532876 526972 547748 516327 469078 481675 517634 583869
12284E83869O1893K5260q8643l0519l693o4957j3761K6801O2430k8786k1818k7533
$$ 583869 645762 671022 582379 551860 548167 483210 469449 496250 558680 529894 508076 480543
12272D80543j16666P1946Q9380Q1551N3924n179j10842j13580m0087J16836K31648
$$ 480543 363877 435823 525203 606754 660678 655499 544657 431077 390990 507826 739474
12261G39474k5300o5443n6807M0876M5501N4616j4400o3062J3344k2090q782P1130
$$ 739474 714174 648731 591924 632800 678301 732917 718517 655455 668799 646709 637927 709057
12249G09057M3826K0846m3099p666J5151m7059o5957n7511O0842N7845o4007K3806
$$ 709057 752883 773729 730630 722964 738115 691056 625099 567588 628430 686275 622268 646074
12237F46074L6311Q7290M8666O5102N9518l4415j9781r221o4421q091n1724m5841
$$ 646074 682385 769675 818341 883443 942961 908546 888765 879544 815123 807032 755308 709467
12225G09467J0678P1092j0139j12889m4088J80796j7164j53725j5262J06220R2174
$$ 709467 720145 791237 781098 668209 624121 804917 787753 634028 618766 724986 817160
12214H17160m7447j43237L6774O4795k4858k100L6675N7101Q4552M1140r5459
$$ 817160 769713 626476 663250 728045 703187 701087 737762 794863 879415 920555 825096
12203H25096l1395l0280L4220L6143J16076j3131o8756K4288K9196M70J49684
$$ 825096 793701 763421 797641 833784 949860 936729 867973 892261 921457 921927 1071611
12192A071611j7087j83333R788O8617n3058k8731M6712K5185L3620J10767K2650
$$ 1071611 1054524 871191 880979 949596 896538 867807 914519 939704 973324 1084091 1106741
12181A106741m0047q9802N5177O1610R5398P6775k3827j5181p9584r0635l0853
$$ 1106741 1066694 976892 1032069 1093679 1189077 1265852 1242025 1226844 1147260 1056625 1025772
12170A025772J30963J8876r5496J7301K5886n1278R617R4754k1783J27285L877
$$ 1025772 1156735 1175611 1080115 1097416 1123302 1072024 1081641 1176395 1154612 1281897 1285774
12159A285774p0814K8124N8040j0734j03674o0539L8187J36358m1072L5535O6749
$$ 1285774 1214960 1243084 1301124 1290390 1186716 1126177 1164364 1300722 1259650 1295185 1361934
12148A361934Q4587O8142P97k9481L7760J2475P189R658q2698L2345o5975l2572
$$ 1361934 1446521 1514663 1515460 1485979 1523739 1536214 1543403 1553061 1470363 1502708 1436733 1404161
12136A404161K8760O1430Q254o7253j9844m3854P7954J67423J4979j8113R1407
$$ 1404161 1432921 1494351 1502605 1435352 1415508 1371654 1449608 1617031 1632010 1613897 1705304
12125A705304R2733p713n3917L714M1692l1014l8767M5477n878m4900L8224J6171
$$ 1705304 1798037 1790324 1736407 1740121 1781813 1750799 1712032 1757509 1751631 1706731 1744955 1761126
12113A761126J5537j0615j46048R4682J89368K6704j09564L5441J07952N9707
$$ 1761126 1776663 1766048 1620000 1714682 1904050 1930754 1821190 1856631 1964583 2024290
12103B024290M6027m7818o4422N6852L0582L4895L5507K7002J5933O9269M5150
$$ 2024290 2070317 2022499 1958077 2014929 2045511 2080406 2115913 2142915 2158848 2228117 2273267
12092B273267p1888M1083P9060N7686j0602n5669J58477O9845M566j00021m700
$$ 2273267 2201379 2242462 2321522 2379208 2368606 2312937 2471414 2541259 2545825 2445804 2441104
12081B441104M6502n5188J8799O3015j2140M6183O9374n4052M181M3666R526Q1878
$$ 2441104 2487606 2432418 2451217 2514232 2502092 2548275 2617649 2563597 2567778 2611444 2620970 2702848
12069B702848R5848K5304N0870n7095J5574K5901P7946J8220o0682O7149J24519
$$ 2702848 2798696 2824000 2874870 2817775 2833349 2859250 2937196 2955416 2894734 2961883 3086402
12058C086402J9380L5565R330J06624L4138J7495N2682R4632L3614L0523M3010
$$ 3086402 3105782 3141347 3150677 3257301 3291439 3308934 3361616 3456248 3489862 3520385 3563395
12047C563395j3208P584L7463J47841J04605R3697k8568k2960Q7569P8496J2839
$$ 3563395 3550187 3557771 3595234 3743075 3847680 3941377 3912809 3889849 3977418 4055914 4068753
12036D068753M6867J8320o2190j5564M7219J7973j7842Q5762Q3069N2204M6705
$$ 4068753 4115620 4133940 4071750 4056186 4103405 4121378 4103536 4189298 4272367 4324571 4371276
12025D371276K0119K1680L0269M7414Q3836R5114J7739O8698P1071J26146J05600
$$ 4371276 4391395 4413075 4443344 4490758 4574594 4669708 4687447 4756145 4827216 4953362 5058962
12014E058962N9501m4249M6633Q1736L2431Q0954J3040R2425O7778k8173J53673
$$ 5058962 5118463 5074214 5120847 5202583 5235014 5315968 5329008 5421433 5489211 5461038 5614711
12003E614711J59703R8038J32477P7972N2336j4712O853M5910J66447K66235J06628
$$ 5614711 5774414 5872452 6004929 6082901 6135237 6120525 6127378 6173288 6339735 6605970 6712598
11992F712598J5537K5489P1275l0359K2300P8898P5660J24968K73905J99777J83091
$$ 6712598 6728135 6753624 6824899 6794540 6816840 6895738 6971398 7096366 7370271 7570048 7753139
11981G753139N6958J3039Q0228K2563L8974M1171J35898J97298Q6264P2993k4939
$$ 7753139 7810097 7823136 7903364 7925927 7964901 8006072 8141970 8339268 8425532 8498525 8473586
11970H473586R2057P9860j6660J72501K67589J46546K93j3912R9631J36800J02062
$$ 8473586 8565643 8645503 8628843 8801344 9068933 9215479 9215772 9201860 9301491 9438291 9540353
11959I540353J22291J01005K3002J79439Q8548N7284O564J57460J41878J06333
$$ 9540353 9662644 9763649 9786651 9966090 10054638 10111922 10118486 10275946 10417824 10524157
11949A0524157k2436N5516J5117R2637J38168J30133Q8685J0003J7841J28791
$$ 10524157 10501721 10557237 10572354 10664991 10803159 10933292 11021977 11031980 11049821 11178612
11939A1178612P1927J37028n4269m3451J07025J22237P0028K0432O3293k1227
$$ 11178612 11250539 11387567 11333298 11289847 11396872 11519109 11589137 11609569 11672862 11651635
11929A1651635l6132R7972O7771R0466Q2752J0202p1005j0690R7416L3348O03
$$ 11651635 11615503 11713475 11781246 11871712 11954464 11964666 11893661 11882971 11980387 12013735 12014338
11918A2014338r5896p9268o8540R6176M6604m3694o9997m6403j06456j6518M1366
$$ 12014338 11918442 11839174 11770634 11866810 11913414 11869720 11799723 11753320 11646864 11630346 11671712
11907A1671712N777p4414r910j7167j15209j32434o3818k7159j182k6711j69192
$$ 11671712 11677489 11603075 11593165 11575998 11460789 11328355 11264537 11237378 11236196 11209485 11040293
11896A1040293p1223m6404j01357j52162p5580n8021j22080n2081r6437r4872
$$ 11040293 10969070 10922666 10821309 10669147 10593567 10535546 10413466 10361385 10264948 10170076
11886A0170076j25115r6974k01060k4037j622j03643j42534J9488l1781j08472
$$ 10170076 10044961 9947987 9746927 9722890 9721268 9617625 9475091 9494579 9462798 9354326
11876I354326j29929o8605j64619k3952M2069p9972j66833o8939r9373p2457k508
$$ 9354326 9224397 9155792 8991173 8967221 9009290 8929318 8762485 8693546 8594173 8521716 8519208
11865H519208j45454r5775j54837j53318j06837p3627J1193j17792k9206j16288
$$ 8519208 8373754 8277979 8123142 7969824 7862987 7789360 7800553 7682761 7653555 7537267
11855G537267j64136q5023l5458n4926j45241q2662j45553q0902l5978n9344j19005
$$ 7537267 7373131 7288108 7252650 7197724 7052483 6969821 6824268 6743366 6707388 6648044 6529039
11844F529039m1967l3315K8000j04051j11969j03761r2384k20865j9550J6776
$$ 6529039 6487072 6453757 6481757 6377706 6265737 6161976 6069592 5848727 5829177 5845953
11834E845953p9902p6175j8300m269q4162j65050j9945r1207j27622q934N3312
$$ 5845953 5766051 5689876 5671576 5667307 5583145 5418095 5398150 5306943 5179321 5170387 5223699
11823E223699o6924p9463p2653k47517j28563M4303J50787p9814n4527r3180j36966
$$ 5223699 5156775 5077312 5004659 4757142 4628579 4672882 4823669 4743855 4689328 4596148 4459182
11812D459182p1268J0771M0778r3118j75021m9996K9301j95574o8482m4592R6855
$$ 4459182 4387914 4398685 4439463 4346345 4171324 4121328 4150629 3955055 3886573 3841981 3938836
11801C938836j8291j36366j10067n5726L8565K2749j2810o9500j3990m8056j16143
$$ 3938836 3920545 3784179 3674112 3618386 3656951 3679700 3666890 3597390 3583400 3535344 3419201
11790C419201l3821O036J2246m0922l2692j4083l7722L3232r9726q6243J1128
$$ 3419201 3385380 3391416 3403662 3362740 3330048 3315965 3278243 3311475 3211749 3125506 3136634
11779C136634K6400j79932j48916m4743m895j4884N0556L7466K0841j6463N4174
$$ 3136634 3163034 2983102 2834186 2789443 2784548 2769664 2820220 2857686 2878527 2862064 2916238
11768B916238j9259M95o3662q2068j2758P118k0748j77325j14414k9312j496M5954
$$ 2916238 2896979 2897474 2833812 2751744 2738986 2746104 2725356 2548031 2433617 2404305 2402809 2448763
11756B448763k9254M0220P367L4621q7504k8143j6717p4610M6604P9241r3316
$$ 2448763 2419509 2459729 2467096 2501717 2414213 2386070 2369353 2294743 2341347 2420588 2327272
11745B327272j47188j16194m5381l0790J27851l7135n9189R4191L794o5305q4322
$$ 2327272 2180084 2063890 2018509 1987719 2115570 2078435 2019246 2113437 2117231 2051926 1967604
11734A967604j0597N0516J3762N326J9759q658k9472n3942p2026r6594J7724O7364
$$ 1967604 1957007 2007523 2021285 2026611 2046370 2037712 2008240 1954298 1882272 1785678 1803402 1870766
11722A870766q6140k9740L7834k1458M3508K3524k9813p5233r0112L6079L0047
$$ 1870766 1784626 1754886 1792720 1771262 1814770 1838294 1808481 1733248 1643136 1679215 1709262
11711A709262J4142j04100r7900K6325q082j7254k7345p722o313j08322m8030
$$ 1709262 1723404 1619304 1521404 1547729 1539647 1522393 1495048 1487326 1481013 1372691 1324661
11700A324661o940N8620J9864p417m0064r4034o084Q9465o052p2861j8141M8468
$$ 1324661 1317721 1376341 1396205 1388788 1348724 1254690 1248606 1338071 1332019 1259158 1241017 1289485
11688A289485p123N090N5142r72j81144j864k4784K3961k3821j9944J9260M3669
$$ 1289485 1282362 1287452 1342594 1341622 1160478 1158614 1133830 1157791 1133970 1114026 1133286 1176955
11676A176955k5265J7880m577k0172O479J16493P2199O1896m3929n6394q4834
$$ 1176955 1151690 1169570 1164993 1144821 1151300 1267793 1339992 1401888 1357959 1301565 1216731
11665A216731R2665O5190k912r8484j26605j17604q9728R8681M7456L5098l8873
$$ 1216731 1309396 1374586 1371674 1273190 1146585 1028981 939253 1037934 1085390 1120488 1081615
11654A081615N176r4625p7880Q7106Q2992j4062o6780q5613r18J6745P4614N9893
$$ 1081615 1086791 992166 914286 1001392 1084384 1070322 1003542 917929 917011 933756 1008370 1068263
11642A068263k6360l6331o3648j08114o3418J48739L721m1273m1407o6646k7819
$$ 1068263 1041903 1005572 941924 833810 770392 919131 922852 881579 840172 773526 745707
11631G45707J80322j4064j2601k8610k5726K0902J39452j8380j4622q0653j8276
$$ 745707 926029 911965 899364 870754 845028 865930 1005382 987002 972380 891727 873451
11620H73451k0997J949l6680J1455j6574j01618m0757L3378O9004m07j12360o1462
$$ 873451 852454 854403 817723 829178 812604 710986 670229 703607 772611 772204 659844 598382
11608E98382O3571J66232O1774n0076m9881k3735m1669O1274J88610J5101n8455
$$ 598382 661953 828185 889959 839883 790002 766267 724598 785872 974482 989583 931128
11597I31128o8032q4655j1734M1263o0333O350K4907p8154m9474n5664n3309J4264
$$ 931128 863096 778441 766707 807970 747637 753987 778894 700740 651266 595602 542293 556557
11585E56557R8363J3063q1512l7940R7425K8037j07769j02536o5432J06712P855
$$ 556557 654920 667983 586471 548531 645956 673993 566224 463688 398256 504968 512823
11574E12823N1811O6250L1426K2398M3703M5420j12555j03696m1698Q5005j1934
$$ 512823 564634 630884 662310 684708 728411 773831 661276 557580 515882 600887 588953
11563E88953O45n0517O0356K670l6843Q3942j5259K219P2679N0871l9452q7028
$$ 588953 589598 539081 599437 602107 565264 649206 633947 636166 708845 759716 720264 633236
11551F33236l8416m6257m4766n4384M2247L7672j8492J7202l4926r781r834m1176
$$ 633236 594820 548563 503797 449413 491660 529332 510840 528042 493116 483335 473501 432325
11539D32325Q536R5498m2515J7275M7723r7587o9052M8143M8966N4001m2813J4391
$$ 432325 440861 536359 493844 511119 558842 461255 392203 440346 489312 543313 500500 514891
11527E14891J33645k4784n1866p8695j16317m2230j7452l308N5792M9889J33309
$$ 514891 648536 623752 571886 493191 376874 334644 317192 313884 369676 419565 552874
11516E52874l37r5125j6394J345k1995K6478m2736N4533J4852L7155L4273P5913
$$ 552874 552537 457412 441018 442363 420368 446846 404110 458643 473495 510650 544923 620836
11504F20836l5396j99339q0737M1368K7267n3759J2461J7626O9890k224J02107
$$ 620836 585440 386101 305364 346732 373999 320240 332701 350327 420217 417993 520100
11493E20100l9942K5904m6057j6321q0082o7726j32M382j7184m7985j9214j492
$$ 520100 480158 506062 460005 443684 363602 295876 295744 300126 282942 234957 215743 214251
11481B14251N2088J32293l8677l3879k0481N8412q595N9560J7093K3048K7571
$$ 214251 266339 398632 359955 326076 305595 364007 355412 414972 432065 455113 482684
11470D82684K7102l6839K1056L8034K4519j8199j36886j01360J18560J24335j18806
$$ 482684 509786 472947 494003 532037 556556 538357 401471 300111 418671 543006 424200
11459D24200M8499O5438j03270l7347n245l627O2138j2044p5485j13953j72085
$$ 424200 472699 538137 434867 397520 392275 388648 450786 438742 363257 249304 77219
11448G7219M5271O8597L8719L4675J354k4254o5607L8025J6613J7279J7283J1249
$$ 77219 122490 191087 229806 264481 265835 241581 175974 213999 230612 247891 265174 276423
11436B76423j3026Q5734M2669o9051n5240M2597L5668P5292l4915r8857J6681
$$ 276423 263397 349131 391800 322749 267509 310106 345774 421066 386151 287294 303975
11425C03975j07607j36689l6137J01640J13376O313r15M2902L9938q1530P618
$$ 303975 196368 59679 23542 125182 238558 244871 243956 286858 326796 245266 252884
11414B52884K0022m1089J9713L5611K9145j03027k7413K8101L3671N563l3962
$$ 252884 272906 231817 251530 287141 316286 213259 185846 213947 247618 253181 219219
11403B19219j252L6557j3278O3331j11643L2575O7549r2858l6991j4461q3j4047
$$ 219219 217967 254524 241246 304577 192934 225509 293058 200200 163209 148748 148665 134618
11391A34618M078n7741l7241M1447k0717m3876P9497O1447J13522K4855O741K2411
$$ 134618 138696 80955 43714 85161 64444 20568 100065 161512 275034 299889 306630 329041
11379C29041q1568l4181p4769j2801l3038r0813p3089P6604Q8040l4609Q018n3943
$$ 329041 247473 213292 138523 125722 92684 1871 -71218 5386 93426 58817 66835 12892
11367A2892j1336R7739Q8168j7309p468n0593l391o1584K121O3783p9058j20326
$$ 12892 1556 99295 187463 170154 162686 112093 108702 47118 49239 113022 33964 -86362
11355h6362q551M1541R4827k3619P1392R9747k9444j31907Q4149R8236p4363r3603
$$ -86362 -94913 -53372 41455 17836 89228 188975 159531 27624 111773 210009 135646 42043
11343D2043k2845K1203L4724k966J38623J2878M1240j3093l6244j8757K8391L3841
$$ 42043 19198 40401 75125 72159 210782 223660 264900 251807 215563 196806 225197 259038
11331B59038m0890o9264m8272q7990M9896P6436Q6653k7019M0551j1317j16189
$$ 259038 218148 148884 100612 12622 62518 138954 225607 198588 239139 227822 111633
11320A11633p633M4988N726r9156K7748M3644N4675O5010r8575r3572l3283K5084
$$ 111633 104000 148988 154714 55558 83306 126950 181625 246635 148060 54488 21205 46289
11308D6289Q0927l478P6276M7933K1288l7809q3934J26974P4266j5286o4512j4240
$$ 46289 127216 123738 200014 247947 269235 231426 147492 274466 348732 333446 268934 254694
11296B54694q4090o9742J1185P1599l5805k5310J9563Q6526J06556j5120j02497
$$ 254694 170604 100862 112047 183646 147841 122531 142094 228620 335176 320056 217559
11285B17559l4919j2508N856K7875j9123l9518k2429N4401O5268q6816k6278m1622
$$ 217559 182640 170132 175988 203863 184740 145222 122793 177194 242462 155646 129368 87746
11273H7746j0264P213j0671n199K2033N1090M1676j6519m1213J7630l1494J1969
$$ 87746 77482 84695 74024 68825 90858 141948 183624 167105 125892 143522 112028 123997
11261A23997L1048K4271Q863o4211m3705j07941J0457M8759J1689M1110r0709
$$ 123997 155045 179316 188179 123968 80263 -27678 -17221 31538 43227 84337 -6372
11250f372q27J1991K0120l3362l7057J29621Q9787l3403j4236l089Q3209J8580
$$ -6372 -7199 4792 24912 -8450 -45507 84114 173901 140498 126262 123173 206382 224962
11238B24962m5859M515K728l8890o085L2404l9710l3430M4738J6117n2419o973
$$ 224962 179103 183618 186346 147456 141371 173775 134065 100635 145373 161490 109071 102098
11226A02098J9316j2734K8687J6227n2352j62360j05014O0048O6119J23608o3885
$$ 102098 121414 108680 137367 153594 101242 -61118 -166132 -106084 -39965 83643 19758
11215A9758j03165P89O4578n50L765n4812J9570M1668p016J00286l051K9649P9136
$$ 19758 -83407 -82618 -18040 -18590 -14825 -69637 -50067 -8399 -15415 84871 81820 111469 190605
11202A90605M9465m0182p9325l9429P226k2652j8950k3988k6754q9901Q6257J2448
$$ 190605 240070 199888 120563 81134 88360 65708 46758 22770 -3984 -93885 -7628 4820
11190D820j0507K17l043K3967j08071O2520M0793p0545M404M9325J36499R853
$$ 4820 -5687 -5470 -8513 15454 -92617 -30097 10696 -59849 -55445 -6120 130379 140232
11178A40232n393N1951J0845k051j1711j00529q6203j6138m2777j6683N4405O7401
$$ 140232 134839 186790 197635 195584 183873 83344 -2859 -18997 -61774 -78457 -24052 43349
11166D3349j17124n9164j2166k8806P4557O7227Q571p730K2566k5962o1826m3211
$$ 43349 -73775 -132939 -145105 -173911 -99354 -32127 -23556 -31286 -8720 -34682 -96508 -139719
11154a39719j9359m4764P1019J33322O7005P5495m0558j30153L2608q841r309
$$ -139719 -159078 -203842 -132823 499 67504 142999 102441 -27712 4896 -3945 -13254
11143a3254o8777m8145M6242L8172P3427O2819k7203O3299l0273p321J00725l8526
$$ -13254 -82031 -130176 -83934 -45762 27665 90484 63281 126580 96307 88986 189711 151185
11131A51185m5133j08939k1886P1427R6697O9960j76946j00549r1291P4259M5623
$$ 151185 106052 -2887 -24773 46654 143351 213311 36365 -64184 -155475 -81216 -35593
11120c5593o386Q891O9940P2703m4762n2289j7328K5344J3976k0216m2908R866
$$ -35593 -41979 -33088 36852 109555 64793 12504 -4824 20520 34496 14280 -28628 -18762
11108a8762n9860R3686J49533q591j68298l3140N2310n700Q0879N7382j3882l6890
$$ -18762 -78622 15064 164597 156006 -12292 -45432 6878 1178 82057 139439 125557 88667
11096H8667K7499r1963j53301k2165j4529R4910J5795q007O4234P0734n6119J5587
$$ 88667 116166 24203 -129098 -151263 -165792 -70882 -55087 -63094 1140 71874 15755 31342
11084C1342J9505m7217K7124J11394j17545J1372K762q5563O0232J51757j9290
$$ 31342 50847 3630 30754 142148 24603 35975 38737 -46826 13406 165163 145873
11073A45873j27045Q695Q1945J0259Q768n0805p261m0106l8503j6088L7166m7228
$$ 145873 18828 27523 109468 119727 128495 77690 70429 30323 -8180 -24268 12898 -34330
11061c4330n644L5808l1891k1404N5110J05201k0728j24496O2605J83725N6131
$$ -34330 -39974 -4166 -36057 -57461 -2351 102850 82122 -42374 20231 203956 260087
11050B60087Q2432J96601M8406j2741Q8990l6920j09828o6278R9983M6915j03084
$$ 260087 342519 539120 587526 574785 663775 626855 517027 450749 550732 597647 494563
11039D94563L6687L8977J61899K89618K42618K2377j34962j07926n8081j45513
$$ 494563 531250 570227 732126 1021744 1264362 1286739 1151777 1043851 985770 840257
11029H40257o8878J09814Q6028J66465K57822J98913J50440K475j32051j93149
$$ 840257 771379 881193 967221 1133686 1391508 1590421 1740861 1743336 1611285 1418136
11019A418136j75276j70357j12568j05274N194Q5629K18381K25500R4550j65681
$$ 1418136 1242860 1072503 959935 854661 859855 945484 1163865 1389365 1483915 1318234
11009A318234j85407j05602k01382j52451o1560J0715l7676j6184J14575M2264
$$ 1318234 1132827 1027225 825843 673392 611832 622547 584871 568687 683262 725526
10999G25526o2125r6055j03825r2240m3780R229m7132j72872j03031Q0480K3620
$$ 725526 663401 567346 463521 371281 327501 336730 289598 116726 13695 94175 117795
10988A17795j35322j42975l7559K6146Q5426J41925N8013K1730k0885q436M040
$$ 117795 -17527 -160502 -198061 -171915 -86489 55436 113449 135179 114294 105858 109898
10977A09898R473n5669p5540o3552o1090L2160J9804L9309O4575N3683o3422n9887
$$ 109898 119371 63702 -11838 -75390 -136480 -104320 -84516 -45207 19368 73051 9629 -50258
10965e0258J461l5735K6003M5090k0616n8689k6936J7168r5328N1647N0311j08300
$$ -50258 -48797 -84532 -58529 -13439 -34055 -92744 -119680 -102512 -197840 -146193 -95882 -204182
10953b04182K8455K18914Q168m2096o3698o5093m3942M8521L4910R1985Q4354
$$ -204182 -175727 43187 51355 9259 -54439 -119532 -163474 -114953 -80043 11942 96296
10942I6296o8199n6201L0933l7676n2156o6532n424M6954l9510o1969m7610P2862
$$ 96296 28097 -28104 2829 -34847 -87003 -153535 -158959 -112005 -151515 -213484 -261094 -188232
10930a88232M7409j6361K9685N8596j130L9294R296K8376k9321O431Q9875l5551
$$ -188232 -140823 -157184 -127499 -68903 -70033 -30739 -21443 6933 -22388 -15957 73918 38367
10918C8367p2873l4037k32q536M9570q3372m3467n8519O425L7132L9218M2448
$$ 38367 -34506 -68543 -68775 -77311 -27741 -111113 -154580 -213099 -206674 -169542 -130324 -87876
10906h7876J33171J02182J5924k5423j42643n5754K3232p730J8716k2210K7082
$$ -87876 45295 147477 163401 137978 -4665 -60419 -37187 -44917 -26201 -48411 -21329
10895b1329J11001p586o3468o4774L5482j3112p4064n1733R0270O5585j5607j7891
$$ -21329 89672 82086 18618 -46156 -10674 -23786 -97850 -149583 -59313 6272 -9335 -27226
10883b7226o3312K6226O2508Q2250j44861p7758p7617J14319r235j06570J0476
$$ -27226 -90538 -64312 -1804 80446 -64415 -142173 -219790 -105471 -114706 -221276 -210800
10872b10800p176K1017M0258o601j0762N2337J09770J47440p37o1404l7247K8730
$$ -210800 -217976 -196959 -156701 -163302 -174064 -121727 -11957 135483 134746 73342 36095 64825
10860F4825j4914j138r7346j8918m8260p9710J32663J30124P2382Q4141J6279
$$ 64825 49911 48773 -48573 -67491 -115751 -195461 -62798 67326 139708 223849 240128
10849B40128q9248K6900J01492J03O5223m9654j22119o8479M6922l4839j6528
$$ 240128 150880 177780 279272 279375 344598 294944 172825 104346 151268 116429 99901
10838I9901K7960L9382Q6380O481j09101j05400L656k0086j7230N1697J2742j37251
$$ 99901 127861 167243 253623 260104 151003 45603 49259 29173 11943 63640 76382 -60869
10826f0869q4876k4633k2531j1984K5780P5258P7625j934l6845m6063k1641J2920
$$ -60869 -145745 -170378 -192909 -204893 -179113 -103855 -26230 -28164 -65009 -111072 -132713 -119793
10814a19793O5009J07186o5744o7074P1708M2518Q6959j0025j71918R285M2140
$$ -119793 -54784 52402 -13342 -80416 -8708 33810 120769 110744 -61174 -51889 -9749
10803i749M784K4322j1129J04914K8701j3897p7994j16054p8357k5778M8377J4866
$$ -9749 -4965 19357 8228 113142 141843 127946 49952 -66102 -144459 -170237 -121860 -106994
10791a06994O9793o1721k072K4593m8170m9153p511J62119Q0911k3353k9898m0243
$$ -106994 -37201 -98922 -100994 -76401 -124571 -173724 -181235 -19116 61795 38442 8544 -31699
10779c1699N9703P8450p4880l1407m1289K2114m700k5865j694L7705m3294l4893
$$ -31699 28004 106454 31574 167 -41122 -19008 -23708 -49573 -51267 -13562 -56856 -91749
10767i1749l6028M3631L7553r496M3319L619j5191j7583L1711K7249m8422P9364
$$ -91749 -127777 -84146 -46593 -56089 -12770 -9151 -24342 -41925 -10214 17035 -31387 47977
10755D7977R7718K101Q9334Q6105k6216m6867p4848j7070O0455L6723q1819o6852
$$ 47977 145695 147796 237130 323235 297019 250152 175304 158234 218689 255412 173593 106741
10743A06741k7669k882L1721J41960r688M4827m5273j85291q0999N763k3490j0457
$$ 106741 79072 76190 107911 249871 240183 285010 239737 54446 -26553 -20790 -44280 -54737
10731e4737J4083P3821P505n6391k9527Q2974l0164p9839M3179O2124M991J8010
$$ -54737 -40654 33167 40672 -15719 -45246 37728 7564 -72275 -29096 33028 38019 56029
10719E6029O1648p203j0678l5248J983j3165p3040k8153K8507K4336P8350N531
$$ 56029 117677 110474 99796 64548 66531 53366 -19674 -47827 -19320 5016 83366 88897
10707H8897L4170L8438j18347j3277N9936K3612M9537q063L06M0460M0847L0653
$$ 88897 123067 161505 43158 29881 89817 113429 162966 154903 155209 195669 236516 267169
10695B67169n5078J03777J42089J2892Q5265Q3335q2293j01370j20136p4910r543
$$ 267169 212091 315868 457957 470849 556114 639449 557156 455786 335650 260740 251197
10684B51197N8222K2616N7903r395o3005m093r2870m6455r6848q1854o7868M8370
$$ 251197 309419 332035 389938 380543 317538 313445 220575 174120 77272 -4582 -72450 -24080
10672b4080l2406n2076N1971L4860k9659J9359K8626L7254L2432m013l0866J22931
$$ -24080 -56486 -108562 -56591 -21731 -51390 -32031 -3405 33849 66281 62268 31402 154333
10660A54333K2759J46299k1119j21593m6346K8915m7082P5051M7154J09495J18664
$$ 154333 177092 323391 302272 180679 134333 163248 116166 191217 238371 347866 466530
10649D66530L7037Q0101m552J04542K4427J628J9712J57686J92021K92968J70675
$$ 466530 503567 583668 579116 683658 708085 709713 729425 887111 1079132 1372100 1542775
10638A542775K29450M01677M33240O88995Q15440P14641L64703J78894L17594
$$ 1542775 1772225 2173902 2607142 3296137 4111577 4826218 5190921 5369815 5687409
10629E687409N97982Q69729J152816J491016K211241L276467M619439O580146
$$ 5687409 6285391 7155120 8307936 9798952 12010193 15286660 19906099 26486245
10621B6486245Q977801J1943880J5263611J7427820J5317044Q112705p99994o545001
$$ 26486245 35464046 47407926 62671537 80099357 95416401 103529106 102729112 96184111
10613I6184111p264082m218442O55339O550660J3715625K2455848L1664506L6533885
$$ 96184111 88920029 84701587 85356926 91907586 105623211 128079059 159743565 196277450
10605A96277450L0012712R879150j3054111k4978209k3830733j5602066n422965
$$ 196277450 226290162 236169312 223115201 198136992 174306259 158704193 153281228
10598A53281228N450946J7451007L0428105M2405155M6492697L3249815J382637
$$ 153281228 158732174 176183181 206611286 249016441 295509138 328758953 330141590
10591C30141590l1220115m5473828m1540008k9996460j7482672n944554M969480
$$ 330141590 298921475 253447647 211907639 181911179 164428507 158483953 163453433
10584A63453433J5355386K3675012K5047969J3798258q407915k8830639l6053006
$$ 163453433 178808819 202483831 227531800 241330058 232922143 204091504 168038498
10577A68038498l1506859k2516555j3837495o696676r51129L851637O821574O245200
$$ 168038498 136531639 114015084 100177589 93480913 92529784 96381421 103202995 109448195
10569A09448195J010264p709230j5163041j7405146j5586267j2262055r082819
$$ 109448195 110458459 102749229 87586188 70181042 54594775 42332720 33249901
10562C3249901o662309m702951l495008k670680k055825j618680j265760j087792
$$ 33249901 26587592 21884641 18389633 15718953 13663128 12044448 10778688 9690896
10554I690896r55105p54707p26474o49696m31223n02552m93460k93965k38414
$$ 9690896 8735791 7981084 7254610 6604914 6173691 5671139 5177679 4883714 4645300
10545D645300k51870k84940k87585k16636j00703p2674j42367k34877j32418n1518
$$ 4645300 4393430 4108490 3820905 3604269 3503566 3430892 3288525 3053648 2921230 2869712
10535B869712j12236p9952j13993j76396r9657N7555j7263j15843j34741j02582
$$ 2869712 2757476 2677524 2563531 2387135 2287478 2345033 2327770 2211927 2077186 1974604
10525A974604l108j6227k7398o9934m4151K7315n2447j13481K1512m5866p4421
$$ 1974604 1971496 1955269 1927871 1857937 1813786 1841101 1788654 1675173 1696685 1650819 1576398
10514A576398o4261M1479N3828q0779j03495M4680o4195N065r1088n3079p6615
$$ 1576398 1512137 1553616 1607444 1526665 1423170 1467850 1403655 1408720 1317632 1264553 1187938
10503A187938m0978N2876M5754m8051j18170J5423q940r815L5010M7704M5125
$$ 1187938 1146960 1199836 1245590 1197539 1079369 1094792 1085852 1076037 1111047 1158751 1203876
10492A203876q732o3722l8801K4415p7987r5214P0502Q5941J8975j11080p7669
$$ 1203876 1195144 1131422 1092621 1117036 1039049 943835 1014337 1100278 1119253 1008173 930504
10481I30504m6151l7196N6394l0474j44188n1328O7985J25140m854o8528J3827
$$ 930504 884353 847157 903551 873077 728889 677561 745546 870686 865832 797304 811131
10470H11131p5259J1288o1794o4179L6274j40806R94O7687m5537O7057K4616J0784
$$ 811131 735872 747160 685366 621187 657461 516655 517649 585336 539799 606856 631472 642256
10458F42256j09364m8666k2846l2243L6748N5992Q8325P4525N3214j04168r0014
$$ 642256 532892 484226 461380 429137 465885 521877 610202 684727 737941 633773 543759
10447E43759m7461l3797J5307P2920Q9038J36738Q4772m0225k9113m3315r0379
$$ 543759 496298 462501 477808 550728 639766 776504 861276 821051 791938 748623 658244
10436F58244j10536J755k5052L8397J7299M2269n7358p263J22018N3343J2705
$$ 658244 547708 549463 524411 562808 580107 622376 565018 557755 679773 733116 745821
10425G45821N3046m294q9867j70529o6421p5143k475o2107Q2234N0960P6243n988
$$ 745821 798867 794573 704706 534177 467756 392613 390138 328031 410265 461225 537468 531480
10413E31480m8493k7318K2793l0260j13983k6948Q7587M3526j18332l27P622O5218
$$ 531480 482987 455669 478462 448202 334219 307271 394858 438384 320052 319725 327347 392565
10401C92565J06929K9336K2356K6470Q0149j41703l7592R3937j2385k4410j51332
$$ 392565 499494 528830 551186 577656 657805 516102 478510 572447 560062 535652 384320
10390C84320k1417j7207J0183L4238o021K2936j8112k1844j7673Q1087n484j37685
$$ 384320 362903 345696 355879 390117 384096 407032 388920 367076 349403 430490 425006 287321
10378B87321j13353Q0021L4429l9655m5015l7289J8910M6739l6319q0300p4024
$$ 287321 173968 253989 288418 248763 203748 166459 185369 232108 195789 115489 41465
10367D1465J17639Q7801L4986o2509j4875L9184Q2708k3065l5023j7634J23407
$$ 41465 159104 246905 281891 219382 204507 243691 326399 303334 268311 250677 374084
10356C74084N9794l6496r2465m6529J3990K8218O4512n5822k3527J807M5033J21846
$$ 374084 433878 397382 304917 258388 272378 300596 365108 309286 285759 287566 332599 454445
10344D54445n9410J4842m7011j400J4823O1502p9724n8263J27075o9335k7729
$$ 454445 395035 409877 362866 361466 376289 437791 358067 299804 426879 357544 329815
10333C29815J6554P500k2428m0219J0110O5767R519n4670r2292p0356K0323M9801
$$ 329815 346369 353869 331441 291222 301332 367099 376618 321948 229656 159300 179623 229424
10321B29424p9400n7360L2293O1005O5711Q5584J8839J1529r1313n7249J7714
$$ 229424 150024 92664 124957 185962 251673 337257 356096 367625 276312 219063 236777
10310B36777k1594N0954o8008q5045p3755J17014J57936L5474j00200p7636m8107
$$ 236777 215183 266137 198129 113084 39329 156343 314279 349753 249553 171917 123810
10299A23810R8279M4081j5153O2782J17605L970j25921r6106m6734q0447K5408
$$ 123810 222089 266170 251017 313799 431404 435374 309453 213347 166613 86166 111574
10288A11574J27027N4145j2631k352k6641r1961N6879P9147K652R1452J3945o1790
$$ 111574 238601 292746 280115 277763 251122 159161 216040 295187 297839 389291 403236 341446
10276C41446m1765J00606l7770j49120j4157N7726j6334k2635K3820j3288k0380
$$ 341446 299681 400287 362517 213397 199240 256966 240632 217997 241817 228529 208149
10265B08149j230P7192L5809l6834r9734j2003Q3856j9998j2994L6588P0439j10479
$$ 208149 206919 284111 319920 283086 183352 171349 255205 235207 222213 258801 329240 218761
10253B18761o4390o556M4687o6022K4313K881j12160m027j3952l0818L6983J44517
$$ 218761 154371 147815 192502 126480 150793 153674 41514 37487 23535 -7283 29700 174217
10241A74217M1397L595o3519K2492n4596N486J57231p7326k4721j2263L37P8121
$$ 174217 215614 219209 155690 178182 123586 129072 286303 208977 184256 171993 172330 250451
10229B50451J2029k02260l7082p4341j2233p221q0974J07173O7194K6906R1655
$$ 250451 262480 60220 23138 -51203 -63436 -70657 -151631 -44458 22736 49642 141297
10218A41297M8138J5184P8945k1965k9496K5148P28L2133j6345J9347k2892j11457
$$ 141297 189435 204619 283564 261599 232103 257251 257979 290112 273767 293114 270222 158765
10206A58765K6238Q6947o4500o6620j8770J02930O4850K0774r9793o6506n5751
$$ 158765 185003 271950 207450 140830 122060 224990 289840 310614 210821 144315 88564
10195H8564R1319J64407P9428l3993L8278n0171o3524L3274R0305K9180r2029
$$ 88564 179883 344290 423718 389725 428003 377832 314308 347582 437887 467067 375038
10184C75038Q4740J02252M6960L1005J33886O2550l0074n9174J6463n1198n0874
$$ 375038 459778 562030 608990 639995 773881 836431 806357 747183 763646 712448 661574
10173F61574J03743M8926J62830J69871J76202K5058P770q5707l0007j03657j39801
$$ 661574 765317 814243 977073 1146944 1323146 1348204 1355974 1270267 1240260 1136603 996802
10162I96802N3768P7938J25749J23651K35837K75435K22813q718k41418k64375
$$ 996802 1050570 1128508 1254257 1377908 1613745 1889180 2111993 2103275 1861857 1597482
10152A597482l02499r4456M844Q0491K6556o4698P1075J53263Q1064r3444k41225
$$ 1597482 1294983 1200527 1205371 1285862 1312418 1247720 1318795 1472058 1553122 1459678 1218453
10141A218453j85323j05396j43633o5725J2945J23293P6757J41J6816n4176j49029
$$ 1218453 1033130 927734 784101 718376 731321 854614 931371 931512 948328 894152 745123
10130G45123j39340j65019k13044Q48M3121j06514j6495K8044r1994o8947k80
$$ 745123 605783 440764 227720 228568 271689 165175 148680 176724 84730 15783 15503
10119A5503L8232Q5910J9033m785o430J703M4218l7585P8348k533q3029q790J02591
$$ 15503 53735 139645 158678 153893 147463 149166 193384 155799 234147 231614 148585 139795 242386
10106B42386P2148m3200n0323O9069r8244q0845k9795p415J28435q7001o0667
$$ 242386 314534 271334 221011 290080 191836 110991 81196 73781 202216 115215 54548
10095E4548J00814J452O9591l9758L9953p7823p3898m7152m8923J33715N0328
$$ 54548 155362 156814 226405 186647 226600 148777 74879 27727 -21196 112519 162847
10084A62847q7921r0376m21N4550P6981K4901K9991q2732j10502j6741j7491K1358
$$ 162847 74926 -15450 -15871 38679 115660 140561 170552 87820 -22682 -39423 -56914 -35556
10072c5556P9738M6602l4697o298O8026L9948N8984j3131l8217J18952q2489j54340
$$ -35556 44182 90784 56087 49789 117815 157763 216747 203616 165399 284351 201862 47522
10060D7522O1064J21629N4401j26913j41062m3743L1762k7296N1501o0708J3793
$$ 47522 108586 230215 284616 157703 16641 -27102 4660 -22636 28865 -31843 -18050
10049a8050Q7383M1573l0280K7262j231j015j0430l420o9918m4330O2606j04034
$$ -18050 69333 110906 80626 107888 106657 105642 95212 91792 21874 -22456 40150 -63884
10037f3884n1390J04550N189M3611L6560k641Q2710K8429M0570m1193r6073j14359
$$ -63884 -115274 -10724 -5535 38076 74636 71995 154705 183134 223704 182511 86438 -27921
10025b7921M4201J03099M0964j6389N4118J7738J1199p9657p1175r401P1210m8432
$$ -27921 16280 119379 160343 143954 198072 215810 227009 147352 76177 66776 137986 89554
10013H9554l7782q5469l0223K3731k7057o234J02454M2267k9786L4848P156Q4260
$$ 89554 51772 -33697 -63920 -40189 -67246 -73480 28974 71241 41455 76303 83459 167719
10001A67719J30760q7224p1731K2974R296l6193N5584K0543n9101j22924p9559
$$ 167719 298479 211255 139524 162498 171794 135601 191185 211728 152627 29703 -49856
9990d9856J22657R5766N7648q6693j23157n6198Q1575N4897n906O2302j368p9248
$$ -49856 72801 168567 226215 139522 16365 -39833 41742 96639 90733 153035 151667 72419
9978G2419L617K3753l9100K8542Q1247P7836L174l2033j58989j02857l4389J174
$$ 72419 76036 99789 60689 89231 170478 248314 251488 219455 60466 -42391 -76780 -75606
9966g5606J5179o424N3264M6873J1147M4312N3023K7048n483r5102Q0501R6102
$$ -75606 -60427 -66851 -13587 33286 44433 88745 141768 168816 163333 68231 148732 244834
9954B44834k4798j27478j56481O3904J05951J32429O8025p5059o7219o8163M6704
$$ 244834 220036 92558 -63923 -19 105932 238361 306386 231327 164108 95945 142649
9943A42649K8387L2005K7862L8884L6608j3800K015n8123j6030K065q3571l2187
$$ 142649 171036 203041 230903 269787 306395 292595 294610 236487 220457 222522 138951 106764
9931A06764q953j6024J20849n841J715r9755p462J0143j25801K9569J87778P563
$$ 106764 97811 81787 202636 196795 198510 98755 91293 101436 -24365 5204 192982 200545
9919B00545j16309j1792q241R424K2715j6836l3900R303O668Q3362P475k2113
$$ 200545 84236 72444 64203 73627 96342 79506 45606 54909 61577 144939 152414 130301
9907A30301m5514k2906l1365L4328J49164J02533j06553o6719n1132m4346n3791
$$ 130301 84787 61881 30516 64844 214008 316541 209988 143269 92137 47791 -6000
9896f000M9842K5048j8856p3264m5169J05749K0997J18555o6583n988p0818P5451
$$ -6000 43842 68890 50034 -23230 -68399 37350 58347 176902 110319 104331 33513 108964
9884A08964P2294J2285p2372q151p4239k4804L2773J1188n1521N5856O715N0296
$$ 108964 181258 193543 121171 113020 38781 13977 46750 57938 6417 62273 68988 119284
9872A19284M2527l9052m1361n0267N4931o4956K6710R6514q6251K8240k054j7891
$$ 119284 161811 122759 81398 31131 86062 21106 47816 144330 58079 86319 84265 66374
9860F6374l9030Q20J5589J08092j967r8167k0901N919M3407J5324l1788o9387
$$ 66374 27344 28164 43753 151845 149878 51711 30810 36729 80136 95460 63672 -5715
9848e715l9405j6081J28783J39144o8682r3410q0203l3829J52341N7835J1796
$$ -5715 -45120 -61201 67582 206726 138044 44634 -35569 -69398 82943 140778 152574
9837A52574p2943R6979n5259k4538k474j3310P417P5871q597j28573P1498Q2505
$$ 152574 79631 176610 121351 96813 94339 81029 88446 164317 155720 27147 98645 181150
9825A81150l0688K2542L023J5948q4501L6491m3703J7733r460n8546o0448r1304
$$ 181150 150462 173004 176027 191975 107474 143965 100262 117995 108535 49989 -10459 -101763
9813a01763l1729J28774K3418O4315L4228k2441p5715N3908P000k6703J17017
$$ -101763 -133492 -4718 18700 83015 117243 94802 19087 72995 79995 53292 170309
9802A70309N0937k206n0782j39985k7090J8764r4220k8461L6533l4369N9317M1213
$$ 170309 221246 219040 168258 28273 1183 19947 -74273 -102734 -66201 -100570 -41253 -40
9790d0N4078J069o5575L2871K3431K2219l263n2725J03029J24297P6563q6472
$$ -40 54038 55107 -10468 22403 45834 68053 64790 12065 115094 239391 315954 229482
9778B29482q1317m0125m7569n090J03266M7495j4905k8364o918k3096J7902p2912
$$ 229482 148165 108040 60471 55381 158647 206142 191237 162873 155955 132859 150761 77849
9766G7849r3054m3251J41714J22095j2235p9569J3989k3032n5499j9697o1708
$$ 77849 -15205 -58456 83258 205353 193118 113549 127538 104506 49007 29310 -32398
9755c2398q4568k8103J49615k0565j61768J21586R0123M8665N9054J5076K0826
$$ -32398 -116966 -145069 4546 -16019 -177787 -56201 33922 82587 141641 156717 177543
9744A77543L5122l9348j02099k4144J38877J3130p9531J2265L9823J9164q7138
$$ 177543 212665 173317 71218 47074 185951 199081 119550 131815 171638 190802 103664
9733A03664O072N0593N0737q0964j15210p6444L6877N0985J7356M5755K2979J3900
$$ 103664 109736 160329 211066 130102 14892 -61552 -24675 26310 43666 89421 112400 126300
9721A26300R4048L0372K594k3880l1487P935j72560J6662J18627M9337l9588r1975
$$ 126300 220348 250720 253314 229434 197947 205882 33322 49984 168611 217948 178360 86385
9709H6385q4302L2541l6557j3017m5900J5012j2788r388L05Q0173o1699j30912
$$ 86385 2083 34624 -1933 -14950 -60850 -45838 -58626 -68014 -67709 12464 -49235 -180147
9697a80147Q745j0308J9171Q4215l575J7792m731R3939N7430j5040j0730l5683
$$ -180147 -171402 -181710 -162539 -78324 -81899 -64107 -68838 25101 82531 67491 56761 21078
9685B1078P2515O3740o344M8883L2033J6018k3764N110r6255q0007n4797K0023
$$ 21078 93593 157333 150989 199872 231905 247923 224159 229269 133014 53007 -1790 18233
9673A8233O5236O4313k6966l2861R504N546K918l2667O53j5337k4561N5801k4973
$$ 18233 83469 147782 120816 87955 97459 103005 105923 73256 73909 58572 34011 89812 64839
9660F4839o6219J45328J89705K58728M43185O37616P64095J09801p62744p50410
$$ 64839 -1380 143948 333653 592381 1035566 1673182 2437277 2547078 1784334 1033924
9650A033924l91807j75220K257l9933j35416j07399r4753j95208p4470Q753P7298
$$ 1033924 642117 466897 469154 429221 293805 186406 91653 -103555 -178025 -169272 -91974
9639i1974J30778K8468M2331P178J560M2081l6776m2906m6613O2615N8588o9665
$$ -91974 38804 67272 109603 116781 118341 160422 123646 80740 34127 96742 155330 85665
9627H5665j7456r7403P3826m4859j4139M5219m4225l4136P0904J9216p3744r729
$$ 85665 68209 -29194 44632 -227 -14366 30853 -13372 -47508 23396 42612 -31132 -40861
9615d0861M4193m1805l775J4253N4409M2543m2783o8601M523J331o89o8841P1310
$$ -40861 3332 -38473 -42248 -27995 26414 68957 26174 -42427 -37904 -36573 -37262 -106103 -34793
9602c4793L9696l5793j5931M0464R8463m3977N4237K4902n9511O8325q784j0464
$$ -34793 4903 -30890 -46821 -6357 92106 48129 102366 127268 67757 136082 127298 116834
9590A16834p2438p9815Q7233K4202n3538Q9827j5734n3289K8369N5030l7699K3954
$$ 116834 44396 -35419 51814 76016 22478 112305 96571 43282 71651 126681 88982 112936
9578A12936k3619j08167P985L3891l766p4065o5783J7331O6775J13764Q2045j3515
$$ 112936 89317 -18850 -10865 23026 19260 -54805 -120588 -103257 -36482 77282 159327 145812
9566A45812r4852m5128J6690O3279M6375Q0912q6586j85770M9354J02567M2752
$$ 145812 50960 5832 22522 85801 132176 213088 126502 -59268 -9914 92653 135405
9555A35405J2669J4097K583J2987l0157L2738r260o4614j47072j76200J4660O4455
$$ 135405 148074 162171 164754 177741 147584 180322 171062 106448 -40624 -216824 -202164 -137709
9543a37709J46795L1137n195L154k3769M0955J2632n6241k3896P1790N1630m1647
$$ -137709 9086 40223 35028 38182 14413 55368 68000 11759 -12137 59653 111283 69636
9531F9636m7736o6223n4302J794M3630j29770j463L5482M5372M2322L7654n1696
$$ 69636 21900 -44323 -98625 -96831 -53201 -182971 -184434 -148952 -103580 -61258 -23604 -75300
9519g5300m1040k3050M588J45096J11936j4957P0599P860l9832o2810r386k884
$$ -75300 -116340 -139390 -134802 10294 122230 107273 177872 185732 145900 83090 73704 70820
9507G0820q8449j8992P7570O149q6367q2579O5227P5052N6571M2460J5450n8069
$$ 70820 -17629 -36621 40949 47098 -39269 -121848 -56621 18431 75002 117462 132912 74843
9495G4843J3954J1025p4207J1245N6705l9692q1185K22o605l0225O3194N8851
$$ 74843 88797 99822 25615 36860 93565 53873 -27312 -27090 -33695 -63920 -726 58125
9483E8125L033j3120J6578m0022q0693o6412q5022P2715J34104L5829k3509l627
$$ 58125 61158 48038 64616 24594 -56099 -122511 -207533 -134818 -714 35115 11606 7979
9471G979O3647l2455p5112q203q3199n9917m74J16932J0631L0530L4364K089k4738
$$ 7979 71626 39171 -35941 -44144 -127343 -187260 -187734 -70802 -60171 -29641 4723 6812 -17926
9458a7926J12804J32993P006N2389R3782j04730o175q6831n6036K3192j8828l9434
$$ -17926 94878 227871 234877 287266 381048 276318 270143 183312 127276 150468 131640 92206
9446I2206l1518k734M2633L2104K8135L2163K0491p4587q7333o7114n865N7961
$$ 92206 60688 57954 100587 132691 160826 192989 213480 138893 51560 -15554 -21419 36542
9434C6542Q940K1534K7727q589l9050k2230j9771k7461J2055L9277l706N9638
$$ 36542 45482 67016 94743 86154 47104 24874 5103 -22358 -10303 28974 25268 84906
9422H4906J4982J5492O7300k3093r2382J4439N7011J133r238N9262r768j37128
$$ 84906 99888 115380 182680 159587 67205 81644 138655 139788 130550 189812 180044 42916
9410D2916r2264O0177O9758Q4r4551n463O6104l7967P5836O3296R9170j5284p9650
$$ 42916 -49348 10829 80587 80671 -13880 -19343 46761 8794 84630 147926 247096 231812 152162
9397A52162o8098k12866j41393J19323J41951N8747J1258j30033p7702M8826P1692
$$ 152162 84064 -128802 -270195 -150872 -8921 49826 61084 -68949 -146651 -97825 -26133
9386b6133J05724L5242O6224L0379p2192J6680j75003l9375Q7425M3926J5536
$$ -26133 79591 114833 181057 211436 139244 155924 -19079 -58454 28971 72897 88433
9375H8433L7668o55r5290J3881L6693n554N0782K1230n9230L9561K0216j13092
$$ 88433 126101 125446 30156 44037 80730 75176 125958 147188 87958 127519 147735 34643
9363C4643n3569J4323J03391k3952j7691p344j7153j4807p9149K0206j340l0491
$$ 34643 -18926 -4603 98788 74836 57145 49801 32648 17841 -61308 -41102 -42442 -72933
9351g2933l1666M6799r5730K8814Q3630M043J843l0822k4783N2135K8156O0312
$$ -72933 -104599 -57800 -153530 -124716 -41086 -37043 -35200 -66022 -90805 -38670 -10514 49798
9339D9798N4631k006n0997m5662j20829P9842L1038L6556J61321L4288j07800
$$ 49798 104429 102423 51426 5764 -115065 -35223 -4185 32371 193692 227980 120180
9328A20180j7162j0271k1168n660P0930P1187m1784q9616n9515q7114n1139q1836
$$ 120180 103018 92747 71579 65919 136849 208036 166252 76636 17121 -69993 -121132 -202968
9316b02968N5863J9666N5203M1311M0093Q5339O3207M0584l5015k0708L4186J3889
$$ -202968 -147105 -127439 -72236 -30925 9168 94507 157714 198298 163283 142575 176761 190650
9304A90650q7345m3472L3165J6986P8661N9872n0421p6449l9300r198j16507J0293
$$ 190650 103305 59833 92998 109984 188645 248517 198096 121647 82347 73149 -43358 -33065
9292c3065J5537J3516k7528j8033M343J9926p6071j37960o2732J38797Q3969j0790
$$ -33065 -17528 -4012 -31540 -49573 -45230 -25304 -101375 -239335 -302067 -163270 -79301 -90091
9280i0091L4000M7728k1043Q086Q2366P9549O085K9126n3202r2251L7951K342
$$ -90091 -56091 -8363 -29406 -21320 61046 140595 146680 175806 122604 30353 68304 70646
9268G0646M1518l4346J0129j7011o3549n134K8191Q3519p3471n7383o038M1907
$$ 70646 112164 77818 87947 70936 7387 2253 30444 113963 40492 -16891 -22929 18978
9256A8978N1091J01755k1521o8174q4438j2469M076J7814L0179k4010K5303M1800
$$ 18978 70069 171824 150303 82129 -2309 -14778 -10702 7112 37291 13281 38584 80384
9244H0384j02635J695p779l550L0858P421K3607q1484l0370O1181o8709k0181
$$ 80384 -22251 -20556 -28335 -31885 -1027 6394 30001 -51483 -81853 -20672 -89381 -109562
9232a09562K99J26905m2493n1764J22091N8907j6325O1183q4466j50694J0823
$$ -109562 -109263 17642 -24851 -76615 45476 104383 88058 149241 64775 -85919 -75096
9221g5096N2755M4814M8605o5206q9261O7807r6590K0166J17454j9079O4385M4958
$$ -75096 -22341 22473 71078 5872 -83389 -15582 -112172 -92006 25448 6369 70754 115712
9209A15712n7295n588k8325m3549j4019j1274J22433J25942j2684p3898p1389
$$ 115712 58417 52829 24504 -19045 -33064 -44338 78095 204037 191353 117455 46066
9198D6066N7248L1549o97q166m4332j3814P4991l0056o9883q2393m2447J0468
$$ 46066 103314 134863 134166 126000 81668 67854 142845 112789 42906 -39487 -81934 -71466
9186g1466N953K3102J11562R0054j2956k5770o41J4771j36546n5045l9213k5789
$$ -71466 -65513 -42411 69151 159205 146249 120479 119838 134609 -1937 -56982 -96195 -121984
9174a21984Q0559K6257J6920M4874j0550j2111K8998j3496Q3728L8035M2083L6796
$$ -121984 -41425 -15168 1752 46626 36076 23965 52963 39467 123195 161230 203313 240109
9162B40109o7025O982n4233j14046n0163L6491l1555q4117j2602M2230Q0541J76
$$ 240109 173084 180066 125833 11787 -38376 -1885 -33440 -117557 -130159 -87929 -7388 -7212
9150g212j3444P6061M5031p8699j33504O2599L4600J15842J7610n8733N6048K2065
$$ -7212 -20656 55405 100436 21737 -111767 -49168 -14568 101274 118884 60151 116199 138264
9138A38264R1119L6838m4703j15136p4512m7791R5115O6493j7928o0439r3940
$$ 138264 229383 266221 221518 106382 31870 -15921 79194 145687 127759 67320 -26620
9127b6620l1076q36k0366K4007q9717n7699R6966J10280q850r9441M9282L359
$$ -26620 -57696 -58532 -78898 -54891 -144608 -202307 -105341 4939 -3911 -103352 -54070 -50711
9115e0711L6678k7886K2185Q0235J28479o1099M6674M0472m7775q4864l6965k575
$$ -50711 -14033 -41919 -19734 60501 188980 127881 174555 215027 167252 82388 45423 42848
9103D2848p1280o0470P2493r053p4231q43K7463O3137K0620J445j8796L4924N7489
$$ 42848 -28432 -88902 -16409 -25462 -99693 -100536 -73073 -9936 10684 12129 -6667 28257 85746
9090H5746j45042l878J30147N0272k2093q8245l7252J7409N6852k8015l8439k2290
$$ 85746 -59296 -63174 66973 117245 95152 6907 -30345 -12936 43916 15901 -22538 -44828
9078d4828N8708R6772k4184o0230Q263J5717K6325n6135j87866n7277J42595P5427
$$ -44828 13880 110652 86468 26238 34501 50218 76543 20408 -167458 -224735 -82140 -6713
9066f713p8901l101K5933Q2418J9492J8725l5185L4001K4241m2331K6624R346
$$ -6713 -85614 -88715 -62782 19636 39128 57853 22668 56669 80910 38579 65203 74549
9054G4549J3359K8434L6069m843j08259j25609n8093n3721o412Q7081L8606O2922
$$ 74549 87908 116342 152411 147568 39309 -86300 -144393 -198114 -204526 -117445 -78839 -15917
9042a5917M5454n574n046O6323R7071m111m2626p1559j4103m2419q1179p4820
$$ -15917 29537 23963 18917 85240 182311 178200 135574 64015 49912 7493 -73686 -148506
9030a48506N1522K3978n234N5368j4741J0459O0156N1163K9363l8557k135J9063
$$ -148506 -96984 -73006 -78240 -22872 -37613 -27154 33002 84165 113528 74971 72836 91899
9018I1899p5582j29308j70660J06322P4634J0047K2133Q232K2955J7781Q8574
$$ 91899 16317 -112991 -283651 -177329 -102695 -92648 -70515 -62283 -39328 -21547 67027
9007F7027K8242p9286l4385r7265m0903O2824L4996k5441j548k966o0433K4785
$$ 67027 95269 15983 -18402 -115667 -156570 -93746 -58750 -84191 -85739 -88705 -149138 -124353
8995a24353J13144J02740K2200j4150j0616L6893R9380n6632j9775j6751l7109
$$ -124353 -11209 91531 113731 99581 88965 125858 225238 168606 148831 132080 94971
8984I4971k2627N3238o589p1614n1354N1508j112k5235j0963M1515j7033k9982
$$ 94971 72344 125582 118993 47379 -3975 47533 46421 21186 10223 51738 34705 4723
8972D723m1549k1447O152J10032P7314k3214K9281J182m282r2349r969Q6720J63406
$$ 4723 -36826 -58273 -52121 57911 135225 112011 141292 142474 138192 45843 35874 122594 286000
8959B86000M6442K3746k7266k01263j05772R6556M3234K0067q9262j5691l4087
$$ 286000 332442 356188 328922 127659 21887 118443 161677 181744 92482 76791 42704
8948D2704o5008K1873j2440q1412r763R1452O810l9527J11373J13234L8885n168
$$ 42704 -22304 -431 -12871 -94283 -104046 -12594 -5784 -45311 66062 179296 218181 213013
8936B13013p6211l1529k4004q68l2860O5803M3899o2787o4092o59r913K761k7090
$$ 213013 136802 105273 81269 80401 47541 113344 157243 94456 30364 29705 19792 22553 -4537
8923d537p3531K2302O1380j6164R2949K2712k1998p8032p786k5886Q6714Q9504
$$ -4537 -78068 -55766 5614 -10550 82399 105111 83113 5081 -2705 -28591 58123 147627
8911A47627m2169o4315K7683J9737j16993l7392k6909Q587m8680K9271J17294
$$ 147627 105458 41143 68826 88563 -28430 -65822 -92731 -84144 -132824 -103553 13741
8900A3741J06462m4398m5079K9024K4683j05722m5532K1092M8780k5911m5568
$$ 13741 120203 75805 30726 59750 84433 -21289 -66821 -45729 3051 -22860 -68428
8889f8428O2837J15685m1264P2437k9058M333P3564j2248m8094n6423R617M3931
$$ -68428 -5591 110094 68830 141267 112209 116542 190106 177858 129764 73341 82958 126889
8877A26889J55952K2059J6480j60147j25581o1999k7057M0771N5856p5661l5319
$$ 126889 282841 304900 321380 161233 35652 -26347 -53404 -12633 43223 -32438 -67757
8866f7757K9589P1709L5067j5766j8187o6115o6679r2108n6559J14475Q5613O4530
$$ -67757 -38168 33541 68608 52842 34655 -31460 -98139 -190247 -246806 -132331 -46718 17812
8854A7812J18181Q4632R455k2454j40185m7247l1456j4159l7163l8795R5134R5175
$$ 17812 135993 220625 230080 207626 67441 20194 -11262 -25421 -62584 -101379 -6245 88930
8842H8930K9614k2539q3571p1295O8384N8541j5692O6722L7385k6916n4830l811
$$ 88930 118544 96005 12434 -58861 9523 68064 52372 119094 156479 129563 74733 70922
8830G0922j9353J02615m4842j07528p7530p8416m3030P5255O58j10801J622J00424
$$ 70922 51569 154184 109342 1814 -75716 -154132 -197162 -121907 -121249 -232050 -230428 -130004
8818a30004J29010J5612J1135j0160Q7814J3038l6607M2497j5406J0788q5908
$$ -130004 -994 14618 25753 15593 103407 116445 79838 122335 106929 117717 31809
8807C1809p7921M0378O149K4270O496O294J7679J8451j09655K329l5836O3578
$$ 31809 -46112 -5734 415 24685 31181 37475 55154 73605 -36050 -33721 -69557 -5979
8795e979N0378n2328j31223l3771J26337J53014J9864k7259m5459r0407J2320
$$ -5979 44399 -7929 -139152 -172923 -46586 106428 126292 99033 53574 -36833 -24513
8784b4513K2987m0665o6976O7929O9595N2073o4515J652P7003J04785q82p5232
$$ -24513 -1526 -42191 -109167 -41238 28357 80430 15915 17567 94570 199355 198473 123241
8772A23241R896j4086o1867l1464P3406R1262j4233p2185j5825k80o3347J9727
$$ 123241 133137 119051 57184 25720 99126 190388 176155 103970 88145 87865 24518 44245
8760D4245J9220m4654M3373L9352L3809L4621k40N4316K7055j4837r6981j62326
$$ 44245 63465 18811 62184 101536 135345 169966 169726 224042 251097 236260 139279 -23047
8748b3047m2523P3627R0939L36l0846L3196l4524n3917n8215q037R4101K5155
$$ -23047 -65570 8057 98996 99332 68486 101682 67158 13241 -44974 -53011 41090 66245
8736F6245M0293m4731N8618Q5285r6702q6072r7122k5863Q6862j1368K7983N6813
$$ 66245 106538 61807 120425 205710 109008 22936 -74186 -100049 -13187 -24555 3428 60241
8724F0241j1943P8561K5544q8848m4730K8162p259m300J3842P7827L5545j6956
$$ 60241 48298 126859 152403 63555 18825 46987 39728 35428 49270 127097 162642 145686
8712A45686n7655P5031N4475o9426j31198R5265L8147J2746l0703q3091m9425
$$ 145686 88031 163062 217537 148111 16913 112178 150325 163071 132368 49277 -148
8701a48m5182P0367O6939N1475k8474J7683k2997k6904p3340m2937J30744N6949
$$ -148 -45330 25037 91976 143451 114977 132660 109663 82759 9419 -33518 97226 154175
8689A54175r3685r9477N4185M500N3101o6680M8854M9264L7911J5686j4617n1267
$$ 154175 60490 -38987 15198 19698 72799 6119 54973 104237 142148 157834 143217 91950
8677I1950k2838j7723j7701O4565M2134j0204m7617r1685L9588R066P0409N1430
$$ 91950 69112 51389 33688 98253 140387 130183 82566 -9119 30469 39535 109944 161374
8665A61374n8604r5559Q2216j4506j22377m2535M7751J7151M3726J00873p8014
$$ 161374 102770 7211 89427 74921 -47456 -89991 -42240 -25089 18637 119510 41496
8654D1496o304K6266J07862N8939p075j04P94r502o4231j6397j8014q7964j21067
$$ 41496 35192 61458 169320 228259 221184 221080 221874 212372 148141 131744 113730 25766 -95301
8641i5301J6045J72732n2398l9560j8393L3136N8094M9714j4359o7256j56009
$$ -95301 -79256 93476 41078 1518 -16875 16261 74355 124069 109710 42454 -113555
8630a13555Q6048M4085Q2754l7080J0324P7258p7911n5773Q610J09479K2585N2346
$$ -113555 -27507 16578 99332 62252 72576 149834 71923 16150 24760 134239 156824 209170
8618B09170o7369r6843Q2883k6161j9045p9307m2673N1750k1437n3360j8359O5929
$$ 209170 141801 44958 127841 101680 82635 3328 -39345 12405 -9032 -62392 -80751 -14822
8606a4822M8160O8317L0638l7583K0771m9329L8195M2956J8268o1662j23348l1125
$$ -14822 33338 101655 132293 94710 115481 66152 104347 147303 165571 103909 -19439 -50564
8594e0564J8050j1921N814m6751j11213P7926J06361O312N850p1554J1398O8562
$$ -50564 -32514 -44435 -38621 -85372 -196585 -118659 -12298 -5986 -136 -71690 -60292 8270
8582H270L3464j7254j5297N7077j3979P9971J09364N5407P7598o2238j33835r9700
$$ 8270 41734 24480 9183 66260 52281 132252 241616 297023 374621 312383 178548 78848
8570G8848q0510N6852k9088j3536R9551L9373n9P6432m9485n2050L1223j0582
$$ 78848 -1662 55190 26102 12566 112117 151490 151431 227863 178378 126328 157551 146969
8558A46969p0095R23M3266o4400j922K2678k7964l1152M3104l0426j093j6452
$$ 146969 76874 77797 121063 56663 54741 77419 49455 18303 61407 30981 29888 13436
8546A3436J7460M0366M0519l1820m0558j8363j7262M1401O1849O3267M2663n3966
$$ 13436 30896 71262 111781 79961 39403 21040 3778 45179 107028 170295 212958 158992
8534A58992n5888L0761l1221L2201L8330p7612j24258m637P3435P7987K0920L8818
$$ 158992 103104 133865 102644 134845 173175 95563 -28695 -33332 40103 118090 139010 177828
8522A77828p424J6024r7020j4455l1093K4850r968K6364K3447R642n5350j09256
$$ 177828 170404 186428 89408 74953 43860 68710 58742 85106 108553 118195 62845 -46411
8510d6411N3935J49927q8002n1335p1383K3500K1523L9291j0684N4411k4870o4053
$$ -46411 7524 157451 69449 18114 -53269 -29769 -8246 31045 20361 74772 49902 -14151
8498a4151l9871L3170o7675M346J74579L4481q4501p1090l9834O7271M7596J1869
$$ -14151 -54022 -20852 -88527 -84181 90398 124879 40378 -30712 -70546 -3275 44321 56190
8486E6190L5189j829m1756K0766N4965N2864J04973o1641p7255J3874R1294n9025
$$ 56190 91379 89550 47794 68560 123525 176389 281362 219721 142466 156340 247634 188609
8474A88609o054Q9471l3906j3009k9631j32933n9149L7809Q9758q9817j3231P219
$$ 188609 182555 272026 238120 225111 195480 62547 3398 41207 130965 41148 27917 35136
8462C5136k1584p905k1522R6333N5512k6731k0489o1337K4780j2616o7774R4028
$$ 35136 13552 5647 -15875 80458 135970 109239 88750 27413 52193 39577 -28197 65831
8450F5831P3464L1384K0407q6618l9086M2294J2304q879p828j6293j298p5196
$$ 65831 139295 170679 191086 104468 65382 107676 119980 111101 103273 86980 85682 10486
8438A0486m7821L4001M286N7863Q8791P1261o0529o5680l6553L0498q9546k0953
$$ 10486 -37335 -3334 952 58815 147606 218867 158338 92658 56105 86603 -2943 -23896
8426b3896k8414j8951j1645l9655Q3383Q5075N9019k269n8394O4582k242j30613
$$ -23896 -52310 -71261 -82906 -122561 -39178 45897 104916 102647 44253 108835 106593 -24020
8414b4020k7439N4430J0500J31853O9034K8168M4488l3559m3235k2215q1334o3619
$$ -24020 -51459 2971 13471 145324 214358 242526 287014 253455 210220 188005 106671 43052
8402D3052l5927P181J8072J5405M2503M7399m7123m9394M9688K3482J3148o3913
$$ 43052 7125 14306 32378 47783 90286 137685 90562 41168 90856 114338 127486 63573
8390F3573j00448K5294L2151j15482Q285J32744J09516K0238m8097j10338j0310
$$ 63573 -36875 -11581 20570 -94912 -86627 46117 155633 175871 127774 17436 7126
8379G126q850J07355J02507M2399j05047m544j6079l12m2147K4850P453j4373
$$ 7126 -1724 105631 208138 250537 145490 140946 124867 124555 82408 107258 114711 100338
8367A00338N0830J777J5353J05342k1848j0194M4044o01m3827j06500q5060n2629
$$ 100338 151168 152945 168298 273640 251792 241598 285642 285041 241214 134714 49654 -2975
8355b975M8896n339Q363p662P7621j1692j2714m3912o7772J7565P6089J19788
$$ -2975 45921 40582 48945 41283 118904 107212 94498 50586 -17186 379 76468 196256
8343A96256Q1644K6703L9433r3427l6568L7902p4579j11957J06824O6791j15465
$$ 196256 277900 304603 344036 250609 214041 251943 177364 65407 172231 239022 123557
8332A23557o7668K9670R902m6172l765M8550m5672n1205J4224P6970L5361K302
$$ 123557 55889 85559 95461 49289 45524 94074 48402 -2803 11421 88391 123752 126054
8320A26054k7724N0379l6211n6765K2804N6315N0898R269k5002l4474N6041l2128
$$ 126054 98330 148709 112498 55733 78537 134852 185750 195019 170017 135543 191584 159456
8308A59456k10l1729J2805P1374O7249m3261o3452q9438K4447L4298R6960k4749
$$ 159456 159246 127517 140322 211696 278945 235684 172232 82794 107241 141539 238499 213750
8296B13750j06790J29060J06232L7322J1538p2420j86518J9157Q6478Q3611M2984
$$ 213750 106960 236020 342252 379574 391112 318692 132174 151331 237809 321420 364404
8285C64404O5212k7497r1939J5099M0753o0826l5735J14088R687j29746l190J12458
$$ 364404 429616 402119 310180 325279 366032 305206 269471 383559 393246 263500 260310 372768
8273C72768M4547K9166m5582j37298o4270o9480J5570Q6172Q4250n6643j47483
$$ 372768 417315 446481 400899 263601 199331 129851 145421 231593 315843 259200 111717
8262A11717q2357N0396N6930m0603n4425o6559J5395Q5100k0240K1216O5443N9948
$$ 111717 29360 79756 136686 96083 41658 -24901 -9506 75594 55354 76570 142013 201961
8250B01961K3327j6367K0923k5421K6381N395P57N995k5082L0681J4967r3709
$$ 201961 225288 208921 229844 204423 230804 236199 236956 242951 217869 248550 263517 169808
8238A69808n9555M3773J4024m1086o2338K72J6864k716M9495l0638K9822J19204
$$ 169808 110253 154026 168050 126964 64626 64898 81762 79046 128541 97903 127725 246929
8226B46929M6082L1314r5519p9833Q3622L1537j5467L7885k0814j2149o795J9922
$$ 246929 293011 324325 228806 148973 232595 264132 248665 286550 265736 253587 246792 266714
8214B66714M0217L8822j9131q5825p3729J3320m2394K5832Q2053o1038o9605P6854
$$ 266714 306931 345753 326622 240797 167068 180388 137994 163826 245879 184841 115236 192090
8202A92090m8154k1417R5041M7398M2215j4379j08443n7786M6787J37859M6968
$$ 192090 143936 122519 217560 264958 307173 292794 184351 126565 173352 311211 358179
8191C58179Q0111n4862p8951j5667j12971j7088P286J4760R842m9475M2791N1008
$$ 358179 438290 383428 304477 288810 175839 158751 166037 180797 190639 141164 183955 234963
8179B34963m976J651J25346L6160J2248k7172j33437q3793N2031O1483j3817n4869
$$ 234963 229987 231638 356984 393144 405392 378220 244783 160990 213021 274504 260687 205818
8167B05818l8732k3212J6582p0891k6535L3887m0688L613l9768k5948N8047O9480
$$ 205818 167086 143874 160456 89565 63030 96917 56229 59842 20074 -5874 52173 121653
8155A21653K0183J05133k9710k3603P741K6608j7613m7020q5459m8299J2889n3768
$$ 121653 141836 246969 217259 193656 201397 228005 210392 163372 77913 29614 42503 -11265
8143a1265M9614M8970J00897O7927J4544p7233Q1483M9057q9411p5224M8420k4108
$$ -11265 38349 87319 188216 256143 270687 193454 274937 323994 234583 159359 207779 183671
8131A83671J402r4512p0657n185L3733J9971m7936k2198L7286P3633J8408l4305
$$ 183671 185073 90561 19904 14719 48452 68423 20487 -1711 35575 109208 127616 93311
8119I3311l3834j6404r536J3246L6589R5919Q6795P2191m0847r3148q4786p5858
$$ 93311 59477 43073 33537 46783 83372 179291 266086 338277 297430 204282 119496 43638
8107D3638L5848P258K8830L4836n4077o0097R5297P3159O3436m3297o1632M690
$$ 43638 79486 86744 115574 150410 96333 36236 131533 204692 268128 224831 163199 167889
8095A67889m5498l9829o3485J0198J2017m4303r7779N0539J59757q239J4850K0068
$$ 167889 122391 82562 19077 29275 41292 -3011 -100790 -50251 109506 101267 116117 136185
8083A36185p4993O7423J3258j6393o8096k2575o673N4092j17260o1939L7917l7253
$$ 136185 61192 128615 141873 125480 57384 34809 28136 82228 -35032 -96971 -59054 -96307
8071i6307j6338R303p9667J5336J35613p780n391J43854m6678r4936P9637K4657
$$ -96307 -112645 -103342 -183009 -167673 -32060 -39840 -45231 98623 51945 -42991 36646 61303
8059F1303p4335q649J1292O2014J5237k7606l6885j44839n5363J75863J66270
$$ 61303 -13032 -21681 -10389 51625 66862 39256 2371 -142468 -197831 -21968 144302
8048A44302n2635k4074o2908k0265k2955k0170O2118k9774K5776m9970Q0930L0573
$$ 144302 91667 67593 4685 -15580 -38535 -58705 3413 -26361 -585 -50555 30375 60948
8036F0948q074K7725l5118J189Q5228L464o4419K91j428q5063j17664J7158K2563
$$ 60948 52874 80599 45481 46670 131898 135362 70943 71234 69806 -15257 -132921 -115763 -93200
8023i3200J6490j3020J0003K2835J6541q817L5916k2136p7379J54356P8458N659
$$ -93200 -76710 -89730 -79727 -56892 -40351 -49168 -13252 -35388 -112767 41589 120047 125706
8011A25706J02175n2149n3737p5513q8691n952k6789N6529L5962J6884N8242P2882
$$ 125706 227881 175732 121995 46482 -42209 -48161 -74950 -18421 17541 34425 92667 165549
7999A65549n6402j02513m9042k4934K7395P6493Q190J161n0528j3307O7586N5119
$$ 165549 109147 6634 -42408 -67342 -39947 36546 44736 45897 -4631 -17938 49648 104767
7987A04767k6568j7707J2428J24159L5598q6246j6678K4490M9001j4423j6776
$$ 104767 78199 60492 72920 197079 232677 146431 129753 154243 203244 188821 172045
7976A72045o8756K0733J4871M260j7862L2552k0471O6608q4780q3751m1938l1625
$$ 172045 103289 124022 138893 143153 125291 157843 137372 203980 119200 35449 -6489 -38114
7964c8114J2541J4684N5329K031p256m1103k6335j9269j6154J28234k7156q0411
$$ -38114 -25573 -10889 44440 46471 39215 -1888 -28223 -47492 -63646 64588 37432 -42979
7952d2979j2708l3364K5907l7144l182M4157m1098j4654p9270P1769Q7842j3825
$$ -42979 -55687 -89051 -63144 -100288 -103470 -59313 -100411 -115065 -194335 -122566 -34724 -48549
7940d8549J18769J07691L6332o1626n4040k0316n3353M8618J1759M8392k3298
$$ -48549 70220 177911 214243 152617 98577 78261 24908 73526 85285 133677 110379
7929A10379L779p2471j23052J5549N1689l6288N4377N1123O4543N3240j20261
$$ 110379 114158 41687 -81365 -65816 -14127 -50415 3962 55085 119628 172868 52607
7918E2607r2610k041Q3172p8543l6713m951l1487K2239M0051M8588k3339R6433
$$ 52607 -40003 -42044 41128 -37415 -74128 -79079 -110566 -88327 -48276 312 -23027 73406
7906G3406N7029L4788k728j28556j93678K4735P8282K8017P1834L937r3532l735
$$ 73406 130435 165223 162495 33939 -159739 -135004 -56722 -28705 43129 47066 -46466 -50201
7894e0201n895p5137k1939P4842J25937Q9329Q4994l8772j18758r204N6882P94
$$ -50201 -56096 -131233 -153172 -78330 47607 136936 221930 183158 64400 55196 112078 112872
7882A12872p5885L0766j13741Q762P2142M542k9013k8585n0479k8604p3624j2205
$$ 112872 36987 67753 -45988 -37226 34916 39458 10445 -18140 -68619 -97223 -170847 -183052
7870a83052J26917O7826k648J1727k1043k791k9352q594Q161j4161m779k0671
$$ -183052 -56135 11691 9043 20770 -273 -3064 -32416 -41010 -32849 -47010 -51789 -72460
7858g2460l5786j5009n6455R7596P9645K085N2010Q7139O171m4637l12L3006o8183
$$ -72460 -108246 -123255 -179710 -82114 -2469 -384 51626 138765 144936 100299 99987 132993 64810
7845F4810N4806M83k0538q5359k0854J06587P8834l8921n421k4040j42511j21115
$$ 64810 119616 120099 99561 14202 -6652 99935 178769 139848 134427 110387 -32124 -153239
7833a53239M1577n7189L8326j288J21609J23079o0328j63671M1727n6357j1884
$$ -153239 -111662 -168851 -130525 -131813 -10204 112875 52547 -111124 -69397 -125754 -137638
7822a37638L6701L8165n0107l5213O6726J20967M8177o8393j3815J06806k2484
$$ -137638 -100937 -62772 -112879 -148092 -81366 39601 87778 19385 5570 112376 89892
7811H9892K443k803q5675J1033J5885R2776j5624n4487j18735M4573R0617r8969
$$ 89892 92335 89532 3857 14890 30775 123551 107927 53440 -65295 -20722 69895 -29074
7799b9074J5099R5762l154l8725r3419J5499O2315J2780r395N448L8274K861n6690
$$ -29074 -13975 81787 78633 39908 -53511 -38012 24303 37083 27688 33136 71410 74271 17581
7786A7581m0283L8152q256K2245q6133N9802P770l2049P7716Q8599O4245m4353
$$ 17581 -22702 15450 7194 29439 -56694 3108 10878 -21171 56545 145144 209389 165036
7774A65036l8059q2027L8635k3637N0194M1123p8520n4985p978k4822l5576L4548
$$ 165036 126977 44950 83585 59948 110142 151265 72745 17760 9782 -15040 -50616 -16068
7762a6068K5531N2417K2005O8638q7004j4986O7159N940M1376M0714k7190k2407
$$ -16068 9463 61880 83885 152523 65519 50533 117692 123632 165008 205722 178532 156125
7750A56125m7296n7748L3717J8160M2378n9923J0446M3705j4643o3285o5563n3609
$$ 156125 108829 51081 84798 102958 145336 85413 95859 139564 124921 61636 -3927 -57536
7738e7536K3394j6502M867k1338o184k4707J15433J0796Q786r869p0442l4712
$$ -57536 -34142 -50644 -45777 -67115 -73299 -98006 17427 28223 37009 27140 -43302 -78014
7726g8014l8600l6997Q3111P8404r7619j6021N3269O3437k6060m0600R8783m3056
$$ -78014 -116614 -153611 -70500 7904 -89715 -105736 -52467 10970 -15090 -55690 43093 37
7714C7p1818K0785r605P61p6519k7287L2961Q2885O5394J3594j5280P2643K3182
$$ 37 -71781 -50996 -60601 -59840 -136359 -163646 -130685 -47800 17594 31188 15908 88551 111733
7701A11733j56536q1384M3570J9431m8228j11644m4164Q2289K12868O0745n9791
$$ 111733 -44803 -126187 -82617 -63186 -111414 -223058 -267222 -184933 27935 88680 28889
7690B8889O8664L1654K1286n7125n8040k5853J14161k4287J7142M4453j5432Q9571
$$ 28889 97553 129207 150493 93368 35328 9475 123636 99349 116491 160944 145512 235083
7678B35083j01045p2574N435J8630K2192q029J264n3442M8128n9733l2873N3042
$$ 235083 134038 61464 66899 85529 107721 99692 100956 47514 95642 35909 3036 56078
7666E6078r0478M0540L3773M7165M7198K3192l0934p7881o7912j2597j15807Q2070
$$ 56078 -34400 6140 39913 87078 134276 157468 126534 48653 -19259 -31856 -147663 -65593
7654f5593K3930J08580K5291j26399m6549r6242k6381O4360J03416O1993K9210
$$ -65593 -41663 66917 92208 -34191 -80740 -176982 -203363 -139003 -35587 26406 55616
7643E5616K3978M101p786L4639r3939o9641R9408n5800o9753P3079J0453R8961
$$ 55616 79594 83695 75909 110548 16609 -53032 46376 -9424 -79177 -6098 4355 103316
7631A03316J11259k7994k1545Q186L2328o5768p5337o6581j8234n582L7734l9520
$$ 103316 214575 186581 165036 173222 205550 139782 64445 -2136 -20370 -25952 11782 -27738
7619b7738r949J9838k421L591K2839O151N7243j980o6020p9405r084J07146R8947
$$ -27738 -37687 -17849 -20270 -16679 6160 12311 69554 67574 1554 -77851 -86935 20211 119158
7606A19158j8951j33825k3577l0172J21105M0678M9450r5950o5749P2449j6113
$$ 119158 100207 -33618 -57195 -87367 33738 74416 123866 27916 -37833 34616 18503
7595A8503N0134r919m4042J9022O3777M6071L8391L5563K2876n5315j126j5207
$$ 18503 68637 58718 14676 33698 97475 143546 181937 217500 240376 185061 183935 168728
7583A68728n5346O4809j04579J653J10729r1076r7083L6802l1114j28953j5828
$$ 168728 113382 178191 73612 75265 185994 94918 -2165 34637 3523 -125430 -141258
7572a41258R2780J11861L1188p973l6645m1287K5180k8506M676P5505M8951R508
$$ -141258 -48478 63383 94571 86598 49953 8666 33846 5340 10016 85521 134472 143980
7560A43980J2541o7286m5819N2254l0388M6133q9678M5858K7761J10m937k9425
$$ 143980 156521 89235 43416 95670 65282 111415 21737 67595 95356 95466 90529 61104
7548F1104j3738L914j256Q9957J6331j09015L9617J2075l2094K7448l702J17334
$$ 61104 47366 51280 50024 139981 156312 47297 86914 98989 66895 94343 90641 207975
7536B07975K1829j05814p3372M6476L9973p9976K6407o6583j34180o7259N5005
$$ 207975 229804 123990 50618 97094 137067 57091 83498 16915 -117265 -184524 -129519
7525a29519J21088j9666l0770j3583L3990L4214O3970J10585M796n5483K9933
$$ -129519 -8431 -28097 -58867 -72450 -38460 -4246 59724 170309 175105 119622 149555
7514A49555M4221M2491k6750n5304n5161P3984n238r7245J2171o6947J20100M7595
$$ 149555 193776 236267 209517 154213 99052 173036 167798 70553 82724 15777 135877 183472
7502A83472j17619p5296O8327J24284K6486j421l1870l0808j08844M1214Q9182
$$ 183472 65853 -9443 58884 183168 209654 208233 176363 145555 36711 77925 167107
7491A67107n5600k2423j2324l4913n4655l2470L4308M3491K1012R9806l0172j12698
$$ 167107 111507 89084 76760 41847 -12808 -45278 -10970 32521 53533 153339 123167 10469
7479A0469J4547p070K331l7108l6465L5325N2893K3689L2629j2150q8721j48348
$$ 10469 25016 17946 20277 -16831 -53296 -17971 34922 58611 91240 79090 -9631 -157979
7467a57979n2373J24367P9831P3592o0136k0550j9906j01047M7356N3726J9743
$$ -157979 -210352 -85985 -6154 67438 7302 -13248 -33154 -134201 -86845 -33119 -13376
7456a3376P4532r4681r3365M4103L3569K4449J01351O9281K5311j5053r5138l2688
$$ -13376 61156 -33525 -126890 -82787 -49218 -24769 76582 145863 171174 156121 60983 28295
7444B8295K2674M0119p190j11150j27433j09827N6662J18721R1809J11460k6590
$$ 28295 50969 91088 83898 -27252 -154685 -264512 -207850 -89129 2680 114140 87550
7433H7550j9426K7784m0468L8134o2521r9481J7622N0998J222m8369q0737P6630
$$ 87550 68124 95908 55440 93574 31053 -68428 -50806 192 1414 -46955 -127692 -51062
7421e1062M2858q692M977k4853M2566L6011M2860j16342j09660n7357R9068k5210
$$ -51062 -8204 -16896 -11919 -36772 5794 41805 84665 -31677 -141337 -198694 -99626 -124836
7409a24836j08638M1786r832J373Q6498p5505o0798Q5208J03128M1916j9308r8597
$$ -124836 -233474 -191688 -201520 -200147 -113649 -189154 -249952 -164744 -61616 -19700 -39008 -137605
7397a37605N1821K3072m4486M1702r6663K6441O4935L7012M2093q4280p8296M4839
$$ -137605 -85784 -62712 -107198 -65496 -162159 -135718 -70783 -33771 8322 -75958 -154254 -109415
7385a09415J05966N1133j2876j05870L0544l1370q8669J9460L7917q0691M2838
$$ -109415 -3449 47684 34808 -71062 -40518 -71888 -160557 -141097 -103180 -183871 -141033
7374a41033O3179q0276M4485J09758J7211r3416N2450N4949j104o7671o4687Q3085
$$ -141033 -77854 -158130 -113645 -3887 13324 -80092 -27642 27307 26203 -41468 -106155 -23070
7362b3070O6631l2141K2104k7669n8952j3339M6021P4967k4598k5839l0294j14316
$$ -23070 43561 11420 33524 5855 -53097 -66436 -20415 54552 29954 4115 -26179 -140495
7350a40495N1612O830o418O1944J55404Q9741j00046q7616j29548K0463Q5605
$$ -140495 -88883 -82053 -88471 -26527 128877 218618 118572 30956 -98592 -78129 7476
7339G476r6582k0094R2600M523J3620o8520o7056L5286l9941m5057m3895L2614
$$ 7476 -89106 -109200 -16600 -12077 1543 -66977 -134033 -98747 -138688 -183745 -227640 -195026
7327a95026J55151J10335r8593l9714o4034m9703R9343Q9633L6735n1550j14343
$$ -195026 -39875 70460 -28133 -67847 -131881 -181584 -82241 7392 44127 -7423 -121766
7316a21766k4125J13837J12704P8444j37299k9108J9267N2967L7569K5970o0901
$$ -121766 -145891 -32054 80650 159094 21795 -7313 11954 64921 102490 128460 67559
7305F7559j0618O2409j4368j14130M1012o995j3672Q020r1812j2788N4942N2217
$$ 67559 56941 119350 104982 -9148 31864 24869 11197 19217 -72595 -85383 -30441 21776
7293B1776N982k4636l1931j57892J4278l7646L0413J16998R5357o637j7095q5411
$$ 21776 27758 3122 -28809 -186701 -172423 -210069 -179656 -62658 32699 26062 8967 -76444
7281g6444m2478K1636n0139m906J47643J15708R785j41354p2356M6415j9569J5332
$$ -76444 -118922 -97286 -147425 -152331 -4688 111020 120805 -20549 -92905 -46490 -66059 -50727
7269e0727P5757P85M8440N8325j9856l6370o5107o4652L8002q1335q9764P405
$$ -50727 25030 25815 74255 132580 112724 76354 11247 -53405 -15403 -96738 -186502 -179097
7257a79097J0002R5970Q6434l3682n4509n1035J6094o376K0643k3826j0313Q664
$$ -179097 -169095 -73125 13309 -20373 -74882 -125917 -109823 -116199 -95556 -119382 -129695 -121031
7245a21031j21484m035J05993J27742O2510m9126K5204j1307J06357k0063j70074
$$ -121031 -242515 -246550 -140557 -12815 49695 569 25773 14466 120823 100760 -69314
7234f9314J3778M0240K6024L0152O1657N1748N3107q7157l8566o5970J182n289
$$ -69314 -55536 -15296 10728 40880 102537 154285 207392 120235 81669 15699 16881 11592
7222A1592j3059M4015j6248l1224p689O818J8051q053p4292P1055M8496m4538
$$ 11592 -1467 42548 26300 -4924 -12613 -5795 12256 4203 -70089 966 49462 4924
7210D924L238j4632q055j3181J4048J7622Q210m916Q9192J5245k0053j4142p2545
$$ 4924 8162 -6470 -14525 -27706 -13658 3964 12174 7258 96450 111695 91642 77500 4955
7197D955J3235O8806j26991j0886J48827q5436j7461k200K4779m0880M1724J6724
$$ 4955 18190 86996 -39995 -50881 97946 12510 -4951 -7151 17628 -23252 18472 35196
7185C5196n4577K0891J05550M2156K4149M2472l2979r5418p2705n9864m175N1028
$$ 35196 -19381 1510 107060 149216 173365 215837 182858 87440 14735 -45129 -49304 1724
7173A724k0225n1319K842o3863m2230k9353N1650P4418K53l8355K5292M8812L2506
$$ 1724 -18501 -69820 -66978 -130841 -173071 -202424 -150774 -76356 -76103 -114458 -89166 -40354 -7848
7160g848j2216p1846j55904J10871Q2557k6663O7033n8864L1882J09340M3363
$$ -7848 -20064 -91910 -247814 -136943 -54386 -81049 -14016 -72880 -40998 68342 111705
7149A11705m5998o765R4629l6880j55518j16859Q2662o0582q260J27148m8651
$$ 111705 65707 58942 153571 116691 -38827 -155686 -73024 -133606 -141866 -14718 -63369
7138f3369o564j810O187K2528r456n8889O0625Q7013l7003j40457p8769J8370
$$ -63369 -69933 -71743 -65556 -43028 -52484 -111373 -50748 36265 -738 -141195 -219964 -201594
7126b01594O4735O1412L8162m3763O2509P1683K1474k6715k9310p8093L0439O2120
$$ -201594 -136859 -75447 -37285 -81048 -18539 53144 74618 47903 18593 -59500 -29061 33059
7114C3059N3417O0078j47482l2415O130J7650O978q9886Q1041O8565j02976r0268
$$ 33059 86476 146554 -928 -33343 -27213 -9563 -2585 -92471 -11430 57135 -45841 -136109
7102a36109n0468L8612l768N4263L6737N0423J3668m3328o9011O2107J0949k0694
$$ -136109 -186577 -147965 -151733 -97470 -60733 -10310 3358 -39970 -108981 -46874 -35925 -56619
7090e6619M8697L4794r8107p7143P6313k8247n3702L3483P1915N7853m2905l3530
$$ -56619 -7922 26872 -71235 -148378 -72065 -100312 -154014 -120531 -48616 9237 -33668 -67198
7078f7198p7989O5360P0609J7149k5872p8308K3258M1195j28879l5671L3394Q8996
$$ -67198 -145187 -79827 -9218 7931 -17941 -96249 -72991 -31796 -160675 -196346 -162952 -73956
7066g3956N5557l392k7387p7306n9972J02215J87312j0100q81l346p1458m338
$$ -73956 -18399 -21791 -49178 -126484 -186456 -84241 103071 92971 92090 88744 17286 12948
7054A2948M2697R054r5184j59382J8950M0565Q737J1663K2025J4654k2509L7031
$$ 12948 55645 64699 -30485 -189867 -170917 -130352 -121615 -109952 -87927 -73273 -95782 -58751
7042e8751K0158o9086q5511j8134L2882L6775K5860J1236K8022j9645p6242R4248
$$ -58751 -38593 -107679 -193190 -211324 -178442 -141667 -115807 -104571 -76549 -96194 -172436 -78188
7030g8188j1605k2984m8530l5778q1671P0697j6261l7575J14131J46596k3605
$$ -78188 -89793 -112777 -161307 -197085 -278756 -208059 -224320 -261895 -147764 -1168 -24773
7019b4773q5017M4059k1786j5998p4498p269J10894k2670m5406k5703P6082j9047
$$ -24773 -109790 -65731 -87517 -103515 -178013 -185282 -74388 -97058 -142464 -168167 -92085 -111132
7007a11132L7042j04286j20700M2439J54397j9951l4015M5833J01383P6408p495
$$ -111132 -74090 -178376 -299076 -256637 -102240 -122191 -156206 -110373 -8990 67418 59923
6996E9923R364O7641j6680K5645p0986o8979k8605r3221m6209O835J0144O6443
$$ 59923 69287 136928 120248 145893 74907 5928 -22677 -115898 -162107 -155272 -145128 -78685
6984g8685J1183q547K6569p0686M6231M1754J35532l5270j06641M487K1420J1852
$$ -78685 -67502 -76049 -49480 -120166 -73935 -32181 103351 68081 -38560 -34073 -12653 -801
6972h01q0778P857j9167p2693q9650L9202J27269O1376R761l3094Q3703k6689
$$ -801 -81579 -73722 -92889 -165582 -255232 -216030 -88761 -27385 -17624 -50718 32985 6296
6960F296K670n2073n8729M1818P5607m0664j78924J1603J53796R3473q5549j11058
$$ 6296 8966 -43107 -101836 -60018 15589 -25075 -203999 -192396 -38600 54873 -30676 -141734
6948a41734p8914M5837N3008J9556R5161K2712p7699m2447j2862K8929Q7816k054
$$ -141734 -220648 -174811 -121803 -102247 -7086 15626 -62073 -104520 -117382 -88453 -637 -2691
6936b691p9048l1151N0114N7275J05918o6571l8090K4378p6478m846M3583l0312
$$ -2691 -81739 -112890 -62776 -5501 100417 33846 -4244 20134 -56344 -61190 -17607 -47919
6924d7919J6935j0338l3775L6780L8696n2608m5887O4552k560l6848j5686m6558
$$ -47919 -30984 -41322 -75097 -38317 379 -52229 -98116 -33564 -36124 -72972 -88658 -135216
6912a35216l1412Q8792K3415j08655j17653L0140O1231J18674R4852n5535r6223
$$ -135216 -166628 -77836 -54421 -163076 -280729 -250589 -189358 -70684 24168 -31367 -127590
6901a27590k6120P2830P2708L6298L2075J6875k4271r6291K3982N1615J177N6285
$$ -127590 -153710 -80880 -8172 28126 60201 77076 52805 -43486 -19504 32111 33288 89573
6889H9573m1438o3801L6406l4866K803L8614n470m2994j30616L5970L5034L4931
$$ 89573 48135 -15666 20740 -14126 -11323 27291 21821 -21173 -151789 -115819 -80785 -45854
6877d5854M8225P7824o1343j25082p7704p337O5502L5059L748Q0835j6916k1547
$$ -45854 2371 80195 18852 -106230 -183934 -191271 -125769 -90710 -86962 -6127 -23043 -44590
6865d4590n5119N9723P7839n2582n3081K4374P2514M0948p7890k4074Q0229J8688
$$ -44590 -99709 -39986 37853 -14729 -67810 -43436 29078 70026 -7864 -31938 48291 66979
6853F6979j2259q6685j52103r9J9462n1665K7384m6408J5627J07984L3716p5192
$$ 66979 54720 -31965 -184068 -184167 -164705 -216370 -188986 -235394 -219767 -111783 -78067 -153259
6841a53259k2782R2480J54706j1329q9250j11061N9270m8580n1736k2808N0343
$$ -153259 -176041 -83561 71145 59816 -29434 -140495 -81225 -129805 -181541 -204349 -154006
6830a54006J45816M9095R1511N0729q31l4324j77062n3849K3175K6660K5081M2524
$$ -154006 -8190 40905 132416 183145 182314 147990 -29072 -82921 -59746 -33086 -8005 34519
6818C4519m9517M1051J135M0976K7142J1875L9176M1476n4174k9097k7283p4277
$$ 34519 -14998 26053 27188 68164 95306 107181 146357 187833 133659 104562 77279 3002
6806C002K2126M8209q9524q3501m2241k7186K2589j2197M0042J06910N4556m3974
$$ 3002 25128 73337 -16187 -99688 -141929 -169115 -146526 -158723 -118681 -11771 42785 -1189
6794a189M8892o5810n7219l9922J23142N2668K2592N602o976o8519J4507j9833
$$ -1189 47703 -18107 -75326 -115248 7894 60562 83154 88756 81780 13261 27768 7935
6782G935K3709k0956l5098j5067K0749l3602q3288p2121L4694J00318P0483j6342
$$ 7935 31644 10688 -24410 -39477 -18728 -52330 -135618 -207739 -173045 -72727 -2244 -18586
6770a8586j1759m1043j09871N7488J7784K8875p3794J2430L9486J28442Q4327
$$ -18586 -30345 -71388 -181259 -123771 -105987 -77112 -150906 -138476 -98990 29452 113779
6759A13779J68099K8126o4768j38089k10286L6993J38121j4344m7881r5146Q23
$$ 113779 281878 310004 245236 107147 -103139 -66146 71975 57631 9750 -85396 -84573
6748h4573l5686J4822L330R3886J22644k2538j43018j05261R8985K468M1673J27557
$$ -84573 -120259 -105437 -102107 -8221 114423 91885 -51133 -156394 -57409 -54941 -13268 114289
6736A14289p6349q977J22534J1001p7165N9608N7277k8458r997M9918N4806q1472
$$ 114289 37940 28963 151497 162498 85333 144941 202218 173760 163763 213681 268487 187015
6724A87015r4556o6662l0331M533n599r1315M3241N983J0467j9882l2895p8494
$$ 187015 92459 25797 -4534 -1 -5600 -96915 -53674 -47691 -37224 -57106 -90001 -168495
6712a68495j0406J125L8425L9523M5480J4902M7565l3261P998L3999J7383j2458
$$ -168495 -178901 -177776 -139351 -99828 -54348 -39446 8119 -25142 -17144 16855 34238 21780
6700B1780p9180l8700L3824j01201n0002j5350K8109j1451N7897J09091J3056
$$ 21780 -57400 -96100 -62276 -163477 -213479 -228829 -200720 -212171 -154274 -45183 -32127
6689c2127N1750n2826P922k7807j24156j9187J0351R1243l777q2599L175J4385
$$ -32127 19623 -33203 -25281 -53088 -177244 -196431 -186080 -94837 -98614 -181213 -178038 -163653
6677a63653J20142R6095q4431P2984k1973n9273n2823M9677O2451L0915p1462
$$ -163653 -43511 52584 -31847 41137 19164 -40109 -92932 -43255 19196 50111 -21351
6666b1351L5520Q6161O814j9361j02247l5877J7876J13806N5312J2413n6153n5293
$$ -21351 14169 100330 107144 87783 -14464 -50341 -32465 81341 136653 149066 92913 37620
6654C7620N445l2626N1013M3793q950O7475P5625K0426k0033L1890k7213n1546
$$ 37620 43065 10439 61452 105245 96295 163770 239395 259821 239788 271678 244465 192919
6642A92919q4260j47717N8025Jj63444J2675O3044o362O6970l0511k2224k5763
$$ 192919 108659 -39058 18967 18968 -144476 -131801 -68757 -75119 -8149 -38660 -60884 -86647
6630h6647R9627J9245r5094o888m3775J9650k1416l7320p661P0248J23952M8068
$$ -86647 12980 32225 -62869 -69757 -113532 -93882 -115298 -152618 -160279 -90031 33921 81989
6618H1989P9426k5194M5686m1303r9348p367k8525o8681Q3209n1507k0567k3160
$$ 81989 161415 136221 181907 140604 41256 33889 5364 -63317 19892 -31615 -52182 -75342
6606g5342m000l5183k8502j165N4311M2363n9400l6125j532P1550P1010J26530
$$ -75342 -79342 -114525 -143027 -144192 -89881 -47518 -106918 -143043 -144575 -73025 -2015 124515
6594A24515R880o0502Q352K2050n6248p698j5739j6974k6865j6845K7174r4751
$$ 124515 134395 73893 82245 104295 48047 40349 24610 7636 -19229 -36074 -8900 -103651
6582a03651m7531J04012J49906o0155q6956J5655k1230J26265K4974J2397J4486
$$ -103651 -151182 -47170 102736 42581 -44375 -28720 -49950 76315 101289 113686 128172
6571A28172n2011r8057j11235r857J0882M6257K4418K5102l5093M0659K7532K5870
$$ 128172 76161 -21896 -133131 -142988 -132106 -85849 -61431 -36329 -71422 -30763 -3231 22639
6559B2639r4117N4690J01039P158r3624Q2670j43215j06596p4578J10165M0305
$$ 22639 -71478 -16788 84251 91409 -2215 80455 -62760 -169356 -243934 -133769 -93464
6548i3464J10043N1810k0435q2669L5653K1478k7023j4039R2907R969j43446J02055
$$ -93464 16579 68389 47954 -34715 938 22416 -4607 -18646 74261 84230 -59216 42839
6536D2839J26061n3693j28210M5126P2257J3051l6914j6486P354M2164k8218o2669
$$ 42839 168900 115207 -13003 32123 104380 117431 80517 64031 71385 113549 85331 22662
6524B2662o9718m4201q4K2650N7578J16235k4446m3743o5516l9232J9595l3880
$$ 22662 -47056 -91257 -91341 -68691 -11113 105122 80676 36933 -28583 -67815 -48220 -82100
6512h2100K4601N5787K3982l656p2541j5970j990k2521K5881j06501j8031L83
$$ -82100 -57499 -1712 22270 18614 -53927 -69897 -71887 -94408 -68527 -175028 -193059 -192676
6500a92676n9900j5385m2563P23N6740M3849J29304K2421n5792r796J8124k3524
$$ -192676 -252576 -267961 -310524 -309801 -253061 -209212 -79908 -57487 -113279 -123075 -104951 -128475
6488a28475K8976q426O6040O431n5662l0935K2110j8972P6144l7103n3805K1273
$$ -128475 -99499 -107925 -41885 -35454 -91116 -122051 -99941 -118913 -42769 -79872 -133677 -112404
6476a12404J10100j1760J3066L1993n6628k4272r987N3415J8129n9357q525K0368
$$ -112404 -2304 -14064 -998 30995 -25633 -49905 -59892 -6477 11652 -47705 -56230 -35862
6464c5862J0985J4486m9996Q646p5640l519k5538n894J6792N6341j5056N9842
$$ -35862 -24877 -10391 -60387 -51741 -127381 -130900 -156438 -162332 -145540 -89199 -104255 -44413
6452d4413k7966L6176o8466l643K8050j5330L087J7711n3111Q7988J1197m5728
$$ -44413 -72379 -36203 -104669 -108312 -80262 -95592 -92505 -74794 -127905 -39917 -28720 -74448
6440g4448n1156M1364L5188J77921N5033n1213p8914N9896O073p2576j04505L8704
$$ -74448 -125604 -84240 -49052 128869 183902 132689 53775 113671 119744 47168 -57337 -18633
6428a8633N3380r9803m6680q8859L3137O8505o8441o7351Q0103M1222p8481O018
$$ -18633 34747 -65056 -111736 -200595 -167458 -98953 -167394 -234745 -154642 -113420 -191901 -185883
6416a85883K2839N0216m293O8297l4600o8714J22771L0088j1511L326n5194j22337
$$ -185883 -163044 -112828 -117121 -48824 -83424 -152138 -29367 721 -10790 -7464 -62658 -184995
6404a84995j8178J78155K4511k8014O5868j26978R422l3922l1566j1912o5325
$$ -184995 -203173 -25018 -507 -28521 37347 -89631 -80209 -114131 -145697 -157609 -222934
6393b22934R7161R8999L1577J121L4113J6621m577P2433L9035j36892k9491k0269
$$ -222934 -125773 -26774 4803 5924 40037 56658 52081 124514 163549 26657 -2834 -23103
6381b3103q034J9350j5032L6997j0110m4565L8552q05L0544r051o6750J9176j8417
$$ -23103 -31137 -11787 -26819 10178 68 -44497 -5945 -6750 23794 14743 -52007 -32831 -51248
6368e1248k3258J716L6752N2044M9044L477n3903j74998l1147L115K1261Q6568
$$ -51248 -74506 -72790 -36038 16006 65050 68527 14624 -160374 -191521 -188406 -167145 -80577
6356h0577J5662J4197P7617k6221k20421n0254J8711o438J51599k3180K539p696
$$ -80577 -64915 -50718 26899 678 -219743 -269997 -251286 -257724 -106125 -129305 -126766 -134462
6344a34462L0487O4267n463n0387J7884O2120l1486n7746n0165R9026L0378r7138
$$ -134462 -103975 -39708 -45171 -95558 -77674 -15554 -47040 -104786 -154951 -55925 -25547 -122685
6332a22685m1111O0684L2795j6069j09650k3670M6435Q2069L9604N9198J2054
$$ -122685 -163796 -103112 -70317 -86386 -196036 -219706 -173271 -91202 -51598 7600 19654
6321A9654m5532k375O9913K6575k3064r0216N596L4807O7472L7738j32098m9249
$$ 19654 -25878 -28253 41660 68235 45171 -45045 -39449 -4642 62830 100568 -31530 -80779
6309h0779p5315J13241M2667l7581k1827N2084k7550M8508j26094P5121P3680
$$ -80779 -156094 -42853 -186 -37767 -59594 -7510 -35060 13448 -112646 -37525 36155
6298C6155m6212j13911J15635k2686l8956M0353K7281P4111K5021k7715j09455
$$ 36155 -10057 -123968 -8333 -31019 -69975 -29622 -2341 71770 96791 69076 -40379
6287d0379m7055M9720n1869k8233j3945p0275q511P2757n217j07987J0375L9090
$$ -40379 -87434 -37714 -89583 -117816 -131761 -202036 -210547 -137790 -143007 -250994 -240619 -201529
6275b01529M0058L5995N7563L2773k4560m0515m3767J0506R5079L5019O309M1296
$$ -201529 -161471 -125476 -67913 -35140 -59700 -100215 -143982 -133476 -38397 -3378 2931 44227
6263D4227j8535k3410n6986j9147K10j9966n343J16271n476p9267j01054N3129
$$ 44227 25692 2282 -54704 -73851 -73641 -93607 -98950 17321 11845 -67422 -168476 -115347
6251a15347Q7591P4548k9694K744K6445l6099K9079l4997o8212m0803j15115M4151
$$ -115347 -27756 46792 17098 19842 46287 10188 39267 4270 -63942 -104745 -219860 -175709
6239a75709P9667N619K8010N8517p3325k4434k507K7221j7830L1087K432N4335
$$ -175709 -96042 -90423 -62413 -3896 -77221 -101655 -104162 -76941 -94771 -63684 -61252 -6917
6227f917j4731L1485O0427n2731o2198R9846p1256j05581j0221M3442J13091J05146
$$ -6917 -21648 9837 70264 17533 -44665 55181 -16075 -121656 -131877 -88435 24656 129802
6215A29802p4448j9402j08191p5294L4644J8873Q8326O963J0289L010m5222p614
$$ 129802 55354 35952 -72239 -147533 -112889 -94016 -5690 1273 11562 14572 -30650 -38264
6203c8264M737r6941L8160O3601O053q9017j02527o1723j8486P0660J86968j3457
$$ -38264 -33527 -130468 -92308 -28707 -22654 -111671 -214198 -275921 -294407 -223747 -36779 -50236
6191e0236p4366L5769J23506K9619N0702M979J2454r8143r6644q4758n361N5977
$$ -50236 -124602 -88833 34673 64292 114994 119973 132427 34284 -62360 -147118 -152479 -96502
6179i6502m258M4490L479n182o1552j09501O7712K2767M559M7084O7925k2453
$$ -96502 -100760 -56270 -52791 -57973 -119525 -229026 -161314 -138547 -133988 -86904 -18979 -41432
6167d1432N5799J2421R495j30678m8818m6912J03106j9838m1836L9380o201j16665
$$ -41432 14367 26788 36283 -94395 -143213 -190125 -87019 -106857 -148693 -109313 -115514 -232179
6155b32179M2731J27724P5142k6497k9390q800r2084L7023O7329q2513j9644P2351
$$ -232179 -189448 -61724 13418 -13079 -42469 -51269 -143353 -106330 -39001 -121514 -141158 -68807
6143f8807N5536p6467N8357N9032K1126r663l2941q8281j03788k2397n671L4210
$$ -68807 -13271 -89738 -31381 27651 48777 39114 6173 -82108 -185896 -208293 -213964 -179754
6131a79754L3901J2082P0158J30854n7668j6929k3526K2210k1583o1162Q5631
$$ -179754 -145853 -133771 -63613 67241 9573 -7356 -30882 -8672 -30255 -91417 -5786
6120e786M7851o1562m7481n2370o741J61174R7115p8531r1863p6877n2578N327
$$ -5786 42065 -19497 -66978 -119348 -126089 35085 132200 53669 -38194 -115071 -167649 -162322
6108a62322J1038m0752Q3111Q8927L1909N6140O4176p1942q5254j6249K3430L4067
$$ -162322 -151284 -192036 -108925 -19998 11911 68051 132227 60285 -24969 -41218 -17788 16279
6096A6279K5135m8060Q6159k1793M8355J1709k0075L1858J0644j82387l3055L174
$$ 16279 41414 -6646 79513 57720 106075 117784 97709 129567 140211 -42176 -75231 -72057
6084g2057M253j5580n1371m6061n0822K1650M9241J32772Q8410l4399j77177k4187
$$ -72057 -67804 -83384 -134755 -180816 -231638 -209988 -160747 -27975 60435 26036 -151141 -175328
6072a75328M500Q1332O1819l4799n5119O064n063O4555R6302o1429n475O936L8663
$$ -175328 -170828 -89496 -27677 -62476 -117595 -111531 -116594 -52039 44263 -17166 -22641 -15705 22958
6059B2958n4910r352K5143O2812l7405o4851p1728N4681M3749M2816q469O3238
$$ 22958 -31952 -41304 -16161 46651 9246 -55605 -127333 -72652 -28903 13913 5444 68682
6047F8682k5664j16914m634O5492O178q762o7984N011Q2379J6341l2518n2843
$$ 68682 43018 -73896 -78530 -13038 -6860 -15622 -83606 -78595 3784 20125 -12393 -65236
6035f5236o2284n9862R2402Q9614N7141m7707n6924O1634m703k7006k3599K2608
$$ -65236 -127520 -187382 -94980 -5366 51775 4068 -52856 8778 4075 -22931 -46530 -23922
6023b3922p344J4324N7506J349m1033P597m3333O6530J9274j07648n4127K3867
$$ -23922 -31266 -16942 40564 41913 880 8477 -34856 31674 50948 -56700 -110827 -86960
6011h6960L303N6382J5470k6407j23725o2067r320L3020J17075p371j1237J7924
$$ -86960 -83657 -27275 -11805 -38212 -161937 -224004 -233324 -200304 -83229 -90600 -101837 -83913
5999h3913P0914M4183L1991o6755j01394p7227k654L1474N3302J9503J677R6109
$$ -83913 -12999 31184 63175 -3580 -104974 -182201 -184855 -153381 -100079 -80576 -78899 17210
5987A7210m9909o825N5073L5845j11084l7251J54068K7378J9666K9468K6767l8804
$$ 17210 -32699 -39524 15549 51394 -59690 -96941 57127 84505 104171 133639 160406 121602
5975A21602p6898p5378n7226r9826J7576J6387Q869q94K7246O3967N6239o076
$$ 121602 44704 -30674 -87900 -187726 -170150 -153763 -144894 -145788 -118542 -54575 1664 -4412
5963d412K8677J07328J4234o9422m5557M6714m6072n0642n6328J718J20491P0235
$$ -4412 24265 131593 145827 76405 30848 77562 31490 -19152 -75480 -73762 46729 116964
5951A16964n3135L4146k3651q16J2812r6131l6683L8625L9555p2870P1240M6480
$$ 116964 63829 97975 74324 73508 86320 -9811 -46494 -7869 31686 -41184 30056 76536
5939G6536l7896Q357n704p3404j29393M065k9622M7431R1748j0818Q3692O2952
$$ 76536 38640 46997 41293 -32111 -161504 -157439 -187061 -139630 -47882 -58700 24992 87944
5927H7944L9777n6722j02515o0099J07332m803n6365L1328O7782o5427J5323K2754
$$ 87944 127721 70999 -31516 -91615 15717 10914 -45451 -14123 53659 -11768 3555 26309
5915B6309O0513j9103r290j10162M2534L4487j3357K9242j53451p0365r872K3618
$$ 26309 86822 67719 58429 -51733 -9199 25288 11931 41173 -112278 -182643 -192515 -168897
5903a68897J6955L5748k7996R8663O3673o3322p0178J1281M6704J57R0321J30800
$$ -168897 -151942 -116194 -144190 -45527 18146 -45176 -115354 -104073 -57369 -57212 33109 163909
5891A63909L3946n7811j4394j9769p5240Q6386J41331k1042k5651p3093q1814
$$ 163909 197855 140044 125650 105881 30641 117027 258358 237316 211665 138572 56758
5880E6758p4713K5015L9532l5749n3135J7029M1399m7831j7372Q0736l6117r5296
$$ 56758 -17955 7060 46592 10843 -42292 -25263 16136 -31695 -49067 31669 -4448 -99744
5868i9744K0418K2097M0036K3253P1917J8727M1986l3525j05335J4029l283j47656
$$ -99744 -79326 -57229 -17193 6060 77977 96704 138690 105165 -170 13859 10576 -137080
5856a37080p653J50258O5208l8792j6472J6644l7435J18819J8392m9403m2091
$$ -137080 -144733 5525 70733 31941 15469 32113 -5322 113497 131889 82486 40395
5845D0395L5900M643j32965l928J83315J4006N2641j00210j27647j04848n165
$$ 40395 76295 80938 -52027 -55955 127360 141366 194007 93797 -33850 -138698 -143863
5834a43863l181M2850J05571r466r1948k3828p0344r3038K9642R1190J07400n4296
$$ -143863 -147044 -104194 1377 -8089 -100037 -123865 -194209 -287247 -257605 -166415 -59015 -113311
5822a13311M2064N9142O6660R242k3824l450J00869j1470r190j4278n7378P3046
$$ -113311 -71247 -12105 54555 63797 39973 36523 137392 125922 116732 102454 45076 118122
5810A18122q1673k7771m4601J3029L8198J7661q3177q2646j2318m468k8697O1119
$$ 118122 36449 8678 -35923 -22894 15304 32965 -50212 -132858 -145176 -149644 -178341 -117222
5798a17222O029P60j27617o2868J23977P3905O6026P8568O804j19607P0084p5542
$$ -117222 -111193 -110433 -238050 -300918 -176941 -103036 -37010 41558 48362 -71245 -1161 -76703
5786g6703j38797n2669J51172R9946o1655k3134l6743K9278K4642Q4030l0817
$$ -76703 -215500 -268169 -116997 -17051 -78706 -101840 -138583 -109305 -84663 -633 -31450
5775c1450m9328R732N676J04898j9916R57L058r3057j38799P1642M0427J6751
$$ -31450 -80778 -71046 -65370 39528 19612 20569 23627 -69430 -208229 -136587 -96160 -79409
5763g9409K3981L6830o1399j6178K3932o5004l0860J28156K8211j6722m9395k3318
$$ -79409 -55428 -18598 -79997 -96175 -72243 -137247 -168107 -39951 -11740 -28462 -77857 -101175
5751a01175R6051N1852p0469j03388L172p0198J7274J66397J36085l942L628p0075
$$ -101175 -5124 46728 -23741 -127129 -123957 -194155 -176881 -10484 125601 121659 125287 55212
5739E5212l8341n8147j51235j32700O6493J31274P6167k1927K6827j9910o8799
$$ 55212 16871 -41276 -192511 -325211 -258718 -127444 -51277 -73204 -46377 -66287 -135086
5728a35086K9265N6012m6007n702Q4092O8313J7068j01605o9843M2661P4196N5022
$$ -135086 -105821 -49809 -95816 -101518 -17426 50887 67955 -33650 -103493 -60832 13364 68386
5716F8386n7437j14008l2514p3809j3437N8255r07k7678J2726R2720j4591j0220
$$ 68386 10949 -103059 -135573 -209382 -222819 -164564 -165471 -193149 -180423 -87703 -102294 -112514
5704a12514M6070j012l5163m5788R313P3788N4432N9433j60146o6295Q8039j7675
$$ -112514 -66444 -67456 -102619 -148407 -139094 -65306 -10874 48559 -111587 -177882 -89843 -107518
5692a07518O6688L9558l7859q1984o75Q8623R5712j03490o8516m791J46587P7468
$$ -107518 -40830 -1272 -39131 -121115 -121790 -33167 62545 -40945 -109461 -114252 32335 109803
5680A09803m1117r3458J0990l7274J9687Q2589N6083n5010j87996l1751K4057
$$ 109803 68686 -24772 -13782 -51056 -31369 51220 107303 52293 -135703 -167454 -143397
5669a43397K7272O6276O1246q5691M5111K7061m6782l4471m7333k4929n1453j5982
$$ -143397 -116125 -49849 11397 -74294 -29183 -2122 -48904 -83375 -130708 -155637 -207090 -223072
5657b23072O1729L6181K1324n5873J2733J07827l5014l5482N4118p6119L1700
$$ -223072 -161343 -125162 -103838 -159711 -146978 -39151 -74165 -109647 -55529 -131648 -99948
5646i9948Q739q472J561N8995R1902k155m5123L0612r3650q4146j3706J37780
$$ -99948 -91209 -99681 -98120 -39125 52777 50622 5499 36111 -57539 -141685 -155391 -17611
5634a7611P2542m6416p4333m0168k5514N1199N4226p9769m1259N9116Q9736K530
$$ -17611 54931 8515 -65818 -105986 -131500 -80301 -26075 -105844 -147103 -87987 1749 4279
5622D279k8519n6923m5778J13397O8613L889J9702K5674M1714o1830r7836p6568
$$ 4279 -24240 -81163 -126941 -13544 55069 58958 78660 104334 146048 84218 -13618 -90186
5610i0186o069J20337R0506j5229o8275N923n761o1099n4404J2165M4558o677
$$ -90186 -96255 24082 114588 99359 31084 37007 31246 -29853 -84257 -72092 -27534 -34211
5598c4211j5074K4455O7468j31298r7101J56351R2974j04261P8754O3769j4426
$$ -34211 -49285 -24830 42638 -88660 -185761 -29410 63564 -40697 38057 101826 87400
5587H7400QM5251j03877m99P7385l5797n483n5140q0784N767N0609q3014j1298
$$ 87400 87408 132659 28782 28283 105668 69871 64388 9248 -71536 -65769 -15160 -98174 -109472
5574a09472M5927O5240M8291o9395j9680L768q2819O5313k3211q896j5561L7081
$$ -109472 -63545 1695 49986 -19409 -39089 -35321 -118140 -52827 -76038 -84934 -100495 -63414
5562f3414M8367L9429k9686K5236j27661j08551L2021l0129M5852P8892j8838
$$ -63414 -15047 24382 -5304 19932 -107729 -216280 -184259 -214388 -168536 -89644 -108482
5551a08482O1927j8094l5454j5168n1679q0183J7257O3031r225m5017M6089O1560
$$ -108482 -46555 -64649 -100103 -115271 -166950 -247133 -229876 -166845 -176070 -221087 -174998 -113438
5539a13438J77062K195l3611l2584m4567L3532q141J324Q1869N8908j54838J01866
$$ -113438 63624 65819 32208 -376 -44943 -11411 -19552 -18228 63641 122549 -32289 69577
5527F9577O8105L9419n922r8633k8566j7425n9281l5250j20614j3570J58709P5010
$$ 69577 137682 177101 171179 72546 43980 26555 -32726 -67976 -188590 -202160 -43451 31559
5515C1559O7125q5944M0458J7375q098N0537K9852m8588n0851k6086k0071l9942
$$ 31559 98684 12740 53198 70573 62475 113012 142864 94276 43425 17339 -2732 -42674
5503d2674l4732k5920O707M9502J13747J22767q2138l1111j6800l4830n2108L4781
$$ -42674 -77406 -103326 -96619 -47117 66630 189397 107259 76148 59348 24518 -27590 7191
5491G191Q5064l2791k7961j8308k6498o9802M9461N4096O6574o4282l1485L1940
$$ 7191 92255 59464 31503 13195 -13303 -83105 -33644 20452 87026 22744 -8741 23199
5479B3199J4971k6706O0270q9731j1802k5038P5031O7162L5629j21386j22342
$$ 23199 38170 11464 71734 -17997 -29799 -54837 20194 87356 122985 1599 -120743
5468a20743r8643K6236L2930J7203O2140j0976k2764K1441R1038q581Q812l6745
$$ -120743 -219386 -193150 -160220 -143017 -80877 -91853 -114617 -93176 -2138 -10719 -1907 -38652
5456c8652r9p660m1993O729N3119O7348M028j01832K7816J6484R12j41363j57977
$$ -38652 -38751 -46411 -88404 -81675 -28556 38792 42820 -59012 -31196 -14712 -13800 -155163 -313140
5443c13140O2366Q0863k2157J44503n1092O4727M0968N6785n8464L2325N8350
$$ -313140 -250774 -169911 -192068 -47565 -98657 -33930 7038 63823 5359 37684 96034
5432I6034j07737p503l269l6059K3894N2473R4314j32028n2652k4102k2559K6558
$$ 96034 -11703 -19206 -22475 -58534 -34640 17833 112147 -19881 -72533 -96635 -119194 -92636
5420i2636K1637L7345k4380K6481O138m8197l1322k5757L4222O2092M1703j2147
$$ -92636 -70999 -33654 -58034 -31553 -25415 -73612 -104934 -130691 -96469 -34377 7326 -4821
5408d821q9823p5132j1048j0714R0657J20389O6722K5025r084n7532k9298j0263
$$ -4821 -94644 -169776 -180824 -191538 -100881 19508 86230 111255 102171 44639 15341 5078
5396E078M1858Q7452o7392o464J18193K9254l4347k0154j02480j37737K2120J29278
$$ 5078 46936 134388 66996 60532 178725 207979 173632 153478 50998 -86739 -64619 64659
5384F4659J8967R075l0532J3443N9472j1445n7283m6045M4766O0402k0424m1895
$$ 64659 83626 92701 62169 75612 135084 123639 66356 20311 65077 125479 105055 63160
5372F3160N3152L5358r427k5875l6865m2465N2801J761l7033m0646L5489O2020
$$ 63160 116312 151670 142243 116368 79503 37038 89839 91600 54567 13921 49410 111430
5360A11430r0847q0491J0829r865P199O3500N3811n3292n8607J1463n3421j2128
$$ 111430 20583 -59908 -49079 -58944 -51745 11755 65566 12274 -46333 -34870 -88291 -100419
5348a00419Q9989P814l7890r993R5263J4546p11K8967l856K5249j37420p1833
$$ -100419 -10430 -2616 -40506 -50499 44764 59310 58599 87566 83710 108959 -28461 -100294
5336a00294p355J21219J33552j19280j06410Q2819R327n5513N5816J36097q2735
$$ -100294 -107649 13570 147122 27842 -78568 4251 13578 -41935 13881 149978 67243
5325F7243j04351O4357O8018o3110k7199q1723R9075P3095n0017m2871L9605J2971
$$ 67243 -37108 27249 95267 32157 4958 -76765 22310 95405 45388 2517 42122 55093
5313E5093m235p504l3478J2094M202P9490n6138o0092m5753N0708O8262r996j08266
$$ 55093 50858 43354 9876 21970 26172 105662 49524 -10568 -56321 -5613 62649 52653 -55613
5300e5613j41088m5796O2052N1757j5803N708N0351N7511J4579j1326K3338q6734
$$ -55613 -196701 -242497 -180445 -128688 -144491 -138783 -88432 -30921 -16342 -27668 -4330 -91064
5288i1064l3864o1450Q848N6163M8161J1281j2443n498R703m5101J7111Q3603
$$ -91064 -124928 -186378 -177530 -121367 -73206 -61925 -74368 -79866 -70163 -115264 -98153 -14550
5276a4550m8570L2928l6955l4820j6032Q8456n5753m8366l1431Q5757J20720L0222
$$ -14550 -63120 -30192 -67147 -101967 -117999 -29543 -85296 -133662 -165093 -79336 41384 71606
5264G1606M6387M0469n0112j29146L0955l9909j3563l6726o1464j1476k9990J03963
$$ 71606 117993 158462 108350 -20796 10159 -29750 -43313 -80039 -141503 -152979 -182969 -79006
5252g9006N3475M283p972m8612p6089m8497k740L530L7247m74M7562M4923p2536
$$ -79006 -25531 -21248 -29220 -77832 -153921 -202418 -205158 -201628 -164381 -164855 -117293 -72370 -144906
5239a44906M0430J14618R3144m6104j17154l9564k4333J79387L6611p3995O8645
$$ -144906 -104476 10142 103286 57182 -59972 -99536 -123869 55518 92129 18134 86779
5228H6779K6754j8561J2296K9833q2168j02331L4462p8156p0569k6500p972Q5337
$$ 86779 113533 94972 107268 137101 54933 -47398 -12936 -91092 -161661 -188161 -196133 -110796
5216a10796O7559n3460k7716N6281P9358M2105n8728j20169m8714j351K4466K4119
$$ -110796 -43237 -96697 -124413 -68132 11226 53331 -5397 -125566 -174280 -175631 -151165 -127046
5204a27046K5397K2912j08351P6706L6917m8412P2971L0067N1889K7828R3020
$$ -127046 -101649 -78737 -187088 -110382 -73465 -121877 -48906 -18839 33050 60878 153898
5193A53898k8750p4952j27366l9703N9304O891o6005M2987J25789J3670m2918
$$ 153898 125148 50196 -77170 -116873 -57569 -50678 -116683 -73696 52093 65763 22845
5182B2845O3960Q9741m3306m0913l2772q1246o2503R1231M2072p6333k1288J20001
$$ 22845 86805 176546 133240 92327 59555 -21691 -84194 7037 49109 -27224 -48512 71489
5170G1489k741k3867j930Q1763M4080J12o7087n4463j30181j02301k8173J13668
$$ 71489 68748 44881 42951 124714 168794 168906 101819 47356 -82825 -185126 -213299 -99631
5158i9631J11984m5920J7053k349n4914N0696o1428p4429j6930K3686P0735l7884
$$ -99631 12353 -33567 -16514 -18863 -73777 -23081 -84509 -158938 -175868 -152182 -81447 -119331
5146a19331o9497M7177R6697j0168m1300j9036O2075O5979m0774j5129j3742l3880
$$ -119331 -188828 -141651 -44954 -55122 -96422 -115458 -53383 12596 -28178 -43307 -57049 -90929
5134i0929M8884J55923J12111K6343n7236j1911L17j98655k7999M9506N0167m8104
$$ -90929 -42045 113878 225989 252332 195096 183185 183502 -15153 -43152 6354 56521 8417
5122H417p6023P5669O3340k1394K7272Q4512J0678M6484J656n6582L9432r9089
$$ 8417 -67606 8063 71403 50009 77281 161793 172471 218955 220611 164029 203461 104372
5110A04372r7925p3590Q2235n793k1109M9169k4330o7936p9999k2368N7579O379
$$ 104372 6447 -67143 15092 9299 -11810 37359 13029 -54907 -134906 -157274 -99695 -93316
5098i3316N9877R8996J16520p166m6992L4122p6662n3941o3995n3810J96J39802
$$ -93316 -33439 65557 182077 174911 127919 162041 85379 31438 -32557 -86367 -86171 53631
5086E3631M1772J3190l1264l9605j61203O183p805N3894K0660L7989o176q8562
$$ 53631 95403 108593 77329 37724 -123479 -117296 -125101 -71207 -50547 -12558 -18734 -107296
5074a07296M0634J6426j1820J01759L0683j8531p4376q6451P051K8885J1466J24198
$$ -107296 -66662 -50236 -62056 39703 70386 51855 -22521 -108972 -101921 -73036 -61570 62628
5062F2628l1320n8225l6258O6709J8172p069J1665m0726l8347J48231K6410q3059
$$ 62628 31308 -26917 -63175 3534 21706 14637 26302 -14424 -52771 95460 121870 38811
5050C8811p2210j1503L1219M551l5849q7486M0711N901J21088J8861L9658n9126
$$ 38811 -33399 -44902 -13683 -9132 -44981 -132467 -91756 -85855 35233 54094 93752 34626
5038C4626m8371o5725M7783J01971J3804J9216m4849k2968n6780n2795p6999M9459
$$ 34626 -13745 -79470 -31687 70284 84088 103304 58455 35487 -21293 -74088 -151087 -101628
5026a01628N8428M953o1919J4016M8050R5480J1732L4156R6036M002r1990j82759
$$ -101628 -43200 -38247 -100166 -86150 -38100 57380 69112 103268 199304 203306 111316 -71443
5014g1443J5056N4450q9061r798k9263r37J1389K4929P6837J19554M5910j05801
$$ -71443 -56387 -1937 -90998 -100796 -130059 -130996 -119607 -94678 -17841 101713 147623 41822
5002D1822j39082J558o0193M935O0199R5184O4345l7306q2146m9261m2241Q389
$$ 41822 -97260 -95702 -155895 -150960 -90761 4423 68768 31462 -50684 -99945 -142186 -133797
4990a33797L2279L6104q948l4097K9688j6888M6509O0185K1413r572J7008n3452
$$ -133797 -101518 -65414 -74362 -108459 -78771 -95659 -49150 11035 32448 22876 39884 -13568
$$ [...]
##END NTUPLES=NMR SPECTRUM
##END=
