##TITLE=Analysis number 330477
Compound Code cc 04946
Book Reference 546/68
Project Code adrs
Chemist Name craigr
##JCAMPDX= 6.0         $$ Bruker NMR JCAMP-DX V2.0
##DATA TYPE= NMR SPECTRUM
##DATA CLASS= NTUPLES
##ORIGIN= Bruker BioSpin GmbH
##OWNER= nmr
$$ XWIN-NMR		Version 3.5
$$ Thu Nov 29 09:27:58 2007 GMT Standard Time (UT+0h)  MAYBRIDGE\nmr@NMR_250MHZ
##.OBSERVE FREQUENCY= 250.131544655141
##.OBSERVE NUCLEUS= ^1H
##.ACQUISITION MODE= SIMULTANEOUS (DQD)
##.ACQUISITION SCHEME= undefined
##.AVERAGES= 16
##.DIGITISER RES= 18
##SPECTROMETER/DATA SYSTEM= dpx250
##.PULSE SEQUENCE= zg30
##.SOLVENT NAME= CDCl3
##.SHIFT REFERENCE= (INTERNAL, CDCl3, 0, 16.522)
##AUDIT TRAIL= $$ (NUMBER, WHEN, WHO, WHERE, WHAT)
$$ ##TITLE= Audit trail, XWIN-NMR		Version 3.5
$$ ##JCAMPDX= 5.01
$$ ##ORIGIN= Bruker BioSpin GmbH
$$ ##OWNER= nmr
$$ C:\u/data/dgb/nmr/ADRS/2430/pdata/1/auditp.txt
$$ ##AUDIT TRAIL=  $$ (NUMBER, WHEN, WHO, WHERE, WHAT)
(   1,<2007-11-29 09:27:36.18 +000>,<MAYBRIDGE\nmr>,<NMR_250MHZ>,
      <created by zg, POWCHK disabled, PULCHK disabled
       configuration hash MD5:
       76 6E 9A 78 1E 09 19 81 EC 84 63 8F B0 6A 59 2D
       data hash MD5: 64K
       4B 1A 2E 24 04 16 13 8F 2D 97 91 F6 01 7B CF 56>)
(   2,<2007-11-29 09:27:49.27 +000>,<MAYBRIDGE\nmr>,<NMR_250MHZ>,
      <Start of raw data processing
       ef LB = 0.3 FT_mod = 6 PKNL = 1 SI = 32K 
       data hash MD5: 32K
       F0 6F 4F B7 CA E8 8F 23 75 5A B9 9A 6A 82 45 72>)
(   3,<2007-11-29 09:27:50.83 +000>,<MAYBRIDGE\nmr>,<NMR_250MHZ>,
      <apk 
       data hash MD5: 32K
       CA 44 3F 53 72 70 85 24 1C 04 96 9E 22 7D 02 AA>)
(   4,<2007-11-29 09:27:51.58 +000>,<MAYBRIDGE\nmr>,<NMR_250MHZ>,
      <abs ABSG = 5 
       data hash MD5: 32K
       22 20 88 D3 B4 01 90 C2 C1 5B 5D 91 58 5E 26 98>)
$$ ##END=
$$ 
$$ hash MD5
$$ 3A 0B 05 D1 B6 CE 3F C7 3F 43 FE 74 BD 55 AC 70
##$RELAX= 
##$RELAX= 
##$RELAX= 
##$RELAX= 
##$RELAX= 
##$RELAX= 
##$RELAX= 
$$ Bruker specific parameters
$$ --------------------------
##$DU= <C:\u>
##$EXPNO= 2430
##$NAME= <ADRS>
##$PROCNO= 1
##$TYPE= <nmr>
##$USER= <dgb>
##$AMP= (0..31)
100 100 100 100 100 100 100 100 100 100 100 100 100 100 100 100 100 100 
100 100 100 100 100 100 100 100 100 100 100 100 100 100 
##$AQSEQ= 0
##$AQ_mod= 3
##$AUNM= <au_zg>
##$AUTOPOS= <23 >
##$BF1= 250.13
##$BF2= 250.13
##$BF3= 250.13
##$BF4= 250.13
##$BF5= 500.13
##$BF6= 500.13
##$BF7= 500.13
##$BF8= 500.13
##$BYTORDA= 1
##$CFDGTYP= 0
##$CFRGTYP= 5
##$CHEMSTR= <none>
##$CNST= (0..31)
1 1 145 1 1 1 1 1 1 1 1 1 1 1 1 1 1 1 1 1 1 1 1 1 1 1 1 1 1 1 1 1 
##$CPDPRG= <>
##$CPDPRG1= <>
##$CPDPRG2= <>
##$CPDPRG3= <>
##$CPDPRG4= <mlev>
##$CPDPRG5= <mlev>
##$CPDPRG6= <mlev>
##$CPDPRG7= <mlev>
##$CPDPRG8= <mlev>
##$CPDPRGB= <>
##$CPDPRGT= <>
##$D= (0..31)
0 1 0 0 0 0 0 0 0 0.06 0 0 0 0 0 0 0.0002 0 0 0 0 0 0 0 0 0 0 0 0 0 0 
0 
##$DATE= 1196328454
##$DBL= (0..7)
120 120 120 120 120 120 120 120 
##$DBP= (0..7)
150 150 150 150 150 150 150 150 
##$DBP07= 0
##$DBPNAM0= <>
##$DBPNAM1= <>
$$ [...]
##$SUBNAM7= <"">
##$SUBNAM8= <"">
##$SUBNAM9= <"">
##$SW= 20.6930455092707
##$SWIBOX= (0..15)
0 0 3 0 0 0 0 0 0 0 0 0 0 0 0 0 
##$SW_h= 5175.983436853
##$TD= 65536
##$TD0= 1
##$TE= 295.16
##$TE2= 300
##$TE3= 300
##$TEG= 300
##$TL= (0..7)
0 120 120 120 120 120 120 120 
##$TP= (0..7)
150 150 150 150 150 150 150 150 
##$TP07= 0
##$TPNAME0= <>
##$TPNAME1= <>
##$TPNAME2= <>
##$TPNAME3= <>
##$TPNAME4= <>
##$TPNAME5= <>
##$TPNAME6= <>
##$TPNAME7= <>
##$TPOAL= (0..7)
0.5 0.5 0.5 0.5 0.5 0.5 0.5 0.5 
##$TPOFFS= (0..7)
0 0 0 0 0 0 0 0 
##$TUNHIN= 0
##$TUNHOUT= 0
##$TUNXOUT= 0
##$USERA1= <user>
##$USERA2= <user>
##$USERA3= <user>
##$USERA4= <user>
##$USERA5= <user>
##$V9= 5
##$VALIST= <valist>
##$VCLIST= <CCCCCCCCCCCCCCC>
##$VD= 0
##$VDLIST= <DDDDDDDDDDDDDDD>
##$VPLIST= <PPPPPPPPPPPPPPP>
##$VTLIST= <TTTTTTTTTTTTTTT>
##$WBST= 1024
##$WBSW= 4
##$XGAIN= (0..3)
0 0 0 0 
##$XL= 0
##$YL= 0
##$YMAX_a= 262655
##$YMIN_a= -391704
##$ZGOPTNS= <>
##$ZL1= 120
##$ZL2= 120
##$ZL3= 120
##$ZL4= 120
##$ABSF1= 16.522
##$ABSF2= -4.171173
##$ABSG= 5
##$ABSL= 3
##$ALPHA= 0
##$AQORDER= 0
##$ASSFAC= 0
##$ASSFACI= 0
##$ASSFACX= 0
##$ASSWID= 0
##$AUNMP= <proc_1d>
##$AZFE= 0.1
##$AZFW= 0.1
##$BCFW= 0
##$BC_mod= 0
##$BYTORDP= 0
##$COROFFS= 0
##$CY= 12.5
##$DATMOD= 1
##$DC= 0
##$DFILT= <>
##$DTYPP= 0
##$F1P= 14.0000005364418
##$F2P= -0.99999901652339
##$FCOR= 0.5
##$FTSIZE= 32768
##$FT_mod= 6
##$GAMMA= 0
##$GB= 0
##$INTBC= 1
##$INTSCL= 1
##$ISEN= 128
##$LB= 0.3
##$LEV0= 0
##$LPBIN= 0
##$MAXI= 10000
##$MC2= 0
##$MEAN= 0
##$ME_mod= 0
##$MI= 0
##$NCOEF= 0
##$NC_proc= -3
##$NLEV= 6
##$NOISF1= 0
##$NOISF2= 0
##$NSP= 0
##$NTH_PI= 0
##$NZP= 0
##$OFFSET= 16.522
##$PC= 1
##$PHC0= 168.6599
##$PHC1= 6.626429
##$PH_mod= 1
##$PKNL= yes
##$PPARMOD= 0
##$PSCAL= 4
##$PSIGN= 0
##$REVERSE= no
##$SF= 250.13
##$SI= 32768
##$SIGF1= 0
##$SIGF2= 0
##$SINO= 400
##$SIOLD= 32768
##$SREGLST= <1H.CDCl3>
##$SSB= 0
##$STSI= 32768
##$STSR= 0
##$SW_p= 5175.98343685301
##$SYMM= 0
##$S_DEV= 0
##$TDeff= 65536
##$TDoff= 0
##$TI= <Analysis number 999999
Compound Code 99
Book Reference 9
Project Code 9>
##$TILT= no
##$TM1= 0
##$TM2= 0
##$TOPLEV= 0
##$USERP1= <user>
##$USERP2= <user>
##$USERP3= <user>
##$USERP4= <user>
##$USERP5= <user>
##$WDW= 1
##$XDIM= 32768
##$YMAX_p= 361543804
##$YMIN_p= -131253
$$ End of Bruker specific parameters
$$ ---------------------------------
##NTUPLES= NMR SPECTRUM
##VAR_NAME=  FREQUENCY,     SPECTRUM/REAL,   SPECTRUM/IMAG
##SYMBOL=    X,             R,               I
##VAR_TYPE=  INDEPENDENT,   DEPENDENT,       DEPENDENT
##VAR_FORM=  AFFN,          ASDF,            ASDF
##VAR_DIM=   32768,         32768,           32768
##UNITS=     HZ,            ARBITRARY UNITS, ARBITRARY UNITS
##FACTOR=    0.157963299565203, 1,           1
##FIRST=     4132.6476996994, 0,             0
##LAST=      -1043.33573715361, 0,           0
##MIN=       -1043.33573715361, -131253,     0
##MAX=       4132.6476996994, 361543804,     0
$$ Real data points
##PAGE= N=1
##DATA TABLE= (X++(R..R)), XYDATA
$$ [...]
$$ plain form
16572 -39036 -50936 -50502 -43695 -29755 -18251 -23604 -1531 12359 -25769 -37654 -44981 -33806 -28881
16559 -28881 -580 -8722 3735 -8916 -9309 333 -6655 -31561 -50876 -44085 -17597 -5089 -11764
16546 -11764 -3465 3150 -8425 6662 15425 -6766 -42398 -61710 -72152 -68023 -19626 3418
16534 3418 -463 -15894 -27425 -21971 -1616 8712 -9327 -7429 14391 4009 -6054 -31933
16522 -31933 -42160 -59218 -42650 -15997 -10192 -13478 -27195 -53673 -40206 -31539 -11934 36947
16510 36947 62553 75528 75364 44800 25411 11086 -35513 -56511 -54163 -37649 -8727 947
16498 947 15424 -9210 -32926 -21521 1055 36579 79480 73603 19854 621 15854 45001
16486 45001 54861 17820 -6978 -25781 -41538 -56977 -44236 -33226 -9636 32097 28415 15811
$$ packed form
16572c9036j1900M34O807J3940J1504n353K2073J3890l8128j1885p327J1175M925
16559b8881K8301q142J2457j2651l93R642o988k4906j9315O791K6488J2508o675
16546a1764Q299O615j1575J5087Q763k2191l5632j9312j0442M129M8397K3044
16534C418l881j5431j1531N454K0355J0328j8039J898K1820j0382j0063k5879
16522c1933j0227j7058J6568K6653N805l286j3717k6478J3467Q667J9605M8881
16510C6947K5606J2975j64l0564j9389j4325m6599k0998K348J6514K8922R674
16498I47J4477k4634k3716J1405K2576L5524M2901n877n3749j9233J5233K9147
16486D5001R860l7041k4798j8803j5757j5439J2741J1010K3590M1733l682j2604
$$ plain form
16474 15811 -18502 -22237 4603 19180 3879 -31488 -45953 -85569 -109996 -112414 -66381 -50150
16462 -50150 -35147 -41485 -33675 -51575 -24397 -11307 -49044 -71550 -82184 -83765 -94235 -72505
16450 -72505 -40806 -46698 -25146 -20065 -36188 -36942 -50200 -87125 -95278 -62882 -52421 -46558 -46586
16437 -46586 -48343 -62647 -55109 -42320 -29174 -22921 9797 11977 -5148 -19253 -47302 -53667 -38424
16424 -38424 -17110 -3010 -19121 -22000 -18470 -32166 -20107 -34939 -61725 -48374 -45501 -71095
16412 -71095 -81980 -39624 -1958 -2875 -13866 6276 -20437 -29671 -51727 -31573 -23516 -50152
16400 -50152 -56243 -49740 -43587 -68688 -68737 -59374 -61741 -66821 -26206 -8390 15695 3830 -22799
16387 -22799 -22981 -29955 -22007 -14985 -23126 -39573 -62108 -47727 -21355 -24346 -42316 -52426 -44679
$$ packed form
16474A5811l4313l735K6840J4577j5301l5367j4465l9616k4427k418M6033J6231
16462e0150J5003o338P810j7900K7178J3090l7737k2506j0634j581j0470K1730
16450g2505L1699n892K1552N081j6123p54j3258l6925q153L2396J0461N863k8
16437d6586j757j4304P538J2789J3146O253L2718K180j7125j4105k8049o365J5243
16424c8424K1314J4100j6111k879L530j3696J2059j4832k6786J3351K873k5594
16412g1095j0885M2356L7666r17j0991K0142k6713r234k2056K0154Q057k6636
16400e0152o091O503O153k5101m9R363k367n080M0615J7816K4085j1865k6629
16387b2799j82o974P948P022q141j6447k2535J4381K6372k991j7970j0110P747
$$ plain form
16374 -44679 -42815 -51049 -58024 -52183 -73003 -61967 -37997 -41319 -79381 -100052 -78007 -66655 -59324
16361 -59324 -48717 -36735 -50778 -57699 -45237 -13286 -15062 -55039 -58755 -46924 -34962 -16679
16349 -16679 16410 23143 11908 -11558 -41856 -25397 -17485 -18307 -40307 -46732 -44830 -45297 -58298
16336 -58298 -30640 11107 23302 10374 5844 14309 23033 -6600 -23906 -42133 -32729 -34728 -32886
16323 -32886 -26735 -16525 -12400 8056 -10072 8479 24863 28735 2151 -23449 -52074 -53559
16311 -53559 -43590 -25471 -7646 -436 13821 26149 -6457 -39864 -32942 -35804 -22878 -29742 -45229
16298 -45229 -58288 -56474 -28915 17325 45875 17196 -13216 -9370 -32168 -33351 -28335 -41041
16286 -41041 -35978 -29271 3079 5142 -20843 -18062 21697 47007 36090 2033 12830 21590 -5557
$$ packed form
16374d4679J864q234o975N841k0820J1036K3970l322l8062k0671K2045J1352P331
16361e9324J0607J1982j4043o921J2462L1951j776l9977l716J1831J1962J8283
16349a6679L3089O733j1235k3466l0298J6459P912q22k2000o425J902m67j3001
16336e8298K7658M1747J2195j2928m530Q465Q724k9633j7306j8227R404j999J842
16323c2886O151J0210M125K0456j8128J8551J6384L872k6584k5600k8625j485
16311e3559R969J8119J7825P210J4257J2328l2606l3407O922k862J2926o864j5487
16298d5229j3059J814K7559M6240K8550k8679l0412L846k2798j183N016j2706
16286d1041N063O707L2350K063k5985K781L9759K5310j0917l4057J0797Q760k7147
$$ plain form
16273 -5557 -22097 -9533 -2512 -8460 -7917 -9127 -483 12177 30224 23010 17994 9653 3720 18173
16259 18173 34683 30640 -16206 -35360 -15631 -17671 -14708 9353 16935 4641 -10001 -9339 -25492
16246 -25492 -18584 -22904 -1694 3880 -16102 -8966 20882 39434 24621 -8097 -27953 -50966
16234 -50966 -57180 -59253 -56484 -45469 -11683 19118 -7394 -29598 -29637 -18311 -40688 -25575 -4136
16221 -4136 -27640 -47494 -10253 -8134 -32800 -33230 -20700 -1281 -4788 8358 18374 3690 -14267
16208 -14267 -18558 -19433 -5990 15558 17363 33885 11477 -16377 -24996 78 12141 -15078 -25929
16195 -25929 -42657 -53513 -27326 -15626 -42852 -21134 -697 -8818 -18349 1358 -448 -28074
16183 -28074 -35189 -35942 -46726 -50458 -51733 -58677 -67847 -55810 -25915 -11335 -11646 -11948 -11987 -9631 -28715
$$ packed form
16273e557j6540J2564P021n948N43j210Q644J2660J8047p214n016q341n933J4453
16259A8173J6510m043m6846j9154J9729k040K963K4061P582j2294j4642O62j6153
16246b5492O908m320K1210N574j9982P136K9848J8552j4813l2718j9856k3013
16234e0966o214k073K769J1015L3786L0801k6512k2204l9J1326k2377J5113K1439
16221d136k3504j9854L7241K119k4666m30J2530J9419l507J3146J0016j4684j7957
16208a4267m291q75J3443K1548J805J6522k2408k7854q619K5074J2063k7219j0851
16195b5929j6728j0856K6187J1700k7226K1718K0437q121r531J9707j806k7626
16183b8074p115p53j0784l732j275o944r170J2037K9895J4580l11l02l9K356j9084
$$ plain form
16168 -28715 -34175 -5550 15333 11632 -5039 -13879 -37563 -52683 -49512 -28838 -20186 -16012 -53377
16155 -53377 -61295 -34158 -28613 -19706 -18439 -24376 -51770 -68676 -69714 -81303 -51140 -16100 -27866
16142 -27866 -58654 -64945 -46798 -38175 -56208 -43199 -61437 -80655 -67641 -56135 -60430 -84356
16130 -84356 -54120 -7670 -10348 -5582 5794 3062 -22683 -28702 -22390 -18077 -2185 -3773 -32378
16117 -32378 -37804 -1484 9777 -970 -32606 -51845 -21416 -25135 -18036 -31536 -64733 -61021
16105 -61021 -76584 -79590 -60500 -64258 -34241 -46314 -52992 -53312 -6687 12671 18362 4188 -33833
16092 -33833 -46616 -40000 -38570 -18278 14731 267 -24755 -21059 -34556 -40597 -7760 28346
16080 28346 10345 10127 -6548 -30758 -18940 -18112 -24547 -25146 -22700 -50142 -55103 -31765 -30971 -58275
$$ packed form
16168b8715n460K8625K0883l701j6671q840k3684j5120L171K0674Q652M174l7365
16155e3377p918K7137N545Q907J267n937k7394j6906j038j1589L0163L5040j1766
16142b7866l0788o291J8147Q623j8033J3009j8238j9218J3014J1506m295k3926
16130h4356L0236M6450k678M766J1376k732k5745o019O312M313J5892j588k8605
16117c2378n426L6320J1261j0747l1636j9239L0429l719P099j3500l3197L712
16105f1021j5563l006J9090l758L0017j2073o678l20M6625J9358N691j4174l8021
16092c3833j2783O616J430K0292L3009j4464k5022L696j3497o041L2837L6106
16080B8346j8001k18j6675k4210J1818Q28o435n99K446k7442m961K3338P94k7304
$$ plain form
16066 -58275 -61318 -69419 -58900 -24617 1619 -4167 -34035 -34441 -41610 -53796 -59440 -72446 -60665
16053 -60665 -27921 -25868 -64601 -69704 -29496 -17761 -21750 -33280 -36631 -33736 -30140 -44775 -34731
16040 -34731 -34397 -39539 -71496 -53723 -20392 1051 -136 -32035 -23556 -10970 1257 -5321 -15863
16027 -15863 -17799 8894 17750 6855 4564 -14559 -52146 -42635 -48482 -43175 7019 5455 -8799
16014 -8799 -19388 -23471 2235 12226 20581 -22864 -33071 -25385 -23864 -25681 -12958 7798 2185
16001 2185 15166 12938 2985 -23767 -5307 746 -11266 11451 24582 13755 11595 -9722 -45701
15988 -45701 -21025 15793 -6118 -37682 -6042 -10376 -19161 -6579 14464 8749 270 -19214
15976 -19214 -12757 -32554 -50815 -34598 -25458 -47983 -80618 -53100 -7904 30920 37869 25651
$$ packed form
16066e8275l043q101J0519L4283K6236n786k9868m06p169j2186n644j3006J1781
16053f0665L2744K053l8733n103M0208J1735l989j1530l351K895L596j4635J0044
16040c4731L34n142l1957J7773L3331K1443j187l1899Q479J2586J2227o578j0542
16027a5863j936K6693Q856j0895k291j9123l7587R511n847N307N0194j564j4254
16014h799j0589m083K5706R991Q355m3445j0207P686J521j817J2723K0756n613
16001B185J2981k228r953k6752J8460O053j2012K2717J3131j0827k160k1317l5979
15988d5701K4676L6818k1911l1564L1640m334q785J2582K1043n715q479j9484
15976a9214O457j9797j8261J6217R140k2525l2635K7518M5196L8824O949j2218
$$ plain form
15964 25651 11113 9696 -16543 -4766 23829 16121 -4294 5843 9005 -12143 -30209 -7470
15952 -7470 -31348 -38083 -34481 -14114 -13249 -26932 -23199 -15268 -197 5204 -5225 -19716 -24328
15939 -24328 145 5653 -11133 -17637 -17554 -28186 -19411 -40390 -28040 5885 6880 -10057 -9580 8973
15925 8973 -5379 -9792 -598 101 4298 13678 17669 20114 17758 20003 47235 59172 43586 27907
15911 27907 33652 18613 19012 20613 -11531 -47563 -58652 -56326 -23417 -6815 -2500 -17336 -13934
15898 -13934 -12466 -5965 -11084 -20553 -26512 -12098 17725 13676 -39438 -72802 -72299 -69432 -58350
15885 -58350 -16888 -10036 -3731 -20665 -21023 -7460 -358 9786 29358 28833 -6145 -31695 -20291
15872 -20291 -17276 -33578 -33633 -35358 -46129 -51617 -54838 -41912 -39053 -46471 -59320 -31235 -9857
$$ packed form
15964B5651j4538j417k6239J1777K8595p708k0415J0137L162k1148j8066K2739
15952g470k3878o735L602K0367Q65j3683L733P931J5071N401j0429j4491m612
15939b4328K4473N508j6786o504Q3j0632Q775k0979J2350L3925R95j6937M77J8553
15925H973j4352m413R194O99M197R380L991K445k356K245K7232J1937j5586j5679
15911B7907N745j5039L99J601l2144l6032j1089K326L2909J6602M315j4836L402
15898a3934J468O501n119r469n959J4414K9823m049n3114l3364N03K867J1082
15885e8350M1462O852O305j6934l58J3563P102J0144J9572n25l4978k5550J1404
15872b0291L015j6302n5j725j0771n488l221J2926K859p418j2849K8085K1378
$$ plain form
15859 -9857 2183 -14604 -20969 -3839 -13173 -12433 -27542 -36550 -20526 -24452 -56440 -80373 -41930
15846 -41930 -13074 -9967 -33437 -48667 -64352 -63062 -29679 -9351 1622 -11392 -68052 -56373
15834 -56373 -41264 -58729 -58924 206 19739 6531 -2674 -29827 -18574 11114 -6925 -18052
15822 -18052 309 11917 13424 8658 -26555 -28850 -26131 -8873 -10025 -14234 -7319 8047 9019
15809 9019 -15126 -15513 -3509 9942 -3951 -3509 5344 21138 27708 7878 10072 24992 7287
15796 7287 -1407 -14042 -33465 -29310 2996 20251 24503 18627 -3385 -18965 -20514 -14676 -17856
15783 -17856 -41089 -25754 -29157 -52507 -45418 -55163 -60697 -82496 -108169 -119352 -91806 -47207
15771 -47207 -25175 -14879 -11801 -4502 10313 789 -6725 -18199 -24327 -14681 -30997 -51720 -53323
$$ packed form
15859i857J2040j6787o365J7130r334P40j5109r008J6024l926l1988k3933L8443
15846d1930K8856L107k3470j5230j5685J290L3383K0328J0973j3014n6660J1679
15834e6373J5109j7465j95N9130J9533j3208r205k7153J1253K9688j8039j1127
15822a8052J8361J1608J507m766l5213k295K719J7258j152m209O915J5366R72
15809I019k4145l87J2004J3451j3893M42Q853J5794O570j9830K194J4920j7705
15796G287q694j2635j9423M155L2306J7255M252n876k2012j5580j549N838l180
15783a7856k3233J5335l403k3350P089r745n534k1799k5673j1183K7546M4599
15771d7207K2032J0296L078P299J4815r524p514j1474o128R646j6316k0723j603
$$ plain form
15758 -53323 -22980 5465 9320 -12762 -14329 -22786 -48116 -40124 -37937 -16611 5989 24861 13941
15745 13941 15284 45162 40379 -6189 -6978 10062 -11202 -32134 -23203 2786 10957 13020 -6938
15732 -6938 19546 38109 37515 43911 12672 -23117 -52968 -68562 -43724 -37694 -9347 -6866 -23856
15719 -23856 -31653 -54200 -58253 -40130 -24661 -39731 -55857 -45205 -24789 -30661 -18624 -15123
15707 -15123 1865 -406 -7110 -16011 -18631 -14387 5316 6693 -33986 -80013 -72772 -56268 -50329
15694 -50329 -68465 -64656 -62636 -74518 -87986 -80474 -54149 -14687 -14159 -34965 -50560 -58259 -36418
15681 -36418 -20886 -27406 -16086 -36936 -7659 -4435 -31410 -17850 1543 15614 13073 16738
15669 16738 -762 -7452 5853 326 -22483 -34844 -40367 -46370 -30153 -16482 -24284 -44335 -43090
$$ packed form
15758e3323L0343K8445L855k2082j567q457k5330P992K187K1326K2600J8872j0920
15745A3941J343K9878m783m6568p89J7040k1264k0932Q931K5989Q171K063j9958
15732f938K6484J8563n94O396l1239l5789k9851j5594K4838O030K8347K481j6990
15719b3856p797k2547m053J8123J5469j5070j6126J0652K0416n872J2037L501
15707a5123J6988k271o704q901k620M244J9703J377m0679m6027P241J6504N939
15694e0329j8136L809K020j1882j3468P512K6325L9462N28k0806j5595p699K1841
15681c6418J5532o520J1320k0850K9277L224k6975J3560J9393J4071k541L665
15669A6738j7500o690J3305n527k2809j2361n523o003J6217J3671p802k0051J245
$$ plain form
15656 -43090 -55338 -51692 -37279 -23502 -11559 -12337 4084 2579 -5939 -5189 -9526 3722 -10660
15643 -10660 -33645 -1469 8178 11527 478 -10359 -13001 -32945 -35287 -31350 -73329 -98762 -107632
15630 -107632 -95195 -45574 -14575 -6031 6046 3048 17672 6676 -6716 -12389 -8463 3012
15618 3012 -3430 -25619 -21517 1690 25727 19741 3788 -34047 -46665 -55579 -40849 -15431 11814
15605 11814 42652 17987 -1807 -8257 -23479 -51436 -49115 -42814 -35432 -23738 -29990 -44435 -53358
15592 -53358 -55692 -53365 -29601 -11540 11207 -3283 -37934 -52147 -40926 -35361 -41258 -38770 -41512
15579 -41512 -43738 -18741 12776 28614 23710 13944 5825 25979 23376 -10468 -35341 -19198 -7023
15566 -7023 8004 -3879 -28325 -4287 11300 9271 -7274 -14267 -8273 -3392 -4026 9021 24991
$$ packed form
15656d3090j2248L646J4413J3777J1943p78J6421j505q518P50m337J3248j4382
15643a0660k2985L2176R647L349j1049j0837k642j9944k342L937m1979k5433q870
15630a07632J2437M9621L0999Q544J2077k998J4624j0996j3392n673L926J1475
15618C012o442k2189M102K3207K4037n986j5953l7835j2618q914J4730K5418K7245
15605A1814L0838k4665j9794o450j5222k7957K321O301P382J1694o252j4445q923
15592e3358k334K327K3764J8061K2747j4490l4651j4213J1221N565n897K488k742
15579d1512k226K4997L1517J5838m904r766q119K0154k603l3844k4873J6143J2175
15566g023J5027j1883k4446K4038J5587k029j6545o993N994M881o34J3047J5970
$$ plain form
15553 24991 1887 -16568 -16027 -23150 -35028 -11890 -6992 6301 1075 -23543 -34534 -25224 -21004
15540 -21004 -14772 -567 -16957 -30658 -46128 -14804 4000 -4502 -2549 -13119 -24496 -26223
15528 -26223 -16412 -16172 -12718 -9575 -17170 -11276 11207 16650 -33741 -50995 -38745 -23293 -12192
15515 -12192 -42544 -25035 14391 -6674 -9581 4574 -15542 -15730 -12686 -18125 -56598 -64588 -45277
15502 -45277 9166 21853 13930 -13308 -4183 -1195 -28333 -34851 -44403 -66144 -45668 -26827 -23509
15489 -23509 -11648 -4995 -8252 -8430 -2013 -20318 -21948 -24224 -24437 -26752 -36452 -38649 -31652 -31220 -15456
15474 -15456 -38307 -19418 -2079 -30859 -55667 -52596 -65059 -35612 -15153 -13834 -6797 -20846
15462 -20846 -43350 -60000 -54029 -39278 -41015 -18159 3425 44070 69587 69369 80934 41950
$$ packed form
15553B4991k3104j8455N41p123j1878K3138M898J3293n226k4618j0991R310M220
15540b1004O232J4205j6390j3701j5470L1324J8804q502J953j0570j1377j727
15528b6223R811K40L454L143p595N894K2483N443n0391j7254J2250J5452J1101
15515a2192l0352J7509L9426k1065k907J4155k0116j88L044n439l8473p990J9311
15502d5277N4443J2687p923k7238R125K988k7138o518r552k1741K0476J8841L318
15489b3509J1861O653l257j78O417j8305j630k276k13k315r700k197O997M32J5764
15474a5456k2851J8889J7339k8780k4808L071j2463K9447K0459J319P037j4049
15462b0846k2504j6650N971J4751j737K2856K1584M0645K5517k18J1565l8984
$$ plain form
15450 41950 12523 5722 26462 51389 29635 23920 51381 24721 17997 30888 -3435 -16521
15438 -16521 -34021 -36316 -47289 -61402 -50342 -32224 -30729 -57517 -67419 -50517 -55888 -23734
15426 -23734 -8387 -17142 -29539 -55762 -45512 -49719 -51566 -53921 -51614 -33052 -10091 25302 17646
15413 17646 424 12354 19652 11268 -11669 -35861 -41413 -41312 -21423 -30279 -47455 -49840 -53719
15400 -53719 -41885 -46973 -25927 -5337 4107 18150 5371 -13740 -4042 14916 49608 20946
15388 20946 -13009 -48981 -75312 -61458 -47443 -18856 -25721 -31017 -54120 -59980 -55442 -46197 -63339
15375 -63339 -56904 -50858 -23843 1457 17101 -10038 -40841 -35822 -14230 2579 5934 -8308
15363 -8308 -33524 -48831 -41799 -36426 -38409 -43706 -42151 -49217 -38192 -25110 -19654 1911 19178
$$ packed form
15450D1950k9427o801K0740K4927k1754n715K7461k6660o724J2891l4323j3086
15438a6521j7500k295j0973j4113J1060J8118J495k6788r902J6902n371L2154
15426b3734J5347q755j2397k6223J0250m207j847k355K307J8562K2961L5393p656
15413A7646j7222J1930P298q384k2937k4192n552J01J9889q856j7176k385l879
15400e3719J1834n088K1046K0590R444J4043j2779j9111R698J8958L4692k8662
15388B0946l3955l5972k6331J3854J4015K8587o865n296k3103n860M538R245j7142
15375f3339O435O046K7015K5300J5644k7139l0803N019K1592J6809L355j4242
15363h308k5216j5307P032N373j983n297J555p066J1025J3082N456K1565J7267
$$ plain form
15350 19178 23578 34135 29742 -998 10643 -2864 -10207 -4046 21019 15360 8284 43691 43297
15337 43297 22671 9558 33864 68197 64303 66746 66156 49791 8939 -14450 10324 23665
15325 23665 31596 10985 -20754 -7344 4654 27818 21631 -25931 -45511 -10139 -11424 -27050
15313 -27050 -51627 -33355 -34073 -44999 -30039 -13311 -39250 -20796 -663 -9224 -18265 -4180
15301 -4180 -7348 11801 14920 -6547 -35118 -13069 122 24357 60130 34014 -34727 -68249
15289 -68249 -71194 -60591 -20100 -9116 -20542 -35104 -62270 -65846 -51809 -57643 -62399 -37864
15277 -37864 -7318 62 -8791 -18354 -1829 15575 13981 1538 -19011 -54559 -54580 -44405 -47925
15264 -47925 -768 37723 25969 -1560 -19882 -14434 28242 51321 42225 -254 -25198 -54925
$$ packed form
15350A9178M400J0557m393l0740J1641j3507p343O161K5065n659p076L5407l94
15337D3297k0626j3113K4306L4333l894K443n90j6365m0852k3389K4774J3341
15325B3665P931k0611l1739J3410J1998K3164o187m7562j9580L5372j285j5626
15313b7050k4577J8272p18j0926J4960J6728k5939J8454K0133q561r041J4085
15301d180l168J9149L119k1467k8571K2049J3191K4235L5773k6116o8741l3522
15289f8249k945J0603M0491J0984j1426j4562k7166l576J4037n834m756K4535
15277c7864L0546P380q853r563J6525J7404j594j2443k0549l5548k1J0175l520
15264d7925M7157L8491j1754k7529j8322N448M2676K3079r096m2479k4944k9727
$$ plain form
15252 -54925 -67266 -52901 -67629 -31038 2972 -7817 -8712 -19074 249 5605 -7636 -38918
15240 -38918 -76281 -67985 -58367 -45696 -5955 33257 25077 12865 26111 44281 30294 44633
15228 44633 28668 -296 -21000 -17807 -13194 -9504 -10049 11415 9460 -29787 -18947 2511 -25602
15215 -25602 -57166 -41554 -34497 -42087 -59518 -68561 -73092 -68191 -61176 -50147 -13492 -38665 -49218
15202 -49218 -27465 -12167 -16083 -9142 -15948 -7357 -18578 -34052 -23570 -10315 17453 5610
15190 5610 3967 15111 -6236 -12663 -2270 -2227 10373 12021 4204 -24792 -13405 -11505 -3567 20497
15176 20497 14220 -23487 -16411 15862 -16364 -36153 -22261 -35045 -36542 -25207 -5298 15159
15164 15159 -4772 -34316 -54043 -47951 -19683 -22903 -27718 -24294 -40755 -33672 -27356 -32021 -40926
$$ packed form
15252e4925j2341J4365j4728L6591L4010j0789q95j0362J9323N356j3241l1282
15240c8918l7363Q296R618J2671L9741L9212q180j2212J3246J8170j3987J4339
15228D4633j5965k8964k0704L193M613L690n45K1464j955l9247J0840K1458k8113
15215b5602l1564J5612P057p590j7431r043m531M901P015J1029L6655k5173j0553
15202d9218K1753J5298l916O941o806Q591j1221j5474J0482J3255K7768j1843
15190E610j643J1144k1347o427J0393M3J2600J648p817k8996J1387J900P938K4064
15176B0497o277l7707P076L2273l2226j9789J3892j2784j497J1335J9909K0457
15164A5159j9931k9544j9727O092K8268l220m815L424j6461P083O316m665q905
$$ plain form
15151 -40926 -40518 -50565 -44591 -18253 -16601 -36063 -30622 12128 35560 -7532 -49855 -49383 -55651
15138 -55651 -52487 -28417 -29991 -31878 -9795 26611 -650 -8690 4243 10270 14297 -2526 -4751
15125 -4751 -22846 -33286 -14301 11462 9647 1241 -14570 -15743 -17176 -35569 -8836 10890 9183
15112 9183 2824 36870 14423 -8907 -36472 -42527 -7996 4449 -4254 -13509 3276 -3265 -21693
15099 -21693 -28524 -35644 -24656 1487 50891 74276 45305 12147 -1561 -1378 -27183 -31020 -27712
15086 -27712 -26116 -4288 -24707 -38890 -26718 -43083 -52870 -36605 -47782 -61710 -62362 -51999
15074 -51999 -32969 -7247 2302 -11163 -12651 -3890 -11634 -3978 -40085 -39700 -18301 -15751 -14385
15061 -14385 -44324 -63079 -74223 -91095 -55833 -25325 -28189 -32845 -41169 -30006 -18594 -15903
$$ packed form
15151d0926M08j0047N974K6338J652j9462N441M2750K3432m3092m2323M72o268
15138e5651L164K4070j574j887K2083L6406k7261q040J2933O027M027j6823k225
15125d751j8095j0440J8985K5763j815q406j5811j173j433j8393K6733J9726j707
15112I183o359L4046k2447k3330k7565o055L4531J2445q703r255J6785o541j8428
15099b1693o831p120J0988K6143M9404K3385k8971l3158j3708J83k5805l837L308
15086b7712J596K1828k0419j4183J2172j6365r787J6265j1177j3928o52J0363
15074e1999J9030K5722R549j3465j488Q761p744P656l6107L85K1399K550J366
15061a4385k9939j8755j1144j6872L5262L0508k864m656q324J1163J1412K691
$$ plain form
15049 -15903 -31576 -11798 8041 -7492 -27961 -15173 11217 10560 -31196 -59559 -43314 -37739
15037 -37739 -41360 -24494 -7949 -28091 -54276 -34075 -11390 -8309 -12173 209 4414 7478 -10082
15024 -10082 -15385 -25428 -13635 -5980 25598 36366 -6858 -43559 -51573 -51827 -27677 -24706 -36245
15011 -36245 -48365 -18233 10212 16902 9911 30072 21282 18805 19789 21624 6047 15151 22746
14998 22746 20874 41434 66441 81800 143948 264289 388516 375395 289267 201548 129245
14987 129245 96567 76473 44187 11106 -6377 -11192 -16224 -28441 -4744 -15636 2628 14735
14975 14735 2190 -3014 1904 -3594 7264 -19146 -38842 -39390 -24246 -9379 15132 27894 36742
14962 36742 44593 26658 11533 17107 27374 2779 5073 -16528 -12675 -1178 -22160 -42738
$$ packed form
15049a5903j5673J9778J9839j5533k0469J2788K6390o57m1756k8363J6245N575
15037c7739l621J6866J6545k0142k6185K0201K2685L081l864J2382M205L064j7560
15024a0082n303j0043J1793P655L1578J0768m3224l6701q014k54K4150K971j1539
15011c6245j2120L0132K8445O690o991K0161q790k477R84J835j5577R104P595
14998B2746j872K0560K5007J5359O2148J20341J24227j3121q6128q7719p2303
14987A29245l2678k0094l2286l3081j7483m815n032j2217K3697j0892J8264J2107
14975A4735j2545n204M918n498J0858k6410j9696n48J5144J4867K4511J2762Q848
14962C6742P851j7935j5125N574J0267k4595K294k1601L853J1497k0982k0578
$$ plain form
14950 -42738 -50806 -56646 -86679 -94434 -85994 -69242 -26510 3562 10792 31016 45701 17085 6503
14937 6503 -27292 -65397 -56303 -38451 -6491 -10966 974 -1442 4274 28681 14497 -6261 -13144
14924 -13144 -10719 -16632 -32276 -54300 -40672 -27312 -21304 -38451 -33937 -52096 -45017 -36595 10977
14911 10977 55499 50400 14309 1675 6141 12781 11529 -28520 -19315 3295 26114 26279 26578
14898 26578 22419 30060 -2762 -19771 -8866 -13733 -13152 -1598 12348 -1037 9491 -10117 -22725
14885 -22725 -43611 -32751 -18859 1854 -13605 -20006 -35109 -47584 -24280 -7971 -21203 -45589
14873 -45589 -29243 2091 9546 11693 -9495 -43190 -81489 -97437 -50990 1730 2670 -25232
14861 -25232 -271 6663 12324 14016 -19957 -24649 -8656 -12922 -5823 -14972 -21297 -24942 -23861 -31458
$$ packed form
14950d2738q068n840l0033p755Q440J6752M2732L0072P230K0224J4685k8616j0582
14937F503l3795l8105R094J7852L1960m475J1940k416N716K4407j4184k0758o883
14924a3144K425n913j5644k2024J3628J3360O008j7147M514j8159P079Q422M7572
14911A0977M4522n099l6091j2634M466O640j252m0049R205K2610K2819J65K99
14898B6578m159P641l2822j7009J0905m867N81J1554J3946j3385J0528j9608j2608
14885b2725k0886J0860J3892K0713j5459o401j5103j2475K3304J6309j3232k4386
14873d5589J6346L1334P455K147k1188l3695l8299j5948M6447N2720R40k7902
14861b5232K4961O934N661J692l3973m692J5993m266P099r149o325l645J081p597
$$ plain form
14847 -31458 -16645 -17276 -35031 -32597 -42405 -57701 -59535 -32543 -34756 -17610 -4721 5839 17057
14834 17057 -5046 -39923 -7206 -10247 -29561 -6554 -11062 -29440 -24625 -21589 -14019 27038 10900
14821 10900 352 -17684 -44106 -41479 -25414 -30605 -38405 -30242 -41238 -33780 -4169 20851 23759
14808 23759 12506 16803 -6211 -14060 -17851 -32232 -11825 1269 7841 -2211 -6796 23652 23158
14795 23158 17421 9165 5928 19000 27169 39491 19941 3771 -16729 -29837 -21027 -866 24914
14782 24914 31136 9002 -14183 -41315 -44578 -51323 -34598 -11248 -15675 -34545 -31288 -51025 -53469
14769 -53469 -40868 -67901 -53545 -13020 -32780 -40715 -35521 -28948 -17995 -10203 -23499 -24873 -36507
14756 -36507 -8730 19491 2288 4914 14995 9503 19234 17960 29924 6905 -11050 24718
$$ packed form
14847c1458J4813o31j7755K434r808j5296j834K6992k213J7146J2889J0560J1218
14834A7057k2103l4877L2717l041j9314K3007m508j8378M815L036P570M1057j6138
14821A0900j0548j8036k6422K627J6065n191p800Q163j0996P458K9611K5020K908
14808B3759j1253M297k3014p849l791j4381K0407J3094O572j0052m585L0448m94
14795B3158n737q256l237J3072Q169J2322j9550j6170k0500j3108Q810K0161K5780
14782B4914O222k2134k3185k7132l263o745J6725K3350m427j8870L257j9737k444
14769e3469J2601k7033J4356M0525j9760p935N194O573J0953P792j3296j374j1634
14756c6507K7777K8221j7203K626J0081n492R731j274J1964k3019j7955L5768
$$ plain form
14744 24718 67460 63973 23016 8899 -6911 -26824 -46326 -21654 -21436 -19089 -4576 -3159 2570
14731 2570 27083 60214 96153 103129 91343 102094 102656 90962 87363 94726 87897 74461 58768
14718 58768 41949 25348 22279 32610 32353 17103 10070 -2145 15558 11095 1765 -658 49151
14705 49151 44313 36808 41854 34405 42323 22484 39681 52242 36831 8128 843 -7573 10122
14692 10122 9422 13140 21196 -10618 -9927 -10166 -21425 -10380 -687 785 1784 -4416 -21224 -444
14678 -444 2214 5939 12693 -2443 -8240 -12788 6943 -4777 -12643 -6565 -7972 -31460 -24250 -43478
14664 -43478 -22871 375 -20230 -12174 10426 -16537 -38763 -57617 -56464 -49731 -65710 -61667
14652 -61667 -52743 -69085 -80386 -63880 -27305 -4991 5849 -1058 4103 -1620 -29883 -19261
$$ packed form
14744B4718M2742l487m0957j4117j5810j9913j9502K4672K18K347J4513J417N729
14731B570K4513L3131L5939O976j1786J0751N62j1694l599P363o829j3436j5693
14718E8768j6819j6601l069J0331k57j5250p033j2215J7703m463r330k423M9809
14705D9151m838p505N046p449P918j9839J7197J2561j5411k8703p285q416J7695
14692A0122p00L718Q056l1814O91k39j1259J1045R693J472R99o200j6808K0780
14678d44K658L725O754j5136n797m548J9731j1720p866O078j407k3488P210j9228
14664d3478K0607K3246k0605Q056K2600k6963k2226j8854J153O733j5979M043
14652f1667Q924j6342j1301J6506L6575K2314J0840o907N161n723k8263J0622
$$ plain form
14640 -19261 -34241 -34059 -7695 11971 4981 -9954 -12603 -1489 -14428 -11477 1049 -775 3934
14627 3934 -4875 -18188 -2638 15899 12168 -8220 2559 19674 -3200 -22386 -10807 15205
14615 15205 14648 -105 -321 21418 33877 54668 47707 29802 23970 34463 19544 4715 -12712
14602 -12712 -27385 -49813 -24927 3904 19037 11022 32034 12499 5827 4276 -12793 1926
14590 1926 -9345 -20199 4056 21202 25073 42514 24649 33185 29299 20714 13269 20714 31164
14577 31164 2146 -34030 -42736 -42525 -41535 -28235 -17051 -12820 -25869 -32860 -31666 -14952 -14345 -21428
14563 -21428 -38336 -17875 8788 -20098 -53839 -39851 -43077 -44371 -37863 -40232 -36408 -38835 -23108
14550 -23108 -1580 -675 -40700 -31823 -11917 1682 21096 16238 -3335 2706 -17292 -31453 3047
$$ packed form
14640a9261j4980J82K6364J9666o990j4935k649J1114j2939K951J2526j824M709
14627C934q809j3313J5550J8537l731k0388J0779J7115k2874j9186J1579K6012
14615A5205n57j4753k16K1739J2459K0791o961j7905n832J0493j4919j4829j7427
14602a2712j4673k2428K4886K8831J5133q015K1012j9535o672j551j7069J4719
14590A926j1271j0854K4255J7146L871J7441j7865Q536l886q585p445P445J0450
14577C1164k9018l6176q706K11R90J3300J1184M231j3049o991J194J6714O07p083
14563b1428j6908K0461K6663k8886l3741J3988l226j294O508k369L824k427J5727
14550b3108K1528R05m0025Q877J9906J3599J9414m858j9573O041j9998j4161L4500
$$ plain form
14537 3047 12543 10571 9626 14341 18039 5777 19115 5633 -9548 17788 59337 50742 14260
14524 14260 -15579 -4318 -2963 -14156 -26087 -2715 -5319 -16475 -3737 3141 -14090 -17692
14512 -17692 -9709 24131 18934 -4637 -38870 -28011 -20187 -23536 -35993 -24577 14004 10487 17083
14499 17083 20199 11286 20494 4583 -5483 17681 24879 11907 -6096 -38014 -20001 4937
14487 4937 22551 29323 7970 -19767 -31563 -33389 -35095 -22285 16969 15255 -8162 -2072 10316
14474 10316 -9669 -24658 -13779 -18657 -8321 16339 12991 18670 32876 42028 55448 54566 35707
14461 35707 40247 75449 96448 87336 42019 41386 42184 65977 73347 31502 10213 22863 -8726
14448 -8726 -21164 -10969 25605 41571 14473 14224 18238 -1472 27436 44065 23827 50360
$$ packed form
14537C047R496j972r45M715L698j2262J3338j3482j5181K7336M1549q595l6482
14524A4260k9839J1261J355j1193j1931K3372k604j1156J2738O878j7231l602
14512a7692P983L3840n197k3571l4233J0859P824l349j2457J1416L8581l517O596
14499A7083L116q913R208j5911j0066K3164P198j2972j8003l1918J8013K4938
14487D937J7614O772k1353k7737j1796j826j706J2810L9254j714k3417O090J2388
14474A0316j9985j4989J0879m878J0336K4660l348N679J4206R152J3420q82j8859
14461C5707M540L5202K0999r112m5317o33P98K3793P370m1845k1289J2650l1589
14448h726j2438J0195L6574J5966k7098k49M014j9710K8908J6629k0238K6533
$$ plain form
14436 50360 14183 6655 33190 67004 29134 19093 21187 11142 12897 18308 26374 -1219 2079
14423 2079 -23170 -23240 -20857 11239 8887 14763 29276 38875 20615 -6709 -3394 9818 -14251
14410 -14251 -14787 -7904 -7044 -12172 -10029 8769 33661 15169 -8809 7888 28376 17157 21698
14397 21698 24534 16768 -9781 -24367 -21219 -13429 -12469 -8627 -11711 -20732 -417 5670 -14320 -23272
14383 -23272 -8668 -25856 -17498 -15717 -3567 6201 -30519 -42400 -32522 -11882 -10518 19710 50081
14370 50081 38922 10943 14909 5228 -1347 14496 5410 -14155 -26827 -34094 -32282 -16683 -15399
14357 -15399 -6367 3098 4106 -4935 -18812 -32587 -21029 -11242 -35555 -39945 3959 151 -21385
14344 -21385 -44783 -58013 -57673 -24785 16455 36608 49080 39629 2034 4933 30618 21067 16951
$$ packed form
14436E0360l6177p528K6535L3814l7870j0041K094j0045J755N411Q066k7593L298
14423B079k5249p0K383L2096k352N876J4513R599j8260k7324L315J3212k4069
14410a4251n36O883Q60n128K143J8798K4892j8492k3978J6697K0488j1219M541
14397B1698K836p766k6549j4586L148P790R60L842l084r021K0315O087j9990q952
14383b3272J4604j7188Q358J781J2150R768l6720j1881R878K0640J364L0228L0371
14370E0081j1159k7979L966r681o575J5843r086j9565j2672p267J812J5599J284
14357a5399R032R465J008r041j3877j3775J1558R787k4313m390M3904l808k1536
14344b1385k3398j3230L40L2888M1240K0153J2472r451l7595K899K5685r551m116
$$ plain form
14331 16951 7453 726 -19016 -16955 25827 37678 10379 -5606 -2782 4924 -554 -24243 -29760
14318 -29760 5432 -4103 -29081 -29613 -20791 -46739 -43997 -26803 -9814 -1481 -3302 -2775 -11460 -3640
14304 -3640 9532 -17842 -45387 -41178 -9020 1033 -28666 3731 -11508 -21939 -35558 -24268
14292 -24268 -34624 -30503 -33474 -24377 -58809 -79542 -51679 -21890 -12906 32433 38204 10804 -4318
14279 -4318 525 9815 -17008 -9564 -9616 8870 -922 -16340 -2771 -23585 -37409 -26897 -25108
14266 -25108 -36754 -45686 -36988 -26369 -36481 -19371 -33789 -47648 -55841 -60918 -71069 -72433 -40300
14253 -40300 -12983 -28720 -30014 -52162 -39234 -21458 -42600 -12854 5888 9350 17746 -1805
14241 -1805 -6080 6729 7788 18519 27830 29293 16017 25847 12393 -14885 -6279 26651 37951
$$ packed form
14331A6951r498o727j9742K061M2782J1851k7299j5985K824P706n478k3689n517
14318b9760L5192r535k4978n32Q822k5948K742J7194J6989Q333j821N27q685P820
14304c640J3172k7374k7545M209L2158J0053k9699L2397j5239j0431j3619J1290
14292b4268j0356M121k971R097l4432k0733K7863K9789Q984M5339N771k7400j5122
14279d318M843R290k6823P444n2J8486r792j5418J3569k0814j3824J0512J789
14266b5108j1646q932Q698J0619j0112J7110j4418j3859q193n077j0151j364L2133
14253d0300K7317j5737j294k2148J2928J7776k1142K9746J8742L462Q396j9551
14241a805m275J2809J059J0731R311J463j3276R830j3454k7278Q606L2930J1300
$$ plain form
14228 37951 23148 14839 26791 7271 5512 1963 5721 3846 2205 20711 19952 19214 11899 -5919
14214 -5919 -26287 -21496 3214 21679 39220 26851 22725 18000 24707 5960 -2173 17580 8675
14201 8675 5870 15430 30620 25631 28536 37092 47579 40483 38615 38880 35582 35022 14501 -26008
14187 -26008 -42518 -47278 -45282 -30847 9649 938 2066 10787 -14722 -8940 -12997 -19698 -6534
14174 -6534 2012 -4086 1072 -14445 -6924 -10722 15901 50133 33143 -1563 -9183 9105 8246
14161 8246 10195 5750 -10341 684 48505 65635 19465 -4221 350 693 9132 20361 44614
14148 44614 39614 59556 47054 41187 23666 -4368 -4159 987 42203 60525 82494 56273 7366
14135 7366 -12046 -3863 12377 2053 20653 20682 26954 32584 15838 -7060 -16756 -21823 25915
$$ packed form
14228C7951j4803q309J1952j9520j759l549L758j875j641J8506p59p38p315j7818
14214e919k0368M791K4710J8465J7541j2369m126m725O707j8747q133J9753q905
14201H675k805R560J5190m989K905Q556J0487p096j868K65l298n60k0521m0509
14187b6008j6510m760J996J4435M0496q711J128Q721k5509N782m057o701J3164
14174f534Q546o098N158j5517P521l798K6623L4232j6990l4706p620J8288q59
14161H246J949m445j6091J1025M7821J7130m6170k3686M571L43Q439J1229K4253
14148D4614n000J9942j2502n867j7521k8034K09N146M1216J8322K1969k6221m8907
14135G366j9412Q183J6240j0324J8600K9O272N630j6746k2898r696n067M7738
$$ plain form
14122 25915 53872 9292 -3078 -26969 -36649 -33604 -12554 4517 19998 39844 20767 -7011
14110 -7011 -13146 -14791 -17596 -4341 14061 -4256 -44008 -65204 -43981 -22985 6106 12225 1911
14097 1911 3927 -5495 -20853 -32853 -43224 -60435 -49633 -36799 -32516 -21545 -29823 -55084 -42813
14084 -42813 13425 17841 38682 33908 34566 36270 26013 -1776 -18426 -36110 -29331 -10228 6104
14071 6104 32125 27701 2331 -20192 -12649 3908 3581 8551 31436 17688 918 -1662 21198
14058 21198 22293 -7760 -17225 -9283 -15925 -4404 -20923 -6175 24101 15789 18713 25519 5244
14045 5244 16234 30100 21631 6184 23655 -1955 -14663 1292 6693 5461 4166 404 10800
14032 10800 9985 13369 18358 43687 14698 -23348 -10148 -36750 -42957 -34382 -21155 -17183 -8020
$$ packed form
14122B5915K7957m4580j2370k3891r680L045K1050J7071J5481J9846j9077k7778
14110g011o135j645k805J3255J8402j8317l9752k1196K1223K0996K9091O119j0314
14097A911K016r422j5358j2000j0371j7211J0802J2834M283J0971q278k5261J2271
14084d2813N6238M416K0841m774O58J704j0257k7789j6650j7684O779J9103J6332
14071F104K6021m424k5370k2523P543J6557l27M970K2885j3748j6770k580K2860
14058B1198J095l0053r465P942o642J1521j6519J4748L0276q312K924O806k0275
14045E244J0990J3866q469j5447J7471k5610j2708J5955N401j232j295l762J0396
14032A0800q15L384M989K5329k8989l8046J3200k6602o207Q575J3227L972R163
$$ plain form
14019 -8020 -41610 -38632 -47270 -31434 -14398 -21940 -32969 -24049 -43865 -36910 -25558 -1898 7491
14006 7491 18585 30458 36218 55360 49592 29062 17513 26812 6336 -21115 -27595 -22139 -1764
13993 -1764 19799 42716 39777 30535 2990 -13133 7783 32994 20093 13526 25706 31887 27880
13980 27880 21304 12713 19671 22134 31010 21732 11201 -6243 -24360 -55102 -56553 -56900 -29794
13967 -29794 -35239 -65976 -63137 -37346 -40002 -26501 2700 20019 18978 9631 3077 13397 16297
13954 16297 41297 52810 23633 -14435 -26433 -9010 1211 18264 31376 19336 8625 21139
13942 21139 43314 26771 3100 23045 31952 14736 -1615 -16202 -23371 -2648 8850 182
13930 182 9936 22417 47299 67790 52579 46741 42066 20789 3667 -22704 -8284 -3803 -20321
$$ packed form
14019h020l3590K978q638J5836J7036p542j1029Q920j9816O955J1352K3660R389
14006G491J1094J1873N760J9142n768k0530j1549R299k0476k7451o480N456K0375
13993a764K1563K2917k939r242k7545j6123K0916K5211j2901o567J2180O181m007
13980B7880o576q591O958K463Q876r278j0531j7444j8117l0742j451l47K7106
13967b9794n445l0737K839K5791k656J3501K9201J7319j041r347o554J0320K900
13954A6297K5000J1513k9177l8068j1998J7423J0221J7053J3112j2040j0711J2514
13942B1139K2175j6543k3671J9945Q907j7216j6351j4587p169K0723J1498q668
13930A82R754J2481K4882K0491j5211n838m675k1277j7122k6371J4420M481j6518
$$ plain form
13917 -20321 -21529 -23422 -18588 245 2871 -3015 -19089 -37638 -39683 -57440 -71067 -50217 -20658
13904 -20658 889 -3042 18226 14748 -9801 -2676 5423 157 -37833 -20161 25964 34381 14768
13891 14768 3629 -5299 -10021 12764 21411 39195 51208 79592 87600 54269 11595 -22102
13879 -22102 -29810 -19164 -37367 -29944 -35579 -32762 -25993 -6607 -11890 -8965 -2750 -23366 -15205
13866 -15205 -203 20535 24128 -14443 9725 5425 -37102 -28537 -14028 -14445 789 -14346 -12895
13853 -12895 6897 24530 20886 21462 433 8922 57029 62295 32570 26107 21901 8748 34134
13840 34134 37953 19627 33381 28413 23388 15188 49234 87066 98107 111962 136602 178846
13828 178846 199120 192163 171290 175094 156476 123887 96361 71958 69803 44328 -1827 -12668
$$ packed form
13917b0321j208j893M834J8833K626n886j6074j8549k045j7757j3627K0850K9559
13904b0658K1547l931K1268l478k4549P125Q099n266l7990J7672M6125Q417j9613
13891A4768j1139q928m722K2785Q647J7784J2013K8384Q008l3331m2674l3697
13879b2102p708J0646j8203P423n635K817O769J9386n283K925O215k0616Q161
13866a5205J5002K0738L593l8571K4168m300m2527Q565J4509m17J5234j5135J451
13853a2895J9792J7633l644N76k1029Q489M8107N266k9725o463m206j3153K5386
13840C4134L819j8326J3754m968n025q200L4046L7832J1041J3855K4640M2244
13828A78846K0274o957k0873L804j8618l2589k7526k4403k155k5475m6155j0841
$$ plain form
13816 -12668 -17313 -5783 -23306 -22192 -7367 -23795 -16409 12545 34655 48825 35147 18484
13804 18484 63324 72829 40085 8804 -5004 -4311 1640 26693 39899 29082 27226 27658 5879
13791 5879 9118 7210 9772 -12558 -37800 -41905 -49331 -46305 -6304 35976 44904 43239 22113
13778 22113 11198 -6510 -8380 -3169 -54905 -50793 -48180 -18094 38 2964 -5285 -13310 -25486
13765 -25486 -19684 -31601 -26451 -7911 11353 31470 50793 40054 15444 27181 27151 10068 3302
13752 3302 -9328 -34764 -35877 -4190 2047 42342 72021 52062 31390 24858 26257 41211 69946
13739 69946 59326 40892 30198 41589 44800 33860 35421 69752 71214 38588 6998 8195
13727 8195 13606 -5433 -32075 -37714 -24200 -17934 -1653 -14755 -48419 -42133 -18508 808 -3716
$$ packed form
13816a2668m645J1530j7523J114J4825j6428P386K8954K2110J4170j3678j6663
13804A8484M4840R505l2744l1281j3808O93N951K5053J3206j0817j856M32k1779
13791E879L239j908K562k2330k5242m105p426L026M0001M2280Q928j665k1126
13778B2113j0915j7708j870N211n1736M112K613L0086J8132K926q249q025j2176
13765b5486N802j1917N150J8540J9264K0117J9323j0739k4610J1737l0j7083o766
13752C302j2630k5436j113L1687O237M0295K9679j9959k0672o532J399J4954K8735
13739F9946j0620j8434j0694J1391L211j0940J561L4331J462l2626l1590J197
13727H195N411j9039k6642n639J3514O266J6281j3102l3664O286K3625J9316m524
$$ plain form
13714 -3716 -33075 -25575 -24964 -31469 -34750 1642 13109 -5449 -9609 -3217 -9 4455 -2201 -21777
13700 -21777 -383 -2080 -30732 -55330 -43888 -3204 19902 30423 12951 5165 419 22079
13688 22079 15726 14713 16723 22518 18771 16034 2493 14773 7839 15617 36073 18700 26144
13675 26144 14418 -22358 -34762 -27782 -27628 -41039 -28079 -34224 -32030 -10433 -2297 6830 13099
13662 13099 10817 8197 10582 31552 56587 58295 13724 6590 -6884 -21951 1422 10766 -6733
13649 -6733 -14186 -3299 13761 2293 256 10011 29135 26990 25878 29609 38776 49868 49058 68493
13635 68493 60763 33935 47751 65413 92229 92158 70003 58941 68634 56508 69229 71845 87466
13622 87466 124549 154823 175552 203291 244321 281185 348146 466967 580010 677447 760014
$$ packed form
13714c716k9359P500O11o505l281L6392J1467j8558m160O392L208M464o656j9576
13700b1777K1394j697k8652k4598J1442M0684K3106J0521j7472p786m746K1660
13688B2079o353j013K010N795l747k737j3541J2280o934P778K0456j7373P444
13675B6144j1726l6776j2404O980J54j3411J2960o145K194K1597Q136R127O269
13662A3099k282k620K385K0970K5035J708m4571p134j3474j5067K3373R344j7499
13649f733p453J0887J7060j1468k037R755J9124k145j112L731R167J1092q10J9435
13635F8493p730k6828J3816J7662K6816p1k2155j1062R693j2126J2721K616J5621
13622H7466L7083L0274K0729K7739M1030L6864O6961J18821J13043R7437Q2567
$$ plain form
13611 760014 774774 770216 783665 767351 691325 559713 444883 335145 274086 222241 213584
13600 213584 152245 136773 142017 151095 138918 121041 99549 115838 95373 65843 55681 70783
13588 70783 83723 78700 19133 -10752 -2345 30726 27226 22915 28100 41573 52575 56868 23885
13575 23885 -6205 -10702 -11299 -11146 -1321 9958 -3548 9774 40982 6734 -19363 15134 19706
13562 19706 33530 35651 -860 568 11218 20921 6145 684 -994 10193 -3729 13579 51517
13549 51517 60438 56095 53810 39599 47896 44472 49839 11638 -7171 33767 70195 48771 41369
13536 41369 60975 43340 45049 31312 28681 39371 45139 48619 21891 25436 25635 11567 -1
13523 -1 -12341 -14804 -946 118 21486 40021 22164 41213 58068 35340 27283 18607 27652
$$ packed form
13611G60014J4760m558J3449j6314p6026j31612j14830j09738o1059n1845q657
13600B13584o1339j5472N244R078j2177j7877k1492J6289k0465k9530j0162J5102
13588G0783J2940n023n9567k9885Q407L3071l500m311N185J3473J1002M293l2983
13575B3885l0090m497n97J53R825J1279j3506J3322L1208l4248k6097L4497M572
13562A9706J3824K121l6511J428J0650R703j4776n461j678J1187j3922J7308L7938
13549E1517Q921m343k285j4211Q297l424N367l8201j8809M0938L6428k1424p402
13536D1369J9606j7635J709j3737k631J0690N768L480k6728L545J99j4068j1568
13523aj2340k463J3858J064K1368J8535j7857J9049J6855k2728q057q676R045
$$ plain form
13510 27652 45594 15993 -29483 -48265 -54582 -35172 6058 35773 33860 41680 40221 68742
13498 68742 64369 36706 27076 24611 48724 31651 -2301 -25304 -40806 -22794 27227 63309
13486 63309 81099 69084 57853 29516 54488 64882 54732 34626 51659 55924 39940 13716
13474 13716 3205 -12559 5709 52244 62339 60860 43367 34409 -10742 -4664 5548 -5995
13462 -5995 16048 25782 35669 31022 14836 14135 -2102 -8110 4010 42148 66056 62808 97083
13449 97083 102037 119133 142285 155885 166623 161534 151740 146004 136451 147510 122106 101801 86859
13436 86859 69854 70980 53592 29009 -820 21183 34226 21985 22650 21759 -7136 4376 32989
13423 32989 38435 9101 -10917 -28387 -28447 18677 34580 19604 -6846 -2656 -7021 226 12857
$$ packed form
13510B7652J7942k9601m5476j8782o317J9410M1230K9715j913P820j459K8521
13498F8742m373k7663r630k465K4113j7073l3952k3003j5502J8012N0021L6082
13486F3309J7790j2015j1231k8337K4972J0394j0150k0106J7033M265j5984k6224
13474A3716j0511j5764J8268M6535J0095j479j7493q958m5151O078J0212j1543
13462e995K2043R734R887m647j6186p01j6237o008J2120L8138K3908l248L4275
13449I7083M954J7096K3152J3600J0738n089r794n736r553J1059k5404k0305j4942
13436H6859j7005J126j7388k4583k9829K2003J3043j2241O65q91k8895J1512K8613
13423C2989N446k9334k0018j7470o0M7124J5903j4976k6450M190m365P247J2631
$$ plain form
13410 12857 11754 7566 7463 -6691 11015 44129 68748 40757 6664 -3917 -14566 24745
13398 24745 46144 39861 48977 38069 33735 44297 32513 22090 42468 49661 44338 28119 35196
13385 35196 38896 26961 35708 46472 68792 89997 74391 59469 57537 70571 71276 76817 63659
13372 63659 72477 57997 54376 59582 61879 63091 24602 27112 47349 69088 53528 25234 42021
13359 42021 69465 71418 70003 92048 110373 133048 129382 94582 66505 104651 89865 72310
13347 72310 57336 62262 66231 67952 67484 74561 82367 89118 64172 63212 86941 82507 70067 95813
13333 95813 101844 110383 109925 90771 88907 77712 84216 79493 47414 30995 56619 76924 93022
13320 93022 118622 167394 190150 223952 259636 237248 217346 190091 193230 186031 162655 155008
$$ packed form
13410A2857j103m188j03j4154J7706L3114K4619k7991l4093j0581j0649L9311
13398B4745K1399o283R116j0908m334J0562j1784j0423K0378P193n323j6219P077
13385C5196L700j1935Q747J0764K2320K1205j5606j4922j932J3034P05N541j3158
13372F3659Q818j4480l621N206K297J212l8489K510K0237K1739j5560k8294J6787
13359D2021K7444J953j415K2045J8325K2675l666l4800k8077L8146j4786j7555
13347G2310j4974M926L969J721m68P077P806O751k4946r60K3729m434j2440K5746
13333I5813O031Q539m58j9154j864j1195O504m723l2079j6419K5624K0305J6098
13320I3022K5600M8772K2756L3802L5684k2388j9902k7255L139p199k3376p647
$$ plain form
13308 155008 134355 112512 110417 132814 142507 133024 105052 105764 131104 132300 117273 132334 144181
13295 144181 134315 122427 100675 77678 57411 46679 67644 54616 76361 94274 115875 124005
13283 124005 106601 98083 115612 148544 170379 168899 139179 133230 135494 145723 164314 144436
13271 144436 103009 115972 160221 220532 227073 202543 199117 222125 217036 216743 219504 229874 241057
13258 241057 238831 256356 289399 267200 251681 276797 269991 259300 264860 299332 323773 353918
13246 353918 387373 404767 439273 474501 491312 541867 578665 615122 633854 647242 667857
13235 667857 701306 766719 839454 916233 949148 981605 1062985 1111765 1147647 1241628 1322735
13224 1322735 1402035 1491269 1619644 1751896 1902041 2065202 2246541 2478902 2750052 3046575
$$ packed form
13308A55008k0653k1843k095K2397R693r483k7972P12K5340J196j5027J5061J1847
13295A44181r866j1888k1752k2997k0267j0732K0965j3028K1745J7913K1601Q130
13283A24005j7404q518J7529L2932K1835j480k9720n949K264J0229J8591j9878
13271A44436m1427J2963M4249O0311O541k4530l426K3008n089k93K761J0370J1183
13258B41057k226J7525L3043k2199j5519K5116o806j0691N560L4472K4441L0145
13246C53918L3455J7394L4506L5228J6811N0555L6798L6457J8732J3388K0615
13235F67857L3449O5413P2735P6779L2915L2457Q1380M8780L5882R3981Q1107
13224A322735P9300Q9234J28375J32252J50145J63161J81339K32361K71150K96523
$$ plain form
13214 3046575 3403864 3871903 4421216 5105896 5895839 6801886 7863240 9057643 10413245
13205 10413245 11897821 13491437 15251962 17322974 19886558 23302033 27970447 34539087
13197 34539087 43606727 55809256 71900701 92112223 113996953 132770996 145751856
13190 145751856 152254235 152966500 148977357 139930214 125529008 105681257 83002877 62115842
13182 62115842 45637316 33766045 25692890 20294765 16673383 14175613 12335645 10923141
13174 10923141 9814492 8815629 7842998 6963017 6159073 5415568 4720446 4115021 3622800
13165 3622800 3219730 2841061 2526745 2274733 2069797 1915346 1767258 1667929 1518635 1356901
13155 1356901 1210105 1118744 1051330 1001884 981079 934070 889813 827566 792394 772167 728853
$$ packed form
13214C046575L57289M68039N49313O84680P89943R06047J061354J194403J355602
13205A0413245J484576J593616J760525K071012K563584L415475M668414O568640
13197C4539087R067640J2202529J6091445K0211522K1884730J8774043J2980860
13190A45751856O502379P12265l989143r047143j4401206j9847751k2678380k0887035
13182F2115842j6478526j1871271q073155n398125l621382k497770j839968j412504
13174A0923141j108649r98863r72631q79981q03944p43505o95122o05425m92221
13165C622800m03070l78669l14316k52012k04936j54451j48088r9329j49294j61734
13155A356901j46796r1361o7414m9446k0805m7009m4257o2247l5172k0227m3314
$$ plain form
13144 728853 710436 718092 711890 667320 633322 614632 598122 573017 557463 568278 536675 518331
13132 518331 505046 469211 434935 422480 414928 414561 400888 368027 330630 311785 289530 265245
13120 265245 262058 226872 201875 215276 253733 276368 269710 265496 275681 268259 242592 249497
13108 249497 249061 234973 216520 208992 227768 236822 244215 264929 254595 258411 274948 249413 231037
13095 231037 239020 228952 213161 215842 220885 210123 207174 223617 213900 207612 212546 172719 152102
13082 152102 191207 158970 133325 157578 194932 189991 166370 166149 179986 159385 157438 178375
13070 178375 199598 192536 181661 172727 171175 193802 217416 261232 301105 363814 432087 536784
13058 536784 642667 719513 804046 904971 982599 1079962 1121835 1094094 1084473 1043748 1023774
$$ packed form
13144G28853j8417P656o202m4570l3998j8690j6510k5105j5554J0815l1603j8344
13132E18331j3285l5835l4276j2455p552l67j3673l2861l7397j8845k2255k4285
13120B65245l187l5186k4997J3401L8457K2635o658m214J0185p422k5667O905
13108B49497m36j4088j8453p528J8776R054P393K0714j0334L816J6537k5535j8376
13095B31037P983j0068j5791K681N043j0762k949J6443r717o288M934l9827k0617
13082A52102L9105l2237k5645K4253L7354m941k3621k21J3837k0601j947K0937
13070A78375K1223p062j0875q934j552K2627K3614M3816L9873O2709O8273J04697
13058E36784J05883P6846Q4533J00925P7628R7363M1873k7741r621m0725j9974
$$ plain form
13047 1023774 978042 873829 780783 701483 641178 572737 486909 439486 376139 318482 305848
13036 305848 313659 310736 279578 254910 274157 277268 278058 252171 257818 217806 190822 191150 214808
13023 214808 208545 161503 138681 134657 137469 100750 72419 73792 74782 60771 25317 46368 89573
13010 89573 99450 86429 70255 70126 92235 114274 101068 116336 142174 148368 118878 89737
12998 89737 87123 125608 156010 138149 92356 96177 102743 117384 110114 110089 119519 103646 112395
12985 112395 126372 127869 114930 84887 96318 106870 101127 105784 126842 129395 115310 136794
12973 136794 135137 150356 164632 167585 171994 177257 171572 206295 291488 345468 384012 405949
12961 405949 454294 535167 640878 770713 895473 1022187 1126127 1203287 1273652 1349255
$$ packed form
13047A023774m5732j04213r3046p9300o0305o8441q5828m7423o3347n7657j2634
13036C05848P811k923l1158k4668J9247L111P90k5887N647m0012k6984L28K3658
13023B14808o263m7042k2822m024K812l6719k8331J373R90j4011l5454K1051M3205
13010H9573R877j3021j6174j29K2109K2039j3206J5268K5838O194k9490k9141
12998H9737k614L8485L0402j7861m5793L821O566J4641p270k5R430j5873Q749
12985A12395J3977J497j2939l0043J1431J0552n743M657K1058K553j4085K1484
12973A36794j657J5219J4276K953M409N263n685L4723Q5193N3980L8544K1937
12961D05949M8345Q0873J05711J29835J24760J26714J03940P7160P0365P5603
$$ plain form
12951 1349255 1434987 1521566 1528408 1520316 1530233 1505009 1448844 1346189 1275051 1197202 1091946
12940 1091946 969648 876790 732577 641861 581770 488075 398357 323268 264949 226131 183996
12929 183996 151575 160774 149642 139430 137375 112951 101473 89214 76400 51434 65992 97785
12917 97785 118122 101977 71103 65787 86637 62101 51187 32837 24951 39050 63300 81568
12905 81568 84942 95412 103878 101231 84613 64143 63354 60519 73154 66011 82293 85033 100334
12892 100334 100591 84536 82085 78227 102860 142051 135778 106791 89134 47942 52549 94029 92871
12879 92871 74134 65122 53225 55704 64990 51585 30707 11164 39542 37529 11776 12055 1994
12866 1994 4994 15353 -2360 5151 9713 2140 -5573 5738 12320 18817 18930 -9533 3081 36066
$$ packed form
12951A349255Q5732Q6579O842q092R917k5224n6165j02655p1138p7849j05256
12940A091946j22298r2858j44213r0716o0091r3695q9718p5089n8319l8818m2135
12929A83996l2421R199j1132j0212k055k4424j1478j2259j2814k4966J4558L1793
12917I7785K0337j6145l0874n316K0850k4536j0914j8350p886J4099K4250J8268
12905H1568L374J0470Q466k647j6618k0470p89k835J2635p143J6282K740J5301
12892A00334K57j6055k451l858K4633L9191o273k8987j7657m1192M607M1480j158
12879I2871j8737r012j1897K479R286j3405k0878j9543K8378k013k5753K79j0061
12866A994L000J0359j7713P511M562p573p713J1311O582O497J13k8463J2614L2985
$$ plain form
12852 36066 78149 72579 64349 81009 78548 97411 136636 137432 117454 96401 109790 123530 135371
12839 135371 125504 147377 149074 124239 123060 100125 90064 117443 147882 186615 200778 217702
12827 217702 242187 282110 316857 356627 379390 417629 412520 368366 347900 352981 332098 306536
12815 306536 275447 219607 177700 172144 146768 104270 76158 102719 125842 105309 101633 90854
12803 90854 85710 84878 96130 63492 23272 16781 7256 1910 8776 25212 60325 70281 39854
12790 39854 20915 35492 39751 29284 50142 60832 73714 59198 59048 81874 82999 107758
12778 107758 124459 113928 122574 148506 151183 170473 202683 245274 319538 380175 426482 538745
12766 538745 651224 779311 856715 898244 878971 830296 807532 750349 672113 563753 430854
$$ packed form
12852C6066M2083n570q230J6660k461J8863L9225P96j9978k1053J3389J3740J1841
12839A35371r867K1873J697k4835j179k2935j0061K7379L0439L8733J4163J6924
12827B17702K4485L9923L4747L9770K2763L8239n109m4154k0466N081k0883k5562
12815C06536l1089n5840m1907n556k5376m2498k8112K6561K3123k0533l676j0779
12803I0854n144q32J1252l2638m0220o491r525n346O866J6436L5113R956l0427
12790C9854j8939J4577M259j0467K0858J0690J2882j4516j50K2826J125K4759
12778A07758J6701j0531Q646K5932K677J9290L2210M2591P4264O0637M6307J12263
12766E38745J12479J28087P7404M1529j9273m8675k2764n7183p8236j08360j32899
$$ plain form
12755 430854 350664 290810 247695 194502 174030 121584 87953 119290 139415 113674 96296
12744 96296 70828 70074 52557 33443 28188 20844 26792 717 -8759 25602 40267 47401 33816
12731 33816 7044 -12568 -11727 1690 38182 64420 42392 35963 55969 80096 91854 66143
12719 66143 30548 30575 39258 51925 76361 69711 20168 20150 -691 -35883 -45429 -20889 -19591 8260
12705 8260 46212 84056 84358 55616 20474 1208 7396 12980 2754 -5093 649 20473 32309
12692 32309 1378 27657 56089 44722 17368 -7144 -14534 -16966 -2289 -6329 -1734 39453
12680 39453 19737 -13741 470 11446 43663 53255 44179 67743 69992 49701 23000 -21128
12668 -21128 -23809 -2186 -6390 14452 11941 -3876 6440 12293 5561 22583 34819 39715 56299
$$ packed form
12755D30854q0190n9854m3115n3193k0472n2446l3631L1337K0125k5741j7378
12744I6296k5468p54j7517j9114n255p344N948k6075r476L4361J4665P134j3585
12731C3816k6772j9612Q41J3417L6492K6238k2028o429K0006K4127J1758k5711
12719F6143l5595K7Q683J2667K4436o650m9543j8k0841l5192r546K4540J298K7851
12705H260L7952L7844L02k8742l5142j9266O188N584j0226p847N742J9824J1836
12692C2309l0931K6279K8432j1367k7354k4512p390k432J4677m040M595M1187
12680C9453j9716l3478J4211J0976L2217R592r076K3564K249k0291k6701m4128
12668b1128k681K1623m204K0842k511j5817J0316N853o732J7022J2236M896J6584
$$ plain form
12655 56299 72479 67674 77986 49868 29701 16631 27727 43098 76081 110031 117348 98057
12643 98057 72238 61387 61504 72098 65759 72551 74534 70776 68250 49092 31971 2425 -17389
12630 -17389 8361 27481 37069 32131 5154 -14851 -23351 -40271 -39089 -33236 -23392 -44292 -46095
12617 -46095 -10737 -4836 -11598 -4202 5972 32391 34681 13279 21590 58135 57893 50943 6273
12604 6273 -49224 -36486 -31056 -20988 -7219 33068 38388 49847 44194 44060 42873 23061 34461
12591 34461 48183 56848 53683 49031 71162 60997 82016 123917 122612 112936 127719 154119 192859
12578 192859 197179 169142 161143 161394 163862 172910 158509 110246 92973 70523 30468 6888 43643
12565 43643 42416 24643 31980 34625 27547 36864 49819 60720 46189 54597 64514 78591 56370
$$ packed form
12655E6299J6180m805J0312k8118k0167j3070J1096J5371L2983L3950P317j9291
12643I8057k5819j0851J17J0594o339O792J983l758k526j9158j7121k9546j9814
12630a7389K5750J9120R588m938k6977k0005q500j6920J182N853R844k0900j803
12617d6095L5358N901o762P396J0174K6419K290k1402Q311L6545k42o950m4670
12604F273n5497J2738N430J0068J3769M0287N320J1459n653j34j187j9812J1400
12591C4461J3722Q665l165m652K2131j0165K1019M1901j305r676J4783K6400L8740
12578A92859M320k8037p999K51K468R048j4401m8263j7273k2450m0055k3580L6755
12565D3643j227j7773P337K645p078R317J2955J0901j4531Q408R917J4077k2221
$$ plain form
12552 56370 64553 69767 33799 41813 44245 25978 19084 20361 13785 27052 65391 56411 45630
12539 45630 48239 30582 27322 26939 16285 9558 30968 49375 44661 8583 -15704 -17870 -13802
12526 -13802 -21407 -13847 -14585 21284 61069 54244 34472 -2572 -29152 -48639 -27114 -1278 28137
12513 28137 11757 6385 -18607 -56907 -43252 -18374 -1259 26336 11988 -7527 21941 36890
12501 36890 22529 17904 13485 22582 12079 23107 61547 68656 39230 47700 66044 43410 5850
12488 5850 5447 49810 44283 37257 34324 16273 28434 39907 44712 52820 68950 81868 118424
12475 118424 139965 137854 127800 132747 169576 188236 195917 168286 152218 149950 113538 80873
12463 80873 88074 102045 56988 51479 81211 81556 76659 104196 95579 56999 44801 1640 -5369
$$ packed form
12552E6370Q183N214l5968Q014K432j8267o894J277o576J3267L8339q980j0781
12539D5630K609j7657l260l83j0654o727K1410J8407m714l6078k4287k166M068
12526a3802p605P560p38L5869L9785o825j9772l7044k6580j9487K1525K5836K9415
12513B8137j6380n372k4992l8300J3655K4878J7115K7595j4348j9515K9468J4949
12501C6890j4361m625m419R097j0503J1028L8440P109k9426Q470J8344k2634l7560
12488E850m03M4363n527p026k933j8051J2161J1473M805Q108J6130J2918L6556
12475A18424K1541k111j0054M947L6829J8660P681k7631j6068k268l6412l2665
12463H0873P201J3971m5057n509K9732L45m897K7537q617l8580j2198m3161p009
$$ plain form
12450 -5369 26795 21953 10922 -26333 -57512 -56254 -19238 23936 45062 34095 60007 84018
12438 84018 64022 44343 69222 88741 56750 21891 -23850 -41660 -10761 21600 28614 61258
12426 61258 65941 89982 79561 71625 83398 91382 107437 100774 99112 67932 42658 57032 40337
12413 40337 10104 12574 37244 27761 11050 7938 12495 12730 23504 25824 33539 6402 -23785
12400 -23785 -20761 -2707 23541 35390 35059 21879 35018 23928 55541 58775 41604 50855 80901
12387 80901 64534 22126 24373 48322 65422 52233 12901 -2314 3288 10796 4387 11643 24657
12374 24657 24207 25010 24858 39713 26077 31651 39351 32618 -3745 -7555 2389 14928 10358 2765
12360 2765 21249 19735 -13428 -35026 -38412 -39472 -48793 -32312 -17471 -25739 -33697 -24496 -12493
$$ packed form
12450e369L2164m842j1031l7255l1179J258L7016M3174K1126j0967K5912K4011
12438H4018j9996j9679K4879J9519l1991l4859m5741j7810L0899L2361P014L2644
12426F1258M683K4041j0421p936J1773P984J6055o663j662l1180k5274J4374j6695
12413D0337l0233K470K4670r483j6711l112M557K35J0774K320P715k7137l0187
12400b3785L024J8054K6248J1849l31j3180J3139j1090L1613L234j7171R251L0046
12387H0901j6367m2408K247K3949J7100j3189l9332j5215N602P508o409P256J3014
12374B4657m50Q03j52J4855j3636N574P700o733l6363l810R944J2539m570p593
12360B765J8484j514l3163k1598l386j060r321J6481J4841q268p958R201J2003
$$ plain form
12347 -12493 -4506 20044 20522 -9634 -45931 -47454 -70873 -74662 -96251 -88969 -84805 -48113 -33503
12334 -33503 -28584 -31449 -60983 -69895 -61044 -31182 -15812 -56252 -52755 -41024 -29622 -7795 3277
12321 3277 17833 11900 -7728 -6341 -10504 -17560 -3973 11839 -8481 -5641 25025 27208 3273
12308 3273 30095 50264 78404 64545 52192 11156 23383 47054 45665 54917 33692 11112
12296 11112 -305 19095 3094 -26941 -4234 27083 43954 46684 45565 19400 13286 26804
12284 26804 47184 58682 22500 6117 -9392 -7918 -6168 -9463 9426 27725 17376 -6180
12272 -6180 -20621 -26187 -4552 -7906 -4256 -13955 -20032 -16496 -29061 -19164 14473 3346 22393
12259 22393 39768 38121 28388 30158 -836 14405 35177 34531 19950 31086 30976 1242 -310
$$ packed form
12347a2493P987K4550M78l0156l6297j523k3419l789k1589P282M164L6692J4610
12334c3503M919k865k9534q912Q851K9862J5370m0440L497J1731J1402K1827J1072
12321C277J4556n933j9628J387m163p056J3587J5812k0320K840L0666K183k3935
12308C273K6822K0169K8140j3859j2353m1036J2227K3671j389R252k1225k2580
12296A1112j1417J9400j6001l0035K2707L1317J6871K730j119k6165o114J3518
12284B6804K0380J1498l6182j6383j5509J474J750l295J8889J8299j0349k3556
12272f180j4441n566K1635l354L650r699o077L536j2565R897L3637j1127J9047
12259B2393J7375j647r733J770l0994J5241K0772o46j4581J1136j10k9734j552
$$ plain form
12246 -310 -6934 -5984 3833 4783 4413 -29950 -18637 1290 -6107 -14944 5095 25670 22682 15011
12232 15011 10005 11653 28596 40946 22831 16365 40153 40404 34629 35790 24555 1122 17755
12219 17755 62972 69956 46800 44660 37226 23427 10467 20842 44372 73818 101911 99560
12207 99560 75222 42416 14774 8575 3290 25768 13721 -10375 -49464 -70469 -51269 -56682
12195 -56682 -42554 -40529 -20566 -13842 -47347 -48846 -15972 -16601 -16536 -30269 -29225 -18155 735
12182 735 21236 18112 18045 -30620 -50775 -38287 29479 20285 -14256 -12446 -3146 10342 -18329
12169 -18329 -19131 22969 20576 12399 16150 19552 21990 44035 34066 4739 -5985 11204 10530 11140
12155 11140 15124 6978 11609 22924 31620 44087 14240 19583 45208 62817 86397 31220 -8595
$$ packed form
12246c10o624R50R817R50l70l4363J1313J9927p397q837K0039K0575k988p671
12232A5011n006J648J6943J2350j8115o466K3788K51n775J161j1235k3433J6633
12219A7755M5217O984k3156k140p434j3799j2960J0375K3530K9446K8093k351
12207I9560k4338l2806k7642o199n285K2478j2047k4096l9089k1005J9200n413
12195e6682J4128K025J9963O724l3505j499L2874o29O5j3733J044J1070J8890
12182G35K0501l124o7m8665k0155J2488O7766r194l4541J810R300J3488k8671
12169a8329q02M2100k393q177L751L402K438K2045r969k9327j0724J7189o74O10
12155A1140L984q146M631J1315Q696J2467k9847N343K5625J7609K3580n5177l9815
$$ plain form
12142 -8595 -3687 1362 3202 30806 30933 29530 19931 -19443 -35124 -37486 -28247 -8344 19185 9641
12128 9641 27617 58693 38460 300 1444 18468 37748 6786 2200 17374 24348 43367
12116 43367 46228 35368 44752 48721 38455 35007 32419 29428 45300 29839 -5244 -16664 -29561
12103 -29561 -15808 21316 21471 3307 17019 34294 81362 70066 73072 84259 96302 107733
12091 107733 104944 119369 131824 129029 136195 105868 72249 67322 57449 73257 98947 97389 73311
12078 73311 66749 79882 83482 101603 98726 95574 85516 72433 82337 75687 45226 18938 13632
12065 13632 41916 57070 60998 37647 15055 12992 2085 7381 -5250 -18271 -23506 -2743
12053 -2743 31759 51903 63406 40073 35467 32534 41637 29058 36101 24415 7027 25841 31587
$$ packed form
12142h595M908N049J840K7604J27j403r599l9374j5681k362R239J9903K7529r544
12128I641J7976L1076k0233l8160J144J7024J9280l0962m586J5174O974J9019
12116D3367K861j0860R384L969j0266l448k588k991J5872j5461l5083j1420j2897
12103b9561J3753L7124J55j8164J3712J7275M7068j1296L006J1187J2043J1431
12091A07733k789J4425J2455k795P166l0327l3619m927r873J5808K5690j558k4078
12078G3311o562J3133L600J8121k877l152j0058j3083R904o650l0461k6288n306
12065A3632K8284J5154L928k3351k2592k063j0907N296j2631j3021n235K0763
12053b743L4502K0144J1503k3333m606k933R103j2579P043j1686j7388J8814N746
$$ plain form
12040 31587 15308 11182 -18784 -279 -12462 -53337 -30737 10622 47111 63822 90805 86950
12028 86950 53661 40468 9776 23060 36778 28665 17818 21469 45254 59049 38501 43814
12016 43814 61601 83959 113468 137025 158364 178222 210522 205537 203127 189222 143944 111841
12004 111841 108642 92510 94773 95778 111610 147002 181310 196724 213766 234208 244724 223775
11992 223775 187284 152654 120740 106400 94066 93330 86793 73141 56910 29192 14861 -17871
11980 -17871 -15069 11443 11793 -8420 -8995 -8697 16385 49266 34919 18047 550 -10183 -3028
11967 -3028 12910 15990 34371 25110 2743 -1074 41051 28843 27942 26388 29488 49621 58315
11954 58315 54732 57630 39211 18671 4217 -20096 2146 1796 -12843 -10992 -12731 -22901 -31584
$$ packed form
12040C1587j6279m126k9966J8505j2183m0875K2600M1359L6489J6711K6983l855
12028H6950l3289j3193l0692J3284J3718q113j0847L651K3785J3795k0548N313
12016D3814J7787K2358K9509K3557K1339J9858L2300m985k410j3905m5278l2103
12004A11841l199j6132K263J005J5832L5392L4308J5414J7042K0442J0516k0949
11992B23775l6491l4630l1914j4340j2334p36o537j3652j6231k7718j4331l2732
11980a7871K802K6512L50k0213n75K98K5082L2881j4347j6872j7497j0733P155
11967c028J5938L080J8381r261k2367l817M2125j2208r01j554L100K0133Q694
11954E8315l583K898j8419k0540j4454k4313K2242l50j4639J851j739j0170q683
$$ plain form
11941 -31584 -36666 -28083 -25150 13861 33759 25481 14864 12524 15169 46856 30547 12664 22802
11928 22802 26996 28811 27196 41802 12890 1045 1699 -3751 -5397 -19023 -9388 -26447 -28463
11915 -28463 -24785 -3914 14600 14381 10323 34711 19385 -26702 -22244 -23984 10390 30752 31602
11902 31602 35977 29776 16117 24155 21406 21325 22174 12900 15769 31976 33268 15745 -14695 -24966
11888 -24966 6634 49830 65020 81540 55141 32736 -11626 -31284 -10761 -9321 -25800 -38447
11876 -38447 -35802 -31837 -7249 48957 56031 38477 28268 30828 -996 -55413 -66711 -25585
11864 -25585 -16864 24493 38390 35828 41441 24601 5096 -10808 15407 11892 -15858 4280
11852 4280 34022 30763 -2156 261 13021 26630 62396 67387 59048 32434 28420 3820 4984
$$ packed form
11941c1584n082Q583K933L9011J9898q278j0617k340K645L1687j6309j7883J0138
11928B2802M194J815j615J4606k8912j1845O54n450j646j3626R635j7059k016
11915b8463L678K0871J8514k19m058K4388j5326m6087M458j740L4374K0362Q50
11902C1602M375o201j3659Q038k749q1Q49r274K869J6207J292j7523l0440j0271
11888b4966L1600M3196J5190J6520k6399k2405m4362j9658K0523J440j6479j2647
11876c8447K645L965K4588N6206P074j7554j0209K560l1824n4417j1298M1126
11864b5585Q721M1357J3897k562N613j6840j9505j5904K6215l515k7750K0138
11852D280K9742l259l2919K417J2760J3609L5766M991q339k6614m014k4600J164
$$ plain form
11839 4984 -31995 -66252 -78567 -69809 -29607 -17917 -5266 -11269 1502 10155 14322 18590 18635
11826 18635 25530 38086 53203 75454 108224 114126 88810 62788 72265 117516 114892 84966
11814 84966 62509 68241 80867 95738 74827 31236 8730 13247 -8899 -9765 913 21656
11802 21656 30062 62866 40936 -2226 -1972 3040 5625 38704 50767 76342 51509 45532 40656
11789 40656 30241 11978 13359 30320 32912 23298 34920 58726 68495 65160 79103 105185 112369
11776 112369 64288 52343 57394 58859 56951 66152 50344 27781 37995 51167 68174 75108
11764 75108 80361 47036 54071 52029 39446 68342 102618 132658 142647 156161 201956 232168
11752 232168 246332 258518 260771 257264 248237 211438 160449 157352 156848 139827 103987 86199 76740
$$ packed form
11839D984l6979l4257j2315Q758M0202J1690J2651o003J2771Q653M167M268M5
11826A8635O895J2556J5117K2251L2770N902k5316k6022R477M5251k624k9926
11814H4966k2457N732J2626J4871k0911m3591k2506M517k2146q66J0678K0743
11802B1656Q406L2804k1930m3162K54N012K585L3079J2063K5575k4833n977m876
11789D0656j0415j8263J381J6961K592r614J1622K3806R769l335J3943K6082P184
11776A12369m8081j1945N051J465j908R201j5808k2563J0214J3172J7007O934
11764G5108N253l3325P035k042j2583K8896L4276L0040R989J3514M5795L0212
11752B32168J4164J2186K253l507r027l6799n0989l097n04j7021l5840j7788r459
$$ plain form
11739 76740 75133 76412 94086 104924 134601 128139 103901 108214 125447 166259 197329 234646
11727 234646 273696 305819 343651 385279 401145 438149 473283 457466 418743 334233 276116
11716 276116 245765 254798 249172 292270 338878 381631 408836 440530 425641 417773 401919 382319
11704 382319 318070 250483 173043 173557 199906 150809 124435 121590 122832 109897 95920 92458
11692 92458 97642 117635 129178 136489 150762 164285 184920 204031 221870 229825 249795 256920
11680 256920 286280 303498 336542 397388 486593 530062 527301 502511 450656 365491 292766 223952
11668 223952 190067 164440 156563 122366 89713 102356 86387 94498 105191 97680 100513 107865
11656 107865 116652 121115 140743 147475 156200 182175 226710 280160 322314 314082 322003 314479 288399
$$ packed form
11739G6740j607J279J7674J0838K9677o462k4238M313J7233M0812L1070L7317
11727B34646L9050L2123L7832M1628J5866L7004L5134j5817l8723q4510n8117
11716B76116l0351R033n626M3098M6608M2753K7205L1694j4889p868j5854j9600
11704C82319o4249o7587p7440N14K6349m9097k6374k845J242j2935j3977l462
11692I2458N184J9993J1543P311J4273J3523K0635J9111J7839P955J9970P125
11680B56920K9360J7218L3044O0846Q9205M3469k761k4790n1855q5165p2725o8814
11668B23952l3885k5627p877l4197l2653J2643j5969Q111J0693p511K833P352
11656A07865Q787M463J9628O732Q725K5975M4535N3450M2154q232P921p524k6080
$$ plain form
11643 288399 251318 217435 148120 91120 57466 71593 77328 77138 101690 104132 124539 127605
11631 127605 116575 85035 94583 108930 164987 154623 144219 136846 112243 135277 142021 135740
11619 135740 130703 102341 58801 66232 57224 36716 32485 38617 36199 29867 30261 54289 74585
11606 74585 99956 99728 127914 141084 156473 148835 145204 158265 161208 135378 118951 102091 103067
11593 103067 69330 63101 76654 106622 86818 78145 68770 39892 5731 16400 13637 736
11581 736 4111 48720 73234 73227 71148 54542 42115 46630 62517 59016 69412 116696 113539 84027
11567 84027 59020 54380 62641 70960 75701 82672 73729 46363 59210 69494 62335 63276 50911
11554 50911 57235 63716 54469 48957 60099 83719 68492 55365 40986 33532 46598 51042 64696
$$ packed form
11643B88399l7081l3883o9315n7000l3654J4127N735j90K4552K442K0407L066
11631A27605j1030l1540R548J4347N6057j0364j0404p373k4603K3034O744o281
11619A35740n037k8362m3540P431r008k0508m231O132k418o332L94K4028K0296
11606G4585K5371k28K8186J3170J5389p638l631J3061K943k5830j6427j6860R76
11593A03067l3737o229J3553K9968j9804q673r375k8878l4161J0669k763j2901
11581G36L375M4609K4514pk079j6606j2427M515J5887l501J0396M7284l157k9512
11567H4027k5007m640Q261Q319M741O971q943k7366J2847J0284p159R41j2365
11554E0911O324O481r247n512J1142K3620j5227j3127j4379p454J3066M444J3654
$$ plain form
11541 64696 52363 43658 77229 87146 86052 66895 60741 39444 33805 17224 13919 25116 28562
11528 28562 49823 27171 -6268 22627 28719 25223 37659 67619 93652 98390 95735 98527 86017
11515 86017 114764 134397 117393 93998 92837 79974 80766 103576 82407 64757 64085 93710 123654
11502 123654 115319 119056 130001 137403 162278 157202 157000 204254 218100 246353 245298 244546 264289
11489 264289 249447 227859 182215 211934 230408 234196 205538 149021 126393 137075 136539 138901
11477 138901 162174 185330 212622 256952 254830 290123 333635 347130 387682 425364 439937 438468
11465 438468 472263 519998 517065 474104 412790 381281 336894 294217 264777 243520 218326 179738
11453 179738 147166 140465 143997 130596 100440 99911 91531 108628 135200 130701 136391 119828 138923
$$ packed form
11541F4696j2333q705L3571R917j094j9157o154k1297n639j6581l305J1197L446
11528B8562K1261k2652l3439K8895O092l496J2436K9960K6033M738k655K792j2510
11515H6017K8747J9633j7004k3395j161j2863P92K2810k1169j7650o72K9625K9944
11502A23654q335L737J0945P402K4875n076k02M7254J3846K8253j055p52J9743
11489B64289j4842k1588m5644K9719J8474L788k8658n6517k2628J0682n36K362
11477A38901K3273K3156K7292M4330k122L5293M3512J3495M0552L7682J4573j469
11465D38468L3795M7735k933m2961o1314l1509m4387m2677k9440k1257k5194l8588
11453A79738l2572o701L532j3401l0156n29q380J7097K6572m499N690j6563J9095
$$ plain form
11440 138923 167666 182608 178751 180173 213665 244826 250795 244189 281969 297860 279963 254151
11428 254151 232502 205796 204864 155584 133048 124662 92538 82709 63636 83409 69309 38204
11416 38204 44194 43634 67547 86828 48983 10649 1875 -13296 -1232 44754 47882 24347 40413
11403 40413 32797 10673 14611 24005 13370 25181 53812 46979 36353 19407 29392 39966 28362
11390 28362 16082 36238 47905 24794 25137 53977 66428 81751 71916 77952 58087 64923 99870
11377 99870 101225 89048 67819 62456 52099 67234 83980 69830 86193 83823 66818 54569
11365 54569 72115 97898 101075 97929 93845 118532 118692 127511 120208 111822 106880 84499 81416 57921
11351 57921 33244 43763 74559 56952 60272 103927 123524 100808 79434 65650 87299 62615
$$ packed form
11440A38923K8743J4942l857J422L3492L1161N969o606L7780J5891j7897k5812
11428B54151k1649k6706r32m9280k2536q386l2124r829j9073J9773j4100l1105
11416C8204N990n60K3913J9281l7845l8334q774j5171J2064M5986L128k3535J6066
11403D0413p616k2124L938R394j0635J1811K8631o833j0626j6946R985J0574j1604
11390B8362j2280K0156J1667k3111L43K8840J2451J5323r835O036j9865O836L4947
11377I9870J355j2177k1229n363j0357J5135J6746j4150J6363k370j7005j2249
11365E4569J7546K5783L177l146m084K4687J60Q819p303q386m942k2381l083k3495
11351E7921k4677J0519L0796j7607L320M3655J9597k2716k1374j3784K1649k4684
$$ plain form
11339 62615 72322 63212 57801 72885 70960 45175 64700 78170 85807 86508 99909 113484 110827
11326 110827 114715 111213 98962 103107 113686 110243 140340 124663 106391 70513 67305 74085 119975
11313 119975 132542 98972 79812 99535 88192 111431 146933 139991 138668 146990 143580 126033
11301 126033 142627 172839 176057 142692 142907 157042 177256 183758 192817 211749 196616 182214
11289 182214 153730 122316 142899 157542 150769 141671 151063 133691 123150 126764 159736 180947
11277 180947 194128 208017 197488 196808 188039 167470 167311 169176 194435 213554 198130 188180 188772
11264 188772 160392 147695 147548 143512 154772 143912 160262 136454 119237 103800 108299 97524
11252 97524 79787 80356 115333 125792 93647 71105 87933 81651 77666 101111 111851 89772
$$ packed form
11339F2615R707r110n411J5084j925k5785J9525J3470P637P01J3401J3575k657
11326A10827L888l502j2251M145J0579l443L0097j5677j8272l5878l208O780M5890
11313A19975J2567l3570j9160J9723j1343K3239L5502o942j323Q322l410j7547
11301A26033J6594L0212L218l3365K15J4135K0214O502R059J8932j5133j4402
11289A82214k8484l1414K0583J4643o773r098R392j7372j0541L614L2972K1211
11277A80947J3181J3889j0529o80q769k0569j59J865K5259J9119j5424r950N92
11264A88772k8380j2697j47m036J1260j0860J6350k3808j7217j5437M499j0775
11252I7524j7737N69L4977J0459l2145k2542J6828o282l985K3445J0740k2079
$$ plain form
11240 89772 96571 124442 113249 81169 102419 99004 83970 85467 55343 73364 102614 96906
11228 96906 108030 118751 138206 160207 177539 177786 187662 185829 182743 198674 194372 176975 175180
11215 175180 165256 195395 205240 154447 93918 65378 85423 81563 59868 59416 43124 57935
11203 57935 50047 64020 86670 107648 123055 128058 99360 92648 107635 121360 135778 163675
11191 163675 173115 156077 142499 134082 111818 135402 159007 161651 164501 174785 180263 195794
11179 195794 198312 212252 198076 192245 196440 187504 161552 170129 143766 126685 146353 146154 141559
11166 141559 140922 103666 89099 110520 103013 96140 105757 127536 162726 184815 202169 211328 222192
11153 222192 237953 241629 210544 198019 223376 215049 199838 200357 169277 143198 147766 161642
$$ packed form
11240H9772O799K7871j1193l2080K1250l415j5034J497l0124J8021K9250n708
11228I6906J1124J0721J9455K2001J7332K47R876j833l086J5931m302j7397j795
11215A75180r924L0139R845n0793o0529k8540K0045l860k1695m52j6292J4811
11203E7935p888J3973K2650K0978J5407N003k8698o712J4987J3725J4418K7897
11191A63675R440j7038j3578q417k2264K3584K3605K644K850J0284N478J5531
11179A95794K518J3940j4176n831M195q936k5952Q577k6363j7081J9668j99m595
11166A41559o37l7256j4567K1421p507o873R617K1779L5190K2089J7354R159J0864
11153B22192J5761L676l1085j2525K5357q327j5211N19l1080k6079M568J3876
$$ plain form
11141 161642 167671 193620 209808 213197 221357 189206 204993 205482 186247 167893 175988 182945 192628
11128 192628 193976 185086 203533 226318 210734 213682 204430 208241 228478 265560 292665 303321
11116 303321 344931 389432 444263 480350 522198 588246 625504 626665 597469 564451 497760 477035
11104 477035 451484 398212 357254 329729 290907 242745 209218 232510 229129 230410 239705 246304
11092 246304 252131 237826 238243 250390 222537 186445 157532 168813 172379 194346 234387 225786
11080 225786 225103 225001 220508 244218 265049 281982 316642 330246 347907 406692 448934 502244
11068 502244 578498 700420 871096 1074997 1393892 1767524 1979781 1829020 1472963 1096109
11058 1096109 784549 574460 432113 327628 223874 202029 204727 211368 184130 154800 156902
$$ packed form
11141A61642O029K5949J6188L389Q160l2151J5787M89j9235j8354Q095O957R683
11128A92628J348q890J8447K2785j5584K948r252L811K0237L7082K7105J0656
11116C03321M1610M4501N4831L6087M1848O6048L7258J161k9196l3018o6691k0725
11104D77035k5551n3272m0958k7525l8822m8162l3527K3292l381J281R295O599
11092B46304N827j4305M17J2147k7853l6092k8913J1281L566K1967M0041q601
11080B25786o83j02m493K3710K0831J6933L4660J3604J7661N8785M2242N3310
11068E02244P6254J21922J70676K03901L18895L73632K12257j50761l56057l76854
11058A096109l11560k10089j42347j04485j03754k1845K698O641k7238k9330K102
$$ plain form
11047 156902 142554 154682 144317 132630 104587 112947 115287 133584 152204 216896 257148 293790
11035 293790 369269 488254 552832 551110 479227 379496 298740 216331 163870 151204 119303
11024 119303 82802 52516 69055 73228 87750 98323 97775 69285 47379 35458 29486 43420
11012 43420 58861 68207 75285 90558 50143 12676 45131 60868 79136 116499 107987 96506
11000 96506 117129 140487 163987 193910 254735 315319 312145 295669 233599 169086 126741 104849
10988 104849 137593 145976 123953 117033 96253 88601 89563 77756 48797 27266 66255 61522 51843
10975 51843 51812 4941 12995 9237 8726 19576 12216 4996 22424 -19035 -13890 16006 18503 7456
10961 7456 2088 23695 55377 49617 58567 36197 13571 28823 46412 40092 42060 25897 -24159
$$ packed form
11047A56902j4348J2128j0365j1687k8043Q360K340J8297J8620O4692M0252L6642
11035B93790P5479J18985O4578j722p1883r9731q0756q2409n2461j2666l1901
11024A19303l6501l0286J6539M173J4522J0573n48k8490k1906j1921n972J3934
11012D3420J5441R346P078J5273m0415l7467L2455J5737J8268L7363q512j1481
11000I6506K0623K3358K3500K9923O0825O0584l174j6476o2070o4513m2345k1892
10988A04849L2744Q383k2023o920k0780p652R62j1807k8959k1531L8989m733r679
10975E1843l1m6871Q054l758n11J0850p360p220J7428m1459N145K9896K497j1047
10961G456n368K1607L1682n760Q950k2370k2626J5252J7589o320J968j6163n0056
$$ plain form
10948 -24159 -55531 -71150 -80326 -73528 -35479 -27877 -23122 -30881 -34787 -60867 -33156 -20328 -40863
10935 -40863 -56391 -31131 -27200 -45942 2596 36004 39891 27006 11347 11925 6550 -30451 -6625
10922 -6625 24919 69085 86182 81321 45754 41730 36905 38918 53886 39370 29571 21025 36598
10909 36598 19710 1636 19025 33945 34666 21425 47839 90600 123044 149262 158297 184564
10897 184564 242982 267563 256420 234919 205170 143490 127254 119031 107740 84385 60094 49217
10885 49217 40155 44536 54259 54224 49011 69179 96694 106921 101429 75996 64982 98682 100773
10872 100773 72832 66583 59188 38746 42163 15570 24484 51384 71147 71347 84236 104915 95546
10859 95546 105009 115218 103175 58577 32141 78791 87645 79566 54945 72163 82251 109128
$$ packed form
10948b4159l1372j5619r176O798L8049P602M755p759l906k6080K7711J2828k0535
10935d0863j5528K5260L931j8742M8538L3408L887j2885j5659N78n375l7001K3826
10922f625L1544M4166J7097m861l5567m024m825K013J4968j4516r799q546J5573
10909C6598j6888j8074J7389J4920P21j3241K6414M2761L2444K6218R035K6267
10897A84564N8418K4581j1143k1501k9749o1680j6236q223j1291k3355k4291j0877
10885D9217r062M381R723l5n213K0168K7515J0227n492k5433j1014L3700K091
10872A00773k7941o249p395k0442L417k6593Q914K6900J9763K00J2889K0679r369
10859I5546R463J0209j2043m4598k6436M6650Q854q079k4621J7218J0088K6877
$$ plain form
10847 109128 95473 109882 123557 85092 59694 60025 54770 67896 100378 117496 133579 130646
10835 130646 134427 124394 124389 157233 173513 168778 148654 120128 85000 110740 119857 89771 51856
10822 51856 41458 29033 51481 108274 148535 159153 150021 106943 70570 76271 114460 109797
10810 109797 94563 92725 101229 77772 71092 90041 102441 80505 98964 123399 130479 120588
10798 120588 94008 94426 133903 144923 134983 136111 150340 150970 162403 149779 123316 137589 149874
10785 149874 129569 114932 126782 120327 131290 132646 125641 120525 133711 161889 222837 269930
10773 269930 322127 373122 460742 555805 614177 587009 503830 439469 385642 323290 294613
10762 294613 272542 261007 249439 230562 208519 199328 172468 159987 159767 154740 148197 129033
$$ packed form
10847A09128j3655J4409J3675l8465k5398L31n255J3126L2482J7118J6083k933
10835A30646L781j0033nL2844J6280m735k0124k8526l5128K5740R117l0086l7915
10822E1856j0398j2425K2448N6793M0261J0618r132m3078l6373N701L8189m663
10810A09797j5234j838Q504k3457o680J8949J2400k1936J8459K4435P080r891
10798A20588k6580M18L9477J1020r940J128J4229O30J1433j2624k6463J4273J2285
10785A49874k0305j4637J1850o455J0963J356p005n116J3186K8178O0948M7093
10773B69930N2197N0995Q7620R5063N8372k7168q3179o4361n3827o2352k8677
10762B94613k2071j1535j1568j8877k2043r191k6860j2481k20n027o543j9164
$$ plain form
10750 129033 138219 123875 114605 96730 95635 112133 139844 144933 163409 184094 174647 154455
10738 154455 148243 141630 144765 112167 100966 141689 194807 232244 236969 226680 254228 269493
10726 269493 280422 275753 288634 304609 300274 299535 343497 412456 421369 417172 395408 381437 398291
10713 398291 399437 423722 416588 405732 409185 415649 431906 423082 432750 417217 410278 419014 440026
10700 440026 480674 565662 624139 652468 682422 723178 756064 792276 817643 823939 842789 899175
10688 899175 952544 1040308 1127194 1239937 1365020 1473370 1558890 1617110 1678551 1715787 1796875
10677 1796875 1938705 2126764 2314746 2435264 2566687 2755625 2944542 3191665 3559023
10668 3559023 4030902 4589770 5252541 6040143 6923649 7950650 9200166 10560969 11866459
$$ packed form
10750A29033R186j4344r270j7875j095J6498K7711N089J8476K0685r447k0192
10738A54455o212o613L135l2598j1201M0723N3118L7437M725j0289K7548J5265
10726B69493J0929m669J2881J5975m335p39M3962O8959Q913m197k1764j3971J6854
10713C98291J146K4285p134j0856L453O464J6257q824R668j5533o939Q736K1012
10700D40026M0648Q4988N8477K8329K9954M0756L2886L6212K5367O296J8850N6386
10688H99175N3369Q7764Q6886J12743J25083J08350Q5520N8220O1441L7236Q1088
10677A796875J41830J88059J87982J20518J31423J88938J88917K47123L67358
10668C559023M71879N58868O62771P87602Q83506J027001J249516J360803J305490
$$ plain form
10659 11866459 13274807 14956579 17002366 19518245 22578457 26274226 30915881 37112492
10651 37112492 45666995 58159816 76954682 104238187 140364776 184963399 241514057
10644 241514057 312242583 361543804 338312511 268572688 196087453 136844573 94350091
10637 94350091 66200572 48024668 36091246 28026032 22448089 18444550 15457593 13223631
10629 13223631 11574601 10360118 9484780 8877361 8413874 7783838 6908415 6019778 5187604
10620 5187604 4543750 4096479 3727862 3428120 3178658 2920122 2658584 2378043 2146228
10611 2146228 1984760 1838008 1733392 1682516 1613989 1491214 1351583 1287911 1247828 1208132
10601 1208132 1191152 1171708 1123953 1085685 1014217 954105 952112 922806 906662 890531 867705
$$ packed form
10659A1866459J408348J681772K045787K515879L060212L695769M641655O196611
10651C7112492Q554503J2492821J8794866K7283505L6126589M4598623N6550658
10644B41514057P0728526M9301221k3231293o9739823p2485235n9242880m2494482
10637I4350091k8149519j8175904j1933422q065214n577943m003539k986957k233962
10629A3223631j649030j214483q75338o07419m63487o30036q75423q88637q32174
10620E187604o43854m47271l68617k99742k49462k58536k61538k80541k31815
10611B146228j61468j46752j04616n0876o8527j22775j39631o3672m0083l9696
10601A208132j6980j9444m7755l8268p1468o0112j993k9306j6144j6131k2826
$$ plain form
10590 867705 844277 816656 787091 794178 815476 812510 805469 817090 808509 741379 669115 612477
10578 612477 559177 525451 539679 528317 501199 463100 435790 413066 408618 411972 423706 408278
10566 408278 412968 452437 457706 434980 406988 398701 387053 382631 391372 379519 332895 342859 392947
10553 392947 419097 416232 399875 373975 363263 347343 352857 355156 356465 365559 362803 342923 321636
10540 321636 337997 349154 362330 353768 340056 306159 280322 265151 275607 288454 282657 246615
10528 246615 236901 228372 179333 187006 217994 220801 217080 174887 125090 75009 40399 -15667
10516 -15667 -24043 24971 59579 112462 175759 220737 228225 246081 260731 276082 300392 311559
10504 311559 332781 358389 338080 321907 320121 284219 246260 196104 159278 116301 102726 109387
$$ packed form
10590H67705k3428k7621k9565P087K1298k966p041J1621q581o7130p2264n6638
10578F12477n3300l3726J4228j1362k7118l8099k7310k2724m448L354J1734j5428
10566D08278M690L9469N269k2726k7992q287j1648m422Q741j1853m6624R964N0088
10553C92947K6150k865j6357k5900j0712j5920N514K299J309R094k756j9880k1287
10540C21636J6361J1157J3176q562j3712l3897k5837j5171J0456J2847n797l6042
10528B46615r714q529m9039P673L0988K807l721m2193m9797n0081l4610n6066
10516a5667q376M9014L4608N2883O3297M4978P488J7856J4650J5351K4310J1167
10504C11559K1222K5608k0309j6173j786l5902l7959n0156l6826m2977j3575O661
$$ plain form
10492 109387 115810 104436 146863 164681 151881 138558 133164 133694 121460 113122 101071 81670
10480 81670 88339 74220 87433 88716 99241 92900 80029 50866 53334 82959 86543 73744 82174
10467 82174 92845 101448 94519 61592 59122 94538 99474 104721 98812 105797 91313 57783 37335
10454 37335 2226 11560 -49 32647 64638 81561 93792 84380 86682 108568 76837 73880
10442 73880 94395 88346 82651 53089 52417 74405 89351 76565 52895 78524 93467 82221
10430 82221 94306 106198 103767 75092 76684 68568 63424 91507 110917 95257 64411 56936 59371
10417 59371 81792 90905 96595 66556 84011 111026 130320 126920 106435 109032 84489 60100
10405 60100 76166 91553 85501 87187 80381 64329 27389 -879 15566 6718 46336 128465
$$ packed form
10492A09387O423j1374M2427J7818j2800j3323n394N30j2234q338j2051j9401
10480H1670O669j4119J3213J283J0525o341j2871k9163K468K9625L584j2799Q430
10467H2174J0671Q603o929l2927k470L5416M936N247n909O985j4484l3530k0448
10454C7335l5109R334j1609L2696L1991J6923J2231r412K302K1886l1731k957
10442G3880K0515o049n695k9562o72K1988J4946j2786k3670K5629J4943j1246
10430H2221J2085J1892k431k8675J592q116n144K8083J9410j5660l0846p475K435
10417E9371K2421R113N690l0039J7455K7015J9294l400k0485K597k4543k4389
10405F0100J6066J5387o052J686o806j6052l6940k8268J6445q848L9618Q2129
$$ plain form
10393 128465 158115 166969 153328 124289 110042 63309 40937 54953 64518 74415 92378 79866
10381 79866 70117 78023 96719 108079 116305 141855 143387 143761 159940 142394 111599 92744 88370
10368 88370 77513 45251 23366 21379 28694 43103 55401 73889 77512 70013 82392 85613 102499
10355 102499 121684 114834 100927 109922 161505 175045 168642 162848 191514 185196 170511 125539
10343 125539 147985 194143 252547 296667 286227 249818 236923 233200 219053 239559 246325 258075
10331 258075 311046 369232 434456 551659 687459 822423 927076 965817 960771 914592 882856
10320 882856 873104 896461 994682 1189047 1499533 1869156 2267567 2709536 2926758 2708966
10310 2708966 2253486 1753555 1362329 1072290 884564 734016 621186 541119 474459 413234
$$ packed form
10393A28465K9650Q854j3641k9039j4247m6733k2372J4016R565R897J7963j2512
10381G9866r749P906J8696J1360Q226K5550J532L74J6179j7546l0795j8855m374
10368H8370j0857l2262k1885j987P315J4409J2298J8488L623p499J2379L221J6886
10355A02499J9185o850j3907Q995N1583J3540o403n794K8666o318j4685m4972
10343A25539K2446M6158N8404M4120j0440l6409j2895l723j4147K0506O766J1750
10331B58075N2971N8186O5224J17203J35800J34964J04653L8741n046m6179l1736
10320H82856r752K3357R8221J94365L10486L69623L98411M41969K17222k17792
10310B708966m55480m99931l91226k90039j87726j50548j12830q0067o6660o1225
$$ plain form
10300 413234 328442 241406 198607 205435 197422 161687 167278 171959 140195 128629 147555 111406
10288 111406 105897 106542 95064 61577 58913 62624 61850 51126 73138 62669 54837 60873 80475
10275 80475 82855 54274 56243 47430 20693 18391 43431 39603 27062 35498 39840 53123 88650
10262 88650 125539 127114 83895 80768 120596 133995 183903 222249 278270 364071 430553 505362
10250 505362 600292 711154 796555 832856 767633 637241 499664 421445 340338 283604 259616
10239 259616 242269 194895 191837 212002 193192 190093 227132 280625 298204 285047 292522 319318
10227 319318 351927 397603 509798 676734 848349 1078342 1382409 1749017 2180233 2600633
10217 2600633 2677205 2369544 1911279 1483349 1117764 852895 626208 465254 382294 299529
$$ packed form
10300D13234q4792q7036m2799O828q013l5735N591M681l1764j1566J8926l6149
10288A11406n509O45j1478l3487k664L711p74j0724K2012j0469p832O036J9602
10275H0475K380k8581J969q813k6737k302K5040l828j2541Q436M342J3283L5527
10262H8650L6889J575m3219l127L9828J3399M9908L8346N6021Q5801O6482P4809
10250E05362R4930J10862Q5401L6301o5223j30392j37577p8219q1107n6734k3988
10239B59616j7347m7374l058K0165j8810l099L7039N3493J7579j3157P475K6796
10227C19318L2609M5676J12195J66936J71615K29993L04067L66608M31216M20400
10217B600633P6572l07661m58265m27930l65585k64869k26687j60954q2960q2765
$$ plain form
10207 299529 265691 263548 264252 233948 211081 202764 193607 210610 208533 189710 171086 169140 154003
10194 154003 148839 162801 148668 140097 155160 175930 206939 223024 227752 216084 197481 191044
10182 191044 170393 140094 127274 136933 166241 162645 145413 124310 111544 104119 99195 66211
10170 66211 46102 20167 2885 5516 30612 65054 76584 66077 53464 78689 90385 91136
10158 91136 103689 91427 72320 68624 77243 61405 43232 54024 74304 72150 67653 82440
10146 82440 70546 78730 83355 67380 78714 69154 35583 24280 15415 5009 9977 20333 33540
10133 33540 9814 -8624 14671 53279 64724 87284 101165 79071 57916 57018 41316 56020
10121 56020 83798 96616 80514 88938 94085 63441 52168 66207 60445 71606 40926 20864
$$ packed form
10207B99529l3838k143P04l0304k2867q317r157J7003k077j8823j8624j946j5137
10194A54003n164J3962j4133q571J5063K0770L1009J6085M728j1668j8603o437
10182A91044k0651l0299j2820R659K9308l596j7232k1103j2766p425m924l2984
10170F6211k0109k5935j7282K631K5096L4442J1530j0507j2613K5225J1696P51
10158I1136J2553j2262j9107l696Q619j5838j8173J0792K0280k154m497J4787
10146H2440j1894Q184M625j5975J1334r560l3571j1303q865j0406M968J0356J3207
10133C3540k3726j8438K3295L8608J1445K2560J3881k2094k1155q98j5702J4704
10121E6020K7778J2818j6102Q424N147l0644j1273J4039n762J1161l0680k0062
$$ plain form
10109 20864 52859 85915 101232 117292 138531 115324 111192 132313 89173 65211 78894 49736
10097 49736 40823 46866 68010 87753 62329 34765 39318 53903 87136 98059 93226 76794
10085 76794 56907 65881 102117 98736 120988 119451 68380 41962 54198 72448 111074 108543
10073 108543 111139 102895 84214 81673 67807 62511 63954 47009 61391 55344 58575 76784 95922
10060 95922 69260 63005 71104 75370 93223 84359 70873 84785 84436 102507 94175 76094 99684
10047 99684 104238 91938 103741 120492 152293 198743 260986 279659 212670 151067 127214 122107
10035 122107 105430 103071 82992 62919 52370 78663 83547 49601 45079 68901 74622 61052
10023 61052 59887 82425 79612 85044 69909 78661 108530 111910 96911 90903 82118 48069 34379
$$ packed form
10109B0864L1995L3056J5317J6060K1239k3207m132K1121m3140k3962J3683k9158
10097D9736q913O043K1144J9743k5424k7564M553J4585L3233J0923m833j6432
10085G6794j9887Q974L6236l381K2252j537n1071k6418J2236J8250L8626k531
10073A08543K596q244j8681k541j3866n296J443j6945J4382o047L231J8209J9138
10060I5922k6662o255Q099M266J7853q864j3486J3912l49J8071q332j8081K3590
10047I9684M554j2300J1803J6751L1801M6450O2243J8673o6989o1603k3853n107
10035A22107j6677k359k0079k0073j0549K6293M884l3946m522K3822N721j3570
10023F1052j165K2538k813N432j5135Q752K9869L380j4999o008q785l4049j3690
$$ plain form
10010 34379 13660 11519 32038 43989 41807 55860 77044 76781 66736 69769 63364 37635 44439
9997 44439 25778 9458 22146 21983 24693 28944 36384 -7719 -24800 -6192 5456 11146 -461
9984 -461 -24502 -6213 1626 6429 8597 21085 39599 46407 65020 51575 59942 56056 37850
9971 37850 22406 41088 59341 38125 27742 22719 12784 35901 43695 31590 29174 25041 28840
9958 28840 38363 54132 62530 43031 41768 40858 66184 60182 42955 51087 32197 20627 34746
9945 34746 34713 18708 24898 44900 50567 35909 -730 -13646 -20624 6966 20900 30590 69662
9932 69662 58415 44181 36365 29671 14656 18533 24409 29464 22847 26107 50815 61710 41835
9919 41835 19976 -10924 -36931 -46222 -11488 264 -10116 294 16537 21870 12332 14018 -584
$$ packed form
10010C4379k0719k141K0519J1951k182J4053K1184k63j0045L033o405k5729O804
9997D4439j8661j6320J2688j63K710M251P440m4103j7081J8608J1648N690j1607
9984d61k4041J8289P839M803K168J2488J8514O808J8613j3445Q367l886j8206
9971C7850j5444J8682J8253k1216j0383n023r935K3117P794j2105k416m133L799
9958B8840R523J5769Q398j9499j263r10K5326o002j7227Q132j8890j1570J4119
9945C4746l3j6005O190K0002N667j4658l6639j2916o978K7590J3934R690L9072
9932F9662j1247j4234p816o694j5015L877N876N055o617L260K4708J0895j9875
9919D1835k1859l0900k6007r291L4734J1752j0380J0410J6243N333r538J686j4602
$$ plain form
9906 -584 3619 3201 18191 53127 52486 43467 20183 5885 1349 19767 46580 35377 612 -8021
9892 -8021 -32302 -20843 4097 50312 68357 91908 118056 126363 96063 77294 108980 115711
9880 115711 77149 67424 68117 58912 35026 19151 30848 33496 22557 6719 -5192 -42933 -34678
9867 -34678 11922 48901 40351 43744 45710 34198 18904 21302 32154 23506 30503 55851 83032
9854 83032 89803 100623 118566 109475 96301 98421 104328 136866 135384 113081 98069 88668 60216
9841 60216 25718 37028 47433 41523 21081 13493 38007 50347 47801 38494 34050 27639 18577
9828 18577 15255 8554 17514 37681 39365 25516 9073 18212 41164 42059 24057 -6426 -4126
9815 -4126 28644 60205 65307 50513 52721 52497 85888 99560 93339 81996 77713 80359 53456
$$ packed form
9906e84M203m18J4990L4936o41r019k3284j4298m536J8418K6813j1203l4765q633
9892h021k4281J1459K4940M6215J8045K3551K6148Q307l0300j8769L1686O731
9880A15711l8562r725O93r205k3886j5875J1697K648j0939j5838j1911l7741Q255
9867c4678M6600L6979q550L393J966j1512j5294K398J0852q648O997K5348K7181
9854H3032O771J0820J7943r091j3174K120N907L2538j482k2303j5012r401k8452
9841F0216l4498J1310J0405n910k0442p588K4514J2340k546r307m444o411r062
9828A8577l322o701Q960K0167J684j3849j6443R139K2952Q95j8002l0483K300
9815d126L2770L1561N102j4794K208k24L3391J3672o221j1343m283K646k6903
$$ plain form
9802 53456 92191 157552 178487 139069 78704 80368 78582 68921 85063 79088 86069 99216 72492
9789 72492 60244 49845 52341 37750 63196 67477 47403 54185 53712 40462 58665 61075 67290
9776 67290 88962 97118 146015 226016 272111 318561 387968 373965 305478 217444 171770 145688
9764 145688 142769 130896 89901 62858 32373 20251 51580 67154 41613 45248 66092 108815
9752 108815 87718 66431 82381 68821 66168 79275 71813 33985 16238 13849 60029 63788
9740 63788 84475 72036 59037 23414 16096 27744 33122 51116 83308 67974 65093 65424 51920
9727 51920 23622 17840 46268 51065 48548 36657 63869 81221 55980 18473 -12486 4342
9715 4342 34062 51870 69988 61287 58461 21436 46884 74170 73066 93074 83778 60232 67505
$$ packed form
9802E3456L8735O5361K0935l9418o0365J664j786r661J6142n975O981J3147k6724
9789G2492j2248j0399K496j4591K5446M281k0074O782m73j3250J8203K410O215
9776F7290K1672Q156M8897Q0001M6095M6450O9407j4003o8487q8034m5674k6082
9764A45688k919j1873m0995k7043l0485j2122L1329J5574k5541L635K0844M2723
9752A08815k1097k1287J5950j3560k653J3107p462l7828j7747k389M6180L759
9740F3788K0687j2439j2999l5623p318J1648N378J7994L2192j5334k881L31j3504
9727E1920k8298n782K8428M797k517j1891K7212J7352k5241l7507l0959J6828
9715D342K9720J7808J8118q701k826l7025K5448K7286j104K0008r296k3546P273
$$ plain form
9702 67505 86613 95487 72382 86834 96588 71758 29480 29472 54591 71570 60705 73512 62903
9689 62903 48404 42028 35165 23994 5190 -2910 16474 26203 16766 19486 19659 22644 8170 2311
9675 2311 41128 57332 40010 19617 20863 38051 72649 73116 63240 54955 43682 71906 98696
9662 98696 113357 86590 45079 38421 70570 47461 12779 -20170 1658 10072 42500 64153
9650 64153 70942 80571 87868 94986 59106 62467 64376 82662 97140 106212 115467 114316 98757 72622
9636 72622 48644 28466 20065 52829 56866 79772 91501 114760 112166 90233 65258 68184 62900
9623 62900 51153 54318 52877 33341 38491 28867 21029 34545 27558 8649 -23387 -6318 29741
9610 29741 58942 42339 39369 44173 59398 95450 88677 56008 75364 108034 93851 79328
$$ packed form
9702F7505J9108Q874k3105J4452R754k4830m2278qK5119J6979j0865J2807j0609
9689F2903j4499o376o863j1171j8804q100J9384R729r437K720J73K985j4474n859
9675B311L8817J6204j7322k0393J246J7188L4598M67r876q285j1273K8224K6790
9662I8696J4661k6767m1511o658L2149k3109l4682l2949K1828Q414L2428K1653
9650F4153O789R629P297P118l5880L361J909J8286J4478R072R255j151j5559k6135
9636G2622k3978k0178q401L2764M037K2906J1729K3259k594k1933k4975K926n284
9623F2900j1747L165j441j9536N150r624p838J3516o987j8909l2036J7069L6059
9610B9741K9201j6603k970M804J5225L6052o773l2669J9356L2670j4183j4523
$$ plain form
9598 79328 64213 64946 67722 59340 57226 76709 83000 89850 80066 50096 22134 35839 46332
9585 46332 26719 -8488 -969 37643 64306 70743 50667 51679 57990 41174 70476 94036 39627
9572 39627 1333 3408 -4061 13033 59470 96635 93510 80708 43804 55204 85790 97175
9560 97175 75964 60048 82500 100107 77982 57365 43354 48204 39313 21072 35568 34764 91847
9547 91847 116493 91248 75243 80319 100080 128927 118922 98738 92022 82524 62377 65232 94587
9534 94587 97416 104299 125236 129168 95835 72333 64775 79891 80171 86057 87698 86870 80598 55314
9520 55314 55362 106404 134150 110405 94370 87174 75823 74314 70692 52089 46581 35384 51969
9507 51969 77584 47753 53480 104589 92887 67283 79919 97893 106534 124832 119697 88306
$$ packed form
9598G9328j5115P33K776q382k114J9483O291O850r784k9970k7962J3705J0493
9585D6332j9613l5207P519L8612K6663O437k0076J012O311j6816K9302K3560n4409
9572C9627l8294K075p469J7094M6437L7165l125j2802l6904J1400L0586J1385
9560I7175k1211j5916K2452J7607k2125k0617j4011M850q891j8241J4496q04N7083
9547I1847K4646k5245j6005N076J9761K8847j0005k0184o716r498k0147K855K9355
9534I4587K829O883K0937L932l3333k3502p558J5116K80N886J641q28o272k5284
9520E5314M8N1042K7746k3745j6035p196j1351j509l622j8603n508j1197J6585
9507E1969K5615k9831N727N1109j1702k5604J2636J7974Q641J8298n135l1391
$$ plain form
9495 88306 77041 84673 63210 26866 35075 64433 81973 86023 88494 86826 106396 86613 64824
9482 64824 46292 58393 74482 78493 80251 67466 55843 43378 9804 3796 22939 39497
9470 39497 45896 59384 67544 85359 62842 46920 24748 27372 31915 30000 26728 25069 39263
9457 39263 40314 35472 54173 59850 70478 51181 75027 119765 118738 126642 120116 113219 114043 89357
9443 89357 52340 70552 82016 57622 73606 99305 92157 89682 101960 125622 114880 90192
9431 90192 81335 78425 74956 80835 71581 66807 67655 91937 125407 136749 126151 127439 114037 97268
9417 97268 71104 46169 51502 71419 61159 59265 69104 99533 100723 95553 98122 93541 79829
9404 79829 42699 44158 67943 104030 112243 153405 150870 147132 125390 119489 132171 131548 121543
$$ packed form
9495H8306j1265P632k1463l6344Q209K9358J7540M050K471j668J9570j9783k1789
9482F4824j8532J2101J6089M011J758j2785j1623j2465l3574o008J9143J6558
9470C9497O399J3488Q160J7815k2517j5922k2172K624M543j915l272j659J4194
9457C9263J051m842J8701N677J0628j9297K3846M4738j027P904o526o897Q24k4686
9443H9357l7017J8212J1464k4394J5984K5699p148k475J2278K3662j0742k4688
9431I0192q857k910l469N879r254m774Q48K4282L3470J1342j0598J288j3402j6769
9417I7268k6164k4935N333J9917j0260j894R839L0429J190n170K569m581j3712
9404G9829l7130J459K3785L6087Q213M1162k535l738k1742n901J2682o23j0005
$$ plain form
9391 121543 99184 88385 93552 91646 69204 113659 120409 113278 123639 116464 126092 126132 151295
9378 151295 170097 144886 122235 131570 132594 117724 106337 124046 152378 155616 141567 158026
9366 158026 160896 157555 144889 118032 109350 113375 135381 179656 207336 188817 174858 159556
9354 159556 127800 118431 115760 105656 93621 98373 96927 106228 121460 138882 140526 126518 116591
9341 116591 119989 147661 147866 150390 134415 142712 147042 156189 147216 112246 112190 150352 177693 163123
9327 163123 160752 167567 190204 183617 179371 186365 199508 186937 181471 170592 171217 165139 158182 157202
9313 157202 176860 170865 198004 210271 183600 177191 213989 228675 204313 190938 191985 168510
9301 168510 176107 219085 256943 273363 251765 224381 203291 184206 187860 179942 177247 186732 190441
$$ packed form
9391A21543k2359j0799N167j906k2442M4455O750p131J0361p175R628M0K5163
9378A51295J8802k5211k2651R335J024j4870j1387J7709K8332L238j4049J6459
9366A58026K870l341j2666k6857q682M025K2006M4275K7680j8519j3959j5302
9354A59556l1756r369k671j0104j2035M752j446R301J5232J7422J644j4008r927
9341A16591L398K7672K05K524j5975Q297M330R147q973l4970n6L8162K7341j4570
9327A63123k371O815K2637o587m246O994J3143j2571n466j0879O25o078o957r80
9313A57202J9658n995K7139J2267k6671o409L6798J4686k4362j3375J047k3475
9301A68510P597M2978L7858J6420k1598k7384k1090j9085L654p918k695R485L709
$$ plain form
9288 190441 194773 187719 202483 214452 225163 240963 238460 230368 226311 228596 229178 239359 227370
9275 227370 229281 226269 229490 233082 241414 251300 234040 229659 225562 236456 253925 283900 274055
9262 274055 244821 211364 202903 228082 234178 261449 242066 221049 210922 249380 287666 293456
9250 293456 289673 259784 242641 238513 239067 246270 240755 233603 253168 238828 226671 240639 232971
9237 232971 261148 284750 290699 277852 262243 250647 220637 231686 272564 306313 310349 325503
9225 325503 358449 371664 331482 311276 321589 340017 341060 336569 317409 317304 315186 324472 309040
9212 309040 321572 334977 341758 348036 342602 343030 372214 387638 397025 381949 374221 362561 344599
9199 344599 320031 324986 324649 360316 364765 386145 415593 424878 423752 427692 454315 442184 440531
$$ packed form
9288A90441M332p054J4764J1969J0711J5800k503q092m057K285N82J0181j1989
9275B27370J911l012L221L592Q332R886j7260m381m097J0894J7469K9975r845
9262B74055k9234l3457q461K5179O096K7271j9383k1017j0127L8458L8286N790
9250B93456l783k9889j7143m128N54P203n515p152J9565j4340j2157J3968p668
9237B32971K8177K3602N949j2847j5609j1596l0010J1049M0878L3749M036J5154
9225C25503L2946J3215m0182k0206J0313J8428J043m491j9160j05k118R286j5432
9212C09040J2532J3405O781O278n434M28K9184J5424R387j5076p728j1660j7962
9199C44599k4568M955l37L5667M449K1380K9448R285j126L940K6623j2131j653
$$ plain form
9186 440531 420376 405341 416109 428975 445118 432820 398465 397900 396020 418137 440444 422307
9174 422307 419389 428071 459187 468364 468784 466146 496698 515071 520273 483850 468580 480331 504637
9161 504637 460948 484573 528538 534180 511728 515247 508506 533214 548300 548861 543824 536504 520428
9148 520428 518202 538921 583175 582652 580281 580978 587743 579345 618276 667330 667974 611358 582986 635670
9134 635670 653441 662421 648334 662566 664752 649972 656321 699668 678168 661393 678533 721243
9122 721243 742580 756693 743442 746667 755421 765200 770046 748952 788193 805843 831357 845098
9110 845098 859841 865504 839402 859815 891124 885329 855017 846474 872675 887455 901738 912716
9098 912716 939095 917466 922890 992659 1028763 1046763 1080031 1100144 1130755 1130426 1123916 1110420
$$ packed form
9186D40531k0155j5035J0768J2866J6143j2298l4355n65j880K2117K2307j8137
9174D22307k918Q682L1116R177M20k638L0552J8373N202l6423j5270J1751K4306
9161E04637m3689K3625M3965N642k2452L519o741K4708J5086N61n037p320j6076
9148E20428k226K0719M4254n23k371O97O765q398L8931M9054O44n6616k8372N2684
9134F35670J7771Q980j4087J4232K186j4780O349M3347k1500j6775J7140M2710
9122G21243K1337J4113j3251L225Q754R779M846k1094L9241J7650K5514J3741
9110H45098J4743N663k6102K0413L1309n795l0312q543K6201J4780J4283J0978
9098I12716K6379k1629N424O9769L6104J8000L3268K0113L0611l29o510j3496
$$ plain form
9086 1110420 1089029 1117808 1139967 1145856 1136616 1142382 1153104 1188952 1200479 1186655 1207154 1226132
9074 1226132 1265280 1313207 1324566 1340338 1331368 1372079 1395653 1411943 1426276 1438039 1446161 1434547
9062 1434547 1450529 1478238 1540241 1581419 1614690 1635868 1641661 1650800 1673345 1673771 1701160 1753646
9050 1753646 1810679 1843874 1874430 1882880 1911747 1921723 1937735 1982721 2066296 2156480 2199887 2203756
9038 2203756 2254659 2274175 2268596 2264910 2306263 2379594 2432374 2502104 2538558 2575017 2621105 2690124
9026 2690124 2726244 2731912 2779504 2843918 2927906 3003540 3025386 3035135 3111791 3174024 3251838 3340204
9014 3340204 3396769 3464586 3565444 3666653 3722350 3792638 3887198 3985645 4077976 4174159 4266709
9003 4266709 4330980 4369094 4481762 4594420 4663656 4761865 4858869 4971591 5101351 5202940
$$ packed form
9086A110420k1391K8779K2159N889r240N766J0722L5848J1527j3824K0499J8978
9074A226132L9148M7927J1359J5772q970M0711K3574J6290J4333J1763Q122j1614
9062A434547J5982K7709O2003M1178L3271K1178N793R139K2545M26K7389N2486
9050A753646N7033L3195L0556Q450K8867R976J6012M4986Q3575R0184M3407L869
9038B203756N0903J9516n579l686M1353P3331N2780O9730L6454L6459M6088O9019
9026B690124L6120N668M7592O4414Q3988P5634K1846R749P6656O2233P7814Q8366
9014C340204N6565O7817J00858J01209N5697P0288R4560R8447R2331R6183R2550
9003D266709O4271L8114J12668J12658O9236R8209R7004J12722J29760J01589
$$ plain form
8993 5202940 5325430 5460889 5552752 5680741 5837924 5961354 6053723 6162575 6271794 6426228
8983 6426228 6566969 6682920 6812038 6967786 7117896 7246591 7376161 7517445 7660069 7778561
8973 7778561 7919716 8069255 8194714 8277050 8393033 8500952 8608887 8755166 8870890 8969465
8963 8969465 9058906 9168695 9274833 9306527 9355723 9429379 9492189 9527205 9564387 9573106 9578417
8952 9578417 9593052 9612203 9633143 9600108 9580564 9557377 9501467 9420089 9331484 9263982 9212536
8941 9212536 9133343 9053543 8972201 8893117 8781646 8652729 8538496 8438361 8317926 8177688
8931 8177688 8011969 7898194 7791815 7665293 7527276 7380768 7248204 7109581 6956617 6803958
8921 6803958 6670806 6559073 6432396 6279257 6143829 6025917 5929572 5798053 5650054 5548842
$$ packed form
8993E202940J22490J35459R1863J27989J57183J23430R2369J08852J09219J54434
8983F426228J40741J15951J29118J55748J50110J28695J29570J41284J42624J18492
8973G778561J41155J49539J25459Q2336J15983J07919J07935J46279J15724R8575
8963H969465Q9441J09789J06138L1694M9196P3656O2810L5016L7182Q719N311
8952I578417J4635J9151K0940l3035j9544k3187n5910q1378q8605o7502n1446
8941I212536p9193p9800q1342p9084j11471j28917j14233j00135j20435j40238
8931H177688j65719j13775j06379j26522j38017j46508j32564j38623j52964j52659
8921F803958j33152j11733j26677j53139j35428j17912r6345j31519j47999j01212
$$ plain form
8911 5548842 5460923 5373197 5248201 5120892 5002910 4896885 4809885 4687763 4584695 4493714
8901 4493714 4421238 4337835 4274925 4159360 4052995 3967660 3856326 3779196 3692138 3606168 3565826
8890 3565826 3516912 3422218 3362840 3301373 3229507 3184416 3128203 3054845 2976143 2900435 2822830
8879 2822830 2747475 2668255 2654900 2626951 2544414 2494895 2504306 2440647 2359772 2315077 2290296 2275325
8867 2275325 2239506 2215969 2193918 2140231 2077304 2027425 2012400 1963685 1907519 1873144 1833542
8856 1833542 1803023 1772856 1743178 1719740 1689257 1668495 1656478 1614322 1615920 1574610 1546582 1536005
8844 1536005 1510758 1475463 1459641 1472388 1469786 1441274 1376432 1311985 1272883 1243185 1256870 1258758
8832 1258758 1236247 1225720 1187229 1190504 1214729 1179942 1124188 1123292 1130311 1122629 1102129 1085239
$$ packed form
8911E548842q7919q7726j24996j27309j17982j06025q7000j22122j03068r0981
8901D493714p2476q3403o2910j15565j06365q5335j11334p7130q7058q5970m0342
8890C565826m8914r4694n9378o1467p1866m5091n6213p3358p8702p5708p7605
8879B822830p5355p9220j3355k7949q2537m9519R411o3659q0875m4695k4781j4971
8867B275325l5819k3537k2051n3687o2927m9879j5025m8715n6166l4375l9602
8856A833542l0519l0167k9678k3438l0483k0762j2017m2156J598m1310k8028j0577
8844A536005k5247l5295j5822J2747k602k8512o4842o4447l9102k9698J3685J888
8832A258758k2511j0527l8491L275K4225l4787n5754q96P019p682k0500j6890
$$ plain form
8820 1085239 1077846 1037033 985686 1003214 1021082 1007253 1014660 1008062 977050 935637 944182 963394
8808 963394 932407 906516 926813 924930 896371 852536 841299 861844 841413 821990 822986 816528
8796 816528 810709 767525 741804 762073 759443 746144 716187 719539 691329 675088 699815 729994
8784 729994 749043 754981 747715 736988 738657 741253 720146 680709 639956 624262 605626 594396
8772 594396 607355 630105 613601 583574 570409 564042 553856 549126 531458 511216 533430 548569
8760 548569 535627 531855 513484 509554 519461 503723 512692 497964 487633 503021 523317 532506 511660
8747 511660 508863 505879 507162 504324 493816 486780 480474 459001 474034 513111 544620 542769 530082
8734 530082 501189 467938 443682 431152 436054 457189 457108 448040 447355 422764 423057 409180 418518 425958
$$ packed form
8820A085239p393m0813n1347J7528J7868j3829P407o598l1012m1413Q545J9212
8808I63394l0987k5891K0297j883k8559m3835j1237K0545k0431j9423R96o458
8796H16528n819m3184k5721K0269k630j3299k9957L352k8210j6241K4727L0179
8784G29994J9049N938p266j0727J669K596k1107l9437m0753j5694j8636j1230
8772E94396J2959K2750j6504l0027j3165o367j0186m730j7668k0242K2214J5139
8760E48569j2942l772j8371l930R907j5738Q969j4728j0331J5388K0296R189k0846
8747E11660k797k984J283k838j0508p036o306k1473J5033L9077L1509j851j2687
8734E30082k8893l3251k4256j2530M902K1135q1r068o85k4591K93j3877R338P440
$$ plain form
8720 425958 425062 399488 381426 391955 381030 353219 349439 341563 338667 325829 305198 320187 320177
8707 320177 331481 357005 360120 355758 385330 377658 336047 319523 357427 337661 337732 368730 400971
8694 400971 406817 397350 373755 329188 314940 349390 387569 415948 408290 389509 371557 395000
8682 395000 390124 364496 368759 385091 407472 416036 424096 454126 460860 507668 581016 647922 726551
8669 726551 877494 1111298 1380199 1695464 2104015 2444224 2465651 2200488 1838966 1532627
8659 1532627 1295620 1096648 907103 784616 726203 645893 577549 501135 472935 474581 477928
8648 477928 461212 449066 460985 457600 459904 496261 519358 511807 522489 512060 499012 456572
8636 456572 453857 470156 476971 480372 512396 560972 615106 666502 742592 862889 1029667 1230583
$$ packed form
8720D25958q96k5574j8062J0529j0925k7811l780p876k896j2838k0631J4989j0
8707C20177J1304K5524L115m362K9572p672m1611j6524L7904j9766P1L0998L2241
8694D00971N846r467k3595m4567j4248L4450L8179K8379p658j8781j7952K3443
8682C95000m876k5628M263J6332K2381Q564Q060L0030O734M6808P3348O6906P8629
8669G26551J50943K33804K68901L15265M08551L40209K1427k65163l61522l06339
8659A532627k37007j98972j89545j22487n8413q0310o8344p6414k8200J646L347
8648D77928j6716j2146J1919l385K304L6357K3097p551J0682j0429j3048m2440
8636D56572k715J6299O815L401L2024M8576N4134N1396P6090J20297J66778K00916
$$ plain form
8624 1230583 1466768 1725557 2040184 2356646 2452332 2160668 1730217 1327432 1006219 782035
8614 782035 640436 555446 493164 420020 373985 342223 343665 310986 277541 259340 261849 269907
8602 269907 285796 295588 271862 266291 258462 243876 252490 284261 283866 256866 248564 242961 235884
8589 235884 244001 274562 281641 279111 270940 246395 242354 302117 313456 307601 268751 234898 234247
8576 234247 204637 194641 234036 235825 189958 190139 192503 142710 113172 131434 163993 191098 193783
8563 193783 202348 199846 174309 154370 162304 171757 150991 138396 120364 123896 116588 135341 141509
8550 141509 143926 149491 107928 88228 86400 108396 101065 89193 111942 146496 155792 151906 119890
8537 119890 87492 100942 166415 175984 163226 129845 136900 149007 154744 128203 119656 107296
$$ packed form
8624A230583K36185K58789L14627L16462R5686k91664m30451m02785l21213k24184
8614G82035j41599q4990o2282p3144m6035l1762J442l2679l3445j8201K509Q058
8602B69907J5889R792k3726n571p829j4586Q614L1771l95k7000q302n603p077
8589B35884Q117L0561P079k530q171k4545m041N9763J1339n855l8850l3853o51
8576B34247k9610r996L9395J789m5867J81K364m9793k9538J8262L2559K7105K685
8563A93783Q565k502k5537j9939P934R453k0766j2595j8032L532p308J8753O168
8550A41509K417N565m1563j9700j828K1996p331j1872K2749L4554R296l886l2016
8537A19890l2398J3450O5473R569j2758l3381P055J2107N737k6541q547j2360
$$ plain form
8525 107296 138189 146620 129752 120894 109603 104354 141147 138209 113191 116775 125899 120394 122791
8512 122791 145663 166562 157787 145031 123213 147927 164101 138196 112159 89007 76397 92924
8500 92924 66920 69951 88823 110637 102668 99941 139604 161469 135572 112123 98593 88648 97912
8487 97912 81427 71200 64432 79210 83096 70763 52894 66328 85689 93276 111000 120618 138332
8474 138332 130515 92163 109244 100200 109172 112250 119210 106883 98353 100940 89298 109775 118701
8461 118701 127508 124110 96379 85028 107413 106288 118647 121160 100261 78057 48255 21357
8449 21357 27996 51577 25840 36542 55786 83541 96997 89638 88062 73280 88127 114974
8437 114974 126036 96498 96428 89386 99651 93054 94408 109912 109184 98902 112958 144209 141967
$$ packed form
8525A07296L0893Q431j6868q858j1291n249L6793k938k5018L584R124n505K397
8512A22791K2872K0899q775j2756k1818K4714J6174k5905k6037k3152j2610J6527
8500I2924k6004L031J8872K1814p969k727L9663K1865k5897k3449j3530r945R264
8487I7912j6485j0227o768J4778L886j2333j7869J3434J9361P587J7724R618J7714
8474A38332p817l8352J7081r044Q972L078O960j2327q530K587j1642K0477Q926
8461A18701Q807l398k7731j1351K2385j125J2359K513k0899k2204k9802k6898
8449B1357O639K3581k5737J0702J9244K7755J3456p359j576j4782J4847K6847
8437A14974J1062k9538p0p042J0265o597J354J5504p28j0282J4056L1251k242
$$ plain form
8424 141967 120772 130222 123273 101094 97487 88309 67775 67739 63245 55652 42947 42389 23093 20612
8410 20612 26508 48800 68563 82728 60993 52391 52135 94850 137020 139534 115313 93665 104850
8397 104850 93676 79279 87382 93565 104922 82491 60467 92434 99322 115337 99558 95451
8385 95451 95251 49255 52730 63130 81439 82399 90144 111232 104200 74646 54492 56077 31607
8372 31607 28342 52614 39131 44385 62268 78082 84940 99915 94649 59495 15815 11028 55332
8359 55332 52407 54477 45659 81217 94270 68689 64213 88132 69435 27709 23155 26378 34397
8346 34397 46078 44712 6872 -6710 18151 44765 44006 90143 81080 83333 86058 100289 93537
8333 93537 99157 99934 68963 52832 64440 58295 72402 65062 78637 95287 81819 56135 59809
$$ packed form
8424A41967k1195R450o949k2179l607r178k0534l6m494p593j2705n58j9296k481
8410B0612N896K2292J9763J4165k1735q602k56M2715M2170K514k4221k1648J1185
8397A04850j1174j4397Q103O183J1357k2431k2024L1967O888J6015j5779m107
8385I5451k00m5996L475J0400J8309R60P745K1088p032k9554k0154J585k4470
8372C1607l265K4272j3483N254J7883J5814O858J4975n266l5154m3680m787M4304
8359E5332k925K070q818L5558J3053k5581m476K3919j8697m1726m554L223Q019
8346C4397J1681j366l7840j3582K4861K6614p59M6137r063K253K725J4231o752
8333I3537N620P77l0971j6131J1608o145J4107p340J3575J6650j3468k5684L674
$$ plain form
8320 59809 43839 33950 61674 60222 59877 38898 29026 51960 36668 24477 59889 74601 43429
8307 43429 41163 28833 47057 52185 35661 8497 7415 44134 57748 55780 34151 22462 29650
8294 29650 31494 19909 13137 2741 22139 44735 56858 47485 42149 44852 51014 52726 62212
8281 62212 55583 66572 62898 71011 89683 69085 71314 87630 83224 71782 63338 63856 42685
8268 42685 14024 14855 20566 37888 75040 73457 54704 45791 70609 94176 85191 71598 53330
8255 53330 26800 1783 27562 42604 56583 43584 37673 12137 11527 983 -16094 -8272 20266
8242 20266 26276 38126 53513 31784 55993 79917 61932 63301 58134 30814 37729 56490 48954
8229 48954 28686 15202 -2504 6908 28425 36132 38434 35711 32136 18945 -1838 17248 43607
$$ packed form
8320E9809j5970r889K7724j452l45k0979r872K2934j5292j2191L5412J4712l1172
8307D3429k266j2330J8224N128j6524k7164j082L6719J3614j968k1629j1689P188
8294B9650J844j1585o772j0396J9398K2596J2123r373n336K703O162J712R486
8281F2212o629J0989l674Q113J8672k0598K229J6316m406j1442q444N18k1171
8268D2685k8661Q31N711J7322L7152j583j8753q913K4818K3567q985j3593j8268
8255E3330k6530k5017K5779J5042J3979j2999n911k5536o10j0544j7077P822K8538
8242B0266O010J1850J5387k1729K4209K3924j7985J369n167k7320O915J8761p536
8229D8954k0268j3484j7706R412K1517P707K302k723l575j3191k0783J9086K6359
$$ plain form
8216 43607 39253 22277 46617 85471 60504 28801 -5379 -43029 -12679 24453 44089 53054
8204 53054 53187 52597 57761 47553 31145 13896 5721 32113 54339 51725 33236 37201 45581 44481
8190 44481 52726 39612 16807 20584 15098 32753 55219 27590 31136 18591 12592 -16966 -20490
8177 -20490 -9527 -19192 -156 7012 3396 22598 65478 97748 97155 75146 41478 31760 15444
8164 15444 21006 32398 46414 38996 47371 69783 59041 25711 17576 48299 36398 4874 19943
8151 19943 8077 19207 10102 -13194 -11610 -30768 -44902 -43080 -43197 -34826 -30368 -39181 -16620
8138 -16620 1613 -13182 -24656 4175 39487 29637 41497 63353 57101 55245 57437 77439 66603
8125 66603 69171 79714 65100 75098 59281 25909 34335 36933 26398 4063 -6065 -13714 -3032
$$ packed form
8216D3607m354j6976K4340L8854k4967l1703l4180l7650L0350L7132J9636Q965
8204E3054J33n90N164j0208j6408j7249q175K6392K2226k614j8489L965Q380j100
8190D4481Q245j3114k2805L777n486J7655K2466k7629L546j2545n999k9558l524
8177b0490J0963r665J9036P168l616J9202M2880L2270n93k2009l3668r718j6316
8164A5444N562J1392J4016p418Q375K2412j0742l3330q135L0723j1901l1524J5069
8151A9943j1866J1130r105k3296J584j9158j4134J822j17Q371M458q813K2561
8138a6620J8233j4795j1474K8831L5312r850J1860K1856o252j856K192K0002j0836
8125F6603K568J0543j4614R998j5817l3372Q426K598j0535k2335j0128p649J0682
$$ plain form
8112 -3032 34109 37873 6031 -10755 -25977 -38256 -42620 -41504 -16365 -15285 -25296 6678 38310
8099 38310 40090 59904 39718 40918 51781 56340 33319 10858 -23522 4284 3370 -3412 32953
8086 32953 38714 18628 18587 16353 -4182 -11385 4673 28955 12165 -42878 -45924 11996 36795
8073 36795 25922 15279 42052 84375 66775 16538 -7696 -15098 -1066 -11252 -11809 303
8061 303 6555 -9454 -22573 -78 15261 -5678 18223 33119 43568 55168 44101 46279 46045
8048 46045 44200 31928 29362 36649 25063 28122 33222 775 -24459 -7138 8182 29619 40856
8035 40856 33011 15552 15668 -10029 -26368 -40886 -3245 -212 -17964 -4537 16712 33126 42363
8022 42363 55705 48152 37868 45580 35754 8263 -8461 -23939 -26443 -41568 -21681 25873 41360
$$ packed form
8112c032L7141L764l1842j6786j5222j2279m364J116K5139J080j0011L1974L1632
8099C8310J780J9814k0186J200J0863M559k3021k2461l4380K7806r14o782L6365
8086C2953N761k0086m1k234k0535p203J6058K4282j6790n5043l046N7920K4799
8073C6795j0873j0643K6773M2323j7600n0237k4234p402J4032j0186n57J2112
8061C03O252j6009j3119K2495J5339k0939K3901J4896J0449J1600j1067K178k34
8048D6045j845j2272k566P287j1586L059N100l2447k5234J7321J5320K1437J1237
8035D0856p845j7459J16k5697j6339j4518L7641L033j7752J3427K1249J6414R237
8022D2363J3342p553j0284P712r826k7491j6724j5478k504j5125J9887M7554J5487
$$ plain form
8009 41360 54030 64112 77420 34278 421 24296 45085 57809 70928 52614 54231 79381
7997 79381 83565 101607 79386 74100 82741 65358 40368 18901 36508 39420 43711 39086 26910
7984 26910 44566 30732 4917 9680 31116 31620 4533 -27171 -11879 16493 37389 -14149
7972 -14149 -28724 -14116 -13910 15962 27596 12487 14798 9828 2396 12476 12026 39366 66408
7959 66408 47635 32958 53456 81478 56115 32061 884 7511 16471 18082 42885 29617
7947 29617 55511 53191 40806 17922 14965 18143 6280 -7081 -6611 2395 18822 41252 67239
7934 67239 70831 40147 28512 47312 15662 -26715 -5189 18666 -27186 -50406 -19760 39891
7922 39891 53290 37252 6897 -10754 -8132 1129 26237 29489 50028 53364 25181 35004 41162
$$ packed form
8009D1360J2670J0082J3308m3142l3857K3875K0789J2724J3119j8314J617K5150
7997G9381M184J8042k2221n286Q641j7383k4990k1467J7607K912M291m625j2176
7984B6910J7656j3834k5815M763K1436N04k7087l1704J5292K8372K0896n1538
7972a4149j4575J4608K06K9872J1634j5109K311m970p432J0080m50K7340K7042
7959F6408j8773j4677K0498K8022k5363k4054l1177O627Q960J611K4803j3268
7947B9617K5894k320j2385k2884k957L178j1863j3361M70R006J6427K2430K5987
7934F7239L592l0684j1635J8800l1650m2377K1526K3855m5852k3220L0646N9651
7922C9891J3399j6038l0355j7651K622R261K5108L252K0539L336k8183R823O158
$$ plain form
7909 41162 26800 20038 33472 41547 40621 41973 29837 50264 37503 19805 22955 48527 67132
7896 67132 42524 38172 43791 40413 58965 56690 37869 30294 47781 30760 25334 28287 28927 33978
7882 33978 12084 1144 8910 24513 33488 56419 51344 46424 29961 25630 7345 937 -5874
7869 -5874 5350 -4872 -21434 -581 12186 13640 13024 8616 13136 16781 18637 21553 61205 66687
7855 66687 47085 45822 28936 18147 25186 801 -14707 7713 10710 34652 42434 7851 11932
7842 11932 41663 55313 25938 9778 16749 29479 301 -28777 -44442 -6436 1881 11490
7830 11490 31081 19722 3856 26349 28019 4429 -10263 11287 22056 12828 2774 27460
7818 27460 35189 18302 1830 890 -6899 8422 2879 11918 12932 27327 27951 4645 -18776 -22012
$$ packed form
7909D1162j4362o762J3434Q075r26J352j2136K0427j2761j7698L150K5572J8605
7896F7132k4608m352N619l378J8552k275j8821p575J7487j7021n426K953O40N051
7882C3978k1894j0940P766J5603Q975K2931n075m920j6463m331j8285o408o811
7869e874J1224j0222j6562K0853J2767J454o16m408M520L645J856K916L9652N482
7855F6687j9602j263j6886j0789P039k4385j5508K2420K997K3942P782l4583M081
7842A1932K9731J3650k9375j6160O971J2730k9178k9078j5665L8006Q317R609
7830A1490J9591j1359j5866K2493J670k3590j4692K1550J0769r228j0054K4686
7818B7460P729j6887j6472r40p789J5321n543R039J014J4395O24k3306k3421l236
$$ plain form
7804 -22012 -37434 -52861 -51087 -47072 -11308 -6755 -24599 -34277 -19759 19793 23636 20000 9350
7791 9350 -17882 -18779 -16464 -20107 -60833 -74394 -17640 -7371 12027 -1113 -31365 1421 23940
7778 23940 34845 20414 23522 24643 18143 -13893 -2971 -25142 -19759 -3276 578 25501 27280
7765 27280 -2103 -1742 12476 14236 31758 44268 51540 48539 -678 -60380 -53113 8833 25819
7752 25819 12261 10331 12894 6645 10306 13124 10250 -1172 -5950 43 -16643 -2095 -8528 -6855
7738 -6855 -4506 3435 17131 5770 5373 31647 39350 26910 17098 22919 5807 -15321 6235
7725 6235 25519 23381 6419 -24456 8995 11222 -3560 4784 2885 19608 -12304 -32867 -28143
7712 -28143 -22587 -15631 -10353 14157 21814 31418 -1247 -7450 -31191 -45728 -27688 -10338 -3400
$$ packed form
7804b2012j5422j5427J774M015L5764M553j7844r678J4518L9552L843l636j0650
7791I350k7232q97K315l643m0726j3561N6754J0269J9398j3140l0252L2786K2519
7778B3940J0905j4431L108J121o500l2036J0922k2171N383J6483L854K4923J779
7765B7280k9383L61J4218J760J7522J2510P272l001m9217n9702P267O1946J6986
7752B5819j3558j930K563o249L661K818k874j1422m778N993j6686J4548o433J673
7738f855K349P941J3696j1361l97K6274P703j2440r812N821j7112k1128K1556
7725F235J9284k138j6962l0875L3451K227j4782Q344j899J6723l1912k0563M724
7712b8143N556O956N278K4510P657R604l2665o203k3741j4537J8040J7350O938
$$ plain form
7699 -3400 14009 44159 64123 44408 13624 9099 965 24499 21455 -7461 -30588 -2833 641
7686 641 9785 8508 9955 19689 -9017 -8726 -12020 -15943 -2145 22879 28723 34360 31324 21354 17502
7671 17502 27553 48655 35379 293 -6691 5153 -13568 -32414 -39327 -7994 -8851 -13311 -20799
7658 -20799 -6467 3392 7613 -11524 -16742 -30297 -24221 -23879 -17190 -24530 -13314 -7925 -4247 39624
7644 39624 36896 27655 19263 -10189 -10547 -10687 6007 17574 -1686 -13887 -1147 914 7890 -770
7630 -770 -5662 -19849 -37624 -3078 12080 37243 10138 -15663 -19626 1058 6231 19194 7415
7617 7415 -17042 -7002 1570 21033 33068 57984 56366 36542 1656 -5899 -21046 -29059 -35067
7604 -35067 -26079 13474 11331 -4505 10077 37489 36834 25334 4415 -4054 -12757 -22005 9203
$$ packed form
7699c400J7409L0150J9964j9715l0784m525q134K3534l044k8916k3127K7755L474
7686F41R144j277J447R734k8706K91l294l923J3798K5024N844N637l036r970l852
7671A7502J0051K1102j3276l5086o984J1844j8721j8846o913L1333q57m460p488
7658b0799J4332R859M221j9137n218j3555O076L42O689p340J1216N389L678M3871
7644C9624k728r241q392k9452l58j40J6694J1567j9260j2201J2740K061O976q660
7630g70m892j4187j7775L4546J5158K5163k7105k5801l963K0684N173J2963j1779
7617G415k4457J0040Q572J9463J2035K4916j618j9824l4886p555j5147q013o008
7604c5067Q988L9553k143j5836J4582K7412o55j1500k0919q469q703r248L1208
$$ plain form
7591 9203 21718 -7842 -37159 -29087 -13765 -9757 -17782 -5931 13144 9879 4473 1591 4601
7578 4601 6982 42521 21609 -28061 -36594 -38586 -31616 -53036 -66923 -23241 -14536 -14806 -7743 588
7564 588 23694 8443 -11527 -7492 -31755 -32961 -19771 -5707 -3671 -20838 -34156 -35602 -40904
7551 -40904 -3610 17462 47236 27049 -8386 -3514 12132 -3357 -8591 -3812 -9726 -39620 -23710
7538 -23710 -12432 -430 -6532 -11238 3367 4481 -7122 -31618 -35969 -45868 -52777 -33613 2914
7525 2914 4438 6305 16820 12234 -16875 -14349 -9834 -33136 -42033 -36765 -26547 6562 13934 1551
7511 1551 -88 -22394 -27542 -12403 -9603 -27810 -26040 1163 -25522 -15348 7794 15259 -3084
7498 -3084 -21258 -12822 -17214 -32547 -68845 -85796 -50156 -30795 -59237 -70532 -50381 -31478
$$ packed form
7591I203J2515k9560k9317Q072J5322M008q025J1851J9075l265n406k882L010
7578D601K381L5539k0912m9670q533j992O970k1420j3887M3682Q705k70P063Q331
7564E88K3106j5251j9970M035k4263j206J3190J4064K036j7167j3318j446n302
7551d0904L7294K1072K9774k0187l5435M872J5646j5489n234M779n914k9894J5910
7538b3710J1278J2002o102m706J4605J114j1603k4496m351r899o909J9164L6527
7525B914J524J867J0515m586k9109K526M515k3302q897N268J0218L3109P372j2383
7511A551j639k2306n148J5139K800j8207J770K7203k6685J0174K3142P465j8343
7498c084j8174Q436m392j5333l6298j6951L5640J9361k8442j1295K0151J8903
$$ plain form
7486 -31478 -27785 -41281 -68100 -39846 -18156 -22752 -8868 5795 13372 23710 19097 715 11083
7473 11083 29432 21699 1651 -11354 -8335 1084 1482 -4936 -5261 -39818 -56194 -49923 -59064 -65399
7459 -65399 -65492 -41762 -6661 16601 24925 5631 -21811 -38530 -50338 -61297 -70039 -53619 -23548
7446 -23548 -27848 -54535 -78400 -57311 -48326 -50381 -18728 17174 17262 10745 -8347 -31618 -33233
7433 -33233 -70217 -65170 -41994 -26609 -22596 243 7722 2042 -12014 -36480 -62791 -47059 -34930
7420 -34930 -37623 -30199 -34387 -27962 -24480 -45009 -34758 -13114 -32324 -57565 -48152 -47030 -30103
7407 -30103 1755 -1762 11311 28815 31884 788 10814 15833 -3939 -9945 -22828 -10167 9300
7394 9300 11320 16281 17010 -641 1529 -31638 -27293 5241 30605 35111 34486 11714 -1190 -8607
$$ packed form
7486c1478L693j3496k6819K8254K1690m596J3884J4663P577J0338m613j8382J0368
7473A1083J8349p733k0048j3005L019R419L98o418l25l4557j6376O271r141o335
7459f5399r3K3730L5101K3262Q324j9294k7442j6719j1808j0959q742J6420L0071
7446b3548m300k6687k3865K1089Q985k055L1653L5902Q8o517j9092k3271j615
7433c3233l6984N047K3176J5385M013K2839P479n680j4056k4466k6311J5732J2129
7420c4930k693P424m188O425L482k0529J0251K1644j9210k5241R413J122J6927
7407c0103L1858l517J3073J7504L069l1096J0026N019j9772o006j2883J2661J9467
7394I300K020M961P29j7651K170l3167M345L2534K5364M506o25k2772j2904p417
$$ plain form
7380 -8607 25162 5217 11208 29940 19845 -8626 -7135 -3556 -9536 8971 18820 -113 11313
7367 11313 18273 27539 20464 11436 13243 18422 17031 -11235 -13416 -3916 -10166 -24153 -16116 -26704
7353 -26704 -33486 -7093 -23773 -41748 -35145 -16565 -29208 -50215 -49568 -12137 23701 47031 36010
7340 36010 16692 23139 18935 1521 -13986 -15706 -21015 -9632 20581 30692 4959 -16833 6459
7327 6459 23408 23618 21452 -5387 10923 12094 -26516 -39388 -37390 -22630 15202 33602 38317
7314 38317 16336 -14232 -26636 -48438 -52552 -54325 -25584 -30145 -50742 -67119 -55777 -38428
7302 -38428 -25042 -21186 -50502 -60883 -57564 -45477 -31628 -20492 15130 56199 56815 54852 26094
7289 26094 -600 18389 43929 41439 30087 27345 8935 -16642 -32038 -41405 3477 18956
$$ packed form
7380h607L3769j9945N991J8732j0095k8471J491L579n980J8507R849j8933J1426
7367A1313O960R266p075r028J807N179j391k8266k181R500o250j3987Q037j0588
7353b6704o782K6393j6680j7975O603J8580j2643k1007O47L7431L5838K3330j1021
7340C6010j9318O447m204j7414j5507j720n309J1383L0213J0111k5733k1792K3292
7327F459J6949K10k166k6839J6310J171l8610j2872J998J4760L7832J8400M715
7314C8317k1981l0568j2404k1802m114j773K8741m561k0597j6377J1342J7349
7302c8428J3386L856k9316j0381L319J2087J3849J1136L5622M1069O16j963k8758
7289B6094k6694J8989K5540k490j1352k742j8410k5577j5396r367M4882J5479
$$ plain form
7277 18956 29714 1354 -17889 8601 7784 -15067 -18923 -16261 2914 -8013 -38513 -30714 -5419
7264 -5419 -22483 -43731 -56882 -79858 -55640 10849 11763 -24475 -25770 -13118 -14787 -18121 344
7251 344 23030 -8323 -13882 -8571 -26914 -26144 -6977 -6878 4217 -1801 -9130 -19098 -36047 -33708
7237 -33708 -18517 4661 14161 -2549 -15051 -20636 -28505 -41074 -37470 -16243 31546 43928 36037
7224 36037 16946 -562 -10750 -18875 -3313 13787 12417 -5208 -22780 -9070 23457 7781
7212 7781 -19457 11873 20674 23909 18147 -19036 -62301 -73432 -70430 -62032 -58350 -54185 -36927
7199 -36927 -34758 -17290 18632 16097 9585 36983 52379 30758 10631 2238 3701 18301 -12397
7186 -12397 -23994 -44190 -56522 -25759 4476 -32721 -26624 -39293 -25132 -23719 -32042 -23796 -30088
$$ packed form
7277A8956J0758k8360j9243K6490q17k2851l856K662J9175j0927l0500P799K5295
7264e419j7064k1248j3151k2976K4218O6489R14l6238j295J2652j669l334J8465
7251C44K2686l1353n559N311j8343P70J9167R9J1095o018p329r968j6949K339
7237c3708J5191K3178R500j6710j2502n585p869j2569L604K1227M7789J2382p891
7224C6037j9091j7508j0188q125J5562J7100j370j7625j7572J3710L2527j5676
7212G781k7238L1330Q801L235n762l7183m3265j1131L002Q398L682M165J7258
7199c6927K169J7468L5922k535o512K7398J5396k1621k0127q393J463J4600l0698
7186a2397j1597k0196j2332L0763L0235l7197O097j2669J4161J413q323Q246o292
$$ plain form
7173 -30088 5173 11712 -9671 -779 4000 -27469 -23956 -5699 -11029 -17296 -25279 -24340 -4157 19539
7159 19539 25345 -9754 -21859 -23198 -39678 -46788 -19408 3617 -4431 -9057 -27816 -35975 -15624
7146 -15624 40992 45302 57600 44803 2733 6958 3794 -21154 -17270 -11700 3836 11856 16409
7133 16409 -4084 -19846 -19381 -4495 -6679 -13875 -9179 -18872 -5230 -1882 -2134 3590 37972 44217
7119 44217 12988 -22578 -54134 -73807 -47895 -22954 -44198 -59456 -80586 -64754 -37187 3427
7107 3427 6601 -31491 -39488 -44355 -12719 40261 45816 9348 -15140 -4706 8540 -19689 -24608
7094 -24608 -46852 -24956 -5986 -8493 646 17460 31738 16113 16786 11398 250 6147 22207
7081 22207 25308 11730 -2966 25913 12989 -7376 -15366 -23590 -25064 -25521 -3462 25859 24924
$$ packed form
7173c0088L5261O539k1383Q892M779l1469L513J8257n330o267p983R39K0183K3696
7159A9539N806l5099j2105j339j6480p110K7380K3025q048m626j8759q159K0351
7146a5624N6616M310J2298j2797m2070M225l164k4948L884N570J5536Q020M553
7133A6409k0493j5762M65J4886k184p196M696r693J3642L348k52N724L4382O245
7119D4217l1229l5566l1556j9673K5912K4941k1244j5258k1130J5832K7567M0614
7107C427L174l8092p997m867L1636N2980N555l6468k4488J0434J3246k8229m919
7094b4608k2244K1896J8970k507R139J6814J4278j5625O73n388j1148N897J6060
7081B2207L101j3578j4696K8879j2924k0365p990q224j474m57K2059K9321r35
$$ plain form
7068 24924 24570 4342 13958 10283 -18071 -16685 29209 33719 969 -6579 5385 5195 3630 -3011
7054 -3011 -10823 -38449 -46943 -80971 -78160 -50097 -68301 -49216 -54727 -52864 -64325 -73267 -30324
7041 -30324 13515 6387 -37958 -35574 -13123 -26847 -35715 -38564 -52146 -36228 -24261 6065 27280
7028 27280 33639 4657 -30004 -56949 -90445 -82083 -50626 -42725 -45330 -36653 -991 20071 5173
7015 5173 -8504 -35429 -45462 -29373 -15344 7225 6419 -8746 4950 16883 -17694 -36867
7003 -36867 -74146 -66694 -70076 -51093 -25469 -1296 -2893 -5773 -16986 1160 27181 1123 -28987
6990 -28987 -24259 -2253 -9456 -33260 -45548 -27058 -40484 -11070 6233 20908 28141 -1263
6978 -1263 -44022 -24422 -24715 -1134 -3395 -2259 16806 37451 37140 26271 6105 -1939 10643
$$ packed form
7068B4924l54k0228R616l675k8354J386M5894M510l2750p548J1964j90j565o641
7054c011p812k7626q494l4028K811K8063j8204J9085n511J863j1461q942M2943
7041c0324M3839p128m4345K384K2451j3724q868k849j3582J5918J1967L0326K1215
7028B7280O359k8982l4661k6945l3496Q362L1457P901k605Q677L5662K1062j4898
7015E173j3677k6925j0033J6089J4029K2569q06j5165J3696J1933l4577j9173
7003c6867l7279P452l382J8983K5624K4173j597k880j1213J8146K6021k6058l0110
6990b8987M728K2006p203k3804j2288J8490j3426K9414J7303J4675P233k9404
6978a263m2759J9600k93K3581k261J136J9065K0645l11j0869k0166q044J2582
$$ plain form
6965 10643 -4335 5221 9504 21803 41038 52830 29891 23600 -3199 -37849 -13841 11671
6953 11671 44520 61850 39372 15912 -3855 1471 2514 6816 3713 7112 12621 -4289 -31376
6940 -31376 -40685 -36470 -22764 -36060 -34843 -41487 -13065 7433 21132 -115 -20109 -17275 -4860
6927 -4860 -6119 -35816 -81934 -92113 -67158 -48442 -48364 -46340 -47051 -43924 -42291 -28609 -11715 -12948
6913 -12948 -7442 -13239 -3060 -22466 -22433 -14769 10961 5372 -10957 -15647 -10457 -21651 -24136 -11889
6899 -11889 -19622 -24034 -24059 -9053 -10761 -20028 -36029 -22476 -20289 -8167 -24323 -39033 -13083
6886 -13083 42020 61192 31466 -13789 -40058 -51377 -65013 -29016 -6665 -6221 -16186 -7215 12541
6873 12541 -9803 -36022 -51640 -25019 -29435 -69099 -61461 -24982 8209 35574 25597 4317
$$ packed form
6965A0643j4978R556M283J2299J9235J1792k2939o291k6799l4650K4008K5512
6953A1671L2849J7330k2478k3460j9767N326J043M302l103L399N509j6910k7087
6940c1376r309M215J3706j3296J217o644K8422K0498J3699k1247j9994K834J2415
6927d860j259k9697m6118j0179K4955J8716P8K024p11L127J633J3682J6894j233
6913a2948N506n797J0179j9406L3P664K5730n589j6329m690N190j1194k485J2247
6899a1889p733m412k5J5006j708r267j6001J3553K187J2122j6156j4710K5950
6886a3083N5103J9172k9726m5255k6269j1319j3636L5997K2351M44r965Q971J9756
6873A2541k2344k6219j5618K6621m416l9664P638L6479L3191K7365r977k1280
$$ plain form
6861 4317 16469 34870 35089 3707 -1723 -26825 -32779 -14457 -5484 -21272 -23793 -11542 -31049
6848 -31049 -48508 -70165 -49462 -39400 -23990 15038 26034 24306 -1295 -16923 -7573 2975
6836 2975 11065 -4681 -18384 -47161 -39657 -26243 -12188 -1714 2189 -20950 -44935 -46253 -39372
6823 -39372 -44921 -61041 -50869 -52514 -59428 -67145 -62352 -24847 25363 48192 34394 16502 -3361
6810 -3361 -26685 -45092 -18839 -16518 -7818 -13559 -16748 -10376 -2934 -14057 -9995 -6247 -3250 -7435
6796 -7435 -13943 -30802 -14828 -9630 491 4198 10476 35219 -1732 -36742 -17926 -31719 -29388
6783 -29388 -18135 -6193 13340 18754 -2286 1910 12904 7366 -8539 7643 35032 27941 7855
6770 7855 -31016 -39958 -30811 -17209 -7354 -7186 2034 23562 14755 15920 2648 -11762 -2076 30226
$$ packed form
6861D317J2152J8401K19l1382n430k5102n954J8322Q973j5788k521J2251j9507
6848c1049j7459k1657K0703J0062J5410L9028J0996j728k5601j5628R350J0548
6836B975Q090j5746j3703k8777P504J3414J4055J0474L903k3139k3985j318O881
6823c9372n549j6120J0172j645o914p717M793L7505N0210K2829j3798j7892j9863
6810c361k3324j8407K6253K321Q700n741l189O372P442j1123M062L748K997m185
6796g435o508j6859J5974N198J0121L707O278K4743l6951l5010J8816j3793K331
6783b9388J1253J1942J9533N414k1040M196J0994n538j5905J6182K7389p091k0086
6770G855l8871q942R147J3602R855J68R220K1528q807J165j3272j4410R686L2302
$$ plain form
6756 30226 28018 2018 -9166 6902 -3876 -14368 -26691 -27296 -15917 -19788 -14732 -11242 -39955
6743 -39955 -57612 -47507 -53261 -69399 -92310 -65532 -48041 -27567 -33642 -30646 -30111 -13686 -23463
6730 -23463 -9591 6036 -4822 -11471 -21969 -2892 48695 31507 7256 11564 39965 55305
6718 55305 61886 47331 39943 37984 25825 28487 23680 20481 14572 20415 28011 12909 36404 4048
6704 4048 -1107 8895 -3526 -21006 -35371 -35646 -18806 -25630 -35168 -26147 -19956 -25109 -6794 -13854
6690 -13854 -8781 10672 32892 46634 35097 20976 8085 -21674 -51317 -65554 -104929 -93767
6678 -93767 -84504 -59746 -16397 -5370 -10428 -3358 -24256 -31603 -36301 -37236 -20063 -36500 -38672
6665 -38672 -14463 1763 -2723 -2770 -24284 -22294 -30929 -56036 -63496 -41332 -8057 -787 903 -33616
$$ packed form
6756C0226k208k6000j1184J6068j0778j0492j2323o05J1379l871N056L490k8713
6743c9955j7657J0105n754j6138k2911K6778J7491K0474o075K996N35J6425r777
6730b3463J3872J5627j0858o649j0498J9077N1587j7188k4251M308K8401J5340
6718E5305O581j4555p388j959j2159K662m807l199n909N843P596j5102K3495l2356
6704D048n155J0002j2421j7480j4365k75J6840o824r538R021O191n153J8315p060
6690a3854N073J9453K2220J3742j1537j4121j2891k9759k9643j4237l9375J1162
6678i3767R263K4758M3349J1027n058P070k0898p347m698r35J7173j6437k172
6665c8672K4209J6226m486m7k1514J990q635k5107p460K2164L3275P270J690l4519
$$ plain form
6651 -33616 -36392 -9049 6884 25629 59910 71294 59523 22701 10637 20062 31601 18180
6639 18180 -10703 -16780 -47455 -40949 -7489 -26491 -49769 -55620 -57008 -43389 -12498 -24690 -28988
6626 -28988 4077 18920 22257 27371 788 -3033 -12390 12318 30815 -4160 -40175 -38894 -34228
6613 -34228 -46151 -43141 -36016 -8959 512 16175 68612 75787 56760 27172 38677 45129 9382
6600 9382 -37803 -45600 -10770 -9263 -22978 -42875 -75419 -51257 -32343 -35843 -21538 -8438 -18166
6587 -18166 -22236 -26461 -2391 24148 21123 -9277 -15956 -13017 1489 15908 13679 16769 12397
6574 12397 -7826 -24408 -48341 -87007 -92382 -69681 -42884 -21187 -33979 -66991 -67824 -62473 -58597
6561 -58597 -48070 -41462 -52016 -49689 -49344 -44805 -32799 -20584 -32544 -27379 11924 -6592 -36718
$$ packed form
6651c3616k776K7343J5933J8745L4281J1384j1771l6822j2064R425J1539j3421
6639A8180k8883o077l0675O506L3460j9002k3278n851j388J3619L0891j2192m298
6626b8988L3065J4843L337N114k6583l821r357K4708J8497l4975l6015J281M666
6613c4228j1923L010P125K7057R471J5663N2437P175j9027k9588J1505O452l5747
6600I382m7185p797L4830J507j3715j9897l2544K4162J8914l500J4305J3100r728
6587a8166m070m225K4070K6539l025l0400o679K939J4506J4419k229L090m372
6574A2397k0223j6582k3933l8666n375K2701K6797K1697j2792l3012q33N351L876
6561e8597J0527O608j0554K327L45M539J2006J2215j1960N165L9303j8516l0126
$$ plain form
6548 -36718 -25272 -10850 -20385 -6537 -8017 -3090 5025 21366 7544 8956 -14537 -50294 -71287
6535 -71287 -58814 -47322 -64245 -48404 -5407 10664 -7320 -17452 -35143 -46233 -63735 -45778
6523 -45778 -23975 -18655 -30163 -48615 -39683 -36260 -34042 -13729 888 36184 39078 19764 31365
6510 31365 42762 36560 26929 27669 61456 41566 -15925 -57816 -48930 -24577 -5896 2102 7969
6497 7969 12022 15327 38506 61587 49710 9084 -32715 -21327 -3340 -3782 -32101 -11675 16911
6484 16911 26744 -2800 -18022 -25980 -9361 40548 50345 26129 15075 -14922 -40299 -23973
6472 -23973 -696 -5772 -18902 -48351 -28012 -7277 -18447 -31866 -17156 -4241 -7168 -11869
6460 -11869 -18287 -31964 -33525 -19714 -8612 -38013 -39063 -34053 -30046 -17806 811 34411 9584
$$ packed form
6548c6718J1446J4422r535J3848j480M927Q115J6341j3822J412k3493l5757k0993
6535g1287J2473J1492j6923J5841M2997J6071j7984j0132j7691j1090j7502J7957
6523d5778K1803N320j1508j8452Q932L423K218K0313J4617L5296K894j9314J1601
6510C1365J1397o202r631P40L3787j9890n7491m1891Q886K4353J8681P998N867
6497G969M053L305K3179K3081j1877m0626m1799J1388J7987m42k8319K0426K8586
6484A6911R833k9544j5222p958J6619M9909R797k4216j1054k9997k5377J6326
6472b3973K3277n076j3130k9449K0339K0735j1170j3419J4710J2915k927m701
6460a1869o418j3677j561J3811J1102k9401j050N010M007J2240J8617L3600k4827
$$ plain form
6447 9584 -36460 -13518 -1597 -7760 -10394 -25893 -14799 -23333 -7499 4429 -15965 -42990 -67756
6434 -67756 -66849 -36511 -4690 -25044 -42302 -18063 -6089 -22779 -30511 -43027 -24865 16285
6422 16285 12119 -18339 -44128 -53932 -41618 -40401 -38751 -12058 6255 5996 -5699 -19562 -41534
6409 -41534 -72035 -52080 -49169 -52958 -17417 27589 50645 16040 -10618 -16501 -22185 -7794 1545
6396 1545 -2928 -43903 -29325 -30482 -64784 -63588 -45297 -24973 -21183 -28314 -9520 7860 -12838
6383 -12838 -17857 -36865 -42350 -17509 -23009 -40553 -48404 519 -15859 -28178 -55540 -37956 -35929
6370 -35929 -41395 -8044 -3108 -4493 -27414 -29480 -35138 -28521 -42978 -51056 -41244 -24211 8062
6357 8062 12490 10684 23724 25958 24054 28612 24817 -12139 -22223 -37 27430 31062 22209 -273
$$ packed form
6447I584m6044K2942J1921o163k634j5499J1094q534J5834J1928k0394k7025k4766
6434f7756R07L0338L1821k0354j7258K4239J1974j6690p732j2516J8162M1150
6422A6285m166l0458k5789r804J2314J217J650K6693J8313k59j1695j3863k1972
6409d1534l0501J9955K911l789L5541M5006K3056l4605k6658n883n684J4391R339
6396A545m473m0975J4578j157l4302J196J8291K0324L790p131J8794J7380k0698
6383a2838n019j9008n485K4841n500j7544p851M8923j6378j2319k7362J7584K027
6370c5929n466L3351M936j385k2921k066n658O617j4457q078R812J7033L2273
6357H062M428j806J3040K234j904M558l795l6956j0084K2186K7467L632q853k2482
$$ plain form
6343 -273 11039 18936 -263 4271 27952 -9865 -49188 -73438 -62849 -49393 -42993 -28581 -30880
6330 -30880 -33346 -37480 -29008 -25515 -34653 -43407 -48293 -33033 14747 -2641 -16182 -4086 7750
6317 7750 -5032 -19708 -26557 -29710 -27044 -21268 -36265 -34229 -9547 1590 -6921 -3007 -5638 -6379
6303 -6379 -26116 -37048 -25039 -15030 2199 -3460 7062 -9062 -24655 -14334 -10768 5004
6291 5004 -3252 6555 31958 15434 -11406 -5904 28141 47607 26936 -5093 5800 2481 13452
6278 13452 27509 15978 6895 4765 4199 4244 10123 19773 15614 24832 28500 12261 1629 13959
6264 13959 19834 30875 5010 -6194 -9171 -12438 10365 30448 20723 24666 2172 -2938 -29105
6251 -29105 -25937 -17815 -34969 -35902 -54978 -34127 -16022 1099 -12406 -2148 26511 20042 -6879
$$ packed form
6343b73J1312P897j9199M534K3681l7817l9323k4250J0589J3456O400J4412k299
6330c0880k466m134Q472L493r138q754m886J5260M7780j7388j3541J2096J1836
6317G750j2782j4676o849l153K666N776j4997K036K4682J1137q511L914k631p41
6303f379j9737j0932J2009J0009J7229n659J0522j6124j5593J0321L566J5772
6291E004q256R807K5403j6524k6840N502L4045J9466k0671l2029J0893l319J0971
6278A3452J4057j1531r083k130n66M5N879R650m159R218L668j6239j0632J2330
6264A3959N875J1041k5865j1204k977l267K2803K0083r725L943k2494n110k6167
6251b9105L168Q122j7154r33j9076K0851J8105J7121j3505J0258K8659o469k6921
$$ plain form
6238 -6879 -4965 15772 -8188 -17638 -13420 -12453 11983 10004 -3029 -6201 -9562 -19718 -20019 -25154
6224 -25154 -30618 -33964 -28707 -34918 -3683 -16996 -52149 -26429 -4946 8583 -17511 -30166 -10071
6211 -10071 -3585 4727 15997 7061 23590 16682 -13501 -15475 2170 -15770 16807 39538 -28065
6198 -28065 -80059 -73261 -32025 -35751 -30571 -37449 -52330 -32452 -25455 1418 6906 -10349 -13657
6185 -13657 -6180 -41173 -62678 -57880 -49824 -57773 -61638 -91318 -104552 -103102 -90318 -66923 -38926
6172 -38926 -29426 -896 24141 -20583 -73957 -88956 -80769 -48088 -10516 28622 42322 19471
6160 19471 -714 129 16069 -6345 -28423 -37813 -53200 -35613 -27074 -19895 -5191 -2977 -26470
6147 -26470 -21303 -35041 -42582 -41104 -19056 5483 -2828 -25417 -17768 -23539 -11054 6262 5547
$$ packed form
6238f879J914K0737k3960r450M218R67K4436j979j3033l172l361j0156l01n135
6224b5154n464l346N257o211L1235j3313l5153K5720K1483J3529k6094j2655K0095
6211a0071O486Q312J1270q936J6529o908l0183j974J7645j7940L2577K2731o7603
6198b8065n1994O798M1236l726N180o878j4881J9878O997K6873N488j7255l308
6185a3657P477l4993k1505M798Q056p949l865k9680j3234J450J2784K3395K7997
6172c8926R500K8530K5037m4724n3374j4999Q187L2681L7572L9138J3700k2851
6160A9471k0185Q43J5940k2414k2078r390j5387J7587Q539P179J4704K214k3493
6147b6470N167j3738p541J478K2048K4539q311k2589P649n771J2485J7316p15
$$ plain form
6134 5547 -1266 8305 -1647 -6339 -68 -14734 -25232 -25637 -39258 -52116 -44203 -51524 -37403 -38457
6120 -38457 -38701 -11634 6516 10001 1035 -16272 -1545 -17569 -7050 -4625 -41378 -61514 -68186
6107 -68186 -61860 -18147 -5654 -26975 -24445 -29194 -14099 -18459 -59065 -67229 -51201 -45669 -42103
6094 -42103 -67387 -42011 -3232 2099 -5299 -24473 4775 9368 12009 26429 28795 11922 -13703
6081 -13703 2656 -3986 -17412 -39364 -35953 -39506 -61528 -70227 -82139 -54741 -52344 -41753 -5460
6068 -5460 4304 -26564 -27728 -21704 -23295 -26579 -13252 226 -10181 -34458 -49023 -40903 -37570
6055 -37570 -34293 -24683 -30977 -31906 -18545 -15169 -14766 2719 1972 4588 8898 -8439 -24792 -27775
6041 -27775 -66066 -84476 -58018 -25065 -21705 -38075 -66245 -45311 -25902 4610 33092 41877
$$ packed form
6134E547o813R571r952m692O271j4666j0498m05j3621j2858P913p321J4121j054
6120c8457k44K7067J8150L485q966j7307J4727j6024J0519K425l6753k0136o672
6107f8186O326M3713J2493k1321K530m749J5095m360m0606q164J6028N532L566
6094d2103k5284K5376L8779N331p398j9174K9248M593K641J4420K366j6873k5625
6081a3703J6359o642j3426k1952L411l553k2022q699j1912K7398K397J0591L6293
6068e460R764l0868j164O024j591l284J3327J3478j0407k4277j4565Q120L333
6055c7570L277R610o294r29J3361L376M03J7485p47K616M310j7337j6353k983
6041b7775l8291j8410K6458L2953L360j6370k8170K0934J9409L0512K8482Q785
$$ plain form
6029 41877 26866 34837 36285 32096 -7117 -16659 -13400 -24738 -45055 -17624 -7812 -17088 -18392
6016 -18392 -35412 -25129 7018 21416 -1890 -35277 -27196 -23008 -12873 -28025 -17006 2899
6004 2899 -8534 -20901 -18897 -4562 -16957 -12834 9778 35102 8167 16574 1951 -32236 -26522
5991 -26522 -37217 -61356 -42680 845 -15914 -10119 -26440 -25513 -31223 -26223 -41827 -61273 -42766
5978 -42766 -24810 -32844 -39849 -54227 -63678 -56681 -41521 4143 14436 2395 -9807 -7165 -14479
5965 -14479 -56999 -56283 -17611 17686 18214 -21655 -41882 -60280 -81854 -67454 -42886 -24999 -10860
5952 -10860 -3243 -5495 6861 17494 5892 3961 -4345 -19272 -64003 -84664 -68490 -43017 -30777
5939 -30777 -45275 -23447 15437 13411 26092 22932 1287 -5014 -25781 -45329 -14918 7939
$$ packed form
6029D1877j5011P971J448m189l9213r542L259j1338k0317K7431R812r276j304
6016a8392j7020J0283L2147J4398k3306l3387Q081M188J0135j5152J1019J9905
6004B899j1433j2367K004J4335j2395M123K2612K5324k6935Q407j4623l4187N714
5991b6522j0695k4139J8676M3525j6759N795j6321R27n710N000j5604j9446J8507
5978d2766J7956q034p005j4378r451O997J5160M5664J0293j2041j2202K642p314
5965a4479m2520P16L8672L5297N28l9869k0227j8398k1574J4400K4568J7887J4139
5952a0860P617k252J2356J0633j1602j931q306j4927m4731k0661J6174K5473J2240
5939c0777j4498K1828L8884k026J2681l160k1645o301k0767j9548L0411K2857
$$ plain form
5927 7939 11513 1068 -12186 3377 -9163 -27437 -31317 -26859 -35941 -66286 -59604 -75955 -82405
5914 -82405 -73369 -81186 -64803 -14653 -31196 -5952 -18642 -30564 -45864 -21975 26294 4303
5902 4303 1310 -603 -9221 133 19463 30525 20121 -1815 -425 4124 10527 10845 3504 -12816
5888 -12816 -4156 -8565 -25296 -32981 -16214 1158 2504 -32369 -70387 -56642 -27871 -27350 -20313
5875 -20313 -376 18401 -4335 758 21157 17832 6084 -19680 -9225 -4872 -7097 -35814 -44948
5862 -44948 -9703 -14977 -9269 3799 15148 23500 7647 -2046 -23766 -24803 -27858 -34357 -32215
5849 -32215 -44432 -43697 -39680 -53170 -35987 -8829 -2729 5669 -9348 -55274 -40593 -22640 -32462
5836 -32462 -47451 -47266 -37766 -28523 -8145 5637 -5028 -39445 -27548 7790 27574 16633 17666
$$ packed form
5927G939L574j0445j3254J5563j2540j8274l880M458r082l0345O682j6351o450
5914h2405R036p817J6383N0150j6543K5244j2690j1922j5300K3889M8269k1991
5902D303k993j913q618R354J9330J1062j0404k1936J390M549O403L18p341j6320
5888a2816Q660m409j6731p685J6767J7372J346l4873l8018J3745K8771N21P037
5875b0313J9937J8777k2736N093K0399l325j1748k5764J0455M353k225k8717r134
5862d4948L5245n274N708J3068J1349Q352j5853r693k1720j037l055o499K142
5849c2215j2217P35M017j3490J7183K7158O100Q398j5017m5926J4681J7953r822
5836c2462j4989J85R500R243K0378J3782j0665l4417J1897L5338J9784j0941J033
$$ plain form
5823 17666 10155 614 30110 17910 30477 36464 17276 -5086 -36377 -41645 -42772 -18634 -13680
5810 -13680 -4496 -1298 -15463 -2122 -2898 -16214 -42709 -50704 -60809 -55595 -52430 -17920 -13509
5797 -13509 10400 18139 -5974 -7427 -9178 9107 17107 36070 23108 15640 2004 -31166 -40591
5784 -40591 -63055 -37149 -16728 374 24083 32997 39558 24506 -4751 -22582 -18417 -29205
5772 -29205 -29229 -14185 7514 1551 -3683 15342 20773 5991 16381 34408 21796 28098 30907
5759 30907 34828 8623 18826 29637 36263 18839 10109 -15542 -24918 -16606 -12039 -28121 -37462
5746 -37462 -43929 -50193 -43226 -18626 -36411 -64232 -56365 -33805 -6396 -6536 1304 -2943 -36392
5733 -36392 -67241 -88353 -106744 -80324 -28269 11950 31866 34608 48119 21394 -313 3594
$$ packed form
5823A7666p511r541K9496j2200J2567N987j9188k2362l1291n268j127K4138M954
5810a3680R184L198j4165J3341p76j3316k6495p995j0105N214L165L4510M411
5797a3509K3909P739k4113j453j751J8285Q000J8963j2962p468j3636l3170r425
5784d0591k2464K5906K0421J7102K3709Q914O561j5052k9257j7831M165j0788
5772b9205k4J5044K1699n963n234J9025N431j4782J0390J8027j2612O302K809
5759C0907L921k6205J0203J0811O626j7424q730k5651r376Q312M567j6082r341
5746c7462o467o264O967K4600j7785k7821P867K2560K7409j40P840m247l3449
5733c6392l0849k1112j8391K6420N2055M0219J9916K742J3511k6725k1707L907
$$ plain form
5721 3594 4648 -7400 -22121 -25738 -12207 -18434 -15863 -20430 -33375 -44843 -58433 -56237 -35626
5708 -35626 -12447 -15824 -7348 4586 11825 16955 2007 -10767 -16969 27939 22976 14955 478
5695 478 12307 -2348 -21252 -22858 -42669 -53467 -27351 -18777 -16130 -18771 -32249 -26703 -10564
5682 -10564 -9666 19900 32706 7099 2008 30695 34541 43792 33611 -31945 -54798 -35909 -14857
5669 -14857 -31807 -20741 -6455 3536 -23243 -60028 -75917 -39674 24224 49979 16523 -5514
5657 -5514 -5901 -12877 -20432 -12380 -6320 -1736 -1082 -54711 -73588 -72540 -46165 -44392 -35468 -47903
5643 -47903 -58290 -69146 -47060 -7550 15289 23580 20575 -4531 -25919 7328 34862 22893
5631 22893 19485 13305 4405 37273 53679 33166 40116 43414 9846 16457 31312 26661 28515
$$ packed form
5721C594J054j2048j4721l617J3531o227K571m567j2945j1468j3590K196K0611
5708c5626K3179l377Q476J1934P239N130j4948j2774o202M4908m963q021j4477
5695D78J1829j4655j8904j606j9811j0798K6116Q574K647k641j3478N546J6139
5682a0564Q98K9566J2806k5607n091K8687L846R251j0181o5556k2853J8889K1052
5669a4857j6950J1066J4286R991k6779l6785j5889L6243O3898K5755l3456k2037
5657e514l87o976p555Q052O060M584O54n3629j8877J048K6375J773Q924j2435
5643d7903j0387j0856K2086L9510K2839Q291l005k5106k1388L3247K7534j1969
5631B2893l408o180q900L2868J6406k0513O950L298l3568O611J4855m651J854
$$ plain form
5618 28515 47487 54508 44591 38074 53040 55782 4456 -31088 -16163 17656 5813 -9530 -13354
5605 -13354 -474 -20034 -37665 -37048 -36783 -3240 3890 -27117 -35507 -5350 6698 4559 -1838
5592 -1838 2933 -25225 -8344 7352 -1209 28240 6310 -35099 -44995 -8088 10504 -12073 -51742
5579 -51742 -52894 -51353 -42664 -14283 -3865 8463 -8972 5973 -13238 -36397 -38162 -41304 -11943
5566 -11943 -2221 -1405 10477 25614 42503 36378 36630 308 -4286 -13293 -25567 -27722 -26803 -21273
5552 -21273 -44575 -47472 -17947 31965 64343 35388 13141 26480 19633 -12901 -19264 -8221
5540 -8221 28130 15900 -20730 -28137 -12691 -26161 -17411 -16898 -17329 -33235 -10186 14551 -546
5527 -546 -8815 -9059 18147 226 -4662 -24747 -50552 -17752 19792 13610 3185 -15830 -2874
$$ packed form
5618B8515J8972P021r917o517J4966K742n1326l5544J4925L3819j1843j5343l824
5605a3354J2880j9560j7631O17K65L3543P130l1007q390L0157J2048k139o397
5592a838M771k8158J6881J5696q561K9449k1930m1409r896L6907J8592k2577l9669
5579e1742j152J541Q689K8381J0418J2328j7435J4945j9211k3159j765l142K9361
5566a1943R722Q16J1882J5137J6889o125K52l6322m594r007j2274k155R19N530
5552b1273k3302k897K9525M9912L2378k8955k2247J3339o847l2534o363J1043
5540h221L6351j2230l6630p407J5446j3470Q750N13m31j5906K3049K4737j5097
5527e46q269k44K7206j7921m888k0085k5805L2800L7544o182j0425j9015J2956
$$ plain form
5514 -2874 32217 16667 30702 -4253 -47102 -47285 -50338 -28466 -1296 19880 -9062 -12446 -12009
5501 -12009 -20409 -19480 13020 50869 39711 19612 -1372 -11066 -15979 -12010 -29703 -33514 -53463
5488 -53463 -70623 -56586 -69063 -58965 -35238 -14716 32650 847 -171 7268 1268 -11405
5476 -11405 8159 19752 -11712 -43760 -47921 -17407 3524 23668 20845 8138 -2148 -14117
5464 -14117 -4293 -3687 -44697 -2388 -2643 -16816 12580 40940 14165 -10263 -41650 -64226 -42902
5451 -42902 -15938 17087 29638 -1402 -32510 -78991 -84234 -54730 -58022 -39753 -31440 -30810 -11760
5438 -11760 -3314 -807 -17791 -17205 -25094 -43968 -19660 -7199 -15206 -43043 -32797 -4680 32889
5425 32889 54974 22897 9469 7352 -12648 294 15463 140 -30526 -10550 6103 29585
$$ packed form
5514b874L5091j5550J4035l4955m2849j83l053K1872K7170K1176k8942l384M37
5501a2009q400R29L2500L7849j1158k0099k0984r694m913L969j7693l811j9949
5488e3463j7160J4037j2477J0098K3727K0522M7366l1803j018P439o000j2673
5476a1405J9564J1593l1464l2048m161L0514K0931K0144k823j2707j0286j1969
5464a4117R824O06m1010M2309k55j4173K9396K8360k6775k4428l1387k2576K1324
5451d2902K6964L3025J2551l1040l1108m6481n243K9504l292J8269Q313O30J9050
5438a1760Q446K507j6984N86p889j8874K4308J2461q007k7837J0246K8117L7569
5425C2889K2085l2077j3428k117k0000J2942J5169j5323l0666J9976J6653K3482
$$ plain form
5413 29585 16106 26084 45500 40335 11381 -4337 -9189 -1839 37258 44199 23881 -8533 -26255
5400 -26255 -21094 7440 34398 61630 66022 37771 14140 40214 56728 33378 -6216 -9012
5388 -9012 -12704 -9428 -9120 -39077 -48552 -7389 -10259 -33140 -21586 -1438 -9718 4163 31047
5375 31047 26535 -9421 -37273 -68779 -41338 -15839 -12115 -21044 -48999 -67319 -58462 -41266 -59620
5362 -59620 -57188 -26131 -39511 -29596 -26678 -21992 6727 22366 22867 9965 -33244 -15576 -6688
5349 -6688 -50537 -94753 -131253 -108721 -77625 -78822 -44200 1545 6396 8758 13065 -8643 -39930
5336 -39930 -51199 -43293 -50293 -42050 -18061 2465 26763 4229 -25614 -45359 -58402 -37535
5324 -37535 -39923 -51587 -31772 -20002 -13903 -50551 -46976 -24506 -6228 -23745 -59160 -84938
$$ packed form
5413B9585j3479R978J9416n165k8954j5718m852P350L9097O941k0318l2414j7722
5400b6255N161K8534K6958K7232M392k8251k3631K6074J6514k3350l9594k796
5388i012l692L276L08k9957r475M1163k870k2881J1554K0148q280J3881K6884
5375C1047m512l5956k7852l1506K7441K5499L724q929k7955j8320Q857J7196j8354
5362e9620K432L1057j3380R915K918M686K8719J5639N01j2902m3209J7668Q888
5349f688m3849m4216l6500K2532L1096j197L4622M5745M851K362M307k1708l1287
5336c9930j1269P906p000Q243K3989K0526K4298k2534k9843j9745j3043K0867
5324c7535k388j1664J9815J1770O099l6648L575K2470J8278j7517l5415k5778
$$ plain form
5312 -84938 -75437 -47360 -56461 -58659 -17464 -12905 -24499 -32077 -24091 -21327 -30953 -37728 -46100 -47037
5298 -47037 -32658 -30059 -1770 41863 74832 56825 17733 40841 47593 24253 17776 10597 14998
5285 14998 17344 -10579 20232 54532 44937 23572 40411 45015 33604 8347 673 -2955 -13781
5272 -13781 -39403 -33964 -12996 -29833 -8785 3950 -173 -12012 -21011 -23523 150 26239 16708
5259 16708 -17560 -35949 -38360 -19989 -6655 7790 -3317 26816 45017 45106 37799 12106 31994
5246 31994 47418 46422 38379 32764 29182 16246 -993 -5374 -9777 -17145 -16666 -6931 3287 -15913
5232 -15913 -9199 -20548 -23239 -21820 -22622 -25848 -19430 -30840 -69354 -56648 -45320 -21859 -47012
5219 -47012 -54075 -56625 -56690 -21504 -6048 -43327 -46262 -30059 -65089 -65578 -31529 9301 246 -22985
$$ packed form
5312h4938R501K8077r101k198M1195M559j1594p578P986K764r626o775q372r37
5298d7037J4379K599K8289M3633L2969j8007l9092K3108O752k3340o477p179M401
5285A4998K346k7923L0811L4300r595k1365J6839M604j1411k5257p674l628j0826
5272a3781k5622N439K0968j6837K1048J2735m123j1839q999k512K3673K6089r531
5259A6708l4268j8389k411J8371J3334J4445j1107L0133J8201Q9p307k5693J9888
5246C1994J5424r96q043n615l582j2936j7239m381m403p368M79R735J0218j9200
5232a5913O714j1349k691J419q02l226O418j1410l8514J2706J1328K3461k5153
5219d7012p063k550o5L5186J5456l7279k935J6203l5030m89L4049M0830r055k3231
$$ plain form
5205 -22985 -21749 -15645 -3873 -28830 -37741 -30791 -31288 -12983 15620 38413 21234 42859 36990
5192 36990 15293 -911 -12485 -19166 -36278 -18175 2414 -7978 -26933 -25648 16121 38611
5180 38611 15822 -17302 648 -815 -3183 16799 8899 -5522 -16341 -15396 -3965 -16749 -19564
5167 -19564 -20136 -4678 24345 43856 40145 39879 56984 41993 20334 17911 22869 -14373 -20047
5154 -20047 -31415 -1675 12449 -29896 -31699 -19601 -6178 7912 -33396 -11168 996 4080
5142 4080 24581 47393 34229 7097 -27607 -31072 -3108 -11130 -30309 -45408 -24898 4248
5130 4248 4620 2150 6640 6583 14193 -16630 -39950 -28061 -21543 -3513 -12823 -21490 -28643 3149
5116 3149 23595 19007 -15085 12137 2516 -31609 -53034 -49024 -18893 -5899 16447 30465 55449
$$ packed form
5205b2985J236O104J1772k4957q911O950m97J8305K8603K2793j7179K1625n869
5192C6990k1697j6204j1574o681j7112J8103K0589j0392j8955J285M1769K2490
5180C8611k2789l3124J7950j463k368J9982p900j4421j0819R45J1431j2784k815
5167a9564n72J5458K9023J9511l711k66J7105j4991k1659k423M958l7242n674
5154b0047j1368K9740J4124m2345j803J2098J3423J4090m1308K2228J2164L084
5142D080K0501K2812j3164k7132l4704l465K7964q022j9179j5099K0510K9146
5130D248L72k470M490n7P610l0823k3320J1889O518J8030r310q667p153L1792
5116C149K0446m588l4092K7222r621l4125k1425M010L0131J2994K2346J4018K4984
$$ plain form
5103 55449 45577 22214 9574 31008 45645 24626 5293 13492 12929 34088 17086 -11521 888
5090 888 32194 23608 -7155 -10973 -12215 -26781 -23919 -26588 -13900 -10040 9774 17165 2216 -5041
5076 -5041 -11486 -11344 26316 41917 48246 27706 3221 -17465 -41215 -46640 -46173 -61530 -58740 -20769
5062 -20769 -10025 -15453 -31110 -46609 -10725 -4468 -23649 -11387 -21019 -26986 -32896 -78466 -90138
5049 -90138 -49498 -7587 24802 2367 -23523 -30919 -20770 6975 -1267 -1412 48441 61879 41620
5036 41620 14534 1919 -365 -19520 2749 12838 -13364 -27993 -42498 -51233 -37128 -44848
5024 -44848 -54814 -32641 10962 15813 -13666 -40903 -64147 -69280 -46633 -80175 -83870 -31514 -24990
5011 -24990 -31193 -37761 -16579 -4208 -29677 -33226 -27342 6600 21491 30363 9778 -14490 -24119
$$ packed form
5103E5449r872k3363j2640K1434J4637k1019j9333Q199n63K1159j7002k8607J2409
5090H88L1306q586l0763l818j242j4566K862k669J2688L860J9814P391j4949p257
5076e041o445J42L7660J5601O329k0540k4485k0686k3750n425M67j5357K790L7971
5062b0769J0744n428j5657j5499L5884O257j9181J2262r632n967n910m5570j1672
5049i0138M0640M1911L2389k2435k5890p396J0149K7745q242j45M9853J3438k0259
5036D1620k7086j2615k284j9155K2269J0089k6202j4629j4505q735J4105p720
5024d4848r966K2173M3603M851k9479k7237k3244n133K2647l3542l695N2356O524
5011b4990o203o568K1182J2371k5469l549N884L3942J4891Q872k0585k4268r629
$$ plain form
4998 -24119 -41203 -46941 -70002 -95172 -100403 -66949 -29001 -50165 -40917 -16330 -29430 -11955
4986 -11955 7195 16499 21615 15547 25613 10546 3684 3695 3118 -23551 -19510 -9228 4031 -2316
4972 -2316 4749 20889 -1716 -21323 -26059 -32481 -23561 -13942 -7598 -8580 -2771 15372 31513 51673
4958 51673 60220 35626 11405 17106 -1334 -21175 -22111 -18471 -8115 -22565 -64537 -61724 -745
4945 -745 20512 23423 11895 1834 -2526 -15603 -22399 -34303 -50480 -49832 -43691 -33104 -23354 -29339
4931 -29339 -10113 7797 5040 -17707 -34306 -54918 -55354 -36922 -25522 -22823 23554 38426 21970
4918 21970 15726 21609 12227 36627 42711 30967 15693 -5216 8485 18979 393 -11365 -15576
4905 -15576 -4945 5458 5283 -31289 -46973 -34560 -10543 2693 -5140 9690 5120 12560 28300
$$ packed form
4998b4119j7084n738k3061k5170n231L3454L7948k1164R248K4587j3100J7475
4986a1955J9150R304N116o068J0066j5067o862J1n77k6669M041J0282J3259o347
4972b316P065J6140k2605j9607m736o422Q920R619O344r82N809J8143J6141K0160
4958E1673Q547k4594k4221N701j8440j9841r36L640J0356j4450m1972K813O0979
4945g45K1257K911j1528j0061m360j3077o796j1904j6177O48O141J0587R750n985
4931b9339J9226J7910k757k2747j6599k0612m36J8432J1400K699M6377J4872j6456
4918B1970o244N883r382K4400O084j1744j5274k0909J3701J0494j8586j1758m211
4905a5576J0631J0403j75l6572j5684J2413K4017J3236p833J4830m570P440J5740
$$ plain form
4892 28300 29559 18253 -20936 832 12598 44124 42945 31973 23946 40429 47514 46169 32053
4879 32053 -17799 -26814 1619 32278 50168 45472 637 -18614 -8083 25974 49532 52321
4867 52321 29709 29835 29988 19111 35492 6004 -5950 80 -386 1962 4229 20931 17363 9208
4853 9208 -1613 -6537 9914 -21903 -45659 -19890 -17610 -13882 -16670 -33284 -29065 -5035 -24202
4840 -24202 -45055 -31677 6916 26977 27061 12482 -8970 -28196 -39785 -28682 -12902 -16136 4093
4827 4093 -1400 -3940 -8384 -8863 -35714 -34491 10828 5253 -26761 -44981 -32184 -4098 -2400 6619
4813 6619 27957 32276 7747 2941 26572 49772 55096 27815 28431 30864 1972 1047 -23348 -39193
4799 -39193 -8219 23614 5793 -7585 -25599 -41511 -40766 -32880 -47460 -56884 -9846 21620 24032
$$ packed form
4892B8300J259j1306l9189K1768J1766L1526j179j0972q027J6483P085j345j4116
4879C2053m9852r015K8433L0659J7890m696m4835j9251J0531L4057K3558K789
4867E2321k2612J26J53j0877J6381k9488j1954O030m66K348K267J6702l568q155
4853I208j0821m924J6451l1817k3756K5769K280L728k788j6614M219K4030j9167
4840b4202k0853J3378L8593K0061Q4j4579k1452j9226j1589J1103J5780l234K0229
4827D093n493k540m444m79k6851J223M5319n575l2014j8220J2797K8086J698R019
4813F619K1338M319k4529m806K3631K3200N324k7281O16K433k8892r25k4395j5845
4799c9193L0974L1833j7821j3378j8014j5912P45P886j4580r424M7038L1466K412
$$ plain form
4786 24032 24065 20622 12190 1557 26321 20781 -15630 -52958 -34075 -31760 -42261 -35447 -45514
4773 -45514 -24527 -4089 -5364 -14127 7326 -16532 -38227 -57835 -65816 -56617 -46014 -17724 -8242
4760 -8242 11175 15467 -13234 -1489 -8467 -12563 -10636 -17747 -28438 -51495 -44893 -8068 6893
4747 6893 24073 18563 29694 26420 -4083 -43688 -34505 -43708 -70073 -53045 -43087 -20649 -239
4734 -239 8918 1822 -1204 -29403 -49143 -20556 8135 14109 26285 28277 7891 -8564 -18901
4721 -18901 -16079 -11602 -17322 -30201 -38022 -26231 -28828 -41735 -26352 -25960 -32623 -23813 -36389 -59341
4707 -59341 -45622 6672 16509 334 -28877 -48238 -58315 -38037 -28872 -5227 20566 -6562
4695 -6562 -37953 -56707 -42338 -12913 -12094 -19631 1428 10418 2560 -11992 -34816 -49878 -42766
$$ packed form
4786B4032L3l443q432j0633K4764n540l6411l7328J8883K315j0501O814j0067
4773d5514K0987K0438j275q763K1453k3858k1695j9608p981R199J0603K8290R482
4760h242J9417M292k8701J1745o978m096J927p111j0691k3057O602L6825J4961
4747F893J7180n510J1131l274l0503l9605R183r203k6365J7028R958K2438K0410
4734b39R157p096l026k8199j9740K8587K8691N974J2176J992k0386j6455j0337
4721a8901K822M477n720j2879p821J1791k597j2907J5383L92o663Q810j2576k2952
4707e9341J3719N2294R837j6175k9211j9361j0077K0278R165K3645K5793k7128
4695f562l1391j8754J4369K9425Q19p537K1059Q990p858j4552k2824j5062P112
$$ plain form
4682 -42766 -39919 -24278 17100 22267 -11123 -30613 -12251 -26816 -17411 -3806 -13000 -21615 -25459
4669 -25459 -9379 3209 -17218 -23936 -32071 -34503 -15225 -8009 -20660 -24571 -8175 -2424 28617
4656 28617 37673 -9151 -34125 -41628 -26644 7380 30989 24153 2561 -22372 8635 41033
4644 41033 61357 44112 23360 -10785 -42242 -31605 -11564 -24035 -25020 -13956 5962 29333
4632 29333 29766 -4494 -30395 -42155 -43177 -20573 -15962 -30494 -28532 3460 1572 -50577 -59106
$$ packed form
4682d2766K847J5641M1378N167l3390j9490J8362j4565R405J3605r194q615l844
4669b5459J6080J2588k0427o718q135k432J9278P216j2651l911J6396N751L1041
4656B8617R056m6824k4974p503J4984L4024K3609o836k1592k4933L1007L2398
4644D1033K0324j7245k0752l4145l1457J0637K0041j2471r85J1064J9918K3371
4632B9333M33l4260k5901j1760j022K2604M611j4532J962L1992j888n2149q529
$$ [...]
##END NTUPLES=NMR SPECTRUM
##END=
