##TITLE=Analysis number 330308
Compound Code cc 10512
Project Code adrs
Chemist Name ugmt
##JCAMPDX= 6.0         $$ Bruker NMR JCAMP-DX V2.0
##DATA TYPE= NMR SPECTRUM
##DATA CLASS= NTUPLES
##ORIGIN= Bruker BioSpin GmbH
##OWNER= nmr
$$ XWIN-NMR		Version 3.5
$$ Thu Nov 15 09:42:41 2007 GMT Standard Time (UT+0h)  MAYBRIDGE\nmr@NMR_250MHZ
##.OBSERVE FREQUENCY= 250.131544655141
##.OBSERVE NUCLEUS= ^1H
##.ACQUISITION MODE= SIMULTANEOUS (DQD)
##.ACQUISITION SCHEME= undefined
##.AVERAGES= 16
##.DIGITISER RES= 18
##SPECTROMETER/DATA SYSTEM= dpx250
##.PULSE SEQUENCE= zg30
##.SOLVENT NAME= DMSO
##.SHIFT REFERENCE= (INTERNAL, DMSO, 0, 16.522)
##AUDIT TRAIL= $$ (NUMBER, WHEN, WHO, WHERE, WHAT)
$$ ##TITLE= Audit trail, XWIN-NMR		Version 3.5
$$ ##JCAMPDX= 5.01
$$ ##ORIGIN= Bruker BioSpin GmbH
$$ ##OWNER= nmr
$$ C:\u/data/dgb/nmr/ADRS/720/pdata/1/auditp.txt
$$ ##AUDIT TRAIL=  $$ (NUMBER, WHEN, WHO, WHERE, WHAT)
(   1,<2007-11-15 09:41:53.51 +000>,<MAYBRIDGE\nmr>,<NMR_250MHZ>,
      <created by zg, POWCHK disabled, PULCHK disabled
       configuration hash MD5:
       76 6E 9A 78 1E 09 19 81 EC 84 63 8F B0 6A 59 2D
       data hash MD5: 64K
       1E E8 92 A1 10 50 F8 34 F7 4B B6 CD 40 60 BC DB>)
(   2,<2007-11-15 09:42:16.72 +000>,<MAYBRIDGE\nmr>,<NMR_250MHZ>,
      <Start of raw data processing
       ef LB = 0.3 FT_mod = 6 PKNL = 1 SI = 32K 
       data hash MD5: 32K
       85 0C BC C8 C8 66 E1 5A 56 DD 01 B9 0C 09 4F 82>)
(   3,<2007-11-15 09:42:24.56 +000>,<MAYBRIDGE\nmr>,<NMR_250MHZ>,
      <apk 
       data hash MD5: 32K
       D9 BA B1 39 E3 A2 BA 38 7A 68 FF CA 24 3D E9 E7>)
(   4,<2007-11-15 09:42:25.98 +000>,<MAYBRIDGE\nmr>,<NMR_250MHZ>,
      <abs ABSG = 5 
       data hash MD5: 32K
       21 9E 13 63 25 BB E9 B6 A8 A4 6E 71 3C 84 69 F5>)
$$ ##END=
$$ 
$$ hash MD5
$$ EB 3A DA 3A 1B F8 C7 EE 91 25 05 D7 0A C5 A7 6E
##$RELAX= 
##$RELAX= 
##$RELAX= 
##$RELAX= 
##$RELAX= 
##$RELAX= 
##$RELAX= 
$$ Bruker specific parameters
$$ --------------------------
##$DU= <C:\u>
##$EXPNO= 720
##$NAME= <ADRS>
##$PROCNO= 1
##$TYPE= <nmr>
##$USER= <dgb>
##$AMP= (0..31)
100 100 100 100 100 100 100 100 100 100 100 100 100 100 100 100 100 100 
100 100 100 100 100 100 100 100 100 100 100 100 100 100 
##$AQSEQ= 0
##$AQ_mod= 3
##$AUNM= <au_zg>
##$AUTOPOS= <7 >
##$BF1= 250.13
##$BF2= 250.13
##$BF3= 250.13
##$BF4= 250.13
##$BF5= 500.13
##$BF6= 500.13
##$BF7= 500.13
##$BF8= 500.13
##$BYTORDA= 1
##$CFDGTYP= 0
##$CFRGTYP= 5
##$CHEMSTR= <none>
##$CNST= (0..31)
1 1 145 1 1 1 1 1 1 1 1 1 1 1 1 1 1 1 1 1 1 1 1 1 1 1 1 1 1 1 1 1 
##$CPDPRG= <>
##$CPDPRG1= <>
##$CPDPRG2= <>
##$CPDPRG3= <>
##$CPDPRG4= <mlev>
##$CPDPRG5= <mlev>
##$CPDPRG6= <mlev>
##$CPDPRG7= <mlev>
##$CPDPRG8= <mlev>
##$CPDPRGB= <>
##$CPDPRGT= <>
##$D= (0..31)
0 1 0 0 0 0 0 0 0 0.06 0 0 0 0 0 0 0.0002 0 0 0 0 0 0 0 0 0 0 0 0 0 0 
0 
##$DATE= 1195119710
##$DBL= (0..7)
120 120 120 120 120 120 120 120 
##$DBP= (0..7)
150 150 150 150 150 150 150 150 
##$DBP07= 0
##$DBPNAM0= <>
##$DBPNAM1= <>
##$DBPNAM2= <>
##$DBPNAM3= <>
$$ [...]
##$SUBNAM7= <"">
##$SUBNAM8= <"">
##$SUBNAM9= <"">
##$SW= 20.6930455092707
##$SWIBOX= (0..15)
0 0 3 0 0 0 0 0 0 0 0 0 0 0 0 0 
##$SW_h= 5175.983436853
##$TD= 65536
##$TD0= 1
##$TE= 294.16
##$TE2= 300
##$TE3= 300
##$TEG= 300
##$TL= (0..7)
0 120 120 120 120 120 120 120 
##$TP= (0..7)
150 150 150 150 150 150 150 150 
##$TP07= 0
##$TPNAME0= <>
##$TPNAME1= <>
##$TPNAME2= <>
##$TPNAME3= <>
##$TPNAME4= <>
##$TPNAME5= <>
##$TPNAME6= <>
##$TPNAME7= <>
##$TPOAL= (0..7)
0.5 0.5 0.5 0.5 0.5 0.5 0.5 0.5 
##$TPOFFS= (0..7)
0 0 0 0 0 0 0 0 
##$TUNHIN= 0
##$TUNHOUT= 0
##$TUNXOUT= 0
##$USERA1= <user>
##$USERA2= <user>
##$USERA3= <user>
##$USERA4= <user>
##$USERA5= <user>
##$V9= 5
##$VALIST= <valist>
##$VCLIST= <CCCCCCCCCCCCCCC>
##$VD= 0
##$VDLIST= <DDDDDDDDDDDDDDD>
##$VPLIST= <PPPPPPPPPPPPPPP>
##$VTLIST= <TTTTTTTTTTTTTTT>
##$WBST= 1024
##$WBSW= 4
##$XGAIN= (0..3)
0 0 0 0 
##$XL= 0
##$YL= 0
##$YMAX_a= 312393
##$YMIN_a= -648677
##$ZGOPTNS= <>
##$ZL1= 120
##$ZL2= 120
##$ZL3= 120
##$ZL4= 120
##$ABSF1= 16.522
##$ABSF2= -4.171173
##$ABSG= 5
##$ABSL= 3
##$ALPHA= 0
##$AQORDER= 0
##$ASSFAC= 0
##$ASSFACI= 0
##$ASSFACX= 0
##$ASSWID= 0
##$AUNMP= <proc_1d>
##$AZFE= 0.1
##$AZFW= 0.1
##$BCFW= 0
##$BC_mod= 0
##$BYTORDP= 0
##$COROFFS= 0
##$CY= 12.5
##$DATMOD= 1
##$DC= 0
##$DFILT= <>
##$DTYPP= 0
##$F1P= 14.0000005364418
##$F2P= -0.99999901652339
##$FCOR= 0.5
##$FTSIZE= 32768
##$FT_mod= 6
##$GAMMA= 0
##$GB= 0
##$INTBC= 1
##$INTSCL= 1
##$ISEN= 128
##$LB= 0.3
##$LEV0= 0
##$LPBIN= 0
##$MAXI= 10000
##$MC2= 0
##$MEAN= 0
##$ME_mod= 0
##$MI= 0
##$NCOEF= 0
##$NC_proc= -5
##$NLEV= 6
##$NOISF1= 0
##$NOISF2= 0
##$NSP= 0
##$NTH_PI= 0
##$NZP= 0
##$OFFSET= 16.522
##$PC= 1
##$PHC0= 82.09824
##$PHC1= 121.0598
##$PH_mod= 1
##$PKNL= yes
##$PPARMOD= 0
##$PSCAL= 4
##$PSIGN= 0
##$REVERSE= no
##$SF= 250.13
##$SI= 32768
##$SIGF1= 0
##$SIGF2= 0
##$SINO= 400
##$SIOLD= 32768
##$SREGLST= <1H.DMSO>
##$SSB= 0
##$STSI= 32768
##$STSR= 0
##$SW_p= 5175.98343685301
##$SYMM= 0
##$S_DEV= 0
##$TDeff= 65536
##$TDoff= 0
##$TI= <Analysis number 999999
Compound Code 99
Book Reference 9
Project Code 9>
##$TILT= no
##$TM1= 0
##$TM2= 0
##$TOPLEV= 0
##$USERP1= <user>
##$USERP2= <user>
##$USERP3= <user>
##$USERP4= <user>
##$USERP5= <user>
##$WDW= 1
##$XDIM= 32768
##$YMAX_p= 332188707
##$YMIN_p= -29774625
$$ End of Bruker specific parameters
$$ ---------------------------------
##NTUPLES= NMR SPECTRUM
##VAR_NAME=  FREQUENCY,     SPECTRUM/REAL,   SPECTRUM/IMAG
##SYMBOL=    X,             R,               I
##VAR_TYPE=  INDEPENDENT,   DEPENDENT,       DEPENDENT
##VAR_FORM=  AFFN,          ASDF,            ASDF
##VAR_DIM=   32768,         32768,           32768
##UNITS=     HZ,            ARBITRARY UNITS, ARBITRARY UNITS
##FACTOR=    0.157963299565203, 1,           1
##FIRST=     4132.6476996994, 0,             0
##LAST=      -1043.33573715361, 0,           0
##MIN=       -1043.33573715361, -29774625,   0
##MAX=       4132.6476996994, 332188707,     0
$$ Real data points
##PAGE= N=1
##DATA TABLE= (X++(R..R)), XYDATA
$$ [...]
##PAGE= N=2
##DATA TABLE= (X++(I..I)), XYDATA
26569 2075092 2139208 2085572 1922315 1832891 1906800 1978765 2063152 2089073 1975335 1812047 1791905
26558 1791905 1910683 1967547 2079696 2015400 1867736 1831819 1894250 1787481 1720266 1736979
26548 1736979 1761139 1781374 1772267 1866461 1892331 1940858 2035551 2036746 1995005 1918223 1891486 1936155
26536 1936155 2007298 2007036 1947568 1903551 1876920 1986933 2088279 2045017 1948696 1858889 1827966
26525 1827966 1877170 1855430 1849486 1954426 2059204 2021749 1965953 1975651 1997092 1992576 1964732
26514 1964732 1936404 1831193 1833011 1893046 1909955 1867215 1918008 1866095 1895939 2005585 2057335
26503 2057335 1976375 1875711 1931659 1970776 1922682 1933338 1986781 2104037 2099321 2071165 2036527
26492 2036527 2056954 2020951 1939072 1868534 1860561 1858522 1899094 1937180 1853137 1834901 1804002 1767240
26480 1767240 1843037 1948297 2050445 2100945 2038633 1973918 1954322 1925491 1839839 1883221 1872255
26469 1872255 1901032 2074321 2043846 1966301 1957414 1880549 1938021 1928495 1832920 1842279 1926229 1967294
26457 1967294 1983375 1975691 1986362 1983164 1962827 2063756 1985761 2014695 1979553 2009278 2110792
26446 2110792 2121954 2149702 2006816 1939142 1913055 2053784 2012801 1998392 1992575 1918948 1956437
26435 1956437 1971207 1956475 1954948 1912192 1986676 1974607 1931108 1857305 1953663 2080917 2093570
26424 2093570 2011501 1963576 2064908 2074307 1985828 1973957 2007047 1956710 2003882 2045975 2020700
26413 2020700 2011108 1986274 1934661 1928691 1942403 1871038 1792025 1713574 1769033 1810530 1898047 1939200
26401 1939200 1997650 1924672 1910462 1988287 2014497 2036640 2088476 2087745 2015565 2006874 2043254 2059095
26389 2059095 2026710 2061023 2085855 2123723 2115508 2069115 2012321 1957368 1894923 1900061 1831550 1947597
26377 1947597 1976462 1968393 2011919 2026916 2083759 2057715 2004509 1949778 2019463 1995560 1947937
26366 1947937 1928554 1919271 1923247 1929999 1911871 1953200 1903237 1889447 1944272 1990331 2006453 2039120
26354 2039120 2102270 2020959 1990310 2011976 1943629 1910661 1977813 1965854 1947995 1967512 1997043
26343 1997043 2063992 2043123 2094316 2120574 2062308 2044818 1998857 1976627 1994984 2084206 2160276
26332 2160276 2076396 2061614 2094432 2043355 1949374 1973371 2006496 2073482 2067845 2123744 2148733
26321 2148733 2090955 2065300 1960521 1895277 1885616 1852811 1794528 1809897 1956970 2038499 2002393
26310 2002393 2039378 1994586 1974866 1953988 1945973 2009267 1928855 1890514 1976929 2092025 2106890
26299 2106890 2088001 2073652 2002517 1884500 1795245 1865080 1923013 1949746 1967182 1954992 2030644
26288 2030644 2084597 2088061 2124089 2174731 2271234 2145049 2068886 2018912 1975175 2093834 2254341
26277 2254341 2184931 2063088 2006702 1906228 1948483 2053811 2123667 2014916 2017354 2005209 2048037
26266 2048037 2006046 1922218 1882281 1973625 2018840 1997990 1970462 1948660 2018978 2056769 2046663
26255 2046663 2021829 1964885 1977776 2014785 2063950 2000099 1933711 1952006 1968290 2006629 2003121
26244 2003121 1902274 1924298 1938849 1863234 1928791 1973398 1971448 1993057 2040054 1950978 1931069
26233 1931069 1938699 1910629 1935291 1903291 1904979 2083836 2168299 2112412 1999313 1982732 2073927
26222 2073927 2166426 2213365 2201480 2114539 2033299 1920707 1963139 2020663 2010828 2011216 2013607 2061205
26210 2061205 2078862 1999604 1960954 2016800 2046491 2015421 2017340 2010696 2020091 2009775 1982701 2061478
26198 2061478 2069923 2108722 2107647 2134043 2144525 2124076 2036846 2066650 2134762 2128900 2171991 2117132
26186 2117132 2101717 2138356 2135051 2090658 2068874 2073725 2003163 2027104 2093075 2049446 1995675 2032977
26174 2032977 2095959 2139832 2041732 1860795 1865876 1932156 1883919 1859356 1922347 1976800 2030401
26163 2030401 2076392 2110102 2049510 1999699 2049342 2088924 2065780 1967197 1974493 1976660 2065932 2174683
26151 2174683 2198512 2060478 1938949 1941664 1997180 2068839 2093324 2079773 2110457 2063144 2031055
26140 2031055 1921230 1915967 1953076 1986152 2074492 2143795 2163146 2139213 2125033 2175408 2211220
26129 2211220 2177145 2176481 2095042 2133596 2123267 2097636 2143567 2155902 2215500 2211796 2088289 2043945
26117 2043945 2108496 2131589 2179497 2162766 2069154 2038780 1973656 1948939 1900478 1977624 1923017
26106 1923017 1869324 1951949 2008282 2062360 2037253 2004587 2015918 2068323 2034194 2065014 2028663
26095 2028663 2007563 1980963 2010880 1971989 2019897 2007807 2045884 2004910 2026953 2137158 2121344
26084 2121344 2059051 2051683 2052305 2030007 2043997 1978934 1978999 1966733 1972893 2035616 2010537 1960803 1957913
26071 1957913 1947790 2028955 1994593 2050724 2032995 1979641 1900152 1908728 2004960 2016265 2079644
26060 2079644 2093116 2069028 2106557 2143788 2130976 2139113 2176355 2193455 2226920 2257379 2194927
26049 2194927 2121708 2102738 2162823 2065059 2054322 2152777 2195324 2164745 2158238 2154804 2111626 2154176
26037 2154176 2268230 2193675 2150811 2212364 2170860 2074571 2064451 2156820 2158483 2163241 2120160
26026 2120160 2080197 2199094 2265926 2312403 2297550 2216341 2120156 2123632 2119340 2131024 2111628
26015 2111628 2124213 2166635 2157646 2098567 2055540 2142199 2245466 2210286 2165178 2219961 2310580
26004 2310580 2256446 2159356 2185575 2210209 2199310 2223837 2209587 2104060 2064385 2076599 2036493
25993 2036493 1983418 2053840 2106367 2172989 2249988 2289527 2206594 2151684 2099976 2182248 2159845
25982 2159845 2186809 2138875 2166806 2217836 2151468 2143233 2150694 2134556 2188031 2173892 2120556 2171976
25970 2171976 2203200 2238992 2264594 2160811 2051361 2075705 2144088 2170743 2220888 2211654 2350946
25959 2350946 2466438 2372334 2284951 2180953 2031967 2001952 2119225 2168809 2172111 2199226 2140339
25948 2140339 2090491 2083624 2132349 2197517 2231987 2235036 2169020 2172509 2156245 2203979 2190932 2148944
25936 2148944 2121410 2177674 2234612 2292383 2314041 2305097 2362550 2319967 2251436 2172629 2139253
25925 2139253 2138888 2204352 2182380 2191956 2190458 2171236 2239086 2215526 2175419 2165338 2214682 2212860
25913 2212860 2215129 2215134 2125128 2037079 2116926 2078276 2104008 2178983 2092147 2069328 2090443 2167069
25901 2167069 2273309 2295356 2259002 2307819 2234201 2142526 2070896 2041559 2053390 2162194 2252596
25890 2252596 2285505 2287379 2241982 2256777 2296356 2274468 2207600 2132381 2123559 2147855 2034666
25879 2034666 2016818 2126671 2253809 2239016 2250439 2183887 2214340 2249787 2211637 2181628 2212693
25868 2212693 2207194 2184050 2170922 2167805 2124957 2038592 2052551 2140684 2190451 2254530 2193621 2131214
25856 2131214 2141611 2136555 2133708 2156434 2191028 2172943 2129003 2086246 2065123 2101369 2041876 2042217
25844 2042217 2061143 2064744 2098809 2198804 2224537 2207215 2293730 2324647 2291499 2236837 2135017
25833 2135017 2062594 2041716 2043889 2053319 2087350 2128990 2174138 2286320 2325521 2235855 2275015
25822 2275015 2190634 2160785 2122653 2089405 2083883 2154421 2158642 2239616 2252070 2172844 2105735 2184179
25810 2184179 2221356 2258069 2214892 2129551 2166058 2362609 2439945 2441084 2350507 2393173 2424826
25799 2424826 2344579 2250361 2170387 2137658 2134909 2239400 2234774 2251856 2312601 2327404 2297187
25788 2297187 2259642 2280170 2198004 2062336 2048472 2073413 2040218 2138401 2246568 2219216 2229306
25777 2229306 2309658 2349120 2319087 2296822 2248504 2273458 2274481 2315894 2315941 2253460 2193843 2222475
25765 2222475 2153181 2154091 2259251 2285374 2294996 2293303 2237064 2165063 2183106 2268557 2221266 2184293
25753 2184293 2244977 2312204 2300178 2171220 2150095 2188713 2177752 2205793 2299804 2377325 2437785
25742 2437785 2428431 2333002 2256542 2222873 2211926 2233798 2301444 2360526 2362402 2337746 2319493 2222139
25730 2222139 2138179 2189722 2245544 2229641 2257465 2271992 2235793 2340644 2291814 2265834 2283826
25719 2283826 2222840 2294425 2297270 2291938 2321736 2367139 2351970 2350215 2326323 2280688 2212070 2235105
25707 2235105 2265197 2286921 2365714 2352772 2403018 2420385 2315937 2310207 2408435 2434614 2260880
25696 2260880 2186798 2230510 2259468 2249827 2258304 2175977 2139833 2171321 2201003 2255661 2218338 2145735
25684 2145735 2108337 2205718 2271891 2291354 2234864 2258420 2268390 2248658 2218098 2227973 2300045 2381205
25672 2381205 2438573 2461087 2383253 2364715 2398690 2421928 2375958 2331242 2341735 2317631 2240618
25661 2240618 2238441 2180123 2250259 2340288 2272558 2143206 2119082 2085912 2208140 2263877 2248057
25650 2248057 2293519 2319729 2303535 2328529 2332387 2396677 2308364 2241667 2269137 2365539 2321502
25639 2321502 2228258 2178456 2235337 2180096 2200262 2239124 2277722 2243446 2164077 2223943 2228263
25628 2228263 2235671 2202966 2255723 2332617 2377197 2333755 2335089 2377994 2381819 2367826 2291022 2310813
25616 2310813 2282056 2266247 2284166 2344617 2355298 2397863 2354513 2272735 2311856 2345586 2348682
25605 2348682 2281092 2168477 2083261 2213107 2371944 2319649 2260230 2233942 2266180 2236844 2205505
25594 2205505 2174756 2189578 2193406 2258448 2274987 2321602 2367092 2355756 2376628 2339739 2348392 2415027
25582 2415027 2474867 2478101 2423080 2315398 2327283 2387852 2465005 2486647 2353954 2266164 2271607
25571 2271607 2395085 2374440 2277985 2353633 2320210 2259968 2205677 2207840 2304860 2315089 2358713
25560 2358713 2284165 2290958 2291952 2236739 2177104 2223576 2302265 2282788 2308034 2404201 2439348 2373793
25548 2373793 2362878 2358226 2341222 2291407 2297448 2245444 2313698 2306000 2346471 2459520 2407850 2418455
25536 2418455 2449788 2449118 2425221 2370183 2328329 2357096 2390710 2377713 2349410 2379189 2299689 2321059
25524 2321059 2311221 2314340 2286177 2281621 2237670 2244646 2356472 2304877 2266473 2277064 2285429 2333819
25512 2333819 2358997 2387449 2342283 2331368 2432863 2533271 2506279 2445418 2462440 2496000 2408105
25501 2408105 2357419 2317503 2303850 2316375 2307990 2381070 2438120 2360304 2305160 2317503 2333107
25490 2333107 2269255 2298607 2348997 2442966 2504008 2460169 2359833 2428697 2453081 2450322 2454222
25479 2454222 2464149 2432350 2399713 2401324 2373643 2400492 2451405 2555842 2603857 2599093 2506710 2438847
25467 2438847 2467707 2473293 2469540 2523799 2440221 2516763 2518270 2393482 2456466 2427606 2414843 2419898
25455 2419898 2460704 2535462 2596993 2582741 2597448 2611932 2609509 2523499 2440631 2354995 2450948
25444 2450948 2472447 2424126 2477265 2422807 2359952 2422963 2544912 2580990 2540433 2484512 2375043
25433 2375043 2286884 2355103 2401183 2415242 2410247 2461716 2422825 2399612 2371288 2303431 2328507
25422 2328507 2322380 2336240 2387797 2435138 2562140 2572452 2554252 2548407 2537431 2500381 2466804
25411 2466804 2406828 2405070 2296668 2223548 2304210 2396977 2417930 2432261 2433317 2360586 2277263
25400 2277263 2283982 2295149 2372694 2422621 2389639 2282816 2260257 2266419 2285749 2430315 2423554
25389 2423554 2424752 2463390 2460525 2399058 2383396 2397146 2425134 2418766 2358266 2336627 2385625 2470129
25377 2470129 2420771 2392144 2370625 2433522 2450126 2440924 2399772 2370169 2321528 2292293 2387008
25366 2387008 2425898 2314608 2285728 2277258 2222105 2212638 2287313 2406902 2481562 2506584 2484785
25355 2484785 2413968 2442083 2437771 2409943 2413738 2412064 2397433 2381907 2381984 2448909 2468212 2423596
25343 2423596 2339296 2267866 2321149 2416679 2497411 2563513 2524224 2464391 2456279 2460368 2499601 2475996
25331 2475996 2496816 2536187 2506750 2484747 2385669 2367187 2421982 2346690 2339326 2329072 2395660
25320 2395660 2427341 2503040 2488715 2515553 2510579 2516959 2406192 2358311 2367988 2377221 2374254 2425147
25308 2425147 2481739 2417615 2498897 2542105 2518975 2436292 2399197 2425163 2518942 2496489 2474962
25297 2474962 2430291 2368731 2380821 2348362 2378800 2430700 2478131 2400326 2343510 2352895 2340741
25286 2340741 2295261 2252587 2197504 2286859 2387890 2470645 2522242 2523228 2525808 2508912 2448555 2389914
25274 2389914 2446474 2503551 2507203 2387931 2265594 2303717 2356555 2415443 2441559 2444936 2393792
25263 2393792 2309135 2466997 2548913 2575653 2481648 2492573 2433445 2379975 2443396 2576474 2614100
25252 2614100 2619153 2550072 2408256 2442792 2538520 2526512 2550833 2550258 2461084 2479531 2487941 2436493
25240 2436493 2426884 2429480 2415074 2422683 2458844 2483201 2486418 2509619 2487092 2483714 2431407 2351993
25228 2351993 2428467 2513534 2572876 2643108 2694963 2628011 2595658 2540945 2464290 2500219 2482542
25217 2482542 2389241 2372097 2446731 2494122 2509872 2571531 2666928 2646503 2651209 2645966 2624934 2574627
25205 2574627 2552694 2584816 2626987 2526193 2504492 2533852 2431173 2360108 2381946 2406720 2451186
25194 2451186 2451986 2518382 2533116 2460665 2524662 2481480 2354538 2264849 2323266 2417758 2494529
25183 2494529 2563078 2547178 2521269 2509293 2575788 2557465 2579874 2587360 2599978 2596358 2560433 2467318
25171 2467318 2390167 2433646 2511646 2562116 2634157 2599123 2631152 2562784 2531754 2510390 2536831
25160 2536831 2591122 2632169 2667412 2560498 2619799 2586566 2532052 2592275 2618108 2557858 2608208
25149 2608208 2577274 2477491 2514067 2508815 2428733 2450875 2425461 2358473 2346142 2399201 2443120
25138 2443120 2423028 2418815 2375334 2396007 2485691 2533157 2570584 2565668 2524122 2536229 2591840 2582569
25126 2582569 2512956 2501213 2512153 2518181 2535804 2571183 2602809 2585568 2622609 2694795 2629784
25115 2629784 2635994 2635835 2622912 2617424 2611627 2694703 2704697 2696511 2688771 2659597 2698658 2710696 2720984
25102 2720984 2622401 2558002 2477623 2410936 2471479 2640493 2695336 2656853 2600079 2636382 2578350
25091 2578350 2565987 2562811 2565251 2618670 2627934 2655483 2748090 2646768 2627275 2649882 2555192 2530331
25079 2530331 2544423 2616050 2711946 2765656 2670237 2611844 2557464 2557156 2523765 2598513 2642035 2671150
25067 2671150 2580765 2575094 2561552 2576817 2646647 2623404 2681130 2631294 2546113 2595150 2679717
25056 2679717 2677531 2694951 2693748 2688621 2700403 2705032 2662243 2566714 2657411 2623180 2531313 2473030
25044 2473030 2539630 2647473 2651434 2756824 2775997 2756946 2702409 2578886 2558043 2621336 2580347
25033 2580347 2537595 2556078 2591883 2557061 2577391 2663380 2708530 2748856 2759140 2797683 2708936
25022 2708936 2676770 2660748 2664615 2635473 2580307 2508081 2512514 2591109 2667380 2682098 2555552
25011 2555552 2598214 2594531 2645718 2559725 2510638 2542883 2581416 2592609 2567832 2597177 2575238
25000 2575238 2511271 2473601 2469782 2630882 2721036 2671844 2686219 2674177 2616160 2657895 2635842
24989 2635842 2538043 2583464 2660882 2749217 2712370 2602946 2536223 2533941 2616736 2612452 2647919
24978 2647919 2584950 2559167 2589871 2587949 2664972 2707766 2670521 2693617 2702494 2662053 2628592 2557180
24966 2557180 2511643 2549951 2477520 2566687 2662302 2645957 2660352 2658492 2649787 2650077 2610872 2684772
24954 2684772 2724483 2660580 2645466 2565736 2595477 2739447 2687804 2670798 2749691 2749146 2752945 2735178
24942 2735178 2756242 2761348 2833847 2849715 2775776 2709978 2754369 2779644 2799339 2820862 2808614
24931 2808614 2817406 2793812 2695614 2709511 2718387 2688044 2745996 2796357 2787707 2740942 2710810 2651165
24919 2651165 2517510 2566540 2698791 2840529 2829876 2821671 2811683 2805780 2757042 2741574 2752944
24908 2752944 2808406 2682069 2542278 2582487 2649338 2709434 2683184 2613309 2706213 2779368 2767724
24897 2767724 2846419 2754011 2647624 2601511 2619326 2669047 2713369 2690829 2729865 2762544 2736390
24886 2736390 2727808 2753848 2763429 2704044 2683507 2728247 2720981 2713398 2718869 2729980 2668928 2680871
24874 2680871 2669675 2703964 2719954 2733795 2709016 2743218 2682719 2628570 2569597 2584432 2668602
24863 2668602 2792530 2803725 2638618 2602545 2668702 2703121 2723252 2791149 2769126 2770820 2799602
24852 2799602 2746104 2736149 2706631 2697629 2622435 2578805 2658803 2609500 2621008 2655474 2693844 2674507
24840 2674507 2617579 2594051 2540490 2581700 2592852 2554188 2648362 2734234 2621305 2595348 2718734
24829 2718734 2721459 2757958 2807683 2799545 2789359 2890389 2955164 2891830 2848234 2820605 2743262
24818 2743262 2677338 2589764 2565490 2509571 2547867 2570148 2584388 2687354 2735966 2670239 2636488
24807 2636488 2640523 2668227 2678593 2626263 2709182 2745969 2774979 2787106 2694710 2600345 2699249
24796 2699249 2723015 2713656 2750513 2804556 2758131 2650327 2636521 2542392 2513699 2572157 2635315
24785 2635315 2712354 2634091 2588473 2657248 2745117 2727991 2726747 2756298 2770638 2752723 2747158 2788954
24773 2788954 2747235 2749849 2719150 2794490 2855743 2797991 2720885 2742778 2773090 2816086 2898915
24762 2898915 2864574 2814550 2741332 2711479 2678883 2639496 2608851 2595395 2684427 2746162 2789206
24751 2789206 2831132 2975934 2931264 2775459 2845419 2875388 2795279 2763561 2830827 2893780 2866693
24740 2866693 2797798 2706823 2663013 2670515 2670858 2716873 2765191 2849001 2855873 2795368 2687942 2702499
24728 2702499 2799644 2873133 2793200 2861794 2869185 2747314 2664495 2694362 2827593 2880548 2902644
24717 2902644 2917104 2938669 2963420 2949694 2889899 2892477 2977475 3043104 2989297 2980840 3013091 2889190
24705 2889190 2788056 2706978 2670503 2774305 2783307 2732433 2693569 2766419 2874460 2901652 2891193
24694 2891193 2894314 2941612 2886437 2780205 2730390 2740432 2804644 2880416 2870075 2786951 2772843
24683 2772843 2755635 2788388 2812744 2801360 2837746 2835273 2810847 2775890 2752894 2767063 2812994
24672 2812994 2862969 2818939 2750357 2748092 2769770 2768785 2804668 2834472 2761255 2725208 2645604 2675714
24660 2675714 2684759 2659654 2809031 2931284 2958769 3027504 3074454 3095135 3036793 3031872 2898417
24649 2898417 2801237 2828724 2867731 2788627 2762550 2773306 2789930 2901907 2979802 3002266 2973093
24638 2973093 2910228 2934915 2957985 2890633 2757557 2750099 2685803 2572151 2616832 2799596 2841889
24627 2841889 2850269 2893213 2951041 2868917 2773971 2815539 2898413 2932584 2869876 2841520 2800079
24616 2800079 2840577 2867406 2854232 2861870 2846065 2812408 2755195 2779053 2803012 2822091 2736205
24605 2736205 2813042 2911780 2854574 2851662 2825617 2861525 2945924 2985502 2957317 2900977 2867040
24594 2867040 2819688 2634287 2525707 2568143 2692622 2839944 2865156 2827969 2771300 2729647
24584 2729647 2768841 2858872 2824083 2717922 2772883 2770958 2868930 2942492 2927085 2946258 2901578
24573 2901578 2860602 2875637 2979635 2987001 2940034 2791660 2861042 2889594 2786377 2750916 2731744
24562 2731744 2802477 2938971 2963252 2869584 2903930 2853931 2870317 2960216 2878282 2841970 2837869
24551 2837869 2868066 2926861 2846573 2741140 2690113 2675516 2713541 2732361 2863377 2950655 2926917
24540 2926917 2943494 2893430 2901284 2861270 2808134 2836323 2757513 2746347 2793695 2890694 2947281
24529 2947281 2901347 2922191 2927800 2891958 2886872 2915845 2889815 2955266 3009435 2944521 2842897
24518 2842897 2818114 2969184 3003209 2968228 3025474 2988071 2975943 2867341 2803249 2838482 2833128
24507 2833128 2871282 2916477 2945223 2999558 2985350 2911397 2796694 2830563 2915015 2869622 2816816
24496 2816816 2903118 2977758 2937259 2934033 2939703 2883762 2874074 2843988 2899957 2889789 2849562 2902089
24484 2902089 2950138 2982508 3017344 3056804 3006170 3003152 2965619 2920661 2940719 2936035 2907173 2874070
24472 2874070 2851946 2863168 2914969 2825554 2817049 2949005 2960607 2875056 2868313 2996384 3137299
24461 3137299 3061648 2933526 2938069 2878036 2843804 2862420 2879825 2788717 2642391 2629104 2776328
24450 2776328 2809347 2860428 2930647 3002158 3035825 3024143 2994591 2960196 2915145 2926656 3010203
24439 3010203 3079079 3082005 3149419 3037908 3003039 3036865 3004012 2973797 2894488 2851397 2913105
24428 2913105 2912864 2905961 2915747 2859565 2899450 3050685 3023576 2906913 2893482 2900229 2932262 2964803
24416 2964803 3032721 3097672 3061532 2996692 2944325 2982115 3060947 3133593 3051595 2900024 2825022
24405 2825022 2824350 2908229 2927790 2920434 2961381 3003966 3006842 3099565 3080307 3011620 2931869 2913426
24393 2913426 2948553 3112581 3170714 3145105 3080430 2961121 2908392 2825248 2810262 2864949 2976607
24382 2976607 2953751 3017457 2988086 2924500 2929220 2940939 2984028 2960083 2938175 2903193 2942681
24371 2942681 3015406 3074442 3163698 3170237 3174455 3158763 3081338 3056619 3067195 3056438 2996733 3016604
24359 3016604 2996453 2977202 3072063 3082891 3075136 3102070 3140972 3155661 3202911 3211513 3146524 3094075
24347 3094075 3094498 3112980 3110142 3002858 2877043 2902726 2973000 2984535 2887124 2928945 3034466
24336 3034466 3131940 3135207 3090007 3081986 3042714 2995696 3000313 3028315 3083297 3143490 3086547 3112601
24324 3112601 3172004 3219181 3204094 3116714 3105944 3059800 3090525 3064865 3003541 3039814 2986151
24313 2986151 2954394 3028944 3118951 3204668 3257078 3214713 3101980 3019817 3047055 3149361 3103459
24302 3103459 2951594 2998209 3056449 3042546 3044143 3034967 2990620 3033812 3164789 3081728 3072512
24291 3072512 3015133 3032051 3092720 3064708 3009101 2999472 3067088 3070021 3075208 3071364 3157582 3249193
24279 3249193 3219439 3136043 3069696 3087148 3061321 3012471 2956981 2978160 2957242 2904583 3044584
24268 3044584 3154277 3144766 3086509 3048375 3025911 3074313 3032977 2976983 3022385 2981206 3012166
24257 3012166 2966161 2861543 2860989 2980134 3064192 3048730 2946549 3007154 3120563 3193401 3137547
24246 3137547 3114269 3158326 3188023 3135625 3188823 3179793 3140072 3060583 3062313 3104759 3111844 3090721
24234 3090721 3038867 3058963 3091970 3095724 3193714 3280372 3196374 3118164 3027879 3048906 3101151
24223 3101151 3143641 3213887 3248016 3129463 3096696 3160336 3205362 3198758 3241298 3248518 3164930
24212 3164930 3178885 3174978 3139138 3054156 3017992 3043705 3138712 3157199 3128432 3133454 3192844 3190830
24200 3190830 3137456 3172385 3103869 3137300 3178762 3217808 3213804 3130804 3279487 3383291 3260206
24189 3260206 3161109 3158243 3223203 3179037 3109243 3143906 3155357 3129548 3141951 3090378 3057555
24178 3057555 3147719 3104760 3057203 3078376 3164706 3225514 3213643 3180800 3168987 3155244 3139925
24167 3139925 3033542 3072095 3141643 3046729 3062954 3111525 3102480 3112572 3155171 3086730 3038888
24156 3038888 3092103 3168794 3216202 3188666 3164844 3203334 3264273 3277446 3221427 3203588 3243712
24145 3243712 3324127 3276840 3226606 3271447 3331817 3331672 3325189 3281838 3188649 3124194 3226767 3172394
24133 3172394 3144225 3225794 3248610 3377377 3337847 3280495 3338112 3335329 3299538 3322941 3250455
24122 3250455 3191380 3159186 3221152 3238453 3258691 3227221 3153151 3204276 3168100 3146454 3161830
24111 3161830 3194171 3255870 3204994 3247265 3284598 3282747 3256276 3239322 3187617 3207021 3114737
24100 3114737 3022343 2977924 3009880 3148627 3204454 3262849 3268153 3312673 3379835 3329460 3185611
24089 3185611 3195809 3215287 3220876 3156862 3208458 3205784 3200760 3264650 3329279 3361159 3329499 3293080
24077 3293080 3281731 3325378 3246045 3188732 3240373 3293604 3270510 3275488 3321003 3307723 3226499
24066 3226499 3175316 3181348 3229135 3312470 3325021 3323194 3357232 3396777 3310902 3309961 3375752 3391970
24054 3391970 3415336 3306085 3307447 3407758 3485663 3480107 3420241 3390009 3260609 3227554 3302303
24043 3302303 3312690 3153379 3083730 3089452 3116083 3191972 3283148 3271057 3278537 3225495 3151636
24032 3151636 3099621 3121715 3147114 3188817 3242741 3214542 3149415 3123872 3141766 3203354 3252059
24021 3252059 3347565 3390988 3319105 3260116 3300144 3273756 3264525 3144500 3138145 3224731 3216871 3129687
24009 3129687 3122676 3225641 3232791 3223614 3321453 3260863 3153416 3224041 3367585 3373107 3375794 3361708
23997 3361708 3354486 3302798 3230479 3223639 3213983 3337806 3406482 3317605 3176985 3158213 3180797
23986 3180797 3212575 3242232 3225107 3287392 3361645 3304830 3238884 3221724 3232984 3152895 3208785
23975 3208785 3319003 3293711 3233886 3198015 3263381 3276967 3309630 3265861 3298941 3299301 3326905
23964 3326905 3339430 3291599 3276116 3284284 3242761 3286948 3203461 3141126 3145803 3131814 3068011 3226080
23952 3226080 3309849 3336625 3325921 3274506 3359611 3372689 3237654 3264530 3320955 3295003 3291213
23941 3291213 3384877 3466104 3513027 3505174 3454611 3450636 3474636 3388334 3433921 3418849 3357147 3404217
23929 3404217 3385245 3384408 3429222 3413355 3380110 3403317 3396412 3440167 3463831 3471312 3374344 3361140
23917 3361140 3375980 3338776 3234372 3289679 3359978 3263257 3209962 3302163 3331746 3356612 3499349
23906 3499349 3576676 3501626 3422416 3353826 3338734 3252558 3303497 3378905 3380042 3351369 3328524
23895 3328524 3356350 3363432 3436131 3448894 3422185 3354412 3387080 3275737 3262803 3227240 3253800
23884 3253800 3443782 3598390 3523767 3511362 3445335 3373100 3416037 3407107 3386889 3386036 3438579
23873 3438579 3420251 3474460 3498794 3407718 3415042 3509728 3353161 3330582 3285579 3231934 3352568
23862 3352568 3452787 3468259 3459397 3430177 3425188 3382117 3335970 3307210 3304151 3363952 3386593 3311889
23850 3311889 3292173 3339165 3362105 3486978 3564113 3598947 3657702 3540277 3495834 3446055 3372299
23839 3372299 3345899 3419245 3531412 3546162 3442511 3448117 3506855 3482256 3504912 3493920 3479776
23828 3479776 3457965 3420291 3438296 3444002 3484603 3432405 3409355 3329563 3364923 3401053 3367082
23817 3367082 3325049 3408529 3441197 3522063 3395931 3372019 3403181 3306256 3334744 3412573 3426101
23806 3426101 3401171 3378882 3385910 3380307 3337485 3348772 3396844 3336696 3263061 3266215 3318909 3358967
23794 3358967 3372152 3286334 3355271 3374778 3356271 3360694 3317115 3332785 3477589 3493256 3407346
23783 3407346 3435662 3497755 3513166 3503690 3488050 3511908 3539912 3529296 3542061 3572820 3571408 3443351
23771 3443351 3386169 3446333 3528767 3516117 3522283 3509823 3532142 3562638 3510433 3440259 3392593
23760 3392593 3352349 3455348 3555235 3656645 3715580 3627445 3681632 3644380 3632470 3537249 3467536
23749 3467536 3558491 3575618 3553313 3551800 3572891 3541777 3549787 3484916 3402077 3515505 3542983
23738 3542983 3427305 3412579 3543857 3544427 3462852 3414764 3360303 3358941 3405482 3375689 3516474
23727 3516474 3605047 3563862 3565858 3478476 3459788 3484299 3535398 3511506 3504817 3502839 3404366 3404170
23715 3404170 3469123 3442445 3435533 3374369 3325895 3345856 3401731 3565863 3560906 3509136 3446045
23704 3446045 3393687 3459626 3418788 3425868 3421620 3383558 3410538 3460074 3469083 3454490 3433974 3431011
23692 3431011 3407007 3422246 3426530 3328593 3403133 3514130 3581715 3677725 3591098 3445345 3409956
23681 3409956 3434791 3484065 3396964 3328829 3459534 3613738 3670506 3751008 3733457 3635437 3613882
23670 3613882 3636843 3596721 3547469 3493409 3417316 3383986 3438466 3487319 3447885 3409039 3522446
23659 3522446 3665667 3673184 3645935 3629189 3554231 3596434 3645373 3578445 3514384 3503471 3500376
23648 3500376 3501330 3589259 3626942 3588881 3623538 3688675 3605362 3520484 3562561 3674008 3651891
23637 3651891 3607433 3536380 3448159 3457492 3524976 3573910 3478497 3473380 3581880 3583944 3563455 3459278
23625 3459278 3427505 3501035 3490601 3457034 3483761 3508601 3527237 3494005 3500902 3488965 3482209 3508027
23613 3508027 3638454 3659370 3653049 3550392 3587185 3649510 3658666 3658095 3602121 3621864 3723962
23602 3723962 3750374 3761322 3716592 3623012 3633748 3661497 3479991 3398447 3431274 3422855 3511139
23591 3511139 3551197 3521804 3430921 3438927 3524877 3488201 3546414 3550133 3569756 3669140 3729287 3712592
23579 3712592 3607972 3585210 3581806 3674876 3712461 3683958 3644100 3642983 3761091 3763938 3653831
23568 3653831 3532669 3555161 3485124 3536378 3633176 3707316 3655098 3675534 3753233 3766273 3699206
23557 3699206 3602030 3514719 3439909 3482496 3515474 3654904 3701808 3656526 3631230 3719668 3751524
23546 3751524 3751496 3730800 3754892 3812780 3832303 3727374 3719385 3697977 3680882 3820194 3863540 3797876
23534 3797876 3763005 3807072 3697121 3768449 3761672 3608462 3567831 3626879 3692088 3635451 3594581
23523 3594581 3587063 3603975 3663797 3663758 3716418 3720805 3733385 3711190 3645207 3685889 3609784 3549097
23511 3549097 3579634 3570207 3581997 3633164 3636078 3592030 3527310 3596630 3658092 3647042 3713632 3674739
23499 3674739 3540235 3557024 3598608 3654073 3658017 3644287 3814979 3838342 3682242 3568542 3600484
23488 3600484 3601946 3648936 3689474 3746251 3768330 3725706 3671235 3684234 3678631 3596538 3531895 3587402
23476 3587402 3677611 3763031 3706383 3574582 3533939 3618225 3738183 3812098 3803620 3816162 3845603
23465 3845603 3883597 3874774 3928448 3873114 3868990 3803470 3769357 3830202 3941853 3893283 3767893
23454 3767893 3739780 3784391 3765792 3692361 3720739 3786821 3657232 3676729 3744716 3702472 3694964
23443 3694964 3686261 3618079 3629583 3737405 3767536 3746286 3792198 3805285 3791577 3804096 3754446
23432 3754446 3671748 3692976 3784581 3861494 3883688 3846524 3754207 3648054 3627617 3597651 3580044
23421 3580044 3559015 3628798 3697078 3631066 3733352 3859398 3825950 3815844 3775722 3726791 3731395
23410 3731395 3752365 3813098 3857191 3899011 3855414 3722841 3609963 3607554 3612855 3593834 3599984
23399 3599984 3615292 3586145 3640850 3693088 3733685 3783686 3829991 3756633 3701673 3756208 3737125
23388 3737125 3687942 3750982 3788582 3711810 3644807 3708627 3686040 3760506 3821278 3854831 3892718
23377 3892718 3940155 3881847 3842348 3806631 3839669 3810260 3810035 3720338 3642876 3681529 3682965 3643247
23365 3643247 3708300 3753989 3667220 3702915 3825559 3878099 3932876 3858805 3764715 3756194 3805122
23354 3805122 3846283 3845108 3938216 3965968 3911422 3884744 3955972 3882581 3936363 3927961 3912764 3937219
23342 3937219 3917967 3899811 3852117 3768829 3872878 3916673 3947782 3940161 3940184 3923771 3919539 3952821
23330 3952821 3923196 3884955 3881976 3937870 3893929 3827454 3881241 3869754 3927636 3879827 3909023
23319 3909023 4022031 4125002 4136697 4041943 3923853 3882872 3909041 3920128 3824749 3832186 3903488
23308 3903488 3963572 3954977 3984813 3932519 3922674 3983613 4001762 4017073 4006670 3947246 3934920 4036582
23296 4036582 4024480 3944022 3987694 4016788 3844858 3709986 3745992 3819957 3838062 3776855 3789800
23285 3789800 3874342 3871790 3833085 3784001 3780407 3858288 3955249 3915885 3863804 3909729 3941933 4039413
23273 4039413 4039485 4001282 3909510 3790763 3814091 3910331 3871369 3861298 3886434 3927778 3899610 3906987
23261 3906987 3871804 3858838 3928540 3995607 3970006 3944403 3826712 3805228 3793474 3801247 3785792
23250 3785792 3827562 3902678 3960541 3975324 3985990 3958819 3971870 3999556 3961606 4020353 4009825
23239 4009825 3958819 4030323 3979804 3937606 3993025 3960824 3998147 3958047 3907678 3870198 3933972
23228 3933972 3989546 3955539 3904006 3943908 3940100 3904301 3917667 3938013 3910927 4008320 4071934
23217 4071934 4024026 4025644 4052352 4038114 3965952 3877303 3906227 4001394 4065224 4074324 4076932 4010187
23205 4010187 3978626 3961386 3982865 4036993 4158435 4059728 4043077 3976670 3878666 3831887 3908124
23194 3908124 3988148 4029527 3949540 3900038 3861742 3782715 3849918 3893489 3874359 4021939 4044637
23183 4044637 3931835 3934120 4001025 4078739 4121140 4100082 4037849 4091037 4049847 4021945 4070006
23172 4070006 4132788 4076638 4135538 4183672 4133809 4080878 4018426 4131359 4118344 4019190 4066362
23161 4066362 4115692 4103204 3963455 3946556 3865180 3848687 3867204 3930256 4002717 4139147 4165085
23150 4165085 4193375 4280014 4262016 4197260 4056786 4075326 4084865 4026886 4001919 4030974 4035901
23139 4035901 4119259 4138961 4046835 3969650 3951794 3928970 3940380 3821178 3846196 4016113 4067267
23128 4067267 3960486 3852984 3850934 3985998 4117240 4083574 4081440 4004202 4008100 4011048 4012488
23117 4012488 4027720 4085259 4064606 3993910 3975727 4029323 4024435 4068963 4140133 4213078 4181079
23106 4181079 4093109 4015261 3908888 3990440 4067377 4088667 4101651 4043928 4008815 4026785 4047333
23095 4047333 4010158 4051118 4074825 4094788 4161077 4196331 4199924 4082905 4098940 4172785 4159384
23084 4159384 4102897 4026358 4020117 4111168 4152898 4132179 4034858 3965719 3955694 3956016 4004434 4024965
23072 4024965 4090415 4141259 4131932 4123817 4150257 4103879 4071857 4059785 4125925 4232288 4268699
23061 4268699 4231618 4191062 4247271 4195884 4131634 4130332 4126252 4148028 4318692 4328408 4244231 4249499
23049 4249499 4305204 4276328 4217769 4203385 4244042 4295307 4248417 4332225 4330053 4333951 4272109 4251244
23037 4251244 4199161 4137492 4149258 4161248 4171894 4231972 4253290 4319736 4307811 4308201 4338657 4364718
23025 4364718 4299846 4236675 4158119 4119522 4148805 4110523 4080583 4055833 4049285 4083001 4095566
23014 4095566 4079504 4114651 4100084 4062711 4059128 4139658 4163638 4160966 4157277 4255319 4243591 4199699
23002 4199699 4194893 4080264 4022485 4104827 4196927 4193928 4193334 4206211 4183427 4090690 4037909 3975184
22990 3975184 4000602 4082134 4168078 4248769 4201992 4155912 4127501 4142725 4204577 4259012 4326561
22979 4326561 4262083 4154414 4179276 4175718 4159079 4118933 4147746 4236805 4282304 4303256 4289895
22968 4289895 4188021 4142095 4218913 4364428 4472019 4481298 4376724 4294106 4242481 4270247 4327508
22957 4327508 4341243 4386744 4317373 4256398 4242890 4189700 4057585 4182168 4304559 4297230 4296324
22946 4296324 4293074 4293229 4333119 4256280 4133348 4149634 4165605 4194597 4167725 4184771 4161546 4121331
22934 4121331 4198806 4219586 4317486 4364402 4332136 4325659 4382311 4411381 4295489 4203421 4247047
22923 4247047 4327849 4335582 4450535 4518632 4450990 4374705 4354969 4427538 4473342 4451782 4430929
22912 4430929 4327609 4317986 4322460 4325481 4273972 4257599 4328798 4306194 4312787 4383316 4409624 4427678
22900 4427678 4314691 4307967 4411116 4467409 4555016 4483206 4458346 4432018 4381010 4353981 4340029
22889 4340029 4379516 4352825 4325559 4220831 4133745 4191700 4237982 4276803 4313863 4252683 4246687
22878 4246687 4317619 4348594 4365545 4371062 4475430 4460636 4432103 4464950 4472494 4371331 4358566
22867 4358566 4458492 4422146 4397798 4437068 4454639 4466140 4631593 4665130 4621753 4466471 4394629
22856 4394629 4466896 4521975 4494359 4464400 4526983 4445054 4460259 4389701 4353906 4480886 4437816
22845 4437816 4320723 4306214 4367486 4330064 4282059 4307148 4337856 4411584 4409697 4452887 4429243
22834 4429243 4410171 4406503 4390246 4419471 4532268 4483025 4464653 4445965 4422551 4352881 4302715
22823 4302715 4278721 4369206 4486136 4480151 4460527 4444549 4428361 4399880 4438691 4464329 4518132
22812 4518132 4471597 4355148 4301917 4319768 4288350 4245480 4232879 4324693 4349923 4367798 4394065
22801 4394065 4309762 4323926 4403886 4472694 4448208 4434822 4468310 4444036 4494228 4477621 4493649
22790 4493649 4469763 4443591 4514256 4550010 4460403 4456024 4503327 4504739 4470764 4517339 4512611 4504041
22778 4504041 4539867 4584158 4605907 4609274 4556837 4531441 4486013 4501856 4557995 4588586 4524246
22767 4524246 4502023 4542657 4516046 4505109 4442441 4437490 4516630 4544007 4398440 4288850 4336683
22756 4336683 4376844 4471500 4491613 4488896 4381506 4380864 4407542 4441248 4480538 4445309 4497211 4477644
22744 4477644 4463861 4455261 4517331 4549420 4619646 4606140 4557001 4602373 4534700 4640743 4731488
22733 4731488 4651017 4657982 4700214 4687615 4644411 4611305 4638946 4610879 4537570 4524876 4577152
22722 4577152 4540753 4533557 4597196 4628149 4647937 4649183 4568346 4510835 4481024 4381907 4331320 4419581
22710 4419581 4496330 4455809 4473274 4502647 4554323 4529882 4511552 4511057 4524717 4558254 4542078 4583233
22698 4583233 4639631 4561113 4446242 4422775 4428782 4427598 4523177 4654277 4682668 4560251 4380653
22687 4380653 4377051 4425489 4498272 4517897 4494128 4525184 4477298 4557229 4644890 4670294 4704179
22676 4704179 4693508 4618879 4590050 4679190 4709757 4667923 4615192 4482043 4452975 4450318 4476259
22665 4476259 4483074 4535271 4631202 4645892 4626978 4697680 4801241 4760066 4645404 4656353 4632169
22654 4632169 4615276 4554946 4580741 4732122 4803087 4774270 4772690 4811885 4741414 4673300 4682744
22643 4682744 4526927 4529252 4518436 4563659 4557271 4425132 4448384 4423265 4485722 4528155 4544853
22632 4544853 4650202 4644467 4562825 4585927 4633856 4648782 4707353 4742482 4768770 4773252 4701297
22621 4701297 4687450 4646305 4563075 4568545 4661880 4584841 4642573 4702180 4666840 4573960 4590172
22610 4590172 4622522 4632928 4685319 4737694 4729374 4719442 4688595 4667853 4636066 4676193 4813913
22599 4813913 4838789 4799799 4760798 4695722 4655006 4658559 4720280 4688726 4632071 4599643 4658178
22588 4658178 4673423 4634132 4526671 4557231 4630321 4624565 4662549 4755691 4756406 4708069 4768530 4792855
22576 4792855 4807854 4862629 4814931 4766527 4761789 4676920 4637966 4656353 4633448 4635189 4611573 4560018
22564 4560018 4717530 4766083 4794385 4786477 4765031 4742440 4737295 4639394 4641743 4704035 4828051
22553 4828051 4809670 4757957 4724086 4739406 4689541 4625897 4587638 4589024 4615547 4708522 4757632
22542 4757632 4788016 4761904 4813755 4824393 4765284 4700817 4675387 4763831 4759160 4830278 4799809
22531 4799809 4802184 4888595 4844150 4678622 4559781 4593416 4688038 4728274 4717512 4716870 4772214
22520 4772214 4688015 4629960 4654626 4740021 4782328 4705490 4641885 4656352 4733637 4796884 4793019
22509 4793019 4824632 4870313 4887494 4883087 4865342 4835495 4833852 4874158 4878606 4872796 4869519 4853103
22497 4853103 4810551 4821431 4854163 4829835 4769042 4798239 4894493 4914725 4897372 4887164 4873887
22486 4873887 4925690 4969268 5049875 5005173 4909583 4910493 4919970 4955062 4971543 4981241 4856904 4803819
22474 4803819 4822615 4875861 4906400 4871365 4858703 4843601 4878138 4966310 4998499 4928088 4916241
22463 4916241 4918317 4834748 4863801 4861467 4861290 4954415 4972187 4928537 4835891 4827070 4913369 4900245
22451 4900245 4930246 4876488 4848949 4849710 4870477 4899162 4947887 5020087 4894981 4900726 4941373 4937231
22439 4937231 4820011 4810685 4901615 4896091 4840866 4817670 4777457 4739438 4744404 4752545 4864102 4970887
22427 4970887 4965495 4959935 4917165 4860645 4914358 4976906 4992441 5054363 5138922 5065911 4981780 4932859
22415 4932859 4958390 4986938 5100280 5136383 5051491 5042789 5051624 5070384 4999826 4933523 4911527
22404 4911527 4921675 4940240 4922590 4978264 5033446 5025881 5009871 5007653 5095156 5115613 4985061
22393 4985061 4975489 5000899 5004282 5074901 5060841 5106449 5132340 5020550 4979525 4949364 4896826
22382 4896826 4897093 4967888 4978794 4973243 4978728 4947909 4879985 4927131 5039859 5043899 4975275 4930821
22370 4930821 4910454 5002087 5021475 4903480 4949823 4956156 4949143 4990704 5039566 5045208 5110203 5116947
22358 5116947 5128574 5162626 5084974 5039398 5067663 4982681 4942917 4990840 5114134 5198540 5164420
22347 5164420 5132179 5095429 5050519 4939432 5063902 5147167 5103116 5136110 5094720 5077915 5113949
22336 5113949 5122458 5130282 5103638 4974500 4867623 4880067 4995205 5151352 5166470 5075827 5175003
22325 5175003 5207262 5166148 5235509 5265084 5246121 5175940 5066840 5032595 5064492 5114200 5090161
22314 5090161 5160967 5110472 5022780 5029643 5093292 5166649 5117338 5146360 5192197 5161159 5239047
22303 5239047 5282456 5234956 5198543 5295215 5213103 5111633 4966669 5012000 5030660 4978508 4983393
22292 4983393 5070673 5205520 5238980 5249403 5219485 5313310 5275435 5188701 5200657 5275070 5197619
22281 5197619 5172589 5228954 5248285 5268700 5253840 5262040 5279523 5223873 5201105 5219486 5231002
22270 5231002 5242016 5221627 5157544 5210652 5079077 5111085 5245226 5235855 5120678 5114749 5073399
22259 5073399 5015441 5101273 5164122 5238589 5293356 5335496 5382940 5299737 5162744 5084128 5051412
22248 5051412 5118588 5149683 5161002 5231254 5207315 5122349 5168182 5219731 5302998 5296129 5333535
22237 5333535 5341688 5274177 5194606 5088917 5086187 5077223 5188577 5276706 5267032 5245198 5187345 5178503
22225 5178503 5181404 5172268 5200002 5210881 5236473 5212673 5120123 5181224 5218524 5220588 5212262 5163454
22213 5163454 5200477 5204743 5272502 5364368 5442728 5446289 5404834 5366917 5301528 5341720 5352645 5383930
22201 5383930 5385924 5428286 5484386 5492315 5379320 5300764 5410730 5461123 5390614 5290641 5258879
22190 5258879 5226633 5255219 5179563 5177652 5210129 5272277 5285522 5215770 5224954 5336238 5308283
22179 5308283 5328579 5347711 5308813 5282939 5363709 5403350 5369050 5387737 5376583 5296259 5296318 5287132
22167 5287132 5381776 5471323 5460619 5439684 5385604 5348957 5350907 5352543 5315490 5406822 5336130 5310148
22155 5310148 5385209 5381277 5424145 5394082 5411565 5437669 5429676 5357754 5401428 5375796 5384534 5296243
22143 5296243 5284938 5357209 5371401 5348363 5278754 5255687 5387107 5365807 5295869 5317983 5337533
22132 5337533 5332047 5333644 5366254 5403493 5448011 5451141 5406417 5404588 5402392 5352274 5341110 5317577
22120 5317577 5254021 5361730 5438939 5530368 5521067 5536447 5534238 5458888 5382366 5389659 5410956 5432728
22108 5432728 5541144 5507030 5390684 5336491 5311123 5449027 5548525 5567772 5516307 5497882 5593839
22097 5593839 5623695 5577509 5566678 5566956 5579145 5556791 5391289 5412670 5461223 5519661 5510975 5400891
22085 5400891 5408914 5392255 5464659 5517685 5530777 5517479 5501366 5465193 5540552 5612113 5498634
22074 5498634 5516980 5594187 5551028 5463592 5459563 5429913 5492480 5431324 5430886 5413973 5407749 5458933
22062 5458933 5437187 5477034 5535744 5563219 5552543 5555153 5505470 5566321 5559785 5620216 5637127 5586991
22050 5586991 5504321 5556782 5563630 5474806 5499784 5532105 5496019 5530787 5508085 5421671 5409331
22039 5409331 5359329 5392256 5390995 5294741 5367504 5484838 5605357 5622718 5560853 5551420 5575802
22028 5575802 5533765 5508207 5506170 5546370 5606881 5600486 5615436 5476956 5405950 5473371 5432034
22017 5432034 5504514 5606939 5638740 5665532 5675341 5675195 5693507 5735217 5734154 5690251 5590496 5575289
22005 5575289 5661145 5674195 5618129 5624950 5677988 5703433 5781202 5806901 5706839 5712223 5725053
21994 5725053 5664990 5581366 5576970 5619218 5581706 5597772 5629720 5614778 5586046 5667543 5769320
21983 5769320 5727240 5656868 5594068 5581946 5718683 5650756 5599407 5596706 5690108 5787961 5827109
21972 5827109 5923703 5837942 5752404 5767876 5818268 5783792 5737597 5634220 5514479 5479113 5613720
21961 5613720 5764273 5786095 5791820 5824134 5707522 5702180 5721554 5701821 5716493 5708414 5710394 5719164
21949 5719164 5715943 5757041 5750452 5725012 5818276 5837232 5851443 5778466 5758402 5784198 5727720 5625723
21937 5625723 5694433 5671618 5652434 5738313 5818868 5791768 5759413 5693989 5734848 5717780 5745131
21926 5745131 5860567 5888144 5854148 5821762 5829755 5772898 5765259 5813933 5808203 5873330 5888033 5780225
21914 5780225 5771827 5823486 5836807 5828596 5741759 5763178 5832518 5901562 5901286 5832610 5869386 5880525
21902 5880525 5878692 5805023 5746657 5659018 5669946 5725405 5776927 5767619 5762309 5772990 5818973 5872478
21890 5872478 5920471 5889241 5831056 5772380 5761381 5722733 5636345 5710277 5775623 5820454 5842552
21879 5842552 5865617 5921025 5899879 5870177 5831059 5820211 5834359 5823372 5836540 5818403 5753739
21868 5753739 5799705 5810979 5908970 5932831 5872016 5802744 5893995 5914975 5972467 5965563 5999221
21857 5999221 5918421 5788348 5726442 5810805 5833360 5878056 5907730 5996065 6080320 6077701 5907450
21846 5907450 5878275 5896193 5866589 5873546 5811772 5729049 5735823 5802539 5826748 5835045 5855588 5921434
21834 5921434 5972261 5940984 5965795 6009460 5928871 5959926 5963075 5875959 5874581 5951375 5986174 5923782
21822 5923782 5988640 5997173 5927772 5968063 6034080 6067167 6127081 6101384 6040182 6042140 6044289 5993242
21810 5993242 5950821 6060484 6148554 6143003 6142141 5971512 5977338 6016144 6039644 5970486 5884566 5927339
21798 5927339 6021544 6041685 6056098 6064019 6007327 5902915 5989052 6118403 6082792 6018682 5937651
21787 5937651 5940174 5955871 5971402 5938531 5865856 5923619 5972680 6092291 6189661 6123344 6061862
21776 6061862 6061390 6043858 6017065 5997939 6042270 6166225 6226058 6144408 6126807 6098626 6093626 6058111
21764 6058111 6191762 6200022 6235718 6241536 6173964 6151408 6142552 6186124 6178010 6110065 6174790 6224707
21752 6224707 6180015 6051905 6028316 6131790 6170773 6206287 6217220 6223433 6228215 6190419 6176839
21741 6176839 6147705 6146272 6100568 6190068 6273928 6348868 6305404 6303148 6261855 6150910 6029616
21730 6029616 6088838 6208525 6239901 6177255 6242409 6370596 6331032 6304939 6387406 6400106 6245719
21719 6245719 6135462 6172979 6199444 6276405 6248344 6142025 6145761 6198707 6286411 6266181 6228704
21708 6228704 6189062 6200641 6165473 6111712 6098857 6148763 6134241 6093075 6223744 6320130 6376655
21697 6376655 6329417 6294220 6234970 6256716 6354050 6376474 6353647 6445515 6492618 6507550 6581777
21686 6581777 6475808 6464160 6427066 6422931 6445828 6346853 6332763 6311683 6300027 6248721 6316304
21675 6316304 6384387 6363424 6347516 6377320 6363300 6453991 6521227 6506389 6437285 6464818 6442121
21664 6442121 6354322 6265177 6165136 6203483 6289863 6238992 6255281 6235377 6204602 6280828 6362948
21653 6362948 6337980 6327690 6275452 6245456 6234965 6229202 6228893 6204133 6277570 6323424 6379158 6441562
21641 6441562 6320472 6337816 6400735 6444364 6394356 6310879 6315911 6300650 6322517 6236501 6226369
21630 6226369 6297872 6335776 6309848 6270730 6174871 6140626 6188924 6306058 6310261 6282216 6239482
21619 6239482 6204996 6172490 6205055 6222112 6279537 6311659 6336907 6281231 6236871 6253354 6336142
21608 6336142 6348496 6449751 6384379 6308409 6352456 6417749 6411517 6409742 6407326 6381332 6345131 6465015
21596 6465015 6578584 6571382 6521552 6440009 6352056 6315664 6317282 6359855 6403496 6386810 6391300 6332149
21584 6332149 6429978 6407688 6430299 6536266 6528709 6494355 6519292 6583554 6671731 6717564 6775817
21573 6775817 6668705 6670449 6683103 6640991 6590126 6516912 6511588 6532590 6540920 6597127 6644045 6654253
21561 6654253 6642596 6671106 6674558 6704600 6672209 6616366 6614235 6674058 6614981 6420539 6332711
21550 6332711 6394488 6571112 6639705 6639734 6539778 6513319 6620834 6739432 6757106 6602724 6561221
21539 6561221 6602112 6504714 6517409 6554698 6592332 6667778 6648283 6494707 6422993 6446388 6422894
21528 6422894 6472122 6424450 6366438 6390820 6547416 6532492 6543531 6567262 6576181 6611302 6622249
21517 6622249 6651726 6626541 6634654 6598883 6602134 6599641 6588829 6626078 6556799 6469281 6425383 6595467
21505 6595467 6680177 6711274 6726842 6795743 6863882 6822898 6718766 6683973 6738579 6733803 6686453
21494 6686453 6675336 6714846 6714311 6693544 6793972 6795516 6783999 6739039 6759233 6699942 6688752 6769760
21482 6769760 6851727 6826854 6731342 6771045 6831346 6781986 6857651 6772440 6675924 6738922 6744112
21471 6744112 6732505 6761356 6842128 6808454 6777303 6683241 6652517 6708407 6677961 6623106 6706289
21460 6706289 6824031 6778584 6788784 6825813 6821430 6742131 6700296 6752647 6733811 6753863 6829805
21449 6829805 6816943 6851816 6872574 6848377 6886561 6825520 6814005 6756359 6816852 6796634 6733104
21438 6733104 6679724 6583595 6610804 6705875 6669188 6659528 6802816 6848068 6889434 6857029 6834907
21427 6834907 6798839 6815061 6907047 6886309 6892617 6889542 6865239 6838249 6820051 6826500 6828170 6878093
21415 6878093 6993262 7079394 7012792 6856668 6849822 6920053 6914599 6884297 6909591 6961356 6884843
21404 6884843 6888099 6935092 6946294 6930557 6924382 7013447 7105922 7064961 6944378 6856168 6818756
21393 6818756 6833642 6839672 6896237 6948715 6973148 6943754 6955518 7056111 7043224 6956321 6875287
21382 6875287 6874145 6878998 6974794 7019756 6956049 6924996 6904751 6897924 6927422 7025537 7044107 7070335
21370 7070335 7075046 6993494 6959836 6910846 6986761 7104624 7161240 7086149 7064099 7067478 6987308
21359 6987308 6970399 6950296 6967231 6964951 6958199 6987692 7043287 7081792 7106757 6992267 7004852
21348 7004852 7107002 7174149 7181110 7150243 7212390 7236569 7286016 7273678 7193787 7081129 7040160
21337 7040160 7032708 7059061 7055708 7095141 7173627 7269822 7234728 7151259 7094296 7111699 7140736 7179433
21325 7179433 7176513 7088792 7021034 7024203 7040242 7101382 7157599 7151392 7200231 7160805 7188714 7167346
21313 7167346 7187107 7213114 7225104 7226645 7280751 7311484 7338386 7309715 7316312 7277063 7266580 7263535
21301 7263535 7180758 7200345 7157686 7195721 7352713 7335489 7189208 7045626 7070103 7195794
21291 7195794 7280797 7291667 7204543 7127062 7212438 7323833 7346121 7388858 7401259 7400315 7354416
21280 7354416 7316572 7286294 7298468 7348950 7315084 7281557 7310431 7324817 7283461 7202103 7252821
21269 7252821 7197266 7125234 7164249 7186695 7198110 7219295 7177322 7190971 7226209 7272841 7229975
21258 7229975 7220934 7343637 7423994 7516378 7504684 7417892 7384217 7361768 7307102 7257688 7319080
21247 7319080 7382961 7351745 7282931 7300587 7365465 7438292 7383199 7341845 7407504 7406621 7400830 7421288
21235 7421288 7428660 7462684 7478345 7442817 7458801 7452796 7396955 7374455 7370734 7390139 7441884 7451894
21223 7451894 7400309 7282417 7240769 7349587 7389487 7354581 7402131 7374385 7306434 7339983 7372672
21212 7372672 7374882 7425048 7361204 7410288 7392262 7296024 7334385 7397482 7385894 7355589 7363613 7400967
21200 7400967 7396550 7372446 7332597 7413255 7358220 7318568 7323800 7365761 7418497 7396112 7451191 7473719
21188 7473719 7465890 7360162 7275522 7313322 7460101 7469502 7437819 7402628 7365305 7317473 7436377
21177 7436377 7561066 7631405 7507915 7454670 7537476 7477269 7406080 7536232 7634123 7556538 7468738
21166 7468738 7498590 7541729 7610584 7628520 7605281 7598853 7644616 7620028 7619313 7561898 7503970 7438024
21154 7438024 7438557 7442851 7516384 7620261 7568256 7595591 7588105 7555109 7554736 7594814 7676405 7598961
21142 7598961 7564905 7604425 7601228 7520540 7589592 7556927 7576755 7566493 7622895 7685259 7664574
21131 7664574 7650343 7585695 7543129 7571591 7634128 7639052 7663741 7654494 7686196 7746855 7748930 7768693
21119 7768693 7839264 7825181 7790808 7781872 7737775 7725872 7836545 7943467 7866426 7750932 7747922
21108 7747922 7779191 7766390 7691062 7728787 7821432 7739704 7760580 7777384 7734420 7693313 7719281
21097 7719281 7809333 7841468 7842868 7878807 7834241 7779173 7787503 7832625 7916128 7844661 7818346 7822401
21085 7822401 7805169 7852217 7908687 7962504 7992897 7844423 7824099 7885577 7960974 8024604 7934360
21074 7934360 7806317 7783752 7779632 7764977 7703508 7793516 7822404 7824789 7939957 7924107 7968424
21063 7968424 8015161 8008391 8012096 7898341 7896572 7931959 7945307 7914833 7905735 8020482 8069992 8045597
21051 8045597 7954015 7885541 7938709 7972399 7969665 7934193 7948896 7984607 8072354 8061776 7980403
21040 7980403 7986049 8004000 8021909 8089057 8048899 8010169 7990676 7948423 7833641 7874532 7890292
21029 7890292 7976441 8026922 7940120 7859800 7903401 7973138 7927988 7898498 7892711 7939315 8043111
21018 8043111 8118177 8082335 8044311 8048473 8048428 8040942 8087314 8149327 8122369 8076135 7931866 8003106
21006 8003106 8035002 8017383 8061967 8009255 7992123 7923404 7965059 8069801 8091365 8083414 8058562
20995 8058562 8023553 8015748 8044948 8072627 8027088 8046723 8070119 8095102 8088624 8047132 8044281 8104942
20983 8104942 8060801 8097624 8145117 8252555 8313229 8344876 8429679 8269952 8280503 8291601 8259361
20972 8259361 8287734 8303689 8225581 8219656 8204178 8220650 8179672 8146965 8103008 8099392 8163081 8118765
20960 8118765 8037028 8128369 8173151 8224566 8296435 8316877 8394182 8383758 8333530 8295409 8284455
20949 8284455 8343790 8246007 8209357 8305123 8453742 8516606 8409930 8335519 8373212 8409262 8395076
20938 8395076 8344516 8231080 8233099 8189788 8160768 8206434 8255527 8284771 8315244 8371551 8343646
20927 8343646 8332900 8289162 8339727 8475696 8565796 8426904 8299170 8280248 8310319 8348604 8285333
20916 8285333 8333948 8430500 8358629 8388551 8461964 8477265 8441517 8478530 8478844 8417516 8392282 8390267
20904 8390267 8336302 8404046 8457201 8449517 8491560 8564646 8613616 8532089 8528985 8540877 8462320 8461307
20892 8461307 8551947 8683182 8711041 8539594 8495322 8535894 8545517 8601841 8583732 8557778 8603251
20881 8603251 8658105 8657127 8688623 8644306 8674355 8649909 8510330 8600556 8711885 8760401 8771799
20870 8771799 8764457 8702627 8678964 8693892 8727005 8724239 8701992 8662342 8674819 8665374 8666098 8629861
20858 8629861 8604552 8678760 8703623 8739962 8783121 8817111 8862824 8858815 8754680 8754333 8778851 8756310
20846 8756310 8812725 8752326 8672472 8781660 8807377 8754872 8762544 8759652 8693640 8719625 8728077 8675912
20834 8675912 8683168 8687758 8801715 8842658 8825470 8817184 8804284 8811847 8741838 8741344 8786053 8752003
20822 8752003 8657081 8602421 8634811 8731309 8804304 8844640 8831204 8744746 8741268 8863017 8947572
20811 8947572 8990992 9045919 8966536 8931312 8900778 8902570 8915609 8977878 8962190 8854981 8891502
20800 8891502 8848514 8824338 8769738 8734244 8815303 8883824 8914212 8832984 8863653 8943769 8909476
20789 8909476 8902323 8939211 8979103 8963287 8963392 9098488 9125620 8992628 8931405 8937696 8932785 8971686
20777 8971686 9042446 9056870 9016045 9072942 9155966 9094625 8977409 9005888 8988829 9016695 8999223
20766 8999223 9120607 9140688 9051135 9030861 9031119 9033076 9021894 8956407 8994075 9047986 9092169 9094454
20754 9094454 9168788 9154468 9124055 9003366 9026576 9152973 9183535 9185482 9109188 9051026 9048221
20743 9048221 9018869 9072880 9078869 9191955 9291173 9280399 9198893 9169344 9246861 9289415 9360861
20732 9360861 9411391 9353882 9338063 9396167 9338641 9289304 9321834 9268049 9212796 9283727 9224889
20721 9224889 9258593 9303894 9373478 9335154 9276724 9205758 9261336 9334089 9377479 9458389 9409844
20710 9409844 9325915 9272672 9327178 9270206 9260313 9246306 9176656 9164765 9223184 9335479 9324757
20699 9324757 9342950 9371243 9366142 9455851 9550444 9499983 9431977 9448592 9523725 9550655 9517821
20688 9517821 9429840 9378464 9383511 9416042 9408281 9330054 9282527 9410027 9381255 9312891 9395967
20677 9395967 9373366 9198912 9150263 9283514 9400200 9524072 9617961 9600989 9501701 9559449
20667 9559449 9592718 9610232 9519271 9458987 9523265 9560511 9578776 9544125 9480186 9528476 9673814
20656 9673814 9780436 9777690 9745448 9757975 9806179 9800435 9816176 9770266 9689667 9703077 9715315
20645 9715315 9673169 9678402 9665884 9622161 9578878 9709884 9819222 9802420 9881144 9850110 9891409
20634 9891409 9913350 9811928 9608652 9622741 9676230 9614689 9514383 9483272 9567501 9637653 9599582
20623 9599582 9542838 9676205 9628017 9566100 9661199 9731057 9781512 9743189 9738370 9840166 9835609
20612 9835609 9737092 9712332 9739884 9776222 9790484 9792975 9716472 9676982 9716351 9788662 9864418
20601 9864418 9809216 9801064 9871410 9871211 9901723 9917116 9911140 9817855 9785469 9750396 9721006 9749607
20589 9749607 9775339 9857897 9930360 9849856 9847861 9901556 9934794 9956216 9945748 9993545 9990548 9927981
20577 9927981 9887561 9912130 9892104 9935513 9913026 9807674 9862797 9983014 9960739 9904972 9964128
20566 9964128 10018819 10002091 9909768 9787306 9872589 10025526 10067671 10026059 9957980 9984353 10017659
20555 10017659 10078691 10141859 10143281 10085579 10092482 10195414 10257042 10159319 10131915 10141735 10162880
20544 10162880 10192299 10080320 9981461 9962277 9955376 10008026 10015391 10087454 10174572 10229648 10308170
20533 10308170 10216127 10140694 10251948 10261271 10233729 10138051 10095794 10209327 10327630 10297324 10312952
20522 10312952 10307054 10211253 10236672 10315931 10317497 10218333 10213869 10254085 10239884 10214094 10270607 10313776
20510 10313776 10314983 10372055 10333190 10311822 10320493 10281755 10228318 10148780 10208142 10399769 10452411
20499 10452411 10466506 10424644 10317086 10362192 10377139 10380935 10442535 10495742 10582986 10425846 10349959
20488 10349959 10454752 10493951 10578530 10553362 10517055 10429481 10380124 10296568 10279756 10305260 10285989
20477 10285989 10388777 10469682 10586063 10562001 10531295 10554883 10592831 10570177 10568396 10582694 10512914
20466 10512914 10477701 10492974 10562955 10688734 10648547 10565575 10530156 10515784 10510202 10453122 10452623
20455 10452623 10490424 10542039 10560000 10585114 10597109 10706610 10789110 10755981 10632464 10540713 10509987
20444 10509987 10595109 10716624 10722527 10704952 10690261 10600882 10555718 10496032 10558424 10574466 10602773
20433 10602773 10641879 10747206 10809501 10800698 10799038 10701427 10605919 10606756 10696836 10729340 10704990 10736173
20421 10736173 10714096 10754424 10888491 10826807 10763783 10713951 10703932 10715117 10828147 10834852 10844892
20410 10844892 10835339 10861342 10862837 10895546 10905444 10976390 10953202 11002720 11078314 11056561 10993883 10992948
20398 10992948 11066346 11087562 11006749 11062227 11111962 11123854 11110943 11125201 11131779 11001080 10985080
20387 10985080 11056292 11077581 11031921 11120032 11118765 11101750 11096966 11162980 11252686 11265028 11185337
20376 11185337 11105742 11106501 11085753 11147628 11202264 11177710 11234724 11282576 11280019 11246164 11152101 11198694
20364 11198694 11236083 11180237 11128415 11131279 11153396 11159342 11044148 11121883 11141747 11190581 11232504
20353 11232504 11289537 11262374 11315357 11412720 11253513 11212605 11291081 11337129 11369196 11431913 11365573
20342 11365573 11311101 11295810 11305823 11349673 11356307 11327214 11331886 11327482 11433237 11425035 11387581 11448081
20330 11448081 11476353 11437714 11381227 11306432 11314530 11278582 11298532 11402012 11429836 11483524 11483246
20319 11483246 11481442 11518115 11518781 11523596 11449251 11406043 11393950 11413572 11411546 11411470 11427182 11410235 11449907
20306 11449907 11634599 11742000 11757699 11680821 11674775 11685398 11759664 11751033 11724485 11722329 11713709
20295 11713709 11686775 11780046 11901211 11911143 11845779 11763376 11756756 11744677 11653049 11646066 11735033
20284 11735033 11694463 11567654 11572886 11652006 11627001 11730561 11817189 11852688 11911708 11924531 11802349
20273 11802349 11761159 11745125 11824005 11857086 11829395 11798807 11897612 11925077 11964326 12001716 11986804
20262 11986804 11998677 11941802 11834865 11811203 11802943 11848633 11883712 11873655 11840312 11862141 11884686
20251 11884686 11855314 11844147 11846750 11886208 11906605 11928308 11909506 11858070 11834434 11748437 11790164
20240 11790164 11951815 11977266 11964741 11971884 11935951 11933278 11966953 11972464 11978181 11990809 11959845 11966859
20228 11966859 12100637 12111083 12020707 12059343 12029982 12076497 12199003 12205336 12135859 12050619 12039982
20217 12039982 12142770 12286466 12224650 12158329 12149921 12103227 12173851 12186005 12129306 12159560 12168656
20206 12168656 12213761 12207245 12228447 12250759 12265916 12214191 12264469 12295287 12190825 12202697 12278159
20195 12278159 12296961 12329884 12254247 12174438 12147882 12187655 12315849 12410197 12389401 12444866 12537918
20184 12537918 12538797 12512482 12459508 12447694 12418568 12337463 12238085 12285266 12410857 12396452 12366049
20173 12366049 12316455 12379225 12410347 12492494 12498694 12504194 12559154 12512478 12436939 12455701 12443170
20162 12443170 12420429 12358949 12337031 12359596 12377662 12396285 12523966 12635171 12695304 12646580 12597899
20151 12597899 12603296 12648883 12614077 12556783 12427794 12407084 12407064 12384829 12438200 12471629 12473668 12536640
20139 12536640 12535868 12526647 12501220 12466181 12446258 12497279 12550148 12526738 12493957 12505349 12569267 12578917
20127 12578917 12587382 12533887 12528804 12499221 12497115 12628335 12703291 12754931 12848650 12809615 12737720
20116 12737720 12731202 12812794 12836706 12817259 12804082 12866638 12892449 12890955 12800309 12757419 12826627
20105 12826627 12825043 12708388 12697091 12701844 12725139 12766861 12796684 12740977 12688001 12699500 12628252
20094 12628252 12619833 12591120 12595673 12571841 12588015 12690552 12811980 12836166 12847125 12851901 12802096
20083 12802096 12878470 12925153 12819506 12736023 12733816 12749514 12817350 12894960 12958546 13012425 12983159
20072 12983159 12861696 12726815 12703508 12679266 12622205 12704315 12697128 12607995 12647183 12607791 12603186
20061 12603186 12752045 12969151 12973916 12845353 12755314 12714725 12724852 12852120 12887589 12786756
20051 12786756 12760071 12863850 12858874 12845049 12774812 12713148 12744997 12862703 12811767 12778493 12810824
20040 12810824 12848643 12943629 12961806 12913267 12882355 12920342 12935190 12960461 12904627 12863871 12807134
20029 12807134 12792964 12902696 12874166 12898099 12899993 12788545 12742731 12793777 12893948 12949204 12858386
20018 12858386 12825510 12841044 12875621 12901490 12986641 12922954 12988812 12914709 12811215 12910522 12950345
20007 12950345 12943472 12872993 12819868 12836174 12888364 12834100 12779897 12788280 12823321 12889172 12906254
19996 12906254 12835462 12793234 12774900 12756536 12760136 12811820 12880857 12834799 12758421 12700640 12764114
19985 12764114 12830733 12855762 12938575 12984847 12909062 12810336 12785492 12817860 12771821 12716980 12668271
19974 12668271 12730273 12794748 12773803 12707623 12680440 12616537 12637405 12710182 12670070 12650869 12778974
19963 12778974 12791565 12697778 12526992 12440793 12425705 12509731 12593264 12580256 12595853 12568915 12480533
19952 12480533 12546964 12494865 12467864 12514886 12542380 12616282 12591970 12445364 12394662 12360137 12427142
19941 12427142 12575738 12663979 12727956 12736778 12694733 12586011 12532469 12500906 12504480 12524911 12501359
19930 12501359 12459576 12369941 12301684 12292447 12266308 12273289 12365504 12379962 12314817 12217500 12216870 12230656
19918 12230656 12212801 12219905 12209273 12199829 12254071 12373509 12314427 12123793 12086236 12082111 12122358
19907 12122358 12166914 12186194 12095414 12088776 12019789 11945140 11908510 11957952 12002808 12016122 12017059 11989596
19895 11989596 11974896 11861461 11760736 11767264 11779822 11817475 11891072 11930998 11960897 11891668 11768471
19884 11768471 11770579 11706494 11559488 11586100 11668206 11685941 11724382 11650336 11625676 11550355 11536875
19873 11536875 11532774 11501976 11521379 11510238 11470670 11424620 11446283 11516149 11380138 11359088 11429941
19862 11429941 11520690 11472647 11428389 11429921 11348537 11274624 11252137 11215501 11163125 11077739 10978838
19851 10978838 10997516 10938798 10973667 10896858 10844874 10903976 10876892 10830381 10854149 10893822 10808998
19840 10808998 10691751 10624282 10592357 10646767 10647867 10608840 10535494 10509128 10470475 10415488 10442061
19829 10442061 10420067 10349823 10344632 10324795 10301359 10396395 10411593 10438529 10389653 10272491 10189546
19818 10189546 10098433 10074196 10045760 10081911 10072801 10003613 9919580 9801345 9807400 9869668 9970768
19807 9970768 9973804 9935143 9895183 9826775 9719096 9656511 9700031 9616686 9570871 9584910 9494818
19796 9494818 9597061 9718314 9702178 9645405 9591566 9512268 9397101 9337569 9267366 9202573 9075024
19785 9075024 9102793 9094676 9107090 9168899 9154696 9184414 9087607 9033938 9028032 8962886 8905108 8906961
19773 8906961 8806331 8779519 8767620 8706360 8688643 8640134 8548683 8526657 8620572 8628986 8596311
19762 8596311 8510829 8441454 8431003 8274319 8206651 8288188 8363802 8429510 8392728 8362627 8322525
19751 8322525 8222371 8098452 8041815 8053080 8084884 8063695 7988985 7949510 7902792 7853096 7847918
19740 7847918 7819342 7903316 7910954 7879078 7898702 7920664 7811961 7707013 7628995 7559584 7547467
19729 7547467 7532519 7547404 7514258 7575911 7537274 7399191 7325967 7209204 7131133 7147606 7224093
19718 7224093 7307785 7270958 7147798 6994505 6894470 6832119 6824391 6879117 6894161 6890160 6978478
19707 6978478 7015179 6908041 6816199 6888809 7030716 7044007 6983239 6830092 6881708 6871969 6769026
19696 6769026 6664798 6596192 6565028 6472559 6511646 6526528 6420283 6348886 6348687 6353439 6265106
19685 6265106 6238176 6328064 6293431 6370174 6448314 6434689 6340295 6232139 6318289 6375036 6412773
19674 6412773 6314103 6188540 6138761 6099031 6181212 6170843 6123259 6207124 6244544 6190176 6170648
19663 6170648 6168241 6110042 6066748 6034056 5997401 5983897 6056337 6058176 6067252 6106873 6128691 6108407
19651 6108407 6087225 6090259 6138736 6007830 5866966 5861190 5767747 5883090 5897127 5889520 5883628
19640 5883628 5849059 5899029 5985235 5951907 5945997 5979843 5975723 5992332 5935416 5968343 5965740 5971610
19628 5971610 5982893 5977963 5988776 5946904 5869768 5873036 5809361 5846861 5976064 5974750 5881563 5923323
19616 5923323 5895191 5912823 6032976 6029180 5920393 5960010 5958169 5941344 5950877 5985439 6011922
19605 6011922 5982536 5967204 5946945 6037020 6119287 6112802 6057569 6012722 6058780 6106274 6120898
19594 6120898 6039205 6050317 6019875 6035018 6027402 6092585 6061308 6110482 6103518 6026263 6087200 6053057
19582 6053057 6043872 6083186 6044661 6040961 6069879 6112204 6241764 6232759 6314515 6326249 6215035
19571 6215035 6194188 6254357 6338705 6351775 6315689 6266917 6328273 6409867 6485602 6521463 6436339
19560 6436339 6328079 6399710 6348372 6295069 6382935 6494021 6504778 6539929 6552693 6540950 6535171
19549 6535171 6559023 6552920 6522212 6448594 6455131 6550329 6597414 6594379 6612683 6625036 6671967 6739506
19537 6739506 6720787 6799214 6836076 6856725 6900216 6924440 6923379 6865800 6865719 6882541 6894203 6952025
19525 6952025 6986917 6957810 7032644 7016417 7068975 7174580 7060717 6882774 6898159 7164413
19515 7164413 7224113 7209918 7151348 7151781 7270518 7335892 7371682 7342666 7349603 7367540 7277076 7265122
19503 7265122 7298902 7323564 7347941 7424719 7584023 7649236 7681043 7669896 7660240 7761761 7786975
19492 7786975 7781671 7704680 7664397 7702493 7759104 7839022 7834587 7787558 7785910 7776411 7863271 8010146
19480 8010146 8064353 8044616 7974168 8025539 8078836 8072567 8043996 8045730 8161194 8261507 8364791
19469 8364791 8421876 8465883 8403648 8330099 8326468 8317438 8444003 8524574 8547762 8530055 8507464
19458 8507464 8518887 8503697 8455017 8459866 8582990 8595731 8637453 8637564 8695273 8727424 8801181 8913683
19446 8913683 9045508 9094058 9064447 9049461 9044252 9050081 9092600 9201391 9266718 9240325 9282256
19435 9282256 9253013 9185952 9205958 9271416 9238600 9222528 9235651 9336396 9395084 9355439 9358334
19424 9358334 9563806 9697692 9717111 9760046 9816976 9818699 9902686 9868644 9885745 9927925 10009769
19413 10009769 10093938 10113050 10075892 9993300 10013796 9994168 10028020 10100775 10015915 10039627 10143100
19402 10143100 10188139 10197728 10197749 10195474 10177975 10237799 10230282 10266254 10237411 10292596 10358063 10400958
19390 10400958 10489891 10494141 10538112 10629425 10644044 10709389 10781181 10844945 10911790 10898729 10789204
19379 10789204 10825930 10885042 10988853 11140327 11256180 11335666 11388798 11333830 11234323 11259578
19369 11259578 11316764 11401620 11377524 11365987 11351051 11346506 11396542 11429705 11395318 11423662 11477710
19358 11477710 11582402 11683543 11640775 11585972 11641354 11735048 11858793 11904220 11868298 11955406
19348 11955406 12005447 12053204 12039399 12077718 12070044 12098627 12096216 12128739 12272352 12345317 12357508
19337 12357508 12365928 12418026 12427448 12522768 12567655 12667101 12728413 12765680 12805678 12770648 12858841
19326 12858841 12896802 12959901 12938459 12819385 12862542 12950690 12935991 12863108 12788368 12776420 12800036
19315 12800036 12891256 12922189 12988394 13062769 13127514 13034999 13102485 13288570 13307622 13226650 13143214
19304 13143214 13166614 13124241 13107231 12985379 12941216 12968318 12881354 12777589 12743401 12704344 12792525
19293 12792525 13042978 13201465 13240182 13292481 13369912 13416370 13555301 13692871 13793493 13797179
19283 13797179 13698569 13665964 13751638 13918843 13919097 13901848 13818125 13672139 13587029 13523071 13457481
19272 13457481 13471634 13483594 13518513 13564537 13692940 13748318 13875446 13921126 13887357 13804170 13814815
19261 13814815 13864377 13816049 13823190 13670154 13558067 13613720 13844715 13889398 13911266 14017878
19251 14017878 14098986 14259624 14372281 14346434 14432536 14495700 14583687 14712056 14755631 14879294
19241 14879294 14913220 14900666 14966401 15016127 14994578 15056730 15189938 15322583 15464712 15557024
19231 15557024 15649344 15734128 15832439 15897460 15943581 15969749 16037724 16134373 16174174 16168896 16071587
19220 16071587 16103725 16205760 16226914 16322630 16394870 16394757 16462402 16549182 16533443 16620348 16738730
19209 16738730 16821509 16797667 16729754 16755704 16756541 16889877 17028221 17179188 17214069 17134377 17102989
19198 17102989 16992400 17013167 17148049 17289696 17214725 17060036 16943710 16921718 16950526 17065330
19188 17065330 17193680 17325042 17347742 17420303 17504971 17556322 17666205 17791390 17897934 17929451
19178 17929451 17903673 18012084 18102034 18191196 18341424 18410327 18473513 18453503 18521202 18593865 18616960
19167 18616960 18635002 18734527 18800417 18880275 18890466 19039679 19101701 19086224 19178909 19171535 19147938
19156 19147938 19269800 19379561 19390289 19404999 19530832 19613915 19612612 19582484 19673529 19714024 19722796
19145 19722796 19808610 19911596 19990445 20005564 20052465 20102031 20044817 20072313 20112736 20167899 20190248
19134 20190248 20367830 20484431 20495315 20572454 20656780 20853790 20932975 21035530 21026169 21103382
19124 21103382 21276405 21402345 21492075 21527334 21535762 21550947 21632287 21762569 21801830 21878703 21940660
19113 21940660 22089938 22131401 22253597 22403572 22464621 22452188 22433594 22542742 22617800 22715572
19103 22715572 22812960 22902319 22965409 23039907 23161488 23206383 23263964 23445309 23477059 23457570 23463746
19092 23463746 23420951 23361137 23351091 23326397 23379407 23261366 23172644 23297508 23496116 23618959
19082 23618959 23684553 23775387 23911980 24062316 23999922 24112468 24373826 24512410 24619604 24715590
19072 24715590 24767597 24724607 24747265 24709451 24701811 24716466 24665928 24663208 24690420 24682352 24704395 24769909
19060 24769909 24812162 24871058 25028284 25270908 25435562 25493228 25561910 25676771 25839696 26004871
19050 26004871 26119029 26236865 26365543 26434654 26499485 26581388 26687639 26953315 27220220 27263839
19040 27263839 27353805 27406878 27403734 27526869 27636240 27725388 27809218 27988198 28154267 28343487
19030 28343487 28337912 28375106 28452379 28456367 28505473 28666456 28901037 28941506 28978029 28995493 29163853
19019 29163853 29313357 29464482 29616450 29794087 29897537 30015292 30081360 30203712 30338098
19010 30338098 30340605 30507828 30656693 30709953 30773718 30897012 31189933 31373147 31500384 31591203
19000 31591203 31643552 31721646 31774677 31969601 32224821 32464891 32662925 32772733 32831582 32904163
18990 32904163 33030807 33287351 33444671 33601818 33660767 33729790 33838979 33896703 34185003 34370957
18980 34370957 34569290 34819589 34999107 35149975 35281416 35540374 35706816 35807013 35998565
18971 35998565 36263887 36411811 36556308 36650695 36836051 37005375 37192014 37367830 37509144
18962 37509144 37720901 37919404 38172000 38350898 38494573 38616306 38708927 38995256 39298204
18953 39298204 39481976 39697006 39971774 40104414 40254193 40496328 40658376 40781995 40901143
18944 40901143 41144965 41375324 41554814 41802549 42084230 42310073 42585582 42868738 43140053
18935 43140053 43352445 43598343 43850184 44024040 44244846 44467560 44662056 44905246 45200298
18926 45200298 45463581 45746041 46131860 46409336 46780676 47143257 47484907 47759538 47975978
18917 47975978 48205700 48494528 48831312 49001637 49218220 49583183 49763097 49860810 50107693
18908 50107693 50447583 50838691 51295743 51634212 51886416 52033762 52102829 52094578 52065579 52301119
18898 52301119 52630114 52953229 53220473 53534810 53947555 54313522 54703360 55144925 55577186
18889 55577186 55930606 56232045 56539301 56743011 56988878 57374683 57732417 58124856 58613207
18880 58613207 59115868 59657481 60291050 61058044 61695151 62242557 62796408 63396209 64023591
18871 64023591 64756263 65537622 66289863 67032641 67767496 68620807 69555607 70404394 71274081
18862 71274081 72202342 73194277 74203733 75081268 75825214 76638294 77424356 78244697 79126353
18853 79126353 80106299 81254024 82409788 83480549 84548169 85747433 86929520 88180797
18845 88180797 89496749 90775480 92053036 93267385 94411568 95712812 97224683 98882931
18837 98882931 100803351 102877638 105082421 107407392 109881666 112501318 115298487 118206997
18829 118206997 121315984 124391637 126708491 127653133 126892048 124227671 119560123 111995714
18821 111995714 99897357 83334947 65603610 52838852 48224098 49405255 53049321
18814 53049321 55741538 52822220 39776348 14957995 -15805312 -42134450 -59523090
18807 -59523090 -68702387 -70535228 -65095615 -54315553 -41362134 -28482854 -17032169
18800 -17032169 -7886185 -1701541 1508008 2835192 4457246 7819817 12843943 19303339
18792 19303339 27159848 35866381 44803401 53727398 62445925 71052572 79492894 87825673
18784 87825673 95816697 103381394 110242199 115120288 114689862 104451805 79520605 37611016
18776 37611016 -13340432 -55813220 -80603667 -89971567 -87406955 -76271412 -61717712
18769 -61717712 -49760489 -46331626 -55854665 -76114764 -95758745 -110289973 -123463692
18762 -123463692 -133823157 -139601813 -145018239 -154717331 -169256926 -184641644 -201206251
18755 -201206251 -226360375 -263473281 -301620467 -323237289 -325437382 -314825475 -296007305
18748 -296007305 -273027403 -250241944 -230690963 -215164697 -202898098 -192220790 -182092346
18741 -182092346 -172339962 -162782171 -153439678 -144471807 -136011425 -128172471 -121005352 -114353822
18733 -114353822 -108098334 -102522511 -97818384 -93933818 -90504774 -86954051 -83486772 -80407778
18725 -80407778 -77533906 -74899300 -72730989 -71085647 -69605695 -67697303 -65146997 -62267892
18717 -62267892 -59384564 -56636322 -54089170 -51830012 -49761351 -47997862 -46768488 -45802309
18709 -45802309 -45214952 -44950469 -44764439 -44488812 -44175550 -43663337 -43210485 -43122036 -43498927
18700 -43498927 -44209798 -45281323 -46325715 -46921631 -47034579 -46562028 -45538355 -44137751 -42660748
18691 -42660748 -41073172 -39358229 -37721578 -36196724 -34694220 -33414579 -32055076 -30576779
18683 -30576779 -29163469 -27781630 -26283649 -24889978 -23587460 -22220152 -20896963 -19660554
18675 -19660554 -18450322 -17172987 -15782619 -14549531 -13437115 -12399818 -11580841 -10850206
18667 -10850206 -10231740 -9791664 -9604892 -9671406 -9892471 -10197999 -10553182 -10952647 -11474300
18658 -11474300 -12294914 -13617634 -15190069 -17091046 -19033011 -20894945 -22386233 -23687318
18650 -23687318 -24718743 -25492305 -26170993 -26763104 -27083518 -27081847 -26604725 -25667392 -24243991
18641 -24243991 -22600479 -20742347 -18907081 -17104747 -15483812 -14144020 -12981682 -11973293
18633 -11973293 -10843353 -9704783 -8524725 -7374058 -6236033 -5144686 -4219972 -3388617
18625 -3388617 -2911141 -2459838 -2321842 -2101303 -1699455 -1194916 -563878 115282 701337
18616 701337 1246391 1870129 2633248 3462490 4403922 5460995 6730435 7883420 8957601
18607 8957601 9984128 11033842 12145621 13427558 14600771 15753180 16950208 18204249
18599 18204249 19487219 20897344 22412023 23745826 24988836 26039732 26752068 27278207
18591 27278207 28139459 29650048 31541374 33495622 35228650 36673676 37654789 38997868
18583 38997868 41050810 43387482 45859849 48580698 51545808 54944358 58747538 62898885
18575 62898885 67425308 72282469 77424699 82434290 85966099 85514784 76652574 53626368
18567 53626368 11721128 -44450256 -94531873 -122787299 -132749485 -131278085 -121206471
18560 -121206471 -105925317 -89385852 -73939423 -60479174 -48927328 -38828763 -29952358
18553 -29952358 -22248516 -14952252 -7396469 124789 7070074 12319619 13288472 5805303
18545 5805303 -15227826 -52925170 -99568689 -136069981 -153985213 -159008518 -155653492
18538 -155653492 -146061969 -132697296 -118755541 -106211367 -95548717 -86565277 -79112727
18531 -79112727 -73098148 -68055895 -63095540 -58469549 -54551214 -50945398 -47621780 -44693781
18523 -44693781 -42031199 -39625971 -37398484 -35059132 -32732742 -30610606 -28723865 -27441639
18515 -27441639 -26856524 -26040723 -24403074 -22440804 -20695211 -18985581 -17620158 -16752185
18507 -16752185 -16213865 -15323832 -14312189 -13451202 -12817479 -12190008 -11464843 -10784942 -10058624
18498 -10058624 -9136556 -8127418 -7303332 -6664260 -6254386 -6054263 -6114211 -6289090 -6467586
18489 -6467586 -6435003 -6077729 -5526858 -4897984 -4311199 -3789940 -3506027 -3684061 -3957476 -4006965
18479 -4006965 -3694280 -2940633 -1724753 -241124 1160961 2182366 2946823 3447941 3590431
18470 3590431 3482850 3268769 2981910 2796602 3032263 3526119 4339922 5328938 6569750
18461 6569750 7733568 8657651 9278761 9945747 10870193 12134759 13562812 15118846 16882128
18452 16882128 18695039 20467756 22189660 23894439 25594359 27287983 28983958 30843303
18444 30843303 32819820 34842051 36990796 39158902 41373243 43647982 45798523 47613091
18436 47613091 48732349 48914605 48332279 46992889 44886938 41010072 35177527 28952609
18428 28952609 24856960 23351064 22690194 20607580 14901285 3582226 -12586055 -28824226
18420 -28824226 -38958445 -41916537 -39923288 -34874703 -28096738 -21243844 -15747424 -12366445
18412 -12366445 -10864874 -10918859 -11737267 -11725940 -10286530 -7723262 -4360633 -468142 3636210
18403 3636210 7747243 11608044 15431115 19240855 22915884 26487076 30160566 33614580
18395 33614580 36817658 39557000 41622618 42950405 43778891 44948790 46605065 48473875
18387 48473875 50490227 52680048 54744106 55149678 52061182 43874895 30475455 12530779
18379 12530779 -10917424 -41658851 -77501574 -110675230 -134200960 -146348667 -147989431
18372 -147989431 -142191664 -133044725 -124891473 -121312391 -123214979 -129115120 -135004161 -136965318
18364 -136965318 -134825536 -129724101 -122084715 -112735498 -103275944 -94667258 -86832122 -79615947
18356 -79615947 -73246999 -67786534 -63273562 -59337510 -56026597 -53171134 -50771300 -48644332
18348 -48644332 -46582612 -44255354 -41613307 -38560455 -35075387 -31233572 -27767350 -25458035
18340 -25458035 -25138877 -27335536 -31071991 -34357777 -35604398 -34935151 -33678516 -34247519
18332 -34247519 -39168832 -50036498 -66146390 -85490410 -104768218 -120754437 -133442669
18325 -133442669 -144348398 -151741091 -152791200 -148067962 -140604971 -132140964 -123021114 -114124586
18317 -114124586 -106659418 -101028512 -96829705 -93515335 -90635332 -87653481 -84458459 -81435563
18309 -81435563 -78938535 -77241976 -76518363 -76907569 -77980146 -79428139 -81276175 -83316980
18301 -83316980 -85252720 -86681503 -87164304 -86805060 -85601117 -83674936 -81427971 -78831334
18293 -78831334 -76241633 -73932817 -71752875 -69722176 -67818002 -66211435 -64904351 -63887212
18285 -63887212 -63305130 -62729306 -62117298 -61234153 -59729460 -57678159 -55128046 -52305107 -49269261
18276 -49269261 -46227199 -43148622 -39979705 -36844360 -33815698 -30675641 -27645170 -24671269
18268 -24671269 -21621376 -18637873 -15744778 -13008607 -10637794 -8855245 -8192326 -9484282
18260 -9484282 -13573710 -20050155 -26740926 -31271820 -33285003 -34158313 -35561707 -39382359
18252 -39382359 -47824833 -62133543 -79502624 -93451958 -100618591 -102278490 -100592819 -97599574
18244 -97599574 -95366763 -95767567 -98816790 -101901593 -102390525 -100352405 -96879163 -92533996
18236 -92533996 -87877709 -83542189 -79602356 -75687791 -71877901 -68262692 -64827132 -61616056
18228 -61616056 -58486153 -55574518 -52842123 -50092949 -47308935 -44877144 -43153862 -42694959
18220 -42694959 -43976072 -46863054 -49932643 -51520914 -51293254 -49892301 -47670530 -44984690
18212 -44984690 -41973282 -39485803 -38390023 -39889818 -45390284 -55767085 -70863074 -89482174
18204 -89482174 -110061399 -128633858 -140536254 -145043214 -144272346 -139631755 -132469507 -124165040
18196 -124165040 -116226702 -108955108 -102616694 -97214880 -92883279 -90089344 -88927467 -89489354
18188 -89489354 -90852751 -91682329 -91153065 -89593734 -87315630 -84742627 -82067587 -79211423
18180 -79211423 -76627790 -74130627 -71771697 -69432521 -67150127 -65001878 -62906913 -60877025
18172 -60877025 -58868360 -57049144 -55549728 -54685817 -54850345 -56255798 -58491081 -60225888
18164 -60225888 -60821212 -60736893 -60496975 -60810909 -62484709 -66413738 -72016265 -76933273 -79584917
18155 -79584917 -80491353 -80242621 -79220511 -78104171 -77659787 -78073863 -78345347 -77605599 -76105828
18146 -76105828 -74138570 -71978974 -69827518 -67953904 -66600415 -65472024 -64490022 -63739040
18138 -63739040 -63053681 -62482739 -61908425 -61506576 -61292013 -61261269 -61308350 -61469217 -61684140 -61646664
18128 -61646664 -61355373 -60983629 -60503307 -60015723 -59452432 -58833172 -58333502 -57756723 -57063379
18119 -57063379 -56414734 -55653166 -54907370 -54115599 -53317876 -52741517 -52165310 -51556732 -50983131
18110 -50983131 -50463213 -49987005 -49413634 -48910573 -48425617 -47853923 -47210007 -46774110 -46315883
18101 -46315883 -45913134 -45606033 -45290966 -45037622 -44878443 -44643162 -44340789 -44009911 -43684974
18092 -43684974 -43387643 -43216698 -43238822 -43571445 -44151248 -45077487 -46084346 -47306079 -48531600
18083 -48531600 -49495353 -50165397 -50435774 -50314946 -49974072 -49465371 -48874242 -48204876 -47612255
18074 -47612255 -47032869 -46404835 -45914380 -45526437 -45181190 -44844742 -44412988 -43823275 -43377579
18065 -43377579 -43012034 -42409688 -41823306 -41412628 -41025837 -40650855 -40217215 -39733821 -39338800
18056 -39338800 -38939417 -38466725 -38073057 -37816306 -37489959 -37252398 -37013973 -36852878 -36825411
18047 -36825411 -36820946 -36753409 -36764322 -36777660 -36906475 -37063247 -37222783 -37461486 -37713063 -38017188
18037 -38017188 -38246529 -38462607 -38433863 -38293073 -38207120 -38094854 -38018769 -37772285 -37486635 -37208199
18027 -37208199 -36973456 -36614875 -36270881 -35963414 -35676955 -35421697 -35194436 -34931239 -34774967
18018 -34774967 -34689523 -34592170 -34527702 -34427829 -34222358 -33920659 -33645799 -33369640 -33179341 -33011124
18008 -33011124 -32705557 -32476554 -32387335 -32235219 -32014530 -31911835 -31779636 -31533477 -31308455
17999 -31308455 -31250080 -31129093 -31082737 -30942528 -30758850 -30606163 -30506979 -30332848 -30220392 -30087571
17989 -30087571 -29952617 -29838371 -29757274 -29587932 -29419813 -29238862 -29056683 -28896290 -28718105
17980 -28718105 -28589371 -28436680 -28237941 -28003835 -27861043 -27812268 -27688347 -27547213 -27462824 -27316785
17970 -27316785 -27157124 -27003840 -26943546 -26711980 -26463533 -26269863 -26133923 -25988108 -25859373
17961 -25859373 -25618571 -25564132 -26092101 -27189153 -28118650 -28145170 -28056569 -27980727 -27732817 -27226808
17951 -27226808 -26834047 -26499714 -26284404 -26173001 -25924330 -25677096 -25539560 -25364616 -25167677
17942 -25167677 -25048743 -24870730 -24604163 -24275188 -24024042 -24002090 -24423028 -25380192 -26189719
17933 -26189719 -26294026 -26075775 -25822243 -25463662 -25029097 -24677127 -24723886 -25392487 -26305730
17924 -26305730 -26614962 -26511150 -26283295 -25975502 -25644416 -25360358 -25017145 -24691384 -24368008
17915 -24368008 -24141307 -23952950 -23884717 -23695706 -23549456 -23392266 -23239010 -23062337 -22849823
17906 -22849823 -22805576 -22916413 -23301809 -24108426 -25050964 -25304349 -25210158 -24982532 -24685823 -24365192
17896 -24365192 -24116081 -23946389 -23759361 -23564710 -23469895 -23273465 -22940790 -22821781 -22655797
17887 -22655797 -22414358 -22236096 -22181661 -22206692 -22231407 -22303836 -22345542 -22180779 -22061132 -21979329
17877 -21979329 -21855812 -21756400 -21636026 -21515184 -21353501 -21312764 -21295282 -21312301 -21290048 -21200168
17867 -21200168 -21150558 -21055425 -20934124 -20910048 -20876148 -20917230 -21021994 -21178143 -21286516 -21319499
17857 -21319499 -21286932 -21189282 -21159712 -20969225 -20864175 -20849151 -20834732 -20981595 -21089098 -21032874
17847 -21032874 -20858470 -20716265 -20574666 -20458423 -20308316 -20132626 -20047998 -19986866 -19835483 -19710335
17837 -19710335 -19640130 -19564911 -19453933 -19213929 -19179586 -19059960 -18943832 -18939146 -18917785 -19026724
17827 -19026724 -19106561 -19009343 -18841750 -18871121 -18830714 -18662976 -18561290 -18488926 -18369954 -18176601
17817 -18176601 -18075342 -18050556 -18039622 -17988281 -17915640 -17878343 -17734462 -17631400 -17564289 -17430220
17807 -17430220 -17308591 -17336396 -17304216 -17297246 -17184564 -17007789 -16846272 -16723225 -16616450 -16587126
17797 -16587126 -16405827 -16215971 -16085480 -15939979 -15853315 -15793240 -15692095 -15499034 -15380234 -15261542
17787 -15261542 -15096187 -15072401 -14955745 -14812734 -14598570 -14427105 -14274414 -14093594 -13916373
17778 -13916373 -13769012 -13594775 -13532105 -13479451 -13412310 -13425129 -13455784 -13627909 -13664704 -13853200
17768 -13853200 -14276077 -14993996 -15808651 -16806567 -18026557 -19373358 -20621337 -21850732 -22913657
17759 -22913657 -23841689 -24349125 -24510722 -24433637 -24309803 -24119451 -23866375 -23557495 -23121591
17750 -23121591 -22885172 -22806254 -22835044 -22884822 -23158093 -23660091 -24169708 -25025311 -26023597 -27001022
17740 -27001022 -28023455 -29027650 -29895482 -30541183 -30711285 -30589368 -30479962 -30221453 -29790927
17731 -29790927 -29362452 -28791421 -28352878 -27985807 -27603630 -27131608 -26718200 -26288174 -25801188
17722 -25801188 -25360173 -25040624 -24745039 -24506120 -24299521 -24041252 -23852089 -23496440 -23143182
17713 -23143182 -22951556 -22660437 -22489093 -22303813 -22187747 -22129063 -22032070 -21811871 -21698053 -21707628
17703 -21707628 -21630955 -21530001 -21436954 -21315483 -21139678 -21103918 -21035729 -20940299 -20881711 -20892505
17693 -20892505 -20878513 -20677309 -20533650 -20586121 -20424416 -20247933 -20152657 -20083516 -20067041 -20066676 -19968886
17682 -19968886 -19864486 -19748457 -19585011 -19459463 -19323925 -19203538 -19158046 -19187207 -19135107 -19072380
17672 -19072380 -18996813 -18803272 -18769805 -18781256 -18705887 -18568226 -18509811 -18469216 -18291464 -18266399
17662 -18266399 -18321702 -18327736 -18406582 -18384599 -18350541 -18255531 -18126900 -18037104 -17998958 -17954029 -17840985
17651 -17840985 -17760362 -17775416 -17850592 -17801641 -17749953 -17672537 -17608582 -17585267 -17547664 -17648962 -17619304
17640 -17619304 -17527325 -17494685 -17452220 -17316510 -17338009 -17300744 -17249608 -17304035 -17262264 -17117948 -17149758
17629 -17149758 -17127334 -17052299 -17147499 -17209578 -17056046 -16984292 -16976004 -16958973 -16976192 -16947796 -16830252
17618 -16830252 -16804676 -16733862 -16697503 -16710848 -16632562 -16518975 -16439231 -16456250 -16484572 -16484898 -16416075
17607 -16416075 -16343815 -16326192 -16260873 -16263757 -16331729 -16382206 -16273116 -16179904 -16180514 -16137112 -16071512
17596 -16071512 -15979936 -15915570 -15934378 -15980465 -15993330 -15921312 -15894730 -15836582 -15726877 -15814384 -15837970
17585 -15837970 -15756884 -15670900 -15639487 -15629384 -15678625 -15636214 -15610725 -15607826 -15648534 -15655896 -15697544
17574 -15697544 -15576113 -15455135 -15485370 -15506425 -15492758 -15364732 -15231927 -15161238 -15073403 -15073133 -15148413
17563 -15148413 -15247129 -15182555 -15093081 -15079634 -15113254 -15156961 -15118330 -15056790 -15089655 -15141727 -15135646
17552 -15135646 -15073425 -14920270 -14883638 -14851088 -14659467 -14445496 -14478383 -14594107 -14666692 -14693054
17542 -14693054 -14710174 -14657083 -14532975 -14564124 -14635110 -14629904 -14562227 -14547203 -14553303 -14535616 -14553379
17531 -14553379 -14531082 -14530781 -14464375 -14395313 -14228902 -14148718 -14101848 -14019362 -14115378 -14184648 -14211519
17520 -14211519 -14315820 -14406758 -14370036 -14291141 -14298269 -14335625 -14162237 -14046011 -14122455 -14167442 -14104515
17509 -14104515 -14021542 -13939661 -13960121 -13957772 -13965167 -13992224 -13944850 -13987270 -13926955 -13889912 -13905779
17498 -13905779 -13978756 -13989664 -13936779 -13869216 -13816982 -13834391 -13749885 -13684296 -13750568 -13759391 -13687228
17487 -13687228 -13627642 -13568458 -13625365 -13652942 -13694777 -13579491 -13504883 -13536789 -13550719 -13540665 -13517661
17476 -13517661 -13487477 -13539721 -13550780 -13485867 -13510042 -13580152 -13482668 -13326925 -13302375 -13244099 -13190429
17465 -13190429 -13151805 -13145359 -13158760 -13143742 -13138510 -13071314 -13081912 -13127156 -13114023 -13067608 -12991820
17454 -12991820 -12937842 -12947856 -12982440 -12944439 -12972766 -12913269 -12964033 -13022899 -13022641 -12988726 -12992421 -12920331
17442 -12920331 -12875311 -12815588 -12804722 -12839631 -12834737 -12779054 -12789768 -12835178 -12799408 -12757190 -12654060
17431 -12654060 -12673951 -12681630 -12674258 -12532008 -12576515 -12565894 -12594750 -12709383 -12687364 -12560568 -12457440
17420 -12457440 -12524179 -12618777 -12536756 -12446129 -12484422 -12553162 -12519485 -12466734 -12319715 -12303420 -12289041
17409 -12289041 -12345760 -12425303 -12544872 -12613319 -12538434 -12407966 -12366603 -12361608 -12358372 -12375376 -12387188
17398 -12387188 -12358408 -12271069 -12229767 -12284883 -12366967 -12360644 -12328069 -12298237 -12367150 -12418415 -12276347
17387 -12276347 -12157206 -12093833 -12076907 -12055161 -12057490 -12021471 -12100354 -12174709 -12161444 -12166577 -12093016
17376 -12093016 -12062693 -11996847 -11991194 -12082227 -12049237 -12029214 -12086565 -12023924 -12022971 -12098572 -12158697 -12113628
17364 -12113628 -11977207 -12035480 -12063045 -12003766 -12034710 -12093353 -12123194 -12085858 -11886700 -11915129 -11971834
17353 -11971834 -11987329 -11961000 -11813722 -11812571 -11746508 -11754023 -11757692 -11690575 -11648310 -11692153 -11671454
17342 -11671454 -11646025 -11768947 -11731919 -11650226 -11718145 -11756989 -11654465 -11637958 -11670786 -11715819 -11721305
17331 -11721305 -11711820 -11730840 -11673088 -11593837 -11517932 -11502671 -11475792 -11439947 -11464774 -11491827 -11515875
17320 -11515875 -11453112 -11301843 -11283322 -11373322 -11374428 -11367710 -11368072 -11370581 -11379958 -11369505 -11354350 -11354358 -11467429
17307 -11467429 -11456057 -11307784 -11346516 -11367284 -11237278 -11147528 -11172349 -11231317 -11273982 -11283256 -11170164
17296 -11170164 -11164189 -11159653 -11206859 -11251894 -11335216 -11356624 -11299381 -11273054 -11257569 -11291993 -11260256
17285 -11260256 -11194484 -11186817 -11182915 -11095825 -11074311 -11120598 -11016347 -10809126 -10799118 -10917637 -11009674
17274 -11009674 -10991296 -11025342 -10921199 -10893885 -10934970 -10952297 -11037796 -10984029 -10949223 -10953362 -10948601
17263 -10948601 -10930944 -10925488 -10820159 -10881608 -10940005 -10892897 -10836247 -10833497 -10832782 -10848168 -10824154 -10774269
17251 -10774269 -10743670 -10783935 -10765814 -10758656 -10677993 -10710712 -10758366 -10764680 -10742341 -10752125 -10820132 -10898019
17239 -10898019 -10871833 -10699877 -10641021 -10634168 -10678900 -10639998 -10629710 -10650191 -10605825 -10593840 -10615513
17228 -10615513 -10661104 -10608740 -10559800 -10529287 -10515880 -10574648 -10539828 -10573148 -10595837 -10574802 -10529689
17217 -10529689 -10631233 -10621688 -10637369 -10587240 -10535115 -10562861 -10635887 -10590021 -10498889 -10524845 -10495203
17206 -10495203 -10421487 -10445483 -10518836 -10533087 -10516446 -10466351 -10450209 -10483880 -10443698 -10347310 -10367408
17195 -10367408 -10391422 -10323005 -10357380 -10418701 -10475765 -10523412 -10467425 -10376324 -10374018 -10374394 -10460493 -10541371
17183 -10541371 -10499967 -10386237 -10312553 -10404100 -10419792 -10389209 -10359379 -10365618 -10384284 -10433843 -10503621
17172 -10503621 -10466231 -10296171 -10107167 -10117853 -10201768 -10243921 -10340092 -10288294 -10292230 -10145821 -10036882
17161 -10036882 -10089475 -10138265 -10104119 -10058467 -10115245 -10213918 -10301808 -10209389 -10169175 -10256117 -10250612
17150 -10250612 -10269062 -10211929 -10109326 -10028699 -10094577 -10235021 -10152408 -10043950 -10083176 -10114250
17140 -10114250 -10105211 -10089242 -10038778 -10076613 -10125910 -10054975 -10038619 -9980743 -10019844 -9944525 -9986793
17129 -9986793 -9992766 -10122351 -10150293 -10068197 -9953422 -9923689 -9881848 -9950017 -9909904 -9857997 -9912648
17118 -9912648 -9872296 -9890440 -9911261 -9809648 -9756064 -9768657 -9845843 -9872169 -9785828 -9754782 -9759197
17107 -9759197 -9780777 -9875909 -9899327 -9849883 -9901694 -9795115 -9584976 -9606101 -9666498 -9705326 -9726412
17096 -9726412 -9720086 -9749387 -9721867 -9738778 -9762823 -9711299 -9674755 -9672414 -9689067 -9715510 -9719644 -9680683
17084 -9680683 -9647159 -9555358 -9587211 -9677241 -9601678 -9507470 -9576227 -9643832 -9587082 -9587718 -9553787 -9630080
17072 -9630080 -9656163 -9714501 -9732542 -9764701 -9784629 -9706434 -9670676 -9718453 -9663534 -9586485 -9596411
17061 -9596411 -9536279 -9515171 -9519703 -9583228 -9617021 -9574749 -9549771 -9514012 -9543182 -9634613 -9691321
17050 -9691321 -9731053 -9691884 -9600557 -9600235 -9661742 -9645553 -9623848 -9521884 -9552640 -9618544 -9592776
17039 -9592776 -9666315 -9698367 -9673259 -9612849 -9597261 -9517809 -9440721 -9405958 -9484797 -9578444 -9582057
17028 -9582057 -9544430 -9486818 -9443582 -9472850 -9562035 -9618784 -9567791 -9527416 -9501607 -9527716 -9486656
17017 -9486656 -9411633 -9392515 -9412379 -9494760 -9444125 -9369741 -9368467 -9359000 -9396050 -9477665 -9452935 -9404294
17005 -9404294 -9408484 -9468914 -9458432 -9473926 -9420174 -9380284 -9416843 -9447601 -9495665 -9471496 -9360537
16994 -9360537 -9437768 -9578645 -9537199 -9416768 -9381590 -9497365 -9535252 -9500137 -9370976 -9438754
16984 -9438754 -9462836 -9431582 -9436550 -9410814 -9522478 -9578110 -9552854 -9525785 -9514785 -9428972 -9369292
16973 -9369292 -9351556 -9335414 -9283476 -9346762 -9347382 -9316128 -9245747 -9218044 -9223965 -9218426 -9334095 -9397302
16961 -9397302 -9311862 -9299048 -9298310 -9326616 -9311150 -9340100 -9225591 -9120763 -9160558 -9287007 -9365743
16950 -9365743 -9337057 -9283905 -9341520 -9294351 -9264810 -9264970 -9244516 -9182237 -9203943 -9233470 -9229173 -9202469
16938 -9202469 -9215908 -9201293 -9190220 -9215163 -9231266 -9189157 -9214346 -9315076 -9261301 -9241810 -9202828
16927 -9202828 -9228897 -9223457 -9128826 -9056383 -9095100 -9247630 -9320777 -9315386 -9215813 -9180749 -9281071
16916 -9281071 -9265657 -9222254 -9200366 -9237999 -9293038 -9310492 -9260986 -9216706 -9115771 -9109063 -9088174
16905 -9088174 -9049633 -9134093 -9253849 -9174465 -9101441 -9099660 -9158821 -9273634 -9351425 -9384898 -9341270
16894 -9341270 -9343026 -9274715 -9260532 -9289752 -9245025 -9212566 -9102868 -8957526 -9072781 -9063478 -9049232
16883 -9049232 -9024439 -8997445 -8978174 -9049710 -9068021 -9117688 -9110217 -9118036 -9166729 -9170487 -9187790 -9137494
16871 -9137494 -9080819 -9028162 -9061949 -9037472 -9006492 -9076510 -9086066 -9063256 -9047913 -9093705 -9154870
16860 -9154870 -9076891 -9065647 -9072222 -9112836 -9219136 -9288733 -9204857 -9208693 -9264340 -9174026 -9106022
16849 -9106022 -9050248 -9047405 -9002698 -9027937 -9042874 -9058797 -9053374 -9093287 -9141014 -9102449 -9055117 -9045233
16837 -9045233 -9099270 -9194116 -9227044 -9215384 -9161425 -9149960 -9119996 -9034144 -8998636 -9039641 -9020942
16826 -9020942 -9042241 -9114930 -9105828 -9084345 -9111773 -9054558 -8962147 -8982293 -9037818 -9072742 -9059924
16815 -9059924 -9018358 -8940260 -8943793 -8998693 -9020561 -8985408 -9130546 -9181246 -9147855 -9035219 -9038227
16804 -9038227 -9029367 -8855215 -8791733 -8857844 -8954180 -9007593 -8982928 -8936641 -8915141 -8943951 -9010853
16793 -9010853 -9105285 -9145024 -9115073 -8976899 -8905313 -8950088 -8915065 -8908502 -8947603 -8953859 -8999004
16782 -8999004 -9068600 -9015746 -9015115 -9051168 -9107607 -9129439 -9090918 -9012093 -9055658 -9128583 -9151983 -9127473
16770 -9127473 -8980597 -8934888 -9043807 -8970326 -8967651 -9065303 -9066472 -8945425 -8978430 -9002352 -8928265
16759 -8928265 -8906254 -9033816 -9088441 -8976520 -8999746 -9050668 -9012253 -9032636 -9058093 -9048146 -9001959
16748 -9001959 -9069668 -9102612 -9036843 -9050730 -8963978 -8989312 -9050821 -9006939 -8979404 -8922494 -8974056
16737 -8974056 -9057710 -9012973 -9103876 -9134639 -9040691 -8946991 -8963166 -8884924 -8834109 -8837471 -8911129
16726 -8911129 -9012166 -9083416 -9082021 -9083345 -9047000 -8971302 -8942510 -8951788 -9015827 -9087026 -9150019 -9096326
16714 -9096326 -9059004 -9098438 -9140735 -9109691 -9119094 -9096086 -9057547 -8972194 -8962638 -9065497 -9053124
16703 -9053124 -9013536 -8960678 -9021258 -9007472 -9059735 -8954355 -8902254 -8900619 -8949771 -8916353 -8988347
16692 -8988347 -8975993 -8923281 -8974533 -8979638 -8899154 -8812699 -8874787 -8941034 -9009842 -9032693 -9016945
16681 -9016945 -8969522 -9014448 -9084855 -9092420 -9093787 -9146020 -9084876 -9094701 -9011306 -9009119 -9032172 -8961032
16669 -8961032 -8910709 -8892445 -8935993 -9013262 -9047427 -8989058 -9005959 -9068123 -9108298 -9084098 -8961578
16658 -8961578 -8914983 -8888633 -8904214 -9016677 -9042767 -9007526 -8970305 -8921867 -8941781 -9012142 -9007794
16647 -9007794 -8953138 -8976526 -9068842 -9102531 -9092040 -9093588 -9051566 -8989120 -9000594 -9135729 -9178295
16636 -9178295 -9018973 -8917921 -8968281 -9030882 -8988507 -8976390 -9058307 -9141660 -9122930 -9117380 -9100493
16625 -9100493 -9070406 -8993562 -8943261 -8946171 -8908296 -8913973 -8929787 -8966073 -9010576 -8970123 -8935260 -8998493
16613 -8998493 -8988621 -9025316 -9046100 -9024271 -9015900 -8885562 -8856620 -8926772 -8947748 -9021782 -9034912
16602 -9034912 -9034135 -8899769 -8931934 -9075199 -9149186 -9153741 -9111848 -9058649 -9043637 -9027328 -9020399 -9010553
16590 -9010553 -9160867 -9090966 -8990358 -8968653 -8983696 -9029616 -8896231 -8764745 -8800425 -8768138
16580 -8768138 -8843757 -8889242 -8956125 -8985631 -9052546 -9061993 -8976596 -8943325 -8892368 -8943830 -9016813
16569 -9016813 -9074628 -9041281 -9155206 -9212340 -9161624 -9099496 -9033410 -8992764 -9032357 -9064351 -9130113
16558 -9130113 -9106945 -9077432 -9114142 -9103930 -9046779 -9055652 -9014916 -8983205 -9060419 -9129518 -9179105
16547 -9179105 -9268526 -9294823 -9312802 -9190665 -9095009 -9088018 -9057381 -9087341 -9025109 -9021808 -9085528
16536 -9085528 -9121876 -9074258 -9085511 -9112205 -9120018 -9063374 -9054100 -9090663 -9018623 -9001607 -8978740 -8952583
16524 -8952583 -8890144 -8857610 -8804182 -8900123 -8927241 -8940764 -8963086 -8979589 -8871801 -8864364 -8993051
16513 -8993051 -8950445 -8822888 -8953304 -9080752 -9092822 -9030605 -9008795 -9002571 -9021368 -8962569 -9047073
16502 -9047073 -9045752 -8976339 -9004502 -9019554 -8971607 -9016520 -9022729 -8985939 -9065498 -9101824 -9086976 -9054618
16490 -9054618 -9004364 -9060131 -9088726 -9009133 -9054973 -9081693 -9108598 -9129551 -9090248 -9067018 -9090607
16479 -9090607 -9127024 -9143522 -9150023 -9144557 -9129832 -9141845 -9128347 -9158034 -8999172 -8983830 -8998657
16468 -8998657 -8988183 -9038429 -9119901 -9126300 -9014209 -8880061 -8993174 -9187691 -9186235 -9070749 -9111024
16457 -9111024 -9149050 -9086507 -9072644 -9022085 -9021774 -8948545 -8884793 -8858538 -8876571 -8824035 -8836365 -8976496
16445 -8976496 -9090487 -9102285 -9056937 -9007954 -9035749 -9064903 -9124998 -9075880 -9034835 -9060184 -9061911
16434 -9061911 -9050736 -9198123 -9271141 -9224138 -9163673 -9062212 -8974954 -8974064 -9002117 -8967953 -8978966
16423 -8978966 -8930135 -8893404 -9000871 -9098798 -9159020 -9049150 -9110750 -9233973 -9245883 -9179583 -9157240
16412 -9157240 -9125315 -9157848 -9159420 -9071227 -9003849 -9077151 -9086925 -9063299 -9112434 -9052160 -9039070 -9048040
16400 -9048040 -9018819 -9046006 -9019437 -9011785 -8953233 -9016511 -8934985 -8954533 -9126441 -9118610 -9104491
16389 -9104491 -9046521 -9029580 -9160054 -9227079 -9120281 -8989795 -8971082 -8971766 -9083499 -9059971 -8989895
16378 -8989895 -9036041 -9104962 -9108354 -9112136 -9152390 -9148182 -9101386 -9083171 -9124214 -9084987 -9036165 -9004387
16366 -9004387 -8924280 -9092125 -9162191 -9210400 -9255531 -9169400 -8996031 -9018699 -9075622 -9064410 -9207683
16355 -9207683 -9346232 -9236629 -9087217 -8957696 -8905483 -8872475 -8895090 -8981192 -9022313 -9005449
16345 -9005449 -9081456 -9119602 -9065875 -9020708 -9000067 -8960817 -8893045 -8901010 -8915693 -8997645 -9030089
16334 -9030089 -9044505 -9073919 -9108870 -9098085 -9070053 -9139916 -9139198 -9011622 -9052189 -9111424 -9137619
16323 -9137619 -9111822 -9078821 -9084212 -9090328 -9188122 -9181602 -9183752 -9158722 -9188785 -9149431 -9076509 -9020703
16311 -9020703 -8995247 -8971470 -8998157 -9091643 -9142203 -9130445 -9033100 -9019146 -8990255 -8964837 -8921146
16300 -8921146 -9016657 -8958457 -8999274 -9076251 -9077341 -9087300 -9046191 -9011148 -9014703 -9039698 -9002808 -8961409
16288 -8961409 -9000460 -9019080 -9017493 -9036038 -8956526 -8916150 -8831119 -8894648 -9072554 -9036181 -9092546
16277 -9092546 -9162373 -9077233 -9034932 -9028288 -9077232 -8996325 -9009679 -9117627 -9136669 -9128728 -9126779 -9133093
16265 -9133093 -9096395 -9063151 -9064844 -9130979 -9110476 -9084448 -9098938 -9186543 -9108665 -8989885 -8940533
16254 -8940533 -8911607 -8958773 -8920426 -8830770 -8893131 -8911121 -8827382 -8786057 -8876059 -8906173 -8915754
16243 -8915754 -9018040 -9063200 -8995916 -9059668 -8967619 -8925693 -8941145 -8956305 -8971984 -9102627 -9088972
16232 -9088972 -9020233 -8956804 -8925078 -8920039 -8858195 -8823028 -8911396 -9002498 -8994395 -8972523 -8929978 -8981771
16220 -8981771 -9015973 -8993426 -8958935 -8996498 -8984118 -8963487 -9038494 -9059892 -9067746 -9071434 -9059015 -9041348
16208 -9041348 -9122645 -9050059 -8971341 -8978993 -9015625 -9059481 -9034975 -9040169 -8973683 -8976682 -9090744 -9112795
16196 -9112795 -9286325 -9309357 -9234280 -9052151 -8984914 -9036634 -9110856 -9192368 -9162836 -9105730 -9104699
16185 -9104699 -9081074 -9038962 -8983724 -8912930 -8932412 -8914432 -8933239 -9020654 -9015610 -9039398 -9084064
16174 -9084064 -9079757 -9044165 -8954914 -8900206 -8875882 -8922528 -8983829 -8985538 -8996128 -8975915 -9033582 -9069516
16162 -9069516 -8958674 -8952642 -9064875 -9062749 -9068941 -9015353 -9044775 -9218901 -9263972 -9216505 -9244042
16151 -9244042 -9169642 -9161868 -9146619 -9127276 -9083431 -9095191 -9075748 -9056204 -9085621 -9110789 -9081417
16140 -9081417 -8979949 -8955492 -8905951 -8919772 -8886285 -8923480 -8937049 -8999479 -8967109 -8959028 -9017104
16129 -9017104 -8990859 -8992676 -8946172 -8959864 -8972464 -9034928 -8976640 -8939337 -9080772 -9058814 -9040012
16118 -9040012 -8952028 -8980614 -9035658 -9020960 -9007711 -9063149 -8983403 -9039624 -9055762 -9042550 -9001547
16107 -9001547 -8890962 -8942953 -9002263 -8991245 -8965483 -8980859 -9061077 -9030978 -8982597 -8902924 -8849632
16096 -8849632 -8926783 -8930688 -8997609 -9034149 -8921759 -8918531 -8940298 -9000950 -9091085 -9054783 -9014631
16085 -9014631 -8902811 -8893249 -8925245 -8963063 -9025514 -9028334 -9046074 -9064287 -8990047 -8967340 -9016433
16074 -9016433 -8992375 -8970036 -9105907 -9140003 -9050529 -8925293 -8835625 -8781832 -8786482 -8811027 -8905007
16063 -8905007 -8938037 -8924701 -8877607 -8979592 -8913828 -8925800 -8953581 -8937919 -8918657 -8926188 -8989981
16052 -8989981 -8979706 -9056367 -8978123 -8989272 -8947437 -8962692 -9048475 -9111632 -8959993 -8856645 -8842110
16041 -8842110 -8803456 -8784518 -8718768 -8762424 -8907145 -8879386 -8853013 -8845289 -8794630 -8830214 -8759167
16030 -8759167 -8776291 -8803357 -8818671 -8812162 -8840077 -8892280 -8880118 -8901382 -8875254 -8862086 -8882379
16019 -8882379 -8898477 -8866048 -8907208 -8915746 -8851189 -8823653 -8826567 -8875014 -8904404 -8879461 -8930012 -8959851
16007 -8959851 -8914347 -8922556 -8873937 -8763075 -8836039 -8859605 -8887943 -8927405 -8965725 -9004292 -8961520
15996 -8961520 -8944876 -8938165 -8941203 -8964940 -8957734 -8867081 -8829832 -8840176 -8866218 -8990139 -8888647
15985 -8888647 -8779120 -8843428 -8897194 -8895157 -8900863 -8930038 -8905994 -8894950 -8902618 -8866943 -8808586 -8787111
15973 -8787111 -8800291 -8780718 -8809132 -8726933 -8674577 -8707264 -8806338 -8831470 -8906967 -8898639 -8868206
15962 -8868206 -8853044 -8803585 -8740448 -8868452 -8934882 -8854173 -8795285 -8824602 -8824308 -8850534 -8873398
15951 -8873398 -8882175 -8843121 -8802931 -8752231 -8758963 -8750722 -8714570 -8735034 -8796463 -8737358 -8711088 -8646741
15939 -8646741 -8583188 -8642540 -8713785 -8852465 -8996619 -8940711 -8860799 -8907976 -8959557 -8965739 -8903697
15928 -8903697 -8820592 -8759702 -8724959 -8772260 -8827449 -8711133 -8739833 -8760454 -8905061 -8962322 -8976191
15917 -8976191 -8903412 -8871509 -8924346 -8869290 -8834837 -8836298 -8905590 -8804277 -8778299 -8853663 -8843763
15906 -8843763 -8806945 -8721544 -8584282 -8708978 -8777619 -8762270 -8704461 -8699566 -8771310 -8826558 -8828273
15895 -8828273 -8789503 -8750534 -8719927 -8749350 -8758699 -8884866 -8889575 -8888719 -8835337 -8750242 -8771130 -8838646
15883 -8838646 -8770332 -8672463 -8616227 -8505945 -8517658 -8534704 -8572086 -8656158 -8644182 -8562269 -8545848
15872 -8545848 -8518400 -8511565 -8641835 -8663781 -8642559 -8589685 -8684796 -8784654 -8731619 -8653211 -8605339
15861 -8605339 -8681524 -8747855 -8746358 -8706408 -8691252 -8691502 -8708625 -8741857 -8773520 -8703435 -8694590 -8642284
15849 -8642284 -8621702 -8656594 -8660188 -8684845 -8741958 -8736561 -8684124 -8645783 -8576832 -8627016 -8674369 -8693793
15837 -8693793 -8780456 -8773521 -8722284 -8681077 -8638993 -8568215 -8522048 -8584083 -8550893 -8495390 -8576214
15826 -8576214 -8655353 -8682860 -8673394 -8680686 -8663974 -8710176 -8720859 -8747988 -8762965 -8688347 -8650008 -8613376
15814 -8613376 -8657271 -8690413 -8584412 -8552174 -8569844 -8575974 -8494456 -8460384 -8466792 -8564950 -8720031
15803 -8720031 -8643774 -8622308 -8710446 -8594656 -8499131 -8461093 -8481713 -8490113 -8455762 -8423656 -8412991
15792 -8412991 -8433138 -8396474 -8334568 -8386576 -8447264 -8456512 -8526622 -8601154 -8542661 -8416628 -8348023
15781 -8348023 -8401839 -8446351 -8459527 -8378490 -8450537 -8429294 -8390134 -8390507 -8458584 -8408959 -8369356 -8389379
15769 -8389379 -8356973 -8315017 -8252171 -8275005 -8252477 -8299207 -8421753 -8441287 -8377695 -8436343 -8474951
15758 -8474951 -8459955 -8409861 -8399158 -8416815 -8329037 -8311081 -8349678 -8415282 -8312289 -8330324 -8362178
15747 -8362178 -8327073 -8241510 -8243348 -8271430 -8372946 -8444067 -8472053 -8424469 -8329710 -8343146 -8376326
15736 -8376326 -8461493 -8511395 -8494833 -8515223 -8496117 -8465702 -8474341 -8482453 -8484574 -8464208 -8433460 -8401181
15724 -8401181 -8360774 -8407362 -8461550 -8524063 -8632206 -8618752 -8537269 -8537446 -8599943 -8591855 -8428170
15713 -8428170 -8355054 -8401021 -8409100 -8308942 -8316503 -8356952 -8332660 -8287739 -8284134 -8319950 -8231746 -8227520
15701 -8227520 -8347446 -8402488 -8340909 -8271777 -8292181 -8331609 -8353599 -8336932 -8278887 -8358733 -8363069
15690 -8363069 -8318793 -8372337 -8440052 -8365070 -8290723 -8243358 -8230242 -8258784 -8322977 -8359347 -8332673
15679 -8332673 -8307138 -8363493 -8391922 -8328808 -8320881 -8352598 -8353225 -8439344 -8520603 -8562379 -8537957 -8508995
15667 -8508995 -8555853 -8563686 -8507629 -8437695 -8412378 -8461728 -8387995 -8255772 -8152094 -8208217 -8275985
15656 -8275985 -8262212 -8179601 -8167906 -8183538 -8292640 -8234220 -8169522 -8204597 -8309049 -8336386 -8299392
15645 -8299392 -8318239 -8226171 -8262401 -8410126 -8393185 -8491452 -8430109 -8318539 -8284455 -8248433 -8282132
15634 -8282132 -8312240 -8287257 -8215131 -8130372 -8172430 -8271072 -8333195 -8280064 -8194689 -8177840 -8176890 -8228727
15622 -8228727 -8226375 -8240968 -8305688 -8246858 -8152512 -8166805 -8224070 -8206419 -8182810 -8193864 -8218005
15611 -8218005 -8290472 -8245511 -8206794 -8218297 -8260751 -8361971 -8305305 -8148343 -8033338 -8090420 -8208717
15600 -8208717 -8252020 -8238263 -8254446 -8217217 -8128587 -8162086 -8184331 -8220360 -8257665 -8275484 -8216759
15589 -8216759 -8125839 -8176485 -8221644 -8266694 -8236581 -8187995 -8171666 -8150035 -8220855 -8281231 -8224612
15578 -8224612 -8191558 -8137763 -8130321 -8102397 -8159094 -8165903 -8165933 -8186061 -8216931 -8230802 -8196422 -8198598
15566 -8198598 -8141190 -8114381 -8060158 -7992318 -7946619 -7980119 -7959015 -8070439 -8191563 -8171607 -8127207
15555 -8127207 -8131878 -8152926 -8085749 -7992838 -8007405 -8162639 -8158767 -8030570 -8030069 -8025832 -8069798 -8103680
15543 -8103680 -8113179 -8094085 -8034528 -8081105 -8156129 -8241777 -8163705 -8077687 -8086634 -8187424 -8208222
15532 -8208222 -8143571 -8162571 -8166658 -8200343 -8157115 -8151210 -8226382 -8209985 -8143783 -8165340 -8191432 -8145744
15520 -8145744 -8046440 -8011246 -8061151 -8078412 -8043869 -8022159 -7942746 -7975207 -7956871 -7918471 -7973105
15509 -7973105 -8017541 -8006914 -8015913 -8022622 -8021324 -7983404 -8018194 -8030807 -8027116 -7975502 -7910558 -7927253
15497 -7927253 -8031120 -8085590 -8073044 -7924603 -7853936 -7866829 -7819786 -7919045 -7915573 -7867280 -7886767
15486 -7886767 -7943449 -7928261 -7888517 -7991021 -7980679 -7923764 -7945101 -7901222 -7874263 -7980367 -8061574
15475 -8061574 -8144231 -8077998 -7989053 -7915636 -7918278 -7933580 -7927725 -7965155 -8052157 -8207497 -8098753
15464 -8098753 -7924225 -7972882 -8028737 -7977644 -7907041 -7926046 -7891478 -7839137 -7918475 -8038077 -7975247
15453 -7975247 -7875404 -7816548 -7849750 -7812644 -7751820 -7800354 -7921860 -7923182 -7895275 -7862886 -7853812
15442 -7853812 -7927078 -7983483 -7944531 -7951337 -7915330 -7883126 -7864879 -7829104 -7813007 -7904951 -7973432
15431 -7973432 -7960290 -7887409 -7776725 -7700424 -7762924 -7775707 -7788446 -7828152 -7856743 -7876256 -7934370
15420 -7934370 -7966019 -7947288 -7870554 -7862721 -7899399 -7965214 -7957837 -7923694 -7913556 -7904221 -7801359 -7721578
15408 -7721578 -7656144 -7627632 -7803096 -7939934 -7869939 -7798518 -7821878 -7770608 -7761249 -7790572 -7842484
15397 -7842484 -7930647 -7948983 -7948878 -7845419 -7752910 -7848573 -7847670 -7792870 -7704684 -7628883 -7600928 -7647090
15385 -7647090 -7761894 -7808573 -7809695 -7807919 -7775764 -7735224 -7802490 -7912597 -7833719 -7752813 -7760518
15374 -7760518 -7755009 -7793664 -7829539 -7777281 -7755794 -7780139 -7848879 -7858967 -7730095 -7682435 -7733803
15363 -7733803 -7720580 -7768012 -7768864 -7768767 -7763831 -7748032 -7679064 -7625641 -7652292 -7745591 -7795881 -7750051
15351 -7750051 -7709336 -7684582 -7770410 -7805325 -7835250 -7819823 -7745409 -7713500 -7622241 -7569186 -7590925
15340 -7590925 -7607052 -7670666 -7767463 -7864389 -7879942 -7830654 -7803393 -7689065 -7630816 -7647400 -7673875
15329 -7673875 -7720224 -7738631 -7740953 -7790287 -7793974 -7808240 -7745751 -7726735 -7844230 -7876022 -7811105
15318 -7811105 -7772687 -7767565 -7800129 -7778628 -7736352 -7732441 -7724431 -7692807 -7691391 -7772620 -7692788 -7640900
15306 -7640900 -7671247 -7721337 -7708292 -7717834 -7794890 -7792296 -7781305 -7675613 -7590901 -7539283 -7539943 -7571793
15294 -7571793 -7599802 -7565356 -7598807 -7649081 -7655609 -7616887 -7526677 -7457403 -7444006 -7505635 -7556300
15283 -7556300 -7518474 -7489470 -7468048 -7560185 -7589504 -7602602 -7634154 -7694142 -7683293 -7635455 -7586308
15272 -7586308 -7499195 -7516894 -7598570 -7627844 -7610205 -7598129 -7581270 -7515839 -7550805 -7635019 -7612069
15261 -7612069 -7512665 -7511362 -7453029 -7429679 -7405923 -7468741 -7552943 -7544449 -7502850 -7594913 -7582578 -7492228
15249 -7492228 -7532407 -7561186 -7617595 -7629876 -7561428 -7569508 -7491200 -7516596 -7511596 -7544895 -7488913 -7445887
15237 -7445887 -7457453 -7408992 -7377240 -7406685 -7455050 -7454756 -7499429 -7514744 -7499741 -7502300 -7532558 -7465691
15225 -7465691 -7369987 -7466337 -7558842 -7537628 -7426725 -7463316 -7565594 -7533675 -7539002 -7522972 -7527425
15214 -7527425 -7522465 -7504894 -7556105 -7573627 -7532586 -7436205 -7388033 -7470693 -7444383 -7467102 -7538386
15203 -7538386 -7514337 -7514638 -7461392 -7460523 -7444606 -7442606 -7447239 -7376270 -7333225 -7322432 -7354976 -7392441
15191 -7392441 -7443911 -7492480 -7511208 -7543539 -7547433 -7518248 -7509932 -7480269 -7427293 -7447038 -7491872 -7527416
15179 -7527416 -7507831 -7391918 -7399592 -7453918 -7482756 -7454621 -7423879 -7363777 -7277431 -7222879 -7217784
15168 -7217784 -7189836 -7270358 -7315267 -7274048 -7235385 -7292671 -7319719 -7301470 -7324855 -7403760 -7329688
15157 -7329688 -7299824 -7241046 -7331138 -7312611 -7227161 -7250941 -7297562 -7253065 -7272901 -7228342 -7138123
15146 -7138123 -7140367 -7154984 -7218199 -7245519 -7258563 -7261187 -7237525 -7231370 -7285100 -7349794 -7275176 -7166692
15134 -7166692 -7159238 -7143365 -7144930 -7177185 -7192031 -7183358 -7168062 -7180277 -7286836 -7351403 -7279886 -7149714
15122 -7149714 -7178838 -7241800 -7227108 -7137011 -7262596 -7273165 -7343964 -7253491 -7214531 -7141391 -7131150
15111 -7131150 -7158572 -7176890 -7215137 -7238385 -7261835 -7310572 -7278379 -7249835 -7250522 -7159781 -7066953 -7054130
15099 -7054130 -7067795 -7149119 -7269672 -7270128 -7218834 -7232392 -7332042 -7300420 -7172838 -7123475 -7152217
15088 -7152217 -7194638 -7294004 -7308279 -7323620 -7238981 -7218121 -7228277 -7217083 -7185179 -7096344 -7120268
15077 -7120268 -7147453 -7141652 -7178819 -7241880 -7245396 -7237542 -7239586 -7225447 -7189651 -7218049 -7239286 -7253440
15065 -7253440 -7227607 -7163227 -7124246 -7108949 -7175484 -7183116 -7119979 -7133012 -7074857 -7061273 -7032220
15054 -7032220 -7099627 -7141151 -7196198 -7202600 -7160797 -7185610 -7198479 -7149523 -7170341 -7109916 -7058156
15043 -7058156 -6946601 -6893607 -6981227 -7016837 -6987558 -7020459 -7020142 -7112381 -7219497 -7219348 -7213047 -7135733
15031 -7135733 -7101852 -7165624 -7158795 -7183357 -7098113 -6953504 -6976139 -7086713 -7098478 -7074262 -7026062
15020 -7026062 -6961544 -7000914 -7074206 -7098862 -7072761 -7070912 -7100795 -7097144 -7001953 -7012929 -7135795
15009 -7135795 -7102342 -7029914 -6947194 -6952811 -6922037 -6999837 -7015318 -6976502 -6962444 -6931451 -6951345
14998 -6951345 -7053614 -7085291 -7087634 -7085169 -7081922 -7062735 -7008908 -6969120 -7002839 -7101139 -7162664 -7101056
14986 -7101056 -7143303 -7161696 -7003061 -7006030 -7024326 -7041190 -6999983 -6957555 -7010739 -7025962 -6985385
14975 -6985385 -7005727 -6981708 -6963165 -6931486 -6926800 -6954842 -6935785 -6927557 -6983986 -7025764 -6958670 -6954288
14963 -6954288 -6868975 -6957862 -7015337 -7055121 -7058439 -7007191 -7007909 -6972059 -7017410 -7055145 -7098861 -7054347
14951 -7054347 -7045777 -7079583 -7106102 -7038610 -7058395 -7113883 -7120583 -7102382 -7119175 -7026034 -6963232 -6940456
14939 -6940456 -6970665 -6979727 -6884785 -6894458 -6964361 -6955944 -6868981 -6911659 -6980923 -6987711 -6985045 -6931774
14927 -6931774 -6974162 -6976660 -6859147 -6821428 -6810971 -6833287 -6913407 -6918881 -6944428 -6946075 -6956687 -6956799
14915 -6956799 -6899173 -6817249 -6803788 -6720610 -6679593 -6749974 -6709469 -6702142 -6695053 -6706362 -6693452 -6841945
14903 -6841945 -6909286 -6975418 -6954869 -6890966 -6777101 -6703118 -6765417 -6894522 -6929142 -6880550 -6807868
14892 -6807868 -6829892 -6827037 -6830629 -6816399 -6735688 -6732258 -6823194 -6860820 -6843930 -6763152 -6789882 -6854406
14880 -6854406 -6850025 -6776591 -6659546 -6659726 -6759980 -6776485 -6764498 -6677254 -6715084 -6761856 -6670959
14869 -6670959 -6700662 -6720496 -6709321 -6694407 -6736325 -6844871 -6765239 -6673324 -6712407 -6674149 -6709779
14858 -6709779 -6641152 -6506135 -6564907 -6636252 -6706565 -6743048 -6755110 -6754198 -6807819 -6874807 -6902500
14847 -6902500 -6944344 -6869299 -6815492 -6732798 -6647069 -6685669 -6748911 -6797611 -6780551 -6760154 -6659040
14836 -6659040 -6683083 -6790644 -6693075 -6649341 -6699496 -6696845 -6737607 -6813327 -6781556 -6724425 -6760936
14825 -6760936 -6754684 -6723025 -6727201 -6712759 -6694086 -6691207 -6641697 -6647301 -6774285 -6666068 -6608041 -6603113
14813 -6603113 -6663787 -6778975 -6833229 -6788539 -6703643 -6651156 -6621131 -6688717 -6626944 -6667526 -6828874
14802 -6828874 -6719687 -6558851 -6572209 -6659519 -6677458 -6696312 -6749384 -6740791 -6661879 -6568683 -6623491
14791 -6623491 -6684078 -6676758 -6695326 -6781070 -6769927 -6682090 -6582776 -6655319 -6623804 -6559318 -6589173
14780 -6589173 -6609119 -6685929 -6719435 -6669897 -6703498 -6684515 -6560207 -6512169 -6505313 -6542300 -6624579
14769 -6624579 -6597565 -6495030 -6451356 -6550491 -6550290 -6567509 -6615971 -6624996 -6632175 -6608259 -6563602 -6499583
14757 -6499583 -6548846 -6637088 -6650926 -6658768 -6684169 -6705021 -6662451 -6609658 -6564458 -6494004 -6463672
14746 -6463672 -6421328 -6488436 -6575326 -6553873 -6528958 -6580557 -6628680 -6624899 -6658648 -6596974 -6503478
14735 -6503478 -6497043 -6501148 -6507618 -6495504 -6567870 -6609724 -6590937 -6532081 -6610768 -6560248 -6513552 -6491626
14723 -6491626 -6462495 -6459361 -6477028 -6569006 -6624412 -6578770 -6445669 -6339439 -6446143 -6451816 -6454747
14712 -6454747 -6514908 -6501728 -6500680 -6579682 -6553160 -6522085 -6500466 -6434253 -6421548 -6485305 -6612887
14701 -6612887 -6666376 -6619197 -6568464 -6621529 -6609627 -6576900 -6570824 -6447549 -6369940 -6351766 -6393186
14690 -6393186 -6435408 -6486715 -6506129 -6482778 -6398079 -6346331 -6423118 -6511982 -6541267 -6469120 -6430384
14679 -6430384 -6293422 -6341516 -6417469 -6405547 -6415513 -6472282 -6473814 -6435973 -6436890 -6439681 -6504613 -6563298
14667 -6563298 -6519796 -6562964 -6534171 -6448603 -6386717 -6418459 -6531672 -6653822 -6664118 -6584924 -6636848
14656 -6636848 -6561310 -6500936 -6460470 -6319469 -6343529 -6395389 -6361163 -6411478 -6462356 -6493661 -6440411
14645 -6440411 -6315963 -6244595 -6230012 -6215989 -6330664 -6333159 -6384729 -6549246 -6508954 -6403091 -6254060
14634 -6254060 -6118071 -6174342 -6282340 -6375407 -6441689 -6472732 -6470265 -6495097 -6525951 -6428064 -6401244
14623 -6401244 -6414352 -6407409 -6404221 -6415883 -6306574 -6220907 -6203174 -6245835 -6303707 -6271732 -6266568 -6373019
14611 -6373019 -6367412 -6398762 -6407183 -6407223 -6369025 -6367599 -6378146 -6368824 -6405192 -6468064 -6521899 -6545288 -6524122
14598 -6524122 -6434545 -6356242 -6263698 -6207246 -6265875 -6336009 -6372477 -6418717 -6380090 -6358426 -6344677
14587 -6344677 -6483377 -6543245 -6481016 -6457624 -6353125 -6355858 -6368034 -6280887 -6218746 -6196473 -6315352
14576 -6315352 -6341391 -6279021 -6285398 -6276439 -6300870 -6316198 -6351880 -6347552 -6385007 -6375357 -6247126 -6140674
14564 -6140674 -6247100 -6352250 -6386179 -6240808 -6286222 -6361577 -6375284 -6317758 -6333250 -6266708 -6201945
14553 -6201945 -6250702 -6332083 -6324747 -6338614 -6370528 -6285610 -6270570 -6214354 -6221447 -6306539 -6344612 -6297371
14541 -6297371 -6221199 -6186258 -6114704 -6101941 -6012175 -6044485 -6158159 -6168488 -6187389 -6196641 -6234141
14530 -6234141 -6142463 -6175480 -6237059 -6234863 -6174613 -6166772 -6141615 -6177237 -6162919 -6140745 -6201713 -6285243
14518 -6285243 -6348305 -6323262 -6431827 -6485175 -6475454 -6413091 -6397927 -6382413 -6319445 -6335114 -6303554
14507 -6303554 -6256801 -6148441 -6149325 -6250554 -6288824 -6251971 -6231203 -6184740 -6205388 -6261230 -6266756
14496 -6266756 -6176236 -6175613 -6266916 -6272441 -6195477 -6132651 -6217865 -6329851 -6344829 -6292305 -6298166 -6235395
14484 -6235395 -6177014 -6218528 -6249903 -6203969 -6175731 -6189281 -6189267 -6212113 -6130120 -6121024 -6091061 -6014820
14472 -6014820 -6072271 -6134604 -6152967 -6133170 -6089490 -6125996 -6221785 -6270628 -6236754 -6216925 -6162096
14461 -6162096 -6143746 -6163383 -6094420 -6082926 -6181241 -6172393 -6051131 -5911293 -5943610 -6070663 -6062854
14450 -6062854 -6053402 -6063636 -6171624 -6192115 -6171906 -6184571 -6183696 -6200091 -6194464 -6128746 -6098801 -6132349
14438 -6132349 -6247037 -6260563 -6191446 -6104648 -6167170 -6267490 -6286693 -6244187 -6154652 -6030266 -5994148
14427 -5994148 -6027738 -6041675 -5989895 -6049486 -6058276 -6104974 -6155292 -6055491 -6054912 -6101937 -6039605 -5944640
14415 -5944640 -5933532 -6064161 -6004892 -5878655 -5897643 -5890596 -5918460 -5859887 -5785367 -5811675 -5987508
14404 -5987508 -6028943 -6000758 -5946560 -5884811 -6015915 -6181791 -6125371 -6015754 -5961843 -6009394 -6056614
14393 -6056614 -6140576 -6054343 -6027012 -6057251 -6054548 -6047381 -6034194 -6061629 -6044703 -5981677 -6003158 -6033932
14381 -6033932 -6043045 -6008411 -6017488 -5946169 -5838387 -5831129 -5884203 -5897302 -6008496 -6027106 -6037221
14370 -6037221 -5986157 -5933106 -5944647 -5900948 -5903449 -5950768 -5900898 -5828747 -5855850 -5853367 -5857143 -5863443
14358 -5863443 -5873482 -5802477 -5830782 -5863924 -5920528 -6061682 -6123253 -6035048 -5974699 -5963684 -6008300
14347 -6008300 -5951591 -5983253 -6093146 -6156681 -6123422 -6040965 -6051381 -6053250 -5993503 -6044150 -6040338
14336 -6040338 -5936242 -5862472 -5927254 -5948520 -5956804 -5918455 -5845220 -5833045 -5818113 -5826478 -5804359
14325 -5804359 -5800339 -5818181 -5836785 -5743799 -5776800 -5798826 -5804277 -5715131 -5759066 -5786697 -5764746 -5790175
14313 -5790175 -5819138 -5928543 -5898382 -5899564 -5959247 -5899173 -5810267 -5863630 -5911598 -5931835 -5912963
14302 -5912963 -5842277 -5863477 -5893417 -5917736 -5992570 -5960782 -5935317 -5878202 -5882163 -5842590 -5770813
14291 -5770813 -5752063 -5777048 -5905796 -5961179 -5947715 -5866230 -5868142 -5856375 -5901608 -5904840 -5903472 -5856579
14279 -5856579 -5781756 -5714575 -5650140 -5642828 -5708469 -5836567 -5908226 -5924455 -5907038 -5902048 -5907262 -5756885
14267 -5756885 -5672487 -5664399 -5723859 -5830477 -5815158 -5727020 -5627032 -5738405 -5784202 -5802632 -5833279
14256 -5833279 -5785290 -5816295 -5835594 -5908483 -5868649 -5934858 -6012276 -5950699 -5920790 -5935165 -5891947
14245 -5891947 -5932235 -5847747 -5836902 -5749463 -5731622 -5708643 -5722575 -5778947 -5757497 -5745851 -5718730
14234 -5718730 -5776239 -5940368 -6010905 -5911212 -5864776 -5943796 -5884556 -5731884 -5698520 -5683711 -5581002
14223 -5581002 -5638067 -5679331 -5735262 -5718975 -5768927 -5736405 -5725902 -5729748 -5698484 -5757756 -5872712
14212 -5872712 -5851946 -5727678 -5660760 -5701241 -5751238 -5777063 -5757764 -5775867 -5834430 -5927017 -5877568
14201 -5877568 -5756012 -5737736 -5799606 -5817966 -5867344 -5853966 -5745017 -5671359 -5766424 -5839317 -5808666
14190 -5808666 -5763223 -5673046 -5623907 -5695110 -5664738 -5641634 -5634666 -5613141 -5617230 -5717346 -5845794
14179 -5845794 -5953864 -5982234 -5901240 -5804028 -5635916 -5531606 -5572752 -5633832 -5668592 -5593660 -5527047
14168 -5527047 -5629603 -5746167 -5683294 -5530490 -5508978 -5537167 -5637730 -5701872 -5602842 -5513347
14158 -5513347 -5478926 -5554864 -5636471 -5567033 -5539275 -5546376 -5571532 -5490022 -5536982 -5592602 -5619991
14147 -5619991 -5679696 -5666651 -5689793 -5643836 -5658383 -5645145 -5593339 -5607992 -5657962 -5750672 -5713384
14136 -5713384 -5702382 -5703227 -5749229 -5731209 -5703758 -5704335 -5688687 -5712682 -5691691 -5664735 -5611911 -5633117
14124 -5633117 -5677757 -5730115 -5702105 -5705065 -5771095 -5814535 -5688342 -5577727 -5622201 -5603126 -5538825
14113 -5538825 -5471013 -5445304 -5496173 -5595064 -5567352 -5598771 -5663147 -5549426 -5481334 -5526376 -5536749
14102 -5536749 -5501379 -5491187 -5515885 -5522726 -5511198 -5544426 -5478002 -5477420 -5489128 -5543855 -5635761 -5529466
14090 -5529466 -5485160 -5548914 -5666258 -5659189 -5615835 -5580454 -5488617 -5512623 -5564164 -5553243 -5661976
14079 -5661976 -5678024 -5626265 -5584864 -5592736 -5611063 -5644382 -5642537 -5528779 -5496564 -5481339 -5506742
14068 -5506742 -5503139 -5474158 -5501341 -5491284 -5425189 -5428074 -5485390 -5442340 -5373340 -5368861 -5469641 -5539372
14056 -5539372 -5515525 -5477465 -5493142 -5529221 -5558866 -5576212 -5636363 -5614375 -5422511 -5327306 -5363832
14045 -5363832 -5426540 -5509477 -5500134 -5413302 -5354253 -5378860 -5512966 -5525104 -5482861 -5378321 -5449624
14034 -5449624 -5499063 -5542281 -5555836 -5489264 -5493404 -5488262 -5510347 -5552512 -5498144 -5448704 -5472214 -5467890
14022 -5467890 -5449856 -5435596 -5423940 -5390627 -5402080 -5459160 -5458204 -5449011 -5492603 -5521126 -5468756 -5418361
14010 -5418361 -5413857 -5533444 -5559845 -5550431 -5568867 -5506432 -5450077 -5432727 -5363394 -5287150 -5240449
13999 -5240449 -5297956 -5356566 -5370658 -5319121 -5296587 -5322688 -5334604 -5252926 -5314240 -5327339 -5315033
13988 -5315033 -5290005 -5360130 -5339475 -5295113 -5269087 -5302041 -5390308 -5331561 -5341582 -5319262 -5360929
13977 -5360929 -5429774 -5355913 -5307757 -5325889 -5453000 -5510265 -5396338 -5396718 -5379674 -5395074 -5331776
13966 -5331776 -5348788 -5385661 -5337966 -5307207 -5329022 -5340662 -5263658 -5294867 -5370703 -5432326 -5480249
13955 -5480249 -5471585 -5503193 -5632847 -5624828 -5532393 -5401434 -5257647 -5261910 -5259870 -5285650 -5320084
13944 -5320084 -5326142 -5353999 -5376892 -5428079 -5508908 -5463705 -5473336 -5491440 -5447982 -5427727 -5452404 -5401862
13932 -5401862 -5426056 -5406256 -5365271 -5318569 -5182770 -5137702 -5252231 -5356605 -5451346 -5427408 -5413306
13921 -5413306 -5292745 -5267217 -5213031 -5295146 -5352013 -5298952 -5296521 -5340305 -5276899 -5211187 -5309515
13910 -5309515 -5372278 -5332461 -5224255 -5231502 -5374625 -5364216 -5330542 -5326560 -5383210 -5446802 -5355875
13899 -5355875 -5376834 -5507732 -5437462 -5393838 -5348594 -5383582 -5401249 -5411170 -5363710 -5434368 -5382026
13888 -5382026 -5347516 -5339252 -5379460 -5363186 -5336134 -5301685 -5298844 -5347915 -5379203 -5313758 -5347324 -5326907
13876 -5326907 -5275062 -5259032 -5209386 -5171996 -5231002 -5258003 -5236138 -5307475 -5291448 -5225025 -5222966
13865 -5222966 -5176811 -5159443 -5195789 -5223969 -5222908 -5106212 -5087380 -5146546 -5154156 -5244037 -5259183
13854 -5259183 -5214534 -5209421 -5274795 -5305429 -5245839 -5287732 -5400705 -5350725 -5225236 -5270703 -5314374
13843 -5314374 -5333999 -5279215 -5224816 -5170265 -5124540 -5129323 -5160141 -5134212 -5117235 -5237606 -5345378
13832 -5345378 -5360645 -5313219 -5244153 -5123470 -5204372 -5201151 -5150462 -5209980 -5197193 -5231883 -5205388
13821 -5205388 -5134786 -5164412 -5217113 -5202951 -5218885 -5102357 -5032134 -5071453 -5028509 -5082913 -5115406
13810 -5115406 -5132611 -5179074 -5108100 -5097754 -5104009 -5148704 -5173409 -5219215 -5256453 -5285500 -5429631
13799 -5429631 -5412218 -5383769 -5314021 -5217821 -5175999 -5138299 -5060982 -5085928 -5173470 -5158559 -5132904
13788 -5132904 -5129471 -5140233 -5157163 -5176096 -5096056 -5032319 -5111558 -5132075 -5069710 -5027691 -5122593
13777 -5122593 -5205405 -5210189 -5210897 -5114790 -5110293 -5182506 -5166839 -5192379 -5179151 -5166304 -5115228 -5074191
13765 -5074191 -5116236 -5131214 -5150688 -5152658 -5176487 -5261187 -5228013 -5125330 -5076592 -4995197 -4991275
13754 -4991275 -5115650 -5231033 -5278061 -5221573 -5200019 -5216174 -5159131 -5060601 -5047053 -5099872 -5098563
13743 -5098563 -5056796 -5046617 -5100063 -5111543 -5109881 -5064141 -5086744 -5082114 -5169653 -5231103 -5156060 -5120685
13731 -5120685 -5112654 -5076655 -5001609 -5024039 -5092941 -5079536 -5004450 -5000308 -5033693 -5040402 -5004180 -5060153
13719 -5060153 -5098133 -5074033 -5019298 -4917811 -4933281 -5006279 -5104982 -5135075 -5094513 -5048837 -5010567
13708 -5010567 -4934405 -4905875 -4866950 -4864789 -4860185 -4927946 -4992323 -5067492 -5024492 -4983822 -5010508 -5093297
13696 -5093297 -5060157 -4998502 -5089047 -5118952 -5055486 -5017887 -5018294 -5022243 -5100931 -5127529 -5114325 -5015754
13684 -5015754 -4969025 -4922073 -5025192 -5104615 -5047108 -4943708 -5016589 -5167073 -5163152 -5126649 -5023469
13673 -5023469 -5050428 -5045433 -5033565 -5156094 -5156229 -5150749 -5100981 -5021062 -5134360 -5172035 -5107237 -5020813
13661 -5020813 -5069826 -5266110 -5217987 -5180476 -5292912 -5289564 -5167676 -5077204 -5035555 -4967677 -4917784
13650 -4917784 -5015147 -5081196 -5127629 -5037607 -5036626 -5071096 -5015500 -5012652 -5044235 -5117278 -5013642 -4904489
13638 -4904489 -4952149 -4946233 -4919513 -4967821 -4959091 -4958456 -5025241 -5110259 -5143908 -5174216 -5153920 -5168443
13626 -5168443 -5179995 -5216449 -5185982 -5111970 -5021275 -5083662 -4986143 -4773397 -4787754 -4851991 -4874377
13615 -4874377 -4796409 -4819374 -4873287 -4874973 -4830274 -4867577 -4888885 -4860949 -4827404 -4747322 -4773873
13604 -4773873 -4834964 -4858763 -4923550 -4903320 -4874488 -4853017 -4796279 -4829400 -4871692 -4837576 -4797109
13593 -4797109 -4936987 -5034957 -5059038 -4943837 -4950012 -4969783 -4971290 -4981478 -4909902 -4869673 -4977196
13582 -4977196 -5093566 -4937970 -4835445 -4891164 -4957785 -4911354 -4855539 -4831855 -4860189 -4831682 -4812176
13571 -4812176 -4845652 -4880564 -4932568 -4960011 -4994788 -5002023 -5008061 -4893929 -4922911 -5021225 -5035002
13560 -5035002 -5039907 -4966317 -4957134 -4978942 -4986132 -5031746 -5111491 -5058846 -4966559 -4864079 -4808447 -4716061
13548 -4716061 -4712467 -4763476 -4760627 -4830031 -4952998 -5023231 -4975358 -4919520 -4896954 -4813179 -4806063 -4884306
13536 -4884306 -4914207 -4946960 -4929092 -4853314 -4837793 -4898242 -4904096 -4906158 -4985996 -5017908 -4988520 -4979991
13524 -4979991 -5051491 -5058712 -5009868 -4963143 -4911138 -4811416 -4833435 -4906392 -4921005 -4924294 -4927669 -4870298
13512 -4870298 -4802184 -4778528 -4854615 -4821786 -4827266 -4806945 -4754602 -4833328 -4885574 -4844080 -4824224
13501 -4824224 -4842935 -4834792 -4732834 -4704683 -4721675 -4727434 -4822275 -4892256 -4793894 -4780749 -4818536
13490 -4818536 -4747760 -4771292 -4907949 -4886665 -4806893 -4789669 -4745880 -4748235 -4766044 -4798317 -4747732
13479 -4747732 -4655432 -4615817 -4704581 -4763918 -4783210 -4802039 -4811126 -4836173 -4813278 -4796910 -4798182 -4835380
13467 -4835380 -4806371 -4738605 -4765536 -4751961 -4712001 -4760515 -4804030 -4740135 -4635938 -4530591 -4531787
13456 -4531787 -4559590 -4555851 -4598030 -4740414 -4755978 -4777064 -4839980 -4926301 -4827662 -4732001 -4756425
13445 -4756425 -4740287 -4624592 -4597736 -4678653 -4694761 -4650386 -4697069 -4727000 -4748054 -4805101 -4868838
13434 -4868838 -4831550 -4788866 -4724344 -4809681 -4871512 -4843328 -4851023 -4886947 -4848406 -4727281 -4713547
13423 -4713547 -4708888 -4669076 -4662858 -4687129 -4659847 -4641672 -4619564 -4726436 -4818197 -4706371 -4661017
13412 -4661017 -4660441 -4663072 -4640860 -4683880 -4676717 -4651695 -4651135 -4712496 -4698008 -4753121 -4823868 -4850538
13400 -4850538 -4837681 -4774199 -4725293 -4696301 -4626217 -4597885 -4588123 -4629303 -4612897 -4590084 -4613754
13389 -4613754 -4601549 -4640439 -4641774 -4556273 -4614258 -4652399 -4689730 -4585725 -4508930 -4478729 -4527829
13378 -4527829 -4633881 -4575072 -4543520 -4556075 -4514936 -4527960 -4476840 -4547668 -4627038 -4648734 -4626061
13367 -4626061 -4531286 -4467140 -4481985 -4537613 -4554355 -4515162 -4493417 -4578442 -4633282 -4596336 -4568889
13356 -4568889 -4530203 -4552627 -4590053 -4547684 -4508562 -4508950 -4581643 -4646111 -4642954 -4620278 -4592022 -4571444
13344 -4571444 -4521110 -4572243 -4465564 -4360272 -4347986 -4376901 -4430164 -4401033 -4464192 -4507944 -4574315
13333 -4574315 -4550547 -4472394 -4423934 -4553359 -4605942 -4581811 -4576788 -4598716 -4620083 -4652428 -4627911
13322 -4627911 -4537424 -4528398 -4511235 -4464362 -4478639 -4670552 -4729058 -4748806 -4674469 -4659276 -4705150
13311 -4705150 -4728651 -4693350 -4622691 -4644016 -4607939 -4514693 -4442056 -4446193 -4495105 -4506811 -4575750
13300 -4575750 -4506761 -4407052 -4286818 -4290918 -4369210 -4397142 -4351575 -4312676 -4371248 -4379132 -4372065 -4422082
13288 -4422082 -4406039 -4403944 -4399563 -4419942 -4409809 -4357593 -4394914 -4469199 -4492206 -4520319 -4483779 -4500380
13276 -4500380 -4444290 -4412727 -4448958 -4500790 -4446271 -4351194 -4290445 -4324523 -4399088 -4418657 -4537967
13265 -4537967 -4595103 -4529479 -4554248 -4588402 -4537517 -4495730 -4511596 -4571825 -4544140 -4568157 -4525788
13254 -4525788 -4481808 -4476264 -4410331 -4415306 -4479556 -4524584 -4457323 -4369509 -4318440 -4338499 -4301513 -4296967
13242 -4296967 -4263055 -4292880 -4286143 -4265380 -4224887 -4276442 -4392501 -4492709 -4475243 -4413332 -4379701
13231 -4379701 -4312891 -4417100 -4352107 -4250118 -4254787 -4313772 -4423785 -4456396 -4451478 -4482287 -4470962
13220 -4470962 -4451044 -4428343 -4489047 -4552878 -4555376 -4484337 -4510611 -4475251 -4485300 -4456407 -4491462
13209 -4491462 -4408256 -4360939 -4346861 -4239773 -4153044 -4226502 -4375800 -4359471 -4312535 -4402488 -4478970
13198 -4478970 -4341593 -4266659 -4245996 -4325894 -4380732 -4389959 -4485648 -4451145 -4443905 -4391006 -4359231
13187 -4359231 -4261447 -4249329 -4324144 -4358530 -4329305 -4289432 -4292095 -4286654 -4263399 -4252979 -4272131 -4400413
13175 -4400413 -4431968 -4397018 -4366479 -4283306 -4338362 -4410822 -4470058 -4477966 -4494343 -4473821 -4411100
13164 -4411100 -4427320 -4307756 -4263786 -4289475 -4375510 -4383706 -4268463 -4226675 -4251699 -4271437 -4310669
13153 -4310669 -4324521 -4208453 -4144775 -4109382 -4102064 -4168212 -4283655 -4274426 -4257967 -4248421 -4205953
13142 -4205953 -4246670 -4294149 -4271311 -4308159 -4364650 -4319840 -4253476 -4192572 -4294157 -4350435 -4309105
13131 -4309105 -4260164 -4289793 -4296981 -4312282 -4224855 -4301994 -4421366 -4314370 -4202494 -4306212 -4367720
13120 -4367720 -4355238 -4286031 -4190090 -4156732 -4080596 -4077321 -4187004 -4200616 -4170344 -4224388 -4200974
13109 -4200974 -4176781 -4180820 -4148226 -4084779 -4149532 -4131942 -3972622 -3913789 -3921903 -3916988 -3917843 -3890758
13097 -3890758 -3928421 -3976762 -4045058 -4047893 -3986701 -3949527 -3952855 -3995438 -4014351 -4028474 -4026669 -4013335
13085 -4013335 -4024225 -3981334 -4034284 -4095830 -4082550 -4030676 -3999534 -3967236 -3944182 -3911189 -3836131
13074 -3836131 -3866419 -3846030 -3782491 -3773996 -3855775 -3944300 -3881964 -3924381 -4066448 -4175793 -4273522
13063 -4273522 -4272002 -4192655 -4174853 -4106334 -4160570 -4157433 -4165284 -4149828 -4153400 -4208821 -4142303 -4098082
13051 -4098082 -4153126 -4116277 -4066135 -4010210 -4047181 -4034149 -3971323 -3911709 -3859566 -3800019 -3780046
13040 -3780046 -3794343 -3900897 -3909521 -3776035 -3716888 -3639557 -3664908 -3732328 -3669017 -3655873 -3584429
13029 -3584429 -3431804 -3367720 -3365207 -3275264 -3194588 -3205917 -3492479 -3947120 -4278051 -4574184
13019 -4574184 -4644383 -4693087 -4741004 -4737809 -4702165 -4610924 -4569293 -4576263 -4411640 -4325132 -4322726 -4228021
13007 -4228021 -4173868 -4162188 -4134013 -4124894 -4146347 -4075208 -4032891 -3960551 -3872886 -3922809 -3948804
12996 -3948804 -3854826 -3799654 -3707467 -3680662 -3698480 -3692197 -3684409 -3644580 -3563824 -3466146 -3331414
12985 -3331414 -3310324 -3316772 -3361942 -3303391 -3219597 -3097239 -3174798 -3484261 -3885554 -4382900 -4651978
12974 -4651978 -4849840 -4941230 -5004311 -4938858 -4825031 -4773034 -4721962 -4635362 -4567088 -4451283 -4379664
12963 -4379664 -4486990 -4581036 -4582547 -4438265 -4327425 -4343475 -4393249 -4337526 -4201800 -4080158
12953 -4080158 -4091752 -4136577 -4180544 -4201140 -4144622 -4126268 -4145635 -4087040 -4053766 -4002094 -3965476
12942 -3965476 -3964545 -3876216 -3817157 -3839994 -3868828 -3781006 -3765381 -3749082 -3762458 -3846745 -4030436
12931 -4030436 -4259706 -4253908 -4293219 -4441931 -4487208 -4566057 -4566065 -4559771 -4593796 -4666028 -4622984 -4528956
12919 -4528956 -4455729 -4533793 -4611308 -4545594 -4516883 -4387226 -4358535 -4358256 -4330323 -4344367 -4359941
12908 -4359941 -4345421 -4295641 -4229349 -4208031 -4168995 -4253316 -4233836 -4145596 -4058244 -4106770 -4111624
12897 -4111624 -4104320 -3982624 -3930808 -3977122 -4033843 -4052147 -3899377 -3867675 -3863720 -3918810 -4009366
12886 -4009366 -4072671 -4028481 -4047837 -4084864 -4156376 -4224558 -4262654 -4350572 -4326955 -4203840 -4139472
12875 -4139472 -4104709 -4068302 -4082535 -4107775 -4038133 -4047437 -4100053 -4021298 -3984548 -4021634 -4007105
12864 -4007105 -4052481 -3981639 -3908400 -3992339 -4071476 -4070904 -4053056 -4061049 -3980502 -3959302 -3946980 -3981710
12852 -3981710 -4022252 -4097072 -4086959 -4111999 -4131677 -4077064 -4022877 -3983994 -3928288 -3900387 -3876087
12841 -3876087 -3912744 -4055837 -4096912 -4078950 -4007157 -4027644 -4026478 -3949085 -3927416 -4031464 -4112946
12830 -4112946 -4156550 -4041487 -3931850 -3897097 -3802656 -3872797 -3849598 -3757984 -3851216 -3945343 -3949948
12819 -3949948 -3895670 -3842159 -3814782 -3813859 -3780819 -3795148 -3868557 -3932213 -4004325 -3889131 -3848934
12808 -3848934 -3870220 -3876302 -3957787 -3932011 -3847290 -3923048 -3975045 -3877539 -3833343 -3871401 -3905297
12797 -3905297 -3834166 -3826697 -3845736 -3999973 -4003412 -3882703 -3783390 -3786179 -3884879 -3906695 -3979638
12786 -3979638 -4004320 -3947852 -3890698 -3854680 -3792369 -3816799 -3872747 -3942023 -3966269 -3962932 -3904198
12775 -3904198 -3882985 -3888224 -3870985 -3816464 -3782989 -3804111 -3843897 -3874101 -3884311 -3800468 -3703702
12764 -3703702 -3658982 -3688193 -3740964 -3757296 -3720501 -3769833 -3738224 -3735956 -3752931 -3697101 -3667952
12753 -3667952 -3689579 -3787981 -3716063 -3670953 -3618168 -3738027 -3785608 -3730596 -3738153 -3848643 -3868911
12742 -3868911 -3828524 -3704499 -3646734 -3620618 -3710606 -3663266 -3673189 -3684472 -3643199 -3650159 -3694553
12731 -3694553 -3731689 -3638173 -3661054 -3729853 -3703237 -3656464 -3614546 -3583622 -3552939 -3593808 -3594760 -3590491
12719 -3590491 -3602572 -3618138 -3567884 -3661803 -3614213 -3566756 -3664914 -3642188 -3601966 -3662429 -3747344
12708 -3747344 -3786241 -3785454 -3815143 -3846867 -3887676 -3893930 -3859274 -3789325 -3779861 -3800193 -3790271 -3780141
12696 -3780141 -3780755 -3806523 -3725159 -3696404 -3695408 -3672298 -3615545 -3607546 -3658682 -3720932 -3708662 -3616929
12684 -3616929 -3565128 -3456238 -3392440 -3454915 -3604464 -3704819 -3485356 -3463181 -3476844 -3415060
12674 -3415060 -3422693 -3521992 -3550657 -3552257 -3548084 -3596600 -3553813 -3529403 -3406970 -3440839 -3533045 -3572594
12662 -3572594 -3546669 -3576254 -3661906 -3591022 -3490175 -3333370 -3377634 -3377203 -3368939 -3356640 -3300020
12651 -3300020 -3377473 -3537593 -3482495 -3343975 -3260836 -3239372 -3222070 -3251231 -3257681 -3293494 -3269231
12640 -3269231 -3281985 -3399792 -3406418 -3359735 -3353638 -3362076 -3322298 -3188111 -3179934 -3286803 -3311958
12629 -3311958 -3274783 -3305916 -3218193 -3240974 -3320001 -3407307 -3388633 -3406669 -3472511 -3402342 -3372242
12618 -3372242 -3405688 -3253647 -3249177 -3323456 -3383262 -3355192 -3360220 -3420207 -3419697 -3403129 -3342046 -3207480
12606 -3207480 -3156773 -3226664 -3362478 -3335310 -3299700 -3198848 -3238002 -3232214 -3216811 -3243305 -3311074
12595 -3311074 -3199533 -3069523 -3091057 -3114762 -3119102 -3142662 -3160763 -3210314 -3335690 -3398874 -3460905
12584 -3460905 -3466077 -3436405 -3545363 -3539238 -3472346 -3377888 -3449398 -3448269 -3402430 -3398125 -3392906 -3251945
12572 -3251945 -3338319 -3379552 -3411791 -3372749 -3336999 -3274117 -3261562 -3304011 -3335436 -3306998 -3326882
12561 -3326882 -3316702 -3235050 -3165589 -3140386 -3146826 -3147668 -3167305 -3088337 -3067442 -3047741 -3028643 -3019952
12549 -3019952 -3058605 -3028045 -2935593 -2844571 -2843421 -2817761 -2755763 -2886907 -3024412 -3014400 -3024125
12538 -3024125 -3129145 -3238416 -3375583 -3642316 -3852349 -3854184 -3812655 -3784728 -3809449 -3730485
12528 -3730485 -3735922 -3633906 -3449267 -3395985 -3407745 -3435892 -3481647 -3366878 -3422727 -3426267 -3347864
12517 -3347864 -3312993 -3266532 -3218403 -3254345 -3207402 -3097507 -3000113 -3028081 -3199257 -3210824 -3110046
12506 -3110046 -3100216 -3017705 -2993454 -2956140 -2942414 -2885818 -2754866 -2720935 -2686808 -2674235 -2756975
12495 -2756975 -2796338 -2883804 -3000095 -3226971 -3366146 -3571181 -3672565 -3688654 -3638048 -3559352
12485 -3559352 -3469291 -3361131 -3376901 -3492417 -3472363 -3371073 -3342541 -3349989 -3352174 -3378187 -3305508
12474 -3305508 -3224721 -3139704 -3139038 -3141462 -3161030 -3136029 -3183905 -3172335 -3245994 -3386117 -3371325 -3330802
12462 -3330802 -3257281 -3154702 -3082335 -3045341 -2972602 -2863129 -2919361 -2894069 -2830421 -2859018 -3032542
12451 -3032542 -3004644 -2949627 -2940870 -2908903 -2918692 -2843829 -2838383 -2877933 -2920667 -3016013 -3094210 -3031031
12439 -3031031 -2976780 -2940350 -2925411 -2907038 -2910076 -2949707 -2961527 -2968208 -3035031 -3135800 -3052897
12428 -3052897 -2953339 -2981838 -2980807 -2959044 -2854648 -2816727 -2849853 -2901072 -2941760 -2975753 -2770102
12417 -2770102 -2689297 -2605662 -2478322 -2467335 -2544344 -2640647 -2705387 -2689183 -2601456 -2503854 -2514124
12406 -2514124 -2535695 -2517134 -2552617 -2645187 -2650102 -2567930 -2509513 -2584384 -2624314 -2627862 -2510893
12395 -2510893 -2381789 -2265644 -2266035 -2217216 -2257255 -2289024 -2161369 -2101435 -2057112 -1954527 -1881219
12384 -1881219 -1844626 -1862543 -1905444 -1960858 -1970595 -1820599 -1690204 -1615459 -1489342 -1422807 -1415081
12373 -1415081 -1455302 -1401429 -1324515 -1191058 -1036590 -853815 -656275 -435919 -239855 -169863
12363 -169863 -56730 -85886 -311872 -463012 -736372 -1259796 -2183308 -3357330 -4444328
12354 -4444328 -5177960 -5632565 -5706100 -5595968 -5395549 -5227253 -5082180 -4945308 -4873600 -4751104
12344 -4751104 -4585120 -4382605 -4227023 -4010212 -4019520 -3999804 -3910704 -3800966 -3803688 -3822423 -3737564
12333 -3737564 -3688873 -3675093 -3579794 -3491226 -3458726 -3386734 -3300176 -3200919 -3093423 -2947958 -2835780
12322 -2835780 -2847091 -2972363 -3443074 -4053501 -4355248 -4492591 -4539902 -4547474 -4584522 -4557890
12312 -4557890 -4461974 -4455627 -4468089 -4452949 -4361965 -4268974 -4200689 -4164803 -4239805 -4300428 -4282395
12301 -4282395 -4214038 -4076914 -4066843 -3997755 -3864944 -3737436 -3737421 -3727203 -3750474 -3738437 -3790976
12290 -3790976 -3797561 -3803180 -3785722 -3837007 -3756844 -3712630 -3624752 -3525464 -3477483 -3426965 -3346511 -3364760
12278 -3364760 -3499923 -3754685 -3921566 -3944736 -3878351 -3818345 -3853146 -4056906 -4236199 -4176268
12268 -4176268 -4200854 -4280189 -4288933 -4305989 -4311892 -4228491 -4141911 -4115581 -4048552 -3971622 -3973894 -3976641
12256 -3976641 -3922813 -3837987 -3694910 -3603265 -3632654 -3677141 -3704918 -3727942 -3739156 -3674847 -3621053
12245 -3621053 -3482603 -3418015 -3425107 -3442638 -3508544 -3439917 -3274528 -3280908 -3384359 -3441427 -3440817
12234 -3440817 -3376748 -3380654 -3439913 -3353676 -3223388 -3163264 -3167422 -3152496 -3128033 -3114930 -3095300
12223 -3095300 -3187762 -3227044 -3300907 -3375526 -3287219 -3240232 -3294250 -3290347 -3231948 -3132692 -3090372
12212 -3090372 -3133580 -3074242 -2980170 -2876626 -2879767 -2955386 -3004104 -3063359 -3146182 -3239641 -3276468
12201 -3276468 -3217257 -3254465 -3273685 -3227396 -3204050 -3188539 -3124973 -3096165 -3065808 -3065700 -3003211 -2989481
12189 -2989481 -2867791 -2822177 -2870954 -2847981 -2909016 -2899326 -2927441 -2995158 -3000966 -2902632 -2902246 -3036478
12177 -3036478 -3027055 -2999704 -2991666 -2978415 -2965677 -2983688 -2877537 -2810924 -2778043 -2779615 -2824936 -2855376
12165 -2855376 -2852598 -2850771 -2733130 -2787931 -2897753 -2840170 -2850920 -2868256 -2824644 -2769256 -2722916
12154 -2722916 -2740133 -2712620 -2752654 -2730893 -2679372 -2713912 -2795155 -2820863 -2858362 -2884243 -2843733
12143 -2843733 -2813719 -2811842 -2808170 -2844575 -2821772 -2829570 -2872558 -2822722 -2652928 -2647193 -2703280 -2734097
12131 -2734097 -2579852 -2462503 -2426422 -2379588 -2471009 -2528896 -2466135 -2441493 -2408955 -2377143 -2373982
12120 -2373982 -2419885 -2423584 -2452332 -2477954 -2398579 -2271957 -2143695 -2178556 -2164093 -2119542 -2226802
12109 -2226802 -2352535 -2420982 -2410377 -2457708 -2560578 -2716013 -2831549 -2962291 -3086915 -3095881
12099 -3095881 -3049391 -3063116 -3137298 -3204586 -3189284 -3126166 -3016607 -2984829 -2978507 -2909124 -2910962
12088 -2910962 -2869269 -2811992 -2788595 -2751027 -2718717 -2801970 -2830522 -2794291 -2822421 -2816337 -2793184
12077 -2793184 -2739714 -2674931 -2501465 -2432253 -2473785 -2402570 -2318898 -2368931 -2378762 -2344542 -2289581
12066 -2289581 -2268264 -2257854 -2154075 -2292763 -2533150 -2592046 -2715333 -2755849 -2814628 -2960925
12056 -2960925 -2978121 -3046349 -3053573 -3130295 -3048595 -3024552 -3073828 -3025624 -2948319 -2940558 -2924825 -2958924
12044 -2958924 -2819822 -2698385 -2742848 -2772654 -2734713 -2646600 -2594377 -2543246 -2491135 -2438792 -2509450
12033 -2509450 -2629787 -2559212 -2377671 -2408184 -2422893 -2395978 -2342317 -2329467 -2287142 -2301478 -2326554
12022 -2326554 -2306905 -2277853 -2184301 -2219840 -2165653 -2086464 -2057625 -2126281 -2192301 -2227191 -2172396
12011 -2172396 -2167340 -2285545 -2369847 -2308670 -2140558 -2020733 -2000500 -1996832 -1919509 -1840392 -1775458
12000 -1775458 -1641607 -1547330 -1498826 -1408491 -1341454 -1311323 -1252609 -1105510 -945258 -764383
11990 -764383 -765226 -1261359 -1755977 -1825519 -1705159 -1446787 -1243823 -994562 -692849 -568432
11980 -568432 -439614 -147595 213133 442699 587417 576792 272286 -343905 -1405163 -2858733
11970 -2858733 -4410594 -5779284 -6755107 -7156241 -7215242 -7159499 -7154685 -6960142 -6705026 -6371232
11960 -6371232 -6043414 -5727994 -5527142 -5285598 -5018636 -4861000 -4882777 -4881673 -4855132 -4733975
11950 -4733975 -4545555 -4472830 -4514058 -4465940 -4391331 -4317144 -4273954 -4227121 -4152249 -4052422 -4105254
11939 -4105254 -4013242 -3840207 -3775667 -3728868 -3713467 -3749382 -3813304 -3792146 -3668176 -3546370 -3501751
11928 -3501751 -3430614 -3505603 -3568219 -3560619 -3569675 -3585282 -3618323 -3662344 -3606670 -3587122 -3541321 -3521755
11916 -3521755 -3529325 -3501669 -3570279 -3585721 -3545242 -3411981 -3390432 -3342867 -3213100 -3303111 -3270351
11905 -3270351 -3276594 -3254157 -3227922 -3266488 -3275680 -3253615 -3194297 -3228567 -3173962 -3091787 -3115554 -3117191
11893 -3117191 -3057053 -2973056 -3043307 -3110449 -3001911 -2834030 -2776983 -2783378 -2832097 -2824200 -2811967
11882 -2811967 -2773450 -2791561 -2853775 -2812738 -2871812 -2836310 -2822954 -2803946 -2871077 -2961482 -2887296
11871 -2887296 -2822641 -2745733 -2786008 -2782203 -2696930 -2703324 -2677763 -2773391 -2765897 -2692485 -2674901 -2748027
11859 -2748027 -2794005 -2783810 -2754131 -2659423 -2574894 -2579290 -2656478 -2695120 -2636643 -2718491 -2724236 -2613733
11847 -2613733 -2508198 -2471383 -2437490 -2353217 -2416930 -2506997 -2456090 -2532296 -2544607 -2345147 -2293447
11836 -2293447 -2290147 -2400190 -2499370 -2413321 -2383928 -2443890 -2514988 -2593834 -2627138 -2579465 -2495361
11825 -2495361 -2454751 -2407652 -2363518 -2315335 -2308768 -2365906 -2402392 -2349692 -2349452 -2427661 -2488422 -2434578
11813 -2434578 -2308807 -2244507 -2157941 -2146163 -2250542 -2362306 -2327094 -2275280 -2177150 -2105947 -2145019
11802 -2145019 -2263052 -2313611 -2242484 -2165384 -2135421 -2162501 -2138320 -2116063 -2118895 -2130437 -2120118
11791 -2120118 -2023556 -2070962 -2159983 -2131438 -2036109 -2052924 -2058269 -1909834 -1929037 -2022303 -2096806
11780 -2096806 -2093509 -2026913 -2072466 -2213783 -2194983 -2126123 -2125321 -2131306 -2093958 -1947509 -1885388 -1949151
11768 -1949151 -2027089 -2135522 -2081265 -2040025 -2020251 -1956637 -1897294 -1880767 -1942872 -1955545 -1845842
11757 -1845842 -1834411 -1919103 -1979768 -1966098 -1924882 -1921095 -1860095 -1826003 -1801220 -1792886 -1722426 -1655977
11745 -1655977 -1621855 -1604478 -1746019 -1813707 -1741383 -1666567 -1591372 -1589239 -1631197 -1613285 -1709909
11734 -1709909 -1705734 -1650156 -1614637 -1553713 -1562583 -1366929 -1271362 -1317179 -1395142 -1316310 -1273856
11723 -1273856 -1335287 -1358835 -1414213 -1356705 -1444271 -1401476 -1322476 -1279436 -1279558 -1200666 -1186483 -1138446
11711 -1138446 -1172884 -1099192 -937095 -969777 -1096310 -1180269 -1161232 -1075657 -913610 -830783 -835771
11700 -835771 -820121 -774191 -767781 -760960 -760212 -709672 -664664 -629823 -569115 -472454 -443182 -517645
11688 -517645 -555924 -490391 -288334 -243301 -240736 -229794 -199115 -135477 -149000 -118353 -94234
11677 -94234 4055 81757 91187 -26083 -83806 -93094 -82086 -51920 5835 12534 -116767 -283069
11665 -283069 -378800 -440883 -459026 -647528 -772760 -944401 -1159096 -1413329 -1664908 -2023518
11655 -2023518 -2437475 -2861253 -3059484 -3206631 -3580492 -3870832 -4095606 -4239535 -4362024
11646 -4362024 -4494404 -4595065 -4717810 -4746451 -4638703 -4667434 -4698564 -4710540 -4659337 -4655402 -4646521
11635 -4646521 -4591021 -4517326 -4447723 -4349310 -4309460 -4366666 -4312290 -4209667 -4156280 -4067853 -3973720
11624 -3973720 -3871664 -3794587 -3724924 -3707914 -3748439 -3747941 -3639615 -3660416 -3636131 -3518982 -3474710
11613 -3474710 -3460386 -3457637 -3380281 -3260761 -3238370 -3254041 -3262524 -3306968 -3296990 -3310216 -3328866 -3224990
11601 -3224990 -3066225 -3055794 -3048211 -3020660 -2949922 -2988883 -2999099 -2910408 -2858238 -2923257 -2957982
11590 -2957982 -2852181 -2800051 -2741417 -2650784 -2673626 -2713790 -2676031 -2598241 -2547311 -2524617 -2519535
11579 -2519535 -2553193 -2671152 -2778060 -2742778 -2638355 -2576808 -2637533 -2549906 -2404992 -2505545
11569 -2505545 -2573050 -2464695 -2423669 -2404692 -2370905 -2395047 -2458802 -2553618 -2577090 -2591386 -2465129
11558 -2465129 -2413241 -2425116 -2467893 -2344214 -2194167 -2157890 -2122495 -2135127 -2152965 -2247534 -2393213
11547 -2393213 -2372166 -2331880 -2377361 -2403541 -2368729 -2360964 -2357120 -2393442 -2384561 -2366429 -2329753 -2228672
11535 -2228672 -2131704 -2089778 -2114849 -2160631 -2127239 -2105415 -2222431 -2285956 -2171214 -2129559 -2020111
11524 -2020111 -1927373 -1987626 -2088794 -2084420 -2015713 -2048836 -2095395 -2106995 -2089575 -2035502 -2006738
11513 -2006738 -1976484 -1938595 -1844303 -1748890 -1788156 -1853825 -1900397 -1858560 -1869010 -1834115 -1861522
11502 -1861522 -1860761 -1845493 -1838594 -1868897 -1907151 -1904719 -1803556 -1778532 -1789810 -1758908 -1694444 -1759645
11490 -1759645 -1855471 -1901434 -1868474 -1830797 -1788802 -1761145 -1758182 -1720039 -1533823 -1483734 -1562076
11479 -1562076 -1585205 -1629577 -1668865 -1661525 -1578228 -1565912 -1601182 -1615233 -1624727 -1690774 -1623198 -1577580
11467 -1577580 -1450520 -1435993 -1443139 -1495365 -1515091 -1483364 -1419206 -1438329 -1452541 -1366437 -1414947
11456 -1414947 -1453803 -1587161 -1642584 -1578413 -1502462 -1562674 -1667867 -1600406 -1587105 -1655247 -1664434
11445 -1664434 -1581823 -1411906 -1391217 -1412883 -1392397 -1358817 -1307915 -1332359 -1442831 -1426257 -1314258
11434 -1314258 -1331095 -1379038 -1476537 -1463522 -1468939 -1416026 -1372930 -1329364 -1334127 -1346201 -1379336 -1374832
11422 -1374832 -1380620 -1288707 -1243788 -1254167 -1312971 -1390678 -1449661 -1375051 -1262290 -1215213 -1128459
11411 -1128459 -1089242 -1158499 -1188663 -1134195 -1093621 -1133183 -1226370 -1244706 -1187540 -1084205 -1127419
11400 -1127419 -1151021 -1180956 -1147498 -1062622 -1090382 -1106846 -1118123 -1126041 -1100317 -1140793 -1057587
11389 -1057587 -999589 -1074490 -1115429 -1035356 -1018984 -1032887 -1009523 -946233 -936370 -953642 -1011724
11378 -1011724 -1084064 -1070485 -1034430 -948195 -926485 -944733 -907317 -930876 -906873 -934095 -922244
11367 -922244 -1034012 -1065209 -926106 -900227 -962257 -1008556 -935882 -826915 -769744 -812097 -850927
11356 -850927 -825758 -869975 -859557 -782332 -794148 -793090 -793175 -656347 -665157 -776579 -781069 -733287
11344 -733287 -670568 -660048 -631968 -721668 -822424 -847788 -767393 -660745 -757352 -816486 -784886
11333 -784886 -803016 -796844 -778247 -769739 -845464 -761880 -561248 -512336 -407983 -377316 -436742
11322 -436742 -513621 -635157 -697894 -662763 -518192 -483438 -468299 -407351 -481215 -517945 -386787
11311 -386787 -376713 -428702 -486188 -489454 -473978 -563857 -560501 -517755 -477103 -463126 -530461 -554051
11299 -554051 -604420 -555088 -452560 -422737 -473849 -527683 -500886 -450754 -446864 -459836 -478306
11288 -478306 -423851 -309948 -269551 -228673 -224325 -257254 -327596 -367044 -458475 -475726 -487669
11277 -487669 -423433 -375727 -356961 -333052 -349130 -303637 -217958 -191947 -196663 -212710 -66590
11266 -66590 -17190 -9740 -28549 -56475 -160226 -164975 -115214 -73711 -62654 17294 11842 71294
11254 71294 77047 28825 4132 -50390 -104482 -126637 -106573 -81660 -41818 95872 177778 174417
11242 174417 149853 134078 -11822 -91716 -6314 86769 171046 212109 150163 83986 -2722
11231 -2722 -28907 23749 107105 197306 161192 107251 61591 114448 210768 270027 293016 167191
11219 167191 111360 134347 117825 145871 219965 237366 257864 196435 230057 271609 260362
11208 260362 205049 186478 225044 281968 351696 386794 336261 344178 362347 424650 348692 368083
11196 368083 329190 316948 334364 340012 408223 477864 356846 326420 430670 481433 371465
11185 371465 294115 270294 307695 454304 536146 641480 660977 592265 515896 608900 704221
11174 704221 730051 798470 847281 837164 827652 806939 723794 640943 618937 628379 569937 659590
$$ [...]
##END NTUPLES=NMR SPECTRUM
##END=
