##TITLE=Analysis number 330406
Compound Code cc 12701
Project Code adrs
Chemist Name stores
##JCAMPDX= 6.0         $$ Bruker NMR JCAMP-DX V2.0
##DATA TYPE= NMR SPECTRUM
##DATA CLASS= NTUPLES
##ORIGIN= Bruker BioSpin GmbH
##OWNER= nmr
$$ XWIN-NMR		Version 3.5
$$ Thu Nov 22 11:08:42 2007 GMT Standard Time (UT+0h)  MAYBRIDGE\nmr@NMR_250MHZ
##.OBSERVE FREQUENCY= 250.131544655141
##.OBSERVE NUCLEUS= ^1H
##.ACQUISITION MODE= SIMULTANEOUS (DQD)
##.ACQUISITION SCHEME= undefined
##.AVERAGES= 16
##.DIGITISER RES= 18
##SPECTROMETER/DATA SYSTEM= dpx250
##.PULSE SEQUENCE= zg30
##.SOLVENT NAME= DMSO
##.SHIFT REFERENCE= (INTERNAL, DMSO, 0, 16.522)
##AUDIT TRAIL= $$ (NUMBER, WHEN, WHO, WHERE, WHAT)
$$ ##TITLE= Audit trail, XWIN-NMR		Version 3.5
$$ ##JCAMPDX= 5.01
$$ ##ORIGIN= Bruker BioSpin GmbH
$$ ##OWNER= nmr
$$ C:\u/data/dgb/nmr/ADRS/2070/pdata/1/auditp.txt
$$ ##AUDIT TRAIL=  $$ (NUMBER, WHEN, WHO, WHERE, WHAT)
(   1,<2007-11-22 11:08:14.87 +000>,<MAYBRIDGE\nmr>,<NMR_250MHZ>,
      <created by zg, POWCHK disabled, PULCHK disabled
       configuration hash MD5:
       76 6E 9A 78 1E 09 19 81 EC 84 63 8F B0 6A 59 2D
       data hash MD5: 64K
       C1 8F EA E5 E5 94 93 CE E9 10 7E 84 D3 21 29 FF>)
(   2,<2007-11-22 11:08:29.13 +000>,<MAYBRIDGE\nmr>,<NMR_250MHZ>,
      <Start of raw data processing
       ef LB = 0.3 FT_mod = 6 PKNL = 1 SI = 32K 
       data hash MD5: 32K
       08 AB 1F AC 9B 18 13 04 BA 93 EC 60 D2 41 9B 8A>)
(   3,<2007-11-22 11:08:30.74 +000>,<MAYBRIDGE\nmr>,<NMR_250MHZ>,
      <apk 
       data hash MD5: 32K
       FB DC F1 05 A7 F3 A5 F2 56 F3 38 26 10 35 A4 83>)
(   4,<2007-11-22 11:08:31.47 +000>,<MAYBRIDGE\nmr>,<NMR_250MHZ>,
      <abs ABSG = 5 
       data hash MD5: 32K
       A1 7D DB BA 86 12 DF 2A 03 A5 49 88 D4 80 C5 71>)
$$ ##END=
$$ 
$$ hash MD5
$$ 66 61 9A 48 F2 01 2E CE FA 71 B9 20 DE 88 69 13
##$RELAX= 
##$RELAX= 
##$RELAX= 
##$RELAX= 
##$RELAX= 
##$RELAX= 
##$RELAX= 
$$ Bruker specific parameters
$$ --------------------------
##$DU= <C:\u>
##$EXPNO= 2070
##$NAME= <ADRS>
##$PROCNO= 1
##$TYPE= <nmr>
##$USER= <dgb>
##$AMP= (0..31)
100 100 100 100 100 100 100 100 100 100 100 100 100 100 100 100 100 100 
100 100 100 100 100 100 100 100 100 100 100 100 100 100 
##$AQSEQ= 0
##$AQ_mod= 3
##$AUNM= <au_zg>
##$AUTOPOS= <12 >
##$BF1= 250.13
##$BF2= 250.13
##$BF3= 250.13
##$BF4= 250.13
##$BF5= 500.13
##$BF6= 500.13
##$BF7= 500.13
##$BF8= 500.13
##$BYTORDA= 1
##$CFDGTYP= 0
##$CFRGTYP= 5
##$CHEMSTR= <none>
##$CNST= (0..31)
1 1 145 1 1 1 1 1 1 1 1 1 1 1 1 1 1 1 1 1 1 1 1 1 1 1 1 1 1 1 1 1 
##$CPDPRG= <>
##$CPDPRG1= <>
##$CPDPRG2= <>
##$CPDPRG3= <>
##$CPDPRG4= <mlev>
##$CPDPRG5= <mlev>
##$CPDPRG6= <mlev>
##$CPDPRG7= <mlev>
##$CPDPRG8= <mlev>
##$CPDPRGB= <>
##$CPDPRGT= <>
##$D= (0..31)
0 1 0 0 0 0 0 0 0 0.06 0 0 0 0 0 0 0.0002 0 0 0 0 0 0 0 0 0 0 0 0 0 0 
0 
##$DATE= 1195729693
##$DBL= (0..7)
120 120 120 120 120 120 120 120 
##$DBP= (0..7)
150 150 150 150 150 150 150 150 
##$DBP07= 0
##$DBPNAM0= <>
##$DBPNAM1= <>
##$DBPNAM2= <>
##$DBPNAM3= <>
$$ [...]
##$SUBNAM7= <"">
##$SUBNAM8= <"">
##$SUBNAM9= <"">
##$SW= 20.6930455092707
##$SWIBOX= (0..15)
0 0 3 0 0 0 0 0 0 0 0 0 0 0 0 0 
##$SW_h= 5175.983436853
##$TD= 65536
##$TD0= 1
##$TE= 295.16
##$TE2= 300
##$TE3= 300
##$TEG= 300
##$TL= (0..7)
0 120 120 120 120 120 120 120 
##$TP= (0..7)
150 150 150 150 150 150 150 150 
##$TP07= 0
##$TPNAME0= <>
##$TPNAME1= <>
##$TPNAME2= <>
##$TPNAME3= <>
##$TPNAME4= <>
##$TPNAME5= <>
##$TPNAME6= <>
##$TPNAME7= <>
##$TPOAL= (0..7)
0.5 0.5 0.5 0.5 0.5 0.5 0.5 0.5 
##$TPOFFS= (0..7)
0 0 0 0 0 0 0 0 
##$TUNHIN= 0
##$TUNHOUT= 0
##$TUNXOUT= 0
##$USERA1= <user>
##$USERA2= <user>
##$USERA3= <user>
##$USERA4= <user>
##$USERA5= <user>
##$V9= 5
##$VALIST= <valist>
##$VCLIST= <CCCCCCCCCCCCCCC>
##$VD= 0
##$VDLIST= <DDDDDDDDDDDDDDD>
##$VPLIST= <PPPPPPPPPPPPPPP>
##$VTLIST= <TTTTTTTTTTTTTTT>
##$WBST= 1024
##$WBSW= 4
##$XGAIN= (0..3)
0 0 0 0 
##$XL= 0
##$YL= 0
##$YMAX_a= 295497
##$YMIN_a= -352429
##$ZGOPTNS= <>
##$ZL1= 120
##$ZL2= 120
##$ZL3= 120
##$ZL4= 120
##$ABSF1= 16.522
##$ABSF2= -4.171173
##$ABSG= 5
##$ABSL= 3
##$ALPHA= 0
##$AQORDER= 0
##$ASSFAC= 0
##$ASSFACI= 0
##$ASSFACX= 0
##$ASSWID= 0
##$AUNMP= <proc_1d>
##$AZFE= 0.1
##$AZFW= 0.1
##$BCFW= 0
##$BC_mod= 0
##$BYTORDP= 0
##$COROFFS= 0
##$CY= 12.5
##$DATMOD= 1
##$DC= 0
##$DFILT= <>
##$DTYPP= 0
##$F1P= 14.0000005364418
##$F2P= -0.99999901652339
##$FCOR= 0.5
##$FTSIZE= 32768
##$FT_mod= 6
##$GAMMA= 0
##$GB= 0
##$INTBC= 1
##$INTSCL= 1
##$ISEN= 128
##$LB= 0.3
##$LEV0= 0
##$LPBIN= 0
##$MAXI= 10000
##$MC2= 0
##$MEAN= 0
##$ME_mod= 0
##$MI= 0
##$NCOEF= 0
##$NC_proc= -4
##$NLEV= 6
##$NOISF1= 0
##$NOISF2= 0
##$NSP= 0
##$NTH_PI= 0
##$NZP= 0
##$OFFSET= 16.522
##$PC= 1
##$PHC0= 163.5044
##$PHC1= 7.115154
##$PH_mod= 1
##$PKNL= yes
##$PPARMOD= 0
##$PSCAL= 4
##$PSIGN= 0
##$REVERSE= no
##$SF= 250.13
##$SI= 32768
##$SIGF1= 0
##$SIGF2= 0
##$SINO= 400
##$SIOLD= 32768
##$SREGLST= <1H.DMSO>
##$SSB= 0
##$STSI= 32768
##$STSR= 0
##$SW_p= 5175.98343685301
##$SYMM= 0
##$S_DEV= 0
##$TDeff= 65536
##$TDoff= 0
##$TI= <Analysis number 999999
Compound Code 99
Book Reference 9
Project Code 9>
##$TILT= no
##$TM1= 0
##$TM2= 0
##$TOPLEV= 0
##$USERP1= <user>
##$USERP2= <user>
##$USERP3= <user>
##$USERP4= <user>
##$USERP5= <user>
##$WDW= 1
##$XDIM= 32768
##$YMAX_p= 275334037
##$YMIN_p= -316718
$$ End of Bruker specific parameters
$$ ---------------------------------
##NTUPLES= NMR SPECTRUM
##VAR_NAME=  FREQUENCY,     SPECTRUM/REAL,   SPECTRUM/IMAG
##SYMBOL=    X,             R,               I
##VAR_TYPE=  INDEPENDENT,   DEPENDENT,       DEPENDENT
##VAR_FORM=  AFFN,          ASDF,            ASDF
##VAR_DIM=   32768,         32768,           32768
##UNITS=     HZ,            ARBITRARY UNITS, ARBITRARY UNITS
##FACTOR=    0.157963299565203, 1,           1
##FIRST=     4132.6476996994, 0,             0
##LAST=      -1043.33573715361, 0,           0
##MIN=       -1043.33573715361, -316718,     0
##MAX=       4132.6476996994, 275334037,     0
$$ Real data points
##PAGE= N=1
##DATA TABLE= (X++(R..R)), XYDATA
$$ [...]
16118E8875m2275p7445N0593L1465n2530m1807o927Q790q4275k1932j7645R6246
16106i8867K6314N9883K7996p6950J1591M6048n4826j08085l0040J6295K8560
16095a52081L7077K0082K3659p5693k9598J7178M4511N0226r602k7105P2853M8047
16083A9554n0913n1761l3286n6046K0922m8191j5776N3422J8958M1754l4664L3759
16071a02268K4942K4591k8841r9068j1688N5386Q9832J3913K7027K8259M2380
16060F4465q7813n2847o188l536L9293l0978N7341Q351K5928L021q1013k4141
16048h8117k3259O8988J33482J2902n8343j815K8291j0340J3759r9642N418K0149
16036A473L1466J8551j723m4225m0662k5057k6479o1532Q9027M5349l4118m8431
$$ plain form
16118 58875 16600 -60845 -10252 21213 -31317 -73124 -80051 -71261 -155536 -177468 -195113 -98867
16106 -98867 -72553 -12670 15326 -61624 -50033 -3985 -58811 -166896 -196936 -180641 -152081
16095 -152081 -115004 -94922 -71263 -146956 -176554 -159376 -114865 -64639 -74241 -101346 -28493 19554
16083 19554 -31359 -83120 -116406 -172452 -151530 -199721 -215497 -162075 -143117 -101363 -136027 -102268
16071 -102268 -77326 -52735 -81576 -180644 -192332 -136946 -47114 -33201 -6174 22085 64465
16060 64465 -23348 -76195 -82383 -85919 -46626 -77604 -20263 -11912 14016 17037 -63976 -88117
16048 -88117 -111376 -42388 91094 103996 45653 43838 72129 61789 75548 -24094 -18676 1473
16036 1473 32939 51490 49767 5542 -35120 -60177 -86656 -148188 -59161 -13812 -47930 -96361
16024i6361r234m7960j6650R4229R7554j9206j4545K1675N792M268O8907n641
16012H2828j17531K2247K1231M2700M3088k7427m1854o3859o0585j368R002p25
16000i2253j2924K2744j1406M6973j2798L2653J1328q2507m5813l344J32986K2206
15988G845p3186N979J9423M1466k1228k6088l0020j903j254J3302M0742O9109
15976D4187O7041p9945p8009M2690L7134J4424k8416m4169P5793R006j00432o7500
15964a08196J2423L5470P8465L2248N606l0923k7290J9810K5880r458J6051l0139
15952A9947j04745o135K0325K3751n5500O6767J4379o496r653L6322k8407J6668
15940a2777K4347o409M8343n3979n8468m1870m572k7911L7989J20755j4697l5967
$$ plain form
16024 -96361 -105595 -153555 -170205 -75976 21578 2372 -12173 9502 15294 19562 88469 82828
16012 82828 -34703 -12456 8775 51475 94563 67136 25282 -38577 -99162 -100530 -91528 -92253
16000 -92253 -105177 -82433 -93839 -46866 -59664 -27011 -15683 -98190 -144003 -147347 -14361 7845
15988 7845 -65341 -59362 -39939 1527 -19701 -45789 -75809 -77712 -78966 -65664 -24922 44187
15976 44187 111228 31283 -46726 -4036 33098 47522 19106 -25063 50730 59736 -40696 -108196
15964 -108196 -95773 -60303 18162 50410 56016 25093 -2197 17613 43493 34035 50086 19947
15952 19947 -84798 -90933 -70608 -46857 -102357 -35590 -21211 -27707 -37360 -1038 -29445 -12777
15940 -12777 11570 5161 53504 -475 -58943 -100813 -105385 -133296 -95307 25448 10751 -25216
15928b5216o5208J9902K2595J2056L2884K3236M6946q612M1361m5614o8548j6344
15916c0562j9701J9414P949L963j3188J3130o2178n2085J21490K5290L1115M180
15904D8817Q2210Q2807o0931n6733J881K4362M8313o6661r9826K0924p9651p4782
15892a29270k3384P9518k3138n0972j3234L4343j5538n9539K1406k7646K5060
15881a82394l1924P915O9333J1905R519N9538K6793j6884J0558l1275L5030l378
15869c5264o486O4987n9730j18842k5097O0149J20422L7032K7424o1589l6709
15858c3703o1275Q4483R4731J7899k4711o3221j9986J9303M8780K4460o3931k5693
15846b864J12m3518o1547o355n6247l3653o133l7546L949M2846L4392J22866M6175
$$ plain form
15928 -25216 -90424 -70522 -47927 -35871 -2987 20249 67195 58583 99944 54330 -14218 -30562
15916 -30562 -50263 -30849 -22900 -18937 -32125 -18995 -81173 -133258 -11768 13522 44637 48817
15904 48817 131027 213834 152903 96170 98051 122413 170726 104065 4239 25163 -54488 -129270
15892 -129270 -152654 -73136 -96274 -147246 -160480 -126137 -141675 -201214 -179808 -207454 -182394
15881 -182394 -214318 -206403 -137070 -125165 -115646 -56108 -29315 -46199 -35641 -66916 -31886 -35264
15869 -35264 -41750 23237 -36493 -155335 -180432 -120283 139 37171 64595 3006 -33703
15858 -33703 -94978 -10495 84236 102135 77424 14203 -5783 13520 62300 86760 22829 -2864
15846 -2864 -2752 -46270 -107817 -114172 -170419 -204072 -210205 -247751 -243802 -200956 -166564 -43698 2477
15833B477n2916k3343n1782p8207Q7017P8424L513O2118N139j33703K1368J53459
15821G3564p0561r5276j4002l7469j6756P704J1496j1770K9660O7700P8298K0907
15809D3495o1216K8170k8861m8465j4494M67J9892l7004l4444K4086J17065M2662
15797E1353j8296J3732m9955j32774M2770Q4878R8070J858k4474k141K8231j6158
15785G7094k2612K2670J9305l4536o8505l755M9717J839l7235L3908j16584m5837
15773a24531L6570j6754Q515O2050M439k5672m2283j694r921J9538j9244K5008
15761h3979O1728O0823j4493l6857K3681M3718j07725o7057j6227p3548P6523
15750a33413J22516Q5516m6346j06650k4751Q9526L1143j0181m4707J3491L2764
$$ plain form
15833 2477 -50439 -73782 -125564 -203771 -116754 -38330 -34817 27301 32440 -101263 -79895 73564
15821 73564 3003 -92273 -106275 -143744 -160500 -152796 -141300 -153070 -123410 -55710 22588 43495
15809 43495 -17721 10449 -18412 -66877 -81371 -80904 -61012 -98016 -132460 -108374 8691 51353
15797 51353 33057 46789 -3166 -135940 -93170 -8292 89778 91636 67162 65021 93252 77094
15785 77094 54482 77152 96457 61921 -6584 -10339 39378 41217 3982 37890 -78694 -124531
15773 -124531 -87961 -104715 -96200 -34150 -29711 -55383 -97666 -99360 -109281 -89743 -108987 -83979
15761 -83979 -22251 38572 24079 -12778 10903 54621 -53104 -120161 -136388 -209936 -133413
15750 -133413 -10897 74619 28273 -78377 -103128 -13602 17541 7360 -37347 -23856 8908
15739H908l9585m4524k3875J3141L0405O5862m9486J398p8107M1638M3461M9584
15727A8820p6406n3629K6057p202k325Q1604N1905J5221r1485p8727J6414j1804
15715a11557L4673n7506M7422M4834j19916j3575K8951O0547j3163q9895K9795
15704a59390Q8441L1695J0683J4459p152m9980l428k1582O0729P0186K3188l1191
15692B6658l9693N3980k2988j10306j5390k3173q9061n544R1694J93030M4185
15681A03392m3585o9212J15221K7836j39465J7031M1923p4131K1365L61p1897
15670g1161J83O3889m0766r385j8277N8831P0013L674k6538R427r8402o4027J10124
15657a2415J00273K0989L4066o5814l7579l1077l1321j9183N971j02113q957l5994
$$ plain form
15739 8908 -30677 -75201 -99076 -85935 -55530 10332 -39154 -37756 -115863 -74225 -30764 18820
15727 18820 -57586 -111215 -85158 -92360 -94685 -13081 38824 54045 -37440 -116167 -99753 -111557
15715 -111557 -76884 -134390 -86968 -42134 -162050 -175625 -146674 -86127 -99290 -189185 -159390
15704 -159390 -70949 -39254 -28571 -14112 -21264 -71244 -74672 -96254 -35525 34661 57849 26658
15692 26658 -13035 40945 17957 -92349 -107739 -130912 -219973 -225517 -133823 59207 103392
15681 103392 59807 -9405 105816 133652 -5813 11218 53141 -20990 375 736 -71161
15670 -71161 -70978 -7089 -47855 -57240 -75517 -16686 53327 57001 30463 39890 -58512 -122539 -12415
15657 -12415 87858 108847 142913 77099 39520 8443 -22878 -42061 -36090 -138203 -147160 -183154
15645a83154L4439R3033l2328k7365Q3874M8223n4554n1408N2140J3991l3608
15634e6717j8169k1682m7883m8335k3485K8718O4279J42753K9185m6091O1826
15623F4399L1074m3539k3657l1847n5160k7190N5556m4547q466K4283l2660m9961
15611a41715J5598K2970P484K2382n1694r877l1999p543k692o9301L9573K9826
15599a76988N5099O5629J800L6001J8610k7545p2227j9072k6137L0397J11822
15588b611J8789l3715l0214K6514M7957l802n6005m5501N4547K9255k7644o1153
15576h3583l3431L5835j8782M9534M5838l9176o0886K0811J11407k272q009J8115
15564C5401n5894M3689K2850r8021j2952N902l8251j1522Q2235Q5360l1665m06
$$ plain form
15645 -183154 -148715 -55682 -88010 -115375 -31501 16722 -37832 -89240 -37100 -23109 -56717
15634 -56717 -74886 -96568 -144451 -192786 -216271 -187553 -123274 19479 48664 2573 64399
15623 64399 95473 51934 28277 -3570 -58730 -85920 -30364 -74911 -83377 -59094 -91754 -141715
15611 -141715 -126117 -103147 -95663 -73281 -124975 -134852 -166851 -174394 -177086 -246387 -206814 -176988
15599 -176988 -121889 -56260 -54460 -18459 151 -27394 -99621 -118693 -144830 -114433 -2611
15588 -2611 16178 -17537 -47751 -21237 26720 22918 -33087 -78588 -24041 5214 -22430 -83583
15576 -83583 -117014 -81179 -99961 -50427 -4589 -43765 -104651 -83840 27567 25295 17286 35401
15564 35401 -20493 23196 46046 -51975 -64927 -59025 -97276 -108798 -26563 58797 27132 26726
15552B6726o3409k9262R7911j9957j9162l3564k261M5934k0986K8615N1185M8227
15540A09997k6838o8488M3287q8418r0344M7559P0005N457L8806J9395k6260o9272
15528c5114o1660K2937P2450k7426q3041J5087J31142R9672j11796m3588k1960
15517d3297q4248N4473K2950n0211K9382k1728n7k7823J01578j3255n5739J33014
15505D5039L3866p5253j12235j5828P3042K9523J2808l4411M297R7440O8204m5325
15493H1167J8125K2407j14758l7957N1522M6347J661N1183j4500K251j29902m1079
15481f3533Q906K5414j5834Q022K3025Q861m0326k2544Q6484O1971J9483r7405
15469B524k7569j49932n8075M1681K972K9813K5155K1965L0317P777L7489N0413
$$ plain form
15552 26726 -36683 -65945 31966 12009 -7153 -40717 -42978 2956 -18030 10585 61770 109997
15540 109997 83159 14671 57958 -30460 -120804 -73245 -3240 2217 41023 60418 34158 -35114
15528 -35114 -96774 -73837 -1387 -28813 -111854 -96767 34375 134047 22251 -21337 -43297
15517 -43297 -127545 -73072 -50122 -100333 -70951 -92679 -92736 -120559 -18981 -32236 -87975 45039
15505 45039 78905 3652 -108583 -124411 -51369 -21846 -9038 -43449 -39152 58288 126492 81167
15493 81167 99292 121699 6941 -31016 20506 66853 68514 119697 105197 107448 -22454 -63533
15481 -63533 -54627 -29213 -45047 -37025 -14000 -5139 -45465 -68009 18475 80446 99929 2524
15469 2524 -25045 -174977 -233052 -191371 -188399 -158586 -133431 -111466 -81149 -73372 -35883 14530
15457A4530J01781p5390k8012J6046q0168o704k2841J712N3768L2495p7445O1546
15445h682k4123q3142j9291Q9225R2094M1484P0772K4184l5226r6108p6363k4402
15433d9578j3227O4581K8469J0492k2800O6165l1863J6887l4239p8030m235P5189
15421B7811J950j24194m7596L8910P8910K6158j13307l7881q474J5938L7561N1437
15409e2777l0894k5533N5332M2407k6041m9334J3568j0143q660K029N9234N7233
15397B6421R9047m503o6596j086j7909P3860l1395q1480n5103J4987R5500k0754
15385C0989o5256l1934m8156P4322O2891m1431N040K3098O5717P497k1316q7214
15373b5753q5429K0201K5272M6841J0686L156o010n7803K8613M2443k3981J6902
$$ plain form
15457 14530 116311 40921 12909 28955 -51213 -57917 -80758 -79046 -25278 7217 -70228 -8682
15445 -8682 -32805 -115947 -135238 -46013 46081 87565 158337 182521 147295 51187 -25176 -49578
15433 -49578 -62805 1776 30245 40737 17937 84102 52239 69126 34887 -43143 -47378 27811
15421 27811 29761 -94433 -142029 -103119 -24209 1949 -111358 -149239 -157713 -141775 -104214 -52777
15409 -52777 -83671 -109204 -53872 -11465 -37506 -86840 -73272 -83415 -92075 -90046 -30812 26421
15397 26421 125468 120965 54369 53283 35374 109234 77839 -3641 -58744 -43757 51743 30989
15385 30989 -34267 -66201 -114357 -40035 22856 -18575 -13535 9563 75280 82777 61461 -25753
15373 -25753 -111182 -90981 -65709 -18868 -8182 -5026 -11036 -68839 -40226 2217 -21764 -4862
15361d862n3413l2718j2654M3642J7846M2563J4372j00842r075J1716N9417M8166
15349B4158q785j6940P0538o1337q2080n3634k9151r9843q512J54456J11894P3141
15337G3905L2576m4699p8532O838L2560R0044M0896k2060l1068K6732j19978J8516
15325B5730J6699L5919q2755m1906P411k2516K4593O6203N1811K5714o9264k2563
15313A5076j1326k5405M5205K2686m5236k3822j0748M651J1978Q055Q9258l3577
15301D6795m6580M4745N4643l7007l2089J943K0447L591m2738n097M6822m2202
15289A3273O1325k8367p8034k7631m0023r8246L1789J10686K3752P6233N6868
15278A01625j2684o6074k3881o9680N0606M8337l9162R6981Q5k1358j0264j00652
$$ plain form
15361 -4862 -58275 -90993 -103647 -60005 -42159 404 14776 -86066 -95141 -83425 -24008 24158
15349 24158 15373 -1567 68971 7634 -74446 -128080 -157231 -257074 -265586 -111130 764 73905
15337 73905 106481 61782 -16750 -9912 22648 112692 153588 131528 100460 127192 7214 25730
15325 25730 42429 78348 -4407 -46313 -38902 -61418 -36825 29378 81189 106903 37639 15076
15313 15076 3750 -21655 23550 46236 1000 -22822 -33570 -28919 -16941 -8886 80372 46795
15301 46795 215 44960 99603 62596 30507 32450 52897 56488 13750 8653 55475 13273
15289 13273 74598 46231 -31803 -59434 -99457 -197703 -165914 -55228 -31476 44757 101625
15278 101625 88941 22867 -1014 -70694 -20088 28249 -10913 86068 86153 64795 54531 -46121
15266d6121o2481j0513R5482L1807k6647n2341j2526l2336P4419J0112Q1965J05334
15254A56154L4256n9959l0086j19923o5481J5766M8932J54588j8879m5315n9967
15243A0086q543l3408m9161J2071O5878J3335L859k9725m9757J3289O7373J8212
15231C3509j4342p024k0708k8133K9993K3601m1361n4859O059K6754n152J4633
15219c7030o5168O258P204N2448N7442J2615K0069j7240n7989p3785j6827p644
15207a19647P6310P3452L0187n3735n1319J23153p220r0769o196p8912N01p035
15195a11230o2322j0028P4257L2586N4962L8107m8000r913l1757M8384j3685r7232
15183a35871o3340K0992J08955j3440r408N3584j3105N7434P6190q2239M3698
$$ plain form
15266 -46121 -108602 -119115 -23633 8174 -18473 -70814 -83340 -115676 -41257 -31145 50820 156154
15254 156154 190410 130451 100365 -19558 -85039 -69273 -20341 134247 115368 70053 10086
15243 10086 1543 -31865 -81026 -68955 -3077 10258 14117 -15608 -65365 -52076 15297 33509
15231 33509 19167 12143 -8565 -36698 -6705 16896 -24465 -79324 -73265 -46511 -51663 -37030
15219 -37030 -102198 -95940 -88736 -36288 21154 33769 53838 36598 -21391 -95176 -112003 -119647
15207 -119647 -43337 30115 60302 6567 -44752 78401 71181 -19588 -25784 -104696 -104195 -111230
15195 -111230 -173552 -183580 -109323 -76737 -21775 16332 -31668 -41581 -73338 -24954 -38639 -135871
15183 -135871 -199211 -178219 -69264 -82704 -92112 -38528 -51633 5801 81991 -248 43450
15172D3450J3712q7825J2917m204l9602P0071R6248n3099m4190J6197p021m2487
15160b5833o1391O5445L6180p7121n3597m7203r861M8954J3771M5620P7227J8973
15148C1164j0689Q367j9834k0887J456J5038k6452M7543L828l7306l6308L0237
15136a3843J3882k2687J9804j4316J2898J1231J4831j7953j0102k3124l6843M5008
15124b1214K1890p199K5q8950L6834P3740N8104m5583l1217L5909K6566m0292
15112A8613m4328O4349k2101J7719r808l5669l8253K1873N2945M1577N2140m3272
15100G5785j12840l6443Q3318P305L5294j1052p6141j7763j033M9485M3401p9904
15088d0588o2844L6260M293m1813k3050J6256R5399O9406q3824q6497R783o770
$$ plain form
15172 43450 57162 -30663 -17746 -21950 -61552 8519 104767 51668 7478 23675 16654 -25833
15160 -25833 -87224 -21779 14401 -62720 -116317 -163520 -173381 -124427 -110656 -65036 12191 31164
15148 31164 20475 28842 9008 -11879 -10423 4615 -21837 25706 29534 -7772 -44080 -13843
15136 -13843 39 -22648 -2844 -17160 -4262 6969 21800 3847 -6255 -29379 -66222 -21214
15124 -21214 676 -6523 -6498 -95448 -58614 15126 73230 27647 -3570 32339 58905 18613
15112 18613 -25715 38634 16533 34252 24444 -11225 -49478 -27605 25340 66917 119057 75785
15100 75785 -37055 -73498 9820 17125 52419 41367 -34774 -52537 -53570 -4085 39316 -40588
15088 -40588 -103432 -67172 -62879 -104692 -127742 -111486 -16087 53319 -30505 -117002 -107219 -113989
15076a13989r2426l1715L7957k80K7761m731O8008J51538l0438n7751k2394P1665
15064C205N0755m4897j24416j03995K3742J36169P3188K6602l126N8020L9511
15053A34758q5775n769j1104J0200O5445M1431o6102o5154O689J5922J8850m8966
15041A0425j04269K0216M7187m1340K2471J8276l6841N3170J01079j1481J0903
15030H9796k7740n0965r7243r2068j8272Q9407M6360o7961R8412R8090K3255l3347
15018E7724M6899R3895o7085j36102p3272m8270m3141N9755l65O8372L2025R638
15006G3J37787m0352m0215K3546k6034N892o6697m7073o1673J2198l428j873N2370
14993e5479n9929M8657Q7404J1267l7865n9046j3382k8780M2732J2423j261M5064
$$ plain form
15076 -113989 -206415 -238130 -200173 -200453 -172692 -177423 -109415 42123 11685 -46066 -68460 3205
15064 3205 53960 9063 -115353 -219348 -195606 -59437 13751 40353 37227 95247 134758
15053 134758 48983 43214 32110 42310 107755 149186 83084 17930 24619 40541 59391 10425
15041 10425 -93844 -73628 -26441 -67781 -45310 -27034 -63875 -10705 90374 78893 89796
15030 89796 62056 11091 -86152 -178220 -196492 -107085 -60725 -128686 -30274 67816 91071 57724
15018 57724 104623 198518 131433 -4669 -77941 -126211 -169352 -109597 -109962 -41590 -9565 73
15006 73 137860 97508 57293 80839 54805 60697 -6000 -53073 -114746 -102548 -105976 -107849 -55479
14993 -55479 -115408 -66751 20653 31920 -5945 -64991 -78373 -107153 -64421 -51998 -53259 -8195
14981h195K5126Q6803J8042p8362l5034k8487M6047j4712m6337n1823N5115M1382
14969I565k3037q6031L8007J1888J4720O8675J4743K4875L2481k6710l4689o2635
14957a8148Q4400R80n3142L8448P8462j264l0145n0612j4172k1917L1644k6472
14945A8062j14310p7650k6776R8551N1785r334M2552k4904m3114M5938K0069O8835
14933D9704N2781q6208j26485j02174J4716p8219M9427O3536Q6711k7053Q680
14922i4584J1884L8336M1706Q2789L4210r7134o9449n042J3924K8448k0485m4645
14910h0042k3446J8449K6424K0698m815J17319M3540J885o5596m2103J0539n4219
14898c1367l3102K4277r2739P5732M1421P3267o1899o0747k9025J4067n5632k5672
$$ plain form
14981 -8195 16931 103734 121776 43414 8380 -20107 25940 11228 -35109 -86932 -31817 9565
14969 9565 -13472 -99503 -61496 -49608 -34888 33787 48530 73405 105886 79176 44487 -18148
14957 -18148 66252 67232 14090 52538 131000 129736 99591 48979 34807 12890 44534 18062
14945 18062 -96248 -173898 -200674 -102123 -50338 -59672 -17120 -42024 -85138 -39200 -19131 49704
14933 49704 102485 16277 -110208 -212382 -197666 -275885 -226458 -162922 -76211 -103264 -94584
14922 -94584 -82700 -44364 -2658 80131 114341 17207 -52242 -57284 -43360 -14912 -35397 -80042
14910 -80042 -103488 -85039 -58615 -37917 -42732 74587 118127 120012 54416 12313 22852 -31367
14898 -31367 -64469 -40192 -132931 -57199 -15778 57489 -4410 -65157 -94182 -80115 -135747 -161419
14886a61419J16380N5839n1912l2519l003N3972J1982p7500p0354M1352J4945
14875a02237J19j4447J7058N760O370J11759K8512k2281j0732j8956O5K8092r19
14862B8163j33309j853J02696N192N9232K2598l2774r4388n8123q361M6163n0934
14850a15698J5362L1743l2906J03852R7974M4114l7907l2443O807p1502N4554
14839F3950j394L3297q0260n9568Q050m177M3526q1622K2930j4037K6217N027
14827c8061m8914r7663m8412M4001P9461K450J8672j1499Q293K1861J199m8467
14815a17079m2008Q0611L4225m3925J4304j2714P285k0360N0286L9788k2156K5964
14803e779k193K2917K4954K0090n1396p3988l583J02405p4512j59155L9608Q3471
$$ plain form
14886 -161419 -45039 10800 -41112 -73631 -76634 -22662 -10680 -88180 -158534 -117182 -102237
14875 -102237 -102118 -116565 -99507 -93747 -87377 24382 52894 30613 19881 925 990 29082 28163
14862 28163 -105146 -106999 -4303 889 60121 82719 49945 -44443 -102566 -110927 -64764 -115698
14850 -115698 -100336 -68593 -101499 2353 100327 144441 106534 74091 80898 9396 63950
14839 63950 62556 95853 15593 -43975 -35925 -40102 3424 -78198 -55268 -69305 -43088 -38061
14827 -38061 -86975 -184638 -233050 -189049 -109588 -107138 -88466 -99965 -91672 -69811 -68612 -117079
14815 -117079 -159087 -78476 -44251 -88176 -73872 -86586 -79301 -99661 -49375 -9587 -31743 -5779
14803 -5779 -7972 14945 39899 59989 8593 -65395 -68978 33427 -41085 -200240 -160632 -77161
14791g7161K6255K8425j3670n7807p3368o2973o453P1636J25970n847k8310j1099
14779h4402N5049J538m1484K4226L8837R1660O5443J6484o1199k2881M5995m0560
14767H8706l406k4481k0635p5182P1774M7612j9882l7638N5997M2704m3580m2377
14755C9612M4823n6482o3872J0701J9089J4519Q4231K9290p8786n8982N866N1474
14743D1483m0390N5026K0078L0552J7456q1518j2391P840n529k3859Q6196Q0465
14731A75409r335p5709n8392k3030j7336j5324p4688N641J7424N3252P0712K8085
14719G6709j3044K7077k5046l1347p1667l0448P1707K4886j5764k6182L2910o9863
14707e0072n3648n9642M6714P2635J912j06293l1740N5275Q2003j0613K4791P37
$$ plain form
14791 -77161 -50906 -22481 -36151 -93958 -167326 -230299 -236752 -165116 -39146 -44993 -73303 -84402
14779 -84402 -29353 -27815 -69299 -45073 -6236 85424 150867 167351 106152 83271 129266 88706
14767 88706 85300 60819 40184 -34998 36776 84388 64506 26868 82865 125569 81989 39612
14755 39612 84435 27953 -35919 -25218 -6129 8390 92621 121911 43125 -15857 -9991 41483
14743 41483 1093 56119 76197 106749 124205 42687 30296 38136 32607 8748 94944 175409
14731 175409 166074 90365 31973 8943 -8393 -23717 -98405 -92764 -75340 -22088 48624 76709
14719 76709 63665 90742 65696 34349 -37318 -67766 3941 28827 13063 -13119 19791 -50072
14707 -50072 -103720 -163362 -116648 -44013 -42101 -148394 -180134 -124859 -42856 -53469 -28678 -27941
14695b7941M7187l1340j92353p224O8821J8875L4892M2967K084m217r508j8866
14683g6623M1466J8117n2039k8443R7071k1515p5217L9209J2151k7615k4674J1686
14671h6426m0121K8062n704R720J8323N187l2390r052N1151J9O8610K6612k8862
14658E129M2030j9834o9828r193M6939L7967M6058M941n8198m2926j35400N1511
14646a00804J20554L9450j16428o614J5534J4187M0043l4012l5371P6868m7458
14635c4051o3044M5087M0001M1736j9573k1114O211M0870k2524j3196j802M7792
14623D6393k9905k0915j7452M437k1960j9238J7072Ok1604J14122L601n0219j9866
14610a5528m6811n4374M0710K5009R425O4793p735o3990r381Q5294o469l4161
$$ plain form
14695 -27941 19246 -12094 -204447 -211671 -142850 -123975 -89083 -46116 -44032 -48249 -57757 -76623
14683 -76623 -35157 -17040 -69079 -97522 -451 -21966 -97183 -57974 -45823 -73438 -98112 -86426
14671 -86426 -126547 -98485 -104189 -94469 -76146 -70959 -103349 -112401 -61250 -61231 7379 33991 5129
14658 5129 47159 27325 -42503 -51696 -4757 33210 79268 84209 26011 -16915 -152315 -100804
14646 -100804 19750 59200 -57228 -63842 -48308 -34121 5922 -28090 -63461 13407 -34051
14635 -34051 -97095 -52008 -12007 29729 10156 -10958 -4747 36123 13599 403 -1399 46393
14623 46393 16488 -4427 -21879 -17442 -39402 -58640 -41568 -41562 -63166 50956 54557 4338 -15528
14610 -15528 -62339 -116713 -76003 -50994 -41569 23224 15489 -48501 -57882 27412 20943 -13218
14598a3218L4802M6838k2418j7613k6148n4288m3112o289L3698P4409l6261j02081
14586a31681K1224o0766l1932J27404K8911M8113K9143j1474k4271M349j2018
14575a2998O004j05392L2024O3675M725K0745L6160l5755J098j2844q0204Q3105
14563C43M9511p5350J8380n4571N6251M1168l0220m2986k3502O998N4655J640
14551B317n0969Q445Q5685m4657n8155M7076J05022r635l5503o5237m4410k7198
14539h7219M2918L058r059k0216p5998J6131J1178m6720L4132L8527J08157k2024
14527g135L7441l983o0611L8715N2520r527M1990M148k5165m7865l9683P8133
14515E8978j3216q1972k4775L6129l6577n7583k0747l1584P3424q500k81j3334
$$ plain form
14598 -13218 21584 68422 46004 28391 2243 -52045 -95157 -101446 -67748 6661 -29600 -131681
14586 -131681 -110457 -171223 -203155 -75751 -46840 1273 30416 18942 -5329 -980 -12998
14575 -12998 -6994 -112386 -80362 -16687 -11962 8783 44943 9188 10286 -2558 -82762 343
14563 343 49854 -25496 -7116 -61687 -5436 35732 5512 -37474 -60976 -53978 677 2317
14551 2317 -48652 -40207 45478 821 -57334 -10258 94764 85129 49626 -15611 -60021 -87219
14539 -87219 -44301 -41243 -50302 -70518 -146516 -130385 -119207 -165927 -131795 -93268 14889 -7135
14527 -7135 30306 26323 -34288 4427 56947 47420 89410 93558 68393 20528 -19155 58978
14515 58978 45762 -36210 -60985 -24856 -61433 -119016 -139763 -171347 -97923 -106423 -106704 -120038
14503a20038M3089K9165J2011K9012P5600L8296O1383M3465m6108j00509j53295
14492h7929p3515O2595N0542O3705P9339M392R070n0565j6407O0600P3750r5659
14480G9918k52425j6562K3645k0646j9255Q995N1388L2893J8789N3355K4985k16
14468a5136L0996l5929k1720O9333M0222m6955r3436l2482J6195O7486J13816
14457I2390J6969p1754n0186k2615l2288r7378l8262O3501M3656m6574P7992J1209
14445e3340k0649O2493J04317K3746j7712O2202K9553m8460p4447k8366K1377
14434F0714l5291r147p240l4282o431l0901l9823m218o3944l0495K5167Q062n513
14421a73342P410K7289P8974n1851O4513M7515K9277k2311l8497j4886P327K0370
$$ plain form
14503 -120038 -76949 -47784 -35773 -6761 68839 107135 168518 211983 165875 65366 -87929
14492 -87929 -161444 -98849 -48307 15398 94737 99129 108199 57634 41227 101827 175577 79918
14480 79918 -172507 -189069 -165424 -186070 -205325 -196330 -144942 -112049 -93260 -39905 -14920 -15136
14468 -15136 15860 -20069 -41789 27544 67766 20811 -72625 -105107 -88912 -21426 92390
14457 92390 109359 37605 -12581 -35196 -67484 -164862 -203124 -139623 -95967 -142541 -64549 -53340
14445 -53340 -73989 -11496 92821 116567 98855 161057 190610 142150 67703 39337 60714
14434 60714 25423 16276 9036 -25246 -31677 -62578 -102401 -106619 -170563 -201058 -175891 -167829 -173342
14421 -173342 -165932 -138643 -59669 -111520 -47007 508 29785 7474 -31023 -45909 -38582 -18212
14409a8212n7629j9996m2136K7633L2692P388K1326M614j7570o7836m6061P8041
14397i7746M0916M7686k6160l8369k2839M9549J7555l9649n2920l2854O8064k598
14385h9365l835j5102k740O775N2890r845m2948N2705K6722j4251n1564J3127
14373g7431O775o3408o683P1049j2371k992K0862K4625n5314l9466K0439J04719
14361i196k2602n6113N7113M0916L1825l9243m3701o0436N4373J24089n1449K0744
14349D6320n1843j04123Q1106k1769L6768K9327O86l7773j3351J1015L6450m2416
14337b9603n2032P3728N4532k8730m9773o1342k260K6707K3127J020n3934J5195
14325h3365L7645L4183M668j1873Q941m2339L0334K9642J4238M1708K3042M0798
$$ plain form
14409 -18212 -75841 -95837 -137973 -110340 -77648 -70260 -48934 -44320 -61890 -129726 -175787 -97746
14397 -97746 -56830 -9144 -35304 -73673 -96512 -46963 -29408 -69057 -121977 -154831 -86767 -89365
14385 -89365 -93200 -108302 -111042 -104267 -51377 -61222 -104170 -51465 -24743 -38994 -90558 -77431
14373 -77431 -70656 -134064 -140747 -69698 -82069 -85061 -64199 -39574 -94888 -134354 -113915 -9196
14361 -9196 -31798 -87911 -30798 10118 41943 2700 -41001 -101437 -47064 77025 25576 46320
14349 46320 -5523 -109646 -28540 -50309 -13541 15786 16472 -21301 -34652 -23637 12813 -29603
14337 -29603 -81635 -7907 46625 17895 -31878 -93220 -95480 -68773 -45646 -44626 -98560 -83365
14325 -83365 -45720 -11537 -6869 -18742 -9801 -52140 -21806 7836 22074 63782 86824 127622
14313A27622l2796q2457j9631l5201k6147M3248R4516N34m3764M2547o0020L5756
14301D4207l1322m3201n2477k5911P897P7408M702o3042p3138N1592N3287R190
14289d0808o8075L6051M5179j9122M9173j2143q9524j8844P9477R1345k3019p5509
14277d5819m7804M1503K2743n8133o2329P1387K0816n117L4127O8142P0753j03430
14265F839j15615l3367J42984J24315L7169n7355m3132j05103k2124O6606O6969
14254F8186K4712p2440l9214p6859j46M6682n1144j0181K4380O7696P2707J559
14242E5938L0392n0007p622L2748p5093l4754J4497J7390L9466R773K089L0993
14230F5810J406j24267n9758M5372L9708M4410k244o7827N7869J1833L3704j6782
$$ plain form
14313 127622 94826 12369 -7262 -42463 -68610 -25362 69154 69688 25924 68471 8451 44207
14301 44207 12885 -30316 -82793 -108704 -100807 -23399 -18697 -81739 -154877 -103285 -49998 -40808
14289 -40808 -108883 -72832 -27653 -46775 2398 -9745 -99269 -118113 -38636 52709 29690 -45819
14277 -45819 -93623 -52120 -29377 -87510 -149839 -78452 -57636 -62753 -28626 39516 110269 6839
14265 6839 -108776 -142143 841 125156 162325 104970 61838 -43265 -65389 1217 68186
14254 68186 92898 20458 -18756 -95615 -95761 -49079 -100223 -110404 -86024 -18328 54379 55938
14242 55938 86330 36323 28701 61449 -13644 -48398 -33901 -16511 22955 32728 34817 65810
14230 65810 67216 -57051 -116809 -71437 -31729 12681 10437 -57390 479 12312 46016 29234
14218B9234j5502l6259k8277k1484J3952o1482q2011J375J00216O2147l4468j5561
14206h8120L2883J5422k3767O816P7164j3726L257o9586R225N8001K3798k5094
14194F273P587n0664j5135R2745r6561j11046m07Q9087R3105J3115n4768p7918
14182a04587n2235L9690J0686o248O9124O3074l3029l7905Q2683J7390j7829J2821
14170D3635m3408o6133j1916M1287m2936k9032M0259L5900J0524n3970M0114L2579
14158c097J09381j3369p7135K022q7571q0224l6660K1221R4729K1853n1844l9512
14146a40206l754M3570M3239O7245N1531M2028K8458l3643l1339j09925o2160
14135a04956J2817L9841M5683n334n2593R418n2235L4932O9131j6867k0211l3288
$$ plain form
14218 29234 13732 -22527 -50804 -72288 -58336 -119818 -201829 -200454 -100238 -38091 -72559 -88120
14206 -88120 -55237 -39815 -63582 -56766 20398 6672 9929 -59657 -50432 7569 31367 6273
14194 6273 13860 -36804 -51939 40806 -55755 -166801 -167208 -78121 14984 28099 -26669 -104587
14182 -104587 -156822 -117132 -106446 -112694 -43570 19504 -13525 -51430 31253 48643 30814 43635
14170 43635 227 -65906 -77822 -36535 -79471 -108503 -68244 -32344 -21820 -75790 -35676 -3097
14158 -3097 106284 92915 15780 17802 -69769 -149993 -186653 -165432 -70703 -48850 -100694 -140206
14146 -140206 -143960 -100390 -57151 10094 61625 103653 132111 98468 67129 -42796 -104956
14135 -104956 -92139 -52298 -6615 -11949 -64542 -55124 -107359 -72427 -3296 -20163 -40374 -73662
14123g3662M8000r5841j20555M6490N5753J9540m1038J7351N4069N2456K0590
14112a6847q5359j1109M9493L2592N898N8651J46404K3505l5394j12194l1277
14101B4363p0880j9123K4796n2182P9034R4488L1124r4604k6064Q49J8733l3179
14089b2645n6568p3613Q3704P4661O5204p2222k6867N5766K066r2268q4429R60
14077a46251K5537J30045o3178o4337N4581O2989J4738O562n4952M8043n3961
14066d0184k4473L0492j9020l3360r635K0472q878J09L261J04241J3227j05146
14054f8894m0470P566J4489p1690o6472J00363Q0906q97k9448k6387N0673O3189
14042A2928j5577K446J8945j4643k7524O2415k2438r97n4528m5189j9911p7336
$$ plain form
14123 -73662 -25662 -121503 -242058 -195568 -139815 -120275 -161313 -143962 -89893 -37437 -16847
14112 -16847 -102206 -113315 -63822 -31230 -25332 33319 179723 203228 167834 55640 24363
14101 24363 -46517 -65640 -40844 -93026 -13992 80496 111620 17016 -9048 -8199 10534 -22645
14089 -22645 -79213 -152826 -69122 5539 70743 -1479 -28346 27420 29486 -62782 -147211 -146251
14077 -146251 -120714 9331 -53847 -118184 -63603 -614 14124 20686 -34266 13777 -40184
14066 -40184 -64657 -34165 -53185 -86545 -96180 -75708 -84586 -84477 -81216 23025 36252 -68894
14054 -68894 -109364 -101798 -87309 -158999 -225471 -125108 -44202 -45099 -74547 -100934 -50261 12928
14042 12928 -2649 -203 18742 4099 -23425 38990 16552 15555 -38973 -84162 -104073 -181409
14030a81409K0545n4511N5056J74132P0407p7888p0097m2871O3805M6284k101
14019A352p0513l1606R3533R269N4920m1784l9876k3988n6616J1037l8785J00157
14007c2900P6010L0243k156k2112q6657n7591J6909j7934j4173M692L6745P9165
13995A0241L7414K5701L077r3845n7660J6205J5396j9242j3867j3389K205N5291
13983c2473L0883m0788o879M004L1516M2463l9472m2569L9326j04990m9147N6904
13971a11222k5517L2630P2602O7875L2418j26546q0474M1653p800n8680j4166
13960a77227K47M9602M6048J5549K0744j0340M21j0822J7590N0464o2934M7811
13948a2847M1162K8795L8133L0240q0860l6947l3438J7289P1690J7028l9953L1661
$$ plain form
14030 -181409 -160864 -215375 -160319 13813 84220 6332 -63765 -106636 -42831 3453 1352
14019 1352 -69161 -100767 -7234 2035 56955 15171 -24705 -48693 -105309 -94272 -133057 -32900
14007 -32900 43110 73353 71197 49085 -37572 -95163 -78254 -96188 -110361 -105669 -68924 10241
13995 10241 47655 73356 76433 -17412 -75072 -58867 -43471 -62713 -76580 -89969 -87764 -32473
13983 -32473 -1590 -42378 -49257 -45253 -13737 28726 -10746 -53315 -13989 -118979 -168126 -111222
13971 -111222 -136739 -104109 -31507 36368 68786 -57760 -138234 -96581 -104381 -163061 -177227
13960 -177227 -176980 -127378 -81330 -65781 -45037 -55377 -54956 -65778 -48188 2276 -60658 -12847
13948 -12847 28315 57110 95243 125483 44623 7676 -25762 -8473 63217 80245 40292 71953
13936G1953N0903l4249m1325M0869L1910j9868q8277j2320n6988p118l4048k8060
13924a26618P6328l518l5358L3337j8877L9922M3775K6494M2031M8560m5639m0984
13912C9453r536o3076k2317L3631k2879Q3408M8468o6336N0940k0959Q111M9432
13900A08340J5218p9806j24460j23632M8618J04850J4050j69O985M4581j7989
13889c414p9501M4219N3089P1554n4926o2930O700O500O50m6113L8245J8481M5322
13876C7876L827j6707l2982k0185L0096p687k1580r24k394j2164M5127N1883n0820
13863C366l4196k9654L5092L8971L3974m3231q7250R369J8447N4558N6430j34423
13851g8547L265l5829K0097N1291M8251M7474j2824q2696n7545R1238R0251m1809
$$ plain form
13936 71953 122856 88607 47282 88151 120061 100193 11916 -404 -57392 -64510 -98558 -126618
13924 -126618 -50290 -53808 -89166 -55829 -74706 -34784 8991 35485 77516 126076 80437 39453
13912 39453 29917 -33159 -55476 -21845 -44724 38684 87152 20816 71756 50797 58908 108340
13900 108340 123558 43752 -80708 -204340 -155722 -50872 -36822 -36991 -30006 14575 -3414
13889 -3414 -82915 -38696 14393 85947 31021 -31909 -25209 -18709 -18059 -64172 -25927 -7446 37876
13876 37876 41703 24996 -7986 -28171 1925 -5762 -27342 -28266 -30660 -42824 2303 54186 3366
13863 3366 -30830 -60484 -25392 13579 47553 4322 -82928 -73559 -55112 -554 55876 -78547
13851 -78547 -75282 -111111 -91014 -39723 8528 56002 43178 -39518 -97063 -5825 84426 42617
13839D2617M6940O1973k627o6549K918j09577k0401P4502j26102j5797p554O1466
13827e8191K3716L1809J02746r2620j14669j10487M2957Q8144O5990n6277p3805
13816a50687l9216N0300j7513J048L9948M0686j2033q989P1886P6383K1916l2184
13804D1545l4762n093k125m6332O059N4065l5310J3224M7507o6700L3009P5198
13792H0285l8849n3345j8079p5115J3818l160M7343O5789Q290L641K4690K4855
13780H0163k701n3658K4221p2175k170o481K0643o546m0440K6708J35116L4580
13768A37260j07672m8538M6046R0699l7974p2980K8303n3289j00574k7019L6583
13757a09155m1470M9294m3851L6138N2234J5143J4079p992L8550l1892l0568K0178
$$ plain form
13839 42617 89557 151530 148903 82354 85272 -24305 -44706 29796 -96306 -112103 -119657 -58191
13827 -58191 -34475 -2666 100080 7460 -107209 -217696 -174739 -86595 -20605 -76882 -150687
13816 -150687 -189903 -139603 -157116 -156068 -116120 -75434 -87467 -96456 -24570 51813 73729 41545
13804 41545 6783 1690 -435 -46767 -40708 13357 -21953 -8729 38778 -27922 5087 80285
13792 80285 41436 -11909 -29988 -105103 -91285 -94445 -47102 18687 26977 30618 55308 80163
13780 80163 77462 23804 48025 -24150 -26320 -32801 -12158 -18704 -59144 -32436 102680 137260
13768 137260 29588 -18950 27096 117795 79821 6841 35144 -18145 -118719 -145738 -109155
13757 -109155 -150625 -101331 -145182 -109044 -56810 -41667 -27588 -35580 2970 -28922 -59490 -39312
13745c9312k677n69j7199l7113k1933j7483J3142J4124Q7123J2170l4018k0836
13733f4581m0932M4520k226Q2938O9739J6677k4855k2284q7914q0667K784R3193
13721a3608l7861l1873J3803j586M0236O1791q802q2515k5498N6458N0457n3329
13709c2327m0756L6196L2412J4650Q956j0085J5119L9077K3899q0723r4443K716
13697h5309K0799p8963P4263k8873r813j969L9225q585k9440J8333K6890m0175
13685a03617l7352j9297j2931k947J43347N5299K5587m7992M1459N6698j5633
13674H2621p3402q822N1414L1771j3863J7860k5501q4592n6164M4138K9871j7167
13662b1836m6797k9024m1471J01626O9435p977l9110J3398m3126j8289k5551R1982
$$ plain form
13745 -39312 -41989 -42558 -59757 -96870 -118803 -136286 -123144 -109020 -21897 -9727 -43745 -64581
13733 -64581 -105513 -60993 -63219 19719 89458 106135 81280 58996 -28918 -109585 -106801 -13608
13721 -13608 -51469 -83342 -69539 -71125 -30889 30902 22100 -60415 -85913 -29455 21002 -32327
13709 -32327 -73083 -36887 -4475 10175 19131 9046 24165 63242 87141 6418 -88025 -85309
13697 -85309 -64510 -143473 -69210 -98083 -107896 -109865 -70640 -79225 -108665 -90332 -63442 -103617
13685 -103617 -140969 -160266 -173197 -176144 -32797 22502 48089 97 41556 98254 82621
13674 82621 9219 397 51811 83582 69719 87579 62078 -22514 -78678 -34540 -4669 -21836
13662 -21836 -68633 -97657 -139128 -37502 31933 23956 -15154 -1756 -44882 -63171 -88722 3260
13650C260k328l5019o230o122P5330K6737p0013j60K4382k6320J0215j7460P9076
13637E5348m8011L8673j9414o1216O6792M0148o7483j4830k2766n7169l7746k395
13625a30069J9351j5209J9938O5069O6349O773m7009r6009L7999P574O9360O3254
13613F7371O0437o9047q1852n6418N28N0880J19691L5504k7890q3946q6587m9786
13601a21115J37424o0179l9826M5794J244K2553O1378j0806J0993n0926m4411
13590d7877K1229J0384Q207j3042K4755R3996m355j08226m4431J4908M2822M7675
13578D6045o6257p6682j7168L9154M2J2677R780K4997j0295k7726j8858Q5868
13566A577R9212r7620l5422l67r535j29100J7045L6977J7584l0631j6426J46279
$$ plain form
13650 3260 932 -34087 -40317 -46439 28891 55628 -14385 -14545 9837 -16483 -6268 -23728 55348
13637 55348 7337 46010 26596 -34620 32172 72320 4837 -9993 -32759 -89928 -127674 -130069
13625 -130069 -110718 -125927 -105989 -40920 25429 32202 -14807 -110816 -72817 -65243 4117 67371
13613 67371 127808 58761 -23091 -79509 -78981 -28101 91590 127094 99204 15258 -71329 -121115
13601 -121115 16309 -43870 -83696 -37902 -36658 -14105 47273 36467 47460 -3466 -47877
13590 -47877 -26648 -16264 -8057 -21099 3656 97652 93297 -14929 -59360 -44452 -1630 46045
13578 46045 -20212 -96894 -114062 -74908 -74866 -62189 -52409 -27412 -37707 -65433 -84291 1577
13566 1577 100789 3169 -32253 -32620 -42155 -171255 -154210 -117233 -99649 -130280 -146706 -427
13554d27M9163m9445k725M3774L8089M3503J288n1992m6681J3792r701J320K0500
13541E0458N3161J8992o0579n0360k1206K4938J6863M509J3283j0861p721M9818
13529H1295P264n7417k7998K6394j836l6714J5950P5142k3714j00060j6635O6129
13517G800l1526J4009k9553J7850M1936O100j5928j4649M0012N4698k0362k7654
13505D2733m8610j2705M3889L4434Q1576N3087j07441q6536l2565Q6850J5525
13494G0237m3434o5812k9246L0184L9646M6912J9472J4559l430L3801k5221k3954
13482F3714k8685J2833N829K9501p692k0279o912l3803m0378K5335J840O980L0152
13469C8435m3673J8659Q5402j9545j2696M761L361j9770l4961K4414O910l4972
$$ plain form
13554 -427 48736 -709 -3434 40340 78429 121932 123220 71228 24547 38339 28638 29958 50458
13541 50458 103619 122611 62032 11672 -9534 15404 32267 36776 50059 39198 31477 81295
13529 81295 88559 31142 3144 29538 27702 -9012 6938 82080 58366 -41694 -58329 7800
13517 7800 -23726 -9717 -39270 -21420 20516 26616 10688 -3961 36051 90749 70387 42733
13505 42733 -5877 -18582 25307 59741 141317 194404 86963 427 -32138 54712 70237
13494 70237 26803 -39009 -68255 -38071 1575 48487 67959 82518 79088 112889 87668 63714
13482 63714 35029 47862 53691 83192 75500 55221 48309 14506 -25872 -537 1303 8283 38435
13469 38435 -5238 13421 98823 79278 66582 71343 74704 54934 19973 44387 51297 16325
13457A6325J1751J3122m8524m1790p9226K3159L270m536o18M9185L697Q4659N0939
13444H1413J6406M808p9243L6937J2262j9533M7320k3171k4111M9651j561K4497
13432A25675K8818j39287k9221P9975K2345K5463O3836o1203j81050m918Q0128
13421A0561N7981J8991k0620j08358m0067L8778L1858L1268N3877L8387m9015
13410F3641l3976l1485J3727m3129N8328R4001J8700l4833o3405q7400J3188n806
13398c8449L9886l9589m0222L1451R3282o248l8066k6928k3277N140J9257L9026
13386A5263J23892m9976r9875j1468M3652L0508J9159m2779l0855K6279o4048
13375d0248m8523p45R7967o1016L826M3846N7627j1286j01795m0892O659N9109
$$ plain form
13457 16325 28076 41198 -7326 -49116 -128342 -105183 -101913 -106449 -107067 -57882 -54185 30474 81413
13444 81413 97819 102627 23384 60321 72583 53050 100370 77199 53088 102739 101178 125675
13432 125675 154493 15206 -14015 65960 88305 113768 177604 116401 -64649 -69567 10561
13421 10561 68542 87533 66913 -41445 -81512 -42734 -10876 20392 74269 112656 63641
13410 63641 29665 -1820 11907 -31222 27106 121107 139807 104974 41569 -45831 -32643 -38449
13398 -38449 1437 -38152 -78374 -46923 46359 40111 2045 -24883 -48160 -43020 -23763 15263
13386 15263 139155 89179 -10696 -22164 21488 51996 71155 28376 -2479 23800 -40248
13375 -40248 -88771 -89516 8451 -52565 -48739 -4893 52734 41448 -60347 -101239 -94580 -35471
13363c5471n2836l596L2956m959k9826p5228N4938L2448K6403N238M958r9080
13351a44055k9994Q2626J45078Q4142m5467l1971J3419m3293n4225m3867M8043
13340a9564M0999R507K2488O7341O4425K068r868P74q4977Q427O1551M7404m3514
13327A67061j12805j23219j2369K7286k5907J3889N8917J0818K0752J1129k1767
13316A3785J05906O9973n2943l2459m889n6377p0991J4540q3835l6669R3930L1531
13304h498j2134m490J7921J2834R2355j9866q7586M9377K6156k3914p1192k4200
13292e3237Q972P3522K5904o5320n0972j8250M562O0398P2165N9416O3223l1272
13280A49111r7794k840K2615p8605k7555p9855K4935O368L4645Q2801R3995l8337
$$ plain form
13363 -35471 -88307 -91903 -58947 -63906 -93732 -168960 -114022 -81574 -55171 -49933 -44975 -144055
13351 -144055 -174049 -91423 53655 137797 92330 60359 73778 30485 -23740 -67607 -19564
13340 -19564 21435 30942 53430 120771 185196 187264 177396 178170 93193 101620 163171 210575 167061
13327 167061 54256 -68963 -81332 -54046 -79953 -66064 -7147 3671 24423 35552 13785
13316 13785 119691 189664 136721 104262 99373 42996 -27995 -13455 -97290 -133959 -40029 -8498
13304 -8498 -20632 -25122 -7201 5633 97988 78122 -9464 39913 66069 42155 -29037 -53237
13292 -53237 -44265 29257 55161 -10159 -61131 -79381 -74819 -14421 57744 117160 180383 149111
13280 149111 51317 48477 71092 -7513 -35068 -114923 -89988 -83620 -48975 33826 127821 89484
13268H9484m4185N801M5545l0923o581L9296K0645L0402l3685l3804l2263M1281
13256I1013P5543o8182o7728j22762k8O4152N5743k0216M7858K7302J3303p3612
13244B2386o8553l42K8626l7527n4595K6507Q0095L9897J8883j26907n5577O5688
13232f1419O4731N0363k230r0823p5348M9699j7195K3713K3435m2597n8630J17514
13220a8787M969j2108j39804N491N9375q4280K3724P7788R6409j3154K8245k1359
13208F509m1044k0308R5014O69J181J4136P319J11731P3397j15949k4314m8709
13196E9632j4256k2479r4265n8264K5280k5851l2514Q5657J94072N8365l2964
13185A42413n9124o7570q6920J0575k8839P2848J12239P41r772q1105j9334O173
$$ plain form
13268 89484 45299 51100 96645 65722 59141 98437 119082 149484 115799 81995 49732 91013
13256 91013 166556 98374 30646 -92116 -92144 -27992 27751 7535 55393 82695 95998 22386
13244 22386 -46167 -46509 -17883 -55410 -110005 -83498 -3403 36494 55377 -71530 -127107 -61419
13232 -61419 3312 53675 51445 -39378 -114726 -65027 -82222 -58509 -35074 -77671 -136301 -18787
13220 -18787 -13818 -25926 -165730 -160239 -100864 -185144 -161420 -83632 12777 -377 27868 6509
13208 6509 -34535 -54843 40171 40840 42021 56157 63476 175207 248604 132655 108341 59632
13196 59632 45376 22897 -71368 -129632 -104352 -130203 -162717 -77060 117012 175377 142413
13185 142413 83289 15719 -71201 -60626 -89465 -16617 95622 96363 86591 5486 -13848 -7675
13173g675K3084j4624J9093L6622q510j3970p6916l9257O5272j2633L0332J0911
13161A1729j05338l9309k1342M5595J8996L9513M4455j5897j4807m9567m6136
13150a32108M0244m8526P0555M0139M0432J08685J7392j18747o9601m377J06830
13139E0918K23q1230p266p919n210R842J15316P3046K4296j38447k4622j7911
13127h964o5549j1753q5917N6539J7301N7203n4438l8595q661N1196k1164L1105
13115h1697N208L2490L900l4876k2560L8174J5859m560K718K9168O0916R504M5784
13102A00028J9583k2494j4766n5412j93m2929O1597K4590J0825o7077O3484M9397
13090A26633P945J0965j6187r8137q773K4557k9892n9754m5047J03858K1126k9804
$$ plain form
13173 -7675 15409 785 19878 56500 47990 34020 -42896 -82153 -16881 -29514 818 11729
13161 11729 -93609 -132918 -154260 -108665 -89669 -50156 -5701 -21598 -36405 -85972 -132108
13150 -132108 -91864 -140390 -69835 -29696 10736 119421 136813 18066 -51535 -55912 50918
13139 50918 51141 -30089 -37355 -45274 -50484 -40642 74674 147720 172016 33569 8947 -8964
13127 -8964 -74513 -86266 -172183 -115644 -98343 -41140 -95578 -134173 -142834 -91638 -112802 -81697
13115 -81697 -76489 -43999 -40099 -74975 -97535 -59361 -43502 -48062 -45344 -16176 44740 54244 100028
13102 100028 119611 97117 82351 26939 26746 -16183 45414 70004 80829 13752 77236 126633
13090 126633 134578 145543 129356 31219 22446 47003 17111 -42643 -87690 16168 37294 7490
13078G490P061O0866N2183L2313N519p8891m2220k2251k442m9369P2759J20536
13066A63554P5777j9196j7718L755p9388o264K2633p1870q2891o9295m300N6646
13054b8557Q2322J9197q733l329J6834R1907R9268K9136j14306j43936q8767J9984
13042b8980N7682O0617l0786L5310K8455J306j27418o9379L2910J13360L1647
13031A04724n3970J7406k1292n9535l0674j7931r6486j048R2868J1556m3518n4160
13019a52060P383O8326Q6602J3378k745j1190K6773j2028j3526O483J19479N2785
13007A89660m6510n8265M874J443k3250k5601r3714m0586Q3308P8720M9037l8820
12995H0296n7736j1769N2255M5071j04393q1880L7513L1404J7667K489J3235j9454
$$ plain form
13078 7490 14551 75417 127600 159913 165432 86541 44321 22070 19628 -29741 43018 163554
13066 163554 239331 220135 202417 206172 126784 120520 143153 71283 -11608 -80903 -85203 -28557
13054 -28557 53765 72962 64229 60900 77734 169641 268909 298045 183739 39803 -48964 -28980
13042 -28980 28702 89319 58533 93843 122298 123604 -3814 -73193 -40283 73077 104724
13031 104724 50754 68160 46868 -12667 -43341 -61272 -157758 -158806 -65938 -54382 -97900 -152060
13019 -152060 -144677 -76351 10251 23629 20884 9694 36467 24439 10913 17396 136875 189660
13007 189660 143150 84885 89759 91202 67952 42351 -51363 -91949 -8641 70079 119116 80296
12995 80296 22560 10791 63046 108117 3724 -78156 -40643 -9239 8428 10917 24152 4698
12983D698J34939N1561l949l8147p4171M0802K4232K3877p4686m5262l0158n464
12971H272q558o562N4046M8347p1006m2379j63k3768M3972N2468q4789L4220J33832
12958A37932J226j3339m202m9804p9855Q7755L7136K4119M0960p8761j71873r6155
12946a64861R9202J05067K2884K3848k0146l2317K1456K0862m5582o3052M8639
12935A6000K1738k4747K4679L164r9850K5261J00670n845j1627J5358j3006l7450
12923A4345l202N1178O0795q0551k0283O4627K9047r0269l8129l5642l6380k3641
12911a08105L4645N4935M9988m4884K8973P5851J1894o064p9843N912K6641P7011
12899A26954O6194n8207n9213m1290o8889p8129j5817M5461J7691m8758j6150
$$ plain form
12983 4698 139637 191198 187249 149102 74931 115733 139965 163842 89156 43894 13736 8272
12971 8272 -286 -6848 47198 95545 24539 -17840 -18003 -41771 2201 54669 -30120 4100 137932
12958 137932 139158 125819 121617 71813 -8042 79713 116849 140968 181928 103167 -68706 -164861
12946 -164861 -65659 39408 62292 86140 65994 33677 55133 75995 30413 -32639 16000
12935 16000 37738 12991 37670 40834 -59016 -33755 66915 61070 49443 64801 51795 14345
12923 14345 11143 62321 123116 42565 22282 86909 115956 25687 -12442 -48084 -84464 -108105
12911 -108105 -73460 -18525 31463 -13421 15552 91403 103297 97233 17390 23302 49943 126954
12899 126954 193148 134941 75728 34438 -34451 -112580 -128397 -82936 -65245 -114003 -130153
12888a30153Q3856P3982K8419M238l6707p8640j1798M1885k5880O6443q716J6681
12876B3610r2979l1350l3764J03582J51090k9291p4466r7839n5220K9048L9964
12865f7615M8846K4545l6056p6444j9414K2536N8767O1415M3358r639k7480n42
12853B2277m6018L229M4946J5493n448l3446n1569r9194j2678R1902K9851j7638
12841e8293R5284J0648o060o53R3616k6025r6584O76O8509J9221q7805l4875P9133
12828E6792M1061l9634N2237q430l8521K6204J5720N3566m3439l738p745r7570
12816F503p8651L4535J1035k093j0796Q331L5972N5842n3854n6761n8174N3217
12804e4894J9537k9296N0496O0414l663r6736j28306L4497K8214Q9296P8315l6919
$$ plain form
12888 -130153 -46297 27685 56104 60342 23635 -55005 -66803 -24918 -50798 15645 6929 23610
12876 23610 -69369 -100719 -134483 -30901 120189 90898 16432 -81407 -136627 -107579 -67615
12865 -67615 -18769 5776 -30280 -106724 -126138 -103602 -44835 16580 59938 50299 22819 22277
12853 22277 -23741 -20512 24434 39927 34479 1033 -50536 -149730 -162408 -70506 -40655 -58293
12841 -58293 36991 47639 41579 40926 134542 108517 11933 12609 81118 100339 12534 -22341 56792
12828 56792 97853 58219 110456 102026 63505 89709 105429 158995 115556 111818 104073 6503
12816 6503 -72148 -37613 -26578 -28671 -39467 -31136 4836 60678 6824 -49937 -108111 -54894
12804 -54894 -35357 -64653 -14157 46257 42594 -54142 -182448 -147951 -119737 -30441 47874 10955
12792A0955n1290m9047P902r643P9069J20203j9309j43995K6979j2221k0208J13265
12780E2660J05818l0915m1197n8845m0490k4710K0331Q9431N7602p938p4441q369
12768C8937r3289j7424j6917K359J22599M6288n078o5795L1103L728J1579m5480
12756A2610p116p4368K5244Q3903k5988n3618K4643J9569k0592J8603L9292p966
12744C4216M2179L404J9895J2175J2056J8194J1319n4060j659m9641m3551P859
12732A2386q0536P1305J42045j7352j10716l1608P2385J5663N4239M6282m2248
12721A31845J1191l9699p6620r4030N4642n6093k8493J00443P5285k2366k5731
12710C0374K0926l6956M4990N3544K035J9973N0688l6656l0509M0419K3389n2049
$$ plain form
12792 10955 -40335 -89382 -81480 -91123 -12054 108149 88840 -55155 -28176 -40397 -60605 52660
12780 52660 158478 127563 86366 27521 -12969 -37679 -17348 72083 129685 121747 47306 38937
12768 38937 -54352 -71776 -88693 -86334 36265 82553 77475 11680 42783 46511 58090 12610
12756 12610 5494 -68874 -43630 40273 14285 -39333 -14690 4879 -15713 2890 42182 34216
12744 34216 76395 79799 99694 111869 123925 142119 153438 99378 97719 48078 4527 12386
12732 12386 -68150 3155 145200 127848 17132 -14476 57909 73572 127811 174093 131845
12721 131845 143036 103337 26717 -67313 -12671 -68764 -97257 3186 78471 56105 30374
12710 30374 51300 14344 59334 112878 114913 134886 185574 148918 118409 158828 182217 130168
12698A30168n1726j6069R2288k8158k4720N4326r9659j15181L8347K9990L2326
12687D1932P2885k0963l2659p2586l085k3329J10644M5810K2836O713k2589k4641
12675A00968l2635Q5653L3130m9066j2693N886o1113m2087n061j3423L596L7913
12663E1068M4052q6808o0117R0673O4082J0763k1446p8030P797P6108o0864j08840
12651g1562N260Q2240R5873L6566l8328n3178o7660l8806K5475N7902K443k9753
12639F472m8729O389l1027o8988K3431M7101j1395N6477L0147N6270l3039k4271
12627H838M9352K8751Q193j4120K8576J8115j3513N8424j5608M780j3439j8292
12615A30057p8767J7516Q9347l799j6077l2865k5915N3321m4280m5940k9921k341
$$ plain form
12698 130168 78442 62373 154661 126503 101783 156109 56450 -58731 -20384 9606 41932
12687 41932 114817 93854 61195 -11391 -14476 -37805 72839 118649 141485 148198 125609 100968
12675 100968 68333 153986 187116 138050 125357 131243 70130 28043 22982 9559 13155 51068
12663 51068 95120 8312 -51805 38868 102950 113713 92267 14237 22034 98142 37278 -71562
12651 -71562 -66302 15938 111811 148377 110049 56871 -10789 -49595 -24120 33782 36225 6472
12639 6472 -42257 -35868 -66895 -135883 -112452 -65351 -76746 -20269 9878 66148 33109 8838
12627 8838 58190 86941 95134 81014 109590 127705 114192 172616 157008 161788 148349 130057
12615 130057 51290 68806 158153 154354 138277 105412 79497 132818 88538 42598 12677 10336
12603A0336P6272O4698o0925K7154m0299N968M9051O0420n1521k5813p5586p3759
12591c4004R2170N2257m8789Q956L8522k0759L3803K5471n3939n0381P543K7876
12579G8726L9510J5399M3247P4200l7255j01009M3494N1527k5155j3047K1862
12568A91499L419n7310m8581n4478K0135O8542M7540m9159k8537J4712n151l6755
12556F5876J1261L4332K6202k0267P464J0257K2520j3050K4770j9657J5234K8798
12544A93740q392Q9819n0424j13617o1019O7343M2944l9739m22J93Q800q4397
12532D4829j1492J0873m6101M1150N2145k8937o7149L5988l6438M6915R6127m6213
12520I1697m8438L7877k6618j4361j1370n9427J1106N7053P0819J8420K5852K0081
$$ plain form
12603 10336 86608 151306 90381 117535 77236 83204 132255 192675 141154 115341 39755 -34004
12591 -34004 58166 110423 61634 70590 109112 88353 122156 147627 93688 43307 50850 78726
12579 78726 118236 133635 176882 251082 213827 112818 156312 207839 182684 169637 191499
12568 191499 194918 137608 89027 34549 54684 123226 170766 121607 93070 107782 102631 65876
12556 65876 77137 111469 137671 117404 124868 135125 157645 144595 169365 149708 164942 193740
12544 193740 185348 275167 224743 111126 50107 117450 160394 120655 120233 120426 129226 44829
12532 44829 33337 44210 -1891 39259 91404 62467 -4682 31306 -5132 41783 137910 91697
12520 91697 43259 81136 54518 40157 28787 -30640 -19534 37519 108338 126758 152610 172691
12508A72691K158J2490K9498o8076r006K3013n982r6178K6033N2083L9782J2484
12496A90990l6221k3556m5899l68P2521O0490j007l7229l9420N5696M5335J8419
12484B59751p789J2420K7369n6018l7578M2157o2423l103M2780K7355J8495n1556
12472B11860q2260l2460k1311K8058P5557K3575l5706Q9625k3724j4715P5022
12461B93521m1418n1878N2245J3738K5132l8900l2258K6074o0174K8156Q0060
12450B94298m4204j8402l7931j2390J1269N9235N5689q1635r0969L1859K2357
12439A89176L125N4400l2459p2441P5040Q527M268k0559l4302o997J7433L7699
12427B22910r322K026P048m7638j2053l1562m7579k327N2029m986n1329J0010
$$ plain form
12508 172691 174849 187339 216837 148761 139755 162768 156786 60608 86641 138724 178506 190990
12496 190990 154769 131213 85314 84946 157467 217957 216950 179721 140301 195997 241332 259751
12484 259751 251962 264382 291751 235733 198155 240312 177889 174786 217566 244921 263416 211860
12472 211860 129600 97140 75829 103887 179444 203019 167313 256938 233214 218499 293521
12461 293521 252103 200225 252470 266208 291340 252440 220182 246256 186082 214238 294298
12450 294298 250094 231692 193761 181371 192640 251875 307564 225929 134960 166819 189176
12439 189176 192301 246701 214242 141801 216841 225368 229636 209077 174775 167778 185211 222910
12427 222910 213588 215614 222662 175024 162971 131409 83830 81503 133532 128546 77217 87227
12415H7227J04122L4113K945j4895o727o178k643M6926J0454L0644n596j8493
12403B61899K7856L9063n312l4702K9188P1019r725o688n7501r835K0824j2713
12391C13373L1164N532K6335Q094R1880L9023Q9744P5210l7719N5713n3578k5827
12379F18944R790l7030J7908J50395K65415K87992L56904M52588K78276j21058
12369B280124k72549k58153j9967L9027j8502r2827j04236j99034j33381o2614
12359A157888n1N1579K18483K20899q759p6718m1395k5226J11499J09435N0567
12348A768201k8572L5987J81227K31610O4094p4220k27137j75519P1801K07526
12338B054998J15254P5279K22522K68493K16903K67032M89351O80332Q91539O49272
$$ plain form
12415 87227 191349 225462 228407 213512 206785 200607 197964 244890 255344 285988 280392 261899
12403 261899 289755 328818 323506 288804 317992 389011 379286 372598 315097 305262 326086 313373
12391 313373 344537 350069 376404 384498 476378 515401 605145 680355 642636 698349 644771 618944
12379 618944 628734 591704 609612 760007 1025422 1313414 1670318 2122906 2401182 2280124
12369 2280124 2007575 1749422 1729455 1768482 1749980 1657153 1552917 1353883 1220502 1157888
12359 1157888 1157837 1209416 1427899 1648798 1640039 1563321 1521926 1496700 1608199 1717634 1768201
12348 1768201 1739629 1775616 1956843 2188453 2252547 2178327 1951190 1775671 1847472 2054998
12338 2054998 2170252 2245531 2468053 2736546 2953449 3220481 3709832 4390164 5281703 5930975
12328E930975j51909p50565q69548o92296k24828q7873j66138j88394k51294k06859
12318B341271j48559k9884R595N6372J22525j5830r2714k26259j38126j13407
12308A764984o0824j02673j28250N4801J30128J14107m0341k12778k95824j13669
12298A109661Q7868J25784P3394K35236J80465Q5650J15973J9207m0104J31387
12288B124521M09676L38652j77618m49132n06010m08921k63200j66807j18891
12279G82270K8308O8394L5307O291L9855q3527j45552j17399L6593M8755O3607
12268G62902O8879l3722q0342N4490L4697k7164k1978n4270j75065l1673O9191
12257E65945n8879j4622J6613p037J01964K5226j9513p8465K0937l611J7622J3805
$$ plain form
12328 5930975 5779066 5028501 4158953 3466657 3241829 3153956 2987818 2799424 2548130 2341271
12318 2341271 2192712 2162828 2172423 2228795 2351320 2335490 2242776 2016517 1878391 1764984
12308 1764984 1704160 1601487 1473237 1528038 1658166 1772273 1731932 1519154 1223330 1109661
12298 1109661 1197529 1323313 1396707 1631943 1812408 1898058 2014031 2033238 1993134 2124521
12288 2124521 2534197 2872849 2695231 2246099 1740089 1331168 1067968 901161 782270
12279 782270 810578 878972 914279 920570 960425 876898 731346 613947 650540 699295 762902
12268 762902 831781 798059 717717 772207 806904 779740 757762 703492 528427 496754 565945
12257 565945 507066 492444 509057 502020 603984 629210 609697 531232 552169 548558 566180 579985
12245E79985q4850q0020Q0096L2426o7455n0086Q6385J14320L5827o7620j24435
12234D54573l8364P4951Q1272l9146J7339M8205n6740J4950L356o5676p326R117
12222D96511L5534j6843o2118j3783N1277k177R284J17725l273k1796q1981k0748
12210D87612Q7190R0868m740L6235J30921N0232M229J8308n5104j59170k6545
12199F60036l8388k5913L0021L5760L1635j3901O36N914o738J8067L1459J17623
12187H46211O2089j64182r1789K2383l2682J3510O3336J0764l2393n9542P4794
12176G12499N0609N4756J3903m2008L757N530K2794J3474p9035k499N4731j9643
12164G88868n2262J5702j134N742J2003p00r1059L6624Q5630M2465l4387P7071
$$ plain form
12245 579985 495135 415115 495211 527637 460182 410096 496481 610801 646628 579008 454573
12234 454573 416209 491160 572432 533286 550625 598830 542090 557040 560396 494720 487394 496511
12222 496511 532045 515202 453084 439301 490578 488401 497685 615410 612137 590341 508360 487612
12210 487612 574802 665670 660930 697165 828086 878318 882547 900855 845751 686581 660036
12199 660036 621648 595735 625756 661516 693151 679250 679886 685800 679062 697129 728588 846211
12187 846211 908300 744118 652329 674712 642030 655540 718876 729640 697247 637705 712499
12176 712499 763108 817864 831767 789759 793516 799046 821840 835314 756279 753780 808511 788868
12164 788868 736606 752308 751174 756916 768919 768219 677160 713784 799414 841879 807492 884563
12152H84563J03757m5453j7228J0327M126k8672k2225p909M89R7594M1018J9821
12140A040208K7543m6071L1817J4823O0001l0123j39226J3707O3093L6485O3571
12129A135828k1482o5823K7926R3379P6331k5825p5602M6038K7455k1935O3707
12118A259997L9793J6140j1819k1171j3729l3958k9129l9001J6367Q8716R9748
12107A371954l8165O9789Q1145P150j31713l5920L1118J8397M9605P5277O2576
12096A561213k7969L2449l0604j6622J36976O4922k2470M5579k4300o2166Q3676
12085A740684M1080J1037J01209j6076m2705J01058R6284k1301P5746o3311p7471
12074A946234O9001K9131O2695j7869M9263J48906j1121q323J379K2610P3215
$$ plain form
12152 884563 988320 942867 925639 935966 940092 911420 889195 881286 881775 979369 1020387 1040208
12140 1040208 1067751 1021680 1053497 1068320 1128321 1098198 958972 972679 1035772 1072257 1135828
12129 1135828 1114346 1048523 1076449 1169828 1246159 1220334 1144732 1190770 1218225 1196290 1259997
12118 1259997 1299790 1315930 1304111 1282940 1269211 1235253 1206124 1167123 1183490 1272206 1371954
12107 1371954 1333789 1403578 1484723 1491873 1360160 1324240 1355358 1373755 1423360 1498637 1561213
12096 1561213 1533244 1565693 1535089 1518467 1655443 1720365 1697895 1743474 1719174 1657008 1740684
12085 1740684 1781764 1792801 1894010 1877934 1835229 1936287 2032571 2011270 2087016 2023705 1946234
12074 1946234 2015235 2044366 2107061 2089192 2138455 2287361 2276240 2267917 2269296 2291906 2365121
12063B365121N3263L7572K9881L0889M5333l5496j643M5342L9975k5839J30730
12052B715128J3795O9006O9221R1208Q5165M8329n5763m7514K755O6297O9948
12041C127575K9797L4313R7664Q3805Q2499L5687M8995R6443K9936N5437R1682
12030C813833J67265M8078M4513K0867N3656L6589J8236R8066J63352K1661O5354
12019D551470J66477P1467J32991J33535J16448O76O8775P5676J35155J45168
12009E597838J25100J23358L9773J87253K01507J56026R6608N3749Q9519N7058
11999F727789J53077K86064L15818K16606R7383J64575J50296J92436J45097J37830
11989H586971J61649K45119K68140K26951K23068J75435K20703K76822L34565
$$ plain form
12063 2365121 2418384 2455956 2485837 2516726 2562059 2526563 2524920 2570262 2610237 2584398 2715128
12052 2715128 2728923 2797929 2867150 2958358 3043523 3091852 3036089 2988575 2991330 3057627 3127575
12041 3127575 3157372 3191685 3289349 3373154 3455653 3491340 3540335 3636778 3666714 3722151 3813833
12030 3813833 3981098 4029176 4073689 4094556 4148212 4184801 4203037 4301103 4464455 4486116 4551470
12019 4551470 4717947 4789414 4922405 5055940 5172388 5173064 5241839 5317515 5452670 5597838
12009 5597838 5722938 5846296 5886069 6073322 6274829 6430855 6527463 6581212 6670731 6727789
11999 6727789 6880866 7166930 7482748 7699354 7796737 7961312 8111608 8304044 8449141 8586971
11989 8586971 8748620 8993739 9261879 9488830 9711898 9887333 10108036 10384858 10719423
11980A0719423K80552K08707K66849K83513K21604K65688K60786L15335L10265
11971A3132722L56380L82740L09606K69064L86594L13261L91347M57095M84873
11962A6483682L51599L16872L77697M03561M71705M79857L68563M00993L78911
11953B0033440L35423L92249M94393M63930M72887L67994L27550L87482L81666
11944B3657014L43343L52558L45975L91447L07415K09052K20532K14246J58251
11935B6199833M0672Q3832Q4189R8894P9455Q4293q1601j10151m9198j00340j44566
11924B6185312k00888j22792j95994k81617k93530l04431l06044l66031l27005
11915B3786980l79746m29536l51505l64736l76690m15261m44241m21612m29376
$$ plain form
11980 10719423 10999975 11208682 11475531 11759044 11980648 12246336 12507122 12822457 13132722
11971 13132722 13489102 13871842 14181448 14450512 14837106 15150367 15541714 15998809 16483682
11962 16483682 16835281 17152153 17529850 17933411 18405116 18884973 19253536 19654529 20033440
11953 20033440 20368863 20761112 21255505 21719435 22192322 22560316 22887866 23275348 23657014
11944 23657014 24000357 24352915 24698890 25090337 25397752 25606804 25827336 26041582 26199833
11935 26199833 26240505 26324337 26408526 26507420 26586875 26671168 26589567 26479416 26430218 26329878 26185312
11924 26185312 25984424 25861632 25665638 25384021 25090491 24786060 24480016 24113985 23786980
11915 23786980 23407234 22977698 22626193 22261457 21884767 21469506 21025265 20603653 20174277
11906B0174277m45361m04112l59518m23340l53092m27388n08811l63826l64724
11897A6524105l90220l38574l10388l26347m14221l02200l88704m59343l13711
11888A3280397k45182l05418k92916l35166l75612l00776k01559k57207k70299
11879A0696262k40366k63791k38994j88143l09912k67191k79034j99540j60453
11870H548838j63735j15741j21533j41982k14925j70963j25811n3070k05868k96513
11860F938697j77712p2120j27691q3202j73061j95632k11859j44170l8955k9596
11850E684699r3235j43256l6823j64325j82997l7724m0838j92462j02733r5967
11840D594339m1286o6403n3122j27770r761r4138j47725r0746J4841j02234r9568
$$ plain form
11906 20174277 19728916 19324804 18965286 18541946 18188854 17761466 17252655 16888829 16524105
11897 16524105 16133885 15795311 15484923 15158576 14744355 14442155 14053451 13594108 13280397
11888 13280397 13035215 12729797 12436881 12101715 11726103 11425327 11223768 10966561 10696262
11879 10696262 10455896 10192105 9953111 9764968 9455056 9187865 8908831 8709291 8548838
11870 8548838 8385103 8269362 8147829 8005847 7790922 7619959 7494148 7441078 7235210 6938697
11860 6938697 6760985 6688865 6561174 6477972 6304911 6109279 5897420 5753250 5714295 5684699
11850 5684699 5591464 5448208 5411385 5247060 5064063 5026339 4985501 4793039 4690306 4594339
11840 4594339 4553053 4486650 4433528 4305758 4295997 4201859 4054134 3963388 3978229 3875995 3776427
11829C776427r1435k326N3717J7801j21651o6657k4381j15609j84339q5775k1021
11818C134751m1454p245j0400o3688j2288k4786k2479q8j1556k5810q8631r2663
11806B733663o4281k4560k3646m1789r8935j38010n2393M031q1219m0491L0771
11795B203141r8127j75728j2552N8753P3820J4092J6779Q446o524l9769q7224
11784A955107R616J1776r196J1595q7219J0175m9435l9829Q164r1232o9654j7153
11772A642715l9329n5870j4166J4614O8984L8642j8424m641n9222L5971n0211
11761A559063r0177q0091l157L4152K4265o0288m2474n2590l7317j0541m4875
11750A195970l5169o4673M7891J11426J02279j5818l8479l8169l3053m0414r4369
$$ plain form
11829 3776427 3684992 3682666 3736383 3754184 3632533 3565876 3541495 3425886 3241547 3155772 3134751
11818 3134751 3093297 3086052 3075652 3011964 2999676 2974890 2952411 2952323 2940767 2914957 2826326 2733663
11806 2733663 2669382 2644822 2621176 2579387 2480452 2342442 2290049 2294080 2212861 2172370 2203141
11795 2203141 2105014 1929286 1916734 1975487 2049307 2063399 2080178 2088624 2082100 2042331 1955107
11784 1955107 1964723 1976499 1967303 1978898 1891679 1901854 1852419 1812590 1820754 1729522 1659868 1642715
11772 1642715 1603386 1547516 1533350 1547964 1616948 1655590 1637166 1632525 1573303 1609274 1559063
11761 1559063 1468886 1388795 1385638 1419790 1444055 1383767 1341293 1288703 1251386 1240845 1195970
11750 1195970 1160801 1096128 1144019 1255445 1357724 1341906 1303427 1265258 1232205 1191791 1097422
11739A097422O2755M3031N9118L4908J0063o0484k877p0608q4475Q79o0817j25616
11727I03299j8702N4919J5587l9481j7812K9825m3073L4769K1654j3966J3929
11716I40948O946j8741M7405l26L8342j9345q9646k325k2840N4234K6390M9970
11704A011012k0184K5433K1782j9715l358m7976m9288o2880k8783Q2212k2670
11693H85585L065l6256n3927n1595P6582K1619n984n2798M7519j06156j05217
11682F22437K2863L9030L2292k9599K979k6298j9104P0969J6402p3257r4906k6197
11670E37611k906k5193K6600M4591o8050m4369K1679L4909L97L6610M861k9461
11658E37279Q9934J903o3417l3627J5367M3809J3040L2204J8418m8430m2248l7140
$$ plain form
11739 1097422 1160177 1203208 1262326 1297234 1307297 1246813 1243936 1173328 1088853 1089732 1028915 903299
11727 903299 884597 939516 955103 915622 897810 927635 884562 919331 940985 927019 940948
11716 940948 947894 929153 976558 976232 1014574 995229 905583 903258 880418 934652 961042 1011012
11704 1011012 990828 1016261 1038043 1018328 1014970 966994 917706 854826 826043 908255 885585
11693 885585 888650 852394 798467 746872 823454 845073 839089 786291 833810 727654 622437
11682 622437 645300 684330 716622 687023 690002 663704 644600 715569 731971 658714 563808 537611
11670 537611 534705 509512 536112 580703 512653 468284 489963 524872 525269 561879 566740 537279
11658 537279 627213 629116 565699 532072 547439 591248 604288 636492 654910 606480 564232 527092
11646E27092K1931P8409O1009J9911j39967j16601M3887R88n9176R002j2196N6984
11634D91273j01531M9337J3266K5994M8283j075j00848m8551Q5734J05060k5649
11623E41293l7483M5086M764m5152p8446O80J0083N0476j24849O875K542L8991
11611D14860k4740L4079m3887k425M3425r8934M8764O5764J8965J9748J8589J0954
11599E05162r8368p7207n0178N1876L8239M0570J8119p6186n8238J3363j7166
11588B89986Q0728m0352j3739L8420L4014L371j8970O2988j18465j46672Q7733
11577B59042O7711l586K9597P9793k0366j26801K6523R7537N2056N492O1535j8875
11565E09658j13835o7025r578l1386l080q449P9846j9285j0888P5933N5110q9654
$$ plain form
11646 527092 549023 627432 688441 708352 568385 451784 495671 496659 437483 446485 434289 491273
11634 491273 389742 439079 452345 478339 526622 525547 424699 376148 461882 566942 541293
11623 541293 503810 548896 553660 508508 430062 430742 440825 491301 366452 373327 375869 414860
11611 414860 390120 424199 380312 377887 421312 322378 371142 436906 455871 475619 494208 505162
11599 505162 406794 329587 279409 331285 369524 410094 428213 352027 293789 307152 289986
11588 289986 370714 330362 316623 355043 389057 392428 373458 436446 317981 171309 259042
11577 259042 326753 323167 352764 432557 412191 285390 311913 409450 461506 466998 528533 509658
11565 509658 395823 328798 319220 287834 284754 276305 356151 336866 325978 401911 457021 367367
11553C67367p6744N166Q501N8174k7123j40960j23118l7118L3594K07873J65477
11542D41089M483n0608l6331j13360l7862r6704Q0777K5205o4993L4254O7462
11531B53412L8585m3896k9090r2162n9156k167O5378K9327P009j4805l7788L2855
11519A47502J2123j0562j33O3347O4928m9671K7691J5416J9013m5866q9441L1695
11507A86042J10122o6947l0902J3133Q6232O0643k7450j47232l3857M5937M919
11496B00640r912O994k8825M2459l2113p194N3498L0374J2605l842o40j11932
11484A52112K9160K1082l0985R123p983m3279m4676j2028L5312l1880r097N6721
11472A23582L3797m1492k6108O5768J1234p1222p6724j5987J01053Q5504n4107
$$ plain form
11553 367367 290623 295789 304290 362464 335341 194381 71263 34145 67739 275612 441089
11542 441089 445572 394964 358633 245273 207411 110707 191484 216689 151696 185950 253412
11531 253412 291997 248101 219011 126849 67693 65526 130904 160231 167240 152435 114647 147502
11519 147502 159625 149063 148930 212277 277205 227534 255225 270641 289654 243788 154347 186042
11507 186042 296164 229217 198315 211448 297680 358323 330873 183641 149784 195721 200640
11496 200640 190728 197722 168897 211356 179243 172049 225547 255921 268526 264684 264044 152112
11484 152112 181272 202354 171369 180492 172509 129230 84554 72526 107838 75958 66861 123582
11472 123582 157379 115887 89779 155547 166781 95559 18835 2848 103901 189405 135298
11461A35298o9329M1725R0456O0503k8311q0879l404K8134p1837o9046N6053M1397
11449A30760k1388k7214m9647j0225O7442n0143J6178J46838J7289n5281L9808
11438B04417j2363L1502k1072k7447j0003l6944l3975J6944N5290J8828k239K2304
11426B05242j08131J7884N567j6407l2606J7666P8463L6546K6240k4872m574R432
11414B10450n7879q2190K7414l790Q7361n778m4661m176J6546Q5611r552m6825
11402A72531j5855j412O956n3207o6576j1947M8474M840M007J3848j2407k0466
11390F8786k9961N5689J17553K4962K8145o4621o9373P2341R872q8504M995J9956
11378A49840l8225K9586Q3363L2892m9966M656j3362j4431l5033K6000m772o3664
$$ plain form
11461 135298 65969 107694 198150 258653 230342 149463 146059 174193 102356 33310 89363 130760
11449 130760 109372 82158 32511 22286 89728 39585 55763 202601 219890 164609 204417
11438 204417 192054 223556 202484 175037 165034 128090 94115 111059 166349 185177 182938 205242
11426 205242 97111 114995 120562 104155 71549 89215 167678 204224 230464 205592 201018 210450
11414 210450 152571 70381 97795 94005 181366 175588 130927 126751 143297 228908 219356 172531
11402 172531 156676 155264 162220 109013 42437 30490 78964 83804 87811 101659 89252 68786
11390 68786 38825 94514 212067 237029 265174 200553 131180 203521 213393 124889 129884 149840
11378 149840 111615 141201 224564 257456 207490 212146 198784 184353 149320 175320 170548 106884
11366A06884P593k6350nL8976J6941r4309L2195J0841q447N6547j5496m0011l787
11353H1572n8456j3793L59j3014n6178k0850M1456J07130J01055J3247p3490q1239
11341B7799n1387M6103P4257M0227K0921p1896m9519P0439n324n2505L3317L3266
11329A15698l7084l2361L8745Q246P8770l4325j04504n8556O9571J3013N546R258
11317G2017r5958n3389J11196J11632N5857L9537k7465J1210o1964K1491j3647
11306A70517k8109j075j530k2694p8262J9714n654j0472N4040O9366m9079m8578
11294F8184O9466Q629r4275j1756P7709M9880O301p7804J8802Q315k0866l9587
11282F2998j958J0241j1704Q028N0573L272o1043J0726J8862L5801q2145L8215
$$ plain form
11366 106884 114477 88127 88122 127098 144039 49730 81925 92766 84319 140866 125370 85359 81572
11353 81572 23116 9323 9682 -3332 -59510 -80360 -38904 68226 169281 182528 109038 27799
11341 27799 -23588 22515 96772 136999 157920 86024 36505 106944 101620 49115 82432 115698
11329 115698 78614 46253 84998 93244 172014 137689 33185 -25371 44200 57213 62759 72017
11317 72017 -23941 -77330 33866 145498 201355 240892 213427 224637 162673 184164 170517
11306 170517 142408 141333 139803 117109 38847 58561 52907 42435 96475 165841 116762 68184
11294 68184 137650 146279 52004 40248 117957 167837 174138 96334 115136 123451 102585 62998
11282 62998 61040 71281 59577 67605 118178 121450 60407 71133 89995 125796 43651 81866
11270H1866r066k957m2311Q779J27593P2436p0007r5852r3548M3727M570L2582
11258E7812L9514J8252R897r9254L4584L7910L1641j760j0567k433n4659j05478
11246d4541o000L2695J5199J35958j4505j01028m6050N5322K517k9317J5171R6490
11234A11911M9843r4743J3780k7441p4311R3250J0526k2544p5733J8960m729p5817
11222g7048J21840N6589r0803m488n5991J3675P6365K0790m1938l0838k0490K4019
11210h318l6823k4923M9871L0049n5601Q3141O9289l854r091L9033l4752k275
11198I5746L8967K3356p3593j06644J0177R578O3866M492r8156j5027Q8477J54305
11186A95544N2048o4600p7795j5229l1740L4315O939J4771k2984j8899M4701o1616
$$ plain form
11270 81866 72800 69843 27532 36311 163904 236340 166333 70481 -23067 20660 25230 57812
11258 57812 97326 115578 125475 26221 60805 98715 130356 128596 118029 115596 60937 -44541
11246 -44541 -50541 -17846 -2647 133311 118806 17778 -28272 27050 29567 250 15421 111911
11234 111911 161754 67011 80791 53350 -20961 72289 82815 60271 -15462 3498 -1231 -77048
11222 -77048 44792 101381 10578 6090 -49901 -36226 40139 60929 18991 -11847 -32337 -8318
11210 -8318 -45141 -70064 -20193 9856 -45745 37396 106685 102831 93740 132773 98021 95746
11198 95746 134713 158069 84476 -22168 -11991 -2413 61453 65945 -32211 -47238 41239 195544
11186 195544 247592 182992 105197 89968 58228 92543 99482 114253 91269 72370 117071 55455
11174E5455q8830l1621m6077L0674J48800Q0654j5283n4297l4357M1945n8836
11163B8227j13787J0435O3669P3714m1738J7758J0173L9469n2554n3200k9056
11152d6890K3948R6110k298o1148j6792n426J323j0582L0713M0653L2809N5435
11140A37855m798J13351K968q5768r7103j790k9816M4156K6113J2442N7199P7016
11128B51825k1377r1596J528m2549j08699k9673J12203K4542n4035M7907O7719
11117A57795p3274q4622l2067J07462J08875L7957l2899L680L7859K3557j9931
11106B34392n4084o7606n0705n9922O2236l9504l3317k3163N4984Q2178O9749
11095A75238k0443M1418K4339m3633r9472J8926L9061m4064J8156L3622R813j9957
$$ plain form
11174 55455 -33375 -64996 -111073 -80399 68401 149055 133772 79475 45118 87063 28227
11163 28227 -85560 -75125 -11456 62258 20520 38278 48451 87920 35366 -17834 -46890
11152 -46890 -22942 73168 70870 9722 -7070 -12496 -11173 -21755 8958 49611 82420 137855
11140 137855 133057 246408 249376 163608 66505 64715 34899 79055 105168 117610 174809 251825
11128 251825 230448 138852 140380 97831 -10868 -40541 71662 96204 42169 90076 157795
11117 157795 84521 -101 -32168 75294 184169 222126 189227 192907 230766 254323 234392
11106 234392 180308 112702 61997 2075 64311 24807 -8510 -31673 23311 105489 175238
11095 175238 154795 196213 220552 176919 77447 96373 135434 91370 109526 143148 152961 133004
11083A33004J2806l0574j11695k0581q9262l4027K4459k6069r012l453P5915J07876
11071B9387L3626P373K0237j5868k29o03k4547o3447J0352K7106J4252j1502O4493
11058I0630k9761m1348J31411L4691n6557k9229Q5723O3022J9173P9809l109M5702
11046C90157Q0108n09N0026M4199N0595m336o999P2775K2044P8062J80698J80167
11034A136987L9476p9092j09341j35227o2156k3024Q0765O9919J77009J15863
11024A211179J33425Q8822j4765Q642k02388k43481j00253j04455J21851L5767
11014I34344O3025R9809R8179m0714n1107n1542j71868k34445r6718p9269p2884
11003C96810M6819N3494J05588J9272j3262l0373q4827j40644P002j2101j33499
$$ plain form
11083 133004 145810 115236 3541 -17040 -106302 -140329 -115870 -141939 -150951 -154404 -78489 29387
11071 29387 63013 70386 90623 74755 74526 73923 49376 -14071 -3719 23387 37639 26137 90630
11058 90630 60869 19521 150932 185623 129066 99837 185560 248582 267755 347564 344455 390157
11046 390157 470265 469756 519782 563981 614576 610240 603241 676016 698060 776122 956820 1136987
11034 1136987 1176463 1097371 988030 852803 790647 767623 848388 918307 1095316 1211179
11024 1211179 1344604 1433426 1418661 1427303 1224915 981434 881181 776726 898577 934344
11014 934344 997369 1097178 1195357 1154643 1103536 1051994 880126 645681 548963 469694 396810
11003 396810 443629 497123 602711 621983 608721 578348 493521 352877 359879 347778 214279
10992B14279l4071J832L3222n8377l3759o879J5088l6003q5654k5551N349n8239
10980f8763J6740O7975Q8550K2753o6609j1205R7236k9074q0340K1042R164K8028
10968I5497M4565k1660j03392k3516L5775M5298m0194K0328q3330n3336K2744
10957f1221L9840J6977N9245j3709J6572k61J47736K1810j02902m7577k7708j6729
10945C2073J4594K1973J8226j00794k2977K9536Q2066j2740l3525j192J1459K102
10933D0801k9257q8008k0396P0730M0813R3410K8941j062M4843K5939m3522q2726
10921H0506k4890n2847o2538J487l3604k6799M827Q2041M3632M401N7970k4387
10909D9799j8744j5799l2061l9465K4247J0534L5551n9886l7655K8390N7400M6575
$$ plain form
10992 214279 180208 182040 215262 156885 123126 116247 131335 95332 9678 -15873 -10524 -68763
10980 -68763 -52023 15952 104502 127255 60646 49441 146677 117603 37263 58305 67469 95497
10968 95497 140062 118402 15010 -8506 27269 72567 32373 52701 -30629 -83965 -61221
10957 -61221 -21381 -4404 54841 41132 57704 57443 205179 226989 124087 76510 48802 32073
10945 32073 46667 68640 86866 -13928 -36905 -7369 74697 61957 28432 27240 38699 40801
10933 40801 11544 -76464 -96860 -26130 14683 108093 137034 135972 180815 206754 163232 80506
10921 80506 55616 2769 -59769 -58282 -91886 -118685 -113858 -31817 11815 16216 74186 49799
10909 49799 31055 15256 -16805 -56270 -32023 -21489 14062 -45824 -83479 -55089 2311 48886
10897D8886L9189l4117k3648p9780j4889K491p3763J13691O3646l6411M5914L6488
10885H7697o7882m0038N5924J1016J5852R215M4995K845P6099L4609l4434j08888
10873H7010q0174K6095P1254P045p5589j00153K1540O30J01471O0767n5452l6806
10861B7638K3074O336j5843m7756P5179R4120K3362l436l4923J7788l2518Q8431
10849B21452m873M032j1826n7082L4929M4636N2980l7227r2891K2462m4709k9467
10837A02416L2762o1235k97K7879M8275O6987l2315p1248N2l6427j5999M3202
10825A04052J2082P946K5567m5357o410l0287l1221o5177l9776k7733J30214M5633
10813G9533n23k0775M1810N7512m2624l5877o5345j5132M0985o1623l1616O2066
$$ plain form
10897 48886 88075 53958 30310 -49470 -64359 -61868 -135631 -21940 41706 5295 51209 87697
10885 87697 19815 -20223 35701 46717 62569 71784 116779 119624 195723 230332 195898 87010
10873 87010 6836 32931 104185 111230 35641 -64512 -42972 -42342 59129 119896 64444 27638
10861 27638 50712 57048 41205 -6551 68628 162748 186110 182674 147751 165539 133021 221452
10849 221452 216579 220611 208785 151703 186632 231268 284248 247021 154130 176592 131883 102416
10837 102416 135178 73943 73646 101525 149800 216787 184472 113224 113276 76849 60850 104052
10825 104052 116134 124080 149647 104290 97880 67593 36372 -28805 -68581 -96314 33900 79533
10813 79533 79010 58235 100045 157557 114933 79056 13711 -1421 39564 -22059 -53675 8391
10801H391L1745l7805o6250p1793J01890R3101O5820o625q5058o2990K9245N3310
10789E2981n5035m2352l937L4710Q427l5647N4057K6566q4908P3546P7327j9089
10777H6646K7820j15029K1359J5587N4216J3778m2551r5642k3736L2018r851J3343
10765b2042K8519O0579l375J0440J7379m610R3620O4151K5933L1083o3217k8676
10753B09784j2681j6594J5687n0733l2512J12994P3670k0403Q42n6879q346O5010
10741B79839J3242j4837K3682p6608j0198m162K065j1926j8837j3086M3728N530
10729B18432J8496q5194j10144o0307O4830J09396P6112K2889m2452q2621p7056
10718E2381L7921P1405K6143m0057m9819o280L8531l0481L90K9118j3438l4454
$$ plain form
10801 8391 40136 2331 -63919 -135712 -33822 59279 125099 118474 33416 -29574 -329 52981
10789 52981 -2054 -44406 -48343 -13633 -5206 -40853 13204 39770 -45138 28408 105735 86646
10777 86646 114466 -563 20796 36383 90599 104377 61826 -33816 -57552 -25534 -35385 -22042
10765 -22042 6477 67056 63681 74121 91500 86890 180510 244661 270594 301677 238460 209784
10753 209784 197103 180509 196196 145463 112951 225945 299615 279212 280054 223175 214829 279839
10741 279839 293081 278244 301926 225318 215120 210958 213023 201097 182260 169174 212902 218432
10729 218432 236928 151734 41590 -18717 46113 155509 231621 254510 212058 129437 52381
10718 52381 90302 161707 187850 147793 97974 91694 130225 99744 100134 129252 115814 81360
10706H1360M9923K2146N3243J1439K1304K629j3495j1419K6735n1687L0033O2342
10694B84553O3296M645p0311o4585L6946R450N9591J1600q409P5228O8749k1607
10682D49146j4577P1838m5290j7913k8682P5848J20900L4532o8702o7332J158
10671E10926K4473Q1293M4499K7404k7507m5473N2694R4464J7988P2650k957K2856
10659H73310K2020J17510J11966N4338L94N5949M8679Q0945j3886K4132J27168
10648A502525R1546J16154P0928O7933J38031Q1762J77119K93377K59725K87903
10638C087003L18208L55800N06682O91762P21912O03967M79837M47296N39707
10629G752174P60002J029366J193717J698584K364910L254349M363118N942138
$$ plain form
10706 81360 131283 153429 206672 218111 239415 242044 228549 217130 243865 192178 222211 284553
10694 284553 347849 352494 282183 217598 254544 263994 323585 335185 326776 402004 470753 449146
10682 449146 434569 506407 461117 443204 414522 490370 611270 645802 577100 509768 510926
10671 510926 535399 616692 661191 688595 661088 615615 668309 762773 780761 853411 850454 873310
10659 873310 895330 1012840 1124806 1179144 1179538 1235487 1284166 1365111 1351225 1375357 1502525
10648 1502525 1594071 1710225 1781153 1849086 1987117 2068879 2245998 2539375 2799100 3087003
10638 3087003 3405211 3761011 4267693 4959455 5681367 6285334 6765171 7212467 7752174
10629 7752174 8512176 9541542 10735259 12433843 14798753 18053102 22416220 28358358
10621B8358358P903986J0139983J2265439J3169819J1308152O703822J063323
10614I0912882k951118l945344k080322J593767O339189J2134237J8595487K4164511
10606A44763289K6091894K0593535P905263o209591j5210655j6540852j1493331
10599A49899552l705342N150428J4555209K3755944L1173975L1952795K1375307
10592B74157868J176169j8994810l0830031l1527659k4494752j4893188n517315
10585A49076282L330134J0940437J5891163J5508995P423013o490313j9377767
10578A76301944k5757668k4866835j9272740j2459946o448534j718663J799580
10571H7577138L687998L004347p43276o321861j1068840j3283874j2816639j0571015
$$ plain form
10621 28358358 36262344 46402327 58667766 71837585 83145737 89849559 90912882
10614 90912882 87961764 84016420 81936098 83529865 89869054 102003291 120598778 144763289
10606 144763289 170855183 191448718 199353981 193144390 177933735 161392883 149899552
10599 149899552 146194210 151344638 165899847 189655791 220829766 252782561 274157868
10592 274157868 275334037 256339227 225509196 193981537 169486785 154593597 149076282
10585 149076282 152406416 163346853 179238016 194747011 202170024 195679711 176301944
10578 176301944 150544276 125677441 106404701 93944755 87496221 85777558 87577138
10571 87577138 91265136 94269483 93526207 87204346 76135506 62851632 50034993 39463978
10563C9463978p994099n993391m414493l267568k603684k051035j619644j340608
10555A0179456j044772r08785q25416p27334o84650n67341n16632m30440l12236
10546D161850j97331j98791l04365k47758j46566k12823j10130p6044j44036j07882
10536B416124m7983j32672j80704q9236j49850l2038m4791P65k7835j14942j67832
10525A429006j06596n6835J8253l027K9558q1661O8133l3341j23586n5196L9767
10514A124475n2433r1980k9010k9094k267J1735K1327L425L044l0335P4708M3877
10502A047472m2035P0145L0600r0349j15339o0801M0924M7216Q759l5253l6573
10491H64766m5476j05873L6453k2439M4892O755L9059l0012p8340l0274M7O2942
$$ plain form
10563 39463978 31469879 25476488 21061995 17794427 15190743 13139708 11520064 10179456
10555 10179456 9134684 8225899 7400483 6673149 5988499 5421158 4904526 4474086 4161850
10546 4161850 3964519 3765728 3461363 3213605 3067039 2854216 2744086 2668042 2524006 2416124
10536 2416124 2368141 2235469 2054765 1965529 1815679 1783641 1738850 1739615 1711780 1596838 1429006
10525 1429006 1322410 1265575 1283828 1280801 1310359 1228698 1296831 1263490 1139904 1084708 1124475
10514 1124475 1072042 980062 951052 921958 919691 931426 952753 956178 959222 928887 1003595 1047472
10502 1047472 1005437 1075582 1106182 1015833 900494 839693 880617 927833 936592 901339 864766
10491 864766 819290 713417 749870 727431 772323 779078 818137 788125 709785 679511 679558 742500
10479G42500k6045n1168o9111L1443j5998q445K902o4017p8835m49J8510Q272
10467D89559M9090R4147J1265k334j11057n3470R7169j0124o1180m2247k4032
10456D36786j067L3998o0954m0337l7857J6925L6267o6509k7064N1318j588M0128
10444C80046L3708o0943o2059m6955l04K5083m2068p2348L0705N3154k9072m2292
10432A66655N9467J04183R1837o4000r7016k4144m0825l4340o091j8258L6939
10421A74407N0339O2226N9626P1757L7384K3753n0038j22127p2111L5553j567
10410B69202K3144O7313P7605J8014j00567j03250m7770Q2138L2319k9807k8755
10399B59586L5445P38j8376K550K4487l3150J5226m0408j9165M3509n7003N1787
$$ plain form
10479 742500 716455 665287 596176 627619 611621 603176 606078 542061 463226 462777 481287 489559
10467 489559 538649 632796 644061 641727 530670 477200 574369 564245 503065 460818 436786
10456 436786 435719 469717 408763 368426 330569 347494 383761 317252 290188 341506 339918 380046
10444 380046 413754 352811 290752 243797 243493 268576 226508 154160 184865 238019 208947 166655
10432 166655 226122 330305 422142 358142 261126 236982 196157 161817 155726 137468 174407
10421 174407 224746 286972 346598 418355 455739 479492 429454 307327 235216 270769 269202
10410 269202 292346 359659 437264 455278 354711 251461 203691 285829 318148 288341 259586
10399 259586 295031 295769 277393 279943 304430 271280 286506 246098 226933 270442 213439 265226
10387B65226P7380p0444q3063L4412L0003l8989j01804Q973L7795k9088L5626
10376A66027K9550M2075j3665k9308k7831p0363O7807k4928K0738K542n1143L7087
10364A48588M8388J4584j4258N0728q2011m1227j3060j6327n5259K3919O1044
10353A25109M7704N3769m2611j02114l0063o9656l8008P7981R7040O822Q1118
10342B07091j3582n7754k1772m172M8042Q8461k1474m4445J8812m7417N809L9195
10330A96794K6448l9044N676o6566p5447p4907K8828R8025R1695M1190l6455j00547
10318I5690j36782N9238N9515o5709n476O1230N9718L1447k0038p7245J4206M592
10306H0386o5794p208L8241Q4568M7896J60j38448k1283L0195M1138j7826n7699
$$ plain form
10387 265226 342606 272162 189099 223511 253514 214525 112721 121694 159489 130401 166027
10376 166027 195577 237652 223987 194679 166848 96485 164292 139364 160102 162644 111501 148588
10364 148588 196976 211560 197302 248030 166019 124792 111732 95405 40146 64065 125109
10353 125109 172813 226582 183971 81857 51794 -17862 -55870 22111 119151 125973 207091
10342 207091 193509 135755 113983 109811 157853 246314 224840 180395 199207 151790 157599 196794
10330 196794 223242 184198 189874 123308 47861 -27046 1782 99807 191502 232692 196237 95690
10318 95690 -41092 18146 77661 11952 6476 67706 127424 158871 138833 61588 75794 80386
10306 80386 14592 7384 45625 130193 178089 178249 39801 18518 48713 89851 72025 14326
10294A4326M6430N9462r616Q127m9816N993O2214l161m0763n7335J0993j2284
10282C4570o640l8912j2307J5464O262O2336N416J4232m622p694l9774l6976J11140
10269A02495J29958n3586n7807j1527K4672k0922j0694N5320K1529J1112p595
10258A82955r4058l8997L6888M4948J4769m248n8784K717p2931J1042Q1777j4803
10246I1275l848L368l6987K7974M7531j9620j6986l0868l2552K2559M7160r643
10234H9363P1727M2196p0223J7023n2972m8054o52J1184K4966Q8230L9578n056
10222B07310J6431P808o4910o0791P3433J6147j05394o6115j2399Q7854K28827
10211C28201L0372o8517m4354l0868n2895o9212k6724k6554L6240J4860j9292
$$ plain form
10294 14326 60756 120218 110602 118729 68913 74906 137120 133959 93196 35861 46854 34570
10282 34570 27930 -10982 -23289 -7825 -1563 60773 66189 80421 75799 68105 28331 -8645 102495
10269 102495 232453 178867 121060 109533 134205 113283 102589 157909 179438 190550 182955
10258 182955 88897 49900 86788 131736 146505 142257 83473 86190 13259 24301 106078 91275
10246 91275 87427 90795 53808 81782 129313 109693 92707 61839 29287 51846 99006 89363
10234 89363 161090 203286 133063 150086 97114 49060 48408 59592 84558 172788 212366 207310
10222 207310 223741 231549 166639 105848 179281 195428 90034 23919 11520 99374 328201
10211 328201 358573 290056 245702 214834 161939 92727 66003 39449 75689 90549 71257
10200G1257o358j8294j7698J5641L7556J0453p3486L1148L1798R2735N6387l5385
10188A95754Q735m4296l5324L8019M740N6731J05220O5339J28546M5447p5909
10177D93002o8249j5670j4527N0635J15426J48172O9805J07786J05077J65913
10167A157370L3132j27416j14626p8971j2764M8860r003N357P2461K17644J76336
10156A368380N8331J0572j65888j77065j10403p4561j6842q8802l5135Q1562L7749
10145H87898R9153O4507P212j27574k28030r2775L1124M678j6517L7837O2971
10134G30484p5347p859j16676r7500n0815l9023P926o5694l2184m8961M1056M7584
10122B92991l8676l7732Q270q2453M6646M5230m0871j6226q673j908j56855l8383
$$ plain form
10200 71257 64899 46605 28907 44548 82104 92557 19071 50219 82017 174752 231139 195754
10188 195754 204489 160193 124869 162888 167628 224359 329579 394918 523464 568911 493002
10177 493002 424753 409083 394556 445191 560617 708789 778594 886380 991457 1157370
10167 1157370 1190502 1063086 948460 869489 856725 905585 896582 901939 974400 1192044 1368380
10156 1368380 1426711 1437283 1271395 1094330 983927 909366 892524 803722 768587 850149 887898
10145 887898 987051 1051558 1058770 931196 703166 610391 641515 646193 629676 667513 730484
10134 730484 655137 647278 530602 433102 382287 343264 351190 285496 253312 204351 245407 292991
10122 292991 254315 216583 224853 142400 189046 234276 193405 177179 168506 166598 9743 -28640
10110b8640L6129J56796k9277j71428o8073L3221M8894O5959N7834N0527l7682
10099A14260p3103o1127K8352P06M526J3424P4155J8197o722r2415n9306K6710
10087a2343K2433j9434j02489O9821O4260O1328l9081J3930r943J3087k7831k517
10075C1221O271r6789O4985Q9995N8531k5833n128M3428l7643j9460j8140l2467
10063E8971P413Q816O4099j1440o8846k442q057l8076P361K4480m8946N853k0817
10050b1631L138n4866j2403M5778J3039N4951j3481l687q636p049n3115J04051
10038D6089J46464k5586P645j4474k6054M9808l6919q1405k5341O962p5679K4057
10026d433J0370M0629J7737N6140j8858j3067P0996L750m8057p0478j949j7727
$$ plain form
10110 -28640 7489 164285 135008 -36420 -104493 -71272 -22378 43581 101415 151942 114260
10099 114260 41157 -19970 8382 9088 13614 27038 101193 119390 112668 20253 -39053 -12343
10087 -12343 10090 -9344 -111833 -42012 22248 83576 44495 58425 48482 61569 33738 31221
10075 31221 37492 -59297 5688 95683 154214 128381 123253 166681 129038 109578 91438 58971
10063 58971 66384 75200 139299 127859 59013 56571 48514 10438 17799 42279 -6667 -814 -21631
10050 -21631 -18493 -73359 -85762 -39984 -26945 28006 14525 10838 2202 -4847 -57962 46089
10038 46089 192553 166967 174612 160138 134084 183892 146973 65568 40227 47189 -28490 -4433
10026 -4433 5937 46566 64303 120443 101585 88518 159514 163264 115207 44729 42780 25053
10014B5053q2679P5240k2846k7735P608j9442N913N597k0479L7794r456k4561
10002d9993N609P3927J2069j7764R774P0292L0685k41p9826j03014P304L0636
9990a0542Q4464N5616L221p7808j18226M4534K086K2110N6077o0760p7219M2002
9978c4445k5421n1019L2092q19k8824O4456J17391O0332j7735j5642n0551o5576
9966a5761M0387K4933l8272m610n3420O4471R9450M006l1158k2321n061J8768
9954H1412j024j063N2436L6710m0098n7647Q445L2817J5845n7592o6881J5706
9942A9066N0351j1644L56N5055M0378l6284m7795J422M0540N617M2864J9475j1260
9929A68141K1856p9205K1169l6510k8094L9381p515j30852n6887Q5218N005J6307
$$ plain form
10014 25053 -57626 17614 -5232 -32967 -25359 -44801 -38888 -33291 -53770 -15976 -25432 -49993
10002 -49993 -44384 29543 41612 23848 33622 103914 134599 134358 54532 -48482 -41178 -10542
9990 -10542 73922 129538 132759 54951 -63275 -18741 -16655 5455 61532 772 -76447 -34445
9978 -34445 -59866 -110885 -78793 -79612 -108436 -43980 73411 133743 116008 100366 49815 -15761
9966 -15761 24626 49559 11287 6677 -46743 17728 117178 121184 90026 67705 62644 81412
9954 81412 80388 79325 131761 168471 128373 70726 79171 111988 127833 70241 3360 19066
9942 19066 69417 57773 58129 113184 153562 117278 69483 70905 111445 117062 159926 179401 168141
9929 168141 189997 110792 131961 95451 67357 106738 99223 -31629 -88516 -3298 1707 18014
9917A8014l8813m9422N5708N3089L3242N3693q3372n0923J0665J2227k8447j0887
9905b5226P800k5107M6665K0738M5081Q602j05224n0724O0898o9241j0634Q6588
9893i784O1596k6225Q4938Q2283N684m9397m7746L2421K8394n7731j21584o9789
9881h6940N2990P8178k1308K7673P0464m7211q8739l604J2821o7145L9870j0404
9869d3355j3014N3816R1171J1753o520j5740j6961m6510n7066n1673P3181M9570
9857B8652p1472l9175p947P6724O9950N192K6739j8352l5926l9823p1851N7675
9845a9614L1321O5655n1048n0971N8760p8162J3131N1194P0102l9555k8409n2845
9833c0441k903Q2900O660l7848r804j02362J9950J02165R9920L3904k1579N9283
$$ plain form
9917 18014 -20799 -70221 -14513 38576 71818 125511 42139 -8784 1881 14108 -14339 -25226
9905 -25226 -17426 -42533 4132 24870 69951 78553 -26671 -77395 -16497 -85738 -96372 -9784
9893 -9784 51812 25587 110525 192808 198492 149095 101349 133770 162164 104433 -17151 -86940
9881 -86940 -33950 44228 22920 50593 121057 73846 -14893 -18497 -5676 -72821 -32951 -43355
9869 -43355 -56369 -2553 88618 100371 93851 78111 61150 14640 -42426 -94099 -20918 28652
9857 28652 -42820 -81995 -89942 -13218 56732 61924 88663 70311 34385 -5438 -77289 -19614
9845 -19614 11707 77362 26314 -24657 34103 -44059 -30928 20266 90368 50813 22404 -30441
9833 -30441 -33344 49556 56216 18368 8564 -93798 -73848 28317 128237 162141 140562 199845
9821A99845l2571p9958o7649J534L7460L4922k5334j4424O7098J6650q7287p9809
9809b9523l8765m978j0932J02310P7939k432r202o5536j1891k1727k4108Q9560
9797E0715l1926r7199q1662k8627O7414r256l2359Q9789K0467J9830L5820j2291
9785i285l0879m0594K055J5522n2201k8047J13322N2384K9433K7819k1475l7498
9773B0556M6758M0249J3664m7028m0018m6763j03105K6642J78557k9283j09615
9762d9386r6969k5872L0641N4076J39930L4468q5464l4493L5155J9752k8373L7836
9750C1301L4965L4345o1908j1879m0026m9504j3991R2102M2902N4151o0272l7909
9738A4277j7408j8193o8988p4335N0982Q2492K9756r540J0130N683o731L5742
$$ plain form
9821 199845 167274 87316 19667 21201 58661 93583 68249 53825 120923 137573 50286 -29523
9809 -29523 -68288 -73266 -84198 18112 96051 93619 84417 18881 6990 -14737 -38845 50715
9797 50715 18789 -78410 -160072 -188699 -121285 -130541 -162900 -73111 -52644 -32814 3006 -9285
9785 -9285 -40164 -80758 -78703 -63181 -115382 -143429 -30107 22277 51710 79529 58054 20556
9773 20556 67314 107563 121227 74199 34181 -12582 -115687 -89045 89512 60229 -49386
9762 -49386 -146355 -172227 -141586 -87510 52420 86888 1424 -33069 2086 21838 -6535 31301
9750 31301 66266 100611 38703 26824 -13202 -62706 -76697 15405 58307 112458 52186 14277
9738 14277 -3131 -21324 -90312 -164647 -113665 -31173 -1417 -10957 -827 4856 -1875 33867
9726C3867N8481M8306k5778n719R4778K8742m8588o4571n2917l8236l8237n9353
9714f9225j197j1957P8205Q4036N8835L317o04o0655M8504l9218q6475l6944o5575
9701i8953l0211N3989L687J07428j4370r136M8601m8629p7436N4586Q8089J9810
9689I7455k8408m406P44o533J1894N6333l5039n0744Q6166K7711k3459J4139m1654
9676A04199j0080J5078K4697N0783k740l5567M1277K6752k2648L8774N3293J6182
9664C00000m4058R621Q0406P716L5461K8124j7381K671k8322n6328l128O7275
9652C82057M6763r4138m6003m4517p5587p4966J0063N2373n9837M3945j1805j01102
9640B7246k381J14249R120p8881k0948K3998L1879m7836j69486K5523J35732O5353
$$ plain form
9726 33867 92348 140654 114876 109157 203935 232677 184089 119518 66601 28365 -9872 -69225
9714 -69225 -70422 -82379 -4174 79862 138697 142014 141410 80755 129259 90041 3566 -33378 -98953
9701 -98953 -129164 -75175 -71488 35940 21570 12434 61035 12406 -65030 -10444 77645 97455
9689 97455 69047 64641 65385 58852 70746 127079 92040 41296 127462 155173 131714 145853 104199
9676 104199 94119 109197 133894 184677 181937 146370 187647 214399 191751 230525 283818 300000
9664 300000 255942 265563 345969 353685 389146 417270 399889 402560 374238 317910 314782 382057
9652 382057 428820 334682 288679 244162 168575 93609 103672 156045 96208 140153 128348 27246
9640 27246 24865 139114 148234 69353 48405 72403 104282 56446 -113040 -87517 48215 113568
9628A13568p4530n4227k6408P7453J70763L7144j27710j20927m8188n0831M6333
9617e7560J02637O859J3979J1107K9340o063r2743j7512p0697L0833M6311R4832
9605I1323l6785k6611r924M060L4986q3410J1606k4074j9368J03459K9475k4664
9593E0073l6914m525N2000n8727j09003o1148j0730L3122P7388P498J652K5524
9581c3790n6000n6941K3338l5930P768k9835l6772J7464k953O3251P0041j6286
9569h6645n4938r12m1502K4439R4459J5252K7484M8556r792m5100N0172K6390
9557D7863n0101j9863l9777j4241k2168J531O213M4429M2419N6317L8810P2555
9545A63987M4480m6901k4332o8494j27863q1804R1373R6984O7727L5955n4708
$$ plain form
9628 113568 39038 -15189 -41597 35856 206619 243763 116053 -4874 -53062 -103893 -57560
9617 -57560 45077 51936 65915 77022 106362 100299 7556 -9956 -80653 -49820 -3509 91323
9605 91323 54538 27927 18003 22063 57049 -26361 -14755 -38829 -58197 45262 74737 50073
9593 50073 13159 8634 60634 1907 -107096 -168244 -178974 -145852 -68464 -60966 -59314 -33790
9581 -33790 -89790 -146731 -123393 -159323 -151555 -181390 -218162 -200698 -203651 -140400 -70359 -86645
9569 -86645 -141583 -142495 -183997 -159558 -65099 -49847 -22363 26193 16401 -28699 21473 47863
9557 47863 -2238 -22101 -61878 -76119 -98287 -96756 -90543 -46114 -3695 52622 91432 163987
9545 163987 208467 161566 137234 68740 -59123 -140927 -49554 47430 115157 151112 96404
9534I6404n1309l1623j1608k3746J1890R8787J7520k1730J7996M5543l1877k6023
9522I0224l962k9779J3072q5643M288M1934K9932P790r6500r5168k8561Q3368
9510f9005R5748l5251l9120k4393N4125Q1945m6643N2629Q6921l2942N1952n492
9498A70474l0700N4675j6805J6093l1027J11n3333j6038n1316o1382L2129O0415
9486G3296M5824k1224n4592J5448p287n0178j9790P574J1216Q4905R9152L1627
9474B15971m2298N6539L7015l4245k8523J02996Q2446R7142N7157K0993o8605
9463D96588J0301M810l8661L7002M7252R1701Q9988J36505L67013M84727M14611
9452B141837J57497j37558k71278k59706j63707k26465r5352j39346j68058j16149
$$ plain form
9534 96404 45095 13472 1864 -21882 -9992 88795 106315 84585 102581 148124 116247 90224
9522 90224 86262 56483 69555 -16088 -11800 30134 60066 67856 -28644 -123812 -152373 -69005
9510 -69005 26743 -8508 -47628 -72021 -17896 64049 17406 70035 156956 124014 175966 170474
9498 170474 139774 194449 177644 193737 162710 162821 109488 93450 42134 -19248 12881 73296
9486 73296 119120 97896 43304 58752 51465 1287 -18503 -10929 287 85192 184344 215971
9474 215971 173673 230212 267227 232982 204459 307455 389901 487043 544200 565193 496588
9463 496588 506889 511699 473038 510040 557292 648993 738981 875486 1242499 1727226 2141837
9452 2141837 2299334 2161776 1890498 1630792 1467085 1240620 1145268 1005922 837864 721715
9442G21715n8673K8497J50355J63855J10971K58301J85791J50874L07612K45543
9432B264841O5098m4195m6666j32575n2845p7862m9222j21722j67407q7222J1864
9421A562087j2583J0715q2887j08696J20458L52525M57575N72692Q98843J191376
9411D962105J271853P15420m29341j062526j335912j109120o67378l87907k16489
9402A740705j22321K7913L3080P9281o309j00898k5205R6410J39069J77686P3637
9391B113048R3765K4451J08782Q6843J576j30629j80600k65391l17916k33312
9381A300617k93278k87928j27694J6083R7117J44330J17380J64587J87242J87729
9371A506185J78778J97827K95510J41206k02396m47792m16577l29922k60031r7584
$$ plain form
9442 721715 663042 691539 841894 1005749 1116720 1375021 1560812 1711686 2019298 2264841
9432 2264841 2329939 2285744 2239078 2106503 2053658 1975796 1926574 1804852 1637445 1550223 1562087
9421 1562087 1549504 1560219 1477332 1368636 1489094 1841619 2299194 2871886 3770729 4962105
9411 4962105 6233958 6949378 6520037 5457511 4121599 3012479 2345101 1957194 1740705
9402 1740705 1618384 1646297 1679377 1758658 1752349 1651451 1626246 1722656 1861725 2039411 2113048
9391 2113048 2206813 2231264 2340046 2426889 2428465 2297836 2117236 1851845 1533929 1300617
9381 1300617 1007339 719411 591717 607800 704917 849247 966627 1131214 1318456 1506185
9371 1506185 1684963 1882790 2178300 2319506 2117110 1669318 1252741 922819 662788 565204
9361E65204m5801M299J8336J9521l0122K8910j3099m3947k1649j10879o8849J4041
9349C15965m9567r594j2260n9718J4909o5685P351O204L2763Q4831p3352o6443
9337A25404M7466N915n2025k009P795l384l544M2742r010K3287O2011Q0764R5765
9324D21177l8764j41322m0970o5584K1203R566m5870Q508K4763m6040K821m9022
9312F0466j13847K694q713J7931R5888m5201p8041j4750N5526J08121N5127n2450
9300H2751J2203j6131n0469N0149j9734L9797O7291J4636J2625K4722k9583L7420
9288B25677O7390o6559p5334q2144k3281l6807k2142P0935M2585o2305m831J4511
9276D7695n5638Q322L3607j1256j5377j6803p918j4436P4475N9558J14592J1559
$$ plain form
9361 565204 519403 523702 542038 561559 531437 560347 547248 503301 481652 370773 301924 315965
9349 315965 266398 256804 244544 184826 199735 134050 141401 147605 180368 265199 191847 125404
9337 125404 172870 178785 126760 124751 132546 129162 125618 168360 159350 182637 244648 325412 421177
9324 421177 382413 241091 200121 134537 155740 165306 119436 127944 152707 106667 109488 60466
9312 60466 -53381 -50687 -59400 -41469 54419 9218 -68823 -83573 -28047 80074 135201 82751
9300 82751 94954 78823 28354 78503 58769 98566 165857 180493 193118 217840 188257 225677
9288 225677 293067 226508 151174 69030 45749 8942 -13200 57735 100320 38015 33184 47695
9276 47695 -7943 379 33986 22730 7353 -9450 -17368 -31804 42671 102229 216821 228380
9264B28380o2102n5549k870m7223j14535m5851M1408N5456K5997o4708m7006N342
9252h3261Q7198L8127J9286K637O8383M5453j6863l9429j4106n2605j694j596
9240E1530k231L3463j104r6774m6262M6534R7531K5556j02336K5686j8346n9170
9228d5923m7872O4279l0783j2248Q5649l5693K5134K1281j04552L1028J756N2651
9216D707N1009m0358N590L6719l8131l3917j3560n7743N178N8097M0175L4828
9204E2594K4491l2266o3382q9091r405k9983K986O6144J0495j4197l4967P5194
9192d1387P7634M5955j9037k3092n9386j00263k4699J33624J06811J1296o2957
9181D4499n9622n8552k7694N8250L9632K5723n77k1961j9814J9607n7594N5005
$$ plain form
9264 228380 166278 110729 107859 60636 -53899 -99750 -58342 -2886 23111 -41597 -88603 -83261
9252 -83261 3937 42064 61350 63987 132370 177823 160960 121531 107425 54820 53126 51530
9240 51530 49299 82762 81658 -15116 -61378 -14844 82687 108243 5907 31593 13247 -45923
9228 -45923 -93795 -29516 -60299 -72547 13102 -22591 2543 23824 -80728 -49700 -47944 4707
9216 4707 55716 15358 20948 57667 19536 -14381 -27941 -85684 -80506 -22409 17766 52594
9204 52594 77085 44819 -18563 -107654 -117059 -147042 -144056 -77912 -67417 -81614 -116581 -41387
9192 -41387 36247 82202 63165 40073 -19313 -119576 -144275 -10651 96160 107456 44499
9181 44499 -15123 -73675 -101369 -43119 -3487 22236 21659 -302 -20116 -509 -58103 -3098
9169c098p1705j2028J22413l4678o2036o370M2033N1931K6425J7777n4122q8106
9157g1564O0013J32303N7184m2887j26342K1341M253m8046n5905K6240N9682J23142
9145A39414R046m7343l1286n3774q1882n3505M7746J39853R7574o8427l1784j16797
9133e1165o5596Q959q34O470R1511K3136m7548p3449p7624M7810L8687P906k805
9120i4542M2103R035P361k1190k7238l9203l2476m817R7956L6324j0192o2751
9108i9630p2392k6747J7420J51842O4372q175l2744j6430m4263m8697L9203l9781
9096a16022K4633k3364q9534P3260Q7960o7402m7619N3173m500K3344O2009P35
9084b3327o0660K3860N4965k0894l2089N249l8027k0846L0667L0211j2354m282
$$ plain form
9169 -3098 -74803 -86831 35582 904 -61132 -67502 -25469 26462 52887 70664 16542 -71564
9157 -71564 -11551 120752 177936 135049 8707 30048 34301 -13745 -69650 -43410 16272 139414
9145 139414 148460 101117 69831 16057 -65825 -119330 -71584 68269 165843 97416 65632 -51165
9133 -51165 -116761 -107802 -108636 -102166 -10655 12481 -35067 -108516 -186140 -138330 -99643 -91737 -94542
9120 -94542 -52439 -43404 -36043 -57233 -84471 -123674 -156150 -160967 -63011 -26687 -36879 -99630
9108 -99630 -172022 -198769 -181349 -29507 34865 26690 -6054 -22484 -66747 -115444 -76241 -116022
9096 -116022 -91389 -114753 -204287 -131027 -43067 -110469 -158088 -104915 -109415 -86071 -24062 -23327
9084 -23327 -83987 -60127 -5162 -26056 -58145 -52896 -90923 -111769 -81102 -50891 -63245 -67527
9072f7527k857l0761k6475j16551P7724M3096K3804L9111q025L6384J05319J4488
9060H7730n2982l3891J9604N7142m0536L5217L005m8559j11033M1586M2198o2142
9048f2661l0766K9081J46083J4003n8815K8993J0563P0730p1787j02572k525l0594
9036f0267j6095J32756N2602k6988j10413K6716r7061q4404M4892O7013J24390
9025E3141N1044O041o7287K8760p0512p7208M400N0596j06541n4834L7406M0398
9013a04596M2790J21136O5631l188K0525J9376m1897q1467j01465L322n053M2121
9001b2765P8121Q831n2841q8830j6950K5693N1108L8733R4941J9035L1428K1597
8989A88101l6716L5816r8957L4576J3530n2978q9841n7799K2531J588k1818J1970
$$ plain form
9072 -67527 -70384 -101145 -127620 -244171 -166447 -123351 -99547 -60436 -68461 -32077 73242 87730
9060 87730 34748 857 20461 77603 37067 72284 75289 26730 -84303 -42717 -519 -62661
9048 -62661 -93427 -64346 81737 95740 36925 65918 76481 147211 75424 -27148 -29673 -60267
9036 -60267 -76362 56394 108996 82008 -28405 -1689 -98750 -183154 -138262 -71249 53141
9025 53141 104185 110226 42939 71699 1187 -76021 -71621 -21025 -127566 -182400 -144994 -104596
9013 -104596 -61806 59330 124961 121773 142298 161674 119777 38310 -63155 -59833 -64886 -22765
9001 -22765 55356 64187 11346 -77484 -94434 -68741 -17633 21100 116041 135076 166504 188101
8989 188101 151385 187201 88244 122820 136350 83372 -6469 -64268 -41737 -40149 -61967 -49997
8977d9997N3944O3735m653P99o705J4371j0521N35o1474o8941J1124N4463l7325
8964d0645m037J03319P5627q8712j31168M2438L8102L9093m9950n0684l9866K1336
8952h5147q2904k8114J14119k0427Q006L5437m2898J1054M4220Q3923M0592Q0641
8940A58502n0343m9546k5415k3060L8769o0967q1473l7357R3467M6417M510j8129
8928d625Q624l4856k8310k4846M3975M7234J932J7728m5838j21653j4691Q114
8916a47212J23344P4169n1306n6399k8130k946J1663K8202L8016J3256k6432M8357
8904B4582N733m590R695p5809M266m4574K0720J3196J9523N1738j7054k8691r2090
8891a13355N5073J26768n0404j05469K6574M1959Q8122j5870l2754r7238r162
$$ plain form
8977 -49997 3947 67682 63029 63828 57123 71494 60973 61508 34 -68907 -57783 -3320 -40645
8964 -40645 -44682 58637 134264 45552 -85616 -43178 -5076 34017 -15933 -66617 -106483 -85147
8952 -85147 -168051 -196165 -82046 -102473 -94467 -59030 -101928 -90874 -46654 37269 77861 158502
8940 158502 108159 58613 33198 10138 48907 -12060 -93533 -130890 -37423 8994 13504 -4625
8928 -4625 3999 -30857 -59167 -84013 -40038 7196 9128 26856 -18982 -140635 -155326 -147212
8916 -147212 -23868 50301 -1005 -57404 -85534 -88480 -76817 -48615 -10599 2657 -23775 24582
8904 24582 30315 25725 35420 -40389 -36123 -80697 -59977 -46781 -27258 24480 7426 -21265 -113355
8891 -113355 -58282 68486 18082 -87387 -60813 -18854 69268 53398 20644 -76594 -85756
8880h5756L2719J532K6302O5145j5099k9408J7085k4344r7009R5909M3066O884
8868C7026j5632k1479j682O611N5998Q2223K2056o4098l1093o3287m8148j7310
8856e8815q279j5363Q0379J4481j30166L2259J9844O6536M7326o1112m5274M3330
8844a4854J13582j3868k0556l6597n3259L1277l5663l2553P5579R1206m9072o9549
8832a4327Q558j9446r5353N2312Q8463M6228l437l0949l2903L856j7325j0781
8820b5104n8294K3715O5860O4100M331m7160j09915l3836J4763P57M1197L5281
8808b4305J0188k4167p549N5521N8466L9315q623L1127p742j25707r136Q3469
8796G0857K2712M0214q618l102R2051O03n1507L3065K8035l8919m1022m4339m9930
$$ plain form
8880 -85756 -53037 -51505 -25203 39942 24843 -4565 12520 -11824 -108833 -12924 30142 37026
8868 37026 21394 -85 -1767 4844 60842 143065 165121 101023 69930 6643 -41505 -58815
8856 -58815 -67094 -82457 -2078 12403 -117763 -85504 -65660 876 48202 -12910 -58184 -14854
8844 -14854 98728 84860 64304 27707 -25552 5725 -29938 -62491 13088 104294 55222 -14327
8832 -14327 -5769 -25215 -120568 -68256 20207 66435 62998 32049 -854 3002 -14323 -25104
8820 -25104 -83398 -59683 6177 70277 74608 27448 -82467 -116303 -101540 -100783 -59586 -24305
8808 -24305 -14117 -38284 -45833 9688 68154 107469 98846 129973 122231 -3476 -12612 70857
8796 70857 93569 133783 125165 122063 214114 214717 163210 196275 224310 185391 144369 100030 50100
8783E0100n292R3902j3274k753J9646O625M0501m7903j37461n5466M1627J06024
8771I6276j20972l6043P2588N2787L3903p696n887Q1839j1131k2893K5812m9561
8759A09022j3477L4974q3786O524q810k4136Q101k6527k8893M8498k3270K0198
8747A8418L2437M2786j1614p034K265N1673P020k8977k8267K0476j7612k5525
8735E6046K0080k7592n6296m9005M5547r159l7449K6026Q7167J3691k4831p5727
8723c1502o6506j983k8312L7698O929o0982k4174J30295P4792Q55p2844j727M779
8710c2682n2621o4028N3950N2614m0008o6889M3760L2816q1400K5359J34865O3509
8698F9245M8438r6025O0566j7681k0999N2935k3556m2828n1066m299O5636N2006
$$ plain form
8783 50100 44808 138710 125436 122683 142329 148954 189455 141552 4091 -51375 -9748 96276
8771 96276 -24696 -60739 11849 64636 98539 90843 84956 166795 155664 132771 158583 109022
8759 109022 95545 130519 46733 53257 44447 20311 28412 1885 -27008 21490 -1780 18418
8747 18418 50855 93641 82027 74993 77258 128931 135951 106974 78707 99183 81571 56046
8735 56046 76126 48534 -7762 -56767 -11220 -20379 -57828 -31802 55365 69056 44225 -31502
8723 -31502 -98008 -99991 -128303 -90605 -83676 -144658 -168832 -38537 36255 37110 -35734 -37461 -32682
8710 -32682 -85303 -149331 -95381 -42767 -82775 -149664 -105904 -73088 -154488 -129129 5736 69245
8698 69245 117683 21658 82224 64543 43544 96479 72923 30095 -20971 -25270 40366 92372
8686I2372l4313k2736K1626L680l874k8952j03456K5589J12114r700o2362M6194
8674C6182M0423L3514p1257N107j6376j3183n6975l6672M9129Q4354l2096o1103
8662c8953j7107j708K2634N4266K5501K2574J04210M8259p3053k5035M1619l254
8650A59953j9799o4755J6722K6242N28j09736J9196Q6611O214j5814o239J0369
8638A09492J7275K7401J3272k6768j08n8900o6805p5738q1996O5013J04410Q9856
8626A16404j7538j4037k904M379J23970J2841m1912J2123o353L2490r1994k1939
8614A05530L8384O546j3167k9434m6959j7722k0624N3029N5113m7669m4027q0698
8602d1698P8746n6499n3434N2804J4674j5680J25184Q3280m6057o7462o0881m7381
$$ plain form
8686 92372 58059 35323 56949 60629 56755 27803 -75653 -50064 62050 52350 -10012 36182
8674 36182 76605 110119 38862 43969 27593 14410 -42565 -79237 -30108 54246 22150 -38953
8662 -38953 -56060 -57768 -35134 19132 44633 67207 171417 219676 146623 121588 163207 159953
8650 159953 140154 75399 92121 118363 118891 9155 28351 114962 121176 105362 99123 109492
8638 109492 126767 154168 167440 140672 140564 81664 14859 -60879 -142875 -77862 26548 116404
8626 116404 98866 84829 81925 86304 210274 223115 181203 193326 186973 219463 127469 105530
8614 105530 143914 150460 137293 107859 60900 43178 22554 75583 130696 83027 39000 -41698
8602 -41698 37048 -19451 -72885 -20081 -5407 -21087 104097 187377 141320 73858 12977 -34404
8590c4404R472O2049K3480N3171J1150o1358j0375O1438R7445J4166n1024m1877
8578A33333N150l3505o2618j396K8773m102p0919m0480L52J79m4991J2364J7685
8565f0175m2032Q43Q7546L8796l2378K0236K6481L4207Q9310k0991o8863l0557
8553D2423M2191k3712o8715n200m7315K3654K8803j0069l2514Q9122J5498l9302
8541A4864K376j02991n062J03519J1059K2740l1617P2072M8944q9027j80292m2924
8529a76339J11739L5268q526L9403J07738J11580j8640j34612n342J8123K4970
8518A05362J3154P9508n6903l6175j8095j21170m7181L0198L7418P6451K2426
8507H4993J001n3256q08J371j516J5018Q2241o5266p0689J5844J9443J17144R4341
$$ plain form
8590 -34404 -24932 37117 60597 113768 124918 63560 53185 114623 212068 226234 175210 133333
8578 133333 138483 104978 42360 40964 69737 65635 -5284 -45764 -45412 -45233 -90224 -77860 -60175
8565 -60175 -102207 -101364 -13818 24978 -7400 12836 39317 73524 162834 141843 72980 42423
8553 42423 84614 60902 -7813 -13013 -60328 -36674 -7871 -17940 -50454 38668 54166 14864
8541 14864 17240 -85751 -90813 12706 23765 46505 14888 86960 135904 46877 -133415 -176339
8529 -176339 -64600 -29332 -37858 1545 109283 220863 202223 67611 62269 80392 105362
8518 105362 118516 198024 141121 104946 86851 -34319 -81500 -51302 -13884 62567 84993
8507 84993 85994 32738 31930 33301 31785 46803 129044 63778 -6911 8933 28376 145520 239861
8494B39861j3876n1162p5693r574k6600o7057M2810m4511n9019p1808O0958r701
8482h5372p836P6998m809p165N8317J33745k2101L728n3944m4902L2138L3908
8470A12705N4030k8549k0443P4785K7075m2119l6107o6267J4633K5110k7475l1354
8458E6024L2489L3579q5741l1405P0915r352q1682N0065k1097l8622P4322O3920
8446A13415j5348Q67L2958k1555m2795O6202j8063k2163m3272M1029R308J5781
8434A16364L6598k265k6332r4731k6973P3907k0530P9864O5598n176n7111j7070
8422A22143L2450j4291l5209J8709n3992j18435K9722R3980K2971K5500o3629
8411E9919l0346M1184j406l0187O3143O4804j4687l3928J3929N4218L5431l295
$$ plain form
8494 239861 225985 174823 99130 89556 62956 -4101 38709 -5802 -64821 -136629 -75671 -85372
8482 -85372 -93208 -16210 -21019 -28184 30133 163878 141777 145505 91561 46659 78797 112705
8470 112705 166735 138186 117743 192528 219603 177484 141377 75110 89743 114853 87378 56024
8458 56024 88513 122092 36351 4946 75861 66509 -15173 34892 13795 -24827 49495 113415
8446 113415 98067 98934 131892 110337 67542 133744 115681 93518 50246 91275 100583 116364
8434 116364 152962 150697 124365 29634 2661 76568 56038 135902 201500 196324 139213 122143
8422 122143 154593 140302 105093 123802 69810 -48625 -18903 75077 98048 123548 59919
8411 59919 29573 70757 69351 39164 102307 167111 152424 118496 132425 186643 222074 218779
8399B18779J9856P8847j28832o5356P2198l6101Q667J3173P6177l3788k4227K0043
8387B19436m1106p8417n8564J078M0666M1697J08065L6667j18821n4651P2162
8376A68212O5573N5583k4720m6182k2044j04008k8994K0294Q4739J0839P519m4434
8364A42377K4486J7545J7574o2794o7879K3045M3065Q6656N7947J7229n8844l204
8352B37203m5939K1332O3250j56064o2084j5987N9719N2897L4081L0393l0448
8341A88353k1878o1560M3004J1561r5186m8123K573J08444K9776q985N566l8878
8329A14667r083q8101J8814N6375L2391L4344j3878R0590P0602L658Q687J8521
8317C37587o4397r8061l8288q8303J9386L0286j5074N9950Q2858L4758N3112p5202
$$ plain form
8399 218779 238635 317482 188650 123294 195492 159391 168058 181231 257408 223620 199393 219436
8387 219436 178330 99913 41349 42427 83093 124790 232855 269522 150701 96050 168212
8376 168212 233785 289368 264648 218466 196422 92414 63420 83714 168453 179292 186811 142377
8364 142377 166863 184408 201982 139188 71309 94354 137419 224075 282022 299251 240407 237203
8352 237203 191264 212596 275846 119782 57698 41711 101430 154327 188408 218801 188353
8341 188353 166475 104915 147919 159480 64294 16171 18744 127188 156964 147979 153545 114667
8329 114667 105584 17483 36297 92672 125063 159407 145529 236119 306721 310379 319066 337587
8317 337587 273190 175129 136841 48538 67924 98210 83136 143086 225944 260702 313814 238612
8305B38612o6662j2122P886m852Q987k4443L0889l6417P984L6549J7157j8910
8293A84658j23569l9856P1655J03048K028j16601l9679P117O8486O65n9834k7808
8281C0310P1792N2626O119k5529r0628k0842M2683J01643J12544j6490l5560l3637
8269A95031l5095J6929J8629q904N968r0178j8586N3872k6796l1121L9817J8659
8257A38225P2261P3125n1514k5118q502k4856p0102P832R8520j0421o6716K0625
8245A53359k9079O5155N2972R281n7531q6471K7380M7702r892m1469l4423R718
8233A06702K2825j7078p3749k6619j0842L4819K664M4258j72m6579j2734N3170
8221G6665M4667M0053M6219M6880m4763L5549M764L8117P481j39883j06269Q5545
$$ plain form
8305 238612 171950 159828 167714 162862 171849 147406 178295 141878 149862 186411 203568 184658
8293 184658 61089 21233 92888 195936 197964 81363 41684 48801 117287 117952 58118 30310
8281 30310 102102 154728 160847 135318 44690 23848 66531 168174 280718 264228 228668 195031
8269 195031 159936 176865 195494 186590 192558 102380 83794 137666 110870 79749 119566 138225
8257 138225 210486 283611 232097 206979 198477 173621 103519 111351 209871 199450 132734 153359
8245 153359 124280 189435 242407 251688 194157 107686 135066 182768 172876 131407 96984 106702
8233 106702 129527 112449 38700 12081 1239 36058 38722 82980 82808 36229 23495 76665
8221 76665 121332 161385 207604 254484 209721 245270 250034 288151 295632 155749 49480 135025
8209A35025O2394l499o4336O12K3445j08194J27822j7352o7368N1090L1989k9469
8197A42159n0771n5158J6067k0255J72926J38637k9229j86474q8544r0648l3890
8186h5180P6697P1990l7888O6220Q6405r944o078k3468k9556J6829M6799M799
8174A77625j5069q6325Q230R081M6159K9486k8800l0829L8797k1450r746L347
8162A20506P345K9326l8614L5059M7520M1123p763q2472k0830J566k5515J5877
8150A23128p5289K1188L0579O915P561J5499L5239k7314r943j8186L1439j9255
8138A21561j7407M557L1441O4553k9799m4740n9776J8157K8602n479K202Q950
8126A22822r894K551J9866m5165n1187l8648N9389P3397K9259R3203o678n5646
$$ plain form
8209 135025 197419 193920 129584 130196 153641 45447 173269 155917 88549 139639 171628 142159
8197 142159 91388 36230 52297 32042 204968 343605 314376 127902 39358 -51290 -85180
8186 -85180 -8483 63507 25619 91839 178244 168300 162222 138754 109198 126027 172826 177625
8174 177625 162556 76231 84461 93542 139701 169187 140387 109558 148355 126905 117159 120506
8162 120506 127851 157177 118563 153622 201142 242265 234502 152030 131200 132766 107251 123128
8150 123128 47839 69027 99606 106521 114082 129581 164820 137506 127563 109377 140816 121561
8138 121561 104154 108711 140152 204705 174906 130166 70390 88547 117149 111670 113872 122822
8126 122822 112928 115479 135345 90180 38993 345 59734 133131 162390 255593 248915 193269
8114A93269N291J0408j5272p667l0689n6262J8289j9940j4218m3058p9671m8906
8102h8426K9542Q0744K7241m8745l7018O6776J6496Q5071J8431k5366o8439j01576
8090d5269M9712Q1909Q6838K2757q7057n3836J8723l9160J6912K5859J9745J6241
8078A13374L9993J2847K1707l091m2853m826r9182J3158P5425K2390m4740k0283
8066H3919n4878L3641K9261q3726j547K4785P6080O4508J4240m1304o1551l9159
8054D4269o5405k5367j4081k5600L279l0688n941P3645N2285Q6119j778m2871
8042D7866J6798N466m8114m2289K9802J21739N4090l4531j07449q7373L7825L0425
8030B4255n4984p6443O9745R5094K7069p1921j8267M484m2444O0118l3804r048
$$ plain form
8114 193269 198560 208968 193696 186029 155340 99078 117367 97427 83209 40151 -39520 -88426
8102 -88426 -58884 21860 49101 356 -36662 30114 46610 131681 150112 124746 56307 -45269
8090 -45269 4443 86352 173190 195947 108890 55054 73777 34617 51529 77388 97133 113374
8078 113374 153367 166214 187921 184830 141977 137151 37969 51127 126552 148942 104202 83919
8066 83919 29041 62682 91943 8217 6670 31455 107535 172043 186283 144979 83428 44269
8054 44269 -21136 -46503 -60584 -86184 -82905 -113593 -119534 -45889 6396 92515 90737 47866
8042 47866 64664 70130 22016 -20273 9529 131268 185358 150827 43378 -43995 -6170 24255
8030 24255 -30729 -107172 -37427 57667 84736 12815 -5452 -968 -43412 16706 -17098 -26146
8018b6146L4251J3339N7683p2318J6953k5993R98j5890L756N3382l2756j8664
8006a1405n5857M7699O6066n9574n1593K2800K857P4511J35328j2595l5289r7396
7994B5552j1058N801N3482r144r937K1020l1249q026o369M4813L6252r3176K1148
7981C9109m9333k1829N8250J478N26q176m3439l8887p329Q7219K8797l5510J512
7968A2388l2120K146j6398k3883l8677N3244n5253l2525K5241j3101L1959l7929
7956a24908j406K4630O7063K5928J9960L8593l4751j9745J3101O292m9494m4130
7944g8867J1963m129P2545j2975m5581O4171k699N7659N058q3154K8709N8136
7932G0836k311j02968R6828K4016r9966L2417N6262j3040J6038n2149j2927M5188
$$ plain form
8018 -26146 8105 21444 79127 6809 23762 -2231 -1233 -17123 -13367 40015 7259 -11405
8006 -11405 -67262 -19563 46503 -13071 -64664 -41864 -39007 35504 170832 158237 122948 25552
7994 25552 14494 20295 73777 64633 54696 75716 44467 36441 30072 74885 111137 17961 39109
7981 39109 -10224 -32053 26197 27675 28201 20025 -23414 -62301 -69630 17589 46386 10876 12388
7968 12388 -19732 -17586 -33984 -57867 -96544 -43300 -98553 -131078 -105837 -118938 -86979 -124908
7956 -124908 -126314 -101684 -34621 -8693 11267 49860 15109 -4636 8465 14757 -34737 -78867
7944 -78867 -66904 -71033 1512 -11463 -57044 7127 4428 62087 67145 -16009 12700 70836
7932 70836 68525 -34443 62385 86401 -13565 18852 75114 62074 78112 25963 13036 58224
7920E8224P3933O1695m2770j12160p7675p2723K3913N6675P7896q586K3323l9976
7908B1769j22727k8133M6211Q3640J03614p0085j04480J7713m2845o5906P6683
7897h4546J15889J8004r508K2955j5234r381l350J5302L988o119k780N8516k0980
7884H2756J7752n0619L0752j41363p5143M9290l1940k5469n83k0242J2163n109
7872a57755K6577J10245q19L7673J0635J8801j5139M2885j6865l8215L5207o975
7860D6255l103L951k9934M5541j5321L6946l1345m7615O2631l7405m5061M2582
7848B8122l1828m0594k3451M4594N4970k2484M6657j4366k5522N0131J5508q2532
7836g95J3163J9826k564K3465M5695j0255r798l5730j7737N8566l2374J0970O3240
$$ plain form
7920 58224 132157 193852 151082 38922 -38753 -111476 -87563 -30888 47008 38422 61745 21769
7908 21769 -100958 -129091 -82880 760 104374 34289 -70191 -52478 -95323 -161229 -84546
7897 -84546 31343 49347 39839 62794 47560 38179 34829 50131 54119 48000 45220 103736 82756
7884 82756 100508 49889 80641 -60722 -135865 -86575 -118515 -143984 -144567 -164809 -152646 -157755
7872 -157755 -131178 -20933 -21752 15921 26556 45357 30218 73103 56238 18023 53230 46255
7860 46255 43152 47103 17169 62710 47389 84335 52990 5375 68006 30601 -14460 28122
7848 28122 -3706 -44300 -67751 -23157 31813 9329 55986 41620 16098 66229 81737 -795
7836 -795 12368 32194 29630 53095 98790 88535 78737 43007 25270 83836 51462 62432 125672
7823A25672L8554K58Q231o4787k5398K8869l029m6091n100m024J3933M0989n4548
7810E3529O102R0166j7704n9312M1423o6443q0059p1351m9278L9253N9634n9817
7798a13857O5840O8293m7125k2524K6076r555M8162m4242n6462J07111L5956L7562
7786I5235m05n8771P905K1488j4494o783j1933m2871L8614N2616n1624o3597l4363
7773f8983m7295m248M538m3693Q1032J01323Q347o716M1387Q1976m8458m018j4041
7760H1151l722K7731n0414l8802j9593Q4758m2243j02463Q7322J39150l3086l0464
7748I9325J5736L3941l3249l3970j9663j2172m7947J0006R531M7567O458m7365
7736B8198q393j5633o5136M7038j9549m1841k5933m6831p1120J09379J26108N1623
$$ plain form
7823 125672 164226 164484 172715 107928 82530 111399 108370 62279 57179 53155 67088 108077 53529
7810 53529 59631 149797 132093 72781 114204 47761 -32298 -103649 -152927 -113674 -54040 -113857
7798 -113857 -48017 20276 -26849 -49373 -23297 -32852 15310 -28932 -85394 21717 57673 95235
7786 95235 94830 36059 43964 65452 50958 44175 32242 -10629 27985 80601 28977 -34620 -68983
7773 -68983 -116278 -120526 -115988 -159681 -78649 22674 31021 24305 65692 147668 99210 95192 81151
7760 81151 77429 105160 54746 15944 -3649 81109 38866 -63597 23725 162875 129789 99325
7748 99325 115061 149002 115753 81783 62120 49948 2001 12007 21538 69105 75563 28198
7736 28198 19805 4172 -60964 -13926 -33475 -75316 -101249 -148080 -219200 -109821 16287 67910
7724F7910M4723N8710J4997r8361K6461N815m5647K5436l1821m1409M1354j6510
7712E1658M543Q493o0888k4755J08452j5862p8020N5774J16518o3423j03177L2562
7700C1875J16254K9358m9624p7805l5397j3161n352n2408j01175N8205O5988l7247
7688g0489q55R1286M406R542J1604N5229J1141j4919K0518j01779n0762J9285
7676a5793N4579M1823L2918j24778o9342j4599p1659P6168J49361P9126l3313
7665A04491j9200M4876q1041j18368K3852K30K7022K0741M5292N36o9995l5490
7653e7054O8155k0520K6436L8676K3917m9949K7802p481j638j04042n2078j6321
7641a24097k6302M9875Q0088N3126l3600j7682P9311K2047m8598N3320j1368j07607
$$ plain form
7724 67910 112633 171343 186340 87979 114440 120255 74608 100044 68223 26814 68168 51658
7712 51658 56201 64694 3806 -20949 87503 71641 -6379 49395 165913 102490 -687 31875
7700 31875 148129 177487 127863 50058 14661 1500 -3852 -56260 -157435 -99230 -33242 -70489
7688 -70489 -71344 19942 24348 33890 45494 100723 111864 96945 117463 15684 -35078 -15793
7676 -15793 38786 80609 113527 -11251 -80593 -95192 -166851 -90683 58678 137804 104491
7665 104491 85291 130167 49126 -69242 -45390 -45160 -18138 2603 47895 48431 -21564 -57054
7653 -57054 11101 -9419 17017 55693 79610 29661 57463 49982 48344 -55698 -107776 -124097
7641 -124097 -150399 -100524 -20436 32690 -910 -18592 60719 82766 34168 87488 76120 -31487
7629c1487Q1553k9472j9401j7604n6138M784Q8075P800J24199P710k0124n1068
7617H8827o5327M875J6010J1633l7408K1234j9233o688K0139m9141J7973l0193
7605b7299k262N778J3215q0607P1577M9181Q853P3743L9752j2608M179l6583j9921
7592H6998K0337k6079n7496j192K1597N1825k5754j3784k027o7935M0817M0877
7580F8184O0493L9858N892j5212l5538l0079o740k306o6248l0158j3901k4062
7568d9817L1890K1992J9310L3774J1487q6622k7830J8403l4540m1388L5363J5197
7556e2781r310O1554l938m3788k2111N7477O7797k0640n1251N3784R2399k9868
7544I9324k2759L492M6012j14487j19450p7612l2158P3304L2024L8219N6754M507
$$ plain form
7629 -31487 50066 20594 1193 -16411 -72549 -67765 20310 28110 152309 160019 139895 88827
7617 88827 23500 28375 44385 56018 18610 39844 20611 13923 34062 -15079 2894 -27299
7605 -27299 -29561 -23783 -10568 -91175 -19598 29583 38436 112179 151931 139323 143502 106919 86998
7592 86998 107335 81256 23760 22568 44165 95990 70236 56452 54425 -13510 27307 68184
7580 68184 128677 168535 174427 159215 123677 93598 86858 84552 18304 -11854 -25755 -49817
7568 -49817 -17927 4065 23375 57149 68636 -17986 -45816 -27413 -61953 -103341 -67978 -52781
7556 -52781 -62091 -537 -4475 -48263 -70374 -12897 54900 34260 -16991 36793 129192 99324
7544 99324 76565 80057 126069 11582 -107868 -185480 -217638 -144334 -112310 -74091 -17337 -12830
7532a2830K3988M5458N2234m53n0935o1825k6842j7117K267K0649j4240m3996
7520h3642l8790N3258M5223o9478Q8983P8019J02015O210o6264j7128J8487O2982
7508A79875n2354j27948L465K9204q3022m8882J40408J16361n3846m7445K3771
7497G9587m2537k9333o1144m0503k5989n0460O5048O9839K3154Q1096l9549k2987
7485F222r624O6373k3246j11174p0280K6001L0432k1986N5554n813J427m5341
7473a01455k1258P0653m3272n6664K4306N1522R782q2386q7628m656R4592R0826
7461e5638L7739k37k6627l1365J602R8j1494J772n2164k6445K4759L1778M3963
7448f2259J19317n615r5259m9911k7213p011k2317P4755l7214k4620J11207M0634
$$ plain form
7532 -12830 11158 56616 108850 108397 57462 -4363 -31205 -48322 -46055 -25406 -39646 -83642
7520 -83642 -122432 -69174 -23951 -93429 -4446 73573 175588 181798 115534 98406 116893 179875
7508 179875 127521 -427 3038 32242 -50780 -99662 40746 157107 103261 55816 79587
7497 79587 37050 7717 -53427 -93930 -119919 -170379 -105331 -35492 -12338 68758 29209 6222
7485 6222 -3402 62971 39725 -71449 -141729 -115728 -85296 -107282 -51728 -57541 -56114 -101455
7473 -101455 -122713 -52060 -95332 -151996 -127690 -76168 -66386 -148772 -236400 -241056 -146464 -55638
7461 -55638 -17899 -18136 -44763 -76128 -74526 -74428 -85922 -84150 -136314 -162759 -138000 -106222 -62259
7448 -62259 57058 51443 -43816 -93727 -120940 -127951 -150268 -75513 -112727 -137347 -26140 14494
7436A4494j09429k7413j7225R559O6601l4408J6546K8439K3602M125O9495m5655
7424a269k679L2543j8863K9260K9374J5187j2257o4838k3299o9611n0157m764
7412a41373K4638M8200K9232q324J9498Q0606n3361k3043q500r711l9516l2770
7400a14424P6668K0109L5258j8781l7893l4173N3852K2849K3772R388o2905L175
7388b3105j1332m5442P3421Q8551l8205j9276J7814O4219N157l1699K9583N5789
7376A65475j01363p2631n9413k806K3176K0779P0124L4243q4603m9942l409N6194
7364d176m8907M4388m9497j6346N1831M9996l1508J0362o552n6721m4950m0850
7352a42930j0847o9216J7654J6730k9465O2311J27760l6492m0390J13103L4258
$$ plain form
7436 14494 -94935 -122348 -139573 -130014 -63413 -97821 -81275 -52836 -29234 -25109 44386 -1269
7424 -1269 -3948 28595 9732 38992 68366 83553 71296 6458 -16841 -86452 -136609 -141373
7412 -141373 -116735 -68535 -39303 -47627 -28129 52477 -884 -23927 -32427 -42138 -81654 -114424
7400 -114424 -37756 -17647 17611 -1170 -39063 -73236 -19384 3465 27237 36625 -26280 -23105
7388 -23105 -34437 -79879 -6458 82093 43888 24612 42426 106645 111802 80103 109686 165475
7376 165475 64112 -8519 -67932 -70738 -47562 -26783 43341 77584 -7019 -56961 -60370 -4176
7364 -4176 -53083 -8695 -58192 -74538 -22707 27289 -4219 6143 -409 -57130 -102080 -142930
7352 -142930 -153777 -222993 -205339 -188609 -218074 -155763 -28003 -64495 -104885 8218 42476
7341D2476J4064p3667l8612J7592p1063l9808q441r720l7521j1206M8987j2067
7329a78986m217l0902J36954R4511K7451j17993r0346P2392K2684n2015M0518
7318g9949J36757k7829J194R811q0150n5283j1506N4126K3121k266l9836p3748
7306a45558K5592P4822M8976j8682L7785J1808m2181M154k1644k7559J6245J47619
7294A11377J7964o3609K5432l0143n3100p5812K0247N323L5839l6971k8208M9459
7282b2202k5055n5094K7071J0821p7049m5171M8205L3283Q1932K4040p7567j0480
7270h7266J9231j7940j9196r7760P2221J1040P5042J3561k3582K5001k7298j23535
7258a80481p4502N7042J05755J32520K4806o2134l1137M2916l6897R835Q1130
$$ plain form
7341 42476 56540 -17127 -55739 -38147 -109210 -149018 -157459 -167179 -204700 -215906 -166919 -178986
7329 -178986 -183203 -214105 -77151 17360 44811 -73182 -163528 -91136 -68452 -120467 -79949
7318 -79949 56808 28979 30173 39984 -40166 -95449 -106955 -52829 -29708 -31974 -71810 -145558
7306 -145558 -119966 -45144 3832 -14850 22935 34743 -7438 -3284 -24928 -52487 -36242 111377
7294 111377 129341 65732 91164 61021 7921 -67891 -47644 -42321 -6482 -43453 -71661 -22202
7282 -22202 -47257 -102351 -75280 -64459 -141508 -186679 -138474 -105191 -23259 781 -76786 -87266
7270 -87266 -68035 -85975 -105171 -202931 -130710 -119670 -44628 -31067 -54649 -29648 -56946 -180481
7258 -180481 -254983 -197941 -92186 40334 65140 3006 -28131 14785 -22112 -12277 68853
7247F8853j8602q9663J3135j55689k9157J72092R6676J1279k4057l9563o8954
7236f3650r3906N309M9534m0955k1366m6717L6496Q8775P1837l2788l730n4850
7224a06011O782R7011M4349M3569l4895r7819N8414m4021m2850K86Q9794j3084
7212A525l9376n2422q4951k9789N0858k656L3453J02080N0514m8013j51986J5683
7200a55080J20175L9044J5375k6785N271M3041k3512N5026Q2468l2703j69832
7189d7512P3622k2018l7895L6729M9091o1553k1605k4219N1197K0381l6046m6698
7177f6526K7015n040j7141K4279K4793K6148l9070j13303o0940n215P3065p1344
7165b03279L7082M5761K3669J10281j480q1934K6852L6463k9403j2244k3441P8677
$$ plain form
7247 68853 50251 -39412 -26277 -181966 -211123 -39031 57645 68924 44867 5304 -63650
7236 -63650 -157556 -152247 -102713 -143668 -165034 -211751 -175255 -86480 -14643 -47431 -51161 -106011
7224 -106011 -99229 -2218 42131 85700 50805 -47014 11400 -32621 -75471 -75185 14609 1525
7212 1525 -37851 -90273 -175224 -205013 -154155 -156811 -123358 -21278 29236 -18777 -170763 -155080
7200 -155080 -34905 4139 19514 -7271 -2000 41041 17529 72555 155023 122320 -47512
7189 -47512 26110 4092 -33803 2926 52017 -9536 -31141 -55360 -4163 16218 -19828 -66526
7177 -66526 -39511 -44551 -61692 -37413 -12620 13528 -25542 -138845 -199785 -205000 -131935 -203279
7165 -203279 -166197 -120436 -96767 13514 12034 -69900 -43048 -6585 -35988 -48232 -71673 7004
7153G004P707o5264r2247j9763Q1225P5365k7602r0586P1319M6192o8451l9530
7141a14631P1477l7503p739j250J6421m6338k7253Q755K0217M1694k3942J8578
7129h1514L7815n0367n3712L604R7452O833q5776M9689L6375n0103M0061o0101
7117a09744k6597J19134j4461L490n0209K831M8100P4313k4640o1019p0044J3165
7105i5681l915M6185O3249p1811m7268J0192L7315M7900N1008j2902k395n2283
7093c0406m3709k6531k8845K1743m4690O0527L8551l0852L2777p810J1216o4215
7081a12244l6323J9065N9290R7037J6835k1341j1300Q579N2300K3629o9235l1854
7069e562O3570k0961q5741n0200L7834N9980P1350n9563O527R21J8336L584o9901
$$ plain form
7153 7004 14711 -50553 -142800 -162563 -81338 -5973 -33575 -124161 -52842 -6650 -75101 -114631
7141 -114631 -43154 -80657 -88396 -89646 -73225 -119563 -146816 -138061 -117844 -76150 -100092 -81514
7129 -81514 -43699 -94066 -147778 -144174 -46722 -39889 -125665 -75976 -39601 -89704 -49643 -109744
7117 -109744 -136341 -17207 -31668 -28178 -78387 -75556 -27456 46857 22217 -38802 -108846 -95681
7105 -95681 -99596 -53411 9838 -61973 -109241 -99049 -61734 -13834 37174 24272 21877 -30406
7093 -30406 -74115 -100646 -129491 -107748 -152438 -91911 -53360 -84212 -51435 -59245 -48029 -112244
7081 -112244 -148567 -129502 -70212 26825 43660 22319 11019 19598 71898 95527 26292 -5562
7069 -5562 58008 37047 -48694 -98894 -61060 -1080 70270 10707 17234 18155 36491 40075 -29826
7056b9826L0111R896p5577m3547M7033O7873L4915J6033p012l2748N068P0323
7044I2542N1427K1368J0369q5368p2917K8167M4536L0435j6043p6211n7672J8080
7032a1287l6885o7064N3052M6237J43304J5478r0123o0421o8388j6965l6413L9456
7020i0019M9005q694o4746m2181o1811k5702L4813J14665j5755m0962L5670J6256
7008i9461k7487j8404o3988k8351K9479J18249J2038q158O086m338L6733k2j50500
6995a98124j1434J65173R5914o3451p2972j6200J27291J44676K0218j54443j37734
6984a01086K0586p628R8892Q2933j04860m7207J2554m3952J4667O5835K5101K977
6972A8812l5369L0739O8589j0766k9480n4006j4n65j8924M1492O8635r893l9339
$$ plain form
7056 -29826 285 10181 -65396 -108943 -61910 5963 40878 56911 49899 17151 22219 92542
7044 92542 143969 165337 175706 90338 17421 45588 90124 120559 104516 28305 -29367 -11287
7032 -11287 -48172 -115236 -62184 -15947 127357 142835 52712 -7709 -76097 -93062 -129475 -90019
7020 -90019 -41014 -49708 -114454 -156635 -218446 -244148 -209335 -94670 -110425 -151387 -115717 -99461
7008 -99461 -126948 -145352 -209340 -237691 -208212 -89963 -77925 -86083 -79997 -84335 -47602 -47624 -198124
6995 -198124 -209558 -44385 51529 -11922 -84894 -101094 26197 170873 191091 36648 -101086
6984 -101086 -80500 -88128 10764 93697 -11163 -58370 -45816 -89768 -75101 -9266 15835 18812
6972 18812 -16557 14182 82771 72005 42525 -11481 -11495 -12060 -30984 10508 79143 69250 29911
6959B9911p3047m2992L4328J3168n3872J1361L3570J6780o334N4444o6030j08229
6947a56942M0789j364k8137k986L5390k6322L22Q811J3747M6011J07149M8759
6935H5227M768r6243o8549K0652n3664q8092J8365O6925P9139k5607L2462P951
6923a6666N3913N5516M872n7417r1212P8426J3111m5710l6008J2678M7704J1560
6911C0767J0960j26022m1947J00574L9984k4155K943m0270n2552l5999K2908M8337
6899f4472Q1351L4965j10168L520k4778m9735n1351P3568K9493O6144o612J5229
6887b846M7254J9504o8397L3100k6457o9766j5339J7722M0148j8456j4192o5848
6875a23573O0779Q6546L9570l7243n1151M4605K3386P3934M979n2182l1584l4810
$$ plain form
6959 29911 -43136 -86128 -51800 -38632 -92504 -81143 -47573 -30793 -37127 17317 -48713 -156942
6947 -156942 -116153 -117517 -145654 -148640 -113250 -139572 -139250 -130439 -116692 -70681 36468 85227
6935 85227 89995 -6248 -74797 -54145 -107809 -195901 -177536 -110611 -31472 -57079 -24617 -16666
6923 -16666 37247 92763 97635 40218 -50994 27432 40543 -5167 -41175 -28497 19207 30767
6911 30767 41727 -84295 -126242 -25668 14316 -9839 -6896 -47166 -99718 -135717 -112809 -64472
6899 -64472 16879 51844 -58324 -54804 -79582 -129317 -180668 -107100 -77607 -11463 -18075 -2846
6887 -2846 44408 63912 -4485 28615 2158 -67608 -82947 -65225 -25077 -43533 -57725 -123573
6875 -123573 -62794 23752 63322 26079 -25072 19533 42919 116853 121832 69650 38066 3256
6863C256r798l6856n6824P7098O871l6893m0381j1648J7244M3227K8736o2705
6851g8673n0311R7492J5554p1012K5849K5702K1852j6528n144r272L7958k7188
6839c3721l8943j73697M4951J10645N8575m8025o7448J01292Q232J5005L889o6223
6827h5468l3980M1750O1390M7387K7336m4915n7505o6365M1605J1341M7951J3481
6815D008K1953m3050n6849q7320o508N2168J07290q323p2821L4510p8582L1900
6803a01624J3416J2347p164L1679P4704O0746m0867L7331p5275q7370p6787J33309
6791b5555M9807K951L298p8617n3069p8039O1596K3033j292o4848N5755P7415
6779b7565k7252k1443P6112K3037j144n4880o4176m8545Q2209R9915N853m9092
$$ plain form
6863 3256 -6542 -43398 -100222 -23124 -16253 -53146 -93527 -105175 -87931 -44704 -15968 -78673
6851 -78673 -128984 -31492 -15938 -86950 -61101 -35399 -13547 -30075 -35219 -44491 -6533 -33721
6839 -33721 -72664 -246361 -201410 -90765 -32190 -80215 -147663 -46371 -38139 -23134 -19245 -85468
6827 -85468 -119448 -77698 -16308 31079 58415 13500 -44005 -110370 -68765 -57424 -9473 4008
6815 4008 25961 -17089 -73938 -161258 -167766 -115598 -8308 -16631 -89452 -54942 -133524 -101624
6803 -101624 -88208 -75861 -83025 -51346 23358 84104 43237 80568 5293 -82077 -158864 -25555
6791 -25555 24252 27203 30501 -48116 -101185 -179224 -117628 -94595 -95887 -160735 -104980 -27565
6779 -27565 -54817 -76260 -148 22889 21745 -33135 -97311 -145856 -63647 36268 42121 -6971
6767f971l8265m8761l6534N4642j0034n0611L0635L2031J13080o0660q5707m9623
6755a56778J3644J10910N5014J8370J1829N2475N0894j09541p9385l5306K112
6744f5762N9628J09412k7659n1532o8781r5388o3099P0892N6266P0778k9431l1398
6732f6074o1468Q56l4535K7279N3301M6166P9303M855Q001J8361r2909l0015L7552
6719i327K8033M886N2261N2653r4272j00568n5036L4416k2912O2130N2857k9837
6707b4716p2122k8281K7435o321K0332N0750j1925j17439J1980N9116J6102L6733
6695c8356J6686P1146p451j15072k8099j5660O3453k0176k0269Q504O0662l908
6683b8540L4343l51r992j23600o3364o9276Q055P2191J06086J73458J0125k5858
$$ plain form
6767 -6971 -45236 -93997 -130531 -75889 -85923 -136534 -105899 -73868 39212 -21448 -107155 -156778
6755 -156778 -143134 -32224 22790 41160 52989 105464 156358 46817 -32568 -67874 -65762
6744 -65762 -6134 103278 75619 24087 -44694 -140082 -203181 -132289 -76023 -5245 -34676 -66074
6732 -66074 -127542 -126686 -161221 -133942 -80641 -34475 44828 49683 57684 76045 -16864 -46879 -9327
6719 -9327 18706 23592 75853 128506 34234 -66334 -121370 -86954 -109866 -47736 5121 -24716
6707 -24716 -96838 -125119 -97684 -104005 -83673 -32923 -44848 -162287 -150307 -91191 -75089 -38356
6695 -38356 -21670 49476 42025 -73047 -101146 -116806 -53353 -73529 -93798 -85294 -24632 -28540
6683 -28540 5803 5452 -4540 -128140 -191504 -260780 -252725 -180534 -74448 99010 109135 83277
6671H3277L956r694n6022K1344j0548o861J5959O3057m2076o5213k2096q3652
6659a08569K8384K2183j5827K4322L3321L7256m6099M731Q4599j7758M2014J7284
6647A05841j03286n7548j286k1184L1554K1942M5579m334r9999j8295J01794q845
6635h067j14633o0817J00667L9607k5982j6333N0755O055O0992L057k4822k4378
6623a3899L5791K7687n063O730k2663k9297L7087M2115o8795j6381M3776p5179
6611c8091q0850R8819Q9427p4277r2704n9293O0920O8706K5971Q97m4787K7521
6599a7741J9815M5967j1532K5736Q000m0681k9687o3648M5530L3277l9779n0302
6587g5045k2585k8828j7729j8989M9980K6212P8031r1873l3453J8022M5154q42
$$ plain form
6671 83277 87233 77539 21517 42861 32313 25452 41411 104468 62392 -2821 -24917 -108569
6659 -108569 -80185 -58002 -73829 -49507 -16186 21070 -25029 -20298 64301 46543 88557 105841
6647 105841 2555 -54993 -56279 -77463 -45909 -23967 21612 17278 -82721 -101016 778 -8067
6635 -8067 -122700 -183517 -82850 -43243 -69225 -85558 -34803 -28748 32244 35301 10479 -13899
6623 -13899 21892 49579 44516 51246 28583 -714 36373 78488 9693 -6688 37088 -38091
6611 -38091 -118941 -20122 69305 -4972 -97676 -156969 -96049 -27343 -1372 -475 -45262 -17741
6599 -17741 2074 48041 36509 62245 70245 29564 -123 -63771 -18241 15036 -24743 -75045
6587 -75045 -97630 -126458 -144187 -163176 -113196 -86984 -8953 -100826 -134279 -116257 -71103 -71945
6575g1945j5772J1317o8452m7259P6280P8702n1020K8717J8353P9319n928K6771
6563E9083k9286q4484q9521J5304o419l9737j7535J15496O0417O8982n9018j5895
6551b2613k4645p0990k6172j659k4459M3723O6532k4755j4802J7997J3076j0117
6539g8884l4802K7394Q8491N4517N359J5242j9643l8820r079n3642m8055K0969
6527g0953O3583m007k2849k8013K4275l7795Q713J24933J3362n2318m0797j3695
6515c5561l3147k8194M7536k6782m2881q6502O1199J13582l0968l3684N006o8946
6503a59342Q6729Q2901m2157m1271j18486M3439J22278M5410k9024q1714L1849
6492e9388L6569l167j8796N1122k2765Q498m7227j27379O482L2497N6863O1674
$$ plain form
6575 -71945 -87717 -76400 -144852 -192111 -115831 -37129 -88149 -59432 -41079 38240 32312 59083
6563 59083 29797 -54687 -144208 -128904 -135323 -175060 -192595 -77099 -16682 52300 -6718 -22613
6551 -22613 -47258 -118248 -144420 -146079 -170538 -126815 -60283 -85038 -99840 -81843 -68767 -78884
6539 -78884 -113686 -86292 2199 56716 62075 77317 57674 18854 9775 -43867 -91922 -70953
6527 -70953 -7370 -11377 -34226 -62239 -37964 -75759 -67046 57887 71249 18931 -21866 -35561
6515 -35561 -68708 -96902 -49366 -76148 -119029 -205531 -144332 -30750 -61718 -95402 -90396 -159342
6503 -159342 -72613 10288 -31869 -73140 -191626 -148187 -25909 19501 -9523 -91237 -59388
6492 -59388 -22819 -25986 -44782 6340 -16425 -7927 -55154 -182533 -176051 -143554 -86691 -25017
6480b5017L9302n9061o4673M9247O4264j6497N9896o5857o5230l4849L0506O291
6468h1678m6915L888L4136O5271l6529L8087Q8989J1481j04943k6285N860r587
6456e8225M2895N3959K3130l541q0351j3431l695J238M5584j7568k9337l15k4938
6443f4595k9892k004O0877J1566K4214K8122P8493O4539j6808o8098N613j1917
6431H0110o802l9928j6701m2559Q246J0091k4941j7757n2829n6915O9373J08741
6419A8129Q1061j1462j62460J8565N1529L1590L7963J8868m3056j00215j8376
6408g7864J7421L3117m9579k2421M1481N1002l8037P2491l6913k7321J1468o6915
6396i2070j1340l0089Q990P9470p536q9607K9600j9672k8195K5576O0093M1093
$$ plain form
6480 -25017 14285 -44776 -109449 -60202 4062 -12435 47461 -18396 -83626 -118475 -87969 -81678
6468 -81678 -128593 -124705 -90569 -25298 -61827 -23740 65249 76730 -28213 -54498 -48638 -58225
6456 -58225 -15330 38629 61759 58218 -22133 -35564 -39259 -38021 7563 -10005 -39342 -39657 -64595
6443 -64595 -94487 -96491 -35614 -24048 166 28288 106781 171320 154512 86414 92027 80110
6431 80110 73308 33380 16679 -25880 -17634 -7543 -32484 -50241 -103070 -159985 -90612 18129
6419 18129 99190 87728 -74732 -56167 -4638 26952 64915 83783 40727 -59488 -77864
6408 -77864 -60443 -27326 -76905 -99326 -57845 -6843 -44880 27611 -9302 -36623 -25155 -92070
6396 -92070 -103410 -133499 -124509 -45039 -52575 -142182 -112582 -132254 -160449 -134873 -74780 -33687
6384c3687o4131k5726o7458n4965k3087K938J38102M5886m5701J6352J4254k1312
6372a18535l7598K094k4255M2042J4768R7334R2235L0065L2834o2440p0229k1659
6360b3344l6117K0709k0244R096J10745O2530l6933j08925o7641K2460J9337P3038
6348B4711Q7229j8963n6904j5839j7948n9775j21332K3077k606K155N211R956
6336a41028k0977P2274K1087l7109q3996l565J9700M8046J9014k6013R863M5026
6324g7678P4592Q754k728j7041o4876l4166k3217l181M7866K2331M8311M549L4497
6311A8013l1445j13184J1473O1850l478l6864J0427K3062j0739R9261K7348O542
6299F2266p207Q611p1194N119O6097L1087n2836m1685L5493L1821p9255J1571
$$ plain form
6384 -33687 -97818 -123544 -191002 -245967 -269054 -266116 -128014 -82128 -127829 -111477 -97223 -118535
6372 -118535 -156133 -154039 -178294 -136252 -121484 -24150 68085 98150 130984 68544 -1685 -23344
6360 -23344 -59461 -38752 -58996 -49900 60845 123375 86442 -22483 -90124 -67664 -48327 24711
6348 24711 111940 92977 36073 20234 2286 -57489 -178821 -155744 -158350 -156195 -150984 -141028
6336 -141028 -162005 -89731 -68644 -105753 -189749 -193314 -173614 -125568 -106554 -132567 -122704 -77678
6324 -77678 -3086 5668 2940 -14101 -78977 -113143 -136360 -139541 -91675 -69344 -21033 -16484 18013
6311 18013 -13432 -126616 -115143 -53293 -56771 -93635 -83208 -60146 -70885 28376 55724 62266
6299 62266 55059 63670 -7524 -2405 63692 94779 41943 258 35751 67572 -11683 -112
6287a12r8040M1958M7520m6514Q725J469l4049J31L1056K6510k0259m6919O0594
6274b7930P4030n144j3277N4348o2822j30784P288J93002Q3296L3625j49607L2976
6262H9001J5485n0349o3752m7408K2245M6998J4586K295l219o593m5082l248Q1196
6249E2155Q9347p9747j06011J3255M5293O7712j3320J5452o5252K117p5040l8478
6237i2517K4651k2998j1921P7067L9255O1438Q0346j1211n1097o3803J2019K3783
6225F5012r4641k3815O9447O1969N6158k2766l0107o4135o2174P9274M5702o6593
6213A3331q5967J5934O7903j8778r5365j02744P761K8812K2996J2129M1994K3072
6201f8922L1500l8511P093L4661O6182N7503O970n8988j25773j712K6563O8098
$$ plain form
6287 -112 -98152 -56194 -8674 -55188 -46463 -44994 -79043 -78912 -47856 -21346 -41605 -88524 -27930
6274 -27930 46100 40956 27679 82027 19205 -111579 -104291 88711 172007 205632 56025 89001
6262 89001 104486 54137 -9615 -57023 -34778 12220 26806 29101 25882 19289 -25793 -29041 52155
6249 52155 141502 61755 -44256 -31001 14292 82004 68684 84136 18884 21001 -54039 -92517
6237 -92517 -67866 -90864 -102785 -25718 13537 74975 155321 144110 93013 29210 41229 65012
6225 65012 -29629 -53444 16003 77972 134130 111364 81257 17122 -45052 34222 79924 13331
6213 13331 -72636 -56702 11201 -7577 -102942 -205686 -197925 -169113 -146117 -133988 -91994 -68922
6201 -68922 -37422 -75933 -68840 -34179 32003 89506 96476 37488 -88285 -89997 -63434 4664
6189D664l5567P960N6182j04609k0573p9659j4309r513L7104R0433k5136m2156
6177a35179j8444K8739L9161k4568J0110N6203L6860k2663J8156M2773N216n2355
6165a5991R773R59r5135J5159P0242L3326q3150k2013J6292j6402j7193M3677
6153f0456k7770J0676P467q9608p4445k2451Q3268O2515P0425j6405P1570r349
6141E437M564o9547p7833j1754J4942N6202J44505k1171j30863m2172m3103o3556
6129b34349N7014j1138m0416R8554O4759O3878k919n8472M574O2956M453p2724
6117f3830J8429K5467M9563J4191j01804l7605n713J4220j5347R933K8378k3623
6105h7741J0231N0514N9450J9777L2363K3594l1241J3017M0397N7998p3584R439
$$ plain form
6189 4664 -30903 -22943 33239 -71370 -91943 -171602 -185911 -195424 -158320 -67887 -93023 -135179
6177 -135179 -153623 -124884 -85723 -110291 -100181 -43978 -7118 -29781 -11625 31148 36364 -15991
6165 -15991 -6218 -5259 -100394 -85235 -14993 18333 -64817 -86830 -70538 -86940 -104133 -60456
6153 -60456 -88226 -77550 -70083 -159691 -234136 -256587 -173319 -110804 -40379 -56784 14786 5437
6141 5437 10001 -59546 -137379 -149133 -134191 -77989 66516 45345 -85518 -127690 -170793 -234349
6129 -234349 -177335 -188473 -228889 -130335 -65576 -1698 -4617 -63089 -58515 4441 8894 -63830
6117 -63830 -45401 -19934 29629 43820 -57984 -95589 -101302 -87082 -102429 -92496 -64118 -87741
6105 -87741 -77510 -26996 32454 52231 84594 108188 76947 89964 130361 188359 114775 124214
6093A24214m6694j9973J0376k5044n7612J8558M2211r528j3755K2015k7080N1302
6081F8990l2523l0196K7845M3894p3736l5603L3345O0339J3115L3050R376k3610
6069I4286k2344P057j0538p5455K427p3315n0021N6545J2656o3909K3459R3775
6057e377p851n6335k4490Q7103L6905m2430k2351K2769K4037L8663m2526o7989
6045e9872j13942K7895P1664M5391j2539k7067l7890M4432Q9876Q1349M47p4307
6033C5437j4348l2885o2394o1054p572k3105j5543K601O9581R0028L2034l9301
6021b6521l5152M7303J4882j12850L528L5835k327k1665N8276q653j6615L3161
6009c0798N2482K8933J158k1236j01348o2421R226R5008R6060M4803K785J4777
$$ plain form
6093 124214 77520 57547 67923 42879 -14733 3825 46036 36508 22753 44768 17688 68990
6081 68990 36467 6271 34116 78010 4274 -31329 2016 62355 75470 108520 117896 94286
6069 94286 71942 78999 68461 -6994 -4567 -77882 -127903 -71358 -58702 -122611 -99152 -5377
6057 -5377 -13228 -69563 -94053 -6950 29955 -12475 -34826 -12057 11980 50643 8117 -59872
6045 -59872 -173814 -145919 -74255 -28864 -41403 -68470 -106360 -61928 27948 109297 109744 35437
6033 35437 21089 -11796 -74190 -135244 -142816 -165921 -181464 -178863 -109282 -19254 12780 -26521
6021 -26521 -61673 -14370 512 -112338 -108810 -72975 -75302 -96967 -38691 -47344 -63959 -30798
6009 -30798 21684 50617 51775 30539 -70809 -133230 -124004 -28996 67064 111867 114652 129429
5997A29429l1853j9969R663L3576O4425m0367p3683p8810k1730j1710K6181L6591
5985B1743K3571J3221j264j00965m8160N309l9755o0843M4604L4381N0604M2340
5973a5214L2138J27477j1701j33723l8659n5022P426N1700k2856K2139p544o1274
5961a05113L5905M7415k6385L3759N439J11k2400Q30J5308n3219R015R4741J5812
5948E1218j04942m627l6230k0423m1591N8001N7346j9885K2985R792N0734l8851
5936a6473M5410L2245q6660l7191K8700M3469n8592K7013r6878l6959N7858k138
5924a00196o9107l8564K8946p074M3004R1164n6746n6848M4150J4403L2535Q8863
5912A4530j2407J735n5982N2886M867j18796l9554M4010J35343P2404M171l6501
$$ plain form
5997 129429 97576 77607 87270 120846 185271 144904 71221 -7589 -29319 -41029 -14848 21743
5985 21743 45314 58535 57271 -43694 -91854 -86545 -126300 -187143 -142539 -108158 -57554 -15214
5973 -15214 16924 144401 132700 -1023 -39682 -94704 -87278 -35578 -58434 -36295 -43839 -105113
5961 -105113 -69208 -21793 -48178 -14419 -8980 -8869 -31269 -30439 -15131 -68350 -59335 35406 51218
5948 51218 -53724 -58351 -94581 -115004 -156595 -98594 -41248 -61133 -38148 -28356 22378 -16473
5936 -16473 28937 61182 -25478 -62669 -33969 9500 -49092 -22079 -118957 -155916 -98058 -100196
5924 -100196 -169303 -207867 -178921 -185995 -142991 -51827 -108573 -165421 -121271 -106868 -74333 14530
5912 14530 2123 3858 -52124 762 5629 -113167 -152721 -108711 26632 99036 103207 66706
5900F6706J7526o4529j03803m4024L1107N0734J28929J9801l9279n2563j8254
5889g649j6672M3291L8090o9386q915j6467m9703K7363N6195J1696M2745M904
5877E5492q6707K605k5587L2561L1400J0445j1649M3974j0854l8816K6858Q0773
5865A10495m6749n3538l602j3615P1166J893r171p6869K1776N3492q2546J493
5853b5775j6571L2605j6561m9255J2234K8388K3425q805p8363n073R5625K8831
5841B0705q740m5218n5271P353J5624k1570j2892K990k5818J1438N5831K524L8577
5828a4467L2355k9669n4346K1866M3746N1875N7035l9178l6594j1747r7268l5295
5816a11687P0020K4865j1402k5583r7128r384Q8533N1061O2350n5657J3697p408
$$ plain form
5900 66706 84232 19703 -84100 -128124 -97017 -46283 82646 102447 63168 10605 -7649
5889 -7649 -24321 18970 57060 -12326 -21241 -37708 -87411 -60048 -3853 7843 50588 55492
5877 55492 -31215 -28610 -54197 -21636 9764 20209 8560 52534 41680 2864 29722 110495
5865 110495 63746 10208 6606 -7009 64157 66050 56879 -19990 1786 55278 -27268 -25775
5853 -25775 -42346 -9741 -26302 -75557 -63323 -34935 -11510 -20315 -98678 -103751 -8126 20705
5841 20705 11965 -33253 -88524 -81171 -65547 -87117 -100009 -97019 -122837 -111399 -55568 -53044 -14467
5828 -14467 17888 -11781 -66127 -44261 -515 51360 108395 69217 32623 20876 -76392 -111687
5816 -111687 -41667 -16802 -28204 -53787 -150915 -160299 -71766 -20705 41645 -14012 -315 -7723
5804g723o9617L8621K2523O8141q7525j1459L0982m5776K6137J8735p2531O2997
5792b6495P3739q2364p9045M8228l1472k8895k0106J23739P3926k7472j01046
5781g7263o7011J17628j918o6833K7013l1186p764r9128k8095P3781R7301K7729
5769c5746K3066J17530j9842m0925O6713L5115p1166m5914n3561o4134N5572n818
5757c9110p0275n6577J74N2782l2789k0696J8547P0838K4328j5805j2735m6918
5745a28236l7696P7653j8878J914Q2755P4089K7715n7483o3947r0066J2048J30125
5733I993j9415n7498J9464M560L4436J11816q02j35639k8171l8124Q2178J40690
5721A23488Q6534q5114j12104o6738l7985L6964J4457P498K7650n8433k3612O681
$$ plain form
5804 -7723 -77340 -38719 -16196 51945 -35580 -47039 -16057 -61833 -35696 -16961 -89492 -26495
5792 -26495 47244 -35120 -114165 -65937 -97409 -126304 -146410 -22671 51255 23783 -77263
5781 -77263 -144274 -26646 -28564 -95397 -68384 -99570 -107334 -206462 -234557 -160776 -63475 -35746
5769 -35746 -12680 104850 85008 44083 110796 145911 74745 28831 -24730 -88864 -33292 -39110
5757 -39110 -109385 -165962 -165788 -113006 -145795 -166491 -147944 -77106 -52778 -68583 -81318 -128236
5745 -128236 -165932 -88279 -107157 -105243 -22488 51601 79316 21833 -42114 -132180 -120132 9993
5733 9993 -9422 -66920 -47456 -42896 -8460 103356 102554 -33085 -61256 -99380 -17202 123488
5721 123488 210022 124908 12804 -53934 -91919 -54955 -40498 -33000 -5350 -63783 -87395 -80714
5709h0714l5790k4730p335N430P4242r444O170P217j5902k1120k8499o5100P6167
5696a19408N8266L8822O901l6589l6198n0915M1309L8647N0902P2488K946o1258
5684E913o7756J09474M5593N31n4645k0212M0721N8502K9250J5787m4153k2754
5672I6251p417j8460K753K5338k3278j1678J395r5240k5512Q9163P4939M761o2081
5659E0934r5808k4814K467j2358N3443k0251k0543O6948R3942m3120p7076J243
5647b4993j9930J10012j8450l5587J7651K4045P1730o0349q1226K8346p903m0292
5635c6946m0611K3246J7956N7167o583k7499p91Q5387k7946l7920J1440K7040
5623D3940J3824K4174j0606p7552l1972N8069k2771Q5216n1430l8419K7812o4708
$$ plain form
5709 -80714 -116504 -141234 -148569 -143139 -68897 -78341 -72171 -64954 -80856 -101976 -130475 -195575 -119408
5696 -119408 -61142 -22320 -15419 -52008 -88206 -139121 -97812 -59165 -8263 64225 67171 5913
5684 5913 -61843 47631 93224 93755 39110 18898 59619 118121 147371 163158 119005 96251
5672 96251 88834 70374 73127 98465 75187 63509 64904 -30336 -55848 33315 108254 113015 50934
5659 50934 -44874 -69688 -67221 -79579 -26136 -46387 -66930 18 93960 50840 -26236 -24993
5647 -24993 -44923 65089 46639 11052 28703 52748 124478 64129 -17097 11249 3346 -36946
5635 -36946 -77557 -54311 -36355 20812 14229 -13270 -14061 71326 43380 5460 16900 43940
5623 43940 57764 81938 71332 -6220 -38192 19877 -2894 82322 30892 -7527 20285 -44423
5611d4423K0184N7884o1447j56251q7307O5377R6891K3798M5383J8611n5217j7144
5599i3661M8023L2811K5126M4014o1882J3045R307K7971J3892q242Q41m9042l0209
5586b8006K1141P7970m4652o1516n0011j1641m8366k3444J29995M1600N3099K146
5574E8315r679o8972P040p887k5119l319M8680M1309J9910l2071O4802L3809l6081
5561I0737m4589r632k9343K9043j0824k7636m20m9224O7566K9192M2207o2625
5549B4452o5598p1958J14233m5504j07508J01837J01741l544p7844j6728m6340
5538i2761M586P1848L6693L8032o993P006L5673j753l8099m7655k2054p173o592
5525b9242l6879l3416J6977Q7243k8382l0148k2030J0060m659N7395N1254J7877
$$ plain form
5611 -44423 -24239 33645 -27802 -184053 -271360 -205983 -109092 -85294 -39911 -21300 -76517 -93661
5599 -93661 -45638 -12827 12299 56313 -5569 7476 16783 44754 58646 50404 51245 2203 -28006
5586 -28006 -6865 71105 26453 -35063 -85074 -96715 -145081 -168525 -38530 3070 56169 58315
5574 58315 48636 -20336 -13296 -21183 -46302 -49621 -941 40368 60278 28207 93009 126818 90737
5561 90737 46148 36516 7173 36216 25392 -2244 -2664 -51888 15678 44870 87077 24452
5549 24452 -41146 -113104 1129 -44375 -151883 -50046 51695 48151 -29693 -46421 -92761
5538 -92761 -88175 -16327 20366 58398 51405 58411 94084 92331 54232 6577 -15477 -22650 -29242
5525 -29242 -66121 -99537 -82560 4683 -23699 -53847 -75877 -65817 -70476 -13081 38173 56050
5513E6050j10449k4119O9744L9774q0347k1305P2690J6273l7523l5664o346m0269
5501a01491k0558Q7955K3049j02193m73R9300O7351m1417q4291m5239J7523l9626
5489a40110l6411K1557l0123K7762O5632m537j5637O0343J06415j53p1649p2748
5477h9659p9O471k1699p449k0796N2416o447k9373m50l6145L6439K1436Q4737
5464a0598N6307l5178l8152L825J8830R817k1881M6495Q556k5375l3713j1491
5452c2558n6420L9915k2967l9955j7103N2563N6410Q29N569M1584O631q8655k9217
5439h3374k4066Q5617Q3679J6368J1680k9363R81L4544l4098P754K1670o4771
5427B6621j14049m5993M4668K1783k4006K5133J8460R191j1529k6670R9159K4920
$$ plain form
5513 56050 -54399 -78518 -8774 31000 -49347 -70652 2038 18311 -19212 -54876 -61222 -101491
5501 -101491 -122049 -34094 -11045 -113238 -113711 -14411 52940 11523 -72768 -118007 -100484 -140110
5489 -140110 -176521 -154964 -185087 -157325 -91693 -96230 -111867 -51524 54891 54738 -16911 -89659
5477 -89659 -89738 -83267 -104966 -112415 -133211 -80795 -87242 -116615 -117065 -153210 -116771 -95335 -10598
5464 -10598 45709 10531 -27621 -23796 -4966 4851 -17030 29465 38021 12646 -21067 -32558
5452 -32558 -88978 -49063 -72030 -111985 -129088 -76525 -20115 -19286 -13717 27867 34498 -54157 -83374
5439 -83374 -107440 -21823 61856 78224 89904 60541 61522 96066 61968 69722 91392 26621
5427 26621 -87428 -133421 -88753 -66970 -90976 -65843 -47383 -38192 -49721 -76391 22768 47688
5415D7688O0322N7801q9537p1079n5267J6391L3031k3997l8162L1178L6461Q6427
5403I1257k1564r8466K8020R2176K834j08282L5040J26716j56q7654j3032M6175
5391I3064k4044J1878n0365L8779J0310L8227l3104k3713J2323K2789j8382j5352
5379F2410m3604n2393r4882L2587n9732q756O4335m6610J2315O7378q358m6317
5367a21627l520R703J9548J0760l1746L706k6920J9023K7815l238N8617n677R1537
5354D7981q4968o2578j1023m1210J3509N9453J9308N9461J3461n8058O1507P6059
5342I2902j08227J3918L4584j9396n9992m2941K1442m4339l2735k5123k2130P4928
5330a17109L0153o3077L5128O6796m4789P7576J07550O945o1678P3070l0061p5413
$$ plain form
5415 47688 108010 165811 76274 5195 -50072 -33681 -650 -24647 -62809 -31631 4830 91257
5403 91257 69693 -28773 -753 91423 94257 -14025 21015 147731 147575 59921 46889 93064
5391 93064 69020 80898 30533 69312 79622 117849 84745 61032 73355 96144 77762 62410
5379 62410 18806 -33587 -128469 -95882 -155614 -164370 -100035 -146645 -134330 -66952 -75310 -121627
5367 -121627 -125147 -115444 -95896 -85136 -116882 -113176 -140096 -121073 -93258 -96496 -37879 -43556 47981
5354 47981 -36987 -99565 -110588 -151798 -138289 -78836 -59528 -67 13394 -44664 16843 92902
5342 92902 -15325 -1407 33177 13781 -46211 -89152 -67710 -112049 -144784 -169907 -192037 -117109
5330 -117109 -86956 -150033 -114905 -48109 -92898 -15322 92228 99173 37495 110565 80504 5091
5318E091m8820J5884L2027o618j2449j7815r4767J0655J37682J1081j08386p869
5306h4304N7793J0697l514L0284L814k6615Q0840m2895m2832R6432n9995o6866
5294d7161L8856r9872n7400m2915L4094J13986N1512p6501n8634j2268l7708l1426
5282b25437P9306J17926R5522M7877l9641o0074M3934L1806K3553k2745J022k3146
5270F9903p0251l0914q6441l6418P5709j1094N502o957l2090M1163Q2020M8559
5258D8691p253n9241q8308J4537L7161l2438J1986J0189K6682n5806L414P776
5246h2610k5511o5788k0669P0082N1410l3054K6196L2267m9502l2716N3343j6367
5234i2919n0219J4281Q2064L1714p845J1974j5097l6500M5304K553k8445k6564
$$ plain form
5318 5091 -43729 -27845 4182 -2436 -14885 -32700 -127467 -116812 20870 31951 -76435 -84304
5306 -84304 -26511 -15814 -19328 10956 14770 -11845 68995 26100 -16732 79700 19705 -47161
5294 -47161 -8305 -108177 -165577 -208492 -174398 -60412 -8900 -85401 -144035 -156303 -194011 -225437
5282 -225437 -146131 -28205 67317 115194 75553 15479 59413 91219 114772 92027 93049 69903
5270 69903 -348 -31262 -117703 -154121 -78412 -89506 -84004 -90961 -123051 -81888 132 48691
5258 48691 41438 -17803 -106111 -91574 -54413 -86851 -74865 -64676 -37994 -93800 -90386 -82610
5246 -82610 -108121 -173909 -194578 -124496 -73086 -106140 -79944 -47677 -97179 -129895 -76552 -92919
5234 -92919 -143138 -128857 -46793 -15079 -22924 -10950 -26047 -62547 -17243 -14690 -43135 -69699
5222f9699j0205j958J2154M7999j5605M8M1363L9320k0159n1636J3344M1350J8476
5209D4792M3580q8202r2589m909l3139M9381N7819q6489P8163O0687n5298l6202
5197f2406j4595l0721K348M3038O0346n259k9230k000K0016n6152o2522K6424
5185a10713K3039k1427j4206q0400K0711J2707O4668Q6979M9822o9377p7564j0134
5173a25895M2491J6435l1662K477j2210j6359L9856M7156r6973m3924m1064K4376
5161a95296J10984J8203k6978K9550O6142N4546J7913K1228J4928J5097J9638
5150A45955J119k6031j2618m0226j09975k0262L2847Q1110k6312p0114q5523K0977
5138a09053M7328M514k029m8833n5274L4282J45401R4245L1002M2773j08529j04798
$$ plain form
5222 -69699 -79904 -81862 -69708 -21709 -37314 -37266 4097 43417 23258 -28378 -15034 26316 44792
5209 44792 88372 170 -92419 -97328 -130467 -81086 -23267 -109756 -31593 29094 -26204 -62406
5197 -62406 -77001 -107722 -105374 -62336 -1990 -7249 -36479 -38479 -18463 -74615 -137137 -110713
5185 -110713 -87674 -109101 -123307 -203707 -182996 -170289 -105621 -18642 31180 -38197 -115761 -125895
5173 -125895 -83404 -66969 -98631 -96154 -108364 -124723 -84867 -37711 -134684 -178608 -219672 -195296
5161 -195296 -84312 -66109 -93087 -63537 2605 57151 75064 96292 111220 126317 145955
5150 145955 147074 121043 108425 68199 -41776 -62038 -29191 51919 25607 -44507 -130030 -109053
5138 -109053 -61725 -57211 -59240 -108073 -163347 -129065 16336 110581 141583 184356 75827 -28971
5126b8971l8597K3110l4390J6869O1996M4902j3987k9707N3825j6517L3155J5568
5114H7256M563q0762j4513j0529p6875k3941K8845J7812L5582P4184k9589k7626
5102a5593n649j6260o8150j4631N9379N6235k2574k0895j0840p885j557k2250
5090i0670L9559O1241N8777L6890M0572j13135q2333l4946k116P2802P4708p70
5078F0579j10499l6231J18115n9297m3789m9030m861k2184m0647L5406K2300K5988
5066a04150j3307J8406L6044J3194l0195Q046L6084J3111k9786k5982k9436m619
5054a12590L2233Q615Q58K4301k6119o5486N390O2231J8675P292M7903K4438J8171
5041D5912l0607M5202j0161j74902m2271K1952M7616M9788K8044N3157p153L054
$$ plain form
5126 -28971 -67568 -44458 -78848 -61979 17 44919 30932 1225 55050 38533 71688 87256
5114 87256 91819 11057 -3456 -13985 -90860 -114801 -85956 -68144 -32562 41622 12033 -15593
5102 -15593 -21242 -37502 -105652 -120283 -60904 -4669 -27243 -48138 -58978 -66863 -68420 -90670
5090 -90670 -51111 10130 68907 105797 146369 33234 -49099 -84045 -86161 -13359 61349 60579
5078 60579 -49920 -86151 31964 -27333 -71122 -120152 -125013 -147197 -187844 -152438 -130138 -104150
5066 -104150 -117457 -99051 -63007 -49813 -80008 -71962 -35878 -22767 -52553 -78535 -107971 -112590
5054 -112590 -80357 -71742 -70884 -46583 -72702 -138188 -132798 -70567 -51892 -44600 3303 27741 45912
5041 45912 15305 60507 50346 -124556 -166827 -144875 -97259 -47471 -19427 33730 26577 29631
5029B9631j24490p6419l1127j9805m1208K9247O0484O2545m9333o0898L3242J19414
5017f8717l3701k8889J4753K3926L6699K0780O0255M4976k5185k1130L2196K2013
5005G7976l9607k7885l9952n6904M9424Q0148N3675l5741l3819n357M7095L2536
4993A01589m0777o2283O1061l1227q4921Q2817K7932k8280m5072m9309k7069p2365
4981a67904k0525M1685k2779q365K0590k8783O801J13388P3549M709L875j4514
4969A727j0255j573m8044R4457J06361Q478K1285J119l5961q5171j08354m4842
4957a00773Q4051N2687N1967k7525m3789J7594J8763o362o340K6429m9398q229
4945I075N2617p0067m1973k3470p6449j6238j2726J01155M2306l1699Q1790L8403
$$ plain form
5029 29631 -94859 -171278 -202405 -222210 -263418 -234171 -173687 -111142 -160475 -221373 -188131 -68717
5017 -68717 -102418 -131307 -116554 -92628 -55929 -35149 25106 70082 44897 23767 55963 77976
5005 77976 38369 10484 -29468 -86372 -36948 43200 96875 61134 27315 21958 69053 101589
4993 101589 60812 -1471 59590 28363 -56558 26259 54191 25911 -19161 -68470 -95539 -167904
4981 -167904 -188429 -146744 -169523 -177888 -157298 -186081 -179280 -65892 7657 12366 16241 1727
4969 1727 -8528 -10101 -58145 36312 142673 151151 172436 173555 137594 52423 -55931 -100773
4957 -100773 -16722 35965 87932 60407 16618 34212 52975 46613 40273 66702 17304 9075
4945 9075 61692 -8375 -50348 -73818 -150267 -166505 -179231 -78076 -35770 -67469 14321 52724
4933E2724q0386o3743N7109R3055o6256j19002n3599N4050M8159O1922L3770R04
$$ plain form
4933 52724 -27662 -91405 -34296 58759 -7497 -126499 -180098 -126048 -77889 -15967 17803 18707
$$ [...]
##END NTUPLES=NMR SPECTRUM
##END=
