##TITLE=Analysis number 329893
Compound Code cc 13501
Project Code adrs
Chemist Name stores
##JCAMPDX= 6.0         $$ Bruker NMR JCAMP-DX V2.0
##DATA TYPE= NMR SPECTRUM
##DATA CLASS= NTUPLES
##ORIGIN= Bruker BioSpin GmbH
##OWNER= nmr
$$ XWIN-NMR		Version 3.5
$$ Tue Oct  9 16:31:07 2007 GMT Daylight Time (UT+1h)  MAYBRIDGE\nmr@NMR_250MHZ
##.OBSERVE FREQUENCY= 250.131544655141
##.OBSERVE NUCLEUS= ^1H
##.ACQUISITION MODE= SIMULTANEOUS (DQD)
##.ACQUISITION SCHEME= undefined
##.AVERAGES= 16
##.DIGITISER RES= 18
##SPECTROMETER/DATA SYSTEM= dpx250
##.PULSE SEQUENCE= zg30
##.SOLVENT NAME= DMSO
##.SHIFT REFERENCE= (INTERNAL, DMSO, 0, 16.507)
##AUDIT TRAIL= $$ (NUMBER, WHEN, WHO, WHERE, WHAT)
$$ ##TITLE= Audit trail, XWIN-NMR		Version 3.5
$$ ##JCAMPDX= 5.01
$$ ##ORIGIN= Bruker BioSpin GmbH
$$ ##OWNER= nmr
$$ C:\u/data/dgb/nmr/ADRS/470/pdata/1/auditp.txt
$$ ##AUDIT TRAIL=  $$ (NUMBER, WHEN, WHO, WHERE, WHAT)
(   1,<2007-10-09 16:30:46.09 +100>,<MAYBRIDGE\nmr>,<NMR_250MHZ>,
      <created by zg, POWCHK disabled, PULCHK disabled
       configuration hash MD5:
       76 6E 9A 78 1E 09 19 81 EC 84 63 8F B0 6A 59 2D
       data hash MD5: 64K
       F2 EC FF C3 72 49 5C D4 26 E4 6B E7 1B 8E C2 D9>)
(   2,<2007-10-09 16:30:59.11 +100>,<MAYBRIDGE\nmr>,<NMR_250MHZ>,
      <Start of raw data processing
       ef LB = 0.3 FT_mod = 6 PKNL = 1 SI = 32K 
       data hash MD5: 32K
       3D 88 80 2E 75 D6 AA D6 0F C8 AD C0 07 C4 F0 A4>)
(   3,<2007-10-09 16:31:00.65 +100>,<MAYBRIDGE\nmr>,<NMR_250MHZ>,
      <apk 
       data hash MD5: 32K
       06 87 DA 52 3F 54 15 1A E7 29 18 0B 62 F7 46 BC>)
(   4,<2007-10-09 16:31:01.34 +100>,<MAYBRIDGE\nmr>,<NMR_250MHZ>,
      <abs ABSG = 5 
       data hash MD5: 32K
       19 EA 97 82 CA EA 07 DB 83 96 40 E7 C0 48 97 60>)
$$ ##END=
$$ 
$$ hash MD5
$$ 74 5D C6 F5 72 EF EA 1F 84 CE 42 92 3D 7A C7 59
##$RELAX= 
##$RELAX= 
##$RELAX= 
##$RELAX= 
##$RELAX= 
##$RELAX= 
##$RELAX= 
$$ Bruker specific parameters
$$ --------------------------
##$DU= <C:\u>
##$EXPNO= 470
##$NAME= <ADRS>
##$PROCNO= 1
##$TYPE= <nmr>
##$USER= <dgb>
##$AMP= (0..31)
100 100 100 100 100 100 100 100 100 100 100 100 100 100 100 100 100 100 
100 100 100 100 100 100 100 100 100 100 100 100 100 100 
##$AQSEQ= 0
##$AQ_mod= 3
##$AUNM= <au_zg>
##$AUTOPOS= <57 >
##$BF1= 250.13
##$BF2= 250.13
##$BF3= 250.13
##$BF4= 250.13
##$BF5= 500.13
##$BF6= 500.13
##$BF7= 500.13
##$BF8= 500.13
##$BYTORDA= 1
##$CFDGTYP= 0
##$CFRGTYP= 5
##$CHEMSTR= <none>
##$CNST= (0..31)
1 1 145 1 1 1 1 1 1 1 1 1 1 1 1 1 1 1 1 1 1 1 1 1 1 1 1 1 1 1 1 1 
##$CPDPRG= <>
##$CPDPRG1= <>
##$CPDPRG2= <>
##$CPDPRG3= <>
##$CPDPRG4= <mlev>
##$CPDPRG5= <mlev>
##$CPDPRG6= <mlev>
##$CPDPRG7= <mlev>
##$CPDPRG8= <mlev>
##$CPDPRGB= <>
##$CPDPRGT= <>
##$D= (0..31)
0 1 0 0 0 0 0 0 0 0.06 0 0 0 0 0 0 0.0002 0 0 0 0 0 0 0 0 0 0 0 0 0 0 
0 
##$DATE= 1191943844
##$DBL= (0..7)
120 120 120 120 120 120 120 120 
##$DBP= (0..7)
150 150 150 150 150 150 150 150 
##$DBP07= 0
##$DBPNAM0= <>
##$DBPNAM1= <>
##$DBPNAM2= <>
##$DBPNAM3= <>
$$ [...]
##$SUBNAM7= <"">
##$SUBNAM8= <"">
##$SUBNAM9= <"">
##$SW= 20.6930455092707
##$SWIBOX= (0..15)
0 0 3 0 0 0 0 0 0 0 0 0 0 0 0 0 
##$SW_h= 5175.983436853
##$TD= 65536
##$TD0= 1
##$TE= 296.16
##$TE2= 300
##$TE3= 300
##$TEG= 300
##$TL= (0..7)
0 120 120 120 120 120 120 120 
##$TP= (0..7)
150 150 150 150 150 150 150 150 
##$TP07= 0
##$TPNAME0= <>
##$TPNAME1= <>
##$TPNAME2= <>
##$TPNAME3= <>
##$TPNAME4= <>
##$TPNAME5= <>
##$TPNAME6= <>
##$TPNAME7= <>
##$TPOAL= (0..7)
0.5 0.5 0.5 0.5 0.5 0.5 0.5 0.5 
##$TPOFFS= (0..7)
0 0 0 0 0 0 0 0 
##$TUNHIN= 0
##$TUNHOUT= 0
##$TUNXOUT= 0
##$USERA1= <user>
##$USERA2= <user>
##$USERA3= <user>
##$USERA4= <user>
##$USERA5= <user>
##$V9= 5
##$VALIST= <valist>
##$VCLIST= <CCCCCCCCCCCCCCC>
##$VD= 0
##$VDLIST= <DDDDDDDDDDDDDDD>
##$VPLIST= <PPPPPPPPPPPPPPP>
##$VTLIST= <TTTTTTTTTTTTTTT>
##$WBST= 1024
##$WBSW= 4
##$XGAIN= (0..3)
0 0 0 0 
##$XL= 0
##$YL= 0
##$YMAX_a= 295934
##$YMIN_a= -369239
##$ZGOPTNS= <>
##$ZL1= 120
##$ZL2= 120
##$ZL3= 120
##$ZL4= 120
##$ABSF1= 16.50699
##$ABSF2= -4.186182
##$ABSG= 5
##$ABSL= 3
##$ALPHA= 0
##$AQORDER= 0
##$ASSFAC= 0
##$ASSFACI= 0
##$ASSFACX= 0
##$ASSWID= 0
##$AUNMP= <proc_1d>
##$AZFE= 0.1
##$AZFW= 0.1
##$BCFW= 0
##$BC_mod= 0
##$BYTORDP= 0
##$COROFFS= 0
##$CY= 12.5
##$DATMOD= 1
##$DC= 0
##$DFILT= <>
##$DTYPP= 0
##$F1P= 14.0000005364418
##$F2P= -0.99999901652339
##$FCOR= 0.5
##$FTSIZE= 32768
##$FT_mod= 6
##$GAMMA= 0
##$GB= 0
##$INTBC= 1
##$INTSCL= 1
##$ISEN= 128
##$LB= 0.3
##$LEV0= 0
##$LPBIN= 0
##$MAXI= 10000
##$MC2= 0
##$MEAN= 0
##$ME_mod= 0
##$MI= 0
##$NCOEF= 0
##$NC_proc= -4
##$NLEV= 6
##$NOISF1= 0
##$NOISF2= 0
##$NSP= 0
##$NTH_PI= 0
##$NZP= 0
##$OFFSET= 16.50699
##$PC= 1
##$PHC0= 145.4821
##$PHC1= 10.55425
##$PH_mod= 1
##$PKNL= yes
##$PPARMOD= 0
##$PSCAL= 4
##$PSIGN= 0
##$REVERSE= no
##$SF= 250.13000375248
##$SI= 32768
##$SIGF1= 0
##$SIGF2= 0
##$SINO= 400
##$SIOLD= 32768
##$SREGLST= <1H.DMSO>
##$SSB= 0
##$STSI= 32768
##$STSR= 0
##$SW_p= 5175.98343685301
##$SYMM= 0
##$S_DEV= 0
##$TDeff= 65536
##$TDoff= 0
##$TI= <Analysis number 999999
Compound Code 99
Book Reference 9
Project Code 9>
##$TILT= no
##$TM1= 0
##$TM2= 0
##$TOPLEV= 0
##$USERP1= <user>
##$USERP2= <user>
##$USERP3= <user>
##$USERP4= <user>
##$USERP5= <user>
##$WDW= 1
##$XDIM= 32768
##$YMAX_p= 401588958
##$YMIN_p= -324844
$$ End of Bruker specific parameters
$$ ---------------------------------
##NTUPLES= NMR SPECTRUM
##VAR_NAME=  FREQUENCY,     SPECTRUM/REAL,   SPECTRUM/IMAG
##SYMBOL=    X,             R,               I
##VAR_TYPE=  INDEPENDENT,   DEPENDENT,       DEPENDENT
##VAR_FORM=  AFFN,          ASDF,            ASDF
##VAR_DIM=   32768,         32768,           32768
##UNITS=     HZ,            ARBITRARY UNITS, ARBITRARY UNITS
##FACTOR=    0.157963299565203, 1,           1
##FIRST=     4128.89357888322, 0,            0
##LAST=      -1047.08985796979, 0,           0
##MIN=       -1047.08985796979, -324844,     0
##MAX=       4128.89357888322, 401588958,    0
$$ Real data points
##PAGE= N=1
##DATA TABLE= (X++(R..R)), XYDATA
$$ [...]
$$ plain form
16726 -55938 -84508 -51200 -42603 -85044 -54440 -3608 57098 -47877 -126424 -167839 -120366 -69142
16714 -69142 -86594 -122282 -125873 -105239 -65299 -43966 -6091 -12274 -17902 -25980 -107765 -72188
16702 -72188 -45640 -60728 -123581 -95673 49983 67916 72730 152093 138938 104622 157759 195946
16690 195946 134747 115908 180063 201560 248387 248345 192055 194715 151943 144554 151604 210654 227800
16677 227800 118525 59752 83674 132522 57905 -62751 -87653 -37580 36559 10690 -6540
16666 -6540 26672 -45981 -28398 41700 17999 -58459 -86439 -72477 -118152 -148495 -83251 43438
16654 43438 90091 49221 20033 -21742 -15452 -79250 -115586 -119752 -97290 -190967 -189728 -144336
16642 -144336 -147589 -173930 -57363 -20236 -129842 -162576 -178075 -281210 -295111 -237913 -148136
$$ packed form
16726e5938k8570L3308Q597m2441L0604N0832O0706j04975p8547m1415M7473N1224
16714f9142j7452l5688l591K0634L9940K1333L7875o183n628q078q1785L5577
16702g2188K6548j5088o2853K7908J45656J7933M814P9363j3155l4316N3137L8187
16690A95946o1199j8839O4155K1497M6827m2n6290K660m2772p389P050N9050J7146
16677B27800j09275n8773K3922M8848p4617j20656k4902N0073P4139k5869j7230
16666f540L3212p2653J7583P0098k3701p6458k7980J3962m5675l0343O5244J26689
16654D3438M6653m0870k9188m1775O290o3798l6336m166K2462r3677J239M5392
16642a44336l253k6341J16567L7127j09606l2734j5499j03135j3901N7198Q9777
$$ plain form
16631 -148136 -38684 -85946 -78791 -55448 -140401 -120285 -111955 -97299 -85037 -53641 1285 15808
16619 15808 -44726 -65137 -88168 -88330 -110155 -91012 -38390 -51097 -54054 -122506 -125661 9222
16607 9222 2047 -26619 -14666 22362 20774 -20393 24557 -11861 -61970 -123445 -114276 -81940
16595 -81940 -26701 -54408 -15076 1963 -79348 -54035 -8917 5763 -13108 21802 22527 71036
16583 71036 46248 -3278 -48171 -77688 -109582 -19868 -16102 -60476 -19780 4174 -5140 41953
16571 41953 36650 -62147 -4013 41599 15918 46908 4235 -67825 -87047 -65904 -106716 -147311
16559 -147311 -107874 -964 69767 52775 -46991 -73085 -105283 -97719 -61389 -75360 -96106
16548 -96106 -79434 -131130 -57125 -65275 -86544 -38047 -68322 -72345 40706 12178 -46722 -6262
$$ packed form
16631a48136J09452m7262P155K3343q4953K0116Q330J4656J2262L1396N4926J4523
16619A5808o0534k0411k3031j62k1825J9143N2622j2707k957o8452l155J34883
16607I222p175k8666J1953L7028j588m1167M4950l6418n0109o1475R169L2336
16595h1940N5239k7707L9332J7039q1311K5313M5118J4680j8871L4910P25M8509
16583G1036k4788m9526m4893k9517l1894Q9714L766m4374M0696K3954r314M7093
16571D1953n303r8797N8134M5612k5681L0990m2673p2060j9222K1143m0812m0595
16559a47311L9437J06910P0731j6992r9766k6094l2198P564L6330j3971k0746
16548i6106J6672n1696P4005q150k1269M8497l0275m023J13051k8528n8900M0460
$$ plain form
16536 -6262 59527 108736 57865 15264 559 -63327 -27836 2833 37175 12589 -27208 15735
16524 15735 -22696 -47330 -95297 -178544 -252723 -232986 -167992 -100087 33493 68026 10800
16513 10800 -130705 -106384 7889 97116 94192 25734 -37459 -108829 -116093 -65338 -56285 -74310
16501 -74310 -57399 -91618 -81104 -71286 -26283 -792 20997 15983 666 -13860 -22301 -47298
16489 -47298 -66949 -63831 -22628 83230 89424 1460 -130297 -152169 -152406 -162444 -126069 -125010
16477 -125010 -152972 -69866 46164 3131 24337 -18069 -5844 41650 17447 11908 40381
16466 40381 -59039 -122393 -169084 -190497 -136021 -81419 -65554 -81955 -77768 -125982 -124873 -75922
16454 -75922 -59664 -48735 -104896 -119856 -139947 -111732 -6848 29168 52465 86382 11065
$$ packed form
16536f262O5789M9209n0871m2601j4705o3886L5491L0669L4342k4586l9797M2943
16524A5735l8431k4634m7967q3247p4179J9737O4994O7905J33580L4533n7226
16513A0800j41505K4321J14273Q9227k924o8458o3193p1370p264N0755R053j8025
16501g4310J6911l4219J0514R818M5003K5491K1789n014j5317j4526q441k4997
16489d7298j9651L118M1203J05858O194q7964j31757k1872k37j0038L6375J059
16477a25010k7962Q3106J16030m3033K1206m2406J2225M7494k4203n539K8473
16466D0381r9420o3354m6691k1413N4476N4602J5865j6401M187m8214J109M8951
16454g5922J6258J0929n6161j4960k0091K8215J04884L6016K3297L3917p5317
$$ plain form
16443 11065 -47492 -94462 -63727 -120419 -61778 -50483 -19763 -44283 7914 16559 -36235 -5478
16431 -5478 64466 43256 21055 16869 39913 1956 -15561 31224 42150 -33052 -66249 -62825
16419 -62825 -69080 -103914 -88115 -84820 -145857 -55437 33773 96622 71311 32095 -12819 -49251
16407 -49251 -64573 -44692 -10764 -17635 -46152 -39349 12511 30561 -12305 -32760 -86179 -53478
16395 -53478 -65669 -51490 -49526 -6365 -36689 -67157 -95690 -141812 -79918 -1023 3426 -938
16383 -938 -45554 -25425 22164 -10344 55161 31697 -63514 -171745 -259990 -229647 -192477 -173581
16371 -173581 -57222 13425 7401 -9066 -75890 -201360 -211988 -174519 -126586 -55807 -80620
16360 -80620 -135593 -122621 -36880 -2398 -35836 -98149 -212025 -110720 -35374 -45453 -69720
$$ packed form
16443A1065n8557m6970L0735n6692N8641J1295L0720k4520N2197Q645n2794L0757
16431e478O9944k1210k2201m186K3044l7957j7517M6785J0926p5202l3197L424
16419f2825o255l4834J5799L295o1037R0420Q9210O2849k5311l9216m4914l6432
16407d9251j5322J9881L3928o871k8517O803N1860J8050m2866k0455n3419L2701
16395e3478j2191J4179J964M3161l0324l0468k8533m6122O1894P8895M449m364
16383i38m4616K0129M7589l2508O5505k3464r5211j08231q8245L0343L7170J8896
16371a73581J16359P0647o024j6467o6824j25470j0628L7469M7933P0779k4813
16360h0620n4973J2972Q5741L4482l3438o2313j13876J01305P5346j0079k4267
$$ plain form
16349 -69720 -104877 -156386 -195937 -155019 -111447 -131180 -26500 -1286 -20766 -3150 -13000 -18106
16337 -18106 25965 44522 105212 42195 -58111 -99112 -4217 -51428 -93684 -131161 -175223
16326 -175223 -190810 -172983 -78942 -84696 -138774 -171090 -34449 13232 46445 4781 -74080
16315 -74080 -218090 -207863 -174540 -64006 -45948 -123451 -206208 -230859 -254988 -183854 -135428
16304 -135428 -138054 -146951 -92078 -20315 -42552 -15480 -24549 -89003 -66740 33743 94951 79129
16292 79129 33750 -20897 -78977 -165307 -143485 -115433 -151614 -28355 67426 84348 -39654
16281 -39654 -116003 -94777 -58734 -26470 -34078 -124321 -65987 -39240 -193858 -228206 -147977 -143892
16269 -143892 -157962 -109968 -87730 -81035 -33317 -21263 -77498 -77861 -117559 -74340 -78713 -81396
$$ packed form
16349f9720l5157n1509l9551M0918M3572j9733J04680K5214j9480J7616r850n106
16337a8106M4071J8557O0690o3017j00306m1001R4895m7211m2256l7477m4062
16326a75223j5587J7827R4041n754n4078l2316J36641M7681L3213m1664p8861
16315g4080j44010J0227L3323J10534J8058p7503q2757k4651k4129P1134M8426
16304a35428k626q897N4873P1763k2237K7072r069o4454K2263J00483O1208j5822
16292G9129m5379n4647n8080q6330K1822K8052l6181J23259R5781J6922j24002
16281c9654p6349K1226L6043L2264p608r0243N8334K6747j54618l4348Q0229M085
16269a43892j4070M7994K2238O695M7718J2054n6235l63l9698M3219m373k683
$$ plain form
16257 -81396 -37484 -54973 -102087 -73391 -82723 -108060 -56538 -46788 -53318 -46628 -22478 -78781
16245 -78781 -132120 -136005 -162237 -103559 -20393 -21192 9233 36004 1976 -67319 -119400 -85142
16233 -85142 -24562 -27532 -102973 -248635 -261673 -183972 -122989 -107359 -49390 -25946 -45822 4403
16221 4403 -58292 -41270 -91037 -87050 -103716 -147165 -126434 -99632 -108307 -150485 -127935 -128420 -101469
16208 -101469 -56501 -51480 -95422 -96658 -116486 -148290 -167421 -44715 -23031 -78538 -67575 -2884
16196 -2884 -34742 -94522 -143022 -108375 -17782 -182 12381 -26812 -35151 -81148 -50324 -61311
16184 -61311 -108071 -168820 -245739 -161202 -161331 -136245 -120427 -82214 4401 10369 19024 62673
16172 62673 -8189 -65395 -63699 -35528 -45654 -52449 -78140 -75286 -64163 -14725 5431 38087
$$ packed form
16257h1396M3912j7489m7114K8696r332k5337N1522R750o530O690K4150n6303
16245g8781n3339l885k6232N8678Q3166p99L0425K6771l4028o9295n2081L4258
16233h5142O0580k970p5441j45662j3038P7701O0983J5630N7969K3444j9876N0225
16221D403o2695J7022m9767L987j6666m3449K0731K6802q675m2178K2550m85K6951
16208a01469M4968N021m3942j236j9828l1804j9131J22706K1684n5507J0963O4691
16196b884l1858n9780m8500L4647R0593J7600J2563l9193q339m5997L0824j0987
16184f1311m6760o0749p6919Q4537j29K5086J5818L8213Q6615N968Q655M3649
16172F2673p0862n7206J696K8171j0126o795k5691K854J1123M9438K0156L2656
$$ plain form
16160 38087 -66392 -54357 -96327 -208474 -97770 -38351 53490 54146 76936 86436 30988 36203
16148 36203 51041 58467 27391 40716 -10051 -90854 -92795 -40621 -562 17989 41909 30133
16136 30133 -26242 -14071 -12930 -9058 -15519 -44366 -52412 -112782 -155372 -192654 -165985 -153754
16124 -153754 -129109 -93014 -55083 -4832 -2187 35919 99933 -1511 6708 28755 -19274 -40638
16112 -40638 -3366 22888 17661 2862 -11365 -66329 -123860 -95282 -143980 -127119 -80684 20592
16100 20592 81544 32496 -37290 -127869 -176588 -154984 -106510 -152733 -175974 -134025 -105992 -140606
16088 -140606 -185946 -140059 -119237 -108155 -173189 -212082 -115751 -127715 -69104 -40130 -18506
16077 -18506 2241 6090 35147 49970 84377 19393 -66955 -40862 47860 66366 35355 -73769
$$ packed form
16160C8087j04479J2035m1970j12147J10704N9419R1841O56K2790R500n5448N215
16148C6203J4838P426l1076J3325n0767q0803j941N2174M0059J8551K3920j1776
16136C0133n6375J2171J141L872o461k8847q046o0370m2590l7282K6669J2231
16124a53754K4645L6095L7931N0251K645L8106O4014j01444Q219K2047m8029k1364
16112d0638L7272K6254n227j4799j4227n4964n7531K8578m8698J6861M6435J01276
16100B0592O0952m9048o9786r0579m8719K1604M8474m6223k3241M1949K8033l4614
16088a40606m5340M5887K0822J1082o5034l8893R6331j1964N8611K8974K1624
16077a8506K0747L849K9057J4823L4407o4984q6348K6093Q8722J8506l1011j09124
$$ plain form
16065 -73769 -159467 -134770 -69241 -34284 -48484 -56400 -91385 -98699 -137857 -151652 -102989 -65245
16053 -65245 -101786 -105730 -101650 -87350 -11402 29874 35139 18280 -15237 -15822 -25340 -48977 -59551
16040 -59551 -63400 -22376 -35328 -35608 -22351 -46766 -80779 -9150 67034 66542 52235 50782 75555
16027 75555 15972 -8901 74532 61307 24731 -16869 -11865 -33545 -34830 -58001 -12426 -2216
16015 -2216 -25483 -52336 -5220 -72175 -21566 -26530 -32047 -71916 -179698 -140817 -31931 -20034
16003 -20034 -34060 -28075 13887 -32266 -49809 -86203 -110098 -132646 -130564 -123466 -20881 19766
15991 19766 5695 5257 -62756 -69808 -15849 -37311 -113215 -87433 -19456 -33059 -44708 -54154
15979 -54154 -87870 -50995 -11160 -116425 -109157 -42270 -77502 -73558 -105379 -164251 -156283 -60058
$$ packed form
16065g3769q5698K4697O5529L4957j4200p916l4985p314l9158j3795M8663L7744
16053f5245l6541l944M080J4300P5948M1276N265j6859l3517n85r518k3637j0574
16040e9551l849M1024j2952k80J3257k4415l4013P1629P6184m92j4307j453K4773
16027G5555n9583k4873Q3433j3225l6576m1600N004k1680j285k3171M5575J0210
16015b216k3267k6853M7116o6955N0609m964n517l9869j07782L8881J08886J1897
16003b0034j4026N985M1962m6153j7543l6394k3895k2548K082P098J02585M0647
15991A9766j4071m38o8013p052N3959k1462p5904K5782O7977j3603j1649r446
15979e4154l3716L6875L9835j05265P268O6887l5232L944l1821n8872P968R6225
$$ plain form
15967 -60058 -85578 19218 113506 122396 110518 165108 187127 164849 138075 32654 -1387
15956 -1387 -20612 36670 119808 10052 -35248 -20728 23916 -2657 -19318 -2635 37523 90222
15944 90222 67668 -10861 32983 15778 -93963 -117199 -40922 -127718 -160273 -128842 -93396
15933 -93396 -23918 40200 687 -48611 -49930 -67290 -69488 -23384 -11433 18803 184 -26403
15921 -26403 -105145 -173647 -165989 -96453 -21277 -58264 -118295 -125382 -185043 -123163 -72185 -101885
15909 -101885 -74192 -22298 22584 60756 57741 -4992 27350 73633 83162 145207 91143 16369
15897 16369 41839 118680 116661 76720 -7791 -33631 -2990 -12660 -11055 16358 23487 60287
15885 60287 25213 6159 -55392 -78635 -8098 24730 18790 43077 13990 -13400 -37766 -58046
$$ packed form
15967f0058k5520J04796R4288Q890j1878N4590K2019k2278k6774j05421l4041
15956a387j9225N7282Q3138j09756m5300J4520M4644k6573j6661J6683M0158N2699
15944I0222k2554p8529M3844j7205j09741k3236P6277q6796l2555L1431L5446
15933i3396O9478O4118l9513m9298j319j7360k198M6104J1951L0236j8619k6587
15921b6403p8742o8502P658O9536P5176l6987o0031p087n9661O1880N0978k9700
15909a01885K7693N1894M4882L8172l015o2733L2342M6283R529O2045n4064p4774
15897A6369K5470P6841k019l9941q4511k5840L0641r670J605K7413P129L6800
15885F0287l5074j9054o1551k3243P0537L2828n940K4287k9087k7390k4366k0280
$$ plain form
15873 -58046 -75552 -113035 -123816 -99619 -96436 -210544 -305817 -243326 -97789 -18220 -28495
15862 -28495 -38155 -39649 -19143 20632 -40220 58265 148839 198540 179413 133572 -3295 -63517
15850 -63517 20410 88986 59690 15191 16398 22635 30745 11078 8913 -5727 -27190 33489
15838 33489 13559 -34271 -63854 -52762 -54293 -85087 -82667 -38950 -642 5614 8168 -5488
15826 -5488 29874 -670 5172 1906 -6810 -70726 -60126 -93752 -56459 -25066 -66347 -30621
15814 -30621 -55594 -39655 7882 10692 54992 64481 25422 6232 44506 31277 -31663 -62662
15802 -62662 -27512 -52097 -53606 -15518 -58114 -47772 -17787 -67203 -27379 49353 69448 7766
15790 7766 17052 71936 123506 75255 55954 24873 15256 62759 129697 99126 27296 -13651
$$ packed form
15873e8046j7506l7483j0781K4197L183j14108r5273O2491J45537P9569j0275
15862b8495r660j494K0506L9775o0852R8485R0574M9701j9127m5841j36867o0222
15850f3517Q3927O8576k9296m4499J207O237Q110j9667k165j4640k1463O0679
15838C3489j9930m7830k9583J1092j531l0794K420M3717L8308O256K554j3656
15826e488L5362l0544N842l266q716o3916J0600l3626L7293L1393m1281L5726
15814c0621k4973J5939M7537K810M4300R489l9059j9190L8274j3229o2940l0999
15802f2662L5150k4585j509L8088m2596J0342K9985m9416L9824P6732K0095o1682
15790G766R286N4884N1570m8251j9301l1081r617M7503O6938l0571p1830m0947
$$ plain form
15778 -13651 -63751 12695 43269 -75164 -104870 -740 -67737 -83543 -130107 -183566 -129798
15767 -129798 -105676 -96996 -79427 -73928 -2039 -26480 -37487 3931 82808 97551 49371 -77710
15755 -77710 -18618 18763 601 -17594 -24380 -72794 -68325 -38863 -133502 -170278 -145043 -218004
15743 -218004 -146592 -79485 -11123 -20200 7029 32997 59511 53137 69376 64774 52766 45485
15731 45485 -10640 -120858 -38541 -58621 -47153 -150090 -188464 -196283 -111528 -63595 -31654
15720 -31654 52552 99459 148150 102126 2262 -76710 -80406 -33903 32268 40813 33291 8344
15708 8344 31779 35498 107651 135765 61364 82305 15886 -31129 64069 100801 43253 29197
15696 29197 46917 48914 -74421 -56412 -4914 -127230 -200617 -157712 -69774 -46127 -38267 -8358
$$ packed form
15778a3651n0100P6446L0574j18433k9706J04130o6997j5806m6564n3459N3768
15767a29798K4122Q680J7569N499P1889k4441j1007M1418P8877J4743m8180j27081
15755g7710N9092L7381j8162j8195o786m8414M469K9462r4639l6776K5235p2961
15743b18004P1412O7107O8362r077K7229K5968K6514o374J6239m602j2008p281
15731D5485n6125j10218Q2317k0080J1468j02937l8374p819Q4755M7933L1941
15720c1654Q4206M6907M8691m6024r9864p8972l696M6503O6171Q545p522k4947
15708H344K3435L719P2153K8114p4401K0941o6419m7015R5198L6732n7548j4056
15696B9197J7720J997j23335J8009N1498j22316p3387M2905Q7938K3647P860K9909
$$ plain form
15684 -8358 -45976 -114420 -143816 -77467 -63970 -55668 -51257 18530 -93728 -144188 -108170 -230250
15672 -230250 -194941 -93054 24326 44626 -2936 -58146 -16940 6146 82809 59316 -1886
15661 -1886 -37788 37573 51446 -16103 -17530 3649 8121 -100179 -127790 -38730 59812 724
15649 724 -21730 8531 -6912 -35680 -16952 -16441 -39927 -19702 -55677 -55767 28100 129138 124297
15636 124297 86406 126951 140118 23016 -61909 -42597 23434 23033 -13 20226 -77193 -95398
15624 -95398 -26420 -73246 26780 100329 96006 70829 -23522 -145880 -123179 -23538 48800
15613 48800 89960 55203 -41335 -128192 -169679 -154732 -140690 -181091 -177929 -194549 -189358 -96769
15601 -96769 -7284 8134 -7829 -14372 40565 -69459 -127269 -110470 -111414 -171091 -119255 -85233
$$ packed form
15684h358l7618o8444k9396O6349J3497Q302M411O9787j12258n0460L6018j22080
15672b30250L5309J01887J17380K0300m7562n5210M1206K3086P6663k3493o1202
15661a886l5902P5361J3873o7549j427K1179M472j08300k7611Q9060R8542n9088
15649G24k2454L0261j5443k8768J8728N11k3486K0225l5975r0Q3867J01038m841
15636A24297l7891M0545J3167j17102q4925J9312O6031m01k3046K0239r7419j8205
15624i5398O8978m6826J00026P3549m323k5177r4351j22358K2701R9641P2338
15613D8800M1160l4757r6538q6857m1487J4947J4042m0401L162j6620N191R2589
15601i6769Q9485J5418j5963o543N4937j10024n7810J6799r44n9677N1836L4022
$$ plain form
15589 -85233 -15207 5640 -64067 -37044 -72543 -94619 -92845 -31407 -49212 -70979 -100034 -146975
15577 -146975 -65481 -32198 -49190 -20140 -98296 -81725 -36442 103391 114535 8465 27191
15566 27191 34555 -27325 -83895 -110295 -46402 -74903 -107706 -76563 -29890 12441 81204 91350
15554 91350 65400 5764 -88676 -80292 -110688 -130934 -156433 -148067 -161345 -115537 -92505 -32925
15542 -32925 16555 -3166 51493 34654 5679 -29347 -51619 -125357 -115788 -84000 -18612 9215
15530 9215 -29151 -52010 -87365 -28048 44872 72205 67678 -30710 -68970 -103874 -28064 51699
15518 51699 665 -83626 -139608 -67938 16372 62950 74935 -2054 -85841 -41434 -34298 17501
15506 17501 -11295 -19201 18889 8468 1926 -91867 -54093 1861 -18600 -47751 -123006 -87825
$$ packed form
15589h5233P0026K0847o9707K7023l5499k2076J774O1438j7805k1767k9055m6941
15577a46975Q1494L3283j6992K9050p8156J6571M5283J39833J1144j06070J8726
15566B7191P364o1880n6570k6400O3893k8501l2803L1143M6673M2331O8763J0146
15554I1350k5950n9636r4440Q384l0396k0246k5499Q366j3278M5808K3032N9580
15542c2925M9480j9721N4659j6839k8975l5026k2272p3738R569L1788O5388K7827
15530I215l8366k2859l5355N9317P2920K7333m527r8388l8260l4904P5810P9763
15518E1699n1034q4291n5982P1670Q4310M6578J1985p6989q3787M4407P136N1799
15506A7501k8796p906L8090j0421o542r3793L7774N5954k0461k9151p5255L5181
$$ plain form
15494 -87825 -140027 -212421 -197129 -143209 -102487 -99549 -139365 -153059 13036 175024 81346
15483 81346 2749 -44982 -31928 -37631 -51765 -104154 -73008 -87515 57318 135430 161550 62355
15471 62355 17229 59708 85082 17301 -32697 -48019 -10230 -60664 -115577 -49299 -16396 29108
15459 29108 41968 26882 -20484 -21168 -34500 -82275 -141599 -196221 -136417 -84311 -64147 -79762
15447 -79762 -139033 -179975 -201091 -129738 -72114 8578 29872 -4485 14536 -51801 -89352 -72552
15435 -72552 -58223 -27239 -18697 -19533 -73979 -46719 -105126 -211843 -159767 -77071 -700 11754
15423 11754 -43960 -37459 -14690 35964 -8922 -44416 -73109 -33471 -28759 14163 47219 60112
15411 60112 98132 82277 28080 40597 24587 73700 66323 28475 -10939 -14365 -80541 -129011
$$ packed form
15494h7825n2202p2394J5292N3920M0722K938l9816j3694J66095J61988r3678
15483H1346p8597m7731J3054n703j4134n2389L1146j4507J44833P8112K6120r9195
15471F2355m5126M2479K5374o7781m9998j5322L7789n0434n4913O6278L2903M5504
15459B9108J2860j5086m7366o84j3332m7775n9324n4622N9804N2106K0164j5615
15447g9762n9271m0942k1116P1353N7624Q0692K1294l4357J9021o6337l7551J6800
15435g2552J4329L0984Q542q36n4446K7260n8407j06717N2076Q2696P6371J2454
15423A1754n5714O501K2769N0654m4886l5494k8693L9638M712M2922L3056J2893
15411F0112L8020j5855n4197J2517j6010M9113p377l7848l9414l426o6176m8470
$$ plain form
15399 -129011 -131117 -180330 -137264 -59188 -87916 -104479 -195994 -264043 -278764 -250440 -238464 -192992
15387 -192992 -134786 -81794 11739 60083 -33521 -132354 -134710 -51587 -84614 -153365 -152956 -108116
15375 -108116 -46079 -29063 -30524 -26720 38025 30087 48342 80234 130319 110241 60692 -26487
15363 -26487 -82242 -35791 58141 56890 -55589 -100234 -47879 -80373 -162718 -204255 -191268 -169951
15351 -169951 -109607 -188986 -177800 -176297 -113095 -52424 -61857 -72259 -76537 -25977 41450 -34828
15339 -34828 -99605 -35107 -21588 39266 89835 60701 55585 49219 20573 -32936 42834 59321
15327 59321 58161 58425 -11233 -33888 2636 86550 33038 13125 901 22607 -351 -33598
15315 -33598 -131846 -226850 -214489 -233419 -220163 -162461 -100661 1887 25864 -29505 -9668
$$ packed form
15399a29011k106m9213M3066P8076k8728j6563r1515o8049j4721K8324J1976M5472
15387a92992N8206N2992R3533M8344r3604r8833k356Q3123l3027o8751M09M4840
15375a08116O2037J7016j461L804O4745p938J8255L1892N0085k0078m9549q7179
15363b6487n5755M6451R3932j251j12479m4645N2355l2494q2345m1537J2987K1317
15351a69951O0344p9379J1186J503O3202O0671r433j0402m278N0560O7427p6278
15339c4828o4777O4498J3519O0854N0569k9134n116o366k8646n3509P5770J6487
15327E9321j160K64o9658k2655L6524Q3914n3512j9913j2224K1706k2958l3247
15315c3598r8248r5004J2361j8930J3256N7702O1800J02548K3977n5369J9837
$$ plain form
15304 -9668 41786 26335 -19606 -107374 -189573 -199510 -146761 -144407 -90018 -9173 23663 72111
15292 72111 72531 45221 -46599 -115412 -109080 -125975 -96212 -43697 -78056 -81589 4822 -38471
15280 -38471 -49169 -42446 -40867 -14747 -12865 -50248 -80903 -7264 -7784 -63447 -114042 -60069 42812
15267 42812 23575 -20129 -65887 -32462 47396 58229 71632 21364 -34373 -19183 32850 84476
15255 84476 145144 125209 46189 -6970 3004 -62000 -94383 -98223 -98052 -58415 -20998 -129879
15243 -129879 -135648 -96547 -54166 -40318 11937 13850 -25551 20675 67338 93448 76772 86400
15231 86400 121667 186190 110182 -13542 17237 -21135 -123486 -167051 -197399 -118323 -33264
15220 -33264 -8209 24423 22173 31136 62050 61459 53604 3426 22796 -9196 -51340 -25506 -24389
$$ packed form
15304i668N1454j5451m5941q7768q2199r937N2749K354N4389Q0845L2836M8448
15292G2111M20k7310r1820o8813O332j6895K9763N2515l4359l533Q6411m3293
15280c8471j0698O723J579K6120J882l7383l0655P3639n20n5663n0595N3973J02881
15267D2812j9237m3704m5758L3425P9858J0833J3403n0268n5737J5190N2033N1626
15255H4476O0668j9935p9020n3159R974o5004l2383l840J71L9637L7417j08881
15243a29879n769L9101M2381J3848N2255J913l9401M6226M6663K6110j6676R628
15231H6400L5267O4523p6008j23724L0779l8372j02351m3565l0348P9076Q5059
15220c3264K5055L2632k250Q963L0914n91p855n0178J9370l1992m2144K5834J117
$$ plain form
15207 -24389 -60794 -53842 -52683 -19933 -33246 -64071 -99275 -107960 -23020 66098 76249 83850
15195 83850 77408 26653 -19779 -5924 -32305 -17155 -14498 -26243 -16163 -21610 -15056 12915
15183 12915 72733 107346 111610 102079 69445 29311 51242 107050 78352 -34460 -154844 -140663
15171 -140663 -56114 -22811 58917 -17035 -106436 -73680 -46777 13859 55266 84732 61093
15160 61093 17385 -74566 -108311 -132333 -107608 -52096 -10662 -37766 -71779 -68239 -56314 -69060
15148 -69060 -109097 -110801 -60665 1204 23896 63815 11913 -32095 -52541 -35347 -104793 -127249
15136 -127249 -100002 -50042 -18597 43372 101169 97617 93723 38909 -34848 -95705 -54004 -53039
15124 -53039 -93828 -34469 62567 40917 75586 71846 31622 88622 96907 80342 -63765 -24362
$$ packed form
15207b4389l6405O952J159L2750j3313l0825l5204q685Q4940Q9118J0151P601
15195H3850o442n0755m6432J3855k6381J5150K657j1745J0080n447O554K7971
15183A2915N9818L4613M264r531l2634m0134K1931N5808k8698j12812j20384J4181
15171a40663Q4549L3303Q1728p5952q9401L2756K6903O0636M1407K9466k3639
15160F1093m3708r1951l3745k4022K4725N5512M1434k7104l4013L540J1925j2746
15148f9060m0037j704N0136O1869K2692L9919n1902m4008k0446J7194o9446k2456
15136a27249K7247M9960L1445O1969N7797l552l894n4814p3757o0857M1701R65
15124e3039m0789N9359R7036k1650L4669l740m0224N7000Q285j6565j44107L9403
$$ plain form
15112 -24362 5903 39456 38091 42706 -17108 16735 23020 28041 42314 16688 -34419 -38120 -35361
15099 -35361 -35015 -115933 -54123 -18816 62836 132390 135808 119670 164969 209889 148933 123721
15087 123721 2795 43925 45920 38424 22298 61990 67360 -12689 -10098 -9218 -40559 -35225 -26330
15074 -26330 -43572 38134 41438 48515 27880 -75619 -119068 -158305 -127788 -1815 43462 75511
15062 75511 73871 -22081 -40462 -88410 -142076 -139440 -110156 -147118 -84755 -33071 -48432 -8176
15050 -8176 -32143 -11585 16266 15015 84698 84362 60601 104759 82068 63523 67532 85165 42613
15037 42613 39160 22885 -17302 -21467 -116696 -72589 -53761 -72440 -93881 -58558 3868 54577
15025 54577 138198 154488 142134 60038 3013 19008 -6058 41901 41725 82066 109644 29158
$$ packed form
15112b4362L0265L3553j365M615n9814L3843O285N021J4273k5626n1107l701K759
15099c5361L46q0918O1810L5307Q1652O9554L418j6138M5299M4920o0956k5212
15087A23721j20926M1130J995p496j6126L9692N370q0049K591Q80l1341N334Q895
15074b6330j7242Q1706L304P077k0635j03499m3449l9237L0517J25973M5277L2049
15062G5511j640r5952j8381m7948n3666K636K9284l6962O2363N1684j5361M0256
15050h176k3967K0558K7851j251O9683l36k3761M4158k2691j8545M009J7633m2552
15037D2613l453j6275m0187m165r5229M4107J8828j8679k1441L5323O2426N0709
15025E4577Q3621J6290j2354q2096n7025J5995k5066M7959j76M0341K7578q0486
$$ plain form
15013 29158 -12989 -58223 -129482 -95542 -41642 -119574 -140145 -86558 -99862 -48606 -78730 -107877
15001 -107877 -87754 20852 73944 52620 50888 56038 32938 49140 97122 55847 -28386 -14959
14989 -14959 18844 -29022 -100133 -40491 -220 9906 -49980 -893 -4444 46080 -18987 -115290
14977 -115290 -203822 -118416 -92901 -116772 -66194 19679 109801 102365 -23147 -84611 56666
14966 56666 78000 48039 -58420 -110682 -126620 -123241 -77632 -75965 -76627 -7503 18849 -20917
14954 -20917 38865 58897 82821 144417 64666 5549 87208 104698 97415 62772 1718 -5187
14942 -5187 -34613 -12300 -10573 -20425 -28488 -21344 575 48639 57085 95117 52052 30390 86297
14929 86297 132221 144299 97771 117497 19696 -19509 -10895 39345 77576 18102 -506 -35659
$$ packed form
15013B9158m2147m5234p1259L3940N3900p7932k0571N3587j3304N1256l0124k9147
15001a07877K0123J08606N3092k1324j732N150k3100J6202M7982m1275q4233J3427
14989a4959L3803m7866p1111N9642M0271J0126n9886M9087l551N0524o5067r6303
14977a15290q8532Q5406K5515k3871N0578Q5873R0122p436j25512o1464J41277
14966E6666K1334k9961j06459n2262j5938L379M5609J667o62O9124K6352l9766
14954b0917N9782K0032K3924O1596p9751n9117Q1659J7490p283l4643o1054o905
14942e187k9426K2313J727r852q063P144K1919M8064Q446L8032m3065k1662N5907
14929H6297M5924J2078m6528J9726r7801l9205Q614N0240L8231n9474j8608l5153
$$ plain form
14917 -35659 -32295 -21108 1984 9646 79126 74775 117297 123528 80841 44570 33132 -118984
14905 -118984 -165208 -153131 -49063 42 -5052 -22881 -54659 -125485 -71433 -24525 -59000
14894 -59000 -54505 -26671 -52310 -35040 -44307 -83425 -128709 -164778 -38999 25804 68708 -23599
14882 -23599 -64169 -11729 -15923 -26535 26564 -499 -28651 16464 87804 96717 65845 62259
14870 62259 11982 -36028 -79617 -112472 -29455 -17029 -15994 68102 53441 46791 -66633 -64505
14858 -64505 -29155 -93333 -45849 -22161 42075 100439 48214 -8634 -24725 -35416 21897 30796
14846 30796 -37057 -79987 -58316 -11751 -2828 100463 154026 93023 52117 78687 43879 -21288
14834 -21288 64823 54067 50632 38782 -12271 -29891 -74678 -62627 -9144 23952 81333 119810
$$ packed form
14917c5659L364J1187K3092P662O9480m351M2522O231m2687l6271j1438j52116
14905a18984m6224J2077J04068M9105n094j7829l1778p0826N4052M6908l4475
14894e9000M495K7834k5639J7270r267l9118m5284l6069J25779O4803M2904r2307
14882b3599m0570N2440m194j0612N3099k7063k8152M5115P1340Q913l0872l586
14870F2259n0277m8010m3589l2855Q3017J2426J035Q4096j4661o650j13424K128
14858f4505L5350o4178M7484K3688O4236N8364n2225n6848j6091j0691N7313Q899
14846C0796o7853m2930K1671M6565Q923J03291N3563o1003m0906K6570l4808o5167
14834b1288Q6111j0756l435j1850n1053j7620m4787J2051N3483L3096N7381L8477
$$ plain form
14822 119810 146432 100374 13133 -7591 40317 28596 -1581 -44085 -36435 -52743 -8133 64642
14810 64642 80271 77598 119490 35020 45103 20000 -27215 18606 55085 1603 -14884 14862
14798 14862 39990 -3139 -69147 -18423 -49991 -10512 -55747 -118674 -85892 -70404 -7617 5800
14786 5800 -60834 -108857 -110465 -62725 22948 34203 936 -20629 -52040 -28569 -1914 26274
14774 26274 -34404 -30663 25439 28349 35824 25492 -41295 -16851 -61566 -46938 21436 93923
14762 93923 56169 77988 106818 58026 -11556 -25666 11084 -3177 -78161 -81270 -46886 384
14750 384 54076 47584 1470 40857 56678 -54447 -141918 -133287 -78105 -69756 -57621 -60665 -59852
14737 -59852 -18836 -33057 -50843 -97594 -47143 -29855 -84235 -93806 -35762 66674 116428 175030
$$ packed form
14822A19810K6622m6058q7241k0724M7908j1721l0177m2504P650j6308M4610P2775
14810F4642J5629k673M1892q4470J0083k5103m7215M5821L6479n3482j6487K9746
14798A4862K5128m3129o6008N0724l1568L9479m5235o2927L2782J5488O2787J3417
14786E800o6634m8023j608M7740Q5673J1255l3267k1565l1411K3471K6655K8188
14774B6274o0678L741N6102K910P475j0332o6787K4444m4715J4628O8374P2487
14762I3923l7754K1819K8830m8792o9582j4110L6750j4261p4984l109L4384M7270
14750C84N3692o492m6114L9387J5821j11125q7471Q631N5182Q349J2135l044Q13
14737e9852M1016j4221j7786m6751N0451J7288n4380r571N8044J02436M9754N8602
$$ plain form
14725 175030 174320 197280 185980 92411 112014 9930 -13164 -24006 -19808 -13451 -64169 -159088
14713 -159088 -140246 -108544 -73145 -22724 9191 -25126 -43159 -40825 -60935 -19998 60469 2066
14701 2066 -84622 -165106 -102463 -2860 34886 27237 8287 32987 -26907 -32097 18323 63385
14689 63385 112332 65059 23309 83853 145041 116217 52375 59717 132250 94946 -3295 -57033
14677 -57033 -15820 76759 96148 37315 67763 118656 57210 32118 58130 89761 112691 128787
14665 128787 79863 45005 9311 1578 37592 71666 122598 97411 86837 47033 49220 -23806
14653 -23806 -58802 -99164 -110095 -120191 -34830 -54193 -86057 -70217 586 -65059 -75625 -37205
14641 -37205 -22238 39672 -1871 21732 29882 -102338 -31151 -13033 -37090 -48802 18964 10658
$$ packed form
14725A75030p10K2960j1300r3569J9603j02084k3094j0842M198O357n0718r4919
14713a59088J8842L1702L5399N0421L1915l4317j8033K334k0110M0937Q0467n8403
14701B066q6688q0484O2643R9603L7746p649j8950K4700n9894n190N0420M5062
14689F3385M8947m7273m1750O0544O1188k8824o3842P342P2533l7304r8241n3738
14677e7033M1213R2579J9389n8833L0448N0893o1446k5092K6012L1631K2930J6096
14665A28787m8924l4858l5694p733L6014L4074N0932k5187j0574l9804K187p3026
14653b3806l4996m0362j0931j0096Q5361j9363l1864J5840P0803o5645j0566L8420
14641c7205J4967O1910m1543K3603Q150j32220P1187J8118k4057j1712O7766q306
$$ plain form
14629 10658 20220 -2955 19129 30642 57873 35328 12548 -92698 -150403 -76534 23972
14618 23972 6242 -36024 -49278 -1077 3816 -75868 -70410 -72931 -69261 -23863 2545 48644
14606 48644 -22763 23814 93516 99571 121372 142479 187914 119352 53500 96885 64258 9853
14594 9853 -95607 -42943 -18616 -42595 -58792 -58155 -42259 -1600 38120 26396 56869 61947
14582 61947 10575 26015 -32597 -76698 -76717 -27219 -6096 -61582 -100993 -82961 3615 135344
14570 135344 142021 184424 104599 34815 39912 4424 -393 21539 -8379 21313 151821 156499
14558 156499 101683 119015 87576 -16414 -17935 -32761 -104865 -69728 -1658 -59811 -47568
14547 -47568 23295 -66597 -74544 -54247 -84715 -145292 -131298 -59107 19485 14466 -116056 -170021
$$ packed form
14629A0658R562k3175K2084J1513K7231k2545k2780j05246n7705P3869J00506
14618B3972j7730m2266j3254M8201M893p9684N458k521L670M5398K6408M6099
14606D8644p1407M6577O9702O055K1801K1107M5435o8562o5852M3385l2627n4405
14594I853j05460N2664K4327k3979j6197O37J5896M0659L9720j1724L0473N078
14582F1947n1372J5440n8612m4101j9M9498K1123n5486l9411J8032Q6576J31729
14570A35344O677M2403p9825o9784N097l5488m817K1932k9918K9692J30508M678
14558A56499n4816J7332l1439j03990j521j4826p2104L5137O8070n8153J2243
14547d7568P0863q9892p947K0297l0468o0577J3994P2191P8592n019j30522n3965
$$ plain form
14535 -170021 -140713 -137366 -176818 -163012 -74836 12183 -2169 -60407 -162673 -185212 -122497
14524 -122497 -31977 -91615 -91017 -13496 52972 71823 105025 139806 33662 -25621 -10967 33764
14512 33764 46356 21758 115356 62044 -81072 -44033 -28310 24916 93243 97226 35092 85219
14500 85219 103731 74591 26127 -59135 -38037 68710 91407 123991 80983 17091 -11657
14489 -11657 1110 58519 59947 66176 82642 112183 91457 66274 88008 88206 120170 99160
14477 99160 -93194 -156354 -83737 -37401 15147 40893 44569 -185 -108491 -132367 -110811
14466 -110811 -93910 -115015 -113799 -118191 -97165 1519 54448 107819 110883 109610 48065 -3648
14454 -3648 4959 15190 55297 71584 40386 59500 44959 -7892 -36063 21089 27456 6550
$$ packed form
14535a70021K9308L347l9452J3806Q8176Q7019j4352n8238j02266k2539O2715
14524a22497R0520n9638N98P7521O6468J8851L3202L4781j06144n9283J4654M4731
14512C3764J2592k4598R3598n3312j43116L7039J5723N3226O8327L983o2134N0127
14500H5219J8512k9140m8464q5262K1098J06747K2697L2584m3008o3892k8748
14489a1657J2767N7409J428O229J6466K9541k0726k5183K1734J98L1964k1010
14477I9160j92354o3160P2617M6336N2548K5746L676m4754j08306k3876K1556
14466a10811J6901k1105J216m392K1026R8684N2929N3371L064j273o1545n1713
14454c648Q607J0231M0107J6287l1198J9114j4541n2851k8171N7152O367k0906
$$ plain form
14442 6550 71310 52492 71245 81025 88874 94764 130264 153920 125842 131101 77676 12114 24036
14429 24036 -32569 25731 49976 -74302 -185063 -130688 32699 123062 128129 81551 19866
14418 19866 -32794 -47876 -53383 -50589 -88097 -75746 51948 83965 73606 3132 13787 42731
14406 42731 48659 51706 64350 29746 11551 -48366 -70667 -11207 10631 -6607 -7901 -57500
14394 -57500 -83520 -13153 -16476 -73417 -74934 -18386 -34387 9973 69077 71631 96009 133960
14382 133960 136137 61516 63592 31650 39640 27621 -58327 -128776 -28832 50238 62709 33922
14370 33922 120989 155964 122596 90557 40693 -56681 -58364 -3994 49950 92509 42768 -20397
14358 -20397 -25204 -85416 -94914 -133506 -111174 -147637 -138066 -89686 -47709 34841 111775 104382
$$ packed form
14442F550O4760j8818J8753R780P849N890L5500K3656k8078N259n3425o5562J1922
14429B4036n6605N8300K4245j24278j10761N4375J63387R0363N067m6578o1685
14418A9866n2660j5082n507K794l7508J2351J27694L2017j0359p0474J0655K8944
14406D2731N928L047J2644l4604j8195n9917k2301N9460K1838j7238j294m9599
14394e7500k6020P0367l323n6941j517N6548j6001M4360N9104K554K4378L7951
14382A33960K177p4621K076l1942P990j2019q5948p0449R9944P9070J2471k8787
14370C3922Q7067L4975l3368l2039m9864r7374j683N4370N3944M2559m9741o3165
14358b0397m807o0212r498l8592K2332l6463R571M8380M1977Q2550P6934p393
$$ plain form
14346 104382 18543 4154 -24061 -41167 13453 65348 32604 91125 176820 84448 -5214
14335 -5214 -17020 -10828 105 622 49804 37389 26005 -50194 -75153 -53175 -35478 26395
14323 26395 113372 195851 184324 105537 25938 84697 57391 35842 84301 125378 121621 92610
14311 92610 35882 31332 -39281 -83320 -34785 -16974 7729 15006 138 30780 18323 -20130
14299 -20130 35242 12540 -24585 -46187 -86646 -115693 -104408 -71662 -63744 -64533 -136734 -170594
14287 -170594 -67529 9294 -1991 63041 104272 -13780 -92487 -61872 -9258 -15296 -40854
14276 -40854 28008 40098 29821 47632 28513 12255 -52443 -20525 12678 -12070 46947 270465
14264 270465 246789 111141 83852 19803 -21516 -18779 -25401 -12565 4257 -11979 64637 67916
$$ packed form
14346A04382q5839j4389k8215j7106N4620N1895l2744N8521Q5695r2372q9662
14335e214j1806O192J0933N17M9182j2415j1384p6199k4959K1978J7697O1873
14323B6395Q6977Q2479j1527p8787p9599N8759k7306k1549M8459M1077l757k9011
14311I2610n6728m550p0613m4039M8535J7811K4703P277j4868L0642j2457l8453
14299b0130N5372k2702l7125k1602m0459k9047J1285L2746P918p89p2201l3860
14287a70594J03065P6823j1285O5032M1231j18052p8707L0615N2614o038k5558
14276d0854O8862J2090j0277J7811j9119j6258o4698L1918L3203k4748N9017K23518
14264B70465k3676j35648k7289o4049m1319K737o622J2836J6822j6236P6616L279
$$ plain form
14252 67916 59473 69862 127287 60379 -21569 -20891 -36395 17769 2116 -44600 22608 -50496
14240 -50496 -75697 2316 -16133 -93551 -43610 -43187 -73213 -42570 -61814 -75301 -54144 -54543
14228 -54543 2700 74530 130109 55670 -39375 -94288 -139570 -44044 -6476 83060 114906 82301
14216 82301 24767 -9814 9021 -66103 -150208 -147975 -52037 60149 154913 196898 156346 129126
14204 129126 90019 84314 21928 -12527 -1725 -24017 -42985 22005 93040 120576 61865 105240
14192 105240 68203 34769 140304 113798 83011 69879 31955 -46009 46539 156812 122049
14181 122049 13370 -35897 -55783 -62734 -17559 54079 66848 63568 44052 77790 120835 196656
14169 196656 159592 24694 -8782 27657 76180 103873 39050 20388 8828 43555 80824
$$ packed form
14252F7916q443J0389N7425o6908q1948O78j5504N4164j5653m6716O7208p3104
14240e0496k5201P8013j8449p7418M9941M23l0026L0643j9244j3487K1157l99
14228e4543N7243P1830N5579p4439r5045n4913m5282R5526L7568Q9536L1846l2605
14216H2301n7534l4581J8835p5124q4105K233R5938J12186R4764M1985m0552k7220
14204A29126l9107n705o2386l4455J0802k2292j8968O4990P1035K7536n8711M3375
14192A05240l7037l3434J05535k6506l0787j3132l7924p7964R2548J10273l4763
14181A22049j08679m9267j9886o951M5175P1638J2769l280j9516L3738M3045P5821
14169A96656l7064j34898l3476L6439M8523K7693o4823j8662j1560L4727L7269
$$ plain form
14158 80824 131122 189916 205197 151577 118389 58612 49446 69660 82122 39369 -38082 42266
14146 42266 -7263 -64295 -119685 -45360 -43452 -4409 35304 -9751 23912 35961 47939 78565
14134 78565 84613 -9689 -93568 -114672 -28935 19059 43793 93856 25097 75584 24374 -49558
14122 -49558 -86722 -35097 -13884 -4184 23416 43167 23181 93561 143223 86604 30116 47151
14110 47151 46290 7235 -100331 -95245 -13085 62765 -10808 -44165 5714 65466 117521 204462
14098 204462 209030 99881 2171 4827 25218 -1060 -61894 -54106 27378 85349 112629 149008
14086 149008 94773 63530 27876 20893 8831 -1628 -22117 -23767 -26783 3164 92262 223069
14074 223069 169181 93044 68378 75182 114275 112010 -1296 -77856 -14889 47835 77924 38158
$$ packed form
14158H0824N0298N8794J5281n3620l3188n9777r166K0214J2462m2753p7451Q0348
14146D2266m9529n7032n5390P4325J908L9043L9713m5055L3663J2049J1978L0626
14134G8565O048r4302q3879k1104Q5737M7994K4734N0063o8759N0487n1210p3932
14122d9558l7164N1625K1213R700K7600J9751j9986P0380M9662n6619n6488J7035
14110D7151q61l9055j07566N086Q2160P5850p3573l3357M9879N9752N2055Q6941
14098B04462M568j09149r7710K656K0391k6278o0834P788Q1484N7971K7280L6379
14086A49008n4235l1243l5654o983j2062j0459k0489j650l016K9947Q9098J30807
14074B23069n3888p6137k4666O804L9093k265j13306p6560O2967O2724L0089l9766
$$ plain form
14062 38158 -32853 -17486 16508 59192 101525 166288 155792 107272 89223 -21713 -61933
14051 -61933 -63649 -63928 -92834 -62810 -25731 -34571 -54811 44715 76800 121418 96378 61763
14039 61763 36504 57364 91945 112051 85548 61212 62234 137395 156393 167276 165795 210667
14027 210667 178644 102383 83709 163197 154060 131522 -3709 -37926 55395 102507 74545
14016 74545 115555 71071 -72092 -105060 -140297 -81294 -30399 -153562 -154376 -78439 -45804 -24522
14004 -24522 35207 31064 -3495 5028 65777 50404 -21959 -78103 -24256 15779 127857 144342
13992 144342 79367 94638 132092 57897 69294 171927 182561 140753 91929 78391 80142
13981 80142 57739 34968 15152 45723 39623 -48413 -40970 15653 87226 90522 101846 46294
$$ packed form
14062C8158p1011J5367L3994M2684M2333O4763j0496m8520j8049j10936m0220
14051f1933j716k79k8906L0024L7079q840k0240R9526L2085M4618k5040l4615
14039F1763k5259K0860L4581K0106k6503k4336J022P5161J8998J0883j481M4872
14027B10667l2023p6261j8674P9488r137k2538j35231l4217R3321M7112k7962
14016G4545M1010m4484j43163l2968l5237N9003N0895j23163q14P5937L2635K1282
14004b4522N9729m143l4559Q523O0749j5373p2363n6144N3847M0035J12078J6485
13992A44342o4975J5271L7454p4195J1397J02633J0634m1808m8824j3538J751
13981H0142k2403k2771j9816L0571o100q8036P443N6623P1573L296J1324n5552
$$ plain form
13969 46294 68262 106367 133725 112089 37571 40301 115304 194961 197295 160441 93707 22151
13957 22151 51591 54477 83253 49081 20968 -14666 -62382 -77816 -12570 -19371 164 46394
13945 46394 50909 11335 -40764 -83142 -35984 -50887 -74922 -3496 59951 79392 50246 66901
13933 66901 46315 -22960 -26154 30383 25249 58839 90880 96762 155987 158143 75454 24312
13921 24312 -2343 12286 27530 48256 54993 83581 46921 39837 78635 32658 72892 42452
13909 42452 40023 26917 29104 81373 129731 165570 110398 18449 16123 107366 115248 113617 137065
13896 137065 92921 76794 112122 54234 79560 134812 111842 39302 8121 73115 81762 88591
13884 88591 44064 45663 126642 112574 105362 44043 85172 92912 72180 66255 36745 10321
$$ packed form
13969D6294K1968L8105K7358k1636p4518K730P5003P9657K334l6854o6734p1556
13957B2151K9440K886K8776l4172k8113l5634m7716j5434O5246o801J9535M6230
13945D6394M515l9574n2099m2378M7158j4903k4035P1426O3447J9441k9146J6655
13933F6901k0586o9275l194N6537n134L3590L2041N882N9225K156q2689n1142
13921B4312k6655J4629J5244K0726O737K8588l6660p084L8798m5977M0234l0440
13909D2452k429j3106K187N2269M8358L5839n5172r1949k326R1243P882j631K3448
13896A37065m4144j6127L5328n7888K5326N5252k2970p2540l1181O4994Q647O829
13884H8591m4527J599Q0979j4068p212o1319M1129P740k0732n925k9510k6424
$$ plain form
13872 10321 -569 25781 54152 -17087 -37732 997 19178 24218 -53333 -52484 31016 -16070
13860 -16070 -68884 -134116 -115728 -57150 82970 137125 150455 197785 141678 65853 83427
13849 83427 73693 -18075 33266 112926 68859 71186 146303 118636 133438 211134 215125 181573
13837 181573 212410 228423 105798 104133 57425 92908 81729 86421 8491 32399 116823 184829
13825 184829 118191 108055 84553 90625 81532 54563 -22289 -13673 5008 -12220 30989 17786
13813 17786 -73779 -26002 58144 145245 63593 12664 -10245 -41146 -6869 -22316 -12209 5077
13801 5077 27098 94024 132040 31304 42013 75263 213075 286107 297019 289870 256910 219384
13789 219384 134065 31549 59036 92885 140694 228441 256198 264704 321030 256003 247565 303034
$$ packed form
13872A0321j0890K6350K8371p1239k0645L8729J8181N040p7551Q49Q3500m7086
13860a6070n2814o5232J8388N8578J40120N4155J3330M7330n6107p5825J7574
13849H3427r734r1768N1341P9660m4067K327P5117k7667J4802P7696L991l3552
13837A81573L0837J6013j22625j665m6708L5483j1179M692p7930K3908Q4424O8006
13825A84829o6638j0136k3502O072r093k6969p6852Q616J8681j7228M3209j3203
13813A7786r1565M7777Q4146Q7101q1652n0929k2909l0901L4277j5447J0107J7286
13801E077K2021O6926L8016j00736J0709L3250J37812P3032J0912p149l2960l7526
13789B19384q5319j02516K7487L3849M7809Q7747K7757Q506N6326o5027q438N5469
$$ plain form
13777 303034 349080 342556 352818 345949 363914 309698 255838 213148 182733 183757 198297 284785
13765 284785 333015 322189 323895 300440 254944 271116 351411 407319 383661 317174 385476 472891
13753 472891 505923 476179 515849 434241 293701 246167 227163 252680 229174 239188 292808
13742 292808 328841 337258 283793 316499 324576 266454 169628 185345 164231 217270 267747 304820
13730 304820 240223 208951 242383 257357 208524 185532 272932 300379 218910 210088 295994 241464
13718 241464 163266 71713 -2469 84742 104952 51772 -13288 77185 199197 184092 118116
13707 118116 137627 85131 75036 82096 23527 60601 126842 131694 49566 56412 110913 159164
13695 159164 198980 142912 94916 61479 137869 197193 140591 111852 133242 62313 128502
$$ packed form
13777C03034M6046o524J0262o869J7965n4216n3860m2690l0415J024J4540Q6488
13765B84785M8230j0826J706k3455m5496J6172Q0295N5908k3658o6487O8302Q7415
13753D72891L3032k9744L9670q1608j40540m7534j9004K5517k3506J0014N3620
13742B92808L6033Q417n3465L2706Q077n8122r6826J5717k1114N3039N0477L7073
13730C04820o4597l1272L3432J4974m8833k2992Q7400K7447q1469q822Q5906n4530
13718B41464p8198r1553p4182Q7211K0210n3180o5060R0473J22012j5105o5976
13707A18116J9511n2496j0095P060n8569L7074O6241M852q2128O846N4501M8251
13695A59164L9816n6068m7996l3437P6390N9324n6602k8739K1390p0929O6189
$$ plain form
13684 128502 116467 98686 86819 86239 171186 181130 225065 226335 208255 202335 228791 245286
13672 245286 177247 88318 98212 61106 12418 27185 78629 109265 55127 109497 72111 78454
13660 78454 76722 120212 120130 127572 86709 79713 111795 152188 15839 -8955 40002 4262 94248
13647 94248 158091 91938 50489 127946 185602 194211 140686 185652 197321 146107 144733 142789
13635 142789 104683 51023 14051 -17465 91297 195687 228324 256676 321690 293367 233793
13624 233793 215151 162530 84858 103470 108415 101026 37221 17891 27449 47079 132631 156678
13612 156678 110412 117458 245750 362756 307958 307766 253246 109898 47245 98237 192075
13601 192075 181452 154572 195332 202218 163782 166123 104636 15939 71774 211783 327430
$$ packed form
13684A28502j2035j7781j1867n80Q4947R944M3935J270j8080n920K6456J6495
13672B45286o8039q8929R894l7106m8688J4767N1444L0636n4138N4370l7386O343
13660G8454j732M3490q2P442m0863o996L2082M0393j36349k4794M8957l5740Q9986
13647I4248O3843o6153m1449P7457N7656Q609n3525M4966J1669n1214j374j944
13635A42789l8106n3660l6972l1516J08762J04390L2637K8352O5014k8323n9574
13624B33793j8642n2621p7672J8612M945p389o3805j9330R558J9630Q5552K4047
13612A56678m6266P046J28292J17006n4798j92n4520j43348o2653N0992R3838
13601A92075j0623k6880M0760O886l8436K341o1487q8697N5835J40009J15647
$$ plain form
13590 327430 273214 140792 54725 36375 62329 29337 51468 108759 124726 153701 249556
13579 249556 265812 323814 224968 144422 77239 74522 103706 234745 291445 202037 167965
13568 167965 184734 118987 148110 126117 170539 253104 217612 215560 232556 195121 289638 294445
13556 294445 269063 304973 318661 338405 393098 324427 164622 114859 108409 133028 157634
13545 157634 160385 177883 139496 148481 150322 170604 211379 218963 304664 341505 260039 213135
13533 213135 210529 177058 207078 262298 254350 215170 142910 169139 195656 239450 244286 266595
13521 266595 325224 367605 320265 282365 293744 291170 230130 131749 113662 169451 198356 229819
13509 229819 241245 234502 155089 148342 167417 105129 100564 132040 172770 279733 268044 191823
$$ packed form
13590C27430n4216j32422q6067j8350K5954l2992K2131N7291J5967K8975R5855
13579B49556J6256N8002r8846q0546o7183k717K9184J31039N6700q9408l4072
13568A67965J6769o5747K9123k1993M4422Q2565l5492k052J6996l7435R4517M807
13556B94445k5382L5910J3688J9744N4693o8671j59805m9763o450K4619K4606
13545A57634K751J7498l8387Q985J841K0282M0775P584Q5701L6841q1466m6904
13533B13135k606l3471L0020N5220p948l9180p2260K6229K6517M3794M836K2309
13521B66595N8629M2381m7340l7900J1379k574o1040r8381j8087N5789K8905L1463
13509B29819J1426o743p9413o747J9075o2288m565L1476M0730J06963j1689p6221
$$ plain form
13497 191823 240286 323029 309380 296035 327276 250374 208259 198908 173576 161965 146346 154925
13485 154925 205196 237255 269963 210949 92616 133979 120366 133608 83431 125110 173924
13474 173924 150760 142919 162641 216457 233017 208310 245346 246802 245120 301093 358494 267859
13462 267859 174058 97820 111005 149102 274519 371814 348644 348096 339216 359610 350635 328100
13450 328100 357238 440486 472695 427285 316775 249967 320118 327980 375036 402903 392505
13439 392505 309725 181055 203402 308328 362436 399198 362865 300117 239643 229358 296485
13428 296485 341802 355883 394959 386724 380509 357765 314165 331396 355142 335332 354876 383817
13416 383817 422606 416585 393932 294164 361354 329046 368844 427928 466412 485297 471842 350898
$$ packed form
13497A91823M8463Q2743j3649j3345L1241p6902m2115r351k5332j1611j5619Q579
13485A54925N0271L2059L2708n9014j18333M1363j3613J3242n0177M1679M8814
13474A73924k3164p841J9722N3816J6560k4707L7036J456j682N5973N7401r0635
13462B67859r3801p6238J3185L8097J25417R7295k3170n48q880K0394q975k2535
13450C28100K9138Q3248L2209m5410j10510o6808P0151P862M7056K7867j0398
13439C92505q2780j28670K2347J04926N4108L6762l6333o2748o0474j0285O7127
13428B96485M5317J4081L9076q235o215k2744m3600J7231K3746j9810J9544K8941
13416C83817L8789o021k2653r9768O7190l2308L9798N9084L8484J8885j3455j20944
$$ plain form
13404 350898 382605 367873 380321 416292 482885 505985 577081 532179 489551 470727 559927
13393 559927 611141 570827 549953 536176 490596 505547 627619 647501 658848 698421 697264
13382 697264 640676 677068 749127 676925 645309 713000 809694 838303 807932 831194 887145
13371 887145 901984 831653 754227 713955 814095 867050 850283 875268 916794 912687 955807
13360 955807 1003748 1024710 1045857 1108132 1223172 1252595 1254762 1297226 1298256 1274506 1323912 1406570
13348 1406570 1523339 1640740 1726389 1770809 1852266 1920139 2051137 2170512 2316528 2525003
13338 2525003 2694682 2820213 2981189 3193366 3425771 3723051 3939117 4287236 4740745
13329 4740745 5247568 5787957 6485200 7249734 8250753 9506489 10857311 12514028 14749547
$$ packed form
13404C50898L1707j4732J2448L5971O6593K3100P1096m4902m2628j8824Q9200
13393E59927N1214m0314k0874j3777m5580J4951J22072J9882J1347L9573j157
13382F97264n6588L6392P2059p2202l1616O7691R6694K8609l0371K3262N5951
13371H87145J4839p0331p7426m0272J00140N2955j6767K4985M1526m107M3120
13360I55807M7941K0962K1147O2275J15040K9423K167M2464J030k3750M9406Q2658
13348A406570J16769J17401Q5649M4420Q1457O7873J30998J19375J46016K08475
13338B525003J69679J25531J60976K12177K32405K97280K16066L48119M53509
13329D740745N06823N40389O97243P64534J001019J255736J350822J656717K235519
$$ plain form
13320 14749547 17712295 21510973 26489529 32579090 39444714 45787327 50028747 50533439
13312 50533439 47309352 41845127 35902869 30629851 26527814 23632750 21693690 20613637
13304 20613637 20385115 21047612 22354163 23981537 25244357 25606258 25283052 25214300 26285220
13295 26285220 29010539 33412911 39378727 45715965 50597411 53231050 54843259 57082676
13287 57082676 60171672 62502724 62399989 59742690 55528508 51480012 49066132 48275194
13279 48275194 47644408 44963800 39829719 34020942 29303547 26244845 24827079 24720019
13271 24720019 25268656 25589386 24960268 23593377 22284334 21580792 21804019 23031622 25266077
13262 25266077 28695936 33207970 38990161 45456835 51189500 54241156 53157098 48168383
$$ packed form
13320A4749547K962748L798678M978556O089561O865624O342613M241420N04692
13312E0533439l224087n464225n942258n273018m102037k895064j939060j080053
13304B0613637k28522O62497J306551J627374J262820L61901l23206o8752J070920
13295B6285220K725319M402372N965816O337238M881446K633639J612209K239417
13287E7082676L088996K331052j02735k657299m214182m048496k413880p90938
13279D8275194o30786k680608n134081n808777m717395l058702j417766j07060
13271B4720019N48637L20730o29118j366891j309043p03542K23227J227603K234455
13262B5266077L429859M512034N782191O466674N732665L051656j084058m988715
$$ plain form
13254 48168383 40970689 33572363 27146587 21954932 17857301 14735014 12316569 10505191
13246 10505191 9107387 7981058 6951966 6078852 5352712 4725251 4196530 3837092 3446385
13237 3446385 3180271 2938065 2648395 2446670 2300091 2124058 2045575 1932435 1743511 1752007
13227 1752007 1757952 1525941 1404303 1334602 1266281 1263065 1168430 1048511 967384 949106 1015577
13216 1015577 1046918 924658 830725 819009 790026 729022 681368 636991 585350 633592 719843
13205 719843 662068 648267 731319 786759 742863 640301 606447 617208 603827 657420 616129
13194 616129 581371 596974 626098 621179 569838 576276 536084 502696 508503 499842 465556 404998
13182 404998 382780 386449 358260 426908 413935 337123 353297 340706 258180 190859 254118 349139
$$ packed form
13254D8168383p197694p398326o425776n191655m097631l122287k418445j811378
13246A0505191j397804j126329j029092q73114p26140o27461n28721l59438l90707
13237C446385k66114k42206k89670k01725j46579j76033p8483j13140j88924Q496
13227A752007N945k32011j21638o9701o8321l216r4635j19919q1127j8278O6471
13216A015577L1341j22260r3933j1716k8983o1004m7654m4377n1641M8242Q6251
13205G19843n7775j3801Q3052N5440m3896j02562l3854J0761j3381N3593m1291
13194F16129l4758J5603K9124m919n1341O438m0192l3388N807q661l4286o0558
13182D04998k2218L669k8189O8648j2973p6812J6174j2591q2526o7321O3259R5021
$$ plain form
13170 349139 381275 359172 363961 427588 480631 416143 305925 242839 256007 233108 234987 269623
13158 269623 270640 295912 295339 276204 272331 170177 170077 222991 319634 370687 338754 307088
13146 307088 296901 375579 403561 429152 447327 515621 499320 482584 491260 454656 431075 332928
13134 332928 206448 147650 172425 235580 190302 167460 192714 137848 61071 64711 133801
13123 133801 190085 205141 247418 295789 286363 237445 246484 249880 222767 211242 233895 221954
13111 221954 249208 205332 127962 184004 165862 205758 307435 374230 213655 38803 15019
13100 15019 97698 67651 77462 74073 115839 170883 203602 195402 184077 134618 78401 64507
13088 64507 169098 254915 285999 226146 162638 228623 325763 325843 306269 213324 148488 160261
$$ packed form
13170C49139L2136k2103M789O3627N3043o4488j10218o3086J3168k2899J879L4636
13158B69623J017K5272n73j9135l873j02154j00N2914R6643N1053l1933l1666
13146C07088j0187P8678K7982K5591J8175O8294j6301j6736Q676l6604k3581r8147
13134C32928j26480n8798K4775O3155m5278k2842K5254n4866p6777L640O9090
13123A33801N6284J5056M2277M8371r426m8918R039L396k7113j1525K2653j1941
13111B21954K7254m3876p7370N6042j8142L9896J01677O6795j60575j74852k3784
13100A5019Q2679l0047R811l389M1766N5044L2719q200j1325m9459n6217j3894
13088F4507J04591Q5817L1084n9853o3508O5985R7140Q0j9574r2945o4836J1773
$$ plain form
13076 160261 156006 96698 73100 87093 145163 175169 118883 83943 74388 152571 102661 99996
13064 99996 133656 170278 128691 191990 216013 153775 145423 91212 95263 117403 171506 192472
13052 192472 246518 217762 175432 152014 165189 97324 35195 108329 176843 178773 143360 106073
13040 106073 111113 21420 -32734 -33455 -1033 77189 97840 195236 246522 283953 283224 184823
13028 184823 193419 170246 146468 135439 161631 122720 90901 85984 68021 176680 224771 131860
13016 131860 8737 39007 120549 219561 158944 161580 151247 108644 60954 107246 177724
13005 177724 139337 62429 84160 81108 118090 179146 191269 188889 227530 132305 80084 114037
12993 114037 196945 275357 313503 267754 132914 142979 264473 282887 218467 161272 223718
$$ packed form
13076A60261m255n9308k3598J3993N8070L0006n6286l4940r555P8183m9910k665
13064I9996L3660L6622m1587O3299K4023o2238q352n4211M051K2140N4103K0966
13052A92472N4046k8756m2330k3418J3175o7865o2129P3134O8514J930l5413l7287
13040A06073N040q9693n4154p21L2422P8222K0651R7396N1286L7431p29r8401
13028A84823Q596k3173k3778j1029K6192l8911l1819m917j7963J08659M8091r2911
13016A31860j23123L0270Q1542R9012o0617K636j0333m2603m7690M6292P0478
13005A77724l8387p6908K1731l052L6982O1056J2123k380L8641r5225n2221L3953
12993A14037Q2908P8412L8146m5749j34840J0065J21494J8414o4420n7195O2446
$$ plain form
12982 223718 217784 195678 175735 164932 196877 171070 57421 9661 83755 111983 131877
12971 131877 99013 -80950 -66742 47245 88157 109033 86822 86675 17715 25264 9302 134917
12959 134917 194818 214535 147597 109435 137228 117734 50152 14415 64809 151395 122709
12948 122709 109286 120641 149608 178279 258063 235041 219727 232579 206195 199547 163210 84045
12936 84045 46345 60677 17073 -3583 -17660 -5969 11941 34671 113124 96610 35255 98946
12924 98946 90331 36177 45353 58285 -3682 -65303 -8583 66186 102781 134770 160221 165529
12912 165529 148237 122957 116754 105628 140098 174585 226001 254815 250540 246581 218331 163143
12900 163143 167723 224412 207467 174630 147128 197908 237466 230474 172940 166060 144954 122889
$$ packed form
12982B23718n934k2106j9943j0803L1945k5807j13649m7760P4094K8228J9894
12971A31877l2864j79963J4208J13987M0912K0876k2211j47o8960P549j5962J25615
12959A34917N9901J9717o6938l8162K7793j9494o7582l5737N0394Q6586k8686
12948A22709j3423J1355K8967K8671P9784k3022j5314J2852k6384o648l6337p9165
12936H4045l7700J4332m3604k0656j4077J1691J7910K2730P8453j6514o1355O3691
12924I8946q615n4154R176J2932o1967o1621N6720P4769L6595L1989K5451N308
12912A65529j7292k5280o203j1126L4470L4487N1416K8814m275l959k8250n5188
12900A63143M580N6689j6945l2837k7502N0780L9558o992n7534o880k1106k2065
$$ plain form
12888 122889 95633 191663 174749 165715 180864 134521 142070 172605 115770 53163 122024 252031
12876 252031 256381 158025 180677 169980 96756 20331 61550 99971 105142 47367 114577 134201
12864 134201 143548 132077 174882 181865 183099 156010 104188 145898 113966 94743 136150 135098
12852 135098 83201 105253 132662 144014 132864 113512 167722 312251 403003 345088 244935
12841 244935 293688 342321 333810 407580 457187 396551 337200 330368 311116 234493 164315 166223
12829 166223 168418 126642 135598 144227 131280 161740 252416 343040 299496 171229 101468 210302
12817 210302 333706 488550 504272 423232 356777 411328 438389 475489 483604 469699 419968
12806 419968 373848 457248 494597 489090 393773 345678 263183 260326 278884 259724 265513 267413
$$ packed form
12888A22889k7256R6030j6914r034J5149m6343P549L0535n6835o2607O8861J30007
12876B52031M350r8356K2652j0697p3224p6425M1219L8421N171n7775O7210J9624
12864A34201R347j1471M2805O983J234k7089n1822M1710l1932j9223M1407j052
12852A35098n1897K2052K7409J1352j1150j9352N4210J44529R0752n7915j00153
12841B44935M8753M8633q511P3770M9607o0636n9351o832j9252p6623p0178J908
12829A66223K195m1776Q956Q629j2947L0460R0676R0624m3544j28267o9761J08834
12817B10302J23404J54844J5722q1040o6455N4551K7061L7100Q115j3905m9731
12806D19968m6120Q3400L7349n507r5317m8095q2495k857J8558j9160N789J900
$$ plain form
12794 267413 267235 225270 226525 182750 204822 278385 218719 242468 294515 312119 293195 317626
12782 317626 332579 292696 294625 326811 341298 279751 174860 165386 129654 99015 80237 67523
12770 67523 48959 51050 137000 117320 100618 110153 75503 138357 225430 229894 196120 71337
12758 71337 88274 95422 107126 122720 92310 21837 -2564 21464 40781 57807 82039 168721
12746 168721 131146 117574 128709 126802 130380 120615 78714 20329 19931 65465 35428 52897
12734 52897 27039 26731 101463 103197 75368 142798 136276 75423 57646 64066 137672 189827 221450
12721 221450 221994 182417 191427 215083 232544 150983 113572 152082 198439 205161 110451 79932
12709 79932 79959 70727 54319 64298 114791 158619 132807 75174 149711 177816 122154 166604 184066
$$ packed form
12794B67413j78m1965J255m3775K2072P3563n9666K3749N2047J7604j8924K4431
12782C17626J4953l9883J929L2186J4487o1547j04891r474l5732l0639j8778j2714
12770F7523j8564K091Q5950j9680j6702R535l4650O2854Q7073M464l3774j24783
12758G1337J6937P148J1704J5594l0410p0473k4401K4028J9317J7026K4232Q6682
12746A68721l7575j3572J1135j907L578r765m1901n8385l98M5534l0037J7469
12734E2897k5858l08P4732J734k7829O7430o522o0853j7777O420P3606N2155L1623
12721B21450N44l9577R010K3656J7461q1561l7411L8510M6357O722r4710l0519
12709G9932K7r232j6408R979N0493M3828k5812n7633P4537K8105n5662M4450J7462
$$ plain form
12696 184066 108958 51007 50084 162271 203940 194252 215168 287947 249276 202452 243179 133637
12684 133637 158327 247145 235150 197156 153519 117389 109405 125034 148508 129467 101752 82181
12672 82181 87350 171878 170666 181088 226248 238348 197962 171717 234530 266816 269522 202500
12660 202500 179685 233810 187679 154058 85470 95404 172857 240389 190552 65103 43940
12649 43940 99922 183959 231144 218779 140589 32651 -7307 -56065 17801 91229 44301
12638 44301 33607 54946 60244 129009 192340 176866 109214 116955 200865 221049 167068 114968
12626 114968 112101 142616 174870 165903 270337 386953 369523 359441 319951 193239 180687
12615 180687 257162 206799 114007 89343 156884 194508 148458 178331 129818 66561 124724
$$ packed form
12696A84066p5108n7951r23J12187M1669r688K0916P2779l8671m6824M0727j09542
12684A33637K4690Q8818j1995l7994m3637l6130p984J5629K3474j9041k7715j9571
12672H2181N169Q4528j212J0422M5160J2100m0386k6245O2813L2286K706o7022
12660B02500k2815N4125m6131l3621o8588R934P7453O7532m9837j25449k1163
12649D3940N5982Q4037M7185j2365p8190j07938l9958m8758P3866P3428m6928
12638D4301j0694K1339N298O8765O3331j5474o7652P741Q3910K0184n3981n2100
12626A14968k867L0515L2254q967J04434J16616j7430j0082l9490j26712j2552
12615A80687P6475n0363r2792k4664O7541L7624m6050K9873m8513o3257N8163
$$ plain form
12604 124724 258957 260968 204923 300603 350333 319010 177658 107064 112718 167510 206101
12593 206101 185802 149146 165056 184954 173430 109261 100684 133998 184491 270404 232822 254313
12581 254313 285807 222658 262775 246539 206211 235626 280824 317691 285263 303176 340699
12570 340699 250762 192675 194789 197506 148655 176276 209845 203514 215064 149794 177281 232544
12558 232544 163595 199135 168478 196997 214103 140896 65575 144634 257614 273441 185037
12547 185037 115091 167607 185283 144571 215272 286583 306714 275910 274722 332645 289602 295260
12535 295260 229481 185471 202946 200207 158002 109727 58443 159261 134950 136176 213708 262428
12523 262428 274838 203334 182334 144416 136843 108285 129344 227585 259724 186189 236969 244612
$$ packed form
12604A24724J34233K011n6045R5680M9730l1323j41352p0594N654N4792L8591
12593B06101k0299l6656J5910J9898j1524o4169q577L3314N0493Q5913l7582K1491
12581B54313L1494o3149M0117j6236m0328K9415M5198L6867l2428J7913L7523
12570C40699q9937n8087K114K717m8851K7621L3569o331J1550o5270K7487N5263
12558B32544o8949L5540l0657K8519J7106p3207p5321P9059J12980J5827q8404
12547A85037o9946N2516J7676m0712P0701P1311K0131l0804j188N7923m3043N658
12535B95260o5779m4010J7475k739m2205m8275n1284J00818k4311J226P7532M8720
12523B62428J2410p1504k1000l7918p573k8558K1059R8241L2139p3535N0780P643
$$ plain form
12511 244612 255764 206957 217979 279989 316714 263336 285700 369128 429382 412760 402283
12500 402283 326129 268212 279437 324878 351903 301967 230410 254048 249616 184641 261180 298251
12488 298251 264674 255042 261311 316554 319963 299460 147890 101490 150359 226737 260469 297182
12476 297182 243479 230702 213825 163387 91166 54445 132493 266376 295120 212665 265022
12465 265022 291732 271179 256371 259095 308368 346930 294348 163477 195724 234213 304742
12454 304742 355261 276608 204031 130735 189184 280757 405903 528139 509331 404815 356147
12443 356147 413320 336972 279872 298192 305451 203224 148185 161597 149656 176064 239348
12432 239348 273791 295243 329825 328875 290931 224691 213484 242700 209153 181809 248919 304686
$$ packed form
12511B44612J1152m8807J1022O2010L6725n3378K2364Q3428O0254j6622j0477
12500D02283p6154n7917J1225M5441K7025m9936p1557K3638m432o4975P6539L7071
12488B98251l3577r632O269N5243L409k0503j51570m6400M8869P6378L3732L6713
12476B97182n3703j2777j6877n0438p2221l6721P8048J33883K8744q2455N2357
12465B65022K6710k0553j4808K724M9273L8562n2582j30871L2247L8489P0529
12454C04742N0519p8653p2577p3296N8449R1573J25146J22236j8808j04516m8668
12443C56147N7173p6348n7100J8320P259j02227n5039J3412j1941K6408O3284
12432B39348L4443K1452L4582r50l7944o6240j1207K9216l3547k7344O7110N5767
$$ plain form
12420 304686 293638 256076 246892 294692 291216 259351 316618 231474 199784 235868 298114 401297
12408 401297 449832 430290 512606 503099 507079 543292 610646 662018 598184 562739 513659 436050
12396 436050 393762 400949 309114 316996 382801 443789 445166 467758 548005 578288 539706 516736
12384 516736 508461 452186 560646 629696 599922 621073 576586 674250 757068 750132 797729 754893
12372 754893 736491 716730 763705 818177 869074 836285 796666 849846 828849 716688 687240
12361 687240 721274 776539 652370 616121 613316 549587 533496 543237 549282 524657 552592 603955
12349 603955 709492 746234 785995 748580 637219 612681 619800 673005 759273 765767 786233
12338 786233 814142 814707 753634 717033 753304 788231 851906 867991 782740 804566 803457 784626
$$ packed form
12420C04686j1048l7562r184M7800l476l1865N7267q5144l1690L6084O2246J03183
12408D01297M8535j9542Q2316r507L980L6213O7354N1372o3834l5445m9080p7609
12396D36050m2288P187r1835P882O5805O0988J377K2592Q0247L0283l8582k2970
12384E16736q275n6275J08460O9050k9774K1151m4487R7664Q2818o936M7597m2836
12372G54893j8402j9761M6975N4472N0897l2789l9619N3180k0997j12161k9448
12361F87240L4034N5265j24169l6249k805o3729j6091R741O045k4625K7935N1363
12349F03955J05537L6742L9761l7415j11361k4538P119N3205Q6268O494K0466
12338G86233K7909N65o1073l6601L6271L4927O3675J6085q5251K1826j109j8831
$$ plain form
12326 784626 780460 765893 766245 651251 597732 579484 516499 505205 679852 754454 758203 698619
12314 698619 620850 581903 590978 531087 547403 527031 533674 603040 668574 672728 700158 646270
12302 646270 596368 622685 658442 563996 526366 529345 544859 639063 689114 651334 630758 679954
12290 679954 732869 760076 718048 654687 630706 538848 524780 584251 692502 664021 649160
12279 649160 582052 567568 539947 509531 474848 477318 453709 428607 490855 477626 493508 525551
12267 525551 547507 598840 643541 557950 544194 641808 654726 642002 614613 691469 731224
12256 731224 693359 717783 750217 764509 771309 686051 629594 650204 647142 636109 605209 591427
12244 591427 598294 675195 737551 687885 608094 580298 567907 591052 663762 660869 611184 569235
$$ packed form
12326G84626m166j4567L52j14994n3519j8248o2985j1294J74647P4602L749n9584
12314F98619p7769l8947R075n9891J6316k0372O643O9366O5534M154K7430n3888
12302F46270m9902K6317L5757r4446l7630K979J5514R4204N0051l7780k0576M9196
12290F79954N2915K7207m2028o3361k3981r1858j4068N9471J08251k8481j4861
12279F49160o7108j4484k7621l0416l4683K470k3609k5102O2248j3229J5882L2043
12267E25551K1956N1333M4701q5591j3756R7614J2918j2724k7389P6856L9755
12256G31224l7865K4424L2434J4292O800q5258n6457K0610l062j1033l0900j3782
12244E91427O867P6901O2356m9666p9791k7796j2391K3145P2710k893m9685m1949
$$ plain form
12232 569235 629823 710436 802895 828892 871754 815545 784449 826700 810767 831194 844978
12221 844978 910435 920865 856078 860477 821239 814463 866199 764463 753502 747957 701733 617005
12209 617005 614805 590057 567651 659131 677971 702997 820629 854713 898685 985132 1034133
12198 1034133 931831 946621 888970 909229 898041 915831 859753 860876 913317 870132 849067
12187 849067 890693 953562 961892 1008872 1000646 1065193 1051435 1063008 1074682 1085331 1072555 1100881
12175 1100881 1121466 1090542 1032281 1013294 1028673 1077369 1052916 1035936 1093712 1112371 1082569
12164 1082569 1107404 1031770 1015111 1005877 1073845 1053526 1094998 1145444 1203262 1147434 1175416
12153 1175416 1191153 1200497 1179027 1196174 1182450 1238187 1334545 1312014 1214536 1151202 1111091
$$ packed form
12232E69235O0588Q0613R2459K5997M2862n6209l1096M2251j5933K0427J3784
12221H44978O5457J0430o4787M399l9238o776N1736j01736j0961n545m6224q4728
12209F17005k200k4748k2406R1480J8840K5026J17632L4084M3972Q6447M9001
12198A034133j02302J4790n7651K0259j1188J7790n6078J123N2441m3185k1065
12187H49067M1626O2869Q330M6980q226O4547j3758J1573J1674J0649j2776K8326
12175A100881K0585l0924n8261j8987J5379M8696k4453j6980N7776J8659k9802
12164A082569K4835p5634j6659r234O7968k0319M1472N0446N7818n5828K7982
12153A175416J5737R344k1470J7147j3724N5737R6358k2531r7478o3334m0111
$$ plain form
12142 1111091 1168882 1240296 1200494 1231815 1305998 1335396 1405285 1425420 1423815 1397606 1328176
12131 1328176 1288920 1257266 1276237 1255500 1361767 1398701 1418894 1432504 1403327 1427728 1450412
12120 1450412 1524026 1566951 1587655 1541682 1503036 1528783 1579631 1558878 1558389 1627959 1615250 1591471
12108 1591471 1487602 1478130 1579385 1618124 1684190 1724339 1727115 1750918 1787343 1859220 1880905
12097 1880905 1909082 1949415 2006366 2030677 1978119 1971561 2011711 2036775 2086313 2162338 2259792
12086 2259792 2270678 2209447 2177301 2160076 2138463 2146384 2150846 2146578 2233263 2280970 2266414 2274855
12074 2274855 2288116 2388088 2471819 2486093 2540146 2531004 2493643 2486430 2533843 2562866 2601657 2652090
12062 2652090 2689803 2694682 2692874 2691710 2754878 2832024 2863505 2891920 2912501 2953480 3024947 3142575
$$ packed form
12142A111091N7791P1414l9802L1321P4183K9398O9889K0135j605k6209o9430
12131A328176l9256l1654J8971k0737J06267L6934K0193J3610k9177K4401K2684
12120A450412P3614M2925K0704m5973l8646K5747N0848k0753m89O9570j2709k3779
12108A591471j03869r472J01255L8739O6066M0149K776K3803L6425P1877K1685
12097A880905K8177M0333N6951K4311n2558o558M0150K5064M9538P6025R7454
12086B259792J0886o1231l2146j7225k1613P921M462m268Q6685M7707j4556Q441
12074B274855J3261R9972Q3731J4274N4053r142l7361p213M7413K9023L8791N0433
12062B652090L7713M879j808j164O3168P7146L1481K8415K0581M0979P1467J17628
$$ plain form
12050 3142575 3272854 3319757 3341177 3376393 3485976 3517095 3531359 3450536 3469580 3531435 3650388
12039 3650388 3746679 3743808 3830646 3929230 4002081 4184661 4171167 4211554 4294612 4390202 4422061
12028 4422061 4442421 4523646 4636998 4793644 4912263 4931991 4930329 5035657 5165807 5265316
12018 5265316 5349954 5431798 5564762 5642062 5710500 5841810 5975846 6099828 6270297 6383193
12008 6383193 6478274 6641803 6835419 7011824 7203446 7372318 7556417 7763807 7954876 8150265
11998 8150265 8424430 8674603 8904554 9061990 9233181 9490567 9812794 10221206 10580135
11989 10580135 10920081 11325330 11778069 12245825 12716878 13290441 13985544 14731320 15616039
11980 15616039 16507680 17418610 18573439 20085938 21807008 23775722 26270950 29364134
$$ packed form
12050C142575J30279M6903K1420L5216J09583L1119J4264q0823J9044O1855J18953
12039C650388R6291k871Q6838R8584P2851J82580j3494M0387Q3058R5590L1859
12028D422061K0360Q1225J13352J56646J18619J9728j662J05328J30150R9509
12018E265316Q4638Q1844J32964P7300O8438J31310J34036J23982J70469J12896
12008F383193R5081J63529J93616J76405J91622J68872J84099K07390J91069J95389
11998H150265K74165K50173K29951J57436J71191K57386L22227M08412L58929
11989A0580135L39946M05249M52739M67756M71053N73563O95103P45776Q84719
11980A5616039Q91641R10930J154829J512499J721070J968714K495228L093184
$$ plain form
11972 29364134 33321688 38370941 44712738 52141185 59780840 66164414 69288027 68125977
11964 68125977 63573390 57626101 51926211 47308785 43893219 41722011 40697120 40591311
11956 40591311 41442260 43282874 45696140 47763114 48811692 49090278 49560973 51111768
11948 51111768 54156065 58753641 64514664 70346368 74898433 77585463 79740102 83006450
11940 83006450 87890572 93508200 98270657 100815290 100534223 98507516 96339670 94876339
11932 94876339 93775643 91636855 87929090 83665259 80214503 78171318 77678447 78365433
11924 78365433 79690067 80670870 80482261 79557946 78726703 78458279 78895766 80094087 82063004
11915 82063004 84607610 88052374 92467745 97600273 102728427 106398994 106989328 103656964
$$ packed form
11972B9364134L957554N049253O341797P428447P639655O383574L123613j162050
11964F8125977m552587n947289n699890m617426l415566k171208j024891j05809
11956D0591311Q50949J840614K413266K066974J048578K78586M70695J550795
11948E1111768L044297M597576N761023N831704M552065K687030K154639L266348
11940H3006450M884122N617628M762457K544633k81067k026707k167846j463331
11932I4876339j100696k138788l707765m263831l450756k043185m92871O86986
11924G8365433J324634R80803j88609r24315q31243k68424M37487J198321J968917
11915H2063004K544606L444764M415371N132528N128154L670567N90334l332364
$$ plain form
11907 103656964 97155829 89348128 81740838 75043294 69408279 64775003 60898037 57486804
11899 57486804 54523989 51950159 49609245 47358224 45186077 43299537 41529993 39844070
11891 39844070 38195162 36679371 35231891 33876728 32557507 31370090 30319613 29148042
11883 29148042 28030682 27087150 26217506 25177610 24174978 23348146 22506174 21757275 21008230
11874 21008230 20314803 19645395 18969448 18303180 17728452 17090123 16568774 16118237 15681195
11865 15681195 15258319 14788455 14315578 13868351 13555800 13191745 12773453 12383332 12034846
11856 12034846 11750153 11453227 11103313 10758927 10442360 10208281 9987974 9683053 9419573
11847 9419573 9130000 8908949 8752882 8574712 8387565 8192579 7890077 7623280 7491089
$$ packed form
11907A03656964o501135p807701p607290o697544n635015m633276l876966l411233
11899E7486804k962815k573830k340914k251021k172147j886540j769544j685923
11891C9844070j648908j515791j447480j355163j319221j187417j050477j171571
11883B9148042j117360r43532q69644j039896j002632q26832q41972p48899p49045
11874B1008230o93427o69408o75947o66268n74728o38329n21349m50537m37042
11865A5681195m22876m69864m72877m47227l12551l64055m18292l90121l48486
11856A2034846k84693k96926l49914l44386l16567k34079k20307l04921k63480
11847I419573k89573k21051j56067j78170j87147j94986l02502k66797j32191
$$ plain form
11838 7491089 7369997 7144532 6996433 6885204 6688777 6593881 6500260 6394597 6307707 6166454
11828 6166454 6040571 5878426 5721798 5606487 5465050 5285122 5206316 4992562 4846119 4739756
11818 4739756 4723955 4794166 4788027 4644128 4527254 4467269 4447649 4322588 4174040 4119157 3997114
11807 3997114 3899140 3858930 3832634 3843165 3773169 3663645 3615362 3530886 3419104 3333423 3326053
11796 3326053 3302116 3284260 3201889 3073571 3083329 3026927 2975216 2942848 2876418 2847475 2902173
11785 2902173 2808619 2656580 2647881 2651039 2674088 2532037 2498985 2564331 2537354 2507077 2453730
11774 2453730 2333084 2295973 2300031 2245050 2236228 2210562 2280267 2232980 2235317 2206716 2124562 2116657
11762 2116657 2044474 1956105 1985026 1961610 1911040 1847592 1797405 1797597 1703877 1725032 1780967 1784285
$$ packed form
11838G491089j21092k25465j48099j11229j96427r4896r3621j05663q6890j41253
11828F166454j25883j62145j56628j15311j41437j79928p8806k13754j46443j06363
11818D739756j5801P0211o139j43899j16874n9985j9620j25061j48548n4883j22043
11807C997114r7974m0210k6296J0531o9996j09524m8283q4476j11782q5681p370
11796C326053k3937j7856q2371j28318R758n6402n1711l2368o6430k8943N4698
11785B902173r3554j52039q699L158K3049j42051l3052O5346k6977l0277n3347
11774B453730j20646l7111M058n4981q822k5666O9705m7287K337k8601q2154p905
11762B116657p2183q8369K8921k3416n0570o3448n0187J92r3720K1155N5935L318
$$ plain form
11750 1784285 1766143 1783901 1812891 1718636 1647022 1733376 1754675 1697569 1646298 1660215 1687172
11739 1687172 1686294 1641406 1615403 1650425 1664627 1647982 1579525 1643815 1663920 1592092 1524493 1499226
11727 1499226 1524163 1542143 1449405 1395052 1377344 1439978 1424650 1320928 1207235 1265622 1332883
11716 1332883 1274243 1252878 1258917 1234717 1170668 1199128 1209481 1174360 1153058 1212203 1243906
11705 1243906 1295118 1277277 1231741 1229222 1232625 1232501 1199094 1232517 1259761 1217919 1189990 1298358
11693 1298358 1307691 1358167 1409094 1473129 1632380 1826545 1933789 2221587 2546733 2848756
11683 2848756 3002918 2889331 2632089 2261825 1871499 1547244 1467744 1336604 1255082 1183881
11673 1183881 1211930 1181322 1079543 1013908 1002885 1018871 1018717 1031015 1034969 996476 944007 958948
$$ packed form
11750A784285j8142J7758K8990r4255p1614Q6354K1299n7106n1271J3917K6957
11739A687172q78m4888k6003L5022J4202j6645o8457O4290K0105p1828o7599k5267
11727A499226K4937J7980r2738n4353j7708O2634j5328j03722j13693N8387O7261
11716A332883n8640k1365O039k4200o4049K8460J0353l5121k1302N9145L1703
11705A243906N1212j7841m5536k519L403j24l3407L3423K7244m1842k7929J08368
11693A298358R333N0476N0927O4035J59251J94165J07244K87798L25146L02023
11683B848756J54162j13587k57242l70264l90326l24255p9500j31140q1522p1201
11673A183881K8049l0608j01779o5635j1023J5986j54J2298L954l8493n2469J4941
$$ plain form
11661 958948 910004 876188 793236 779579 772876 770496 744883 765149 820880 889697 890901 749703
11649 749703 719031 741902 824608 837300 825770 837887 849487 816655 769888 699519 691218 687147
11637 687147 658991 643963 638786 646869 688168 781215 782112 782569 698810 592594 671500 761888
11625 761888 796802 782285 694671 680364 738503 725161 772929 712966 617943 616662 670030 649844
11613 649844 636390 684858 667016 662323 558323 576172 543671 516327 531944 567242 579043
11602 579043 626756 617830 585408 475669 487180 550227 619971 702385 677885 580195 578500 611131
11590 611131 601913 616989 500856 390592 556176 643239 545555 456747 453170 403855 417731
11579 417731 410541 400268 381763 323244 378126 446994 477851 545182 563850 493091 461055 406870
$$ packed form
11661I58948m8944l3816q2952j3657o703k380k5613K0266N5731O8817J204j41198
11649G49703l0672K2871Q2706J2692j1530J2117J1600l2832m6767p0369q301m071
11637F87147k8156j5028n177Q083M1299R3047Q97M57q3759j06216P8906R0388
11625G61888L4914j4517q7614j4307N8139j3342M7768n9963r5023j281N3368k0186
11613F49844j3454M8468j7842m693j04000J7849l2501k7344J5617L5298J1801
11602E79043M7713q926l2422j09739J1511O3047O9744Q2414k4500r7690j695L2631
11590F11131r218J5076j16133j10264J65584Q7063r7684q8808l577m9315J3876
11579D17731p190j0273j8505n8519N4882O8868L0857O7331J8668p0759l2036n4185
$$ plain form
11567 406870 398762 427104 388002 369840 389148 452565 501170 469581 420852 364325 372704 424925
11555 424925 434330 425083 371599 434596 436701 429429 426328 437691 460300 555295 597644 515056
11543 515056 460374 455721 481801 446031 378500 415659 394814 542299 660075 692619 675625
11532 675625 600106 541267 501485 453087 484138 489317 579395 609957 597115 584303 517060 563426
11520 563426 616090 680135 733125 757465 698745 735686 671643 569190 625334 699112 771582
11509 771582 862793 883339 766457 779278 770491 718781 722132 733469 737198 749567 806256 811001
11497 811001 822762 848622 825853 771046 712844 715011 649428 602366 649403 714602 797369 673220
11485 673220 632908 616201 561750 538001 575763 537973 521024 524837 533164 536018 544063 568804
$$ packed form
11567D06870q108K8342l9102j8162J9308O3417M8605l1589m8729n6527Q379N2221
11555D24925R405r247n3484O2997K105p272l101J1363K2609R4995M2349q2588
11543E15056n4682m653K6080l5770o7531L7159k0845J47485J17776L2544j6994
11532F75625p5519n8839l9782m8398L1051N179R0078L0562j2842j2812o7243M6366
11520E63426N2664O4045N2990K4340n8720L6941o4043j02453N6144P3778P2470
11509G71582R1211K0546j16882J2821q787n1710L351J1337L729J2369N6689M745
11497H11001J1761K5860k2769n4807n8202K167o5583m7062M7037O5199Q2767j24149
11485F73220m0312j6707n4451k3749L7762l7790j6949L813Q327K854Q045K4741
$$ plain form
11473 568804 576499 558880 514311 557756 680441 681895 659371 701732 786148 821521 782229 755704
11461 755704 736740 651299 499303 403409 329345 355676 359239 303980 343677 400659 400051 440803
11449 440803 547473 620706 599645 619738 642717 608300 616994 598170 553467 504682 512756 458449
11437 458449 458939 500677 466364 408482 429332 426982 405125 380686 364502 377914 369894 455888
11425 455888 472898 458931 499844 486111 533266 556838 467427 375220 411233 502329 437801
11414 437801 392634 424239 383950 338884 374452 477580 474844 454597 406527 286647 240328
11403 240328 264088 342852 420032 427780 396739 416482 316678 264630 331541 323949 339431 401614
11391 401614 460208 380594 361199 452855 452406 441782 354456 356557 437445 520060 504186 497721
$$ packed form
11473E68804P695j7619m4569M3445J22685J454k2524M2361Q4416L5373l9292k6525
11461G55704j8964q5441j51996r5894p4064K6331L563n5259L9697N6982o08M0752
11449D40803J06670P3233k1061K0093K2979l4417Q694j8824m4703m8785Q074n4307
11437D58449M90M1738l4313n7882K0850k350k1857k4439j6184J3412q020Q5994
11425D55888J7010j3967M0913j3733M7155K3572q9411r2207L6013R1096o4528
11414D37801m5167L1605m0289m5066L5568J03128k736k0247m8070j19880m6319
11403B40328K3760P8764P7180P748l1041J9743r9804n2048O6911p592J5482O2183
11391D01614N8594p9614j9395R1656m49j0624q7326K101Q0888Q2615j5874o465
$$ plain form
11379 497721 489524 447737 498066 506455 551161 601543 637790 674405 713484 690981 673165 657161
11367 657161 707164 753828 795179 824812 810611 781985 746363 767125 805064 801999 786965 703592
11355 703592 692309 643406 562430 567141 623911 689573 777397 830523 745006 675097 734147 683222
11343 683222 725884 761178 782891 817873 839838 852693 877725 921552 972951 937704 906675
11332 906675 999271 1111224 1077016 983624 917044 1018218 1062076 1099414 1134567 1216124 1282376
11321 1282376 1234965 1178378 1240185 1356664 1405837 1333471 1360143 1459499 1577238 1710481 1747977
11310 1747977 1802250 1927759 2071464 2196292 2273782 2378027 2511318 2515346 2629618 2797790
11300 2797790 2896432 3084160 3229808 3399319 3541147 3609180 3710003 3789488 3896934 3963684
$$ packed form
11379D97721q197m1787N0329Q389M4706N0382L6247L6615L9079k2503j7816j6004
11367F57161N0003M6664M1351K9633j4201k8626l5622K0762L7939l065j5034q3373
11355G03592j1283m8903q0976M711N6770O5662Q7824N3126q5517o9909N9050n0925
11343F83222M2662L5294K1713L4982K1965J2855K5032M3827N1399l5247l1029
11332I06675R2596J11953l4208r3392o6580J01174M3858L7338L5153Q1557O6252
11321A282376m7411n6587O1807J16479M9173p2366K6672R9356J17739J33243L7496
11310A747977N4273J25509J43705J24828P7490J04245J33291M028J14272J68172
11300B797790R8642J87728J45648J69511J41828O8033J00823P9485J07446O6750
$$ plain form
11290 3963684 4059193 4240684 4431846 4677017 5007948 5220586 5466956 5903264 6357170 6774561
11280 6774561 7229536 7776804 8370328 9104244 9990154 10894795 12017050 13303069 14762956
11271 14762956 16613411 18978034 21792154 25140793 29056240 33695319 39138796 45932834
11263 45932834 54845777 67540681 85995416 113155633 153160089 209890799 282163194
11256 282163194 355411086 401588958 399030034 348933531 274045960 201922962 146641727
11249 146641727 108325517 82357522 64720352 52408568 43429721 36626700 31239496
11242 31239496 26733372 22793509 19493228 16879048 14839875 13036167 11490832 10282272
11234 10282272 9302205 8406243 7658245 7094200 6459063 5944352 5515936 5124782 4838980
$$ packed form
11290C963684R5509J81491J91162K45171L30931K12638K46370M36308M53906M17391
11280F774561M54975N47268N93524P33916Q85910R04641J122255J286019J459887
11271A4762956J850455K364623K814120L348639L915447M639079N443477O794038
11263D5932834Q912943J2694904J8454735K7160217M0004456N6730710P2272395
11256B82163194P3247892M6177872k558924n0096503p4887571p2122998n5281235
11249A46641727l8316210k5967995j7637170j2311784q978847o803021n387204
11242C1239496m506124l939863l300281k614180k039173j803708j545335j208560
11234A0282272r80067q95962p47998n64045o35137n14711m28416l91154k85802
$$ plain form
11225 4838980 4583091 4257682 3981473 3733707 3518766 3381726 3263813 3100931 2915814
11216 2915814 2706005 2583123 2430119 2282790 2231072 2174463 2139702 2029285 1885571 1762927
11206 1762927 1742801 1750692 1763898 1595840 1431384 1351527 1337135 1247794 1219177 1191251 1171016
11195 1171016 1223407 1226607 1215149 1244524 1195297 1127224 1030574 971675 927001 876497 810181
11184 810181 802279 839006 849497 733386 662907 694143 789167 793094 687054 635613 623619
11173 623619 611096 639535 674930 608433 550571 518804 531709 485120 478270 490819 485980 488287
11161 488287 565898 532830 512657 553859 593119 620573 518602 513599 518439 513418 492899 520153
11149 520153 566561 519491 458276 360820 333837 244197 217044 283557 304339 358445 396620
$$ packed form
11225D838980k55889l25409k76209k47766k14941j37040j17913j62882j85117
11216B915814k09809j22882j53004j47329n1718n6609l4761j10417j43714j22644
11206A762927k0126P891J3206j68058j64456p9857j4392q9341k8617k7926k0235
11195A171016N2391L200j1458K9375m9227o8073r6650n8899m4674n0504o6316
11184H10181p902L6727J0491j16111p0479L1236R5024L927j06040n1441j1994
11173F23619j2523K8439L5395o6497n7862l1767J2905m6589o850J2549m839K307
11161D88287P7611l3068k0173M1202L9260K7454j01971n003M840n021k0519K7254
11149E20153M6408m7070o1215r7456k6983q9640k7153O6513K0782N4106L8175
$$ plain form
11138 396620 369448 242980 217388 209468 315558 312867 369381 371163 382694 389722 396612 436726
11126 436726 447787 433864 402391 471281 419907 495594 539242 528673 539926 451244 462943
11115 462943 454033 392049 338239 347355 279428 233241 225256 224193 185170 274659 407689 473194
11103 473194 528542 512464 518123 517699 445283 413609 395941 325028 266863 239552 267419 244430
11091 244430 232847 255260 304743 345003 394927 377844 425052 411407 368980 323439 328192 350592
11079 350592 327835 241481 242555 248577 229744 280768 301786 258537 201022 278636 323029 284490
11067 284490 256055 244954 289177 387422 301663 229839 273107 245064 163193 155986 209068 243476
11055 243476 295568 395852 438814 437197 442958 402593 421951 427886 536793 511834 501959 436680
$$ packed form
11138C96620k7172j26468k5592p920J06090k691N6514J782J1531P028O890M0114
11126D36726J1061j3923l1473O8890n1374P5687M3648j0569J1253q8682J1699
11115D62943q910o1984n3810R116o7927m6187p985j063l9023Q9489J33030O5505
11103D73194N5348j6078N659m24p2416l1674j7668p0913n8165k7311K7867k2989
11091B44430j1583K2413M9483M0260M9924j7083M7208j3645m2427m5541M753K2400
11079C50592k2757q6354J074O022j8833N1024K1018m3249n7515P7614M4393l8539
11067B84490k8435j1101M4223R8245q5759p1824M3268k8043q1871p207N3082L4408
11055B43476N2092J00284M2962j617N761m0365J9358N935J08907k4959r875o5279
$$ plain form
11043 436680 483017 575428 596655 635794 649460 666486 659688 761961 874095 906800 927421
11032 927421 869262 905075 833251 811376 816034 932081 1030916 1121146 1260428 1322437 1280645
11021 1280645 1222440 1164975 1091954 1011762 898851 796758 798929 832047 901067 953269 1009152
11010 1009152 1007947 882247 745871 750733 698843 610804 562965 650069 706109 759505 698672
10999 698672 667113 556947 507238 413178 329687 204126 151213 220547 265036 233344 262645
10988 262645 224502 196907 167381 160463 214481 242320 196544 181254 119740 14398 9283 80741
10976 80741 125021 228130 275803 272086 223173 183991 200131 131535 111830 160025 196636 244844
10964 244844 210102 183577 205712 187105 194375 201939 163583 115342 140176 155666 159147 204621
$$ packed form
11043D36680M6337R2411K1227L9139J3666J7026o798J02273J12134L2705K0621
11032I27421n8159L5813p1824k1875M658J16047R8835R0230J39282O2009m1792
11021A280645n8205n7465p3021q0192j12911j02093K171L3118O9020N2202N5883
11010A009152j205j25700j36376M862n1890q8039m7839Q7104N6040N3396o0833
10999F98672l1559j10166m9709r4060q3491j25561n2913O9334M4489l1692K9301
10988B62645l8143k7595k9526o918N4018K7839m5776j5290o1514j05342n115P1458
10976H0741M4280J03109M7673l717m8913l9182J6140o8596j9705M8195L6611M8208
10964B44844l4742k6525K2135j8607P270P564l8356m8241K4834J5490L481M5474
$$ plain form
10952 204621 160891 120693 21433 2298 -18357 10284 58417 48232 171903 141523 137480
10941 137480 153132 31520 63306 55465 39800 13760 15058 17294 38061 68098 89658 171399
10929 171399 134885 141492 156133 122620 144969 215504 213161 154126 178750 261047 181835 123536
10917 123536 79984 82964 142733 190780 223626 233464 232777 263425 192057 94528 122828 120499
10905 120499 112169 106297 71178 135505 148591 182989 202146 184332 244072 257589 234994 207135
10893 207135 196724 116994 86070 133866 152663 110847 148545 185927 209221 212523 177627 177195
10881 177195 241256 219330 225428 204636 111130 189169 263880 307460 284912 238737 119302
10870 119302 27345 139455 159120 21201 56946 117800 156852 212692 220029 295314 216070
$$ packed form
10952B04621m3730m0198r9260j9135k0655K8641M8133j0185J23671l0380m043
10941A37480J5652j21612L1786p841j5665k6040J298K236K0767L0037K1560Q1741
10929A71399l6514O607J4641l3513K2349P0535k343n9035K4624Q2297p9212n8299
10917A23536m3552K980N9769M8047L2846R838o87L0648p1368r7529K8300k329
10905A20499q330n872l5119O4327J3086L4398J9157j7814N9740J3517k2595k7859
10893B07135j0411p9730l0924M7796J8797m1816L7698L7382K3294L302l4896m32
10881A77195O4061k1926O098k0792r3506P8039P4711M3580k2548m6175j19435
10870A19302r1957J12110J9665j37919L5745O0854L9052N5840P337P5285p9244
$$ plain form
10859 216070 278079 352291 382605 367233 325333 279122 292182 294311 306718 310335 329629 286100
10847 286100 227380 237823 272263 262462 270522 298511 307690 375193 407293 307371 223178 140116
10835 140116 218707 283950 350242 329928 306868 343961 357852 446434 523060 642760 650163
10824 650163 777015 1085958 1421685 1824972 2038508 2105803 2026370 1687129 1358902 1153473
10814 1153473 941531 722833 593539 553244 446081 432534 414870 409350 332989 251476 190213
10803 190213 143032 164200 222284 266101 268670 257561 240968 278024 274321 275171 212085 184317
10791 184317 169793 190396 241798 258063 214015 172290 199571 212375 128701 115968 224169
10780 224169 228201 159885 276766 371067 341732 297405 261894 347199 431586 378928 292518
$$ packed form
10859B16070O2009P4212L0314j5372m1900m6211J3060K129J2407L617J9294m3529
10847B86100n8720J0443L4440r801Q060K7989R179O7503L2100r9922q4193q3062
10835A40116P8591O5243O6292k0314k3060L7093J3891Q8582P6626J19700P403
10824F50163J26852L08943L35727M03287K13536O7295p9433l39241l28227k05429
10814A153473k11942k18698j29294m0295j07163j3547j7664n520p6361q1513o1263
10803A90213m7181K1168N8084M3817K569j1109j6593L7056l703Q50o3086k7768
10791A84317j4524K0603N1402J6265m4048m1725K7281J2804q3674j2733J08201
10780B24169M032o8316J16881R4301k9335m4327l5511Q5305Q4387n2658q6410
$$ plain form
10769 292518 253076 202101 269928 354871 324877 333610 323516 346975 295388 286588 317940 287844
10757 287844 195523 216488 229641 267538 272837 235390 194607 154243 199848 234070 274514 209308
10745 209308 261790 308459 229572 244554 199639 244982 239682 301449 229761 204575 251338 187617
10733 187617 170302 248622 320153 310990 343504 394144 410386 372919 329583 309685 230255 297284
10721 297284 312562 351584 345853 412006 480666 438553 338186 309923 289289 315926 339702
10710 339702 399461 297226 322507 340707 423905 398461 376849 406459 361512 333754 402973
10699 402973 465718 495596 513376 498811 512844 490434 611764 674010 619156 604291 658001
10688 658001 700943 677372 608096 594432 514932 488760 550559 615791 610579 583235 605189 712233
$$ packed form
10769B92518l9442n0975O7827Q4943k9994Q733j0094K3459n1587q800L1352l0096
10757B87844r2321K0965J3153L7897N299l7447m0783m0364M5605L4222M0444o5206
10745B09308N2482M6669p8887J4982m4915M5343n300O1767p1688k5186M6763o3721
10733A87617j7315P8320P1531r163L2514N0640J6242l7467m3336j9898p9430O7029
10721B97284J5278L9022n731O6153O8660m2113j00367k8263k0634K6637K3776
10710C39702N9759j02235K5281J8200Q3198k5444k1612K9610m4947k7758O9219
10699D02973O2745K9878J7780j4565J4033k2410J21330O2246n4854j4865N3710
10688F58001M2942k3571o9276j3664p9500k6172O1799O5232n212k7344K1954J07044
$$ plain form
10676 712233 718857 744666 781471 885978 918580 842436 827818 873858 904380 926332 983318
10665 983318 1005209 1095219 1208249 1256395 1271314 1299855 1366447 1334459 1417669 1598155 1830169
10654 1830169 1894409 1920549 1938640 1906564 2007664 2088872 2151049 2153044 2275604 2374563 2524299
10643 2524299 2594306 2709039 2904771 3134924 3366868 3610558 3836361 4225549 4592254 5139274
10633 5139274 5703578 6038056 6350376 6824194 7416589 8121842 9041617 10363138 12068788
10624 12068788 14362269 17444366 21442657 26799685 33743058 42161899 51265455 58906275
10616 58906275 62731490 62228790 59158506 56138855 54976324 56432524 61048516 69427247
10608 69427247 82202432 99060191 117420917 131170248 134380259 126844110 114439320
$$ packed form
10676G12233O624K5809L6805J04507L2602p6144j4618M6040L0522K1952N6986
10665I83318K1891R0010J13030M8146J4919K8541O6592l1988Q3210J80486K32014
10654A830169O4240K6140J8091l2076J01100Q1208O2177J995J22560R8959J49736
10643B524299P0007J14733J95732K30153K31944K43690K25803L89188L66705N47020
10633E139274N64304L34478L12320M73818N92395P05253R19775J321521J705650
10624A2068788K293481L082097L998291N357028O943373Q418841R103556P640820
10616E8906275L825215n02700l070284l019651j162531J456200M615992Q378731
10608F9427247J2775185J6857759J8360726J3749331L210011p536149j2404790
$$ plain form
10601 114439320 103228538 96373416 94886573 99084828 109341843 125950274 147754785
10594 147754785 170069813 183933614 181402888 163896463 140566653 119657161 104749036
10587 104749036 96342379 93950460 97031304 105124493 116721233 128016154 132717013 126226817
10579 126226817 110320649 91517271 75436126 63941214 56979419 53556443 53041140
10572 53041140 54872968 57915844 60259005 59667912 54749667 46515892 37272686 29057360
10564 29057360 22602628 17843339 14386875 11892222 9979521 8461217 7237093 6388982
10556 6388982 5650128 5101712 4711182 4361719 3913679 3588923 3266821 2938947 2691995
10547 2691995 2425509 2281479 2172611 2028267 1903851 1835725 1806817 1652715 1521831 1437922
$$ packed form
10601A14439320j1210782o855122j486843M198255J0257015J6608431K1804511
10594A47754785K2315028J3863801k530726j7506425k3329810k0909492j4908125
10587A04749036q406657k391919L080844Q093189J1596740J1294921M700859o490196
10579A26226817j5906168j8803378j6081145j1494912o961795l422976n15303
10572E3041140J831828L042876K343161n91093m918245q233775r243206q215326
10564B9057360o454732m759289l456464k494653j912701j518304j224124q48111
10556F388982p38854n48416l90530l49463m48040l24756l22102l27874k46952
10547B691995k66486j44030j08868j44344j24416o8126k8908j54102j30884q3909
$$ plain form
10537 1437922 1333091 1267262 1273832 1231013 1129914 1076393 1042907 1035165 920563 881993 847850
10526 847850 843504 822042 842082 762385 700144 633283 598680 613101 599575 571207 566368 627396
10514 627396 600587 468427 374211 356077 417853 502627 487328 536236 478623 406050 392615
10503 392615 316807 363790 414837 372709 317166 267314 312825 400496 429116 486048 424648
10492 424648 297130 202160 231917 238460 227997 239388 284629 275970 239767 227647 262937 288651
10480 288651 300854 362854 446259 427528 418038 322981 209871 155369 145619 189757 232157 174379
10468 174379 118022 100158 115715 235979 235111 161241 177950 168742 175848 191806 202318 264154
10456 264154 231130 283280 317955 309709 276432 354531 372666 349512 325496 219880 224258 173928
$$ packed form
10537A437922j04831o5829O570m2819j01099n3521l3486p742j14602l8570l4143
10526H47850m346k1462K0040p9697o2241o6861l4603J4421j3526k8368m839O1028
10514F27396k6809j32160r4216j8134O1776Q4774j5299M8908n7613p2573j3435
10503C92615p5808M6983N1047m2128n5543m9852M5511Q7671K8620N6932o1400
10492D24648j27518r4970K9757O543j0463J1391M5241q659l6203j2120L5290K5714
10480B88651J2203O2000Q3405j8731r490r5057j13110n4502r750M4138M2400n7778
10468A74379n6357j7864J5557J20264q68p3870J6709r208P106J5958J0512O1836
10456B64154l3024N2150L4675q246l3277P8099J8135k3154k4016j05616M378n0330
$$ plain form
10444 173928 144240 198920 313345 298795 303405 247281 193161 157448 133133 238083 247455
10433 247455 223158 152689 132334 77285 104521 135766 182736 220231 255297 216333 152537
10422 152537 142484 127455 96691 123972 89572 43137 9300 -91615 -36637 17964 12125
10411 12125 -61893 -104772 -119262 -174363 -220233 -174735 -242465 -233450 -102149 43592 76597
10400 76597 65608 48760 46046 28673 31113 13049 -35585 -117761 -66668 17228 56463 114167
10388 114167 49805 49988 41088 21658 52848 81288 91691 48600 68126 60651 -8991 -14806
10376 -14806 -67132 -60743 23992 38173 47229 110224 172157 134667 60826 10070 51735 94882
10364 94882 102204 199139 264269 216810 245897 276861 274843 258188 227931 182683 192162 159934
$$ packed form
10444A73928k9688N4680J14425j4550M610n6124n4120l5713k4315J04950R372
10433B47455k4297p0469k0355n5049K7236L1245M6970L7495L5066l8964o3796
10422A52537j0053j5029l0764K7281l4400m6435l3837j00915N4978N4601n839
10411A2125p4018m2879j4490n5101m5870M5498o7730R015J31301J45741L3005
10400G6597j0989j6848k714j7373K440j8064m8634q2176N1093Q3896L9235N7704
10388A14167o4362J83q900j9430L1190K8440J0403m3091J9526p475o9642n815
10376a4806n2326O389Q4735J4181R056O2995O1933l7490p3841n0756M1665M3147
10364I4882P322R6935O5130m7459K9087L0964k018j6655l0257m5248R479l2228
$$ plain form
10352 159934 29950 -54224 -81229 -4979 74727 143983 138277 109951 133988 161752 139964
10341 139964 76608 25567 36557 53978 48032 43126 73355 103819 49915 38076 -39162 9302
10329 9302 66782 71905 45065 98770 82744 96829 104285 150874 112335 -15930 -96286 -87065
10317 -87065 -48151 -9605 70423 161197 142375 162496 216996 167724 43390 -40857 -1009
10306 -1009 -68329 -104964 -20381 103130 -29964 -108735 -38413 60223 46682 46324 14805 -21003
10294 -21003 -84840 -103269 -95415 -22573 12072 61434 38106 76103 65036 10991 -92145 -144839
10282 -144839 -79511 3715 35076 62801 26401 -38427 -71158 -36117 -36424 -71184 -32216 -63756
10270 -63756 -68003 -34678 -51612 -79674 -97397 -37080 -4720 -8903 -68587 -42247 -3966 10554
$$ packed form
10352A59934j29984q4174k7005P6250P9706O9256n706k8326K4037K7764k1788
10341A39964o3356n1041J0990J7421n946m906L0229L0464n3904j1839p7238M8464
10329I302N7480N123k6840N3705j6026J4085P456M6589l8539j28265q0356R221
10317h7065L8914L8546Q0028R0774j8822K0121N4500m9272j24334q4247L9848
10306a009o7320l6635Q4583J23511j33094p8771P0322R8636j3541l58l1519l5808
10294b1003o3837j8429P854P2842L4645M9362k3328L7997j1067n4045j03136n2694
10282a44839O5328Q3226L1361K7725l6400o4828l2731L5041l07l4760L8968l1540
10270f3756m247L3325j6934k8062j7723O0317L2360m183n9684K6340L8281J4520
$$ plain form
10258 10554 24272 6014 -15439 -46676 -35748 -67519 -87428 -40220 -30757 -15179 37663 -10166
10246 -10166 -44783 -63479 -151487 -202984 -249846 -194085 -115859 -103271 -108592 -50227 18197 2669
10234 2669 16994 57353 -45760 -24152 -27652 -45042 -51733 -55965 5335 -38345 -61291 -1655
10222 -1655 -23187 -18293 -18740 -48079 -42118 -63572 -41444 -35169 -35742 -23505 -10420 55878 50058
10209 50058 -8087 20193 108625 151835 92918 111554 158996 169143 145165 85588 102108 54172
10197 54172 9692 62907 104989 147459 160941 154531 155205 123814 63065 53077 67268 10166
10185 10166 95717 207584 212414 259799 283678 280192 262307 250417 221248 206551 207153 171632
10173 171632 189065 220540 386067 541761 640203 774799 793902 706745 588705 488360
$$ packed form
10258A0554J3718j8258k1453l1237J0928l1771j9909M7208R463J5578N2842m7829
10246a0166l4617j8696q8008n1497m6862N5761P8226J2588n321N8365O8424j5528
10234B669J4325M0359j03113K1608l500j7390o691m232O1300m3680k2946N9636
10222a655k1532M894m47k9339N961k1454K2128O275n73J2237J3085O6298n820
10209E0058n8145K8280Q8432M3210n8917J8636M7442J0147k3978n9577J6520m7936
10197E4172m4480N3215M2082M2470J3482o410O74l1391o0749r988J4191n7102
10185A0166Q5551J11867M830M7385K3879l486j7885j1890k9169j4697O02l5521
10173A71632J7433L1475J65527J55694R8442J34596J9103q7157j18040j00345
$$ plain form
10163 488360 499399 553697 628766 747531 833498 927263 1032045 1036383 935387 818771 698198
10152 698198 572226 434453 462216 503974 479114 505971 617247 613776 595926 568309 476931
10141 476931 460727 418157 398858 343808 300213 288910 314583 348028 354723 282600 232068 241067
10129 241067 258942 140662 49694 -16264 -37762 -114216 -51277 -12072 39078 69599 44933
10118 44933 47834 -48254 -104460 -42747 -76830 -86590 -21771 -132 29134 14679 -41136 -68252
10106 -68252 -107115 -95816 -75051 -36010 15742 43924 -1737 33556 105474 39554 13144 9989
10094 9989 21678 33534 1692 -38754 -85486 -69515 -73696 -69871 -49245 -156707 -146932 -97690
10082 -97690 -80493 -63853 -44816 10231 -9826 -30755 68996 31983 -740 -2599 44026 -26577
$$ packed form
10163D88360J1039N4298P5069J18765Q5967R3765J04782M338j00996j16616j20573
10152F98198j25972j37773K7763M1758k4860K6857J11276l471j7850k7617r1378
10141D76931j6204m2570j9299n5050m3595j1303K5673L3445O695p2123n0532Q999
10129B41067J7875j18280r0968o5958k1498p6454O2939L9205N1150L0521k4666
10118D4933K901r6088n6206O1713l4083r760O4819K1639K9266j4455n5815k7116
10106f8252l8863J1299K0765L9041N1752K8182m5661L5293P1918o5920k6410l155
10094I989J1689J1856l1842m0446m6732J5971m181L825K0626j07462R775M9242
10082i7690J7197J6640J9037N5047k0057k0929R9751l7013l2723j859M6625p0603
$$ plain form
10070 -26577 9197 -23780 -13039 18207 80865 38909 52937 80832 113041 74486 112744 117185
10058 117185 62991 -15807 -7511 24204 13616 -25999 59554 62840 49540 1803 -4197 21483
10046 21483 25750 -3335 10988 22511 -27950 -61969 22018 54771 25335 -52446 -86205 -16249
10034 -16249 -29251 -108473 -152764 -136878 -71462 -55535 -27530 -113929 -144626 -49487 -111487 -149013
10022 -149013 -109127 -43079 -77792 -156216 -151279 -89586 -58997 -54901 -65683 -104377 -100192 -18797
10010 -18797 -30470 31439 68669 62041 43900 60259 25490 -11430 17953 53409 -15661 -112472
9998 -112472 -124713 -197811 -324844 -321607 -227083 -150027 -179582 -148461 -97909 -40824 3964 33164
9986 33164 -19805 -79234 -76361 -150005 -80073 -64387 -102989 -159971 -218082 -205626 -172933 -92240
$$ packed form
10070b6577L5774l2977J0741L1246O2658m1956J4028K7895L2209l8555L8258M441
10058A17185n4194p8798Q296L1715j0588l9615Q5553L286j3300m7737o000K5680
10046B1483M267k9085J4323J1523n0461l4019Q3987L2753k9436p7781l3759O9956
10034a6249j3002p9222m4291J5886O5416J5927K8005q6399l0697R5139o2000l7526
10022a49013L9886O6048l4713p8424M937O1693L0589M096j0782l8694M185Q1395
10010a8797j1673O1909L7230o628j8141J6359l4769l6920K9383L5456o9070r6811
9998a12472j2241p3098j27033L237R4524P7056k9555L1121N0552N7085M4788K9200
9986C3164n2969n9429K873p3644O9932J5686l8602n6982n8111J2456L2693Q0693
$$ plain form
9974 -92240 24556 -11545 -15663 11019 59707 12540 -14255 66864 125638 69599 22910 70304
9962 70304 47968 -61929 -123547 -93305 -67292 -26805 -10484 -60909 -99088 -21283 -7208 -2490
9950 -2490 13588 1222 18656 -4559 -26735 46339 59807 83637 -28321 -59948 -104629 -27296
9938 -27296 34050 -7962 -100247 -1354 97160 134794 93138 63172 76287 104280 60421 -20705
9926 -20705 -4557 36980 33365 27737 38769 34919 -13180 -8842 33744 -18980 -38412 10580 71638
9913 71638 111882 67939 36089 16242 129623 114820 96858 135234 80497 -27926 -59454
9902 -59454 -65404 -81973 -93967 9064 131904 219957 203867 123917 -21037 -115016 -127446
9891 -127446 -122668 -56543 -11266 14183 -11260 -24025 -50623 -29300 13768 69756 10496 -41297
$$ packed form
9974i2240J16796l6101m118K6682M8688m7167k6795Q1119N8774n6039m6689M7394
9962G0304k2336j09897o1618L0242K6013M0487J6321n0425l8179P7805J4075M718
9950b490J6078j2366J7434k3215k2176P3074J3468K3830j11958l1627m4681P7333
9938b7296O1346m2012r2285R8893R8514L7634m1656k9966J3115K7993m3859q1126
9926b0705J6148M1537l615n628J1032l850m8099M338M2586n2724j9432M8992O1058
9913G1638M0244m3943l1850j9847J13381j4803j7962L8376n4737j08423l1528
9902e9454n950j6569j1994J03031J22840Q8053j6090p9950j44954r3979j2430
9891a27446M778O6125M5277K5449k5443j2765k6598K1323M3068N5988n9260n1793
$$ plain form
9879 -41297 -92426 -141989 -150739 -164613 -145463 -119846 -40951 -75 8554 -25984 -48093 -55476
9867 -55476 -34759 10293 33474 12378 33886 412 26632 48587 46883 22886 -68545 -70303
9855 -70303 -93349 -170559 -150846 -107184 -61055 -58793 -62182 -56187 -59585 -96630 -117537 -29493 8460
9842 8460 -12625 -5583 -12960 -54462 -65179 15447 -20595 -11256 70600 109384 142357 113748 66394
9829 66394 64120 85350 53098 11380 -75220 -65842 -27462 -42196 -39461 -70384 -90075 -65739
9817 -65739 -38514 -16823 59645 -19109 14854 -45008 -31273 -32125 -12518 25638 26420 -49617 -149479
9804 -149479 -77075 -4731 -20277 -50514 -17784 75452 47108 -8429 -51923 -68283 -69647 -73666
9792 -73666 -126391 -111179 -87170 15862 104360 92886 25166 28546 78390 156321 334765 527392
$$ packed form
9879d1297n1129m9563q750j3874J9150K5617P8895M0876Q629l4538k2109p383
9867e5476K0717M5052K3181k1096K1508l3474K6220K1955j704k3997r1431j758
9855g0303k3046p7210J9713M3662M6129K262l389N995l398l7045k0907Q8044L7953
9842H460k1085P042p377m1502j0717Q0626l6042R339Q1856L8784L2973k8609m7354
9829F6394k274K1230l2252m1718q6600R378L8380j4734K735l0923j9691K4336
9817f5739K7225K1691P6468p8754L3963n9862J3735q52J9607L8156P82p6037r9862
9804a49479P2404P2344j5546l0237L2730R3236k8344n5537m3494j6360j364m019
9792g3666n2725J5212K4009J03032Q8498j1474o7720L380M9844P7931J78444J92627
$$ plain form
9780 527392 556736 496626 373317 336908 195790 81699 -7811 -29237 -20373 -49838 -7474
9769 -7474 50396 86951 95903 82867 77874 15620 -84957 -72669 57425 96543 54433 42844
9757 42844 38505 -3037 58303 -21141 -133728 -95061 -6980 -2775 -78706 -129165 -154792 -182408
9745 -182408 -122321 -54634 -72028 -45449 -38590 -87219 -80327 -71331 -44823 17718 44104 6626
9733 6626 27027 30524 -19100 -58679 -33530 25114 28414 -58168 -17411 -115436 -85996 -43665
9721 -43665 -74066 -26667 -39717 -36965 -92835 -168319 -158279 -127226 -68750 -44862 -54252 -177302
9709 -177302 -128741 -78456 -69962 56509 35806 62430 3748 -50122 -107299 -30224 -15632 -29560
9697 -29560 -5818 63567 88003 144463 136598 122830 146736 116709 -13527 -40984 -18898 -69176
$$ packed form
9780E27392K9344o0110j23309l6409j41118j14091q9510k1426Q864k9465M2364
9769g474N7870L6555Q952j3036m993o2254j00577J2288J30094L9118m2110j1589
9757D2844m339m1542O1340p9444j12587L8667Q8081M205p5931n0459k5627k7616
9745a82408O0087O7687j7394K6579O859m8629O892Q996K6508O2541K6386l7478
9733F626K0401L497m9624l9579K5149N8644L300q6582M0757r8025K9440M2331
9721d3665l0401M7399j3050K752n5870p5484J0040L1053N8476K3888r390j23050
9709a77302M8561N0285Q494J26471k0703K6624n8682n3870n7177P7075J4592j3928
9697b9560K3742O9385K4436N6460p865j3768K3906l0027j30236k7457K2086n0278
$$ plain form
9685 -69176 -83732 -95383 -111949 14841 55748 56978 30184 -66610 -115546 -127568 -8913 26741
9673 26741 -80601 -117702 -103822 -41273 -24451 -46984 -9376 21628 1562 11866 94943 144711
9661 144711 229208 213269 142396 222166 372707 602949 1053334 1635132 1906675 1658858
9651 1658858 1122691 578492 268801 261636 300775 202158 56138 28935 -58363 -109901 -106739
9640 -106739 -48098 -47133 -120298 -145816 -42554 44772 55454 15665 -35361 -124433 -94115 -24913
9628 -24913 -9184 -70856 -105834 -103074 -25445 51171 65324 12734 -1039 63673 57038 -30423
9616 -30423 13484 8327 8005 -10253 -17932 50797 -2536 -105943 -118299 -120332 -128600 -46382 -9437
9603 -9437 -71822 -79287 -86800 -161362 -222940 -208058 -182471 -172422 -175290 -136456 -83367 -65145 -42944
$$ packed form
9685f9176j4556j1651j6566J26790M0907J230k6794r6794m8936j2022J18655L5654
9673B6741j07342l7101J3880O2549J6822k2533L7608L1004k0066J0304Q3077M9768
9661A44711Q4497j5939p0873P9770J50541K30242M50385N81798K71543k47817
9651A658858n36167n44199l09691p165L9139r8617j46020k7203q7298n1538L162
9640a06739N8641R65p3165k5518J03262Q7326J0682l9789n1026q9072L0318O9202
9628b4913J5729o1672l4978K760P7629P6616J4153n2590j3773O4712o635q7461
9616c0423M3907n157l22j8258p679O8729n3333j03407j2356k033q268Q2218L6945
9603i437o2385p465p513p4562o1578J4882K5587J0049k868L8834N3089J8222K2201
$$ plain form
9590 -42944 -64860 -98147 -95113 24174 73999 -6664 20937 -74 -24094 -14875 21907 -20937
9578 -20937 -48435 380 35265 5236 -25702 -3723 29144 6112 -3818 91971 118529 48243
9566 48243 -34354 -52155 -60791 -71896 -43575 41880 103547 73351 55037 69873 62676 -4410
9554 -4410 -65480 -128769 -122684 -124844 -116431 -41327 -77469 -87332 -52099 -68759 -22535 5887 4626
9541 4626 -27468 -49552 -27375 -1614 53360 133691 111315 42536 78064 87605 85859 77823 25531
9528 25531 9453 53320 -62596 -46182 -1538 -28721 -25427 51964 68721 -1489 -94477 -134447
9516 -134447 -126365 -125997 -41409 -1268 -6230 49985 105284 56914 64323 51168 22506 6560 -21290
9503 -21290 24777 41329 -29551 19794 29813 31602 42025 2301 95276 74236 19379 56253
$$ packed form
9590d2944k1916l3287L034J19287M9825q0663K7601k1011k4020R219L6782m2844
9578b0937k7498M8815L4885l0029l0938K1979L2867k3032r930R5789K6558p0286
9566D8243q2597j7801q636j1105K8321Q5455O1667l0196j8314J4836p197o7086
9554d410o1070o3289O085k160Q413P5104l6142r863L5233j6660M6224K8422j261
9541D626l2094k2084K2177K5761N4974Q0331k2376o8779L5528R541j746q036n2292
9528B5531j6078M3867j15916J6414M4644k7183L294P7391J6757p0210r2988l9970
9516a34447Q082L68Q4588M0141m962N6215N5299m8370P409j3155k8662j5946k7850
9503b1290M6067J6552p0880M9345J0019J789J0423l9724R2975k1040n4857L6874
$$ plain form
9491 56253 22098 -10608 -34288 38918 60524 -33865 -49526 -29146 -54616 -24690 59405 49178
9479 49178 -10974 -79249 -87602 -17548 50241 33870 -2855 19908 -58811 -46005 -51129 -129933
9467 -129933 -89472 -71673 -29026 20414 -19678 -56865 29440 112302 153763 161610 89482 74000
9455 74000 84030 99236 215411 245701 149429 118384 73334 78863 12368 75499 86064 40037
9443 40037 24129 -18322 169 34107 -55419 -30495 78349 111204 165962 209031 240751 139915
9431 139915 95964 104509 74483 68883 44649 44679 126702 246402 231942 160741 85724 110256
9419 110256 225691 302248 468470 621419 730027 701113 600082 420654 331595 268764
9409 268764 196678 141327 79384 155451 276516 224262 119992 52506 62278 68481 130261 121925
$$ packed form
9491E6253l4155l2706k3680P3206K1606r4389j5661K0380k5470K9926Q4095j0227
9479D9178o0152o8275q353P0054O7789j6371l6725K2763p8719J2806n124p8804
9467a29933M0461J7799M2647M9440m0092l7187Q6305Q2862M1461P847p2128j5482
9455G4000J0030J5206J16175L0290r6272l1045m5050N529o6495O3131J0565m6027
9443D0037j5908m2451J8491L3938q9526K4924J08844L2855N4758M3069L1720j00836
9431A39915m3951Q545l0026n600k4234L0Q2023J19700j4460p1201p5017K4532
9419A10256J15435P6557J66222J52949J08608k8914j01031j79428q9059o2831
9409B68764p2086n5351o1943P6067J21065n2254j04270o7486R772O203O1780q336
$$ plain form
9397 121925 118293 112298 139604 169402 184146 160967 206055 223255 250444 192743 75769 73162
9385 73162 54802 113792 106066 106464 83216 59599 107485 164737 160278 260844 291297 315872
9373 315872 359438 299522 197665 6802 26771 90052 165401 130706 119052 177623 194561
9362 194561 165143 148723 148863 76555 10248 -28384 25496 -26660 -41581 -68260 -57854 -5134
9350 -5134 19718 36923 47910 94832 125623 111906 22597 -33875 -59390 -23462 41738 56480
9338 56480 86982 23295 -81544 -36752 -9672 -12579 12330 58310 38190 10941 97638 147773
9326 147773 125113 82391 98865 119521 66626 26359 4223 -40886 -59106 -73947 -34765 -73217
9314 -73217 -99421 -189394 -90422 30040 -22724 -110100 -190139 -166337 -97087 6108 55299
$$ packed form
9397A21925l632n995K7306K9798J4744k3179M5088J7200K7189n7701j16974k607
9385G3162j8360N8990p726L98k3248k3617M7886N7252m459J00566L0453K4575
9373C15872M3566n9916j01857j90863J9969O3281P5349l4695j1654N8571J6938
9362A94561k9418j6420J40p2308o6307l8632N3880n2156j4921k6679J0406N2720
9350e134K4852J7205J0987M6922L0791j3717q9309n6472k5515L5928O5200J4742
9338E6480L0502o3687j04839M4792K7080k907K4909M5980k0120k7249Q6697N0135
9326A47773k2660m2722J6474K0656n2895m0267k2136m5109j8220j4841L9182l8452
9314g3217k6204q9973R8972J20462n2764q7376q0039K3802O9250J03195M9191
$$ plain form
9303 55299 19337 -7416 -37093 -163159 -162728 -70081 -50076 4636 36511 -8956 -16872 -20206
9291 -20206 17246 32897 -2214 -17293 -39847 11509 109335 103296 16109 -109020 -84476 -49550
9279 -49550 -9432 20494 44898 25649 -7843 -29600 -62261 -34276 -46386 -32554 -136034 -160254
9267 -160254 -54327 -47861 -21710 51008 26962 74886 83102 67975 88312 46287 -43329 -2383
9255 -2383 35456 18724 42472 -32634 -88828 -5702 153799 206033 193330 119025 11365 -15452
9243 -15452 -50026 -855 29538 -44326 11878 21854 -22746 -41947 21442 293 -19941 -35899
9231 -35899 -15831 7234 85919 111445 54095 -3869 25773 -31890 -38128 76125 90384 44074
9219 44074 50651 -12299 18974 106221 6278 -101365 -148022 -115032 -90306 -55529 -21975 -48754
$$ packed form
9303E5299l5962k6753k9677j26066M31R2647K0005N4712L1875m5467p916l334
9291b0206L7452J5651l5111j5079k2554N1356R7826o039q7187j25129K4544L4926
9279d9550M0118K9926K4404j9249l3492k1757l2661K7985j2110J3832j03480k4220
9267a60254J05927O466K6151P2718k4046M7924Q216j5127K0337m2025q9616M0946
9255b383L7839j6732K3748p5106n6194Q3126J59501N2234j2703p4305j07660k6817
9243a5452l4574M9171L0393p3864N6204R976m4600j9201O3389k1149k0234j5958
9231c5899K0068K3065P8685K5526n7350n7964K9642n7663o238J14253J4259m6310
9219D4074O577o2950L1273Q7247r9943j07643m6657L2990K4726L4777L3554k6779
$$ plain form
9207 -48754 -50072 -7049 -10704 -11347 -26650 -83369 -71108 30184 40166 -29395 1762 -11300 -23667
9194 -23667 -24378 44003 69811 45769 8233 82298 69161 38972 -18867 -73010 -50046 -14168
9182 -14168 -14880 -21166 -28173 42198 46232 -52004 -26458 -62660 -108315 -98577 -110763 -42220 -50014
9169 -50014 -54042 43605 79414 60474 11 -28798 -33861 -34550 -68135 -126947 -25036 -11027
9157 -11027 -81320 -59049 -80422 -82848 -117245 -25444 -48395 -67063 -49472 -45716 -112101 -97848
9145 -97848 -129943 -54799 -38320 -38662 9650 15173 -46278 -84359 -73003 69449 163143 213547
9133 213547 135612 84758 59645 47234 20914 -34501 -69706 -5394 21167 1350 -8078 -39240
9121 -39240 4235 -20913 -29889 -18035 43228 41684 -21947 -75997 -33754 -42451 12211 -755
$$ packed form
9207d8754j318M3023l655o43j5303n6719J2261J01292R982o9561L1157j3062j2367
9194b3667p11O8381K5808k4042l7536P4065j3137l0189n7839n4143K2964L5878
9182a4168p12o286p007P0371M034r8236K5546l6202m5655R738j2186O8543p794
9169e0014m028R7647L5809j8940o0463k8809n063o89l3585n8812J01911J4009
9157a1027p0293K2271k1373k426l4397R1801k2951j8668J7591L756o6385J4253
9145i7848l2095P5144J6479l42M8312N523o1451l8081J1356J42452R3694N0404
9133B13547p7935n0854k5113j2411k6320n5415l5205O4312K6561j9817r428l1162
9121c9240M3475k5148q976J1854O1263j544o3631n4050M2243q697N4662j2966
$$ plain form
9109 -755 -55218 -69437 -5316 37068 -37237 -94883 -84872 -38896 -29785 37283 10066 19800 47694
9096 47694 79450 93255 94545 32921 -21403 -46609 -10643 47954 152792 135094 69446 -34354
9084 -34354 -122596 -129611 -66743 44507 40944 -65099 -35644 -32687 -14309 18483 -1608 34827
9072 34827 2187 1975 -78619 -114044 -64228 44861 127147 87655 41096 37676 2811 -23501
9060 -23501 9693 28677 73137 89312 56903 69461 8312 39468 25306 24267 36209 59947
9048 59947 26306 -10843 21216 30567 23791 5406 -26487 -11701 4001 14414 -33000 -76004
9036 -76004 -81998 -98298 -125322 -37545 10507 49161 67654 912 5698 -18348 14011 34702
9024 34702 23623 44066 38673 18673 -5860 18974 -11528 4158 61166 122611 44757 40470
$$ packed form
9109g55n4463j4219O4121M2384p4305n7646J0011M5976R111O7068k7217R734K7894
9096D7694L1756J3805J290o1624n4324k5206L5966N8597J04838j7698o5648j03800
9084c4354q8242p015O2868J11250l563j06043K9455K957J8378L2792k0091L6435
9072C4827l2640k12q0594l5425M9816J09089Q2286l9492m6559l420l4865k6312
9060b3501L3194J8984M4460J6175l2409J2558o1149L1156j4162j039J1942K3738
9048E9947l3641l7149L2059R351o776j8385l1893J4786J5702J0413m7414m3004
9036g6004n994j6300k7024Q7777M8052L8654J8493o6742M786k4046L2359K0691
9024C4702j1079K0443n393k0000k4533K4834l0502J5686N7008O1445p7854m287
$$ plain form
9012 40470 51291 -28748 101851 95309 96124 134954 137636 77925 98333 142360 33097 3270
9000 3270 -32035 -41761 -59264 -79742 -62593 53696 91801 12379 -40984 -37530 -125983 -137381
8988 -137381 -62711 -5215 24640 15072 8425 21682 107474 149464 157732 169503 166551 83755
8976 83755 12284 -11839 26643 39559 46183 11276 25328 39789 63495 -10063 -114581 -174046
8964 -174046 -87014 2055 -68142 -112932 49748 102047 -32524 -36359 54366 57593 -46815
8953 -46815 -46440 79884 126713 104729 19958 -22593 4283 13922 16131 21933 43609 21399 -13177
8940 -13177 -45114 -5272 -57186 -55174 20119 42559 -36150 6984 52513 -13214 -21040 -5774
8928 -5774 -78762 -36703 -53229 -63870 -96321 -73977 -16063 23585 43489 -27758 -89516 -12391
$$ packed form
9012D0470J0821q0039J30599o542Q15L8830K682n9711K0408M4027j09263k9827
9000C270l5305r726j7503k0478J7149J16289L8105p9422n3363L454q8453j1398
8988a37381P4670N7496K9855r568o647J3257Q5792M1990Q268J1771k952q2796
8976H3755p1471k4123L8482J2916O624l4907J4052J4461K3706p3558j04518n9465
8964a74046Q7032Q9069p0197m4790J62680N2299j34571l835R0725L227j04408
8953d6815L75J26324M6829k1984q4771m2551K6876R639K209N802K1676k2210l4576
8940a3177l1937L9842n1914K012P5293K2440p8709M3134M5529o5727p826J5266
8928e774p2988M2059j6526j0641l2451K2344N7914L9648J9904p1247o1758P7125
$$ plain form
8916 -12391 129173 60480 28315 60022 2068 30006 -51024 -90795 -19376 8569 116480
8905 116480 158238 172488 199055 193219 93583 64637 94200 59417 35050 13683 44192 39673
8893 39673 2355 55330 8792 5203 28035 -13546 -109349 -60569 -33638 -81164 -36548 50658
8881 50658 71467 50924 43900 114113 35455 34162 6428 -31621 33157 60316 18223 -26760
8869 -26760 50794 123815 144593 93467 116867 115545 56787 4776 16114 20525 23223 -44940
8857 -44940 9567 42709 8198 -6398 -45661 4222 46974 44360 53463 57529 120808 167955
8845 167955 80104 47145 44162 -5134 -5138 40089 -6964 13658 -12664 -60872 -1437 1152 49551
8832 49551 35021 21504 56646 85410 -12945 -78627 -94695 36426 -6610 -9060 50126 106760
$$ packed form
8916a2391J41564o8693l2165L1707n7954K7938q1030l9771P1419K7945J07911
8905A16480M1758J4250K6567n836r9636k8946K9563l4783k4367k1367L0509m519
8893C9673l7318N2975m6538l589K2832m1581r5803M8780K6931m7526M4616Q7206
8881E0658K0809k0543p024P0213p8658j293k7734l8049O4778K7159m2093m4983
8869b6760P7554P3021K0778n1126K3400j322n8758n2011J1338M411K698o8163
8857d4940N4507L3142l4511j4596l9263M9883M2752k614R103M066O3279M7147
8845A67955q7851l2959k983m9296mM5227m7053K0622k6322m8208N9435K589M8399
8832D9551j4530j3517L5142K8764r8355o5682j6068J31121m3036k450N9186N6634
$$ plain form
8820 106760 73136 61728 21254 -3992 -36779 4276 79459 59331 -1822 -32165 44988 125915
8808 125915 127445 58629 25200 32874 128606 187692 134989 73259 121678 171913 130261 63236
8796 63236 57163 38038 9258 -17219 -126933 -47887 44824 68439 28311 56099 78248 105687
8784 105687 142028 128332 99009 25605 -17221 25738 39639 -37512 -41636 62549 112369 21203
8772 21203 42443 42569 18705 62229 56466 96305 185638 189689 155605 107395 68979 42389 30425
8759 30425 60983 83381 57272 41839 17823 41017 -775 -100599 -47094 83771 136293 186973
8747 186973 182021 165973 253035 278790 228766 163442 54638 64272 -4159 -61560 -43510 -24501
8735 -24501 61734 76490 95701 78504 125114 116638 116431 15646 -36696 -24193 58172 100981
$$ packed form
8820A06760l3624j1408m0474k5246l2787M1055P5183k0128o1153l0343P7153Q0927
8808A25915J530o8816l3429P674R5732N9086n2703o1730M8419N0235m1652o7025
8796F3236o073j9125k8780k6477j09714P9046R2711K3615m0128K7788K2149K7439
8784A05687L6341j3696k9323p3404m2826M2959J3901p7151m124J04185M9820r1166
8772B1203K1240J26k3864M3524n763L9839Q9333M051l4084m8210l8416k6590j1964
8759C0425L0558K2398k6109j5433k4016K3194m1792r9824N3505J30865N2522N0680
8747A86973m952j6048Q7062K5755n0024o5324j08804R634o8431n7401J8050J9009
8735b4501Q6235J4756J9211j7197M6610q476k07j00785n2342J2503Q2365M2809
$$ plain form
8723 100981 68252 -13304 -78845 -78065 -75436 -43833 79209 179369 194373 276351 335229 302261
8711 302261 287324 206413 120185 191046 199452 72083 85413 92220 62165 29445 66010 95681
8699 95681 107962 126498 85578 38787 29274 42122 35044 99775 163473 158184 107339 18447
8687 18447 39567 37106 70681 32187 28288 48925 -9693 1229 50339 126728 202402 190812
8675 190812 114185 67731 103452 179405 141518 166534 183012 88465 6705 -48788 -30880 8211
8663 8211 -29204 -10174 17042 35272 67392 18671 -2832 -23045 27686 -3086 -27724 9548
8651 9548 88557 61900 104549 66297 31309 -43732 16939 90744 103245 61263 84110 167125
8639 167125 142759 76967 109998 121642 176353 199376 286898 324840 240441 182466 104281 16646
$$ packed form
8723A00981l2729q1556o5541P80K629L1603J23042J00160J5004Q1978N8878l2968
8711C02261j4937q0911q6228P0861Q406j27369J3330O807l0055l2720L6565K9671
8699I5681J2281J8536m0920m6791r513J2848p078O4731O3698n289n0845q8892
8687A8447K1120k461L3575l8494l899K0637n8618J0922M9110P6389P5674j1590
8675A90812p6627m6454L5721P5953l7887K5016J6478r4547q1760n5493J7908L9091
8663H211l7415J9030K7216J8230L2120m8721k1503k0213N0731l0772k4638L7272
8651I548P9009k6657M2649l8252l4988p5041O0671P3805J2501m1982K2847Q3015
8639A67125k4366o5792L3031J1644N4711K3023Q7522L7942q4399n7975p8185q7635
$$ plain form
8627 16646 -70741 -9668 17009 48176 158321 188595 54469 24779 139779 177683 117289
8616 117289 14519 -44958 -1062 101017 129119 98765 45323 -65439 -79395 -28668 27195
8605 27195 47694 -714 20058 55429 53074 191005 268131 255868 204399 143414 157472 172044
8593 172044 163048 216328 238801 193144 204465 96210 39143 56120 136870 138419 129860 98617
8581 98617 26766 32310 108309 117477 105924 41438 109344 119453 53002 19225 -45017 -70910
8569 -70910 6238 50927 105684 58200 7294 -51923 -29667 -32929 18425 12848 56846 105543
8557 105543 70711 -13636 18462 25558 14943 -31040 -102600 -57810 58574 64707 -8368 -78025
8545 -78025 -1472 6161 -10708 13721 64511 55469 11484 31226 156240 141911 210322 259451
$$ packed form
8627A6646q7387O1073K6677L1167J10145L0274j34126k9690J15000L7904o0394
8616A17289j02770n9477M3896J02079K8102l0354n3442j10762j3956N0727N5863
8605B7195K0499m8408K0772L5371k355J37931P7126j2263n1469o0985J4058J4572
8593A72044q996N3280K2473m5657J1321j08255n7067J6977Q0750J549q559l1243
8581I8617p1851N544P5999R168j1553o4486O7906J0109o6451l3777o4242k5893
8569g0910P7148M4689N4757m7484n0906n9217K2256l262N1354n577M3998M8697
8557A05543l4832q4347L2098P096j0615m5983p1560M4790J16384O133p3075o9657
8545g8025P6553P633j6869K4429N0790r042m3985J9742J25014j4329O8411M9129
$$ plain form
8533 259451 186246 151431 135043 82797 106364 142499 45640 50821 93324 93419 141496 152126
8521 152126 144805 165027 153560 119985 120250 7176 55655 195599 238209 201145 93624 17997
8509 17997 12139 52651 27613 53927 120564 235852 253163 231068 244857 249446 198094 224353
8497 224353 241420 205076 118880 63024 70043 119334 188096 281550 298934 238182 198270 181096
8485 181096 141290 39181 36820 85812 137203 159977 116238 108803 68599 -20603 -39975 -44283
8473 -44283 35019 41126 46956 93050 70726 56208 161200 168843 168301 180528 145506 167650 160098
8460 160098 133464 119188 57672 55163 86756 106159 187764 166751 274900 244967 179186 106821
8448 106821 213999 332141 408597 438501 385088 265670 248500 281681 283335 233734 238227
$$ packed form
8533B59451p3205l4815j6388n2246K3567L6135r6859N181M2503R5M8077J0630
8521A52126p321K0222j1467l3575K65j13074M8479J39944M2610l7064j07521p5627
8509A7997n858M0512k5038K6314O6637J15288J7311k2095J3789M589n1352K6259
8497B24353J7067l6344q6196n5856P019M9291O8762R3454J7384o0752l9912j7174
8485A81096l9806j02109k361M8992N1391K2774m3739p435m0204q9202j9372m308
8473d4283P9302O107N830M6094k2324j4518J04992P643n42J2227l5022K2144p552
8460A60098k6634j4276o1516k509L1593J9403Q1605k1013J08149k9933o5781p2365
8448A06821J07178J18142P6456K9904n3413j19418j7170L3181J654m9601M493
$$ plain form
8437 238227 237334 220333 250540 187282 243385 221466 157379 75674 67774 102310 181358 269643
8425 269643 277436 175465 145978 136516 181289 164662 182756 282248 251812 184029 104034 92420
8413 92420 83889 50140 141361 153937 160510 183223 216203 212366 245235 175721 67748 55144
8401 55144 31681 73827 69550 150413 183091 176463 197679 122129 53417 19903 89978 164155
8389 164155 217371 234989 194700 189083 99287 124745 144508 174518 214202 234979 230770 165512
8377 165512 175916 166271 97925 89866 150062 118024 58059 97742 37499 -27003 17155 55956
8365 55956 98464 106767 -13585 -51596 44375 108588 112277 156738 147182 167662 153237 160905
8353 160905 274642 278263 213894 178499 131346 148849 220412 219853 164431 189794 230062 182762
$$ packed form
8437B38227q93j7001L0207o3258N6103k1919o4087q1705p900L4536P9048Q8285
8425B69643P793j01971k9487r462M4773j6627J8094R9492l0436o7783p9995j1614
8413I2420q531l3749R1221J2576O573K2713L2980l837L2869o9514j07973j2604
8401E5144k3463M2146m277Q0863L2678o628K1216p5550o8712l3514P0075P4177
8389A64155N3216J7618m0289n617q9796K5458J9763L0010L9684K0777m209o5258
8377A65512J0404r645o8346q059O0196l2038n9965L9683o0243o4502M4158L8801
8365E5956M2508Q303j20352l8011R5971O4213L689M4461r556K0480j4425P668
8353A60905J13737L621o4369l5395m7153J7503P1563n59n5422K5363M0268m7300
$$ plain form
8341 182762 175589 232685 246951 173155 100101 67076 97182 130581 232252 328084 273025 237208
8329 237208 300133 323483 220078 96880 103032 170885 190579 220951 321096 369141 302589
8318 302589 293723 217233 159654 159661 149765 164597 165825 129427 150475 224777 212399 159893 116755
8305 116755 67292 129471 159309 195688 266038 170039 211894 236668 263491 318927 286722 203179
8293 203179 252576 321242 327538 335155 375289 378586 328748 315782 280162 215763 221960 193136
8281 193136 201868 231065 171308 135731 168404 145495 167733 84382 57065 69142 107657 160171
8269 160171 167698 161875 147455 158865 209217 199668 140807 94041 57905 104983 171109 247533
8257 247533 203401 180864 197287 183153 162680 91123 157215 163222 121019 184895 203044 173130
$$ packed form
8341A82762p173N7096J4266p3796p3054l3025L0106L3399J01671R5832n5059l5817
8329B37208O2925K3350j03405j23198O152O7853J9694L0372J00145M8045o6552
8318C02589q866p6490n7579Pr896J4832J228l6398K1048P4302j2378n2506m3138
8305A16755m9463O2179K9838L6379P0350r5999M1855K4774K6823N5436l2205q3543
8293B03179M9397O8666O296P617M0134L297m9838j2966l5620o4399O197k8824
8281A93136Q732K9197n9757l5577L2673k2909K2238q3351k7317J2077L8515N2514
8269A60171P527n823j4420J1410N0352r549n8861m6766l6136M7078O6126P6424
8257B47533m4132k2537J6423j4134k0473p1557O6092O007m2203O3876J8149k9914
$$ plain form
8245 173130 162548 203214 134322 41508 62570 147156 285844 195919 99442 176129 223386
8234 223386 211085 234511 96513 10446 75054 144454 145213 141624 92472 53781 116263 118565
8222 118565 121215 168862 167980 123072 182307 206414 301720 256426 295172 325878 274170 212103
8210 212103 239251 259385 245585 199979 223221 207507 222376 229904 214898 248682 287539 324097
8198 324097 308570 155649 107088 126555 120954 164066 201833 250127 287298 217016 150017 229928
8186 229928 295473 347435 357171 315782 250193 182814 203388 233563 248401 269377 209794 157614
8174 157614 244375 288480 288065 235616 126719 119283 85284 103425 121807 87713 136157 201959
8162 201959 297645 322539 301094 212808 248609 279845 252476 186845 105345 161986 132937 90895
$$ packed form
8245A73130j0582M0666o8892r2814K1062Q4586J38688q9925r6477P6687M7257
8234B23386j2301K3426j37998q6067O4608O9400P59l589m9152l8691O2482K302
8222A18565K650M7647q82m4908N9235K4107R5306m5294L8746L0706n1708o2067
8210B12103K7148K0134j3800m5606K3242j5714J4869P528j5006L3784L8857L6558
8198C24097j5527j52921m8561J9467n601M3112L7767M8294L7171p0282o6999P9911
8186B29928O5545N1962R736m1389o5589o7379K0574L0175J4838K0976n9583n2180
8174A57614Q6761M4105m15n2449j08897p436l3999J8141J8382l4094M8444O5802
8162B01959R5686K4894k1445q8286L5801L1236k7369o5631q1500N6641k9049m2042
$$ plain form
8150 90895 84391 25793 -22644 -25239 8056 28595 58504 173173 190870 177984 271836 265976
8138 265976 170224 138351 98316 143794 189568 192740 164689 184809 206268 132537 59392 121459
8126 121459 107557 88614 67709 37377 93224 159904 190612 235778 229904 197612 202122 164135
8114 164135 120011 75305 75392 89971 45340 5276 -73104 9478 178948 241550 254981 275728
8102 275728 246014 120234 15146 57017 18975 -15529 -21458 -9408 46918 110052 92650
8091 92650 67538 120994 116622 70718 105884 52319 21725 25810 127567 255859 284262 199133
8079 199133 155866 131302 210860 222707 148312 127051 115148 40693 -26445 49408 72490 106029
8067 106029 131946 189218 234635 196067 197004 203272 202125 272814 332235 297827 215844 176517
$$ packed form
8150I0895o504n8598m8437k595L3295K0539K9909J14669J7697j2886R3852n860
8138B65976r5752l1873m0035M5478M5774L172k8051K0120K1459p3731p3145O2067
8126A21459j3902j8943k0905l0332N5847O6680L0708M5166n874l2292M510l7987
8114A64135m4124m4706Q7J4579m4631m0064p8380Q2582J69470O2602J3431K0747
8102B75728k9714j25780j05088M1871l8042l4504n929J2050N6326O3134j7402
8091I2650k5112N3456m372m5904L5166n3565l0594M085J01757J28292K8403q5129
8079A99133m3267k4564P9558J1847p4395k1261j1903p4455o7138P5853K3082L3539
8067A06029K5917N7272M5417l8568R37O268j147P0689N9421l4408q1983l9327
$$ plain form
8055 176517 195214 160938 90526 59537 104023 98055 169297 191303 200659 146191 96517 86478
8043 86478 117257 90937 96978 182530 130246 41809 75868 154959 158691 94588 64987 89621
8031 89621 98568 86188 119349 92577 -595 -26094 2606 156945 211812 267373 195014 99365
8019 99365 115834 114522 127488 156126 188971 148784 171904 163926 169267 215076 185458 95471
8007 95471 59629 126383 191445 198546 193621 191148 125823 121075 149226 100815 58706 145062 187813
7994 187813 170976 128568 136015 21346 -69034 1136 38676 -1868 20686 2596 58636 48243
7982 48243 23126 52557 63557 69821 77842 169688 250572 112670 53188 43788 15586 85371
7970 85371 44883 25113 130750 142253 157907 189220 159974 153917 91326 29639 24664 64716
$$ packed form
8055A76517J8697l4276p0412l0989M4486n968P1242K2006R356n4468m9674j0039
8043H6478L0779k6320O041Q5552n2284q8437L4059P9091L732o4103k9601K4634
8031H9621Q947j2380L3161k6772r3172k5499K8700J54339N4867N5561p2359r5649
8019I9365J6469j312J2966K8638L2845m0187K3120p978N341M5809k9618q9987
8007I5471l5842O6754O5062P101m925k473o5325m748K8151m8411m2109Q6356M2751
7994A87813j6837m2408P447j14669r0380P0170L7540m0544K2554j8090N6040j0393
7982D8243k5117K9431J1000O264Q021R1846Q0884j37902n9482r400k8202O9785
7970H5371m0488j9770J05637J1503J5654L1313k9246o057o2591o1687m975M0052
$$ plain form
7958 64716 82264 60363 56026 23826 25926 -18008 -2511 63757 99964 67950 93759 75750
7946 75750 38214 30316 41529 -3185 -55918 -74941 -114404 -20564 68115 43681 -58272 -108188
7934 -108188 -4008 82784 26949 -42552 16611 572 -43200 3951 51930 9699 -61460
7923 -61460 -22142 13688 -16367 -26746 -29679 13077 -22278 -44142 23722 52102 64536 66050
7911 66050 103680 63608 22054 -13164 -55949 1658 6157 -317 -28578 -59133 14586 45892
7899 45892 -10098 -44522 -61214 -22170 -20390 -70684 -101180 -203383 -205260 -151740 -143825 -130773
7887 -130773 -84762 -63065 -114477 -28154 74848 77694 171619 215219 146980 154511 141416 87962
7875 87962 29339 34360 92075 116892 98799 27583 -30351 -99702 -118418 -112826 -81159 -15268
$$ packed form
7958F4716J7548k1901m337l2200K100m3934J5497O6268L6207l2014K5809j8009
7946G5750l7536p898J1213m4714n2733j9023l9463R3840Q8679k4434j01953m9916
7934a08188J04180Q6792n5835o9501N9163j6039m3772M7151M7979m2231p1159
7923f1460L9318L5830l0055j0379k933M2756l5355k1864O7864K8380J2434J514
7911F6050L7630m0072m1554l5218m2785N7607M499o474k8261l0555P3719L1306
7899D5892n5990l4424j6692L9044J780n0294l0496j02203j877N3520P915J3052
7887a30773M6011K1697n1412Q6323J03002K846R3925M3600o8239P531j3095n3454
7875H7962n8623N021N7715K4817j8093p1216n7934o9351j8716N592L1667O5891
$$ plain form
7863 -15268 -44799 -28723 -63004 -104546 -82709 -4497 92714 50356 44512 -2226 66363 65137
7851 65137 -9669 -114857 -165413 -76945 -33925 46203 93018 87642 -55831 -57677 -19013 26839
7839 26839 -51217 -70635 -47644 -146617 -132867 -113384 -111234 -130265 -72958 -53063 -33289 -7758
7827 -7758 -34822 -58497 -16135 2247 35669 58807 100600 50093 -36251 -117451 -79745 -109652
7815 -109652 -72184 -79186 -67851 1309 74096 22297 -31187 -29585 -30797 -18097 19059 48226
7803 48226 -20314 29605 65835 37810 -7617 -27596 1442 -32068 -50324 9580 8649 -10807
7791 -10807 -21982 11961 55215 -18362 -82557 -4421 15079 72348 102557 61065 31523 19873
7779 19873 37510 79530 90825 114966 58524 28272 -5985 -5008 -1249 9668 -37283 -131714
$$ packed form
7863a5268k9531J6076l4281m1542K1837P8212R7211m2358n844m6738O8589j226
7851F5137p4806j05188n0556Q8468M3020Q0128M6815n376j43473j846L8664M5852
7839B6839p8056j9418K2991r8973J3750J9483K150j9031N7307J9895J9774K5531
7827g758k7064k3675M2362J8382L3422K3138M1793n0507q6344q1200L7706k9907
7815a09652L7468p002J1335O9160P2787n1799n3484J602j212J2700L7156K9167
7803D8226o8540M9919L6230k8025m5427j9979K9038l3510j8256N9904r31j9456
7791a0807j1175L3943M3254p3577o4195P8136J9500N7269L0209m1492k9542j1650
7779A9873J7637M2020J1295K4141n6442l0252l4257R77L759J0917m6951r4431
$$ plain form
7767 -131714 -123950 -149510 -116689 -63671 1616 29594 -54245 -105134 -43707 -51114 -89671 -93938
7755 -93938 -110969 -106504 -72136 -44341 -54958 -19890 22693 -4832 11363 3186 20506 7787
7743 7787 -58912 33264 -14526 -73480 -125251 -65916 -63250 -2001 52524 1730 -72803 -133815
7731 -133815 -111265 -83402 -115427 -94960 -111669 605 84916 129033 145540 130875 76519
7720 76519 24013 28620 -41280 -112070 -65943 -47961 -87784 -119838 -65922 6426 -27054 -96295
7708 -96295 -99247 -68507 36679 84972 70937 33640 13166 18589 38707 60499 76450 67397
7696 67397 63485 64707 34132 -25569 19599 13539 -23545 -11520 13781 -29009 -698 13678
7684 13678 62105 64422 14667 3419 24170 57532 123584 152948 67573 -43478 600 -19400
$$ packed form
7767a31714P764k5560L2821N3018O5287K7978q3839n0889O1427p407l8557m267
7755i3938j7031M465L4368K7795j0617L5068M2583k7525J6195q177J7320j2719
7743G787o6699R2176m7790n8954n1771N9335K666O1249N4525n0794p4533o1012
7731a33815K2550K7863l2025K0467j6709J12274Q4311M4117J6507j4665n4356
7720G6519n2506M607o9900p0790M6127J7982l9823l2054N3916P2348l3480o9241
7708i6295k952L0740J05186M8293j4035l7297k0474N423K0118K1792J5951r053
7696F7397l912J222l0575n9701M5168o060l7084J2025K5301m2790K8311J4376
7684A3678M8427K317m9755j1248K0751L3362O6052K9364q5375j11051M4078k0000
$$ plain form
7672 -19400 -12068 39542 -25992 -28255 41092 72498 58441 -1235 -10682 -86268 -50251 23853
7660 23853 16570 87108 135018 140172 137919 176567 151568 88470 75770 75506 59278 55187 -16012
7647 -16012 -91219 -71656 -7469 -84926 -147571 -155120 -104286 -108374 -145005 -86800 -59373 -21003
7635 -21003 19202 51493 47422 60442 85194 78086 81857 156659 68680 -22695 51114 112145
7623 112145 104075 16701 -10264 -46467 34954 30626 55582 75960 35519 20105 81648 4065
7611 4065 -31084 -11396 -131630 -79078 37589 3726 34554 20414 13012 -29629 -107700 -97021
7599 -97021 45887 40772 11864 17407 59447 106850 150001 60202 3497 98956 90156 41712
7587 41712 -60589 -95831 -36318 -23491 -39426 -42534 -99483 -120522 -47510 17136 18722 28962
$$ packed form
7672a9400P332N1610o5534k263O9347L1406j4057n9676r447p5586L6017P4104
7660B3853p283P0538M7910N154k253L8648k4999o3098j2700k64j6228m091p1199
7647a6012p5207J9563O4187p7457o2645p549N0834m088l6631N8205K7427L8370
7635b1003M0205L2291m071J3020K4752p108L771P4802q7979r1375P3809O1031
7623A12145q070q7374k6965l6203Q1421m328K4956K0378m0441j5414O1543p7583
7611D065l5149J9688j20234N2552J16667l3863L0828j4140p402m2641p8071J0679
7599i7021J42908n115k8908N543M2040M7403M3151q9799n6705R5459q800m8444
7587D1712j02301l5242N9513J2827j5935l108n6949k1039P3012O4646J586J0240
$$ plain form
7575 28962 34399 -17653 -17733 -27970 10809 -42991 -46777 -65256 -111843 -156428 -88521 31973 -97594
7562 -97594 -139859 -47709 -20431 -28886 -9357 52996 90159 81125 26903 34686 15452 -86460
7550 -86460 29146 99826 47469 35310 26134 2734 -45271 1557 48950 75149 38051 23593
7538 23593 -27692 -39361 -42869 47928 26452 56718 117588 130946 132786 100142 -11254 -37912
7526 -37912 28115 38914 112675 58048 -29820 -5805 -46641 -55674 -4420 -2615 13239 -7654
7514 -7654 -15772 -8160 -20758 609 -61291 -57755 -89348 -202082 -219288 -193961 -144350 -16702
7502 -16702 147189 134874 72898 20641 27809 45472 81874 20234 -68126 -137788 -162595 -104418
7490 -104418 -42718 -63850 24755 24957 -25098 9829 26543 7102 -21922 -43543 17101 30309
$$ packed form
7575B8962N437n2052q0j0237L8779n3800l786j8479m6587m4585O7907J20494j29567
7562i7594m2265R2150K7278q455J9529O2353L7163r034n4222P783j9234j01912
7550h6460J15606P0680n2357j2159r176k3400m8005M6828M7393K6199l7098j4458
7538B3593n1285j1669l508R0797k1476L0266O0870J3358J840l2644j11396k6658
7526c7912O6027J0799P3761n4627q7868K4015m0836r033N1254J805J5854k0893
7514g654q118P612j2598K1367o1900L536l1593j12734j7206K5327M9611J27648
7502a6702J63891j2315o1976n2257P168J7663L6402o1640q8360o9662k4807N8177
7490a04418O1700k1132Q8605K02n0055L4927J6714j9441k9024k1621O0644J3208
$$ plain form
7478 30309 47881 26620 67036 68840 -26504 -110146 -82177 -87761 -109024 -20113 -12352 -31994
7466 -31994 -56303 -75495 -10379 -55277 -75548 -117631 -156875 -177369 -214390 -214760 -189711 -173054
7454 -173054 -87976 -36415 -102521 -137962 -64071 -122513 -159312 -85095 -33379 -1335 44292 90069
7442 90069 35286 21287 40426 68660 72850 56540 12077 -8402 -62175 -41280 -99587 -137284
7430 -137284 -67896 31940 50336 58698 -9116 -29102 -68119 -38342 11325 -964 12333 -46088
7418 -46088 -88468 -101026 -109398 -22370 1452 109453 156553 99784 136610 156535 74136 31496
7406 31496 65617 28314 -4641 -41829 -8964 70959 -663 -43521 -15192 -13551 10670 -42480
7394 -42480 -39918 -6925 -1922 -60273 -105933 -147920 -132673 -91799 -132558 -180829 -148976 -95506
$$ packed form
7478C0309J7572k1261M0416J804r5344q3642K7969n584k1263Q8911P761j9642
7466c1994k4309j9192O5116m4898k0271m2083l9244k0494l7021l70K5049J6657
7454a73054Q5078N1561o6106l5441P3891n8442l6799P4217N1716L2044M5627M5777
7442I0069n4783j3999J9139K8234M190j6310m4463k0479n3773K0895n8307l7697
7430a37284O9388R9836J8396Q362o7814j9986l9017K9777M9667j2289J3297n8421
7418d6088m2380j2558q372Q7028K3822J08001M7100n6769L6826J9925q2399m2640
7406C1496L4121l7303l2955l7188L2865P9923p1622m2858K8329J641K4221n3150
7394d2480K562L2993N003n8351m5660m1987J5247M0874m0759m8271L1853N3470
$$ plain form
7382 -95506 -100944 -87948 -100951 -73826 -48738 -62512 12804 121526 173548 156393 144515 87266
7370 87266 59564 16514 4088 -21030 -8482 -700 -29118 -32156 -68333 -29792 4200 32328
7358 32328 15890 -85668 -82885 21758 -4039 -53869 27890 66011 22411 24067 49896 -28526
7346 -28526 -71165 -13333 68911 200599 172820 52964 28319 16053 -1127 -30830 -74150
7335 -74150 -122948 -136656 -109146 -68443 46574 59899 26002 23538 56664 126928 84788 41290
7323 41290 14494 4312 14398 -14252 13182 52296 66420 38033 -5905 -49110 -64394 -145202
7311 -145202 -203221 -213254 -183513 -132242 -151013 -121245 -60123 -65616 1375 13683 -3327 -31910
7299 -31910 -57243 -40283 -16069 -53634 -71597 -85353 -53333 27475 2744 -643 -23957 -72506
$$ packed form
7382i5506n438J2996j3003K7125K5088j3774P5316J08722N2022j7155j1878n7249
7370H7266k7702m3050j2426k5118J2548P782k8418l038l6177L8541L3992K8128
7358C2328j6438j01558K783J04643k5797m9830Q1759L8121m3600J656K5829p8422
7346b8526m2639N7832Q2244J31688k7779j19856k4645j2266j7180k9703m3320
7335g4150m8798j3708K7510M0703J15017J3325l3897k464L3126P0264m2140m3498
7323D1290k6796j0182J0086k8650K7434L9114J4124k8387m3938m3205j5284q0808
7311a45202n8019j0033K9741N1271j8771K9768O1122n493O6991J2308j7010k8583
7299c1910k5333J6960K4214l7565j7963j3756L2020Q0808k4731l387k3314m8549
$$ plain form
7287 -72506 -2904 66602 71766 47291 45967 -16291 -44970 80339 135037 71874 11079 -879
7275 -879 107007 192600 125259 48464 -34422 -122970 -191511 -167251 -123128 -104520 -42691 -35123
7263 -35123 -69336 -102456 -89310 -34525 48256 45117 58648 12487 64343 14632 -133259 -178429
7251 -178429 -103415 -44188 -29182 -16330 -62738 -21993 -8541 -10569 40859 125010 154024 113961
7239 113961 22809 11467 62377 79520 62005 71486 30441 -86416 -145218 -143103 -158330 -106858
7227 -106858 -170240 -168937 -98562 -75017 -53526 17825 16252 34347 29969 -5982 27012 35250
7215 35250 -17846 -49323 -96323 -81728 -89468 -85963 -107503 -198475 -215846 -126988 -29746 -31278
7203 -31278 -38570 -40829 -69553 -64057 -47714 -23103 -32734 30119 79660 15082 30352 14148 63374
$$ packed form
7287g2506O9602O9506N164k4475j324o2258k8679J25309N4698o3163o0795j1958
7275h79J07886Q5593o7341p6795q2886q8548o8541K4260M4123J8608O1829P568
7263c5123l4213l3120J3146N4785Q2781l139J3531m6161N1856m9711j47891m5170
7251a78429P5014N9227J5006J2852m6408M0745J3452k028N1428Q4151K9014m0063
7239A13961r1152j1342N0910J7143j7515R481m1045j16857n8802K115j5227N1472
7227a06858o3382J303P0375K3545K1491P1351j573J8095m378l5951L2994Q238
7215C5250n3096l1477m7000J4595p740L505k1540r0972j7371Q8858R7242j532
7203c1278p292k259k8724N496J6343K4611r631O2853M9541o4578J5270j6204M9226
$$ plain form
7190 63374 94118 64899 60778 142278 138654 132506 102119 57343 41872 136475 83918 -34776
7178 -34776 -27356 -3300 -28453 15940 -22233 17800 24389 -21850 -86656 -38309 -68952 -161798
7166 -161798 -112390 -19765 62845 43784 -71365 -122385 -2377 10985 37457 -59388 -192077
7155 -192077 -195911 -134888 -85317 -89821 -150328 -123182 -88012 -88251 -80694 -70285 -39052 32732 110478
7142 110478 116847 183922 131782 60393 47458 -42853 -59095 26004 31880 -18337 -40032 -72610
7130 -72610 -131849 -130987 -56963 -94175 -106501 3181 77238 72310 1567 -17373 36250 119230
7118 119230 111435 27046 -12350 -7725 15693 -92964 -89669 -48362 25140 41624 -38758 -65792
7106 -65792 -72453 -119198 -73964 -56866 -9172 77075 48716 71807 -6317 -95645 -118249 -39903
$$ packed form
7190F3374L0744k9219m121Q1500l624o148l0387m4776j5471R4603n2557j18694
7178c4776P420K4056k5153M4393l8173M0033O589m6239o4806M8347l0643r2846
7166a61798M9408R2625Q2610j9061j15149n1020J20008J3362K6472r6845j32689
7155a92077l834O1023M9571m504o0507K7146L5170k39P557J0409L1233P1784P7746
7142A10478O369O7075n2140p1389j2935r0311j6242Q5099N876n0217k1695l2578
7130g2610n9239Q62P4024l7212j2326J09682P4057m928p0743j8940N3623Q2980
7118A19230p795q4389l9396M625K3418j08657L295M1307P3502J6484q0382k7034
7106f5792o661m6745M5234J7098M7694Q6247k8359K3091p8124q9328k2604P8346
$$ plain form
7094 -39903 -41788 -75059 -16661 -9463 -161001 -187514 -116996 -110564 -158086 -221133 -127312 13952
7082 13952 -24918 1191 -72584 -118726 -182859 -215203 -170466 -150249 -130094 -78075 -62109 -56993
7070 -56993 -24993 26558 64649 108642 50094 -19000 -94035 -124929 170 79584 56829 -24740
7058 -24740 -49789 -50388 -45282 -78186 -62231 -16129 43542 -18419 -54883 -18917 21989 -44208
7046 -44208 -32621 -94073 -118361 -12812 104707 99700 -1043 -85746 -127943 -130766 -41139 -43405
7034 -43405 -85166 -171390 -168409 -20481 128765 182883 128159 47567 -37312 -38154 -78039 -48252
7022 -48252 -29821 -49537 -24962 -84202 -105286 -110217 -190108 -134336 -3478 13268 -46571 -28910
7010 -28910 -37229 22108 50191 45062 76430 94037 77516 139083 149710 189622 204313 148820
$$ packed form
7094c9903j885l3271N8398P198j51538k6513P0518O432m7522o3047R3821J41264
7082A3952l8870K6109p3775m6142o4133l2344M4737K0217K0155N2019J5966N116
7070e6993L2000N1551L8091M3993n8548o9094p5035l0894J25099P9414k2755q1569
7058b4740k5049n99N106l2904J5955M6102N9671o1961l6464L5966M0906o6197
7046d4208J1587o1452k4288J05549J17519n007j00743q4703m2197k823Q9627k266
7034d3405m1761q6224K981J47928J49246N4118n4724q0592q4879q42l9885K9787
7022d8252J8431j9716K4575n9240k1084m931p9891N5772J30858J6746n9839J7661
7010b8910q319N9337K8083n129L1368J7607j6521O1567J0627L9912J4691n5493
$$ plain form
6998 148820 69431 -28110 -93688 -101593 -54537 11132 -49904 -119330 -99092 -66781 -122379 -122635
6986 -122635 -154451 -208404 -158196 -118851 -31136 -60475 -83580 -40771 -26278 3578 -46809 -52557
6974 -52557 -95202 -59649 -58824 -127220 -128196 -83101 -44891 -32707 -56235 -141837 -153452 10493
6962 10493 51987 29225 12526 -8088 -12660 9534 -9707 -15783 -157033 -181818 -105252 -44077
6950 -44077 344 -11906 -57298 -74196 -75278 -55154 -4269 43028 48350 11183 -28788 -43310
6938 -43310 6190 -1850 -7521 -107811 -162641 -163437 -118861 -92123 -86353 -73789 -101308 -91114 -103935
6925 -103935 -83920 -38504 26424 -9826 -153881 -159055 -75807 12832 30435 -40407 -47796 -33259
6913 -33259 -27424 -15091 51838 33617 -57373 -32861 -3715 8355 3031 -34693 -36893 29513
$$ packed form
6998A48820p9389r7541o5578p905M7056O5669o1036o9426K0238L2311n5598k56
6986a22635l1816n3953N0208L9345Q7715k9339k3105M2809J4493K9856n0387n748
6974e2557m2645L5553Q25o8396r76M5095L8210J2184k3528q5602j1615J63945
6962A0493M1494k2762j6699k0614m572K2194j9241o076j41250k4785P6566O1175
6950d4077M4421j2250m5392j6898j082K0124N0885M7297N322l7167l9971j4522
6938d3310M9500q040n671j00290n4830p96M4576K6738N770J2564k7519J0194j2821
6925a03935K0015M5416O4928l6250j44055n174Q3248Q8639J7603p0842p389J4537
6913c3259N835J2333O6929j8221r0990K4512K9146J2070n324l7724k200O6406
$$ plain form
6901 29513 -29267 -31378 69292 122220 57757 -4949 -29825 -56761 -91811 -166283 -187101 -162075
6889 -162075 -114844 -61015 -58844 -53139 -112892 -37251 28373 -12950 -62983 -146751 -143409 -103149
6877 -103149 -18374 -6827 -71803 -114909 -112373 -59919 -116656 -89381 -93841 -120703 -156621 -154675
6865 -154675 -109761 -80619 -178889 -218222 -152348 -144939 -121282 -70851 -49571 -74055 -4910 50613
6853 50613 18351 527 -66824 -880 108808 87426 -8510 -25674 8737 -1329 7338 -128680
6841 -128680 -235750 -214799 -177513 -86242 18412 36375 45467 58323 -30171 -112413 -66876
6830 -66876 -9090 9873 44459 40849 67568 89166 -25225 35437 -17079 -87561 -56853 -62692
6818 -62692 -79660 -95202 -37561 57603 96921 93345 96818 95724 89176 27038 -14081 11946 -36566
$$ packed form
6901B9513n8780k111J00670N2928o4463o2706k4876k6936l5050p4472k0818K5026
6889a62075M7231N3829K171N705n9753P5641O5624m1323n0033q3768L342M0260
6877a03149Q4775J1547o4976m3106K536N2454n6737K7275m460k6862l5918J946
6865a54675M4914K9142r8270l9333O5874P409K3657N0431K1280k4484O9145N5523
6853E0613l2262j7824o7351O5944J09688k1382r5936j7164L4411j0066Q667j36018
6841a28680j07070K0951L7286R1271J04654J7963R092J2856q8494q2242M5537
6830f6876N7786J8963L4586l610K6719K1598j14391O0662n2516p0482L0708n839
6818f2692j6968j5542N7641R5164L9318l576L473j094o548o2138m1119K6027m8512
$$ plain form
6805 -36566 -34140 -49203 -50849 -42882 14536 24820 -45005 -164861 -152820 -92371 -154107 -167621
6793 -167621 -99723 -77693 -57078 35005 53573 -54457 -15674 60138 59829 18092 -75170 -139524
6781 -139524 -162463 -135817 -103468 -83370 -133977 -129338 -64204 -61803 -34576 -640 -23128 -64529
6769 -64529 -97841 -74586 -44888 -52214 -74466 -87907 -116984 -45320 35316 -44871 -89554 -48655
6757 -48655 -67148 -116584 -50302 19749 11155 -65042 -80047 -56512 -42425 -16910 -20943 21620
6745 21620 -876 -19216 -18540 -56298 -81338 -122152 -84605 -64272 -69829 -71677 15071 26903 -23774
6732 -23774 -102469 -116219 -18918 -54939 -86502 -23934 54728 88132 68196 75080 -27471 -98446
6720 -98446 -113278 -90137 -60309 74182 6853 -75353 -42304 -27529 -38074 -41609 -78402 -85629
$$ packed form
6805c6566K426j5063j646P967N7418J0284o9825j19856J2041O0449o1736j3514
6793a67621O7898K2030K0615R2083J8568j08030L8783P5812l09m1737r3262o4354
6781a39524k2939K6646L2349K0098n0607M639O5134K401K7227L3936k2488m1401
6769f4529l3312K3255K9698p326k2252j3441k9077P1664Q0636q0187m4683M0899
6757d8655j8493m9436O6282P0051q594p6197j5005K3535J4087K5515m033M2563
6745B1620k2496j8340O76l7758k5040m0814L7547K0333n557j848Q6748J1832n0677
6732b3774p8695j3750R7301l6021l1563O2568P8662L3404j9936O884j02551p0975
6720i8446j4832K3141K9828J34491o7329q2206L3049J4775j0545l535l6793p227
$$ plain form
6708 -85629 -70807 -107289 -145161 -161525 -150456 -127540 -93091 -79371 -26600 -4682 40487 27271
6696 27271 5461 -53614 -19784 10583 17441 -41909 -70580 10039 90575 83494 24640 56264
6684 56264 172954 210855 134882 39024 50296 40982 9553 58005 65706 123148 138991 118302
6672 118302 128625 141686 147044 197345 201192 266439 282025 242265 222366 299852 330513 283686
6660 283686 314390 386746 336236 351120 394689 467308 579748 648456 945954 1405677 1740561
6649 1740561 1670022 1275381 1053599 1048232 1129316 1174165 1304848 1406895 1555680 1816553
6639 1816553 2123890 2566356 3255015 4213946 5502008 7418725 10471570 15976544 25954091
6630 25954091 41010781 51834921 44974711 29136020 17395790 11202102 7919565 6015815
$$ packed form
6708h5629J4822l6482l7872j6364J1069K2916L4449J3720N2771K1918M5169j3216
6696B7271k1810n9075L3830L0367O858n9350k8671Q0619Q0536p081n8854L1624
6684E6264J16690L7901p5973r5858J1272r314l1429M8452P701N7442J5843k0689
6672A18302J0323J3061N358N0301L847O5247J5586l9760j9899P7486L0661m6827
6660B83686L0704P2356n0510J4884M3569P2619J12440O8708K97498M59723L34884
6649A740561p0539l94641k21782n367Q1084M4849J30683J02047J48785K60873
6639A816553L07337M42466O88659R58931J288062J916717L052845N504974R977547
6630B5954091J5056690J0824140o860210j5838691j1740230o193688l282537j903750
$$ plain form
6622 6015815 4813978 3897560 3105487 2508676 2011470 1680434 1507585 1269176 1008182
6613 1008182 961455 1029630 1081648 1190896 1443064 1714592 1628040 1244003 812628 634079
6603 634079 541929 547622 526903 511347 436397 382491 337701 327817 297317 244352 199607 192317
6591 192317 168809 99996 106305 108177 137985 192879 216861 201348 178779 139902 135018 132817
6579 132817 126751 119753 105186 138502 128520 78376 51957 105896 103100 46340 54431 -28417 -38248
6566 -38248 12723 6756 -13413 15707 29167 -49888 -111163 -38500 23619 27021 80 -41220
6554 -41220 -15144 -46784 -61586 -96610 -11905 28140 -8901 4402 49361 1126 25488 -33354
6542 -33354 -159783 -161592 -97415 -45362 17381 44812 33071 12921 78789 50923 117385 122290
$$ packed form
6622F015815j201837r16418p92073n96811m97206l31036j72849k38409k60994
6613A008182m6727O8175N2018J09248K52168K71528q6552l84037m31375j78549
6603F34079r2150N693k0719j5556p4950n3906m4790r884l0500n2965m4745p290
6591A92317k3508o8813O309J872K9808N4894K3982j5513k2569l8877m884k201
6579A32817o066o998j4567L3316r982n0144k6419N3939k796n6760Q091q2848r831
6566c8248N0971n967k0169K9120J3460p9055o1275P2663O2119L402k6941m1300
6554d1220K6076l1640j4802l5024Q4705M0045l7041J3303M4959m8235K4362n8842
6542c3354j26429j809O4177N2053O2743K7431j1741k0150O5868k7866O6462M905
$$ plain form
6530 122290 122785 143210 117376 87398 45071 88272 92534 37566 -16140 -29600 -26843 26440
6518 26440 20701 -44881 -63561 -105566 -125108 -115181 -108595 -33635 -112673 -77656 -43170 -39364 -42687
6505 -42687 -49673 -54260 -17034 -66288 -119689 -80899 -57878 25556 72233 80970 17333 -24352
6493 -24352 -13970 -12786 -13113 -3325 -9505 -67890 -76452 -2418 473 21545 -14996 -123258 -139613
6480 -139613 -31645 57406 112732 44696 23082 98363 112676 6495 -89076 -71573 -51304
6469 -51304 39776 116644 97433 12613 18392 5448 -33622 -72550 -47077 -36211 -5458 -22508
6457 -22508 1100 60488 69241 6287 -943 -4781 -50911 -67465 -86587 -50346 -34634 -18742
6445 -18742 -110469 -135241 -67351 -66188 -1152 37630 52033 -17563 6717 -1950 -35871 -24960
$$ packed form
6530A22290M95K0425k5834k9978m2327M3201M262n4968n3706j3460K757N3283
6518B6440n739o5582j8680m2005j9542R927O586P4960p9038L5017L4486L806l323
6505d2687o986m587L7226m9254n3401L8790K3021Q3434M6677Q737o3637m1685
6493b4352J0382J184l27R788o180n8385q562P4034K891K1072l6541j08262j6355
6480a39613J07968Q9051N5326o8036k1614P5281J4313j06181r5571J7503K0269
6469e1304R1080P6868j9211q4820N779j2944l9070l8928K5473J0866L0753j7050
6457b2508K3608N9388Q753o2954p230l838m6130j6554j9122L6241J5712J5892
6445a8742r1727k4772O7890J163O5036L8782J4403o9596K4280q667l3921J0911
$$ plain form
6433 -24960 -5385 114 -42100 -29968 -20308 -40029 -70561 -119364 -118144 -72712 -42058 7356
6421 7356 40065 29582 -23099 20110 7387 -91730 -120925 -99746 -131562 -81120 -69154 -81019
6409 -81019 -139432 -95271 -46143 -67918 -95802 -113176 -68982 23026 5596 -51370 -49600 13097
6397 13097 -10640 -1904 -36067 30665 -2818 -960 -49850 -11450 -65488 -41369 -129451 -192254
6385 -192254 -135093 -109375 -121390 -103812 -130108 -137673 -57748 33782 31390 33732 1576 -62013
6373 -62013 -23884 -8650 -19341 -29562 -1304 -30914 -68300 -2011 15679 -1417 38359 24591
6361 24591 9376 -9261 -61449 -75587 -104796 -110712 -120936 -76273 -30305 -100122 -113942 -110926
6349 -110926 -65286 -51302 -19724 31124 47197 -8001 -1295 -35237 -30815 15732 2461 17240
$$ packed form
6433b4960J9575N499m2214J2132R660j9721l0532m8803J220M5432L0654M9414
6421G356L2709j0483n2681M3209j2723r9117k9195K1179l1816N0442J1966j1865
6409h1019n8413M4161M9128k1775k7884j7374M4194R2008j7430n6966J770O2697
6397A3097k3737Q736l4163O6732l3483J858m8890L8400n4038K4119q8082o2803
6385a92254N7161K5718j2015J7578k6296p565P9925R1530k392K342l2156o3589
6373f2013L8129J5234j0691j0221K8258k9610l7386O6289J7690j7096L9776j3768
6361B4591j5215j8637n2188j4138k9209n916j0224M4663M5968o9817j3820L016
6349a10926M5640J3984L1578N0848J6073n5198O706l3942M422M6547j3271J4779
$$ plain form
6337 17240 55913 98147 95955 30140 81043 -8948 -83702 -156099 -178986 -198401 -186225 -162460
6325 -162460 -104370 -78753 31879 29375 -7248 49985 -43828 -59979 -48097 -204 68316 46051
6313 46051 37821 -18689 -34818 5200 51322 61140 -10113 7199 14770 -60615 -104441 -45704
6301 -45704 -53578 311 -57448 8532 29841 6906 -35487 -84973 -81571 -12338 -71818 -46585
6289 -46585 -5095 43322 80021 3741 -89706 -121988 -92058 -79938 -50224 -24499 -24431 -45057
6277 -45057 -66990 -58833 -49585 35550 76265 6940 -13466 -18642 -44000 53083 145236 132886
6265 132886 44661 -38922 -35488 -32724 -13367 5057 -1394 -39181 -20769 -33635 20740 -15334
6253 -15334 66378 147675 137440 67718 52935 -10334 -59635 -97958 -79275 -74593 20099 62001
$$ packed form
6337A7240L8673M2234k192o5815N0903q9991p4754p2397k2887j9415J2176K3765
6325a62460N8090K5617J10632k504l6623N7233r3813j6151J1882M7893O8520k2265
6313D6051q230n6510j6129M0018M6122R818p1253J7312P571p5385m3826N8737
6301d5704p874N3889n7759O5980K1309k2935m2393m9486L402O9233n9480K5233
6289d6585M1490M8417L6699p6280r3447l2282K9930J2120K9714K5725O8k0626
6277d5057k1933Q157R248Q5135M0715o9325k0406n176k5358R7083R2153j2350
6265A32886q8225q3583L434K764J9357J8424o451l7787J8412j2866N4375l6074
6253a5334Q1712Q1297j0235o9722j4783o3269m9301l8323J8683M682R4692M1902
$$ plain form
6241 62001 115944 21875 19927 11955 -31209 -79777 -126242 -81373 -69241 -134665 -112549 -18811
6229 -18811 8984 36717 55888 22360 -41733 -36306 -61632 -46416 -71788 -16673 9444 29485
6217 29485 33016 -42889 2266 -3370 36977 166217 199381 71720 -10937 -72364 -174162 -166545
6205 -166545 -132068 -54714 -32193 -29979 -5216 -26285 -128496 -197705 -143216 -83862 -23106 35202
6193 35202 18567 -65417 -49587 -17745 -54475 37844 30527 -10320 -22427 93998 69892 43249
6181 43249 53607 72728 23850 4665 50250 104246 100773 30067 -153904 -177833 -112512 -65835
6169 -65835 2564 92136 70581 -37273 -41203 -16282 -21685 -12341 -44053 -127432 -103453 -23613
6157 -23613 -47055 -75014 17450 52194 13204 -53380 -111354 -101247 -70804 -33275 -43934 6815
$$ packed form
6241F2001N3943r4069j948p972m3164m8568m6465M4869J2132o5424K2116R3738
6229a8811K7795K7733J9171l3528o4093N427k5326J5216k5372N5115K6117K0041
6217B9485L531p5905M5155n636M0347J29240L3164j27661q2657o1427j01798P617
6205a66545L4477P7354K2521K214K4763k1069j02211o9209N4489N9354O0756N8308
6193C5202j6635q3984J5830L1842l6730R2319p317m0847j2107J16425k4106k6643
6181D3249J0358J9121m8878j9185M5585N3996l473p0706j83971k3929O5321M6677
6169f5835O8399Q9572k1555j07854l930K4921n403R344l1712q3379K3979P9840
6157b3613k3442k7959R2464L4744l8990o6584n7974J0107L0443L7529j0659N0749
$$ plain form
6145 6815 19690 -47590 -108894 -154826 -87341 -77587 -79635 -42542 -57691 -25871 -32506 -30294 -52454
6132 -52454 -65806 -54178 -44550 -44456 -96947 -180581 -180645 -126138 -86472 1396 90511 65882 8071
6119 8071 52987 91607 36058 2919 -47293 -59236 965 -18192 -44824 -48854 -78437 1222
6107 1222 35132 26973 -3123 -20835 -107204 -90114 -66635 -45235 -3471 34047 -5165 -31630
6095 -31630 -19975 -1255 30545 51987 117582 150770 78720 15530 -62203 -47851 -39446 -40008
6083 -40008 -120878 -161220 -219106 -192402 -103441 -69535 -125556 -152791 -265090 -248656 -226684 -158835
6071 -158835 -78092 -37250 -64358 -128724 -141093 -122965 -132327 -60672 -44575 -45577 27097 33052
6059 33052 -86907 -64750 -55248 81340 135023 84925 88171 49441 -12016 34634 29043 56938
$$ packed form
6145F815J2875o7280o1304m5932O7485R754k048L7093j5149L1820o635K212k2160
6132e2454j3352J1628R628R4n2491q3634o4N4507L9666Q7868Q9115k4629n7811
6119H071M4916L8620n5549l3139n0212j1943O0201j9157k6632m030k9583P9659
6107A222L3910q159l0096j7712q6369J7090K3479K1400M1764L7518l9212k6465
6095c1630J1655J8720L1800K1442O5595L3188p2050o3190p7733J4352Q405n62
6083d0008q0870m0342n7886K6704Q8961L3906n6021k7235j12299J6434K1972O7849
6071a58835Q0743M0842k7108o4366j2369J8128r362P1655J6097j002P2674N955
6059C3052j19959K2157R502J36588N3683n0098L246l8730o1457M6650n591K7895
$$ plain form
6047 56938 28824 -33257 -52724 -15969 -18949 -27146 -60297 -70527 -49774 -95603 -116392 -177162
6035 -177162 -112821 -70398 -65503 -24478 -37332 -44682 -67111 19001 28477 38160 -2839 1271 7650
6022 7650 -80184 -129859 -64049 -17416 148 12884 -60893 -91083 -11013 -14558 25062 77357
6010 77357 -23005 -74950 -18264 -9890 -93130 -70255 -5728 27620 -10751 -89925 -68054 -6520
5998 -6520 35121 12717 -22871 15334 -57758 -90728 -178465 -183828 -149886 -101394 -39334 -17143
5986 -17143 -106436 -90010 -78517 -100210 -100426 -99232 7909 90773 147740 34052 -26552 -133953
5974 -133953 -116171 -49292 -12688 39509 84664 8279 -42690 -98537 -141179 -103495 -97991 -92456
5962 -92456 -62761 -44183 -48647 -77657 -85598 -91617 -81928 -107534 -116261 -67725 -16663 9059 -20142
$$ packed form
6047E6938k8114o2081j9467L6755k980q197l3151j0230K0753m5829k0789o0770
6035a77162O4341M2423M895M1025j2854p350k2429Q6112R476R683m0999M110O379
6022G650q7834m9675O5810M6633J7564J2736p3777l0190Q0070l545L9620N2295
6010G7357j00362n1945N6686Q374q3240K2875O4527L3348l8371p9174K1871O1534
5998f520M1641k2404l5588L8205p3092l2970q7737n363L3942M8492O2060K2191
5986a7143q9293J6426J1493k1693k16J194J07141Q2864N6967j13688o0604j07401
5974a33953J7782O6879L6604N2197M5155p6385n0969n5847m2642L7684N504N535
5962i2456K9695J8578m464k9010p941o019R689k5606q727M8536N1062K5722k9201
$$ plain form
5949 -20142 -96681 -108057 -118507 -129122 -138294 -53789 7536 42902 -7703 -164140 -178353 -130511
5937 -130511 -148796 -216938 -184187 -95921 -67768 -9768 -49027 -129711 -66663 60990 59342 28190
5925 28190 -41693 -109444 -177694 -170368 -78855 -73397 -121913 -60152 -18080 -51437 -71858 -104155
5913 -104155 -61996 -77739 -77743 -77556 -88797 -66780 -89317 -55492 41479 47278 30965 23439 45743
5900 45743 84350 40005 6351 14953 48420 42047 69007 41851 -32575 7686 13814 12685 34423
5887 34423 67800 111240 81998 59629 38528 -1091 110708 186861 138048 30836 -76406
5876 -76406 -41120 -36639 24656 18787 189 -81017 -132508 -72126 -31829 54145 56775 1451
5864 1451 -5144 -45553 -78567 -45470 -48996 -59680 -43635 -11682 -40884 -99660 -112038 -92754
$$ packed form
5949b0142p6539j1376j0450j0615r172Q4505O1325L5366n0605j56437j4213M7842
5937a30511j8285o8142L2751Q8266K8153N8000l9259q0684O3048J27653j648l1152
5925B8190o9883o7751o8250P326R1513N458m8516O1761M2072l3357k0421l2297
5913a04155M2159j5743mJ87j1241K2017k2537L3825R6971N799j6313p526K2304
5900D5743L8607m4345l3654Q602L3467o373K6960k7156p4426M0261O128j129K1738
5887C4423L3377M3440k9242k2369k1101l9619J11799P6153m8813j07212j07242
5876g6406L5286M481O1295n869j8598q1206n1491O0382M0297Q5974K630n5324
5864A451o595m0409l3014L3097l526j0684J6045L1953k9202n8776j2378J9284
$$ plain form
5852 -92754 -127372 -162834 -148584 -118915 -112698 -36496 3786 40545 18877 54424 25007 -36812
5840 -36812 -67352 -14411 -12364 -37544 -134510 -149902 -96767 -126082 -172870 -137329 -61314 10344
5828 10344 -37916 -69311 -38880 -23008 -48333 -60948 -42783 -22442 -43540 -121663 -163769 -65172
5816 -65172 67098 196315 121978 24615 -20094 -5968 130816 83812 11546 -156566 -146667
5805 -146667 2801 17664 -19734 1168 -7945 -48961 -47653 52990 73873 2633 44568 91104
5793 91104 95397 52130 -33689 -40782 -144467 -83576 -17297 12016 77649 89168 46348 67785
5781 67785 25118 10628 -30773 -64264 -64415 -14477 35658 25813 -1738 -51452 -12819 -36897
5769 -36897 -83443 -100261 -60399 -82306 -63104 22656 63532 62035 50472 3950 -52646 -180651
$$ packed form
5852i2754l4618l5462J4250K9669O217P6202M0282L6759k1668L5547k9417o1819
5840c6812l0540N2941K047k5180r6966j5392N3135k9315m6788L5541P6015P1658
5828A0344m8260l1395L0431J5872k5325j2615J8165K0341k1098p8123m2106R8597
5816f5172J32270J29217p4337r7363m4709J4126J36784m7004p2266j68112R899
5805a46667J49468J4863l7398K0902r113m1016J308J00643K0883p1240M1935M6536
5793I1104M293m3267q5819p093j03685O0891O6279K9313O5633J1519m2820K1437
5781F7785m2667j4490m1401l3491j51M9938N0135r845k7551m9714L8633k4078
5769c6897m6546j6818L9862k1907J9202Q5760M0876j497j1563m6522n6596j28005
$$ plain form
5757 -180651 -233116 -181823 -108148 -93404 -126177 -88782 -36876 2330 40265 4886 122795
5746 122795 128535 102648 -24317 6444 42973 -1211 48257 149234 92490 24369 -33288
5735 -33288 -6686 55336 31728 -35751 -55769 36075 127870 64244 -11404 -8098 66191 34077
5723 34077 -48026 -21300 -12051 -2201 -20700 -7049 57219 34183 -8790 -71826 -136938 -157896
5711 -157896 -99708 -54992 12679 98625 111572 56819 -10461 -138212 -110658 -29927 -79254
5700 -79254 -156420 -76604 766 35572 79032 94578 86352 107497 52052 2334 13876 40313
5688 40313 6330 -7894 36132 11794 20317 38736 17511 13720 -17309 -82840 -146275 -123601
5676 -123601 -92633 -53128 -92355 -57923 -58469 -177706 -181848 -110112 -107502 -89443 -67907 -57018
$$ packed form
5757a80651n2465N1293P3675J4744l2773L7395N1906L9206L7935l5379J17909
5746A22795N740k5887j26965L0761L6529m4184M9468J00977n6744o8121n7657
5735c3288K6602O2022k3608o7479k0018R1844R1795o3626p5648L306P4289l2114
5723C4077q2103K6726R249R850j8499J3651O4268k3036m2973o3036o5112k0958
5711a57896N8188M4716O7671Q5946J2947n4753o7280j27751K7554Q0731m9327
5700g9254p7166P9816P7370L4806M3460J5546q226K1145n5445m9718J1542K6437
5688D0313l3983j4224M4026k4338Q523J8419k1225l791l1029o5531o3435K2674
5676a23601L0968L9505l9227L4432n46j19237m142P1736K610J8059K1536J0889
$$ plain form
5664 -57018 -144852 -150586 -124380 -84115 -91617 -73507 -61371 -43035 -92388 -213239 -200271 -139355
$$ packed form
5664e7018q7834n734K6206M0265p502J8110J2136J8336m9353j20851J2968O0916
$$ [...]
##END NTUPLES=NMR SPECTRUM
##END=
