##TITLE=Analysis number 330074
Compound Code cc 14602
Book Reference 554/10
Project Code adrs
Chemist Name bruced
##JCAMPDX= 6.0         $$ Bruker NMR JCAMP-DX V2.0
##DATA TYPE= NMR SPECTRUM
##DATA CLASS= NTUPLES
##ORIGIN= Bruker BioSpin GmbH
##OWNER= nmr
$$ XWIN-NMR		Version 3.5
$$ Wed Oct 24 12:30:47 2007 GMT Daylight Time (UT+1h)  MAYBRIDGE\nmr@NMR_250MHZ
##.OBSERVE FREQUENCY= 250.131544655141
##.OBSERVE NUCLEUS= ^1H
##.ACQUISITION MODE= SIMULTANEOUS (DQD)
##.ACQUISITION SCHEME= undefined
##.AVERAGES= 16
##.DIGITISER RES= 18
##SPECTROMETER/DATA SYSTEM= dpx250
##.PULSE SEQUENCE= zg30
##.SOLVENT NAME= CDCl3
##.SHIFT REFERENCE= (INTERNAL, CDCl3, 0, 16.4463)
##AUDIT TRAIL= $$ (NUMBER, WHEN, WHO, WHERE, WHAT)
$$ ##TITLE= Audit trail, XWIN-NMR		Version 3.5
$$ ##JCAMPDX= 5.01
$$ ##ORIGIN= Bruker BioSpin GmbH
$$ ##OWNER= nmr
$$ C:\u/data/dgb/nmr/ADRS/1280/pdata/1/auditp.txt
$$ ##AUDIT TRAIL=  $$ (NUMBER, WHEN, WHO, WHERE, WHAT)
(   1,<2007-10-24 12:30:24.52 +100>,<MAYBRIDGE\nmr>,<NMR_250MHZ>,
      <created by zg, POWCHK disabled, PULCHK disabled
       configuration hash MD5:
       76 6E 9A 78 1E 09 19 81 EC 84 63 8F B0 6A 59 2D
       data hash MD5: 64K
       6C F3 D6 5C 6B C0 01 ED 5D 3D CB 7A 0C 87 90 1F>)
(   2,<2007-10-24 12:30:37.40 +100>,<MAYBRIDGE\nmr>,<NMR_250MHZ>,
      <Start of raw data processing
       ef LB = 0.3 FT_mod = 6 PKNL = 1 SI = 32K 
       data hash MD5: 32K
       4F EE 53 EA F9 78 AD 1F DF 86 A4 7E A2 12 2D D7>)
(   3,<2007-10-24 12:30:39.44 +100>,<MAYBRIDGE\nmr>,<NMR_250MHZ>,
      <apk 
       data hash MD5: 32K
       B8 D7 DB 37 AA 18 3F 87 75 D6 17 1F 9C D5 8D E9>)
(   4,<2007-10-24 12:30:40.11 +100>,<MAYBRIDGE\nmr>,<NMR_250MHZ>,
      <abs ABSG = 5 
       data hash MD5: 32K
       7C 98 4A 11 AA 7B 93 89 9F 8A 88 19 90 7E 31 9C>)
$$ ##END=
$$ 
$$ hash MD5
$$ 5A 6A 6C 31 EA E5 C4 E7 E8 89 DE D8 1C 76 F0 D5
##$RELAX= 
##$RELAX= 
##$RELAX= 
##$RELAX= 
##$RELAX= 
##$RELAX= 
##$RELAX= 
$$ Bruker specific parameters
$$ --------------------------
##$DU= <C:\u>
##$EXPNO= 1280
##$NAME= <ADRS>
##$PROCNO= 1
##$TYPE= <nmr>
##$USER= <dgb>
##$AMP= (0..31)
100 100 100 100 100 100 100 100 100 100 100 100 100 100 100 100 100 100 
100 100 100 100 100 100 100 100 100 100 100 100 100 100 
##$AQSEQ= 0
##$AQ_mod= 3
##$AUNM= <au_zg>
##$AUTOPOS= <21 >
##$BF1= 250.13
##$BF2= 250.13
##$BF3= 250.13
##$BF4= 250.13
##$BF5= 500.13
##$BF6= 500.13
##$BF7= 500.13
##$BF8= 500.13
##$BYTORDA= 1
##$CFDGTYP= 0
##$CFRGTYP= 5
##$CHEMSTR= <none>
##$CNST= (0..31)
1 1 145 1 1 1 1 1 1 1 1 1 1 1 1 1 1 1 1 1 1 1 1 1 1 1 1 1 1 1 1 1 
##$CPDPRG= <>
##$CPDPRG1= <>
##$CPDPRG2= <>
##$CPDPRG3= <>
##$CPDPRG4= <mlev>
##$CPDPRG5= <mlev>
##$CPDPRG6= <mlev>
##$CPDPRG7= <mlev>
##$CPDPRG8= <mlev>
##$CPDPRGB= <>
##$CPDPRGT= <>
##$D= (0..31)
0 1 0 0 0 0 0 0 0 0.06 0 0 0 0 0 0 0.0002 0 0 0 0 0 0 0 0 0 0 0 0 0 0 
0 
##$DATE= 1193225423
##$DBL= (0..7)
120 120 120 120 120 120 120 120 
##$DBP= (0..7)
150 150 150 150 150 150 150 150 
##$DBP07= 0
##$DBPNAM0= <>
##$DBPNAM1= <>
$$ [...]
##$SUBNAM7= <"">
##$SUBNAM8= <"">
##$SUBNAM9= <"">
##$SW= 20.6930455092707
##$SWIBOX= (0..15)
0 0 3 0 0 0 0 0 0 0 0 0 0 0 0 0 
##$SW_h= 5175.983436853
##$TD= 65536
##$TD0= 1
##$TE= 295.16
##$TE2= 300
##$TE3= 300
##$TEG= 300
##$TL= (0..7)
0 120 120 120 120 120 120 120 
##$TP= (0..7)
150 150 150 150 150 150 150 150 
##$TP07= 0
##$TPNAME0= <>
##$TPNAME1= <>
##$TPNAME2= <>
##$TPNAME3= <>
##$TPNAME4= <>
##$TPNAME5= <>
##$TPNAME6= <>
##$TPNAME7= <>
##$TPOAL= (0..7)
0.5 0.5 0.5 0.5 0.5 0.5 0.5 0.5 
##$TPOFFS= (0..7)
0 0 0 0 0 0 0 0 
##$TUNHIN= 0
##$TUNHOUT= 0
##$TUNXOUT= 0
##$USERA1= <user>
##$USERA2= <user>
##$USERA3= <user>
##$USERA4= <user>
##$USERA5= <user>
##$V9= 5
##$VALIST= <valist>
##$VCLIST= <CCCCCCCCCCCCCCC>
##$VD= 0
##$VDLIST= <DDDDDDDDDDDDDDD>
##$VPLIST= <PPPPPPPPPPPPPPP>
##$VTLIST= <TTTTTTTTTTTTTTT>
##$WBST= 1024
##$WBSW= 4
##$XGAIN= (0..3)
0 0 0 0 
##$XL= 0
##$YL= 0
##$YMAX_a= 323438
##$YMIN_a= -389281
##$ZGOPTNS= <>
##$ZL1= 120
##$ZL2= 120
##$ZL3= 120
##$ZL4= 120
##$ABSF1= 16.44633
##$ABSF2= -4.246843
##$ABSG= 5
##$ABSL= 3
##$ALPHA= 0
##$AQORDER= 0
##$ASSFAC= 0
##$ASSFACI= 0
##$ASSFACX= 0
##$ASSWID= 0
##$AUNMP= <proc_1d>
##$AZFE= 0.1
##$AZFW= 0.1
##$BCFW= 0
##$BC_mod= 0
##$BYTORDP= 0
##$COROFFS= 0
##$CY= 12.5
##$DATMOD= 1
##$DC= 0
##$DFILT= <>
##$DTYPP= 0
##$F1P= 14.0000005364418
##$F2P= -0.99999901652339
##$FCOR= 0.5
##$FTSIZE= 32768
##$FT_mod= 6
##$GAMMA= 0
##$GB= 0
##$INTBC= 1
##$INTSCL= 1
##$ISEN= 128
##$LB= 0.3
##$LEV0= 0
##$LPBIN= 0
##$MAXI= 10000
##$MC2= 0
##$MEAN= 0
##$ME_mod= 0
##$MI= 0
##$NCOEF= 0
##$NC_proc= -4
##$NLEV= 6
##$NOISF1= 0
##$NOISF2= 0
##$NSP= 0
##$NTH_PI= 0
##$NZP= 0
##$OFFSET= 16.44633
##$PC= 1
##$PHC0= 150.1121
##$PHC1= 44.17918
##$PH_mod= 1
##$PKNL= yes
##$PPARMOD= 0
##$PSCAL= 4
##$PSIGN= 0
##$REVERSE= no
##$SF= 250.130018927292
##$SI= 32768
##$SIGF1= 0
##$SIGF2= 0
##$SINO= 400
##$SIOLD= 32768
##$SREGLST= <1H.CDCl3>
##$SSB= 0
##$STSI= 32768
##$STSR= 0
##$SW_p= 5175.98343685301
##$SYMM= 0
##$S_DEV= 0
##$TDeff= 65536
##$TDoff= 0
##$TI= <Analysis number 999999
Compound Code 99
Book Reference 9
Project Code 9>
##$TILT= no
##$TM1= 0
##$TM2= 0
##$TOPLEV= 0
##$USERP1= <user>
##$USERP2= <user>
##$USERP3= <user>
##$USERP4= <user>
##$USERP5= <user>
##$WDW= 1
##$XDIM= 32768
##$YMAX_p= 279360088
##$YMIN_p= -494618
$$ End of Bruker specific parameters
$$ ---------------------------------
##NTUPLES= NMR SPECTRUM
##VAR_NAME=  FREQUENCY,     SPECTRUM/REAL,   SPECTRUM/IMAG
##SYMBOL=    X,             R,               I
##VAR_TYPE=  INDEPENDENT,   DEPENDENT,       DEPENDENT
##VAR_FORM=  AFFN,          ASDF,            ASDF
##VAR_DIM=   32768,         32768,           32768
##UNITS=     HZ,            ARBITRARY UNITS, ARBITRARY UNITS
##FACTOR=    0.157963299565203, 1,           1
##FIRST=     4113.72061327498, 0,            0
##LAST=      -1062.26282357803, 0,           0
##MIN=       -1062.26282357803, -494618,     0
##MAX=       4113.72061327498, 279360088,    0
$$ Real data points
##PAGE= N=1
##DATA TABLE= (X++(R..R)), XYDATA
$$ [...]
24598I987j8737P7602O203j61986l3564P7140Q0897n9167q262o0219J4100M1139
$$ 9987 -8750 68852 75055 -86931 -120495 -43355 37542 -21625 -29887 -90106 -76006 -34867
24586c4867p5871o9909J31334J29682k141r0812Q0563M0809j19996k4J03965K1071
$$ -34867 -110738 -180647 -49313 80369 78228 -12584 67979 108788 -11208 -11232 92733 113804
24574A13804j6633l6549Q0390O1346M4324J7513j09503j93627r0953j4960Q6342
$$ 113804 97171 60622 141012 202358 246682 264195 154692 -38935 -129888 -144848 -58506
24563e8506Q4565J43828j5753j29506j53832p5739N2546m7079J1058J69543K7349
$$ -58506 26059 169887 154134 24628 -129204 -204943 -152397 -199476 -188418 -18875 8474
24552H474j14208j35058L5633M8633J01091O6765O8235k4134j0793Q6774n5861
$$ 8474 -105734 -240792 -205159 -156526 -55435 11330 79565 55431 44638 131412 75551
24541G5551j12117M8147n5949J6875N2575j16727J7020O4876l6776N6671o3882
$$ 75551 -36566 11581 -44368 -27493 25082 -91645 -74625 -9749 -46525 10146 -53736
24530e3736j7459J6812N770k3764J54876R5131J2526j46978j23968j3354J43959
$$ -53736 -71195 -54383 -48613 -72377 82499 177630 190156 43178 -80790 -94144 49815
24519D9815J7902p8533j4753Q9244j249k7495K3600J1089r135p4367o3246J51559
$$ 49815 67717 -10816 -25569 63675 62426 34931 58531 69620 60485 -13882 -77128 74431
24507G4431J9837q6173L7921k4231Q979l3772J3760j8500M8453J974m9956m8862
$$ 74431 94268 8095 46016 21785 30764 -3008 10752 -7748 40705 42679 -7277 -56139
24495e6139N8610Q0831K4769j35742n3710J17372O4926o5501p8407N760N2349
$$ -56139 2471 83302 108071 -27671 -81381 35991 100917 35416 -42991 -37231 15118
24484A5118M3630K6301o8293J931O7270L4304k5821o6958L8621N687p6540N312
$$ 15118 58748 85049 16756 18687 85957 120261 94440 27482 66103 71790 -4750 562
24472E62p6165o3676J22248K0298m8055M3739O1520l9117q4875o8440M5693L099
$$ 562 -75603 -139279 -17031 3267 -44788 -1049 60471 21354 -63521 -131961 -86268 -83169
24460h3169M0720M7239k6977p2688m9419m1536K8857L1736M4439J05073q8020
$$ -83169 -42449 4790 -22187 -94875 -144294 -185830 -156973 -125237 -80798 24275 -63745
24449f3745m1118L2533L9058m9470j3155r488k7046O5702q634o6932O3529r022
$$ -63745 -104863 -72330 -33272 -82742 -95897 -105385 -132431 -66729 -75363 -142295 -78766 -87788
24437h7788p5243j8314O8630k9801J55353K5338o0585M1498K4416J3102J1722
$$ -87788 -163031 -181345 -112715 -142516 12837 38175 -22410 19088 43504 56606 68328
24426F8328j86945l4962j5331O5638N050m7334k9091M0408k433L1458p1389l4890
$$ 68328 -118617 -153579 -168910 -103272 -98222 -145556 -174647 -134239 -136672 -105214 -176603 -211493
24414b11493J04974O8196K7197Q286r0754j21963Q7896P1528k4872K7068P6575
$$ -211493 -106519 -38323 -11126 -2840 -93594 -215557 -127661 -56133 -81005 -53937 22638
24403B2638p4919n8652M338P6865N9631M328l5116N427m4330k0362O0242L7672
$$ 22638 -52281 -110933 -106595 -29730 29901 34229 -887 4540 -39790 -60152 90 37762
24391C7762j0799L3622K2533Q9936l6039l9157K976k8165L6972o7572j54944l2977
$$ 37762 26963 60585 83118 173054 137015 97858 100834 72669 109641 42069 -112875 -145852
24379a45852M5628J03127j2345j4801j6062k3841J63258J32889j15356l3790R4165
$$ -145852 -100224 2903 -9442 -24243 -40305 -64146 99112 232001 116645 82855 177020
24368A77020N8513Q6035j50057r4372r2344q6220j61964Q7387O7524L1415R9590
$$ 177020 235533 321568 171511 77139 -15205 -101425 -263389 -176002 -108478 -77063 22527
24357B2527R4786N3875n9549K0044k9113M6155r1570n4471O9460m4828m3625K9606
$$ 22527 117313 171188 111639 131683 102570 148725 57155 2684 72144 27316 -16309 13297
24345A3297Q7765O3501j06808p0290M4465L6392R576m9263m5158p9526n3091J28312
$$ 13297 101062 164563 57755 -12535 31930 68322 77898 28635 -16523 -96049 -149140 -20828
24333b0828O4834N1059l6590k2363J1326l3550n8527l9723Q4331M2691O829j5461
$$ -20828 44006 95065 58475 36112 47438 13888 -44639 -84362 -31 42660 49489 34028
24321C4028J3023P0491o2105l9886L9974Q548k062M9354n7464j2003J7612O3201
$$ 34028 47051 117542 55437 15551 55525 64073 62011 111365 53901 41898 59510 122711
24309A22711k8221j71130k5316J45729R7332r05O3337J7876q1142r2451k9350
$$ 122711 94490 -76640 -101956 43773 141105 140200 203537 221413 140271 47820 18470
24298A8470K459N0190N2309k2232q232r2735N6930q961j2248m0532n7686p0494
$$ 18470 20929 71119 123428 101196 92964 229 57159 48198 35950 -4582 -62268 -132762
24286a32762J14679J58987n4094l4645n6363l4170J28918M8019j12427Q716L6036
$$ -132762 -18083 140904 86810 52165 -4198 -38368 90550 138569 26142 34858 70894
24275G0894k1908J9840R1636n29k6623o16j65599p7400O5672k0886n3449P0475
$$ 70894 48986 68826 160462 159933 133310 132694 -32905 -110305 -44633 -65519 -118968 -48493
24263d8493M4125P9365L6884r0319l8158J86986L2177q6078j25135J6326R1808
$$ -48493 -4368 74997 111881 21562 -16596 170390 202567 116489 -8646 7680 99488
24252I9488l0380n1285j7299J15323P730o4375m0122J8423l0746l0903N6112J17952
$$ 99488 69108 17823 524 115847 123577 59202 19080 37503 6757 -24146 31966 149918
24240A49918j9569j10889j21988J5003P2076J0193P4134P1711k9091L8022m5218
$$ 149918 130349 19460 -102528 -87525 -15449 -5256 68878 140589 111498 149520 104302
24229A04302p0380j0186l5579m4162j9748Q4927M2379L216l6302l2150r156l925
$$ 104302 33922 23736 -11843 -56005 -75753 9174 51553 54769 18467 -13683 -22839 -26764
24217b6764R3957o9355P787K9334o1655j8238L6262l3857m8839m7694n3518M9624
$$ -26764 67193 -2162 5625 34959 -26696 -44934 -8672 -42529 -91368 -139062 -192580 -142956
24205a42956J02096J01345n8202k1528L117Q9496R5944m618j22585p2783m3599
$$ -142956 -40860 60485 2283 -19245 -16128 73368 169312 164694 42109 -30674 -74273
24194g4273m439O0310K0532j9668O764J5491J4249k1605K2729j83699l8220J79191
$$ -74273 -78712 -18402 2130 -17538 -10774 4717 18966 -2639 20090 -163609 -201829 -22638
24182b2638J85155p870q7358l1594L4931l003j0182j09450Q5456j8442p3701R1993
$$ -22638 162517 154647 67289 35695 70626 67623 57441 -52009 33447 15005 -58696 33297
24170C3297o1288l0684l6948l097l4874N131M7390L0038J33764l3027j43038L4412
$$ 33297 -27991 -58675 -95623 -98720 -133594 -128463 -81073 -51035 82729 49702 -93336 -58924
24158e8924J098L5472M2553M5312R0897j26q3700m815m6591L0443J17455p495
$$ -58924 -57826 -22354 20199 65511 156408 156282 72582 67767 21176 51619 169074 161579
24146A61579j30197l0531M1600M0350M6813o1937j87211k0583n7077P3283Q7915
$$ 161579 31382 851 42451 82801 129614 67677 -119534 -140117 -197194 -123911 -35996
24135c5996K7682j6669o8033p8001R702K705o1141j81048P8204J60223Q6653R2509
$$ -35996 -8314 -24983 -93016 -171017 -161315 -158610 -219751 -400799 -322595 -162372 -75719 16790
24123A6790N354m8479j83134n010R2634K1812Q3197Q059r0533p4605l6271J04365
$$ 16790 22144 -26335 -209469 -214479 -121845 -100033 -16836 -8777 -99310 -173915 -210186 -105821
24111a05821R1602l3548L600n580L3114q5477r9560N9095J84463n210l2691K5171
$$ -105821 -14219 -47767 -44167 -49747 -16633 -102110 -201670 -142575 41888 36678 3987 29158
24099B9158O8960R0362p8313k3977o9401N2712n845j01585m1572m9769l1412L5907
$$ 29158 98118 188480 110167 86190 16789 69501 63656 -37929 -79501 -129270 -160682 -124775
24087a24775R9949M5733q4793p5147J09107P9391q6923j33372n6046J46849J84110
$$ -124775 -24826 20907 -63886 -139033 -29926 49465 -37458 -170830 -226876 -80027 104083
24076A04083m0112j08548l7755j7832J6076n8457n4640n1036Q1495Q2371P7903
$$ 104083 63971 -44577 -82332 -100164 -84088 -142545 -197185 -248221 -166726 -84355 -6452
24065f452R4780l2047l1657r6914L8075K8708P118j6274K3190K7729k3052M2041
$$ -6452 88328 56281 24624 -72290 -34215 -5507 1611 -14663 8527 36256 13204 55245
24053E5245p2326n921J16941n9778n4179M0440K2813J9070o6414N4579P3809q561
$$ 55245 -17081 -23002 93939 34161 -20018 20422 43235 62305 -4109 50470 124279 115718
24041A15718l0464Q4561k8991j05860n6204l7975J6222o4883J9439L6219O8865
$$ 115718 85254 169815 140824 34964 -21240 -59215 -42993 -107876 -88437 -52218 16647
24030A6647Q0884J35207L7225j18284K9359o6750j36302k72696K1267J63514r8053
$$ 16647 97531 232738 269963 151679 181038 114288 -22014 -294710 -273443 -109929 -207982
24019b07982j08604J21033K6491O9575J681m6765M7474R4722L4611K7190k0589
$$ -207982 -316586 -195553 -169062 -99487 -97806 -144571 -97097 -2375 32236 59426 38837
24008C8837j40278p693O9839L691k1004M4880Q478J3527L2824J18109o9509m8507
$$ 38837 -101441 -109134 -39295 -35604 -56608 -11728 -3250 10277 43101 161210 91701 43194
23996D3194p6651l8504L4051j9443l1889j9177j4238P9810n5165k0722N661m3112
$$ 43194 -33457 -71961 -37910 -57353 -89242 -108419 -122657 -42847 -98012 -118734 -113073 -156185
23984a56185P7238L6929J8928M3032q8895n5039J46853R0021j2843j0306j6560
$$ -156185 -78947 -42018 -23090 19942 -68953 -123992 22861 112882 100039 89733 73173
23973G3173n389q336j5244j3020j14744l1981Q5127J50788J39166j31629j21176
$$ 73173 67784 59448 44204 31184 -83560 -115541 -30414 120374 259540 127911 6735
23962F735p6637J45198R6421n1233j3905N109k751j05179q9512r454P9079N2873
$$ 6735 -69902 75296 171717 120484 106579 111688 108937 3758 -85754 -95208 -16129 36744
23950C6744o2289O1541R6226r710j06448r7394j00413j01003Q1475J66902K2719
$$ 36744 -25545 35996 132222 122512 16064 -81330 -181743 -282746 -201271 -34369 -11650
23939a1650p4761J27735Q7775q605N9028n8565o8613K8710M526r0753j07197K7140
$$ -11650 -86411 41324 129099 120494 179522 120957 52344 81054 85580 -5173 -112370 -85230
23927h5230K05249j26863k21449J2676J21062k1416r8306p0039J34483l9833J5878
$$ -85230 120019 -6844 -228293 -215617 -94555 -115971 -214277 -284316 -149833 -189666 -173788
23916a73788N8907M8303n9706n2746Q1976L7947n9712P7040M3634J8783j963N335
$$ -173788 -114881 -66578 -126284 -179030 -97054 -59107 -118819 -41779 1855 20638 18675 24010
23904B4010k0991J4397k0355J20324L2726p0267N0141j9897K0434o5756k5551
$$ 24010 3019 17416 -2939 117385 150111 79844 129985 110088 130522 64766 39215
23893C9215L4378N0571j00591m2399j20258j08707m3987R5957P5618J35812k6640
$$ 39215 73593 124164 23573 -18826 -139084 -247791 -291778 -195821 -120203 15609 -11031
23882a1031Q262m832N0370p308m8967o7252j3378O6452j2438m0312n3882p8808
$$ -11031 -2769 -7601 42769 35461 -13506 -80758 -94136 -27684 -40122 -80434 -134316 -213124
23870b13124K1466J20711J7489k3005l0762k2184J03571J08300p3894Q509p7125
$$ -213124 -191658 -70947 -53458 -76463 -107225 -129409 -25838 82462 8568 17077 -60048
23859f0048o6694l4357K0194J16847M4272K456J7574P1966M3579j12857j51510
$$ -60048 -126742 -161099 -140905 -24058 20214 22670 40244 112210 155789 42932 -108578
23848a08578r0561P0063N0455L1958o1J9730P5795m6039n7106M9987l2004o2738
$$ -108578 -199139 -129076 -78621 -46663 -46724 -26994 48801 2762 -54344 -4357 -36361 -99099
23836i9099j02521j14121K4449K7138N8458J10664P4205m8139p145L6290L8119
$$ -99099 -201620 -315741 -291292 -264154 -205696 -95032 -20827 -68966 -76111 -39821 -1702
23825a702M5501N973q247L7074R6936j16277n6028N2850M6793o557k1945p3426
$$ -1702 43799 49772 41525 78599 175535 59258 3230 56080 102873 96316 74371 945
23813I45j11337N3102J17860K0877r4000p9333Q4430J8240L0947O5055k4541N0355
$$ 945 -110392 -57290 60570 81447 -12553 -91886 -7456 10784 41731 106786 82245 132600
23801A32600k0695L1338M2084k1870o2443n3248n7672r644J10628p3915l3701
$$ 132600 111905 143243 185327 163457 101014 47766 -9906 -19550 91078 17163 -16538
23790a6538Q9178l5562m7517m8286J97715N6805p5735R139j7680j04843q5031
$$ -16538 72640 37078 -10439 -58725 138990 195795 120060 129199 111519 6676 -78355
23779g8355j4117O675Q5734N0612k4785P9368J5799o8083p163k5524n2864o3389
$$ -78355 -92472 -85797 -63 50549 25764 105132 120931 52848 45685 20161 -32703 -96092
23767i6092J0663m3570K6050J69470M5901o2644N8781K2415q342l7739j53020
$$ -96092 -85429 -128999 -102949 66521 112422 49778 108559 130974 122632 84893 -68127
23756f8127J09636N6332L4855q60K6058O165j6491m9052q6700J48038L7602j45741
$$ -68127 41509 97841 132696 131836 157894 164059 147568 98516 11816 159854 197456 51715
23744E1715n5967J20168l2722p9919p8789n9971Q39L3426J42496K6328O3910n5621
$$ 51715 -4252 115916 83194 3275 -75514 -135485 -134646 -101220 41276 67604 131514 75893
23732G5893P689m5888m8940K6123J2982p2891J2875j8204J3326P3711L7249R7986
$$ 75893 83582 37694 -11246 14877 27859 -45032 -32157 -50361 -37035 36676 73925 171911
23720A71911O5773m2665j17535j27441N4538J14540o9557j55961M1353Q7097n2166
$$ 171911 237684 195019 77484 -49957 4581 119121 49564 -106397 -65044 22053 -30113
23709c0113N1337O6645n7798M9223Q7704L915m1958N4729p9721R4753K8857j02016
$$ -30113 21224 87869 30071 79294 166998 170913 128955 183684 103963 198716 227573 125557
23697A25557j27961M5113p2199q2575j0261P5193N0993L0184N7121n6471o5297
$$ 125557 -2404 42709 -29490 -112065 -122326 -47133 3860 34044 91165 34694 -30603
23686c0603j61437r865J07799M0201P7654J00200l0400Q7073o604r3294j4702
$$ -30603 -192040 -201905 -94106 -53905 23749 123949 93549 180622 174018 80724 66022
23675F6022N1598K5426j08886j5757P418l2952M1839j12619k4800o1628Q4049
$$ 66022 117620 143046 34160 18403 25821 -7131 34708 -77911 -102711 -164339 -80290
23664h0290J04818K791o786L2050O1834M3910j8849o5067o1436j2777K0688Q5282
$$ -80290 24528 27319 20533 52583 114417 158327 139478 74411 12975 198 20886 106168
23652A06168P5005k0441j31032M4306N4977n0437q4307n0177L9845P4981L022
$$ 106168 181173 160732 29700 74006 128983 78546 -5761 -55938 -16093 58888 61910
23641F1910k5911n2687l4855Q4760m9807n5137J08463R9551M5243j45255q3594
$$ 61910 35999 -16688 -51543 33217 -16590 -71727 36736 136287 181530 36275 -47319
23630d7319M3618J03954l9960p4458j00648M1820K8000o1110p8119Q1564M7189
$$ -47319 -3701 100253 60293 -14165 -114813 -72993 -44993 -106103 -184222 -102658 -55469
23619e5469r3140L2973q7829K8860J04719O2925o4107j4636k2145O1185J9986
$$ -55469 -148609 -115636 -203465 -174605 -69886 -6961 -71068 -85704 -107849 -46664 -26678
23608b6678Q9717o2424p6870K3589j278P2323K734l7772M7209m7381j35833L185
$$ -26678 63039 615 -76255 -52666 -53944 18379 21113 -16659 30550 -16831 -152664 -149479
23596a49479L8034n8446Q4294O7332N3203M9422N3847N5093n2858m1583O7480
$$ -149479 -111445 -169891 -85597 -18265 34938 84360 138207 193300 140442 98859 166339
23585A66339m8017j70227j6815l6544q4508L9751R4972J6538l328n4424J8870
$$ 166339 118322 -51905 -68720 -105264 -189772 -150021 -55049 -38511 -41839 -96263 -77393
23574g7393m8021R9331M6673J1982K1230l2772n5755N54m4130p9129P0593l6957
$$ -77393 -125414 -26083 20590 32572 53802 21030 -34725 -34171 -78301 -157430 -86837 -123794
23562a23794k3479R2617J16138J03229Q963M1758p6289m9304j4813J6272r4635
$$ -123794 -147273 -54656 61482 164711 173674 215432 139143 89839 75026 91298 -3337
23551c337q2838k8347P0883j79r8642n8318J30295P7754K2988O363N4248Q0960
$$ -3337 -86175 -114522 -43639 -43818 -142460 -200778 -70483 7271 30259 36622 90870 171830
23539A71830q3369o9641L1084r1357N3630J3932r5591l3403R0388P3094K1948
$$ 171830 88461 18820 49904 -41453 12177 26109 -69482 -102885 -12497 60597 82545
23528H2545R2007J8241o2136j15131p2572p3383k2080K8443N0566r0425M0002
$$ 82545 174552 192793 130657 15526 -57046 -130429 -152509 -124066 -73500 -163925 -123923
23517a23923O2200N6930O3925M9477L5267O0541p3187q2601k8694m8778k3256
$$ -123923 -61723 -4793 59132 108609 143876 204417 131230 48629 19935 -28843 -52099
23506e2099N5204k2424l1687j44049j52581P964J23381l7262L575p6757J9351
$$ -52099 3105 -19319 -51006 -195055 -347636 -339672 -216291 -253553 -249978 -326735 -307384
23495c07384J51957J47926J8383q049n2111m4497p4827L7735Q9549M6689P6855
$$ -307384 -155427 -7501 10882 2833 -49278 -93775 -168602 -130867 -41318 5371 82226
23484H2226J8851k0553j04463L5343N072m1516o5286N2075P0964o7557k0928J5632
$$ 82226 101077 80524 -23939 11404 16476 -25040 -90326 -38251 32713 -34844 -55772 -40140
23472d0140N0694J4099j4348N9652R2466N3177j21526j72706L094j7086Q9146
$$ -40140 10554 24653 10305 69957 162423 215600 94074 -78632 -75538 -92624 -3478
23461c478M2424o5864q3071J1929N4840K65677j8303k1378k9585J8947j5008k4808
$$ -3478 38946 -26918 -109989 -98060 -43220 222457 204154 182776 153191 172138 157130 132322
23449A32322N3468l1628o8722q2440m693L1994r9139o2200j9517J94846Q0619
$$ 132322 185790 154162 85440 3000 -1693 30301 -68838 -131038 -150555 44291 124910
23438A24910o7432l4448L7025m356n9074M3040K3140j59850J1836J66713n2755
$$ 124910 57478 23030 60055 55699 -3375 39665 62805 -97045 -85209 81504 28749
23427B8749M1918J0074l2231N842K6362k4626p0019L2466l3160k0780k1381L5894
$$ 28749 70667 80741 48510 54352 80714 56088 -13931 18535 -14625 -35405 -56786 -20892
23415b0892P7424j10032q9042k1201J11920J78020k818j47995r7238Q6130J16687
$$ -20892 56532 -53500 -142542 -163743 -51823 126197 123379 -24616 -121854 -35724 80963
23404H0963P7245J7766O244O26m518L0587N7260N8842J0772j19842k8142n8210
$$ 80963 158208 175974 182218 182844 178326 208913 266173 325015 335787 215945 187803 129593
23392A29593R458J1824o8001j21407O8391R0717Q2213N0001r6512q7934P4544
$$ 129593 139051 150875 82874 -38533 29858 120575 202788 252789 156277 68343 142887
23381A42887k0832l9200N4851l1303N352J29533l4478R305M1954n9n043m2865
$$ 142887 122055 82855 137706 106403 111755 241288 206810 216115 258069 258010 252967 210102
23369B10102m5669n106l548P9398j350j31430j98557m0878J9136j0803J06352
$$ 210102 164433 159327 155779 235177 233827 102397 -96160 -137038 -117902 -128705 -22353
23358b2353J838P5998l6716m6871j00567J0030O7535K2555m056R870O5131N2472
$$ -22353 -20515 55483 18767 -28104 -128671 -118641 -51106 -28551 -32607 -22737 42394 94866
23346I4866o7306J32763K0047L8151m893j04961j11826o5916K0332r8722p6057
$$ 94866 27560 160323 180370 218521 213628 108667 -3159 -69075 -48743 -147465 -223522
23335b23522m6673N0970P0676m0044R6332Q5024l9223R3147r0877o5660P0439
$$ -223522 -270195 -219225 -148549 -188593 -92261 -7237 -46460 46687 -44190 -109850 -39411
23324c9411M7304o5199R4303j6709P1160L8978k4168m5972J68860L7821p0762
$$ -39411 7893 -57306 36997 20288 91448 130426 106258 60286 229146 266967 196205
23313A96205M3097N7289r9541j64792k4642J04624K1668n6540j42056K2338N4957
$$ 196205 239302 296591 197050 32258 7616 112240 133908 77368 -64688 -42350 12607
23302A2607k5354L7535Q5286N6433K1135J3184j35965j53657m8256l1911o2063
$$ 12607 -12747 24788 110074 166507 187642 200826 64861 -88796 -137052 -168963 -231026
23291b31026K3489N0758L8736m2421j4638K19787J09515k3584j06237K1722j60937
$$ -231026 -207537 -156779 -118043 -160464 -175102 44685 154200 130616 24379 46101 -114836
23280a14836o1709J11346P4427J7170r0133r090k2008J85754R5641q0147n4776
$$ -114836 -176545 -65199 9228 26398 -63735 -72825 -94833 90921 186562 106415 51639
23269E1639J4965j06104r0052L2066N5227N2060J9982j003m6718l8929J2014J8638
$$ 51639 66604 -39500 -129552 -97486 -42259 9801 29783 28780 -17938 -56867 -44853 -26215
23257b6215k0761l8777N3011K4359Q818P1178m7410j06270P2303k3811j688o8681
$$ -26215 -46976 -85753 -32742 -8383 435 71613 24203 -82067 -9764 -33575 -35263 -103944
23245a03944J86687J45727r9822r5795j26391j6674l4868J12432R9220j325m0808
$$ -103944 82743 228470 128648 32853 -93538 -110212 -145080 -32648 66572 65247 24439
23234B4439l2808M2542o3769K4040j3352j2028m8661J3201j8808p4362J04495
$$ 24439 -8369 34173 -29596 -5556 -18908 -30936 -79597 -66396 -85204 -159566 -55071
23223e5071L6002k7651k4986k2O5495N3865N483j2000m7170n2991J7634l3191
$$ -55071 -19069 -46720 -71706 -71728 -6233 47632 53115 41115 -6055 -59046 -41412 -74603
23211g4603M5137J76585r6309j57180j26297o6162R7044N4807K4576K3873N7793
$$ -74603 -29466 147119 50810 -106370 -232667 -298829 -201785 -146978 -122402 -98529 -40736
23200d0736Q421Q4789l6762n7480J39011n2900j09606K989m3669Q86P4172j5969
$$ -40736 -32315 52474 15712 -41768 97243 44343 -65263 -62274 -105943 -105057 -30885 -46854
23188d6854N0704J25951J156j13867j50821L574N2163p9769J11054J8493L6224
$$ -46854 3850 129801 130957 17090 -133731 -130157 -77994 -157763 -46709 -28216 8008
23177H008P6886r4197k25878J2033J10238j3958O1304L5981m3693k4221L8772
$$ 8008 84894 -9303 -235181 -223148 -112910 -126868 -65564 -29583 -73276 -97497 -58725
23166e8725N3057o3689J380J30106J01722l3198q6801M4569L7148L1323n2511
$$ -58725 -5668 -69357 -67977 62129 163851 130653 43852 88421 125569 156892 104381
23155A04381q9287l2732p0906O4420k3599j1627L7974l3081o7363Q7255L2465
$$ 104381 15094 -17638 -88544 -24124 -47723 -59350 -21376 -54457 -121820 -34565 -2100
23144b100k9332K3971J21659R2406m8274j00670j58933L192N33J4037R7774O2530
$$ -2100 -31432 -7461 114198 206604 158330 57660 -101273 -98081 -97548 -83511 14263 76793
23132G6793m5925j3145J08046j1052j42962k1676K7627r9498O4638J05038n8885
$$ 76793 30868 17723 125769 114717 -28245 -49921 -22294 -121792 -57154 47884 -11001
23121a1001r3644O2018l5531j05604N0229J08958J2103k2831k953K2876J4982
$$ -11001 -104645 -42627 -78158 -183762 -133533 -24575 -12472 -35303 -38256 -15380 -398
23110c98m3873N8525J3717J6176J5401J19361m7469p7880n1884N3676J4019O6480
$$ -398 -44271 14254 27971 44147 59548 178909 131440 53560 1676 55352 69371 135851
23098A35851o7271r366j23560j42570k544r260R6239K4611O6517J09709M6429
$$ 135851 68580 59214 -64346 -206916 -209460 -218720 -122481 -97870 -31353 78356 124785
23087A24785n7740k50062r0828K06100N5054J6761O1425n6392o7706k1050j9159
$$ 124785 67045 -183017 -273845 -67745 -12691 4070 65495 9103 -58603 -79653 -98812
23076i8812M1063O0725N4415K319p0911j30415m819P6120K03318J2017J0867l0580
$$ -98812 -57749 2976 57391 59710 -11201 -141616 -146435 -70315 133003 145020 155887 125307
23064A25307k954j349j62998l7200K6320m2453r5235r49O9005J08587j462j0642
$$ 125307 122353 121004 -41994 -79194 -52874 -95327 -190562 -191511 -122506 -13919 -15381 -26023
23052b6023n4826n6542o4114n1475j4316J73695J5667K8246n796K9614K2761J41744
$$ -26023 -80849 -137391 -201505 -252980 -267296 -93601 -77934 -49688 -55484 -25870 -3109 138635
23040A38635J22236L811k5643j60466j14240J22993k0798M6321N0759j0174p7803
$$ 138635 260871 264682 239039 78573 -35667 87326 66528 112849 163608 153434 75631
23029G5631q7q8067k8600Q1909r1127j27592o2821j3807j4443J02633J15912Q208
$$ 75631 75544 -12523 -41123 40786 -50341 -177933 -240754 -254561 -269004 -166371 -50459 -42251
23017d2251o8089J25274P3803k0285p1848n0713j0284n929N7718p8921K7937K3653
$$ -42251 -110340 14934 88737 68452 -3396 -54109 -64393 -70322 -12604 -91525 -63588 -39935
23005c9935j6148P4964M5898N823j5124j14415j11748J7358N1086q749j04510
$$ -39935 -56083 18881 64779 70602 55478 -58937 -170685 -153327 -102241 -110990 -215500
22994b15500j27604M2786Q7347q4647N4197L0618m5065K8043J67520J0263q8991
$$ -215500 -343104 -300318 -212971 -297618 -243421 -212803 -257868 -229825 -62305 -52042 -141033
22983a41033K4246p674J5245l3153J5192N2655k6170l8353R0670J4018p516N245
$$ -141033 -116787 -124461 -109216 -142369 -127177 -74522 -100692 -139045 -48375 -34357 -41873 -36628
22971c6628Q3174p5976r4518j4714K4452K0449n8016j2919J47977Q6290j00007
$$ -36628 46546 -29430 -123948 -138662 -114210 -93761 -151777 -164696 -16719 69571 -30436
22960c0436n029j3359J1576o4726J10428Q7229n9043L786p888M0275r3153m0185
$$ -30436 -35465 -48824 -37248 -101974 8454 95683 36640 40426 32538 72813 -20340 -60525
22948f0525r5265Q3261k519k8458J3861O7208m4202Q854P9966N3006k0143O680
$$ -60525 -155790 -72529 -75048 -103506 -89645 -22437 -66639 -57785 22181 75187 55044 61724
22936F1724p7427p3835J5290K9262K0798J16958p898j05825l3719j00837J5061
$$ 61724 -15703 -89538 -74248 -44986 -24188 92770 84872 -20953 -54672 -155509 -140448
22925a40448n6578M6999J26498R4197q4997k9126M6990L2007o6279L8660J45113
$$ -140448 -197026 -150027 -23529 70668 -14329 -43455 3535 35542 -30737 7923 153036
22914A53036p1803j23446K5341j6616O8967n174J17784L1116j5973j02672p2033
$$ 153036 81233 -42213 -16872 -33488 35479 30305 148089 179205 163232 60560 -11473
22903a1473L5966P623j1028l1392j24498O6802J5764p2606j1957O1893K4079k8315
$$ -11473 24493 32116 21088 -10304 -134802 -68000 -52236 -124842 -136799 -74906 -50827 -79142
22891g9142K0046R0412O5078N4384r4313n4104J672K4790M2433J2251k8789r6112
$$ -79142 -59096 31316 96394 150778 56465 2361 4033 28823 71256 83507 54718 -41394
22879d1394M5409O6964J8742L941o2088j8271p8799N4367O247j08028J52574K5681
$$ -41394 4015 70979 89721 93662 31574 13303 -65496 -11129 -4882 -112910 39664 65345
22867F5345o8065J1310K8311L1693o670M7881M8951p5943j32813m4779N1931Q2888
$$ 65345 -2720 8590 36901 68594 61924 109805 158756 82813 -50000 -94779 -42848 40040
22855D0040L2299L0972k1219j74339q3828l4958J75120J19996k3285j1056N360
$$ 40040 72339 103311 82092 -92247 -176075 -211033 -35913 84083 60798 49742 55102
22844E5102N1184j80058l7492J57021J78677j35935k41555r7003J04454O5681
$$ 55102 106286 -73772 -111264 45757 224434 88499 -153056 -250059 -145605 -79924
22834g9924P5122O0287p3847m4038M394J13219m0113j47354q3660J18576j9895
$$ -79924 -4802 55485 -18362 -62400 -58006 55213 15100 -132254 -215914 -97338 -117233
22823a17233J9980L6473L3347J7744Q2082Q9946J3056j13498n2961o3502P6908
$$ -117233 -97253 -60780 -27433 -9689 72393 162339 175395 61897 8936 -54566 22342
22812B2342k1386r5968O2104j248N2597J632m0664j10434o545J62306P2441j6930
$$ 22342 956 -95012 -32908 -34156 18441 20073 -20591 -131025 -137570 24736 97177 80247
22800H0247Q7220j14930j30831n667J00619n5202m3874M5867J10585n5293L9470
$$ 80247 167467 52537 -78294 -83961 16658 -38544 -82418 -36551 74034 18741 58211
22789E8211N7745q4721o7618p535M3207P1662J0381j24210l7014J3090J87330
$$ 58211 115956 31235 -36383 -43918 -711 70951 81332 -42878 -79892 -66802 120528
22778A20528Q8616p838m2052j54932j3575l8064r2198j37200m4976J75707J42462
$$ 120528 209144 201306 159254 4322 -9253 -47317 -139515 -276715 -321691 -145984 -3522
22767c522m961N0453J1124l228n9157n2143o8395j9932k3566p4178N6472J18434
$$ -3522 -8483 41970 53094 49866 -9291 -61434 -129829 -149761 -173327 -247505 -191033 -72599
22755g2599K1835Q4573J76062L6050k04984q8994n2198m3260J99558N289p5205
$$ -72599 -50764 33809 209871 245921 40937 -48057 -100255 -143515 56043 61332 -13873
22744a3873q2824Q93N7265P8672O4497m2269M683P765M4961m7036L179q3640r7986
$$ -13873 -96697 -95804 -38539 40133 104630 62361 67044 74809 119770 72734 75913 -7727 -105713
22731a05713Q2949J52133O3814l3848j02599l5603k9190o3652M696M5997J00564
$$ -105713 -22764 129369 193183 159335 56736 21133 -8057 -71709 -67013 -21016 79548
22720G9548P3526j85868p7339j11826o9009K23133K32840N453p6491O420M5438
$$ 79548 153074 -32794 -110133 -221959 -290968 -67835 165005 170458 93967 100387 145825
22709A45825M4109l0506k21123O527N1687j921K6510K5380j34937m922N8092N2370
$$ 145825 189934 159428 -61695 -55168 -3481 -5402 21108 46488 -88449 -93371 -35279 17091
22697A7091M0948M6595k4799m3984L3038j25552p5090P6732R4092J03036J7268
$$ 17091 58039 104634 79835 35851 68889 -56663 -131753 -55021 39071 142107 159375
22686A59375q6720q1431n2436n2216K4969O8658O3796j4078p3760p7770m5932
$$ 159375 72655 -8776 -61212 -113428 -88459 -19801 43995 29917 -43843 -121613 -167545
22675a67545K9871J28326O101l1637l1332J1668j5899q0975J36436J49204L8800
$$ -167545 -137674 -9348 -3247 -34884 -66216 -54548 -70447 -151422 -14986 134218 173018
22664A73018j6611l2668j17350l137p176R4504J09322j42555m8713P6612J3009
$$ 173018 156407 123739 6389 3252 -3924 90580 199902 57347 8634 85246 98255
22653I8255O2219o7332m8888P1897m301k6580j35784P288P7489j4923M2656o4382
$$ 98255 160474 93142 44254 116151 111850 85270 -50514 -43226 34263 19340 61996 -2386
22641b386k3866p9611n5920k5615K6539J09369J24275Q3117j8612K4374K4810
$$ -2386 -26252 -105863 -161783 -187398 -160859 -51490 72785 155902 137290 161664 186474
22630A86474k1657q0441j26909k626Q4346O1555j7944j2754K1169J8619n6954
$$ 186474 164817 84376 -42533 -45159 39187 100742 82798 70044 91213 109832 52878
22619E2878K3206p791o7418N2600q443l2954L9085n156R3252n4371j5993K9434
$$ 52878 76084 68293 875 53475 45032 12078 51163 46007 139259 84888 68895 98329
22607I8329K1869j1563l0211r5532n9515l6209l3277n456K6909Q4231J19625N2931
$$ 98329 120198 108635 78424 -17108 -76623 -112832 -146109 -151565 -124656 -40425 79200 132131
22595A32131K8087K0617l8620Q931o0988k6195M9229N1885L6917m6694P2891K8972
$$ 132131 160218 180835 142215 151146 90158 63963 113192 165077 201994 155300 228191 257163
22583B57163P0105o7106P41p4102j26349o8965k1765J40650J26267l0068j40012
$$ 257163 327268 260162 260903 186801 60452 -8513 -30278 110372 236639 206571 66559
22572F6559o5298N8537L4109L2941j3713p7206m0337N4193K9167r3701q2913N16
$$ 66559 1261 59798 93907 126848 113135 35929 -4408 49785 78952 -14749 -97662 -97146
22560i7146j0681P7107j1295O204Q8118o5305o3935J7709O7023n5230j12429n2652
$$ -97146 -107827 -30720 -42015 -35811 52307 -12998 -76933 -59224 7799 -47431 -159860 -212512
22548b12512Q7842M7640k03774l912K05834J68456j50207n3766m5916P1405J52327
$$ -212512 -124670 -77030 -280804 -284716 -78882 89574 -60633 -114399 -160315 -88910 63417
22537F3417j224j6268n807r9710K9654O6682J5383o4700j9090k8255p4754M4226
$$ 63417 62193 45925 40118 -59592 -29938 36744 52127 -12573 -31663 -59918 -134672 -90446
22525i0446l3316l4727O8805O637J21409O3877j11353j06669K4210R9737J0055
$$ -90446 -123762 -158489 -89684 -83047 38362 102239 -9114 -115783 -91573 8164 18219
22514A8219k3818O5188l5860j43012l5295J47779M4520j90405j15703l3858J91492
$$ 18219 -5599 59589 23729 -119283 -154578 -6799 37721 -152684 -268387 -302245 -110753
22503a10753J57211n7676n0926M9349m8084q9418J8827N4468j4482o4686n3434
$$ -110753 46458 -11218 -62144 -12795 -60879 -150297 -131470 -77002 -91484 -156170 -209604
22492b09604M6705J01719p738q5166O6978O988l5901J4916M2254L9938J4206j6351
$$ -209604 -162899 -61180 -68918 -154084 -87106 -80118 -116019 -101103 -58849 -18911 -4705 -21056
22480b1056Q8052J19842P860j78378j38983p9800L5346k4869K4448l4412r9039
$$ -21056 66996 186838 194698 16320 -122663 -202463 -167117 -191986 -167538 -201950 -300989
22469c00989j8941J07994J03900m2034j09111P1778K5535P1776O2345K7425L6378
$$ -300989 -319930 -211936 -108036 -150070 -259181 -187403 -161868 -90092 -27747 -322 36056
22458C6056O8022N1403J0558n2309j0594P2748K2126k9899m0684n8399r6589P0970
$$ 36056 104078 155481 166039 113730 103136 175884 198010 168111 127427 69028 -27561 43409
22446D3409j8849j5199Q9903J05295m7055m4264Q9832n824q2544r4978K5295l5528
$$ 43409 24560 9361 99264 204559 157504 113240 203072 197248 114704 19726 45021 9493
22434I493o5313P6214P4119j7441J5447M2241p2232N6104L2024M2187o0919j01961
$$ 9493 -55820 20394 94513 77072 92519 134760 62528 118632 150656 192843 131924 29963
22422B9963o3573l1820r5820m4934J30164J61807O6699j15024j08888l381M8623
$$ 29963 -33610 -65430 -161250 -206184 -76020 85787 152486 37462 -71426 -74807 -26184
22411b6184M9739N8838L5597p1779j14572o4358k65Q5379J41821k7359j00614
$$ -26184 23555 82393 117990 46211 -68361 -132719 -132984 -47605 94216 66857 -33757
22400c3757j33908Q4683J27397q9523n3007P7012R672J4414K4918L9930p1111
$$ -33757 -167665 -82982 44415 -45108 -98115 -21103 -11431 2983 27901 67831 -3280
22389c280J5413L8512N4835n652o7664o7254k9716O1044J4641N262N8946j09630
$$ -3280 12133 50645 105480 99828 32164 -35090 -64806 -3762 10879 16141 75087 -34543
22377c4543L2021j3541R2154r7077j55288k9423K2681J5927k0546r6874o8163
$$ -34543 -2522 -16063 76091 -20986 -176274 -205697 -183016 -167089 -187635 -284509 -352672
22366c52672R6133M012n4951L1144R2492n9583p3569R6802R8581Q3829P390P7284
$$ -352672 -256539 -252527 -307478 -276334 -183842 -243425 -316994 -220192 -121611 -37782 -30392 46892
22354D6892M527j14695k0279R8185K8634o8793o734N419o0190l6352O9480L0274
$$ 46892 51419 -63276 -83555 14630 43264 -25529 -32263 -26844 -87034 -123386 -53906 -23632
22342b3632j1750L9326J4692M9610k04807q578M7905J3597L3224J40044O756O9717
$$ -23632 -35382 3944 18636 68246 -136561 -145139 -97234 -83637 -50413 89631 96387 166104
22330A66104N0648k0308j14102j14026j38834L5392J94211N523j07086l4782n3498
$$ 166104 216752 196444 82342 -31684 -170518 -135126 59085 64608 -42478 -77260 -130758
22319a30758n9526L0432J07149J29013O1266j35460o5968P1738J17561k8086m9965
$$ -130758 -190284 -159852 -52703 76310 137576 2116 -63852 7886 125447 97361 47396
22308D7396p4023P3556j947M974Q1377j5403K1601k3365j7882Q1468J6416j0816
$$ 47396 -26627 46929 44982 49956 131333 115930 137531 114166 96284 177752 194168 183352
22296A83352N8114l0944J83p8780j71311o4291K1808O3356R2926N8300o9878k7840
$$ 183352 241466 210522 210705 131925 -39386 -103677 -81869 -18513 74413 132713 62835 34995
22284C4995K2356R5899p5563l4385J14884L9672p1707j11591n8666M0229P6839
$$ 34995 57351 153250 77687 43302 158186 197858 126151 14560 -44106 -3877 72962
22273G2962m4329p0892k0184p128Q373k1630J3155J0719L9428k3865m9609P4210
$$ 72962 28633 -42259 -62443 -69571 -61198 -82828 -69673 -58954 -19526 -43391 -93000 -18790
22261a8790L1069Q7587k8359r5353j16229K0236R0156R861m1964j0782p628K3013
$$ -18790 12279 99866 71507 -23846 -140075 -119839 -29683 -19822 -61786 -72568 -80196 -57183
22249e7183m2038k4911P5200N1032P1656p95k752Q7684K079r6783j55342P7212
$$ -57183 -99221 -124132 -48932 2100 73756 72961 70209 157893 159972 63189 -92153 -14941
22237a4941K3340j4924n5393J0026Q30K540N1113J28172k5731p5508k3648k1757
$$ -14941 8399 -6525 -61918 -51892 -51062 -48522 2591 130763 105032 29524 5876 -15881
22225a5881P9044l2513J092j22546R7001k1277l1408J05241l935j18868p3993
$$ -15881 63163 30650 31742 -90804 6197 -15080 -46488 58753 54818 -64050 -138043
22214a38043j7380o0472P8570O6745m8720O5913N2472J18058J22066l0692o1495
$$ -138043 -155423 -215895 -137325 -70580 -119300 -53387 -915 117143 239209 208517 147022
22203A47022o5971l8294l0693j35009L6301J92898P9199p6036m1439j22531K4184
$$ 147022 81051 42757 12064 -122945 -86644 106254 185453 109417 67978 -54553 -30369
22192c0369M0415l8272j06885L3458L8281l51P042n442R5091P5964l335N0785
$$ -30369 10046 -28226 -135111 -101653 -63372 -63723 -56681 -62123 32968 108932 105597 156382
22180A56382N708j38505n5264J35615J40292j25925k23192r553Q6240J22341J4674
$$ 156382 162090 23585 -31679 103936 244228 118303 -104889 -114442 -28202 94139 108813
22169A08813m5081k7474j4399N1124j4501L6710K7428M7409l9172J1259k2542
$$ 108813 63732 36258 21859 72983 58482 95192 122620 170029 130857 142116 119574
22158A19574q6206j64490J7525J8762k620k3418K5251J1489O6704M2457l8452
$$ 119574 33368 -131122 -113597 -94835 -97455 -120873 -95622 -84133 -17429 25028 -13424
22147a3424n2161M8184N4119L5230k0099m4337K1457k3472l1150j34121j8644
$$ -13424 -65585 -17401 36718 71948 51849 7512 28969 5497 -25653 -159774 -178418
22136a78418J47649M3274O4742q3840r2226q4837M2757k7585l9315k758N120N8150
$$ -178418 -30769 12505 77247 -6593 -98819 -183656 -140899 -168484 -207799 -210557 -205437 -147287
22124a47287J11857M8530j2987j14806q0483k6533R2549j07987q1297N9699J69409
$$ -147287 -35430 13100 113 -114693 -195176 -221709 -129160 -237147 -318444 -258745 -89336
22113h9336P6337j286N1120M0386q586o8399l5522k963O2224J36042P0185j33533
$$ -89336 -12999 -14285 36835 77221 68635 236 -35286 -38249 23975 160017 230202 96669
22101I6669p8895L4669J2343O7417K0561n2507L1708k4177r2360q2347K5483O7590
$$ 96669 17774 52443 64786 132203 152764 100257 131965 107788 15428 -66919 -41436 26154
22089B6154Q7047N4134K0174j24564j026n722J772J130l945N3292n9267j44321
$$ 26154 113201 167335 187509 62945 61919 56197 57969 59099 55154 108446 49179 -95142
22077i5142J14896R917K072R56j04953L5480L809N4564L0527n1841k017j00238
$$ -95142 19754 29671 31743 32699 -72254 -36774 -32965 21599 52126 285 -1732 -101970
22065a01970J857M1755R660n428J14719m2290r6473j5553K7942J03147O5215L6926
$$ -101970 -100113 -58358 -48698 -54126 60593 18303 -78170 -93723 -65781 37366 102581 139507
22053A39507j0576m0200k6968l7611j03589J1645P6893K6528j02651k8472n340
$$ 139507 128931 88731 61763 24152 -79437 -67792 9101 35629 -67022 -95494 -100834
22042a00834O0016M8530K6673n3323m094j7905k5486L4686j055o9615o4544R3234
$$ -100834 -40818 7712 34385 -18938 -23032 -40937 -66423 -31737 -32792 -102407 -166951 -73717
22030g3717J78139J25279j42586M474J14478r529j5013J4153J449q2859k00600
$$ -73717 104422 229701 87115 91589 206067 196538 181525 195678 197127 114268 -86332
22019h6332r2132R2473Q243Q472J58163m5006j19661N7210P0674j5598m4930k2612
$$ -86332 -178464 -85991 -77748 -69276 88887 43881 -75780 -18570 52104 36506 -8424 -31036
22007c1036M2399K4000j4424O1695l0011r4610O9671P9581n027k818K5368n019
$$ -31036 11363 35363 20939 82634 52623 -41987 27684 107265 102238 99420 124788 119769
21995A19769J68296P594j88836j65240L3596j4533p6028j3145K6752R6684J02027
$$ 119769 288065 295659 106823 -58417 -24821 -39354 -115382 -128527 -101775 -5091 96936
21984I6936R3352m3638l7380r1873j34023K631p577K9705j1163l6083q6081Q2606
$$ 96936 190288 146650 109270 17397 -116626 -113995 -121572 -91867 -103030 -139113 -225194 -142588
21972a42588J86632n9022J9254j9606P032m0267K2917J14730N5656l0734r0615
$$ -142588 44044 -14978 4276 -15330 -8298 -48565 -25648 89082 144738 114004 23389
21961B3389k8247K7690r6356k5441J17767K1543k0408L1563L4374q0373m3520
$$ 23389 -4858 22832 -73524 -98965 18802 40345 19937 51500 85874 5501 -38019
21950c8019k9347J20998P6984j43873j38141J35128K0548J6653O1298M7594R3504
$$ -38019 -67366 53632 130616 -13257 -151398 -16270 4278 20931 82229 129823 223327
21939B23327n4952P2158K5456j11488q0020J3438q5147m8805Q4981J3866M6841
$$ 223327 168375 240533 265989 154501 74481 87919 2772 -46033 38948 52814 99655
21928I9655O7793k4460j31829k4082m1426K2147R508P950k8233L99j19710P4049
$$ 99655 167448 142988 11159 -12923 -54349 -32202 -22694 -14744 -42977 -42578 -162288 -88239
21916h8239K06440L9058n9481j156O6537M6261l9878r2278j76569j87698l3962
$$ -88239 118201 157259 97778 96622 163159 209420 169542 77264 -99305 -287003 -320965
21905c20965P4984J06232R5732n4497J7909M1186J01854k032j02466n2744j9867
$$ -320965 -245981 -139749 -44017 -98514 -80605 -39419 62435 60403 -42063 -94807 -114674
21894a14674q3555N8717N390Q966K2102J96153M4290p654N6063J04762r911M7947
$$ -114674 -198229 -139512 -134122 -125156 -103054 93099 137389 129735 185798 290560 280649 328596
21882C28596L5608j21411q1775J0613k1306j3084n8020j1341J42270L0961j4387
$$ 328596 364204 242793 161018 171631 150325 137241 79221 67880 210150 241111 226724
21871B26724j7510j89968k6161N6587Q9536J3564j18868l4732O8354m2519m6905
$$ 226724 209214 19246 -6915 49672 139208 152772 33904 -828 67526 25007 -21898
21860b1898n8170J153R5694N9424j4519R038j7070J18448R1620p8256K3183o3886
$$ -21898 -80068 -78915 16779 76203 61684 70722 53652 172100 263720 185464 208647 144761
21848A44761r1097L8329O3303M4642J6549o1027j22791m8880K9745Q3504P3865
$$ 144761 53664 91993 155296 199938 216487 155460 32669 -16211 13534 97038 170903
21837A70903J20834j4068m3719m1264j36095p6963n3374j4831k7824N4750R142
$$ 170903 291737 277669 233950 192686 56591 -20372 -73746 -88577 -116401 -61651 -52509
21826e2509J109k646M72M3408M1735m6261o8627N2858O0142P693L5918q2412o9189
$$ -52509 -51400 -54046 -53574 -10166 31569 -14692 -83319 -30461 29681 37374 73292 -9120 -78309
21813g8309J7303J60854J12008j8516n7824l3420N256R126m60j79304q6330Q3269
$$ -78309 -61006 99848 211856 193340 135516 102096 107352 116478 116018 -63286 -149616 -66347
21801f6347R1069L305L1548m2965P1898M848k3234L0179J9057L5907L9128r5054
$$ -66347 24722 28027 59575 16610 88508 93356 70122 100301 119358 155265 194393 99339
21789I9339j78797M9857J54028k9604k01118p1915N3979L9063K3303O4436M2422
$$ 99339 -79458 -29601 124427 94823 -106295 -178210 -124231 -85168 -61865 2571 44993
21778D4993N5930k8199q0751j40935p7110J14197n5061K6245M7576M4351Q5321
$$ 44993 100923 72724 -8027 -148962 -226072 -111875 -166936 -140691 -93115 -48764 36557
21767C6557k8019k6892q4878K6835L3999J5933L7478L2447p2012j05956K2061
$$ 36557 8538 -18354 -103232 -76397 -42398 -26465 11013 43460 -28552 -134508 -112447
21756a12447R8953l5409l8221J02777L8326j5447r2131l7289j01918O6158Q6902
$$ -112447 -13494 -48903 -87124 15653 53979 38532 -53599 -90888 -192806 -126648 -39746
21745c9746R5694Q408L4897m6951j57284j13904m2263O2006P6715P9732Q0629
$$ -39746 55948 64356 99253 52302 -104982 -218886 -261149 -199143 -122428 -42696 37933
21734C7933J69186R888M4207Q7322o314j52928j03855J5428q156r1715l1353P7380
$$ 37933 207119 217007 261214 348536 342222 189294 85439 100867 92711 996 -30357 47023
21722D7023M4839j9651l7286j1724J5493M4665j27840p670N3958m4911J3061N3058
$$ 47023 91862 72211 34925 23201 38694 83359 -44481 -52151 1807 -43104 -30043 23015
21710B3015k3340j3078m3231P765p6755Q0374l7841N7128N9988M6537p2666j15598
$$ 23015 -325 -13403 -56634 -48869 -125624 -45250 -83091 -25963 34025 80562 7896 -107702
21698a07702M7387O076J2711l888m4979j12730J4838n0404p946M7068m38L2k888
$$ -107702 -60315 -54239 -41528 -45416 -90395 -203125 -188287 -238691 -246637 -199569 -200007 -199975 -202863
21685b02863O9454J05234J7215J7586p7530r9709l871J34930N047j9568p18l1360
$$ -202863 -133409 -28175 -10960 6626 -70904 -170613 -174484 -39554 -34507 -54075 -54793 -86153
21673h6153j57444J653J62519J05113j37421n761P0423N3357j5704j7829l7132
$$ -86153 -243597 -241944 -79425 25688 -111733 -117494 -47071 6286 -9418 -27247 -64379
21662f4379k6010L6167K8965n9787r5325j32060J977M7508M2358N7729j9134J5718
$$ -64379 -90389 -54222 -25257 -85044 -180369 -312429 -310452 -262944 -220586 -162857 -181991 -166273
21650a66273O7610N6374n0999k8699j5630J14477P7023k5978k5402L8988k1163
$$ -166273 -98663 -42289 -93288 -121987 -137617 -23140 53883 27905 2503 41491 20328
21639B0328N0271L9625J5362n7095j3033l7870p1646O2210J5863m912K649r7750
$$ 20328 70599 110224 125586 68491 55458 17588 -54058 8152 24015 19103 21752 -75998
21627g5998K6844J3494j1004j03027J368J17967O2117J74570O8910r3226n654
$$ -75998 -49154 -35660 -46664 -149691 -148323 -30356 31761 206331 275241 182015 176361
21616A76361O4034K2475j32787j67352o9590Q2452k1554l4511O418L4906j4165
$$ 176361 240395 262870 130083 -37269 -106859 -24407 -45961 -80472 -74054 -39148 -53313
21605e3313L0460O7892j30337p299Q9965L4330p2880j10849n5734l135R1108Q0132
$$ -53313 -22853 45039 -85298 -92597 -2632 31698 -41182 -152031 -207765 -210900 -119792 -39660
21593c9660n830j44351K4419j6219J91810L8076o3853j2609K2534k2830n9498
$$ -39660 -45490 -189841 -165422 -181641 10169 48245 -15608 -28217 -5683 -28513 -88011
21582h8011l7237m5082p1866O162l4132j3729J29321L5419M5098j5162l6583K7623
$$ -88011 -125248 -170330 -242196 -236034 -270166 -283895 -154574 -119155 -74057 -89219 -125802 -98179
21570i8179O563m9744J2913J2687j02825J18783Q8019q5367n013l5212m7233M7519
$$ -98179 -91616 -141360 -128447 -115760 -218585 -99802 -11783 -97150 -102163 -137375 -184608 -137089
21558a37089k6357Q695J9735j0889J7172K9451P2494p0963J6663J01893k9096
$$ -137089 -163446 -154751 -135016 -145905 -128733 -99282 -26788 -97751 -81088 20805 -8291
21547h291R3253R1401m9311m8197k5299L3711P9501o0116k9660r0244o4711J47372
$$ -8291 84962 176363 127052 78855 53556 87267 166768 106652 76992 -13252 -77963 69409
21535F9409J55613j7304o880k279j0659o9401l1565n0393J8737m1744l0445K4563
$$ 69409 225022 207718 200838 198559 187900 118499 86934 36541 55278 13534 -16911 7652
21523G652P780n6585m706J0664k1486k2932L8364l6324n1318N6763K1690J4321
$$ 7652 15432 -41153 -45859 -35195 -56681 -79613 -41249 -77573 -128891 -72128 -50438 -36117
21511c6117L1818p4457k2882o0123O1104J2701Q3441n4004K4580J04518J8401
$$ -36117 -4299 -78756 -101638 -161761 -100657 -87956 -4515 -58519 -33939 70579 88980
21500H8980J6178K676m3952k959p373k6735j35146j14620m046R2045J52929j4363
$$ 88980 105158 107834 63882 60923 53550 26815 -108331 -222951 -226997 -134952 17977 3614
21488C614o214P8537m8625j14912K170J17283J15558N7966j54518j42656O262
$$ 3614 -2600 75937 27312 -87600 -85430 31853 147411 205377 50859 -91797 -85535
21477h5535j1966j9762O4490r132m450J74777l9960k1148K0285P21N6221n6177
$$ -85535 -97501 -117263 -52773 -61905 -66355 108422 68462 47314 67599 68320 124541 68364
21465F8364n9927K454N5592Q399p4938J55505m6514j63031j07060l568N1623k3891
$$ 68364 8437 10891 66483 74882 -56 155449 108935 -54096 -161156 -164724 -113101 -136992
21453a36992R9528O1464R4522o7063j13346m449Q8937J017n4834j00699o3704
$$ -136992 -37464 24000 118522 51459 -61887 -66336 22601 23618 -31216 -131915 -195619
21442a95619M9803N9758Q3320o429J6558j60081l4505m6724J80086M6231n1276
$$ -195619 -145816 -86058 -2738 -9167 7391 -152690 -187195 -233919 -53833 -7602 -58878
21431e8878m6116j8611P9868j8970K4067J305q5488J8426K6705K6404O5778l0482
$$ -58878 -104994 -123605 -43737 -62707 -38640 -37335 -122823 -104397 -77692 -51288 14490 -15992
21419a5992j53799M4517K697P6855r4660L1618O9345m6212l9446o2129K4197J19712
$$ -15992 -169791 -125274 -122577 -45722 -140382 -108764 -39419 -85631 -125077 -187206 -163009 -43297
21407d3297O7691O4751Q8699L758o9983j18244l502m0411L4463J03012q1923r9432
$$ -43297 24394 89145 177844 181602 111619 -6625 -10127 -50538 -16075 86937 5014 -94418
21395i4418q5253O1727R9236M0820k0240p4530n2338J28121Q1424l1661q6294
$$ -94418 -179671 -117944 -18708 22112 1872 -72658 -124996 3125 84549 52888 -33406
21384c3406j1801Q760O425J5766l0267j7689O7111R5581o669K0606m4598j28691
$$ -33406 -45207 -36447 -30022 -14256 -44523 -62212 4899 100480 93811 114417 69819 -58872
21372e8872j19761j85545M7666M0728R890J07804O8812J3772q3366J5252P8831
$$ -58872 -178633 -364178 -316512 -275784 -265894 -158090 -89278 -75506 -158872 -143620 -64789
21361f4789M2944q6677k8511j22820L6803J39348O9230L3258j2496M7678r25j20991
$$ -64789 -21845 -108522 -137033 -259853 -223050 -83702 -14472 18786 6290 53968 53043 -67948
21349f7948k4907J6148R8495R4525J29846k4046j15032j83691r3420m6343M4768
$$ -67948 -92855 -76707 21788 116313 246159 222113 107081 -76610 -170030 -216373 -171605
21338a71605Q0536p312P7670J19223j2913j5528o7112q9544m8075R257J36846
$$ -171605 -91069 -98381 -20711 98512 85599 70071 2959 -86585 -134660 -125403 11443
21327A1443M0636j2004N4960K195r3154j04908j13421k9947J03149J48365R3171
$$ 11443 52079 40075 95035 97230 4076 -100832 -214253 -244200 -141051 7314 100485
21316A00485o0303j08327p0416j11414J4807L6095K9431n298J44349O1078l5808
$$ 100485 40182 -68145 -138561 -249975 -235168 -199073 -169642 -174940 -30591 30487 -5321
21305e321q7919L6586j7238m4841j8764J02923J06052m3135m754J7727o3361K9893
$$ -5321 -93240 -56654 -73892 -118733 -137497 -34574 71478 28343 23589 41316 -22045 7848
21293G848L9225O5407O0892K8262k2306j13390k09635M0425K7721Q0967L2819
$$ 7848 47073 112480 173372 201634 179328 65938 -143697 -103272 -75551 5416 38235
21282C8235J33042m107j07462j18527K5282M0044m064p5238j41114j5911P7639
$$ 38235 171277 167170 59708 -58819 -33537 6507 2443 -72795 -213909 -229820 -152181
21271a52181J49307M2580m171m9347M9980p8669L0996p5157p1152N6957p0181
$$ -152181 -2874 39706 35535 -13812 36168 -42501 -11505 -86662 -157814 -100857 -171038
21260a71038p8715J87654L1605r2481N0550L9613J10061M3743m0552M0110R5048
$$ -171038 -249753 -62099 -30494 -122975 -72425 -32812 77249 120992 80440 120550 215598
21249B15598j64381j94993K1983J4290k7168j0679k0208o339P4377J70230J52114
$$ 215598 51217 -143776 -121793 -107503 -134671 -145350 -165558 -171897 -97520 72710 224824
21238B24824n0717n7515l2412j71521j66559K5021J44423J4047M2405Q633n4286
$$ 224824 174107 116592 84180 -87341 -253900 -228879 -84456 -70409 -28004 -19371 -73657
21227g3657j16526P3934K6631p7666l7480J27143N2735Q7173l0126o9838O9268
$$ -73657 -190183 -116249 -89618 -167284 -204764 -77621 -24886 62287 32161 -37677 31591
21216C1591j4593O6968J84039p8600j55790J3181L8373J8143K9341k650L998o6129
$$ 31591 16998 83966 268005 189405 33615 46796 85169 103312 132653 130003 134001 67872
21204F7872n3223l4065p8923Q4076M1900j08923O9505K1469j3657P6145J11238
$$ 67872 14649 -19416 -98339 -14263 27637 -81286 -11781 9688 -3969 72176 183414
21193A83414j5866r5090r2479N4363J0616R3678K3712q6913l208l1003L527l4581
$$ 183414 167548 72458 -20021 34342 44958 138636 162348 75435 72227 41224 44751 10170
21181A0170j53542o619J07586K06621M221m3956P3363j02338m3786o225N8085
$$ 10170 -143372 -149991 -42405 164216 168437 124481 197844 95506 51720 45495 103580
21170A03580J113o6279r1257J73167P0926o4716j10170k5365J2990J09591R234
$$ 103580 104693 38414 -52843 120324 191250 126534 16364 -9001 3989 113580 122814
21159A22814o8422J8296m1038J7760O2025P887j26446j08642p0069Q3403O1600
$$ 122814 54392 72688 31650 49410 111435 119322 -7124 -115766 -185835 -102432 -40832
21148d0832l2048J32373R3932j14971j47730K3149R4099M9045p904l7506r246
$$ -40832 -72880 59493 153425 38454 -109276 -86127 7972 57017 49113 11607 2361
21137B361o9151m9955O0831J32206J601r1079j6813j7089N1763J749k2534J22418
$$ 2361 -66790 -116745 -55914 76292 77893 -13186 -29999 -47088 4675 6424 -16110 106308
21125A06308p7740j37840l7942R6774L7562n9233K0488l1961Q2742N9760j23045
$$ 106308 28568 -109272 -147214 -50440 -12878 -72111 -51623 -83584 -842 58918 -64127
21114f4127j7522J16331M1884o1479j28201K2754J43724K5627K0124j06911J992
$$ -64127 -81649 34682 76566 15087 -113114 -90360 53364 78991 99115 -7796 -5804
21103e804L4257j7613J0418o6745R5202k594K2033o107O9409p3126k31802o8359
$$ -5804 28453 10840 21258 -45487 49715 47121 69154 63047 132456 59330 -172472 -240831
21091b40831K3083r998J17582J31588j8222J2537l4515j03006k464P2397Q2578
$$ -240831 -217748 -227746 -110164 21424 3202 15739 -18776 -121782 -124246 -51849 30729
21080C0729J1818m6362k551l474n376N2752p8898j00306J57340J11714q8731L2910
$$ 30729 42547 -3815 -6366 -9840 -15216 37536 -41362 -141668 15672 127386 38655 71565
21068G1565j04724o2547k3760P3196J7458j27083q0981K7766K10546N8162m9331
$$ 71565 -33159 -95706 -119466 -46270 -28812 -155895 -236876 -209110 1436 59598 10267
21057A0267q8697J438J07205l8853k8751N1099K7817K6618n5639l7863n0326M1444
$$ 10267 -78430 -76992 30213 -8640 -37391 13708 41525 68143 12504 -25359 -75685 -34241
21045c4241N0185K7341m8167n2894j6099R1805N1727N7873K594m9392l4472k9367
$$ -34241 15944 43285 -4882 -57776 -73875 17930 69657 127530 130124 80732 46260 16893
21033A6893N4244m2296n5702q4105O58m237R7032N9639m5369K8308m4470J2668
$$ 16893 71137 28841 -26861 -110966 -110308 -114545 -17513 42126 -3243 25065 -19405 -6737
21021f737k3051J04042M1124j11775n8069q3932K0393O9912P2378j0176l381P8138
$$ -6737 -29788 74254 115378 3603 -54466 -138398 -118005 -48093 24285 14109 10728 88866
21009H8866O9037p9534j78277q2225j32464J33995M1373j550p087N1151l0736
$$ 88866 157903 78369 -99908 -182133 -314597 -180602 -139229 -140779 -147866 -96715 -127451
20998a27451K6975J27095M8876j78478j00835L9710J30179K381J5197J4686J24453
$$ -127451 -100476 26619 75495 -102983 -203818 -164108 -33929 -31548 -16351 -1665 122788
20987A22788r5811o2653O8527J44443K2106m0128p4654j44866j06518l1638n5376
$$ 122788 26977 -35676 32851 177294 199400 159272 84618 -60248 -166766 -198404 -253780
20976b53780P3296M6945k484j7455L2840J07865N1647m8763j29758L282J05372
$$ -253780 -180484 -133539 -136023 -153478 -120638 -12773 38874 -9889 -139647 -136365 -30993
20965c0993J25o2266Q7656q801m2957L7229J84579j2972n868n5391p3779K4457
$$ -30993 -30868 -93134 -5478 -14279 -57236 -20007 164572 151600 145732 90341 16562 41019
20953D1019L3889r8867k3936n1258K2723p4482j47461N4196N2920q513R7650O399
$$ 41019 74908 -23959 -47895 -99153 -76430 -150912 -298373 -244177 -191257 -199770 -102120 -95721
20941i5721N9726j31983k0730J27427K6095J08791j5278o3623q6148p6296J42594
$$ -95721 -35995 -167978 -188708 -61281 -35186 73605 58327 -5296 -91444 -167740 -25146
20930b5146M1007k05089N1947N1464Q278m2291J26825l1551L7302K6319r4034
$$ -25146 15861 -189228 -137281 -85817 -77539 -119830 6995 -24556 12746 39065 -54969
20919e4969J4191J20135n6170k8863R1351k9972q0334J67793l4155m3517o0543
$$ -54969 -40778 79357 23187 -5676 85675 55703 -24631 143162 109007 65490 4947
20908D947j4635K2961R4165M318k9222j8888n3360o8490k2809N2369K0012J4075
$$ 4947 -9688 13273 107438 111756 82534 63646 10286 -58204 -81013 -28644 -8632 5443
20896E443N3700p4378k9991k0844o858P7078N9826L7919q3331j62769J799P9559
$$ 5443 59143 -15235 -45226 -66070 -72928 4150 63976 101895 18564 -144205 -142406 -62847
20884f2847J15636Q078p9746O9065J3945j4713r0884n4276J13759J37869q5049
$$ -62847 52789 60867 -18879 50186 64131 49418 -41466 -95742 18017 155886 70837
20873G0837n7484j04417p9211N0004K4480n4602j4339j3928m0122j26119m0694
$$ 70837 13353 -91064 -170275 -120271 -95791 -150393 -164732 -178660 -218782 -344901 -385595
20862c85595R3549M0785j3113O6571L116N5715O1996L4124j08679J7184L8738
$$ -385595 -292046 -251261 -264374 -197803 -194687 -138972 -76976 -42852 -151531 -134347 -95609
20851i5609N6745N4071l2551j4730Q8398J0393L082l1263l7416R323O0330K7287
$$ -95609 -38864 15207 -17344 -32074 56324 66717 69799 38536 1120 10443 70773 98060
20839I8060j2503m0449j07972o405L452K8721R9426M9187q9120p3766K9123q3546
$$ 98060 85557 45108 -62864 -69269 -65817 -37096 62330 111517 22397 -51369 -22246 -105792
20827a05792o6460R2956L8272J37851P1961j7653L774j38465j44361O5701Q0944
$$ -105792 -172252 -79296 -41024 96827 168788 151135 154909 16444 -127917 -62216 18728
20816A8728M0405R8337k964j24221l3484n8776O1529O956J9227J5038j30610L5459
$$ 18728 59133 157470 154506 30285 -3199 -61975 -446 6510 25737 40775 -89835 -54376
20804e4376Q6217K04458N0415q5281o2890O8861Q12n2163j14394n4583j02632
$$ -54376 31841 236299 286714 201433 138543 207404 208216 156053 41659 -12924 -115556
20793a15556M4691J12554J18763j1569m4257L0022K0833m150l8476L1098L5768
$$ -115556 -70865 41689 160452 148883 104626 134648 155481 151331 112855 143953 179721
20782A79721J2107p9216j76554M8522M8957m6596q0551p038R4953J12991l2346
$$ 179721 191828 112612 -63942 -15420 33537 -13059 -93610 -100648 -5695 107296 74950
20771G4950o5404k5319j05089l9916m337N2954k5904N6845l4511n5190j02405
$$ 74950 9546 -15773 -120862 -160778 -165115 -112161 -138065 -81220 -115731 -170921 -273326
20760b73326j1903P9457O9517J91812J41054j06076r417K6052r2068j94872o4027
$$ -273326 -285229 -205772 -136255 55557 196611 90535 81118 107170 15102 -179770 -243797
20749b43797J85420M1904J006J13385J6709n9618r0137j24462J2625K710P7443
$$ -243797 -58377 -16473 -15467 97918 114627 55009 -35128 -159590 -146965 -144255 -66812
20738f6812J50379K103l377k3996N030P958M6362j55155j08221n9128r111J40208
$$ -66812 83567 85670 82293 58297 63327 71285 117647 -37508 -145729 -204857 -213968 -73760
20726g3760K5223N3042M3875j896o2145o7446j3888K4551J14036n4834l550k4756
$$ -73760 -48537 4505 48380 46484 -15661 -83107 -96995 -72444 41592 -13242 -16792 -41548
20714d1548J1804l348m0064L1803N3978r577L1882L0466k7269J02716k0888l1896
$$ -41548 -29744 -33092 -73156 -41353 12625 3048 34930 65396 38127 140843 119955 88059
20702H8059L4631j01768k2173q985M217m7725r340P3423J16821l0440q7243n6356
$$ 88059 122690 20922 -1251 -10236 -6019 -53744 -63084 10339 127160 96720 9477 -46879
20690d6879M666N9021R4739N1026j82166k7808m3267p268m0764J11627M2531N5577
$$ -46879 -42213 16808 111547 162573 -19593 -47401 -90668 -97936 -138700 -27073 15458 71035
20678G1035q511j1584J1061j0503r0460k8652L3997m8280O8933j4042l4451M4274
$$ 71035 62524 50940 62001 51498 -38962 -67614 -33617 -81897 -12964 -27006 -61457 -17183
20666a7183L1556j64162j92382J74804J27925L3477r443J9139K6845q9327j2942
$$ -17183 14373 -149789 -342171 -167367 -39442 -5965 -15408 3731 30576 -58751 -71693
20655g1693O4780N1199j3848K0358J08827L4472L2776p5014L7092j35222j38442
$$ -71693 -6913 44286 30438 50796 159623 194095 226871 151857 188949 53727 -84715
20644h4715L8199J9463r405K5695R1862m6729r2428r1910J94292J64Q4J8225O3520
$$ -84715 -46516 -27053 -36458 -10763 81099 34370 -58058 -149968 44324 44488 44572 62797 126317
20631A26317O214j39982M9660l5858j12040L4522o2931r7297j08063N0754J62254
$$ 126317 132531 -7451 42209 6351 -105689 -71167 -134098 -231395 -339458 -288704 -126450
20620a26450J82883L8812p0093Q063pj8987m548N5981P7623p6883p5475J6929
$$ -126450 56433 95245 25152 33215 33208 14221 9673 65654 143277 66394 -9081 7848
20608G848L6514l4333q5681m707M6666M7979n3691l7941o6880P2557J9885o0168
$$ 7848 44362 10029 -75652 -80359 -33693 14286 -39405 -77346 -144226 -71669 -51784 -111952
20596a11952L9159R4277N0043o1774m3461Q2959O0240J1819j46826j51614O1176
$$ -111952 -72793 21484 71527 9753 -33708 49251 109491 121310 -25516 -177130 -115954
20585a15954J03939M4470K6748l3966o7403K5622L5659K311L3745m1432l4940
$$ -115954 -12015 32455 59203 25237 -42166 -16544 19115 21426 55171 13739 -21201
20574b1201L9150J22241N5606J6413O9208j19784o3667r0028K4280J965J08526
$$ -21201 17949 140190 195796 212209 281417 161633 97966 7938 32218 34183 142709
20563A42709L0175j48943j49251q6721Q1364R2960l2553j0638O2353j1928o9136
$$ 142709 172884 23941 -125310 -212031 -130667 -37707 -70260 -80898 -18545 -30473 -99609
20552i9609m06M4504n913n1367j2264O5126J13125M732J6341k3382M1874p2327
$$ -99609 -100015 -55511 -61424 -112791 -125055 -59929 53196 57928 74269 50887 92761 20434
20540B0434j84111k5164N42K5671P4448J16158R7634o0220j02060P5283Q06N3140
$$ 20434 -163677 -188841 -188299 -162628 -88180 27978 125612 65392 -36668 38615 39421 92561
20528I2561Q3587r6183l9969j7011m1133N3691L3687L0484P8446J8095l1651k3614
$$ 92561 176148 79965 39996 22985 -18148 35543 69230 99714 178160 196255 164604 140990
20516A40990m0668P144l0213m3512R3216J778n4817K4423L8693r3345j71582P5854
$$ 140990 100322 107466 77253 33741 126957 128735 73918 98341 137034 43689 -127893 -52039
20504e2039J21301l6030k12207p9907R6413J33810j797o3328j9892P9413K7088
$$ -52039 69262 33232 -178975 -258882 -162469 -28659 -30456 -93784 -113676 -34263 -7175
20493g175l7746J5590p4988J0240k3663L668J34357Q0239k4026n9586l0989J16505
$$ -7175 -44921 -29331 -104319 -94079 -117742 -114074 20283 100522 76496 16910 -14079 102426
20481A02426m1908L1168N5057J1312J21887j52121j23987J6722R8920m3158J4898
$$ 102426 60518 91686 146743 158055 279942 127821 3834 20556 119476 76318 91216
20470I1216J7491j29141o4870L3879R3789l733j56335o4996R657j1281P372Q1975
$$ 91216 108707 -20434 -85304 -51425 42364 38631 -117704 -182700 -173043 -184324 -176952 -94977
20458i4977J59728J13745l7414k3507K6336K2105n2642p3846k8N6745R248p7995
$$ -94977 64751 178496 141082 117575 143911 166016 113374 39528 39500 96245 105493 27498
20446B7498J4826N7361R430m8910o4009r3229M1095L6003J29749n6722K3259Q4600
$$ 27498 42324 99685 109115 60205 -3804 -97033 -55938 -19935 109814 53092 76351 160951
20434A60951q0858j98237j63648M8942J06252L6505K0408o138m6357k1119k0370
$$ 160951 80093 -118144 -281792 -232850 -126598 -90093 -69685 -75823 -122180 -143299 -163669
20423a63669Q4993J49931P9649m9710n9309k53578L9175J57271N8336K5331o8107
$$ -163669 -78676 71255 150904 101194 41885 -211693 -172518 -15247 43089 68420 313
20412C13m0166j9711N8669k7927n3768M5257Q1673J5056N669o567j117j0936n0206
$$ 313 -39853 -59564 -895 -28822 -82590 -37333 44340 59396 65065 58498 57381 46445 -3761
20399c761n6715M5197K6853L1682N4859J4543j17659r5545J2822J32817N725l6737
$$ -3761 -60476 -15279 11574 43256 98115 112658 -5001 -100546 -87724 45093 50818 14081
20387A4081p1071O0117N2668q459o1717l7694O5133j4178J21061M6861j09053
$$ 14081 -56990 3127 55795 47336 -14381 -52075 13058 -1120 119941 166802 57749
20376E7749k1594n0232l3627j6272M9922O5617p2587p2728o1996P7120N275J1354
$$ 57749 36155 -14077 -47704 -63976 -14054 51563 -21024 -93752 -155748 -78628 -73353 -61999
20364f1999O235J07995k0302m7J10109m9858j24533P387J16742K9526j1287o3674
$$ -61999 -55764 52231 31929 31882 141991 92133 -32400 -25013 91729 121255 109968 46294
20352D6294j10042m8628M7388P8853k6751q5505r117J36704m042r1486J58601
$$ 46294 -63748 -112376 -64988 13865 -12886 -98391 -107508 29196 25154 -66332 92269
20341I2269k3765n7016R823n332j9107m2948J3904r691J2405j19477M000N5137
$$ 92269 68504 11488 21311 15979 -3128 -46076 -32172 -41863 -29458 -148935 -144935 -89798
20329h9798r10L38m560k3478M6791p2517j1332R634L6563j7618j2173L2190R9884
$$ -89798 -90708 -90370 -94930 -118408 -71617 -144134 -155466 -145832 -109269 -126887 -139060 -106870 -6986
20316f986J08442r2044J3259Q3981J57515K7699o4960j08059m6793L435j7784
$$ -6986 101456 9412 22671 106652 264167 291866 226906 118847 72054 75489 57705
20305E7705J2611o3329P2978N160k1724J537q6591r8481k7752l534J2999L1169
$$ 57705 70316 6987 79965 85125 63401 64938 -21653 -120134 -147886 -151420 -138421 -107252
20293a07252K1032p9149p9893R5877L5529J78585Q6577M2873L822p1404k5209
$$ -107252 -86220 -165369 -245262 -149385 -113856 64729 151306 194179 198001 126597 101388
20282A01388l639j04918m7545O7849J11399j91284k7262N2697K3661J3466r982
$$ 101388 97749 -7169 -54714 13135 124534 -66750 -94012 -41315 -17654 -4188 -14170
20271a4170P4758J36525L4321J27871j38552j40131j4784L6023O50p5072k1912
$$ -14170 60588 197113 231434 359305 220753 80622 65838 101861 102511 27439 5527
20260E527L7133r6251N1119J18755n151P6501L3576j53973j04883n6282P1985
$$ 5527 42660 -53591 -2472 116283 111132 187633 221209 67236 -37647 -93929 -21944
20249b1944M7023o029R0109m629j5913L9514k5695J0027n2725k7744j1497k3802
$$ -21944 25079 19050 109159 104530 88617 128131 102436 112463 59738 31994 20497 -3305
20237c305r02O8426O653J4113M2150Q790K7498j5533r8188M2718J07794k2574
$$ -3305 -4207 64219 70872 84985 127135 135925 163423 147890 49702 92420 200214 177640
20225A77640j08474j88301m2161K8762j02350N9280J56241J39540N3610m963L1621
$$ 177640 69166 -119135 -161296 -132534 -234884 -175604 -19363 120177 173787 168824 200445
20214B00445j21201p8797J1802M1712m8135m8028K8614M5440J5134l2907M5561
$$ 200445 79244 447 12249 53961 5826 -42202 -13588 31852 46986 14079 59640
20203E9640k2110j63694o9019N7733J03755J30881n664j12875K4336M3855n2765
$$ 59640 37530 -126164 -195183 -137450 -33695 97186 91522 -21353 2983 46838 -5927
20192e927o6141Q3151J5595n4426k7678l7834M1313M0294k1628j04155K1475Q0334
$$ -5927 -72068 11083 26678 -27748 -55426 -93260 -51947 -11653 -33281 -137436 -115961 -35627
20180c5627P6643L3860l10n669r9837r9572O4534N4709j02208P6571J32461k7717
$$ -35627 41016 74876 74566 68897 -30940 -130512 -65978 -11269 -113477 -36906 95555 67838
20168F7838N5997P5155J7322K2610P964j37622j44123J8024O4277r9251J6950
$$ 67838 123835 198990 216312 238922 246886 109264 -34859 -16835 47442 -51809 -34859
20157c4859K8850R8522O9587j55246q8144q9489m7715M7738L7543Q2528N7974
$$ -34859 -6009 92513 162100 6854 -81290 -170779 -218494 -170756 -133213 -50685 7289
20146G289j11386J7058p9449l7286m7691O9583J20706N9368o5021k8639j38051
$$ 7289 -104097 -87039 -166488 -203774 -251465 -181882 -61176 -1808 -66829 -95468 -233519
20135b33519K6541N0097L9544K4518P7295J14366L3106P968j39857r5923P4106
$$ -233519 -206978 -156881 -117337 -92819 -15524 98842 131948 139916 59 -95864 -21758
20124b1758Q9786j06321j80733j6930P5432K4560K3733n5524m0002j6137R2787
$$ -21758 68028 -38293 -219026 -235956 -160524 -135964 -112231 -167755 -207757 -223894 -131107
20113a31107J06600P0742J3015q2291j34153J0781j9591l771J04244K9365k0893
$$ -131107 -24507 46235 59250 -23041 -157194 -146413 -166004 -169775 -65531 -36166 -57059
20102e7059J13617P0696p5492j27627K02O1899p0375J4490M1771p158j7901M284
$$ -57059 56558 127254 51762 -75865 -75663 -13764 -84139 -69649 -27878 -35036 -52937 -48653
20090d8653J21000K8549j42751k16258k7133J11801P7115Q9723k5878Q0287Q108
$$ -48653 72347 100896 -41855 -258113 -285246 -173445 -96330 -6607 -32485 47802 55910
20079E5910j59339p6066j6060J9351P0787j2163p0755P2802p91n0529j2843L4546
$$ 55910 -103429 -179495 -195555 -176204 -105417 -117580 -188335 -115533 -116324 -166853 -179696 -145150
20067a45150j5477R3385J27727j5406R214J9568j3036l491p1532q2178j57765
$$ -145150 -160627 -67242 60485 45079 54293 73861 60825 57334 -14198 -96376 -254141
20056b54141q9723J20427R3599N9651o9603q8072N4578Q1504L4411n4529L3317
$$ -254141 -343864 -223437 -129838 -70187 -139790 -227862 -173284 -91780 -57369 -111898 -78581
20045g8581L6808Q6102J4633Q1137m6828j13045o1904m4793j14287j6116J61609
$$ -78581 -41773 44329 58962 140099 93271 -19774 -81678 -126471 -240758 -256874 -95265
20034i5265J14901l9976J9080K7898m3879p1448Q3351J48551L929n6683j02577
$$ -95265 19636 -20340 -1260 26638 -17241 -88689 -5338 143213 147142 90459 -12118
20023a2118m2411n2481p2244L1097K4042Q5927J00776J25028l5978j09238j21629
$$ -12118 -54529 -107010 -179254 -148157 -124115 -38188 62588 187616 151638 42400 -79229
20012g9229R3266J29107N6793j02387j26798p9827r485j8720J01287J15760k606
$$ -79229 14037 143144 199937 97550 -29248 -109075 -118560 -137280 -35993 79767 77161
20001G7161N5360J2241n4097j6734j50888n1858j598M8777N2776J6111K5184n0727
$$ 77161 132521 144762 90665 73931 -76957 -128815 -130413 -81636 -28860 -12749 12435 -38292
19989c8292q3424q8887p9114N8618P5078J27167O1486l4060p5722K2091m8869
$$ -38292 -121716 -210603 -289717 -231099 -156021 -28854 32632 -1428 -77150 -55059 -103928
19978a03928P6487K0700o8447j08486L0881J11686o9812L7556n3986n9010P5248
$$ -103928 -27441 -6741 -75188 -183674 -152793 -41107 -110919 -73363 -127349 -186359 -111111
19967a11111M3194O1840K4446L9364L7406n9451q3851k3661J4063K4685J0099
$$ -111111 -67917 -6077 18369 57733 95139 35688 -48163 -71824 -57761 -33076 -22977
19956b2977l128K1326J1435J082o8129m5449l7541M5356R4478M3469P0823r4081
$$ -22977 -26105 -4779 6656 7738 -60391 -105840 -143381 -98025 -3547 39922 110745 16664
19944A6664j13915o7392M6084N7515M9603P8454r5314j53781q694J00780p4624
$$ 16664 -97251 -164643 -118559 -61044 -11441 67013 -28301 -182082 -190776 -89996 -164620
19933a64620n8312K7264J3372N667Q9817L8021o774J09269r783o0237l8003O8207
$$ -164620 -222932 -195668 -182296 -176629 -86812 -48791 -55565 53704 43921 -16316 -54319 13888
19921A3888P9454p5323k9553J1646o0610o4159J18467O1151l6839j3919j19434
$$ 13888 93342 18019 -11534 112 -60498 -124657 -6190 54961 18122 4203 -115231
19910a15231k040J64105K5351l7505j3834O7634l9447J8150P9826l2175r8256
$$ -115231 -117271 46834 72185 34680 20846 88480 49033 67183 147009 114834 16578
19899A6578m5340r568m0691M492L2965L9400p5429L6874J20030m9838m910o864
$$ 16578 -28762 -38330 -79021 -74529 -41564 -2164 -77593 -40719 79311 29473 24563 17699
19887A7699j4209J02688O2520k1909q1964l8920M1031R5o8763M6635q25m0333
$$ 17699 3490 106178 168698 146789 64825 25905 66936 67031 -1732 44903 44078 3745
19875C745Q9123j4120n7142m6441K9649P5365K2528M1747J0085J5676r7761m279
$$ 3745 92868 78748 21606 -24835 4814 80179 102707 144454 154539 170215 72454 68175
19863F8175L7647k014Q915O029m2564o6350J14381L766K2543O4107j9183j14577
$$ 68175 105822 103808 112723 118752 76188 9838 124219 127985 150528 214635 195452 80875
19851H0875r5134k9402m5708P7851N5920m3606M8095M2853j6731j01370p5745
$$ 80875 -14259 -43661 -89369 -11518 44402 796 48891 91744 75013 -26357 -102102
19840a02102m6039P7241N0452N9980J06881p438k9847j28920K6676N2621n1492
$$ -102102 -148141 -70900 -20448 39532 146413 138975 109128 -19792 6884 59505 8013
19829H013o4011J7320P0689J06268l379j27281q3753P1884J08207k0229j8644
$$ 8013 -55998 -38678 32011 138279 134900 7619 -76134 -4250 103957 83728 65084
19818F5084Q144j20937p9597p9987J08544J62577J1839l2405J1285l6244n4548
$$ 65084 73228 -47709 -127306 -207293 -98749 63828 75667 43262 54547 18303 -36245
19807c6245M3953N191O2223K3278K7621Q192l0684o5620j45193m9849M2423J78683
$$ -36245 7708 12899 75122 98400 126021 134213 103529 37909 -107284 -157133 -114710 63973
19795F3973O8406M3576q6346j71282n6965o2907j8258K8507O9904N1964j4196
$$ 63973 132379 175955 89609 -81673 -138638 -201545 -219803 -191296 -121392 -69428 -83624
19784h3624R8710J28558l7108j72869j35422k3309L4897M5524J5074J47908r0701
$$ -83624 15086 143644 106536 -66333 -201755 -225064 -190167 -144643 -129569 18339 -72362
19773g2362p5740p0216j8000O6127J38393Q0330L787L2398k2942J2256O1736Q75
$$ -72362 -148102 -218318 -236318 -170191 -31798 48532 52319 84717 61775 74031 135767 136642
19761A36642n0019j22290j24339n5270J96490R5509j3019q7847N817O2528q9773
$$ 136642 86623 -35667 -160006 -215276 -18786 76723 63704 -24143 -18326 44202 -45571
19750d5571L0833m038r4359Q380R6415J15628O5864j30223p0225K9083p2170n1164
$$ -45571 -14738 -18776 -113135 -104755 -8340 107288 173152 42929 -27296 1787 -70383 -121547
19738a21547Q8124L8102N6586P3044L3m0818l1399m5775k452l4522M3992l3971
$$ -121547 -33423 4679 61265 134309 134342 93524 62125 16350 13898 -20624 23368 -10603
19726a0603p1562j2530J30148k553j19753j22281J20519J46273k0748j47637q4004
$$ -10603 -82165 -94695 35453 32900 -86853 -209134 -88615 57658 36910 -110727 -194731
19715a94731J52437J24613m5956n6680M0189n3298k8595J6808l3411o7861J32073
$$ -194731 -42294 82319 36363 -20317 19872 -33426 -62021 -45213 -78624 -146485 -14412
19704a4412P2522o2537m0962n4246m2939k1270P281q992K2283M391l0959N6909
$$ -14412 58110 -4427 -45389 -99635 -142574 -163844 -156563 -165555 -143272 -138881 -169840 -112931
19692a12931Q1585M9996N5379J4064m9014k6854l4754n8743j6529r1803J35863
$$ -112931 -31346 18650 74029 88093 39079 12225 -22529 -81272 -97801 -189604 -53741
19681e3741P1309J48148O47j46847j85339K4004J23144l339o6890P5358L9213
$$ -53741 17568 165716 166363 19516 -165823 -141819 -18675 -22014 -88904 -13546 25667
19670B5667J3126O8525m9108o7105n1182l8680J300M8406J0679j14814o9362N4497
$$ 25667 38793 107318 58210 -8895 -60077 -98757 -97457 -49051 -38372 -153186 -222548 -168051
19658a68051N779Q0993k4609J81083K27749Q2806P6771J58692J66033R9290K53173
$$ -168051 -162272 -81279 -105888 75195 302944 385750 462521 621213 787246 886536 1139709
19647A139709J85018o3092j91668l17861k71338j45782p9526k6867Q159m3211
$$ 1139709 1324727 1261635 1069967 752106 480768 334986 255460 228593 236752 193541
19637A93541j05874J8310j7600K871N9065K7633L8225k332k344J4066M6843M084
$$ 193541 87667 105977 88377 91248 150313 177946 216171 213839 211495 225561 272404 276488
19625B76488J67437J50141J71101L41825L80817N4746k98804l26222l03130k27879
$$ 276488 443925 594066 765167 1106992 1487809 1542555 1243751 917529 614399 386520
19615C86520j78956J113K4267l3536l8304l6959M2891M7066k9630M415O484j17531
$$ 386520 207564 208677 232944 199408 161104 124145 167036 214102 184472 188887 195371 77840
19603G7840j56381K0089k9325P9651K00818J01635j26575j71024j8125P4129l8450
$$ 77840 -78541 -58452 -87777 -8126 192692 294327 167752 -3272 -21397 52732 14282
19592A4282j7238J319k0508j08596l158O4379O3030k7611l7010r9437j4090J7231
$$ 14282 -2956 -1637 -22145 -130741 -133899 -69520 -6490 -34101 -71111 -170548 -184638 -167407
19580a67407n1560J0789N0448J48483o2044J1161j09045n5290J22508J17093q056
$$ -167407 -218967 -208178 -157730 -9247 -71291 -60130 -169175 -224465 -101957 15136 7080
19569G080j7232M7582J1051r7366n6935O7580J22637k6609Q483n5147N2310q1866
$$ 7080 -10152 37430 48481 -48885 -105820 -38240 84397 57788 66271 11124 63434 -18432
19557a8432N0368Q2144l2602R229k7033k4013l0669p965J3813N6921O4236O0468
$$ -18432 31936 114080 81478 90707 63674 39661 8992 1027 14840 71761 135997 196465
19545A96465L504l4992p4156J30095L3570p6735j43330o6354R3921K3141j02801
$$ 196465 199969 164977 90821 220916 254486 177751 34421 -31933 61988 85129 -17672
19534a7672p9242m2977O3517J71285J19230l1496j26770j02981K4634J11953K8791
$$ -17672 -96914 -139891 -76374 94911 214141 182645 55875 -47106 -22472 89481 118272
19523A18272J8541l2613l1124Q3346m6233p4164n7526L6841N3888R487o8442O2367
$$ 118272 136813 104200 73076 156422 110189 36025 -21501 15340 69228 78715 10273 72640
19511G2640L6863j10536j7730n2718R3092J14374M2801o6567l5297P9811J21549
$$ 72640 109503 -1033 -18763 -71481 21611 135985 178786 112219 76922 156733 278282
19500B78282j4329q6367M1783j6245j1493L300j66039p8177m0278J39736J32169
$$ 278282 263953 177586 219369 203124 191631 194931 28892 -49285 -89563 50173 182342
19489A82342m7672m4593P8444M0015n9529L378M1897J11168M5388o5665p7942
$$ 182342 134670 90077 168521 208536 149007 152385 194282 305450 350838 285173 207231
19478B07231O8876J4489R6993j20163n8028n3102j2571l0451R839J3303R7243
$$ 207231 276107 290596 387589 267426 209398 156296 143725 113274 123113 136416 233659
19467B33659p089q0908j06079P5366M966J2170N4190J648p8621j6086P9083K7789
$$ 233659 226570 145662 39583 114949 119915 132085 186275 187923 109302 93216 172299 200088
19455B00088R8296n5642j46521j5816q3579q5005J29802J69374K6868n7977r2566
$$ 200088 298384 242742 96221 80405 -3174 -88179 41623 210997 237865 179888 87322
19444H7322O0103j5914j4700l7300K6298l5680l9381p7733L4686K7122j1653k824
$$ 87322 147425 131511 116811 79511 105809 70129 30748 -46985 -12299 14823 3170 346
19432C46P277J5464R078q1643j7303O6761L4872m3616j3874p9610j7875L4318
$$ 346 7623 23087 32165 -49478 -66781 -20 34852 -8764 -22638 -102248 -120123 -85805
19420h5805n2142J12486Q1336K5957J2383j36071o1311L8370J09282k0234L5952
$$ -85805 -137947 -25461 55875 81832 94215 -41856 -103167 -64797 44485 24251 60203
19409F0203O6277m8988m7293K1024J04636n7950K0941j62939k7052Q2070k4338
$$ 60203 126480 77492 30199 51223 155859 97909 118850 -44089 -71141 10929 -13409
19398a3409l140M4852Q5961n2103n1536j2123k4517N8968L579M9781L5109K486
$$ -13409 -16549 28303 114264 62161 10625 -1498 -26015 32953 36532 86313 121422 123908
19386A23908L8675Q7308m9857j80461n3225J48048J51472j920L4523n6205n5945
$$ 123908 162583 249891 200034 19573 -33652 114396 265868 263948 298471 242266 186321
19375A86321K9355j69826q2579O8915n684L2801o2286Q5562L5286Q8699J403l1608
$$ 186321 215676 45850 -36729 32186 26502 59303 -2983 82579 117865 206564 207967 176359
19363A76359J1425L8469q9896j62292n2592J62999Q5158P2889O322r67j85298
$$ 176359 187784 226253 136357 -25935 -78527 84472 169630 242519 248841 247874 62576
19352F2576j4644J924J10717j31351j3970J16453J31143l4956j13997L1241j01765
$$ 62576 47932 49856 160573 29222 15252 131705 262848 227892 113895 145136 43371
19341D3371p7743K7872J42234P1427j51596J86Q5910K20568N3674q0541n9323
$$ 43371 -34372 -6500 135734 207161 55565 55751 141661 362229 415903 335362 276039
19330B76039q0339q491l0651j6262P552p2509p5339K8904p4092Q1834J48584R9298
$$ 276039 195700 187209 156558 140296 147848 75339 0 28904 -45188 36646 185230 284528
19318B84528o982j27090q0496l7852O2628N3701l1583k9089o4095M8520J09106
$$ 284528 277546 150456 69960 32108 94736 148437 116854 87765 23670 72190 181296
19307A81296Q1417j165K3805n6624k5752j08682j73803J8691J52248Q3402k3549
$$ 181296 262713 261548 285353 228729 202977 94295 -79508 -60817 91431 174833 151284
19296A51284m482n4014j45685o0842J35620J30203m8199K422q5760j3412N9369
$$ 151284 146802 92788 -52897 -113739 21881 152084 103885 106307 20547 7135 66504
19285F6504o9563Q316N8688j9669j66731N4564J92982P0808k4591q7886O9191
$$ 66504 -3059 5257 63945 44276 -122455 -67891 125091 195899 171308 83422 152613
19274A52613j0035o9738P835N7689O4800J32405p9472n5299J2614p8935K570K9321
$$ 152613 142578 72840 80675 138364 203164 335569 256097 200798 213412 134477 137047 166368
19262A66368m4409j9006K3804O6241m6094m1761j71949N6887J11183R4841k7962
$$ 166368 121959 102953 126757 192998 146904 105143 -66806 -9919 101264 196105 168143
19251A68143O6220j8496K1792K8913m0623M8063r537j9443j3084L3310P1333L0221
$$ 168143 234363 215867 237659 266572 225949 274012 264475 245032 231948 265258 336591 366812
19239C66812o6508o2924j43395p8464O6210L5269R7205J72111n2882o4379L7219
$$ 366812 300304 237380 93985 15521 81731 117000 214205 386316 333434 269055 306274
19228C06274M8553m4459k9263o2451k8915K5001N7582L0793J3072k124J35j41302
$$ 306274 354827 310368 281105 218654 189739 214740 272322 303115 316187 314063 314198 172896
19216A72896L512J06466J69633N1712j22288q7377j29254L8904L5659m013J0500
$$ 172896 176408 282874 452507 504219 381931 294554 165300 204204 239863 235850 246350
19205B46350N6857l2396J34627K72509m4388q8943K7850N3067R4131L1580R3819
$$ 246350 303207 270811 405438 677947 633559 544616 572466 625533 719664 751244 845063
19194H45063j10792J4942N4324J00700O5712K576R2712J73667J35745J89311K32860
$$ 845063 734271 749213 803537 904237 969949 972525 1065237 1238904 1374649 1563960 1796820
19183A796820M55468O11508R53431J454216J044937l92850j212313j165728r57148
$$ 1796820 2252288 2863796 3817227 5271443 6316380 5923530 4711217 3545489 2588341
19174B588341o59142l70725j76596p6847O507J42295M6846P706j30798M3245K12767
$$ 2588341 1929199 1558474 1381878 1305031 1311538 1453833 1500679 1508385 1377587 1420832 1633599
19163A633599O3691j3436J52547K15174J78160L42176L79946M27405Q72061J435203
$$ 1633599 1697290 1683854 1836401 2051575 2229735 2571911 2951857 3379262 4251323 5686526
19153E686526J354687J3636r76412j214939j131670o63952l79168j64243l1865
$$ 5686526 7041213 7054849 6078437 4863498 3731828 3067876 2688708 2524465 2492600
19144B492600M2199J56644J99362M63534J22311l13558j87058k23055j18858L3859
$$ 2492600 2534799 2691443 2890805 3354339 3476650 3163092 2976034 2752979 2634121 2667980
19134B667980J60970J86847R8805J77402Q6515J40659L86939N23100M17037N80745
$$ 2667980 2828950 3015797 3114602 3292004 3378519 3519178 3906117 4429217 4846254 5426999
19124E426999O66618P41014J048249J253143J660293K140777K572233K369188
$$ 5426999 6093617 6834631 7882880 9136023 10796316 12937093 15509326 17878514
19116A7878514K342746K565478K498567K562739L437125N519995R124636J3872959
$$ 17878514 20221260 22786738 25285305 27848044 31285169 36805164 45929800 59802759
19108E9802759J8070783K3704654L8118890O2793313O2894815p167686n3410915
$$ 59802759 77873542 101578196 139697086 202490399 265385214 258217528 204806613
19101B04806613o1984468n2407266l1399615j6569132q986551n001526k703623
$$ 204806613 142822145 90414879 59015264 42446132 33459581 28458055 25754432
19094B5754432r41135L74191J184515J461259J375108J960633J764658J593202
$$ 25754432 24813297 25187488 26372003 27833262 29208370 31169003 32933661 34526863
19086C4526863K822429N268309Q958381J2545365J4481442K0134277L3788084
$$ 34526863 37349292 42617601 51575982 64121347 78602789 98737066 132525150
19079A32525150N7786806P3212704J5835428m9228109o4550023o0481707l9726479
$$ 132525150 190311956 263524660 279360088 230131979 165581956 105100249 65373770
19072F5373770k1483121j1902927p091081m238111k443606j654108j631670j494118
$$ 65373770 43890649 31987722 24896641 20658530 18214924 16560816 14929146 13435028
19064A3435028j280669q34385p16932j231392j378561j257972j043049q37208
$$ 13435028 12154359 11319974 10603042 9371650 7993089 6735117 5692068 4854860
19056D854860m85993l02281m9171j79085m61375l99029k82724k09893j68488j05112
$$ 4854860 4368867 4066586 4017415 3838330 3376955 2977926 2695202 2485309 2316821 2211709
19046B211709Q1472j66691J06710K85820K58349L06793m6616k85827j89228j87869
$$ 2211709 2293181 2126490 2233200 2519020 2777369 3084162 3037546 2751719 2562491 2374622
19036B374622k81040l18184k75166k91069k88237r4724L4557j2490m3692M9382
$$ 2374622 2093582 1775398 1500232 1209163 920926 826202 860759 848269 804577 853959
19026H53959m3102p2827J0280P8408k4772l0618r3624k16395K8836J1512l0706
$$ 853959 810857 738030 748310 826718 801946 771328 677704 461309 490145 501657 470951
19015D70951q2802o2255q1573J02976J41608j01482l7085k7070m3683Q5565M0833
$$ 470951 388149 325894 244321 347297 488905 387423 350338 323268 279585 365150 405983
19004D05983K0926j02005n4018k1908o9234q9857Q3646N9974N5970J806J2169
$$ 405983 426909 324904 270886 248978 179744 89887 173533 233507 289477 291283 303452
18993C03452o1619m3796p6051M04l7684k672J25144K2629J4420j66447Q2243M8935
$$ 303452 241833 198037 121986 122390 84706 82034 207178 229807 244227 77780 160023 208958
18981B08958L6002L1841j0530j24152j7912n3859r8387o4491J35860J57135M8933
$$ 208958 244960 276801 266271 142119 124207 70348 -28039 -92530 43330 200465 249398
18970B49398J3059N2677J07411n5298q385M8006p7433j39000j16320m5382M4559
$$ 249398 262457 315134 422545 367247 358862 406868 329435 190435 74115 28733 73292
18959G3292j8112J9979Q4549P6237l3567j53158o4612J3162O9476Q9151j4071
$$ 73292 55180 75159 159708 235945 202378 49220 -15392 -2230 67246 156397 142326
18948A42326M9469J42979N974P3769Q1209J48149J61438n3276n0521j5510K6O7637
$$ 142326 191795 334774 340748 414517 495726 643875 805313 752037 701516 686006 686032 753669
18936G53669K4000O6789J7445j33209j15698k11808j77354j08952J17508J9488
$$ 753669 777669 844458 861903 728694 612996 401188 223834 114882 232390 251878
18926B51878p120O3548l1808j8658j32546k8526O3671M2975J90269P8437q865
$$ 251878 244758 308306 276498 257840 125294 96768 160439 203414 393683 472120 463255
18915D63255j24469l7291M3751M4342J41587J06856J47135M9855j25002j84456
$$ 463255 338786 301495 345246 389588 531175 638031 785166 835021 710019 525563
18905E25563R471M924J24580J73885J17607k6582j14438j51141j02379j88323
$$ 525563 535034 539958 664538 838423 956030 929448 815010 663869 561490 373167
18895C73167q1705j2551M0342J08119q2197j34172r8811j9420l8846n7641M5702
$$ 373167 291462 278911 319253 427372 345175 211003 112192 92772 53926 -3715 41987
18884D1987j3078M0522L6951L1548J03311q349k6676j88574m1047k4890L2019
$$ 41987 28909 69431 106382 137930 241241 232892 206216 17642 -23405 -48295 -16276
18873a6276J56791J14472l346j55677k0644k5257J8597J8293J27902O1052q2095
$$ -16276 140515 254987 251641 95964 75320 50063 68660 86953 214855 275907 193812
18862A93812q7618j84867M1883J41716Q2177N0739m6226J06945p5214j43477O358
$$ 193812 106194 -78673 -36790 104926 187103 237842 191616 298561 223347 79870 86228
18851H6228L1567n0911k9929J3798j36466L6533Q9176p0312j32630L1933M0590
$$ 86228 117795 66884 36955 50753 -85713 -49180 39996 -30316 -162946 -131013 -90423
18840i0423O3067J13390Q5668O2547J01186J03695J12246K46193R4736L9113j98099
$$ -90423 -27356 86034 171702 234249 335435 439130 551376 797569 892305 931418 733319
18829G33319j59883o5357M0000P5533M6622K8055M3798o7801j75945k24290J2850
$$ 733319 573436 508079 548079 623612 670234 698289 742087 674286 498341 274051 286901
18818B86901J06221j03455K1563K6173L9141m8611J0450Q8875J94212J45104K9768
$$ 286901 393122 289667 311230 337403 376544 327933 338383 427258 621470 766574 796342
18807G96342j14989j76114j57396J29669O9610J37991J09811j30566k48147j83749
$$ 796342 681353 505239 347843 477512 547122 685113 794924 664358 416211 232462
18797B32462j75273j249P1202j0996L5595J8940k6687L9860q7894p8078q2594
$$ 232462 57189 55940 127142 116146 151741 170681 143994 183854 95960 17882 -64712
18786f4712p0475J21668J52442L9201l0001l0277n2138n3196o563k0239J5748
$$ -64712 -135187 -13519 138923 178124 148123 117846 65708 12512 5949 -14290 1458
18775A458J19532k024N7913L9524J47147J29377K21503K73934J78039j39097l49278
$$ 1458 120990 118966 176879 216403 363550 492927 714430 988364 1166403 1027306 678028
18764F78028k45166j59023j87420j46464K7472J04573Q0204r644K8935l2638q7482
$$ 678028 432862 273839 86419 -60045 -32573 72000 152204 142560 171495 138857 51375
18753E1375N1566K0217r4654p8422M2626l513J2943n8263L481j2222m4083O979
$$ 51375 102941 123158 28504 -49918 -7292 -10805 2138 -56125 -52644 -64866 -108949 -101970
18741a01970K9337n5572K7332K3875K4485q6524P497J14566J53111J1158n3960
$$ -101970 -72633 -128205 -100873 -76998 -52513 -139037 -131540 -16974 136137 147295 93335
18730I3335o5672J04829J44070P4106o2689r8493p8172p3043K1752p7561k6429
$$ 93335 27663 132492 276562 350668 287979 189486 111314 38271 60023 -17538 -43967
18719d3967K3325J14557J32996M6417j4919m2381o1249o7635r3323l9546N3349
$$ -43967 -20642 93915 226911 273328 258409 216028 154779 87144 -6179 -45725 7624
18708G624K3029L3612k7813n1274Q9561Q3843o4376q9627J4681r6656Q6135P8459
$$ 7624 30653 64265 36452 -14822 74739 158582 94206 4579 19260 -77396 8739 87198
18696H7198j18690k4028n6833j7736O5147Q4365Q3386L459N6044P2754p7013j98761
$$ 87198 -31492 -55520 -112353 -130089 -64942 19423 102809 106268 162312 235066 158053 -40708
18684d0708n9254j6736K2561P2019R0004L2463q3538k8437J54701K2390k2094
$$ -40708 -99962 -116698 -94137 -22118 67886 100349 16811 -11626 143075 165465 143371
18673A43371m9329m6435l2878l9263N5528J0409Q1339P317r034j26599k6128P1423
$$ 143371 94042 47607 14729 -24534 30994 41403 122742 130059 121025 -5574 -31702 39721
18661C9721L2883k0981Q237Q9583J5291m6754O8371L3385j13837j32801l7739
$$ 39721 72604 51623 59860 149443 164734 117980 186351 219736 105899 -26902 -64641
18650f4641k0344J3240M6458J0857Q7800k569r4721l7388M846k5549j45028k2338
$$ -64641 -84985 -71745 -25287 -14430 73370 70801 -23920 -61308 -56462 -82011 -227039 -249377
18638b49377J05511J02169L6408J6068N1456L4347l1661p5466j7030M2629k3939
$$ -249377 -143866 -41697 -5289 10779 62235 96582 64921 -10545 -27575 15054 -8885
18627h885P8734J75467j9437p7573j04035r2625K1171O7452J8863M7020L5558
$$ -8885 69849 245316 225879 148306 44271 -48354 -27183 40269 59132 106152 141710
18616A41710o6562q5225M5722J6432P8368j0725J5730K4137R4319M6793K5013
$$ 141710 75148 -10077 35645 52077 130445 119720 135450 159587 253906 300699 325712
18605C25712J8411N0211L3633M9846J15720P177O6718P7714J40973L12662K97791
$$ 325712 344123 394334 427967 477813 593533 600710 667428 745142 886115 1198777 1496568
18594A496568J6972k34678k37870l10469j65182j31973n2260j1256M7412M6859
$$ 1496568 1513540 1278862 1040992 730523 565341 433368 381108 369852 417264 464123
18584D64123n5628j3480M8824m9144o5935p4959l8305J4200K16247M1688N2382
$$ 464123 408495 395015 443839 394695 328760 253801 215496 229696 445943 487631 540013
18573E40013R3198Q1240J61748K18693L16115J56948k10316l18158k34978k35717
$$ 540013 633211 714451 876199 1094892 1411007 1567955 1357639 1039481 804503 568786
18563E68786p3137J3320k3730n6587P2875J81083J34316J25833K92552P8726j11444
$$ 568786 495649 508969 485239 428652 501527 682610 816926 942759 1235311 1314037 1202593
18552A202593j41233k16806k26987k00095q0814K7392N3109m332o8454n1621M3831
$$ 1202593 1061360 844554 617567 417472 336658 364050 417159 412827 344373 292752 336583
18541C36583k9747J8034P8302J23354N1439n1646l0792L3515k9529n9346J59398
$$ 336583 306836 324870 403172 526526 577965 526319 495527 529042 499513 440167 599565
18530E99565L24152L01572K03139j11147k31272k86985k50324k6809n3442k22403
$$ 599565 923717 1225289 1428428 1317281 1086009 799024 548700 521891 468449 246046
18520B46046j32734J19616J50072M3268n1651j85636l6279l3920p6165j20434
$$ 246046 113312 232928 383000 426268 374617 188981 152702 118782 42617 -77817
18510g7817j7004J41518L3534m3189j47889L0778k9798M6427K53400P8643j11832
$$ -77817 -94821 46697 80231 37042 -110847 -80069 -109867 -63440 189960 268603 156771
18499A56771p1660p5925O4546N2540R0817l2947j86902L525J6384o5157j9136
$$ 156771 85111 9186 73732 126272 217089 184142 -2760 765 17149 -48008 -67144
18488f7144j1275J7922M6954p0494p0474l798J49668J18253O8245m2625l9106
$$ -67144 -78419 -60497 -13543 -84037 -154511 -158309 -8641 109612 177857 135232 96126
18477I6126P5933O5375J33793k9400j28798K3286n0570j62325j46606R6592N9559
$$ 96126 172059 237434 371227 341827 213029 236315 185745 23420 -123186 -26594 32965
18466C2965J6177P0734j3216j00795k0461J425J0867Q5500N7103p6854o7037N7995
$$ 32965 49142 119876 106660 5865 -14596 -13171 -2304 83196 140299 63445 -3592 54403
18454E4403O4136M8260j647l099R6420J03751Q317p6721r4840L7664K4873k9362
$$ 54403 118539 166799 165152 162053 258473 362224 370541 293820 198980 236644 261517 232155
18442B32155J92m4123k7597J34163J03392K0992k3130j6022l1819j0736J09154
$$ 232155 232347 188224 160627 294790 398182 419174 396044 380022 348203 337467 446621
18431D46621M3876k892j08049M7491j63909r2933K6957J54376N2453P670l6549
$$ 446621 490497 487605 379556 427047 263138 170205 197162 351538 403991 411661 375112
18420C75112J18431M4434N4762n8256r4041J42065M8506m0425K0194k2048j48231
$$ 375112 493543 537977 592739 534483 440442 582507 631013 590588 610782 588734 440503
18409D40503j14633O6674L7969M3438K4203q3715J84272M4381P288J23820N227
$$ 440503 325870 392544 430513 473951 498154 414439 598711 643092 650380 774200 779427
18398G79427Q7642N4368O9595M6126M0388q5144R6537J15833m5159L5012Q4749
$$ 779427 867069 921437 991032 1037158 1077546 992402 1088939 1204772 1159613 1194625 1279374
18387A279374O7224J82365J55794J85585L67521M01003K47155m8900r4890j32644
$$ 1279374 1346598 1528963 1684757 1870342 2237863 2638866 2886021 2837121 2742231 2609587
18377B609587l5748O5276K42587L85151K12159J11910K91534L57447L77607L31457
$$ 2609587 2573839 2639115 2881702 3266853 3479012 3590922 3882456 4239903 4617510 4948967
18367D948967O87469Q98743J029164J307606J644157J835402J880739J887983
$$ 4948967 5636436 6535179 7564343 8871949 10516106 12351508 14232247 16120230
18359A6120230K492942L436912M565346O688507J0275936J6413896K5232562K7203410
$$ 16120230 18613172 22050084 26615430 33303937 43579873 59993769 85226331 112429741
18351A12429741R622731r706113j4873736r889406K823426J9450852K9475622
$$ 112429741 122052472 112346359 97472623 87583217 90406643 109857495 139333117
18344A39333117J2264152j7976230l1358965l0956895k2608763j3145664p173629
$$ 139333117 151597269 133621039 102262074 71305179 48696416 35550752 28377123
18337B8377123m243209k843530j608123n24637J88769P13036J033451J111313
$$ 28377123 24133914 21290384 19682261 19157624 19346393 20059429 21092880 22204193
18329B2204193J488837K461086L801231N368932O273196O935046R790063J5743258
$$ 22204193 23693030 26154116 29955347 35324279 41597475 48532521 58322584 74065842
18321G4065842K5399366K9716759J3415151p650873j3858711q604654N521853
$$ 74065842 99465208 129181967 142597118 134946245 121087534 112482880 118004733
18314A18004733K4422584L7463064K1447722j2850536k8379181k4867889q405665
$$ 118004733 142427317 179890381 201338103 188487567 160108386 135240497 126834832
18307A26834832J3323146K4706788J2355468j1565943k5050133k2136156r435370
$$ 126834832 140157978 164864766 177220234 165654291 140604158 118468002 109032632
18300A09032632P774724J9183502J1295689r255435k4660927k6469234k0467691
$$ 109032632 116807356 135990858 147286547 138031112 113370185 86900951 66433260
18293F6433260j2081550n598109j463273R56625J615632K211715M377062Q577393
$$ 66433260 54351710 48753601 47290328 48246953 49862585 52074300 56451362 65028755
18285F5028755J5587134K6585384L8530931L3394256O020859k2039393l0780481
$$ 65028755 80615889 107201273 145732204 179126460 185147319 163107926 132327445
18278A32327445k3781561q015906R123820J5371002L091182j5496992k4332453
$$ 132327445 108545884 100529978 109653798 125024800 128115982 112618990 88286537
18271H8286537k2373974j5322792p076891k206958j281721j560422k913352m777442
$$ 88286537 65912563 50589771 43512880 41305922 40024201 38463779 35550427 30772985
18263C0772985n706329n019279l793228k596721j516077j109445j080779j021348
$$ 30772985 25066656 20047377 16254149 13657428 12141351 11031906 9951127 8929779
18255H929779j030364p34938o58575o38692m80690k49295j09784k86017m38710
$$ 8929779 7899415 7164477 6505902 5867210 5386520 5137225 5027441 4741424 4302714
18246D302714l59488l63419k28750j03476m2225j38846k24471j01251l2511j08771
$$ 4302714 3943226 3579807 3351057 3247581 3205356 3066510 2842039 2740788 2708277 2599506
18236B599506j13179q2188n7485j03712j29051j81016j06195q928K2543k579p6766
$$ 2599506 2486327 2404139 2346654 2242942 2113891 1932875 1826680 1817752 1840295 1837716 1760950
18225A760950j60225r1385o1586p1936M414o4538k2048m0690j77267o7360K2189
$$ 1760950 1600725 1509340 1447754 1375818 1380232 1315694 1293646 1252956 1075689 1008329 1030518
18214A030518m4927n9374L7403L2598M0143k3212J1271j3099k1221J92780R8327
$$ 1030518 985591 926217 963620 996218 1036361 1013149 1024420 1011321 990100 1182880 1281207
18203A281207l4197K4660j2058o5444p8155n984M9087K6173q0075r6343N5188
$$ 1281207 1247010 1271670 1259612 1194168 1116013 1110029 1159116 1185289 1105214 1008871 1064059
18192A064059J47637L5450j44238j64902j02475N4201M4063j36259n1454J05269
$$ 1064059 1211696 1247146 1102908 938006 835531 889732 933795 797536 746082 851351
18182H51351K285l3461K3271P6698P9895J32325L8272j69870o0951P285J8574
$$ 851351 853636 820175 843446 920144 1000039 1132364 1170636 1000766 939815 947100 965674
18171I65674q5935k9269J90704P1190l5547k00991N751K9891Q1553J21984L2050
$$ 965674 879739 850470 1041174 1112364 1076817 875826 881577 911468 993021 1115005 1147055
18160A147055M4201O2464P5891q9481l5156P4955M8654M812j0923k1013j2969
$$ 1147055 1191256 1253720 1329611 1240130 1204974 1279929 1328583 1333395 1322472 1301459 1288490
18149A288490P1546j836j4892k6373K0462k5789M8058P4944N5904q49N9877P9458
$$ 1288490 1360036 1358200 1343308 1316935 1337397 1311608 1359666 1434610 1490514 1489665 1549542 1629000
18137A629000R8287J13517J60712N4423J61251K94126K07155L45636L79841M94690
$$ 1629000 1727287 1840804 2001516 2055939 2217190 2511316 2718471 3064107 3443948 3938638
18127C938638N44938N86719Q11869J187489J299985J272355J472294J795133J839248
$$ 3938638 4483576 5070295 5882164 7069653 8369638 9641993 11114287 12909420 14748668
18118A4748668K141253K656548L748677N597435Q511394J3410980K1831671L6816035
$$ 14748668 16889921 19546469 23295146 28892581 37403975 50814955 72646626 109462661
18110A09462661N9500337M7676742j7557716m6647621n0567824l9677039k2401256
$$ 109462661 168962998 216639740 199082024 152434403 101866579 62189540 39788284
18103C9788284j1719477o726351m256246k830450j847260j402361j129428q73238
$$ 39788284 28068807 21342456 17086210 14255760 12408500 11006139 9876711 9003473
18095I003473p18741m52888j70910p2910o4787k57737m55514n50712l92827j12392
$$ 9003473 8284732 7831844 7660934 7588024 7523237 7265500 6809986 6259274 5866447 5754055
18085E754055J53981J97576L42679N15008O92693Q71590J261018K063297K825551
$$ 5754055 5908036 6105612 6448291 6963299 7655992 8527582 9788600 11851897 14677448
18076A4677448L551256M157781L335706R66264q16128j267747o05901P10609J842463
$$ 14677448 18228704 22386485 25722191 26688455 25872327 24604580 23998679 24709288 26551751
18067B6551751K784374M284406O261506R460920J4671711K3234221L7833220N6359418
$$ 26551751 29336125 33620531 39882037 49342957 64014668 87248889 125082109 181441527
18059A81441527N7012396K1633849k7318897n4412867n4321647m0471308k4273117
$$ 181441527 238453923 260087772 232768875 178356008 124034361 83563053 59289936
18052E9289936j2549119n625030j454573R8045q45748k620873l256107k713573
$$ 59289936 46740817 41115787 39661214 39759259 38913511 36292638 33036531 30322958
18044C0322958j355929K6968J193670J958134K941729M546849P473764J1780783
$$ 30322958 28967029 28993997 30187667 32145801 35087530 39634379 47108143 58888926
18036E8888926J8768588L0835114M8517293N7011083L1995728j4991381m8628815
$$ 58888926 77657514 108492628 157009921 214021004 246016732 231025351 182396536
18029A82396536n4586237m3664247k7998518j5909314r249262n959542m253397
$$ 182396536 127810299 84146052 56147534 40238220 30988958 25029416 20776019
18022B0776019l199451k541195j956650j516408j184399p83978n36469l81494
$$ 20776019 17576568 15035373 13078723 11562315 10377916 9593938 9057469 8675975
18014H675975m19320l97910l55533n68703o39204n93013n91425m00163l43575
$$ 8675975 8256655 7858745 7503212 6934509 6295305 5702292 5110867 4710704 4367129
18005D367129k36356r0482m911n265R0597K29776N538k03389k68664m04963k85379
$$ 4367129 4130773 4040291 4035380 4030115 4120712 4350488 4356026 4152637 3883973 3479010 3193631
17994C193631l02363k58685j16221j35966j95886q5079J26546m8988q2934n4942
$$ 3193631 2891268 2632583 2516362 2380396 2184510 2099431 2225977 2176989 2094055 2039113
17984B039113j26513O7644k9813q8032l6504P3626J74030K1655r6034j29601k68842
$$ 2039113 1912600 1980244 1950431 1862399 1825895 1899521 2073551 2095206 1999172 1869571 1600729
17973A600729j18082k6133J1876M6075r2546O9156R6120K2220j47990j23331l3246
$$ 1600729 1482647 1456514 1468390 1514465 1421919 1491075 1587195 1609415 1461425 1338094 1304848
17962A304848k123M8395L1677K38234O8009m2723j1780L8686P7303l2232q878
$$ 1304848 1302725 1351120 1382797 1621031 1689040 1646317 1634537 1673223 1750526 1718294 1709416
17951A709416l346L3304k0672j32921j12604P9364K40010J88020P8961P0232K4883
$$ 1709416 1706070 1739374 1718702 1585781 1473177 1552541 1792551 1980571 2059532 2129764 2154647
17940B154647j3700j29199r1460n3869j55637k30237k27131j80858j9507j8168
$$ 2154647 2140947 2011748 1920288 1866419 1710782 1480545 1253414 1072556 1053049 1034881
17930A034881l7759R0263J25597O7354J69890J62164J40862O2210n1714j03153
$$ 1034881 997122 1087385 1212982 1280336 1450226 1612390 1753252 1815462 1763748 1660595
17920A660595j21960R2688K45477K60974J22150J40529J91824J038o4242j43780
$$ 1660595 1538635 1631323 1876800 2137774 2259924 2400453 2592277 2593315 2529073 2385293
17910B385293j04654j77070l9039J46868J54640J14316j36021k36058j71685J00490
$$ 2385293 2280639 2103569 2064530 2211398 2366038 2480354 2344333 2108275 1936590 2037080
17900B037080K85814K41875L19019M16299K09856J90593J47156J49357K75638
$$ 2037080 2322894 2564769 2883788 3300087 3509943 3700536 3847692 3997049 4272687
17891D272687M17771M38969N44720O34877O96733R02911J122876J401409J521488
$$ 4272687 4690458 5129427 5674147 6309024 7005757 7908668 9031544 10432953 11954441
17882A1954441J837311K214844K952819M256025O719024J0452280J6523290K7148233
$$ 11954441 13791752 16006596 18959415 23215440 29934464 40386744 56910034 84058267
17874H4058267L9878792K9345593j0548677l0071875l3460630k6233391j4853223
$$ 84058267 123937059 153282652 142733975 112662100 79201470 52968079 38114856
17867C8114856p231421k938121p79471j331732k198189j909828j268053l76330
$$ 38114856 30883435 27945314 27165843 25834111 23635922 21726094 20458041 20081711
17859B0081711M57560J170064K150166L331392N066318P711506J1860689J9022440
$$ 20081711 20539271 21709335 23859501 27190893 32257211 39968717 51829406 70851846
17851G0851846K9875071L6376287J2092588j7870502k5976045k2992728j0896079
$$ 70851846 100726917 137103204 149195792 131325290 105349245 82356517 71460438
17844G1460438K824925J6779376L1172285K7148625o842731k7408775l1655683
$$ 71460438 74285363 91064739 122237024 149385649 142542918 115134143 83478460
17837H3478460k6155981j5593430p567935l590059l028703l154751k827001k209437
$$ 83478460 57322479 41729049 34161114 30571055 27542352 24387601 21560600 19351163
17829A9351163j201013m55836M8684O36673J359198K363541L672810N468245R007071
$$ 19351163 18150150 17694314 17742998 18379671 19738869 22102410 25775220 31243465 40250536
17820D0250536J5026368K4429120L1788399J2514886j7121810k6618390k6386836
$$ 40250536 55276904 79706024 111494423 124009309 106887499 80269109 53882273
17813E3882273j8313184r841584m724962j933225j086349k183124k581411k500642
$$ 53882273 35569089 25727505 21002543 19069318 17982969 15799845 13218434 10717792
17805A0717792j973130j304884o89011m99040k19674k75178l43766l44388k86546
$$ 10717792 8744662 7439778 6750767 6251727 6032053 5756875 5413109 5068721 4782175
17796D782175l03893l97623l55103l55286k41393k56896k69046j74487m6053M6284
$$ 4782175 4478282 4080659 3725556 3370270 3128877 2871981 2602935 2428448 2382395 2428679
17786B428679K2787M3610p7097r4936k45979k25156r3017j04724j01705m7737
$$ 2428679 2451466 2495076 2417979 2323043 2077064 1851908 1758891 1654167 1552462 1504725
17776A504725k3263M523J48982J09200J41124K55893L3000k14897j76312j22418
$$ 1504725 1481462 1485985 1634967 1744167 1885291 2141184 2174184 1959287 1782975 1660557
17766A660557p1650P7971J09345J64568J2810j17608n4869k35030l32698o2935
$$ 1660557 1588907 1666878 1776223 1940791 1953601 1835993 1781124 1546094 1213396 1150461
17756A150461J14430M7141M9053J26379K38964J81862J33749l850N715j62995
$$ 1150461 1264891 1312032 1361085 1487464 1726428 1908290 2042039 2038189 2043904 1880909
17746A880909m0628j4162J18355J80046J8755j48916j59423j30428j72673k10390
$$ 1880909 1840281 1826119 1944474 2124520 2143275 1994359 1834936 1704508 1531835 1321445
17736A321445k78275j81157n6392J27285j7648j41034M696k9305m4188O309q5084
$$ 1321445 1043170 862013 805621 932906 915258 774224 778920 749615 705427 711736 626652
17725F26652n545K5438P4472J72640P0274q6415P6521J24153k513k30881k8023
$$ 626652 621107 646545 721017 893657 963931 877516 954037 1078190 1075677 844796 816773
17714H16773O1049m8039N6312Q1883j65476k0993P513r2780J0656l2779r2121
$$ 816773 877822 829783 886095 967978 802502 781509 789022 696242 706898 674119 581998
17703E81998L7085P5271j19159N1598L3829j1471m166q8818n8564n0207M2105
$$ 581998 619083 694354 575195 626793 660622 649151 644985 556167 497603 447396 489501
17692D89501N759l9619o0800n105j5665j8664J05592J14765J6912l5344p4650
$$ 489501 495260 455641 394841 389736 374071 355407 460999 575764 592676 557332 482682
17681D82682j26000m3333L5400n4299Q4533J3000R09K5575J6814o1590K2753j4265
$$ 482682 356682 313349 348749 294450 378983 391983 392892 418467 435281 373691 396444 382179
17669C82179r468j2914M371N8850L817P273O7312n184j15262O8762O0883r5178
$$ 382179 372711 359797 364168 423018 426835 434108 501420 496236 380974 449736 510619 415441
17657D15441q047k0887q2173O7643J13800j24110j76590j28983N9082R8358j10160
$$ 415441 407394 386507 304334 371977 485777 361667 185077 56094 115176 213534 103374
17646A03374j64778M4391L4508l4Q9535K5607J55404J01649P6748K1484j12478
$$ 103374 -61404 -17013 17495 17461 106996 132603 288007 389656 466404 487888 375410
17635C75410l2905J6556l9078n5856P531J9625l8088m0684J02p380j5996l8554
$$ 375410 342505 359061 319983 264127 271658 291283 253195 212511 212613 205233 189237 150683
17623A50683n9328l8739m752N0544L0760K2956R5223M9990p4786m6681p5541o7007
$$ 150683 91355 52616 47864 98408 129168 152124 247347 297337 222551 175870 100329 33322
17611C3322R5114J16536p4725o3141n8421r7856j4111J13162J79090O2699m5419
$$ 33322 128436 244972 170247 107106 48685 -49171 -63282 49880 228970 291669 246250
17600B46250P2749j3839l3930q229Q9839L1679O2794J63187N3351j91170j92321
$$ 246250 318999 305160 271230 263001 352840 384519 447313 610500 663851 472681 280360
17589B80360M7042n7651N5365R9415l6179j12148K2680J49345J02029j7907R9875
$$ 280360 327402 269751 325116 424531 388352 276204 298884 448229 550258 532351 632226
17578F32226L21671K39949J51664j36295k86275k60082j27995k5626R4767J60114
$$ 632226 953897 1193846 1345510 1209215 922940 662858 534863 509237 604004 764118
17568G64118m4269J463P7629m5027n1554J5124l8375o4741q5353R0075J13790
$$ 764118 719849 721312 798941 753914 702360 717484 679109 614368 529015 619090 732880
17557G32880n5509m1661P0792J63988J23451Q2087K4818j71874M2427J3605q5121
$$ 732880 677371 635710 706502 870490 993941 1076028 1100846 928972 971399 985004 899883
17546H99883j99477j25446j9884O2531r2448n9302P6570K8448j00242j11794l821
$$ 899883 700406 574960 555076 617607 525159 465857 542427 570875 470633 358839 355018
17535C55018O2635m7549J3000N8817K079n8535n2611j15196m2224J31918R0374
$$ 355018 417653 370104 383104 441921 444000 385465 332854 217658 175434 307352 397726
17524C97726j90039n1373J04276M4229P196K58278M40212L58669K55699N6007
$$ 397726 207687 156314 260590 304819 312015 570293 1010505 1369174 1624873 1680880
17514A680880j24122k95269l33898j70791k17022j71940p0902r3890l24J11445
$$ 1680880 1556758 1261489 927591 756800 539778 367838 296936 203046 202722 314167
17504C14167j8853q043l3625m90k5868q6028j7005P9631R2453L0277R4389M0786
$$ 314167 295314 287271 253646 253156 227288 141260 124255 203886 296339 326616 421005 461791
17492D61791J82740L30008L14667J00948j62249k51714k45298j96610j20393l6968
$$ 461791 644531 974539 1289206 1390154 1227905 976191 730893 534283 413890 376922
17482C76922L8306j7L6944N6045j0691j45509j81911k0930L9593k7963J8469l6972
$$ 376922 415228 415211 452155 508200 497509 352000 170089 149159 188752 160789 179258 142286
17470A42286O968p1760r4182O0133J0365J1573k3914k3268J7313k8128J21526
$$ 142286 149254 77494 -16688 43445 53810 65383 41469 18201 35514 7386 128912
17459A28912Q79K4849K2740j25881r9845N7493J55933K5299q11n2048O3608N4660
$$ 128912 129791 154640 177380 51499 -48346 9147 165080 190379 189568 137520 201128 255788
17447B55788O3062O1935J79381K75657L72260k364k94598k93697k47669r2224
$$ 255788 318850 380785 560166 835823 1208083 1205719 911121 617424 369755 277531
17437B77531M9372N4341j01613r8079K2355L4764j06802M9853N7945m5195M1078
$$ 277531 326903 381244 279631 181552 203907 238671 131869 181722 239667 194472 235550
17426B35550M9569l4946j08816k3260l0062Q2130K5782L0297M8424O8217q803
$$ 235550 285119 250173 141357 118097 88035 170165 195947 226244 274668 342885 334082
17415C34082m8748r9695l4075M2337Q4888r0282m6349K1878j35286n2992J5206
$$ 334082 285334 185639 151564 193901 278789 188507 142158 164036 28750 -24242 -9036
17404i036L8184Q5453j5586j3307M3855o5055p0455J09790O7028L9381k9155j2242
$$ -9036 29148 114601 99015 85708 129563 64508 -5947 103843 170871 210252 181097 168855
17392A68855J1286o330j63960m4813P1142P5406N122j6100N3590K8260r8049n3146
$$ 168855 180141 173811 9851 -34962 36180 111586 116708 100608 154198 182458 84409 31263
17380C1263J9432m6547k2778J3753N9038N4431l9076r1000m4432j2881L0389N5036
$$ 31263 50695 4148 -18630 -4877 54161 108592 69516 -21484 -65916 -78797 -48408 6628
17368F628k1002L8425l5853K867n6523N246J31507J859o2587q6119P998j3675
$$ 6628 -14374 24051 -11802 -8935 -65458 -60212 71295 73154 10567 -75552 -67554 -81229
17356h1229k2689K3385J21777R032P5959N187L0801N5869M7333P7400R3761J5795
$$ -81229 -103918 -80533 41244 50276 126235 131422 162223 218092 265425 342825 436586 452381
17344D52381r6298j23374o2006m1340o1605j9763J68081L9514L2347J33153J00761
$$ 452381 356083 232709 170703 129363 67758 47995 216076 255590 287937 421090 521851
17333E21851O5288l0476j25315j83470J42203k62o0448M3475q2102k0443J4404
$$ 521851 587139 556663 431348 247878 390081 389819 329371 372846 290744 270301 284705
17322B84705q7324j27795n3580O2032O9020r0123Q8365k2980q1564J29342K14340
$$ 284705 197381 69586 16006 78038 147058 56935 145300 122320 40756 170098 384438
17311C84438J33123J02798J10705n915j86989r4373j0868k6625M9132J85191J84191
$$ 384438 517561 620359 731064 725149 538160 443787 432919 406294 455426 640617 824808
17300H24808N1989j50465j92017j96014l8673n4432j11911j42235O1042J32716
$$ 824808 876797 726332 534315 338301 299628 245196 133285 -8950 52092 184808
17290A84808L3799p3896J00956M0737J4735j9102k109k0654j25972q7167j250
$$ 184808 218607 144711 245667 286404 301139 282037 279928 259274 133302 46135 44885
17279D4885J87464J91634J07966N1090J553k37965j90215m5596l3172Q4510P6510
$$ 44885 232349 423983 531949 583039 584592 346627 156412 110816 77644 162154 238664
17268B38664m1139Q163m0355J3740n4782o5695r0269N8162J31337k8355j06829
$$ 238664 197525 205688 165333 179073 124291 58596 -31673 26489 157826 129471 22642
17257B2642o1730J0674O2291R5850j0221r4286o3917R7059Q2608n4060m566q4442
$$ 22642 -39088 -28414 33877 129727 119506 25220 -38697 58362 140970 86910 82344 -2098
17245b098o6091l8513p3144P0407m4525n0387O4910J52981Q3101J54058L2530
$$ -2098 -68189 -106702 -179846 -109439 -153964 -204351 -139441 13540 96641 250699 283229
17234B83229O757n7842j19820j44530l4219l7702J24842M3687l5077l8400Q4781
$$ 283229 289986 232144 112324 -32206 -66425 -104127 20715 64402 29325 -9075 75706
17223G5706o6085q7474J7701j5274p7363k8481O9309k7093J09602J4984m9714
$$ 75706 9621 -77853 -60152 -75426 -152789 -181270 -111961 -139054 -29452 -14468 -64182
17212f4182m9701q371Q9903K1620N2325m8101P80q6773r5710j6958M8166K7392
$$ -64182 -113883 -122254 -32351 -10731 41594 -6507 -5727 -92500 -188210 -205168 -157002 -129610
17200a29610L0328n6694K3368n8609P8449J01604O6823J5215r6712l7J672j1344
$$ -129610 -99282 -155976 -132608 -191217 -112768 -11164 55659 70874 -25838 -25875 -24203 -35547
17188c5547q0657M2998J50697M863n9704j7290j7553j2100Q2151M2181k7996r1340
$$ -35547 -116204 -73206 77491 82354 22650 5360 -12193 -24293 57858 100039 72043 -19297
17176a9297m2584R3874J7672p4796R4476M1448j23564q7999p085P3283J02071
$$ -19297 -61881 31993 49665 -25131 69345 110793 -12771 -100770 -107855 -34572 67499
17165F7499n6126l2939O1121l5966k7592j1970K8631L1330l5320J2767J0764o8189
$$ 67499 11373 -21566 39555 3589 -24003 -35973 -7342 23988 -11332 1435 12199 -55990
17153e5990p8113p1261J33121K53380q654q3098j33154m9703L6613r9098n2577
$$ -55990 -134103 -205364 -72243 181137 172483 89385 -43769 -93472 -56859 -155957 -208534
17142b08534P4343K9197m3713k0244Q8019N2330j9284R356J18539j35454l9994
$$ -208534 -134191 -104994 -148707 -168951 -80932 -28602 -47886 -38530 80009 -55445 -95439
17131i5439L4861O4405l1586k9878k1027o8087R0815o0577k7777J14484J30018
$$ -95439 -60578 3827 -27759 -57637 -78664 -146751 -55936 -116513 -144290 -29806 100212
17120A00212J4291R9555m15n8089j10225n4706n4131l0124p5013K7960K5952J22373
$$ 100212 114503 214058 213643 155554 45329 -9377 -63508 -93632 -168645 -140685 -114733 7640
17108G640N218O0073m5558j19064j7155M5858j87130j0244K045l6944R020K9370
$$ 7640 12858 72931 27373 -91691 -108846 -62988 -250118 -260362 -258317 -295261 -286241 -256871
17096b56871J10226Q4464J81154j52153q6562N2722N1784N7732P6860Q445j08337
$$ -256871 -146645 -62181 118973 -33180 -119742 -67020 -15236 42496 119356 127801 19464
17085A9464p4829J9774L1702J04929R3149j18694j1333J221j893P1967L8604M9552
$$ 19464 -55365 -35591 -3889 101040 194189 75495 64162 65383 63490 135457 174061 223613
17073B23613j60229n5628m4554L8645J320r8729j5433Q705Q5820J61221O2398
$$ 223613 63384 7756 -36798 1847 3167 -95562 -110995 -102290 -16470 144751 207149
17062B07149q1567q6238j8885q4364K9869K3831N5202p5763L3827P5475P8492
$$ 207149 125582 39344 20459 -63905 -34036 -10205 44997 -30766 3061 78536 157028
17051A57028j12122l7061J74815k7465o1872r2592j0314K2325J9818o2432p37
$$ 157028 44906 7845 182660 155195 93323 731 -9583 12742 32560 -29872 -30609
17040c0609M9563K0055j7415O1003P6426O3551p5460j28566O8956P6237j06220
$$ -30609 18954 39009 21594 82597 159023 222574 147114 18548 87504 163741 57521
17029E7521o4511m9502n7055p6283k3253l7677j4997K6011J17967Q938l5899K2757
$$ 57521 -6990 -56492 -113547 -189830 -213083 -250760 -265757 -239746 -121779 -112841 -148740 -125983
17017a25983J12968K2495J5270Q1853j6508l5877P5828n078j51820n6549M840
$$ -125983 -13015 9480 24750 106603 90095 54218 130046 124968 -26852 -83401 -78561
17006g8561k662J70610J01778L4825k01385k12114q5981J47671J14002l3431J2632
$$ -78561 -81223 89387 191165 225990 24605 -187509 -273490 -125819 -11817 -45248 -32616
16995c2616j1270N1859N58N3528M1188K6384k8742j04822J03359Q5154j11808
$$ -32616 -43886 7973 8531 62059 103247 129631 100889 -3933 99426 184580 72772
16984G2772j50357j4285M5864q4896j60751j12478J04989J92352R0031j4602n1467
$$ 72772 -77585 -91870 -46006 -130902 -291653 -404131 -299142 -106790 -16759 -31361 -82828
16973h2828J3527N1307L4757N0570k233Q1123Q279k1383j9323O782n0009n9109
$$ -82828 -69301 -17994 16763 67333 65100 146223 154502 133119 113796 120578 70569 11460
16961A1460j05223K2241R4811O7067r5056j16626K0356K6401Q2662M3092P9007
$$ 11460 -93763 -71522 23289 90356 -4700 -121326 -100970 -74569 8093 51185 130192
16950A30192l012q4763K6192j57859j85253R0271J55514R2135Q3721l1472j1734
$$ 130192 127180 42417 68609 -89250 -274503 -184232 -28718 63417 147138 115666 103932
16939A03932n3818j06215o7289M3735k3144J5256J6904M5583j1672j261P7580
$$ 103932 50114 -56101 -123390 -79655 -102799 -87543 -70639 -25056 -36728 -37989 39591
16928C9591N5065j9801q5141j4520k096o5807l4343J2757O2673J5023J34091M3098
$$ 39591 94656 74855 -10286 -24806 -26902 -92709 -127052 -114295 -51622 -36599 97492 140590
16916A40590r0959q9388m4461j44526m054L4609J15730J37338J2310p1245K2928
$$ 140590 49631 -39757 -84218 -228744 -232798 -198189 -82459 54879 67189 -4056 18872
16905A8872J53125j9818j11182L4740N8644m3146J23538P0830q2441m0208n0354
$$ 18872 171997 152179 40997 75737 134381 91235 214773 285603 203162 162954 112600
16894A12600Q3661R3587j14017l4521o127k3549O063J7515m4460j61385l9153
$$ 112600 196261 289848 175831 141310 135183 111634 117697 135212 90752 -70633 -109786
16883a09786J0296Q7348M1526n92K8178p6240k5158K4607q0028J5658R9894M1130
$$ -109786 -99490 -12142 29384 28792 56970 -19270 -44428 -19821 -99849 -84191 15703 56833
16871E6833q3450j17027J88374m5551j22512o7932k8948M5549M5662J06292L9427
$$ 56833 -26617 -143644 44730 -821 -123333 -191265 -220213 -174664 -129002 -22710 16717
16860A6717q5360j2637P1219n4385K99Q2083r905K2741p568j40549R18L2468K1986
$$ 16717 -68643 -81280 -10061 -64446 -64147 17936 8031 30772 23204 -117345 -116427 -83959 -61973
16847f1973j37664j2829P7145R7723M0407m2914k922O4179p3174m5341Q5495l2450
$$ -61973 -199637 -212466 -135321 -37598 2809 -40105 -43027 21152 -52022 -97363 -11868 -44318
16835d4318K4428q3365j28147m0901M6549R1646k1905o5428P2290J42491P3257
$$ -44318 -19890 -103255 -231402 -272303 -225754 -134108 -156013 -221441 -149151 -6660 66597
16824F6597k1474p6297M6636J52145p6325n9764J27751k368p3166m3563J3382
$$ 66597 45123 -31174 15462 167607 91282 31518 159269 156901 83735 40172 53554
16813E3554j70676o4224K1229J97872J32357o5534K8207Q6782j7739k6347o4836
$$ 53554 -117122 -181346 -160117 37755 170112 104578 132785 219567 201828 175481 110645
16802A10645k1425j09690o6292j29156P5451J7075M5409K4361L9412m3930k9468
$$ 110645 89220 -20470 -86762 -215918 -140467 -123392 -77983 -53622 -14210 -58140 -87608
16791h7608J3793M740K9788M7475J00866J56883n8096j8458J8969M661J516n5273
$$ -87608 -73815 -69075 -39287 8188 109054 265937 207841 189383 208352 213013 214529 159256
16779A59256o6345j21861Q719L1907k7417q0036j27822r010P7446L5907m5786
$$ 159256 92911 -28950 -20231 11676 -15741 -95777 -223599 -232609 -155163 -119256 -165042
16768a65042K784m217j41177J4881N1113K1339J9498J56290J21342m5043Q6416
$$ -165042 -162258 -166475 -307652 -292771 -241658 -220319 -200821 -44531 76811 31768 118184
16757A18184j3429j52120k5782J21193J26531j9547l4830j56977r6128P9942P7335
$$ 118184 104755 -47365 -73147 48046 174577 155030 120200 -36777 -132905 -52963 24372
16746B4372q6709P6811L9358m8211q2223j0640N3218K2931L2540m3515M2732m724
$$ 24372 -62337 14474 53832 5621 -76602 -87242 -34024 -11093 21447 -22068 20664 15940
16734A5940q6048n2061m5314O5643L8642R6153r6588L1683L6235P3724n1777j96481
$$ 15940 -70108 -122169 -167483 -101840 -63198 32955 -63633 -31950 4285 78009 26232 -170249
16722a70249P609l2740j3329J06392L0450o1765q9720j0335L4047Q9364l2053
$$ -170249 -162640 -195380 -208709 -102317 -71867 -133632 -223352 -233687 -199640 -110276 -142329
16711a42329q2780j2092n505N7074N6926M3960L8469Q1486j7692o1504r4801L6403
$$ -142329 -225109 -237201 -242706 -185632 -128706 -84746 -46277 35209 17517 -43987 -138788 -102385
16699a02385J05137O3485p0966k1880o5564q0849j6101N1944J2816J05808M0021
$$ -102385 2752 66237 -4729 -26609 -92173 -173022 -189123 -137179 -124363 -18555 21466
16688B1466k5986N7735K6428k2074N426j9174p2898n9770j378q067L2773R1707
$$ 21466 -4520 53215 79643 57569 62995 43821 -29077 -88847 -90225 -98292 -65519 26188
16676B6188k6362O05k3397L7144p0683r201J42570J6605Q0526Q6168o7056o6446
$$ 26188 -174 431 -22966 14178 -56505 -65706 76864 93469 173995 260163 193107 126661
16664A26661p7772o0311J5246L190O2620n7790o7097m2735M4620P0677m4868N0042
$$ 126661 48889 -11422 3824 7014 69634 11844 -55253 -97988 -53368 17309 -27559 22483
16652B2483J02931M7323n1495R046l6143j50184J3639l4269K2431L6225J78573
$$ 22483 125414 172737 121242 130288 94145 -56039 -42400 -76669 -54238 -18013 160560
16641A60560l0488o1616p1924m1867K5616j22376J04874J82392r4103J3501n6420
$$ 160560 130072 68456 -3468 -45335 -19719 -142095 -37221 145171 51068 64569 8149
16630H149j17119j07456J17625J13786J6855ql5710p6082p2280j5766O094Q0042
$$ 8149 -108970 -216426 -98801 14985 31840 31832 -3878 -79960 -152240 -168006 -161912 -81870
16618h1870o1809P6566o395k445q9376j56561J5421J84541Q688p8169M3660J28222
$$ -81870 -143679 -67113 -73508 -75953 -165329 -321890 -306469 -121928 -113240 -191409 -147749 -19527
16606a9527J00227l8773K176r687r6562q3873L5077J11601p3841l1001K7316Q6324
$$ -19527 80700 41927 44103 34416 -62146 -146019 -110942 659 -73182 -104183 -76867 9457
16594I457J57148K8037j60121j47123J6776K13472J5869l1722j35432j72080n6276
$$ 9457 166605 194642 34521 -112602 -95826 117646 133515 101793 -33639 -205719 -261995
16583b61995K05498J92570k5108M0793J14400K5418J283j82300j10655n4881k2297
$$ -261995 -56497 136073 110965 151758 266158 291576 292859 110559 -96 -54977 -77274
16572g7274Q195j0481K4095J15592L0844j21903P6779P0722q1231J06712J26229
$$ -77274 -69079 -79560 -55465 60127 90971 -30932 45847 116569 35338 142050 268279
16561B68279m504q1436r9484k5135j7586p9976o1197Q2913J74020m6723j50200
$$ 268279 263775 182339 82855 57720 40134 -39842 -101039 -18126 155894 109171 -41029
16550d1029n2695R7776P4342M213p5079j05815J326P2667n0950L6639O0479J09957
$$ -41029 -93724 4052 78394 82607 7528 -98287 -96961 -24294 -75244 -38605 21874 131831
16538A31831r6889j9411m0571O8895M2332p6366r914K7503K8841j12789Q4072
$$ 131831 34942 15531 -25040 43855 86187 9821 -93 27410 56251 -56538 27534
16527B7534J7872n1924o370M2739r3499j41402n3052N7640N0909N9486M6675J21903
$$ 27534 45406 -6518 -12888 29851 -63648 -205050 -258102 -200462 -149553 -90067 -43392 78511
16515G8511p456j65711j7983L6736n3914M5761L0694p2363j04532m7441K0409
$$ 78511 71055 -94656 -112639 -75903 -129817 -84056 -53362 -125725 -230257 -277698 -257289
16504b57289R3055J84812J52917q6822j06281o1679K7253J03566j3311m7009m0017
$$ -257289 -164234 20578 173495 86673 -19608 -81287 -54034 49532 36221 -10788 -50805
16493e0805N148n1163Q198J10658J18140p4207r5761k9449j06616O4859J38905
$$ -50805 -45657 -96820 -88622 22036 140176 65969 -29792 -59241 -165857 -100998 37907
16482C7907N8212O7729j3072j47039j84569m2375J08336J43167J7634j943M6141
$$ 37907 96119 163848 150776 3737 -180832 -223207 -114871 28296 45930 43987 90128
16471I0128J11994m8598r0031q8964L2360K6429r835K5370k7877q9364L5914J0044
$$ 90128 202122 153524 63493 -25471 6889 33318 23483 48853 20976 -68388 -32474 -22430
16459b2430l6671l2762R1700p999j37394K6527M3619L6614m0170j28747k0712
$$ -22430 -59101 -91863 -163 -8162 -145556 -119029 -75410 -38796 -78966 -207713 -228425
16448b28425O1858P4633j401N1425O6849o4187l4992j6418J6266j5751j1066Q1153
$$ -228425 -166567 -91934 -93335 -41910 24939 -39248 -74240 -90658 -74392 -90143 -101209 -20056
16436b0056P9844L8417n7789M7247r8882j04729R8206P0631o5056k8023O8690
$$ -20056 59788 98205 40416 87663 -11219 -115948 -17742 52889 -12167 -40190 28500
16425B8500P8777o1509L4954N7918P414j06265j8189p5726j3906R9552j3422J0254
$$ 28500 107277 45768 80722 138640 146054 39789 21600 -54126 -68032 31520 18098 28352
16413B8352K7075m4417p9533p6030j0862J3483J02562j2289o5403l6013M2186
$$ 28352 55427 11010 -68523 -144553 -155415 -141932 -39370 -51659 -117062 -153075 -110889
16402a10889P6498n8443n0077j09173k5644M5595R039J7195J44628O8201o9479
$$ -110889 -34391 -92834 -142911 -252084 -277728 -232133 -223094 -205899 -61271 6930 -62549
16391f2549p2736n6733J73853M6598n134L9145Q388j7568L621o7855p4971q98
$$ -62549 -135285 -192018 -18165 28433 23299 62444 70832 53264 56885 -10970 -85941 -86839
16379h6839O5408m1682J9352J10919N6053k472p4319m0617r4511j24497L732K0041
$$ -86839 -21431 -63113 -43761 67158 123211 120739 46420 5803 -88708 -213205 -209473 -189432
16367a89432J38102J04973j9546q809K2565L7660l5002o0000J27778m4587j05614
$$ -189432 -51330 53643 34097 25288 47853 85513 50511 -9489 118289 73702 -31912
16356c1912j08014p2735P8907p399R5623k9704l7358J00q2036L4893j2872J548
$$ -31912 -139926 -212661 -133754 -141153 -45530 -75234 -112592 -112492 -194528 -159635 -172507 -170959
16344a70959K6815J7675O0931l385R4435K5712r406k3797O2177l7981L1680N9024
$$ -170959 -144144 -126469 -65538 -68923 25512 51224 41818 18021 80198 42217 73897 132921
16332A32921j36578q6895M6155O4452j5935r5021p0379J18693L0483p2008p4557
$$ 132921 -3657 -90552 -44397 20055 4120 -90901 -161280 -42587 -12104 -84112 -158669
16321a58669N6880L5523N4681m5378r2054M4054M7160l262l019j9798L8373N033
$$ -158669 -101789 -66266 -11585 -56963 -149017 -104963 -57803 -61065 -64084 -83882 -45509 -40476
16309d0476Q7359M8515r628m097M068k4414q629l1400m5201O5775Q6835j98j10829
$$ -40476 46883 95398 85770 81673 85741 61327 52698 21298 -23903 41872 128707 128509 17680
16296A7680J11101K6523p6618j2922m7916k9147J2374J7475Q8035J21913k5965
$$ 17680 128781 155304 78686 65764 17848 -11299 1075 18550 106585 228498 202533
16285B02533q7101J3002n4338n6843m2694m3546L6319N1690L1141r4508M8959
$$ 202533 115432 128434 74096 17253 -25441 -68987 -32668 19022 50163 -44345 4614
16274D614P1925R361p6900j24411J8215Q864j633k7693o8831N6996J7372p8178
$$ 4614 76539 85900 9000 -115411 -97196 -88332 -89965 -117658 -186489 -129493 -112121 -190299
16262a90299L6210K9217p106P1669o5584r4580J80870K4343p3136k1967j0767
$$ -190299 -154089 -124872 -131978 -60309 -125893 -220473 -39603 -15260 -88396 -110363 -121130
16251a21130N4986J40041m9374j12792J0776M8002n7395O2313m0661m8276N2600
$$ -121130 -66144 73897 24523 -88269 -77493 -29491 -86886 -24573 -65234 -113510 -60910
16240f0910L1889J26207N6842o6805p248P7929Q6380o7246n3439m1788L4935Q59
$$ -60910 -29021 97186 154028 87223 79975 157904 244284 177038 123599 81811 116746 117605
16228A17605L9957p7552n0524L1762n0729m0689r9498l5237q4121J14006J67726
$$ 117605 157562 80010 29486 61248 10519 -30170 -129668 -164905 -249026 -135020 32706
16217C2706M4889k0205k499r6800L377o9204l8005J9071O1522N7598k2775j00553
$$ 32706 77595 57390 54891 -41909 -38532 -107736 -145741 -126670 -65148 -7550 -30325 -130878
16205a30878q3740p2412Q4759J03014k3300j5448k4372P1606k1151m6417J02028
$$ -130878 -214618 -287030 -202271 -99257 -122557 -138005 -162377 -90771 -111922 -158339 -56311
16194e6311J64781J6400o0452q0437p5023N9900P124q36O1981k7974P4235K6298
$$ -56311 108470 124870 64418 -16019 -91042 -31142 -24018 -24854 37127 9153 83388 109686
16182A09686p6181J00209j18008p6327K6939R6204J247l1323p832K0732p3418
$$ 109686 33505 133714 15706 -60621 -33682 62522 63769 32446 24614 45346 -28072
16171b8072L6417J35492O5626m7316j81298o8415L40J7749R2978j9422n7095P5411
$$ -28072 8345 143837 209463 162147 -19151 -87566 -87226 -69477 23501 4079 -53016 22395
16159B2395N2617k47548R0029P6687m3736N0149N8662j7450P870k992K9486O2891
$$ 22395 75012 -172536 -82507 -5820 -49556 593 59255 41805 49675 46683 76169 139060
16147A39060o2067K8398p8513q1434L1056P6135N2532k7323j07960O5947J10250
$$ 139060 76993 105391 26878 -54556 -23500 52635 105167 77844 -30116 35831 146081
16136A46081l591k0925q6342l3114q4874r4073Q1011O4756M3536j1936N3777J8656
$$ 146081 142490 121565 35223 2109 -82765 -176838 -95827 -31071 12465 529 54306 72962
16124G2962m8431l4829K060q489J49927J4630q6694P3746l1314K7712l9709N7781
$$ 72962 24531 -10298 -8238 -16727 133200 147830 61136 134882 103568 131280 91571 149352
16112A49352k16771j0550P6951j40174r7164J6784L5709R4655P505k8014o290
$$ 149352 -67419 -77969 -1018 -141192 -238356 -221572 -185863 -91208 -83703 -111717 -118007
16101a18007L3813M5907J21060M4965j9300m1889j01152l0323k9414R1482Q0756
$$ -118007 -84194 -38287 82773 127738 108438 66549 -34603 -64926 -94340 -2858 77898
16090G7898M4208r3330j23031L1501k1778j12619J06206N5944J5771j8173N538
$$ 77898 122106 28776 -94255 -62754 -84532 -197151 -90945 -35001 -19230 -37403 -31865
16079c1865l3317p6098J7172q6142R6723m2613l1586L6193L8962n335K2310P4036
$$ -31865 -65182 -141280 -124108 -210250 -113527 -156140 -187726 -151533 -112571 -117906 -95596 -21560
16067b1560m0847k3205k3033J17041K5196n0904o937K7324j04663o3501J64605
$$ -21560 -62407 -85612 -108645 8396 33592 -17312 -24249 3075 -101588 -165089 -484
16056d84L1956p6724N1817j4226k439j30726j31677J00192j4692O328J33283j6144
$$ -484 31472 -45252 6565 -7661 -10100 -140826 -272503 -172311 -187003 -180675 -47392 -63536
16044f3536j7541R007N4823L1242l9780n8051j198J91501o9389j04528j2870k0923
$$ -63536 -81077 -72070 -17247 13995 -25785 -83836 -85034 106467 37078 -67450 -80320 -101243
16032a01243k5430J64850M6977j06313o4503m349J09656M1802l2866L2446R6610
$$ -101243 -126673 38177 85154 -21159 -85662 -90011 19645 61447 28581 61027 157637
16021A57637l8444p5004k64m0606j4474J3525Q5460M5141L2317P4856j1426O7152
$$ 157637 119193 44189 43925 3319 -11155 2370 87830 132971 165288 240144 228718 295870
16009B95870j20734m9320K355M9080N7136j03998n1767m2216m9332p6102l6859
$$ 295870 175136 125816 128171 177251 234387 130389 78622 36406 -12926 -89028 -125887
15998a25887J04599M131L2663M9898m7610L5797L4804p8997j42806J54356K8956
$$ -125887 -21288 -17157 15506 65404 17794 53591 88395 9398 -133408 20948 49904
15987D9904j16404k1864L8077n3922q733N9741J03920L6822l0442O0155l9315
$$ 49904 -66500 -88364 -50287 -104209 -112942 -53201 50719 87541 57099 117254 77939
15976G7939M2114O3350q1711j71254n3563J5446R142L8166j6639q732k6839K4770
$$ 77939 120053 183403 101692 -69562 -123125 -107679 -98537 -60371 -77010 -85742 -112581 -87811
15964h7811Q6797K0923r5341R1901J66173n911j94813o416o5786q2004O1515J26964
$$ -87811 -1014 19909 -75432 16469 182642 176731 -18082 -24498 -90284 -172288 -110773 16191
15952A6191k7794M2649r2050j16468J7896K4515M7406Q9857q7335n5040r216q007
$$ 16191 -11603 31046 -61004 -177472 -159576 -135061 -87655 2202 -85133 -140173 -149389 -157396
15940a57396N7140N4421J04466J0360M1131j23192q4033l7427o2092Q3323o62
$$ -157396 -100256 -45835 58631 68991 110122 -13070 -97103 -134530 -196622 -113299 -113961
15929a13961O0042M4571m8733P6448l1655l4748l9123K963N7058M4542P543o8814
$$ -113961 -53919 -9348 -58081 18367 -13288 -48036 -87159 -84196 -27138 17404 24947 -43867
15917d3867o7660L0090Q1790J7726j9615J4162o0856o7737p0247j8247j25505
$$ -43867 -111527 -81437 353 18079 -1536 12626 -48230 -115967 -186214 -204461 -329966
15906c29966o3818J21722O2453o8286N1503L639Q7070K4814p6295o7818l4365
$$ -329966 -393784 -272062 -209609 -277895 -226392 -222753 -135683 -110869 -187164 -254982 -289347
15895b89347M2887J17633P2716m3544L5681P0314Q1851L9326n8641R8382m2641
$$ -289347 -246460 -128827 -56111 -99655 -63974 6340 88191 127517 68876 167258 124617
15884A24617L6134L0648O285p8455q3921m9500j19642Q5919R747n672j2785J42816
$$ 124617 160751 191399 197684 119229 35308 -14192 -133834 -47915 -38168 -43840 -56625 86191
15872H6191M3442p4672q6027ql5762K7606R135q6987N7282r5723M988J18576P4800
$$ 86191 129633 54961 -31066 -31074 -66836 -39230 -30095 -117082 -59800 -155523 -150535 -31959 42841
15859D2841K3302J5513k4338j08697J01825J18252j7806o4501p4795k9618O47
$$ 42841 66143 81656 57318 -51379 50446 168698 150892 86391 11596 -18022 -17375
15848a7375P4330J5458j6406q2699m4762O7279j10380n1281R9732J37077n0593
$$ -17375 56955 72413 56007 -26692 -71454 -4175 -114555 -165836 -66104 70973 20380
15837B0380j1354k516r7079k2421L2704J37499R3020J7975J871l0419o1218j08057
$$ 20380 9026 6510 -90569 -112990 -80286 57213 150233 168208 170079 139660 78442 -29615
15825b9615j31093j63794K37753J57752Q5125M8357K9626l7644n4055j9018J6013
$$ -29615 -160708 -324502 -86749 71003 156128 204485 234111 196467 142412 123394 139407
15814A39407r1264p4078q3617j6562n61M485j47131j0916L2491J88959O040m494
$$ 139407 48143 -25935 -109552 -126114 -126675 -122190 -269321 -280237 -247746 -58787 -52747 -57241
15802e7241J2806q9990n0065K5633N2677J26592q9810q7142J04498K4064k1443
$$ -57241 -44435 -134425 -184490 -158857 -106180 20412 -69398 -156540 -52042 -27978 -49421
15791d9421L3776J5994J41072M2983j19654P072J60900l0690j78890r1209M0903
$$ -49421 -15645 349 141421 184404 64750 71822 232722 202032 23142 -68067 -27164
15780b7164J07984l701n2736K8217l5226M6706L1833l6811j4024p086K496q236
$$ -27164 80820 77119 24383 52600 17374 64080 95913 59102 45078 37992 40488 32252
15768C2252P722M396r042J5830R0893l3841r9455N441n4510j9398N5688j0126
$$ 32252 39974 44370 35328 51158 142051 108210 8755 14196 -40314 -59712 -4024 -14150
15756a4150J41572P1822k3709J10449q2514j80429l7135O251L5094k0640J9031
$$ -14150 127422 199244 175535 285984 203470 23041 -14094 -7843 27251 6611 25642
15745B5642M3745o0351o4614R5765J29464q0606j30656J03701j07990q9284L1573
$$ 25642 69387 9036 -55578 40187 169651 89045 -41611 62090 -45900 -135184 -103611
15734a03611K2276L729J56303L6084n2490j02224K3394q2825l3586Q6021L4071
$$ -103611 -81335 -77606 78697 114781 62291 -39933 -16539 -99364 -132950 -46929 -12858
15723a2858J9916l0514k0495n2950j4110J12256n1618j17138J7445j69814O261
$$ -12858 7058 -23456 -43951 -96901 -111011 1245 -50373 -167511 -150066 -319880 -313619
15712c13619K41762J33590K6301q0706k6889p6455J00865J5871q5225O8609n1760
$$ -313619 -71857 61733 88034 7328 -19561 -96016 4849 20720 -64505 4104 -47656
15701d7656m5453L5019P0732J93850n2139j02312l6401M9282r7488o3541p6053
$$ -47656 -93109 -58090 12642 206492 154353 52041 15640 64922 -32566 -96107 -172160
15690a72160J4411Q484J48507K6027l4520K4644n426l1030k3420m2995n8040L2838
$$ -172160 -157749 -149265 -758 25269 -9251 15393 9967 -21063 -44483 -87478 -145518 -112680
15678a12680N6335J30815J2268j29001O5578J50947p0841j26468l7694j34730
$$ -112680 -56345 74470 86738 -42263 23315 174262 103421 -23047 -60741 -195471
15668a95471k7918O2095J25755j07102l7903J532o0026J04033Q4157o8725M3883
$$ -195471 -223389 -161294 -35539 -142641 -180544 -179012 -239038 -135005 -50848 -119573 -75690
15657g5690r1173J4695L337N7502O5252J7471m6068q8652L7603N1750p0793r2344
$$ -75690 -166863 -152168 -148831 -91329 -26077 -8606 -54674 -143326 -105723 -53973 -124766 -217110
15645b17110O500l08J4043J40516O0338k07343j5871J50256J34538Q9221j4528
$$ -217110 -210610 -210918 -196875 -56359 3979 -203364 -219235 -68979 65559 154780 140252
15634A40252n3430j69344P1923P0369J1079k6619k1676R622m213n0676j6585K9290
$$ 140252 86822 -82522 -10599 59770 70849 44230 22554 32176 27963 -22713 -39298 -10008
15622a0008r4831R0322P7340J7564K4464l0308M1969k6871N7691j1414o4940J18843
$$ -10008 -104839 -14517 62823 80387 104851 74543 116512 89641 147332 135918 70978 189821
15610A89821q0088p5984K5273M1201N9567j22811n3036P2616L8608R3723J07404
$$ 189821 109733 33749 59022 100223 159790 36979 -16057 56559 95167 188890 296294
15599B96294j17012j18905j6807j14400m2988M5343J03123k9294j2593j521k2034
$$ 296294 179282 60377 43570 -70830 -113818 -68475 34648 5354 -7239 -8760 -30794
15588c0794n4699r09L9561q0861L7000Q2684L094j2490Q1496o394k0300Q8212
$$ -30794 -85493 -86402 -46841 -127702 -90702 -8018 -4924 -17414 64082 57688 37388 125600
15576A25600j16412o5524l869R6583L4124m7019K7201R2276m5205j61934m4038
$$ 125600 9188 -56336 -60205 36378 70502 23483 50684 142960 97755 -64179 -108217
15565a08217j1891n4004N4897K12183k1899o130r1511o2730P6662l2656j96J24414
$$ -108217 -120108 -174112 -119215 92968 71069 64939 -26572 -89302 -12640 -45296 -45492 78922
15553G8922j0525Q6362l5018j74409l1752J06646J56386m5166K1371o5096j72194
$$ 78922 68397 154759 119741 -54668 -86420 20226 176612 131446 152817 87721 -84473
15542h4473p3344K2759j5776N1837L7805O3883N5899J22035M5693m1366p7030
$$ -84473 -157817 -135058 -150834 -98997 -61192 2691 58590 180625 226318 184952 107922
15531A07922l819q2628N1647n681o9863j24452K8433K33644O1441j73625j12773
$$ 107922 104103 21475 73122 67441 -2422 -126874 -98441 135203 196644 23019 -89754
15520h9754J38137O6366M8096j9460j15383p5805j03152J7651J06453l721l6040
$$ -89754 48383 114749 162845 143385 28002 -47803 -150955 -133304 -26851 -30572 -66612
15509f6612j7336m734m7366r1071L3491Q301k4673J8072L6147J40647j985j0766
$$ -66612 -83948 -88682 -136048 -227119 -193628 -185327 -210000 -191928 -155781 -15134 -17119 -27885
15497b7885j2373K5186N471P731q775M190n7856P4869r5170r264R3329O711R6259
$$ -27885 -40258 -15072 -9601 -1870 -10645 -6455 -64311 10558 -84612 -93876 -547 6164 102423
15484A02423P827j73858j67645L0503r5746P4658R584L4687L7661P5799R9644
$$ 102423 110250 -63608 -231253 -200750 -296496 -221838 -212254 -177567 -139906 -64107 35537
15473C5537l0992j1147J3345j062m1702k4458K8825P8159l9131o3230k686j6164
$$ 35537 4545 -6602 6743 5681 -36021 -60479 -31654 46505 7374 -55856 -58542 -74706
15461g4706q416O7407L3135O777q4003K3535O8029M7268J389n0489O7203J8123
$$ -74706 -83122 -15715 17420 24197 -59806 -36271 31758 79026 80415 29926 97129 115252
15449A15252O8141j10509j28815k788O9206M1566k2104J4284k731l8688n0458
$$ 115252 183393 72884 -55931 -58719 10487 52053 29949 44233 41502 2814 -47644
15438d7644l2681L0975J08779P0481p5311N4413j10845p5246J4337j34700J39308
$$ -47644 -80325 -49350 59429 129910 54599 109012 -1833 -77079 -62742 -197442 -58134
15427e8134J18978o8180r5853n6393R5854K8230L6187l6037J60508r110j1814
$$ -58134 60844 -7336 -103189 -159582 -63728 -35498 689 -35348 125160 116050 104236
15416A04236j42658m5742N0259n9464q9207M9761M7482N904J62813P05o6219m0024
$$ 104236 -38422 -84164 -33905 -93369 -182576 -132815 -85333 -79429 83384 84089 17870 -22154
15404b2154q6791N6922K6445j2785j2099j01707L4458M6268l979m9202O5726j6209
$$ -22154 -108945 -52023 -25578 -38363 -50462 -152169 -117711 -71443 -75422 -124624 -58898 -75107
15392g5107P2080q5184o6129M2536J8790j5278j3718o1933Q7609L5585N5448J3233
$$ -75107 -3027 -88211 -154340 -111804 -93014 -108292 -122010 -183943 -96334 -60749 -5301 7932
15380G932k7632Q2031j6548o6379J6684Q0856l5567l6842n4775l4308L2965p1296
$$ 7932 -19700 62331 45783 -20596 -3912 76944 41377 4535 -50240 -84548 -51583 -122879
15368a22879P0566R4856J10877K3964r3026l2376m0969k578p268j56084O3749
$$ -122879 -52313 42543 153420 177384 84358 51982 11013 8435 1167 -154917 -91168
15357i1168R1503q812k7143J89555k4264j02443r8937j7855R0901m339o7079j01086
$$ -91168 335 -8477 -35620 153935 129671 27228 -71709 -89564 1337 -3002 -70081 -171167
15345a71167K2785J65177R506k3126n3801j6181n1650N7975L4812J480o1317l8458
$$ -171167 -148382 16795 26301 3175 -50626 -66807 -118457 -60482 -25670 -24190 -85507 -123965
15333a23965k722N4143Q0894n6992J3142m794K6949j877k6958M7879O3205K230
$$ -123965 -126687 -72544 8350 -48642 -35500 -40294 -13345 -15222 -42180 5699 68904 71134
15321G1134n4258r1754R164M8072L6873o207j9476k6972n0044P6343J5365k2982
$$ 71134 16876 -74878 -65714 -17642 19231 13024 -6452 -33424 -83468 -7125 8240 -14742
15309a4742k3227j8694N0605J7858k7675m3982J59104M4134j05490m5626l7767
$$ -14742 -37969 -56663 -6058 11800 -15875 -59857 99247 143381 37891 -7735 -45502
15298d5502Q9759j03380o0586m1482o6182J01161Q9187K9411P800N6671n4641
$$ -45502 44257 -59123 -119709 -161191 -227373 -126212 -37025 -7614 186 56857 2216
15287B216j35562l6694q3695L9959J19136P5407o5338p1734O931J50091J7401
$$ 2216 -133346 -170040 -253735 -213776 -94640 -19233 -84571 -156305 -149374 717 18118
15276A8118L0155K5735m1685j01174J9254L8442M2914j9351m2915p3976L5017
$$ 18118 48273 74008 32323 -68851 -49597 -11155 31759 12408 -30507 -104483 -69466
15265f9466J01817k6948k0727j0777k3953P8183P4449n8177p2656l1037J00827
$$ -69466 32351 5403 -15324 -26101 -50054 28129 102578 44401 -28255 -59292 41535
15254D1535j5514K6104N6346k6695j05889m6446N9915P0286M585m3016j76077
$$ 41535 26021 52125 108471 81776 -24113 -70559 -10644 59642 64227 21211 -154866
15243a54866P5547J22647j0226j36526J1398J29633J9320O875n5408j11949r7818
$$ -154866 -79319 43328 33102 -103424 -92026 37607 56927 63802 8394 -103555 -201373
15232b01373L6950l3225j01384O8295M0301k9181M2907N2331J136n0234J0847
$$ -201373 -164423 -197648 -299032 -230737 -190436 -219617 -176710 -124379 -123243 -173477 -162630
15221a62630P6358m5585j461M9232N7643M987J07191o8762m2740N4420N4400L0122
$$ -162630 -86272 -131857 -133318 -84086 -26443 -21456 85735 16973 -25767 28653 83053 113175
15209A13175n8015p0137j3635r7218j4240J06123J48222K20p6239r6951p7700
$$ 113175 55160 -14977 -28612 -125830 -140070 -33947 114275 114495 38256 -58695 -136395
15198a36395k7180j4770L8833L9955j5488O2687j8642K6564o2715k824j725J39203
$$ -136395 -163575 -178345 -139512 -99557 -115045 -52358 -71000 -44436 -107151 -109975 -111700 27503
15186B7503Q1718p2378j34042l6400J02913l2400M4023Q710p1595j49062Q7405
$$ 27503 109221 36843 -97199 -133599 -30686 -63086 -19063 -10353 -81948 -231010 -143605
15175a43605J30018O4570K335N8094j8768k6602m6553R3144M7331m2389l8459
$$ -143605 -13587 50983 53318 111412 92644 66042 19489 112633 159964 117575 79116
15164G9116O2944K96l3074m9340M8292j1001q644J36899K8140j06105J6727k0031
$$ 79116 142060 142356 109282 59942 108234 97233 88589 225488 253628 147523 164250 144219
15152A44219p3204j18893r2126J8683Q8366O4190Q8629n6301r5181J7928L2478
$$ 144219 71015 -47878 -140004 -121321 -32955 31235 119864 63563 -31618 -13690 18788
15141A8788L4069o7800q2824N3384K9333M6922Q494n9120N0052J8670O534m1038
$$ 18788 52857 -14943 -97767 -44383 -15050 31872 40366 -18754 31298 49968 56502 15464
15129A5464J2702R5688r9152K7121J0319J28291Q5972r50j05811m5686k4708j21464
$$ 15464 28166 123854 24702 51823 62142 190433 276405 275455 169644 123958 99250 -22214
15117b2214j20464O2243J07172N5365r9255n8772N1557R3320K6767J0875K3752
$$ -22214 -142678 -80435 26737 82102 -17153 -75925 -24368 68952 95719 106594 130346
15106A30346q1013n2939j20397p8721j09425K42349K01601j2386J8741l3724q0861
$$ 130346 49333 -3606 -124003 -202724 -312149 -69800 131801 119415 138156 104432 23571
15095B3571L7953N54q9151N1087N3031M6409M9474m1125j57309j78367J10359
$$ 23571 61524 62078 -27073 24014 77045 123454 172928 131803 -25506 -203873 -93514
15084i3514J41728L6863m6516q2621j09817o6999J50745K01091N2391j8815j8071
$$ -93514 48214 85077 38561 -44060 -153877 -220876 -70131 130960 183351 164536 146465
15073A46465p4417M3917N1198Q2290r1416j16130p5513J08996j007M3429M8066
$$ 146465 72048 115965 167163 249453 158037 41907 -33606 75390 74383 117812 165878
15062A65878j8703o0837q2760j3252k9963j3157M0506l5632R038k8974q5023J6407
$$ 165878 147175 86338 3578 -9674 -39637 -52794 -12288 -47920 -38882 -67856 -152879 -136472
15050a36472k074o417P411J61526M4447m8597j07824K2869j7864L3907J0753m6692
$$ -136472 -138546 -144963 -137552 23974 68421 19824 -88000 -65131 -82995 -49088 -38335 -85027
15038h5027K859q153L2982N3293j21537L9901R4092j15708j4662J01888P7760
$$ -85027 -82168 -90321 -57339 -4046 -125583 -85682 8410 -107298 -121960 -20072 57688
15027E7688o7468l323j2344N9384O2018p4806K2852N7558j35332l4544j8533n1238
$$ 57688 -9780 -13103 -25447 33937 95955 21149 44001 101559 -33773 -68317 -86850 -138088
15015a38088k6755K5556M3582O8532o5167q5967j78564p313J56128n5231J2978
$$ -138088 -164843 -139287 -95705 -27173 -92340 -178307 -356871 -364184 -208056 -263287 -250309
15004b50309J42908P4511J2047p735J5282J593r627R4559O750j36059Q0302m0946
$$ -250309 -107401 -32890 -20843 -28578 -13296 -11703 -21330 73229 79979 -56080 24222 -16724
14992a6724M5293J19344k4400j22750n5078J44351M1191j28107p6828p2775l2379
$$ -16724 28569 147913 123513 763 -54315 90036 131227 3120 -73708 -146483 -178862
14981a78862J0099J93430J53165j11927n1167k0820n0936m126K2967O5752Q7888
$$ -178862 -168763 24667 177832 65905 14738 -6082 -57018 -61144 -38177 27575 115463
14970A15463p4894q2012L2433J03041N0842p3289o9634l8625j7648P228J09l2062
$$ 115463 40569 -41443 -9010 94031 144873 71584 1950 -36675 -54323 -47095 -46986 -79048
14958g9048n9669N9608R9699M8049L0166l8417j3983k2577l6825m397M106l377
$$ -79048 -138717 -79109 20590 68639 98805 60388 46405 23828 -12997 -17394 -13288 -16665
14946a6665O780P6378n1739L0814l1099r5365K1776L7396n0776m5893L4239R6148
$$ -16665 -9885 66493 14754 45568 14469 -80896 -59120 -21724 -72500 -118393 -84154 11994
14934A1994Q7975P5857j77920n9035N2287k3638o5527P607K7056J1733L1122m3326
$$ 11994 99969 175826 -2094 -61129 -8842 -32480 -98007 -90400 -63344 -51611 -20489 -63815
14922f3815P8229P5333q3529L675O8245j40383L7968K4685L817O9464k5982q2760
$$ -63815 14414 89747 6218 9893 78138 -62245 -24277 408 4225 73689 47707 -35053
14910c5053j9215n7136J78438Q5405J8493k2855j19854k6647j0090J2019q9181
$$ -35053 -54268 -111404 67034 152439 170932 148077 28223 1576 -8514 3505 -85676
14899h5676N6338O2358K5375l0800L0773p847l783N9173m691j74388j01377m0877
$$ -85676 -29338 33020 58395 27595 58368 50521 46738 105911 101220 -73168 -174545 -215422
14887b15422J05173J64962J3494L1274k6276k0630j1776r5170J7271O1438o9396
$$ -215422 -110249 54713 68207 99481 73205 52575 40799 -54371 -37100 24338 -45058
14876d5058R4929n0623K6107m349P3316O6859j34103o2496o8241R7573O4426J4056
$$ -45058 49871 -752 25355 21006 94322 161181 27078 -35418 -103659 -6086 58340 72396
14864G2396k0347L6080J83925j24338j02200R659m7957N420o101j1941j369K8920
$$ 72396 52049 88129 272054 147716 45516 55175 7218 12638 6537 -5404 -6773 22147
14852B2147M3923M5230j34969N198l3986n5238L5319k6582K1153J11119J01551
$$ 22147 66070 111300 -23669 -18471 -52457 -107695 -72376 -98958 -77805 33314 134865
14841A34865j21232m2804J34396M1165j2937m1166j5546M7864j17806j19721Q078
$$ 134865 13633 -29171 105225 146390 133453 92287 76741 124605 6799 -112922 -104844
14830a04844P6151n5581q987J3783l6953j40113n1062M3140M0920L986m882J45483
$$ -104844 -28693 -84274 -93261 -79478 -116431 -256544 -307606 -264466 -223546 -219560 -224442 -78959
14818g8959J11397j491m2732j9646L126n7765k6881R7304m4508o625J5932K7715
$$ -78959 32438 30947 -11785 -31431 -28305 -86070 -112951 -15647 -60155 -66780 -50848 -23133
14806b3133Q0660O0802p1591m8157O0445N5141j43862j05591k3124J3018J270
$$ -23133 57527 118329 46738 -1419 59026 114167 -29695 -135286 -158410 -145392 -144122
14795a44122M733O4637R6190O7997K8359K0183m0851n4335N6822r555K1055o3636
$$ -144122 -139389 -74752 21438 89435 117794 137977 97126 42791 99613 90058 111113 47477
14783D7477J06977N9114m5671r1560p3355N424l5112N2943m5853K7228L554J2231
$$ 47477 154454 213568 167897 76337 2982 8406 -26706 26237 -19616 7612 11166 23397
14771B3397O254j9180K4005Q739k5534j0220L3398R0461l864L182k7024j56516
$$ 23397 29651 10471 34476 43215 17681 7461 40859 131320 127456 130638 103614 -52902
14759e2902M046N7938K6372N946j09938J1657n9320q6048m4679P7583J42343M3127
$$ -52902 -48856 9082 35454 41400 -68538 -56881 -116201 -202249 -246928 -169345 -27002 16125
14747A6125j13414k9128m0573L2273m2282J42816R1681k2682j29818n3992j7333
$$ 16125 -97289 -126417 -166990 -134717 -176999 -34183 57498 34816 -95002 -148994 -166327
14736a66327k9646p104J85470J16497q9413j48227m4546O3248l4842J63091J33390
$$ -166327 -195973 -203077 -17607 98890 9477 -138750 -183296 -120048 -154890 8201 141591
14725A41591m9547L4474p7955j77836L183m5379N4752R6492j26151P653J20506
$$ 141591 92044 126518 48563 -129273 -126090 -171469 -116717 -20225 -146376 -138723 -18217
14714a8217R412O7588K7415K96j12260j43551n6130J8754J06651M8785o5261m398
$$ -18217 -8805 58783 86198 86494 -25766 -169317 -225447 -206693 -100042 -51257 -116518 -120916
14702a20916O9012P4554J19396M8481J8262L3601m2081j35667k3534M3782K775
$$ -120916 -51904 22650 142046 190527 208789 242390 200309 64642 41108 84890 87665
14691H7665P246P6328P4897j609r5629j73378l7774L7418L3831p5811N9029N4821
$$ 87665 94911 171239 246136 244527 148898 -24480 -62254 -24836 8995 -66816 -7787 47034
14679D7034L6559J4578j130j1633M535j035J2865l0672r5642j0547J46656L2358
$$ 47034 83593 98171 97041 85408 89943 88908 101773 71101 -24541 -35088 111568 143926
14667A43926j95769n3087N8317K2705r8126M9J5224k7035J18963L8255j7458j16269
$$ 143926 -51843 -104930 -46613 -23908 -122034 -121985 -106761 -133796 -14833 23422 5964 -110305
14655a10305q8761N5166Q917L2150l2411n3751Q2532J4059j02886M8782L7237
$$ -110305 -199066 -143900 -134983 -102833 -135244 -188995 -106463 -92404 -195290 -146508 -109271
14644a09271N3231k8412j7019n0408k5352P5127J0121j3345n1048J2305J68709
$$ -109271 -56040 -84452 -101471 -151879 -177231 -102104 -91983 -105328 -156376 -144071 24638
14633B4638m100o4101l3266N0073J5113O4983p8009l4540p515K2129L2115J28783
$$ 24638 20538 -43563 -76829 -26756 -11643 53340 -24669 -59209 -66724 -44595 -12480 116303
14621A16303l5914k28687n1974P5509P6494j05736k9088K7533m2278O1232Q061
$$ 116303 80389 -148298 -200272 -124763 -48269 -154005 -183093 -155560 -197838 -136606 -128545
14610a28545O2981O0828K6613K2809m1169j26834o1057J54702Q487j2484K915
$$ -128545 -65564 -4736 21877 44686 3517 -123317 -184374 -29672 -21185 -33669 -30754
14599c0754L2400p9161J24218M2825n0053p185J17051K4269j31513L8855N6866
$$ -30754 1646 -77515 46703 89528 39475 32290 149341 173610 42097 80952 137818
14588A37818l9849P0993o5533p2002j04370O447R5873Q6138N4206K3583k9345
$$ 137818 97969 168962 103429 31427 -72943 -66496 29377 115515 169721 193304 163959
14577A63959j9250p8940p6095l3762L6241R8215j35008j15024p109J62489P5923
$$ 163959 144709 65769 -10326 -44088 -7847 90368 -44640 -159664 -166773 -4284 71639
14566G1639L664r6566q8266n455M1013N2070P9908j4219o0273k1586p0J4001k7061
$$ 71639 75303 -21263 -109529 -114984 -73971 -21901 58007 43788 -16485 -38071 -38141 -24140 -51201
14553e1201m1986J7916n024L3431k0170n265N4448l0566n2734R059O9456R5648
$$ -51201 -93187 -75271 -80295 -46864 -67034 -72299 -17851 -48417 -101151 -92092 -22636 73012
14541G3012Q5177m161j4957j38536l3633N7092J2958n4986K3172j77967n5121
$$ 73012 158189 154028 139071 535 -33098 23994 36952 -18034 5138 -172829 -227950
14530b27950O3817J02454Q0402o2926M7678J24275q9767q8870M378M6362R0295
$$ -227950 -164133 -61679 18723 -44203 3475 127750 37983 -50887 -46509 -147 90148
14519I0148L4748q5919j25250j48533P2299J27812J15674R6183P1914P5201m2477
$$ 90148 124896 38977 -86273 -234806 -162507 -34695 80979 177162 249076 324277 281800
14508B81800j48609j77051j32518J538Q6504j0762l9159o2639P2584J37804o4514
$$ 281800 133191 -43860 -176378 -174840 -88336 -99098 -138257 -200896 -128312 9492 -55022
14497e5022o174J4963q443j2239k0376l6343M4217O5935N6289j7460p2587R7749
$$ -55022 -61196 -46233 -54676 -66915 -87291 -123634 -79417 -13482 42807 25347 -47240 50509
14485E0509k3608r7805n3273M4301l8642k0802j6989Q7189J22228J1116K3106
$$ 50509 26901 -70904 -124177 -79876 -118518 -139320 -156309 -69120 53108 64224 87330
14474H7330l4799N9589o1915j3908N9374k7186n0409K894K761j1355O7590L281
$$ 87330 52531 112120 50205 36297 95671 68485 18076 20970 23731 12376 79966 83247
14462H3247n931l2152o0866J8530R8036R947o4962J4327l4993L9282o3391M5162
$$ 83247 77316 45164 -15702 2828 100864 110811 45849 60176 25183 64465 1074 46236
14450D6236J00620J6424k624m9756m3984j31919o1455p5113j8510N1224P4988
$$ 46236 146856 163280 160656 110900 66916 -65003 -126458 -201571 -220081 -168857 -93869
14439i3869J9378J46242Q526n9252q1293j19117P7807L5630Q8467M4619J08226
$$ -93869 -74491 71751 80277 21025 -60268 -179385 -101578 -65948 22519 67138 175364
14428A75364L4093j04347m3419O6226k84676n8028K08956O9236p1954O8732q9523
$$ 175364 209457 105110 61691 127917 -156759 -214787 -5831 63405 -8549 60183 -29340
14417b9340o1109K898l9210R6283j4034j05024N7569O4817P359N4607K3695Q8719
$$ -29340 -90449 -87551 -126761 -30478 -44512 -149536 -91967 -27150 -19791 34816 58511 147230
14405A47230M7493q6561L2474j372p2445j4352K5400j8233o1208n8443N4996K9459
$$ 147230 194723 108162 140636 139264 66819 52467 77867 59634 -1574 -60017 -5021 24438
14393B4438j42254r3139J37845Q5209R615O4480P113j05534l8520k3494q5231
$$ 24438 -117816 -210955 -73110 12099 21714 86194 93307 -12227 -50747 -74241 -159472
14382a59472l2193J22230J15593O3820O2936n4017n9673n6448m4097K2009O3856
$$ -159472 -191665 -69435 46158 109978 172914 118897 59224 2776 -41321 -19312 44544
14371D4544l729r0338j44865K8305m40p6135J5572K4586l138l0075J03702P5819
$$ 44544 40815 -49523 -194388 -166083 -166523 -242658 -227086 -202500 -205638 -235713 -132011 -56192
14359e6192J48120k001K1563k3308j6537P5651k00367o9112P5271J8202k212j9772
$$ -56192 91928 89927 111490 88182 71645 147296 -53071 -122183 -46912 -28710 -30922 -50694
14347e0694L027J36701J68657n7883j14820m0924p8510J04833J10652j5018M7549
$$ -50694 -47667 89034 257691 199808 84988 44064 -34446 70387 181039 166021 213570
14336B13570k06541j19890o8957J3595N326K0947j471o7942l7071J9621J6477
$$ 213570 7029 -112861 -181818 -168223 -162897 -141950 -143421 -211363 -248434 -228813 -212336
14325b12336j1195o5447k0927J86591j1169K0421N7214J14954j9908Q8611M0483
$$ -212336 -223531 -288978 -309905 -123314 -134483 -114062 -56848 58106 38198 126809 167292
14314A67292j39492j08377N6759M8528j09366m1073J88628N0162p4114j49755
$$ 167292 27800 -80577 -23818 24710 -84656 -125729 62899 113061 38947 -110808
14304a10808j08517L4181J08521j2935Q1901J2997r2766n5868K5203P1501J05798
$$ -110808 -219325 -185144 -76623 -89558 -7657 5340 -87426 -143294 -118091 -46590 59208
14293E9208j29496L4639J05829P1180j07758j28582J9109Q7370J3200J403k7592
$$ 59208 -70288 -35649 70180 141360 33602 -94980 -75871 11499 24699 26102 -1490
14282a490J3494q7620m0599r3491j23297O7749r9984R7988J87842J2018N2841
$$ -1490 12004 -75616 -116215 -209706 -333003 -265254 -365238 -267250 -79408 -67390 -14549
14271a4549m4988j01042N491J8495j0681j7350J45240Q7748L5215j5612r2570
$$ -14549 -59537 -160579 -155088 -136593 -147274 -164624 -19384 68364 103579 87967 -4603
14260d603l4980M3088o5501m9244q5242k2807J02022J73978P6577j4600j41872
$$ -4603 -39583 3505 -61996 -111240 -196482 -219289 -117267 56711 133288 118688 -23184
14249b3184o8536O0296J01576M07M9498j23665j04829J9976k3742m4657p42o3874
$$ -23184 -91720 -31424 70152 70559 120057 -3608 -108437 -88461 -112203 -156860 -157602 -221476
14237b21476r6163l126J01962L3165M121L0071J6450o611K0846J688j9773L6682
$$ -221476 -317639 -320765 -218803 -185638 -181517 -151446 -134996 -141607 -120761 -119073 -138846 -102164
14225a02164R585J22801L8197j00927o6501R4094P6927J20756L6003k747o5873
$$ -102164 -92579 30222 68419 -32508 -99009 -4915 72012 192768 228771 226024 160151
14214A60151k5148n5991j4278m9398L0177P1215k0158k4316r285O5326j27446
$$ 160151 135003 79012 64734 15336 45513 116728 96570 72254 62969 128295 849
14203H49j5027j557k6445m0801j06836l6059R2331Q1684K5018q843j18403n6347
$$ 849 -14178 -15735 -42180 -82981 -189817 -225876 -133545 -51861 -26843 -35686 -154089 -210436
14191b10436J31211R4545o5985l0872n1958L4492l5916Q1549M8637m8807q241
$$ -210436 -79225 15320 -50665 -81537 -133495 -99003 -134919 -53370 -4733 -53540 -61781
14180f1781L0759J38375J42864O4460k14806j47779r8442n7309m776J44015P5688
$$ -61781 -31022 107353 250217 314677 99871 -47908 -146350 -203659 -208435 -64420 11268
14169A1268K6135l324K3045n5124M3989M0163J8781q0020n6384j57k8856O2110
$$ 11268 37403 34079 57124 2000 45989 86152 104933 24913 -31471 -31628 -60484 1626
14157A626J05547o3380n7957r6312m0797R8644j2272j8181N1568J03112M5000
$$ 1626 107173 43793 -14164 -110476 -151273 -52629 -64901 -83082 -31514 71598 116598
14146A16598r8544l6145J04193J08128q5014j26178K7270J8572M7718l8827k6621
$$ 116598 18054 -18091 86102 194230 109216 -16962 10308 28880 76598 37771 11150
14135A1150k8202n2437q6525K5933J7935m8759m8822k0643J61224K8623n6312
$$ 11150 -17052 -69489 -156014 -130081 -112146 -160905 -209727 -230370 -69146 -40523 -96835
14124i6835l7437L4051Q8511O3999O8970j88226k15128L2847J31367k6692n2308
$$ -96835 -134272 -100221 -11710 52289 121259 -66967 -282095 -249248 -117881 -144573 -196881
14113a96881J7962Q7850K7435m4925J4633n893K5882K1648l3326o2588M8355J1711
$$ -196881 -178919 -91069 -63634 -108559 -93926 -99819 -73937 -52289 -85615 -148203 -99848 -88137
14101h8137J2322L2512J9464L5166O3142p9783j21534Q35P0264O6720N1547r6541
$$ -88137 -75815 -43303 -23839 11327 74469 -5314 -126848 -126013 -55749 10971 62518 -34023
14089c4023L3509q9864o7610k255Q5360J30607l8447n2203N3860Q6706J944o8459
$$ -34023 -514 -90378 -157988 -160243 -74883 55724 17277 -34926 18934 105640 107584 39125
14077C9125j5405j27622j04397L996J03785L9416o5148q851K9291J5286M9881
$$ 39125 23720 -103902 -208299 -204303 -100518 -61102 -126250 -135101 -105810 -90524 -40643
14066d0643m4892R1357l17j9550N3612o7929n9722O3104L3747m9533J9811J40953
$$ -40643 -85535 5822 5505 -14045 39567 -28362 -88084 -24980 8767 -40766 -20955 119998
14054A19998M1599K6404M2431r6286j08252j23226J01122l2308K9599p884J0040
$$ 119998 161597 188001 230432 134146 25894 -97332 3790 -28518 1081 -6803 3237
14043C237J5702j07370l1972J08081M1384j4297l6560m3579m6798K5646Q1998
$$ 3237 18939 -88431 -120403 -12322 29062 14765 -21795 -65374 -112172 -86526 -4528
14032d528N5557o405l8510n1988p1228j4574k8793J2698p3962J00652M4031j696
$$ -4528 51029 44624 6114 -45874 -117102 -131676 -160469 -147771 -221733 -121081 -77050 -78746
14020g8746n3962j3262R3598N9378J3273j6478k3634p9165K3132J19463J8924
$$ -78746 -132708 -145970 -52372 7006 20279 3801 -19833 -98998 -75866 43597 62521
14009F2521k7773j3823n2394M4616M5744j56946O488K3622Q610k3195J4818L8514
$$ 62521 34748 20925 -31469 13147 58891 -98055 -91567 -67945 -59335 -82530 -67712 -29198
13997b9198J83998m5553j77835r105J31120Q7706j0327p7644L4639K3287o3088
$$ -29198 154800 109247 -68588 -77693 53427 141133 130806 53162 87801 111088 48000
13986D8000R7472K9901l6516j71988j48828q005J36141l7221j5438J4165J6961
$$ 48000 145472 175373 138857 -33131 -181959 -189964 -53823 -91044 -106482 -92317 -75356
13975g5356K9179P4140j26901r8664R734K87588l5682l1820K9084M3162R3675
$$ -75356 -46177 27963 -98938 -197602 -187868 99720 64038 32218 61302 104464 198139
13964A98139j5170j9018Q5631o2750j52768K9324J18526O8125r1852j66440m5859
$$ 198139 182969 163951 249582 186832 34064 63388 181914 250039 158187 -8253 -54112
13953e4112j6571M3993R0996r1362j06905J18470M140j30206o4161J11051J47347
$$ -54112 -70683 -26690 64306 -27056 -133961 -15491 -11351 -141557 -205718 -94667 52680
13942E2680J06469J20941m3601j03750j03617j12932l2409r1416j8420P3627J06802
$$ 52680 159149 280090 236489 132739 29122 -83810 -116219 -207635 -226055 -152428 -45626
13931d5626J35649o6747j8920m9123m5823k6676r9908N7612J54260J07227o9714
$$ -45626 90023 23276 4356 -44767 -90590 -117266 -217174 -159562 -5302 101925 32211
13920C2211J4975m1755M526M9380q3756K5352J2408l4182R6087J23376L0217j600
$$ 32211 47186 5431 9957 59337 -24419 933 13341 -20841 75246 198622 228839 227239
13908B27239K3718l5814m0572j29793k2260J570l277O2821O5830k0967j09218
$$ 227239 250957 215143 174571 44778 22518 24088 20811 83632 149462 128495 19277
13897A9277j92066j5222J6950J49366J91775q3520l7777Q3585P6270l8450k6385
$$ 19277 -172789 -188011 -171061 -21695 170080 86560 48783 132368 208638 170188 143803
13886A43803r8686j06990M3602J33623k6216j14288q605M7711m6210n946M8848
$$ 143803 45117 -61873 -18271 115352 89136 -25152 -33757 13954 -32256 -38202 10646
13875A0646O6281R7526l9619K340m4034k06591j32064m2074P2859J38883p3618
$$ 10646 76927 174453 134834 137174 93140 -113451 -245515 -287589 -214730 -75847 -149465
13864a49465Q8632J45285l3269j093j47452p7572O1375J64964R6231P5482j55163
$$ -149465 -60833 84452 51183 50090 -97362 -174934 -113559 51405 147636 223118 67955
13853F7955o4978N9211P6218P8064P6130j76498j22969j0718Q2087L4131k6981
$$ 67955 2977 62188 138406 216470 292600 116102 -6867 -17585 64502 98633 71652
13842G1652P318J51329O129n7098m9816l2047K3336j7359m9137k0290l8082n8387
$$ 71652 78970 230299 236428 179330 129514 97467 120803 103444 54307 34017 -4065 -62452
$$ [...]
##END NTUPLES=NMR SPECTRUM
##END=
