##TITLE=Analysis number 330292
Compound Code cc 24301
Book Reference lab3
Project Code adrs
Chemist Name stores
##JCAMPDX= 6.0         $$ Bruker NMR JCAMP-DX V2.0
##DATA TYPE= NMR SPECTRUM
##DATA CLASS= NTUPLES
##ORIGIN= Bruker BioSpin GmbH
##OWNER= nmr
$$ XWIN-NMR		Version 3.5
$$ Wed Nov 14 10:41:33 2007 GMT Standard Time (UT+0h)  MAYBRIDGE\nmr@NMR_250MHZ
##.OBSERVE FREQUENCY= 250.131544655141
##.OBSERVE NUCLEUS= ^1H
##.ACQUISITION MODE= SIMULTANEOUS (DQD)
##.ACQUISITION SCHEME= undefined
##.AVERAGES= 16
##.DIGITISER RES= 18
##SPECTROMETER/DATA SYSTEM= dpx250
##.PULSE SEQUENCE= zg30
##.SOLVENT NAME= DMSO
##.SHIFT REFERENCE= (INTERNAL, DMSO, 0, 16.522)
##AUDIT TRAIL= $$ (NUMBER, WHEN, WHO, WHERE, WHAT)
$$ ##TITLE= Audit trail, XWIN-NMR		Version 3.5
$$ ##JCAMPDX= 5.01
$$ ##ORIGIN= Bruker BioSpin GmbH
$$ ##OWNER= nmr
$$ C:\u/data/dgb/nmr/ADRS/640/pdata/1/auditp.txt
$$ ##AUDIT TRAIL=  $$ (NUMBER, WHEN, WHO, WHERE, WHAT)
(   1,<2007-11-14 10:40:44.51 +000>,<MAYBRIDGE\nmr>,<NMR_250MHZ>,
      <created by zg, POWCHK disabled, PULCHK disabled
       configuration hash MD5:
       76 6E 9A 78 1E 09 19 81 EC 84 63 8F B0 6A 59 2D
       data hash MD5: 64K
       D9 C2 72 B0 88 6B 8F F2 B5 78 60 EB FA 02 8C 28>)
(   2,<2007-11-14 10:41:11.02 +000>,<MAYBRIDGE\nmr>,<NMR_250MHZ>,
      <Start of raw data processing
       ef LB = 0.3 FT_mod = 6 PKNL = 1 SI = 32K 
       data hash MD5: 32K
       08 0B B7 59 B2 B5 1A C8 B5 30 3D 0E C0 31 AE F8>)
(   3,<2007-11-14 10:41:14.96 +000>,<MAYBRIDGE\nmr>,<NMR_250MHZ>,
      <apk 
       data hash MD5: 32K
       FA 31 73 30 7A F3 B2 92 1A B9 A1 89 83 84 C4 BE>)
(   4,<2007-11-14 10:41:16.43 +000>,<MAYBRIDGE\nmr>,<NMR_250MHZ>,
      <abs ABSG = 5 
       data hash MD5: 32K
       3D 27 24 2B 30 7C 55 F4 1D 04 97 EA BB CE 9D B9>)
$$ ##END=
$$ 
$$ hash MD5
$$ FD 7B 3F 3C B3 62 D9 12 BF C2 01 6C 5D 41 38 FF
##$RELAX= 
##$RELAX= 
##$RELAX= 
##$RELAX= 
##$RELAX= 
##$RELAX= 
##$RELAX= 
$$ Bruker specific parameters
$$ --------------------------
##$DU= <C:\u>
##$EXPNO= 640
##$NAME= <ADRS>
##$PROCNO= 1
##$TYPE= <nmr>
##$USER= <dgb>
##$AMP= (0..31)
100 100 100 100 100 100 100 100 100 100 100 100 100 100 100 100 100 100 
100 100 100 100 100 100 100 100 100 100 100 100 100 100 
##$AQSEQ= 0
##$AQ_mod= 3
##$AUNM= <au_zg>
##$AUTOPOS= <10 >
##$BF1= 250.13
##$BF2= 250.13
##$BF3= 250.13
##$BF4= 250.13
##$BF5= 500.13
##$BF6= 500.13
##$BF7= 500.13
##$BF8= 500.13
##$BYTORDA= 1
##$CFDGTYP= 0
##$CFRGTYP= 5
##$CHEMSTR= <none>
##$CNST= (0..31)
1 1 145 1 1 1 1 1 1 1 1 1 1 1 1 1 1 1 1 1 1 1 1 1 1 1 1 1 1 1 1 1 
##$CPDPRG= <>
##$CPDPRG1= <>
##$CPDPRG2= <>
##$CPDPRG3= <>
##$CPDPRG4= <mlev>
##$CPDPRG5= <mlev>
##$CPDPRG6= <mlev>
##$CPDPRG7= <mlev>
##$CPDPRG8= <mlev>
##$CPDPRGB= <>
##$CPDPRGT= <>
##$D= (0..31)
0 1 0 0 0 0 0 0 0 0.06 0 0 0 0 0 0 0.0002 0 0 0 0 0 0 0 0 0 0 0 0 0 0 
0 
##$DATE= 1195036843
##$DBL= (0..7)
120 120 120 120 120 120 120 120 
##$DBP= (0..7)
150 150 150 150 150 150 150 150 
##$DBP07= 0
##$DBPNAM0= <>
##$DBPNAM1= <>
$$ [...]
##$SUBNAM6= <"">
##$SUBNAM7= <"">
##$SUBNAM8= <"">
##$SUBNAM9= <"">
##$SW= 20.6930455092707
##$SWIBOX= (0..15)
0 0 3 0 0 0 0 0 0 0 0 0 0 0 0 0 
##$SW_h= 5175.983436853
##$TD= 65536
##$TD0= 1
##$TE= 300
##$TE2= 300
##$TE3= 300
##$TEG= 300
##$TL= (0..7)
0 120 120 120 120 120 120 120 
##$TP= (0..7)
150 150 150 150 150 150 150 150 
##$TP07= 0
##$TPNAME0= <>
##$TPNAME1= <>
##$TPNAME2= <>
##$TPNAME3= <>
##$TPNAME4= <>
##$TPNAME5= <>
##$TPNAME6= <>
##$TPNAME7= <>
##$TPOAL= (0..7)
0.5 0.5 0.5 0.5 0.5 0.5 0.5 0.5 
##$TPOFFS= (0..7)
0 0 0 0 0 0 0 0 
##$TUNHIN= 0
##$TUNHOUT= 0
##$TUNXOUT= 0
##$USERA1= <user>
##$USERA2= <user>
##$USERA3= <user>
##$USERA4= <user>
##$USERA5= <user>
##$V9= 5
##$VALIST= <valist>
##$VCLIST= <CCCCCCCCCCCCCCC>
##$VD= 0
##$VDLIST= <DDDDDDDDDDDDDDD>
##$VPLIST= <PPPPPPPPPPPPPPP>
##$VTLIST= <TTTTTTTTTTTTTTT>
##$WBST= 1024
##$WBSW= 4
##$XGAIN= (0..3)
0 0 0 0 
##$XL= 0
##$YL= 0
##$YMAX_a= 546427
##$YMIN_a= -702478
##$ZGOPTNS= <>
##$ZL1= 120
##$ZL2= 120
##$ZL3= 120
##$ZL4= 120
##$ABSF1= 16.522
##$ABSF2= -4.171173
##$ABSG= 5
##$ABSL= 3
##$ALPHA= 0
##$AQORDER= 0
##$ASSFAC= 0
##$ASSFACI= 0
##$ASSFACX= 0
##$ASSWID= 0
##$AUNMP= <proc_1d>
##$AZFE= 0.1
##$AZFW= 0.1
##$BCFW= 0
##$BC_mod= 0
##$BYTORDP= 0
##$COROFFS= 0
##$CY= 12.5
##$DATMOD= 1
##$DC= 0
##$DFILT= <>
##$DTYPP= 0
##$F1P= 14.0000005364418
##$F2P= -0.99999901652339
##$FCOR= 0.5
##$FTSIZE= 32768
##$FT_mod= 6
##$GAMMA= 0
##$GB= 0
##$INTBC= 1
##$INTSCL= 1
##$ISEN= 128
##$LB= 0.3
##$LEV0= 0
##$LPBIN= 0
##$MAXI= 10000
##$MC2= 0
##$MEAN= 0
##$ME_mod= 0
##$MI= 0
##$NCOEF= 0
##$NC_proc= -4
##$NLEV= 6
##$NOISF1= 0
##$NOISF2= 0
##$NSP= 0
##$NTH_PI= 0
##$NZP= 0
##$OFFSET= 16.522
##$PC= 1
##$PHC0= 160.9349
##$PHC1= 4.825917
##$PH_mod= 1
##$PKNL= yes
##$PPARMOD= 0
##$PSCAL= 4
##$PSIGN= 0
##$REVERSE= no
##$SF= 250.13
##$SI= 32768
##$SIGF1= 0
##$SIGF2= 0
##$SINO= 400
##$SIOLD= 32768
##$SREGLST= <1H.DMSO>
##$SSB= 0
##$STSI= 32768
##$STSR= 0
##$SW_p= 5175.98343685301
##$SYMM= 0
##$S_DEV= 0
##$TDeff= 65536
##$TDoff= 0
##$TI= <Analysis number 999999
Compound Code 99
Book Reference 9
Project Code 9>
##$TILT= no
##$TM1= 0
##$TM2= 0
##$TOPLEV= 0
##$USERP1= <user>
##$USERP2= <user>
##$USERP3= <user>
##$USERP4= <user>
##$USERP5= <user>
##$WDW= 1
##$XDIM= 32768
##$YMAX_p= 282764201
##$YMIN_p= -126152
$$ End of Bruker specific parameters
$$ ---------------------------------
##NTUPLES= NMR SPECTRUM
##VAR_NAME=  FREQUENCY,     SPECTRUM/REAL,   SPECTRUM/IMAG
##SYMBOL=    X,             R,               I
##VAR_TYPE=  INDEPENDENT,   DEPENDENT,       DEPENDENT
##VAR_FORM=  AFFN,          ASDF,            ASDF
##VAR_DIM=   32768,         32768,           32768
##UNITS=     HZ,            ARBITRARY UNITS, ARBITRARY UNITS
##FACTOR=    0.157963299565203, 1,           1
##FIRST=     4132.6476996994, 0,             0
##LAST=      -1043.33573715361, 0,           0
##MIN=       -1043.33573715361, -126152,     0
##MAX=       4132.6476996994, 282764201,     0
$$ Real data points
##PAGE= N=1
##DATA TABLE= (X++(R..R)), XYDATA
$$ [...]
$$ plain form
17209 -51658 -67019 -72466 -67862 -65087 -72762 -93279 -79154 -49690 -63470 -68399 -47277 -37660 -54175
17196 -54175 -71615 -80644 -97928 -88414 -51733 -61943 -64672 -66786 -53135 -49663 -64841 -64553 -61879
17183 -61879 -59216 -77126 -63964 -59453 -53899 -23779 -27812 -42904 -42955 -39500 -47750 -67005 -59201 -48442
17169 -48442 -20272 21382 21376 -13815 -23311 -22382 -30380 -41601 -46686 -51348 -31075 -27819 -21063 -14523
17155 -14523 -16497 -5358 2649 7530 -18417 -54421 -70388 -70080 -45077 -27765 -33324 -41200 -49974
17142 -49974 -26718 -33742 -42423 -45424 -45315 -11508 19672 -18971 -25010 -42626 -38787 -56833 -47566
17129 -47566 -20468 -41428 -54242 -46567 -18944 -17935 -41128 -77636 -96933 -54071 -50102 -54956
17117 -54956 -32209 -20808 -16898 -22668 -37403 -46232 -57298 -66967 -59979 -59871 -52161 -16685 1730
$$ packed form
17209e1658j5361n447M604K775p675k0517J4125K9464j3780m929K1122R617j6515
17196e4175j7440r029j7284R514L6681j0210k729k114J3651L472j5178K88K674
17183f1879K663j7910J3162M511N554L0120m033j5092n1L455q250j9255P804J0759
17169d8442K8170M1654ol5191r496R29p998j1221n085m662K0273L256O756O540
17155a4523j974J1139Q007M881k5947l6004j5967L08K5003J7312n559p876q774
17142d9974K3256p024q681l001J09L3807L1180l8643o039j7616L839j8046R267
17129d7566K7098k0960j2814P675K7623J009k3193l6508j9297M2862L969m854
17117e4956K2747J1401L910n770j4735q829j1066r669O988J08P710L5476J8415
$$ plain form
17104 1730 -9802 -39357 -48810 -42282 -41104 -18189 -9538 -21188 -9245 -5623 -4489 -40323 -77729
17091 -77729 -37271 -35439 -61434 -67709 -52544 -39201 -37911 -48926 -7609 17709 28222 24900
17079 24900 14961 9921 -11497 -37379 -38067 -19470 -14288 -30664 -30572 -18439 -4339 -11557 1422
17066 1422 34713 45546 12630 -44494 -43637 -14811 -23611 -29538 -20899 -16782 -27442 -47686 -46226
17053 -46226 -28274 -14549 -8487 -310 -710 -13543 -24951 -2464 -25513 -37157 -32216 -24417 -8685
17040 -8685 -26551 -51204 -66643 -62556 -45380 -50930 -55467 -63521 -61844 -67088 -40182 -52959 -61534
17027 -61534 -46955 -56107 -74626 -51112 -33596 -42326 -45561 -22610 -11783 -20901 -2851 29932
17015 29932 20013 -7366 -29049 -8008 -20029 -45164 -33009 -56582 -59895 -51997 -14457 3309
$$ packed form
17104A730j1532k9555r453O528J178K2915Q651j1650J1943L622J134l5834l7406
17091g7729M0458J832k5995o275J5165J3343J290j1015M1317K5318J0513l322
17079B4900r939n040k1418k5882o88J8597N182j6376R2J2133J4100p218J2979
17066A422L3291J0833l2916n7124Q57K8826q800n927Q639M117j0660k0244J460
17053d6226J7952J3725O062Q177m00j2833j1408K2487k3049j1644M941P799J5732
17040h685j7866k4653j5439M087J7176n550m537q054J677n244K6906j2777q575
17027f1534J4579r152j8519K3514J7516q730l235K2951J0827r118J8050L2783
17015B9932r919k7379k1683K1041j2021k5135J2155k3573l313P898L7540J7766
$$ plain form
17003 3309 -14185 -13815 -22007 -41106 -52677 -27961 -39006 -50086 -47541 -28587 -24255 -33881 -26358
16990 -26358 -22120 -32928 -36815 -59461 -65306 -38191 -38096 -34968 -47433 -25240 -25506 -35697 -35359 -47953
16976 -47953 -44050 -40127 -11914 -10212 -320 7703 -36239 -70263 -61757 -41032 -13539 -23819 -39242
16963 -39242 -54415 -58543 -63328 -56042 -65412 -62428 -33597 -13224 -26592 -21337 -43394 -48187 -55764
16950 -55764 -39592 -6869 -23842 -64373 -78248 -76604 -91324 -70533 -84530 -98145 -74264 -52054
16938 -52054 -39182 -55521 -26584 -31720 -42752 -23391 -2538 -36001 -87720 -78393 -31829 -30576
16926 -30576 -49506 -56972 -37046 -36040 -59857 -89871 -98982 -98286 -64238 -32317 -22060 -7763 -18988
16913 -18988 -24760 -19292 -38273 -59051 -57128 -42603 -25214 -16002 -27787 -46485 -48304 -36184 -40509
$$ packed form
17003C309j7494L70q192j9099j1571K4716j1045j1080K545J8954M332r626P523
16990b6358M238j0808l887k2646n845K7115R5L128j2465K2193k66j0191L38j2594
16976d7953L903L923K8213J702R892Q023m3942l4024Q506K0725K7493j0280j5423
16963c9242j5173m128m785P286r370K984K8831K0373j3368N255k2057m793p577
16950e5764J6172L2723j6973m0531j3875J644j4720K0791j3997j3615K3881K2210
16938e2054J2872j6339K8937n136j1032J9361K0853l3463n1719R327M6564J253
16926c0576j8930p466J9926J006k3817l0014r111O96L4048L1921J0257J4297j1225
16913a8988n772N468j8981k0778J923J4525J7389R212j1785j8698j819J2120m325
$$ plain form
16900 -40509 -42897 -57093 -88847 -77075 -55102 -12234 2588 -14596 -30580 -43998 -33993 -35655
16888 -35655 -26620 -27317 -58199 -85856 -74206 -37179 -14865 -29635 -36727 -43273 -2256 1490 -12841
16875 -12841 -3804 -19846 1415 -7484 -14156 -12521 -3842 4811 5049 -10839 7472 20712 5207
16862 5207 -4741 -27201 -45847 -48530 -55321 -43228 -61935 -64258 -65867 -44236 -15819 -4908 12577
16849 12577 28705 -2685 -25220 -3661 -13717 -12752 -23403 -41114 -58437 -49923 -45056 -48023 -45734
16836 -45734 -41393 -59445 -29829 -18051 -5546 -13095 -7622 -12307 -17708 -36305 -54040 -59850 -65037
16823 -65037 -63085 -48942 -33833 -19199 -40328 -53620 -56283 -36501 -19279 -11163 -7956 -29156
16811 -29156 -64440 -59186 -39580 -48411 -63449 -64755 -53799 -30335 -20878 -46407 -60209 -69240 -59482
$$ packed form
16900d0509k388j4196l1754J1772K1973M2868J4822j7184j5984j3418J0005j662
16888c5655R035o97l0882k7657J1650L7027K2314j4770p092o546M1017L746j4331
16875a2841R037j6042K1261q899o672J635Q679Q653K38j5888J8311J3240j5505
16862E207r948k2460j8646k683o791J2093j8707k323j609K1631K8417J0911J7485
16849A2577J6128l1390k2535K1559j0056R65j0651j7711j7323Q514M867k967K289
16836d5734M341j8052K9616J1778J2505p549N473m685n401j8597j7735n810n187
16823f5037J952J4143J5109J4634k1129j3292k663J9782J7222Q116L207k1200
16811b9156l5284N254J9606q831j5038j306J0956K3464R457k5529j3802r031R758
$$ plain form
16798 -59482 -46412 -40840 -29877 10897 19610 -6807 -25477 -42775 -47722 -55614 -52363 -21098 -25847
16785 -25847 -33208 -34058 -46690 -50144 -15974 -16730 -19518 678 24120 -11335 -39042 -50617 -31970
16772 -31970 -34061 -40649 -43569 -38651 -16571 -12985 -2942 -4422 -23070 -38477 -51379 -63469 -67551
16759 -67551 -46221 -25221 -12152 -13031 -30173 -48660 -36861 -17504 3558 -19394 -28489 -35592
16747 -35592 -28175 -17423 -14205 -23178 -12774 -27200 -55452 -34809 -33843 -40327 -38324 -25397 -15034
16734 -15034 -13636 -24781 -42708 -38933 -45683 -47188 -12891 5087 20676 15835 7214 -5425 -13143
16721 -13143 -23849 -15201 -29269 -15191 3769 -15013 -48169 -57247 -33415 -13785 -35512 -48706
16709 -48706 -73013 -72831 -65133 -50829 -32296 -20943 -42757 -65550 -73551 -77775 -70883 -68561 -79752
$$ packed form
16798e9482J3070N572J0963M0774Q713k6417j8670j7298m947p892L251L1265m749
16785b5847p361q50j2632l454L4170p56k788K0196K3442l5455k7707j1575J8647
16772c1970k091o588k920M918K2080L586J0043j480j8648j5407j2902j2090m082
16759f7551K1330K1000J3069q79j7142j8487J1799J9357K1062k2952r095p103
16747c5592P417J0752L218q973J0404j4426k8252K0643R66o484K003J2927J0363
16734a5034J398j1145j7927L775o750j505L4297J7978J5589m841q621j2639p718
16721a3143j0706Q648j4068J4078J8960j8782l3156r078K3832J9630k1727j3194
16709d8706k4307J82P698J4304J8533J1353k1814k2793q001m224O892K322j1191
$$ plain form
16696 -79752 -69554 -59532 -71568 -72076 -50560 -46254 -58564 -68447 -60869 -61631 -51048 -29338 -5032
16683 -5032 2755 -19012 -12877 -26739 2417 14815 5718 -34455 -33663 -67785 -77540 -56003 -24317
16670 -24317 -23228 -1988 1425 -31801 -56566 -51109 -25231 -30394 -55026 -54709 -49508 -78683 -70746
16657 -70746 -49211 -66342 -62736 -58150 -43259 -42830 -54067 -74004 -53176 -45907 -29913 -20110 -43993
16644 -43993 -62441 -47660 -36110 -25281 -18946 -43018 -87091 -54672 -43817 -47411 -48564 -59831
16632 -59831 -39334 -26677 -33432 -49410 -52266 -36560 -37660 -33072 -25119 -30413 -28906 1055 -11835
16619 -11835 -48296 -38256 -40905 -67061 -61584 -54857 -69619 -63944 -48551 -69832 -92376 -90685 -82519
16606 -82519 -72241 -46636 -50139 -30657 -37485 -38828 -35563 -34723 -28999 -30297 -33764 -58526 -75743
$$ packed form
16696g9752J0198J0022j2036n08K1516M306j2310r883P578p62J0583K1710K4306
16683e032P787k1767O135j3862K9156J2398r097m0173P92l4122r755K1537L1686
16670b4317J089K1240L413l3226k4765N457K5878n163k4632L17N201k9175P937
16657g0746K1535j7131L606M586J4891M29j1237j9937K0828P269J5994R803k3883
16644d3993j8448J4781J1550J0829O335k4072m4073L2419J0855l594j153j1267
16632e9831K0497J2657o755j5978k856J5706j100M588P953n294J507K9961j2890
16619a1835l6461J0040k649k6156N477O727j4762N675J5393k1281k2544J691Q166
16606h2519J0278K5605l503J9482o828j343L265Q40N724j298l467k4762j7217
$$ plain form
16593 -75743 -49997 -12664 -8188 -12838 -25553 -44127 -20538 -5784 3574 -14521 4486 4377 -13518
16580 -13518 -12139 -3635 -21864 -17163 -10056 11126 9145 -32790 -39818 -17967 -20839 -13213 -4186
16567 -4186 7190 2894 6711 16890 16348 10124 -14209 -29455 -43535 -39434 -57586 -71470 -66961
16554 -66961 -33307 -32547 -49181 -62634 -79254 -74012 -26502 -8346 6824 -12898 -15083 -33027
16542 -33027 -23466 -25748 -37687 -36166 -10349 22974 15648 -17465 -37420 -50855 -33282 -43681
16530 -43681 -40373 -41009 -45471 -61076 -47460 -47367 -44150 -15027 -7441 -31447 -60445 -63487 -48626 -39465
16516 -39465 -39213 -47645 -44460 -59623 -82330 -57011 -24254 -11448 7393 5798 3090 -6092 -31226
16503 -31226 -35173 -20658 -6779 -6745 -13851 -17716 -19486 -27016 -45864 -44751 -6265 4929 16771
$$ packed form
16593g5743K5746L7333M476m650j2715j8574K3589J4754R358j8095J9007j09j7895
16580a3518J379Q504j8229M701P107K1182j981m1935p028K1851k872P626R027
16567d186J1376m296L817J0179n42o224k4333j5246j4080M101j8152j3884M509
16554f6961L3654P60j6634j3453j6620N242M7510J8156J5170j9722k185j7944
16542c3027R561k282j1939J521K5817L3323p326l3113j9955j3435J7573j0399
16530d3681L308o36m462j5605J3616R3L217K9123P586k4006k8998l042J4861R161
16516c9465K52q432L185j5163k2707K5319L2757J2806J8841j595k708r182k5134
16503c1226l947J4515J3879L4p106l865j770p530j8848J113L8486J1194J1842
$$ plain form
16490 16771 7985 -27151 -27458 -28425 -23986 -17477 -41759 -40028 -12994 -917 21067 6056 -9297
16477 -9297 -44590 -33133 -6243 -11952 -23805 -24580 503 -6986 -28066 -53530 -57900 -65808 -60894
16464 -60894 -57441 -52233 -60447 -59254 -45726 -34485 -12854 -9994 -21664 -31780 -15481 -1103 -21340
16451 -21340 -36356 -34526 -18594 -14792 -31787 -32783 -41773 -52631 -37353 -44081 -24607 -48523 -42395
16438 -42395 -32266 -35733 -43041 -51221 -48006 -23844 -44431 -18242 -16762 1417 -5296 10944 17242
16425 17242 1863 -14080 -12829 -14898 -27010 -21039 -12536 -17388 -30080 -34119 -67000 -46012 -28375
16412 -28375 -18903 1014 3769 4984 -12790 -29125 -23003 -26724 -35245 -43265 -32025 -6669 -1270
16399 -1270 -27508 -28241 -39336 -51017 -59277 -44710 -28108 -1736 -2459 -27187 -38476 -42523 -56004
$$ packed form
16490A6771q786l5136l07r67M439O509k4282J731K7034J2077K1984j5011j5353
16477i297l5293J1457K6890n709j1853p75K5083p489k1080k5464m370p908M914
16464f0894L453N208q214J193J3528J1241K1631K860j1670j0116J6299J4378k0237
16451b1340j5016J830J5932L802j6995r96q990j0858J5278o728J9474k3916O128
16438d2395J0129l467p308q180L215K4162k0587K6189J480J8179o713J6240O298
16425A7242j5379j5943J251k069j2112N971Q503m852j2692m039l2881K0988J7637
16412b8375R472J9917K755J215j7774j6335O122l721q521q020J1240K5356N399
16399a270k6238p33j1095j1681q260J4567J6602K6372p23k4728j1289m047j3481
$$ plain form
16386 -56004 -48201 -32400 -18975 -17641 -27212 -7751 -16398 -34494 -24876 2194 -14945 -39389 -23235
16373 -23235 -14759 -25058 -33297 3199 -13160 -17642 -19564 -20903 -20548 -12506 -9825 -16415 -18742 -25777
16359 -25777 -31453 -50316 -47558 -30058 -16204 -2999 3073 -19819 -14153 11526 26039 -6627
16347 -6627 -29053 -36361 -37778 -14292 8522 -305 -16908 -1727 5444 -7373 -20627 -55036 -63475
16334 -63475 -54492 -64202 -79506 -57617 -53419 -21217 24557 2765 4770 831 -2939 -19091 -51246
16321 -51246 -68327 -43084 -33319 -15099 -31056 -39508 -39113 -47608 -22880 -15041 -8942 -21575 -18063
16308 -18063 -24147 -8308 -22545 -25120 -42690 -43801 -44923 -40732 -46342 -38747 -41042 -33605 -29132 -35921
16294 -35921 -32708 -21515 -22190 -32279 -33725 -45394 -58410 -46777 -43548 -26324 -25267 -41787 -58687
$$ packed form
16386e6004P803J5801J3425J334r571J9461q647j8096R618K7070j7139k4444J6154
16373b3235Q476j0299q239L6496j6359m482j922j339L55Q042K681o590k327p035
16359b5777n676j8863K758J7500J3854J3205O072k2892N666K5679J4513l2666
16347f627k2426p308j417K3486K2814q827j6603J5181P171j2817j3254l4409q439
16334f3475Q983r710j5304K1889M198L2202M5774k1792K005l939l770j6152l2155
16321e1246j7081K5243R765J8220j5957q452L95q495K4728P839O099j2633L512
16308a8063o084J5839j4237k575j7570j111j122M191n610P595k295P437M473o789
16294c5921L213J1193o75j0089j446j1669j3016J1633L229J7224J057j6520j6900
$$ plain form
16281 -58687 -66407 -70993 -51196 -20426 -19948 -40656 -43601 -35558 -50887 -21459 4502 -28236 -28997
16268 -28997 -24134 -32779 -44430 -30796 8905 5984 288 -19666 -19714 -16352 -13140 -32447 -46372
16255 -46372 -40782 -63921 -58971 -13984 3908 -13126 -6809 -21548 -24077 -9644 -22458 -29154 -17535
16242 -17535 -36167 -41546 -43423 -36705 2593 26005 6055 -17046 -9986 -12541 -7194 -12940 -21895
16229 -21895 -19573 -3735 -23342 -3408 -14558 -26935 -53688 -69106 -51022 -6217 12751 732
16217 732 13531 10325 8102 -7971 -18498 -19380 -25865 -23038 -34984 -42717 -16627 -6878 -18416 -46600
16203 -46600 -53755 -31891 -15250 -17979 -42795 -31715 -23397 -12987 -30311 -25180 -22723 -20262 -12143
16190 -12143 -45135 -36430 -23960 -15229 -3942 -21044 -56676 -54548 -38318 -9148 3382 -14727
$$ packed form
16281e8687p720m586J9797L0770M78k0708k945Q043j5329K9428K5961l2738p61
16268b8997M863q645j1651J3634L9701k921n696j9954m8L362L212j9307j3925
16255d6372N590k3139M950M4987J7892j7034O317j4739k529J4433j2814o696J1619
16242a7535j8632n379j877O718L9298K3412j9950k3101P060k555N347n746q955
16229b1895K322J5838j9607J9934j1150j2377k6753j5418J8084M4805J8968j2019
16217G32J2799l206k223j6073j0527q82o485K827j1946p733K6090R749j1538k8184
16203d6600p155K1864J6641k729k4816J1080Q318J0410j7324N131K457K461Q119
16190a2143l2992Q705J2470Q731J1287j7102l5632K128J6230K9170J2530j8109
$$ plain form
16178 -14727 8387 33719 24568 9268 -6818 -18781 4764 -6160 -31666 -37014 -44310 -79148
16166 -79148 -58273 -43077 -26660 -17388 -15690 -25696 5482 22903 2063 -31807 -20445 -51279
16154 -51279 -38573 -33344 -24443 -43385 -68207 -67264 -21213 -22211 -30011 -5119 -18915 -16427 -100
16141 -100 -5735 -24220 -39152 -29758 -23383 -13091 -17607 19322 20651 7937 -3502 -9313 6028
16128 6028 -14683 -31314 -24350 -41016 -60112 -25340 3935 -9593 -31695 -31728 -41317 -61259 -69827
16115 -69827 -64398 -42226 -26649 -29380 -35295 -39928 -11256 9561 -9274 -27632 -12871 -11224 1780
16102 1780 10178 16734 -3816 -15937 -25078 -33236 -42733 -58323 -47932 -49621 -57447 -79682 -68947
16089 -68947 -19006 -5197 -942 26955 24582 -6551 -15979 -10583 -17191 -9845 25942 16724 2997
$$ packed form
16178a4727K3114K5332r151j5300j6086j1963K3545j0924k5506n348p296l4838
16166g9148K0875J5196J6417R272J698j0006L1178J7421k0840l3870J1362l0834
16154e1279J2706N229Q901j8942k4822R43M6051r98p800K4892j3796K488J6327
16141a00n635j8485j4932R394O375J0292m516L6929J329j2714j1439n811J5341
16128F028k0711j6631O964j6666j9096L4772K9275j3528k2102l3r589j9942q568
16115f9827N429K2172J5577k731n915m633K8672K0817j8835j8358J4761J647J3004
16102A780Q398O556k0550j2121r141q158r497j5590J0391j689p826k2235J0735
16089f8947M9941J3809M255K7897k373l1133r428N396o608P346L5787r218j3727
$$ plain form
16076 2997 -17680 -10017 -12641 -24394 -54731 -34527 11202 42882 40508 16837 -15319 -37885
16064 -37885 -38656 -44550 -18557 -1496 -16183 -22518 -10976 -15337 -8131 5415 -52 -10425 -2363
16051 -2363 5674 2389 -17385 -18201 -22321 -9238 -8259 -4707 10444 2628 -4888 301 1458 -12950
16037 -12950 -29676 -27608 -23634 -26510 -30274 -26700 -12718 -2906 -12902 -23156 -55286 -64680 -58388
16024 -58388 -56813 -45350 -33271 -16230 -17080 -14303 4444 12220 -8531 -28394 -26271 -33598 -13760
16011 -13760 -27194 -45820 -26097 -23045 -31139 -34574 -35798 -36820 -40582 -22089 7056 728 -7165
15998 -7165 -22704 -15237 14585 -3970 -10799 -14197 -23519 -22922 -24664 -53334 -72196 -66275 -53666
15985 -53666 -31642 -22545 -22180 -57391 -38780 -15126 -35636 -29200 -39832 -32268 -14493 6363 2358
$$ packed form
16076B997k0677P663k624j1753l0337K0204M5729L1680k374k3671l2156k2566
16064c7885p71n894K5993J7061j4687o335J1542m361P206J3546n467j0373Q062
16051b363Q037l285j9774q16m120J3083R79L552J5151p816p516N189J157j4408
16037a2950j6726K068L974k876l764L574J3982R812r996j0254l2130r394O292
16024e8388J575J1463J2079J7041q50K777J8747P776k0751j9863K123p327J9838
16011a3760j3434j8626J9723L052q094l435j224j022l762J8493K9145o328p893
15998g165j5539P467K9822j8555o829l398r322N97j742k8670j8862N921J2609
15985e3666K2024R097L65l5211J8611K3654k0510O436j0632P564J7775K0856m005
$$ plain form
15972 2358 -19309 -21161 -9753 -26878 -7334 -5325 9332 407 -14466 -32202 -31757 -20174 -3184
15959 -3184 -22157 -28531 -42562 -41389 -19529 -18323 -23306 -19088 -43201 -44755 -48926 -48081 -23143 -44100
15945 -44100 -42097 -22642 -18015 -17020 -15599 -19973 -18069 -47443 -53888 -45379 -38691 -48495 -87566 -104205
15931 -104205 -63747 -37910 -21563 96 6400 -16325 -37914 -27523 -17205 -7275 -31043 -55010
15919 -55010 -24706 8191 20970 -7807 -23817 -17297 -44637 -48920 -55522 -28810 -2617 1099
15907 1099 -48967 -46843 -27510 -57463 -59875 -22206 -25168 -45277 -50603 -34995 -38669 -77249 -69672
15894 -69672 -59277 -29627 4355 -11150 -35478 -32166 -8175 -13406 2451 9007 15818 17119 6114
15881 6114 -25151 -35444 -34961 -14288 -21460 -23936 -20261 -18923 -11285 -31390 -21953 26352 24345 -5401
$$ packed form
15972B358k1667j852J1408j7125J9544K009J4657q925j4873j7736M45J1583J6990
15959c184j8973o374j4031J173K1860J206m983M218k4113j554m171Q45K4938k0957
15945d4100K003J9455M627R95J421m374J904k9374o445Q509O688r804l9071j6639
15931a04205M0458K5837J6347K1659O304k2725k1589J0391J0318R930k3768k3967
15919e5010L0304L2897J2779k8777j6010O520k7340m283o602K6712K6193L716
15907A099n0066K124J9333k9953k412L7669k962k0109n326J5608l674l8580P577
15894f9672J0395K9650L3982j5505k4328L312K3991n231J5857O556O811J301j1005
15881F114l1265j0293M83K0673p172k476L675J338P638k0105R437M8305k007k9746
$$ plain form
15867 -5401 -34009 -22989 -7083 -4512 -4781 -18181 -31586 -30666 -13976 -22213 -53190 -69008 -49041
15854 -49041 -35613 -46267 -29861 1586 22345 32548 30640 11977 -5595 -1624 14508 -3653
15842 -3653 -29738 -13498 -23617 -30913 -31404 -18870 -3290 -8375 -2340 -1168 -17788 -19534 3441
15829 3441 -4650 -2405 4292 -14676 -35367 -22622 -7957 -22818 -14526 -5562 -5929 -9418 -35633
15816 -35633 -62502 -40595 -28360 -8700 15439 5688 9263 23607 7084 -13895 -28970 -19115
15804 -19115 10615 -1999 -28190 -32203 -27024 -39927 -25167 -8026 -19046 -29777 -24592 -1944
15792 -1944 26191 33718 -2862 -16402 -26049 -26594 -15799 -1414 -3125 5474 -11518 -48725 -62894
15779 -62894 -35464 -17763 -28816 -39941 -34658 -28426 -22561 12611 14332 2948 10323 22728 35809
$$ packed form
15867e401k8608J1020J5906K571k69j3400j3405R20J6690q237l0977j5818J9967
15854d9041J3428j0654J6406L1447K0759J0203j908j8663j7572L971J6132j8161
15842c653k6085J6240j0119p296m91J2534J5580n085O035J172j6620j746K2975
15829C441q091K245O697j8968k0691J2745J4665j4861Q292Q964l67l489k6215
15816c5633k6869K1907J2235J9660K4139r751L575J4344j6523k0979j5075R855
15804a9115K9730j2614k6191m013N179j2903J4760J7141j1020j0731N185K2648
15792a944K8135P527l6580j3540r647n45J0795J4385j711Q599j6992l7207j4169
15779f2894K7430J7701j1053j1125N283O232N865L5172J721j1384P375J2405J3081
$$ plain form
15766 35809 12539 8751 -11931 -28594 -30361 -15499 678 734 2456 6511 2142 11210 6610 -7396
15752 -7396 -15218 5742 19665 26549 -16559 -33680 -41375 -9397 6134 3742 11912 21046 9570
15739 9570 8760 27362 28215 8800 -16933 -26795 -29392 -61330 -80193 -53902 -19426 -21853 -29171
15726 -29171 -37897 -80296 -71506 -46835 -7268 -119 -16104 -7752 27048 31143 47921 19681 4697
15713 4697 5471 -3300 -4879 -1195 8284 -21823 -19388 10881 9161 -15143 5736 41623 31867 4537
15699 4537 -5514 6556 18263 -8973 -41282 -30391 -20973 -17095 2880 -4016 -19853 -14580 -21022
15686 -21022 -26586 -20755 -24372 -31523 -28830 -5885 -10465 -28718 -37931 -5901 26315 13741 -27621
15673 -27621 -42258 -37913 -28694 -33617 -29604 -21802 -20960 -22404 -1457 -181 646 6763 2936 6245
$$ packed form
15766C5809k3270l788k0682j6663j767J4862J6177N6J722M055m369R068m600j4006
15752g396p822K0960J3923O884m3108j7121p695L1978J5531k392Q170R134j1476
15739I570q10J8602Q53j9415k5733r862k597l1938j8863K6291L4476k427p318
15726b9171q726m2399Q790K4671L9567P149j5985Q352L4800M095J6778k8240j4984
15713D697P74q771j579L684R479l0107K435L0269j720k4304K0879L5887r756k7330
15699D537j0051J2070J1707k7236l2309J0891R418L878J9975o896j5837N273o442
15686b1022n564N831l617p151K693K2945m580j8253r213L2030L2216j2574m1362
15673b7621j4637M345R219m923M013P802Q42j444K0947J276Q27O117l827L309
$$ plain form
15659 6245 675 -12291 -32506 -37481 -35273 -51959 -33878 -6059 -5204 -42995 -23545 -5438 -23530
15646 -23530 -11871 16642 14712 -2595 18391 26008 11727 4707 -5966 -3663 -9971 -13141 -942
15633 -942 -2302 -11300 -27301 -22798 -20492 -24381 -31016 5482 14676 -9809 -2270 9636 -579 4136
15619 4136 -19076 -22964 1231 -24956 -19407 5373 16230 19990 22898 21326 -12702 -386 13082
15606 13082 -8683 -5607 15176 39221 47648 37337 -276 -16757 -19389 -33437 -35433 -31974 -23587
15593 -23587 -11998 -6682 8938 -9675 -20804 -28345 -27364 -6894 -15032 -33025 -9451 -6301 -18044
15580 -18044 -11709 -23166 -17002 -26142 -22368 11133 16494 9497 15244 14699 -5067 259 3786 -17422
15566 -17422 -49335 -74459 -51487 -35178 -8101 3568 -5076 2708 -22413 -36925 -16593 -6738
$$ packed form
15659F245n570j2966k0215m975K208j6686J8081K7819Q55l7791J9450J8107j8092
15646b3530J1659K8513j930j7307K0986P617j4281p020j0673K303o308l170J2199
15633i42j360q998j6001M503K306l889o635L6498R194k4485P539J1906j0215M715
15619D136k3212l888K4195k6187N549K4780J0857L760K908j572l4028J2316J3468
15606A3082k1765L076K0783K4045Q427j0311l7613j6481k632j4048j996L459Q387
15593b3587J1589N316J5620j8613j1129p541R81K0470q138j7993K3574L150j1743
15580a8044O335j1457O164r140L774L3501N361o997N747n45j9766N326L527k1208
15566a7422l1913k5124K2972J6309K7077J1669q644P784k5121j4512K0332R855
$$ plain form
15554 -6738 131 -17607 -25773 -24145 -3272 -17324 -27500 -24366 -2577 54567 53230 29685 13972
15541 13972 3067 -15707 -17318 -20189 19556 48909 86782 89469 62485 66103 55329 39641
15529 39641 31807 1372 5375 14494 7499 7991 13519 38973 33974 26191 9747 3089 -1849 -1004
15515 -1004 -4694 -8773 -3754 1297 -2763 4661 -10004 -16005 -12351 -17843 -26053 -15436 -17373 -1044
15501 -1044 -15948 -25205 -23058 -21187 -30601 -17289 -22901 -48417 -55779 -38929 -13756 -1316 -11198
15488 -11198 -16340 -46529 -62602 -49197 -27009 -11110 -32199 -53658 -50374 -49472 -25236 -20143 -19682
15475 -19682 -10262 -22486 -28787 -28477 -6978 13299 23122 6471 -6761 4532 3829 -13217 -9278
15462 -9278 -490 -12430 12814 35021 31852 46870 33686 11292 17122 15337 623 -10612 20332
$$ packed form
15554f738O869j7738q166J628K0873j4052j0176L134K1789N7144j337k3545j5713
15541A3972j0905j8774j611k871L9745K9353L7873K687k6984L618j0774j5688
15529C9641p834l0435M003R119o995M92N528K5454m999p783j6444o658m938Q45
15515a004l690m079N019N051m060P424j4665o001L654n492q210J0617j937J6329
15501a044j4904r257K147J871r414J3312n612k5516p362J6850K5173J2440r882
15488a1198n142l0189j6073J3405K2188J5899k1089k1459L284R02K4236N093M61
15475a9682R420j2224o301L10K1499K0277R823j6651j3232J1293p03j7046L939
15462i278Q788j1940K5244K2207l169J5018j3184k2394N830j785j4714j1235L0944
$$ plain form
15449 20332 43227 40876 38580 12457 7099 4942 290 -8248 -8475 -15746 -19269 -33344 -43881 -16020
15435 -16020 2503 -4794 679 -833 -5478 5543 15629 18667 -16446 -56273 -51239 -22243 3118
15422 3118 -9583 -10513 8503 17420 26188 40408 42892 43957 17715 1769 20086 31795 33813
15409 33813 39382 10998 -6431 -19337 -9850 20334 17136 -12810 -29975 -497 10718 27753
15397 27753 34386 20855 54691 57719 54418 32402 16689 13563 6601 12026 -2352 -26046 -15249
15384 -15249 -5467 2392 20632 6902 9919 25733 21516 31369 46966 48657 20436 6534 -8052
15371 -8052 -16820 -5094 -4233 16553 4944 12821 14596 3469 6096 19436 30637 39666 47399
15358 47399 26612 6139 -684 -731 827 12343 7416 15545 -2514 -22813 -1285 -2590 -15875
$$ packed form
15449B0332K2895k351k296k6123n358k157m652q538k27p271l523j4075j0537K7861
15435a6020J8523p297N473j512m645J1021J0086L038l5113l9827N034K8996K5361
15422C118j2701r30J9016Q917Q768J4220K484J065k6242j5946J8317J1709K018
15409C3813N569k8384j7429j2906R487L0184l198k9946j7165K9478J1215J7035
15397B7753O633j3531L3836L028l301k2016j5713l126o962N425j4378k3694J0797
15384a5249R782P859J8240j3730L017J5814m217R853J5597J691k8221j3902j4586
15371h052q768J1726Q61K0786j1609P877J775j1127K627J3340J1201R029P733
15358D7399k0787k0473o823m7J558J1516m927Q129j8059k0299K1528j305j3285
$$ plain form
15345 -15875 -7938 -13225 -20943 -30200 -9636 -10207 -5599 -2368 -12414 -41135 -30100 6386 17243
15332 17243 21835 31908 42875 2203 335 9664 22389 30728 34364 21605 -20761 -38189 -24789
15319 -24789 -12464 -18719 -26456 -16181 8568 12587 7923 18000 30497 43481 29462 -1626
15307 -1626 -21116 -24883 1891 25615 59245 54122 37310 22383 9244 7668 21927 36315
15295 36315 42965 45058 15686 -21193 -22647 -3388 4817 28512 14502 21997 2581 -7969 -537
15282 -537 23002 37645 1003 3268 44404 60453 29441 -1189 -7558 -7640 -18059 -25602 -33230
15269 -33230 -41674 -27196 -31140 -56657 -36033 2642 9998 8485 17466 20105 17802 -455 7071
15256 7071 -1869 3488 29277 12506 -22212 -27602 -21735 -30068 -24004 -23768 -4217 -9402 -27676 -1630
$$ packed form
15345a5875P937n287p718r257K0564n71M608L231j0046k8721J1035L6486J0857
15332A7243M592J0073J0967m0672j868R329J2725Q339L636j2759m2366j7428J3400
15319b4789J2325o255p737J0275K4749M019m664J0077J2497J2984j4019l1088
15307a626j9490l767K6774K3724L3630n123j6812j4927j3139j576J4259J4388
15295C6315O650K093k9372l6879j454J9259Q205K3695j4010P495j9416j0550P432
15282e37K3539J4643l6642K265M1136J6049l1012l0630o369q2j0419p543p628
15269c3230q444J4478l944k5517K0624L8675P356j513Q981K639k303j8257P526
15256G071q940N357K5789j6771l4718n390N867q333O064K36J9551n185j8274K6046
$$ plain form
15242 -1630 33443 26869 -2792 -35736 -38932 -24607 24047 12530 -6779 -2797 10836 22138
15230 22138 33953 40385 40625 41903 48267 46094 31588 37731 12597 -3313 -16866 -27231 -2638
15217 -2638 1646 247 21562 24814 15253 6822 -4909 -20587 8545 13836 7888 -17812 -33819
15204 -33819 -5540 24295 8125 -31711 -41309 -51564 -53797 -41856 -14661 -34263 -44491 -26572
15192 -26572 -13103 -3707 -13330 -5611 1835 18047 30553 19815 28855 29754 48471 63842 57063
15179 57063 32365 8921 7137 10331 1819 3643 2148 9415 -1219 -13694 -15578 -21223 -24208
15166 -24208 -29593 -46306 -62964 -44777 -13075 -8712 -2163 6994 5633 8964 -4225 3616 22780
15153 22780 29286 22049 39299 16513 -11376 -17080 13853 -523 -15910 -35533 4781 14124
$$ packed form
15242a630L5073o574k9661l2944l196J4325M8654j1517j9309L982J3633J1302
15230B2138J1815O432K40J278O364k173j4506O143k5134j5910j3553j0365K4593
15217b638M284j399K1315L252r561q431j1731j5678K9132N291n948k5700j6007
15204c3819K8279K9835j6170l9836r598j0255k233J1941K7195j9602j0228J7919
15192b6572J3469R396r623P719P446J6212J2506j0738R040Q99J8717J5371o779
15179E7063k4698k3444j784L194q512J824j495P267j0634j2475j884n645k985
15166b4208n385j6713j6658J8187L1702M363O549R157j361L331j3189P841J9164
15153B2780O506p237J7250k2786k7889n704L0933j4376j5387j9623M0314R343
$$ plain form
15141 14124 14547 23874 43106 35442 6305 -20317 -25321 22458 35307 30096 13974 11944 13741
15128 13741 489 -23701 -39743 -47691 -44945 -29958 -26407 -22664 -31117 -18543 13777 29429 20400
15115 20400 30594 7542 -5477 12287 14686 3719 -4313 14795 39494 28222 -5863 -19837
15103 -19837 722 -2817 1298 32161 45372 43662 51610 13965 5268 12736 14741 23376 11834
15090 11834 9849 20778 27435 36997 46776 45343 31685 14703 -838 -3748 -8485 -8040 -1497 -1127
15076 -1127 -27286 -26081 -8924 -1710 29502 58319 55314 21775 17696 4328 40 15371 21941
15063 21941 12252 6012 -5096 16138 17712 2991 -18081 -27666 -24103 -37806 -22471 4421 19565
15050 19565 19919 380 -573 41483 49662 68926 69984 45757 11479 10192 57354 58592 52980
$$ packed form
15141A4124M23R327J9232p664k9137k6622n004M7779J2849n211j6122k030J797
15128A3741j3252k4190j6042p948K746J4987L551L743q453J2574L2320J5652r029
15115B0400J0194k3052j3019J7764K399j0967q032J9108K4699j1272l4085j3974
15103a9837K0559l539M115L0863J3211j710P948l7645q697P468K005Q635j1542
15090A1834j985J0929O657R562R779j433j3658j6982j5541k910m737M45O543L70
15076a127k6159J205J7157P214L1212K8817l005l3539m079j3368m288J5331O570
15063B1941r689o240j1108K1234J574j4721k1072r585L563j3703J5335K6892J5144
15050A9565L54j9539r53M2056Q179J9264J058k4227l4278j287M7162J238n612
$$ plain form
15037 52980 30983 23437 -7853 -9268 12043 25609 35173 13658 2081 13783 15066 17122 -6279
15024 -6279 -5174 -7026 -15920 -31238 -36576 -9081 13874 36785 25475 15259 29196 36448 10089
15011 10089 -3236 1151 13384 25707 39975 37020 44657 23993 1877 -13741 -6879 15864
14999 15864 54157 52803 39752 46702 25331 26829 23591 17582 39851 12098 -12568 -25626 -1021
14986 -1021 19401 -4108 -17774 -24355 -45469 -15394 -2702 5867 16173 31309 22144 28772 32220
14973 32220 49544 75247 67484 48581 21095 7351 11494 40940 57053 43645 3166 -2260
14961 -2260 9114 45012 51206 39303 32414 69395 83781 33925 13047 28699 20117 19914 17906
14948 17906 35254 50968 25204 26753 19581 -3675 -9000 -14490 7020 7273 1667 9667 5661
$$ packed form
15037E2980k1997p546l1290j415K1311J3566R564k1515j1577J1702J283K056k3401
15024f279J105j852q894j5318n338K7495K2955K2911j1310j0216J3937P252k6359
15011A0089j3325M387J2233J2323J4268k955P637k0664k2116j5618O862K2743
14999A5864L8293j354j3051O950k1371J498l238o009K2269k7753k4666j3058K4605
14986a021K0422k3509j3666o581k1114L0075J2692Q569J0306J5136r165O628L448
14973C2220J7324K5703p763j8903k7486j3744M143K9446J6113j3408m0479n426
14961b260J1374L5898O194j1903o889L6981J4386m9856k0878J5652q582k03k008
14948A7906J7348J5714k5764J549p172k3256n325n490K1510K53n606Q000m006
$$ plain form
14935 5661 30950 21318 -6060 -2154 -1944 -16962 -55465 -47569 -24520 -7253 -29855 -20352 -18654
14922 -18654 -8399 18699 17074 5139 13239 15856 28108 29218 37294 26131 37737 33512 32638
14909 32638 26889 22551 27189 5400 23072 36629 33433 19833 17890 10809 19463 41006 28299
14896 28299 1283 -7922 -13560 -60327 -50462 -11509 -8414 -43567 -57242 -42081 292 8219 4048
14883 4048 -8999 -9179 22877 8874 -969 -11053 -8268 1402 -10345 -28711 -11274 -959 17226
14870 17226 28199 11280 22100 44330 51771 44007 46078 46389 47267 64253 62691 27449 30912
14857 30912 59269 90127 77435 56073 57352 53196 52184 44184 49934 42528 39995 42431 24436
14844 24436 17503 8819 22510 34263 45928 55113 45343 37437 51495 39940 18944 30722 27783
$$ packed form
14935E661K5289r632k7378L906K10j5018l8503P896K3049J7267k2602R503J698
14922a8654J0255K7098j625j1935Q100K617J2252J110Q076j1163J1606m225q74
14909C2638n749m338M638k1789J7672J3557l196j3600j943p081Q654K1543j2707
14896B8299k7016r205n638m6767R865L8953L095l5153j3675J5161M2373P927m171
14883D048j3047j80L2056j4003r843j0084K785R670j1747j8366J7437J0315J8185
14870A7226J0973j6919J0820K2230P441p764K071L11Q78J6986j562l5242L463
14857C0912K8357L0858j2692k1362J279m156j012q000N750p406k533K436j7995
14844B4436o933q684J3691J1753J1665R185r770p906J4058j1555k0996J1778k939
$$ plain form
14831 27783 28720 32266 21817 33209 17404 16150 14040 -13159 -31773 -57518 -44494 -30180 -18024
14818 -18024 -246 22174 1161 -32953 -7690 26237 28322 24568 10640 21614 18373 23022
14806 23022 6925 -17280 9061 16664 18113 40392 31320 20466 16862 25886 31476 49009 20769
14793 20769 2797 2279 8213 18864 48132 62476 46407 33379 30050 7260 -6363 22248
14781 22248 34713 20106 27649 13083 -6775 -20915 -27640 -31964 -24660 4450 25310 53030
14769 53030 50759 24728 7083 -11961 -4710 15956 26526 34722 29614 26185 22449 16095 -16858
14756 -16858 -17212 7553 4673 -9782 226 27556 27865 28644 41333 41833 16560 -123 8914 40118
14742 40118 77814 73968 48408 20910 30252 32109 54211 74119 58103 41952 4626 -20406
$$ packed form
14831B7783R37L546j0449J1392j5805j254k110k7199j8614k5745J3024J4314J2156
14818a8024J7778K2420k1013l4114K5263L3927K085l754j3928J0974l241M649
14806B3022j6097k4205K6341P603J449K2279r072j0854l604R024N590J7533k8240
14793B0769j7972n18N934J0651K9268J4344j6069j3028l329k2790j3623K8611
14781B2248J2465j4607P543j4566j9858j4140o725m324P304K9110K0860K7720
14769E3030k271k6031j7645j9044P251K0666J0570Q196n108l429l736o354l2953
14756a6858l54K4765k880j4455J0008K7330L09P79J2689N00k5273j6683R037L1204
14742D0118L7696l846k5560k7498R342J857K2102J9908j6016j6151l7326k5032
$$ plain form
14730 -20406 -8939 1992 6182 24804 57297 38195 -779 -870 29690 28115 26303 7434 -1462
14717 -1462 21892 -11137 2499 30783 39680 40711 31860 10667 1475 -9325 7871 2507 5262
14704 5262 5844 11857 8631 -594 -9000 4354 14442 42600 50047 45253 38284 35580 40020 28423
14690 28423 722 -1763 -2191 -307 10346 18514 16583 52005 68408 54853 38449 47413 46481
14677 46481 71110 81167 70693 39151 28553 17344 -989 -333 17476 25655 11946 560
14665 560 -26538 4814 35790 61161 55016 55294 63414 59862 64436 54646 45446 20658 34324 59047
14651 59047 56900 34852 21208 45104 45431 22643 8934 10274 12906 1223 6454 18936 6228
14638 6228 11268 -11948 -3462 21683 38693 56583 57086 56982 39876 1747 -38237 -37176 13170
$$ packed form
14730b0406J1467J0931M190J8622L2493j9102l8974r1L0560j575j812j8869q896
14717a462K3354l3029J3636K8284Q897J031q851k1193r192j0800J7196n364K755
14704E262N82O013l226r225q406J3354J0088K8158P447m794o969k704M440j1597
14690B8423k7701k485m28J884J0653Q168j931L5422J6403j3555j6404Q964r32
14677D6481K4629J0057j0474l1542j0598j1209j8333O56J7809Q179j3709j1386
14665E60k7098L1352L0976K5371o145K78Q120l552M574r790r200k4788J3666K4723
14651E9047k147k2048j3644K3896L27k2788j3709J340K632j1683N231J2482j2708
14638F228N040k3216Q486K5145J7010J7890N03j04j7106l8129l9984J061N0346
$$ plain form
14625 13170 25940 -191 -3926 3648 -17665 4781 4227 -4830 -6376 3470 4111 10118 32915 21559
14611 21559 10675 23166 34624 17717 1238 9884 28760 47288 65347 57745 57782 73682 68372
14598 68372 34838 40616 27708 26160 31203 24157 34006 21820 24773 14544 6561 -1986 15272
14585 15272 23185 35640 48555 59028 75479 89290 91786 51077 54729 24829 19005 18935 15069
14572 15069 25247 28049 -8248 -18432 -6319 -7656 4512 31942 40264 45019 56301 71350
14560 71350 76221 44412 38800 57001 48049 55189 48185 29264 21746 40950 42804 51080 51003 41352
14546 41352 43603 53722 55480 47220 29006 24726 29889 25658 41785 70528 77376 60679 40184
14533 40184 54250 61482 63553 32407 23759 -836 -15737 -1821 30777 57549 53107 70697
$$ packed form
14625A3170J2770k6131l735P574k1313K2446n54r057j546R846O41O007K2797j1356
14611B1559j0884J2491J1458j6907j6479Q646J8876J8528J8059p602L7J5900n310
14598F8372l3534N778j2908j548N043p046R849j2186K953j0229p983q547J7258
14585A5272P913J2455J2915J0473J6451J3811K496m0709L652k9900n824p0l866
14572A5069J0178K802l6297j0184J2113j337J2168K7430Q322M755J1282J5049
14560G1350M871l1809n612J8201q952P140p004j8921p518J9204J854Q276p7r651
14546D1352K251J0119J758q260j8214m280N163m231J6127K8743O848j6697k0495
14533D0184J4066P232K071l1146q648k4595j4901J3916L2598K6772m442J7590
$$ plain form
14521 70697 60576 91642 108574 76247 50337 18620 16753 28581 20227 18167 32109 28565
14509 28565 17335 12826 24161 39142 29304 7563 16052 25816 13870 24535 8623 -10830
14497 -10830 -8692 -18396 -6998 8732 19202 2102 6638 38379 63262 59459 56266 60064 50769
14484 50769 49992 39807 23858 38585 60331 71631 54177 11727 6211 22686 30904 37070 36834
14471 36834 48410 38132 23383 14671 26301 19084 19338 34959 57086 51944 41444 31190 14892
14458 14892 37716 51462 26558 12513 36301 39805 39129 48936 53784 48893 63123 67905 48342
14445 48342 37158 32063 31466 35074 43030 25857 19490 41929 57406 46094 37982 27805 21243
14432 21243 5679 -10399 -2383 12644 29603 19044 4648 2823 10974 44533 66169 36231
$$ packed form
14521G0697j0121L1066J6932l2327k5910l1717j867J1828q354k060J3942l544
14509B8565j1230m509J1335J4981r838k1741Q489R764j1946J0665j5912j9453
14497a0830K138r704J1398J5730J0470j7100M536L1741K4883l803l193L798r295
14484E0769p77j0185j5949J4727K1746J1300j7454m2450n516J6475Q218O166k36
14471C6834J1576j0278j4749q712J1630p217K54J5621K2127n142j0500j0254j6298
14458A4892K2824J3746k4904j4045K3788L504o76R807M848m891J4230M782j9563
14445D8342j1184n095n97L608P956j7173o367K2439J5477j1312q112j0177o562
14432B1243j5564j6078Q016J5027J6959j0559j4396j825Q151L3559K1636k9938
$$ plain form
14420 36231 7174 -9910 -34314 -23448 -10430 -21015 -10632 21934 37475 48500 41005 27109
14408 27109 42639 51140 32367 19017 19359 35205 28384 10474 4138 3604 16 4117 15045
14395 15045 17699 -7843 -19268 -15644 -10903 -5870 19834 13051 5434 26654 51835 65287 40034
14382 40034 43947 19964 36145 34058 36537 60815 63697 23534 19725 32895 79747 92110 77610
14369 77610 77030 58443 61012 81761 61602 28716 -13896 24695 47263 53252 53832 30991 33760
14356 33760 12745 22945 34849 19670 51260 52986 8406 -190 21951 28888 48226 49754
14344 49754 35962 33445 -2797 3487 14842 39429 73991 61575 33493 34677 54248 43779
14332 43779 42486 63191 81144 76978 45019 66687 61946 59105 66741 61906 61632 29688 39888
$$ packed form
14420C6231k9057j7084k4404J0866J3018j0585J0383L2566J5541J1025p495j3896
14408B7109J5530Q501j8773j3350L42J5846o821j7910o336n34l588M101J0928
14395A5045K654k5542j1425L624M741N033K5704o783p617K1220K5181J3452k5253
14382D0034L913k3983J6181k087K479K4278K882m0163l809J3170M6852J2363j4500
14369G7610n80j8587K569K0749k0159l2886m2612L8591K2568N989N80k2841K769
14356C3760k1015J0200J1904j5179L1590J726m4580q596K2141O937J9338J528
14344D9754j3792k517l6242O284J1355K4587L4562j2416k8082J184J9571j0469
14332D3779j293K0705J7953m166l1959K1668m741k841P636m835k74l1944J0200
$$ plain form
14319 39888 74324 53850 54342 72091 86081 79777 78525 52548 42252 37311 42463 40245 30917
14306 30917 34009 39146 30773 18355 41505 62929 49227 30600 49697 53280 32578 37498 31905
14293 31905 42828 34993 56207 97217 98838 80985 60060 74204 80453 56801 25839 22109
14281 22109 34137 41790 34759 29516 41128 83267 86201 74909 40845 23595 49727 65715
14269 65715 64070 76548 74236 37048 28752 28077 41150 80123 80474 69144 60812 77603 60234
14256 60234 54208 77017 85705 62568 35831 37516 17569 0 10887 48876 62635 58828
14244 58828 66508 70941 52472 56308 65216 52161 52433 61085 68817 78708 80027 66037 67201 72986
14230 72986 62064 69438 66111 55652 71067 77407 91109 91449 87623 93589 86655 101792 40253
$$ packed form
14319C9888L4436k0474M92J7749J3990o304j252k5977j0296m941N152k218r328
14306C0917L092N137q373j2418K3150K1424j3702j8627J9097L583k0702M920n593
14293C1905J0923p835K1214M1010J621j7853k0925J4144O249k3652l0962l730
14281B2109J2028P653p031n243J1612M2139K934j1292l4064j7250K6132J5988
14269F5715j645J2478k312l7188q296o75J3073L8973L51j1330q332J6791j7369
14256F0234o026K2809Q688k3137k6737J685j9947j7569J0887L7989J3759l807
14244E8828P680M433j8469L836Q908j3055K72Q652P732R891J319j3990J164N785
14230G2986j0922P374l327j0459J5415O340J3702L40l826N966o934J5137o1539
$$ plain form
14217 40253 4981 8654 16752 55878 100376 102445 102875 89316 58688 49935 57402 52106 20204
14204 20204 37724 53827 58253 72542 51017 44385 53920 52041 79035 85784 70917 93547 117913
14191 117913 114617 93846 99872 113908 113765 94826 63366 58775 62969 43816 38125 42607 64255
14178 64255 54291 30519 20587 50250 65767 66194 52657 61818 80605 77716 89554 60973 61792
14165 61792 58760 38313 30840 37351 16053 37629 55521 60603 52880 76043 81810 92315 78728
14152 78728 73221 74489 71099 73871 90763 92089 96023 104241 72220 42694 61589 51710 57121
14139 57121 61565 57547 59868 54984 42108 51487 81063 79470 69083 60015 67178 62591 50794
14126 50794 34670 40698 70061 96476 121733 124632 89939 59164 30490 36105 64213 72689
$$ packed form
14217D0253l5272L673Q098L9126M4498K069M30j3559l0628q753P467n296l1902
14204B0204J7520J6103M426J4289k1525o632R535j879K6994O749j4867K2630K4366
14191A17913l296k0771O026J4036j43j8939l1460m591M194j9153n691M482K1648
14178F4255r964k3772r932K9663J5517M27j3537R161J8787k889J1838k8581Q19
14165F1792l032k0447p473O511k1298K1576J7892N082p723K3163N767J0505j3587
14152G8728n507J268l390K772J6892J326L934Q218l2021k9526J8895r879N411
14139E7121M444m018K321m884j2876R379K9576j593j0387r068P163m587j1797
14126E0794j6124O028K9363K6415K5257K899l4693l0775k8674N615K8108Q476
$$ plain form
14114 72689 67197 53755 83839 81347 81394 88485 81851 71494 63474 64467 95318 104902 97366 103140
14100 103140 111640 94193 54627 55098 83104 107167 98146 91978 91390 88727 94970 98642 93113 94885
14086 94885 90864 75288 73837 62560 73945 94308 92049 62630 89273 102492 83387 52930
14074 52930 78112 60751 56719 70835 62848 52348 38421 63212 80865 77976 46328 41937
14062 41937 57875 99574 87592 65552 74962 70800 51230 44725 41502 61189 64223 65776 60418
14049 60418 56686 68758 57126 59067 82018 95860 81985 79278 78935 52468 46748 74800 97215
14036 97215 114749 100942 91252 88702 49111 46538 51003 64968 103621 109516 78831 48323 47816
14023 47816 61675 28601 33646 46932 55961 60925 102752 113477 87425 75691 35782 49650
$$ packed form
14114G2689n492j3442L0084k492M7P091o634j0357q020R93L0851R584p536N774
14100A03140Q500j7447l9566M71K8006K4063r021o168n88k663O243L672n529J772
14086I4885m021j5576j451j1277J1385K0363k259k9419K6643J3219j9105l0457
14074E2930K5182j7361m032J4116p987j0500j3927K4791J7653k889l1648m391
14062D1937J5938M1699j1982k2040R410m162j9570o505l223J9687L034J553n358
14049F0418l732J2072j1632J941K2951J3842j3875k707l43k6467n720K8052K2415
14036I7215J7534j3807r690k550l9591k573M465J3965L8653N895l0685l0508n07
14023D7816J3859l3074N045J3286R029M964M1827J0725k6052j1734l9909J3868
$$ plain form
14011 49650 45865 20081 24461 24104 35086 21905 41564 47818 51452 48029 73716 106440 107086
13998 107086 82043 88096 105078 114625 99964 65878 78952 86504 105427 121500 105558 73281
13986 73281 61579 63331 65608 81064 83703 75744 78446 72931 66035 81277 101426 82297 62028
13973 62028 53891 56087 55815 70799 99362 108090 78606 63980 57156 54863 51127 68704 107091
13960 107091 107247 100094 107164 145029 145274 114470 97532 92184 77044 61901 62778 59340 64345 84077
13946 84077 78778 88300 83209 67764 81126 109343 87423 65072 79772 65980 65178 84605 97374
13933 97374 100913 87716 88448 91475 120408 123573 103589 74866 62074 68275 82100 84754 89742
13920 89742 112492 99794 77035 67398 83223 83116 63985 64426 57231 79538 120102 138340 107686
$$ packed form
14011D9650l785k5784M380l57J0982j3181J9659O254L634l423K5687L2724O46
13998A07086k5043O053J6982R547j4661l4086J3074P552J8923J6073j5942l2277
13986G3281j1702J752K277J5456K639p959K702n515o896J5242K0149j9129k0269
13973F2028q137K196k72J4984K8563Q728k9484j4626o824k293l736J7577L8387
13960A07091J56p153P070L7865K45l0804j6938n348j5140j5143Q77l438N005J9732
13946H4077n299R522n091j5445J3362K8217k1920k2351J4700j3792q02J9427J2769
13933I7374L539j3197P32L027K8933L165j9984k8723j2792O201J3825K654M988
13920H9742K2750j2698k2759r637J5825j07j9131M41p195K2307M0564J8238l0654
$$ plain form
13907 107686 108907 118013 128489 121117 121019 120241 87151 94613 122073 123082 130916 127068 123531 113808
13893 113808 106395 106429 99497 73800 57153 53910 78367 87973 116183 134959 130429 120581 122444
13880 122444 111359 100990 106140 111462 101412 78433 93631 101839 94275 78999 80441 105531
13868 105531 129353 105358 94684 88907 64637 45436 68380 109011 105423 108022 148135 148996
13856 148996 124904 106023 97866 135292 152562 137932 108490 78175 39904 72568 90018 98231
13844 98231 116699 125784 120242 118525 106699 86927 79408 74873 98532 128274 131694 134012 127122
13831 127122 134027 139509 140527 127491 136495 127155 103669 103376 101865 99847 77070 69372 78543 92500
13817 92500 82741 105224 130985 120714 104891 97246 102753 95137 87209 94296 108984 112137 105311
$$ packed form
13907A07686J221R106J0476p372r8p78l3090P462K7460J009P834l848l537r723
13893A13808p413L4o932k5697j6647l243K4457R606K8210J8776m530r848J863
13880A22444j1085j0369N150N322j0050k2979J5198Q208p564j5276J442K5090
13868A05531K3822k3995j0674n777k4270j9201K2944M0631l588K599M0113Q61
13856A48996k4092j8881q157L7426J7270j4630k9442l0315l8271L2664J7450Q213
13844I8231J8468R085n542j717j1826j9772p519m535K3659K9742L420K318o890
13831A27122O905N482J018j3036R004r340k3486k93j511k018k2777p698R171J3957
13817I2500r759K2483K5761j0271j5823p645N507p616p928P087J4688L153o826
$$ plain form
13804 105311 107503 127056 129931 119175 113817 132593 162470 168601 148577 121151 116541 111994 127816
13791 127816 158214 176154 174747 149647 115775 104163 113610 118934 89792 110633 109700 79743
13779 79743 70800 82403 95653 103722 100260 101473 92871 116714 130417 132718 124575 115713 90240
13766 90240 75362 61512 99049 124093 123903 148071 138240 115729 82085 69361 75438 95493
13754 95493 90906 99709 83513 65280 84819 117140 146842 128714 102614 104911 117414 107718
13742 107718 97546 93818 110497 142772 160943 160139 124227 94362 83942 87434 106768 102334
13730 102334 85692 116642 142984 112728 89717 71597 94747 99088 72566 55868 72981 74080
13718 74080 88717 131658 139120 105038 91175 99944 110407 146348 161255 138626 130761 133028
$$ packed form
13804A05311K192J9553K875j0756n358J8776K9877O131k0024k7426m610m547J5822
13791A27816L0398J7940j407k5100l3872j1612R447N324k9142K0841r33k9957
13779G9743q943J1603J3250Q069l462J213q602K3843J3703K301q143q862k5473
13766I0240j4878j3850L7537K5044j90K4168r831k2511l3644j2724O077K0055
13754I5493m587Q803j6196j8233J9539L2321K9702j8128k6100K297J2503r696
13742A07718j0172l728J6679L2275J8171q04l5912k9865j0420L492J9334m434
13730A02334j6642L0950K6342l0256k3011j8120K3150M341k6522j6698J7113J099
13718G4080J4637M2941P462l4082j3863Q769J0463L5941J4907k2629p865K267
$$ plain form
13706 133028 124791 135391 112351 122387 133158 132782 120704 103521 114128 122840 142861 129986
13694 129986 110389 146567 158919 131865 87401 76426 104941 126294 140813 143658 131767 121821
13682 121821 108694 100100 102784 130821 140886 124844 105822 122719 99537 62953 59743 77513
13670 77513 89544 88906 102576 118935 124224 113455 115942 142564 161124 178010 154246 148201 151375
13657 151375 144567 152274 163641 187994 168380 159058 167309 164704 142963 142922 138281 102440 88276
13644 88276 111766 130588 122453 133977 177881 212852 211531 207606 192354 178312 146535 136459
13632 136459 162513 168566 161688 159605 175367 174997 127646 106413 115513 133475 136658 138809 130432
13619 130432 141766 140354 139000 137109 133514 143107 170067 169056 147764 134886 156167 176151 175311
$$ packed form
13706A33028q237J0600k3040J0036J0771l76j2078j7183J0607Q712K0021j2875
13694A29986j9597L6178J2352k7054m4464j0975K8515K1353J4519K845j1891r946
13682A21821j3127q594K684K8037J0065j6042j9022J6897k3182l6584l210J7770
13670G7513J2031o38J3670J6359N289j0769K487K6622J8560J6886k3764o045L174
13657A51375o808P707J1367K4353j9614r322Q251k605k1741m1m641l5841j4164
13644H8276K3490J8822q135J1524M3904L4971j321l925j5252j4042l1777j0076
13632A36459K6054O053o878k083J5762l70m7351k1233R100J7962L183K151q377
13619A30432J1334j412j354j891l595R593K6960j011k1292j2878K1281J9984q40
$$ plain form
13606 175311 169575 173786 174588 166785 177587 147542 114007 114172 115691 136474 143222 107307 98833
13593 98833 118086 126498 148448 172464 188576 175209 149228 128642 133752 153498 174097 162575
13581 162575 166394 160484 168349 167424 156274 160284 149112 146521 143894 150284 171788 183925 167076
13568 167076 158382 154271 128588 159376 164465 162820 159239 140710 153302 150166 140936 117439 146580
13555 146580 145913 135929 125171 111753 152831 172600 184452 186403 189505 188597 158919 145965 138464
13542 138464 150599 158376 150312 130085 147609 163101 139112 133477 173260 192341 181858 152443
13530 152443 151308 167815 136580 144359 148232 159405 165471 172837 185515 174154 148413 144844 140649
13517 140649 100833 110760 166660 178352 177090 192220 194657 181957 182854 195129 168926 147512
$$ packed form
13606A75311n736M211Q02p803J0802l0045l3535J65J519K0783O748l5915q474
13593I8833J9253Q412K1950K4016J6112j3367k5981k0586N110J9746K0599j1522
13581A62575L819n910P865r25j1150M010j1172k591k627O390K1504J2137j6849
13568A67076q694m111k5683L0788N089j645l581j8529J2592l136r230k3497K9141
13555A46580o67r984j0758j3418M1078J9769J1852J951L102r08k9678j2954p501
13542A38464J2135P777q064k0227J7524J5492k3989n635L9783J9081j0483k9415
13530A52443j135J6507l1235P779L873J1173O066P366J2678j1361k5741l569m195
13517A40649l9816R927N5900J1692j262J5130K437j2700Q97J2275k6203k1414
$$ plain form
13505 147512 154084 176284 176936 169704 147235 129614 146163 147276 130385 136838 150182 148550 143368
13492 143368 174380 191165 183906 172598 157431 169997 159267 167624 171037 167142 145548 138498
13480 138498 170568 161731 170181 163727 159146 169740 185891 193060 178659 182566 188295 176380 172620
13467 172620 166692 174119 177381 179850 188085 179156 147811 146424 172832 189890 186413 175877 162176
13454 162176 159899 172163 192876 196610 148532 149700 172166 180683 137563 133406 141748 135707 159829
13441 159829 163089 147728 151483 175547 176520 157796 152843 162721 146946 155128 162735 179663 204041
13428 204041 201139 194652 199341 211006 216338 179629 175070 153063 150615 162218 173085 187703 174451
13415 174451 163530 161479 158965 161027 175713 183523 199590 217153 218319 212476 218132 213030 211269
$$ packed form
13505A47512O572K2200O52p232k2469j7621J6549J113j6891O453J3344j632n182
13492A43368L1012J6785p259j1308j5167J2566j0730Q357L413l895k1594p050
13480A38498L2070q837Q450o454m581J0594J6151P169j4401L907N729j1915l760
13467A72620n928P427L262K469Q235q929l1345j387K6408J7058l477j0536j3701
13454A62176k277J2264K0713L734m8078J168K2466Q517m3120m157Q342o041K4122
13441A59829L260j5361L755K4064R73j8724m953R878j5775Q182P607J6928K4378
13428B04041k902o487M689J1665N332l6709m559k2007k448J1603J0867J4618j3252
13415A74451j0921k051k514K062J4686P810J6067J7563J166n843N656n102j761
$$ plain form
13402 211269 188839 181255 220369 234536 200777 189164 177402 172016 161153 184355 209510 220929
13390 220929 225293 208625 213705 233629 235130 204773 193060 186330 181082 182262 177748 198649 198134
13377 198134 215533 217615 226630 207140 202659 219340 201707 208270 236961 268117 277809 253237
13365 253237 223944 224645 222476 223822 223108 213749 214288 210365 209968 206845 199095 167749 177664 192165
13351 192165 195561 206435 227200 245699 227941 195193 189236 199447 180547 162269 174837 189242
13339 189242 216246 226813 227000 235195 197918 180946 190037 183966 192967 190620 182084 185504 180918
13326 180918 201954 209115 213121 210755 215754 228389 259878 239952 245047 251647 258741 258756 244485
13313 244485 218074 224807 232779 240062 245776 241150 245592 237321 239161 240368 234322 246012 264534
$$ packed form
13402B11269k2430p584L9114J4167l3759j1613j1762n386j0863K3202K5155J1419
13390B20929M364j6668N080J9924J501l0357j1713o730n248J180m514K0901n15
13377A98134J7399K082R015j9490m481J6681j7633O563K8691L1156R692k4572
13365B53237k9293P01k169J346p14r359N39l923l97l123p750l1346R915J4501
13351A92165L396J0874K0765J8499j7758l2748n957J0211j8900j8278J2568J4405
13339A89242K7004J0567J87Q195l7277j6972R091o071R001k347q536L420m586
13326A80918K1036P161M006k366M999J2635L1489j9926N095O600P094J5j4271
13313B44485k6411O733P972P283N714m626M442q271J840J207o046J1690J8522
$$ plain form
13300 264534 250461 233411 236351 237762 245266 246179 236533 237095 257680 274018 290103 286656 299022
13287 299022 259518 247810 226661 217326 227900 232687 254855 260359 236985 222160 204327 218118
13275 218118 257488 271364 243398 255616 257146 267908 262874 217865 204954 240297 258199 265258
13263 265258 253292 240252 233109 249630 251760 262707 267486 262537 273484 269058 271579 270339 269089
13250 269089 280134 283840 268551 256328 252853 282315 296999 267649 270230 270004 264015 284911 290191
13237 290191 287657 290887 294746 284082 301382 306739 306800 300491 309444 288513 307499 314230 291174
13224 291174 296309 321323 331644 321467 308130 313513 327113 303237 283997 280890 291471 285505
13212 285505 300156 303019 321146 326502 330308 331632 298367 256097 273331 309619 311905 275551
$$ packed form
13300B64534j4073j7050K940J411P504R13r646N62K0585J6338J6085l447J2366
13287B99022l9504j1708k1149r335J0574M787K2168N504k3374j4825j7833J3791
13275B18118L9370J3876k7966J2218J530J0762n034m5009j2911L5343J7902P059
13263B65258j1966j3040p143J6521K130J0947M779m949J0947m426K521j240j250
13250B69089J1045L706j5289j2223l475K9462J4684k9350K581k26n989K0896N280
13237B90191k534L230L859j0664J7300N357O1o309Q953k0931J8986O731k3056
13224B91174N135K5014J0321j0177j3337N383J3600k3876j9240l107J0581n966
13212B85505J4651K863J8127N356L806J324l3265m2270J7234L6288K286l6354
$$ plain form
13200 275551 259347 277068 291800 303229 298542 306876 326007 327164 311697 313683 317025 314242 316461
13187 316461 305609 319399 312226 306084 311829 288259 276442 319194 338786 359544 370471 354418
13175 354418 354856 355147 368252 370744 359411 362301 354361 349288 307680 299922 332246 350469 322780
13162 322780 308455 310905 318850 331825 329782 337556 344539 354144 355502 365445 380972 392272 381194
13149 381194 348111 368683 358080 350431 370330 394705 406636 402056 415684 406732 430388 473016
13137 473016 478619 470788 474306 503760 544378 564043 591580 644870 724662 788145 823318 881110
13125 881110 985240 1090858 1218848 1322134 1405353 1501968 1510896 1459758 1386875 1302882 1213958
13114 1213958 1141623 1066239 1024912 1042560 1068285 1076543 1058529 1071509 1122565 1174317 1236956
$$ packed form
13200B75551j6204J7721J4732J1429m687Q334J9131J157j5467J986L342k783K219
13187C16461j0852J3790p173o142N745k3570j1817M2752J9592K0758J0927j6053
13175C54418M38K91J3105K492j1333K890p940n073m1608p758L2324J8223k7689
13162C22780j4325K450P945J2975k043P774O983R605J358R943J5527J1300j1078
13149C81194l3083K0572j0603p649J9899K4375J1931m580J3628q952K3656M2628
13137D73016N603p831L518K9454M0618J9665K7537N3290P9792O3483L5173N7792
13125H81110J04130J05618J27990J03286Q3219R6615Q928n1138p2883q3993q8924
13114A213958p2335p5384m1327J7648K5725Q258j8014J2980N1056N1752O2639
$$ plain form
13103 1236956 1310782 1363735 1371285 1386398 1383243 1415837 1440217 1467380 1519424 1575673 1604482 1667579
13091 1667579 1701049 1703621 1681621 1651877 1597996 1571214 1522683 1459801 1413714 1406300 1387963 1379560
13079 1379560 1396640 1375767 1347472 1299890 1245787 1179120 1148186 1117940 1099594 1115236 1135007
13068 1135007 1140217 1167369 1235612 1332511 1422733 1490391 1537297 1580263 1571342 1466909 1378584
13057 1378584 1291032 1179122 1071807 964637 879910 826313 788547 758197 713752 649428 604299
13046 604299 569181 548126 518351 507167 512505 536580 540993 531168 547945 525101 511921 496910
13034 496910 479250 441252 442649 456614 440843 432692 426344 425724 466630 468640 486885 460308 445590
13021 445590 426762 420744 434383 465385 482891 464471 457311 452102 447741 461896 444443 420148
$$ packed form
13103A236956P3826N2953P550J5113l155L2594K4380K7163N2044N6249K8809O3097
13091A667579L3470K572k2000k9744n3881k6782m8531o2882m6087p414j8337q403
13079A379560J7080k0873k8295m7582n4103o6667l0934l0246j8346J5642J9771
13068A135007N210K7152O8243R6899R0222O7658M6906M2966q921j04433q8325
13057A378584q7552j11910j07315j07170q4727n3597l7766l0350m4445o4324m5129
13046F04299l5118k1055k9775j1184N338K4075M413r825J6777k2844j3180j5011
13034D96910j7660l7998J397J3965j5771q151o348o20M0906K010J8245k6577j4718
13021D45590j8828o018J3639L1002J7506j8420p160n209m361J4155j7453k4295
$$ plain form
13009 420148 413205 440204 469184 483414 472075 487721 493566 468847 453523 477158 517451 525770
12997 525770 518388 529734 530663 514679 492476 468853 472853 473896 461858 489931 508822 497066
12985 497066 487451 477439 498764 528349 552729 555752 549502 516494 499763 482146 524440 533125
12973 533125 501467 484856 473702 486196 509539 507423 508716 507146 520082 531817 548115 542432
12961 542432 525669 522316 512316 532901 550257 554785 551807 542034 536790 546426 539566 507311 511309
12948 511309 513271 486940 493158 531832 541778 520014 492608 517928 541643 535960 529985 524970 540895
12935 540895 541388 547383 570813 584936 607500 616036 611918 620532 649781 645851 659978 701042 732778
12922 732778 757687 772933 778995 748409 725867 706941 702700 699890 697505 704555 690732 695768 680499
$$ packed form
13009D20148o943K6999K8980J4230j1339J5646N845k4719j5324K3635M0293Q319
12997E25770p382J1346R29j5984k2203k3623M000J043j2038K8073J8891j1756
12985D97066r615j0012K1325K9585K4380L023o250l3008j6731j7617M2294Q685
12973E33125l1658j6611j1154J2494K3343k116J293j570J2936J1735J6298n683
12961E42432j6763l353j0000K0585J7356M528k978r773n244R636o860l2255L998
12948E11309J962k6331O218L8674R946k1764k7406K5320K3715n683n975n015J5925
12935E40895M93N995K3430J4123K2564Q536m118Q614K9249l930J4127M1064L1736
12922G32778K4909J5246O062l0586k2542j8926m241k810k385P050j3823N036j5269
$$ plain form
12909 680499 672077 686077 712721 738181 766552 792824 821381 801088 781387 801543 794679 804964
12897 804964 812000 812080 845543 860668 877702 892680 901052 893335 870976 857539 859629 846935 847633
12884 847633 850364 876091 876082 861465 865899 869821 872971 883174 883196 885176 901492 914663 908969 937393
12870 937393 938576 937961 935523 903891 919365 959464 1005249 1022875 1027596 1033368 1042731 1039288 1025564
12857 1025564 1011678 981834 942059 936042 968469 959709 962995 955535 974603 961387 955962 963271
12845 963271 959120 950870 955248 958716 948699 961255 970702 989971 985964 1002416 1018303 1010744 965779
12832 965779 968925 986749 1006209 1037354 1059896 1082078 1087552 1099362 1114495 1094391 1084431 1101036
12820 1101036 1110590 1115954 1162260 1202041 1206891 1217193 1221232 1231195 1238295 1248348 1261178 1311982
$$ packed form
12909F80499q422J4000K6644K5460K8371K6272K8557k0293j9701K0156o864J0285
12897H04964P036Q0L3463J5125J7034J4978Q372p717k2359j3437K090j2694O98
12884H47633K731K5727rj4617M434L922L150J0203K2J980J6316J3171n694K8424
12870I37393J183o15k438l1632J5474M0099M5785J7626M721N772R363l443j3724
12857A025564j3886k9844l9775o017L2427q760L286p460J9068j3216n425P309
12845I63271m151q250M378L468j0017J2556R447J9269m007J6452J5887p559m4965
12832I65779L146J7824J9460L1145K2542K2182N474J1810J5133k0104r960J6605
12820A101036R554N364M6306L9781M850J0302M039R963P100J0053J2830N0804
$$ plain form
12808 1311982 1301205 1296771 1333754 1338722 1312677 1319052 1363719 1398117 1417118 1462059 1525153 1604246
12796 1604246 1687179 1768582 1858498 1928306 1977291 2023794 2076693 2079189 2049102 2060006 2064534 2036039
12784 2036039 1983934 1944986 1908117 1860234 1855446 1890207 1906138 1913501 1918689 1931593 1951778 1966009
12772 1966009 1988827 2003402 2034162 2080010 2059837 2075357 2108044 2118350 2124883 2161185 2161547 2176534
12760 2176534 2202731 2232935 2257843 2279087 2315580 2346271 2384339 2416173 2444179 2483406 2503715
12749 2503715 2518959 2548527 2575018 2591213 2639486 2662330 2701710 2753035 2804581 2876756 2951205
12738 2951205 3016950 3078720 3135869 3190820 3242923 3328320 3405038 3427533 3440487 3479300 3550354
12727 3550354 3626781 3688612 3735902 3790589 3849793 3947773 4061727 4178502 4292115 4408943
$$ packed form
12808A311982j0777m434L6983M968k6045O375M4667L4398J9001M4941O3094P9093
12796A604246Q2933Q1403Q9916O9808M8985M6503N2899K496l0087J0904M528k8495
12784B036039n2105l8948l6869m7883m788L4761J5931P363N188J2904K0185J4231
12772A966009K2818J4575L0760M5848k0173J5520L2687J0306O533L6302L62J4987
12760B176534K6197L0204K4908K1244L6493L0691L8068L1834K8006L9227K0309
12749B503715J5244K9568K6491J6195M8273K2844L9380N1325N1546P2175P4449
12738B951205O5745O1770N7149N4951N2103Q5397P6718K2495J2954L8813P1054
12727C550354P6427O1831M7290N4687N9204R7980J13954J16775J13613J16828
$$ plain form
12717 4408943 4540515 4661702 4789423 4931698 5077655 5211137 5357637 5542350 5715914
12708 5715914 5911045 6139718 6373941 6638602 6923414 7208430 7550201 7885042 8204230
12699 8204230 8576931 9007331 9475569 9989194 10528579 11167865 11882716 12684115 13577071
12690 13577071 14577396 15741743 17053804 18539782 20244100 22177437 24379060 26904607
12682 26904607 29831410 33312949 37522057 42659898 49013405 56939703 66950075 79617632
12674 79617632 95648901 115605163 139679934 167128397 195721081 221232935 238358064
12667 238358064 243177881 235303921 217907397 195836555 173494713 153690214 137763085
12660 137763085 126021981 118386190 114670440 114793836 118637889 126148465 137104161 150842878
$$ packed form
12717D408943J31572J21187J27721J42275J45957J33482J46500J84713J73564
12708E715914J95131K28673K34223K64661K84812K85016L41771L34841L19188
12699H204230L72701M30400M68238N13625N39385O39286P14851Q01399Q92956
12690A3577071J000325J164347J312061J485978J704318J933337K201623K525547
12682B6904607K926803L481539M209108N137841O353507P926298J0010372J2667557
12674G9617632J6031269J9956262K4074771K7448463K8592684K5511854J7125129
12667B38358064M819817p873960j7396524k2070842k2341842j9804499j5927129
12660A37763085j1741104p635791l715750J23396L844053P510576J0955696J3738717
$$ plain form
12652 150842878 166023367 180725542 192956920 201436741 205996616 207753085 208640433 210771036
12644 210771036 215793743 224392564 236047293 249148399 261141321 269253091 271143825
12637 271143825 266051381 255051174 240558575 225319774 211788193 201512720 195268689
12630 195268689 193044286 193981631 196429769 198325162 197637616 193030738 184228652 172138021
12622 172138021 158610258 145766396 135268432 128167863 125030501 126109301 131603489
12615 131603489 141712852 156595409 176104488 199364966 224105722 246397666 261131466
12608 261131466 263654291 252252131 229215405 199695695 168976349 140677665 116417197
12601 116417197 96456499 80392301 67585778 57465675 49397895 42900593 37656938
$$ packed form
12652A50842878J5180489J4702175J2231378Q479821M559875J756469Q87348K130603
12644B10771036N022707Q598821J1654729J3101106J1992922Q111770J890734
12637B71143825n092444j1000207j4492599j5238801j3531581j0275473o244031
12630A95268689k224403R37345K448138J895393o87546m606878q802086j2090631
12622A72138021j3527763j2843862j0497964p100569l137362J078800N494188
12615A31603489J0109363J4882557J9509079K3260478K4740756K2291944J4733800
12608B61131466K522825j1402160k3036726k9519710l0719346k8298684k4260468
12601A16417197j9960698j6064198j2806523j0120103q067780o497302n243655
$$ plain form
12594 37656938 33355761 29756765 26729360 24131260 21813302 19785280 17978450 16407557
12586 16407557 15054122 13868229 12835603 11923441 11090440 10355827 9699479 9112962 8554385
12577 8554385 8037120 7606339 7200764 6801747 6405722 6067881 5795608 5577332 5341192
12568 5341192 5133275 4958156 4749788 4553089 4354318 4143327 3963811 3801313 3652523
12559 3652523 3540660 3440174 3332960 3251266 3157331 3062164 2989120 2912933 2824419 2722030
12549 2722030 2630869 2556458 2468272 2414108 2338422 2258409 2190743 2100680 2054016 2025643 1981920
12538 1981920 1921577 1880904 1859408 1833271 1782274 1724553 1719469 1671685 1643025 1623137 1564529
12527 1564529 1512292 1498964 1479314 1432493 1393232 1376901 1371659 1355910 1321496 1292395 1284128 1269314
$$ packed form
12594C7656938m301177l598996l027405k598100k317958k028022j806830j570893
12586A6407557j353435j185893j032626r12162q33001p34613o56348n86517n58577
12577H554385n17265m30781m05575l99017l96025l37841k72273k18276k36140
12568E341192k07917j75119k08368j96699j98771k10991j79516j62498j48790
12559C652523j11863j00486j07214q1694r3935r5167p3044p6187q8514j02389
12549B722030r1161p4411q8186n4164p5686q0013o7666r0063m6664k8373m3723
12538A981920o0343m0673k1496k6137n0997n7721n084m7784k8660j9888n8608
12527A564529n2237j3328j9650m6821l9261j6331n242j5749l4414k9101q267j4814
$$ plain form
12515 1269314 1249738 1246041 1227235 1211492 1196629 1153233 1120685 1101760 1113473 1109498 1094221 1086168
12503 1086168 1095759 1097910 1100122 1120320 1140562 1144473 1191005 1258691 1297593 1328021 1405607 1491550
12491 1491550 1583100 1674338 1744124 1771165 1755968 1691592 1580806 1487206 1401231 1285573 1195138
12480 1195138 1115959 1045847 1006404 986199 950403 896515 844568 825358 789003 768505 777385
12469 777385 761225 752102 739919 745243 748477 743752 760182 771908 775808 745478 756011 748011 769789
12456 769789 753653 736538 748012 735152 721941 730230 738005 716281 703621 693949 679172 681940
12444 681940 689809 696047 724928 712598 670433 626635 623179 601090 595010 613608 624368 629906
12432 629906 612567 612017 621692 617362 601174 596944 604756 594582 594781 609748 582637 574311 583608
$$ packed form
12515A269314j9576l697j8806j5743j4863m3396l2548j8925J1713l975j5277q053
12503A086168R591K151K212K0198K0242L911M6532O7686L8902L0428P7586Q5943
12491A491550R1550R1238O9786K7041j5197o4376j10786r3600q5975j15658r0435
12480A195138p9179p0112l9443k0205l5796n3888n1947j9210l6355k0498Q880
12469G77385j6160r123j2183N324L234m725J6430J1726L900l0330J0533q000K1778
12456G69789j6136j7115J1474j2860j3211Q289P775k1724j2660r672j4777K768
12444F81940P869O238K8881j2330m2165m3798l456k2089o080J8598J0760N538
12432F29906j7339n50R675m330j6188m230P812j0174J99J4967k7111q326R297
$$ plain form
12419 583608 604388 632777 674495 695140 676759 627458 597574 579197 575874 590181 609032 588404
12407 588404 609053 626636 626125 610623 589096 568774 578506 609292 626070 613224 621852 634116
12395 634116 618967 601089 589487 573042 580264 605888 638282 617731 560753 566223 559629 551682
12383 551682 569924 598538 613672 618821 635398 650618 638649 626294 609498 588802 602810 619805
12371 619805 599690 599322 598314 625078 642972 642660 642483 638392 650363 643084 660897 694810 676432
12358 676432 653694 633213 590052 600160 643545 647401 661791 663862 651459 665247 666980 657152
12346 657152 630750 650450 686052 694002 684633 676183 634893 635736 657940 683255 656685 639172
12334 639172 645017 661289 668248 675909 642767 609482 624381 642086 622369 635903 620466 632525
$$ packed form
12419E83608K0780K8389M1718K0645j8381m9301k9884j8377l323J4307J8851k0628
12407E88404K0649J7583n11j5502k1527k0322R732L0786J6778j2846Q628J2264
12395F34116j5149j7878j1602j6445P222K5624L2394k0551n6978N470o594p947
12383E51682J8242K8614J5134N149J6577J5220j1969j2355j6796k0696J4008J6995
12371F19805k0115l68j008K6764J7894l12j77m091J1971p279J7813L3913j8378
12358F76432k2738k0481m3161J0108M3385L856J4390K071j2403J3788J733r828
12346F57152k6402J9700L5602P950r369q450m1290Q43K2204K5315k6570j7513
12334F39172N845J6272O959P661l3142l3285J4899J7705j9717J3534j5437J2059
$$ plain form
12322 632525 633653 649533 675678 655292 641857 613243 619002 648560 663309 638913 635943 651963
12310 651963 653275 675847 681285 663491 634417 632853 649444 652235 648633 620757 614585 640980 653424
12297 653424 637791 636505 648582 650793 666068 668638 668518 698863 689184 662618 648769 674162 691398
12284 691398 704665 711874 680583 680538 709309 697251 673065 685098 686292 686819 710441 703877 676869
12271 676869 690754 684500 698156 710693 714704 722726 734406 749474 754924 752778 742340 749535 761770
12258 761770 764746 733955 720533 734744 767261 793272 797571 798918 793599 802337 819169 818156 820192
12245 820192 801228 823370 851585 852724 825602 820865 823617 826020 852390 882398 886312 852235
12233 852235 830627 868707 898894 901227 872989 867699 910158 946939 947109 956601 960552 1003294 1050992
$$ packed form
12322F32525J128J5880K6145k0386j3435k8614N759K9558J4749k4396k970J6020
12310F51963J312K2572N438j7794k9074j564J6591K791l602k7876o172K6395J2444
12297F53424j5633j286J2077K211J5275K570j20L0345r679k6566j3849K5393J7236
12284F91398J3267P209l1291m5K8771j2058k4186J2033J194N27K3622o564k7008
12271F76869J3885o254J3656J2537M011Q022J1680J5068N450k146j0438P195J2235
12258G61770K976l0791j3422J4211L2517K6011M299J347n319Q738J6832j013K036
12245H20192j8964K2142K8215J139k7122m737K752K403K6370L0008L914l4077
12233H52235k1608L8080L0187K333k8238n290M2459L6781J70R492L951M2742M7698
$$ plain form
12220 1050992 1063837 1066907 1096843 1188439 1294329 1368217 1447423 1541251 1635943 1724537 1795797
12209 1795797 1884881 1920905 1900248 1856107 1814295 1769438 1713594 1647044 1591969 1533688 1531502
12198 1531502 1542639 1556096 1582850 1641109 1690032 1704136 1749101 1832797 1900712 1950566 1992992
12187 1992992 2039154 2071994 2082053 2097801 2144271 2205894 2238957 2271994 2264255 2239540 2172433
12176 2172433 2114030 2059112 2008219 1946586 1902769 1907700 1931387 1938499 1965729 2009790 2025593 1959291
12164 1959291 1877286 1821666 1782155 1737417 1716136 1743947 1777349 1815984 1859910 1913148 1950326
12153 1950326 2039305 2156411 2263278 2320254 2307432 2260518 2178277 2066041 1953161 1823462
12143 1823462 1689673 1574279 1502840 1440130 1377240 1348805 1304696 1289913 1276141 1263557 1262045
$$ packed form
12220A050992J2845L070K9936R1596J05890P3888P9206R3828R4692Q8594P1260
12209A795797Q9084L6024k0657m4141m1812m4857n5844o6550n5075n8281k186
12198A531502J1137J3457K6754N8259M8923J4104M4965Q3696O7915M9854M2426
12187A992992M6162L2840J0059J5748M6470O1623L3063L3037p739k4715o7107
12176B172433n8403n4918n0893o1633m3817M931K3687P112K7230M4061J5803o6302
12164A959291q2005n5620l9511m4738k1281K7811L3402L8635M3926N3238L7178
12153A950326Q8979J17106J06867N6976j2822m6914q2241j12236j12880j29699
12143A823462j33789j15394p1439o2710o2890k8435m4109j4783j3772j2584j512
$$ plain form
12132 1262045 1270750 1252457 1252689 1262014 1248899 1206843 1187060 1206260 1235363 1268513 1264659 1249135
12120 1249135 1235507 1207512 1227808 1223174 1199082 1199860 1214816 1224650 1231088 1207129 1177374 1170116
12108 1170116 1201727 1239870 1236236 1211693 1211092 1227920 1240028 1251679 1247781 1229979 1230690 1261293
12096 1261293 1288829 1299487 1278976 1266247 1287111 1308064 1257568 1249338 1288975 1303705 1258882
12085 1258882 1250603 1249956 1248532 1264100 1262449 1261007 1254533 1262188 1283740 1286805 1289046 1305198 1302134
12072 1302134 1304892 1295904 1274574 1272394 1280393 1298227 1316096 1353335 1359659 1356195 1342952 1354764
12060 1354764 1387664 1378553 1358607 1361592 1362976 1386046 1417463 1421043 1431679 1424387 1424917 1428773 1435844
12047 1435844 1416413 1420860 1406066 1401426 1418020 1411688 1390923 1402003 1439396 1469492 1460521 1446355
$$ packed form
12132A262045Q705j8293K32R325j3115m2056j9783J9200K9103L3150l854j5524
12120A249135j3628k7995K0296m634k4092P78J4956R834O438k3959k9755p258
12108A170116L1611L8143l634k4543o01J6828J2108J1651l898j7802P11L0603
12096A261293K7536J0658k0511j2729K0864K0953n0496q230L9637J4730m4823
12085A258882q279o47j424J5568j651j442o474P655K1552L065K241J6152l064
12072A302134K758q988k1330k180P999J7834J7869L7239O324l464j3243J1812
12060A354764L2900r111j9946K985J384K3070L1417L580J0636p292N30L856P071
12047A435844j9431M447j4794m640J6594o332k0765J1080L7393L0096q971j4166
$$ plain form
12035 1446355 1463547 1456674 1463119 1462358 1484746 1484139 1486196 1450200 1429152 1421379 1440315 1470809 1489985
12022 1489985 1501913 1494050 1505367 1530750 1546569 1541333 1529258 1538920 1540740 1559813 1549044 1521489
12010 1521489 1497997 1501225 1523372 1540709 1554448 1540136 1518310 1512833 1538996 1568045 1566113 1568481
11998 1568481 1570024 1578740 1600261 1594052 1596538 1583286 1575363 1584730 1582082 1598677 1589915 1573386 1586902
11985 1586902 1617025 1640532 1667021 1684524 1646101 1618693 1618384 1618115 1638846 1640394 1630231 1638308
11973 1638308 1658267 1648902 1630988 1638168 1653155 1678694 1700618 1723290 1752888 1768510 1776826 1748311
11961 1748311 1746593 1772748 1795528 1809228 1828682 1839638 1817661 1859081 1896082 1941758 2016212
11950 2016212 2085929 2159539 2214918 2294948 2405907 2538893 2696892 2800772 2874761 2906546
$$ packed form
12035A446355J7192o873O445p61K2388o07K057l5996k1048p773J8936L0494J9176
12022A489985J1928p863J1317K5383J5819n236j2075R662J820J9073j0769k7555
12010A521489k3492L228K2147J7337J3739j4312k1826n477K6163K9049j932K368
11998A568481J543Q716K1521o209K486j3252p923R367k648J6595q762j6529J3516
11985A586902L0123K3507K6489J7503l8423k7408l09k69K0731J548j0163Q077
11973A638308J9959r365j7914P180J4987K5539K1924K2672K9598J5622Q316k8515
11961A748311j718K6155K2780J3700J9454J0956k1977M1420L7001M5676P4454
11950B016212O9717P3610N5379Q0030J10959J32986J57999J03880P3989L1785
$$ plain form
11940 2906546 2892350 2860314 2781877 2704154 2610970 2558268 2504409 2429344 2423677 2435062 2432429 2441858
11928 2441858 2439621 2481517 2548214 2613421 2661357 2675793 2683411 2683765 2671984 2663498 2670272 2685140
11916 2685140 2717186 2784783 2856861 2914659 2989044 3054598 3046017 3006539 2973436 2919584 2881894
11905 2881894 2858642 2828428 2823872 2782789 2744880 2734096 2723854 2714031 2726002 2779496 2876919 2967527
11893 2967527 3007631 2982776 2917602 2796156 2679030 2626072 2606254 2610929 2652925 2711273 2758460
11882 2758460 2751008 2698029 2651438 2611025 2520662 2382023 2283049 2226860 2165295 2094127 2019294
11871 2019294 1961316 1939750 1911315 1888625 1827638 1771564 1785432 1791508 1785810 1792239 1763995 1759108
11859 1759108 1791104 1804170 1826471 1892408 1991751 2084434 2197515 2330651 2437870 2525658 2565220
$$ packed form
11940B906546j4196l2036p8437p7723r3184n2702n3859p5065n667J1385k633R429
11928B441858k237M1896O6697O5207M7936J4436P618L54j1781q486O774J4868
11916B685140L2046O7597P2078N7798P4385O5554q581l9478l3103n3852l7690
11905B881894k3252l0214m556m1083l7909j0784j0242r823J1971N3494R7423R0608
11893B967527M0104k4855o5174j21446j17126n2958j9818M675M1996N8348M7187
11882B758460p452n2979m6591m0413r0363j38639r8974n6189o1565p1168p4833
11871B019294n7978k1566k8435k2690o0987n6074J3868O076n698O429k8244m887
11859A759108L1996J3066K2301O5937R9343R2683J13081J33136J07219Q7788L9562
$$ plain form
11848 2565220 2554201 2533226 2470015 2398328 2330351 2248629 2107463 1972659 1858650 1788847 1723010
11837 1723010 1666956 1646782 1596019 1586843 1574064 1564336 1587587 1606177 1608410 1598401 1598704 1622702
11825 1622702 1634645 1597056 1575741 1577370 1576523 1557900 1558745 1590973 1617742 1610199 1596482 1567972
11813 1567972 1555734 1550079 1588605 1642928 1691545 1776033 1890507 2034826 2154576 2215634 2223743
11802 2223743 2150001 1998444 1824460 1715611 1631855 1585337 1573212 1542011 1519605 1512229 1502850
11791 1502850 1482100 1444249 1422020 1417091 1432370 1434388 1437037 1455096 1469344 1466807 1462976 1432666
11779 1432666 1409202 1427227 1428422 1411780 1402506 1397471 1371856 1385825 1386460 1400334 1393442 1401919 1419701
11766 1419701 1424100 1449400 1425241 1450880 1489217 1501285 1531527 1578900 1597434 1578240 1548832
$$ packed form
11848B565220j1019k0975o3211p1687o7977q1722j41166j34804j14009o9803o5837
11837A723010n6054k0174n0763r176j2779r728K3251J8590K233j0009L03K3998
11825A622702J1943l7589k1315J629q47j8623Q45L2228K6769p543j3717k8510
11813A567972j2238n655L8526N4323M8617Q4488J14474J44319J19750O1058Q109
11802B223743p3742j51557j73984j08849q3756m6518j2125l1201k2406p376r379
11791A502850k0750l7851k2229m929J5279K018K649J8059J4248k537l831l0310
11779A432666k3464J8025J195j6642r274n035k5615J3969O35J3874o892Q477J7782
11766A419701M399K5300k4159K5639L8337J2068L0242M7373J8534j9194k9408
$$ plain form
11755 1548832 1521053 1500100 1484820 1466221 1438807 1436698 1440663 1461606 1415354 1370472 1393097 1419254
11743 1419254 1427420 1429788 1451548 1453040 1491826 1512662 1493687 1483763 1474388 1505988 1530259 1540231
11731 1540231 1552462 1548747 1549327 1567496 1577155 1567911 1545548 1518637 1487124 1463435 1468117 1465624 1459610
11718 1459610 1476752 1489239 1506974 1519991 1513746 1489694 1492689 1497244 1493567 1476111 1482872 1465489
11706 1465489 1473042 1492713 1504409 1508556 1525708 1517442 1513426 1535572 1564524 1548684 1526384 1527489
11694 1527489 1509591 1493271 1493330 1508780 1494800 1476686 1478943 1464853 1462352 1497112 1489939 1467309
11682 1467309 1452874 1474410 1493029 1513890 1519292 1509760 1498927 1469165 1469520 1459241 1421174 1407460
11670 1407460 1406068 1428517 1440915 1459951 1483924 1474334 1477716 1500328 1525918 1512533 1491627 1489397
$$ packed form
11755A548832k7779k0953j5280j8599k7414k109L965K0943m6252m4882K2625K6157
11743A419254Q166K368K1760J492L8786K0836j8975r924r375L1600K4271R972
11731A540231J2231l715N80J8169R659r244k2363k6911l1513k3689M682k493o014
11718A459610J7142J2487J7735J3017o245k4052K995M555l677j7456O761j7383
11706A465489P553J9671J1696M147J7152q266m016K2146K8952j5840k2300J105
11694A527489j7898j6320N9J5450j3980j8114K257j4090k501L4760p173k2630
11682A467309j4435K1536J8619K0861N402r532j0833k9762L55j0279l8067j3714
11670A407460j392K2449J2398J9036K3973r590L382K2612K5590j3385k0906k230
$$ plain form
11658 1489397 1497608 1487253 1496767 1513828 1558662 1602626 1630810 1645078 1666339 1688902 1721839 1750803
11646 1750803 1764320 1758068 1744751 1736578 1724926 1761431 1786622 1825106 1890344 1956422 2015858 2101107
11634 2101107 2161381 2201725 2278589 2396438 2508042 2609459 2721772 2783551 2813178 2803968 2713802
11623 2713802 2667732 2613190 2532920 2440354 2401444 2385663 2357120 2340850 2330764 2346690 2362458
11612 2362458 2356358 2359660 2378586 2384198 2397041 2402867 2420258 2433699 2423909 2437902 2443117 2438749 2457353
11599 2457353 2492199 2524569 2527245 2555315 2581599 2633759 2668377 2712104 2750442 2748751 2757306 2779817
11587 2779817 2800906 2814585 2810373 2858257 2915752 2934619 2969402 3017380 3052634 3099756 3193547
11576 3193547 3272158 3359332 3417969 3450476 3481541 3549158 3601042 3625135 3659228 3707229 3757747
$$ packed form
11658A489397Q211j0355R514J7061M4834M3964K8184J4268K1261K2563L2937K8964
11646A750803J3517o252j3317q173j1652L6505K5191L8484O5238O6078N9436Q5249
11634B101107O0274M0344P6864J17849J11604J01417J12313O1779K9627r210r0166
11623B713802m6070n4542q0270r2566l8910j5781k8543j6270j0086J5926J5768
11612B362458o100L302J8926N612J2843N826J7391J3441r790J3993N215m368J8604
11599B457353L4846L2370K676K8070K6284N2160L4618M3727L8338j691Q555K2511
11587B779817K1089J3679m212M7884N7495J8867L4783M7978L5254M7122R3791
11576C193547P8611Q7174N8637L2507L1065O7617N1884K4093L4093M8001N0518
$$ plain form
11565 3757747 3809984 3859028 3939959 4038285 4155542 4232824 4318460 4411881 4534075 4647875 4776320
11554 4776320 4905241 5073510 5219567 5362374 5510221 5670094 5841254 6036777 6257810
11545 6257810 6503403 6739386 6983710 7230109 7525891 7838486 8190865 8608802 9035138
11536 9035138 9460353 9893973 10423133 11051311 11732579 12478635 13308850 14234306 15316071
11527 15316071 16505212 17831146 19387898 21207072 23328154 25815099 28698028 32109206
11519 32109206 36144841 40986783 46848657 54056293 63034845 74313125 88559534 106571368
11511 106571368 128947006 155826605 186247565 217552089 245085463 263226882 267845061
11504 267845061 258639403 239198557 214811181 190080547 167944928 149895088 136468596
$$ packed form
11565C757747N2237M9044Q0931R8326J17257P7282Q5636R3421J22194J13800J28445
11554D776320J28921J68269J46057J42807J47847J59873J71160J95523K21033
11545F257810K45593K35983K44324K46399K95782L12595L52379M17937M26336
11536I035138M25215M33620N29160O28178O81268P46056Q30215R25456J081765
11527A5316071J189141J325934J556752J819174K121082K486945K882929L411178
11519C2109206M035635M841942N861874P207636Q978552J1278280J4246409J8011834
11511A06571368K2375638K6879599L0420960L1304524K7533374J8141419M618179
11504B67845061r205658j9440846k4387376k4730634k2135619j8049840j3426492
$$ plain form
11497 136468596 127716869 123469594 123490986 127712804 135962655 147767533 162079285 176854138
11489 176854138 189379272 197283637 199783785 197995399 194326071 191423813 191455932 195853481
11481 195853481 205208966 219234753 236621396 254920955 270832636 280914023 282764201
11474 282764201 276096464 262904555 246558224 230553456 217533029 208830066 204484629
11467 204484629 203417348 203581942 202346794 197348198 187407493 173268594 157224155 141797295
11459 141797295 128855587 119341774 113483139 111300710 112787079 118101950 127414139 140820369
11451 140820369 158238317 179015539 201417070 222304775 237217289 241675484 233329871
11444 233329871 213546824 186721282 157968878 131116824 108017129 89069200 74012381
$$ packed form
11497A36468596q751727m247275K1392M221818Q249851J1804878J4311752J4774853
11489A76854138J2525134P904365K500148j788386l669328k902258L2119M397549
11481A95853481R355485J4025787J7386643J8299559J5911681J0081387J850178
11474B82764201o667737j3191909j6346331j6004768j3020427q702963m345437
11467B04484629j067281J64594j235148m998596r940705j4138899j6044439j5426860
11459A41797295j2941708r513813n858635k182429J486369N314871R312189J3406230
11451A40820369J7417948K0777222K2401531K0887705J4912514M458195q345613
11444B33329871j9783047k6825542k8752404k6852054k3099695j8947929j5056819
$$ plain form
11437 74012381 62154730 52800029 45388069 39443973 34531286 30439419 27007118 24061998
11429 24061998 21529930 19350502 17500058 15910951 14531228 13326585 12280997 11394873
11421 11394873 10636412 9931066 9277832 8706523 8177668 7730945 7306178 6890460 6495661
11412 6495661 6151375 5842688 5561623 5295570 5056313 4860203 4685065 4503160 4345289
11403 4345289 4164208 3979926 3825315 3679098 3539657 3394800 3259357 3109669 2979226
11394 2979226 2895343 2820110 2769688 2694639 2592441 2506449 2418714 2326197 2265835 2213596 2149101
11383 2149101 2073820 1973452 1911299 1882181 1839425 1776178 1734097 1702293 1660850 1610255 1585583
11372 1585583 1525568 1515624 1515838 1475078 1419200 1357521 1274311 1231682 1230169 1236341 1230646 1204763
$$ packed form
11437G4012381j1857651r354701p411960n944096m912687m091867l432301k945120
11429B4061998k532068k179428j850444j589107j379723j204643j045588q86124
11421A1394873p58461p05346o53234n71309n28855m46723m24767m15718l94799
11412F495661l44286l08687k81065k66053k39257j96110j75138j81905j57871
11403D345289j81081j84282j54611j46217j39441j44857j35443j49688j30443
11394B979226q3883p5233n0422p5049j02198q5992q7735r2517o0362n2239o4495
11383B149101p5281j00368o2153k9118m2756o3247m2081l1804m1443n0595k4672
11372A585583o0015r944K14m0760n5878o1679q3210m2629j513O172n695k5883
$$ plain form
11360 1204763 1167431 1126776 1121707 1131159 1129119 1103704 1103772 1087973 1060164 1052736 1031192 996565 952552
11347 952552 920943 914326 907536 875365 864596 885801 851900 812528 834332 887240 913626 897141
11335 897141 888619 892255 885040 886638 932874 979936 1014003 1082083 1140513 1158310 1157091 1154521 1128818
11322 1128818 1080499 989899 919555 848472 790818 753556 714199 691146 661218 648819 656707
11311 656707 634315 614080 567098 561115 581346 559404 544688 539557 530701 515065 520591 484207
11299 484207 447981 425472 433135 442105 451573 474672 472562 501494 480458 468068 454548 452666
11287 452666 443072 420726 397927 414675 428077 422417 432233 422953 418022 384269 352075 346334 341932
11274 341932 355842 343236 318767 307134 301441 282698 282866 282252 287479 280953 293812 330038 353709
$$ packed form
11360A204763l7332m0655n069R452k040k5415O8j5799k7809p428k1544l4627m4013
11347I52552l1609o617o790l2171j0769K1205l3901l9372K1804N2908K6386j6485
11335H97141q522L636p215J598M6236M7062L4067O8080N8430J7797j219k570k5703
11322A128818m8319r0600p0344p1083n7654l7262l9357k3053k9928j2399P888
11311F56707k2392k0235m6982n983K0231k1942j4716n131q856j5636N526l6384
11299D84207l6226k2509P663Q970R468K3099k110K8932k1036j2390j3520j882
11287D52666r594k2346k2799J6748J3402n660R816r280m931l3753l2194n741m402
11274C41932J3910j2606k4469j1633n693j8743J68o14N227o526J2859L6226K3671
$$ plain form
11261 353709 341356 324972 319154 323730 347298 375355 405009 408957 368050 346568 325449 326130
11249 326130 300751 256008 267568 234398 228441 249588 238186 245654 246719 283836 313908 315107
11237 315107 293240 264335 274297 268744 260502 289183 285413 294411 287048 300531 289428 268827 258131
11224 258131 255752 256951 248040 243257 225377 234386 240157 241617 276963 284631 250893 230678 230124
11211 230124 238702 242925 253480 252918 236068 244479 266337 259096 248754 235312 217951 213422 219018
11198 219018 225525 231467 202395 216631 200285 222754 259572 266755 255375 243729 236093 251294
11186 251294 242228 212268 209972 217090 217779 213464 206915 206650 241009 232136 235776 200652 180892 199829
11172 199829 219998 209229 189763 197753 212526 214674 231057 200931 165571 137930 134901 136042
$$ packed form
11261C53709j2353j6384n818M576K3568K8057K9654L948m0907k1482k1119O81
11249C26130k5379m4743J1560l3170n957K1147j1402P468J065L7117L0072J199
11237C15107k1867k8905R962n553q242K8681l770Q998p363J3483j1103k0601j0696
11224B58131k379J199q911m783j7880R009N771J460L5346P668l3738k0215n54
11211B30124Q578M223J0555n62j6850Q411K1858p241j0342j3442j7361m529N596
11198B19018O507N942k9072J4236j6346K2469L6818P183j1380j1646p636J5201
11186B51294r066k9960k296P118O89m315o549k65L4359q873L640l5124j9760J8937
11172A99829K0169j0769j9466P990J4773K148J6383l0126l5360k7641l029J141
$$ plain form
11160 136042 176327 206481 198682 160472 163052 155245 135863 160426 175609 177721 139758 124363
11148 124363 114430 111163 136506 134724 122473 127303 125071 113453 110097 120052 144461 142066 128903
11135 128903 112132 134103 126665 158237 165797 127961 96988 54159 64058 75811 105454 110292
11123 110292 81358 109607 132814 144524 162275 168258 159031 153192 150631 166390 174571 171479 143109
11110 143109 128631 144439 147848 140465 158701 170758 174181 186376 181914 154389 125259 116118
11098 116118 99220 121943 124978 136666 139858 164770 175683 149547 132325 142096 168316 189055
11086 189055 198125 201932 216009 234820 251944 263995 280116 272179 291574 304159 331732 394585
11074 394585 440989 494454 549182 628980 729861 865337 962299 1048849 1130265 1226968 1315496
$$ packed form
11160A36042M0285L0154p799l8210K580p807j9382K4563J5183K112l7963j5395
11148A24363r933l267K5343j782j2251M830k232j1618l356R955K4409k395j3163
11135A28903j6771K1971p438L1572P560l7836l0973m2829R899J1753K9643M838
11123A10292k8934K8249K3207J1710J7751N983r227n839k561J5759Q181l092k8370
11110A43109j4478J5808L409p383J8236J2057L423J2195m462k7525k9130r141
11098A16118j6898K2723L035J1688L192K4912J0913k6136j7222R771K6220K0739
11086A89055R070L807J4077J8811J7124J2051J6121p937J9395J2585K7573O2853
11074C94585M6404N3465N4728P9798J00881J35476R6962Q6550Q1416R6703Q8528
$$ plain form
11063 1315496 1365034 1373282 1325760 1246383 1132417 1012731 942094 888134 847929 843321 835382
11052 835382 848376 881110 944925 1014543 1089677 1164725 1226699 1252991 1250538 1261152 1273825 1304246
11040 1304246 1336802 1404185 1494445 1577967 1677120 1783293 1820724 1808312 1756999 1676469 1559458
11029 1559458 1470123 1452268 1418373 1410122 1441419 1486478 1544307 1511690 1406833 1288616 1201499
11018 1201499 1123652 1057546 980879 931175 921721 973419 1056612 1139442 1192067 1240149 1296806
11007 1296806 1329285 1327811 1337690 1333893 1294521 1231922 1134738 1043528 955686 849532 761505 658009
10995 658009 563856 507881 457770 412095 362834 326724 250559 204789 198103 170840 159928 158925
10983 158925 125676 124796 141204 161068 154523 145132 141183 124070 97384 91228 90573 116520 151419
$$ packed form
11063A315496M9538Q248m7522p9377j13966j19686p0637n3960m0205m608p939
11052H35382J2994L2734O3815O9618P5134P5048O1974K6292k453J0614J2673L0421
11040A304246L2556O7383R0260Q3522R9153J06173L7431j2412n1313q0530j17011
11029A559458q9335j7855l3895q251L1297M5059N7829l2617j04857j18217q7117
11018A201499p7847o6106p6667m9704r454N1698Q3193Q2830N2625M8082N6657
11007A296806L2479j474R879l797l9372o2599r7184r1210q7842j06154q8027j03496
10995F58009r4153n5975n0111m5675m9261l6110p6165m5770o686k7263j0912j003
10983A58925l3249q80J6408J9864o545r391l949j7113k6686o156o55K5947L4899
$$ plain form
10970 151419 145395 115202 95840 56611 45460 65413 82481 75987 65780 63859 74434 110657
10958 110657 112266 137862 119069 126876 126491 113664 111174 112267 117504 115798 114765 109376 94576
10945 94576 87622 99565 107369 58854 39380 51737 64716 75502 59337 52442 44173 80489
10933 80489 94454 103991 93761 78520 51547 60172 87681 95885 111850 98623 72508 54657
10921 54657 83600 108095 113705 89096 82571 101875 125535 110001 100602 96458 97500 120775 126599
10908 126599 132420 145237 151975 181487 222881 233660 292143 409293 484963 579063 772133
10897 772133 1044905 1458856 1910934 2259046 2447562 2673642 3154361 3646219 3691962 3246856
10887 3246856 2736657 2467454 2296652 1983498 1538089 1081789 717125 494810 365849
$$ packed form
10970A51419o024l0193j9362l9229j1151J9953J7068o494j0207j921J0575L6223
10958A10657J609K5596j8793P807l85j2827k490J093N237j706j033n389j4800
10945I4576o954J1943P804m8515j9474J2357J2979J0786j6165o895q269L6316
10933H0489J3965R537j0230j5241k6973Q625K7509Q204J5965j3227k6115j7851
10921E4657K8943K4495N610k4609o525J9304K3660j5534r399m144J042K3275N824
10908A26599N821J2817O738K9512M1394J0779N8483J17150P5670R4100J93070
10897G72133K72772M13951M52078L48112J88516K26080M80719M91858M5743m45106
10887C246856n10199k69203j70802l13154m45409m56300l64664k22315j28961
$$ plain form
10878 365849 321372 294883 292940 236091 192774 183742 156526 147422 166820 144382 114972 126921
10866 126921 127992 112389 118917 122581 113046 124437 140387 110869 97095 109962 106411 111677 132149
10853 132149 132569 129258 97978 103918 114239 95962 95996 81948 72265 78896 62485 46594 61580
10840 61580 95454 132778 119262 78005 78027 97852 90872 73225 83162 82584 97047 99151 78978
10827 78978 95827 87697 87125 99276 90309 92479 125407 110090 89351 82228 59624 53977 31867
10814 31867 35620 13145 33159 53161 63351 40583 31797 68403 88039 86615 72920 61799
10802 61799 73333 67637 57514 58627 50426 59824 75438 85564 84347 74875 84955 67842 59457
10789 59457 66059 44073 18561 26108 63063 87870 92290 80733 81515 99150 104078 111858 107486
$$ packed form
10878C65849m4477k6489j943n6849m3317r032k7216r104J9398k2438k9410J1949
10866A26921J071j5603O528L664r535J1391J5950k9518j3774J2867l551N266K0472
10853A32149M20l311l1280N940J0321j8277L4j4048r683O631j6411j5891J4986
10840F1580L3874L7324j3516m1257K2J9825o980j7647R937n78J4463K104k0173
10827G8978J6849q130n72J2151q967K170L2928j5317k0739p123k2604n647k2110
10814C1867L753k2475K0014K0002J0190k2768q786L6606J9636j424j3695j1121
10802F1799J1534n696j0123J113q201R398J5614J0126j217r472J0080j7113q385
10789E9457O602k1986k5512P547L6955K4807M420j1557P82J7635M928P780m372
$$ plain form
10776 107486 100035 97525 93069 83339 67493 84783 86235 100188 126690 126778 102185 112278 99280
10763 99280 90328 49365 49570 82935 96535 121966 120584 115086 101286 97230 84821 80885 90245
10750 90245 91527 114194 124429 137107 130467 132790 129060 142151 148144 136820 144332 164136 167599
10737 167599 161611 178355 202938 187966 147669 139739 167682 171014 172778 174386 190134 173203
10725 173203 157854 159371 162728 136461 157340 193098 203060 213305 217232 209105 199599 203594 213210
10712 213210 216927 202069 207243 221200 218306 235438 255437 264230 249363 242787 243551 236125 242345
10699 242345 249801 227479 223483 226630 202813 201519 209359 217720 211267 201592 196810 228848 268867
10686 268867 257438 229618 224400 212806 244442 280873 290620 279183 282247 279266 304347 307160
$$ packed form
10776A07486p451k510m456r730j5846J7290J452J3953K6502Q8k4593J0093j2998
10763I9280q952m0963K05L3365J3600K5431j382n498j3800m056j2409l936R360
10750I0245J282K2667J0235J2678o640K323l730J3091N993j1324P512J9804L463
10737A67599n988J6744K4583j4972m0297p930K7943L332J764J608J5748j6931
10725A73203j5349J517L357k6267K0879L5758R962J0245L927q127r506L995R616
10712B13210L717j4858N174J3957k894J7132J9999Q793j4867o576P64p426O220
10699B42345P456k2322l996L147k3817j294P840Q361o453r675m782L2038M0019
10686B68867j1429k7820n218j1594L1636L6431R747j1437L064k981K5081K813
$$ plain form
10674 307160 318440 332624 317448 291109 309915 331418 361178 356567 345278 349445 371428 378193
10662 378193 393979 403942 436303 452951 457064 476888 504902 525521 564128 601347 623866 644161
10650 644161 655331 657492 687868 755345 793554 787029 814046 839067 870152 945278 1037963 1128099
10638 1128099 1202446 1324889 1500524 1717716 1927034 2108568 2278243 2419980 2559004 2769688
10628 2769688 3076337 3475425 4001382 4693373 5617793 6868826 8572240 10855384 13796079
10619 13796079 17429611 21496602 25178488 27444089 27842101 26866631 25516935 24707189
10611 24707189 24950551 26600982 29980549 35308726 42531555 50767728 57683143 60575465
10603 60575465 58647787 53672709 48345988 44548164 43090256 44257054 48229430 55109182
$$ packed form
10674C07160J1280J4184j5176k6339J8806K1503K9760m611j1289M167K1983O765
10662C78193J5786R963L2361J6648M113J9824K8014K0619L8607L7219K2519K0295
10650F44161J1170K161L0376O7477L8209o525K7017K5021L1085P5126R2685R0136
10638A128099P4347J22443J75635K17192K09318J81534J69675J41737J39024K10684
10628B769688L06649L99088N25957O91991R24420J251033J703414K283144K940695
10619A3796079L633532M066991L681886K265601L98012r75470j349696q09746
10611B4707189K43362J650431L379567N328177P222829Q236173O915415K892322
10603F0575465j927678m975078n326721l797824j457908J166798L972376O879752
$$ plain form
10595 55109182 64529896 74704357 82112747 83069099 77046113 67125294 57217541 49574971
10587 49574971 44807717 42887559 43623966 46789619 51713379 56906266 59800140 58149132
10579 58149132 52054044 43859232 36167151 30311491 26520883 24478332 23868071 24389357
10571 24389357 25603410 26719931 26767415 25042931 21674746 17607807 13774555 10623684
10563 10623684 8255955 6534674 5230254 4270167 3564294 3015772 2602933 2281692 2029706
10554 2029706 1828630 1618482 1392521 1239423 1155256 1061627 944538 832426 762345 701219
10544 701219 657194 638561 587692 543584 512311 488569 436698 419996 389259 374312 367495 337666
10532 337666 290933 245315 234064 248205 253730 242458 234759 198635 175873 178280 173539 168408
$$ packed form
10595E5109182R420714J0174461P408390R56352o022986r920819r907753p642570
10587D9574971m767254j920158P36407L165653M923760N192887K893874j651008
10579E8149132o095088q194812p692081n855660l790608k042551o10261N21286
10571B4389357J214053J116521M7484j724484l368185m066939l833252l150871
10563A0623684k367729j721281j304420r60087p05873n48522m12839l21241k51986
10554B029706k01076k10148k25961j53098q4167r3629j17089j12112p0081o1126
10544G01219m4025j8633n0869m4108l1273k3742n1871j6702l0737j4947o817k9829
10532C37666m6733m5618j1251J4141N525j1272p699l6124k2762K407m741n131
$$ plain form
10520 168408 154294 143098 129218 113074 96239 95483 97379 114504 124050 112909 71393 34889
10508 34889 34836 34314 36055 35813 27645 29071 37269 37369 39842 48942 52026 30462 14138 -1325 162
10493 162 -3305 -26076 -58519 -59102 -34376 -12490 -12211 -17982 -4103 5638 -14086 -6069 -13382 -29925
10479 -29925 -26437 -31540 -17295 -35632 -50850 -26074 -18325 -52305 -80259 -86390 -66081 -45485
10467 -45485 -37826 -43002 -53449 -45574 -22290 -9528 -21547 -28749 -46464 -17528 -19681 -29301 -38795
10454 -38795 -41390 -24186 -10967 7753 -67 -20722 -46032 -63067 -75144 -75526 -72901 -85685 -96002
10441 -96002 -70731 -69499 -88763 -86751 -59875 -45817 -79501 -78496 -69900 -68829 -84203 -75984 -71909
10428 -71909 -60784 -26220 -13085 -36042 -4028 -4808 -32984 -62797 -50054 -43682 -48977 -50442 -29944
$$ packed form
10520A68408j4114j1196j3880j6144j6835p56J896J7125R546j1141m1516l6504
10508C4889n3n22J741k42q168J426Q198J00K473R100L084k1564j6324j5463J487
10493A62l467k2771l2443n83K4726K1886K79n771J3879R741j9724Q017p313j6543
10479b9925L488n103J4245j8337j5218K4776P749l3980k7954o131K0309K0596
10467d5485P659n176j0447P875K3284J2762j2019p202j7715K8936k153r620r494
10454c8795k595J7204J3219J8720p820k0655k5310j7035j2077l82K625j2784j0317
10441i6002K5271J232j9264K012K6876J4058l3684J005Q596J071j5374Q219M075
10428g1909J1125L4564J3135k2957L2014p80k8176k9813J2743O372n295j465K0498
$$ plain form
10415 -29944 -26846 -13678 -30835 -46966 -43198 -36599 1859 9025 -22017 -32468 -26642 -17997 -5735
10402 -5735 7568 5182 -15170 -36038 -9450 -29520 -53648 -50445 -39633 -46557 -45360 -48241 -80955
10389 -80955 -84004 -61200 -55355 -70091 -58658 -45262 -38090 -44978 -58221 -68348 -93280 -70716
10377 -70716 -48829 -64104 -60033 -31152 -24485 -23271 -2304 -5622 -17931 -35691 -55957 -75938
10365 -75938 -77049 -53325 -53306 -57306 -55801 -44497 -45616 -26411 -12135 -5273 -22182 -34082 -18789
10352 -18789 -18918 -21004 -9217 -6296 7359 -439 3698 30525 36074 30499 -1249 -12626 -12037 -22084
10338 -22084 -18949 -6174 -10694 -14881 -42260 -33865 -16232 3462 -6532 -18478 -9315 -33622 -40467
10325 -40467 -56595 -56417 -48944 -40640 -25618 10799 5539 -5075 -14914 -15050 -6151 -10624 -46261 -34123
$$ packed form
10415b9944L098J3168j7157j6131L768O599L8458P166l1042j0451N826Q645J2262
10402e735J3303k386k0352k0868K6588k0070k4128L203J0812o924J197k881l2714
10389h0955l049K2804N845j4736J1433J3396P172o888j3243j0127k4932K2564
10377g0716K1887j5275M071K8881O667J214K0967l318j2309j7760k0266j9981
10365g5938j111K3724J9m000J505J1304j119J9205J4276O862j6909j1900J5293
10352a8789j29k086J1787K921J3655p798M137K6827N549n575l1748j1377N89j0047
10338b2084L135J2775m520m187k7379Q395J7633J9694r994j1946R163k4307o845
10325d0467j6128J78P473Q304J5022L6417n260j0614r839j36Q899m473l5637J2138
$$ plain form
10311 -34123 -33351 -40946 -38205 -33495 -18781 -18243 -30260 -26446 -18057 -14094 -3262 -30199 -64450 -50056
10297 -50056 -52916 -58437 -29149 -4281 -8031 -7881 -26963 -26842 -19164 -29037 -21593 -14937 -976 -14403
10283 -14403 -43309 -61924 -42638 -21494 -14758 -20345 -16092 -4504 -11919 -32691 -34264 -42310 -35390
10270 -35390 -50100 -59179 -35634 -14503 -27224 -29095 -27658 -6395 -12173 6275 -12350 -21998 -33770
10257 -33770 -35414 -18822 -18147 -32105 -36550 -33688 -56763 -53230 -44110 -72237 -45889 -10230 -14249
10244 -14249 -42946 -22873 -15581 -4532 16283 -16949 -75613 -89710 -67391 -28458 -19663 -16330
10232 -16330 -28874 -51437 -80769 -92784 -94802 -90472 -53692 -29360 -25158 -29034 -36463 -26718 -18907
10219 -18907 -44007 -11805 -30991 -42460 -29953 -37411 -28806 -13714 -15397 -31580 -49738 -47820
$$ packed form
10311c4123P72p595K741M710J4714N38j2017L814Q389L963J0832k6937l4251J4394
10297e0056k860n521K9288K4868l750J50j9082J21P678r873P444O656J3961j3427
10283a4403k8906j8615J9286K1144O736n587M253J1588p415k0772j573q046O920
10270c5390j4710r079K3545K1131j2721j871J437K1263n778J8448j8625r648j1772
10257c3770j644J6592O75j3958m445K862k3075L533R120k8127K6348L5659m019
10244a4249k8697K0073P292J1049K0815l3232n8664j4097K2319L8933Q795L333
10232a6330j2544k2563k9332j2015k018M330L6780K4332M202l876p429R745P811
10219a8907k5100L2202j9186j1469J2507p458Q605J5092j683j6183j8158J918
$$ plain form
10207 -47820 -58260 -73659 -49311 -25388 3883 9139 -17129 -34504 -40093 -46805 -50114 -33744
10195 -33744 -15784 -36683 -18964 20221 27585 22865 36718 26360 13136 22700 29872 29796 45586
10182 45586 75689 130189 171152 186346 195195 154367 123515 116634 132122 131246 139372 186774 237797
10169 237797 261588 287065 296107 273513 265244 266456 220585 194697 176544 201883 281479 355715
10157 355715 409036 465343 429217 366857 295600 248605 239960 221207 247880 266589 274249 265310
10145 265310 272300 278145 259439 242835 201660 167680 151686 108680 109582 113245 118593 122791 162893
10132 162893 175164 207056 214906 212818 217403 257958 312917 312288 301065 307280 316728 314305 305008
10119 305008 292922 277548 237406 212678 207946 189852 164020 123620 76798 65369 70321 38988
$$ packed form
10207d7820j0440j5399K4348K3923K9271N256k6268j7375n589o712l309J6370
10195c3744J7960k0899J7719L9185P364m720J3853j0358j3224R564P172p6J5790
10182D5586L0103N4500M0963J5194Q849m0828l0852o881J5488q76Q126M7402N1023
10169B37797K3791K5477R042k2594q269J212m5871k5888j8153K5339P9596P4236
10157C55715N3321N6307l6126o2360p1257m6995q645j8753K6673J8709P660q939
10145B65310O990N845j8706j6604m1175l3980j5994m3006R02L663N348M198M0102
10132A62893J2271L1892P850k088M585M0555N4959o29j1223O215R448k423r297
10119C05008j2086j5374m0142k4728m732j8094k5832m0400m6822j1429M952l1333
$$ plain form
10107 38988 23351 38648 25290 20486 27153 -3635 -28651 -46863 -39028 -5206 102 -938 1369
10094 1369 22737 22038 -4087 -24660 -16623 3126 4515 19278 57004 76474 102277 113921 136189
10081 136189 174169 244335 304841 366986 419744 505734 563289 589758 634903 650515 628734
10070 628734 616928 646762 624527 580637 525533 450740 395733 355438 309449 283066 247693
10059 247693 212279 205708 189105 142440 122692 97479 76442 70284 77240 61099 39968 40646
10047 40646 18978 24841 31940 40267 60470 51796 54648 46080 58847 29534 -1167 -17860 -4655
10034 -4655 6021 31840 60451 97409 115119 107288 150169 208113 269974 323552 388985 425302
10022 425302 428638 470627 511352 522618 511433 488713 461752 437534 397110 352658 314176 263567
$$ packed form
10107C8988j5637J5297j3358m804O667l0788k5016j8212P835L3822N308j040K307
10094A369K1368o99k6125k0573Q037J9749J389J4763L7726J9470K5803J1644K2268
10081A36189L7980P0166O0506O2145N2758Q5990N7555K6469M5145J5612k1781
10070F28734j1806K9834k2235m3890n5104p4793n5007m0295m5989k6383l5373
10059B47693l5414o571j6603m6665j9748k5213k1037o158O956j6141k1131O78
10047D0646k1668N863P099Q327K0203q674K852q568J2767k9313l0701j6693J3205
10034d655J0676K5819K8611L6958J7710p831M2881N7944O1861N3578O5433L6317
10022D25302L336M1989M0725J1266j1185k2720k6961k4218m0424m4452l8482n0609
$$ plain form
10010 263567 206462 161467 139602 119518 84605 56408 60383 46342 37566 21763 8433 27753
9998 27753 -2230 -25179 -19158 -12049 -29445 -45787 -32027 -36880 -23554 -30356 -42803 -26922 -20672
9985 -20672 -32602 -36526 -42232 -38629 -1301 12270 -13865 -22913 -23099 -8589 -8247 -28896 -43495
9972 -43495 -69772 -64309 -56951 -45025 -27605 -32691 -51277 -26472 -637 -559 -31200 -23292 -8276
9959 -8276 -34035 -47786 -25861 -36594 -50332 -54844 -64125 -55038 -71091 -61892 -60496 -50304 -50001
9946 -50001 -64114 -62965 -61596 -37418 -28715 -37034 -36429 -60183 -52878 -19299 1848 -8569 -30875
9933 -30875 -23942 -1156 8315 4555 7922 -6237 -8875 -13756 -5880 -37195 -52070 -43075 -40150 -42200
9919 -42200 -53869 -74573 -57169 -50120 -33241 -22060 -17230 3634 2046 -2799 -28420 -65823 -85805
$$ packed form
10010B63567n7105m4995k1865k0084l4913k8197L975j4041q776j5803j3330J9320
9998B7753k9983k2949O021P109j7396j6342J3760m853J3326o802j2447J5881O250
9985b0672j1930l924n706L603L7328J3571k6135r048j86J4510L42k0649j4599
9972d3495k6277N463P358J1926J7420n086j8586K4805K5835P8l0641P908J5016
9959h276k5759j3751K1925j0733j3738m512r281R087j6053R199J396J0192L03
9946e0001j4113J149J369K4178Q703q319O05k3754P305L3579K1147j0417k2306
9933c0875O933K2786R471l760L367j4159k638m881P876l1315j4875Q995K925k050
9919d2200j1669k0704J7404P049J6879J1181M830K0864j588m845k5621l7403j9982
$$ plain form
9906 -85805 -87689 -26677 17109 8475 1804 -21593 -47670 -29638 -13016 -9765 13369 7834 -2498
9893 -2498 -13113 -18482 -2316 -11989 -28805 -43693 -45863 -27355 6808 19764 -10770 -13944 -39493
9880 -39493 -45413 -49709 -66431 -52646 -46737 -38594 -48710 -73614 -76716 -62409 -58321 -48951 -62763
9867 -62763 -70710 -58682 -72397 -63889 -44694 -23897 -28639 -16847 -19946 -17596 -61523 -62482 -43201
9854 -43201 -49161 -26809 -11155 -98 -28427 -63686 -58119 -74520 -78384 -68189 -52511 -40751
9842 -40751 -42050 -43174 -68974 -44543 -19540 -6722 -17096 -20538 -28507 -33463 -45177 -36986 -29363
9829 -29363 -32142 -28519 -36768 -27575 -39341 -46154 -59041 -44635 -48114 -37798 -42616 -35064 -9417
9816 -9417 8744 13246 22368 27697 20860 -1541 -26062 -34510 -30533 -10800 712 11894 12453 16367
$$ packed form
9906h5805j884O1012M3786q634o671k3397k6077J8032J6622L251K3134n535j0332
9893b498j0615n369J6166r673j6816j4888k170J8508L4163J2956l0534l174k5549
9880c9493n920m296j6722J3785N909Q143j0116k4904l102J4307M088R370j3812
9867f2763p947J2028j3715Q508J9195K0797m742J1792l099K350m3927r59J9281
9854d3201n960K2352J5654J1057k8329l5259N567j6401l864J0195J5678J1760
9842d0751j299j124k5800K4431K5003J2818j0374l442p969m956j1714Q191P623
9829b9363k779L623q249R193j1766o813j2887J4406l479J0316m818P552K5647
9816i417J8161M502R122N329o837k2401k4521q448L977J9733J1512J1182N59L914
$$ plain form
9802 16367 8100 -12523 -17422 -25839 -30419 -20024 -24840 -36442 -29551 -33033 -3444 16456 -5263
9789 -5263 -24456 -30143 -9965 -34178 -46272 -41725 -39191 -39159 -32108 -27512 10800 11508 8313 13328
9775 13328 11941 674 12973 -13339 -29004 -29313 -28469 -26140 -35833 -19758 -5064 -18277 -25180
9762 -25180 -44303 -58957 -36968 -12271 -32635 -56699 -49409 -62554 -32174 435 -18149 -19132
9750 -19132 -15286 -24095 -36570 -75500 -118093 -106611 -55633 -28989 -55980 -81753 -77009 -59317
9738 -59317 -64070 -36903 -7010 -12746 -40577 -48246 -34531 -20776 -36289 -44430 -9931 15149 21285
9725 21285 13094 49969 111572 150814 142637 145662 156395 155053 177625 173110 141941 99339 75872
9712 75872 56942 30761 -3621 -25247 -19412 -12277 -3655 -5678 3189 7879 11717 27372 21241
$$ packed form
9802A6367q267k0623m899q417m580J0395m816j1602O891l482K9589J9900k1719
9789e263j9193n687K0178k4213j2094M547K534L2P051M596L8312P08l195N015
9775A3328j387j1267J2299k6312j5665l09Q44K329r693J6075J4694j3213o903
9762b5180j9123j4654K1989K4697k0364k4064P290j3145L0380L2609j8584r83
9750a9132L846q809j2475l8930m2593J1482N0978K6644k6991k5773M744J7692
9738e9317m753K7167K9893n736k7831p669J3715J3755j5513q141L4499K5080O136
9725B1285q191L6875O1603L9242q177L025J0733j342K2572m515l1169m2602k3467
9712G5872j8930k6181l4382k1626N835P135Q622k023Q867M690L838J5655o131
$$ plain form
9699 21241 46578 45151 61101 69418 31745 23931 6034 -1703 -9384 -12682 -1345 18460 34012
9686 34012 48957 54694 58996 80333 105639 133129 171012 233614 320803 378650 427267 466978
9674 466978 456963 457275 427880 379002 308002 301608 334989 374768 381649 350794 309966 276285
9662 276285 253149 217665 204800 241126 352113 474141 662243 935127 1336021 1640543
9652 1640543 1541104 1138605 697456 413226 281003 226460 177650 133906 137159 136427 111015
9641 111015 88036 105083 116126 124132 124084 136095 128176 164335 229912 307874 369224 445685 503812
9628 503812 523291 524932 477514 438886 390460 345698 339748 333034 309017 285932 267533 278677
9616 278677 322680 324971 278548 235328 175457 110528 92005 87617 66557 47290 47287 52547 55395
$$ packed form
9699B1241K5337j427J5950Q317l7673p814j7897p737p681l298J1337J9805J5552
9686C4012J4945N737M302K1337K5306K7490L7883O2602Q7189N7847M8617L9711
9674D66978j0015L12k9395m8878p1000o394L3381L9779O881l0855m0828l3681
9662B76285k3136l5484j2865L6326J10987J22028J88102K72884M00894L04522
9652A640543r9439m02499m41149k84230j32223n4543m8810m3744L253p32k5412
9641A11015k2979J7047J1043Q006m8J2011p919L6159O5577P7962O1350P6461N8127
9628E03812J9479J641m7418l8628m8426m4762n950o714k4017k3085j8399J1144
9616B78677M4003K291m6423m3220n9871o4929j8523m388k1060j9267lN260K848
$$ plain form
9603 55395 75354 58960 35477 33650 36339 12188 10046 -3466 -12555 1118 18002 18839 27984
9590 27984 33922 55500 78703 105064 131680 138734 105685 116459 136482 194876 271455 301425
9578 301425 327817 319545 290955 273081 219609 172370 146284 149501 167660 180622 183671 176262
9566 176262 138676 86655 57070 61276 42726 19237 21719 48940 53989 51965 15148 -26960
9554 -26960 -5229 5643 16777 21081 -26185 -53815 -73565 -67174 -54047 -29255 5724 -12224
9542 -12224 -55009 -55706 -38785 -29549 -28818 -43184 -5377 38640 61195 100433 112582 89017 64600
9529 64600 39752 38179 31872 12299 30232 34243 28544 903 1351 5541 12390 2274 -22363
9516 -22363 -17068 -27374 -25710 -22883 -35190 -45207 -49414 -53909 -53365 -35215 -50688 -85515 -88865
$$ packed form
9603E5395J9959j6394k3483j827K689k4151k142j3512r089J3673J6884Q37R145
9590B7984N938K1578K3203K6361K6616P054l3049J0774K0023N8394P6579K9970
9578C01425K6392q272k8590j7874n3472m7239k6086L217J8159J2962L049p409
9566A76262l7586n2021k9585M206j8550k3489K482K7221N049k024l6817m2108
9554b6960K1731J0872J1134M304m7266k7630j9750O391J3127K4792L4979j7948
9542a2224m2785o97J6921R236P31j4366L7807M4017K2555L9238J2149k3565k4417
9529F4600k4848j573o307j9573J7933M011n699k7641M48M190O849j0116k4637
9516b2363N295j0306J664K827j2307j0017m207m495N44J8150j5473l4827l350
$$ plain form
9503 -88865 -76292 -65449 -52685 -46699 -37200 -15539 -43447 -31096 -20292 -8075 -12918 -8401 -6949
9490 -6949 -11998 -14630 -27288 -34479 -31408 -18713 -25761 -47863 -39350 -46207 -41106 -15493 -38125 -45592
9476 -45592 -41511 -49267 -49333 -57441 -63417 -58456 -62408 -71696 -76773 -57650 -66340 -75551 -64280 -80981
9462 -80981 -76677 -70528 -40072 -45296 -43974 -24612 -31557 -53468 -49496 -19241 -7765 -20756 -39304
9449 -39304 -41761 -57914 -53868 -49458 -38081 -32817 -28914 -36998 -27626 -19983 -15539 -39790 -52785 -44915
9435 -44915 -39488 -16178 -2451 6716 20510 8294 -9315 -37808 -42937 -46925 -52166 -75478 -75001
9422 -75001 -64256 -64852 -56964 -51623 -48158 -60916 -58199 -37014 -31934 -20004 -42672 -60305 -42093
9409 -42093 -13525 -22992 -34410 -23701 -20803 -47735 -34497 14731 22709 -20449 -41467 -75770
$$ packed form
9503h8865J2573J0843J2764N986R499K1661k7908J2351J0804J2217m843M517J452
9490f949n049k632j2658p191L071J2695p048k2102Q513o857N101K5613k2632p467
9476d5592M081p756o6q108n976M961l952r288n077J9123q690r211J1271j6701
9462h0981M304O149L0456n224J322J9362o945k1911L972L0255J1476j2991j8548
9449c9304k457j6153M046M410J1377N264L903q084R372P643M444k4251j2995P870
9435d4915N427K3310J3727R167J3794j2216j7609k8493n129l988n241k3312M77
9422g5001J0745n96P888N341L465j2758K717K1185N080J1930k2668j7633J8212
9409d2093K8568r467j1418J0709K898k6932J3238M9228P978m3158k1018l4303
$$ plain form
9397 -75770 -74896 -36957 -26109 -47775 -62116 -49641 -54262 -57485 -41187 -49035 -49919 -67323 -51128
9384 -51128 -38396 -44189 -40064 -53292 -56787 -52400 -18717 -18936 -29908 -46392 -49756 -66778 -74817
9371 -74817 -58743 -57331 -60513 -68695 -54644 -39910 -24060 -20797 -49916 -46991 -32223 -45283 -54071
9358 -54071 -59606 -48542 -28471 -19495 -16641 -22338 -12327 -10641 -29739 -35279 -33097 -37273 -58407
9345 -58407 -74640 -61045 -55192 -42300 -29497 -26789 -37617 -2558 -6400 -26667 -28214 -31443 -25009
9332 -25009 -5805 7685 18448 20814 21034 -18235 -45395 -30735 -42842 -63625 -62541 -51659 -30617
9319 -30617 -12081 -17373 -21973 -14169 -21431 -34175 -56373 -73935 -42554 -31486 -21081 -15900 -23134
9306 -23134 -29421 -25239 -25315 -20043 -20442 -39483 -38240 -50407 -29311 181 1899 -32363 -16585 15582
$$ packed form
9397g5770Q74L7939J0848k1666j4341J2475m621l223J6298p848q84j7404J6195
9384e1128J2732n793M125j3228l495M387L3683k19j0972j6484l364j7022q039
9371g4817J6074J412l182q182J4051J4734J5850L263k9119K925J4768j3060q788
9358e4071n535J1064K0071Q976K854n697J0011J686j9098n540K182m176k1134
9345e8407j6233J3595N853J2892J2803K708j0828L5059l842k0267j547l229O434
9332b5009J9204J3490J0763K366K20l9269k7160J4660j2107k0783J084J0882K1042
9319c0617J8536n292m600P804p262j2744k2198j7562L1381J1068J0405N181p234
9306b3134o287M182p6N272l99j9041J243j2167K1096K9492J718l4262J5778L2167
$$ plain form
9292 15582 22504 -7109 -30923 -45285 -58844 -69734 -81940 -57926 -32415 -9339 -23225 -29720
9280 -29720 -52188 -45173 -52773 -29322 -25278 -39322 -39479 -26472 -29526 -11168 -23689 -21526 -3881
9267 -3881 -15433 1425 45594 43020 16509 -9459 -8203 -5060 2550 17390 16868 25150 18726 975
9253 975 -7035 -11151 -23842 5887 10672 1696 12825 788 -20541 -49812 -46567 -28685 -34983
9240 -34983 -39234 -22636 -24387 -49119 -22824 8719 -7483 -33364 -52137 -23448 16855 19019
9228 19019 -3685 -34807 -48755 -32344 -23426 -20687 -13146 -13143 -2752 -10550 -7049 -11500 4972 -7825
9214 -7825 -8158 -4359 -20670 -31334 -18335 -2429 7794 25349 55502 53854 38252 -4480 -27740
9201 -27740 -41876 -37152 -24518 -36520 -41349 -19342 -12683 -13406 -972 -14272 -28830 -22251 -31285
$$ packed form
9292A5582O922k9613k3814j4362j3559j0890j2206K4014K5511K3076j3886o495
9280b9720k2468P015p600K3451M044j4044j57J3007l054J8358j2521K163J7645
9267c881j1552J6858M4169k574k6511k5968J256L143P610J4840n22Q282o424j7751
9253I75q010m116j2691K9729M785q976J1129j2037k1329k9271L245J7882o298
9240c4983m251J6598j751k4732K6295L1543j6202k5881j8773K8689M0303K164
9228A9019k2704l1122j3948J6411Q918K739P541LJ0391p798L501m451J6472j2797
9214g825l33L799j6311j0664J2999J5906J0223J7555L0153j648j5602m2732k3260
9201b7740j4136M724J2634j2002m829K2007O659p23J2434j3300j4558O579r034
$$ plain form
9188 -31285 -48282 -58156 -43929 -32819 -36527 -18383 -9054 -26666 -26549 -23545 -15947 3105 14806
9175 14806 28722 35534 25006 14899 -12086 -46709 -32890 -12511 -17908 -12445 -24815 -17175 -4960
9162 -4960 2584 -15112 -19327 -38421 -53747 -35814 -23190 -43054 -63376 -75127 -70974 -55871 -40987
9149 -40987 -28429 -10838 3334 -19159 -24318 -21623 -22022 -30047 -6666 -4827 3426 -12904 -39917
9136 -39917 -27251 -13454 -9755 -16211 -17510 -21548 -13902 2971 -8328 -33938 -39946 -23359 -2058
9123 -2058 5982 -24060 -20520 4091 9536 -13223 -11557 -16079 -15952 -3701 3581 9094 23355 22579
9109 22579 -5569 -4131 -1345 2017 18804 -8754 -15244 -10233 -14394 -24803 -20159 -32754 -20038
9096 -20038 -28175 -42948 -57406 -76598 -46945 -26553 -25847 -33674 -44150 -32917 -47465 -31658 -20961
$$ packed form
9188c1285j6997r874J4227J1110l708J8144R329j7612J17L004P598J9052J1701
9175A4806J3916O812j0528j0107k6985l4623J3819K0379n397N463j2370P640J2215
9162d960P544j7696m215j9094j5326J7933J2624j9864k0322j1751M153J5103J4884
9149d0987J2558J7591J4172k2493n159K695l99q025K3381J839Q253j6330k7013
9136c9917J2666J3797L699o456j299m038P646J6873j1299k5610o008J6587K1301
9123b058Q040l0042L540K4611N445k2759J666m522J27J2251P282N513J4261p76
9109B2579k8148J438K786L362J6787k7558o490N011m161j0409M644j2595J2716
9096b0038q137j4773j4458j9192K9653K0392P06p827j0476J1233j4548J5807J0697
$$ plain form
9083 -20961 10696 -6525 -7444 253 -23156 -64071 -58193 -39827 -36498 -20309 -8155 -1634 -24460
9070 -24460 -40246 -43286 -35775 -31216 -47132 -39434 -57040 -62644 -37593 -23602 -46818 -48622 -47813
9057 -47813 -71856 -93062 -77699 -71489 -55091 -41359 -49530 -52691 -47020 -58505 -71163 -73687 -75224
9044 -75224 -33273 -10095 -23623 -2107 16473 12717 -8001 -2651 1461 18339 25840 4511 -8572
9031 -8572 -8641 -10303 -7212 -25971 -21405 -3268 -30505 -38276 -28243 -22660 -12654 -5210 6401 13425
9017 13425 -15240 -13091 -50566 -71130 -49879 -48938 -10409 -12267 -36570 -44729 -34868 -34414 -59177
9004 -59177 -58863 -36613 -4168 7408 -4277 -21110 -15654 -17939 -39472 -43674 -37338 -16326 -19380
8991 -19380 -21035 -24940 -38196 -21188 4547 7910 -505 -21382 -28288 -45273 -51842 -62410 -62249
$$ packed form
9083b0961L1657j7221r19P697k3409m0915N878J8366L329J6189J2154O521k2826
9070b4460j5786l040P511M559j5916P698j7606n604K5051J3991k3216j804Q09
9057d7813k4043k1206J5363O210J6398J3732q171l161N671j1485j2658k524j537
9044g5224M1951K3178j3528K1516J8580l756k0718N350M112J6878P501k1329j3083
9031h572o9j662L091j8759M566J8137k7237p771J0033N583J0006P444J1611P024
9017A3425k8665K149l7475k0564K1251R41L8529j858k4303q159R861M54k4763
9004e9177L14K2250L2445J1576j1685j6833N456k285k1533m202O336K1012l054
8991a9380j655l905j3256J7008K5735L363q415k0877o906j6985o569j0568J61
$$ plain form
8978 -62249 -64708 -63091 -35831 -6278 -10495 -7066 -21608 -23846 4334 24904 36403 13995 791
8965 791 -2848 -6616 -16549 -10517 -15646 -2845 16958 -3913 -28675 -28636 -26006 -16128 2652 10206
8951 10206 25113 21132 3992 8522 -9048 -15511 -20264 -26091 -29966 -45629 -34483 -21617 -5951
8938 -5951 21379 11079 88 30377 45912 43626 39218 19503 10922 16637 25576 36489 38027
8925 38027 18684 7039 -3783 -5150 16890 16873 -17873 -16447 -50589 -65755 -44747 -34887 -29166
8912 -29166 -26455 -6733 -3237 18206 4801 -33664 -24671 13808 10181 13308 38191 8412 -18432
8899 -18432 -730 -46 -4452 14168 31686 40506 6743 13290 -9085 -10203 -17861 -17148 -12177 -1843
8885 -1843 -3131 -17312 -27659 -39384 -50435 -43816 -41465 -33370 -23750 -33333 -37489 -37479 -21241 -44548
$$ packed form
8978f2249k459J617K7260K9553m217L429j4542k238K8180K0570J1499k2408j3204
8965G91l639l768r933O032n129J2801J9803k0871k4762L9K630R878J8780P554
8951A0206J4907l981j7140M530j7570o463m753n827l875j5663J1146J2866J5666
8938e951K7330j0300j0991L0289J5535k286m408j9715q581N715Q939J0913J538
8925C8027j9343j1645j0822j367K2040j7l4746J426l4142j5166K1008R860N721
8912b9166K711J9722L496K1443j3405l8465Q993L8479l627L127K4883k9779k6844
8899a8432J7702O84m406J8620J7518Q820l3763O547k2375j118p658P13M971J0334
8885a843j288j4181j0347j1725j1051O619K351Q095R620r583m156J0J6238k3307
$$ plain form
8871 -44548 -37518 -38942 -64079 -86621 -68965 -21492 15748 6473 -8182 -7507 -12670 -29540 -32792
8858 -32792 -12080 -6051 -3165 5510 12560 10861 -4437 -14012 -7422 -16342 -6116 -11908 -22874 -74256
8844 -74256 -66863 -3117 16443 19642 32616 936 -25571 -34025 -23381 4907 2723 -26297 -25787
8831 -25787 -3396 -16559 -25011 -23362 -28751 -34776 -49039 -41437 -21764 -5229 -3607 -11257 -2153
8818 -2153 605 172 -17430 -12886 26085 10311 -11620 -17338 -32147 -32627 -3014 -13047 -45760
8805 -45760 -27918 -456 5361 9936 -2507 -2756 21537 37420 30731 -15492 -54889 -56859 -15020
8792 -15020 14414 21006 10430 20939 31098 10204 8086 23968 -4905 -31697 -38654 -55013
8780 -55013 -43080 -60711 -56734 -29059 -30168 -17194 20983 41590 28966 20423 -767 -13907
$$ packed form
8871d4548P030j424k5137k2542J7656M7473L7240r275j4655O75n163j6870l252
8858c2792K0712O029K886Q675P050j699j5298r575O590q920J0226n792j0966n1382
8844g4256P393O3746J9560L199J2974l1680k6507q454J0644K8288k184k9020N10
8831b5787K2391j3163q452J649n389o025j4263P602J9673J6535J622p650R104
8818b153K758m33j7602M544L8971j5774k1931n718j4809m80K9613j0033l2713
8805d5760J7842K7462N817M575j2443k49K4293J5883o689m6223l9397j970M1839
8792a5020K9434O592j0576J0509J0159k0894k118J5882k8873k6792o957j6359
8780e5013J1933j7631L977K7675j109J2974L8177K0607j2624q543k1190j3140
$$ plain form
8768 -13907 -6881 2866 -7224 -16191 1382 34046 35139 22375 13181 -39228 -75521 -68227 -52370
8755 -52370 -41027 -19485 103 -7283 5990 29297 25123 14266 9427 22675 18898 12569 39079
8742 39079 31827 24479 20958 28532 -4600 -35055 -32852 -27748 -14611 -29703 -29691 -19893 2830 9054
8728 9054 26807 43740 27739 20620 17420 20220 16985 -13903 -39748 -33803 -33966 -42142 -45674 -23458
8714 -23458 12367 33998 49024 68353 54101 62085 65399 41396 38492 61254 112033 111221 69417
8701 69417 30932 17321 17394 9697 20610 32157 26072 32040 55840 56931 40581 32644 36213 5698
8687 5698 4964 32792 39838 16310 14940 13005 22515 41068 58096 49518 32044 19917 6546
8674 6546 3390 818 69 -24431 -10992 -9036 454 15524 7646 15383 41047 32455 20506 2037
$$ packed form
8768a3907P026R747j0090q967J7573L2664J093j2764r194n2409l6293P294J5857
8755e2370J1343K1542J9588p386J3273K3307m174j0857m839J3248l777o329K6510
8742C9079p252p348l521P574l3132l0455K203N104J3137j5092J2R798K2723O224
8728I054J7753J6933j6001p119l200K800l235l0888k5845N945j63q176l532K2216
8714b3458L5825K1631J5026J9329j4252P984L314k4003k904K2762N0779q12m1804
8701F9417l8485j3611P3p697J0913J1547o085N968K3800J091j6350p937L569l0515
8687E698p34K7828P046k3528j370j935R510J8553J7028q578j7474j2127j3371
8674F546l156k572p49k4500J3439J956R490J5070p878P737K5664q592j1949j8469
$$ plain form
8660 2037 -10253 7746 12492 -811 -15414 14384 33081 11842 -23047 -21513 -1689 17191
8648 17191 12909 -12544 -12048 -21995 -18086 -16306 -20175 2976 13493 -6219 6397 20821 40229
8635 40229 82673 66120 39021 35415 16935 -14718 -852 21456 28799 26731 19181 21223 52007
8622 52007 23827 -2921 -10583 -11896 19001 16291 5670 24557 34630 39142 25442 38518 44736
8609 44736 26282 28854 3346 6660 20370 -18959 -32206 -31131 -10816 10472 50467 44839 28012
8596 28012 -4555 22119 44739 42846 33431 50895 54621 35189 31920 38885 53293 51046 35707
8583 35707 42430 53551 72788 96057 79838 55038 67351 105471 129957 119039 86293 85063
8571 85063 103211 102519 104072 99166 67294 55878 32770 38221 65000 83909 74047 31898 30171
$$ packed form
8660B037j2290J7999M746j3303j4603K9798J8697k1239l4889J534J9824J8880
8648A7191m282k5453M96r947L909J780l869K3151J0517j9712J2616J4424J9408
8635D0229M2444j6553k7099l606j8480l1653J3866K2308P343k068p550K042L0784
8622E2007k8180k6748p662j313L0897k710j0621J8887J0073M512j3700J3076O218
8609D4736j8454K572k5508L314J3710l9329j3247J075K0315K1288L9995n628j6827
8596B8012l2567K6674K2620j893r415J7464L726j9432l269O965J4408k247j5339
8583C5707O723J1121J9237K3269j6219k4800J2313L8120K4486j0918l2746j230
8571H5063J8148o92J553m906l1872j1416k3108N451K6779J8909r862m2149j727
$$ plain form
8558 30171 34629 10778 5013 -1797 5658 29081 40510 22989 29702 19439 25124 27943 23666
8545 23666 25540 9826 14905 8401 -8596 -13846 -35824 -31241 -650 58746 59932 25677 32018
8532 32018 42500 48025 20005 38914 50087 17620 -7262 17027 45225 36538 17333 11492
8520 11492 27238 29171 31918 11725 14062 14832 6475 30443 43663 44513 31182 45843 44542 48470
8506 48470 49820 42145 39924 36652 4398 9858 31232 40288 33873 47951 46742 41714 31434 32101
8492 32101 14180 9314 29333 50598 19625 -24338 -37586 -11687 15327 34425 -761 -16840
8480 -16840 -7026 5557 12324 2849 -14089 -9662 2287 25314 30225 18127 17232 24592 1496
8467 1496 -8517 27855 42401 9871 26226 15766 11671 17320 13287 40630 57675 33616 16567
$$ packed form
8558C0171M458k3851n765o810P455K3423J1429j7521O713j0263N685K819m277
8545B3666J874j5714N079o504j6997n250k1978M583L0591N9396J186l4255O341
8532C2018J0482N525k8020J8909J1173l2467k4882K4289K8198q687j9205n841
8520A1492J5746J933K747k0193K337P70q357K3968J3220Q50j3331J4661j301L928
8506D8470J350p675k221l272l2254N460K1374R056o415J4078j209n028j0280O67
8492C2101j7921m866K0019K1265l0973m3963j3248K5899K7014J9098l5186j6079
8480a6840R814J2583O767r475j6938M427J1949K3027M911j2098q95P360k3096
8467A496j0013L6372J4546l2530J6355j0460m095N649m033K7343J7045k4059j7049
$$ plain form
8454 16567 43689 65335 63069 51139 59706 44337 17775 17793 28032 39875 45790 35607 25180
8441 25180 32541 43799 38192 44888 31542 5845 11808 20958 12356 9842 12317 38939 37765 19788
8427 19788 39634 74275 96064 83560 75664 82127 73992 55518 44812 63830 50846 42617 53478
8414 53478 33172 2381 250 14077 35472 36259 37971 10403 4919 14962 9434 13834 11125
8401 11125 11758 10072 5629 2275 20619 10817 5092 36192 47481 70017 75020 49723 31563
8388 31563 21974 18186 37295 49014 47103 31365 19007 21911 57769 68748 60866 50985 45683
8375 45683 46684 74883 77658 70801 37084 32452 14385 33288 51422 41272 19034 15216 29405
8362 29405 24804 33699 20789 33729 35409 23099 47205 62332 62350 46473 26832 27358 22687 49489
$$ packed form
8454A6567K7122K1646k266j1930Q567j5369k6562J8J0239J1843N915j0183j0427
8441B5180P361J1258n607O696j3346k5697N963R150q602k514K475K6622j174j7977
8427A9788J9846L4641K1789j2504p896O463q135j8474j0706J9018j2984q229J0861
8414E3478k0306l0791k131J3827K1395P87J712k7568n484J0043n528M400k709
8401A1125O33j686m443l354J8344r802n725L1100J1289K2536N003k5297j8160
8388C1563r589l788J9109J1719j911j5738j2358K904L5858J0979p882r881n302
8375D5683J001K8199K775o857l3717m632j8067J8903J8134j0150k2238l818J4189
8362B9405m601Q895j2910J2940J680j2310K4106J5127J8j5877j9641N26m671K6802
$$ plain form
8348 49489 72343 64761 52075 42707 48888 42874 37006 32386 49461 40014 14839 20404 51816
8335 51816 62602 66689 66651 50272 33981 56939 55566 75469 84571 79825 80938 97050 65006
8322 65006 55929 74736 72675 67699 43744 41782 52564 60862 53938 46057 44375 30848 32426 48839
8308 48839 65447 67500 38283 23923 -15585 -36244 -9232 15054 20042 27458 23616 19643 8204
8295 8204 -14511 -16079 -7095 8503 32861 60070 59148 39021 19399 33827 46792 66879 89075
8282 89075 70063 60246 62264 31531 48618 77276 54148 47689 50947 46242 34530 18696 16247
8269 16247 12648 9168 15937 38965 42125 11294 14964 13828 14337 51209 107569 106200 63947 41113
8255 41113 51895 49497 65109 33438 25106 23517 51411 58013 37634 38321 31307 22540 52538
$$ packed form
8348D9489K2854p582j2686r368O181o014n868m620J7075r447k5175N565L1412
8335E1816J0786M087l8j6379j6291K2958j373J9903R102m746J113J6112l2044
8322F5006r077J8807k061m976k3955j962J0782Q298o924p881j682j3527J578J6413
8308D8839J6608K053k9217j4360l9508k0659K7012K4286M988P416l842l973j1439
8295H204k2715j568Q984J5598K4358K7209r22k0127j9622J4428J2965K0087K2196
8282H9075j9012r817K018l0733J7087K8658k3128o459L258m705j1712j5834k449
8269A6247l599l480O769K3028L160l0831L670j136N09L6872N6360j369m2253k2834
8255D1113J0782k398J5612l1671q332j589K7894O602k0379O87p014q767K9998
$$ plain form
8242 52538 42668 46021 74373 87714 66946 75648 89593 80496 99888 80605 47966 45662 26513
8229 26513 31583 7516 1648 15609 48558 78479 73751 78241 49304 42850 26647 15402 34738
8216 34738 50886 15825 21164 35412 47734 56811 47166 44315 82932 90071 43220 -5465 -25170
8203 -25170 -10690 2945 22094 56909 72862 75662 51910 31223 -1307 -8492 -25710 -24775 -4958
8190 -4958 20912 35190 77878 107246 102349 62733 32847 50338 95953 71906 33516 40380
8178 40380 37175 36562 41163 48664 75206 70439 31593 -7281 -42157 -50008 -43322 -30635 -14932
8165 -14932 -4979 12538 20809 15257 -3161 -6157 -18743 -22384 -739 -10346 -17423 -17598 -40786 -45398
8151 -45398 -18730 126 10596 38732 37160 27282 50322 63340 31092 19513 11269 56976
$$ packed form
8242E2538r870L353K8352J3341k0768Q702J3945r097J9392j9283l2639k304j9149
8229B6513N070k4067n868J3961L2949K9921m728M490k8937o454j6203j1245J9336
8216C4738J6148l5061N339J4248J2322R077r645k851L8617P139m6851m8685j9705
8203b5170J4480J3635J9149L4815J5953K800k3752k0687l2530p185j7218R35J9817
8190d958K5870J4278M2688K9368m897l9616k9886J7491M5615k4047l8390O864
8178D0380l205o13M601P501K6542m767l8846l8874l4876p851O686J2687J5703
8165a4932R953J7517Q271n552j8418k996j2586l641K1645r607p077j75k3188m612
8151d5398K6668J8856J0470K8136j572r878K3040J3018l2248j1579q244M5707
$$ plain form
8139 56976 95577 89599 53929 21584 7507 -9473 -4005 -15642 -5901 1447 4288 15466 13869
8126 13869 30983 33318 24776 22644 4212 1990 9477 18494 9110 38 15416 22867 13715 25548
8112 25548 16322 3574 -7889 -8590 -1633 -14587 -22141 -24519 -28184 -17399 -4527 3251 19449
8099 19449 17769 9716 31265 25664 -7672 -48387 -55348 -46061 -14519 -4615 -25378 -24257 -12552
8086 -12552 -1240 -9131 -28826 -13100 -763 -36829 -19948 -8316 -12546 -7247 -9882 -21768 -2713
8073 -2713 -5154 -13941 -22660 -18711 -4318 -11922 -18681 -15665 -12402 -18340 -8984 -15455 -24526 -7111
8059 -7111 -3181 -15525 -25800 -14999 -7284 3829 -8952 8490 28492 43937 22884 -27316
8047 -27316 -12699 4363 12263 20130 3728 -5103 3653 -7178 -17287 -15845 -17078 4837 -1700
$$ packed form
8139E6976L8601n978l5670l2345j4077j6980N468j1637R741P348K841J1178j597
8126A3869J7114K335q542k132j8432k222P487R017r384r072J5378P451r152J1833
8112B5548r226j2748j1463p01O957j2954p554k378l665J0785J2872P778J6198
8099A9449j680q053K1549n601l3336m0715o961R287L1542R904k0763J121J1705
8086a2552J1312p891j9695J5726J2337l6066J6881J1632m230N299k635j1886J9055
8073b713k441q787q719L949J4393p604o759L016L263n938R356o471r071J7415
8059g111L930j2344j0275J0801P715J1113j2781J7442K0002J5445k1053n0200
8047b7316J4617J7062P900P867j6402q831Q756j0831j0109J442j233K1915o537
$$ plain form
8034 -1700 -3979 -23850 -40087 -4781 10257 24141 -3701 -33260 -36816 6564 46738 37799 -1221
8021 -1221 -22215 -16342 15637 12414 13385 -3897 -23604 -31604 -29463 6148 7825 -30034 -2251
8008 -2251 23806 20540 -202 13790 42436 39381 18130 18487 25832 14185 5934 -3763 13683
7995 13683 45940 61821 50966 32242 28006 -2053 -3042 8227 29508 78443 56838 24563
7983 24563 10121 23260 12675 1324 15052 17555 18663 4509 -13921 -24347 -9605 12864
7971 12864 37259 69500 61096 51846 36155 21704 14765 -15042 -46022 -23225 23226 15696 11827
7958 11827 24402 21763 29935 13983 7513 32585 7968 3983 47803 64538 48196 23801 25690
7945 25690 -9816 -31743 -5856 34065 46104 27744 39382 49191 40783 47659 43387 17244 -7903
$$ packed form
8034a700k279j9871j6237L5306J5038J3884k7842k9559l556M3380M0174q939l9020
8021a221k0994N873L1979l223R71j7282j9707q000K141L5611J677l7859K7783
8008b251K6057l266k0742J3992K8646l055k1251L57P345j1647q251r697J7446
7995A3683L2257J5881j0855j8724m236l0059r89J1269K1281M8935k1605l2275
7983B4563j4442J3139j0585j1351J3728K503J108j4154j8430j0426J4742K2469
7971A2864K4395L2241q404r250j5691j4451o939k9807l0980K2797M6451p530l869
7958A1827J2575k639Q172j5952o470K5072k4617l985M3820J6735j6342k4395J889
7945B5690l5506k1927K5887L9921J2039j8360J1638R809q408O876m272k6143k5147
$$ plain form
7932 -7903 -37691 -30215 11185 31129 27697 -3634 -39 21171 24430 12005 -198 18012 28108
7919 28108 28933 43362 52876 37513 26280 33387 23243 11804 17114 27221 24558 30724 17153
7906 17153 9795 -6287 -8756 3304 3614 -22150 -10170 4752 28019 29968 29882 17238 11198 23101
7892 23101 36773 52435 33422 4713 34232 37774 31912 26280 11538 5515 -8840 -1233 -11722
7879 -11722 -16292 9125 18465 10308 3609 -3543 6810 29266 23390 26864 20161 8105 6539 3855
7865 3855 -7087 5482 4479 1915 -4507 -13437 -2725 24272 35514 37273 50712 36015 15303
7852 15303 34495 31198 7904 12711 9474 12700 -6219 -32767 -18821 14376 33289 38738 23417
7839 23417 19353 38025 44324 41657 15761 9463 30225 39978 1931 14208 1325 -24500 -4273
$$ packed form
7932g903k9788P476M1400J9944l432l1331L595K1210L259j2425j2203J8210J0096
7919B8108Q25J4429R514j5363j1233P107j0144j1439N310J0107k663O166j3571
7906A7153p358j6082k469J2060L10k5764J1980J4922K3267J949q6j2644o040J1903
7892B3101J3672J5662j9013k8709K9519L542n862n632j4742o023j4355P607j0489
7879a1722m570K5417R340q157o699p152J0353K2456n876L474o703j2056j566k684
7865C855j0942J2569j003k564o422q930J0712K6997J1242J759J3439j4697k0712
7852A5303J9192l297k3294M807l237L226j8919k6548J3946L3197J8913N449j5321
7839B3417m064J8672O299k667k5896o298K0762R753l8047J2277j2883k5825K0227
$$ plain form
7826 -4273 4818 4948 40459 62396 60678 52775 34661 12461 -662 -2777 -34109 -21308 -18404
7813 -18404 -35034 -33910 -17994 -13510 -32972 -19581 -8681 7034 18034 23909 34786 44775 33138
7800 33138 23006 14487 15874 8355 -9878 -2064 6356 7497 -8854 12555 16295 -11950 -10982 -2526
7786 -2526 11594 16495 24298 21493 4796 28122 22632 5255 -5224 -20461 -13365 -1794 -18343
7773 -18343 -16535 -7666 -9051 14370 31207 -12544 -11935 24248 22923 25784 41217 22227 -646
7760 -646 -1051 1862 -16039 -15695 -14664 -17223 -30010 -24032 31229 45358 41464 45597 14112 10549
7746 10549 7674 22311 15439 25902 14511 5000 13713 -4646 -11880 -23957 -38820 -12302 -5801
7733 -5801 5263 27770 32519 8268 -22046 -43227 -84230 -88065 -59022 -43375 -14420 -6420 -21650
$$ packed form
7826d273R091J30L5511K1937j718p903j8114k2200j3123k115l1332J2801K904
7813a8404j6630J124J5916M484j9462J3391J0900J5715J1000N875J0877R989j1637
7800C3138j0132q519J387p519j8233P814Q420J141j6351K1409L740k8245R68Q456
7786b526J4120M901P803k805j6697K3326n490j7377j0479j5237P096J1571j6549
7773a8343J808Q869j385K3421J6837m3751O09L6183j325K861J5433j8990k2873
7760f46m05K913j7901L44J031k559j2787N978N5261J4129l894M133l1485l563
7746A0549k875J4637o872J0463j1391r511Q713j8359p234j2077j4863K6518O501
7733e801J1064K2507M749k4251l0314k1181m1003l835K9043J5647K8955Q000j5230
$$ plain form
7720 -21650 -28871 -24907 -13462 -336 8186 16766 10625 -5277 363 874 8567 13852 15905 -1672
7706 -1672 6398 24915 34598 17840 19878 27710 21827 240 17063 30401 45410 27740 4412
7693 4412 -25173 -11754 6620 -7595 -32824 -37586 -37600 -37625 -45514 -42024 -54993 -37115 -38374 -32125
7679 -32125 -50352 -61549 -56103 -63859 -62165 -34287 -10699 -10124 -38647 -60219 -70729 -69655 -39903
7666 -39903 -4788 20166 -6016 -26461 -47683 -34713 -56330 -69550 -74484 -65164 -40619 -64112
7654 -64112 -79352 -54650 -38694 -22926 -28849 -20292 7661 16670 22766 23386 23734 30616 5373 11016
7640 11016 21298 10878 16847 26432 13550 3087 32010 38897 30016 29036 17211 8364 2972
7627 2972 14024 19691 20558 3103 -30983 -51147 -40315 -30836 -32944 -28053 -32058 -41410 -51243 -10247
$$ packed form
7720b1650p221L964J1445J3126Q522Q580o141j5902N640N11P693N285K053j7577
7706a672Q070J8517R683j6758K038P832n883k1587J6823J3338J5009j7670k3328
7693D412k9585J3419J8374j4215k5229m762j4k5p889L490j2969J7878j259O249
7679c2125j8227j1197N446p756J694K7878K3588N75k8523k1572j0510J074K9752
7666c9903L5115K4954k6182k0445k1222J2970k1617j3220m934R320K4545k3493
7654f4112j5240K4702J5956J5768n923Q557K7953R009O096O20L48O882k5243N643
7640A1016J0282j0420N969R585j2882j0463K8923O887q881r80j1825q847n392
7627B972J1052N667Q67j7455l4086k0164J0832R479k108M891m005r352r833M0996
$$ plain form
7613 -10247 29220 44505 25721 -4502 -6524 -21695 -28746 -33795 -27195 -20437 -22877 -32776 -6875
7600 -6875 2576 -17965 -27650 -12930 -3035 600 1218 -5735 -5604 -15897 -25446 -24239 -21830 -26415 -13702
7585 -13702 -6154 -4792 -1158 -7831 -3985 -4129 -34227 -50866 -42044 -44261 -30061 -132 1784 -3087
7571 -3087 12428 -7427 -34557 -40424 -9732 -16919 -24629 -1977 17815 -3884 -24371 -28277 -42908
7558 -42908 -32653 -27117 -22928 -41962 -21775 13766 38938 19582 -5928 13953 23674 33463 15600
7545 15600 2340 6010 -3459 16796 23866 978 -11986 -11461 -28695 -22964 5460 34110 35369
7532 35369 29511 21796 33368 47795 39739 35874 22183 12360 5844 -10332 -23835 -24274 -39678
7519 -39678 -68029 -77019 -32179 1982 4047 8584 24334 13320 -6423 -5676 -11387 682 19068
$$ packed form
7613a0247L9467J5285j8784l0223k022j5171p051n049O600O758k440r899K5901
7600f875R451k0541r685J4720R895L635O18o953J31j0293r549J207K409m585J2713
7585a3702P548J362L634o673L846j44l0098j6639Q822k217J4200K9929J916m871
7571c087J5515j9855k7130n867L0692p187p710K2652J9792k1699k0487l906j4631
7558d2908J0255N536M189j9034K0187L5541K5172j9356k5510J9881R721R789j7863
7545A5600j3260L670r469K0255P070k2888j2964N25j7234N731K8424K8650J259
7532C5369n858p715J1572J4427q056l865j3691r823o516j6176j3503m39j5404
7519c9678k8351q990M4840L4161K065M537J5750j1014j9743P47n711J2069J8386
$$ plain form
7506 19068 19867 439 -31803 -38621 -34511 -36939 -14629 10857 -20959 -14470 3185 -11720 -19057
7493 -19057 -264 5654 28639 42839 51592 14177 -45810 -67027 -52927 -26882 -24 -819 2199
7480 2199 -18799 -39623 -23117 -7985 -5418 -14347 -17339 -13430 -36776 -34402 -38180 -6434 1411
7467 1411 10426 22440 8712 -13069 -15460 -22099 -27535 -28730 -32539 -19854 -5969 10900 26357
7454 26357 40524 27999 3398 -11454 -13001 -44815 -65440 -44469 -19355 -13878 -6163 -23748
7442 -23748 -33080 -56995 -70667 -62346 -47850 -54437 -55984 -26908 14633 37030 41182 53009 41183
7429 41183 41100 32237 -6186 -26536 -24842 -20641 -7272 10874 5904 -4326 -32681 -27148 -8447
7416 -8447 -5207 7900 24057 18387 -11524 -9262 26484 32835 25299 22545 2553 -11739 -13959
$$ packed form
7506A9068P99j9428l2242o818M110k428K2310K5486l1816O489J7655j4905p337
7493a9057J8793N918K2985J4200Q753l7415n9987k1217J4100K6045K6858p95L018
7480B199k0998k0824J6506J5132K567q929k992L909k3346K374l778L1746P845
7467A411R015J2014j3728k1781k391o639n436j195l809J2685J3885J6869J5457
7454B6357J4167j2525k4601j4852j547l1814k0625K0971K5114N477P715j7585
7442b3748r332k3915j3672Q321J4496o587j547K9076M1541K2397M152J1827j1826
7429D1183q3q863l8423k0350J694M201J3369J8146m970j0230k8355N533J8701
7416h447L240J3107J6157n670k9911K262L5746O351p536k754j9992j4292k220
$$ plain form
7403 -13959 -14408 -21736 -15030 -25855 -22487 -10453 -22730 -31125 -4213 -846 -1969 -20444 -25820 -11079
7389 -11079 15690 33470 14948 23833 23251 3471 -23779 -33321 -11565 703 -1572 -15298 -37295
7376 -37295 -38479 -29415 -34301 -36001 -18063 -19411 -37575 -19975 -21723 -28681 -8068 914 -5608 13284
7362 13284 19508 15793 13100 7672 -6067 24867 35896 24953 4305 -23244 -9739 -9414 -7276
7349 -7276 -12459 13639 21210 21159 16739 4595 7825 21880 2828 -7163 -2771 12031 2362 13227
7335 13227 12336 17878 -10097 -14779 -2108 -10776 -2806 -734 -10145 -26392 -33097 -60042 -41138 -19802
7321 -19802 -17673 -28933 -31445 -40142 -50984 -45700 -41639 -31347 -25639 -15694 -20590 -5335 -1977 -3564
7307 -3564 -17034 -27528 -43790 -34488 -19954 -17614 -19701 -23376 -9081 -535 -8348 15284 -2298
$$ packed form
7403a3959m49p328O706j0825L368J2034j2277q395K6912L367j123j8475n376J4741
7389a1079K6769J7780j8522Q885n82j9780k7250r542K1756J2268k275j3726k1997
7376c7295j184R064m886j700J7938j348j8164J7600j748o958K0613Q982o522J8892
7362A3284O224l715k693n428j3739L0934J1029j0943k0648k7549J3505L25K138
7349g276n183K6098P571n1m420j2144L230J4055j9052r991M392J4802r669J0865
7335A3227q91N542k7975m682J2671q668P970K072r411j6247o705k6945J8904K1336
7321a9802K129j1260k512q697j0842N284M061J0292N708R945m896J5255L358j587
7307c564j3470j0494j6262R302J4534K340k087l675J4295Q546p813K3632j7582
$$ plain form
7294 -2298 -1111 44058 49904 27297 27581 12997 13119 10858 1189 -29224 -23629 -30655 -25089 -6166
7280 -6166 12198 -3956 -21783 -4667 -1084 -5332 32002 36771 32804 18739 -12596 237 10245
7267 10245 139 33175 23296 18254 16636 -3379 -16937 -46545 -21617 -2563 -6661 -6591 -543
7254 -543 9513 -6887 -229 3298 -2093 9436 -6819 -13413 -253 2560 2108 11859 20541 4716
7240 4716 -28048 -19119 -21508 -25676 10510 59 -10995 17511 4135 1515 21473 44921 50522
7227 50522 38327 8484 -12607 -7882 11697 -1890 -18905 -18220 -13953 -23832 -16744 -16592 -17348 6470
7213 6470 19315 5050 -19350 -46556 -39192 -1394 28985 19462 1946 4814 20953 24974 21336
7200 21336 10167 -14240 -29481 -36633 -21756 -22051 -39267 -38319 -21942 -10170 -25640 -48280 -22036
$$ packed form
7294b298J187M5169N846k2607K84j4584J22k261r669l0413N595p026N566J8923
7280f166J8364j6154j7827J7116L583m248L7334M769l967j4065l1335J2833J0008
7267A0245j0106L3036r879n042j618k0015j3558k9608K4928J9054m098P0O048
7254e43J0056j6400O658L527n391J1529j6255o594J3160K813m52R751Q682j5825
7240D716l2764Q929k389m168L6186j0451j1054K8506j3376k620J9958K3448N601
7227E0522j2195k9843k1091M725J9579j3587j7015O85M267r879P088J52p56K3818
7213F470J2845j4265k4400k7206P364L7798L0379r523j7516K868J6139M021l638
7200B1336j1169k4407j5241p152J4877k95j7216R48J6377J1772j5470k2640K6244
$$ plain form
7187 -22036 -3569 -11041 -50126 -41536 -25109 -31705 -21104 -29042 -51059 -53431 -39917 -16256 -28176
7174 -28176 -40780 -23052 1576 18478 8738 -14410 -12904 -25841 -61010 -81009 -73817 -43797
7162 -43797 4236 18308 19135 29574 46149 54720 27773 12814 -18249 -27163 -32532 -55692 -67490
7149 -67490 -54772 -28469 -5572 4037 39098 25771 31219 21132 35417 36110 -3194 -16135 1323
7136 1323 -14752 -20397 -25080 5001 -5424 -14008 -22918 -24063 -41420 -44338 -12248 -13869 6978
7123 6978 29121 6783 -17709 -12431 -2589 3521 14566 1158 -12795 -18129 -26673 -41941 -41112
7110 -41112 -34377 -44680 -42972 -38266 -24501 10135 14343 19929 13737 15297 29845 60021 49191
7097 49191 19202 -2635 -6920 4304 -7648 -7772 -4478 -15740 -23900 -34869 -11448 5650 22196
$$ packed form
7187b2036J8467p472l9085Q590J6427o596J0601p938k2017k372J3514K3661j1920
7174b8176j2604J7728K4628J6902r740k3148J506j2937l5169j9999P192L0020
7162d3797M8033J4072Q27J0439J6575Q571k6947j4959l1063q914n369k3160j1798
7149f7490J2718K6303K2897R609L5061j3327N448j0087J4285O93l9304j2941J7458
7136A323j6075n645m683L0081j0425q584q910j145j7357k918L2090j621K0847
7123F978K2143k2338k4492N278R842O110J1045j3408j3953n334q544j5268Q29
7110d1112O735j0303J708M706J3765L4636M208N586o192J560J4548L0176j0830
7097D9191k9989k1837m285J1224j1952j24L294j1262q160j0969K3421J7098J6546
$$ plain form
7084 22196 37352 34198 36389 14130 11033 12426 4751 -7786 -5983 -10222 -43069 -41445 -34063 -29571
7070 -29571 -10659 -3928 -23194 -35350 -49830 -64720 -44409 -4163 7183 21626 20579 22187
7058 22187 30949 47919 35479 16596 8267 -5770 -16887 -23299 10395 19007 -1568 -12484 -30480
7045 -30480 -67303 -62461 -45178 -37544 -43842 -37864 -33476 -26430 -55344 -73611 -58175 -31139 -37585
7032 -37585 -56841 -66843 -39586 -12174 -21819 -13031 -17875 -3415 -18306 -54404 -48502 -55660 -58032
7019 -58032 -63732 -56520 -79444 -101410 -85430 -57484 -71181 -50513 -23247 -18340 13988 35770
7007 35770 19122 8355 -7427 -13404 -21166 -23111 -22137 -17646 -11985 2614 15467 -10211 -7666
6994 -7666 -15567 -27425 -42687 -29774 -7830 10454 47282 66251 67048 46839 48416 33555 17291
$$ packed form
7084B2196J5156l154K191k2259l097J393p675j2537J803m239l2847J624P382M492
7070b9571J8912O731j9266j2156j4480j4890K0311M0246J1346J4443j047J608
7058B2187Q762J6970j2440j8883q329j4037j1117o412L3694Q612k0575j0916j7996
7045c0480l6823M842J7283P634o298N978M388P046k8914j8267J5436K7036o446
7032c7585j9256j0002K7257K7412r645Q788m844J4460j4891l6098N902p158k372
7019e8032n700P212k2924k1966J5980K7946j3697K0668K7266M907L2328K1782
7007C5770j6648j0767j5782n977p762j945R74M491N661J4599J2853k5678K545
6994g666p901j1858j5262J2913K1944J8284L6828J8969P97k0209J577j4861j6264
$$ plain form
6981 17291 15998 -21296 -62221 -86584 -72206 -39140 -26931 -18313 -6082 -945 -855 -5114 -25368
6968 -25368 -69377 -70299 -41496 -23890 -21938 -14491 7039 39408 34926 3729 -18931 -46246 -53342
6955 -53342 -32064 -925 36934 20744 -19961 -35140 -40885 -49591 -57339 -37756 -20820 -21089 24841
6942 24841 49113 30940 16846 -12071 -12121 8467 19297 12107 -25999 -36580 -49969 -67467 -25833
6929 -25833 21649 8133 -21849 1251 22180 16749 12118 5801 3234 -8574 12734 27458 -8157
6916 -8157 -16316 1749 36535 37571 31762 31273 25337 14097 9619 14278 16507 29380 18973 9063
6902 9063 -1292 14750 35049 33027 27654 16397 2567 -10593 15296 42365 24912 3529
6890 3529 4013 -14049 -18720 -14782 4867 -5476 -16121 -8770 -21220 -31393 -55957 -65149 -48117
$$ packed form
6981A7291j293l7294m0925k4363J4378L3066J2209Q618J2231N137R0m259k0254
6968b5368m4009r22K8803J7606J952P447K1530L2369m482l1197k2660k7315p096
6955e3342K1278L1139L7859j6190m0705j5179n745q706p748J9583J6936k69M5930
6942B4841K4272j8173j4094k8917n0K0588J0830p190l8106j0581j3389j7498M1634
6929b5833M7482j3516k9982K3100K0929n431m631o317k567j1808K1308J4724l5615
6916h157q159J8065L4786J036n809m89n936j1240m478M659K229J2873j0407r910
6902I063j0355J6042K0299k022n373j1257j3830j3160K5889K7069j7453k1383
6890C529M84j8062m671L938J9649j0343j0645P351j2450j0173k4564r192J7032
$$ plain form
6877 -48117 -41794 -7532 -18541 -11415 17353 11064 -9699 -6606 -26657 -39359 -20365 10717 14343
6864 14343 8345 505 -23752 -58430 -60137 -49256 -40832 -13379 19336 34861 17398 -1873 -22757
6851 -22757 -45821 -45561 -5640 10627 -7968 -23369 -1963 -19487 -15593 3460 4085 4276 -10479
6838 -10479 3031 15783 22486 1741 12945 11645 -4701 -11940 -29623 -29118 -15857 -27791 -3060
6825 -3060 16849 32224 14663 -7332 11598 26433 28022 16146 13594 22209 24279 1027 14760
6812 14760 8440 -20091 -5 12636 -2323 -16904 -25383 -11324 8172 12082 12648 4741 23973
6799 23973 34463 -5741 -40372 -39697 -28126 -34348 -51186 -53938 -33783 -16141 -1292 -14932 -33564
6786 -33564 -39076 -18095 -2627 -8060 -7583 -12567 -18473 -16093 -7777 -10605 23336 38068 19002 -4765
$$ packed form
6877d8117O323L4262j1009P126K8768o289k0763L093k0051j2702J8994L1082L626
6864A4343n998p840k4257l4678j707J0881Q424K7453L2715J5525j7463j9271k0884
6851b2757k3064K60L9921J6267j8595j5401K1406j7524L894J9053O25J91j4755
6838a0479J3510J2752O703k0745J1204j300j6346p239j7683N05J3261j1934K4731
6825c060J9909J5375j7561k1995J8930J4835J589j1876k552Q615K070k3252J3733
6812A4760o320k8531K0086J2641j4959j4581q479J4059J9496L910N66p907J9232
6799B3973J0490m0204l4631O75J1571o222j6838k752K0155J7642J4849j3640j8632
6786c3564n512K0981J5468n433M77m984n906K380Q316k828L3941J4732j9066k3767
$$ plain form
6772 -4765 -33821 -32677 -35346 -18058 13090 4457 -13807 -4667 -6617 14883 18304 4767 2499
6759 2499 25734 20606 15316 12063 10104 -8050 1070 -26792 -50040 -46762 -63351 -68422 -64244 -34763
6745 -34763 -22890 4633 19377 -24743 -58705 -63222 -49103 -39067 -23495 -24037 3329 -271 24731
6732 24731 26347 33643 23567 31716 37466 32532 541 -17064 -23266 -29972 -20374 -25565 -1542 -6191
6718 -6191 -21083 838 1266 -29739 -22198 -30717 -61685 -85200 -64345 -40758 -16135 18452 22845
6705 22845 5435 3411 8555 -22824 -35423 -20423 -15754 -10287 -6221 -10943 -20637 -15342 -24479 15592
6691 15592 16871 6889 -33487 -29875 -10434 -722 -13557 -13030 24518 24456 -11729 -31267 -41109 -41568
6677 -41568 -40121 -36404 -16943 -21877 -26854 -16862 -1372 4921 -3110 -50620 -67717 -19373 -3025
$$ packed form
6772d765k9056J144k669J7288L1148q633j8264R140j950K1500L421j3537k268
6759B499K3235n128n290l253j959j8154R120k7862k3248L278j6589n071M178K9481
6745c4763J1873K7523J4744m4120l3962m517J4119J0036J5572n42K7366l600K5002
6732B4731J616P296j0076Q149N750m934l1991j7605o202o706R598n191K4023m649
6718f191j4892K1921M28l1005P541q519l0968k3515K0855K3587K4623L4587M393
6705B2845j7410k024N144l1379j2599J5000M669N467M066m722r694N295r137M0071
6691A5592J279r982m0376L612J9441R712j2835N27L7548o2l6185j9538r842m59
6677d1568J447L717J9461m934m977R992J5490O293q031m7510j7097M8344J6348
$$ plain form
6664 -3025 -35072 -49501 -3952 -9978 -26309 -49747 -44063 -14626 -6678 -11786 -34139 -58391 -60733
6651 -60733 -39129 -12399 7981 13597 15435 24208 12739 17218 -8224 -3072 4392 -13438 -19377
6638 -19377 -18520 -7770 -5388 11612 -1293 313 -12065 -986 -2607 -10045 -8343 -16450 -34507
6625 -34507 -32797 -31715 -10374 12494 21846 27032 4281 -7303 5451 -2075 -15974 -15739 14579
6612 14579 5726 -4009 157 -5279 -2447 -2243 9583 26710 39230 12270 -13582 -18400 -32151
6599 -32151 -27094 10402 13074 -23444 -28884 -7737 -14172 -3172 -16936 -29296 -22469 -11747 -1093
6586 -1093 9994 10607 17892 1896 1211 -5361 -19470 -42882 -41325 -28410 -19324 -8520 2022 -4749
6572 -4749 14732 28871 3863 -9920 -32223 -42556 -49463 -36600 -12332 2418 28550 45354
$$ packed form
6664c025l2047j4429M5549o026j6331k3438N684K9437P948n108k2353k4252k342
6651f0733K1604K6730K0380N616J838Q773j1469M479k5442N152P464j7830n939
6638a9377Q57J0750K382J7000j2905J606j2378J1079j621p438J702q107j8057
6625c4507J710J082K1341K2868R352N186k2751j1584J2754p526j3899K35L0318
6612A4579q853r735M166n436K832K04J1826J7127J2520k6960k5852m818j3751
6599c2151N057L7496K672l6518n440K1147o435J1000j3764j2360O827J0722J0654
6586a093J1087O13P285j5996o85o572j4109k3412J557J2915R086J0804J0542o771
6572d749J9481J4139k5008j3783k2303j0333o907J2863K4268J4750K6132J6804
$$ plain form
6560 45354 35884 24517 -13813 -21015 -6123 9009 24324 8910 -6986 25907 22982 -40239
6548 -40239 -69975 -25777 9263 12147 -7855 -9617 366 -5167 -9250 11112 3532 -12605 -26274
6535 -26274 -60732 -38247 15997 50031 55489 44713 26847 24409 -10393 -40959 -23083 -10478
6523 -10478 -7065 -3349 14215 18850 18302 13556 11625 -2769 -10272 -10991 -11945 -21099 -41522 -45634 -31322
6508 -31322 -35059 -25062 -32612 -36147 -26304 18386 13748 2987 3545 -13271 -19141 -28756 -31599 -14791
6494 -14791 -13320 -2529 -3627 -3708 -13743 -7140 -33253 -15453 -2874 -14256 -32530 -38149 -39782
6481 -39782 -44657 -20940 -43089 -40268 -26062 -7044 -30 21007 34845 20657 -10409 -23580
6469 -23580 14468 -4232 -22584 -2504 -12218 10879 15334 10280 7846 10449 -3594 -21256 -36389
$$ packed form
6560D5354r470j1367l8330p202J4892J5132J5315j5414j5896L2893k925o3221
6548d0239k9736M4198L5040K884k0002j762R983n533m083K0362p580j6137j3669
6535b6274l4458K2485N4244L4034N458j0776j7866k438l4802l0566J7876J2605
6523a0478L413L716J7564M635n48m746j931j4394p503p19r54r154k0423m112J4312
6508c1322l737R997p550l535R843M4690m638j0761N58j6816n870r615k843J6808
6494a4791J471J0791j098q1j0035O603k6113J7800J2579j1382j8274n619j633
6481c9782m875K3717k2149K821J4206J9018P014K1037J3838j4188l1066j3171
6469b3580L8048j8700j8352K0080r714K3097M455n054k434K603j4043j7662j5133
$$ plain form
6456 -36389 -18123 1729 -22182 -21168 7191 37010 24469 -1070 -11017 -17910 -2880 8075
6444 8075 6019 -13061 -23468 -29047 -26879 878 32928 49994 31874 19109 5447 5814 16773
6431 16773 4427 -5547 -12739 8992 -1951 -40733 -42416 -30018 -20159 -8578 33 27253 35249
6418 35249 17523 5808 -6075 2248 5522 -1721 3107 3573 20314 8007 -12906 -28326 -27499
6405 -27499 -39317 -37172 -35307 -23641 -8668 -28490 -39965 -58016 -50432 -11698 17677 28556
6393 28556 19997 13607 13263 12834 -2875 -8528 -17833 -38016 -45296 -27057 -17802 -35396 6536 -3540
6379 -3540 -31802 -20148 -45469 -41275 -23146 -16157 -32904 -31445 4121 21982 20354 6959 11907
6366 11907 13219 -8892 -5437 -4848 10696 26205 34952 22153 -11092 -4440 -4051 -14251 2930
$$ packed form
6456c6389J8266J9852k3911J014K8359K9819j2541k5539r947o893J5030J0955
6444H075k056j9080j0407n579K168K7757L2050J7066j8120j2765j3662L67J0959
6431A6773j2346r974p192K1731j0943l8782j683J2398R859J1581Q611K7220P996
6418C5249j7726j1715j1883Q323L274p243M828M66J6741j2307k0913j5420Q27
6405b7499j1818K145J865J1666J4973j9822j1475j8051P584L8734K9375J0879
6393B8556q559o390l44m29j5709n653r305k0183p280J8239R255j7594M1932j0076
6379c540k8262J1654k5321M194J8129O989j6747J459L5566J7861j628j3395M948
6366A1907J312k2111L455N89J5544J5509Q747j2799l3245O652L89j0200J7181
$$ plain form
6353 2930 24796 27861 18180 15685 30832 13414 -18583 -6196 1606 7545 -11666 -7907 1961
6340 1961 3907 -11508 -5260 -9131 -39094 -47483 -35028 -56584 -59245 -45924 -24509 -11901 15859
6327 15859 20001 18463 15087 -9100 -5476 -4873 10291 2197 5585 1827 -1264 -10228 3019 22027
6313 22027 28628 -3379 2178 26469 25142 30370 17014 32938 16396 32656 4979 2846 -284
6300 -284 -8703 -169 16765 38444 38635 2133 14732 14209 10292 -3582 4734 15050 4066 1308
6286 1308 12419 -4343 -14614 23201 38841 28142 -2965 3956 -9502 13373 34053 20406
6274 20406 6346 -11826 -15528 -7656 -7588 -17466 -3104 -772 4023 -4119 18352 -9936 -41324 -58256
6260 -58256 -28491 -21901 -33769 -13972 -21806 -2529 14262 -14769 -22583 7100 7787 -2207 8356
$$ packed form
6353B930K1866L065r681k495J5147j7418l1997J2387P802N939j9211L759R868
6340A961J946j5415O248l871k9963q389J2455k1556k661J3321K1415J2608K7760
6327A5859M142j538l376k4187L624O03J5164q094L388l758l091q964J3247J9008
6313B2027O601l2007N557K4291j327N228j3356J5924j6542J6260k7677k133l130
6300b84q419Q534J6934K1679J91l6502J2599n23l917j3874Q316J0316j0984k758
6286A308J1111j6762j0271L7815J5640j0699l1107O921j3458K2875K0680j3647
6274B0406j4060j8172l702P872O8r878J4362K332M795q142K2471k8288l1388j6932
6260e8256K9765O590j1868J9797p834J9277J6791k9031p814K9683O87r994J0563
$$ plain form
6247 8356 30476 24016 25992 28690 27231 27357 28182 24240 26141 25570 8856 393 3685 6225 14138
6232 14138 -2296 -26468 -8585 32603 25700 3021 12898 23188 27905 11546 9265 -14004 -8886
6219 -8886 10601 33882 17622 21553 44166 44868 21484 18503 20192 21376 24595 21232 5876 -18776
6205 -18776 -30231 -16698 -26792 -36809 -31841 -19357 4073 9204 18126 4181 -6139 3397 -3027
6192 -3027 -26393 -26521 -46913 -38903 -7148 15273 30141 16561 4295 -4866 -7858 7288 6810
6179 6810 -18229 -33160 -2954 5372 -4142 -16075 -36195 -13469 1531 -7638 -5605 13408 35455
6166 35455 42133 41972 25560 13622 28066 34852 22932 6479 -424 23975 30716 26177 -1333
6153 -1333 -3744 -29888 -37663 -29592 -15845 26171 40859 18691 -4426 -15842 -15837 -25396 -33042 -31101
$$ packed form
6247H356K2120o460J976K698j459J26Q25l942J901n71j6714q463L292K540P913
6232A4138j6434k4172J7883M1188o903k2679R877J0290M717j6359k281k3269N118
6219h886J9487K3281j6260L931K2613P02k3384k981J689J184L219l363j5356k4652
6205a8776j1455J3533j0094j0017M968J2484K3430N131Q922j3945j0320R536o424
6192c027k3366j28k0392Q010L1755K2421J4868j3580j2266r161k992J5146m78
6179F810k5039j4931L0206Q326r514j1933k0120K2726J5000r169K033J9013K2047
6166C5455O678j61j6412j1938J4444O786j1920j6453o903K4399O741m539k7510
6153a333k411k6144p775Q071J3747M2016J4688k2168k3117j1416Nr559p646J941
$$ plain form
6139 -31101 -9120 -819 -11106 -13752 11681 19490 -1010 6401 -4105 -1563 -2105 6853 16773 47746
6125 47746 33086 8808 8384 13349 -2206 -16449 -30318 -2463 10749 -12103 -12333 -9443 -11107
6112 -11107 -18174 -27295 -35244 -47133 -41581 -20826 -8885 -10501 12854 6504 -5298 19770 3547
6099 3547 -5925 -1251 -12336 -44079 -51581 -32105 -21356 -24307 -11170 -25584 -20552 -18016 -25194
6086 -25194 -34046 -12662 9389 7149 -43614 -37024 -30922 -34803 -20684 -10871 -7083 -40426 -48258
6073 -48258 -49118 -36336 -48508 -38162 -9555 6313 -3587 10058 38680 28021 13542 18047 8765
6060 8765 -11594 -34241 -29676 -16934 -20679 -2142 29214 38964 5275 -23392 -17533 2540 3932
6047 3932 24841 30829 -1225 -16156 13268 34560 50985 42654 10282 15853 33496 46774 57524
$$ packed form
6139c1101K1981Q301j0287k646K5433P809k0500P411j0506K542n42Q958R920L0973
6125D7746j4660k4278m24M965j5555j4243j3869K7855J3212k2852k30K890j664
6112a1107p067r121p949j1889N552K0755J1941j616K3355o350j1802K5068j6223
6099C547r472M674j1085l1743p502J9476J0749k951J3137j4414N032K536p178
6086b5194q852K1384K2051k240n0763O590O102l881J4119R813L788l3343p832
6073d8258q60J2782j2172J0346K8607J5868r900J3645K8622j0659j4479M505r282
6060H765k0359k2647M565J2742l745J8537L1356R750l3689k8667N859K0073J392
6047C932K0909N988l2054j4931K9424K1292J6425q331l2372N571J7643J3278J0750
$$ plain form
6034 57524 47571 21319 30191 21712 224 5138 10258 -8882 -19435 15166 53249 76132 66677
6021 66677 42345 32734 -12057 -28048 -62385 -75988 -38930 -33373 -36630 -32365 -7601 -5584 3647
6008 3647 16800 9208 3160 6147 45 -35639 -21504 -26758 -39627 -25292 -12111 16656 33525
5995 33525 11225 8927 6286 -16223 -22888 -11578 -16630 7650 5085 -5154 -35516 -32599 -13813
5982 -13813 -4718 -8525 -51309 -53732 -13945 -126 -13632 15873 43756 44505 4705 -26321 -4449
5969 -4449 5472 1106 6793 19312 1986 -12085 13597 7364 8244 26422 8759 -3724 -1162
5956 -1162 5150 2805 -6332 -19667 -12545 -9259 -23978 -35511 -14772 -3295 -5064 -15572 8709
5943 8709 45986 35400 28899 22706 1388 652 228 28858 34647 16248 -300 -8984 -9840 -24983
$$ packed form
6034E7524r953k6252Q872q479k1488M914N120j9140j0553L4601L8083K2883r455
6021F6677k4332r611m4791j5991l4337j3603L7058N557l257M265K4764K017R231
6008C647J3153p592o048K987o102l5684J4135n254j2869J4335J3181K8767J6869
5995C3525k2300k298k641k2509o665J1310n052K4280k565j0239l0362K917J8786
5982a3813R095l807m2784k423L9787J3819j3506K9505K7883P49l9800l1026K1872
5969d449R921m366N687J2519j7326j4071K5682o233Q80J8178j7663j2483K562
5956a162O312k345r137j3335P122L286j4719j1533K0739J1477j769j0508K4281
5943H709L7277j0586o501o193k1318p36m24K8630N789j8399j6548q684q56j5143
$$ plain form
5929 -24983 -3616 8761 13183 15345 8647 -22682 -52617 -61306 -37333 11962 24915 10731 -8377
5916 -8377 -20845 -19266 -21936 -27011 -16757 3063 37456 23578 25475 54459 15650 4685 4638
5903 4638 21690 52856 58580 68256 53870 37726 37142 41166 30957 -5664 -13885 -10397 -29759
5890 -29759 -43508 -36360 -48980 -47550 -13752 34962 20150 11945 4148 5629 -6196 -12371 -18399
5877 -18399 -21080 -18367 -27900 -24459 -4573 12105 27852 28003 -9822 -17310 7953 18657 33071
5864 33071 24326 905 -36843 -54905 -67537 -41786 -12075 9744 46524 32316 21180 16516
5852 16516 -24644 -25908 -20955 -30258 -8266 -9521 -10666 -24235 -34500 -36306 -29984 -34808 -38756 -22127
5838 -22127 -20306 -14395 -32476 -49559 -34732 -30239 -16237 -17817 3931 -2748 -17735 -29701 -15450
$$ packed form
5929b4983K1367J2377M422K162o698l1329k9935q689K3973M9295J2953j4184j9108
5916h377j2468J579k670n075J0254J9820L4393j3878J897K8984l8809j0965m7
5903D638J7052L1166N724R676j4386j6144n84M024j0209l6621q221L488j9362
5890b9759j3749P148j2620J430L3798M8714j4812q205p797J481j1825o175o028
5877a8399k681K713r533L441J9886J6678J5747J51l7825p488K5263J0704J4414
5864C3071q745k3421l7748j8062j2632K5751K9711K1819L6780j4208j1136m664
5852A6516m1160j264M953r303K1992j255j145j3569j0265j806O322m824l948J6629
5838b2127J821N911j8081j7083J4827M493J4002j580K1748o679j4987j1966J4251
$$ plain form
5825 -15450 5171 29171 12523 -29669 -44686 -52866 -42202 -55780 -35538 -42512 -45960 -30759
5813 -30759 -29610 -23957 -28690 -20054 904 23653 32608 2317 -6239 -13130 -5530 46617 65475
5800 65475 77536 60937 29613 -10609 -19073 -11682 -5652 3011 26558 15565 -24932 -11609 25489
5787 25489 45403 27484 27853 18560 -9676 -28945 -43511 -45593 -45431 -44600 -29177 -33466 -47733 -57994
5773 -57994 -56766 -65389 -39385 -43086 -51146 -50182 -26574 -33780 -50361 -41502 -9152 1968 -15224
5760 -15224 -6041 19555 54166 39631 3296 4815 4234 3643 -30097 -61233 -61003 -50631 -20080
5747 -20080 2834 17765 -23299 -40152 -28619 -24762 -35997 -21843 18229 14685 -13281 -28132
5735 -28132 -8561 -6419 18421 11679 -4898 -16516 -8272 3864 -5791 6013 -2103 -7433 13644
$$ packed form
5825a5450K0621K4000j6648m2192j5017q180J0664j3578K0242o974l448J5201
5813c0759J149N653m733Q636K0958K2749Q955l0291q556o891P600N2147J8858
5800F5475J2061j6599l1324m0222q464P391O030Q663K3547j0993m0497J3323L7098
5787B5489J9914j7919L69r293k8236j9269j4566k082J62Q31J5423m289j4267j0261
5773e7994J228q623K6004l701q060R64K3608p206j6581Q859L2350J1120j7192
5760a5224R183K5596L4611j4535l6335J519n81n91l3740l1136K30J0372L0551
5747b0080K2914J4931m1064j6853J1533L857j1235J4154M0072l544k7966j4851
5735b8132J9571K142K4840o742j6577j1618Q244J2136r655J1804q116n330K1077
$$ plain form
5722 13644 23795 38736 25417 21723 19792 -3671 -27940 -4644 -30148 -42634 -19474 -20681
5710 -20681 -31503 -32974 -39297 -54618 -47160 -30076 -8335 -18028 -26786 -44893 -53670 -38384 -21850
5697 -21850 -26861 -48847 -33707 2206 -5587 -26309 -19833 7410 -49 -15917 -17069 -24689 -28266
5684 -28266 -54706 -55339 -56431 -16711 -8878 -3989 -4339 -3244 -24436 -39291 -5932 5124 -18818
5671 -18818 -16370 -3282 19620 11870 -23544 -27874 -20010 -5748 9360 11023 20666 6547 9037
5658 9037 29731 21795 7712 15799 8862 1969 -722 5408 13625 14589 -24014 -43426 -24653 32297
5644 32297 59634 41926 34670 19431 -3354 -3586 -3033 13263 3582 -10956 -340 -202 7043 14907
5630 14907 25964 36635 6364 -21498 -16897 -11449 -19821 -26801 -11676 -15764 -37703 -55418 -51441
$$ packed form
5722A3644J0151J4941j3319l694j931k3463k4269K3296k5504j2486K3160j207
5710b0681j0822j471o323j5321P458J7084K1741r693q758j8107q777J5286J6534
5697b1850n011k1986J5140L5913p793k0722O476K7243p459j5868j152p620l577
5684b8266k6440o33j092L9720P833M889l50J095k1192j4855L3359J1056k3942
5671a8818K448J3088K2902p750l5414m330P864J4262J5108J663R643j4119K490
5658I037K0694p936j4083Q087o937o893k691O130Q217R64l8603j9412J8773N6950
5644C2297K7337j7708p256j5239k2785k32N53J6296r681j4538J0616J38P245P864
5630A4907J1057J0671l0271k7862M601N448q372o980J5125m088k1939j7715L977
$$ plain form
5617 -51441 -50315 -36530 -30205 -20296 -689 18433 7025 -2542 -673 -9085 -19160 -12839 -692
5604 -692 8662 -4074 -3734 -3341 -23636 -17668 21479 26309 6553 4815 13395 17718 9044 10762 17491
5589 17491 28838 4920 1723 24297 18050 -26997 11909 46886 54860 45746 63895 50794 20721
5576 20721 2714 -21032 -14439 -34455 -32037 -27876 -33636 -38497 -19295 -979 -11989 -12203 -20857
5563 -20857 -35879 -29869 -29925 -6254 -19019 -28959 -34847 -33364 -27072 -17362 18694 30096 19118 16538
5549 16538 -5486 -37793 -36170 -33642 -32189 -18852 -4163 -16890 -21949 -456 13696 -2059 -9488
5536 -9488 21641 16375 -4783 -8781 -6946 17636 31450 -9678 -5810 20668 31940 672 -27190
$$ packed form
5617e1441J126J3785O325R909J9607J9122j1408r567J869q412j0075O321J2147
5604f92R354j2736L40L93k0295N968L9147M830j9756j738Q580M323q674J718O729
5589A7491J1347k3918l197K2574o247m5047L8906L4977P974r114J8149j3101l0073
5576B0721j8007k3746O593k0016K418M161n760m861J9202J8316j1010k14q654
5563b0857j5022O010n6K3671j2765r940n888J483O292R710L6056J1402j0978k580
5549A6538k2024l2307J623K528J453J3337J4689j2727n059K1493J4152j5755p429
5536i488L1129n266k1158l998J835K4582J3814m1128L868K6478J1272l1268k7862
$$ [...]
##END NTUPLES=NMR SPECTRUM
##END=
