##TITLE=Analysis number 329877
Compound Code cc 27008
Book Reference 552/24
Project Code adrs
Chemist Name stevem
##JCAMPDX= 6.0         $$ Bruker NMR JCAMP-DX V2.0
##DATA TYPE= NMR SPECTRUM
##DATA CLASS= NTUPLES
##ORIGIN= Bruker BioSpin GmbH
##OWNER= nmr
$$ XWIN-NMR		Version 3.5
$$ Mon Oct  8 14:34:33 2007 GMT Daylight Time (UT+1h)  MAYBRIDGE\nmr@NMR_250MHZ
##.OBSERVE FREQUENCY= 250.131544655141
##.OBSERVE NUCLEUS= ^1H
##.ACQUISITION MODE= SIMULTANEOUS (DQD)
##.ACQUISITION SCHEME= undefined
##.AVERAGES= 16
##.DIGITISER RES= 18
##SPECTROMETER/DATA SYSTEM= dpx250
##.PULSE SEQUENCE= zg30
##.SOLVENT NAME= CDCl3
##.SHIFT REFERENCE= (INTERNAL, CDCl3, 0, 16.522)
##AUDIT TRAIL= $$ (NUMBER, WHEN, WHO, WHERE, WHAT)
$$ ##TITLE= Audit trail, XWIN-NMR		Version 3.5
$$ ##JCAMPDX= 5.01
$$ ##ORIGIN= Bruker BioSpin GmbH
$$ ##OWNER= nmr
$$ C:\u/data/dgb/nmr/ADRS/370/pdata/1/auditp.txt
$$ ##AUDIT TRAIL=  $$ (NUMBER, WHEN, WHO, WHERE, WHAT)
(   1,<2007-10-08 14:34:12.23 +100>,<MAYBRIDGE\nmr>,<NMR_250MHZ>,
      <created by zg, POWCHK disabled, PULCHK disabled
       configuration hash MD5:
       76 6E 9A 78 1E 09 19 81 EC 84 63 8F B0 6A 59 2D
       data hash MD5: 64K
       D9 01 F0 C5 F3 D5 9C 54 49 54 54 90 3F 5E A4 A7>)
(   2,<2007-10-08 14:34:24.95 +100>,<MAYBRIDGE\nmr>,<NMR_250MHZ>,
      <Start of raw data processing
       ef LB = 0.3 FT_mod = 6 PKNL = 1 SI = 32K 
       data hash MD5: 32K
       D2 89 93 E4 C5 11 04 73 EF 1C 61 18 08 8B 4F 00>)
(   3,<2007-10-08 14:34:26.62 +100>,<MAYBRIDGE\nmr>,<NMR_250MHZ>,
      <apk 
       data hash MD5: 32K
       3A 4A 70 2C 49 43 C9 EE 1C 1F B9 76 74 D0 99 AF>)
(   4,<2007-10-08 14:34:27.36 +100>,<MAYBRIDGE\nmr>,<NMR_250MHZ>,
      <abs ABSG = 5 
       data hash MD5: 32K
       3C 22 CB 47 53 15 91 AC CB 78 CE 90 71 40 57 61>)
$$ ##END=
$$ 
$$ hash MD5
$$ BD 9A 3A EC DB 27 2C 3B 7A 73 F3 0B D5 69 30 A0
##$RELAX= 
##$RELAX= 
##$RELAX= 
##$RELAX= 
##$RELAX= 
##$RELAX= 
##$RELAX= 
$$ Bruker specific parameters
$$ --------------------------
##$DU= <C:\u>
##$EXPNO= 370
##$NAME= <ADRS>
##$PROCNO= 1
##$TYPE= <nmr>
##$USER= <dgb>
##$AMP= (0..31)
100 100 100 100 100 100 100 100 100 100 100 100 100 100 100 100 100 100 
100 100 100 100 100 100 100 100 100 100 100 100 100 100 
##$AQSEQ= 0
##$AQ_mod= 3
##$AUNM= <au_zg>
##$AUTOPOS= <13 >
##$BF1= 250.13
##$BF2= 250.13
##$BF3= 250.13
##$BF4= 250.13
##$BF5= 500.13
##$BF6= 500.13
##$BF7= 500.13
##$BF8= 500.13
##$BYTORDA= 1
##$CFDGTYP= 0
##$CFRGTYP= 5
##$CHEMSTR= <none>
##$CNST= (0..31)
1 1 145 1 1 1 1 1 1 1 1 1 1 1 1 1 1 1 1 1 1 1 1 1 1 1 1 1 1 1 1 1 
##$CPDPRG= <>
##$CPDPRG1= <>
##$CPDPRG2= <>
##$CPDPRG3= <>
##$CPDPRG4= <mlev>
##$CPDPRG5= <mlev>
##$CPDPRG6= <mlev>
##$CPDPRG7= <mlev>
##$CPDPRG8= <mlev>
##$CPDPRGB= <>
##$CPDPRGT= <>
##$D= (0..31)
0 1 0 0 0 0 0 0 0 0.06 0 0 0 0 0 0 0.0002 0 0 0 0 0 0 0 0 0 0 0 0 0 0 
0 
##$DATE= 1191850451
##$DBL= (0..7)
120 120 120 120 120 120 120 120 
##$DBP= (0..7)
150 150 150 150 150 150 150 150 
##$DBP07= 0
##$DBPNAM0= <>
##$DBPNAM1= <>
$$ [...]
##$SUBNAM7= <"">
##$SUBNAM8= <"">
##$SUBNAM9= <"">
##$SW= 20.6930455092707
##$SWIBOX= (0..15)
0 0 3 0 0 0 0 0 0 0 0 0 0 0 0 0 
##$SW_h= 5175.983436853
##$TD= 65536
##$TD0= 1
##$TE= 296.16
##$TE2= 300
##$TE3= 300
##$TEG= 300
##$TL= (0..7)
0 120 120 120 120 120 120 120 
##$TP= (0..7)
150 150 150 150 150 150 150 150 
##$TP07= 0
##$TPNAME0= <>
##$TPNAME1= <>
##$TPNAME2= <>
##$TPNAME3= <>
##$TPNAME4= <>
##$TPNAME5= <>
##$TPNAME6= <>
##$TPNAME7= <>
##$TPOAL= (0..7)
0.5 0.5 0.5 0.5 0.5 0.5 0.5 0.5 
##$TPOFFS= (0..7)
0 0 0 0 0 0 0 0 
##$TUNHIN= 0
##$TUNHOUT= 0
##$TUNXOUT= 0
##$USERA1= <user>
##$USERA2= <user>
##$USERA3= <user>
##$USERA4= <user>
##$USERA5= <user>
##$V9= 5
##$VALIST= <valist>
##$VCLIST= <CCCCCCCCCCCCCCC>
##$VD= 0
##$VDLIST= <DDDDDDDDDDDDDDD>
##$VPLIST= <PPPPPPPPPPPPPPP>
##$VTLIST= <TTTTTTTTTTTTTTT>
##$WBST= 1024
##$WBSW= 4
##$XGAIN= (0..3)
0 0 0 0 
##$XL= 0
##$YL= 0
##$YMAX_a= 557099
##$YMIN_a= -572453
##$ZGOPTNS= <>
##$ZL1= 120
##$ZL2= 120
##$ZL3= 120
##$ZL4= 120
##$ABSF1= 16.522
##$ABSF2= -4.171173
##$ABSG= 5
##$ABSL= 3
##$ALPHA= 0
##$AQORDER= 0
##$ASSFAC= 0
##$ASSFACI= 0
##$ASSFACX= 0
##$ASSWID= 0
##$AUNMP= <proc_1d>
##$AZFE= 0.1
##$AZFW= 0.1
##$BCFW= 0
##$BC_mod= 0
##$BYTORDP= 0
##$COROFFS= 0
##$CY= 12.5
##$DATMOD= 1
##$DC= 0
##$DFILT= <>
##$DTYPP= 0
##$F1P= 14.0000005364418
##$F2P= -0.99999901652339
##$FCOR= 0.5
##$FTSIZE= 32768
##$FT_mod= 6
##$GAMMA= 0
##$GB= 0
##$INTBC= 1
##$INTSCL= 1
##$ISEN= 128
##$LB= 0.3
##$LEV0= 0
##$LPBIN= 0
##$MAXI= 10000
##$MC2= 0
##$MEAN= 0
##$ME_mod= 0
##$MI= 0
##$NCOEF= 0
##$NC_proc= -2
##$NLEV= 6
##$NOISF1= 0
##$NOISF2= 0
##$NSP= 0
##$NTH_PI= 0
##$NZP= 0
##$OFFSET= 16.522
##$PC= 1
##$PHC0= 154.1721
##$PHC1= 8.292424
##$PH_mod= 1
##$PKNL= yes
##$PPARMOD= 0
##$PSCAL= 4
##$PSIGN= 0
##$REVERSE= no
##$SF= 250.13
##$SI= 32768
##$SIGF1= 0
##$SIGF2= 0
##$SINO= 400
##$SIOLD= 32768
##$SREGLST= <1H.CDCl3>
##$SSB= 0
##$STSI= 32768
##$STSR= 0
##$SW_p= 5175.98343685301
##$SYMM= 0
##$S_DEV= 0
##$TDeff= 65536
##$TDoff= 0
##$TI= <Analysis number 999999
Compound Code 99
Book Reference 9
Project Code 9>
##$TILT= no
##$TM1= 0
##$TM2= 0
##$TOPLEV= 0
##$USERP1= <user>
##$USERP2= <user>
##$USERP3= <user>
##$USERP4= <user>
##$USERP5= <user>
##$WDW= 1
##$XDIM= 32768
##$YMAX_p= 523670044
##$YMIN_p= -49752
$$ End of Bruker specific parameters
$$ ---------------------------------
##NTUPLES= NMR SPECTRUM
##VAR_NAME=  FREQUENCY,     SPECTRUM/REAL,   SPECTRUM/IMAG
##SYMBOL=    X,             R,               I
##VAR_TYPE=  INDEPENDENT,   DEPENDENT,       DEPENDENT
##VAR_FORM=  AFFN,          ASDF,            ASDF
##VAR_DIM=   32768,         32768,           32768
##UNITS=     HZ,            ARBITRARY UNITS, ARBITRARY UNITS
##FACTOR=    0.157963299565203, 1,           1
##FIRST=     4132.6476996994, 0,             0
##LAST=      -1043.33573715361, 0,           0
##MIN=       -1043.33573715361, -49752,      0
##MAX=       4132.6476996994, 523670044,     0
$$ Real data points
##PAGE= N=1
##DATA TABLE= (X++(R..R)), XYDATA
$$ [...]
16488C8358j0876N196K0312K3989O142o056L751m695o879L902O232j7624o088
$$ 38358 27482 32678 52990 76979 83121 77065 80816 76121 69242 73144 79376 61752 55664
16475E5664l191o969L0J053L375p074J3479J60k298r620r775N680p308o958o924
$$ 55664 52473 45504 45534 46587 49962 42888 56367 56527 54229 44609 34834 40514 33206 26248 19324
16460A9324M031K877J1442j396J1539J6090L938N437J5236P031l517m99n059K591
$$ 19324 23355 26232 37674 36278 47817 63907 67845 73282 88518 95549 92032 91533 86474 89065
16446H9065k014o811J266M852m992q121L854J0436N744J648J0015J6127J7462
$$ 89065 87051 80240 81506 86358 81366 73245 77099 87535 93279 94927 104942 121069 138531
16433A38531o272j6534l136O360N773J6715O288j0426K110j0086j2425j5509J6067
$$ 138531 132259 115725 112589 118949 124722 141437 147725 137299 139409 129323 116898 101389 117456
16420A17456O755J2804q7j9667j4859J5462L585p158Q550K3306J3354O720J0335
$$ 117456 124211 137015 136928 117261 102402 117864 121449 114291 122841 146147 159501 166221 176556
16407A76556J745K937J3582R646J921K947K0958K9940J1275J049K5348J1447q20
$$ 176556 178301 181238 194820 204466 206387 209334 230292 260232 271507 272556 297904 309351 308531
16394C08531j2355K02J0950K6969L6157K1794J3651L4238O0600P1205Q6921R3942
$$ 308531 296176 296378 307328 334297 370454 392248 405899 440137 500737 571942 658863 752805
16382G52805R2981J14328J11401R7155Q2842O6580M4781M1616M6269O2225Q6711
$$ 752805 845786 960114 1071515 1168670 1251512 1318092 1362873 1404489 1450758 1512983 1599694
16371A599694J29728J71953K33500K93951L27963L56023L91799M50945N49392
$$ 1599694 1729422 1901375 2134875 2428826 2756789 3112812 3504611 3955556 4504948
16362D504948P12418J033916J564940K453357L947983O269066Q935032J1964704
$$ 4504948 5217366 6251282 7816222 10269579 14217562 20486628 29421660 41386364
16354D1386364J4749903J5441463J6234807J4596932J0437007M393053j65p759120
$$ 41386364 56136267 71577730 87812537 102409469 112846476 117239529 117239364 109480244
16346A09480244j1636529j4697108j5473775j5206707j2853396j0652535p698382
$$ 109480244 97843715 83146607 67672832 52466125 39612729 28960194 21261812
16339B1261812n334930l559568k400077j717501j285356r75751p36495o11808
$$ 21261812 15926882 12367314 9967237 8249736 6964380 5988629 5252134 4640326
16331D640326n00692m06012l51423l12881k76836k38880j97247j64657j39067
$$ 4640326 4139634 3733622 3382199 3069318 2792482 2553602 2356355 2191698 2052631
16322B052631q9826o2714p1178o6537n4084q0399q7400j04943j24161j34189j33675
$$ 2052631 1962805 1900091 1828913 1762376 1708292 1627893 1540493 1435550 1311389 1177200 1043525
16311A043525j30599j09302r4847q4648o5400l7238l4414l8831m8219o2783k5262
$$ 1043525 912926 803624 708777 624129 558729 521491 487077 448246 400027 337244 311982
16300C11982l544j4736P49r268j5729p732L913m653M571L267l867j03n786r037
$$ 311982 308438 293702 294451 285183 269454 261722 265635 260982 265553 268820 264953 264850 259064 250027
16286B50027n812j1325j1182k1068o013q139O683l718j3747o995j687m20n075
$$ 250027 244215 232890 221708 200640 194627 186488 193171 189453 175706 168711 167024 166604 161529
16273A61529P133Q582l787j6812o69p995k202m932m749M656J4649Q668J4240k559
$$ 161529 168662 177244 173457 156645 155976 147981 145779 140847 136098 140754 155403 164071 178311 175752
16259A75752O068L1933K3219J7750L3538M7398R4731J53634K03423K93713L90895
$$ 175752 181820 213753 236972 254722 288260 335658 430389 584023 787446 1081159 1472054
16248A472054M77497M57167M73448M32848M28808M38779K06314J18824j61419
$$ 1472054 1949551 2406718 2880166 3313014 3741822 4180601 4386915 4505739 4344320
16239D344320l08508l68930m60486m20029m59715m79128m33629l43534k57290
$$ 4344320 4035812 3666882 3206396 2786367 2326652 1847524 1413895 1070361 813071
16230H13071j72140j34673q8780m1580l4271m0339m3433k9997n959j2362k1469
$$ 813071 640931 506258 417478 375898 341627 301288 257855 227858 221899 209537 188068
16219A88068j5275j3748l969j0600j2547j7868L99K979O403L54j0795k569j1906
$$ 188068 172793 159045 155076 144476 131929 114061 114460 117439 123842 124196 113401 110832 98926
16206I8926j2165j3825j6294l362Q624R295M255J287p627o057j2871o209M626
$$ 98926 86761 72936 56642 53280 61904 71199 75454 76741 69114 63057 50186 43977 48603
16193D8603R113j788l492j269n008n465j2084Q91J3849M76o883k97Q347j608k101
$$ 48603 57716 55928 52436 51167 46159 40694 28610 29501 43350 43826 36943 36646 44993 43385 41284
16178D1284j772R76O74Q255L5k3389r946J6360J0913q96n092q678r127l964R21
$$ 41284 39512 40488 41162 49417 49452 26063 16117 32477 43390 42494 37402 28724 19597 15633 16554
16163A6554n43Q851L272O431p733j2338n108K6835J5451L82n468J492J3675P90
$$ 16554 16011 24862 28134 34565 26832 14494 9386 36221 51672 52054 46586 48078 61753 62543
16149F2543k398j076j2872k621q109J683K518n677l44J808n382j1859j0590m22
$$ 62543 60145 59069 46197 43576 35467 37150 39668 33991 33647 35455 30073 18214 7624 7202
16135G202k520P833J0111j0348k2231j235Q092J2303P745J3234r125q679k975
$$ 7202 4682 12515 22626 12278 -9953 -11188 -3096 9207 16952 30186 21061 12382 9407
16122I407J1366O159p027p400j48J153L8L218o275j7820L483k712M687J7317J5252
$$ 9407 20773 26932 19905 12505 12357 13510 13548 16766 10491 -7329 -3846 -6558 -1871 15446 30698
16107C0698n13n888n165j994L15r465j1704M739K652J3180J2889l226j3672P2
$$ 30698 30185 24297 19132 17138 17453 7988 -3716 1023 3675 16855 29744 26518 12846 12918
16093A2918O962J277j9331m487N268j261l586Q549J2831K507k5772L477J0083
$$ 12918 19880 21157 1826 -2661 2607 1346 -2240 6309 19140 21647 -4125 -648 9435
16080I435m736J958P700k2809n662L675K304J5201J0963m17j0509n381P081o306
$$ 9435 4699 6657 14357 -8452 -14114 -10439 -8135 7066 18029 17612 7103 1722 8803 2497
16066B497j914J126n593m90k4039L691r12j2168P943k580k085J3631p718K112
$$ 2497 583 1709 -3884 -4374 -28413 -24722 -25634 -37802 -29859 -32439 -34524 -20893 -28611 -26499
16052b6499K2323j581r404Q890L934J5819J7151p364o106P103M26j325n198J1614
$$ -26499 -4176 -5757 -15161 -6271 -2337 13482 30633 23269 17163 24266 24692 23367 18169 29783
16038B9783j1768O899j1469j3985r615J5339M881j2127p01M072M413M645N286
$$ 29783 18015 24914 13445 -540 -10155 5184 10065 -2062 -2763 1309 5722 10367 15653
16025A5653j2929l218R653P284J589M332J461n565o981q080j1438m309K1183J1936
$$ 15653 2724 -494 9159 16443 18032 22364 23825 18260 11279 3199 -8239 -12548 8635 20571
16011B0571m894o834k721Q373K279p82J532j1312N722J184r103n70K852k161M898
$$ 20571 15677 8843 6122 14495 16774 15992 17524 6212 11934 13118 4015 3445 6297 4136 9034
15996I034o700P08J3218N498q977l580Q083J6j3823k3000p572J635O997P833l029
$$ 9034 2334 3042 16260 21758 12781 9201 17284 17300 3477 -19523 -27095 -25460 -18463 -10630 -13659
15981a3659l820J9202Q183o369J451m601J3815K443j0251o440M741O647j3330
$$ -13659 -17479 1723 9906 3537 4988 387 14202 16645 6394 -46 4695 11342 -1988
15968a988o428j1282o962M359K2688P715m921p87l965P261K467N371l230j6520
$$ -1988 -8416 -19698 -26660 -22301 387 8102 3181 2394 -1571 5690 8157 13528 10298 -6222
15954f222j3324p99J0868J5866L754m30j6136l766L707K419j691j6067o047N930
$$ -6222 -19546 -20345 -9477 6389 10143 9713 -6423 -10189 -6482 -4063 -5754 -21821 -27868 -21938
15940b1938j187j322J495P18R512J208j4578K726q755J0097P61Q961P056n33n824
$$ -21938 -23125 -24447 -22952 -22234 -12722 -11514 -26092 -23366 -32121 -22024 -21263 -12302 -5246 -5779 -11603
15925a1603o690N651l010r526p811L2603K3032j3630j7153j259l82l178N860l768
$$ -11603 -18293 -12642 -15652 -25178 -32989 -386 22646 9016 -8137 -9396 -9778 -12956 -7096 -10864
15911a0864N964O296n596J3210k667K161j167O153p057k761k63q649n500K522
$$ -10864 -4900 1396 -4200 9010 6343 8504 7337 13490 6433 3672 3409 -5240 -10740 -8218
15897h218j1401p66R088J4473K695J4228J0271p960l341j1825r002j3137l123
$$ -8218 -19619 -20385 -11297 3176 5871 20099 30370 22410 19069 7244 -1758 -14895 -18018
15884a8018K299J1005L120l333l847L176N637J2229P216r202j46m01p530l224
$$ -18018 -15719 -4714 -1594 -4927 -8774 -5598 39 12268 19484 10282 10136 9735 2205 -1019
15870a019J640J3242j292P41j1168p093j2228J2654J4974J3580K06L054R19o172
$$ -1019 621 13863 12571 13312 2144 -4949 -17177 -4523 10451 24031 24237 27291 28210 22038
15856B2038j0549L047o096k076j698O88k060r732R935q291J277R236k519m490
$$ 22038 11489 14536 8440 6364 4666 5354 3294 -6438 3497 -4794 -3517 5719 3200 -1290
15842a290Q885P186K815n041j8912j4223j1028k689P100K6493K141J003O992k908
$$ -1290 7595 14781 17596 12555 -6357 -20580 -31608 -34297 -27197 -704 1437 2440 9432 6524
15828F524l993p607m180J2548J482Q233j2108o958p018j3916n515N988N813K401
$$ 6524 2531 -5076 -9256 3292 4774 13007 899 -6059 -13077 -26993 -32508 -26520 -20707 -18306
15814a8306J747J012m520M292M922M042M677O573N241r865M156K273M429j117
$$ -18306 -16559 -15547 -20067 -15775 -10853 -6811 -2134 4439 9680 -185 3971 6244 10673 9556
15800I556K593n208j8431J759Q674n248J5852K6562O318l205K652K3289J2286
$$ 9556 12149 6941 -11490 -9731 -1057 -6305 9547 36109 42427 39222 41874 65163 77449
15787G7449M838O412O232O466p45J783K4719N5278O2661P2203P9277Q8027Q1763
$$ 77449 82287 88699 94931 101397 100652 102435 127154 182432 245093 317296 396573 484600 566363
15774E66363N6420L2386M915m8865q4095r6380q8805q2405n8340n3927l8830l3572
$$ 566363 622783 655169 660084 611219 527124 430744 341939 259534 201194 147267 108437 74865
15762G4865k1840j7866j6092j2696o812M029q44j2036p658O409n563N927L5j319
$$ 74865 53025 35159 19067 6371 -441 3588 2744 -9292 -16950 -10541 -16104 -10177 -10142 -11461
15748a1461j4198J94M518o38R25N639n00J0920k344j4722l734k469J0281l914
$$ -11461 -25659 -25465 -20947 -21585 -20660 -15021 -15521 -4601 -6945 -21667 -25401 -27870 -17589 -21503
15734b1503J317m510o489L301Q781J4682P322M288o310L398J3680J808o872p03
$$ -21503 -20186 -24696 -31185 -27884 -19103 -4421 2901 7189 879 4277 17957 19765 12893 12190
15720A2190M29N165P104q774m177n687r62n727L806J0324n5o76m690n215j1455
$$ 12190 12619 17784 24888 16114 11937 6250 5288 -439 3367 13691 13636 12960 8270 3055 -8400
15705h400j9981j748J4425J8220N148L779n704n63N716M281m256r717r124r585
$$ -8400 -28381 -30129 -15704 2516 7664 11443 5739 5176 10892 15173 10917 1200 -7924 -17509
15691a7509J1823m131m456J61L628P408L386n307r500J9063Q013K053p462o786
$$ -17509 -5686 -9817 -14273 -14112 -10484 -3076 310 -4997 -14497 4566 12579 14632 7170 384
15677C84n260J09J559J2585P609l803N518L335N861O77q796L430j488m383j4769
$$ 384 -4876 -4767 -3208 9377 16986 13183 18701 22036 27897 28574 19778 23208 21720 17337 2568
15662B568k735m120J067K702O264J2760j3129j9027j7049L299P149K998J3289
$$ 2568 -167 -4287 -3220 -518 5746 18506 5377 -13650 -30699 -27400 -20251 -17253 -3964
15649c964Q143Q705Q504P001L100r050j5666q597K678J0934J503j438p963k745
$$ -3964 4179 12884 21388 28389 31489 22439 6773 -1824 854 11788 13291 11853 3890 1145
15635A145o75J3693P829j396o827p487l150Q93M418J15k223J842o526k0043J583
$$ 1145 470 14163 21992 20596 13769 6282 3132 4025 8443 8558 6335 8177 1651 -18392 -16809
15620a6809O537j0761J0914J5004J7663k899j6907q209M06j0485o179O685J2918
$$ -16809 -10272 -21033 -10119 4885 22548 19649 2742 -5467 -5061 -15546 -21725 -15040 -2122
15607b122M376k772k643J6907J0431l226j0975J664L284p018J6190l135j9182
$$ -2122 2254 -518 -3161 13746 24177 20951 9976 11640 14924 7906 24096 20961 1779
15594A779l787r760J698J7522P472L800p615k166j2223j0029m12M232m748k908
$$ 1779 -2008 -11768 -10070 7452 14924 18724 11109 8943 -3280 -13309 -13721 -9489 -14237 -17145
15580a7145n670m066J3407R596J077m702o148N188o501n162j773k100J5099J2567
$$ -17145 -22815 -26881 -13474 -3878 -2801 -7503 -13651 -8463 -14964 -20126 -21899 -23999 -8900 3667
15566C667J1633J509m681j2551k834J390o391n16O964o025Q732P489J0931q037
$$ 3667 15300 16809 12128 -423 -3257 -1867 -8258 -8774 -1810 -7835 897 8386 19317 11280
15552A1280j2676n040j813k631O985K542O365J753L806k515J632Q761n590j8817
$$ 11280 -1396 -6436 -8249 -10880 -3895 -1353 5012 6765 10571 8056 9688 18449 12859 -5958
15538e958j0915R824j601P634M736j0968j980N198K7o650R702O892l694j8833
$$ -5958 -16873 -7049 -8650 -1016 3720 -7248 -9228 -4030 -4003 -10653 -951 5941 2247 -16586
15524a6586m500K204J611R053K558j1786K464J9924K819m918q772J4926N599q24
$$ -16586 -21086 -18882 -17271 -8218 -5660 -17446 -14982 4942 7761 2843 -5929 8997 14596 13772
15510A3772j0088J38j8581j0252Q485J3341O154m194N442K083j0679J898O883
$$ 13772 3684 3822 -14759 -25011 -16526 -3185 2969 -1225 4217 6300 -4379 -2481 4402
15497D402M292n136P785j1727l159N23K930P65L664J5048m592j7051L92r234j0206
$$ 4402 8694 3558 11343 -384 -3543 -3020 -90 675 4339 19387 14795 -2256 -1864 -11098 -21304
15482b1304Q72J4967L861N184J3074o94j2231r687K960j888n780J1308M396J344
$$ -21304 -20432 -5465 -1604 3580 16654 15960 3729 -5958 -2998 -4886 -10666 642 5038 6382
15468F382r929m089j0363j140J4734Q519j330l590R979O907j5988r593J275k079
$$ 6382 -3547 -7636 -17999 -19139 -4405 4114 2784 -806 9173 16080 92 -9501 -8226 -10305
15454a0305J6105L095J388k540j3296j1437Q382P616k654M959R205o57j2011r619
$$ -10305 5800 8895 10283 7743 -5553 -16990 -8608 -992 -3646 1313 10518 9861 -2150 -11769
15440a1769L413J215N588p985j842l909J3666J9272m425j047J024o260J824M964
$$ -11769 -8356 -7141 -1553 -9538 -11380 -15289 -1623 17649 13224 12177 13201 6941 8765 13729
15426A3729p524M407j0035o846J2174L033k142o036n168J4735Q818m520J664o414
$$ 13729 6205 10612 577 -6269 5905 8938 6796 760 -4408 10327 19145 14625 16289 9875
15412I875o698J439q111n844J1106N156R5o705m515M064K626J281J0749L637J186
$$ 9875 3177 4616 -3495 -9339 1767 6923 7018 313 -4202 -138 2488 3769 14518 18155 19341
15397A9341J0094p832m501m396o91m598J018O823m593l041j8550O066L792K801
$$ 19341 29435 21603 17102 12706 12015 7417 8435 15258 10665 7624 -10926 -4860 -1068 1733
15383A733L974j5112k693K1433p158j6019l785L357M39n772R483J3155P34j0004
$$ 1733 5707 -9405 -12098 9335 2177 -13842 -17627 -14270 -13831 -19603 -10120 3035 3769 -6235
15369f235p287p97R010L692L711K469o635K251m515J1069L293j17k16L462r935
$$ -6235 -13522 -14319 -5309 -1617 2094 4563 -2072 179 -4336 6733 10026 9909 9693 13155 3220
15354C220p109j343P542L517k190r257l782j655j368J0342J84j940l727m014l79
$$ 3220 -3889 -5232 2310 5827 3637 -5620 -9402 -11057 -12425 -2083 -1899 -3839 -7566 -11580 -11959
15339a1959K384O11o244o147J3989J671o222p018L244N698M284k277q063r791
$$ -11959 -9575 -8964 -15208 -21355 -7366 -5695 -11917 -18935 -15691 -9993 -5709 -7986 -16049 -25840
15325b5840j743R332J2955k220P647K670R217P814j0294l712l134P10J644j1374
$$ -25840 -27583 -18251 -5296 -7516 131 2801 12018 19832 9538 5826 2692 3402 5046 -6328
15311f328N637p08O506K786k490p114Q619j056r482J5102O753j2955j3628J481
$$ -6328 -691 -1399 5107 7893 5403 -1711 6908 5852 -3630 11472 18225 5270 -8358 -6877
15297f877o980l316P982o541n95P397O163J731J0685m475j1112J844L42j085J720
$$ -6877 -13857 -17173 -9191 -15732 -16327 -8930 -2767 -1036 9649 5174 -5938 -4094 -3752 -4837 -3117
15282c117p351o218Q352P889o618k447j598P573k705m87Q791j273j4437J1941
$$ -3117 -10468 -16686 -8334 -445 -7063 -9510 -11108 -3535 -6240 -6727 2064 791 -13646 -1705
15268a705J1484J0288o89J067o953j896J4944k540o275o459j9803J374p050j186
$$ -1705 9779 20067 19378 20445 13492 11596 26540 24000 17725 11266 -8537 -7163 -14213 -15399
15254a5399O970N892R549j1527j1915Q955Q114N383n429q717M01j154J1023Q646
$$ -15399 -8429 -2537 7012 -4515 -16430 -7475 639 6022 593 -8124 -7723 -8877 2146 10792
15240A0792M531J342j3064r092m925j2454J863J4702J4702l472L450p855j2187
$$ 10792 15323 16665 3601 -5491 -10416 -22870 -21007 -6305 8397 4925 8375 520 -11667
15227a1667L832J4240R284j3406K873Q438k104j3458j4420n437J1346N337M86
$$ -11667 -7835 6405 15689 2283 5156 13594 11490 -1968 -16388 -21825 -10479 -5142 -4656
15214d656q675l108O803K480n96K25N229K287k7L219M350q313n735N563K2291
$$ -4656 -13331 -16439 -9636 -7156 -7752 -7527 -2298 -11 -38 3181 7531 -782 -6517 -954 21337
15199B1337Q400j5085j2766k2469l006O01O055k0M987j57j658N502J0377Q239
$$ 21337 29737 14652 1886 -20583 -23589 -22988 -16933 -16953 -11966 -12123 -13781 -8279 2098 10337
15185A0337r045M52k1140J0893J6945J3202r600j4828j3051j3607p689M497J1416
$$ 10337 1292 1744 -19396 -8503 8442 21644 12044 -2784 -15835 -29442 -37131 -32634 -21218
15172b1218J0310k359O348O198j283N603q090k381J4041K480p692L402k901O606
$$ -21218 -10908 -13267 -6919 -721 -2004 3599 -4491 -6872 7169 9649 1957 5359 2458 9064
15158I064K586m170n882j6547n107N500J2562j0888k887J2561j222n205L458p29
$$ 9064 11650 7480 1598 -14949 -20056 -14556 -1994 -12882 -15769 -3208 -4430 -9635 -6177 -6906
15144f906l022j792J651k451M58l042r684L319R239R052P223j20o954k162j903
$$ -6906 -9928 -11720 -10069 -12520 -12062 -15104 -24788 -21469 -12230 -3178 4045 3925 -3029 -5191 -7094
15129g094M696K6802J4305k5373j4861j770j158N21Q750M729j648n504j6879k343
$$ -7094 -2398 24404 38709 13336 -1525 -3295 -4453 -3932 4818 9547 7899 2395 -14484 -16827
15115a6827r735r142O886J3133J2868j362O635O997j6653p815J14J3054q082O228
$$ -16827 -26562 -35704 -28818 -15685 -2817 -4179 2456 9453 -7200 -15015 -14901 -1847 -9929 -3701
15101c701N861J0855L829j1017qJ6481j1606o813R816R195K605j2357j1411p499
$$ -3701 2160 13015 16844 5827 5819 22300 10694 3881 13697 22892 25497 13140 1729 -5770
15087e770o94l472R833K81j6010j71J0466J635R033Q327m205p801o988q685M531
$$ -5770 -6464 -9936 -103 178 -15832 -16003 -5537 -3902 5131 13458 9253 1452 -5536 -14221 -9690
15072i690J9287M447j1872p000p463n1P891J0255n11o862k887n566o349q569j7216
$$ -9690 9597 14044 2172 -4828 -12291 -12342 -4451 5804 5293 -1569 -4456 -10022 -16371 -24940 -42156
15057d2156J3435K4529M278p13J380k241k959j5725p672R307N445J0744Q526K156
$$ -42156 -28721 -4192 86 -627 753 -1488 -4447 -20172 -27844 -18537 -13092 -2348 6178 8334
15043H334M1n370j7762L501l933j0028q09o249j822L354L703J3861j159J2131
$$ 8334 8375 3005 -14757 -11256 -15189 -25217 -26026 -32275 -34097 -30743 -27040 -13179 -14338 -2207
15029b207m74N061m741N23P696Q143o106n517P385Q463M451o525q746j2960j3928
$$ -2207 -2681 2380 -2361 -1838 5858 14001 7895 2378 9763 18226 22677 16152 7406 -5554 -19482
15014a9482n724J4177K825j6300r47L021R091Q996o672o943K319m042N305J4933
$$ -19482 -25206 -11029 -8204 -24504 -25451 -22430 -13339 -4343 -11015 -17958 -15639 -19681 -14376 557
15000E57l813J881L120p18Q886Q921J26L201q605j5127k558J0796m278r84j425
$$ 557 -3256 -1375 1745 1027 9913 18834 18960 22161 13556 -1571 -4129 6667 2389 1405 -20
14985b0j152k783Q370K451n682p653J0416j2305J0271J4563l006P767P856J796
$$ -20 -1172 -3955 4415 6866 1184 -6469 3947 -8358 1913 16476 13470 21237 29093 30889
14971C0889L959l678K131j2348L199o117j557q069j6553p716J4959K436p28n364
$$ 30889 34848 31170 33301 20953 24152 18035 16478 8409 -8144 -15860 -901 1535 807 -4557
14957d557J019L293N841o813r164J259K155o113k43J667r221j523J5573N586o107
$$ -4557 -3538 -245 5596 -1217 -10381 -9122 -6967 -13080 -13323 -11656 -20877 -22400 -6827 -1241 -7348
14942g348l697P209P380l955j9878k031l82L252Q779l294L19R286N746p134k0939
$$ -7348 -11045 -3836 3544 -411 -20289 -22320 -22702 -19450 -10671 -13965 -13646 -4360 1386 -5748 -26687
14927b6687j0276J4125M363R893M847k1547J1684J2376J7823Q219j1541l596M838
$$ -26687 -36963 -22838 -18475 -8582 -3735 -25282 -13598 -1222 16601 24820 13279 9683 14521
14914A4521K2J533r582j3566m986R15L558P887N155p030j468K801j892m204m013
$$ 14521 14543 16076 6494 -7072 -12058 -11143 -7585 302 5457 -1573 -3041 -240 -2132 -6336 -10349
14899a0349M471P425K0800J1039j3126j3491Q825J0458Q613J343N953j1436j0006
$$ -10349 -5878 1547 22347 33386 20260 6769 15594 26052 34665 36008 41961 30525 20519
14886B0519j485Q770J3571k062j9413r275l106N745K269k862j4561N227m776J0789
$$ 20519 19034 27804 41375 39313 19900 10625 7519 13264 15533 12671 -1890 3337 -1439 9350
14872I350j5118j011J3090R277J890r055L520M780j957q296r934j669J2025K875
$$ 9350 -5768 -6779 6311 15588 17478 8423 11943 16723 14766 6470 -3464 -5133 6892 9767
14858I767j4154j750J3557r79j2852j2003R176K2003L240m183n132m114K641p688
$$ 9767 -4387 -6137 7420 6441 -6411 -18414 -9238 12765 16005 11822 6690 2576 5217 -2471
14844b471r84J3251L566p269j3063K706R762K629M760j2194m573l70K664j953
$$ -2471 -3455 9796 13362 6093 -6970 -4264 5498 8127 12887 693 -3880 -4250 -1586 -3539
14830c539J4165Q269m66j3482n54p89n802P198L081O791m672k301l151o451L717
$$ -3539 10626 18895 18429 4947 4393 3604 -2198 5000 8081 14872 10200 7899 4748 -1703 2014
14815B014L367J1121L162j3151j2544m555j115J4841O00J0242N635Q731L392o42
$$ 2014 5381 16502 19664 6513 -6031 -10586 -11701 3140 3740 13982 19617 28348 31740 31098
14801C1098J2914M456j3449j491j4562j6410r192O362N742k562N434k134r060
$$ 31098 44012 48468 35019 33528 18966 2556 -6636 -274 5468 2906 8340 6206 -2854
14788b854l405m459j372P442o291j023k199M231J4848J179m590k49j050P567o154
$$ -2854 -6259 -10718 -12090 -4648 -10939 -11962 -14161 -9930 4918 6097 1507 1258 208 7775 1621
14773A621r847O655n342q036R507Q796R730j2078m871j826k801o544J9508J1518
$$ 1621 -8226 -1571 -6913 -14949 -5442 3354 13084 1006 -3865 -5691 -8492 -15036 4472 15990
14759A5990P758M579l629j1286m307k146J95O373K0233J0372m991n523q802j6459
$$ 15990 23748 28327 24698 13412 9105 6959 7154 13527 33760 44132 39141 33618 24816 8357
14745H357q194m226J591J6503n654r620O506K213J2623J4477P864J0190R822Q912
$$ 8357 163 -4063 -2472 14031 8377 -1243 5263 7476 20099 34576 42440 52630 62452 71364
14731G1364J7328L0949O5030J00353J29637J41382J23289O8022K4371k347l6261
$$ 71364 88692 119641 184671 285024 414661 556043 679332 747354 771725 769378 733117
14720G33117q0195j33340j25946j14023r5872n7619k1622j9012o963j7089j4477
$$ 733117 652922 519582 393636 279613 183741 126122 104500 85488 78525 61436 46959
14709D6959J615n017k209o413j4365n767K265J0583k281J643Q502j1988j2158
$$ 46959 48574 43557 41348 34935 20570 14803 17068 27651 25370 27013 35515 23527 11369
14696A1369R05j0325j0225K823P588k002l42k39m895L260k340K717l381P099P090
$$ 11369 12274 1949 -8276 -5453 2135 133 -209 -448 -5343 -2083 -4423 -1706 -5087 2012 9102
14681I102j392L955M098L632o912j4237n827j034K947n710K621J5093q05q533
$$ 9102 7710 11665 15763 19395 12483 -1754 -7581 -8615 -5668 -11378 -8757 6336 5531 -3002
14667c002j732k170M332N650q210n90J971L589p396j6665k561R159l522J8349
$$ -3002 -4734 -6904 -2572 3078 -5132 -5722 -3751 -162 -7558 -24223 -26784 -17625 -21147 -2798
14653b798R652o029K422J5896M789r914L809n205p425R380J1068j336j9694j4285
$$ -2798 6854 825 3247 19143 23932 14018 17827 12622 5197 14577 25645 24309 4615 -9670
14639i670j2855K600J9315R259m853l073J1353p699j6478J031l069q19N693J7236
$$ -9670 -22525 -19925 -610 8649 3796 723 12076 4377 -12101 -11070 -14139 -14958 -9265 7971
14625G971l736j2210p30k361O291J1407r59R56m26J56m196p62m642j4867o05Q900
$$ 7971 4235 -7975 -8705 -11066 -4775 6632 5673 6629 6203 6359 2163 1401 -3241 -18108 -18713 -9813
14609i813O465J838k036l637R796J6808J0884p130J812j4774j8998p691J0658
$$ -9813 -3348 -1510 -3546 -7183 2613 19421 30305 23175 24987 10213 -8785 -16476 -5818
14596e818R341M224O94J0702J5614J200l2729k3562J1203j955j388J1479M112
$$ -5818 3523 7747 8441 19143 34757 35957 3228 -20334 -9131 -11086 -12474 -995 3117
14583C117r357j717N306J995l321P934j1238R10R731K056Q31J0802L39o747j7145
$$ 3117 -6240 -7957 -2651 -656 -3977 3957 -7281 -6371 3360 5416 6247 17049 17388 10641 -6504
14568f504p063k233N555J1261J1371K372J6494P020P080N498J2718J606Q11j872
$$ -6504 -13567 -15800 -10245 1016 12387 14759 31253 38273 45353 50851 63569 65175 65986 64114
14554F4114P114l005l957o465n580k965j1569q561j4463r068k371J8483O29k2145
$$ 64114 71228 68223 64266 57801 52221 49256 37687 29126 14663 5595 3224 21707 22336 191
14540A91q351J0677O173k715K227N22k200m102r504O266J0710O870M708j9113
$$ 191 -8160 2517 8690 5975 8202 8724 6524 2422 -7082 -816 9894 16764 21472 2359
14526B359q670l197j1439L130N898M212L11M934J5112K751K132M355j5945r256
$$ 2359 -6311 -9508 -20947 -17817 -11919 -7707 -7396 -2462 12650 15401 17533 21888 5943 -3313
14512c313L701K463N309n746q930R874N268K461r119k126j7049M347K2235O652
$$ -3313 388 2851 8160 2414 -6516 3358 8626 11087 1968 -158 -17207 -12860 9375 16027
14498A6027L377j6118q109N05j869N050L246M367q898j1584n795j2326J3102J8223
$$ 16027 19404 3286 -4823 -4318 -6187 -1137 2109 6476 -2422 -14006 -19801 -32127 -19025 -802
14484h02J0089P187p668j9194q139O119J1198K746o952l585m054J4342O400j962
$$ -802 9287 16474 8806 -10388 -18527 -12408 -1210 1536 -5416 -9001 -13055 1287 7687 5725
14470E725m330Q86J7528o35j2583r110J0102P178k013o832Q182K066k580j438
$$ 5725 1395 2281 19809 19174 6591 -2519 7583 14761 12748 5916 14098 16164 13584 12146
14456A2146j337o624L248J459q236j3044j2731n966O769J3122J1030j799J833
$$ 12146 10809 4185 7433 8892 656 -12388 -25119 -31085 -24316 -11194 -164 -1963 -130
14443a30N151N808N171R44O339P50n089p431l725L404R007j867j1212N764j2139
$$ -130 5021 10829 16000 16944 23283 24033 18944 11513 7788 11192 20199 18332 7120 12884 745
14428G45p328j379M916Q279K402j4959k475J6355J4032L409n692j9170n082O084
$$ 745 -6583 -7962 -3046 5233 7635 -7324 -9799 6556 20588 23997 18305 -865 -5947 137
14414A37K046R030O405k007r060R609K295j8043p667L971J3842j187r225q113
$$ 137 2183 11213 17618 15611 6551 16160 18455 412 -7255 -3284 10558 9371 146 -7967
14400g967l023l044J3979J0441K693R272K107o907k197m199j3030L39L98j2579
$$ -7967 -10990 -14034 -55 10386 13079 22351 24458 17551 15354 11155 -1875 -1536 -1138 -13717
14386a3717j3252J446R738N955J5984k389j8322k571K2331K374j0625j0184N96
$$ -13717 -26969 -25523 -15785 -9830 6154 3765 -14557 -17128 5203 7577 -3048 -13232 -12636
14373a2636P466p519O373R393r525N465J0369k265p173p350N438O142J0160N921
$$ -12636 -5170 -12689 -6316 3077 -6448 -983 9386 7121 -52 -7402 -1964 4178 14338 20259
14359B0259n690j3645Q384K1453L518O848k0236j7914Q257m470o778l745r042
$$ 20259 14569 924 9308 30761 34279 41127 20891 2977 11234 6764 -14 -3759 -12801
14346a2801L36O698P021j346M616j3726j22J3439P171n302n922J799M702N385
$$ -12801 -12465 -5767 1254 -92 4524 -9202 -9324 4115 11286 5984 62 1861 6563 11948
14332A1948K668k2472O073J244K292n430O258j6130l69J1045M699P593m297K112
$$ 11948 14616 -7856 -1783 -539 1753 -3677 2581 -13549 -13918 -2873 1826 9419 5122 7234
14318G234M896J0594O573r39j1352k995l63L220j230j2285j049l458J257P82j320
$$ 7234 12130 22724 29297 28358 17006 14011 13648 16868 15638 3353 2304 -1154 103 885 -435
14303d35n261P01J1932R316L882j2416j8160m373J0749M558J338K852O5O850Q009
$$ -435 -5696 -4995 6937 16253 20135 7719 -10441 -14814 -4065 493 1831 4683 4748 11598 19607
14288A9607n065j3221L679r43M769r251l888J0725O189n648l423q982P48Q501
$$ 19607 14542 1321 5000 4057 8826 -425 -4313 6412 12601 6953 3530 -5452 -4704 3797
14274C797l569J580O27j1082J265M197o763m440L0J1045j567L09j915j395n044
$$ 3797 228 1808 2435 -8647 -7382 -3185 -9948 -14388 -14358 -3313 -4880 -4571 -6486 -7881 -12925
14259a2925j4826O026J2853n597J274N426j166k51q10O014J947J022N40r386O010
$$ -12925 -27751 -21725 -8872 -14469 -13195 -7769 -8935 -9186 -9996 -3982 -2035 -1013 -473 -9859 -3849
14244c849J2602j157j1257p763J376R164J3999J0790o133p316M954o797P773N234
$$ -3849 8753 7596 -3661 -11424 -10048 -884 13115 23905 17772 10456 15410 8613 16386 21620
14230B1620j1533j166P327l184q060J6097J1472J29J201j0018r017j1476j2905
$$ 21620 10087 8921 16248 13064 5004 21101 32573 32702 33903 23885 14868 3392 -9513
14217i513J6248J1094j2104j1366J0472K783j5930L070J3217Q36n708k448J1623
$$ -9513 6735 17829 5725 -5641 4831 7614 -8316 -5246 7971 8807 3099 651 12274
14204A2274L129j3593K66p158m578O670J3897J4989M77m445n793p87n626o23q179
$$ 12274 15403 1810 2076 -5082 -9660 -2990 10907 25896 26373 21928 16135 15348 9722 9099 920
14189I20O316J3335Q014k323m351q567N973J0193K402O86J1316o108Q47J4196
$$ 920 7236 20571 28585 26262 21911 13344 19317 29510 31912 32598 43914 37806 38653 52849
14175E2849J2539o453j4547j4850k843p01N720L098L783K356p560q113J095K526
$$ 52849 65388 58935 44388 29538 26695 25994 31714 34812 38595 40951 33391 25278 26373 28899
14161B8899N89L525k93j0787N728k370O288j629k469j0876J546J5155J4944Q414
$$ 28899 29488 33013 32720 21933 27661 25291 31579 29950 27481 16605 18151 33306 48250 56664
14147E6664o413q874N843N54O033p245O425N506o040P342J0522P133j638l514
$$ 56664 50251 41377 47220 47774 53807 46562 52987 58493 52453 59795 70317 77450 75812 72298
14133G2298M021J6316J7989J2613J988o671J4896k416J4378J3764J7449J5015
$$ 72298 76319 92635 110624 123237 125225 118554 133450 131034 145412 159176 176625 191640
14121A91640J8216L5074M1953L9552L8435M1293O4529P1923P2942J02846J19615
$$ 191640 209856 244930 286883 326435 364870 406163 470692 542615 615557 718403 838018
14110H38018J65064K07181K95323M34580O55894R68431J344141J605703J459376
$$ 838018 1003082 1210263 1505586 1940166 2596060 3564491 4908632 6514335 7973711
14101G973711Q76572L55045K49230M36697K72238m32163j127684j441989j446749
$$ 7973711 8850283 9205328 9454558 9891255 10163493 9731330 8603646 7161657 5714908
14092E714908j316748j061349p91409n69145l79238k71241j89841j71683j43084
$$ 5714908 4398160 3336811 2545402 1976257 1597019 1325778 1135937 964254 821170
14083H21170r9660q8292p0711n6907m8779n2717o0832m3230l8287j4349k7601
$$ 821170 721510 633218 562507 505600 456821 404104 343272 300042 261755 247406 219805
14072B19805j5701j6776k3491j2755k0276j8054m16n514j0984k387j9772j2931
$$ 219805 204104 187328 163837 151082 130806 112752 112336 106822 95838 93451 73679 60748
14060F0748j791J436K106J0117J1852j609J5107m892j4282m369l424j12m784o396
$$ 60748 58957 60393 62499 72616 84468 82859 97966 93074 78792 74423 70999 70887 66103 59707
14046E9707j710O870M181m538O171j783o104M2K708k999J659r074l483n1M146
$$ 59707 57997 64867 69048 64510 70681 68898 62794 62836 65544 62545 64204 55130 51647 51596 55742
14031E5742N043k498j941k439J770L044m375q872m274P226O583m75J3920K036
$$ 55742 60785 58287 56346 53907 55677 58721 54346 45474 41200 48426 55009 54534 68454 70490
14017G0490j3233r494j0239l6L105N618L581q006m492m603O087j2995r299K746
$$ 70490 57257 47763 37524 37488 40593 46211 49792 41786 37294 32691 38778 25783 16484 19230
14003A9230k192l541K206L716K879k853q249J0017K3155K539k087r106j4089J6459
$$ 19230 17038 13497 15703 19419 22298 19445 11196 21213 44368 46907 44820 35714 21625 38084
13989C8084p81q506Q445N567j0634j5149n098l338o789J329n458K681m79J3914
$$ 38084 37303 28797 37242 42809 32175 17026 11928 8590 1801 3130 -2328 353 -126 13788
13975A3788J0708M34J2064k843Q65r570m61r68K577L126N491L99m260j0672R619
$$ 13788 24496 24930 36994 34151 35016 25446 24985 24017 26594 29720 35211 35610 31350 20678 30297
13960C0297k06o759L100P037j624N004J1309R38r878r192n110N409M789q279N342
$$ 30297 30091 23332 26432 33469 31845 36849 48158 49096 39218 30026 24916 30325 35114 26835 32177
13945C2177j0911n64m560k672o622j017J5603K340q713n612n481J0788k822M262
$$ 32177 21266 20702 16142 13470 6848 5831 21434 23774 15061 9449 3968 14756 11934 16196
13931A6196L640L021J6149K515K357j6304m644J0994j08R825O694K632j4719l900
$$ 16196 19836 22857 39006 41521 43878 27574 22930 33924 33816 43641 50335 52967 38248 34348
13917C4348l418L44m633j8370k2431k1228N040J4426o495m300K1284P956p1J0927
$$ 34348 30930 31274 26641 8271 -14160 -35388 -30348 -15922 -22417 -26717 -5433 2523 2452 13379
13903A3379J0715J638N95o957K002P466j5823j8564j233J9842P29j1458P592J0840
$$ 13379 24094 25732 26327 19370 21372 28838 13015 -5549 -6782 13060 13789 2331 9923 20763
13889B0763Q980N34l963l522K577M190m680k399P033k699j3596k323k237l290
$$ 20763 29743 30277 26314 22792 25369 29559 24879 22480 29513 26814 13218 10895 8658 5368
13875E368L39J694J7594K2620l352q836Q29L447k367K2669O2997M6717K1903J9809
$$ 5368 5707 7401 24995 47615 44263 35427 36256 39703 37336 60005 123002 169719 191622 211431
13861B11431J9203N062j9743l2136k5665k9338l4000k3508L115J8883J7430O461
$$ 211431 230634 235696 215953 183817 158152 128814 94814 71306 74421 93304 110734 117195
13849A17195K0077L3939L6070M4224O1069L7839J7716j5209o8693p2904n7119
$$ 117195 137272 171211 207281 251505 312574 350413 368129 352920 284227 211323 154204
13838A54204l4250k7527j1606j8748R0k999N780k882n765j4861n725J2846M433
$$ 154204 119954 92427 80821 62073 62163 59164 64944 62062 56297 41436 35711 48557 52990
13825E2990L303k973k781j1878r958L815M257m418n81L870q575r648o869N348
$$ 52990 56293 53320 50539 38661 28703 32518 36775 32357 31776 35646 27071 17423 10554 15902
13811A5902N023l812p866K255L508n067r918L197N415J6723R036M439j2325J3940
$$ 15902 20925 17113 9247 11502 15010 9943 25 3222 8637 25360 34396 38835 26510 40450
13797D0450J1060j469J4156O790q606j406K566j6844j1265L84K496o415p955Q833
$$ 40450 51510 50041 64197 70987 62381 60975 63541 46697 35432 35816 38312 31897 23942 32775
13783C2775k455j157l304L553r60P863J2618K788l562l604r747J2170j766q091
$$ 32775 30320 29163 25859 29412 28452 36315 48933 51721 48159 44555 34808 46978 45212 37121
13769C7121j2267P369k683j5103r933k1574j6458n203J3053M4386L7420K3612
$$ 37121 24854 32223 29540 14437 4504 -17070 -33528 -38731 -25678 18708 56128 79740
13757G9740K5283m353p300k041M253K737n706j2015j0146M960J1795m035J858
$$ 79740 105023 100670 93370 91329 95582 98319 92613 80598 70452 75412 87207 83172 85030
13744H5030J682l492P579L666J6060O755j534P234j7384p199m26P277l733K97
$$ 85030 86712 83220 90799 94465 110525 117280 115746 122980 105596 98397 97971 105248 101515 101812
13730A01812J0222n669K080L948Q446P72j4120m766J3469K810O00J330j7558m930
$$ 101812 112034 106365 108445 112393 120839 121611 107491 102725 116194 119004 119604 120934 103376 98446
13716I8446k391Q412k421O067K0295K2420p571q964K306N667r759m327j125O813
$$ 98446 96055 104467 102046 108113 128408 150828 143257 134293 136599 142266 132507 128180 127055 133868
13702A33868L35M987J0479J4783K1359m342O783J6006O606O296L758K85Q906P354
$$ 133868 134203 139190 149669 164452 185811 181469 188252 204258 210864 217160 220918 221203 230109 237463
13688B37463j696k840o383O081R522N046J0059J3015O60j9007o418o122n518J409
$$ 237463 235767 232927 226544 232625 242147 247193 257252 270267 270927 251920 245502 239380 233862 235271
13674B35271k221J0795J1229P596J2871L123O533K4968L8915m29L058L1359K9098
$$ 235271 233050 243845 255074 262670 275541 278664 285197 310165 349080 348651 351709 383068 412166
13661D12166K8010L5589P5494Q9454Q8301P1949M4649L4082L9917l2029o6896
$$ 412166 440176 475765 551259 640713 729014 800963 845612 879694 919611 887582 820686
13650H20686o5454k6713M470J7761M0575N9946N1835L8052L0502M2869L6144K3887
$$ 820686 755232 728519 732989 750750 791325 851271 903106 941158 971660 1014529 1050673 1074560
13638A074560L4680P6027J13202J42767J54788J97592K45264K85428L20489L48292
$$ 1074560 1109240 1185267 1298469 1441236 1596024 1793616 2038880 2324308 2644797 2993089
13628B993089L81052M59217N71939P18612R35823J125852J115819J156414J505195
$$ 2993089 3374141 3833358 4405297 5123909 6059732 7185584 8301403 9457817 10963012
13619A0963012J937023K281398K917564M406624P144772J1634767J9134439L2022518
$$ 10963012 12900035 15181433 18098997 22505621 29650393 41285160 60419599 92442117
13611I2442117N2194553O7208889M8681766J5236798O486829L566987k2095956
$$ 92442117 144636670 211845559 260527325 275764123 282250952 285817939 263721983
13604B63721983m9610176n8011527n0840419l3899778j9537423j1675592p666040
$$ 263721983 214111807 156100280 105259861 71360083 51822660 40147068 32481028
13597C2481028n463276m216737l411506k865568k470682j996824j559818j373115
$$ 32481028 27017752 22801015 19389509 16523941 14053259 12056435 10496617 9123502
13589I123502j276860j132072r33336p09702n61584m23712l14789k56014k20818
$$ 9123502 7846642 6714570 5781234 5071532 4509948 4086236 3771447 3515433 3294615
13580C294615k13027j89665j87170j91418j94943j84231j78492j73561j40061
$$ 3294615 3081588 2891923 2704753 2513335 2318392 2134161 1955669 1782108 1642047
13571A642047j22279j06732o6222l5579n0301r3213j02184p1999n9651q7538p1990
$$ 1642047 1519768 1413036 1346814 1311235 1260934 1167721 1065537 993538 933887 846349 774359
13560G74359o1219m1996j7354N274n709j4734j0667q984O182K870k0028k9958
$$ 774359 713140 671144 653790 659064 653355 638621 627954 618970 625152 628022 607994 578036
13548E78036k7837j5916k0648n448J3326j4750k5436K94p388k1391p426K2519
$$ 578036 550199 534283 513635 508187 521513 506763 481327 481621 474233 452842 445416 467935
13536D67935J7727K7475q658m1175l8944m1901k7596k7938j7706k0296l1825j6438
$$ 467935 485662 513137 504479 463304 424360 382459 354863 326925 309219 288923 257098 240660
13524B40660j042n973j4802j519N105o894J0179O446M659N433J0276N865j6351
$$ 240660 239618 233645 218843 217324 222429 215535 225714 232160 236819 242252 252528 258393 242042
13511B42042j5584j1722l431J2699M343j1564n893j3145O041O127J4544Q702o803
$$ 242042 226458 214736 211305 224004 228347 216783 210890 197745 203786 209913 224457 233159 226356
13498B26356n279Q025m828J5394J9743M6130P9730Q0013K1604l3050p4765p5166
$$ 226356 221077 229102 224274 239668 259411 305541 385271 465284 486888 453838 379073 303907
13486C03907m6811m3468j5408J6787K1661M539O27j7250k1267j9193j6343k0254
$$ 303907 257096 213628 198220 215007 236668 241207 241834 224584 203317 184124 167781 147527
13474A47527j745p941j4788P929n153j1143Q157O41J167j363q129n962j3503j6110
$$ 147527 145782 137841 123053 130982 125829 114686 122843 123484 124651 123288 115159 109197 95694 79584
13460G9584j2986L571K94R744J0752J8042K1775K8660L5820J0326J6690L830J4731
$$ 79584 66598 70169 70463 80207 90959 109001 130776 159436 195256 205582 222272 226102 240833
13447B40833L9186K8355j2523l5969n4733l8668l4597p852k575J8136K9124N5468
$$ 240833 280019 308374 295851 259882 205149 166481 131884 124032 121457 139593 168717 224185
13435B24185P3026J18681J13434p128j4510Q462L7410o2727r7325j09214q8013
$$ 224185 297211 415892 529326 522198 507688 516150 553560 490833 393508 284294 196281
13424A96281m2706l3421k3729k8870j5865J902j213r036L976J7150J3077Q769
$$ 196281 153575 120154 96425 67555 51690 53592 52379 43343 47319 64469 77546 86315
13412H6315O785m619J614M972R761J5720o339j9701L065q722j0546J0511P906
$$ 86315 93100 88481 90095 95067 104828 120548 114209 94508 97573 88851 78305 88816 96722
13399I6722l340k992j3777j6834j4596j6048P121J1574k683o33Q749P119J894
$$ 96722 93382 90390 76613 59779 45183 29135 36256 47830 45147 44514 53263 60382 62276
13386F2276j166j189l145j3096j0460j882L521L270N295L663o433p100Q984q479
$$ 62276 61110 59921 56776 43680 33220 31338 34859 38129 43424 47087 40654 33554 42538 34059
13372C4059p846P497q93L926J503M096j7916k820M549K807L455J2298J1487m562
$$ 34059 26213 33710 32817 36743 38246 42342 24426 21606 26155 28962 32417 44715 56202 51640
13358E1640N207P399J805J4243M362j0244o956j3796j0741J1321M462p366j586
$$ 51640 56847 64246 66051 80294 84656 74412 67456 53660 42919 54240 58702 51336 49750
13345D9750j0912L123J0359n983j2001J3800m09k501R201N099O149n495j4289
$$ 49750 38838 41961 52320 46337 34336 48136 47727 45226 54427 59526 65675 60180 45891
13332D5891k8828P28j0091M520P042N655K332P399j628j849N528j755k537j1648
$$ 45891 17063 17791 7700 12220 19262 24917 27249 34648 33020 31171 36699 34944 32407 20759
13318B0759P494Q207M378p712j0738j3259Q88J1298Q117J0726J3593r228j5193
$$ 20759 28253 36460 40838 33126 22388 9129 10017 21315 29432 40158 53751 44523 29330
13305B9330K4246L0452k985j4811o197M475j5895j9425j1650O24J5446k020k658
$$ 29330 53576 84028 81043 66232 60035 64510 48615 29190 17540 18164 33610 31590 28932
13292B8932O118L281j4114q308m355L556j18R740j0322r249k683O921l667M735
$$ 28932 35050 38331 24217 15909 11554 15110 14992 24732 14410 5161 2478 9399 5732 10467
13278A0467O301J454p836Q860P126Q310Q537J961r319o457j0744K142J2124J1158
$$ 10467 16768 18222 10386 19246 26372 34682 43219 45180 35861 29404 18660 20802 32926 44084
13264D4084r09l917j1245j402P979J2624L763k060r925r034j4698P08J012j150
$$ 44084 43175 39258 28013 26611 34590 47214 50977 48917 38992 29958 15260 15968 16980 15830
13250A5830k057o091k324P861K169l455j7059K418k591P297J0563m294Q953J0966
$$ 15830 13773 7682 5358 13219 15388 11933 -5126 -2708 -5299 1998 12561 8267 17220 28186
13236B8186l040l95n094j3447k056N280J5740P046K386L059j041j0309j806M767
$$ 28186 25146 24751 19657 6210 4154 9434 25174 32220 34606 37665 36624 26315 24509 29276
13222B9276K400j0525j3064P930n696M653J5310J1939j271n891p706R9j3927j5521
$$ 29276 31676 21151 8087 16017 10321 14974 30284 42223 40952 35061 27355 27454 13527 -1994
13208a994O92l838O212O447j0617n978N840K452j563O069R129J0009k247J1710
$$ -1994 -1302 -5140 1072 7519 -3098 -9076 -3236 -784 -2347 3722 12851 22860 20613 32323
13194C2323J851o783J2841J034n650O877k501N024n971m990j4233l804o018o431
$$ 32323 34174 27391 40232 41266 35616 42493 39992 45016 39045 34055 19822 16018 10000 3569
13180C569J07m593r574n983l209k2N242Q347O222k778J0133J2562q850j281J0703
$$ 3569 3676 -917 -10491 -16474 -19683 -19705 -14463 -6116 106 -2672 7461 20023 11173 9892 20595
13165B0595K423o282k484L134M255J2345n832m596j967n213l022M200J2381K3983
$$ 20595 23018 16736 14252 17386 21641 33986 28154 23558 21591 16378 13356 17556 29937 53920
13151E3920J4377l704k5730k652J3066o892k2281k295j459O703l286k542J4047
$$ 53920 68297 64593 38863 36211 49277 42385 20104 17809 16350 23053 19767 17225 31272
13138C1272qp702l733k22P784L129p18N391P51K366J2240L361J1300N267J1726
$$ 31272 31264 23562 19829 19607 27391 30520 29802 35193 35944 38310 50550 53911 65211 70478 82204
13123H2204J5353J9190L1312N0297P8007R7482J81301K91135L40475K33427Q9696
$$ 82204 97557 116747 148059 198356 276363 373845 555146 846281 1186756 1420183 1509879
13112A509879M1438R078j49886k88054l10348k49098j84683r6829o1595l2525
$$ 1509879 1551317 1560395 1410509 1122455 812107 563009 378326 281497 219902 187377
13102A87377l2383k2413l4471k0470l639r917K281q018o700n84m728k0141j1965
$$ 187377 154994 132581 98110 77640 74001 64084 66365 58347 51647 51063 46335 26194 14229
13089A4229J2944Q64o716l492M375K481k783O73O103o527m174o122j86l57l290
$$ 14229 27173 28037 21321 17829 22204 24685 21902 22575 28678 22151 17977 11855 11669 11312 8022
13074H022n980j6337P431J2020j2329r578P063J4459R248J718M104r628Q790j2315
$$ 8022 2042 -14295 -6864 5156 -7173 -16751 -9688 4771 14019 15737 19841 10213 19003 6688
13060F688k7983o457M065j148J734K60j199M090J0308J1279L560j1470Q66K3800
$$ 6688 -21295 -27752 -23687 -24835 -23101 -22841 -24040 -19950 -9642 1637 5197 -6273 -5407 18393
13046A8393n489n873k763r810P451Q077M825r001J92p944n36r37p336j020L794
$$ 18393 12904 7031 4268 -5542 1909 9986 14811 5810 6002 -1942 -2478 -3415 -10751 -11771 -7977
13031g977J0578M935k322m573j691l845P15j0041J69J2937J3264P650r060j2828
$$ -7977 2601 7536 5214 641 -1050 -4895 -4180 -14221 -14052 -1115 12149 19799 10739 -2089
13017b089R90J533J0307l050k181n86J2585P045Q469m841O14M88l273j7649m182
$$ -2089 -1099 434 10741 7691 5510 4924 17509 24554 33023 28182 28796 29284 26011 8362 4180
13002D180J079k614k81l129j1688J1916J0772q800l210J0419O652M863q331j1479
$$ 4180 5259 2645 2364 -765 -12453 -537 10235 1435 -1775 8644 15296 20159 11828 349
12988C49k857R634L413m016M324M784p483j9302M517P972R623P375M130O840n276
$$ 349 -2508 7126 10539 6523 10847 15631 8148 -11154 -6637 1335 10958 18333 22463 29303 24027
12973B4027J703k3210r962l0K15n363N301Q06M666k801P036K335r685o501r717
$$ 24027 25730 2520 -7442 -7472 -7257 -12620 -7319 -6513 -1847 -4648 2388 4723 -4962 -11463 -21180
12958b1180N181J1693l976j5417L731K5976R815j1731j240l072m141J5018J0647
$$ -21180 -15999 -4306 -8282 -23699 -19968 6008 15823 4092 2852 -220 -4361 10657 21304
12945B1304l798J118m865j032l014r67P214r807n256r31l654j3752J626Q733l737
$$ 21304 17506 18624 13759 12727 9713 8746 15960 6153 897 -34 -3688 -17440 -15814 -7081 -10818
12930a0818n758j944J268K0497J3305N683J937k338n302p764j0639J177J2311
$$ -10818 -16576 -18520 -17252 3245 16550 22233 24170 21832 16530 8766 -1873 -696 11615
12917A1615k555J67j1082J455J3942N117n445j0707j913K133m191p650l590O402
$$ 11615 9060 9227 -1855 -400 13542 18659 13214 2507 594 2727 -1464 -9114 -12704 -6302
12903f302J2724o98P78P550R465J543j6637j4703p67k658n717P800N212R019l605
$$ -6302 6422 5724 6502 14052 23517 25060 8423 -6280 -7047 -9705 -15422 -7622 -2410 6609 3004
12888C004J1101K645j1286m299n297Q459Q14o997n060m001J234K9460L889m131
$$ 3004 14105 16750 5464 1165 -4132 4327 5141 -1856 -6916 -10917 -9683 19777 23666 19535
12874A9535P820j1467j9796O515K419L575n364K763J0831j722j1128j0111k6980
$$ 19535 27355 15888 -3908 2607 5026 8601 3237 6000 16831 15109 3981 -6130 -33110
12861c3110P082L3615P076o345l688O981j126J10j0031r784J222N367n470j3000
$$ -33110 -26028 7587 14663 8318 4630 11611 10485 10595 564 -9220 -7998 -2631 -8101 -21101
12847b1101N805J0713N713j2475n185K2704Q511j7968j2058q376L060k518J6390
$$ -21101 -15296 -4583 1130 -11345 -16530 6174 14685 -3283 -15341 -23717 -20657 -23175 -6785
12834f785O906L780K811L753J581j5670n363p122k496P643J8340J0755j194j1406
$$ -6785 121 3901 6712 10465 12046 -3624 -8987 -16109 -18605 -10962 7378 18133 16939 5533
12820E533j3624L406k223r752j484J8138J2547L918J1147j4651j306R343q56Q15
$$ 5533 -8091 -4685 -6908 -16660 -18144 -6 12541 16459 27606 12955 11649 20992 20136 20951
12806B0951j5974p70r445o944J8036r78n56J1470o836o529m015p24k066J0972
$$ 20951 4977 4207 -5238 -12182 5854 4876 4320 15790 8954 2425 -1590 -2314 -4380 6592
12792F592r18J017o650j0266L62Q071J3809m23j1783o957m099M147Q584r222o707
$$ 6592 5674 6691 41 -10225 -9863 -1792 12017 11594 -189 -7146 -11245 -7098 1486 -7736 -14443
12777a4443o509N006j155l761J0885P37j670l987O702J039J1424o00O594j844
$$ -14443 -20952 -15946 -17101 -20862 -9977 -9240 -10910 -14897 -8195 -7156 4268 3668 10262 8418
12763H418L312k255K31p445j2252j7301N972J8863J120O784q14l374M237j108
$$ 8418 11730 9475 9706 2261 -9991 -27292 -21320 -2457 -1337 5447 4633 1259 5496 4388
12749D388p465Q918N033k3760j1831j107P186M961m743L001l567k502R763p1k564
$$ 4388 -3077 5841 10874 -12886 -24717 -25824 -18638 -13677 -18420 -15419 -18986 -21488 -11725 -11796 -14360
12734a4360J195N186j345o729O094Q712K36R668J9881L480j8153q250m395r033
$$ -14360 -13165 -7979 -9324 -16053 -9959 -1247 -1011 8657 28538 32018 13865 5615 1220 -7813
12720g813j369m409L711J731j0275J209J207p560P311M784o086j1262l71J0451
$$ -7813 -9182 -13591 -9880 -8149 -18424 -17215 -16008 -23568 -16257 -11473 -17559 -28821 -29192 -18741
12706a8741L876N16J4020J479O022k536l838n079L430j5468O271p827p839M221
$$ -18741 -14865 -14349 -329 1150 7172 4636 798 -4281 -851 -16319 -10048 -17875 -25714 -21493
12692b1493P344o216l074M499J4401P343N371j380R58j2535o443j3222j8534J0846
$$ -21493 -14149 -20365 -23439 -18940 -4539 2804 8175 6795 7753 -4782 -11225 -24447 -42981 -32135
12678c2135Q743J075M116M078j103m231Q89J613M596J3402q745j1856M020N655
$$ -32135 -23392 -22317 -18201 -14123 -15226 -19457 -18568 -16955 -12359 1043 -7702 -19558 -15538 -9883
12664i883k443K544R784K643O226p98M66M129o416K999K525j382j636j0767j2025
$$ -9883 -12326 -9782 2 2645 8871 8073 8539 12668 6252 9251 11776 10394 8758 -2009 -14034
12649a4034O066m058R346L801k250q528J634q678P345J0356M890j7588k112j1754
$$ -14034 -7968 -12026 -2680 1121 -1129 -9657 -8023 -16701 -9356 1000 5890 -11698 -13810 -25564
12635b5564R428J0323j999M264Q747Q943j1922r828P285J4490J746n178R326K763
$$ -25564 -16136 -5813 -7812 -3548 5199 14142 2220 -7608 -323 14167 15913 10735 20061 22824
12621B2824J463j5762K018O934j500n767m225O911P527J0130m199j8375m673p123
$$ 22824 24287 8525 10543 17477 15977 10210 5985 12896 20423 30553 26354 7979 3306 -3817
12607c817o849o140J5681o015n890N316n08m002J1477m828n172M388n132r403
$$ -3817 -10666 -16806 -1125 -7140 -13030 -7714 -8222 -12224 -747 -5575 -10747 -6359 -11491 -20894
12593b0894o80O47M084Q585L159j0229k566q951K870J1423Q32Q236R22j397N328
$$ -20894 -21574 -20927 -16843 -8258 -5099 -15328 -17894 -26845 -23975 -12552 -11720 -3484 -2562 -3959 1369
12578A369L109o335l932n457j737Q591J0268K818O57n650J0960J2571j0094j9536
$$ 1369 4478 -1857 -5789 -11246 -12983 -4392 5876 8694 9351 3701 14661 27232 17138 -2398
12564b398p359o053R707J4468J0703j1789p035L603r892J7368Q303k1944j0262
$$ -2398 -9757 -15810 -6103 8365 19068 7279 244 3847 -6045 11323 19626 -2318 -12580
12551a2580O326M485K290J898k113N204k267O784j430k802L765J116K679k610
$$ -12580 -6254 -1769 521 2419 306 5510 3243 10027 8597 5795 9560 10676 13355 10745
12537A0745N032n085L620J131p408k301n588Q19L402N122o796o257k668o226o206
$$ 10745 15777 10692 14312 15443 8035 5734 146 965 4367 9489 2693 -3564 -6232 -12458 -18664
12522a8664M543k878p43J5911L696m943M897P456j1315j3234O667m17o87N642
$$ -18664 -14121 -16999 -17742 -1831 1865 -3078 1819 9275 -2040 -15274 -8607 -9024 -9711 -4069
12508d069Q62M095L015j3698K487L568k248Q244l90j153n356P67K698m66l684
$$ -4069 -3207 888 3903 -9795 -7308 -3740 -5988 2256 1866 713 -4643 -3876 -1178 -1644 -5328
12493e328j1299n772P445J6437L308o664j281j3165k3072k497O03J8005K2103
$$ -5328 -16627 -22399 -14954 1483 4791 -1873 -3154 -16319 -39391 -41888 -41285 -23280 -1177
12480a177L056j047K554j2599r024M574J3415J632K402q55j2179N951m36J139
$$ -1177 1879 832 3386 -9213 -18237 -13663 -248 1384 3786 2931 -9248 -3297 -3733 -2594
12466b594m852J0070J386j5914M490o227k118J3107J95J1187J2331r544j4733
$$ -2594 -7446 2624 4010 -11904 -7414 -13641 -15759 -2652 -2457 8730 21061 11517 -3216
12453c216m339n469j0786J1235R977p813j3461J2590K3227P87j1570p215j5143
$$ -3216 -7555 -13024 -23810 -12575 -2598 -10411 -23872 -11282 11945 12732 1162 -6053 -21196
12440b1196l409O710M25N181J2396K0674k636j5342j9277N892Q728l620M51J5557
$$ -21196 -24605 -17895 -17470 -12289 107 20781 18145 2803 -16474 -10582 -1854 -5474 -5023 10534
12426A0534P17J888M174j348j0863j3112k22n225l576J1835k45m749L807J3947
$$ 10534 11251 13139 17313 15965 5102 -8010 -8232 -13457 -17033 -5198 -5443 -10192 -6385 7562
12412G562Q472q234q267j28r026l04N263R88k411j3783L339O609J1291k157M501
$$ 7562 16034 7800 -467 -595 -9621 -9925 -4662 -3674 -6085 -19868 -16529 -9920 1371 -786 3715
12397C715Q40L365J2446j1729r915K299k152j3240r132M678J352L190P879P043
$$ 3715 4555 7920 20366 8637 -1278 1021 -1131 -14371 -23503 -18825 -17473 -14283 -6404 639
12383F39r908L627m905M657r45J395k592m143j361O067l309j3143m252K681k212
$$ 639 -9269 -5642 -10547 -5890 -6835 -5440 -8032 -12175 -13536 -7469 -10778 -23921 -28173 -25492 -27704
12368b7704J3390J395j559l796n512l168P445J8293J2469r305k0506j568J4506
$$ -27704 -14314 -12919 -14478 -18274 -23786 -26954 -19509 -1216 11253 1948 -18558 -20126 -5620
12355e620J0587n720j8269j325J0125q466p474Q959L813J1613J1920P758k509
$$ -5620 4967 -753 -19022 -20347 -10222 -18688 -26162 -17203 -13390 -1777 10143 17901 15392
12342A5392m997p842M527J585m669k161j37j2409j0594K572K809O204j419J5253
$$ 15392 10395 2553 7080 8665 3996 1835 1698 -10711 -21305 -18733 -15924 -9720 -11139 4114
12328D114m27j085q461j8025p828P955J512m326R362N446j7836J1299K279q812
$$ 4114 3687 2602 -5859 -23884 -31712 -23757 -22245 -26571 -17209 -11763 -29599 -18300 -16021 -24833
12314b4833j216J0345L793j194J537m754n397j8459J0307J2501P189l248j3727
$$ -24833 -26049 -15704 -11911 -13105 -11568 -16322 -21719 -40178 -29871 -17370 -10181 -13429 -27156
12301b7156J687O344J7251P011m743j0189q436J0576L718P354N790O450j5414
$$ -27156 -25469 -19125 -1874 5137 394 -9795 -18231 -7655 -3937 3417 9207 15657 243
12288B43j099q445J408L179n13j397K450J3070j411K294L898q893p159n907J335
$$ 243 -856 -9301 -7893 -4714 -5227 -6624 -4174 8896 7485 9779 13677 4784 -2375 -8282 -6947
12273f947J0808P546j1489q402j8564o210K391R441J3871J7810O246L557J872
$$ -6947 3861 11407 -82 -8484 -27048 -33258 -30867 -21426 -7555 10255 16501 20058 21930
12260B1930M722j2243n794p890j2320J1327j946l038n721L546K096j366K97q52
$$ 21930 26652 14409 8615 725 -11595 -268 -2214 -5252 -10973 -7427 -5331 -6697 -6400 -7252
12246g252J1327O874k07p473q20J9094K490j0137o185l907l692k117q250M065
$$ -7252 4075 10949 10742 3269 2449 21543 24033 13896 7711 3804 112 -2005 -10255 -6190
12232f190k713o182O199P90O118M481O846K092o80j451K687k64J2127J5163j1598
$$ -6190 -8903 -15085 -8886 -8096 -1978 2503 9349 11441 10761 9310 11997 11733 23860 39023 27425
12217B7425j8315j253K854o573M215L457N927N492O205o047j5670q769l782j087
$$ 27425 9110 7857 10711 4138 8353 11810 17737 23229 29434 23387 7717 -1052 -4834 -5921
12203e921l641Q533j3231Q22K251p987p562P000J0926J8704J2100j2492j2655
$$ -5921 -9562 -1029 -14260 -13438 -11187 -19174 -26736 -19736 -8810 9894 21994 9502 -3153
12190c153p319Q39R021P382l857J1015L447l521n858j174J130J2903n812j251
$$ -3153 -10472 -9633 -612 6770 2913 13928 17375 13854 7996 6822 7952 20855 15043 13792
12176A3792M969k197K623N895q332L367R840o900j1847M343K632j0094o917J634
$$ 13792 18761 16564 19187 25082 16750 20117 29957 23057 11210 15553 18185 8091 1174 2808
12162B808m348L246J4024R289o506l729r525l581Q379J5841j4235j4325j515L633
$$ 2808 -1540 1706 15730 25019 18513 14784 5259 1678 10057 25898 11663 -2662 -4177 -544
12148e44J5566L585K948j8730J776J2302J8925q958j4115l447K385N527l325L721
$$ -544 15022 18607 21555 2825 4601 16903 35828 26870 12755 9308 11693 17220 13895 17616
12134A7616N186j5326j5845k79l02n856m987R970k374P317m558q933N250Q066
$$ 17616 22802 7476 -8369 -8648 -8950 -14806 -19793 -9823 -12197 -4880 -9438 -18371 -13121 -5055
12120e055K99K499L676J1998p601j2900R182k712p504Q731J0811j6400j42K4188
$$ -5055 -4756 -2257 1419 13417 5816 -7084 2098 -614 -8118 613 11424 -4976 -5118 19070
12106A9070P119o148O866L178p952j8964j2813p474R370L550l74J1605l687Q350
$$ 19070 26189 20041 26907 30085 22133 3169 -9644 -17118 -7748 -4198 -4572 7033 3346 11696
12092A1696J2477q646k1396p594M933j065L164J289J208K566K661J7716k677j5858
$$ 11696 24173 15527 -5869 -13463 -8530 -9595 -6431 -5142 -3934 -1368 1293 19009 16332 474
12078D74l477J7283R718k407p74j0549l232M409M870o356m760j0497k562O892
$$ 474 -3003 14280 23998 21591 20817 10268 7036 11445 16315 9959 5199 -5298 -7860 -968
12064i68O113l688p017K596o374M029J2733p679O086M367l611k505l784p463m641
$$ -968 5145 1457 -5560 -2964 -9338 -5309 7424 -255 5831 10198 6587 4082 298 -7165 -11806
12049a1806n284J0762J3984N87l946J3314J0764m767l121M36J2559j948j6999
$$ -11806 -17090 -6328 7656 8243 4297 17611 28375 23608 20487 20923 33482 31534 14535
12036A4535r565P298J1962k149J436p749o084M531j015J884p607p022l07r523
$$ 14535 4970 12268 24230 22081 23517 15768 9684 14215 13200 15084 7477 455 148 -9375
12022i375m490Q455L552N174j512J067K735L81q550n895R12J2117L57j1926o13
$$ -9375 -13865 -5410 -1858 3316 1804 2871 5606 5987 -2563 -8458 -7546 4571 4928 -6998 -7611
12007g611J0174p393K526J3109P76J2046n68M980P376j1026n150n967r843J532
$$ -7611 2563 -4830 -2304 10805 11581 23627 23059 28039 35415 24389 19239 13272 3429 4961
11993D961m75M749L57j6333m728J0115M83l504M773L366q962J711M21N257k739
$$ 4961 4486 9235 9592 -6741 -11469 -1354 -871 -4375 398 3764 -5198 -3487 -3066 2191 -548
11978e48n059j4831O543l143j195P752O518k69K500J2427J2518j5326k0712m836
$$ -548 -5607 -20438 -13895 -17038 -18233 -10481 -3963 -4232 -1732 10695 23213 7887 -12825 -17661
11964a7661J4365N627o783n934Q057J5292J1521K0833J021L154p71q652p050l752
$$ -17661 -3296 2331 -4452 -10386 -2329 12963 24484 45317 46338 49492 48721 40069 33019 29267
11950B9267j1209p302R011q29n951k413L317O143o40N606j2604r490l176P979
$$ 29267 18058 10756 19767 18938 12987 10574 13891 20034 19394 25000 12396 2906 -270 7709
11936G709M070Q1l550J5226l108j6437j6765K002J2224M404j4723m514j752j328
$$ 7709 11779 11860 8310 23536 20428 3991 -12774 -10772 1452 5856 -8867 -13381 -15133 -16461
11922a6461M581M705j066N48N631j935l350O030J1876L909P441J3426L2Q913q161
$$ -16461 -11880 -7175 -8241 -7693 -2062 -3997 -7347 -1317 10559 14468 21909 35335 35367 44280 36119
11907C6119j5678j6293n968K741l990j382J8678n867j1414m020l334J7297j0769
$$ 36119 20441 4148 -1820 921 -3069 -4451 14227 8360 -3054 -7074 -10408 6889 -3880
11894c880P146Q300k2096j1925K606L881q895J1844K5575P304K065J2865m141
$$ -3880 3266 11566 -10530 -22455 -19849 -15968 -24863 -13019 12556 19860 21925 34790 30649
11881C0649j6599p495j0933n642Q338J0494K769o134k628j0889j6318n889J5103
$$ 30649 14050 6555 -4378 -10020 -1682 8812 11581 5447 2819 -8070 -24388 -30277 -15174
11868a5174K0050J808R543R800N094M165k871j1561j8340L965L400O607P629j560
$$ -15174 4876 6684 16227 26027 31121 35286 32415 20854 2514 6479 9879 16486 24115 22555
11854B2555j2002k2603R749O077n371p950r018J3603J4565J778j689P611r058
$$ 22555 10553 -12050 -2301 3776 -1595 -9545 -18563 -4960 9605 11383 9694 17305 8247
11841H247j2565p872Q988P190N265J0808r570M26j1244J768P783Q773m326r649
$$ 8247 -4318 -12190 -3202 3988 9253 20061 10491 10917 -327 1441 9224 17997 13671 4022
11827D022P110p139K043M318o983K972J7992j212M628P236J1212J608n939j6955
$$ 4022 11132 3993 6036 10354 3371 6343 24335 23123 27751 34987 46199 47807 41868 24913
11813B4913n691K065j4837j5189k511K31J2290M790K941O870q98k26M645j4194
$$ 24913 19222 21287 6450 -8739 -11250 -11019 1271 6061 9002 15872 14974 14748 19393 5199
11799E199k247Q086k579p560R529O736r127j4052k004K824J0242L052q938j006
$$ 5199 2952 11038 8459 899 10428 17164 8037 -6015 -8019 -5195 5047 8099 -839 -1845
11785a845n697k083q32J07M949p42J0710J1253p43j9809N766K2917j098J92j048
$$ -1845 -7542 -9625 -10457 -10350 -5401 -6143 4567 15820 15077 -4732 1034 23951 22853 23045 21997
11770B1997M669J7976N223j2015j2199j4454j5717J4191k865j3918k425J003k161
$$ 21997 26666 44642 49865 37850 25651 11197 -4520 9671 6806 -7112 -9537 -8534 -10695
11757a0695J1182J4588j0550j6780r636M150J0485j729p459p147J1129L719k914
$$ -10695 487 15075 4525 -12255 -21891 -17741 -7256 -8985 -16444 -23591 -12462 -8743 -11657
11744a1657J1770J3162J2479m809r896N657m779q684M930Q701R00N353K609j1243
$$ -11657 113 13275 25754 20945 11049 16706 11927 3243 8173 16874 17774 23127 25736 14493
11730A4493j1207Q113K5175P662j0645k519M882J527p486k4241q865N051Q023
$$ 14493 3286 11399 36574 44236 33591 31072 35954 37481 29995 5754 -3111 1940 9963
11717I963N982j7583J404Q675j0215Q593N413J388K282j1009j2198J1870K710
$$ 9963 15945 -1638 -234 8441 -1774 6819 12232 13620 15902 4893 -7305 4565 7275
11704G275m566p713j0105o658N382l372R474n429k096O557R467P010j286p363
$$ 7275 2709 -5004 -15109 -21767 -16385 -19757 -10283 -15712 -17808 -11251 -1784 5226 3940 -3423
11690c423P40J5349q020j8587L758J620j1287P296J3061M414n057j2456P175M019
$$ -3423 -2683 12666 4646 -13941 -10183 -8563 -19850 -12554 507 4921 -136 -12592 -5417 -1398
11676a398K642J992J3638Q046K685j9629j808J069j0423p114q15p280J888m851
$$ -1398 1244 3236 16874 24920 27605 7976 6168 7237 -3186 -10300 -11115 -18395 -16507 -21358
11662b1358n949P394O458p467j038J516m38r575n926n018J6062N913K971K127
$$ -21358 -27307 -19913 -13455 -20922 -21960 -20444 -20882 -30457 -36383 -41401 -25339 -19426 -16455 -14328
11648a4328J31Q564J5600J0715j0642k917J28p006K237J646N77M978j5791q685
$$ -14328 -14197 -5633 9967 20682 10040 7123 7251 245 2482 4128 4705 9683 -6108 -14793
11634a4793M570M582K651k893J264k193l558J0298p137L15L430J3893Q123N313
$$ -14793 -10223 -5641 -2990 -5883 -4619 -6812 -10370 -72 -7209 -6894 -3464 10429 18552 23865
11620B3865r406j6351J591L331O088m860j1029J0964j068p07j6465K2L723K109
$$ 23865 14459 -1892 -301 3030 9118 4258 -6771 4193 3125 2418 -14047 -14025 -10302 -8193
11606h193j2572O338O790j4558n81k304J917J4546P557J3048j0480j2228m936
$$ -8193 -20765 -14427 -7637 -22195 -22776 -25080 -23163 -8617 -1060 11988 1508 -10720 -15656
11593a5656R889Q271O880j1582q761P637O476p389k129J3518J4810j841l949q382
$$ -15656 -5767 2504 9384 -2198 -10959 -3322 3154 -4235 -6364 7154 21964 20123 16174 7792
11579G792k704q902q360o020M728J3308k354m741J0139j435j2089O736J531J216
$$ 7792 5088 -3814 -12174 -18194 -13466 -158 -2512 -7253 2886 1451 -10638 -3902 -2371 -1155
11565a155L490j484M906q172j4442L719p66j0759K130K557R631K0307j0837j1069
$$ -1155 2335 851 5757 -2415 -16857 -13138 -13904 -24663 -22533 -19976 -10345 9962 -875 -11944
11551a1944N790k154j9324N552p362m979R161P486k106k233J0296R274J217J1067
$$ -11944 -6154 -8308 -27632 -22080 -29442 -34421 -25260 -17774 -19880 -22113 -11817 -2543 -1326 9741
11537I741j0033j3123m222J4277k172P509P829q971J1733J3328j881k350q058
$$ 9741 -292 -13415 -17637 -3360 -5532 1977 9806 835 12568 25896 24015 21665 13607
11524A3607j2288n461R452M967l807P498L024o669k73J734Q56P566k018P857j8232
$$ 13607 1319 -4142 5310 10277 6470 13968 16992 10323 10050 11784 12640 20206 18188 26045 7813
11509G813r283j1161O634K759m678N049M237R398M614o551j288k181j185j0221
$$ 7813 -1470 -12631 -5997 -3238 -7916 -2867 1370 10768 15382 8831 7543 5362 4177 -6044
11495f044p95J3518q205j1013J0499J9868r464p674Q922K889L214N806m053j5076
$$ -6044 -6839 6679 -1526 -12539 -2040 17828 8364 690 9612 12501 15715 21521 17468 2392
11481B392k9k182j319o207o719J721L049q7r143l510L623N542L749j0786q302
$$ 2392 2363 181 -1138 -7345 -14064 -12343 -9294 -9381 -18524 -22034 -18411 -12869 -9120 -19906 -28208
11466b8208Q229M476M214o994j246j148P938R913J6041M160n593j0514O929J9173
$$ -28208 -19979 -15503 -11289 -18283 -19529 -20677 -12739 -2826 13215 17375 11782 1268 8197 27370
11452B7370L11j2518p985R62L197L587k429l197O52P60o728J2332n40M482P468
$$ 27370 27681 15163 7178 8140 11337 14924 12495 9298 9950 10710 3982 16314 15774 20256 27724
11437B7724r579L314p863j6199J514l236K508O900J5668R074j1765Q293r443l938
$$ 27724 18145 21459 13596 -2603 -1089 -4325 -1817 5083 20751 29825 18060 26353 16910 12972
11423A2972K271J6942j776n944J9839k285L206N193J1446r81J5185K0497K448
$$ 12972 15243 32185 30409 24465 44304 42019 45225 50418 61864 60883 76068 96565 99013
11410I9013J784k0286k2033q774J076j7062j6544j1707n805J1614l284j2690K464
$$ 99013 100797 80511 58478 49704 50780 33718 17174 5467 -338 11276 7992 -4698 -2234
11397b234K496P297P677r625j0064J8154J5308l777J0052n441k4054n180O314
$$ -2234 262 7559 15236 5611 -4453 13701 29009 25232 35284 29843 5789 609 6923
11384F923L995m530k650m079M589J1508M986L845J6126j2353k3887j0097J9640
$$ 6923 10918 6388 3738 -341 4248 15756 20742 24587 40713 28360 4473 -5624 14016
11371A4016M815j8423j504k524N924P459k399Q525J3386O673m264j029o253r257
$$ 14016 18831 408 -1096 -3620 2304 9763 7364 15889 29275 35948 31684 30655 24402 15145
11357A5145P123Q225m887m054l228J2560J0992K0313J2133K4095K8377J4362L5529
$$ 15145 22268 30493 25606 21552 18324 30884 41876 62189 74322 98417 126794 141156 176685
11344A76685O247k0028j3725j0567k3186k0189k2111k5054r376q513j7567q199
$$ 176685 182932 162904 149179 138612 115426 95237 73126 48072 38696 30183 12616 4417
11332D417j2024l872N594P382N700q095m740j3075J4732M992N192n568n407L034
$$ 4417 -7607 -11479 -5885 1497 7197 -898 -5638 -18713 -3981 1011 6203 635 -4772 -1738
11318a738O383j7501p081M698j421p277m005P324K2742J167m096O392j674j4553
$$ -1738 4645 -12856 -19937 -15239 -16660 -23937 -27942 -20618 2124 3291 -805 5587 3913 -10640
11304a0640m050j0086J0122J0984O981m868j0984j962J5892O24l759K766J451
$$ -10640 -14690 -24776 -14654 -3670 3311 -1557 -12541 -14503 1389 2013 -1746 1020 2471
11291B471N239n264L409k490m368k853K882m49p238j4251m450P162J5121J1057
$$ 2471 7710 2446 5855 3365 -1003 -3856 -974 -1423 -8661 -22912 -27362 -20200 -5079 5978
11277E978M200N232j1355j0627j112Q088J0691k860O083o535k085k289j4080N251
$$ 5978 10178 15410 4055 -6572 -7684 404 11095 8235 14318 7783 5698 3409 -10671 -5420
11263e420N885j384q30K009r4j919K419O781P78L580q76l986n295N011j922M384
$$ -5420 465 -919 -1749 260 166 -1753 666 7447 8225 11805 10929 6943 1648 6659 4737 9121
11247I121j1513j878m992M206K417K97Q89K317m326j930j143n573j0856mL025
$$ 9121 -2392 -4270 -9262 -5056 -2639 -2342 -1453 864 -3462 -5392 -6535 -12108 -22964 -22968 -19943
11232a9943O536K537l02O967k738l534j516l218R730K736R98Q223k450J1307j2571
$$ -19943 -13407 -10870 -11172 -4205 -6943 -10477 -11993 -15211 -5481 -2745 -1747 6476 4026 15333 2762
11217B762j4977J4024k36K87L9O564o498J58J7622M600j244j745M974R066p900
$$ 2762 -12215 1809 1573 1860 1899 8463 1965 2123 19745 24345 23101 21356 26330 35396 27496
11202B7496j4988p745m642M53m616M843M078J353P278j5877j129R102O023R386
$$ 27496 12508 4763 121 574 -4042 801 4879 6232 13510 -2367 -3496 5606 11629 21015
11188B1015p636m160J7193J1452J177j2957N68L421j306j2547j2479j604J908
$$ 21015 13379 9219 26412 37864 39041 26084 26652 30073 28767 16220 3741 2137 4045
11175D045k475l432k755J151j0251l915O494J3025j967k242m005M053J5964M154
$$ 4045 1570 -1862 -4617 -3466 -13717 -17632 -11138 1887 -80 -2322 -6327 -2274 13690 17844
11161A7844m655M479o700n127m045q558n885K511J512N401O809K648q818k2511
$$ 17844 13189 17668 10968 5841 1796 -6762 -12647 -10136 -8624 -3223 3586 6234 -2584 -25095
11147b5095o589K1410K0251J1659L880j3076n280j413O562o452j952Q132q71m075
$$ -25095 -31684 -10274 9977 21636 25516 12440 7160 5747 12309 5857 3905 12037 11166 7091
11133G091R339n555P489j7433n342r18k805M620O247J1380k397l425m000J4676
$$ 7091 16430 10875 18364 931 -4411 -5329 -8134 -3514 2733 14113 11716 8291 4291 18967
11119A8967N332j535J1572j4814k843l042k50N046N186k116p42R914q147M950
$$ 18967 24299 22764 34336 19522 16679 13637 13387 18433 23619 21503 20761 30675 22528 27478
11105B7478J0693j0589n655O43M950j591J319l73O165k552q044l830J0879M29
$$ 27478 38171 27582 21927 22570 27520 25929 27248 26875 33040 30488 22444 18614 29493 29922
11091B9922j157j4342k4296j0940J5871J544M520O58j5906j583J9716R165r1l822
$$ 29922 28765 14423 -9873 -20813 -4942 -3398 1122 1780 -14126 -15709 4007 13172 13081 9259
11077I259j3655l36O388o796J390L270m108j017m36p350J515J0067j5874q932
$$ 9259 -4396 -4732 1656 -5140 -3750 -480 -4588 -5605 -6041 -13391 -11876 -1809 -17683 -26615
11063b6615J1234J4486N192J5042n197M550l329r145J042M391L735p453M321K740
$$ -26615 -15381 -895 4297 19339 14142 18692 15363 6218 7260 11651 15386 7933 12254 14994
11049A4994m99L761j0504J279j524k82K510j648m985j397R176J872o201j1784
$$ 14994 14495 18256 7752 9031 7507 7225 9735 8087 3102 1705 10881 12753 6552 -5232
11035e232O721O095l218j3516J0272R154J405J327m88j873j736R137N564J775
$$ -5232 1489 7584 4366 -9150 1122 10276 11681 13008 12520 10647 8911 18048 23612 25387
11021B5387P677P831k0646j9989n532R40P566R987j3979M041O128k164N07K066
$$ 25387 33064 40895 20249 260 -5272 -4332 3234 13221 -758 3283 9411 7247 7754 9820
11007I820p473P913P013k009l991L04j39K757r009M513l209L216r203K682K7423
$$ 9820 2347 10260 17273 15264 11273 11577 11438 14195 5186 9699 6490 9706 503 3185 30608
10992C0608J0404L9548L5890q054k0876k6856r800q6q453j7891n520Rn294M454
$$ 30608 41012 80560 116450 108396 87520 60664 50864 50778 42325 24434 18914 18923 13629 18083
10978A8083k933m736O323P199J587n771j817n182P910k810N91j580N908P442O870
$$ 18083 15150 10414 16737 23936 25523 19752 17935 12753 20663 17853 18444 16864 22772 30214 37084
10963C7084k5656j0588J4191J6298L652k672K389j5784p940j0812J3676K10n984
$$ 37084 11428 840 15031 31329 34981 32309 34698 18914 10974 162 13838 14048 8064
10950H064q24K782q625J548L93l186P346O366Q120m631j6596P055P851J698Q17
$$ 8064 7240 10022 1397 2945 3338 152 7498 13864 21984 17353 757 7812 15663 17361 18178
10935A8178l155K581r230P238K2571L877r344J910m640j0625o094K607J1910M843
$$ 18178 15023 17604 8374 15612 38183 42060 32716 34626 29986 19361 13267 15874 27784 32627
10921C2627P460N335j6152j4881k460N365J8998L297l690J7317Q228J6075K5520
$$ 32627 40087 45422 29270 14389 11929 17294 36292 39589 35899 53216 61444 77519 103039
10908A03039M0185O1069M5400J3502O911j5644l7043l6555l7629l5240k7269j5497
$$ 103039 143224 204293 249693 263195 270106 254462 217419 180864 143235 107995 80726 65229
10896F5229p697p256j0926m01L447q271j4639L992J1679m038J367J656L811j0725
$$ 65229 57532 50276 39350 38949 42396 34125 19486 23478 35157 31119 32486 34142 37953 27228
10882B7228N159J6226m003p508L899J1046J2918J6194K2860J2012o276j0098j3938
$$ 27228 32387 48613 44610 37102 41001 52047 64965 81159 104019 116031 109755 99657 85719
10869H5719k9469n478k253j3979Q6O228k742n713L749Q316j977j1111q775p662
$$ 85719 56250 50772 48519 34540 34626 40854 38112 32399 36148 44464 42487 31376 22601 14939
10855A4939o222Q780N885Q69J189J3961L682j2013j799L164M301N315J090o723
$$ 14939 8717 17497 23382 24251 25440 39401 43083 31070 29271 32435 36736 42051 43141 36418
10841C6418k662k2623J1450J9434P056N84j2988j5601o370r363m15Q339K52K408
$$ 36418 33756 11133 22583 42017 49073 49657 36669 21068 14698 5335 4920 13259 13511 15919
10827A5919k549o71J3118K0677j1566p44O562O848J970K83j1489k1130O723J1828
$$ 15919 13370 12699 25817 46494 34928 34184 40746 47594 49564 49847 38358 17228 23951 35779
10813C5779n497N696r381j1611L452K5929N610j3203Q891m307R280m484k893K854
$$ 35779 30282 35978 26597 14986 18438 44367 49977 36774 45665 41358 50638 46154 43261 46115
10799D6115j1405n191N968k4k071j8848k627j571m509j0068J2782K3185Q179J1910
$$ 46115 34710 29519 35487 35463 33392 14544 11917 10346 5837 -4231 8551 31736 39915 51825
10785E1825m379k0773j4731o678o718P234J1448J2037J483r866N47M133M20l467
$$ 51825 47446 26673 11942 5264 -1454 5780 17228 29265 30748 20882 21429 25562 25982 22515
10771B2515j461p22K834N067k505o251M123r499l27p407p356p272m833Q833L228
$$ 22515 21054 20332 23166 28233 25728 19477 23600 14101 13774 6367 -989 -8261 -13094 -4261 -1033
10756a033J2130O081O660Q725j0019j45O600P797j6710l432J0072J9769J4323
$$ -1033 11097 17178 23838 32563 22544 22399 28999 36796 20086 16654 26726 46495 60818
10743F0818j708o972j0435j374k463j289R451p084n653q10k011L379r64q241j2465
$$ 60818 59110 52138 41703 40329 37866 36577 46028 38944 33291 32481 30470 33849 32885 24644 12179
10728A2179L792Q201p339K898m167J371m223j071j4686k812O38J5581P541L885
$$ 12179 15971 24172 16833 19731 15564 16935 12712 11641 -3045 -5857 -5219 10362 17903 21788
10714B1788j1159o387K463J0347K793J457k197m620O16n672M737O255K341q140
$$ 21788 10629 4242 6705 17052 19845 21302 19105 14485 15101 9429 14166 20421 22762 14622
10700A4622j539J5331J4616J4043K732O2j495j3595l0782k5588r62J4707J3115
$$ 14622 13083 28414 43030 57073 59805 59867 58372 44777 13995 -11593 -12555 2152 15267
10687A5267o359J0424J4133N023l26R848l903K445J5947J3374R308j636r926j4758
$$ 15267 8908 19332 33465 38488 38162 48010 44107 46552 62499 75873 85181 83545 73619 58861
10673E8861l690k204J1664M686R795J3091l498p039k1148J608J9341O943k778
$$ 58861 55171 52967 64631 69317 79112 92203 88705 81666 60518 62126 81467 88410 85632
10660H5632M431J0119M177P508O498k319M049R700J1908K5297J9834K7036M0621
$$ 85632 90063 100182 104359 111867 118365 116046 120095 129795 141703 167000 186834 213870 254491
10647B54491M4490O4257J08181J68885K46235L81538N75393O38721M27529R5239
$$ 254491 298981 363238 471419 640304 886539 1268077 1843470 2482191 2909720 3004959
10637C004959l40537o17111n98116m62477k92181j63651j03358o8689m8884l9347
$$ 3004959 2664422 2047311 1449195 986718 694537 530886 427528 358839 309955 270608
10627B70608n2238l8019j7219r355j3846j0020L733j4147r972Q217m224j0314
$$ 270608 218370 180351 163132 153777 139931 129911 133644 119497 109525 117742 113518 103204
10615A03204M479O941m128P911K6006J0984j1258m779r301k7561j2666O921K611
$$ 103204 107683 114624 110496 118407 144413 155397 144139 139360 130059 102498 89832 96753 99364
10602I9364J9053q378p637K447p930n590j324J6026J420j0549q183o439j6636
$$ 99364 118417 110039 102402 104849 96919 91329 90005 106031 107451 96902 88719 82280 65644
10589F5644K678J0604j1101m671J0442N487m812q142O465J8006k770j4804n441
$$ 65644 68322 78926 67825 63154 73596 79083 74271 66129 72594 90600 87830 73026 67585
10576F7585J887J2716O43n07j3321l284m182l124K187O439Q509P431Q086K3707
$$ 67585 69472 82188 82831 82324 69003 65719 61537 58413 60600 67039 75548 82979 91065 114772
10562A14772O046O156J8675L815k394Q565L5929J9037J9114J7038M450p464n495
$$ 114772 120818 126974 145649 149464 147070 155635 191564 210601 229715 246753 251203 243739 238244
10549B38244l393j5830m1891j4889j9073j3977j832q064j1249j8647l4297k4980
$$ 238244 234851 219021 177130 162241 143168 129191 127359 119295 108046 89399 55102 30122
10537C0122j8458j1248j763Q795J5954K0652K0551J6612O607J1347P779n106q73
$$ 30122 11664 416 -1347 7448 23402 44054 64605 81217 87824 99171 106950 101844 100971
10524A00971J5883J7622K042j2136k4241j5578m620M381J0277J7800N605N378
$$ 100971 116854 134476 136518 124382 100141 84563 79943 84324 94601 112401 118006 123384
10512A23384M078K9008K7161P65J2850L6160L0478J5235n889k9371j6253J4572
$$ 123384 127462 156470 183631 184396 197246 233406 263884 279119 273230 243859 227606 242178
10500B42178K62m3444l1008j7626k6289m759o716m480N289K1754L4782O0514N5973
$$ 242178 242440 198996 167988 150362 124073 119314 112598 108118 113407 135161 169943 230457 286430
10487B86430O4125N3810K0999j8075m7940p3315p4069n5128k9449k332j3651j0623
$$ 286430 350555 404365 425364 407289 359349 286034 211965 156837 127388 125056 111405 100782
10475A00782n010k871P856n515j204j708j7668l648J8344J4372K793J0584J5895
$$ 100782 95772 92901 100757 95242 94038 92330 74662 71014 89358 103730 106523 117107 133002
10462A33002j127O297J0902m82p237j9876J84j0819j3352Q091J364r711l882m195
$$ 133002 131875 138172 149074 148592 141355 121479 121663 110844 97492 105583 106947 97236 93354 89159
10448H9159N280R690J776J7119k259M90j6561p419p949K220k391J9541Q630L219
$$ 89159 94439 104129 105905 123024 120765 121255 104694 97275 89326 91546 89155 108696 117326 120545
10434A20545n455K660Q447N011L2781K0854N485m103n254q084J7659M6389O8670
$$ 120545 115090 117750 126197 131208 163989 184843 190328 186225 180971 172887 190546 236935 305605
10421C05605L8055K9206j2066m6659m1716l7867m1996j8703k244r268j3379j2464
$$ 305605 343660 372866 360800 314141 272425 234558 192562 173859 171615 162347 148968 136504
10409A36504p063r515k729p733j2388r737Q588m522j7610J5660P141j1548j5770
$$ 136504 129441 119926 117197 109464 97076 87339 95927 91405 73795 89455 96596 85048 69278
10396F9278Q050J5847R614r788j3626j5933l7282k0256j1264m575L5062L7845
$$ 69278 77328 93175 102789 93001 79375 63442 26160 5904 -5360 -9935 25127 62972
10384F2972M7201M7059L7297J5510L580j5779j9522k890P065n841j5492r746M92
$$ 62972 110173 157232 194529 210039 213619 197840 178318 175428 182493 176652 161160 151414 151906
10371A51906Q375J5133O751J8932J7966J8701N448O763K44j309J523L6009L5298
$$ 151906 160281 175414 182165 201097 219063 237764 243212 249975 250219 248910 250433 286442 321740
10358C21740K3287K1244J0048K0076J4478o242j6823l5138l9911k8731j7797j440
$$ 321740 345027 366271 376319 396395 410873 404631 387808 352670 312759 284028 266231 264791
10346B64791N994o901l782J3154j736m796M2167P2437R7918J49084J91862Q3786
$$ 264791 270785 263884 260102 273256 271520 266724 308891 381328 479246 628330 820192 903978
10334I03978l642M2082M6894o7918j40164j60503j20774m6172k4511J0416L3615
$$ 903978 900336 942418 989312 921394 781230 620727 499953 453781 429270 439686 473301
10323D73301L8161M3495K6386j7462k1423j0689J101q060j2577k0987j1357l0748
$$ 473301 511462 554957 581343 563881 542458 531769 532870 524810 512233 491246 479889 449141
10311D49141q919J0613N81J5006J6620J7849q79j8438j9002k0249n173n387J0714
$$ 449141 440222 450835 451416 466422 483042 500891 500012 481574 462572 442323 437150 431763 442477
10298D42477K7663Q135J8305K2722J1549J3761K0273J8725J2532L0058N7347R2912
$$ 442477 470140 478275 496580 519302 530851 544612 564885 583610 596142 626200 683547 776459
10286G76459J43031J86615J68373P4855j2602n8610n8876k1482j1080j5920l1352
$$ 776459 919490 1106105 1274478 1349333 1336731 1278121 1219245 1197763 1186683 1170763 1139411
10275A139411k9496l1184Q740O4707P9508Q3956J08989R5795Q4628P5405N5999
$$ 1139411 1109915 1078731 1087471 1152178 1231686 1315642 1424631 1520426 1605054 1680459 1736458
10264A736458L9287M4974R4581J76755K90375M15694N09257N74802P08802R75106
$$ 1736458 1775745 1820719 1915300 2092055 2382430 2798124 3307381 3882183 4590985 5566091
10254E566091J180976J115236R05233N73123L06924M37253Q51015J448480K099318
$$ 5566091 6747067 7862303 8767536 9340659 9647583 10084836 10935851 12384331 14483649
10245A4483649K814996L640595M504417N602885P733450J1080316J5231894K0451040
$$ 14483649 17298645 20939240 25443657 31046542 38779992 49860308 65092202 85543242
10237H5543242K9025656M4626794P3513896J09890356J09210018O3761244Q098838
$$ 85543242 114568898 159195692 232709588 342599944 451809962 515571206 523670044
10230E23670044o8285214j08602993j04826171q0657443m9664175k8380829j7084465
$$ 523670044 455384830 346781837 241955666 161298223 111634048 83253219 66168754
10223F6168754j1412010q578796p035825o255389n505140m533389l609995k765073
$$ 66168754 54756744 46177948 39142123 32886734 27381594 22848205 19238210 16473137
10215A6473137k110568j641918j159099o45144k49374k33070m16837p42198j025935
$$ 16473137 14362569 12720651 11561552 10916408 10667034 10433964 10017127 9274929 8248994
10206H248994j018132q35109n99790m48740m04049l91636l83383l82599l24353
$$ 8248994 7230862 6395753 5795963 5347223 4943174 4551538 4168155 3785556 3461203
10197C461203k69414k11771j54823j26580j13752r3364r4975j03540j27536j51273
$$ 3461203 3191789 2980018 2825195 2698615 2584863 2491499 2396524 2292984 2165448 2014175
10187B014175j55642j34012j12721r4775o7800m2017l4970l2714N106J849k0499
$$ 2014175 1858533 1724521 1611800 1517025 1449225 1407208 1372238 1339524 1344630 1346479 1325980
10176A325980k9350l0709m8794o5737m6092l9194j6396L668J7242j2682k2510
$$ 1325980 1296630 1265921 1217127 1151390 1105298 1066104 1049708 1053376 1070618 1057936 1035426
10165A035426k2243k5072n197N435J7469N969k5796m4338l7886l8157n1749n3834
$$ 1035426 1013183 988111 982914 988349 1005818 1011787 985991 941653 903767 865610 813861 760027
10153G60027o2495m4252k6886j9915j4362l0781j5351r023p71J350J6022J6275
$$ 760027 697532 653280 626394 606479 592117 561336 545985 536962 536191 537541 553563 569838
10141E69838j738K1862J5823M57j4205j1373j9596j9728k2612j6320o131O647
$$ 569838 568100 589962 605785 606242 592037 580664 561068 541340 518728 502408 496277 502924
10129E02924l687j472q295p803L146Q215r082j6798j432p262j8631j3240q221
$$ 502924 499237 497765 489470 481667 484813 493028 483946 467148 465716 458454 439823 426583 418362
10116D18362n979j143q106J287J708j3244q834M190K4091L8776K6401J5072l864
$$ 418362 412383 411240 403134 404421 406129 392885 384051 388241 412332 451108 477509 492581 488717
10103D88717r473l4232l7516j6029j7725J767q296M36n271o616l723l109O072
$$ 488717 479244 445012 407496 391467 373742 375509 367213 367649 362378 355762 352039 348930 355002
10090C55002O607j4099j7874j7426J877j5887k5991j9689j1628P614K3624N1078
$$ 355002 361609 347510 329636 312210 314087 298200 272209 252520 240892 248506 272130 323208
10078C23208N1923L6724O137j3658j8288j9412j7754k5487k3608k1221j0571L525
$$ 323208 375131 411855 417992 404334 386046 366634 348880 323393 299785 278564 267993 271518
10066B71518j801n226O977J3094m368j2189L681J356l349o972j131l610k346R42
$$ 271518 269717 264491 271468 284562 280194 268005 271686 273042 269693 262721 261590 257980 255634 256576
10052B56576l300R327j3794j8719p780j9592k9809k0089M089J8826P755M676K5373
$$ 256576 253276 262603 248809 230090 222310 202718 172909 152820 156909 175735 183490 188166 213539
10039B13539K6139K2292K7312N545j1314l117j2747J0960P620j6185n553j2656
$$ 213539 239678 261970 289282 294827 283513 280396 267649 278609 286229 270044 264491 251835
10027B51835K256r894k0258m792n965p404J663j3953k0963N893J0565m978l619
$$ 251835 254091 244197 223939 219147 213182 205778 207441 193488 172525 178418 188983 184005 180386
10014A80386j24Q39j85N149n9R770n66n923j416L776J7636l4J021K107J6678R005
$$ 180386 180262 181101 180916 186065 186006 195776 195210 189287 187871 191647 209283 209249 210270 212377 229055 238060
9998B38060M381K5312J2035K2901O5451J14042J19132P2472j9738q7744j12322
$$ 238060 242441 267753 279788 302689 368140 482182 601314 673786 654048 566304 453982
9987D53982r4221o5129j6106o851j0197R413K41N498j5207l1747p307P406j234
$$ 453982 359761 294632 278526 271675 261478 270891 271132 276630 261423 229676 222369 229775 228541
9974B28541m696m094K789P373L28l909n189o569r55M996j894J0112o08J3814O783
$$ 228541 223845 219751 222540 229913 230241 226332 221143 214574 213619 218615 216721 226833 226225 240039 246822
9959B46822M56M195J4652M4088N8108R8566J71691K86377M64744N01873J63274
$$ 246822 247278 251473 266125 310213 368321 466887 638578 924955 1389699 1891572 2054846
9948B054846k59461m58249m27207k74335j59180q5606n9399m7211k8855k9100
$$ 2054846 1795385 1337136 909929 635594 476414 390808 331409 284198 255343 226243
9938B26243j8249p52m926n21K996o396J0749K575R993J2777r142j2272j6328j8025
$$ 226243 207994 207242 202316 201795 204791 198395 209144 211719 221712 234489 225347 213075 196747 178722
9924A78722q686k269j0091j6647m748j778K797R103j328O675J4196J1482r831
$$ 178722 170036 167767 157676 141029 136281 134503 137300 146403 145075 151750 165946 177428 167597
9911A67597k7151l687N265n169l114M375J4419n744O811J1766J968P567M875K689
$$ 167597 140446 136759 142024 136855 133741 138116 152535 146791 153602 165368 167336 174903 179778 182467
9897A82467Q89J1480L6346M7985K7290j3681l6696m6826m2442k8246k2921n056
$$ 182467 183356 194836 231182 279167 306457 292776 256080 209254 166812 138566 115645 110589
9885A10589j55Q319J1010P782P967N457Q342Q351L969N454O55k97j1453k3350
$$ 110589 110434 118753 129763 137545 145512 150969 159311 167662 171631 177085 177740 177443 165990 142640
9871A42640o425m164o515L381J8378j792m103l321R740O108K140j0525j2077j3
$$ 142640 136215 132051 125536 128917 147295 145503 141400 138079 147819 153927 156067 145542 133465 133452
9857A33452J6930J3014N844j3081o311J679l186k543q706m255P582J9376M210
$$ 133452 150382 163396 169240 156159 149848 151527 148341 145798 137092 132837 140419 159795 164005
9844A64005m620J0851J7499R384J1330J8893Q980q545n405K064o195Q964J3239
$$ 164005 159385 170236 187735 197119 208449 227342 236322 227777 222372 224436 218241 227205 240444
9831B40444K2667K9283M3849N4085P8847Q0160J22696J76559K93928N13694O48512
$$ 240444 263111 292394 336243 390328 469175 549335 672031 848590 1142518 1656212 2304724
9820B304724N16323K43742j81792n41451o13976n12466l55691k13460j21210p7408
$$ 2304724 2821047 3064789 2882997 2341546 1727570 1215104 859413 645953 524743 447335
9810D47335o0146l7989j8287l4786k9398j8101k4969k3496p156J453K154k369
$$ 447335 387189 349200 330913 296127 266729 248628 223659 200163 193007 194460 196614 194245
9798A94245M903n227q668m25J020k732m756k240q502j6549m451j375R819m345
$$ 194245 199148 193921 185253 184828 185848 183116 178360 176120 167618 151069 146618 145243 155062 150717
9784A50717P077k88N183j694P815O512K897M529R868J134j387l620p627j1999
$$ 150717 157794 157506 162689 160995 168810 175322 178219 182748 192616 193750 192363 188743 181116 169117
9770A69117K670n801q882p825m004R419J2716O029k2065j1060N577l12q506j069
$$ 169117 171787 165986 157104 149279 145275 154694 167410 173439 151374 140314 145891 145579 137073 136004
9756A36004J065J5416l832r935J1294Q428p192n73n289J461M679Q060M566l968
$$ 136004 137069 152485 148653 138718 150012 158440 151248 150675 145386 146847 151526 159586 164152 160184
9742A60184j2061m751j1134p477J5719J7116l354j4622l700L409m58j4051j786
$$ 160184 148123 143372 132238 124761 140480 157596 154242 139620 135920 139329 138871 124820 123034
9729A23034q00Q23R377L118L405l935O3J54r064l920L874M592M125K037O649j1381
$$ 123034 122234 123057 132434 135552 138957 135022 135085 135239 126175 122255 126129 130721 134846 136883 143532 132151
9713A32151o257N151N336l847p821R137O381m556J4211J0927k017L374J4082j0296
$$ 132151 125894 131045 136381 132534 124713 133850 140231 135675 149886 160813 158796 162170 176252 165956
9699A65956j7177j0312o419q538J3754R904o96r036p705N870P113q717j727k036
$$ 165956 148779 138467 132048 123510 137264 147168 146472 137436 129731 135601 142714 133997 132270 130234
9685A30234L22J174K685M731J16m766J651K537l52o093l171J1768N693k280K837
$$ 130234 130556 131730 134415 139146 139262 134496 136147 138684 138332 132239 129068 140836 146529 144249 147086
9670A47086q990q126R600J6344L800j8446K552p848o432J3603q742j5139P70L373
$$ 147086 138096 129970 139570 155914 159714 141268 143820 135972 129540 143143 134401 119262 120032 123405
9656A23405Q269J806J5372J3299J950J578M599k371P079n143q903n112r644k743
$$ 123405 131674 133480 148852 162151 164101 165679 170278 167907 174986 169843 160940 155828 146184 143441
9642A43441p907k120J3600J0314q785r452N778K0327o118p043j800j489O59K478
$$ 143441 135534 133414 147014 157328 148543 139091 144869 165196 159078 152035 150235 148746 149405 151883
9628A51883q84K747o781p151M064M100p608j0215l844J2990J6819L006J2213l918
$$ 151883 150999 153746 146965 139814 143878 147978 140370 130155 126311 139301 156120 159126 171339 167421
9614A67421j3448L008J6616R243m079K077l604j0010j1590j0495K147N262P200
$$ 167421 153973 156981 173597 182840 178761 180838 177234 167224 155634 145139 147286 152548 159748
9601A59748N07P269k57p855Q026N355r981j173J0880j951Q859K208N374j116n531
$$ 159748 160255 167524 167267 159412 167438 172793 162812 161639 172519 170568 179427 181635 187009 185893 180362
9586A80362O483M461M78l089J005J0745M568j2073j4496r90L551o42L930J3669
$$ 180362 186845 191306 191784 188695 189700 200445 205013 192940 178444 177454 181005 180363 184293 197962
9572A97962P247J065J41j298p931q18L849Q37j2479O078j915m919J578M631k987
$$ 197962 205209 206274 206415 205117 197186 196368 200217 201054 188575 194653 192738 187819 189397 194028 191041
9557A91041p62O732o636l050l892L749Q921L921l570J5122K783j2683p641R666
$$ 191041 190279 197011 190375 187325 183433 187182 196103 200024 196454 211576 214359 201676 194035 203701
9543B03701R204l617N57K735K775L22P647J1630q403j5171O603l744m121J8455
$$ 203701 212905 209288 209845 212580 215355 215677 223324 234954 226551 211380 217983 214239 210118 228573
9529B28573K708j2785o778k389N498K250J194K954J5412R968q410J1764J0440
$$ 228573 231281 218496 211718 209329 214827 217077 218271 221225 236637 246605 238195 249959 260399
9516B60399j7006j1767K912J0422J115J647P765r952j3188l835n352q562N188
$$ 260399 243393 231626 234538 244960 246075 247722 255487 245535 232347 228512 223160 214598 219786
9503B19786J111k294N420J7043N353J7170P748j1979J2184M163j0811L923N416
$$ 219786 220897 218603 224023 241066 246419 263589 271337 259358 271542 275705 264894 268817 274233
9490B74233R577O692o017j7265j3891j2976j7749J2173l488l46K657O706J755
$$ 274233 283810 290502 284485 267220 253329 240353 222604 234777 231289 230943 233600 240306 242061
9477B42061Q285r42j014R338J6097R60J756K407j1773J199l049p428L083N558
$$ 242061 250346 249404 248390 257728 273825 274785 276541 278948 267175 268374 265325 257897 260980 266538
9463B66538J8956Q585j854K897J9158N311n793N480j5663j7889J0106L163O576
$$ 266538 285494 294079 292225 295122 314280 319591 313798 319278 303615 285726 295832 298995 305571
9450C05571L452j069p009O881J2266m674j2147N248R971K750j860K755R816M401
$$ 305571 309023 307954 300945 307826 320092 315418 303271 308519 318490 321240 319380 322135 331951 336352
9436C36352K81p476j115N965M409J31J3605l614q668k08K606j1234R419Q01r078
$$ 336352 336633 329157 328042 334007 338416 338547 352152 348538 339870 339662 342268 331034 340453 341254 332176
9421C32176K069O233K409O492L090J795J4868J3397l27o072J741J8636J2470p314
$$ 332176 334245 340478 342887 349379 352469 354264 369132 382529 382202 376130 377871 396507 408977 401663
9407D01663j4995j849l275j131K112J959l920l693o46N176J0165J1457J111M149
$$ 401663 386668 384819 381544 380413 382525 384484 380564 376871 376225 381401 391566 403023 404134 408283
9393D08283O507o432N088J2757o691K621L345q279J7689Q667j851J7683M65q825
$$ 408283 414790 408358 413446 426203 419512 422133 425478 417199 434888 443555 441704 459387 459852 451027
9379D51027m111p134J635J0566O996l86J1824r04n44K362k36J771k199o126J707
$$ 451027 446916 439782 441417 451983 458979 458593 470417 469513 468969 471331 471095 472866 470667 464541 466248
9364D66248P268J0764j426L662L931j0396j348q84p932J432n16R093N608J4127
$$ 466248 473516 484280 482854 486516 490447 480051 478703 477819 469887 471319 470803 479896 485504 499631
9350D99631O278k565M214R586N01j6323o741p67R360J1421J9024M703q40L216
$$ 499631 505909 503344 507558 517144 517645 501322 494581 493814 503174 514595 533619 538322 537482 540698
9336E40698K2676J3427n067L0003M0754r433k8919l0661j3542r141j3603j1859
$$ 540698 563374 576801 571734 601737 642491 633058 604139 573478 559936 550795 537192 525333
9324E25333q3K528R088N042L097j1897j903J2938K3481O377p43j917N791n258
$$ 525333 525250 527778 536866 541908 545005 533108 531205 544143 567624 574001 573258 571341 577132 571874
9310E71874O33j3548j2390j0678m177o806N972R420J118o489k176k397L478L920
$$ 571874 572507 558959 546569 535891 531714 524908 530880 540300 541418 534929 532753 530356 533834 537754
9296E37754j783J880j596J550J2305J2968P537K4936K5946q637k3573k0419k4933
$$ 537754 535971 537851 536255 537805 550110 563078 570615 595551 621497 612860 589287 568868 543935
9283E43935j3768k273j1058n086j2688m492P149O507l180M166O897l22j5937P305
$$ 543935 530167 527894 516836 511750 499062 494570 501719 508226 505046 509212 516109 515787 499850 507155
9269E07155J7994j1187j5135n904j4078J0045P233r515p234n854O283o743k023
$$ 507155 525149 513962 498827 492923 478845 488890 496123 486608 479374 473520 479803 473060 471037
9256D71037o553j87J922j303o098j098j708k514j055j4117r901o833o119K665
$$ 471037 464484 464297 466219 464916 458818 457720 456012 453498 452443 438326 428425 421592 415473 418138
9242D18138R058j6144j4358Q65r448J618L818q239o291l870P804k956M67j244
$$ 418138 427196 411052 396694 397559 388111 389729 393547 385308 379017 375147 382951 379995 380462 379218
9228C79218J650R188N039j5631n060p886j3999K755q241j7601j2559Q053K3623
$$ 379218 380868 390056 395095 379464 374404 366518 352519 355274 347033 329432 316873 324926 348549
9215C48549q275L133J1454p097j2880m356l338M151J584q587J443K53O60J1546
$$ 348549 340274 343407 354861 347764 334884 330528 327190 331341 332925 324338 325781 326034 326694 338240
9201C38240K687j1623j5986j3434l242J010R422L71n518r392r139m321q472l15
$$ 338240 340927 329304 313318 299884 296642 297652 307074 307445 301927 292535 283396 279075 270603 270288
9187B70288J815j0805q7L966J2801n590j1598N43L051Q831N375j117p586o236
$$ 270288 272103 261298 261211 265177 277978 272388 260790 261333 264384 273215 278590 277473 269887 263651
9173B63651j3867l989k419j6440j342J1324J103p285N092j585j6621K641J0329
$$ 263651 249784 245795 243376 226936 225594 236918 238021 230736 235828 234243 217622 220263 230592
9160B30592k0765j7428L950J002J030O056J4281r5j397J64n019j157J125M319
$$ 230592 209827 192399 196349 197351 198381 204437 218718 218623 217226 217390 212371 211214 212339 216658
9146B16658j4658p707M610L148j951j2140j3195Q858J1426J8709M184J3683j4363
$$ 216658 202000 194293 198903 202051 200100 187960 174765 183623 195049 213758 217942 231625 217262
9133B17262m722L178j0072j9976p977P599Q125J0797n878l648n82L703k406j6071
$$ 217262 212540 215718 205646 185670 177693 185292 193417 204214 198336 194688 194106 197809 195403 179332
9119A79332j3012j1898J5409J6475j5244j2268k46N742R027O246J1834o273r384
$$ 179332 166320 154422 169831 186306 171062 158794 158548 164290 173317 179563 191397 185124 175740
9106A75740Q973J64O745J0878q574j9991l457M808L273k497n579n787k418r45
$$ 175740 184713 184877 191622 202500 193926 173935 170478 175286 178559 176062 170483 164696 162278 161333
9092A61333n151l173N467r058k288M75j047j0299J1630K60p240l507L076K0540
$$ 161333 156182 153009 158476 149418 147130 147605 146558 136259 147889 148149 140909 137402 140478 161018
9078A61018l551j1684L484O738M143n115j7808p533J1499j449m965J851n569M328
$$ 161018 157467 145783 149267 156005 160148 155033 137225 129692 141191 139742 134777 136628 131059 135387
9064A35387J4017K3868K508P780m380k9968k9584M753l537M339o952k61N860r424
$$ 135387 149404 173272 175780 183560 179180 149212 119628 124381 120844 125183 118231 117970 123830 114406
9050A14406N999N69l87m869p68p990R722J0866j0497P07N575m550R197M370j0046
$$ 114406 120405 120974 120587 115718 114950 106960 116682 127548 117051 117758 123333 118783 127980 132350 122304
9035A22304L963k230j3554r613l021J7085N387k3045R787J1806O96j278R59m874
$$ 122304 126267 124037 110483 100870 97849 114934 120321 97276 107063 118869 119565 118287 119246 114372
9021A14372p537L487N586k40p98J616j2623J02J0848r773j5986r125K950J2160
$$ 114372 106835 110322 115908 115668 114870 116486 103863 103965 114813 105040 89054 79929 82879 95039
9007I5039O393J4915L924j1639j2787N052M05r122o254L492K18M115J1912n358
$$ 95039 101432 116347 120271 108632 95845 100897 101302 92180 85926 89418 89636 93751 105663 100305
8993A00305j570j0341k710R458J3521j0751r080N743K581r683l614M492l947m330
$$ 100305 98735 88394 85684 95142 108663 97912 88832 94575 97156 87473 83859 88351 84404 80074
8979H0074k375N971k554O221K801j3141k370K12J4480J160P08j1923j1859r4k016
$$ 80074 77699 83670 81116 87337 90138 76997 74627 74839 89319 90479 91187 79264 67405 67311 65295
8964F5295J0029Q269L455n490p548P99j2796p951R4K819N384m174J3156N52J0775
$$ 65295 75324 83593 87048 81558 74010 74809 62013 54062 54156 56975 62359 58185 71341 71893 82668
8949H2668J410O072J0311N21k2154j3698K293Q057O361m413m76K465J78J585J700
$$ 82668 84078 90150 100461 100982 78828 65130 67423 75480 81841 77428 76952 79417 79595 81180 82880
8934H2880l223q176r913j713m905M491R202j214n140k1933R329J5359p99r521
$$ 82880 79657 71481 61568 59855 54950 59441 68643 67429 62289 40356 49685 65044 64245 54724
8920E4724o474O941L035q673K653l309o997j2712K049K0465K883L831L479n562
$$ 54724 48250 55191 58226 49553 52206 48897 41900 29188 31237 51702 54585 58416 61895 56333
8906E6333j2030K306L576L679p654m125p119N530l717o899J0913O568m991N344
$$ 56333 44303 46609 50185 53864 46210 42085 34966 40496 36779 29880 40793 47361 42370 47714
8892D7714o247L177o448n603L336J138J211m183P857J1175J469j3378J0178N887
$$ 47714 41467 44644 38196 32593 35929 37067 38278 34095 41952 53127 54596 41218 51396 57283
8878E7283k326j3894R799O627P687J0765p393k756k826m113N83l806M772J2270
$$ 57283 54957 41063 50862 57489 65176 75941 68548 65792 62966 58853 59436 55630 60402 72672
8864G2672K1970K1826M6629L6296j063k5828k6151k7673l4661j3480k6395M425
$$ 72672 94642 116468 163097 199393 198330 172502 146351 118678 84017 70537 44142 48567
8852D8567Q530o203n312k900O331J168n107j2497P47k433J591O482R167J313j8767
$$ 48567 57097 50894 45582 42682 49013 50181 45074 32577 33324 30891 32482 38964 48131 49444 30677
8837C0677j681l89j515J2197L900R21M881j919q305J378J4079Q93j3263k1756
$$ 30677 28996 28607 27092 39289 43189 44110 48991 47072 38767 40145 54224 55117 41854 20098
8823B0098M094J9777R781N743j2009j958O365j5692o573J468J688M74m00R648
$$ 20098 24192 43969 53750 59493 47484 45526 51891 36199 29626 31094 32782 33256 32856 42504
8809D2504o872R654j884J183N179l374p053r769p120J3348R076N977j4285n352
$$ 42504 35632 45286 43402 44585 49764 46390 39337 29568 22448 35796 44872 50849 36564 31212
8795C1212l35K75K107O681J1693m445j5362K696J047Q009o633o261J0169J3155
$$ 31212 30877 31152 33259 39940 51633 47188 31826 34522 35569 43578 36945 30684 40853 54008
8781E4008j143j697k578j397M906r519J02o765j4108R190j348Q507L815o627O453
$$ 54008 52865 51168 48590 47193 52099 42580 42682 35917 21809 30999 29651 38158 41973 35346 41799
8766D1799J2521j0279o920N806k41p098k040M550l639J872q907k262k790n396
$$ 41799 54320 44041 37121 42927 42686 35588 33548 38098 34459 36331 27424 25162 22372 16976
8752A6976J0274J352M622j3363k390R402j55r359q204l44Q223J2877L119J4356
$$ 16976 27250 28602 33224 19861 17471 26873 26718 17359 9155 8811 17034 29911 33030 47386
8738D7386Q966P820Q112K6684K2234J653M911J839k528r747j7073l353k6593j3270
$$ 47386 56352 64172 72284 98968 121202 122855 127766 129605 127077 117330 100257 96904 70311 57041
8724E7041N622j5795j3092m571j941M746J9360K256p074J785j1706J291M641n069
$$ 57041 62663 46868 33776 29205 27264 32010 51370 53626 46552 48337 36631 37922 42563 37494
8710C7494r524R076N563k033j63k648n618R926N497k4J7599K0317J2077K1213
$$ 37494 27970 37046 42609 40576 40413 37765 32147 42073 47570 47546 65145 85462 97539 118752
8696A18752K6078J0895j0810o840k40l947j2259k4164j5380j1419m674K563o351
$$ 118752 144830 155725 144915 138075 137835 133888 121629 97465 82085 70666 65992 68555 62204
8683F2204M826N534n65j0455j4620j3441P287n75p857j0612j120J1279J271J5717
$$ 62204 67030 72564 71999 61544 46924 33483 40770 40195 32338 21726 20606 31885 33156 48873
8669D8873M094j2766M664j2709K248N049l47L771Q693J2620k669j3789n973n197
$$ 48873 52967 40201 44865 32156 34404 39453 39106 42877 51570 64190 61521 47732 41759 36562
8655C6562j5807J7307J7945R875j835m681l284K651J3710l036k2676n997O484
$$ 36562 20755 38062 56007 65882 64047 59366 56082 58733 72443 69407 46731 40734 47218
8642D7218o475j1931O804K5489N419j1348n620n461J399N993o638n051j481K906
$$ 47218 40743 28812 35616 61105 66524 55176 49556 44095 45494 51487 44849 39798 38317 41223
8628D1223K075j4567q785L350K8592k684j0463k524P421J7295p703m808O657q832
$$ 41223 43298 28731 19946 23296 51888 49204 38741 36217 43638 60933 53230 48422 55079 46247
8614D6247q335Q061P604K276o471J198l328N15J0851M676j3212J1141J820J0465
$$ 46247 37912 45973 53577 55853 49382 50580 47252 47767 58618 63294 50082 61223 63043 73508
8600G3508L579L816M519M945j447L726J5190R626l30J2331m07K466J8288J0795
$$ 73508 77087 80903 85422 90367 88920 92646 107836 117462 117132 129463 129056 131522 149810 160605
8586A60605K365Q811N185l30p807j1960j1214p938p519j5700k0691j4149m283
$$ 160605 162970 171781 176966 176636 168829 156869 145655 137717 130198 114498 93807 79658 75375
8573G5375L855j3929j0830O28J015j1334J1350O71n446Q614J6333J2524K68j1811
$$ 75375 79230 65301 54471 55099 56114 44780 56130 56801 51355 59969 76302 88826 89094 77283
8559G7283q210O197L312m399k1682n574K427m34o5L474Q390J460r991K398N560
$$ 77283 69073 75270 78582 74183 52501 46927 49354 48920 48855 52329 60719 62179 52188 54586 60146
8544F0146j4716L678R699R267j3685P766K966R154L434J0174J1162j8449k2979
$$ 60146 45430 49108 58807 68074 54389 62155 65121 74275 77709 87883 99045 80596 57617
8531E7617K886J3862L038j6450j8670L601K3204M537k2624j8983K970m552M71
$$ 57617 60503 74365 77403 60953 42283 45884 69088 73625 51001 32018 34988 30436 30907
8518C0907J3030R400j8662n579J8712P707K386o695J3471j961n059m181L278L358
$$ 30907 43937 53337 34675 29096 47808 55515 57901 51206 64677 62716 57657 53476 56754 60112
8504F0112j0540p134m934P22m897k086j524J1259o735j638J2855J8847K3559K0000
$$ 60112 49572 42438 37504 38226 33329 31243 29719 40978 34243 32605 45460 64307 87866 107866
8490A07866L3983P671j6742P28j0540k5366k4642J4j1506k589m628m214r649j202
$$ 107866 141849 149520 132778 133506 122966 97600 72958 72972 61466 58877 54249 50035 40386 39184
8476C9184q045M065M658M850P55J830N327j173q876o957p566j4900n172K166q241
$$ 39184 31139 35204 39862 44712 45467 47297 52624 51451 42575 35618 28052 13152 7980 10146 1905
8461A905J82p925Q889K1680J616P807J5618P171r090j9804j576J7659O922j870
$$ 1905 2087 -5838 3051 24731 26347 34154 49772 56943 47853 28049 26473 44132 51054 49184
8447D9184J5010J2546J1702J9141J196r315J138J906N732l18j3538o540l20p966
$$ 49184 64194 76740 88442 107583 108779 99464 100602 102508 108240 107922 94384 87844 87524 79558
8433G9558l1412j9108p67J1973N799k283j2343m74J0231r773P423M207j16q451
$$ 79558 48146 29038 28271 40244 46043 43760 31417 30943 41174 31401 38824 43031 42915 34464
8419C4464j624l118n960q869K911J3717q497k611n619j491O934N729L450m584
$$ 34464 32840 29722 23762 14893 17804 31521 23024 20413 14794 13303 20237 25966 29416 24832
8405B4832L300M103J4371J3043n086J198m236J135Q576J7697L1418J7914O881
$$ 24832 28132 32235 46606 59649 54563 55761 51525 52660 61236 78933 110351 128265 135146
8392A35146p03q430j0160k3302j8469q237r206J364O652k1001k5747p915o81K99
$$ 135146 134443 126013 115853 92551 74082 65845 56639 58003 64655 43654 17907 9992 9311 9610
8378I610R014K4285N484k532j2764J187O873Q324l866k6031q539J3677J1015K107
$$ 9610 18624 42909 48393 45861 33097 34284 41157 49481 45615 19584 11045 24722 35737 37844
8364C7844q186r498P448n277j2238K646l252M53J2666P88Q716R028O356J0511
$$ 37844 29658 20160 27608 22331 10093 12739 9487 9940 22606 23394 32110 41138 47494 58005
8350E8005O390J6755Q608n695k0076j3957j4021j9666p406N566J5125M48k0549
$$ 58005 64395 81150 89758 84063 63987 50030 36009 16343 8937 14503 29628 30076 9527
8337I527M011l540p986R38J3062R829N877j6648l203O46M976N560j930L442m576
$$ 9527 13538 9998 2012 2950 16012 25841 31718 15070 11867 12513 17489 23049 21119 24561 19985
8322A9985j1092O605j551j2016Q494N790J661m330P306J4036m360n285K900J653
$$ 19985 8893 15498 13947 1931 10425 16215 17876 13546 20852 34888 30528 25243 28143 29796
8308B9796K108o834K181q710l562K477L282p484L944m581p526M739L338J91J0506
$$ 29796 31904 25070 27251 18541 14979 17456 20738 13254 17198 12617 5091 9830 13168 13359 23865
8293B3865K2542p589q765q428j0634l254j2267O3L27n710M803m235o283Q777J0565
$$ 23865 46407 38818 30053 21625 10991 7737 -4530 -4467 -4140 -9850 -5047 -9282 -15565 -6788 3777
8278C777M422j0597L20J0964O925q81J267j21m547j035j492o532J746O245J163
$$ 3777 8199 -2398 -2078 8886 15811 14930 16197 16076 11529 10494 9002 2470 4216 10461 11624
8263A1624N683l179r588M602N735N338k068j609j5549j8272P827J1320Q077l323
$$ 11624 17307 14128 4540 9142 14877 20215 18147 16538 989 -17283 -9456 1864 9941 6618
8249F618K909J956J387l265L62j508J929o678J6836J670l709O574j1318j6030
$$ 6618 9527 11483 12870 9605 9967 8459 10388 3710 20546 22216 18507 25081 13763 -2267
8235b267L511Q130K833j2665j0731J4371L698r183n95J2897J5440L439p365j1164
$$ -2267 1244 9374 12207 -458 -11189 3182 6880 -2303 -2898 9999 25439 28878 21513 10349
8221A0349j273M644o660J792j409o675J0683j1390j0037K622K5498J8387J4789
$$ 10349 9076 13720 7060 8852 7443 768 11451 61 -9976 -7354 18144 36531 51320
8208E1320p999j3884n659j2750N148K671k086l012M454O893q123m622j122N219
$$ 51320 43321 29437 23778 11028 16176 18847 16761 13749 18203 25096 16973 12351 11229 16448
8194A6448m865m825l680p384K994J7910J453l435R180n83k389p397r60q047R18
$$ 16448 11583 6758 3078 -4306 -1312 16598 18051 14616 23796 23213 20824 13427 12467 4420 5338
8179E338Q020o030M707N647P618p490M397R320q315r10L372Q04n750q127P6K3237
$$ 5338 13358 7328 12035 17682 25300 17810 22207 31527 23212 22302 25674 26478 20728 12601 12677 35914
8163C5914j768j2306l900m416K382n830j5271J0843j319o48J426L343j090m185
$$ 35914 34146 21840 17940 13524 15906 10076 -5195 5648 4329 3681 5107 8450 7360 3175
8149C175q385Q194j012O185o784j0767r64N89p034k933J4999J1223L001K68l104
$$ 3175 -5210 2984 1972 8157 1373 -9394 -10358 -9769 -16803 -19736 -4737 6486 9487 9755 6651
8134F651m784p57J0492Q414k729J022O443j3983j732J424n368k011K4745P785
$$ 6651 1867 1110 11602 20016 17287 18309 24752 10769 9037 10461 5093 3082 27827 35612
8120C5612k181l006j5095r173j394Q888J5886q401k08N68L724J607R120j2248
$$ 35612 33431 30425 15330 6157 4763 13651 29537 21136 20928 21496 25220 26827 35947 23699
8106B3699j9402o20n573j252j246K561J6975L679r510O393J2572L211j5966j1473
$$ 23699 4297 3677 -1896 -3148 -4394 -1833 15142 18821 9311 15704 28276 31487 15521 4048
8092D048k76L171m139L222J7095n74k6618M910J4930P888J3427P295o991j2088
$$ 4048 3772 6943 2804 6026 23121 22547 -4071 839 15769 23657 37084 44379 37388 25300
8078B5300k1619m17N965p030N226J5826L191p2n728n298J312L21J534o933m50
$$ 25300 3681 3264 9229 2199 7425 23251 26442 26370 20642 15344 16656 16977 18511 11578 11128
8063A1128P660L749Q24l370o089j480L516K38k860l246O441j768q90N974L886
$$ 11128 18788 22537 23361 19991 13902 12422 15938 16176 13316 10070 16511 14743 13853 19827 23713
8048B3713L253r43L618j1363j0743O975J1258N043o621J278j509k970J3434J7088
$$ 23713 26966 26023 29641 18278 7535 14510 25768 30811 24190 25468 23959 20989 34423 51511
8034E1511r386p258j3929k797L562J1966R524j220l816l718K983J9204j1257J959
$$ 51511 42125 34867 20938 18141 21703 33669 43193 41973 38157 34439 37422 56626 45369 47328
8020D7328J3970k358j0270r606O760n237K146m518l962m752O781M377r893q809
$$ 47328 61298 58940 48670 39064 45824 40587 42733 38215 34253 29501 36282 40659 30766 21957
8006B1957K2842q89j2433p485o547J0865J86p515N213K594N78J253o56O859q05
$$ 21957 44799 43910 31477 23992 17445 28310 28496 20981 26194 28788 29366 30619 29963 36822 36017
7991C6017M853J6738Q208J1600J577l780j6077r047l845P929K924m844j1722r145
$$ 36017 40870 57608 65816 77416 78993 75213 59136 50089 46244 54173 57097 52253 40531 31386
7977C1386J66m589m574J4473oj3827m940n109L379k698Q503M412N577p780l664
$$ 31386 31552 26963 22389 36862 36856 23029 18089 12980 16359 13661 22164 26576 32153 24373 20709
7962B0709N744L983Q430j181L887Q010N162M409q061p687l489N616m540J968k671
$$ 20709 26453 30436 38866 37685 41572 49582 54744 59153 51092 43405 39916 45532 40992 42960 40289
7947D0289n639N146J2838Q541m333q475J172j504K069J887l15R452J619k2682
$$ 40289 34650 39796 52634 61175 56842 48367 49539 48035 50104 51991 51676 61128 62747 40065
7933D0065j2450K99L06Q383q029q754m248K3937J4557p940k0261O301M48Q101
$$ 40065 27615 27914 28220 36603 28574 19820 15572 39509 54066 46126 25865 32166 32614 40715
7919D0715m529O675o23j0332K627j3771n898O829J0705Q046n020r231K098Q968
$$ 40715 36186 42861 42238 31906 34533 20762 14864 21693 32398 40444 35424 26193 28291 37259
7905C7259Q566j1005M662J167j0265o997r161m072J4541K3457j85m637Q02j5541
$$ 37259 45825 34820 39482 40649 30384 23387 14226 10154 24695 48152 47967 43330 44132 28591
7891B8591j3164K101J5582p550j2208q317n37L338R540N852j1333L535P060L531
$$ 28591 15427 17528 33110 25560 13352 5035 4498 7836 17376 23228 11895 15430 22490 26021
7877B6021K209M912O830M590j474j1869j0397J944R101j855j0322j254J450p740
$$ 26021 28230 33142 39972 44562 43088 31219 20822 22766 31867 30012 19690 18436 19886 12146
7863A2146k330k138J540o887L539L062l088o356n17K261k771n039K999q88K325
$$ 12146 9816 7678 9218 2331 5870 8932 5844 -512 -1029 1232 -1539 -6578 -3579 -4467 -2142
7848b142l9l92J0535J4416n960r3l010j8968j1481Q18J0722J5122N567K461j3682
$$ -2142 -2181 -2573 7962 22378 16418 16325 13315 -5653 -17134 -16316 -5594 9528 15095 17556 3874
7833C874n485N317j1815n679J0625J1485K161n700k278j0448j1424N799R208P314
$$ 3874 -1611 3706 -8109 -13788 -3163 8322 10483 4783 2505 -7943 -19367 -13568 -4360 2954
7819B954N252J382j235q298o31L676J0392j735j519r358m950L209q942J0563O618
$$ 2954 8206 9588 8353 55 -576 3100 13492 11757 10238 880 -4070 -861 -9803 760 7378
7804G378r519N72q271K628J5892O012K69r99r062q093O31J2517O270N048N588
$$ 7378 -2141 -1569 -9840 -7212 8680 14692 14961 13962 4900 -3193 -2562 9955 16225 21273 26861
7789B6861j2698k465j8j042J26o645j3070O662Q089J888m907O217l54O246L746
$$ 26861 14163 11698 11680 10638 10764 4119 -8951 -2289 5800 7688 2781 8998 8644 14890 18636
7774A8636L117m442k0465p47j242j82J34K590K4797N705O666R82j8082n103J2918
$$ 18636 21753 17311 -3154 -3901 -5143 -5325 -5191 -2601 22196 27901 34567 35549 17467 12364 25282
7759B5282n492N152j4621j0813r48N577N116j535O572j877N749m642j1442N588
$$ 25282 19790 24942 10321 -492 -1440 4137 9253 7718 14290 12413 18162 13520 2078 7666
7745G666k318k286l44q656K406R389J0403m282rJ633J810L577R45l270j711J848
$$ 7666 5348 3062 2718 -5938 -3532 5857 16260 11978 11969 13602 15412 18989 19934 16664 14953 16801
7729A6801o983j1836N704L770o949k047M775J7859J1819l979q870p987M848M150
$$ 16801 9818 -2018 3686 7456 507 -1540 3235 21094 32913 28934 20064 12077 16925 21075
7715B1075M15P84j1982j3593P387n801j4161n462L962J565O476m429m228r258
$$ 21075 21490 22274 10292 -3301 4086 -1715 -15876 -21338 -17376 -15811 -9335 -13764 -17992 -27250
7701b7250J5413J1869J2922N706q689j1443K808K124o723j988Q639J453J488j546
$$ -27250 -11837 32 12954 18660 9971 -1472 1336 3460 -3263 -5251 3388 4841 6329 4783
7687D783j228R89P472M393K572k026l231q752J812m563o061k447K3035J2966j2284
$$ 4783 3555 4544 12016 16409 18981 16955 13724 4972 6784 2221 -3840 -6287 16748 29714 17430
7672A7430j1129q988N275J2357N482L115q475o581o371r072J0950R92M470N866
$$ 17430 6301 -2687 2588 14945 20427 23542 15067 8486 2115 -6957 3993 4985 9455 15321
7658A5321P407m69K625o939j2316q086m560M223J766q220j5604j162K309K911
$$ 15321 22728 22259 24884 17945 5629 -2457 -7017 -2794 -1028 -9248 -24852 -26014 -23705 -20794
7644b0794J5182J9070K802k560o170j7698Q107r682P156K322j3203Q002j943p206
$$ -20794 -5612 13458 16260 13700 7530 -10168 -2061 -11743 -4587 -2265 -15468 -7466 -9409 -16615
7630a6615m131P529J5921J2211p484j2706q277J2810Q287Q315r20J3538O422j0660
$$ -16615 -20746 -13217 2704 14915 7431 -5275 -13552 -742 7545 15860 14940 28478 34900 24240
7616B4240r674j1303o939R813M32K179n085o372J1775n535k135L999l666o047
$$ 24240 14566 3263 -3676 6137 6569 8748 3663 -2709 9066 3531 1396 5395 1729 -4318
7602d318K060j817n41k963P915J028J92R892N732j4925r737p499J1632L559l02
$$ -4318 -2258 -4075 -4616 -7579 336 1364 1556 11448 17180 2255 -7482 -14981 -3349 210 -92
7587i2p977k417l570k951Q081L83o50K554n04L44J42m449Q380M482k1271r404
$$ -92 -8069 -10486 -14056 -17007 -8926 -8543 -9193 -6639 -7143 -6799 -6657 -11106 -2726 1756 -19515 -28919
7571b8919P971M500k122Q821J717Q866N887l633r329l273m898J528J0080o525
$$ -28919 -20948 -16448 -18570 -9749 -8032 834 6721 3088 -6241 -9514 -14412 -12884 -2804 -9329
7557i329l001J3188J0057M969j0385o971j6686p240J5866N261Q732m742p898N746
$$ -9329 -12330 858 10915 15884 5499 -1472 -18158 -25398 -9532 -4271 4461 -281 -8179 -2433
7543b433J466k168k900Q85J0888k592j163J690j5025m543J0032J2524j0143l904
$$ -2433 -967 -3135 -6035 -5150 5738 3146 1983 3673 -11352 -15895 -5863 6661 -3482 -7386
7529g386n277o986L999J6019J533M007p692j5812J0595P556n072J5970P797k5365
$$ -7386 -12663 -19649 -15650 369 1902 5909 -1783 -17595 -7000 556 -4516 11454 19251 -6114
7515f114l337J0220L808q431N926O438l939m731J238o679q154J0355K0554Q77
$$ -6114 -9451 769 4577 -3854 2072 8510 4571 -160 1078 -5601 -13755 -3400 17154 18031
7501A8031k865J686o040l987Q85P715j25l429o138o590j4107Q119R297l382j2638
$$ 18031 15166 16852 10812 6825 7710 15425 15300 11871 5733 -857 -14964 -6845 2452 -930 -13568
7486a3568k947n415L917M671j0044r954J2599P305J2895m982o62J222k27n97K855
$$ -13568 -16515 -21930 -18013 -13342 -23386 -33340 -20741 -13436 -541 -5523 -6185 -4963 -5190 -5787 -2932
7471b932K57l104j1244R35L158M679M845l53p969K60J507j1171R412k335P304
$$ -2932 -2675 -5779 -17023 -16088 -12930 -8251 -3406 -3759 -11728 -11468 -9961 -21132 -11720 -14055 -6751
7456f751l53O095L870n127q29n581Q509N744o761M017k455j3318p982m993r77
$$ -6751 -7104 -1009 2861 -2266 -3095 -8676 -167 5577 -1184 2833 378 -12940 -20922 -25915 -26892
7441b6892J2430M117P003m646l102O040p020n596J9501M80j9512p850L418N062
$$ -26892 -14462 -10345 -3342 -7988 -11090 -5050 -12070 -17666 1835 2315 -17197 -25047 -21629 -16567
7427a6567j321M751J965k927l463Q811P40O159R103q92J0399n516j5306j1343
$$ -16567 -17888 -13137 -11172 -14099 -17562 -8751 -8011 -1852 7251 6359 16758 11242 -4064 -15407
7413a5407J3056K0450K801j0634q221j2409N09M783p512l942N806Q818m428J1697
$$ -15407 -2351 18099 20900 10266 2045 -10364 -9855 -5072 -12584 -16526 -10720 -1902 -6330 5367
7399E367Q860k688m583K18n181j1475J1206M866l331J703L444K333M044M54M314
$$ 5367 14227 11539 6956 7174 1993 -9482 1724 6590 3259 4962 8406 10739 14783 15237 19551
7384A9551l862j1224L467K325l960O24K03K77q33J625m523P01P636l712j5244
$$ 19551 15689 4465 7932 10257 6297 6921 7124 7401 6568 8193 3670 4371 12007 8295 -6949
7369f949rN566K4619M403m987l796j1479J4031N691j0789l406p223j262Q99r966
$$ -6949 -6958 -1392 23227 27630 22643 18847 7368 21399 27090 16301 12895 5672 4410 5309 -4657
7354d657M858R683M80j294j1255J118K145K360l225p767J535J128L187L740M457
$$ -4657 201 9884 10364 9070 -2185 -1067 1078 3438 213 -7554 -6019 -4891 -1704 2036 6493
7339F493J801o507p826L804Q956K524J1257j07k173J0650J0371L14r564k405l62
$$ 6493 8294 1787 -6039 -2235 6721 9245 20502 20395 18222 28872 39243 39557 29993 27588 27226
7324B7226m987k1849j0176r16R630Q005m635k0328r187J5821N752m991K70n581
$$ 27226 22239 390 -9786 -10702 -1072 6933 2298 -18030 -27217 -11396 -5644 -10635 -10365 -15946
7310a5946j0039M78J4944J8186O437p187j0851J375Q393l434l600K755m229n389
$$ -15946 -25985 -25507 -10563 7623 14060 6873 -3978 -2603 5790 2356 -1244 1511 -2718 -8107
7296h107n162M288K553Q419N403L9j3020q050l370l806L100L316p510L552K0637
$$ -8107 -13269 -8981 -6428 1991 7394 7433 -5587 -13637 -17007 -20813 -17713 -14397 -21907 -18355 2282
7281B282L369l738K014J3713k195J417j7819N79K316m227K192J439O326N657r654
$$ 2282 5651 1913 3927 17640 15445 16862 -957 -378 1938 -2289 -97 1342 7668 13325 3671
7266C671P99M029M85q081r174l516J69R904M601N220Q382k3580k8897q923n62
$$ 3671 4470 8499 8984 903 -8271 -11787 -11618 -1714 2887 8107 16489 -7091 -35988 -44911 -45473
7251d5473K5769K6335J110j880j0009O74j1809j4373N584M043J9676K0722n935
$$ -45473 -19704 6631 7741 5861 -4148 -3474 -15283 -29656 -24072 -20029 -353 20369 14434
7238A4434j4933j6317J1765J0953r930o22L978J281J089J5956J660j2199K977
$$ 14434 -499 -16816 -5051 5902 -4028 -4650 -672 609 1698 17654 19314 7115 10092
7225A0092j028J6102o02j4938L541J0272j884n696J848r45j637p397J872q01j5386
$$ 10092 9064 25166 24564 9626 13167 23439 21555 15859 17707 16762 15125 7728 9600 8799 -6587
7210f587j3829N221n53K696J1812N629q89j3609o868M550J1106j517j0836M762
$$ -6587 -20416 -15195 -15748 -13052 -1240 4389 3500 -10109 -16977 -12427 -1321 -2838 -13674 -8912
7196h912J1638M483K351L180M323J009M627k215n819n674M799M070j3603l703
$$ -8912 2726 7209 9560 12740 17063 18072 22699 20484 14665 8991 13790 17860 4257 554
7182E54J0946M765j2266L294N195P695n937k138J327n514j5435q239P12N133n440
$$ 554 11500 16265 3999 7293 12488 20183 14246 12108 13435 7921 -7514 -15753 -15041 -9908 -15348
7167a5348m551l163J0747p007j4136P080M2R094K7494N874j1119p453J0443r020
$$ -15348 -19899 -23062 -12315 -19322 -33458 -26378 -26336 -17242 10252 16126 5007 -2446 7997 -1023
7153a023n294Q205M640M31l515k850n906k493j684O20q1N572Q74K618O812o251
$$ -1023 -6317 1888 6528 6959 3444 594 -5312 -7805 -9489 -8869 -8950 -3378 -2504 114 6926 675
7137F75m274J0736o729n165j743o029M700N5Q945O706m111j0253P288j166j8654
$$ 675 -3599 7137 408 -4757 -6500 -12529 -7829 -7774 1171 7877 3766 -6487 801 -365 -19019
7122a9019o05l850j002K971J5804J4685N11M46k76j3358k550o76j0417l300J244
$$ -19019 -19624 -23474 -24476 -21505 -5701 8984 9495 9941 9665 -3693 -6243 -6919 -17336 -20636 -19392
7107a9392q51J3640Q942k741j1943k57p41L790J1127Q931L543M957o357l182j3595
$$ -19392 -20243 -6603 2339 -402 -12345 -12602 -13343 -9553 1574 10505 14048 19005 12648 9466 -4129
7092d129k793k736K548L713k845q694o947J2071J3323M028m093j313q090k0338
$$ -4129 -6922 -9658 -7110 -3397 -6242 -14936 -21883 -9812 3511 7539 3446 2133 -5957 -26295
7078b6295M196K2183J3779o744J1746R475l823O145j879j3177o933K231k153o659
$$ -26295 -22099 84 13863 7119 18865 28340 24517 30662 28783 15606 8673 10904 8751 2092
7064B092j527j687N457N733M426J3151q619j3662L427m176j951m327O73K149J320
$$ 2092 565 -1122 4335 10068 14494 27645 19026 5364 8791 4615 2664 -1663 -990 1159 2479
7049B479M355Q027J800k421K97o269j0841o290r086j40P080K2583P700k470l541
$$ 2479 6834 14861 16661 14240 14537 8268 -2573 -8863 -17949 -18089 -11009 11574 19274 16804 13263
7034A3263n608l13j0240j4483l557J1091O929J2792J0081j3184J405L112j1560
$$ 13263 7655 7342 -2898 -17381 -20938 -9847 -2918 9874 19955 6771 8176 11288 -272
7021b72j0317p147l282N815N207q227K657J4098k403o969K93k177O224k692R768
$$ -272 -10589 -17736 -21018 -15203 -9996 -18223 -15566 -1468 -3871 -10840 -10547 -12724 -6500 -9192 576
7006E76o232k323R166k43K460M671j8456q703K742J7551L376P106p14n766M214
$$ 576 -5656 -7979 1187 944 3404 8075 -10381 -19084 -16342 1209 4585 11691 10977 5211 9425
6991I425N992j196j2048n880j1728q769J2516J6287m00K763n538L802J689m940
$$ 9425 15417 14221 2173 -3707 -15435 -24204 -11688 4599 4199 6962 1424 5226 6915 1975
6977A975m310o208r692K363K656O944J210K305J0389Q633Q298j1132m256N132
$$ 1975 -2335 -8543 -18235 -15872 -13216 -6272 -5062 -2757 7632 16265 24563 13431 9175 14307
6963A4307n341l066j136j060J476J209J1172L257k418M578P391M565j0323L980
$$ 14307 8966 5900 4764 3704 5180 6389 17561 20818 18400 22978 30369 34934 24611 28591
6949B8591O180r118n142j3595o175j0491j427Q55m978J743O108K2079p542r808
$$ 28591 34771 25653 20511 6916 741 -9750 -11177 -10322 -15300 -13557 -7449 14630 7088 -2720
6935b720j077R867M471J754k344q354j2603J6173r18k883k0365q074K1250j21
$$ -2720 -3797 6070 10541 12295 9951 1597 -11006 5167 4249 1366 -18999 -27073 -5823 -5944
6921e944O419N616Q549n27J1053n676q943K184K978O176K32n809n137o435j7454
$$ -5944 475 6091 14640 14113 25166 19490 10547 12731 15709 21885 22117 16308 11171 4736 -12718
6906a2718q186R166J3976p05j9205k991M149R865q51J492R37P092q141k834p854
$$ -12718 -20904 -11738 2238 1533 -17672 -20663 -16514 -6649 -7500 -6008 -5071 2021 -6120 -8954 -16808
6891a6808M828k660o84J7808k009l201j0122m732l175K98p81J4765J449O519R844
$$ -16808 -11980 -14640 -15324 2484 475 -2726 -12848 -17580 -20755 -20457 -21238 -6473 -5024 1495 11339
6876A1339j101J0685k634p195P237R312n213k7947l73J7828j105j7275j2834p188
$$ 11339 10238 20923 18289 11094 18331 27643 22430 -5517 -5890 11938 10833 -6442 -19276 -26464
6862b6464L945L329J2589K2907J1164Q217r065L209K028j3280k0582k5284j39
$$ -26464 -22519 -19190 -6601 16306 27470 35687 26622 29831 31859 18579 -2003 -27287 -27426
6849b7426K1693J5698j609M539m241p174J0845K0420O436j5867o220l388j0260
$$ -27426 -5733 9965 8356 12895 8654 1480 12325 32745 39181 23314 17094 13706 3446
6836C446j1234J09O80j238N547j861L440k278k19k808L078q920q860m977P390
$$ 3446 -7788 -7679 -6999 -8237 -2690 -4551 -1111 -3389 -3608 -6416 -3338 -12258 -21118 -26095 -18705
6821a8705J2121Q209p388j4622M711P653K556o207j931m344o660J7749J1458O18
$$ -18705 -6584 1625 -5763 -20385 -15674 -8021 -5465 -11672 -13603 -17947 -24607 -6858 4600 5218
6807E218k642j3832j2046R060K0410L565j564P111j472n602r759j314p155R86
$$ 5218 2576 -11256 -23302 -14242 6168 9733 8169 15280 13808 8206 -1553 -2867 -10022 -9036
6793i036p173j4K1513p52j3328j0814j2785Q064J6010P980P658P453j859j994
$$ -9036 -16209 -16223 5290 4538 -8790 -19604 -32389 -24325 -8315 -335 7323 14776 12917 10923
6779A0923m581J766L261Q712j4020r45j3986m104J4094Q25L284p859j9662K364
$$ 10923 6342 8108 11369 20081 6061 5116 -8870 -12974 1120 1945 5229 -2630 -22292 -19928
6765a9928J1875Q554m911r969K857n436J0317N063O596j1131p537m630m963O479
$$ -19928 -8053 501 -4410 -14379 -11522 -16958 -6641 -1578 5018 -6113 -13650 -18280 -23243 -16764
6751a6764R522K183M9p745Q631J1930q58j6489m813O636k725j408J0051k248K24
$$ -16764 -7242 -5059 -5010 -12755 -4124 7806 6948 -9541 -14354 -7718 -10443 -11851 -1800 -4048 -3824
6736c824m800m252R869m838L602m715j633n567q116q24J769K66j1003K931J2343
$$ -3824 -8624 -12876 -3007 -7845 -4243 -8958 -10591 -16158 -24274 -25098 -23329 -23063 -34066 -31135 -18792
6721a8792P361J3183J1102m608m330O261k99L263N301r213j2835l030n044n042
$$ -18792 -11431 1752 12854 8246 3916 10177 9878 13141 18442 9229 -3606 -6636 -11680 -16722
6707a6722J85R087P143j3215n972J8654J1143r93j0853n218Q759j337j4446j1373
$$ -16722 -16537 -7450 -307 -13522 -19494 -840 10303 9310 -1543 -6761 1998 661 -13785 -25158
6693b5158m492r120R344J4080J0211N060l518n220Q533p1j2899Q30q08n949r70
$$ -25158 -29650 -38770 -29426 -15346 -5135 -75 -3593 -8813 -280 -351 -13250 -12420 -13228 -19177 -20147
6678b0147p484M603O135Q12K774l033P800L370l231o607J7752j725l231K835q535
$$ -20147 -27631 -23028 -16893 -16081 -13307 -16340 -8540 -5170 -8401 -15008 2744 1019 -2212 623 -7912
6663g912k095R957l651j1489q658k748K1575K271l710j0015l160K146l850J0535
$$ -7912 -10007 -50 -3701 -15190 -23848 -26596 -5021 -2750 -6460 -16475 -19635 -17489 -21339 -10804
6649a0804O958m50Q07J666K621M615j1966n454M906m526p33j474j592J1548m368
$$ -10804 -3846 -4296 -3489 -1823 798 5413 -6553 -12007 -7101 -11627 -12360 -13834 -15426 -3878 -8246
6634h246k457j08P211P335P514j323j1506K942L982n722P597K303L390n226q503
$$ -8246 -10703 -10811 -3600 3735 11249 9926 -1580 1362 5344 -378 7219 9522 12912 7686 -817
6619h17M870K919m377n209p239r33m670l385J1319J0535M698o773r495l274p890
$$ -817 4053 6972 2595 -2614 -9853 -10786 -15456 -18841 -7522 3013 7711 938 -8557 -11831 -19721
6604a9721M501J3618K041M467J2210R236N7o061j1287j3272j3396j004J1870R956
$$ -19721 -15220 -1602 439 4906 17116 26352 26409 20348 9061 -4211 -17607 -18611 -6741 3215
6590C215N229R654R09m54l648q397j088j6596l720J1652L850k773M271M900r072
$$ 3215 8444 18098 19007 18553 14905 6508 5420 -11176 -14896 -3244 606 -2167 2104 7004 -2068
6575b068k304P673O998q502n693Q296N07l89j4426K874Q441n523M050R132J0014
$$ -2068 -4372 3301 10299 1797 -3896 4400 4907 4518 -9908 -7034 1407 -4116 -66 9066 19080
6560A9080K014N341j2388k4076o973N990Q589N776q830j0882O797O511N729n098
$$ 19080 21094 26435 14047 -10029 -17002 -11012 -2423 3353 -5477 -16359 -9562 -3051 2678 -2420
6546b420R63p514p684L527l716k150j58J7707l104l736J498k648r660L494J1542
$$ -2420 -1457 -8971 -16655 -13128 -16844 -18994 -19152 -1445 -4549 -8285 -6787 -9435 -19095 -15601 -4059
6531d059J4063r694j4741j771k253R728R159k220m317k551R748J4515o185j3112
$$ -4059 10004 310 -14431 -16202 -18455 -8727 432 -1788 -6105 -8656 1092 15607 9422 -3690
6517c690m773R303o888q604l724l834J2597J2454r518J0830L068r642p180o03
$$ -3690 -8463 840 -6048 -14652 -18376 -22210 -9613 2841 -6677 4153 7221 -2421 -9601 -10204
6503a0204M374N619M066R642J7Q044m542r889J179Q048r872j8225m246N776O203
$$ -10204 -5830 -211 3855 13497 13514 21558 17016 7127 8306 16354 6482 -11743 -15989 -10213 -4010
6488d010k282P067P034L858q587n043J087j3218j2494q24J2802J1019n137o939
$$ -4010 -6292 775 7809 11667 3080 -1963 -876 -14094 -26588 -27412 -14610 -3591 -8728 -15667
6474a5667R942o73p675J2019J2576M014q657j2239k373P860m548R02j782l003
$$ -15667 -5725 -6398 -14073 -2054 10522 14536 5879 -6360 -8733 -873 -5421 -4519 -6301 -9304
6460i304R299M801n78j1797P885K175n692K43L188K012q737l41L146M346k04J1865
$$ -9304 -5 4796 4218 -7579 306 2481 -3211 -2968 220 2232 -6505 -6846 -3700 646 442 12307
6444A2307O149q529K541K147mL196j066j6611n359R653k121n224M652j1880j5518
$$ 12307 18456 9927 12468 14615 14611 17807 16741 130 -5229 4424 2303 -2921 1731 -10149 -25667
6429b5667J0365J7347N728Q333q828N949J1794p137o876o272j0409l159J2016
$$ -25667 -15302 2045 7773 16106 7278 13227 25021 17884 11008 4736 -5673 -8832 3184
6416C184O051k106P171j133k972l082j2719N50O872n003M89K361L873Q444J142
$$ 3184 9235 7129 14300 13167 10195 7113 -5606 -5056 1816 -3187 -2698 -337 3536 11980 13122
6401A3122j1091K75O646o495N494L188L511o215j428L5K472K331q207l79l000
$$ 13122 2031 2306 8952 2457 7951 11139 14650 8435 7007 7042 9514 11845 3638 3259 259
6386B59J01j2762M832Q866M420n831k062M21n260p065J5216J9073j0589o541K126
$$ 259 360 -12402 -7570 1296 5716 -115 -2177 -1756 -7016 -14081 1135 20208 9619 3078 5204
6371E204o379L826P48k419O595J636j5688J91J2868L276j2719r534l071M894N464
$$ 5204 -1175 2651 3399 980 7575 9211 -6477 -6286 6582 9858 -2861 -12395 -15466 -10572 -5108
6356e108L691P034j4112M398l072L081O725J081m418q294j0160Q99J719Q392j912
$$ -5108 -1417 5617 -8495 -4097 -7169 -4088 2637 3718 -700 -8994 -19154 -18255 -16536 -8144 -10056
6341a0056q581k189j785N75R439O419l760m446j1209j6677L401K3423J0196k238
$$ -10056 -18637 -20826 -22611 -22036 -12597 -6178 -9938 -14384 -25593 -42270 -38869 -15446 -5250 -7488
6327g488q070M569J83L705n373m840N460n106J0877J6660j6713j1353N846M076
$$ -7488 -15558 -10989 -10806 -7101 -12474 -17314 -11854 -16960 -6083 10577 -6136 -17489 -11643 -7567
6313g567M395M136k322o199m310J625R014K2872R050l058j1273j018L228j944
$$ -7567 -3172 964 -1358 -7557 -11867 -10242 -1228 21644 30694 27636 16363 15345 18573 16629
6299A6629j199M311m043j8560j7929r99M286M860J2888L617N158m862P88P796
$$ 16629 15430 19741 15698 -2862 -20791 -21790 -17504 -12644 244 3861 9019 4157 4945 12741
6285A2741O050L926k11K927r134r363k893O01q84o842K795j4133m635K301J0178
$$ 12741 18791 22717 22506 25433 16299 6936 4043 4644 3760 -3082 -287 -14420 -19055 -16754 -6576
6270f576L673l716k844M860R285P019J080J6990L460r064j8790j3474J064J9786
$$ -6576 -2903 -6619 -9463 -4603 4682 11701 12781 29771 33231 24167 5377 -8097 -7033 12753
6256A2753J350k640l00o763n060k332r345n330o44K820Q366Q044j0940R537l252
$$ 12753 14103 11463 11163 4400 -660 -2992 -12337 -17667 -18311 -15491 -7125 919 -10021 -484 -3736
6241c736j2237l69j5052p390J0042J4018l76J7562J5100J876q293n121Q780j3632
$$ -3736 -15973 -16342 -31394 -38784 -28742 -14724 -15100 2462 17562 19438 11145 6024 14804 1172
6227A172j7096J1193J3439k991j0574K857R844n951k622M965M265p849j718R938
$$ 1172 -15924 -4731 8708 5717 -4857 -2000 7844 1893 -729 4236 8501 652 -1066 8872
6213H872j2164q643J3943O283k882q679j77J4665N093k0771j5506l080K740J0386
$$ 8872 -3292 -11935 2008 8291 5409 -3270 -3447 11218 16311 -4460 -19966 -23046 -20306 -9920
6199i920j925p685J0730N712J998J2571P23j6069N772N17l93n650n228J1833n280
$$ -9920 -11845 -19530 -8800 -3088 -1090 11481 12204 -3865 1907 2424 2031 -3619 -8847 2986 -2294
6184b294j4343j399O354M996j255L847n026N322L104J973K240j7284j3967J694
$$ -2294 -16637 -18036 -11682 -6686 -7941 -4094 -9120 -3798 -694 1279 3519 -13765 -27732 -26038
6170b6038L484N942J2431K470l727p44o692l32J0169N761P999k584n707M469q286
$$ -26038 -22554 -16612 -4181 -1711 -5438 -6182 -12874 -13206 -3037 2724 10723 8139 2432 6901 -1385
6155a385j6506j3035M847M322R472N124l613o96L618J0961j0739j516K308q12
$$ -1385 -17891 -30926 -26079 -21757 -12285 -7161 -10774 -11470 -7852 3109 -7630 -9146 -6838 -7650
6141g650J2556O151j0424k6225L119J0476J3364k440M247k260Q601p594q589J5485
$$ -7650 4906 11057 633 -25592 -22473 -11997 1367 -1073 3174 914 9515 1921 -6668 8817
6127H817J1972j1853j2902n215l809M094P003k885q470l680j439j3948K334J3861
$$ 8817 20789 8936 -3966 -9181 -12990 -8896 -1893 -4778 -13248 -16928 -18367 -32315 -29981 -16120
6113a6120J4092l791L125j99J957J4574j539k386k2210P033K926j7819J4460K7634
$$ -16120 -2028 -5819 -2694 -2893 -936 13638 12099 9713 -12497 -5464 -2538 -20357 -5897 21737
6099B1737Q858p435j7660j8056M659P294Q703J194j4969j3606J0099M897Q341
$$ 21737 30595 23160 5500 -12556 -7897 -603 8100 9294 -5675 -19281 -9182 -4285 4056
6086D056J2819L235j3152o408K842o703k127K220j5470J91J0126p641J180p643
$$ 4056 16875 20110 6958 550 3392 -3311 -5438 -3218 -18688 -18497 -8371 -16012 -14832 -22475
6072b2475M746Q700j5009j210J1883J4698P556o684l798P012j1375j3256N539
$$ -22475 -17729 -9029 -24038 -25248 -13365 1333 8889 2205 -1593 5419 -5956 -19212 -13673
6059a3673K1861n112j4411M317r166p572O534q878j4532P490J8537Q743P995r307
$$ -13673 8188 3076 -11335 -7018 -16184 -23756 -17222 -26100 -40632 -33142 -14605 -5862 2133 -7174
6045g174J765L108R239j897o136J713J5204j4221q281n398n202o742O931J8605
$$ -7174 -5409 -2301 6938 5041 -1095 618 15822 1601 -6680 -12078 -17280 -24022 -17091 1514
6031A514M2l875R474J314o289Q549m261O980O409j2692q626n387J1040O42j900
$$ 1514 1556 -2319 7155 8469 2180 10729 6468 13448 19857 7165 -1461 -6848 4192 4834 2934
6016B934n92j6079r009n175M828J3349N293Q600j5673o998P645m104n513O731
$$ 2934 2342 -13737 -22746 -27921 -23093 -9744 -4451 4149 -11524 -18522 -10877 -14981 -20494 -13763
6002a3763J4083P396j1159L52L07M98k523p158j0424q12K486J2838L285r800k215
$$ -13763 320 7716 -3443 -3091 -2784 -2286 -4809 -11967 -22391 -23203 -20717 -7879 -4594 -14394 -16609
5987a6609j644J8031J1040J090j3032K593L7R035o772j7917o138K496M98j349
$$ -16609 -18253 -222 10818 11908 -1124 1469 1506 10541 3769 -14148 -20286 -17790 -17292 -18641
5973a8641J2037J8180q625m864j0028K058J6886J1066p063l911j0456j1873R58
$$ -18641 -6604 11576 2951 -1913 -11941 -9883 7003 18069 11006 7095 -3361 -15234 -14276
5960a4276K833l228L32Q894m911M803m234k077j657O179m196r45m360k908m784
$$ -14276 -11443 -14671 -14339 -5445 -10356 -5553 -9787 -11864 -13521 -7342 -11538 -12483 -16843 -19751 -24535
5945b4535L685N097J786M152j19m674M215L269o163j3649Q182J1071l089l081
$$ -24535 -20850 -15753 -13967 -9815 -9934 -14608 -10393 -7124 -13287 -26936 -18754 -7683 -10772 -13853
5931a3853J2609J160r406r390N734L3504l459q638j1638j0246K243N737N516k237
$$ -13853 -1244 -84 -9490 -18880 -13146 20358 16899 8261 -3377 -13623 -11380 -5643 -127 -2364
5917b364j2436J6814P989p473K793p887M6J1182P02j2782q693R655M402L301m239
$$ -2364 -14800 2014 10003 2530 5323 -2564 -2518 8664 9366 -3416 -12109 -2454 1948 5249 1010
5902A010k949j494M402o771J007J1708M19R367J3669m7o488j3631r634L407j56
$$ 1010 -1939 -3433 969 -5802 -4795 6913 7332 16699 30368 30321 23833 10202 568 3975 3819
5887C819r572p263j7965K98O394L364J617O011K464L869J150m633L422J8054K987
$$ 3819 -5753 -13016 -30981 -30683 -24289 -20925 -19308 -13297 -10833 -6964 -5814 -10447 -7025 11029 14016
5872A4016q026N309r107O30j0530j5827K716K748k066K628J2553m543j5158L333
$$ 14016 5990 11299 2192 2822 -7708 -23535 -20819 -18071 -20137 -17509 -4956 -9499 -24657 -21324
5858b1324J3001M105J1728k351l40J74n810k871Q947J4361j4603p326J0257p751
$$ -21324 -8323 -4218 7510 5159 4819 4993 -817 -3688 5259 19620 5017 -2309 7948 197
5844A97R06l22m186N353O082j707j454j5975o148N338N239L130J3544J5304j3914
$$ 197 1103 781 -3405 1948 8030 6323 4869 -11106 -17254 -11916 -6677 -3547 9997 25301 11387
5829A1387j3939R126m866J889p878K925O911K131j4146R422R036j7123q157J1445
$$ 11387 -2552 6574 1708 3597 -4281 -1356 5555 7686 -6460 2962 11998 -5125 -13282 -1837
5815a837J1936N56J699j0293n482M070m964O058M611L060J0042O070M26j0045
$$ -1837 10099 10655 12354 2061 -3421 649 -4315 1743 6354 9414 19456 25526 25952 15907
5801A5907M15K215r655k120o696j0748j0301M316R751r84O349P136k278n203m752
$$ 15907 16322 18537 8882 6762 66 -10682 -20983 -16667 -6916 -7900 -1551 5585 3307 -1896 -6648
5786f648k261K4148J0800p134p379j4063l873j797J250Q015L241k2672M710J6928
$$ -6648 -8909 15239 26039 18905 11526 -2537 -6410 -8207 -6957 1058 4299 -18373 -13663 3265
5772C265L808p066L223N275q294j4940j0349p368J2695K1428j780j2078J1112
$$ 3265 7073 7 3230 8505 211 -14729 -25078 -32446 -19751 1677 -103 -12181 -1069
5759a069l406J0654K723J37L369P368m950k3830m990J4291O362m872l811M552
$$ -1069 -4475 6179 8902 9039 12408 19776 14826 -9004 -13994 297 6659 1787 -2024 2528
5745B528l254J709R150R207q607m791p518M94j1780O783L195m697j3278j210n744
$$ 2528 -726 983 10133 19340 10733 5942 -1576 -1082 -12862 -6079 -2884 -7581 -20859 -22069 -27813
5730b7813L378N43J0893O772k471M225m958j3827r483J0442J0829R957j179q90
$$ -27813 -24435 -23892 -12999 -6227 -8698 -4473 -9431 -23258 -32741 -22299 -11470 -1513 -2692 -3582
5716c582j810R132K513n078P559k546j2833l269j438N337L549j1514M830R080
$$ -3582 -5392 3740 6253 1175 8734 6188 -6645 -9914 -11352 -6015 -2466 -13980 -9150 -70
5702g0O921J036l481m381Q160j450q393k1804m309J2260N53m745R649Q826N943
$$ -70 6851 7887 4406 25 8185 6735 -1658 -23462 -27771 -15511 -14958 -19703 -10054 -1228 4715
5687D715M598O706p840l138P87l271k139q870m211J1385J1802j34j2317q544P44
$$ 4715 9313 16019 8179 5041 5828 2557 418 -8452 -12663 -1278 10524 10390 -1927 -10471 -9727
5672i727J3030N074P34m240j36J0753k961j763N603K284p393j0543P01K376L31
$$ -9727 3303 8377 9111 4871 4735 15488 12527 10764 16367 18651 11258 715 1416 3792 4123
5657D123o602R08K084p130k082K275L085p617L446k468J178J3218J7334q501J287
$$ 4123 -2479 -1571 513 -6617 -8699 -6424 -3339 -10956 -7510 -9978 -8800 4418 21752 13251 14538
5642A4538j2753k1310l545J8300K647m84o222J043p96q420o58Q679J2323j588
$$ 14538 1785 -19525 -23070 -4770 -2123 -2607 -8829 -7786 -8582 -17002 -17660 -8981 3342 1754
5628A754p827L771L575n004o256N597P764j813N614J6171J526j1253L94L239l491
$$ 1754 -6073 -2302 1273 -3731 -9987 -4390 3374 1561 7175 23346 24872 13619 14013 17252 13761
5613A3761k145J0287l510p133j591j40m052J357J007K222Q172j2886j935Q27j6127
$$ 13761 11616 21903 18393 11260 9669 9529 5477 6834 7841 10063 18235 5349 3414 4241 -11886
5598a1886m771j3264J0027J2187R895O826j5413p481j466m638o753J3885L050
$$ -11886 -16657 -29921 -19894 -7707 2188 9014 -6399 -13880 -15346 -19984 -26737 -12852 -9802
5585i802J2380L7l297N74o475J139k346n156k821R1P435L410J1279J1290j720
$$ -9802 2578 2615 -682 -108 -6583 -5444 -7790 -12946 -15767 -15676 -8241 -4831 6448 17738 16018
5570A6018k0320j3086n016L177m046O913P399J0119m013j6071q881L892M682O645
$$ 16018 -4302 -17388 -22404 -19227 -23273 -16360 -8961 1158 -2855 -18926 -27807 -23915 -19233 -12588
5556a2588J3395P078k04Q509k2815j1989l614J4938L555j647n513j003Q956M21
$$ -12588 807 7885 7681 16190 -6625 -18614 -22228 -7290 -3735 -5382 -10895 -11898 -2942 -2521
5542b521J814K972n377q928m57J2490L035o526O672R096K430o27o698j2612n79
$$ -2521 -707 2265 -3112 -12040 -12497 -7 3028 -3498 3174 12270 14700 14073 7375 -5237 -5816
5527e816Q787M219j3548p405L59P248P068j1376o951J0184Q649K750P800n212
$$ -5816 2971 7190 -6358 -13763 -13404 -6156 912 -10464 -17415 -7231 1418 4168 11968 6756
5513F756j011K097j3297l0982n583J3192Q658n561J731Q29L626O961j1983P344
$$ 6756 5745 7842 -5455 -36437 -42020 -28828 -20170 -25731 -24000 -23171 -19545 -12584 -24567 -17223
5499a7223m98J339L091J0287m289N233O826L491m987p477O097k012o601O12j3416
$$ -17223 -17721 -16382 -13291 -3004 -7293 -2060 4766 8257 3270 -4207 1890 -122 -6723 -6111 -19527
5484a9527k957R953P254k044k31j3408N628J724l816N163m544O396r000k591J0409
$$ -19527 -22484 -12531 -5277 -7321 -7552 -20960 -15332 -13608 -17424 -12261 -16805 -10409 -19409 -22000 -11591
5469a1591J5532J1509j1703o413R606j120k923O051N869j1053j1247j4589m387
$$ -11591 3941 15450 3747 -2666 6940 5820 2897 8948 14817 3764 -7483 -22072 -26459
5456b6459J3617Q987N81l194R28k059M820m798l033Q545P335J0387j2283j3588
$$ -26459 -12842 -3855 -3274 -6468 -5540 -7599 -2779 -7577 -10610 -2065 5270 15657 3374 -10214
5442a0214J068J0614P799p39k181p292n087q519m639l970JJ1649P278j1418k007
$$ -10214 -9146 1468 9267 8528 6347 -945 -6032 -14551 -19190 -23160 -23159 -11510 -4232 -15650 -17657
5427a7657M705N797M753O200r472j6475J161J4412O047K709j5853k847k812M094
$$ -17657 -12952 -7155 -2402 3798 -5674 -22149 -20988 -6576 -529 2180 -13673 -16520 -19332 -15238
5413a5238J495O995P895J6770P612j6911J270M679j435r652M208l04l672p58o720
$$ -15238 -13743 -6748 1147 17917 25529 8618 9888 14567 13132 3480 7688 7384 3712 2954 -3766
5398c766k147o859M521o090k463j129o234O622Q336J4961K260j0742m802J3477
$$ -3766 -5913 -12772 -8251 -14341 -16804 -17933 -24167 -17545 -9209 5752 8012 -2730 -7532 5945
5384E945r106o585J1228J2060O135k4553j6219J228L510K41p815n638J0601J2277
$$ 5945 -3161 -9746 1482 13542 19677 -4876 -21095 -19867 -16357 -16116 -23931 -29569 -18968 -6691
5370f691O590l097p532L960N84K230M449j0993j100N462p761N776j682p917O343
$$ -6691 -101 -3198 -10730 -6770 -6186 -3956 493 -10500 -11600 -6138 -13899 -8123 -9805 -17722 -11379
5355a1379L152N637M482j511J2065l86k0525n388K2399Q646j0415Q90k5q001j5218
$$ -11379 -8227 -2590 1892 381 12446 12060 -8465 -13853 8546 17192 6777 7667 7642 -359 -15577
5340a5577O842k403O477J3934J495l174n465j1304K434Q850l19J69p617m381k473
$$ -15577 -8735 -11138 -4661 9273 10768 7594 2129 -9175 -6741 2109 1790 1959 -5658 -10039 -12512
5325a2512q464O207Q199j273J4226J5392m788n408j1869P593M602j20n954o429
$$ -12512 -20976 -14769 -6570 -7843 6383 21775 16987 11579 -290 7303 11905 11785 5831 -598
5311e98L976L588j2473k007J6670K446o065j0388k037J835j624N916k110m540
$$ -598 3378 6966 -5507 -7514 9156 11602 5537 -4851 -6888 -5053 -6677 -761 -2871 -7411
5297g411o579m665J1502P16k384N24m230J51O043K274j1313Q415J0637Q410l40
$$ -7411 -13990 -18655 -7153 -6437 -8821 -8297 -12527 -12376 -6333 -4059 -15372 -6957 3680 12090 11750
5282A1750j807n059p148j1963O257O861k414M580o069K163P189o02j0639j5798
$$ 11750 9943 4884 -2264 -14227 -7970 -1109 -3523 1057 -5012 -2849 4340 3738 -6901 -22699
5268b2699k131R990J1776p152o725R511L508j5795P022K371l231j467N956k281
$$ -22699 -24830 -14840 -3064 -10216 -16941 -7430 -3922 -19717 -12695 -10324 -13555 -15022 -9066 -11347
5254a1347M316J1619L027k987Q674K074N80r611q965l957N143J1850N467j116
$$ -11347 -7031 4588 7615 4628 13302 15376 15956 6345 -2620 -6577 -1434 10416 15883 14767
5240A4767k5888j0810R287J9751m021q480k2215M712J0621J4291j4414j9828P9
$$ 14767 -11121 -21931 -12644 7107 3086 -5394 -27609 -22897 -12276 2015 -12399 -32227 -32148
5227c2148J7489J757l29J819P532L115Q90l838J3324K3409L757l468j3987o863
$$ -32148 -14659 -12902 -13231 -11412 -3880 -765 125 -3713 9611 33020 36777 33309 19322 12459
5213A2459j2201q468r608n829P621J7488M766j1345n594L771K3314M252j5639
$$ 12459 258 -8210 -17818 -23647 -16026 1462 6228 -5117 -10711 -6940 16374 20626 4987
5200D987j4536N984Q757l945R15K131m438l793m219Q055r22n043O649n12q184
$$ 4987 -9549 -3565 5192 1247 2162 4293 -145 -3938 -8157 -102 -1024 -6067 582 70 -8114
5185h114j1313l564J4266O09L803p643m673l183O705N808J2882Q945p255j8800
$$ -8114 -19427 -22991 -8725 -8116 -4313 -11956 -16629 -19812 -13107 -7299 5583 14528 7273 -11527
5171a1527j3766M343o686Q812L33R15J6524j283l419K030j757J100L691P47k506
$$ -11527 -25293 -20950 -27636 -18824 -18491 -17576 -1052 -2335 -5754 -3724 -5481 -4381 -690 57 -2449
5156b449K242K323j7181P043O449K192p569O017Q368L401j5789N35j4579o396
$$ -2449 -207 2116 -15065 -8022 -1573 619 -6950 -933 7435 10836 -4953 -4418 -18997 -25393
5142b5393J0185J6055O226m02j314j7195o080J0294k114p755j1190l882P887J6563
$$ -25393 -15208 847 7073 6671 5357 -11838 -17918 -7624 -9738 -17493 -28683 -32565 -24678 -8115
5128h115J4568o480n424m303j0322k021l282J7277J1298j1945l655R955M276k297
$$ -8115 6453 -27 -5451 -9754 -20076 -22097 -25379 -8102 3196 -8749 -12404 -2449 1827 -470
5114d70q402K242M528j5574k2198J7079J9655O061L764j0077p188J0407M229m734
$$ -470 -8872 -6630 -2102 -17676 -39874 -22795 -3140 2921 6685 -3392 -10580 -173 4056 -678
5100f78k675l310q556J5964Q760r994j1682l302L784r64R984L290O473O428K640
$$ -678 -3353 -6663 -15219 745 9505 -489 -12171 -15473 -11689 -12653 -2669 621 7094 13522 16162
5085A6162J4351j6762k3184n536P107J98K217N214K876l790j1517k427P500J4493
$$ 16162 30513 13751 -9433 -14969 -7862 -7664 -5447 -233 2643 -1147 -12664 -15091 -7591 6902
5071F902J0562j2408k432k211q867L447J546J4442j391j1131K362Q316k283Q330
$$ 6902 17464 5056 2624 413 -8454 -5007 -3461 10981 9590 -1541 821 9137 6854 15184
5057A5184j0435l722l302j4783j0536N17M992j2319P765J5015J3316n45o0J051
$$ 15184 4749 1027 -2275 -17058 -27594 -27077 -22085 -34404 -26639 -11624 1692 1147 1087 2138
5043B138K247R419j4033n309O049l441L838J260K520k166P686j5140M31J5708
$$ 2138 4385 13804 -229 -5538 511 -2930 908 2168 4688 2522 10208 -4932 -4501 11207
5029A1207q965j787n419o617N36K890M859l888L104R533j6942P824p967j1339
$$ 11207 2242 455 -4964 -11581 -11045 -8155 -3296 -7184 -4080 5453 -11489 -3665 -11632 -22971
5015b2971L695Q480P057j075N300K648q261r65r409J214o324n706N332J135j403
$$ -22971 -19276 -10796 -3739 -4814 486 3134 -5127 -6092 -15501 -14287 -20611 -26317 -20985 -19850 -21253
5000b1253Q133k669J0468N455lk688J1345P150p786p65j006j0382O0p213o430
$$ -21253 -13120 -15789 -5321 134 131 -2557 8788 15938 8152 7387 6381 -4001 -3941 -11154 -17584
4985a7584L249m179J5878R846M273q629O887J674r160N825N25o750j8084r549
$$ -17584 -14335 -18514 -2636 7210 11483 2854 9741 11415 2255 8080 8605 1855 -16229 -25778
4971b5778n341L414Q762J6287J0394O627j0942j3497k769k30R339J7504Q322n147
$$ -25778 -31119 -27705 -18943 -2656 7738 14365 3423 -10074 -12843 -13073 -3734 13770 22092 16945
4957A6945m689p187l279r90O239J7847l662j8853j1014O604N454m031j0030Q138
$$ 16945 12256 5069 1790 800 7039 24886 21224 2371 -8643 -2039 3415 -616 -10646 -2508
4943b508L27o343j0009n53O402J131O831P470j1168n529r473J4871N879m989Q71
$$ -2508 -2181 -8524 -18533 -19086 -12684 -11553 -4722 2748 -8420 -13949 -23422 -8551 -2672 -7661 -6790
4928f790l586J2447j317k079K969j023m294l199m949J847J7912Q229K911q897
$$ -6790 -10376 2071 754 -1325 1644 621 -3673 -6872 -11821 -9974 7938 16167 19078 10181
4914A0181k267K887l044O300l354j0382K290l945Q49o735M709P494M32j2269j1887
$$ 10181 7914 10801 7757 14057 10703 321 2611 -1334 -485 -7220 -2511 4983 5415 -6854 -18741
4899a8741k690J3098J140j17j606j270o66K276R105n146j2927j467J2465N567
$$ -18741 -21431 -8333 -7193 -7310 -8916 -10186 -10852 -8576 529 -4617 -17544 -19011 -6546 -979
4885i79j050j0596P004R531L590l872j050r135O245J2798M068M267j072O439L975
$$ -979 -2029 -12625 -5621 3910 7500 3628 2578 -6557 -312 12486 16554 20821 19749 26188 30163
4870C0163p365j0272J162l20j3581J486p204o9O52M189J1784j1466j3989q726
$$ 30163 22798 12526 13688 13368 -213 1273 -5931 -6000 -5348 -1159 10625 -841 -14830 -23556
4856b3556O560M183R412J2863J5280q98q570L933q166J459j2231j4607j581N035
$$ -23556 -16996 -12813 -3401 9462 24742 23844 15274 19207 11041 12500 269 -14338 -15919 -10884
4842a0884J1673q795n320O884P873k28n974q464R557k317J020Q282m916M482M213
$$ -10884 789 -8006 -13326 -6442 1431 1203 -4771 -13235 -3678 -5995 -4975 3307 -1609 2873 7086
4827G086j225m302N079K115l304L313j6873K327L599R160J992j5153q405J673
$$ 7086 5861 1559 6638 8753 5449 8762 -8111 -5784 -2185 6975 8967 -6186 -14591 -12918
4813a2918q439r610L090K2418J6641N4l85n08m971R44M60j755L625K762n137r935
$$ -12918 -21357 -30967 -27877 -5459 11182 11236 10851 10343 5372 6316 6776 5021 8646 11408 6271 -3664
4797c664J1322O244k827q413k465k535J0047Q406J626p940j3534j911L635J4483
$$ -3664 7658 13902 11075 2662 197 -2338 7709 16115 17741 9801 -3733 -5644 -2009 12474
4783A2474p063j0285j2054J0499J3187k055j0505N705Q606j0578O483j60o395
$$ 12474 5411 -4874 -16928 -6429 6758 4703 -5802 -97 8509 -2069 4414 4254 -2141
4770b141P069P02n904j753m175p020J4185K162j5196n569J230K17M203j4682N79
$$ -2141 4928 5630 -274 -2027 -6202 -13222 963 3125 -12071 -17640 -16410 -16193 -11990 -26672 -26093
4755b6093Q245P599j2149j075J2109L361n806k199J5604Q879P550j06p563N561
$$ -26093 -17848 -10249 -22398 -23473 -11364 -8003 -13809 -16008 -404 8475 16025 15919 8356 13917
4741A3917q78m313j5645p792J0563O428o424k676K152q577l737R992p640o233
$$ 13917 13039 8726 -6919 -14711 -4148 2280 -4144 -6820 -4668 -13245 -16982 -6990 -14630 -20863
4727b0863J3483J2415L191l162J143p55l817J254L429j651J655L986K445M907
$$ -20863 -7380 5035 8226 5064 6207 5452 1635 2889 6318 4667 6322 10308 12753 17660
4713A7660r10j8472j0346J0459R49J306j888K186N216O349l466M51N08Q360p15
$$ 17660 16750 -1722 -12068 -1609 -660 646 -1242 944 6160 12509 9043 9494 10002 18362 17647
4698A7647m346q955L19L899K461J0445o883j0074l742p002l107R726O337m927
$$ 17647 13301 4346 4665 8564 11025 21470 14587 4513 771 -6231 -9338 388 6725 1798
4684A798j3522l09J2249K023j775l062M604j3885P05M044J0276J0063l732j2296
$$ 1798 -11724 -12033 216 2239 464 -2598 2006 -11879 -11174 -7130 3146 13209 9477 -2819
4670b819m989J71l822M017j2270j2309N430K1013J4137l582j7485j445J1596L423
$$ -2819 -7808 -7637 -11459 -7442 -19712 -32021 -26591 -5578 8559 4977 -12508 -13953 -2357 1066
4656A066r246O558j77l630M468J085k464m848J286P564N831L827j0174m940J5858
$$ 1066 -8180 -1622 -1799 -5429 -961 124 -2340 -7188 -5902 1662 7493 11320 1146 -3794 12064
4641A2064K277k1972j4450m76n539Q256P954N203N685J2615L019m657r246o246
$$ 12064 14341 -7631 -22081 -22557 -28096 -19840 -11886 -6683 -998 11617 14636 9979 733 -5513
4627e513j471M080O391L931j951O976k539M18o737j0142J901m939l890M232k78
$$ -5513 -6984 -2904 3487 7418 5467 12443 9904 10322 3585 -6557 -4656 -9595 -13485 -9253 -9531
4612i531j1300l63J4980j0739p617J237J0220O021p256J6133R445n703r87K521
$$ -9531 -20831 -21194 -6214 -16953 -24570 -23333 -13113 -7092 -14348 1785 11230 5527 4540 7061
4598G061j2926J1j055n760m45J1450Q523J5239m845j5417J348J989j6484J610
$$ 7061 -5865 -5854 -6909 -12669 -13114 -1664 6859 22098 17253 1836 3184 5173 -11311 -9701
4584i701P085p891k570J639O182p915j5711K713N609O276L556m259L794R040j4
$$ -9701 -2616 -10507 -13077 -11438 -5256 -13171 -28882 -26169 -20560 -14284 -10728 -14987 -11193 -2153 -2167
4569b167k5704L233K4601j832m234J0858l951j613l173k57M613Q668j0096p966
$$ -2167 -27871 -24638 -37 -1869 -6103 4755 804 -809 -3982 -4239 374 9042 -1054 -9020
4555i020m505Q716Q009p286o978J0821J4140R34r327m165q697N373J0562Q9o757
$$ -9020 -13525 -4809 3200 -4086 -11064 -243 13897 14831 5504 1339 -7358 -1985 8577 8666 1909
4540A909m308L0l874P745N935m312q722l712J1520N954J73j173j4527o054l538
$$ 1909 -2399 -2369 -6243 1502 7437 3125 -5597 -9309 2211 8165 8338 7165 -7362 -13416 -16954
4525a6954J714R412p785j744J3725K0183q150m095L209j3670k0983K776J1495
$$ -16954 -15240 -5828 -13613 -15357 -1632 18551 10401 6306 9515 -4155 -25138 -22362 -10867
4512a0867M521P62k532P518q789j2363P858J7225O988L700q984l347q23o538J965
$$ -10867 -6346 -5584 -8116 -598 -9387 -21750 -13892 3333 10321 14021 5037 1690 867 -5671 -3706
4497c706j2060j0916J0183j2037m008J413L433O601L366J744L877j656L938L386
$$ -3706 -15766 -26682 -16499 -28536 -32544 -31131 -27698 -21097 -17731 -15987 -12110 -13766 -9828 -6442
4483f442p007o955O500N483m757N065J9599k710j0460K234J966J2j6585r4o954
$$ -6442 -13449 -20404 -13904 -8421 -13178 -8113 11486 8776 -1684 550 2516 2528 -14057 -14151 -21105
4468b1105Q504J3130R147q080j6247q680P700R00m39O138K871j242p265m203Q979
$$ -21105 -12601 529 9676 1596 -14651 -23331 -15631 -14731 -15170 -9032 -6161 -7403 -14668 -18871 -9892
4453i892O637j697j804j008L951L669r857l664J4459R407L382l542m089J5375
$$ -9892 -3255 -4952 -6756 -7764 -3813 -144 -10001 -13665 794 10201 13583 10041 5952 21327
4439B1327K89m605J940q991J88p490J709j5536j290K495O713N357R763J2749p753
$$ 21327 21616 17011 18951 9960 10148 2658 4367 -11169 -12459 -9964 -3251 2106 11869 24618 16865
4424A6865p711m27p376j1340o821L801J3061J0528o47N561j221k395j0321o775
$$ 16865 9154 8727 1351 -9989 -16810 -13009 52 10580 9933 15494 14273 11878 1557 -5218
4410e218J318n16j4168J012N599J782R322o21q519N760J3881p217j8592J581J2994
$$ -5218 -3900 -4416 -18584 -17572 -11973 -10191 -869 -1490 -10009 -4249 9632 2415 -16177 -14596 -1602
4395a602K195k773N1o130J010O934P731P407p47j3696k728q714Q0K65K401O726
$$ -1602 593 -2180 -2129 -8259 -7249 -315 7416 14823 14076 380 -2348 -11062 -10982 -10717 -8316 -1590
4379a590M63L074N913O125m01k0087l520J7676m987j505J7417n95j4402o398j544
$$ -1590 -1127 1947 7860 13985 13584 -6503 -10023 7653 2666 1161 18578 17983 3581 -2817 -4361
4364d361N138J699l630p911n90J005l86J8430N427j0797k0610k650K459J0130
$$ -4361 777 2476 -1154 -9065 -9655 -8650 -9036 9394 14821 4024 -16586 -19236 -16777 -6647
4350f647J5416m271K574Q610N656l781j446j676J0850j246J1129k360q525l222
$$ -6647 8769 4498 7072 15682 21338 17557 16111 14435 25285 24039 35168 32808 24283 21061
4336B1061l024M137j662j0889J181q08o053m311o85L943P650l370r5p789n097
$$ 21061 18037 22174 20512 9623 10804 9996 3943 -368 -1053 2890 10540 7170 7075 -714 -5811
4321e811J2250l293j8932j9868R427J3308K204Q11O197m203K595P320J634k475
$$ -5811 6439 3146 -15786 -35654 -26227 -12919 -10715 -9904 -3707 -7910 -5315 2005 3639 1164
4307A164P942J10k251q32q898M438m68n05q474n046o999p183O123J5097N165k863
$$ 1164 9106 9216 6965 6133 -2765 1673 1205 700 -7774 -12820 -19819 -27002 -20879 -5782 -617 -3480
4291c480o691m367O124K473m849K275Q714m217j3142O31Q155K274q229K692M412
$$ -3480 -10171 -14538 -8414 -5941 -10790 -8515 199 -4018 -17160 -16529 -8374 -6100 -14329 -11637 -7225
4276g225l327j77J3270J0853P642j8206p883O533l721L652j723j428l334N104
$$ -7225 -10552 -10729 2541 13394 21036 2830 -5053 1480 -2241 1411 -312 -1740 -5074 30
4262C0L614L298M083L730K986n275j7966j505L166j0025R73J1392J3372P676n528
$$ 30 3644 6942 11025 14755 17741 12466 -5500 -7005 -3839 -13864 -12891 -1499 11873 19549 14021
4247A4021m78K59r592j3194K1261j911q697m955J2309J5427j1326j1903n981j3397
$$ 14021 13543 13802 4210 -8984 12277 10366 1669 -3286 9023 24450 13124 1221 -4760 -18157
4233a8157L542J4193J869j0762k903J4588J4876L10l660j0886j801J8917l344
$$ -18157 -14615 -422 1447 -9315 -12218 2370 17246 17556 13896 3010 1209 20126 16782
4220A6782j7181n903p455J1054J2177Q67j1175j4987N05R845K0365o653r40N547
$$ 16782 -399 -6302 -13757 -2703 9474 10341 -834 -15821 -15316 -5471 14894 8241 7301 12848
4206A2848o093p09o135j2309l051k970l52K835O759N145o152j0184J7125J2813
$$ 12848 6755 6046 -89 -12398 -15449 -18419 -18771 -15936 -9177 -4032 -10184 -20368 -3243 9570
4192I570n6j2220j6019j657Q104J0507O765j7450m501k544k449L586P759p945
$$ 9570 9514 -2706 -18725 -20382 -12278 -1771 4994 -12456 -16957 -19501 -21950 -18364 -10605 -18550
4178a8550l141K710k057n548l318J7173K657n729j546J2898M770l952m107k807
$$ -18550 -21691 -18981 -21038 -26586 -29904 -12731 -10074 -15803 -17349 -4451 319 -3633 -7740 -10547
4164a0547J2089K309j5400o394N763L773L312N943n122P9J088j0329k869L272
$$ -10547 1542 3851 -11549 -17943 -12180 -8407 -5095 848 -4274 -4195 -3107 -13436 -16305 -13033
4150a3033p107k6o317P205L629L531J708J2091J5766N270r939p392L44R207P618
$$ -13033 -20140 -20166 -26483 -19278 -15649 -12118 -10410 1681 17447 22717 12778 5386 5730 14937 22555
4135B2555N1j7421k099j550J706r240j4003L901Q597L444j730N295O04l668o88
$$ 22555 22606 5185 3086 1536 3242 -5998 -20001 -16100 -7503 -4059 -5789 -494 110 -3558 -4246
4120d246J7927J4255l590k2259j1290P659j666N238R153j2397o109R491J1696
$$ -4246 13681 27936 24346 2087 -9203 -1544 -3210 2028 11181 -1216 -7325 2166 13862
4107A3862q734m484P810m742n2N427l787M51J2512O48q577j596j56n385R35M683
$$ 13862 5128 644 8454 3712 3660 9087 5300 5751 18263 18911 10334 8738 8582 3197 4132 8815
4091H815J244j3514l396l199K821N319R421O243k465l004j9876q655j7866n955
$$ 8815 10059 -3455 -6851 -10050 -7229 -1910 7511 13754 11289 8285 -11591 -20246 -38112 -44067
4077d4067J8992J9185o09j2890j4308n359P095J8503L682n631J5008O681k671
$$ -44067 -25075 -5890 -6499 -19389 -33697 -39056 -31961 -13458 -9776 -15407 -399 6282 3611
4064C611q576q331R701J7727k974o607m417J822L68N08q761N925J983r137o501
$$ 3611 -4965 -13296 -3595 14132 11158 4551 134 1956 2324 2832 -5929 -4 1979 -7158 -13659
4049a3659l565P798Q420L552l500m814q99P501M333J93j0684p136M826o684M283
$$ -13659 -17224 -9426 -1006 2546 -954 -5768 -6667 834 5167 5360 -5324 -12460 -7634 -14318 -10035
4034a0035J143j904J3009r186r547L477J5843J6663j4535r480Q090K0665P338
$$ -10035 -8892 -10796 2213 -6973 -16520 -13043 2800 19463 4928 -4552 3538 24203 31541
4021C1541j2260j4047P673K3645N725j0819p921k7756k1450j7955m083J1342R731
$$ 31541 19281 5234 12907 36552 42277 31458 23537 -4219 -25669 -43624 -47707 -36365 -26634
4008b6634O887P44J0472J1802n202l974J444l506O619l441k850N375j1094J23
$$ -26634 -19747 -19003 -8531 3271 -1931 -5905 -4461 -7967 -1348 -4789 -7639 -2264 -13358 -13235
3994a3235L890M999p096J821N162k617m877P654R840r73l529O366p63J362m669
$$ -13235 -9345 -4346 -11442 -9621 -4459 -7076 -11953 -4299 5541 4568 1039 7405 6642 8004 3335
3979C335N16O123q397j652J2478P841N511q265o547j6596n748J1296K371m459
$$ 3335 3851 9974 1577 -75 12403 20244 25755 17490 10943 -5653 -11401 -105 2266 -2193
3965b193P928m29m24j0164p569J3671m485j2760l108N370L808R337J0205j547
$$ -2193 5735 5306 4882 -5282 -12851 820 -3665 -16425 -19533 -14163 -10355 -1018 9187 7640
3951G640q928N283q960J293K418o367Q95L564O742J353p364k2385k471J6548J0424
$$ 7640 -1288 3995 -4965 -3672 -1254 -7621 -6726 -3162 3580 4933 -2431 -24816 -27287 -10739 -315
3936c15L562Q512J222q542j2376L166J0937m043j7557K77K538p73j699M236J2229
$$ -315 3247 11759 12981 4439 -7937 -4771 6166 2123 -15434 -15157 -12619 -13392 -15091 -10855 1374
3921A374j789P060K005o428k266J1j483O632J6380o094k009j4539K11L498K815
$$ 1374 -415 6645 8650 2222 -44 -33 -1516 5116 21496 15402 13393 -1146 -935 2563 5378
3906E378p806K614P594L687J076q631J0065n181P715P671j4173K074K367J903
$$ 5378 -2428 186 7780 11467 12543 3912 13977 8796 16511 24182 10009 12083 14450 16353
3892A6353O150j121j0804k543p950k165M729r280L737R804K146J1962R55L427
$$ 16353 22503 21382 10578 8035 85 -2080 2649 -6631 -2894 6910 9056 21018 21973 25400
3878B5400q282R25l03j2202k911Q440p375j3883P487J3400L778r364o376o539
$$ 25400 17118 18043 17740 5538 2627 11067 3692 -10191 -2704 10696 14474 5110 -1266 -7805
3864g805p997j859R549J3122k973k7326J411J2026P891M265l5o073m735J5779
$$ -7805 -15802 -17661 -8112 5010 2037 -25289 -23878 -11852 -3961 304 269 -5804 -10539 5240
3850E240j1661j2999O189J0025J2612J3532K598k088j1521m551j9740p122J79
$$ 5240 -6421 -19420 -13231 -3206 9406 22938 25536 23448 11927 7376 -12364 -19486 -19307
3837a9307o418R235O34R471J5497K768j065j0937n994O31r224l602R475K880J0543
$$ -19307 -25725 -16490 -15856 -6385 9112 11880 10815 -122 -6116 -5485 -14709 -18311 -8836 -5956 4587
3822D587j598j4763L736O723J0590J1577m034l566o438m318j1976l505R186J7355
$$ 4587 2989 -11774 -8038 -1315 9275 20852 16818 13252 6814 2496 -9480 -12985 -3799 13556
3808A3556q798l501O445m545J419J408k56k183n873r462j3322J2428J5096J6166
$$ 13556 4758 1257 7702 3157 4576 5984 5728 3545 -2328 -11790 -25112 -12684 2412 18578
3794A8578l551j1445K965J801j3840k28q416J436M372P260N599R97r477n83L39
$$ 18578 15027 3582 6547 8348 -5492 -5720 -14136 -12700 -8328 -1068 4531 5528 -3949 -4532 -4193
3779d193O738k662K441L096O462k449k893L504R638j1503K657Q723n763L324j3400
$$ -4193 2545 -117 2324 5420 11882 9433 6540 10044 19682 8179 10836 19559 13796 17120 3720
3764C720r327O39O897J131o657k640O619j152p7j587J2320N670j1615o392Q023
$$ 3720 -5607 -4968 1929 3060 -3597 -6237 382 -770 -847 -2434 9886 15556 3941 -2451 5572
3749E572n231j6867j1512R800J3631R53j2234n950N18P545J9879J0735Q413p880
$$ 5572 341 -16526 -28038 -18238 -4607 -3654 -15888 -21838 -21320 -13775 6104 16839 25252 17372
3735A7372l586m664j568p844O240P930M347j3159r027n723M516P534O979k479
$$ 17372 13786 9122 7554 -290 5950 13880 18227 5068 -3959 -9682 -5166 2368 9347 6868
3721F868m960n021J010N352R498K5770O54j8992m91P75q887j2176j919K27l072
$$ 6868 1908 -3113 -2103 3249 12747 38517 39171 20179 19688 20463 11576 -600 -2519 -2292 -5364
3706e364K196o20R464K272P035q246P134Q823r248J025Q13j8160K471L306j2458
$$ -5364 -3168 -3788 5676 7948 14983 6737 13871 22694 13446 14471 15284 -2876 -405 2901 -9557
3691i557k070j0347M325J1721L078K0808K103l176j3381j0753Q810J506M050j6263
$$ -9557 -11627 -21974 -17649 -5928 -2850 17958 20061 16885 3504 -7249 1561 3067 7117 -9146
3677i146j899M567k119p6M732O727j5402j271J7674J1224j0791l547L259M32j7622
$$ -9146 -11045 -6478 -8597 -8673 -3941 2786 -12616 -13887 3787 15011 4220 673 3932 4364 -13258
3662a3258n500O38l029R302r42P185J4579n985j6296k19Q609P958j5175n019J0983
$$ -13258 -18758 -18120 -21149 -11847 -12789 -5604 8975 2990 -13306 -13525 -4916 3042 -12133 -17152 -6169
3647f169O50M78O362k432q393k955J113J3012J4212J0202N345j4110Q65m619j752
$$ -6169 -5519 -5041 1321 -1111 -9504 -12459 -11346 1666 15878 26080 31425 17315 18180 13561 11809
$$ [...]
##END NTUPLES=NMR SPECTRUM
##END=
