##TITLE=Analysis number 329815
Compound Code cc 27009
Book Reference 552/14
Project Code adrs
Chemist Name stevem
##JCAMPDX= 6.0         $$ Bruker NMR JCAMP-DX V2.0
##DATA TYPE= NMR SPECTRUM
##DATA CLASS= NTUPLES
##ORIGIN= Bruker BioSpin GmbH
##OWNER= nmr
$$ XWIN-NMR		Version 3.5
$$ Tue Oct  2 09:36:46 2007 GMT Daylight Time (UT+1h)  MAYBRIDGE\nmr@NMR_250MHZ
##.OBSERVE FREQUENCY= 250.131544655141
##.OBSERVE NUCLEUS= ^1H
##.ACQUISITION MODE= SIMULTANEOUS (DQD)
##.ACQUISITION SCHEME= undefined
##.AVERAGES= 16
##.DIGITISER RES= 18
##SPECTROMETER/DATA SYSTEM= dpx250
##.PULSE SEQUENCE= zg30
##.SOLVENT NAME= CDCl3
##.SHIFT REFERENCE= (INTERNAL, CDCl3, 0, 16.522)
##AUDIT TRAIL= $$ (NUMBER, WHEN, WHO, WHERE, WHAT)
$$ ##TITLE= Audit trail, XWIN-NMR		Version 3.5
$$ ##JCAMPDX= 5.01
$$ ##ORIGIN= Bruker BioSpin GmbH
$$ ##OWNER= nmr
$$ C:\u/data/dgb/nmr/ADRS/90/pdata/1/auditp.txt
$$ ##AUDIT TRAIL=  $$ (NUMBER, WHEN, WHO, WHERE, WHAT)
(   1,<2007-10-02 09:36:23.81 +100>,<MAYBRIDGE\nmr>,<NMR_250MHZ>,
      <created by zg, POWCHK disabled, PULCHK disabled
       configuration hash MD5:
       76 6E 9A 78 1E 09 19 81 EC 84 63 8F B0 6A 59 2D
       data hash MD5: 64K
       12 18 50 1A BA F0 DF 10 74 82 D5 B3 4E B2 6A 8F>)
(   2,<2007-10-02 09:36:36.42 +100>,<MAYBRIDGE\nmr>,<NMR_250MHZ>,
      <Start of raw data processing
       ef LB = 0.3 FT_mod = 6 PKNL = 1 SI = 32K 
       data hash MD5: 32K
       D1 06 91 6D B8 CF 2F 12 41 B5 E2 84 76 53 34 7C>)
(   3,<2007-10-02 09:36:38.15 +100>,<MAYBRIDGE\nmr>,<NMR_250MHZ>,
      <apk 
       data hash MD5: 32K
       01 09 A3 0C 97 67 58 BC 69 DA C4 E8 5C 97 19 A8>)
(   4,<2007-10-02 09:36:38.90 +100>,<MAYBRIDGE\nmr>,<NMR_250MHZ>,
      <abs ABSG = 5 
       data hash MD5: 32K
       DC 76 A5 E9 72 59 0C 4F B0 82 62 56 2F 50 B9 34>)
$$ ##END=
$$ 
$$ hash MD5
$$ C5 69 E4 7A B2 8B 42 48 AF 60 4B 66 7C 38 82 1D
##$RELAX= 
##$RELAX= 
##$RELAX= 
##$RELAX= 
##$RELAX= 
##$RELAX= 
##$RELAX= 
$$ Bruker specific parameters
$$ --------------------------
##$DU= <C:\u>
##$EXPNO= 90
##$NAME= <ADRS>
##$PROCNO= 1
##$TYPE= <nmr>
##$USER= <dgb>
##$AMP= (0..31)
100 100 100 100 100 100 100 100 100 100 100 100 100 100 100 100 100 100 
100 100 100 100 100 100 100 100 100 100 100 100 100 100 
##$AQSEQ= 0
##$AQ_mod= 3
##$AUNM= <au_zg>
##$AUTOPOS= <17 >
##$BF1= 250.13
##$BF2= 250.13
##$BF3= 250.13
##$BF4= 250.13
##$BF5= 500.13
##$BF6= 500.13
##$BF7= 500.13
##$BF8= 500.13
##$BYTORDA= 1
##$CFDGTYP= 0
##$CFRGTYP= 5
##$CHEMSTR= <none>
##$CNST= (0..31)
1 1 145 1 1 1 1 1 1 1 1 1 1 1 1 1 1 1 1 1 1 1 1 1 1 1 1 1 1 1 1 1 
##$CPDPRG= <>
##$CPDPRG1= <>
##$CPDPRG2= <>
##$CPDPRG3= <>
##$CPDPRG4= <mlev>
##$CPDPRG5= <mlev>
##$CPDPRG6= <mlev>
##$CPDPRG7= <mlev>
##$CPDPRG8= <mlev>
##$CPDPRGB= <>
##$CPDPRGT= <>
##$D= (0..31)
0 1 0 0 0 0 0 0 0 0.06 0 0 0 0 0 0 0.0002 0 0 0 0 0 0 0 0 0 0 0 0 0 0 
0 
##$DATE= 1191314182
##$DBL= (0..7)
120 120 120 120 120 120 120 120 
##$DBP= (0..7)
150 150 150 150 150 150 150 150 
##$DBP07= 0
##$DBPNAM0= <>
##$DBPNAM1= <>
$$ [...]
##$SUBNAM7= <"">
##$SUBNAM8= <"">
##$SUBNAM9= <"">
##$SW= 20.6930455092707
##$SWIBOX= (0..15)
0 0 3 0 0 0 0 0 0 0 0 0 0 0 0 0 
##$SW_h= 5175.983436853
##$TD= 65536
##$TD0= 1
##$TE= 296.16
##$TE2= 300
##$TE3= 300
##$TEG= 300
##$TL= (0..7)
0 120 120 120 120 120 120 120 
##$TP= (0..7)
150 150 150 150 150 150 150 150 
##$TP07= 0
##$TPNAME0= <>
##$TPNAME1= <>
##$TPNAME2= <>
##$TPNAME3= <>
##$TPNAME4= <>
##$TPNAME5= <>
##$TPNAME6= <>
##$TPNAME7= <>
##$TPOAL= (0..7)
0.5 0.5 0.5 0.5 0.5 0.5 0.5 0.5 
##$TPOFFS= (0..7)
0 0 0 0 0 0 0 0 
##$TUNHIN= 0
##$TUNHOUT= 0
##$TUNXOUT= 0
##$USERA1= <user>
##$USERA2= <user>
##$USERA3= <user>
##$USERA4= <user>
##$USERA5= <user>
##$V9= 5
##$VALIST= <valist>
##$VCLIST= <CCCCCCCCCCCCCCC>
##$VD= 0
##$VDLIST= <DDDDDDDDDDDDDDD>
##$VPLIST= <PPPPPPPPPPPPPPP>
##$VTLIST= <TTTTTTTTTTTTTTT>
##$WBST= 1024
##$WBSW= 4
##$XGAIN= (0..3)
0 0 0 0 
##$XL= 0
##$YL= 0
##$YMAX_a= 436371
##$YMIN_a= -462597
##$ZGOPTNS= <>
##$ZL1= 120
##$ZL2= 120
##$ZL3= 120
##$ZL4= 120
##$ABSF1= 16.522
##$ABSF2= -4.171173
##$ABSG= 5
##$ABSL= 3
##$ALPHA= 0
##$AQORDER= 0
##$ASSFAC= 0
##$ASSFACI= 0
##$ASSFACX= 0
##$ASSWID= 0
##$AUNMP= <proc_1d>
##$AZFE= 0.1
##$AZFW= 0.1
##$BCFW= 0
##$BC_mod= 0
##$BYTORDP= 0
##$COROFFS= 0
##$CY= 12.5
##$DATMOD= 1
##$DC= 0
##$DFILT= <>
##$DTYPP= 0
##$F1P= 14.0000005364418
##$F2P= -0.99999901652339
##$FCOR= 0.5
##$FTSIZE= 32768
##$FT_mod= 6
##$GAMMA= 0
##$GB= 0
##$INTBC= 1
##$INTSCL= 1
##$ISEN= 128
##$LB= 0.3
##$LEV0= 0
##$LPBIN= 0
##$MAXI= 10000
##$MC2= 0
##$MEAN= 0
##$ME_mod= 0
##$MI= 0
##$NCOEF= 0
##$NC_proc= -2
##$NLEV= 6
##$NOISF1= 0
##$NOISF2= 0
##$NSP= 0
##$NTH_PI= 0
##$NZP= 0
##$OFFSET= 16.522
##$PC= 1
##$PHC0= 145.507
##$PHC1= 19.15225
##$PH_mod= 1
##$PKNL= yes
##$PPARMOD= 0
##$PSCAL= 4
##$PSIGN= 0
##$REVERSE= no
##$SF= 250.13
##$SI= 32768
##$SIGF1= 0
##$SIGF2= 0
##$SINO= 400
##$SIOLD= 32768
##$SREGLST= <1H.CDCl3>
##$SSB= 0
##$STSI= 32768
##$STSR= 0
##$SW_p= 5175.98343685301
##$SYMM= 0
##$S_DEV= 0
##$TDeff= 65536
##$TDoff= 0
##$TI= <Analysis number 999999
Compound Code 99
Book Reference 9
Project Code 9>
##$TILT= no
##$TM1= 0
##$TM2= 0
##$TOPLEV= 0
##$USERP1= <user>
##$USERP2= <user>
##$USERP3= <user>
##$USERP4= <user>
##$USERP5= <user>
##$WDW= 1
##$XDIM= 32768
##$YMAX_p= 360657866
##$YMIN_p= -225404
$$ End of Bruker specific parameters
$$ ---------------------------------
##NTUPLES= NMR SPECTRUM
##VAR_NAME=  FREQUENCY,     SPECTRUM/REAL,   SPECTRUM/IMAG
##SYMBOL=    X,             R,               I
##VAR_TYPE=  INDEPENDENT,   DEPENDENT,       DEPENDENT
##VAR_FORM=  AFFN,          ASDF,            ASDF
##VAR_DIM=   32768,         32768,           32768
##UNITS=     HZ,            ARBITRARY UNITS, ARBITRARY UNITS
##FACTOR=    0.157963299565203, 1,           1
##FIRST=     4132.6476996994, 0,             0
##LAST=      -1043.33573715361, 0,           0
##MIN=       -1043.33573715361, -225404,     0
##MAX=       4132.6476996994, 360657866,     0
$$ Real data points
##PAGE= N=1
##DATA TABLE= (X++(R..R)), XYDATA
$$ [...]
##PAGE= N=2
##DATA TABLE= (X++(I..I)), XYDATA
15335E11537l846N33O224L816P474K843l910j1285m701m191L489k404M547M790
15321E14916m43J744j066K177O090q019p84P474N902K361R26j803N25j325P975
15306E36650R791l463j335j43m529O635N168N015m118p398K560O542K983M988
15292E59346R63o862m714j437P347Q041K660n635k481M784l700Q34J506P85K950
15277E64387K008K61J599l61l041l134R433J3894K61k835j995N85L38m68n40L332
15261E83724M079J59o662N921M252P012P747J835r85O24J04j426j329k550l103
15246E99402N024K341m381l750P814O096m578q628P606J202k687N811Q258K891
15232F22421J232k808q106L357m73M23K141K137J752L892N035j492n38Q522P63
$$ plain form
15335 511537 507691 508224 514448 518264 525738 528581 524671 513386 508685 504494 507983 505579 510126 514916
15321 514916 514473 516217 515151 517328 523418 515399 514615 522089 527991 530352 531278 529475 530000 528675 536650
15306 536650 546441 542978 541643 541500 536971 543606 548774 553789 549671 542273 544833 551375 554358 559346
15292 559346 560309 553447 548733 547296 554643 562684 565344 559709 557228 562012 558312 559146 560652 561437 564387
15277 564387 566395 566656 568255 567894 564853 561719 571152 585046 585307 582472 580477 581062 581400 580932 580392 583724
15261 583724 587803 587962 581300 587221 591473 598485 606232 608067 607082 607706 607810 606384 605055 602505 599402
15246 599402 604426 606767 602386 598636 606450 612546 607968 599340 606946 608148 605461 611272 619530 622421
15232 622421 623653 620845 612739 616096 615623 616046 618187 620324 622076 625968 631003 629511 628973 637495 638258
15217F38258P328M441j180p94P98o303j705L93n54J737N040Q609n822j0319j359
15202F38568M112N139P44m666J529J368P408j834N80K854l697m020o92N71N936
15187F53900M072J553o35j105K046M672J094r32l495q383J1070J0704K920l362
15173F74119P097J069k608k986L521O89l872j3223K238L926N250O623R551M47
15159F91841l777j609K668N009k777p267k145K941j591R322P524o317M47J853
15145F96122N614M977N517J980o264k767P343M989K351K483R63k071n885j0037
15131G05315P255O921K741j461m038M924Q801N833l49m994j887q73N057k286j735
15116G29224n35L547N175m75k317N615k263n697K045Q944O570n359J725J191k341
$$ plain form
15217 638258 645586 650027 648847 648053 648851 642548 640843 641236 640682 642419 647459 656068 650246 639927 638568
15202 638568 642680 647819 648563 643897 645426 646794 654202 652368 652948 655802 652105 648085 647393 647964 653900
15187 653900 657972 659525 658890 657785 659831 664503 665597 664665 661170 652787 663857 674561 677481 674119
15173 674119 681216 682285 679677 676691 680212 680901 677029 663806 666044 669970 675220 681843 691394 691841
15159 691841 688064 686455 689123 694132 691355 684088 681943 684884 683293 692615 700139 693822 694269 696122
15145 696122 701736 706713 712230 714210 707946 705179 712522 717511 719862 722345 723308 721237 715352 705315
15131 705315 712570 719491 722232 720771 716733 721657 730458 736291 735942 730948 729061 728188 733245 730959 729224
15116 729224 728689 732236 737411 736936 734619 740234 737971 732274 734319 743263 749833 744474 746199 747390 745049
15101G45049K283M023N668K350L717M179j0817n203o64r35K909N999L842J497
15087G63897n338M413N82j088M592N211L231L348J967j371n330k658k408P790
15073G76838P649m28q0J160L868j002L382j124J736K478r834j459M603M317N794
15058G97898Q537J775q528N337n70J856M671J64n273l002O791N320L481M060k669
15043H19848k068l838j738L316L221M95k801P437J23m584J518J931k496M925N262
15028H30551L130k074n063k355J869K746L604k18j227P70L012L264M624j055J748
15013H43326L236M129K356J579r168L709M571O126L531k452p69J593n869j614
14999H54284M419k974L907R006Q077p696K069P913K084L736k439N533j689q690
$$ plain form
15101 745049 747332 751355 757023 759373 763090 767269 756452 751249 750585 749650 752559 758558 762400 763897
15087 763897 758559 762972 763554 762466 767058 772269 775500 778848 780815 779444 774114 771456 769048 776838
15073 776838 784487 784059 783979 785139 789007 788005 791387 790263 791999 794477 784643 783184 787787 792104 797898
15058 797898 806435 808210 799682 805019 804449 806305 810976 811140 805867 802865 809656 814976 818457 822517 819848
15043 819848 817780 813942 812204 815520 818741 819236 816435 823872 823995 819411 820929 822860 820364 825289 830551
15028 830551 833681 831607 826544 824189 826058 828804 832408 832190 830963 831733 834745 838009 842633 841578 843326
15013 843326 846562 850691 853047 854626 845458 849167 853738 859864 863395 860943 860174 861767 855898 854284
14999 854284 858703 855729 859636 868642 876719 869023 871092 879005 881089 884825 882386 887919 886230 877540
14985H77540n615L223Q766k110q59J629l914K221P501M73j70M137O053J188p322
14970H92741l500O646j095p055L756P166O034P30J195M598J084J1091K948j0526
14956I15813o972K629J12m654L106j930L738N110k381J998m88l3K388L963O510
14941I28909Q52k175O33N524O911L616N892P4l847m319O15k45L44j639K524R573
14925I53242M481K872J576k182N447N451m811j3266l858J2039M866J704M434K654
14911I74649l642N74j918J378O30k40l270L615R632M949k226J1667o29p824o779
14896I80566J0846j03K112N255L735k824m856m470J26L211l022J547K890N552
14882A000565M329k75L48r00n300K332Q478O50k96Q001N224l515k02M012P58o684
$$ plain form
14985 877540 871925 875148 883914 881804 880945 882574 878660 880881 888382 888855 888685 892822 898875 900063 892741
14970 892741 889241 895887 894792 887737 891493 898659 904693 905423 906618 911216 912300 923391 926339 915813
14956 915813 908841 911470 911582 906928 910034 908104 911842 916952 914571 916569 916081 916048 918436 922399 928909
14941 928909 929761 927586 928219 933743 940654 944270 950162 950236 946389 942070 942685 942440 942784 941145 943669 953242
14925 953242 957723 960595 962171 959989 965436 970887 966076 952810 948952 960991 965857 967561 971995 974649
14911 974649 971007 971581 969663 971041 971671 971431 968161 971776 981408 986357 984131 995798 995169 987345 980566
14896 980566 991412 991309 993421 998676 1002411 999587 994731 990261 990387 993598 990576 992123 995013 1000565
14882 1000565 1004894 1004619 1004967 1004067 998767 1001099 1009577 1010227 1009931 1017932 1023156 1019641 1019439 1023451 1024209 1017525
14866A017525l209p06M434K530L820l152k235J118M529N231M931k974K681P832
14852A042355K755P09l110R07J989J279L581q18l29M946R204O493l077J465M079
14837A072428n735q669j583Q051M049N212K049k120K184K680P598L712K342p198
14823A085000k453L767r53J124N625j827Q33P606M646N48k808K521r34J621P371
14808A111687N008L092K971P594M421q344n065k13M693K345K189L230K169j935
14794A133842k150m556k674j835R258P853Q880N218m30O84m51l598P277R468J149
14779A167935m455N429N099N458J453m391K745O049r44m260J118q9N4m79J806
14764A182528K928R213M971J995K041N500K63Rr295j745L923M907R44M309j189
$$ plain form
14866 1017525 1014316 1013610 1018044 1020574 1024394 1021242 1019007 1020125 1024654 1029885 1034816 1031842 1034523 1042355
14852 1042355 1045110 1045819 1042709 1043616 1045605 1046884 1050465 1049647 1049318 1054264 1063468 1069961 1066884 1068349 1072428
14837 1072428 1066693 1058024 1056441 1064492 1068541 1073753 1075802 1073682 1075866 1078546 1086144 1089856 1092198 1085000
14823 1085000 1082547 1086314 1085361 1086485 1092110 1090283 1091116 1098722 1103368 1103916 1101108 1103629 1102695 1104316 1111687
14808 1111687 1116695 1119787 1122758 1130352 1134773 1126429 1121364 1121151 1125844 1128189 1130378 1133608 1135777 1133842
14794 1133842 1131692 1127136 1124462 1122627 1131885 1139738 1148618 1153836 1153406 1154090 1153639 1150041 1157318 1166786 1167935
14779 1167935 1163480 1168909 1174008 1179466 1180919 1176528 1179273 1185322 1184378 1180118 1181236 1181147 1181201 1180722 1182528
14764 1182528 1185456 1194669 1199640 1201635 1203676 1209176 1209439 1209448 1200153 1198408 1202331 1207238 1208182 1212491 1211302
14749A211302K925N005M938J618l11K130K66L693L006l308j067P984J12j483O416
14734A243226J604M51N880L427K093j81K520P47P526J09M320J1394j129o128P284
14719A283143P486L186L383J0377J827N20O968P499J3381K0020J9004K0122J0774
14706A407690Q046l922j3891k3137l0909l3912m2564l6716k6265j0270m34N071
14694A198787J5361J9214J3762N137k3n75L338O663J0682P877K326N256J662J2816
14680A302283J1810N845K90k178n214m322J880L357N807L213K340O608m65M846
14666A336100L845N936q43j0228o049O434J3050J2152L468J899k278L860R428
14653A376774O194M067l155L099M403P775M52j40O58M249k417n671O695P402N839
$$ plain form
14749 1211302 1214227 1219232 1224170 1225788 1225477 1227607 1227873 1231566 1234572 1231264 1230197 1238181 1238293 1236810 1243226
14734 1243226 1244830 1245281 1251161 1254588 1256681 1256500 1259020 1259767 1267293 1267402 1271722 1283116 1281987 1275859 1283143
14719 1283143 1290629 1293815 1297198 1307575 1309402 1309922 1316890 1324389 1337770 1357790 1376794 1396916 1407690
14706 1407690 1415736 1411814 1397923 1374786 1343877 1309965 1267401 1230685 1204420 1194150 1193716 1198787
14694 1198787 1214148 1233362 1247124 1252261 1252238 1251663 1255001 1261664 1272346 1280223 1282549 1287805 1289467 1302283
14680 1302283 1314093 1319938 1320228 1318050 1312836 1308514 1310394 1313751 1319558 1322771 1325111 1331719 1331254 1336100
14666 1336100 1339945 1345881 1345038 1334810 1328761 1335195 1348245 1360397 1363865 1365764 1363486 1367346 1376774
14653 1376774 1382968 1387035 1383880 1386979 1391382 1399157 1399609 1399469 1400127 1404376 1401959 1396288 1402983 1410385 1416224
14638A416224J506M14N253k243O176P906J471p226L198K241P907L021L232L786
14624A452866N53L266L25M572M400Q78K997N268o226J192R231O714J661N055L376
14609A496128q39N36j557J2505L986j808j949J0125J6217k223q21N287K619j165
14595A537041J936m829N49O235R239Q005J070j529J05M047L647O201P104L968
14581A582789P206m903m63O956O258O44N307K638N580J0p46N395J1479L799J216
14566A633165O760N119R32M049O070M563M390l227j479M549L990N799J0830j381
14552A684129L87J270M617J2164L241R62J388K24j075Q889N978P221Q969N777
14538A744141O272J343j278K22K384R072P596J3365M199n944m34P179O737P127
$$ plain form
14638 1416224 1417730 1418144 1423397 1421154 1427330 1435236 1436707 1429481 1432679 1434920 1442827 1445848 1449080 1452866
14624 1452866 1453419 1456685 1457010 1461582 1465982 1466860 1469857 1475125 1468899 1470091 1479322 1486036 1487697 1492752 1496128
14609 1496128 1495289 1495825 1494268 1506773 1510759 1508951 1507002 1517127 1533344 1531121 1530300 1535587 1538206 1537041
14595 1537041 1538977 1534148 1534697 1540932 1550171 1558176 1559246 1557717 1557822 1561869 1565516 1571717 1578821 1582789
14581 1582789 1589995 1585092 1584629 1591585 1597843 1598487 1603794 1606432 1612012 1612022 1611276 1616671 1628150 1631949 1633165
14566 1633165 1639925 1645044 1645976 1650025 1656095 1660658 1665048 1661821 1660342 1664891 1668881 1674680 1685510 1684129
14552 1684129 1684516 1685786 1690403 1702567 1705808 1706770 1708158 1708382 1707307 1716196 1722174 1729395 1738364 1744141
14538 1744141 1750413 1751756 1750478 1750700 1753084 1762156 1769752 1783117 1787316 1781372 1780938 1788117 1794854 1801981
14524A801981J5575J0107O85j464J434N797J0756J3996J6335J2290J0293O631
14512A904416Q098J3270J1475K0077J0318J1378J6894P688J5529J1837J3390K2687
14500B067057K6396K2479J6266J2484N587j0112k4233m2502n5361o3350o8344
14489A886367p4810o6266o6938o0593n0205l2000p173m738O349J3352J9136J6050
14477A578531R849J6913J4859J2404J7858Q818J2314J6613K0145J6787J4255J0509
14465A749855J6970J3338J0826J1567J1252J0976M775J856J637R711Q374M033
14453A855170N337J0824P981Q471J0883R729P300M363O764N588Q952N838N800
14440A953000r08M543O565M278R983J4143J709K436Q673J0322O167j481N660P903
$$ plain form
14524 1801981 1817556 1827663 1828348 1826884 1828318 1834115 1844871 1858867 1875202 1887492 1897785 1904416
14512 1904416 1912514 1925784 1937259 1957336 1967654 1979032 1995926 2003614 2019143 2030980 2044370 2067057
14500 2067057 2093453 2115932 2132198 2144682 2150269 2140157 2115924 2073422 2018061 1954711 1886367
14489 1886367 1811557 1745291 1678353 1617760 1567555 1535555 1528382 1523644 1529993 1543345 1562481 1578531
14477 1578531 1588380 1605293 1620152 1632556 1650414 1659232 1671546 1688159 1708304 1725091 1739346 1749855
14465 1749855 1766825 1780163 1790989 1802556 1813808 1824784 1829559 1831415 1833052 1842763 1851137 1855170
14453 1855170 1860507 1871331 1879312 1887783 1898666 1908395 1915695 1920058 1926822 1932410 1941362 1947200 1953000
14440 1953000 1952092 1956635 1963200 1967478 1977461 1991604 1993313 1995749 2004422 2014744 2020911 2019430 2025090 2032993
14426B032993R785Q032M668P758J1421J449N14k942O778J4777J286j975N501O516
14412B106561L769M377J1353J4547K985L584J0979J0685K539k566J2565J8996
14400B200374R438o43k259J375J8700L581L164l283O630J0436J376J4192O577
14387B269658O592M478O02J377O991J6455P588J0691Q899N763M016O127M711k886
14373B351062P243M703R529R610J2067N495L486O738J1111P384J4097J0880M706
14360B458111M237J1357J4333Q313J1921J4841Q304L895L637M323N613J5593J1300
14347B575778N761J4719R555Q301Q275J4691J1253J0747m86k211O159J3849N491
14334B681882q62q559j946J0457O868J0938R763P689J015O006N299J0440J1541
$$ plain form
14426 2032993 2042778 2050810 2055478 2063236 2074657 2076106 2076620 2073678 2080456 2095233 2096519 2094544 2100045 2106561
14412 2106561 2110330 2114707 2126060 2140607 2143592 2147176 2158155 2168840 2171379 2168813 2181378 2200374
14400 2200374 2209812 2209169 2206910 2208285 2226985 2230566 2233730 2230447 2237077 2247513 2248889 2263081 2269658
14387 2269658 2276250 2280728 2281330 2282707 2289698 2306153 2313741 2324432 2333331 2339094 2343110 2349237 2353948 2351062
14373 2351062 2358305 2363008 2372537 2382147 2394214 2399709 2403195 2409933 2421044 2428428 2442525 2453405 2458111
14360 2458111 2462348 2473705 2488038 2496351 2508272 2523113 2531417 2535312 2538949 2543272 2548885 2564478 2575778
14347 2575778 2581539 2596258 2605813 2614114 2622389 2637080 2648333 2659080 2658594 2656383 2662542 2676391 2681882
14334 2681882 2681020 2672461 2670515 2680972 2687840 2698778 2708541 2716230 2717245 2723251 2728550 2738990 2750531
14321B750531J661j31J1888J5709J4688J9019J2463J3864Q555J0097Q785J2980
14309B880109J4411R819J1910J8249J3721J2243P615J2790J5136J6307J2716Q884
14297C033910J2718J3397Q805J2765J6713J2711J1821K540L265k786k256p522
14285C116081J30O786J0590M945P710J4114J6800J2482J3449J3062J9013K1000
14273C256162J3459J2966J2397J6401J9037J2967N100J5109J3008K987P652J2834
14261C400079J3006J8832J9730J0742J4536K1763K2136J5392J7211J7015J0816
14250C581258K78J3202J7963J9455J6774K0241J6617J3670K1904K3607K4220K0070
14238C789259J7320K0889J7358K2772K0643K0541K1911J4527J7055J1064J5690
$$ plain form
14321 2750531 2752192 2752061 2763949 2779658 2794346 2813365 2825828 2839692 2848247 2858344 2867129 2880109
14309 2880109 2894520 2904339 2916249 2934498 2948219 2960462 2968077 2980867 2996003 3012310 3025026 3033910
14297 3033910 3046628 3060025 3068830 3081595 3098308 3111019 3122840 3125380 3128645 3125859 3123603 3116081
14285 3116081 3116211 3122997 3133587 3138532 3146242 3160356 3177156 3189638 3203087 3216149 3235162 3256162
14273 3256162 3269621 3282587 3294984 3311385 3330422 3343389 3348489 3363598 3376606 3379593 3387245 3400079
14261 3400079 3413085 3431917 3451647 3462389 3476925 3498688 3520824 3536216 3553427 3570442 3581258
14250 3581258 3581536 3594738 3612701 3632156 3648930 3669171 3685788 3699458 3721362 3744969 3769189 3789259
14238 3789259 3806579 3827468 3844826 3867598 3888241 3908782 3930693 3945220 3962275 3973339 3989029
14227C989029J6349J1509J4809K1743J9014J7663J4548J5915J9994K3804J7593
14216D181970K2880K6669K7277K1184K0563K7696K0090J8202K0573L1489L3185
14205D451778K8498K5735K9061L2964K0963K1313J6209L0184L2245K1530K3539
14194D734019K9009L8312L5922K6046L0449M2839K9169K3584L3359L7117L2177
14183E092002L4648L3161L6014L2086L1594L7325K9624L2393M0447L0350M0832
14172E470476M3223M2686M0875L7682M3242M8870N5297N0597O0675N7894M5624
14161E997141N2419M9918M2209M3773M3374M5570M2736M4685M8116N4396N0156
14150F514493M6163N2709N9690N4662M8189O0964N7266O0480N9452O3733N8364
$$ plain form
14227 3989029 4005378 4016887 4031696 4053439 4072453 4090116 4104664 4120579 4140573 4164377 4181970
14216 4181970 4204850 4231519 4258796 4279980 4300543 4328239 4348329 4366531 4387104 4418593 4451778
14205 4451778 4480276 4506011 4535072 4568036 4588999 4610312 4626521 4656705 4688950 4710480 4734019
14194 4734019 4763028 4801340 4837262 4863308 4893757 4936596 4965765 4989349 5022708 5059825 5092002
14183 5092002 5126650 5159811 5195825 5227911 5259505 5296830 5326454 5358847 5399294 5429644 5470476
14172 5470476 5513699 5556385 5597260 5634942 5678184 5727054 5782351 5832948 5893623 5951517 5997141
14161 5997141 6049560 6099478 6141687 6185460 6228834 6274404 6317140 6361825 6409941 6464337 6514493
14150 6514493 6560656 6613365 6673055 6727717 6775906 6836870 6894136 6954616 7014068 7077801 7136165
14139G136165O7346P5023O6126O0622N7002O3077P0577P5815P4957Q7281Q5659
14128G919650P6764Q4922P9218P5019Q6979R8128J00043R8340R5963J03136J09953
14117H928115R7252J05595J09904J13278J05027R6215J06999J06425J08921J17432
14107I995163J19516J23725J33047J34980J34052J44569J58589J62337J68547
14098A1274525J75421J85202J85075J90605J99418K12847K15332K21893K25209
14089A3085527K26546K35940K48335K63742K70595K69991K82168L00686L10972
14080A5494502L22329L30890L50862L63346L90989M11160M27195M54417M76085
14071A9021775N01603N30716N55221N83448O14006O52083O89839P28672P77419
$$ plain form
14139 7136165 7203511 7278534 7344660 7405282 7462284 7525361 7595938 7671753 7746710 7833991 7919650
14128 7919650 7996414 8081336 8160554 8235573 8322552 8420680 8520723 8619063 8715026 8818162 8928115
14117 8928115 9025367 9130962 9240866 9354144 9459171 9555386 9662385 9768810 9877731 9995163
14107 9995163 10114679 10238404 10371451 10506431 10640483 10785052 10943641 11105978 11274525
14098 11274525 11449946 11635148 11820223 12010828 12210246 12423093 12638425 12860318 13085527
14089 13085527 13312073 13548013 13796348 14060090 14330685 14600676 14882844 15183530 15494502
14080 15494502 15816831 16147721 16498583 16861929 17252918 17664078 18091273 18545690 19021775
14071 19021775 19523378 20054094 20609315 21192763 21806769 22458852 23148691 23877363 24654782
14062B4654782Q28429Q83578R42586J012997J082495J162527J249510J346526
14054C3163430J442498J557322J680006J821725J979931K148268K335793K522758
14046D8651731K704048K840639K902249K780240K325744J343933l51075k775024
14038F0422485n687671q558235j0839973j2295786j3072716j3428317j3336852
14031a6797065j2533668j0813811q316939n503908k915222q75048N31422J410720
14023e5813519J901677K131340K218568K217954K167446K080042J972118J835252
14015c9289122J679242J550913J451203J377832J327306J258538J177155J109875
14007b8357058J043736R60996Q98773Q48939P90986P46217P03650O66694O32230
$$ plain form
14062 24654782 25483211 26366789 27309375 28322372 29404867 30567394 31816904 33163430
14054 33163430 34605928 36163250 37843256 39664981 41644912 43793180 46128973 48651731
14046 48651731 51355779 54196418 57098667 59878907 62204651 63548584 63197509 60422485
14038 60422485 54734814 46176579 35336606 23040820 9968104 -3460213 -16797065
14031 -16797065 -29330733 -40144544 -48461483 -53965391 -56880613 -57755661 -57224239 -55813519
14023 -55813519 -53911842 -51780502 -49561934 -47343980 -45176534 -43096492 -41124374 -39289122
14015 -39289122 -37609880 -36058967 -34607764 -33229932 -31902626 -30644088 -29466933 -28357058
14007 -28357058 -27313322 -26352326 -25453553 -24604614 -23813628 -23067411 -22363761 -21697067 -21064837
13998b1064837N98657N65930N32291M95136M84642M70973M43144M16142L99624
13989a6658298L86865L68872L57836L40673L34186L20724L05151K82979K75704
13980a3685308K68302K61596K49796K35891K26699K17295K08775K06368J99456
13971a1611130J92052J93823J75765J72506J62921J62539J57562J52901J50742
13962a0090319J47514J40910J38176J34192J42881J40869J28619J26674J27672
13953h862812J28189J22053J15252J10770J02477R7603J03185R5625R0897Q6107
13943g810654R5116R7117Q5604Q3977Q9015Q6798Q0495P6756P9370P7561P6785
13932f882060P9594P2804P5289P6479P3342P4371P1416O6455O7504O9994O5699
$$ plain form
13998 -21064837 -20466180 -19900250 -19367959 -18872823 -18388181 -17917208 -17474064 -17057922 -16658298
13989 -16658298 -16271433 -15902561 -15544725 -15204052 -14869866 -14549142 -14243991 -13961012 -13685308
13980 -13685308 -13417006 -13155410 -12905614 -12669723 -12443024 -12225729 -12016954 -11810586 -11611130
13971 -11611130 -11419078 -11225255 -11049490 -10876984 -10714063 -10551524 -10393962 -10241061 -10090319
13962 -10090319 -9942805 -9801895 -9663719 -9529527 -9386646 -9245777 -9117158 -8990484 -8862812
13953 -8862812 -8734623 -8612570 -8497318 -8386548 -8284071 -8186468 -8083283 -7987658 -7896761 -7810654
13943 -7810654 -7715538 -7618421 -7532817 -7448840 -7359825 -7273027 -7192532 -7115776 -7036406 -6958845 -6882060
13932 -6882060 -6802466 -6729662 -6654373 -6577894 -6504552 -6430181 -6358765 -6292310 -6224806 -6154812 -6089113
13921f089113O1502O0712N9206N9016N7309N1391N9950N9880N6558M9498M7542
13910e466549M8567N2896M7878M2208L7126M1397K7821L4878L3722K3777L8147
13899e038132L5028L5328L9419L5232L6013L0059L8123M2038M1358M0007L2488
13888d633039L9592L4252L1559K9025L0259L7435M0434L0988J9980L0685K9584
13877d279246K6128L1859L1300L5237L4248L0575L0691L3304K4835K4319K6445
13866c950305K1525K0014K7635K6284K6560K7455L0115K0922K3647K8665K1008
13855c676475J7586K4887K6390K2009K1767K2346K4264K4284K2286K3497K7031
13844c420128K7934L0842L0753J8570J6063K8963K7997L0151K6308K5466J6618
$$ plain form
13921 -6089113 -6027611 -5966899 -5907693 -5848677 -5791368 -5739977 -5680027 -5620147 -5563589 -5514091 -5466549
13910 -5466549 -5417982 -5365086 -5317208 -5275000 -5237874 -5196477 -5168656 -5133778 -5100056 -5076279 -5038132
13899 -5038132 -5003104 -4967776 -4928357 -4893125 -4857112 -4827053 -4788930 -4746892 -4705534 -4665527 -4633039
13888 -4633039 -4593447 -4559195 -4527636 -4498611 -4468352 -4430917 -4390483 -4359495 -4339515 -4308830 -4279246
13877 -4279246 -4253118 -4221259 -4189959 -4154722 -4120474 -4089899 -4059208 -4025904 -4001069 -3976750 -3950305
13866 -3950305 -3928780 -3908766 -3881131 -3854847 -3828287 -3800832 -3770717 -3749795 -3726148 -3697483 -3676475
13855 -3676475 -3658889 -3634002 -3607612 -3585603 -3563836 -3541490 -3517226 -3492942 -3470656 -3447159 -3420128
13844 -3420128 -3392194 -3361352 -3330599 -3312029 -3295966 -3267003 -3239006 -3208855 -3182547 -3157081 -3140463
13833c140463K1805L1736K1183K5672K5172J9537K1149K8960L4924L3453K1924
13822b854948N920j5452l9122n3896l6084j0264J1093J3661K6556L5474L2760
13811b884302J9271J8912K1053K8194K4655J7909K0158J9634K0881J9519K2662
13800b651454J7828K1621J8127K5072K1983K4273J9383J0726N688P18m244l995
13788b494274j2808j6891j0290j1103j4417q9N147R648Q529K0464K1205J7502
13776b477377J2963J0493J4909J7884J3658K1080K3423J5396Q84Q109J3637R889
13764b315052J2046J4929J0847J1871J0632R886O538L441J6629J6914R997J0277
13752b181045Q088R162K202N049J285J1794J2496J3130J0433J1464J0396P320
$$ plain form
13833 -3140463 -3118658 -3086922 -3065739 -3040067 -3014895 -2995358 -2974209 -2945249 -2910325 -2876872 -2854948
13822 -2854948 -2849028 -2864480 -2903602 -2957498 -2993582 -3003846 -2992753 -2979092 -2952536 -2917062 -2884302
13811 -2884302 -2865031 -2846119 -2825066 -2796872 -2772217 -2754308 -2734150 -2714516 -2693635 -2674116 -2651454
13800 -2651454 -2633626 -2612005 -2593878 -2568806 -2546823 -2522550 -2503167 -2492441 -2486753 -2486035 -2490279 -2494274
13788 -2494274 -2507082 -2523973 -2534263 -2545366 -2559783 -2559872 -2554725 -2545077 -2536548 -2516084 -2494879 -2477377
13776 -2477377 -2464414 -2453921 -2439012 -2421128 -2407470 -2386390 -2362967 -2347571 -2346687 -2338578 -2324941 -2315052
13764 -2315052 -2303006 -2288077 -2277230 -2265359 -2254727 -2244841 -2238303 -2234862 -2218233 -2201319 -2191322 -2181045
13752 -2181045 -2172957 -2163795 -2161593 -2156544 -2155259 -2143465 -2130969 -2117839 -2107406 -2095942 -2085546 -2078226
13740b078226R070J9912J3139J3020J9379J6154J5208J4480J6734J3884J9923
13729a907323J1937N023Q499O738L374P348P256P026M549Q156R731L861Q781J3639
13715a801405O715O526L892J0420N651K342P747O316J0137N828O991J1134M638
13702a713068M974M244J3052P206O091Q915R881Q080J1152P126M21N357J8191
13689a608378M840J664O154J1783Q024J438P721j490O794P721R597L580K473L050
13675a535029p00R854P665Q504O250O933L712O648R094R344l34m140P552J4873
13661a449774J4335P480M005N546O334q03R464J0152R109K136R402R173L591M223
13647a355627K955K985J0296K315M083O095N664N591O861Q813J423O667M522O818
$$ plain form
13740 -2078226 -2069156 -2049244 -2036105 -2023085 -2003706 -1987552 -1972344 -1957864 -1941130 -1927246 -1907323
13729 -1907323 -1895386 -1890363 -1881864 -1875126 -1871752 -1864404 -1857148 -1850122 -1845573 -1837417 -1827686 -1823825 -1815044 -1801405
13715 -1801405 -1794690 -1788164 -1784272 -1773852 -1768201 -1765859 -1758112 -1751796 -1741659 -1735831 -1728840 -1717706 -1713068
13702 -1713068 -1708094 -1703850 -1690798 -1683592 -1677501 -1668586 -1658705 -1650625 -1639473 -1632347 -1631926 -1626569 -1608378
13689 -1608378 -1603538 -1601874 -1595720 -1583937 -1575913 -1574475 -1566754 -1568244 -1561450 -1553729 -1544132 -1540552 -1538079 -1535029
13675 -1535029 -1535729 -1525875 -1518210 -1509706 -1503456 -1496523 -1492811 -1486163 -1477069 -1467725 -1468059 -1472199 -1464647 -1449774
13661 -1449774 -1435439 -1427959 -1423954 -1418408 -1412074 -1412877 -1403413 -1393261 -1384152 -1382016 -1372614 -1363441 -1359850 -1355627
13647 -1355627 -1352672 -1349687 -1339391 -1337076 -1332993 -1326898 -1321234 -1315643 -1308782 -1299969 -1298546 -1291879 -1287357 -1280539
13633a280539J2877L004N186P526K205Q381O325O466N064J2421Q175N074N869
13620a191966L024K527J622R604J0093J2131J1719K869N88Q539J9865J4790k558
13607a097153O484P303J950J0564J1734P033R190Q257J1021J4910J1127O306P914
13594i83360O202K744P825J5303J1177J1236J1952K1658J5923Q948J6019J9742
13582h34631J1951J4445K4459J5934Q394l261r099k0062m8052n8897o6444o9926
13570a035189p0991o4739n8996n1314l7556k3785m606L898J1614N590J6697J7352
13558a292025J7985K0586J5748J3107J6415J4331J0775J2639M723J2756K0971
13547a131989J7497O247N107Q844L699J7746J7988Q415M992J1350P479M027R339
$$ plain form
13633 -1280539 -1267662 -1264658 -1259472 -1251946 -1249741 -1241360 -1235035 -1228569 -1223505 -1211084 -1202909 -1197835 -1191966
13620 -1191966 -1188942 -1186415 -1184793 -1175189 -1165096 -1152965 -1141246 -1138377 -1137789 -1129250 -1109385 -1094595 -1097153
13607 -1097153 -1090669 -1083366 -1081416 -1070852 -1059118 -1052085 -1042895 -1034638 -1023617 -1008707 -997580 -991274 -983360
13594 -983360 -977158 -974414 -966589 -951286 -940109 -928873 -916921 -895263 -879340 -870392 -854373 -834631
13582 -834631 -822680 -808235 -783776 -767842 -759448 -762709 -771808 -791870 -839922 -898819 -965263 -1035189
13570 -1035189 -1106180 -1170919 -1229915 -1281229 -1318785 -1342570 -1347176 -1343278 -1331664 -1326074 -1309377 -1292025
13558 -1292025 -1274040 -1253454 -1237706 -1224599 -1208184 -1193853 -1183078 -1170439 -1165716 -1152960 -1131989
13547 -1131989 -1114492 -1108245 -1103138 -1094294 -1090595 -1072849 -1054861 -1046446 -1041454 -1030104 -1022625 -1018598 -1009259
13534a009259J1597K0591K2774K1484R693k1108m5172l5729k4613l780Q554O817
13522a038151J5689J0822N761Q961J4536K0966N145J470Q936J1408O034L803N324
13509i19296N373J1597O064M361L237P09R66O558R236J5945J1070M793M078J476
13495h33833R676J2991O914J4393N423J3511K2394K8207K3149K5627j5413p1099
13483g58060q7303o9715l4646J105O761J4031Q654J8142J2642J3177R298J0867
13471h55047J2688J0350O381J0605O043N866L410j049q554p88N978M853M329J0433
13457g84502L874p69P264N853J0729J1730J2212J2958l640N311N827P386J2569
13444f93198J6772J5684J4995K086l4995n1346m3804j7472j658N872O536J6565
$$ plain form
13534 -1009259 -997662 -977071 -954297 -932813 -923120 -944228 -989400 -1025129 -1049742 -1053522 -1044968 -1038151
13522 -1038151 -1022462 -1011640 -1005879 -996918 -982382 -961416 -956271 -954801 -945865 -934457 -928423 -924620 -919296
13509 -919296 -913923 -902326 -896262 -891901 -888664 -887955 -886989 -880431 -871195 -855250 -844180 -839387 -835309 -833833
13495 -833833 -824157 -811166 -804252 -789859 -784436 -770925 -748531 -720324 -697175 -671548 -686961 -758060
13483 -758060 -845363 -915078 -949724 -948619 -941858 -927827 -919173 -901031 -888389 -875212 -865914 -855047
13471 -855047 -842359 -832009 -825628 -815023 -808980 -803114 -799704 -800753 -809307 -810095 -804117 -799264 -794935 -784502
13457 -784502 -780628 -781397 -774133 -768280 -757551 -745821 -733609 -720651 -724291 -718980 -713153 -705767 -693198
13444 -693198 -676426 -660742 -645747 -643661 -678656 -730002 -773806 -791278 -792936 -787064 -780528 -763963
13432g63963J4017J3523J0509J975J66N716O950M186J1022Q570P73K18K971J0971
13418f72396K869l726L96J4309R343q4o836m008M996M319J0302L496J710O833
13404f28477L437n53k090k149P143N551J274R66j460Q58P087P45k289P160M473
13389e98324M447L764L405l09K278N028N769Q608M498K319p16K174P562P40K757
13374e46000k872k744M340o135N731Q443N232P684J50N784N93P852j547J54K065
13359e11270j562M666J168k179P042L202O083L863P22k880O432O119p475P051
13345d79018L872N387P336L712q44p29Q621M309N289P624P052r24p406j5197n859
13330d56775J754J2868O456o28Q650M229n093Q61M073M249N754O744k145o943
$$ plain form
13432 -763963 -749946 -736423 -725914 -723939 -723773 -718057 -711107 -706921 -695899 -687329 -686556 -686338 -683367 -672396
13418 -672396 -669527 -673253 -672857 -658548 -649205 -649289 -656125 -660133 -655137 -650818 -640516 -637020 -635310 -628477
13404 -628477 -625040 -625593 -627683 -629832 -622689 -617138 -615864 -614898 -616358 -615500 -608413 -607668 -609957 -602797 -598324
13389 -598324 -593877 -590113 -586708 -587017 -584739 -579711 -573942 -565334 -560836 -558517 -559233 -557059 -549497 -548757 -546000
13374 -546000 -548872 -551616 -547276 -553411 -547680 -539237 -534005 -526321 -526171 -520387 -519794 -511942 -513489 -513335 -511270
13359 -511270 -512832 -508166 -506998 -509177 -502135 -498933 -492850 -488987 -488265 -491145 -484713 -478594 -486069 -479018
13345 -479018 -475146 -469759 -462423 -458711 -459555 -460284 -451663 -447354 -442065 -434441 -427389 -428313 -435719 -450916 -456775
13330 -456775 -455021 -442153 -435697 -436325 -427675 -423446 -428539 -427678 -423605 -419356 -413602 -406858 -409003 -415946
13316d15946n957M429l4K195R81j163M650P974M727QL343k876L02K656P817L58
13300c86536j122K156K968J0567p78l33N639J767o65O674J768O095P403p1l737
13285c48205k889N120R534P825J687M367M196k116m77J1477P213p54p785l876
13271c14683M469K511P4J0155O185k288l088n75q64J0629J8776M622k394n38L906
13256b63103Q371N625L790K674n225J276L330K026P178Q331L097J1101O835N673
13242a99021N699j489L39L124J2K703N579J1950J5914J3616R311j7600l6713k9463
13228b16039j5470j080N660J3564J1315O691J1395J7156J1587R734K1739K1363
13216a02385j2503l7955l9715j9122q601Q528J2944Q494J0489M306J3718R686
$$ plain form
13316 -415946 -421903 -417474 -417508 -415313 -414332 -415495 -410845 -402871 -398144 -398136 -394793 -397669 -397367 -394711 -386894 -386536
13300 -386536 -387658 -385502 -382534 -371967 -372745 -373078 -367439 -365672 -366337 -359663 -357895 -351800 -344397 -344468 -348205
13285 -348205 -351094 -345974 -336440 -328615 -326928 -322561 -318365 -320481 -320958 -309481 -302268 -303022 -310807 -314683
13271 -314683 -310214 -307703 -307629 -297474 -291289 -293577 -296665 -297240 -298104 -287475 -268699 -264077 -266471 -267009 -263103
13256 -263103 -254732 -249107 -245317 -242643 -247868 -246592 -243262 -241236 -234058 -225727 -222630 -211529 -204694 -199021
13242 -199021 -193322 -194811 -194472 -191348 -191336 -188633 -183054 -171104 -155190 -141574 -132263 -149863 -186576 -216039
13228 -216039 -231509 -232589 -226929 -213365 -202050 -195359 -183964 -166808 -155221 -145487 -123748 -102385
13216 -102385 -114888 -152843 -192558 -211680 -220281 -211753 -198809 -190315 -179826 -175520 -161802 -152116
13204a52116K291K805M409J279j720Q16O026K277M329P627J2591M148K079N627
13190i7532J2969J4737L112O287J3089R619K0380J3718P973R768R798J8708K6564
13177F9190K3370J9517K6943K0952K8965L5341M4523O1560N7779K5702m9903j47767
13165B16172k12533j97506j15107l7641J9781M0033M4800M3465L3889Q811j3085
13154a68921p774l130P566K4849L4398L6529K8561K2635J9229K4310L1729L0990
13142H0971K7369M115j8744j3302M345J3771K3012L1745L9492N1760N1473M7666
13130C43673O2777O7808Q5235J07062J30841J53685J64572R3041j10051l93998
13120G04645o22876o36053m47791j93007K780R8727J05763R7605Q6597P3210N5410
$$ plain form
13204 -152116 -149825 -147020 -142611 -141332 -143052 -142236 -136210 -133933 -129604 -121977 -109386 -105238 -103159 -97532
13190 -97532 -84563 -69826 -66714 -60427 -47338 -37719 -17339 -3621 4352 14120 23918 42626 69190
13177 69190 92560 112077 139020 159972 188937 224278 268801 330361 388140 413842 363939 216172
13165 216172 3639 -193867 -308974 -346615 -326834 -286801 -242001 -198536 -164647 -155836 -168921
13154 -168921 -176695 -179825 -172259 -147410 -113012 -76483 -47922 -25287 -6058 18252 49981 80971
13142 80971 108340 112455 93711 80409 84754 98525 121537 153282 192774 244534 296007 343673
13130 343673 406450 474258 559493 666555 797396 951081 1115653 1208694 1098643 704645
13120 704645 81769 -554284 -1002075 -1195082 -1192302 -1093575 -987812 -890207 -803610 -730400 -674990
13109f74990M8643M4006M9788M8977L9652K9391L6354M0627L8597K9981K4227
13098b44747K7486L1416L7330K6495K5479K7524L0291K7189L4405M1210L6561
13087A00639M3030N0643N5566O5161Q2616J00250J16879J58000J77519J29087
13077A079390m1749l32944o01747o81039n15296k51950l1916Q2130J21273J06564
13067a067284R2839P5004O0364N2982M6909L8319M0010M2303L2389K8238K2432
13056e35495K7663L0640K3425J5295J5718J3896J5516J4284J8559K8848K5411
13045c06240J3726K1172K0738K3050K2732K1731K7888K4156K2592L4514N0272
13034b3669O0107O1056R365r6240j91359k19785j78096r5372j8420K4395M3205
$$ plain form
13109 -674990 -626347 -582341 -532553 -483576 -443924 -414533 -378179 -337552 -298955 -268974 -244747
13098 -244747 -217261 -185845 -148515 -122020 -96541 -69017 -38726 -11537 22868 64078 100639
13087 100639 143669 194312 249878 315039 397655 497905 614784 772784 950303 1079390
13077 1079390 1037641 704697 102950 -578089 -1093385 -1345335 -1377251 -1295121 -1173848 -1067284
13067 -1067284 -974445 -899441 -839077 -786095 -739186 -700867 -660857 -618554 -586165 -557927 -535495
13056 -535495 -507832 -477192 -453767 -438472 -422754 -408858 -393342 -379058 -360499 -331651 -306240
13045 -306240 -292514 -271342 -250604 -227554 -204822 -183091 -155203 -131047 -108455 -73941 -23669
13034 -23669 36438 97494 106859 10619 -180740 -400525 -578621 -673993 -692413 -668018 -624813
13023f24813M1966L2434K4816K2397J5345J7354J6276J6211J4767J5531J0433
13012c97283J6127J1591R318J4116P309L321MN921J3543J3271P573K170P110L305
12998b82604M175P644K472N651J2420M4l333M939Q562O105m290R30N924N201J1360
12983b14800Q364p61J408J936O009J138O785Q29J692O214P241K414J088M686j668
12968a67425m662Q40L493P979P573k82r52K671Q542O535J842K082O294M234L680
12953a17556J120k701L724m40R27m58K772J001j658j978K53K138P795P914l973
12938a01120P08J919R078J05l076P605N745M215m55R554N164l037o529j499O822
12923f4801l315J325M996L890j626k114J478l959L345Q243j006J176j408M121
$$ plain form
13023 -624813 -582847 -550413 -525597 -503200 -487855 -470501 -454225 -438014 -423247 -407716 -397283
13012 -397283 -381156 -369565 -360247 -346131 -338822 -335501 -335497 -329576 -316033 -302762 -295189 -293019 -285909 -282604
12998 -282604 -278429 -270785 -268313 -262662 -250242 -250198 -253531 -248592 -240030 -233925 -238215 -237285 -231361 -226160 -214800
12983 -214800 -206436 -207197 -205789 -203853 -197844 -196706 -189921 -189092 -187400 -181186 -173945 -171531 -170443 -165757 -167425
12968 -167425 -172087 -171247 -167754 -159775 -152202 -152484 -153436 -150765 -142223 -135688 -133846 -131764 -125470 -121236 -117556
12953 -117556 -116436 -119137 -115413 -115853 -114926 -115384 -112612 -111611 -113269 -115247 -114994 -112856 -105061 -97147 -101120
12938 -101120 -100412 -98493 -89415 -89310 -92386 -84781 -79036 -74821 -75276 -65722 -60558 -63595 -70124 -71623 -64801
12923 -64801 -68116 -66791 -61795 -57905 -59531 -61645 -60167 -64126 -60781 -52538 -53544 -52368 -53776 -49655
12909d9655O665P011K567j820M000L90p234j817Q961K870m88M735M236l095j496
12894b4170R710Q724n955m196J754P880j431J396P952M077m564m949N335P932
12880I495O174R053O315p331r74j96j55k368O282j976m74J849j655K861K567m92
12864B8975J166k888L728K687M169K988n594L728J104o780J58K357l468Q54L958
12849C7142R129M818L76K02K969K028J116L214L405j100J431m740j289N100P178
12834G0979N923J391R61L011j692m361K696j285K597P219L547J72K669l523K348
12819I2652J059L162m303L551P473J828M679J144n09K524m278r770M313R800J193
12804A14518p994p42J872j898N617O143L031N028J486M214O75m087r906j210N287
$$ plain form
12909 -49655 -42990 -35979 -33412 -35232 -31232 -30842 -38076 -39893 -30932 -28062 -28550 -23815 -19579 -22674 -24170
12894 -24170 -14460 -5736 -11691 -15887 -14133 -6253 -7684 -6288 1664 5741 1177 -3772 1563 9495
12880 9495 15669 24722 31037 23706 22732 22536 22381 20013 26295 24319 23845 25694 24039 26900 29467 28975
12864 28975 30141 27253 30981 33668 37837 40825 35231 38959 40063 33283 33441 35798 32330 33184 37142
12849 37142 46271 51089 51465 51667 54636 56664 57780 60994 64399 63299 64730 59990 58701 63801 70979
12834 70979 76902 78293 79254 82265 80573 76212 78908 77623 80220 87439 90986 91158 93827 90304 92652
12819 92652 93711 96873 92570 96121 103594 105422 110101 111245 110736 113260 108982 99212 103525 113325 114518
12804 114518 106524 105782 107654 105756 111373 117516 120547 125575 127061 131275 131950 127863 117957 116747 122034
12789A22034M857L184L988Q230J608l602J489P140k289k892j76N161J092j413
12775A48411M700L579l020r53j766N622L802L668l67j008L029j405J784P225M048
12760A77349O22l020M69M800m980O04N542K59Q710O607m907p125j218L722N033
12745A92467L929o075J814K373K751j12J292N890N505j585k235l332J807L322
12731B07811l701J152N022J446j152O187J912Q70J538K142O361R18K670J1053
12717B44229p59n939J813R310J632K359N819o079K285M808J915O877K263j0596
12703B59937l763J30L059K304M433j800o128K422J1165K086r801l552l854O080
12689B62718J0528J1220P092o803q561q26Q793M800P012k209j275l334J649k103
$$ plain form
12789 122034 126891 130075 134063 142293 143901 140299 141788 148928 146639 143747 143571 148732 149824 148411
12775 148411 153111 156690 153670 152717 150951 156573 160375 164043 163676 162668 165697 164292 166076 173301 177349
12760 177349 177971 174951 175420 180220 175240 175844 181386 181645 190355 196962 192055 184930 183712 187434 192467
12745 192467 196396 190321 192135 194508 197259 197147 198439 204329 209834 208249 206014 202682 204489 207811
12731 207811 204110 205262 210284 211730 210578 216765 218677 219547 221085 223227 229588 230506 233176 244229
12717 244229 243470 237531 239344 248654 250286 252645 258464 252385 254670 259478 261393 268270 270533 259937
12703 259937 256174 256304 259363 261667 266100 264300 258172 260594 271759 273845 264044 260492 256638 262718
12689 262718 273246 284466 291558 284755 276194 275368 284161 288961 295973 293764 292489 289155 290804 288701
12675B88701j623N797M976k00N291O5l878k284M138K833K983M482J502P577K426
12660C22786m200l716N13l3Q508M871j081K539q8O00Q689K436j090k192k806l49
12644C35387l234J780J725Q67J396M834R681K915R24J07k336O115j599J502K309
12629C62373L489J768M105K752K023j132J77L214N117l353N724O127k216j747
12615C88421L611M210M474Q865O543L227M115j330j634J0922k13o903J957p17
12601D25548J20L676P103M245M090J092k668J481P373J3519O842J2572L061R074
12587D97128J0612Q608k780j3519l0486l3290k6643k0883j618K860J25M542N861
12574D00517N975P916Q860L933N977M961K785N666J1815K376L21O375N477J833
$$ plain form
12675 288701 287078 292875 297851 297651 302942 303007 299129 296845 300983 303816 306799 311281 312783 320360 322786
12660 322786 318586 314870 315383 315350 323858 328729 327648 330187 330099 330699 339388 341824 340734 338542 335736 335387
12644 335387 332153 333933 335658 336525 337921 342755 352436 355351 356275 356382 354046 360161 358562 360064 362373
12629 362373 365862 367630 371735 374487 376510 375378 375555 378769 383886 380533 386257 392384 390168 388421
12615 388421 392032 396242 400716 409581 416124 419351 423466 422136 420502 431424 431211 424308 426265 425548
12601 425548 425668 429344 436447 440692 444782 445874 443206 444687 452060 465579 472421 484993 488054 497128
12587 497128 507740 516348 513568 500049 469563 436273 409630 388747 387129 389989 390114 394656 400517
12574 400517 406492 414408 423268 427201 433178 438139 440924 446590 458405 460781 461102 467477 472954 474787
12560D74787Q968J3601J0173N598O649O427R880J6358J0333Q990J1964K126j0606
12547E75248k6301l7868m6875m5074l0443k3746j5677k59O504N448L943R990J1102
12534C85992J2466N123P737M966j728J1726J0630P110O633O006m401m093j54J6322
12520D64335J3486N608J0910M186O577R803Q129J0155J0494k151j1350k4046l1941
12507D74195l5543j7963r746j020J640o99R538J6135J2631Q049k057P55N229K748
12493D63892M705O578P789R109L278p173j477P466R966J060L186O375J489m539
12479E11704j349P464O166K740j761j51N404K31k552P967j33L9P837M393q88O361
12463E53472N990j23l310j48K976N106R370j304r26N397J359o08o11Q41K751J594
$$ plain form
12560 474787 483755 497356 507529 513127 519776 526203 536083 552441 562774 571764 583728 585854 575248
12547 575248 548947 511079 464204 419130 388687 364941 349264 349005 355509 360957 364900 374890 385992
12534 385992 398458 403581 411318 416284 414556 426282 436912 444022 450655 456661 452260 448167 448013 464335
12520 464335 477821 483429 494339 498525 505102 514905 523034 533189 543683 541532 530182 506136 474195
12507 474195 438652 420689 410943 409923 411563 410864 420402 436537 449168 457217 455160 455915 461144 463892
12493 463892 468597 475175 482964 492073 495351 488178 486701 494167 504133 505193 508379 514754 516243 511704
12479 511704 510355 517819 523985 526725 524964 524813 530217 530448 527896 535863 535730 535769 543606 547999 547111 553472
12463 553472 559462 559339 556029 555881 558857 563963 573333 572029 571103 576500 577859 577251 576640 577481 580232 581826
12447E81826M93M078K534L542M336N895J2327O014p181m560R82O476m427n913
12433F06422k52J852J526j634m186L506K517M209M797Q379N324N286N300J765
12419F44811o517J996Q460M41Q344L967J002j152L53l878m568J177N867l06k244
12404F57753J626P963N399P095L29N604R465J516l904M21K900n372l840m132Q62
12389F83685j099O555M272J877l364L012P232N242M51O274O39P39N757Q591O54
12374G30517M198J448p8j387Q15q58R059M574q15M624J21O58N6L015O607L564
12358G66118l177K340J1374m709m853j701Q127J2209L254K28M908k845J37m225
12344G87185N465M890P116M851p57L02M486J393l3r3Q313K833L697J659r72j981
$$ plain form
12447 581826 582319 586397 588931 592473 596809 602704 615031 621045 613864 609304 610286 616762 612335 606422
12433 606422 606170 608022 609548 607914 603728 607234 609751 613960 618757 627136 632460 637746 643046 644811
12419 644811 638294 640290 648750 649191 657535 661502 662504 661352 661705 657827 653259 654436 660303 659997 657753
12404 657753 659379 667342 672741 679836 680165 685769 695234 696750 692846 693267 696167 690795 686955 682823 683685
12389 683685 682586 689141 693413 695290 691926 694938 702170 707412 707863 714137 714776 715515 721272 729863 730517
12374 730517 734715 736163 736085 734698 735513 734655 743714 748288 747473 752097 752218 752876 752932 755947 762554 766118
12358 766118 762941 765281 776655 771946 767093 765392 773519 785728 788982 789210 794118 791273 791410 787185
12344 787185 792650 797540 804656 809507 808750 809052 813538 814931 814898 814805 823118 825951 829648 831307 830335 828354
12328H28354K278K339K655K557J717J959N76P51R260K498o48L182J0001r22L115
12313H69672L514j119o645L081K411N899N427M697N110k91o13J16L777L905M220
12298I03161j70K694L312J271K902L518N660N174M483K534M726L237M201N081
12284I51784m220j799O926R269n298K364O623m778N472O459k577l378J624O935
12270I75406r33K800O060P073L927J0308M030j885k508K538J2275O562J714K995
12256A030362M552O899M782M17L893O870P443o517k447K097N352N669K823K069
12242A074264K094K328K524J0832M434J516J189J036J0437O538m93O74P54l216
12228A114911P086O812Q039O814J1410K069j562Q4Q42M721O010R447K463L406
$$ plain form
12328 828354 830632 832971 835626 838183 839900 841859 842435 843186 852446 854944 854296 857478 867479 866557 869672
12313 869672 873186 872067 865422 868503 870914 876813 882240 886937 892047 891756 891143 891259 895036 898941 903161
12298 903161 902991 905685 908997 910268 913170 916688 922348 927522 932005 934539 939265 942502 946703 951784
12284 951784 947564 945765 952691 961960 956662 959026 965649 960871 966343 972802 970225 966847 968471 975406
12270 975406 974473 977273 983333 990406 994333 1004641 1008671 1006786 1004278 1006816 1019091 1025653 1027367 1030362
12256 1030362 1034914 1041813 1046595 1047012 1050905 1057775 1065218 1058701 1056254 1058351 1063703 1069372 1072195 1074264
12242 1074264 1076358 1078686 1081210 1092042 1096476 1097992 1099181 1100217 1110654 1117192 1116699 1117373 1118127 1114911
12228 1114911 1121997 1128809 1136848 1143662 1155072 1157141 1155579 1155663 1156505 1161226 1167236 1176683 1179146 1182552
12214A182552M378L909M944Q23r98L750M186L314Q314L663p220M47M486J052P043
12199A224643R694Q553M456L874L408K183M584J0518N188L844l537M497N329N800
12185A293034P756Q125K183L303O169J388M650N436R833K374L400M628m930N251
12171A352600O919m73M652N049J1373Q446J2545M952j140j288L400M659R327N616
12157A426637R553O987L865L013K73L550J1651O954K806n03N41K610L713O175
12143A487825Q060R340Q385M257M826K040L005J0779Q005Q299J0290K027O702
12130A573840J2307N237J708P828O586P006O941J987K812K434O807J3189P121
12117A655803m32N68m202P781J9255J5644O670R009R616J1732Q362J0858J993
$$ plain form
12214 1182552 1186930 1190839 1195783 1196606 1195608 1199358 1203544 1206858 1215172 1218835 1211615 1212062 1216548 1217600 1224643
12199 1224643 1234337 1242890 1247346 1251220 1254628 1256811 1261395 1271913 1277101 1280945 1277408 1281905 1287234 1293034
12185 1293034 1300790 1308915 1311098 1314401 1320570 1321958 1326608 1332044 1341877 1344251 1347651 1352279 1347349 1352600
12171 1352600 1359519 1359046 1363698 1368747 1380120 1388566 1401111 1406063 1404923 1403635 1407035 1411694 1421021 1426637
12157 1426637 1436190 1443177 1447042 1450055 1450328 1453878 1465529 1472483 1475289 1474786 1475327 1477937 1481650 1487825
12143 1487825 1495885 1505225 1513610 1517867 1522693 1524733 1527738 1538517 1546522 1554821 1565111 1567138 1573840
12130 1573840 1586147 1591384 1593092 1600920 1607506 1614512 1621453 1623440 1626252 1628686 1635493 1648682 1655803
12117 1655803 1655371 1655939 1651737 1659518 1678773 1694417 1701087 1710096 1719712 1731444 1739806 1750664 1752657
12104A752657N6Q554J1624J1612n177P452J4353N97N075N320J5370J1546O205
12091A845244R199J1710O310R062J2450P140M078O319P846J0101J2348J4538J0199
12078A966544M840N635K166R278J4923J2339R958J4280Q717J3535J1477K648J2815
12065B089155J4946L238Q038R078J3567R318J6044J5797Q154K86J5551J9525Q940
12052B231637K232N441R565J3992J6804J0579J8016J5560O343N740J1537J4617
12040B362063J6452Q972J5336J4735J3474J3118J7516J3166J1992O601J2348J5652
12028B521425J6783J8067K3039J6102J9137J3623J5906J2548J4650J1062J4939
12017B697281K2845J7917J9136K2425K0234K0406J9742J7917J4379K0573J9145
$$ plain form
12104 1752657 1752713 1761267 1772891 1784503 1779326 1786778 1801131 1801728 1806803 1812123 1827493 1839039 1845244
12091 1845244 1854443 1866153 1872463 1881525 1893975 1901115 1905193 1911512 1919358 1929459 1941807 1956345 1966544
12078 1966544 1971384 1977019 1979185 1988463 2003386 2015725 2025683 2039963 2048680 2062215 2073692 2076340 2089155
12065 2089155 2104101 2107339 2115377 2124455 2138022 2147340 2163384 2179181 2187335 2187621 2203172 2222697 2231637
12052 2231637 2233869 2239310 2248875 2262867 2279671 2290250 2308266 2323826 2330169 2335909 2347446 2362063
12040 2362063 2378515 2387487 2402823 2417558 2431032 2444150 2461666 2474832 2486824 2493425 2505773 2521425
12028 2521425 2538208 2556275 2579314 2595416 2614553 2628176 2644082 2656630 2671280 2682342 2697281
12017 2697281 2720126 2738043 2757179 2779604 2799838 2820244 2839986 2857903 2872282 2892855 2912000
12006B912000J7997J3741J1141J3228J5182J9224K7100J8757J5724K1142J7914
11995C103150K3171K1082K4873K2826K5604K5020J7925J7644K3160J7337K3006
11984C344798K1671L0424L0442K2948K8011K8821K0451J9131K6373K0959L1432
11973C625461L0861K1383K0641K6597L1149K5195K6067K0366K1098K4863K6443
11962C900124K1415K4912L2859L2013K6502K5686K9868K8430K7606J9136K4877
11951D193428K8872K8435L2014L5444L2618K7648K3654J5609J0343J8595K0536
11940D467196J3381K9879L2022K4008J9216J5382Q864J6698J8205K2337K7619
11929D694807J5044J0446K245N339j324r55m197l315k972j4214j5998r737r488
$$ plain form
12006 2912000 2929997 2943738 2954879 2968107 2983289 3002513 3029613 3048370 3064094 3085236 3103150
11995 3103150 3126321 3147403 3172276 3195102 3220706 3245726 3263651 3281295 3304455 3321792 3344798
11984 3344798 3366469 3396893 3427335 3450283 3478294 3507115 3527566 3546697 3573070 3594029 3625461
11973 3625461 3656322 3677705 3698346 3724943 3756092 3781287 3807354 3827720 3848818 3873681 3900124
11962 3900124 3921539 3946451 3979310 4011323 4037825 4063511 4093379 4121809 4149415 4168551 4193428
11951 4193428 4222300 4250735 4282749 4318193 4350811 4378459 4402113 4417722 4428065 4446660 4467196
11940 4467196 4480577 4510456 4542478 4566486 4585702 4601084 4609948 4626646 4644851 4667188 4694807
11929 4694807 4709851 4720297 4722542 4727881 4726557 4725602 4721405 4718090 4715118 4700904 4684906 4675169 4665681
11916D665681j7750k3665k9096l7942m1948m8353n5512n8761o6673p2767p3629
11905D139585q1708p4031q5796r5368r7667j02129j16935j25259j18228j33584
11895C108880j40064j36388j53487j59775j55812j61262j64754j73426j76474
11886A687438j79981j77375j81948j84233j81645j84084j83241j80762j84490
11877D9679j81855j75574j75459j79559j78506j71830j49699j48776j52139j49682
11867a613400j37581j40936j43917j33147j28493j25412j18586j08459r8086q9526
11857b837543q6615q0138p7798o8698o6558n9216o0542n7499m3881m2233l7118
11846c517839l1008l0698l2282l1244j8926j6676j5136j1339j2291l296p31m170
$$ plain form
11916 4665681 4647931 4624266 4595170 4557228 4515280 4466927 4411415 4352654 4285981 4213214 4139585
11905 4139585 4057877 3983846 3898050 3802682 3705015 3602886 3485951 3360692 3242464 3108880
11895 3108880 2968816 2832428 2678941 2519166 2363354 2202092 2037338 1863912 1687438
11886 1687438 1507457 1330082 1148134 963901 782256 598172 414931 234169 49679
11877 49679 -132176 -307750 -483209 -662768 -841274 -1013104 -1162803 -1311579 -1463718 -1613400
11867 -1613400 -1750981 -1891917 -2035834 -2168981 -2297474 -2422886 -2541472 -2649931 -2748017 -2837543
11857 -2837543 -2924158 -3004296 -3082094 -3150792 -3217350 -3276566 -3337108 -3394607 -3438488 -3480721 -3517839
11846 -3517839 -3548847 -3579545 -3611827 -3643071 -3661997 -3678673 -3693809 -3705148 -3717439 -3720735 -3721466 -3725636
11834c725636M06p442n382P875P815L586O379J1069J7157J9675J6480K0283J6747
11821c610988J6719J7593J2127J7078J9276J5574J6522J8119J6125K1254L1071
11810c409530K2024K4553K4371K5419K1179J9423J6125J4157R803J3283K4697
11799c194496K6264J8596K2763K5407K4141K4837K0099K3059K0570K4212L1150
11788b933398K8964J9143J8504K0608K5083J6133K2777K6722K3260J7159J6889
11777b698156K4925K1471K7768K6082K5417J2145K0591J9357J2726K1936K2909
11766b462829J5673J9500J9922K1226K4058K2115K3163J8581O066P649J0543Q451
11754b265882J2088J8370J9427J9030J6976J6842J3309J0278K0222J7755J5332
$$ plain form
11834 -3725636 -3725230 -3732672 -3738054 -3730179 -3722364 -3718778 -3712399 -3701330 -3684173 -3664498 -3648018 -3627735 -3610988
11821 -3610988 -3594269 -3576676 -3564549 -3547471 -3528195 -3512621 -3496099 -3477980 -3461855 -3440601 -3409530
11810 -3409530 -3387506 -3362953 -3338582 -3313163 -3291984 -3272561 -3256436 -3242279 -3232476 -3219193 -3194496
11799 -3194496 -3168232 -3149636 -3126873 -3101466 -3077325 -3052488 -3032389 -3009330 -2988760 -2964548 -2933398
11788 -2933398 -2904434 -2885291 -2866787 -2846179 -2821096 -2804963 -2782186 -2755464 -2732204 -2715045 -2698156
11777 -2698156 -2673231 -2651760 -2623992 -2597910 -2572493 -2560348 -2539757 -2520400 -2507674 -2485738 -2462829
11766 -2462829 -2447156 -2427656 -2407734 -2386508 -2362450 -2340335 -2317172 -2298591 -2292525 -2284876 -2274333 -2265882
11754 -2265882 -2253794 -2235424 -2215997 -2196967 -2179991 -2163149 -2149840 -2139562 -2119340 -2101585 -2086253
11743b086253J7245Q956J5245J9754J2613J8021J1192P037J5928J9165J5327J1038
11731a914732J1898J6556J8732J7528J7242J2978J5155J1575J6670J0240O307
11720a759851J0658J4510J7902J7027J2904P901J1465O451M571M042M489P738
11708a640193J1473J2709J3906Q609J3610P280L156J8772J7192L480J9193P820
11696a502993J4352J3382R209M752J0476J5026J3554J5861J2717M981O806O512
11684a375365J0233O004M09O517J5745J2540P872J2498J2866M964J938Q536R500
11671a265743Q968K817r73J6052J4168L226P294J2818J3074R918O426J0234N458
11658a156263P080M172Q833Q033J2144L504P36P301Q160R060P388R847M768K888
$$ plain form
11743 -2086253 -2069008 -2060052 -2044807 -2025053 -2012440 -1994419 -1983227 -1976190 -1960262 -1941097 -1925770 -1914732
11731 -1914732 -1902834 -1886278 -1867546 -1850018 -1832776 -1819798 -1804643 -1793068 -1776398 -1766158 -1759851
11720 -1759851 -1749193 -1734683 -1716781 -1699754 -1686850 -1678949 -1667484 -1661033 -1656462 -1652420 -1647931 -1640193
11708 -1640193 -1628720 -1616011 -1602105 -1593496 -1579886 -1572606 -1569450 -1550678 -1533486 -1530006 -1510813 -1502993
11696 -1502993 -1488641 -1475259 -1466050 -1461298 -1450822 -1435796 -1422242 -1406381 -1393664 -1388683 -1381877 -1375365
11684 -1375365 -1365132 -1359128 -1358719 -1352202 -1336457 -1323917 -1316045 -1303547 -1290681 -1285717 -1283779 -1275243 -1265743
11671 -1265743 -1256775 -1253958 -1254931 -1238879 -1224711 -1221485 -1214191 -1201373 -1188299 -1178381 -1171955 -1161721 -1156263
11658 -1156263 -1149183 -1145011 -1136178 -1128145 -1116001 -1112497 -1111761 -1104460 -1096300 -1087240 -1079852 -1070005 -1065237 -1062349
11644a062349M547N938P704O818K733N948R536P585M566O769Q907M184k186K106
11630i87194J4801J0594N551Q731M498J339m269L420R508J3289Q599M437O740
11617h99956J1531P220L124P07L426J0928P567M377N175N328L930P768J0918M961
11603h12996L996M318J798Q942J0834J337r0N602N213P165O393M696M173L64K510
11588g45745J2706N128P760K560L109N091J351M444N526N264P229K660N113J0675
11574f67129L474p9j455M534O285J0199P298M892k117N89P081J2044N380L972
11560f05032Q85L080N624N176J56N668Q234J2031K472k439J975p585j700N941
11546e65514J1198M437N254K516O829O793r7p630O799J0285N915N978j603L151
$$ plain form
11644 -1062349 -1057802 -1051864 -1044160 -1037342 -1034609 -1028661 -1019125 -1011540 -1006974 -1000205 -991298 -987114 -989300 -987194
11630 -987194 -972393 -961799 -956248 -947517 -943019 -941680 -945949 -942529 -933021 -919732 -911133 -906696 -899956
11617 -899956 -888425 -881205 -878081 -877374 -873948 -863020 -855453 -851076 -845901 -840573 -836643 -828875 -817957 -812996
11603 -812996 -809000 -804682 -802884 -793942 -783108 -781771 -781861 -776259 -771046 -763881 -757488 -752792 -748619 -748255 -745745
11588 -745745 -733039 -727911 -720151 -717591 -714482 -709391 -708040 -703596 -698070 -692806 -685577 -682917 -677804 -667129
11574 -667129 -663655 -663734 -665189 -660655 -654370 -644171 -636873 -631981 -634098 -633509 -626428 -614384 -609004 -605032
11560 -605032 -604147 -601067 -595443 -590267 -590111 -584443 -576209 -564178 -561706 -564145 -562170 -569755 -571455 -565514
11546 -565514 -554316 -549879 -544625 -542109 -535280 -528487 -528584 -536214 -529415 -519130 -513215 -507237 -508840 -505689
11532e05689R616L129r44N365K206n46R87j173J1840R985J766J896R833L640J837
11517d46252R958R91k551K994M330J0671P162J566o2M93J006J813N498o95n8O272
11501c96864Q794L666N786R25L838j891r0Q426J2400J1681M240N740n155J611
11487c36893J733N788O814j617n45N551M037M312K969m711K128O121m476n812
11473c14601K614J1074Q493J513P83K919L140P6J574J2243N92p291N445R163K964
11458b59299K409J0302N003J80Q47J682K623O043Q859j635j913M402l9K421N027
11443b13088N687L596PQ604L203J630m652K930J206m886l843N449R421L407k520
11428a83849Q395M772J247k434k10N232M551P061j116K489O953L369J0555O676
$$ plain form
11532 -505689 -496073 -492944 -493888 -488523 -486317 -486863 -485876 -487049 -475209 -465224 -463458 -461562 -451729 -448089 -446252
11517 -446252 -436294 -435303 -437854 -434860 -430530 -419859 -412697 -411131 -411193 -410700 -409694 -407881 -402383 -403078 -403136 -396864
11501 -396864 -388070 -384404 -378618 -377693 -373855 -375746 -375836 -367410 -355010 -343329 -339089 -333349 -338504 -336893
11487 -336893 -335160 -329372 -322558 -324175 -324720 -319169 -315132 -310820 -307851 -312562 -310434 -304313 -308789 -314601
11473 -314601 -311987 -300913 -292420 -290907 -290124 -287205 -284065 -283989 -282415 -270172 -269580 -276871 -271426 -262263 -259299
11458 -259299 -256890 -246588 -241585 -241405 -240558 -238876 -236253 -230210 -221351 -222986 -224899 -220497 -220536 -218115 -213088
11443 -213088 -207401 -203805 -203798 -195194 -191991 -190361 -195013 -192083 -190877 -195763 -199606 -194157 -184736 -181329 -183849
11428 -183849 -175454 -170682 -169435 -171869 -172079 -166847 -162296 -155235 -156351 -153862 -146909 -143540 -132985 -126309
11414a26309L594J25r564K265L853m39J634N074J594M334K685P638p79K801L593
11399i7901o257L743J0706N293P93L975M983M373K041m516J52L774L787J12K397
11384f2545O814R337j851J314P795J860M492J506J680P536l28o315O216J948J287
11369a9254J738k019M069N082N36n337n305J257J1949J1780Q524j240m057L490
11355A1213K053N174J0426N572K357J310O77Q756R27l575L648J2454m330j205
11341E5457K132K046J0305K942J456J935L155L796K484O277J4006M078j730O777
11327A15116L709o88j222O877J1351R488j654J2983J3593P934J0521R891P244
11314B05143k724p257j2009k5010l5235k9962k5433k2856j0908M25K281Q319o87
$$ plain form
11414 -126309 -122715 -122590 -132154 -129889 -126036 -126475 -124841 -119767 -118173 -113839 -111154 -103516 -104295 -101494 -97901
11399 -97901 -104158 -100415 -89709 -84416 -83623 -79648 -74665 -70292 -68251 -72767 -72615 -68841 -65054 -64942 -62545
11384 -62545 -55731 -46394 -48245 -46931 -39136 -37276 -32784 -31278 -29598 -22062 -22390 -28705 -22489 -20541 -19254
11369 -19254 -17516 -19535 -15466 -10384 -9848 -15185 -20490 -19233 -7284 4496 13020 11780 7723 11213
11355 11213 13266 18440 28866 34438 36795 38105 38782 47538 48465 44890 48538 60992 56662 55457
11341 55457 57589 59635 69940 72882 74338 76273 79428 83224 85708 91985 105991 110069 108339 115116
11327 115116 118825 118137 116915 123792 135143 144631 142977 155960 169553 177487 188008 197899 205143
11314 205143 202419 195162 183153 158143 122908 92946 67513 44657 33749 34174 36455 44774 44087
11301D4087Q954Q416J108P030O444K385O879R888Q880J0848Q430L153k960n833
11287A17709K220N789Q433K184O933J5137M696P442J400k121q89P257R34k721
11273A74403J914L325Q189L348O75q42l757k94N379P138o92q19j555m677O367
11258A98102P820K871N369J913m850K07R123R373j9p13j394L598M679N18M6L630
11242B40273K000K227L621J0754k961q279N079N84M321k665q67Q520M287L340
11228B70234n016J33L591J2616Q473J192N450L88K42R57M327L686N562J518l767
11213C09586r57L679M070l448p350L597O752O871J05P84N91J0422O804O806K329
11198C50641L423j389O92O036J1040n68P8L765J985k157L256k88n9k946k430P025
$$ plain form
11301 44087 53041 61457 62565 69595 76039 78424 85303 95191 104071 114919 123349 126502 123542 117709
11287 117709 119929 125718 134151 136335 143268 158405 163101 170543 171943 169822 168933 176190 177124 174403
11273 174403 176317 179642 187831 191179 191854 191012 187255 186961 192340 199478 198786 197967 196412 191735 198102
11258 198102 205922 208793 214162 216075 211225 211432 220555 229928 229909 229196 227802 231400 236079 236597 236643 240273
11242 240273 242273 244500 248121 258875 255914 247635 252714 253298 257619 254954 254087 262607 266894 270234
11228 270234 265218 265351 268942 281558 290031 291223 296673 297061 297303 298260 302587 306273 311835 313353 309586
11213 309586 308629 312308 316378 312930 305580 309177 315929 322800 322905 323689 324280 334702 341506 348312 350641
11198 350641 354064 352675 353367 359403 370443 369875 369953 373718 375703 373546 376802 376514 376455 373509 371079 378104
11182C78104j195K990N887K707l385k211J190l02N275L636R51N62P946K647Q126
11167D12928M140K917k223j737J438P095M215K581L310P616M906l296L278N496
11153D52664M49J541k080P264J093K362O212P478j255K696K353n094k63M085N040
11138D84545M559lm730n176N755K299M824P390P276M978J070J073N191k2J362
11123E20391L30l994L059J141N67j971o58J366K959M166O427P76R774N989K508
11108E52830l006J232N731M688J3183P619k943L45L500M221M282Q305N043l311
11094F01719j644m203l116l759o486m695p911k857O645L86k339j361p286K682
11080E65775J0185L825M985J167J081L172R633L746k5N292O470Q380J333j624
$$ plain form
11182 378104 376909 379899 385786 388493 385108 382897 384087 383785 389060 392696 393647 394209 402155 404802 412928
11167 412928 417068 419985 417762 416025 417463 424558 428773 431354 434664 442280 447186 443890 447168 452664
11153 452664 453113 454654 452574 459838 460931 463293 469505 476983 475728 478424 480777 475683 475420 479505 484545
11138 484545 489104 489101 484371 479195 484950 487249 492073 499463 506739 511717 512787 513860 519051 519029 520391
11123 520391 520721 516727 519786 520927 521494 519523 518865 520231 523190 527356 533783 534559 544333 550322 552830
11108 552830 549824 551056 556787 561475 574658 582277 579334 579679 583179 587400 591682 599987 605030 601719
11094 601719 600075 595872 592756 588997 582511 577816 569905 567048 573693 574079 571740 570379 563093 565775
11080 565775 575960 579785 584770 585937 587018 590190 599823 603569 603544 608836 615306 623686 625019 623395
11066F23395q7L006J1809R82r17K682M101n321m116L641O909l852O118J3432r39
11051F60843j534N221J640m561L784N268N370Q159Q480L567j859j274p98O662
11037F98968K331J067m954n24Q691L351L580K562K057P703M385R834J1068p32
11023G49387l899m512J186N47O100K527p59O381j89k837O031M375L702O069N801
11008G79910J503R623O344K20p589J546P759Q268M594M457K841N011R50L933P140
10993H36510M033R238N346j200M528R455J9169J5923K1423R541l3167n2362l8333
10980H10104j2614O04L798Q175J3883J2598n15p148J2499N167R975J2724J0050
10967H79300m778q159J426O297J1043Q800K103k837r894l314O755L060Q5M644
$$ plain form
11066 623395 623308 626314 638123 639105 638188 640870 644971 639650 635534 639175 646084 642232 648350 661782 660843
11051 660843 659309 664530 666170 661609 665393 670661 676031 684190 692670 696237 694378 693104 692306 698968
11037 698968 701299 702366 697412 696888 705579 708930 712510 715072 717129 724832 729217 739051 750119 749387
11023 749387 745488 740976 742162 742709 748809 751336 750577 756958 756769 753932 759963 764338 768040 774109 779910
11008 779910 781413 791036 797380 797600 790011 791557 799316 807584 812178 816635 819476 824487 825437 829370 836510
10993 836510 840543 849781 855127 853927 858455 867910 887079 903002 924425 933966 900799 848437 810104
10980 810104 797490 798094 801892 810067 823950 836548 836033 828885 841384 846551 856526 869250 879300
10967 879300 874522 866363 867789 874086 885129 893929 896032 893195 883301 879987 886742 889802 889887 894531
10953H94531Q100Q564N021R926R293m40n175K492N645Q149M669k104L987J0427
10939I63085M930l94K635O405L667L250P789p94M127R219K940O339Q718K944M804
10924A029664m95l465K663O136M795J1197J0785K330K312J0537P059K515L3O027
10910A092093O506M043Q498O925Q846J222l685J0335O157J2560J7853J2807R386
10897A193546J6275J0813J5075K2526J8598J7098J0104m589j6362k7456m1502
10886A214126m5064l4853j7578j2983j810J7013K0297J5167J3632K3966K3787
10875A215700J7845J5421J8872J3402J3802R678J7056L2304K6702L0172M0371
10864A451325L6455N1374O7369Q3563Q8552M5573j05500l03700l51654k61821
$$ plain form
10953 894531 902631 911195 916216 926142 935435 934995 929820 932312 937957 946106 950775 948671 952658 963085
10939 963085 968015 967621 970256 976661 980328 983578 991367 990573 994700 1003919 1006859 1013198 1021916 1024860 1029664
10924 1029664 1029169 1025704 1028367 1034503 1039298 1050495 1061280 1063610 1065922 1076459 1083518 1086033 1086066 1092093
10910 1092093 1098599 1102642 1111140 1118065 1126911 1128133 1124448 1134783 1140940 1153500 1171353 1184160 1193546
10897 1193546 1209821 1220634 1235709 1258235 1276833 1293931 1304035 1299446 1283084 1255628 1214126
10886 1214126 1169062 1134209 1116631 1103648 1101838 1118851 1139148 1154315 1167947 1191913 1215700
10875 1215700 1233545 1248966 1267838 1281240 1295042 1304720 1321776 1354080 1380782 1410954 1451325
10864 1451325 1487780 1539154 1606523 1690086 1778638 1824211 1718711 1415011 1063357 801536
10854H01536j10817M667M6180N0897N8552N0497L0374L8402L7872K5576L2094
10843A065830L4563K0021K0890K7275K1162K1551K8838L5875L2668K8967L6642
10832A374282L7105L6522M6366M0372K0063l1635q8898j55441j82066j62050j08065
10821H26555m5567k384J4763K4267K5229J8527K0979K8845K3233J5068J6310J9182
10809I85007J6607J6031J8072J9607K1145J4850M213J2688J0560M767J2643P986
10797A144176J1407L501L694N920P187J3807P004L836J3726R932L165J632R722
10784A238709J0223R112M338Q255J67N240P404P351P746M991Q940N247N639J1931
10770A335293R860L955K549N968J0468L622p117K709R507P707O900P176J2257
$$ plain form
10854 801536 690719 695386 741566 792463 851015 901512 931886 970288 1008160 1033736 1065830
10843 1065830 1100393 1120414 1141304 1168579 1189741 1211292 1240130 1276005 1308673 1337640 1374282
10832 1374282 1411387 1447909 1494275 1534647 1554710 1523075 1434177 1278736 1096670 934620 826555
10821 826555 780988 778604 793367 817634 842863 861390 882369 911214 934447 949515 965825 985007
10809 985007 1001614 1017645 1035717 1055324 1076469 1091319 1095532 1108220 1118780 1123547 1136190 1144176
10797 1144176 1155583 1159084 1162778 1168698 1175885 1189692 1196696 1200532 1214258 1224190 1227355 1228987 1238709
10784 1238709 1248932 1258044 1262382 1270637 1270804 1276044 1283448 1290799 1298545 1303536 1312476 1317723 1323362 1335293
10770 1335293 1345153 1349108 1351657 1357625 1368093 1371715 1364598 1367307 1376814 1384521 1391421 1398597 1410854
10757A410854R246k71L697J100J136M315M968n42k310Q794R517J0555J0074R157
10743A480290O190N429L753j423L762J712J638N683R986J3798J6627P717M212
10730A559374L66M722N473K807q60N165Q242l486l826Q462P498J0340N176P83
10716A610236K311N177O564J2929J2013N549J775M879M821K018O505Q041N727
10703A688545o67k236N667J1670L823N544O247R657J5330J0976L415l641L007
10690A757337R947L779N082M961J3786P351m150L865M356J1188N415N891L833
10677A832641Q762J6357R281O110J2207J344O575J2226J0570j530K482L102J2783
10664A932910J0664R236Q436J2889J0710r23j34O127O087Q778M987Q728J4169
$$ plain form
10757 1410854 1420100 1419829 1423526 1424626 1425762 1430077 1435045 1434503 1432193 1440987 1450504 1461059 1471133 1480290
10743 1480290 1486480 1491909 1495662 1494239 1498001 1499713 1501351 1507034 1517020 1530818 1547445 1555162 1559374
10730 1559374 1559740 1564462 1569935 1572742 1571882 1577047 1585289 1581803 1577977 1586439 1593937 1604277 1609453 1610236
10716 1610236 1612547 1617724 1624288 1637217 1649230 1654779 1656554 1661433 1666254 1668272 1674777 1682818 1688545
10703 1688545 1687878 1685642 1691309 1702979 1706802 1712346 1718593 1728250 1743580 1754556 1757971 1754330 1757337
10690 1757337 1767284 1771063 1776145 1781106 1794892 1802243 1798093 1801958 1806314 1817502 1822917 1828808 1832641
10677 1832641 1841403 1857760 1867041 1873151 1885358 1886702 1893277 1905503 1916073 1914543 1917025 1920127 1932910
10664 1932910 1943574 1952810 1961246 1974135 1984845 1983922 1983788 1989915 1996002 2004780 2009767 2018495 2032664
10651B032664J1361J0044O316M919J7093R446O167K23J1660M685L382R149J1065
10638B138174Q982J0170R854J5139K1463J5253J5456J3551J1086K2937J0126J2837
10626B305028J6302J5122J5037J0437J8544J6844J7426K9024K4034J5958K8838
10615B512594K8225L4545M0148M3290M8317N6450O0916P3257R2560J15985J42876
10604C249163J62927J35244p531k35400m44697n49751n03601l24456j31693J8696
10594A368901R7173J14742J09807R3727P2320L3242j139j2231j8577k758J5880
10583A871087L6413M9820N1156L9918L0558K7680K3572K0351J8867K5604K4677
10572B219703K4606K4624J7332J8026J4684K2595K6697K1219J5916K1768K7164
$$ plain form
10651 2032664 2044025 2054069 2060385 2065304 2082397 2091843 2098010 2098233 2109893 2114578 2117960 2127109 2138174
10638 2138174 2147156 2157326 2167180 2182319 2203782 2219035 2234491 2248042 2259128 2282065 2292191 2305028
10626 2305028 2321330 2336452 2351489 2361926 2380470 2397314 2414740 2443764 2467798 2483756 2512594
10615 2512594 2540819 2575364 2615512 2658802 2707119 2763569 2824485 2897742 2990302 3106287 3249163
10604 3249163 3412090 3547334 3539803 3304403 2859706 2309955 1806354 1481898 1350205 1368901
10594 1368901 1466074 1580816 1690623 1784350 1856670 1889912 1888773 1876542 1857965 1855207 1871087
10583 1871087 1907500 1957320 2008476 2048394 2078952 2106632 2130204 2150555 2169422 2195026 2219703
10572 2219703 2244309 2268933 2286265 2304291 2318975 2341570 2368267 2389486 2405402 2427170 2454334
10561B454334K2657J8909J3117J4010Q505J7744J8929K4627K9407K8312L5521
10550B686072L2929L4197L3154L0911K6711L6383K4487k4498q2325j13872j12509
10539B571640p3212j2046K0376K7173J7790P076o178k567Q319K0870K5289K9294
10527B633824L0270K8418K6577L2321K8621L2215L8423M1339J7752j9282l4380
10516B856098j9802K7K0268K4080J9824K0078K3059K6084K3917L2180L4838L4994
10504C095645L2707L5423L0781L1913L0824K5506J0907j2795l9027o6779o4278
10493C110827n2408m3515j8701R558K3409J8088o954q310J0218J7885J8527K0027
10481C098651K6107K9029K5115K8672K5498K9042K3855K5212K0359K0955J6037
$$ plain form
10561 2454334 2476991 2495900 2509017 2523027 2531532 2549276 2568205 2592832 2622239 2650551 2686072
10550 2686072 2719001 2753198 2786352 2817263 2843974 2880357 2904844 2880346 2798021 2684149 2571640
10539 2571640 2498428 2486382 2506758 2533931 2551721 2558797 2552619 2550052 2558371 2579241 2604530 2633824
10527 2633824 2664094 2692512 2719089 2751410 2780031 2812246 2850669 2892008 2909760 2890478 2856098
10516 2856098 2836296 2836323 2856591 2880671 2900495 2920573 2943632 2969716 2993633 3025813 3060651 3095645
10504 3095645 3128352 3163775 3194556 3226469 3257293 3282799 3293706 3280911 3241884 3175105 3110827
10493 3110827 3058419 3014904 2996203 3005761 3029170 3047258 3040304 3031994 3042212 3060097 3078624 3098651
10481 3098651 3124758 3153787 3178902 3207574 3233072 3262114 3285969 3311181 3331540 3352495 3368532
10470C368532J7206J7550K4645K5999K1871K7756K6351K9585K3292K2765L1636
10459C637188K9758L2989L1520K6188L0145L0640M1340M4006N2320L6034j2766
10448C979362n4511p3101p4103n2032k3174J383K6196M6206M8020N3280N6126
10437C933652M9318L7780K6374J438l1942k1108P741K5996L7606L5197K3865J8658
10425D144575J3648K1106L2141L1133M0369M2428L3342J1308O786J1647K9523
10414D418006L9083L2916L8002K6196J0002j3929k1518j5306M377K0343K6781
10403D564953L9569M1110M0071M1845L8549L0115M0695M0742L3638K8700K3546
10392D963533J5102L1516L7000L2910L2012M4571M2181K6808J0017P00j6701j5599
$$ plain form
10470 3368532 3385738 3403288 3427933 3453932 3475803 3503559 3529910 3559495 3582787 3605552 3637188
10459 3637188 3666946 3699935 3731455 3757643 3787788 3818428 3859768 3903774 3956094 3992128 3979362
10448 3979362 3924851 3851750 3777647 3725615 3702441 3703824 3730020 3776226 3824246 3877526 3933652
10437 3933652 3982970 4020750 4047124 4048562 4016620 3995512 4003253 4029249 4066855 4102052 4125917 4144575
10425 4144575 4158223 4179329 4211470 4242603 4282972 4325400 4358742 4370050 4376836 4388483 4418006
10414 4418006 4457089 4490005 4528007 4554203 4564205 4550276 4528758 4513452 4517829 4538172 4564953
10403 4564953 4604522 4645632 4685703 4727548 4766097 4796212 4836907 4877649 4911287 4939987 4963533
10392 4963533 4978635 5010151 5047151 5080061 5112073 5156644 5198825 5225633 5235650 5236350 5219649 5204050
10380E204050l364J0109K1308L9688M9898O0325N6299N5090M7541M3367M3429
10369E627740L2507K8650K7449L0332M1314M6437M4467M2997M3620L8734M6382
10358F050629M6958M3634M3799M3420L3247K7954L3022L1100L7157M1215M6432
10347F478567M9260O7632P4740O7622O5060O9245O1463N6881M8997M7226M8793
10336G135486N3917M9257M4592M1375M3255L5492M1316N4047O4259P2585Q1871
10325G717452Q9425Q8415R2052J06684J15482J08832R9158R2582P6713N4753L3256
10314H674804K5810K2832K7534L6362N5247O3250O9804P2769Q6955R3629R9155
10303I328151R3610R1902R2844Q7189J07131J09629J05384J07725J12610J16086
$$ plain form
10380 5204050 5200686 5210795 5232103 5271791 5321689 5382014 5438313 5493403 5540944 5584311 5627740
10369 5627740 5660247 5688897 5716346 5746678 5787992 5834429 5878896 5921893 5965513 6004247 6050629
10358 6050629 6097587 6141221 6185020 6228440 6261687 6289641 6322663 6353763 6390920 6432135 6478567
10347 6478567 6527827 6595459 6670199 6737821 6802881 6872126 6933589 6990470 7039467 7086693 7135486
10336 7135486 7189403 7238660 7283252 7324627 7367882 7403374 7444690 7498737 7562996 7635581 7717452
10325 7717452 7806877 7895292 7987344 8094028 8209510 8318342 8417500 8510082 8586795 8641548 8674804
10314 8674804 8700614 8723446 8750980 8787342 8842589 8905839 8975643 9048412 9135367 9228996 9328151
10303 9328151 9421761 9513663 9606507 9693696 9800827 9910456 10015840 10123565 10236175 10352261
10293A0352261J12219J01773O9309N3552P2176R9083J22252J36534J36593J32744
10283A1388496J34444J44834J61528J73993J79876J79599J83654J83651J82765
10274A2912840J69874J62637J84362J93455J92932J50719Q6216M8237O6114J14733
10264A4282119J58369K02761K44002K74934K91034L13755L09425K59035J98077
10255A6533511K08088K33764K34015K21509K50443L01944L54777L77208L89207
10246A9104466L97107L97263M09191M18023M10671M35866M61795M91306N17659
10237B3043347N47701N82232O15660O45138O71213O98183P42339P92617Q33416
10228B9171846Q79829R28225R85419J035772J089639J155882J217861J293286
$$ plain form
10293 10352261 10464480 10566253 10635562 10689114 10761290 10860373 10982625 11119159 11255752 11388496
10283 11388496 11522940 11667774 11829302 12003295 12183171 12362770 12546424 12730075 12912840
10274 12912840 13082714 13245351 13429713 13623168 13816100 13966819 14053035 14101272 14167386 14282119
10264 14282119 14440488 14643249 14887251 15162185 15453219 15766974 16076399 16335434 16533511
10255 16533511 16741599 16975363 17209378 17430887 17681330 17983274 18338051 18715259 19104466
10246 19104466 19501573 19898836 20308027 20726050 21136721 21572587 22034382 22525688 23043347
10237 23043347 23591048 24173280 24788940 25434078 26105291 26803474 27545813 28338430 29171846
10228 29171846 30051675 30979900 31965319 33001091 34090730 35246612 36464473 37757759
10220C7757759J392004J538938J707701J851729J875686J801781J740589J817651
10212E1483838K130842K637162L242166L856553M468675N096145N711325O345003
10204H4971709P161586Q437490J0420182J3355891J7336106K2242168K6847882
10197A90773014K5507792P191681k9976655o8428144r3257606r5560052p2175814
10190a35925784l8003698p688142J0208308J5914802J5427473J3132722J0785809
10183a16148510Q913147P658271O901234O357421N847452N330709M841600M413974
10175f5884702M031063L625637L119070K570332K090333J734704J594583J607800
10167d5511180J649756J652968J609388J518254J400838J293099J198582J117621
$$ plain form
10220 37757759 39149763 40688701 42396402 44248131 46123817 47925598 49666187 51483838
10212 51483838 53614680 56251842 59494008 63350561 67819236 72915381 78626706 84971709
10204 84971709 92133295 100570785 110990967 124346858 141682964 163925132 190773014
10197 190773014 216280806 223472487 193495832 125067688 31810082 -63749970 -135925784
10190 -135925784 -173929482 -181617624 -171409316 -155494514 -140067041 -126934319 -116148510
10183 -116148510 -107235363 -99577092 -92675858 -86318437 -80470985 -75140276 -70298676 -65884702
10175 -65884702 -61853639 -58228002 -55108932 -52538600 -50448267 -48713563 -47118980 -45511180
10167 -45511180 -43861424 -42208456 -40599068 -39080814 -37679976 -36386877 -35188295 -34070674
10159c4070674J051192R85167R23010Q70999Q25468P78766P25698O79338O52330
10150b6578706O29767N98463N57308N28655N18554N18508N20446N01808M79056
10141b1726141M50678M24605M06580L84490L69240L38928L17014L09322L01512
10132a8423772K96438K87225K76231K62252K54290K46474K38130K31789K17074
10123a6113869K12718K22813K23655K14708K14673K09923K05016K08447K05402
10114a4196514K04779K01850J85254J78734J73680J67475J50842J33958J26087
10105a2673855J28210J24912J34089J33799J33231J22617J25226J20093J22334
10096a1529344J23503J20475J15033J23375J20900J23491J20511J13982J06411
$$ plain form
10159 -34070674 -33019482 -32034315 -31111305 -30240306 -29414838 -28636072 -27910374 -27231036 -26578706
10150 -26578706 -25948939 -25350476 -24793168 -24264513 -23745959 -23227451 -22707005 -22205197 -21726141
10141 -21726141 -21275463 -20850858 -20444278 -20059788 -19690548 -19351620 -19034606 -18725284 -18423772
10132 -18423772 -18127334 -17840109 -17563878 -17301626 -17047336 -16800862 -16562732 -16330943 -16113869
10123 -16113869 -15901151 -15678338 -15454683 -15239975 -15025302 -14815379 -14610363 -14401916 -14196514
10114 -14196514 -13991735 -13789885 -13604631 -13425897 -13252217 -13084742 -12933900 -12799942 -12673855
10105 -12673855 -12545645 -12420733 -12286644 -12152845 -12019614 -11896997 -11771771 -11651678 -11529344
10096 -11529344 -11405841 -11285366 -11170333 -11046958 -10926058 -10802567 -10682056 -10568074 -10461663
10087a0461663J01066R5583J00849J01960R0042R0836Q9582Q6233Q7123Q3782
10077i534607R1126Q8921Q6091R2591J01468J01046J06208J12090J04194P2930
10067h577942N0882L5210K3040J9866K5057L6403M3817M0389L8641M6916N5221
10056h162500N3653N4927N1345M8965N7788O5259O8858N8797N9707O4417O6396
10045g512388O1875M5154L1457K3669K4436K4257L8940L8043M2238M9939N9592
10034g072788N7456O0485N6149L9127M0856M0062L4556L8288M6330L5640L5832
10023f588007L4079L9336L5985M1737M8486M3472L8273M0466M0649L0136K2164
10012f173224K0293P387J4570K3241L6675M2561N5983N6805N5030O4808N9613
$$ plain form
10087 -10461663 -10360597 -10265014 -10164165 -10062205 -9972163 -9881327 -9791745 -9705512 -9618389 -9534607
10077 -9534607 -9443481 -9354560 -9268469 -9175878 -9074410 -8973364 -8867156 -8755066 -8650872 -8577942
10067 -8577942 -8527060 -8491850 -8468810 -8448944 -8423887 -8387484 -8343667 -8303278 -8264637 -8217721 -8162500
10056 -8162500 -8108847 -8053920 -8002575 -7953610 -7895822 -7830563 -7761705 -7702908 -7643201 -7578784 -7512388
10045 -7512388 -7450513 -7405359 -7373902 -7350233 -7325797 -7301540 -7262600 -7224557 -7182319 -7132380 -7072788
10034 -7072788 -7015332 -6954847 -6898698 -6859571 -6818715 -6778653 -6744097 -6705809 -6659479 -6623839 -6588007
10023 -6588007 -6553928 -6514592 -6478607 -6436870 -6388384 -6344912 -6306639 -6266173 -6225524 -6195388 -6173224
10012 -6173224 -6152931 -6145544 -6130974 -6107733 -6071058 -6028497 -5972514 -5915709 -5860679 -5795871 -5736258
10001e736258O0959N3502N0960K7478q733k5792j3643J3499K8492M1584N3967
9990e453985M8981L6542L4024K1507J2115K0106J2423J4242K0226K7617M3540
9979e162662L8653M9210N9841M6537K7469j0780m6082p1258m7888l759K4672L4792
9967e061255L2339K5336K6989K3074K4385K5844L1764L6155L5731L1390L4781
9956d733467K9764K3118K1988L1789K4304L2562K2955K6474K6803K2920K2772
9945d448018K1864K7796K3709K9182L5162L8550M6602N5995N5906L0055n0020
9934d133217j29902j29497p0773j2145K7144L5755L2703K7672L3419K7754K3031
9923d268056J9721K2009J9286J6633J6277K7533K5768J7614J8941K3531J7363
$$ plain form
10001 -5736258 -5675299 -5621797 -5570837 -5543359 -5552092 -5577884 -5591527 -5578028 -5549536 -5507952 -5453985
9990 -5453985 -5405004 -5368462 -5334438 -5312931 -5300816 -5280710 -5268287 -5254045 -5233819 -5206202 -5162662
9979 -5162662 -5124009 -5074799 -5014958 -4968421 -4940952 -4951732 -4997814 -5069072 -5116960 -5120719 -5096047 -5061255
9967 -5061255 -5028916 -5003580 -4976591 -4953517 -4929132 -4903288 -4871524 -4835369 -4799638 -4768248 -4733467
9956 -4733467 -4703703 -4680585 -4658597 -4626808 -4602504 -4569942 -4546987 -4520513 -4493710 -4470790 -4448018
9945 -4448018 -4426154 -4398358 -4374649 -4345467 -4310305 -4271755 -4225153 -4169158 -4113252 -4083197 -4133217
9934 -4133217 -4263119 -4392616 -4463389 -4475534 -4448390 -4412635 -4379932 -4352260 -4318841 -4291087 -4268056
9923 -4268056 -4248335 -4226326 -4207040 -4190407 -4174130 -4146597 -4120829 -4103215 -4084274 -4060743 -4043380
9912d043380J1489J4639J7709J4327J5202J5274J4540J8819K1722K3786J5783
9901c860090Q771J3782J4737J4195J2021J8652K2640K9114M9866O0818O3181N0347
9889c501966M2361J9596O345Q778K817K883J7405J7149K1832J9269K0427J2013
9877c311091K559j5192j9311j911J3631L4241L5531L6647L2998L6181L2783L6413
9865c086521L0300K2408J5879K7469L7510K8640K3794K4498n854l4378n0309n5616
9853c022180l3086j0081J4719K8973K7144L4869M4403N1154M5881N1729N3150
9842b713325N8264N9343N4338M8358N4517N2396M9774N5565P2901Q8241J06466
9831b013162J15969J42848J58931J77442J96952K32254K79257L45558M44526N81908
$$ plain form
9912 -4043380 -4031891 -4017252 -3999543 -3985216 -3970014 -3954740 -3940200 -3921381 -3899659 -3875873 -3860090
9901 -3860090 -3851319 -3837537 -3822800 -3808605 -3796584 -3777932 -3755292 -3726178 -3676312 -3615494 -3552313 -3501966
9889 -3501966 -3459605 -3440009 -3433664 -3424886 -3422069 -3419186 -3401781 -3384632 -3362800 -3343531 -3323104 -3311091
9877 -3311091 -3308532 -3323724 -3343035 -3344946 -3331315 -3297074 -3261543 -3224896 -3191898 -3155717 -3122934 -3086521
9865 -3086521 -3056221 -3033813 -3017934 -2990465 -2952955 -2924315 -2900521 -2876023 -2881877 -2916255 -2966564 -3022180
9853 -3022180 -3055266 -3065347 -3050628 -3021655 -2994511 -2959642 -2915239 -2864085 -2818204 -2766475 -2713325
9842 -2713325 -2655061 -2595718 -2541380 -2493022 -2438505 -2386109 -2336335 -2280770 -2207869 -2119628 -2013162
9831 -2013162 -1897193 -1754345 -1595414 -1417972 -1221020 -988766 -709509 -363951 80575 662483
9821F62483P78677R55328P44824l76408k188178l416296l148133j854482m96263
9812h338448L07567N53376N30997M38812L57929K73066K02047J78754J66910J57750
9802e171240J47930J37697J37799J31805J20842J11589J06780J01026R4317Q4755
9792c996700Q5560J04839J09891J16707J34588J66459J92236J88404J08397q1945
9782b871564l15644m94618n37604m13267k02935k1898P8525J15023J02614R4786
9772d466582Q3877P5062O8083O4585N7593M2816M9275M4347L7964L5969M0046
9761c866965M1424L5925L3873K8591K5066L2071L6307L5622L1940k185l1159l5809
9749c635299k4298N274K1749J7165K2167K3988K2805K0978K0553K1759K1868J6696
$$ plain form
9821 662483 1441160 2396488 3141312 2764904 576726 -2839570 -5987703 -7842185 -8338448
9812 -8338448 -8030881 -7477505 -6946508 -6507696 -6149767 -5876701 -5674654 -5495900 -5328990 -5171240
9802 -5171240 -5023310 -4885613 -4747814 -4616009 -4495167 -4383578 -4276798 -4175772 -4081455 -3996700
9792 -3996700 -3911140 -3806301 -3696410 -3579703 -3445115 -3278656 -3086420 -2898016 -2789619 -2871564
9782 -2871564 -3187208 -3681826 -4219430 -4632697 -4835632 -4857530 -4779005 -4663982 -4561368 -4466582
9772 -4466582 -4382705 -4307643 -4239560 -4174975 -4117382 -4074566 -4025291 -3980944 -3942980 -3907011 -3866965
9761 -3866965 -3825541 -3789616 -3755743 -3727152 -3702086 -3670015 -3633708 -3598086 -3566146 -3568331 -3599490 -3635299
9749 -3635299 -3659597 -3654323 -3632574 -3615409 -3593242 -3569254 -3546449 -3525471 -3504918 -3483159 -3461291 -3444595
9737c444595O837J6976J6876J9327J7919J4931J4923J7243J5977P245J1966J1130
9725c273245P978Q691M147N892J3167Q851L425J4767J5934R980J425J0834J6730
9712c151424R811O934P680J3767J0545M861O152J0237J6537M518O883J4988J0992
9699c027519M877J2327J1444J713P495R752O239J2730J1998M751L054R930M414
9686b926795P319O875R692R046O140O665j093J189J0524J3346P733J0627q40O887
9672b832685N763J5188J5974l35O764J6063J3863N754M187P007j203p145j1438
9659b762243K67j402K904J1175J930J0518J4195J1375J1125L849N380P167N120
9646b678640J5569M993o00J863L107J0634O805M058Q078J4955O913N710K795O936
$$ plain form
9737 -3444595 -3437758 -3420782 -3403906 -3384579 -3366660 -3351729 -3336806 -3319563 -3303586 -3296341 -3284375 -3273245
9725 -3273245 -3265267 -3256576 -3252429 -3246537 -3233370 -3224519 -3221094 -3206327 -3190393 -3180413 -3178988 -3168154 -3151424
9712 -3151424 -3141613 -3134679 -3126999 -3113232 -3102687 -3097826 -3091674 -3081437 -3064900 -3060382 -3053499 -3038511 -3027519
9699 -3027519 -3022642 -3010315 -2998871 -2997158 -2989663 -2979911 -2973672 -2960942 -2948944 -2944193 -2941139 -2931209 -2926795
9686 -2926795 -2919476 -2912601 -2902909 -2893863 -2887723 -2881058 -2882151 -2880962 -2870438 -2857092 -2849359 -2838732 -2839572 -2832685
9672 -2832685 -2826922 -2811734 -2795760 -2796095 -2789331 -2773268 -2759405 -2753651 -2749464 -2742457 -2743660 -2750805 -2762243
9659 -2762243 -2761976 -2763378 -2760474 -2749299 -2747369 -2736851 -2722656 -2711281 -2700156 -2696307 -2690927 -2683760 -2678640
9646 -2678640 -2663071 -2658078 -2658678 -2656815 -2653708 -2643074 -2636269 -2632211 -2624133 -2609178 -2602265 -2596555 -2593760 -2586824
9632b586824J6184J9088J3620Q537J4174J1087R720P35k4884j9389n692J998N028
9619b536618P074L587j0499j8552j2876m999j261J1694J3514J1162O690Q805K370
9606b519909J5675J4933P635P992J0196K167J2942Q952J0671L371M894Q451J2678
9593b399352J0285J3633J0209J1849J1916R28n835o481j076O001N149P097p32
9580b336409j8516l0465l2325j9670K248k504n73P589O648M511j516K10K212L385
9566b415175R941M690L169O498J8505J6040m7L764R266Q099Q698N961J0392J4179
9552b296020N43K083J7352J3193J1807Q547J1064N843O71n640j7047j6676j1543
9539b275823o916J299N502L031k550O23k164n235n182n688o539M516Q006J3235
$$ plain form
9632 -2586824 -2570640 -2551552 -2537932 -2529395 -2515221 -2504134 -2494414 -2493679 -2518563 -2537952 -2543644 -2541646 -2536618
9619 -2536618 -2529544 -2525957 -2536456 -2555008 -2567884 -2572883 -2574144 -2562450 -2548936 -2537774 -2531084 -2522279 -2519909
9606 -2519909 -2504234 -2489301 -2481666 -2473674 -2463478 -2461311 -2448369 -2439417 -2428746 -2425375 -2420481 -2412030 -2399352
9593 -2399352 -2389067 -2375434 -2365225 -2353376 -2341460 -2340532 -2346367 -2352848 -2353924 -2347923 -2342774 -2335677 -2336409
9580 -2336409 -2354925 -2385390 -2417715 -2437385 -2435137 -2437641 -2438214 -2430625 -2423977 -2419466 -2420982 -2420772 -2418560 -2415175
9566 -2415175 -2405234 -2400544 -2397375 -2390877 -2372372 -2356332 -2356379 -2352615 -2343349 -2335250 -2326552 -2320591 -2310199 -2296020
9552 -2296020 -2295477 -2293394 -2276042 -2262849 -2251042 -2242495 -2231431 -2225588 -2224917 -2230557 -2247604 -2264280 -2275823
9539 -2275823 -2282739 -2281440 -2275938 -2272907 -2275457 -2274834 -2276998 -2282233 -2287415 -2293103 -2299642 -2295126 -2287120 -2273885
9525b273885R531N072l714O763J4100J0855J512Q182P398j203P445J0946Q298
9512b188700N993K946P81l515Q90J0485K812n54P353L625M588L848Q050M761M068
9497b132569n840k266J87l493K567N18N167R144J672O10q10J944Q385J1777J644
9482b101363O811P411M942m156k256O822P266J55N299P588M516K685Q212M627
9468b041441m694q498o531M975P858J3499O203j790P392N331O79K783M029L697
9454b006508J965n27L21P123M854K523J80n18M020L979k581J880L360J0337P297
9439a962295K09O77O28q45L858O405K976N331j51K805P83N428N456J1047O483
9424a911205k337n336K153J73P834K505M693N776o39M77j307j979K623J0220J7432
$$ plain form
9525 -2273885 -2264354 -2259282 -2262996 -2256233 -2242133 -2231278 -2229766 -2221584 -2214186 -2215389 -2207944 -2196998 -2188700
9512 -2188700 -2182707 -2179761 -2178980 -2182495 -2181605 -2171120 -2168308 -2168862 -2161509 -2157884 -2153296 -2149448 -2141398 -2136637 -2132569
9497 -2132569 -2138409 -2140675 -2140488 -2143981 -2141414 -2140896 -2135729 -2126585 -2124913 -2124303 -2125113 -2123169 -2114784 -2103007 -2101363
9482 -2101363 -2094552 -2087141 -2082199 -2086355 -2088611 -2081789 -2074523 -2074368 -2069069 -2061481 -2056965 -2054280 -2046068 -2041441
9468 -2041441 -2046135 -2054633 -2061164 -2056189 -2048331 -2034832 -2028629 -2030419 -2023027 -2017696 -2017017 -2014234 -2010205 -2006508
9454 -2006508 -2004543 -2005070 -2004749 -1997626 -1992772 -1990249 -1990069 -1990587 -1986567 -1982588 -1985169 -1983289 -1979929 -1969592 -1962295
9439 -1962295 -1962086 -1961409 -1960781 -1961626 -1957768 -1951363 -1948387 -1943056 -1943207 -1940402 -1939619 -1934191 -1928735 -1917688 -1911205
9424 -1911205 -1913542 -1918878 -1916725 -1916552 -1908718 -1906213 -1901520 -1895744 -1896383 -1895906 -1897213 -1899192 -1896569 -1886349 -1868917
9409a868917J6790P426J3112O179j2870j6468j5893r610j108o3J667R024K549
9396a868182k450K784P319N545Q016M061K099l749n90L036O626P288N378L287
9382a819532L356J975k253K142L496k232j002O004M394M890L059L46J4M635M361
9367a786347k743O928L510M644L228N003J275K769l768j904J0967N908j134K355
9353a749309P908N435J187k006m009P515Q020n503L44P176O513k400j28P768J438
9338a710051j035M990J979L450J558O95K666K253M68K648R526K532Q405M726J599
9323a663591k517M33M395p2j895L053K906j489L960J414R471l355M03Q643M489
9308a633752L470k645M614R222P888k351j60R483R192J0864O648J817J714L021
$$ plain form
9409 -1868917 -1852127 -1844701 -1831589 -1825410 -1838280 -1854748 -1870641 -1880251 -1881359 -1881422 -1879755 -1870731 -1868182
9396 -1868182 -1870632 -1867848 -1860529 -1854984 -1846968 -1842907 -1840808 -1844557 -1845147 -1842111 -1835485 -1828197 -1822819 -1819532
9382 -1819532 -1816176 -1814201 -1816454 -1814312 -1810816 -1813048 -1814050 -1808046 -1803652 -1798762 -1795703 -1795357 -1795343 -1790708 -1786347
9367 -1786347 -1789090 -1782162 -1778652 -1774008 -1770780 -1765777 -1764502 -1761733 -1765501 -1767405 -1756438 -1750530 -1751664 -1749309
9353 -1749309 -1741401 -1735966 -1734779 -1736785 -1740794 -1733279 -1725259 -1730762 -1730418 -1723242 -1716729 -1719129 -1719257 -1711489 -1710051
9338 -1710051 -1711086 -1706096 -1704117 -1700667 -1699109 -1698414 -1695748 -1693495 -1693027 -1690379 -1680853 -1678321 -1669916 -1665190 -1663591
9323 -1663591 -1666108 -1665675 -1661280 -1661352 -1663247 -1660194 -1657288 -1658777 -1654817 -1653403 -1643932 -1647287 -1646884 -1638241 -1633752
9308 -1633752 -1630282 -1632927 -1628313 -1619091 -1611203 -1613554 -1613714 -1604231 -1595039 -1584175 -1577527 -1575710 -1573996 -1570975
9294a570975P924J1562J4171J3657R080J3275J7577J3521K6331K7971K5542R858
9282a380506m7829j16651j11357q3446m0558m739J1515J5091J3995J5522J8609
9271a710354J0044J1475J4031L376L121J0684J0160R335J2776J1759N461N149
9259a602983J1810K528R776Q193P330Q805J0610O035M890J4992O116J4437K5649
9246a471812K1885K5859K8172J9732k6684j04734j23131r4942m7323j597J1690
9235a762885K0178J2846P858J3234J6231J2344M035R454J6087O940N597Q768O811
9222a622502O992N033P536l143L185P362N893R180O279k846K326O328j806k590
9208a572773R92L521O433M390j323l027J246J0966J2168R12P29r76M669O7o368
$$ plain form
9294 -1570975 -1563051 -1551489 -1537318 -1523661 -1514581 -1501306 -1483729 -1470208 -1443877 -1415906 -1390364 -1380506
9282 -1380506 -1428335 -1544986 -1656343 -1739789 -1780347 -1785086 -1773571 -1758480 -1744485 -1728963 -1710354
9271 -1710354 -1700310 -1688835 -1674804 -1671428 -1668307 -1657623 -1647463 -1638128 -1625352 -1613593 -1608132 -1602983
9259 -1602983 -1591173 -1588645 -1578869 -1570676 -1563346 -1554541 -1543931 -1537896 -1533006 -1518014 -1511898 -1497461 -1471812
9246 -1471812 -1449927 -1424068 -1395896 -1376164 -1402848 -1507582 -1630713 -1725655 -1772978 -1774575 -1762885
9235 -1762885 -1742707 -1729861 -1722003 -1708769 -1692538 -1680194 -1676159 -1666705 -1650618 -1643678 -1638081 -1629313 -1622502
9222 -1622502 -1615510 -1610477 -1602941 -1606084 -1602899 -1595537 -1589644 -1580464 -1574185 -1577031 -1574705 -1568377 -1570183 -1572773
9208 -1572773 -1571781 -1568260 -1561827 -1557437 -1558760 -1561787 -1560541 -1549575 -1537407 -1536495 -1535766 -1536742 -1532073 -1532006 -1538374
9193a538374m84L603R129M03j749J0921M056k052R096L38n536n29O175m306O837
9178a502472L718n373m113j772K432l58O220J0138M126k229m479O162O216p23
9164a482507l799J29k547L979O5R347M455K935k857j637j862n49P514M182j042
9149a464194o25L984K14k58K907L037l231l860M447R449j386P178o35m873l126
9134a450972K67k601K365J1134J3052K867L354m04j707j743k430K089L094M852
9120a416783M94m730Q44L209P96J050J623N622j966j726J141M170N693m480J386
9105a403657J848M496J2200K013J895J351m950j184O709K935J729m362r911n02
9091a389390L503L652K864L310R114J603l829p326J615Q058P21oP482L956K762
$$ plain form
9193 -1538374 -1538858 -1535255 -1526126 -1525723 -1527472 -1516551 -1512495 -1514547 -1505451 -1505113 -1510649 -1511178 -1505003 -1509309 -1502472
9178 -1502472 -1498754 -1504127 -1508240 -1510012 -1507580 -1507938 -1501718 -1491580 -1487454 -1489683 -1494162 -1488000 -1481784 -1482507
9164 -1482507 -1486306 -1486177 -1488724 -1484745 -1484680 -1475333 -1470878 -1467943 -1470800 -1472437 -1474299 -1474848 -1467334 -1463152 -1464194
9149 -1464194 -1464819 -1460835 -1460621 -1460879 -1457972 -1454935 -1458166 -1462026 -1457579 -1448130 -1449516 -1442338 -1442973 -1447846 -1450972
9134 -1450972 -1450705 -1453306 -1450941 -1439807 -1426755 -1423888 -1420534 -1420938 -1422645 -1424388 -1426818 -1424729 -1421635 -1416783
9120 -1416783 -1416289 -1421019 -1420175 -1416966 -1416170 -1415120 -1413497 -1407875 -1409841 -1411567 -1410426 -1406256 -1400563 -1405043 -1403657
9105 -1403657 -1401809 -1397313 -1385113 -1383100 -1381205 -1379854 -1384804 -1385988 -1379279 -1376344 -1374615 -1378977 -1388888 -1389390
9091 -1389390 -1385887 -1382235 -1379371 -1376061 -1366947 -1365344 -1369173 -1376499 -1374884 -1366826 -1366105 -1366111 -1358629 -1354673 -1351911
9076a351911O109P216m426r930q529N199J0232J645j488J0388M975l436r858r333
9062a353147j3788j0020J706K661L255P892Q511N454j395p56m275N528M672J044
9048a342658L185J946q48N356J210O738r81N582R7j383k273K921L500j777R994
9033a309391Q755l482L824M346L692r51m644p93l867J313L810n820j0182j7596
9019a330986q219O312P104k712m634L643K057k676R379M587J305L865K179O79
9005a308117j69p17L276L414m8n58N885J994M870N379l394R05k91l702M162k6
8989a287137K790J346J842j823K656L767O562L745k038k015l17P02K793N317O279
8974a255531O900j113p744r291l584K42p376j330O646j455k191M801M056o435
$$ plain form
9076 -1351911 -1345802 -1338586 -1343012 -1352942 -1361471 -1356272 -1346040 -1344395 -1345883 -1335495 -1330520 -1333956 -1343814 -1353147
9062 -1353147 -1366935 -1376955 -1375249 -1372588 -1369333 -1361441 -1352930 -1347476 -1348871 -1349627 -1353902 -1348374 -1343702 -1342658
9048 -1342658 -1339473 -1337527 -1338375 -1333019 -1331809 -1325071 -1326052 -1320470 -1320373 -1321756 -1324029 -1321108 -1317608 -1319385 -1309391
9033 -1309391 -1300636 -1304118 -1300294 -1295948 -1292256 -1293207 -1297851 -1298644 -1302511 -1301198 -1297388 -1303208 -1313390 -1330986
9019 -1330986 -1339205 -1332893 -1325789 -1328501 -1333135 -1329492 -1327435 -1330111 -1320732 -1316145 -1314840 -1310975 -1308796 -1308117
9005 -1308117 -1308286 -1309003 -1305727 -1302313 -1302361 -1302919 -1297034 -1295040 -1290170 -1284791 -1288185 -1287280 -1287571 -1291273 -1287111 -1287137
8989 -1287137 -1284347 -1283001 -1281159 -1282982 -1280326 -1276559 -1269997 -1266252 -1268290 -1270305 -1270622 -1269920 -1267127 -1261810 -1255531
8974 -1255531 -1248631 -1249744 -1257488 -1266779 -1270363 -1270121 -1277497 -1278827 -1272181 -1273636 -1275827 -1271026 -1266970 -1273405
8960a273405K150P901N028J0012R062k027k130k035L198L151m261o23J390J037
8946a241552k383j043q436k26N877L172j128n47O303k117m72k582L238M032P269
8931a230595N405O799J335Q979P507j853l374l60o477r585r547M688R972m49l141
8916a220696K828Q165J499K175L294m206J10L280L883M96K078l242M786K668M270
8901a188612K434K241J507l521N065O978j00M396M803M61l919n774j0958l736
8887a188735M027N362Q175P124m09l489L792J931p335L392N131n63J452J467J1862
8872a146816O149J570p064r707n497N40N351P615N816j65R06L076K162m753k791
8857a143608Q223K811q30Q945j82N7M572O455J645j982j969m35K884M380l41J46
$$ plain form
8960 -1273405 -1271255 -1263354 -1258326 -1248314 -1239252 -1241279 -1243409 -1245444 -1242246 -1239095 -1243356 -1243979 -1242589 -1241552
8946 -1241552 -1243935 -1244978 -1253414 -1253640 -1247763 -1244591 -1245719 -1246266 -1239963 -1242080 -1242552 -1245134 -1241896 -1237864 -1230595
8931 -1230595 -1225190 -1218391 -1217056 -1208077 -1200570 -1202423 -1205797 -1206157 -1212634 -1222219 -1231766 -1227078 -1217106 -1217555 -1220696
8916 -1220696 -1217868 -1209703 -1208204 -1206029 -1202735 -1206941 -1206831 -1203551 -1199668 -1199172 -1197094 -1200336 -1195550 -1192882 -1188612
8901 -1188612 -1186178 -1183937 -1182430 -1185951 -1180886 -1173908 -1174008 -1169612 -1164809 -1164348 -1168267 -1174041 -1184999 -1188735
8887 -1188735 -1184708 -1179346 -1171171 -1164047 -1164456 -1167945 -1164153 -1162222 -1169557 -1166165 -1161034 -1161597 -1160145 -1158678 -1146816
8872 -1146816 -1140667 -1139097 -1146161 -1155868 -1161365 -1160825 -1155474 -1147859 -1142043 -1142208 -1141302 -1138226 -1136064 -1140817 -1143608
8857 -1143608 -1135385 -1132574 -1133404 -1124459 -1124641 -1124584 -1120012 -1113557 -1111912 -1113894 -1115863 -1116298 -1113414 -1109034 -1109375 -1109229
8841a109229P566N536N284L485p443n80L475M502M048m040q378l692j817J908
8827a099375R431J0100j140n411K417m145l597O441k414l412Q803J0845m33o274
8813a078164K096Q552N633k227K940J685M37J747r68K113N237J59L07N643k60
8798a045070O09L802L406K170O245J0216R694l97J177P021K864l452K930R067
8784i89718M933J1080P771J3052R224M004p529l2896m4502l5635l0814q161N768
8771a093423m335J3053J3920O123P685R406J849l31L201M748p90N439N627K466
8757a025362Q406O513M302k397R647R768O939M519n683l275K61q569m359O214
8743i93076J621m797M871Q129L57K37k351J267J0535N336O45N612J4j785O14P793
$$ plain form
8841 -1109229 -1101663 -1096127 -1090843 -1087358 -1094801 -1095381 -1091906 -1087404 -1083356 -1087396 -1095774 -1099466 -1101283 -1099375
8827 -1099375 -1089944 -1079844 -1080984 -1086395 -1083978 -1088123 -1091720 -1085279 -1087693 -1091105 -1082302 -1071457 -1071890 -1078164
8813 -1078164 -1076068 -1067516 -1061883 -1064110 -1061170 -1059485 -1059048 -1057301 -1058269 -1056156 -1050919 -1050760 -1050453 -1044810 -1045070
8798 -1045070 -1044461 -1040659 -1037253 -1035083 -1028838 -1018622 -1008928 -1009325 -1008148 -1001127 -998263 -1001715 -998785 -989718
8784 -989718 -984785 -973705 -965934 -952882 -943658 -939654 -947183 -980079 -1024581 -1060216 -1091030 -1099191 -1093423
8771 -1093423 -1097758 -1084705 -1070785 -1064662 -1056977 -1047571 -1045722 -1046053 -1042852 -1038104 -1038894 -1033455 -1027828 -1025362
8757 -1025362 -1016956 -1010443 -1006141 -1008538 -998891 -989123 -982184 -977665 -983348 -986623 -986362 -994931 -999290 -993076
8743 -993076 -991455 -996252 -991381 -983252 -982895 -982658 -985009 -983742 -973207 -967871 -967226 -961614 -961600 -963385 -962771 -954978
8727i54978J999j166M315J973q56k349l225M45r05J2156J0990j074L929P989P821
8712i12936Q150M962K131j440K8m900p439k159k04J843N062P627P554j32K561
8697h89292J715L062L095J709K264k790N523P685O705R94m742K521J2273M323
8683h44955m2o75N44n78j425J564K645O862P035J0282J1649P662j810j090Q236
8668g94096J5307J2931M99j01L298M448Q134j214N563J4736J5400N437M332j009
8654g06335M094J0053N245Q399J3754N229J0672J4608J3111J2377J1572N289O557
8641e85375J4408J4620J5328K2001K3004J4686J5841J8862K6601L7558L7031K9118
8629c16317L3608N0746N6687O6079Q1652J07858J35369J71780K10421K48173J45805
$$ plain form
8727 -954978 -952979 -954145 -949830 -947857 -948713 -951062 -954287 -953842 -954747 -942591 -931601 -932675 -928746 -920757 -912936
8712 -912936 -904786 -899824 -897693 -899133 -899105 -904005 -911444 -913603 -913807 -911964 -906902 -899275 -891721 -891853 -889292
8697 -889292 -887577 -884515 -881420 -879711 -877447 -880237 -874714 -867029 -860324 -859330 -864072 -861551 -849278 -844955
8683 -844955 -844997 -845672 -845128 -845706 -847131 -845567 -842922 -836060 -829025 -818743 -807094 -799432 -801242 -802332 -794096
8668 -794096 -778789 -765858 -765359 -765460 -762162 -757714 -749580 -750794 -745231 -730495 -715095 -709658 -705326 -706335
8654 -706335 -702241 -692188 -686943 -678544 -664790 -659561 -648889 -634281 -621170 -608793 -597221 -591932 -585375
8641 -585375 -570967 -556347 -541019 -519018 -496014 -481328 -465487 -446625 -420024 -382466 -345435 -316317
8629 -316317 -282709 -231963 -175276 -109197 -27545 80313 215682 387462 597883 846056 991861
8618I91861l30864q70067r02071o00212k02943N0940J29658J30288J12650Q8399
8608a402361P9793O4639O9646O2546N7416N1629N0191L8798L4349M0825M1855
8597h10674M1105M7397M0724L9239L8340M6750N3001N6396M3466N3309O2184O1646
8585b27117N9857O7112Q0989J04270J28448J53617J87952K30708L08606L91921
8575A486363M83169L82048l97516j634070j914776j396620n74821L4207K22648
8566c309368K44976K13313J81265J50925J29471J18982J14763J03688P6612N7912
8556a917461N0100M6079N3527N6082N7398N5919M7309M0833L9826M1444M4614
8545a384330M3149M1987M3218L8784L8238M6470M2590N2447N8737O7300P7742
$$ plain form
8618 991861 660997 -209070 -1111141 -1711353 -1914296 -1863356 -1733698 -1603410 -1490760 -1402361
8608 -1402361 -1322568 -1257929 -1188283 -1125737 -1068321 -1016692 -966501 -927703 -893354 -852529 -810674
8597 -810674 -769569 -722172 -681448 -642209 -603869 -557119 -504118 -447722 -404256 -350947 -288763 -227117
8585 -227117 -167260 -100148 -19159 85111 213559 367176 555128 785836 1094442 1486363
8575 1486363 1969532 2351580 1954064 319994 -1594782 -2991402 -3566223 -3532016 -3309368
8566 -3309368 -3064392 -2851079 -2669814 -2518889 -2389418 -2270436 -2155673 -2051985 -1975373 -1917461
8556 -1917461 -1867361 -1821282 -1767755 -1711673 -1654275 -1598356 -1551047 -1510214 -1470388 -1428944 -1384330
8545 -1384330 -1341181 -1299194 -1255976 -1217192 -1178954 -1132484 -1089894 -1037447 -978710 -911410 -833668
8534h33668R5753J24091J52684J88693K28652K17492n2708o15234r07532p34308
8524b136085l75506n3793P5928J10703J09845R9402P9891O9821O7562O0394N1571
8513a840267M4226L9401L1684K3789K7878K9593L2983K5712K3670K5922L0202
8502a505207J8533J2885J0728J7689J8418J9825L0129K3564K1220Q489j7064l3010
8490a373801l6715k5306j3130K370J0659J3629N300P585J2722J5781J8899L72
8478a361635l4j1362j7142j3834J170J5119N705O747Q582J2141J0973J3338L093
8465a327139r0P918J674J7051J1114Q753O707L514M267Q640L60m882j283O431
8451a256965N220L393J117q59M883O356Q700Q400J0832J842M633j295n112M366
$$ plain form
8534 -833668 -737915 -613824 -461140 -272447 -43795 173697 120989 -494245 -1401777 -2136085
8524 -2136085 -2511591 -2565384 -2489456 -2378753 -2268908 -2169506 -2089615 -2019794 -1952232 -1891838 -1840267
8513 -1840267 -1796041 -1756640 -1724956 -1701167 -1673289 -1643696 -1610713 -1585001 -1561331 -1535409 -1505207
8502 -1505207 -1486674 -1473789 -1463061 -1445372 -1426954 -1407129 -1377000 -1353436 -1332216 -1323727 -1340791 -1373801
8490 -1373801 -1410516 -1435822 -1448952 -1446582 -1435923 -1422294 -1416994 -1409409 -1396687 -1380906 -1362007 -1361635
8478 -1361635 -1361669 -1373031 -1390173 -1404007 -1402837 -1387718 -1382013 -1375266 -1366684 -1354543 -1343570 -1330232 -1327139
8465 -1327139 -1327229 -1319311 -1317637 -1300586 -1289472 -1280719 -1274012 -1270498 -1266231 -1257591 -1257231 -1262113 -1263396 -1256965
8451 -1256965 -1251745 -1248352 -1247235 -1248094 -1243211 -1236855 -1228155 -1219755 -1208923 -1207081 -1202448 -1203743 -1208855 -1204489
8437a204489K915O985O044J510J027J283j0664r496r459O14J0047M505J831R564
8423a187783M395L900K994J4811J1769K439K927O981N684J2749J1809r916j5696
8410a132937j1503q038p655o115j0738j3768l668M763J0302P941Q14M062L693
8397a162847L761Q794P594L932l246J586Q28R702M132L748K23N580Q004J0951
8383a097258M998l232K869O724N543Q795M586r658j9060k2272q083o90p729J38
8369a134329J358J0811J1213O944O628P673L562p903k0847j6400j8764j3031n679
8356a168764j652O545K817Q385O653Q483K887O648r28M167J0310M754o62J275
8342a109082M482M177K43K100J2117l745k990J40N992N913j942M175R638M656
$$ plain form
8437 -1204489 -1201574 -1194589 -1188545 -1187035 -1186008 -1184725 -1195389 -1204885 -1214344 -1213730 -1203683 -1199178 -1197347 -1187783
8423 -1187783 -1183388 -1179488 -1176494 -1161683 -1149914 -1147475 -1144548 -1137567 -1131883 -1119134 -1107325 -1117241 -1132937
8410 -1132937 -1144440 -1152478 -1160133 -1166248 -1176986 -1190754 -1194422 -1189659 -1179357 -1171416 -1170602 -1166540 -1162847
8397 -1162847 -1159086 -1150292 -1142698 -1138766 -1142012 -1140426 -1139598 -1129896 -1125764 -1122016 -1121793 -1116213 -1108209 -1097258
8383 -1097258 -1092260 -1095492 -1092623 -1085899 -1080356 -1071561 -1066975 -1076633 -1095693 -1117965 -1126048 -1126738 -1134467 -1134329
8369 -1134329 -1132971 -1122160 -1110947 -1104003 -1097375 -1089702 -1086140 -1094043 -1114890 -1131290 -1150054 -1163085 -1168764
8356 -1168764 -1170416 -1163871 -1161054 -1152669 -1146016 -1137533 -1134646 -1127998 -1128926 -1124759 -1114449 -1109695 -1110357 -1109082
8342 -1109082 -1104600 -1100423 -1100180 -1098080 -1085963 -1089708 -1092698 -1092558 -1086566 -1080653 -1082595 -1078420 -1068782 -1064126
8328a064126M948J49k616N369Q185n42j2119l904P588k386R76L395M33j1291o206
8313a072147l129j1915J18N729M149l499l148O570O751J1442P875p710m087l367
8299a066368l301L47j711O953R798N889P57q90M745N182M599K375N801m536p87
8284a031147m612l442P452N102m396m887K214L54o116n198L784Q620M102M364
8270a023806N091K568m175l967M304j955R32j336M465l55n334j646Q290K435j303
8255a015792l313L060K235O470M876r66n710k477N985M707l081o661J337J0012
8241i99318J677l633M620K551P00M709P825l307K679k805k139L272k92l184k024
8226i88669M131L928J991o403o70p376o53L536J0253Q508L02k025K203O39k924
$$ plain form
8328 -1064126 -1059178 -1059029 -1061645 -1056276 -1048091 -1048633 -1060752 -1064656 -1057068 -1059454 -1058478 -1055083 -1054650 -1065941 -1072147
8313 -1072147 -1075276 -1087191 -1087073 -1081344 -1077195 -1080694 -1083842 -1077272 -1070521 -1059079 -1051204 -1058914 -1063001 -1066368
8299 -1066368 -1069669 -1069322 -1071033 -1064080 -1054282 -1048393 -1047636 -1048526 -1043781 -1038599 -1034000 -1031625 -1025824 -1030360 -1031147
8284 -1031147 -1035759 -1039201 -1031749 -1026647 -1031043 -1035930 -1033716 -1033362 -1039478 -1044676 -1040892 -1032272 -1028170 -1023806
8270 -1023806 -1018715 -1016147 -1020322 -1024289 -1019985 -1021940 -1021008 -1022344 -1017879 -1018234 -1023568 -1025214 -1016924 -1014489 -1015792
8255 -1015792 -1019105 -1016045 -1013810 -1007340 -1002464 -1003430 -1009140 -1011617 -1005632 -1000925 -1004006 -1010667 -1009330 -999318
8241 -999318 -997641 -1001274 -996654 -994103 -993403 -988694 -980869 -984176 -981497 -984302 -986441 -983169 -983461 -986645 -988669
8226 -988669 -984538 -980610 -978619 -985022 -985692 -993068 -993721 -990185 -979932 -971424 -971122 -973147 -970944 -970305 -973229
8211i73229r3J196J34m00q126o390m407L862J4329R625N49q052M179K67L352m442
8195i67646o546j470q18N135q11J428Q75L860N756L449L431K20K734L57N58R55
8179i48533m91l80R33r11J687R114Q615k003N95J0822j167m030o095q066o632
8164i46542N216m584J219q30K208q48l908k931l833j277Q442O807N001j60L126
8149i32894J838m995m402M693k277k95O071K107l206k949M856Q205K515K88N744
8134i14701k602K935k088J766J770q82l672j045P500k5J0799K511n923p822j3257
8119i24736J06L661Q035J481L124m353J766M617N094Q788J802J807p490k241j481
8104i00020q82N77J971N887m616R81J0261N399M692l663K942l839j0920k22O079
$$ plain form
8211 -973229 -973322 -972126 -971992 -972392 -980518 -986908 -991315 -987453 -973124 -963499 -962950 -971002 -966823 -966556 -963204 -967646
8195 -967646 -974192 -975662 -976480 -971345 -972156 -970728 -969853 -965993 -960237 -956788 -953357 -953137 -950403 -950046 -949488 -948533
8179 -948533 -949024 -949404 -948471 -949382 -947695 -938581 -929966 -931969 -931374 -920552 -921719 -925749 -931844 -939910 -946542
8164 -946542 -941326 -945910 -944691 -945521 -943313 -944161 -948069 -951000 -954833 -956110 -947668 -940861 -935860 -936020 -932894
8149 -932894 -931056 -936051 -940453 -935760 -938037 -938332 -932261 -930154 -933360 -936309 -931453 -923248 -920733 -920445 -914701
8134 -914701 -917303 -914368 -916456 -914690 -912920 -913802 -917474 -918519 -911019 -911044 -900245 -897734 -903657 -911479 -924736
8119 -924736 -924630 -920969 -912934 -911453 -908329 -912682 -910916 -906299 -901205 -892417 -890615 -888808 -896298 -898539 -900020
8104 -900020 -900902 -900325 -898354 -892467 -897083 -896102 -885841 -880442 -875750 -879413 -876471 -880310 -891230 -891452 -885373
8089h85373M660L280J128q048L111N664M223m251k78M823n928n431m580K226K935
8074h81839J089o513l419L216Q427Q748r64Q76K2l971M294J3411O708m518o059
8059h60492l744l894K507k899l29J653j053P86N962J476L079k467j452p774k804
8044h71445L279M661N32n545n280N707Q536K820K22j182n15j540k665j1590m587
8029h78592O064K708L418O414J326L944m379o556R44K155j624M154P689M789O279
8014h41267Q79j524q77q349r444q136j6523j1275n154L769J3225J002k053K152
8000h83575n528N96J1371K637Q158J276k718L816L791K528M019j053J417Q92j673
7985h54046J645N951k39k913L784l982o694j833N77N226m46j959j1890k949K102
$$ plain form
8089 -885373 -880713 -877433 -876305 -884353 -881242 -875578 -871355 -875606 -875884 -871061 -876989 -882420 -887000 -884774 -881839
8074 -881839 -880750 -887263 -890682 -887466 -879039 -870291 -871255 -870379 -870357 -874328 -870034 -856623 -849915 -854433 -860492
8059 -860492 -864236 -868130 -865623 -868522 -868851 -867198 -868251 -867465 -861503 -860027 -856948 -859415 -860867 -868641 -871445
8044 -871445 -868166 -863505 -862973 -868518 -873798 -868091 -859555 -856735 -856513 -857695 -858210 -859750 -862415 -874005 -878592
8029 -878592 -872528 -869820 -866402 -859988 -858662 -854718 -859097 -865653 -864709 -862554 -864178 -860024 -852335 -847546 -841267
8014 -841267 -840388 -841912 -842789 -851138 -860582 -868718 -885241 -896516 -901670 -897901 -884676 -883674 -885727 -883575
8000 -883575 -889103 -888507 -877136 -874499 -866341 -865065 -867783 -863967 -860176 -857648 -853629 -854682 -853265 -852373 -854046
7985 -854046 -852401 -846450 -846689 -849602 -845818 -849800 -856494 -858327 -857750 -852524 -852970 -854929 -866819 -869768 -867666
7970h67666m160K56J1715N012k880K818r070j8428k7847j3057j358j279M578M020
7956i17346j371O947R642O008k675n188R14M225N453n22J749O272M185M83L590
7941h77634P95K342R549l483k343r32l104m242K412N157j317o058q25l454n630
7926h88767K177p294O7L756K349m019r70M644J336q075n492l186n654n081J289
7911i12920N47k350N183L336K262j14K007M077L951O189K821M43l869l729O058
7896h86108J756n839J882N655P317j365j1365o295K900m77n83L026l148o859Q13
7881h98690p90M816M29J508L883N667k99K694n831J960L161J968M00j717n916
7866h86757J177R756L46p552K285k309m04O90J742J760N547K410M912M758J114
$$ plain form
7970 -867666 -871826 -871570 -859855 -854843 -857723 -854905 -863975 -882403 -910250 -923307 -924665 -925944 -921366 -917346
7956 -917346 -918717 -911770 -902128 -896120 -898795 -903983 -903069 -898844 -893391 -893913 -892164 -885892 -881707 -881224 -877634
7941 -877634 -876839 -874497 -864948 -868431 -870774 -871706 -874810 -879052 -876640 -871483 -872800 -878858 -879683 -883137 -888767
7926 -888767 -886590 -893884 -893817 -890061 -887712 -891731 -892701 -888057 -886721 -894796 -900288 -903474 -909128 -914209 -912920
7911 -912920 -912373 -914723 -909540 -906204 -903942 -904056 -902049 -897972 -894021 -887832 -885011 -884568 -888437 -892166 -886108
7896 -886108 -884352 -890191 -888309 -882654 -875337 -876702 -888067 -894362 -891462 -891939 -892522 -889496 -892644 -899503 -898690
7881 -898690 -899480 -894664 -894235 -892727 -888844 -883177 -883476 -880782 -886613 -884653 -881492 -879524 -879124 -880841 -886757
7866 -886757 -885580 -875824 -875478 -883030 -880745 -883054 -883458 -882768 -881026 -879266 -873719 -871309 -866397 -861639 -860525
7851h60525K668l12J332o010j412K924p6q10M25N805m29n737n981k99L291j569
7835h66715n62M819l462L327p91m146k112j100k25M671O411K519K68M871J22M623
7819h47482l506o552J638M713J137j995k96K491k59L999O81k406L400O365n190
7804h43262n661J079j576P530M794j16p25K796k056n734p241J810R980P904K882
7789h27596n774J065k446J666N59p266n930m14O337J0127J441L001N033o089m006
7774h30292O47n99o181n19Q151K117j046n580o98J172l07J263O186R241M434l697
7758h15708j263N85M658R31m74M166k840o267Q65K03K075K865J418n443j1888
7743h26117L975P814L93k915n567J555J898J745J670k135J003N238Q205O165n359
$$ plain form
7851 -860525 -857857 -858169 -856837 -862847 -864259 -861335 -861411 -862221 -861796 -855991 -856420 -862157 -868138 -868437 -865146 -866715
7835 -866715 -867277 -862458 -865920 -862593 -863384 -867530 -869642 -870742 -870967 -866296 -859885 -857366 -857098 -852227 -852105 -847482
7819 -847482 -850988 -857540 -855902 -851189 -850052 -852047 -852343 -849852 -850111 -846112 -845431 -847837 -844437 -838072 -843262
7804 -843262 -848923 -847844 -849420 -841890 -837096 -837212 -837937 -835141 -837197 -842931 -850172 -848362 -838382 -830478 -827596
7789 -827596 -833370 -832305 -834751 -833085 -832526 -839792 -845722 -846136 -839799 -829672 -828231 -825230 -820197 -826286 -830292
7774 -830292 -829645 -830244 -836425 -836944 -828793 -826676 -827722 -833302 -834000 -832828 -833135 -831872 -825686 -816445 -812011 -815708
7758 -815708 -816971 -816386 -811728 -810797 -811271 -807105 -809945 -816212 -815347 -815144 -813069 -810204 -808786 -814229 -826117
7743 -826117 -822142 -814328 -813935 -816850 -822417 -820862 -818964 -817219 -815549 -817684 -816681 -811443 -803238 -797073 -802432
7728h02432m731J529l030j342o35J143K130k908k021P321L220o272m481O162k655
7713h09002K874j194R51l122m550K299M537K930L479j42J587j755k000K100J746
7698g99262L110O400M115n092o12J66M464J149J148m48p987j229O975o374r682
7683h03159J554L595J241K641pk597M331J3506N220l690m468n17j695k377L846
7668g82576L839k86l566p19o13n646K140K236j952n383Q145M525k093L782m586
7653g82753l241P309L519n716K300l82p707o251m547N354O514L205k649J469m511
7638g88087L698P249N892K737m280p748J245R925j684L271j449k159ql835n86
7623g75819K491j339L61M835P487j406K340m658k920m486Q7K153P083N905j009
$$ plain form
7728 -802432 -807163 -805634 -808664 -810006 -810641 -809498 -807368 -810276 -812297 -804976 -801756 -808028 -812509 -806347 -809002
7713 -809002 -806128 -807322 -806371 -809493 -814043 -811744 -807207 -804277 -800798 -800940 -799353 -801108 -803108 -801008 -799262
7698 -799262 -796152 -789752 -785637 -790729 -791341 -791175 -786711 -785562 -784414 -784862 -792849 -794078 -787103 -793477 -803159
7683 -803159 -801605 -798010 -796769 -794128 -794135 -796732 -792401 -778895 -773675 -777365 -781833 -782350 -784045 -786422 -782576
7668 -782576 -778737 -779023 -782589 -783308 -783921 -789567 -787427 -785191 -787143 -792526 -784381 -779856 -781949 -778167 -782753
7653 -782753 -785994 -778685 -775166 -780882 -778582 -778964 -786671 -792922 -797469 -792115 -785601 -782396 -785045 -783576 -788087
7638 -788087 -784389 -777140 -771248 -768511 -772791 -780539 -779294 -769369 -771053 -767782 -769231 -771390 -771398 -775233 -775819
7623 -775819 -773328 -774667 -774306 -769471 -761984 -763390 -761050 -765708 -768628 -773114 -773027 -770874 -763791 -757886 -758895
7608g58895k836o893l180p78J542O88J898J845m073K046l114J0363l240o965k684
7593g74276m512M553P135r48J148K121M572K414Q50l133L61M28n297o186J828
7578g68942L720J657L774K830j494r40k104j970L350M852M248O149k590m672m216
7563g56348L685K918n43j903J164R167m861j020K99l02m522n162P56k13Q067N135
7547g43683j551o22L496j926o500K478L258n31M167J388j368p8M48l629M262J645
7531g38746J09K799j820q883j611K53l884M4P279N945k145M564M742K889m455
7516g32920j273r151K067O423j44M85j664n23Q05M11k299l222R05O34L18m740
7500g43888K433n185n016L131J094R02M584K008N631l015P499L873J167L552o02
$$ plain form
7608 -758895 -761731 -768624 -771804 -772582 -771040 -770352 -768454 -766609 -770682 -768636 -771750 -761387 -764627 -771592 -774276
7593 -774276 -778788 -774235 -767100 -768048 -766900 -764779 -760207 -757793 -756943 -760076 -759715 -759287 -764584 -770770 -768942
7578 -768942 -765222 -763565 -759791 -756961 -758455 -759395 -761499 -763469 -760119 -755267 -751019 -744870 -747460 -752132 -756348
7563 -756348 -752663 -749745 -750288 -752191 -751027 -741860 -746721 -747741 -747442 -747744 -752266 -757428 -756672 -756885 -748818 -743683
7547 -743683 -745234 -745856 -742360 -744286 -750786 -748308 -745050 -745581 -741414 -740026 -741394 -741472 -741024 -744653 -740391 -738746
7531 -738746 -738637 -735838 -737658 -746541 -748152 -747899 -751783 -751739 -744460 -738515 -740660 -736096 -731354 -728465 -732920
7516 -732920 -734193 -743344 -741277 -734854 -734998 -734513 -736177 -736700 -735895 -735484 -737783 -741005 -740100 -739466 -739148 -743888
7500 -743888 -741455 -746640 -751656 -748525 -747431 -746529 -741945 -739937 -734306 -737321 -729822 -725949 -724782 -721230 -721832
7485g21832l136l846L066L717j476n262J53K050J405m281o36k244k62M830O511
7470g21243R93l113q99N693k552p4J748k502j439m09j569J020M68n26j900O040
7454g20264k450P191J161q219m878k698O92m629m875L624O851J618J141K309j543
7439g24969n485L332Q58M243J474k200J163P552K733k961L449P92K691k803q215
7424g18346j417L791l6j006j992K875J076L734L517l182J242K006N734k71m470
7409g06745m593Q258j759m188j493m223k352K257J551M266K661m063l56l583j707
7394g16069J281O837K94n344j626j406P611K346M638l694o114m95k428j482M683
7379g10968o78o03p090j025M733p299K85N108K096K627O30K516J238L15P689O547
$$ plain form
7485 -721832 -724968 -728814 -725748 -722031 -723507 -728769 -728616 -726566 -725161 -729442 -730078 -732322 -732584 -727754 -721243
7470 -721243 -720250 -723363 -724262 -718569 -721121 -721195 -719447 -721949 -723388 -723797 -725366 -724346 -723878 -724404 -726304 -720264
7454 -720264 -722714 -715523 -714362 -722581 -727459 -730157 -729465 -734094 -738969 -735345 -728494 -726876 -725735 -723426 -724969
7439 -724969 -730454 -727122 -726264 -722021 -720547 -722747 -721584 -714032 -711299 -714260 -710811 -710019 -707328 -710131 -718346
7424 -718346 -719763 -715972 -716008 -717014 -719006 -716131 -715055 -711321 -707804 -710986 -709744 -707738 -702004 -702275 -706745
7409 -706745 -711338 -703080 -704839 -709027 -710520 -714743 -717095 -714838 -713287 -709021 -706360 -710423 -710779 -714362 -716069
7394 -716069 -714788 -707951 -707657 -713001 -714627 -716033 -708422 -706076 -701438 -705132 -711246 -711741 -714169 -715651 -710968
7379 -710968 -711646 -712249 -719339 -720364 -715631 -722930 -722645 -717537 -715441 -712814 -712184 -709668 -708430 -708115 -700426 -693879
7363f93879o039m803J186o22k296j85j423R53L777N395N019L383m888m112p430
7348g05964o608p42M445N399P10J072j355P223M196K507o522j685k624j628r10
7333g02486O011M653n550p243k231p47N675K243j982j522O33J802N1R23J701K290
7317f95779L460k131l280k629j291k591K812q84k709J287N943J238N467O751P30
7302f83606l241k125l0l795K956m82j697j472K455K975q474m80N678Q74l203k854
7286f96521L744P668M04l466l957L861L021J682J026k12o89J432J903K249r40
7271f78795J149L016J441L819N531m040r959p92L605N072m368o590Q43N57j215
7256f80726K046k541M064O183j427q194n196O25L057Q212L138o026n499J0962
$$ plain form
7363 -693879 -699918 -704721 -703535 -704157 -706453 -706638 -708061 -707108 -703331 -697936 -692917 -689534 -694422 -698534 -705964
7348 -705964 -712572 -713314 -708869 -703470 -702760 -701688 -703043 -695820 -691624 -689117 -695639 -697324 -699948 -701576 -702486
7333 -702486 -696475 -691822 -697372 -704615 -706846 -707593 -701918 -699675 -701657 -703179 -702546 -700744 -700693 -699770 -698069 -695779
7317 -695779 -692319 -694450 -697730 -700359 -701650 -704241 -701429 -702313 -705022 -703735 -697792 -696554 -691087 -684336 -683606
7302 -683606 -686847 -688972 -689002 -692797 -689841 -690323 -692020 -693492 -691037 -688062 -696536 -697016 -691338 -690464 -693667 -696521
7286 -696521 -692777 -685109 -684705 -688171 -692128 -688267 -685246 -683564 -682538 -682750 -683439 -682007 -680104 -677855 -678795
7271 -678795 -677646 -674630 -673189 -669370 -663839 -667879 -677838 -678630 -675025 -669953 -674321 -680911 -680068 -679511 -680726
7256 -680726 -678680 -681221 -677157 -670974 -672401 -680595 -685791 -685166 -682109 -673897 -670759 -676785 -682284 -671322
7242f71322M860O56l31N07m207l622n160k7L985O005K20m186l703K020k246k784
7226f79335m84k499K111o78J1373O074o832o87O82M362j121j26M505K37k894m143
7210f69455K334l354o068K960O402O970P05M05o238l194J368M590k144K64O180
7195f58275o598K00L324k634p057Q2J567J130J225N883K110o092J407J848K40
7180f61640J544l818k980J398L54m987K873j39L674K697k847L132J228l044N156
7165f57399O527q62k251l964m073J913K984J427n285K727M648K397j446l823J587
7150f54893K853l781O180n485m012j485K073J609J121J255l609k485J051K40l893
7135f63261K220O472j705l932K070k456Q209l353l92O45O644K036m305R607N696
$$ plain form
7242 -671322 -666462 -665806 -666137 -665630 -669837 -673459 -678619 -678646 -674661 -668656 -668436 -672622 -676325 -674305 -676551 -679335
7226 -679335 -679819 -682318 -680207 -680885 -669512 -663438 -670270 -670957 -670275 -665913 -667034 -667160 -662655 -662418 -665312 -669455
7210 -669455 -667121 -670475 -676543 -673583 -667181 -660211 -659506 -659101 -665339 -668533 -667165 -662575 -664719 -664455 -658275
7195 -658275 -664873 -664673 -661349 -663983 -671040 -670958 -669391 -668261 -667036 -661153 -659043 -665135 -663728 -661880 -661640
7180 -661640 -660096 -663914 -666894 -665496 -665142 -670129 -667256 -667395 -663721 -661024 -663871 -660739 -659511 -662555 -657399
7165 -657399 -650872 -651734 -653985 -657949 -662022 -660109 -657125 -655698 -660983 -658256 -653608 -651211 -652657 -656480 -654893
7150 -654893 -652040 -655821 -649641 -655126 -659138 -660623 -658550 -656941 -655820 -654565 -658174 -660659 -659608 -659368 -663261
7135 -663261 -661041 -654569 -656274 -660206 -658136 -660592 -652383 -655736 -656128 -655483 -648839 -646803 -651108 -641501 -635805
7120f35805K2r512m529j56J59k805j748J858M004J95j418J634M027m137j0326
7105f58537r20J995L759M787J697k167j040l299N374N355k215r86j779j53m040
7090f52169m565K19K646J887l761L463O353L865K925K386l943k092M098J636q924
7075f45976m527M540M240r42l056O537j884l335M264J239p81P927n795m533r45
7060f43027k206q51m22O564l655o048N461K508k234k248L217M865N359n421j304
7045f39442J607l438m256o18r355l901P706P049M143O615N578n583k476k736m603
7030f43710R665J804k483l789r28j109L503K333j394R25n132k876K814J524o134
7015f44987q73K039L383j21m020N858O232K760k339k230k462K937Q48k285o591
$$ plain form
7120 -635805 -635783 -645295 -649824 -649980 -649821 -652626 -654374 -652516 -648512 -648317 -649735 -648101 -644074 -648211 -658537
7105 -658537 -659457 -657462 -653703 -648916 -647219 -649386 -650426 -653725 -648351 -642996 -645211 -646197 -647976 -648129 -652169
7090 -652169 -656734 -656515 -653869 -651982 -655743 -652280 -645927 -642062 -639137 -636751 -640694 -642786 -638688 -637052 -645976
7075 -645976 -650503 -645963 -641723 -642665 -645721 -639184 -641068 -644403 -640139 -638900 -639681 -631754 -637549 -642082 -643027
7060 -643027 -645233 -646084 -646506 -639942 -643597 -649645 -644184 -641676 -643910 -646158 -642941 -638076 -632717 -638138 -639442
7045 -639442 -637835 -641273 -645529 -646147 -655502 -659403 -651697 -644648 -640505 -633890 -628312 -633895 -636371 -639107 -643710
7030 -643710 -634045 -632241 -634724 -638513 -639441 -640550 -637047 -634714 -636108 -635183 -640315 -643191 -640377 -638853 -644987
7015 -644987 -645860 -643821 -640438 -640559 -644579 -638721 -632489 -629729 -632068 -634298 -636760 -633823 -632975 -635260 -641851
7000f41851N636N213m669N739Q222Q3l975p69J859Q86K223J264k214q471r570
6985f40394l19M970Q447M937r20J561k807o593K55j537m19L756K152n680k850
6970f35441N256k095O57L16l685P96m61m257R64M367M188p19K251N791Q968K36
6954f12868l085k618J229p96l405l076j877O61P141O054k869m076L869J954m574
6939f18336j581L884j421l544J917Q92k449N280M057j63L952p48k657j0322r54
6924f22193O955K757J389j813q667M130L895O253R49n261j770K495j077L74r37
6909f12521n011q03O763O135l76p46J975o479l860J596L063k40m639l445L362
6894f15226k018n970J896Q478L837p483m041L846M138l260k823j84M73O08K582
$$ plain form
7000 -641851 -636215 -631002 -635671 -629932 -621710 -621627 -625602 -626371 -624512 -623626 -621403 -620139 -622353 -630824 -640394
6985 -640394 -640713 -635743 -627296 -622359 -623279 -621718 -624525 -631118 -630863 -632400 -632819 -629063 -626911 -632591 -635441
6970 -635441 -630185 -632280 -631623 -631307 -634992 -634196 -634657 -638914 -637950 -633583 -629395 -630114 -627863 -622072 -613104 -612868
6954 -612868 -615953 -618571 -617342 -618138 -621543 -624619 -626496 -625835 -618694 -612640 -615509 -619585 -615716 -613762 -618336
6939 -618336 -619917 -616033 -617454 -620998 -619081 -618189 -620638 -615358 -611301 -611464 -607512 -608260 -610917 -621239 -622193
6924 -622193 -615238 -612481 -611092 -612905 -621572 -617442 -613547 -607294 -606345 -611606 -613376 -610881 -611958 -611584 -612521
6909 -612521 -617532 -618335 -611572 -605437 -605813 -606559 -604584 -611063 -614923 -613327 -610264 -610504 -615143 -618588 -615226
6894 -615226 -617244 -623214 -621318 -612840 -609003 -616486 -620527 -616681 -612543 -615803 -618626 -618810 -618337 -617729 -615147
6879f15147R501K21K05J004j743k686k105m443j48M84O905Q058K098m242k384
6864f04422n55J968L76o528l125N439n79l395M221P470J207Q79R17M237L040k587
6848e91437j0144j0328j184q91j155K839k587p078J786N438P918P336N928M001
6834e89558j13M339P28k667p451J1Q76j0833m368M180N74j236l267K64l73J936
6818f06958P451O222l805l786o237J528K486K922M741k974k66Q31L050M029J435
6803e89331K648m866r493K154Q64N06J592j274j291k345J227J081N084L952j638
6788e91130k124K056l39K632J119m080q525P620J987L75l145N41P75j171K57J774
6772e91378J785m349M03j162r71J541K707m244M11M083K45j346J429j061j108
$$ plain form
6879 -615147 -605646 -605425 -605220 -604216 -605959 -608645 -610750 -615193 -615341 -614857 -607952 -599894 -597796 -602038 -604422
6864 -604422 -604977 -603009 -602633 -609161 -612286 -606847 -607426 -610821 -606600 -599130 -597923 -597044 -596127 -591890 -588850 -591437
6848 -591437 -601581 -611909 -613093 -613984 -615139 -612300 -614887 -621965 -620179 -614741 -606823 -599487 -593559 -589558
6834 -589558 -589671 -585332 -584604 -587271 -594722 -594711 -593835 -604668 -609036 -604856 -604282 -605518 -608785 -608521 -608894 -606958
6818 -606958 -599507 -593285 -597090 -600876 -607113 -605585 -603099 -600177 -595436 -598410 -598676 -597845 -594795 -590766 -589331
6803 -589331 -586683 -591549 -601042 -598888 -598024 -597518 -595926 -597200 -598491 -600836 -599609 -598528 -593444 -589492 -591130
6788 -591130 -593254 -591198 -591537 -588905 -587786 -591866 -600391 -592771 -590784 -590409 -593554 -593013 -592238 -593409 -593152 -591378
6772 -591378 -589593 -593942 -593539 -594701 -595672 -594131 -591424 -595668 -595257 -591174 -590929 -592275 -590846 -591907 -593015
6757e93015j737p163N437R898K425k403J812q64l436m023n848P082Q359j080M141
6742e80415j454n516j751j646K934L30J953L59l657j619p11N899M48J662j966
6727e85150J16k780N269L125m065m804J476L927m222M23K347J094j696m96J529
6712e83907K90N501K94k330n778R87L093O327J139o670m282l271K207n192P37
6697e90855O669K517l399j1720m277N382O335K205M592M146L140j855p517k505
6683e87142K552L928M523k670O924n056j1134q36M929O054n541k185O046L328
6669e76280P60J780J207k584n29K391j545j587o923o76O445q25j583j788K386
6654e79351L523Q57r057j795N697M560m81j346o436j261M726M358J576m434n428
$$ plain form
6757 -593015 -594752 -601915 -596478 -586580 -584155 -586558 -584746 -585610 -589046 -593069 -598917 -591835 -583476 -584556 -580415
6742 -580415 -581869 -587385 -589136 -590782 -587848 -587518 -585565 -585206 -588863 -590482 -591193 -585294 -584846 -583184 -585150
6727 -585150 -585034 -587814 -582545 -579420 -583485 -588289 -586813 -582886 -587108 -586685 -584338 -583244 -584940 -585436 -583907
6712 -583907 -583617 -578116 -577822 -580152 -585930 -584943 -581850 -575523 -574384 -581054 -585336 -588607 -586400 -591592 -590855
6697 -590855 -584186 -581669 -585068 -596788 -601065 -595683 -589348 -587143 -582551 -578405 -575265 -577120 -584637 -587142
6683 -587142 -584590 -580662 -576139 -578809 -571885 -576941 -588075 -588911 -583982 -577928 -583469 -585654 -579608 -576280
6669 -576280 -575520 -573740 -572533 -575117 -575646 -573255 -574800 -576387 -583310 -583986 -577541 -578366 -579949 -581737 -579351
6654 -579351 -575828 -574971 -584028 -585823 -580126 -575566 -576047 -577393 -583829 -585090 -580364 -576006 -574430 -578864 -584292
6639e84292n835O478J3230J823K612P286l706q904J77J092K995k23j506k065r47
6624e71785M546m861o723k695K243J1486K287n506l276j28O588m63m374J341P97
6609e70523N855j219L906J291r374l758K680O89K488K341K234k081J529o682m1
6594e70665k365j477j899J941K121p732q074M5N712O414J871J55l001N078j53
6579e72029j733J413m79M711Q881K529k955j309n733L64K301j176R73l716J692
6564e66266J255M389n528p376n62M976J952k521l749O44M123m876J669K29M277
6549e67364P685k21k313L962k96l56l660O734K336l454n156pj736M416J041k491
6533e60880j131p50o177q75K749L951RP461p86J588k302m621k91l449l835K464
$$ plain form
6639 -584292 -590127 -583649 -570419 -568596 -565984 -558698 -562404 -571308 -571131 -570039 -567044 -567267 -568773 -570838 -571785
6624 -571785 -567239 -572100 -578823 -581518 -579275 -567789 -565502 -571008 -574284 -574412 -567824 -568287 -572661 -571320 -570523
6609 -570523 -564668 -565887 -561981 -560690 -570064 -573822 -571142 -570453 -567965 -565624 -563390 -565471 -563942 -570624 -570665
6594 -570665 -573030 -574507 -576406 -574465 -572344 -580076 -588150 -588105 -582393 -575979 -574108 -573953 -576954 -571876 -572029
6579 -572029 -573762 -572349 -572828 -568117 -559236 -556707 -559662 -560971 -566704 -566340 -564039 -565215 -564242 -567958 -566266
6564 -566266 -565011 -560622 -566150 -573526 -574088 -569112 -567160 -569681 -573430 -572786 -568663 -573539 -571870 -571641 -567364
6549 -567364 -559679 -559900 -562213 -558251 -558547 -558903 -562563 -555829 -553493 -556947 -562103 -562110 -563846 -559430 -558389 -560880
6533 -560880 -562011 -562761 -568938 -569813 -567064 -563113 -563104 -555643 -556429 -554841 -557143 -561764 -562055 -565504 -569339 -566875
6517e66875M612P401L274m889n81N81K57L886m654j612l418j877K183L007L035
6502e55670k288j870L801L8M642K343j839o919o87L817K950j120j447K112N28
6487e51609L090k485m810O144N253r66n857k301L560O312M443J121j209o640p648
6472e53602k895j90L597K589j636p458K681N635J888O58J499J473j248L21K523
6457e44165m676n033l590J046L487k38l000J690j535L188L520m730k033L874P467
6442e44728K950l114j5208j71O360K422L061k409J085K177N074J636m150N924
6428e39091J741n19n873m878K936r84J538J89J390J20L242m675l223m435J289
6413e51233J1862P807m426m270J5l607p646q59L039o56N271k07L382M984J233
$$ plain form
6517 -566875 -562263 -554862 -551588 -556477 -557058 -556477 -556220 -552334 -556988 -558600 -562018 -563895 -561712 -558705 -555670
6502 -555670 -557958 -559828 -556027 -555989 -551347 -549004 -550843 -557762 -558449 -554632 -551682 -552802 -554249 -552137 -551609
6487 -551609 -548519 -551004 -555814 -549670 -544417 -545383 -551240 -553541 -549981 -543669 -539226 -538105 -539314 -545954 -553602
6472 -553602 -556497 -556687 -553090 -550501 -552137 -559595 -556914 -551279 -549391 -548733 -547234 -545761 -547009 -546688 -544165
6457 -544165 -548841 -553874 -557464 -556418 -552931 -553169 -556169 -554479 -556014 -552826 -549306 -554036 -556069 -552195 -544728
6442 -544728 -541778 -544892 -560100 -560271 -553911 -551489 -548428 -550837 -549752 -547575 -542501 -540865 -545015 -539091
6428 -539091 -537350 -537869 -543742 -548620 -545684 -546668 -545130 -544941 -543551 -543431 -540189 -544864 -548087 -552522 -551233
6413 -551233 -539371 -531564 -535990 -540260 -540245 -543852 -551498 -552357 -549318 -549974 -544703 -544910 -541528 -536544 -535311
6398e35311N06L204n766j687J892J25p830j120J1598j751m161J528L743l006r877
6383e47913k837J660L425M242p81J214O968R386K106m046k029m496j555j068m078
6368e39802l7L133J642R430L150n235r17N37L98p54K176N84o90o302j3466o611
6352e52764O631l216J152J386o022m627o50R456P130N960l032l523M004m856l066
6337e46037M541K005j259p757K079L412K988M275L139L223l370O59P594o64q936
6322e34108l479k15K96Q91j951K708M651M38l024m605m235M084J1132K179J50
6307e25088m023p28n015J009n91m001R311M777m195o094K437M772N56P742m2k685
6291e21858p141o265l132J872K136k013M700k8J789M211L25M112j160q53m183
$$ plain form
6398 -535311 -534805 -531601 -537367 -539054 -537162 -537037 -544867 -545987 -534389 -536140 -540301 -538773 -535030 -538036 -547913
6383 -547913 -550750 -549090 -545665 -541423 -542204 -540990 -534022 -524636 -522530 -526576 -528605 -533101 -534656 -535724 -539802
6368 -539802 -539839 -536706 -535064 -525634 -522484 -527719 -528636 -528099 -527701 -528455 -526279 -525695 -526385 -532687 -546153 -552764
6352 -552764 -546133 -549349 -548197 -546811 -552833 -557460 -558110 -548654 -541524 -535564 -538596 -542119 -538115 -542971 -546037
6337 -546037 -541496 -539491 -540750 -548507 -546428 -543016 -540028 -535753 -532614 -529391 -532761 -532102 -524508 -525172 -534108
6322 -534108 -537587 -537802 -537506 -536615 -538566 -535858 -531207 -530769 -533793 -538398 -542633 -538549 -527417 -525238 -525088
6307 -525088 -529111 -529839 -534854 -533845 -534436 -538437 -529126 -524349 -528544 -534638 -532201 -527429 -526873 -519131 -519173 -521858
6291 -521858 -528999 -535264 -538396 -536524 -534388 -536401 -531701 -531729 -529940 -525729 -525404 -521292 -522452 -523305 -527488
6276e27488l190k13M863j363m060N576N943o111J768J858m279K106M268J038l531
6261e22815J30q065j0600K405N186N312L466J508Q446l11J173K040k953M524k258
6246e12812m650l897L963N62k489k071o531K296J531l998r3J136l215P371l682
6231e26579k021m320K472L770m471O930J0461O554j127k863K197L178K250k485
6217e06054l843j396j0079l437n71O21l694K315j453J118Q02O131k345J275L457
6202e17153o199k054o75l083K916K223j958m279N673Q920l56J039j34j759k882
6187e19761n585L613Q493K229m532k877l585j414K444n75J463J1169J88j124n337
6172e15191p418N867N405K946K838o239J287J18J707k148n992r11j639K509Q875
$$ plain form
6276 -527488 -530678 -530891 -526028 -527391 -531451 -525875 -519932 -526043 -524275 -522417 -526696 -524590 -520322 -519284 -522815
6261 -522815 -522685 -530750 -541350 -538945 -533759 -528447 -524981 -523473 -515027 -515338 -514165 -512125 -515078 -510554 -512812
6246 -512812 -517462 -521359 -517396 -516834 -519323 -521394 -527925 -525629 -524098 -528096 -528189 -527053 -530268 -522897 -526579
6231 -526579 -528600 -532920 -530448 -526678 -531149 -524219 -513758 -507204 -508331 -511194 -508997 -505819 -503569 -506054
6217 -506054 -509897 -511293 -521372 -524809 -525380 -524759 -528453 -526138 -527591 -526473 -525671 -519540 -521885 -520610 -517153
6202 -517153 -523352 -525406 -526081 -529164 -526248 -524025 -525983 -530262 -524589 -515669 -516025 -514986 -515120 -516879 -519761
6187 -519761 -525346 -521733 -513240 -511011 -515543 -518420 -522005 -523419 -520975 -521550 -520087 -508918 -508730 -509854 -515191
6172 -515191 -522609 -516742 -511337 -508391 -505553 -511792 -510505 -510387 -508680 -510828 -516820 -517731 -519370 -516861 -507986
6157e07986J632q109k236O104m533q95O676o85k48l573p320M275K590l659M07
6142e17560K022p097k629L111N08M166j94q9j432o081L931R423N088r342o231
6127e22406K067P12J293M039M765K216K560K934j190M088m11q406n036n753l330
6112e21858K738j696N854N698P421K618j634M489q19k936j1492J369k27L713L671
6097e03091K905l006L38P42k426J984M835j917K253J279l941q35k394P57M240
6082d98277n182o296K54M91K865K032K841M382m844l165m597O27K959N090l614
6067e04434j053k036n862J356N294N404j309l125K000K70l819p772j025K863J3147
6052e00101J0436n176l221J356j037l246k791n596M150J349L03M131l07J453J163
$$ plain form
6157 -507986 -506354 -514463 -516699 -510595 -515128 -516023 -509347 -510032 -510280 -513853 -521173 -516898 -514308 -517967 -517560
6142 -517560 -515538 -522635 -525264 -522153 -521645 -517479 -517673 -517762 -519194 -525275 -521344 -511921 -506833 -516175 -522406
6127 -522406 -520339 -519627 -518334 -514295 -509530 -507314 -504754 -501820 -503010 -498922 -499333 -507739 -512775 -518528 -521858
6112 -521858 -519120 -520816 -514962 -509264 -501843 -499225 -500859 -496370 -497189 -500125 -511617 -510248 -510475 -506762 -503091
6097 -503091 -500186 -503192 -502854 -502112 -504538 -502554 -497719 -499636 -497383 -496104 -500045 -500880 -503274 -502517 -498277
6082 -498277 -503459 -509755 -509501 -509010 -506145 -504113 -501272 -496890 -501734 -504899 -509496 -508869 -505910 -500820 -504434
6067 -504434 -505487 -507523 -513385 -512029 -506735 -501331 -502640 -505765 -503765 -503495 -507314 -515086 -516111 -513248 -500101
6052 -500101 -489665 -494841 -498062 -496706 -497743 -500989 -503780 -509376 -505226 -503877 -503574 -499443 -499750 -498297 -497134
6037d97134k027l707k419M039K664L036L071m465K788J421K674o51j0523n169
6023e06402n538K449m677L373N656N154p80p383R82J352O44L531L524Q0K706Q102
6007d87227O530q21q707q904q018k151M004M723l429k279Q7j311M776K077K007
5992d98643J415R22K846L514l841o654o879k761N187O063N750J222m602j291L17
5977d97435q51N773M586K706m993j335K496J827j31k531q328n720k96k899L705
5962e03426K257J73J468L145r27l568m319O857R326o938p027M296O166N093J909
5947d85515r323J732M078K235p874l496R32L212M654K67K098j842P84j087j487
5932d90632j396j183k424l28K575m888M022M190l51J056N539Q038l024o372k194
$$ plain form
6037 -497134 -499161 -502868 -505287 -501248 -498584 -495548 -492477 -496942 -494154 -492733 -490059 -490710 -501233 -506402
6023 -506402 -511940 -509491 -514168 -510795 -505139 -499985 -500765 -508148 -507166 -505814 -505170 -501639 -498115 -498035 -495329 -487227
6007 -487227 -480697 -481518 -490225 -499129 -507147 -509298 -505294 -500571 -504000 -506279 -506192 -507503 -502727 -500650 -498643
5992 -498643 -497228 -496306 -493460 -489946 -493787 -500441 -507320 -510081 -504894 -498831 -493081 -491859 -496461 -497752 -497435
5977 -497435 -498286 -492513 -487927 -485221 -490214 -491549 -489053 -487226 -487357 -489888 -498216 -503936 -504232 -507131 -503426
5962 -503426 -501169 -500996 -499528 -496383 -497310 -500878 -505197 -498340 -489014 -495952 -502979 -498683 -492517 -487424 -485515
5947 -485515 -494838 -493106 -489028 -486793 -494667 -498163 -497231 -494019 -489365 -489098 -487000 -488842 -488058 -489145 -490632
5932 -490632 -492028 -493211 -495635 -495963 -493388 -498276 -494254 -490064 -490415 -489359 -483820 -475782 -478806 -485178 -487372
5917d87372l042O06k751N01L377M768J111J801J235k406n435R74M767k031n156
5902d89053m642k023P154P00j815M09l848m714R95O836K577n25N79J1716K147
5887d73507k290j0930o847P369M336J996J526m12m878l703k354l266m777k282
5873e00019K987K812Q206O837K90K763n80j670j355K229n904j554R12O545M25
5858d77076o691j614L056J200J997k56j002k885l126l740K705k005m056l072P93
5843d95772K044o53J976O465J0051Q15p607K415K939L086l129q204N338K199k91
5828d78328O161P519j944j2493n285O672l243M95M896j459k760o380j439M26l46
5813d87508j313N567M061j610k72j417k285R35N98K752P068J439j519m688r26
$$ plain form
5917 -487372 -490414 -489808 -492559 -492058 -488681 -483913 -482802 -481001 -479766 -482172 -487607 -486633 -481866 -483897 -489053
5902 -489053 -493695 -495718 -488564 -487864 -489679 -489270 -493118 -497832 -496837 -490001 -487424 -487949 -487370 -475654 -473507
5887 -473507 -475797 -486727 -493574 -486205 -481869 -479873 -478347 -478759 -483637 -487340 -489694 -492960 -497737 -500019
5873 -500019 -497032 -494220 -486014 -479177 -478887 -476124 -476704 -478374 -479729 -477500 -483404 -484958 -484046 -477501 -477076
5858 -477076 -483767 -485381 -482325 -481125 -479128 -479384 -480386 -483271 -486397 -490137 -487432 -489437 -493493 -496565 -495772
5843 -495772 -493728 -494381 -492405 -485940 -475889 -475074 -482681 -480266 -477327 -474241 -477370 -485574 -480236 -478037 -478328
5828 -478328 -472167 -464648 -466592 -479085 -484370 -477698 -480941 -480446 -475550 -477009 -479769 -486149 -487588 -487162 -487508
5813 -487508 -488821 -483254 -479193 -480803 -481075 -482492 -484777 -483842 -483244 -480492 -473424 -471985 -473504 -478192 -479118
5798d79118K921K397k686l396p67k059J0850K489q727J645k926j984j467m820
5784d87648P686R79k450N33o507J828P666K935j656j10O882O49o98m702m096l66
5768d79075m13N016J049l313M353J842J332k028j480r06r29j734m555m250R455
5753d75636P687k503m088J954J975K164l26o662l733M528J029J451l402k860J631
5738d76791M901J158n711P28J418k174j098Q368j292o175L502O70M234L831q179
5723d72610q22M281L999j207M427J994J131o58k706p18p883l285M89j679P245
5708d68002Q915R18j109n855J580l205r332K094M28j473K106R278J650p96q038
5693d70841j739q4J086K683N46n437J8J000j07j244L39l890N484O029l150j0153
$$ plain form
5798 -479118 -476197 -473800 -476486 -479882 -480649 -482708 -471858 -469369 -478096 -476451 -479377 -481361 -482828 -487648
5784 -487648 -479962 -478983 -481433 -480900 -487407 -485579 -477913 -474978 -476634 -476744 -469862 -469213 -469911 -474613 -478709 -479075
5768 -479075 -479488 -474472 -473423 -476736 -472383 -470541 -469209 -471237 -472717 -473623 -474552 -476286 -480841 -485091 -475636
5753 -475636 -467949 -470452 -474540 -472586 -470611 -468447 -468773 -475435 -479168 -474640 -473611 -472160 -475562 -478422 -476791
5738 -476791 -471890 -470732 -476443 -475715 -474297 -476471 -477569 -469201 -470493 -476668 -473166 -472496 -468262 -464431 -472610
5723 -472610 -473432 -469151 -465152 -466359 -461932 -459938 -458807 -459465 -462171 -462889 -470772 -474057 -473568 -475247 -468002
5708 -468002 -459087 -458169 -459278 -465133 -463553 -466758 -476090 -473996 -473568 -475041 -472935 -463657 -462007 -462803 -470841
5693 -470841 -472580 -472664 -471578 -468895 -468349 -473786 -473768 -472768 -472875 -474119 -473780 -477670 -472186 -466157 -469307 -479460
5677d79460M076P417k487j608n663n271N748Q884j561o667j204O845J793k389
5663d71547P266Q70j035n22L998J816L188R99r888o989o091o140M405L443O774
5648d69453P279L054o531j183J548R031L583R6r83m29j476q76q917n64O595k350
5632d61576j485j134k773l519o816l465J551L278N861k150K930M864K974L312
5618d58148M981L097q065l533K510l458o713O305L871l573l75J119k665L821N44
5603d60282m458L454j402o348K698O303K159J676L959j482J212L880r53l935j062
5588d54581J358k173J650J137o61r96m664m143k606M107Q361n71q417l055N621
5573d59633k664L526R75j963o787J27K927R711R99k492l790l415j179J3438N275
$$ plain form
5677 -479460 -475384 -467967 -470454 -472062 -477725 -482996 -477248 -468364 -469925 -476592 -477796 -470951 -469158 -471547
5663 -471547 -464281 -463411 -464446 -464968 -460970 -459154 -455966 -454967 -464855 -471844 -477935 -484075 -479670 -476227 -469453
5648 -469453 -462174 -459120 -465651 -466834 -465286 -456255 -452672 -452576 -453559 -453988 -455464 -456340 -465257 -465821 -459226 -461576
5632 -461576 -463061 -464195 -466968 -470487 -477303 -480768 -479217 -475939 -470078 -472228 -469298 -464434 -461460 -458148
5618 -458148 -453167 -450070 -458135 -461668 -459158 -462616 -469329 -463024 -459153 -462726 -463101 -461982 -464647 -460826 -460282
5603 -460282 -464740 -461286 -462688 -469036 -466338 -460035 -457876 -456200 -452241 -453723 -452511 -448631 -449584 -453519 -454581
5588 -454581 -453223 -455396 -453746 -452609 -453270 -454266 -458930 -463073 -465679 -461572 -453211 -453782 -462199 -465254 -459633
5573 -459633 -462297 -458771 -457796 -459759 -466546 -466419 -463492 -453781 -452782 -455274 -459064 -462479 -463658 -450220 -444945
5558d44945n516n550L350R40m087n110j639J33K176O642K173m165j544m13K478
5543d55077r388k204Q076N198l654K867J468k386k870j231M5M840P873m33o221
5528d53097m485O75M75l827q01o93o062k065K769j337k401q6j044K087P337K943
5512d59612m863M92p21O884N190K880k982M616K564n886l629k792J299M358N451
5497d46751K806q66q892n318O05K987k818P85M309j104Q1M921J117J699m062k917
5481d53418P81k363l53j707M174P83J738N01l60K8L344L050j099K710K360l417
5465d43248k934O18L542p125o972Q49J16j275L740P815l73j531l071n571R481
5450d45939M514O205n406o684L525m405n393O005M383k55m914n16O91o41K37K233
$$ plain form
5558 -444945 -450461 -456011 -452661 -451721 -455808 -460918 -462557 -462424 -460248 -453606 -451433 -455598 -457142 -457555 -455077
5543 -455077 -464465 -466669 -458593 -453395 -457049 -454182 -452714 -455100 -457970 -459201 -459156 -454316 -446443 -446876 -453097
5528 -453097 -457582 -456907 -456432 -460259 -461060 -461753 -467815 -469880 -467111 -468448 -470849 -470935 -471979 -469892 -462555 -459612
5512 -459612 -464475 -463983 -464704 -457820 -452630 -449750 -452732 -448116 -445552 -451438 -455067 -457859 -456560 -452202 -446751
5497 -446751 -443945 -444811 -453703 -459021 -458416 -455429 -458247 -457462 -453153 -454257 -454176 -449255 -448138 -446439 -450501 -453418
5481 -453418 -452637 -455000 -455353 -457060 -452886 -452103 -450365 -449864 -450224 -450196 -446852 -443802 -444901 -442191 -439831 -443248
5465 -443248 -446182 -445564 -442022 -449147 -456119 -455270 -455154 -456429 -452689 -444874 -445247 -446778 -449849 -455420 -445939
5450 -445939 -441425 -435220 -440626 -447310 -443785 -448190 -453583 -447578 -443195 -443450 -448364 -448880 -448189 -448830 -448593 -446360
5434d46360J787J144n244k662q93L813L703K268R39j598k610j712j471l789K80
5419d52405J935R02K166Q255j27l237j34n277k123L190M965m369M903P535m025
5404d37846j197l950m320k266l44N248R89k894m509l214N169N388l850N81L783
5389d43232J831M816j40r65j377o979k793K630l333J550R50L13m933m585P153
5374d49094Q07l631O656R092l280l588O683J59j980K628n856q692K975P205L460
5359d36456k696l814M12P012K507k510n637l778K057J727j244M39NJ353J347K086
5343d37190P775K149l023k366m363p745P700J192l329M619m359k688J813J391
5329d38424L011l190n260L067Q57m867j1149L33N667J1280r59l034J731N269p348
$$ plain form
5434 -446360 -444573 -443429 -448673 -451335 -452228 -448415 -444712 -442444 -441505 -443103 -445713 -447425 -448896 -452685 -452405
5419 -452405 -450470 -449568 -447402 -439147 -439274 -442511 -442645 -447922 -450045 -446855 -441890 -446259 -441356 -433821 -437846
5404 -437846 -439043 -442993 -447313 -449579 -449923 -444675 -443686 -446580 -451089 -454303 -449134 -443746 -447596 -447015 -443232
5389 -443232 -441401 -436585 -436725 -437690 -439067 -446046 -448839 -446209 -449542 -447992 -447042 -446729 -451662 -456247 -449094
5374 -449094 -448287 -451918 -445262 -436170 -439450 -443038 -436355 -436196 -438176 -435548 -441404 -450096 -447121 -439916 -436456
5359 -436456 -439152 -442966 -442554 -435542 -433035 -435545 -441182 -444960 -442903 -441176 -442420 -441981 -441976 -440623 -439276 -437190
5343 -437190 -429415 -427266 -430289 -432655 -437018 -444763 -437063 -435871 -439200 -434581 -438940 -441628 -439815 -438424
5329 -438424 -435413 -438603 -443863 -440796 -439939 -444806 -455955 -455622 -449955 -438675 -439634 -442668 -440937 -435668 -443016
5314d43016n212J574L355j076m91P668J193M75O387m307m951k804O956k084J34
5299d36199L101L530Kk880m333j10P481J299j548l99j0677r283p41J2460R801
5284d28496J461k28p40M223k641m267r962L766k640j775K833j504q069l114P619
5269d43534j358l661j135o0J012N212O630M489n57L76P027k012k051j560k247
5254d33429r263J81R337Q105m306q604K168j057j165N964O107m148m993P61k713
5239d37055k095l311k655K667P185P346R98m491q85m15j21Q974J0136K421m748
5224d16049m553k952m892N207J951k151k416J938r626k272M562N197j074Q03J545
5209d24782p628P1P219M351j811j608r11k239R07M385q55k242l021j146K591k481
$$ plain form
5314 -443016 -448228 -446654 -443299 -444375 -444866 -437198 -436005 -435530 -429143 -433450 -438401 -441205 -434249 -436333 -436199
5299 -436199 -433098 -429568 -429566 -432446 -436779 -436889 -429408 -428109 -429657 -430056 -440733 -450016 -450757 -438297 -428496
5284 -428496 -427035 -427263 -428003 -423780 -426421 -430688 -440650 -436884 -439524 -441299 -438466 -439970 -448039 -451153 -443534
5269 -443534 -444892 -448553 -449688 -449748 -448736 -443524 -436894 -432405 -432962 -432586 -425559 -427571 -429622 -431182 -433429
5254 -433429 -442692 -442511 -433174 -425069 -429375 -437979 -435811 -436868 -438033 -432069 -425962 -430110 -435103 -434342 -437055
5239 -437055 -439150 -442461 -445116 -442449 -435264 -427918 -426920 -431411 -432296 -432711 -432832 -423858 -413722 -411301 -416049
5224 -416049 -420602 -423554 -428446 -423239 -421288 -423439 -425855 -423917 -433543 -435815 -431253 -426056 -427130 -426327 -424782
5209 -424782 -432410 -432339 -425120 -420769 -422580 -424188 -425099 -427338 -426431 -422046 -422901 -425143 -428164 -429310 -426719 -429200
5193d29200l774P00K829L27k827j200L478L50L453J202o051o772m065k140M737
5178d38953O658J564j120m874k608O839M664L769o737J863Q449J593n241n74J452
5163d23256l468p78N460r18j159M395M205j563l766O81K23n40L386L824l184l378
5147d19836K047j488K753M931m933n870l58J930o0k798n502N085J711J290j647
5132d22745m596j337N523m177l043K301j159j08K132O627L781j418k558o972o03
5117d28352Q17K498M31k600K902q67O528J3107r779o960L599N081J296K410k997
5102d12886o034j030j286m963M347J395m065j136O219j792k65J811L713M695j571
5087d12848l612N956l31j284M142m836l293q52K053n870l398P015j88L45J150
$$ plain form
5193 -429200 -432974 -432274 -429445 -429118 -431945 -433145 -429667 -429317 -425864 -424662 -430713 -437485 -441550 -443690 -438953
5178 -438953 -432295 -430731 -431851 -436725 -439333 -432494 -427830 -424061 -430798 -428935 -420486 -418893 -424134 -424708 -423256
5163 -423256 -426724 -427502 -422042 -422960 -424119 -419724 -415519 -417082 -420848 -420167 -419944 -420484 -417098 -413274 -416458 -419836
5147 -419836 -417789 -419277 -416524 -411593 -416526 -422396 -422754 -420824 -420884 -423682 -429184 -424099 -422388 -421098 -422745
5132 -422745 -427341 -428678 -423155 -427332 -430375 -428074 -429233 -429341 -427209 -420582 -416801 -418219 -420777 -427749 -428352
5117 -428352 -427535 -425037 -424606 -427206 -424304 -425171 -418643 -405536 -415315 -422275 -418676 -413595 -412299 -409889 -412886
5102 -412886 -418920 -419950 -421236 -426199 -421852 -420457 -424522 -425658 -419439 -421231 -421496 -419685 -415972 -411277 -412848
5087 -412848 -416460 -410504 -410835 -412119 -407977 -412813 -416106 -416958 -414905 -420775 -424173 -417158 -417346 -417001 -415851
5072d15851J773k322n415K800J447K070j410o333j773Q639R65q422o308O643K806
5057d20691k103O23j36J509L734l834m545l389k304l493j53N132R385j134l284
5042d24683l325O23N646M384N395N102p339k976O005k126N51n304j030K923M651
5027d11503K841J509M846R78k818o083J174j661m164k619n834j84M407m475r86
5012d24572J611M125N764K066J987l351m367m88L764N454P05l200l983n257l723
4997d23465J050M089n28M34J397P05m559M729R533N68n162q480n208N902M365
4982d14630L106M906L157m954j601o089M531Q799L148k742J16j087r44l72R64
4967d03692J57K629K191k143N962n699m392J50j352l623l263R51k750J031P17
$$ plain form
5072 -415851 -414078 -416400 -421815 -419015 -417568 -415498 -416908 -423241 -425014 -416375 -415410 -423832 -430140 -423497 -420691
5057 -420691 -422794 -422171 -422307 -420798 -417064 -420898 -425443 -428832 -431136 -434629 -434782 -429650 -420265 -421399 -424683
5042 -424683 -428008 -427385 -421739 -417355 -411960 -406858 -414197 -417173 -411168 -413294 -412743 -418047 -419077 -416154 -411503
5027 -411503 -408662 -407153 -402307 -401329 -404147 -410230 -409056 -410717 -414881 -417500 -423334 -423518 -419111 -423586 -424572
5012 -424572 -422961 -418836 -413072 -411006 -409019 -412370 -416737 -417225 -413461 -408007 -407302 -410502 -414485 -419742 -423465
4997 -423465 -422415 -418326 -418854 -418420 -417023 -416318 -420877 -416148 -406615 -406047 -411209 -419689 -424897 -418995 -414630
4982 -414630 -411524 -406618 -403461 -408415 -410016 -416105 -411574 -402775 -399627 -402369 -402253 -403340 -404284 -404656 -403692
4967 -403692 -403535 -400906 -398715 -400858 -394896 -400595 -404987 -404837 -406189 -409812 -413075 -412124 -414874 -413843 -413126
4952d13126l616k294M443Q260K209p912r559n29Q115L933J002K590K671j354l720
4937d08887k110L821j273j249j170j730m184k873L494N652k442N222O932m765
4923d05562J148j01n046j929K788o27l658M937M921l349l362K578K092R968m45
4908c95647o566j147m312l835K574p21j06L693K303l196k920m931L317P935L188
4893d00371k030n928o48M55N757k455J699j365o174R05j459n519K096p64L469
4878d12332M319K125k544K105L553j863J038N204M325m454k324L03K16k803r85
4863d04117K415L129L921M705o174p147n88K338n202r213K766j609L933J3658
4849c97185J862m212j846J239K93L999j019n23j285J480l858j669K640j915o116
$$ plain form
4952 -413126 -416742 -419036 -414593 -406333 -404124 -412036 -421595 -422124 -414009 -410076 -409074 -406484 -403813 -405167 -408887
4937 -408887 -410997 -407176 -408449 -409698 -410868 -412598 -416782 -419655 -416161 -410509 -412951 -407729 -400797 -405562
4923 -405562 -404414 -404515 -409561 -411490 -408702 -409329 -412987 -408050 -403129 -406478 -409840 -407262 -405170 -395202 -395647
4908 -395647 -402213 -403360 -407672 -411507 -408933 -409654 -409760 -406067 -403764 -406960 -409880 -414811 -411494 -403559 -400371
4893 -400371 -402401 -408329 -408977 -408522 -402765 -405220 -403521 -404886 -411060 -410155 -411614 -417133 -415037 -415801 -412332
4878 -412332 -408013 -405888 -408432 -406327 -402774 -404637 -403599 -398395 -394070 -398524 -400848 -400545 -400329 -403132 -404117
4863 -404117 -401702 -398573 -394652 -389947 -396121 -403268 -403856 -401518 -406720 -415933 -413167 -414776 -410843 -397185
4849 -397185 -395323 -399535 -401381 -400142 -399849 -395850 -396869 -397392 -398677 -397197 -401055 -402724 -400084 -401999 -408115
4834d08115j189L090J058K204J838j90j755o221l454J225m106m628L293L014K044
4819d11892m280l74O017L791J487j073J964J463R72k249j293K81l277k986M596
4804d06853k77J454M456K399l083m906l715N78Q724l002r12O540N634m443o375
4789d03781L732Q144M193r576p281J376J193j773q44q26j859Q18N86o08L782L921
4773c98803k829P14m266M039P232M425l82O365m774j2819l096Q5N99L85p91M55
4757d03461L455M583N031m53m566j243l65m361M862L282l465r161p3M866J622
4742c99447M586K043k949l350L71j313q34K982L150O06q68o939j403j557J867
4727d03055j391k861k814K265O939P949k554r56P40M610p037l217J0956O297l291
$$ plain form
4834 -408115 -409304 -406214 -405156 -402952 -401114 -401304 -403059 -409280 -412734 -411509 -415615 -420243 -416950 -413936 -411892
4819 -411892 -416172 -416546 -410529 -406738 -405251 -406324 -404360 -402897 -401925 -404174 -405467 -405186 -408463 -411449 -406853
4804 -406853 -407130 -405676 -401220 -398821 -401904 -406810 -410525 -409947 -401223 -404225 -405137 -398597 -392963 -397406 -403781
4789 -403781 -400049 -391905 -387712 -397288 -404569 -403193 -402000 -403773 -404617 -405443 -407302 -406484 -405898 -406506 -402724 -398803
4773 -398803 -401632 -400918 -405184 -401145 -393913 -389488 -389870 -383505 -388279 -401098 -404194 -404109 -403510 -403125 -403916 -403461
4757 -403461 -400006 -395423 -390392 -390845 -395411 -396654 -397019 -401380 -396518 -393236 -396701 -405862 -405935 -401069 -399447
4742 -399447 -394861 -392818 -395767 -399117 -398746 -400059 -400893 -397911 -394761 -394155 -395023 -401962 -403365 -404922 -403055
4727 -403055 -404446 -407307 -410121 -407856 -400917 -392968 -395522 -396478 -395738 -391128 -398165 -401382 -390426 -384129 -387420
4712c87420m113O05q54J442l802L989L71R70m646k891j382o72N362m40j542J932
4696c93091K084q24Q325L074m006K27k32k55L221l653p521m663m195J422L95N391
4680c94301Q00l05J492J639j047K810j067n809n662L255n477k884K974p39o14
4665d04935K652N109R90N83N21k123M577J933l005k465M642o38n716J494J413
4650c94968N24M887p68p190o277M255J6715K586o325K127K327P31K870j164l519
4635c83189n763L85k454r825J33J886P753M717O26o554J588L295o366k016L375
4620c92409l593P452P987l482m082K06J524j055k689r1K812P43L117n144l286
4605c91990O947k564m700j686L494K928M223J497N11o150K015l862j186N636O942
$$ plain form
4712 -387420 -391533 -390928 -391782 -390340 -394142 -390153 -389782 -388812 -393458 -396349 -397731 -398403 -393041 -393481 -395023 -393091
4696 -393091 -391007 -391831 -383506 -380432 -384438 -384211 -384443 -384698 -381477 -385130 -392651 -397314 -401509 -400087 -399692 -394301
4680 -394301 -393501 -393806 -392314 -390675 -391722 -388912 -389979 -395788 -401450 -398195 -403672 -406556 -403582 -404321 -404935
4665 -404935 -402283 -397174 -396184 -395601 -395080 -397203 -392626 -390693 -393698 -396163 -391521 -392159 -397875 -396381 -394968
4650 -394968 -394444 -389557 -390325 -397515 -403792 -399537 -382822 -380236 -386561 -384434 -382107 -381376 -378506 -379670 -383189
4635 -383189 -388952 -388567 -391021 -400846 -400713 -398827 -391074 -386357 -385731 -392285 -390697 -387402 -393768 -395784 -392409
4620 -392409 -396002 -388550 -380563 -384045 -388127 -387921 -386397 -387452 -390141 -390232 -387420 -386677 -383560 -388704 -391990
4605 -391990 -385043 -387607 -392307 -393993 -390499 -387571 -383348 -381851 -381340 -387490 -385475 -389337 -390523 -384887 -377945
4590c77945j672m318j522l513o604l627L530J994L11M73K789P282l076l512j969
4575c91379P69J977K133O01k747j568j235m761M668J904L044j440m281P326O489
4560c78500n360J18J449J796m998o994L390N452M6j62m366J515M664L817Q835
4545c69298J327j078p251j849r440l713m237l428R18J14K094j719M44L75N253
4530c91488O279L962J238K924K24l942p23l010m89r74J322J801m624m27j553j94
4514c89674P502K159k880l094O533J813n258o370K473J281Q64m034l574j751P04
4499c93306N045L394Q529L228q18l528N590n034o530M022l94r59r25l19n312m83
$$ plain form
4590 -377945 -379617 -383935 -385457 -388970 -395574 -399201 -395671 -393677 -393366 -392893 -390104 -382822 -385898 -389410 -391379
4575 -391379 -390610 -388633 -386500 -385899 -388646 -390214 -391449 -396210 -391542 -389638 -386594 -388034 -392315 -384989 -378500
4560 -378500 -383860 -383742 -382293 -380497 -385495 -392489 -389099 -383647 -383601 -383763 -388129 -386614 -381950 -378133 -369298
4545 -369298 -367971 -369049 -376300 -378149 -387589 -391302 -395539 -398967 -398049 -397935 -395841 -397560 -397116 -396741 -391488
4530 -391488 -385209 -381247 -380009 -377085 -376861 -380803 -381526 -384536 -385025 -385999 -384677 -382876 -387500 -387927 -389480 -389674
4514 -389674 -382172 -380013 -382893 -385987 -379454 -377641 -382899 -389269 -386796 -385515 -384651 -388685 -392259 -394010 -393306
4499 -393306 -388261 -384867 -376338 -373110 -373928 -377456 -371866 -376900 -383430 -379408 -379802 -380761 -381686 -382005 -387317 -387800
$$ [...]
##END NTUPLES=NMR SPECTRUM
##END=
