##TITLE=Analysis number 329826
Compound Code cc 31603
Project Code adrs
Chemist Name fudan
##JCAMPDX= 6.0         $$ Bruker NMR JCAMP-DX V2.0
##DATA TYPE= NMR SPECTRUM
##DATA CLASS= NTUPLES
##ORIGIN= Bruker BioSpin GmbH
##OWNER= nmr
$$ XWIN-NMR		Version 3.5
$$ Wed Oct  3 09:53:18 2007 GMT Daylight Time (UT+1h)  MAYBRIDGE\nmr@NMR_250MHZ
##.OBSERVE FREQUENCY= 250.131544655141
##.OBSERVE NUCLEUS= ^1H
##.ACQUISITION MODE= SIMULTANEOUS (DQD)
##.ACQUISITION SCHEME= undefined
##.AVERAGES= 16
##.DIGITISER RES= 18
##SPECTROMETER/DATA SYSTEM= dpx250
##.PULSE SEQUENCE= zg30
##.SOLVENT NAME= CDCl3
##.SHIFT REFERENCE= (INTERNAL, CDCl3, 0, 16.522)
##AUDIT TRAIL= $$ (NUMBER, WHEN, WHO, WHERE, WHAT)
$$ ##TITLE= Audit trail, XWIN-NMR		Version 3.5
$$ ##JCAMPDX= 5.01
$$ ##ORIGIN= Bruker BioSpin GmbH
$$ ##OWNER= nmr
$$ C:\u/data/dgb/nmr/ADRS/150/pdata/1/auditp.txt
$$ ##AUDIT TRAIL=  $$ (NUMBER, WHEN, WHO, WHERE, WHAT)
(   1,<2007-10-03 09:52:56.43 +100>,<MAYBRIDGE\nmr>,<NMR_250MHZ>,
      <created by zg, POWCHK disabled, PULCHK disabled
       configuration hash MD5:
       76 6E 9A 78 1E 09 19 81 EC 84 63 8F B0 6A 59 2D
       data hash MD5: 64K
       D9 06 9A 1D 15 09 69 EB 1F 76 D1 FF 0F B2 6D 59>)
(   2,<2007-10-03 09:53:09.54 +100>,<MAYBRIDGE\nmr>,<NMR_250MHZ>,
      <Start of raw data processing
       ef LB = 0.3 FT_mod = 6 PKNL = 1 SI = 32K 
       data hash MD5: 32K
       6F 41 F0 00 B2 12 AC 4C 81 C8 9C AC A3 45 FC 84>)
(   3,<2007-10-03 09:53:11.21 +100>,<MAYBRIDGE\nmr>,<NMR_250MHZ>,
      <apk 
       data hash MD5: 32K
       87 5A BF 43 D5 A6 43 F5 99 A8 E0 EA 22 53 60 9F>)
(   4,<2007-10-03 09:53:11.93 +100>,<MAYBRIDGE\nmr>,<NMR_250MHZ>,
      <abs ABSG = 5 
       data hash MD5: 32K
       4F 59 67 7A 62 31 43 69 8D 6F AF 21 96 F3 2F 26>)
$$ ##END=
$$ 
$$ hash MD5
$$ B0 6F 5D DA 76 5B EB 2F D8 31 B6 E0 89 2C 58 61
##$RELAX= 
##$RELAX= 
##$RELAX= 
##$RELAX= 
##$RELAX= 
##$RELAX= 
##$RELAX= 
$$ Bruker specific parameters
$$ --------------------------
##$DU= <C:\u>
##$EXPNO= 150
##$NAME= <ADRS>
##$PROCNO= 1
##$TYPE= <nmr>
##$USER= <dgb>
##$AMP= (0..31)
100 100 100 100 100 100 100 100 100 100 100 100 100 100 100 100 100 100 
100 100 100 100 100 100 100 100 100 100 100 100 100 100 
##$AQSEQ= 0
##$AQ_mod= 3
##$AUNM= <au_zg>
##$AUTOPOS= <5 >
##$BF1= 250.13
##$BF2= 250.13
##$BF3= 250.13
##$BF4= 250.13
##$BF5= 500.13
##$BF6= 500.13
##$BF7= 500.13
##$BF8= 500.13
##$BYTORDA= 1
##$CFDGTYP= 0
##$CFRGTYP= 5
##$CHEMSTR= <none>
##$CNST= (0..31)
1 1 145 1 1 1 1 1 1 1 1 1 1 1 1 1 1 1 1 1 1 1 1 1 1 1 1 1 1 1 1 1 
##$CPDPRG= <>
##$CPDPRG1= <>
##$CPDPRG2= <>
##$CPDPRG3= <>
##$CPDPRG4= <mlev>
##$CPDPRG5= <mlev>
##$CPDPRG6= <mlev>
##$CPDPRG7= <mlev>
##$CPDPRG8= <mlev>
##$CPDPRGB= <>
##$CPDPRGT= <>
##$D= (0..31)
0 1 0 0 0 0 0 0 0 0.06 0 0 0 0 0 0 0.0002 0 0 0 0 0 0 0 0 0 0 0 0 0 0 
0 
##$DATE= 1191401575
##$DBL= (0..7)
120 120 120 120 120 120 120 120 
##$DBP= (0..7)
150 150 150 150 150 150 150 150 
##$DBP07= 0
##$DBPNAM0= <>
##$DBPNAM1= <>
##$DBPNAM2= <>
##$DBPNAM3= <>
$$ [...]
##$SUBNAM7= <"">
##$SUBNAM8= <"">
##$SUBNAM9= <"">
##$SW= 20.6930455092707
##$SWIBOX= (0..15)
0 0 3 0 0 0 0 0 0 0 0 0 0 0 0 0 
##$SW_h= 5175.983436853
##$TD= 65536
##$TD0= 1
##$TE= 296.16
##$TE2= 300
##$TE3= 300
##$TEG= 300
##$TL= (0..7)
0 120 120 120 120 120 120 120 
##$TP= (0..7)
150 150 150 150 150 150 150 150 
##$TP07= 0
##$TPNAME0= <>
##$TPNAME1= <>
##$TPNAME2= <>
##$TPNAME3= <>
##$TPNAME4= <>
##$TPNAME5= <>
##$TPNAME6= <>
##$TPNAME7= <>
##$TPOAL= (0..7)
0.5 0.5 0.5 0.5 0.5 0.5 0.5 0.5 
##$TPOFFS= (0..7)
0 0 0 0 0 0 0 0 
##$TUNHIN= 0
##$TUNHOUT= 0
##$TUNXOUT= 0
##$USERA1= <user>
##$USERA2= <user>
##$USERA3= <user>
##$USERA4= <user>
##$USERA5= <user>
##$V9= 5
##$VALIST= <valist>
##$VCLIST= <CCCCCCCCCCCCCCC>
##$VD= 0
##$VDLIST= <DDDDDDDDDDDDDDD>
##$VPLIST= <PPPPPPPPPPPPPPP>
##$VTLIST= <TTTTTTTTTTTTTTT>
##$WBST= 1024
##$WBSW= 4
##$XGAIN= (0..3)
0 0 0 0 
##$XL= 0
##$YL= 0
##$YMAX_a= 253969
##$YMIN_a= -334096
##$ZGOPTNS= <>
##$ZL1= 120
##$ZL2= 120
##$ZL3= 120
##$ZL4= 120
##$ABSF1= 16.522
##$ABSF2= -4.171173
##$ABSG= 5
##$ABSL= 3
##$ALPHA= 0
##$AQORDER= 0
##$ASSFAC= 0
##$ASSFACI= 0
##$ASSFACX= 0
##$ASSWID= 0
##$AUNMP= <proc_1d>
##$AZFE= 0.1
##$AZFW= 0.1
##$BCFW= 0
##$BC_mod= 0
##$BYTORDP= 0
##$COROFFS= 0
##$CY= 12.5
##$DATMOD= 1
##$DC= 0
##$DFILT= <>
##$DTYPP= 0
##$F1P= 14.0000005364418
##$F2P= -0.99999901652339
##$FCOR= 0.5
##$FTSIZE= 32768
##$FT_mod= 6
##$GAMMA= 0
##$GB= 0
##$INTBC= 1
##$INTSCL= 1
##$ISEN= 128
##$LB= 0.3
##$LEV0= 0
##$LPBIN= 0
##$MAXI= 10000
##$MC2= 0
##$MEAN= 0
##$ME_mod= 0
##$MI= 0
##$NCOEF= 0
##$NC_proc= -3
##$NLEV= 6
##$NOISF1= 0
##$NOISF2= 0
##$NSP= 0
##$NTH_PI= 0
##$NZP= 0
##$OFFSET= 16.522
##$PC= 1
##$PHC0= 167.5158
##$PHC1= -10.05699
##$PH_mod= 1
##$PKNL= yes
##$PPARMOD= 0
##$PSCAL= 4
##$PSIGN= 0
##$REVERSE= no
##$SF= 250.13
##$SI= 32768
##$SIGF1= 0
##$SIGF2= 0
##$SINO= 400
##$SIOLD= 32768
##$SREGLST= <1H.CDCl3>
##$SSB= 0
##$STSI= 32768
##$STSR= 0
##$SW_p= 5175.98343685301
##$SYMM= 0
##$S_DEV= 0
##$TDeff= 65536
##$TDoff= 0
##$TI= <Analysis number 999999
Compound Code 99
Book Reference 9
Project Code 9>
##$TILT= no
##$TM1= 0
##$TM2= 0
##$TOPLEV= 0
##$USERP1= <user>
##$USERP2= <user>
##$USERP3= <user>
##$USERP4= <user>
##$USERP5= <user>
##$WDW= 1
##$XDIM= 32768
##$YMAX_p= 271157031
##$YMIN_p= -522601
$$ End of Bruker specific parameters
$$ ---------------------------------
##NTUPLES= NMR SPECTRUM
##VAR_NAME=  FREQUENCY,     SPECTRUM/REAL,   SPECTRUM/IMAG
##SYMBOL=    X,             R,               I
##VAR_TYPE=  INDEPENDENT,   DEPENDENT,       DEPENDENT
##VAR_FORM=  AFFN,          ASDF,            ASDF
##VAR_DIM=   32768,         32768,           32768
##UNITS=     HZ,            ARBITRARY UNITS, ARBITRARY UNITS
##FACTOR=    0.157963299565203, 1,           1
##FIRST=     4132.6476996994, 0,             0
##LAST=      -1043.33573715361, 0,           0
##MIN=       -1043.33573715361, -522601,     0
##MAX=       4132.6476996994, 271157031,     0
$$ Real data points
##PAGE= N=1
##DATA TABLE= (X++(R..R)), XYDATA
$$ [...]
$$ plain form
16826 -46012 8365 34426 12340 -24856 -40329 -100300 -89350 -53804 -15056 -53340 -68791 -81423
16814 -81423 -42664 -12822 -43429 -19609 38733 45532 65495 15195 -8053 -58130 -60352 -22013
16802 -22013 -18212 -3397 18202 -26643 -121251 -131286 -134788 -135777 -112443 -71508 -43804 -67776
16790 -67776 -31787 -48709 -87014 -76885 -36711 -62598 -94678 -165433 -145511 -88900 -70839 -118672
16778 -118672 -87370 -54852 -96088 -65082 57628 69836 62144 -12460 -93772 -125103 -78957
16767 -78957 -46285 -12241 33353 10275 9481 -3682 -38431 -125218 -167981 -102242 -34649 -29294
16755 -29294 -38863 -58558 -87901 -83964 -39161 -14832 -31802 -40371 -69318 -47038 -67536 -88800
16743 -88800 -104084 -57856 3241 1206 -52306 -36119 -13537 7157 -9580 -12691 -26952 -65528
$$ packed form
16826d6012N4377K6061k2086l7196j5473n9971J0950L5546L8748l8284j5451j2632
16814h1423L8759K9842l0607K3820N8342O799J9963n0300k3248n0077k222L8339
16802b2013L801J4815K1599m4845r4608j0035l502r89K3334M0935K7704k3972
16790f7776L5989j6922l8305J0129M0174k5887l2080p0755J9922N6611J8061m7833
16778a18672L1302L2518m1236L1006J22710J2208p692p4604q1312l1331M6146
16767g8957L2672L4044M5594k3078p94j3163l4749q6787m2763O5739O7593N355
16755b9294r569j9695k9343L937M4803K4329j6970q569k8947K2280k0498k1264
16743h8800j5284M6228O1097k035n3512J6187K2582K0694j6737l111j4261l8576
$$ plain form
16731 -65528 -13810 22331 37209 67025 69542 -9764 -83296 -73061 -40517 -55844 5248 -53125
16719 -53125 -134475 -67955 -23693 -4890 -10837 -17719 -52522 -71110 -109613 38182 66012 7506
16707 7506 -4461 25670 -22360 -97244 -124490 -122318 -81097 -115944 -124508 -145230 -171406 -106527
16695 -106527 -96261 -45155 -4137 -26051 -5407 -62720 -113451 -115476 -42328 33248 22428 9627
16683 9627 -31649 -104797 -105073 -84922 -60597 -91410 -146968 -173355 -134126 -40216 -20382 -5820
16671 -5820 -41648 -95084 -112285 -44608 13163 -29559 -52335 -168045 -161375 -105868 -73453 -57605
16659 -57605 -83876 -63123 -37924 -38595 -72904 -86264 -85585 -80800 -82720 -30709 15376 -76699 -157235
16646 -157235 -175488 -151435 -76249 -42707 -40098 -50772 -85821 -22834 59328 86598 21407 -84881
$$ packed form
16731f5528N1718L6141J4878K9816K517p9306p3532J0235L2544j5327O1092n8373
16719e3125q1350O6520M4262J8803n947o882l4803j8588l8503J47795K7830n8506
16707G506j1967L0131m8030p4884k7246K172M1221l4847q564k0722k6176O4879
16695a06527J0266N1106M1018k1914K0644n7313n0731k025P3148P5576j0820j2801
16683I627m1276p3148k76K0151K4325l0813n5558k6387L9229R3910J9834J4562
16671e820l5828n3436j7201O7677N7771m2722k2776j15710O670N5507L2415J5848
16659e7605k6271K0753K5199o71l4309j3360O79M785j920N2011M6085r2075q0536
16646a57235j8253K4053P5186L3542K609j0674l5049O2987Q2162K7270o5191j06288
$$ plain form
16634 -84881 -123458 -90984 -82306 -140690 -133748 -93305 -16269 -1073 -19085 -55697 -53865 -67269
16622 -67269 -61035 -115968 -112921 -127508 -158782 -172740 -95509 -43660 -103278 -116631 -54748 5106
16610 5106 22417 -16165 -6956 9345 32421 -12571 -84649 -84061 -26298 -20501 13514 44146 22584
16597 22584 392 9277 9793 25348 7666 -62986 -85066 -145601 -78886 -51055 -151302 -228587
16585 -228587 -153036 -89980 -108852 -105258 -105757 -165507 -170803 -97003 -62431 -94459 -122528 -193635
16573 -193635 -122210 -70198 -103750 -121394 -63398 -75384 -152934 -200882 -139037 -98324 -53094
16562 -53094 -3825 30494 44626 23135 -39313 -13110 -11075 26469 -10167 -57744 -50129 -32675
16550 -32675 -10750 21386 -6221 -113180 -134216 -24164 -1566 -13042 -14960 8222 6994 49477
$$ packed form
16634h4881l8577L2474Q678n8384O942M0443P7036J5196j8012l6612J832j3404
16622f7269O234n4933L047j4587l1274j3958P7231N1849n9618j3353O1883N9854
16610E106J7311l8582R209J6301K3076m4992p2078N88N7763N797L4015L0632k1562
16597B2584k2192Q885N16J5555j7682p0652k2080o0535O6715K7831j00247p7285
16585b28587P5551O3056j8872L594m99n9750n296P3800L4572l2028k8069p1107
16573a93635P1425N2012l3552j7644N7996j1986p7550m7948O1845M0713M5230
16562e3094M9269L4319J4132k1491o2448K6203K035L7544l6636m7577P615J7454
16550c2675K1925L2136k7607j06959k1036J10052K2598j1476j918K3182j228M2483
$$ plain form
16538 49477 11838 -45271 -74154 -72804 -11098 14190 -43362 -57438 -50327 -49266 -73380 -78117
16526 -78117 -89099 -42102 18733 19930 -68811 -66486 37068 -15963 -48635 -86903 -152574 -134169
16514 -134169 -45623 -21645 -63679 -83072 -78038 16279 28849 38373 -260 -15615 -60032 -22911
16502 -22911 4259 19753 -872 -56419 -100453 -95291 -66684 5950 45346 54077 77210 124670
16490 124670 70237 -28450 -135482 -102676 -127211 -93263 9019 43395 49121 84008 89924
16479 89924 82322 28691 34257 1316 -9152 15473 23125 14763 -18448 9813 -4017 10088
16467 10088 1625 -25837 -15978 -93129 -174035 -77536 -46106 -28388 35268 60306 28200 83
16455 83 -7654 -62474 -108666 -91518 -37635 12614 30232 39978 63800 58242 -56791 -88169 -89742
$$ packed form
16538D9477l7639n7109k8883J350O1706K5288n7552j4076P111J061k4114m737
16526g8117j0982M6997O0835J197q8741K325J03554n3031l2672l8268o5671J8405
16514a34169Q8546K3978m2034j9393N034R4317J2570R524l8633j5355m4417L7121
16502b2911K7170J5494k0625n5547m4034N162K8607P2634L9396Q731K3133M7460
16490A24670n4433r8687j07032L2806k4535L3948J02282L4376N726L4887N916
16479H9924p602n3631N566l2941j0468K4625P652q362l3211K8261j3830J4105
16467A0088q463k7462R859p7151q0906R6499L1430J7718O3656K5038l2106k8117
16455H3p737n4820m6192J7148N3883N0249J7618R746K3822n558j15033l1378j573
$$ plain form
16442 -89742 -114519 -107712 -136024 -142505 -124742 -127227 -141566 -159740 -137053 -90456 -67044 -61071
16430 -61071 -117541 -176442 -162958 -107609 -70222 -83678 -32480 -35934 16135 16692 -12122 -66298
16418 -66298 -63087 -22963 -68635 -25006 27231 34887 105477 127719 154838 136374 127468 89027
16406 89027 24309 -51213 -81983 -47167 -93474 -164574 -123184 -102142 -120922 -68762 -53379 -53672
16394 -53672 -59674 -38579 -30154 13486 -99913 -147071 -80734 -11267 16762 -6226 29052 124546
16382 124546 57099 -33774 -67291 -10156 32413 38651 -30540 -111753 -122740 -118596 14362 82413
16370 82413 96436 3972 -48351 -5549 -24030 -70921 -33757 -11110 -6682 17592 -32247 -36285
16358 -36285 -91564 -70067 -10610 -4308 53516 27282 -24777 -42610 -58644 -53607 -50327 -11203
$$ packed form
16442h9742k4777O807k8312o481J7763k485j4339j8174K2687M6597K3412N973
16430f1071n6470n8901J3484N5349L7387j3456N1198l454N2069N57k8814n4176
16418f6298L211M0124m5672M3629N2237P656P0590K2242K7119j8464q906l8441
16406H9027o4718p5522l0770L4816m6307p1100M1390K1042j8780N2160J5383k93
16394e3672o002K1095Q425M3640j13399m7158O6337O9467K8029k2988L5278R5494
16382A24546o7447r0873l3517N7135M2569O238o9191q1213j0987M144J32958O8051
16370H2413J4023r2464n2323M2802j8481m6891L7164K2647M428K4274m9839m038
16358c6285n5279K1497N9457O302N7824k6234n2059j7833j6034N037L280L9124
$$ plain form
16346 -11203 34745 -14577 -93046 -88679 -86477 -125065 -127377 -105169 -56717 -33641 7599 -20301
16334 -20301 -26036 -12930 -52481 -146880 -152655 -110534 -9166 1580 -80931 -125848 -55462 -7261
16322 -7261 -33644 -23773 10270 -31519 -70470 -50828 -60848 13380 43061 36162 30344 5000
16310 5000 45844 38325 24411 17505 33813 37567 14808 -31593 -12816 59710 95501 25771
16298 25771 -24821 -46013 12207 36831 8499 32304 -30933 -117501 -61044 -21430 14078 24804
16286 24804 889 -22654 -2898 79424 24780 -70531 -124643 -180411 -152865 -140840 -125488 -112992
16274 -112992 -83771 -81996 -86357 -88248 -98321 -143923 -127046 -58906 -26622 -87062 -76422 -29395
16262 -29395 -64489 -85686 -70133 -52982 -33285 -14704 -23941 -27908 -74078 -91772 -31094 9513
$$ packed form
16346a1203M5948m9322p8469M367K202l8588k312K2208M8452K3076M1240k7900
16334b0301n735J3106l9551r4399n775M2121J01368J0746q2511m4917P0386M8201
16322g261k6383R871L4043m1789l8951J9642j0020P4228K9681o899n818k5344
16310E000M0844p519j3914o906J6308L754k2759m6401J8777P2526L5791o9730
16298B5771n0592k1192N8220K4624k8332K3805o3237q6568N6457L9614L5508J0726
16286B4804k3915k3543J9756Q2322n4644r5311n4112n5768K7546J2025J5352J2496
16274a12992K9221J775m361j891j0073m5602J6877O8140L2284o0440J0640M7027
16262b9395l5094k1197J5553J7151J9697J8581r237l967m6170j7694O0678M0607
$$ plain form
16250 9513 -40172 19525 104106 52088 1764 -8908 -54619 -41086 -39030 -99571 -103270 -90737
16238 -90737 -40133 31811 68462 82837 -215 -34853 -9932 -36875 -43922 -1911 26363 -8467
16226 -8467 -53346 -81107 -113894 -70510 -44301 -22985 -105002 -195382 -140472 -36822 -39593 -90793
16214 -90793 -120534 -126266 -164595 -180874 -128033 -106892 -43204 23981 52610 79176 47743 49882
16202 49882 70810 125105 88186 -76876 -184870 -128035 -44855 2111 19175 -21606 -44125
16191 -44125 -41279 -12987 52067 78107 79386 32621 -23127 -30630 -55321 -42022 251 18647
16179 18647 -36338 -94926 -77970 -41405 -33057 -14030 21381 5590 -30736 -15473 -20764 -24293
16167 -24293 -16668 -36970 -101767 -145372 -186551 -58290 3103 -75223 -136136 -114570 -103626 -53542
$$ packed form
16250I513m9685N9697Q4581n2018n0324j0672m5711J3533K056o0541l699J2533
16238i0737N0604P1944L6651J4375q3052l4638K4921k6943p047M2011K8274l4830
16226h467m4879k7761l2787M3384K6209K1316q2017r0380N4910J03650k771n1200
16214i0793k9741n732l8329j6279N2841K1141O3688O7185K8629K6566l1433K139
16202D9882K0928N4295l6919j65062j07994N6835Q3180M6966J7064m0781k2519
16191d4125K846K8292O5054K6040J279m6765n5748p503k4691J3299M2273J8396
16179A8647n4985n8588J6956L6565Q348J9027L5411j5791l6326J5263n291l529
16167b4293P625k0302o4797m3605m1179J28261O1393p8326o0913K1566J0944N0084
$$ plain form
16155 -53542 -24207 5678 42093 41645 24818 -7674 -48794 -41517 -74711 -52436 -5222 -24502
16143 -24502 1628 45476 102894 98167 71930 23354 -10616 -43700 -85048 -84317 -39709 -56994
16131 -56994 -86208 -95663 -132216 -145674 -130137 -74529 -63759 -33147 48543 -5223 -109343 -139746
16119 -139746 -181690 -156544 -112654 -56544 -16735 -43773 -67574 -71825 -17807 -21387 -7540 10035
16107 10035 20952 21362 5177 18761 27780 -3029 -15936 -28888 -64703 -13284 -15789 -21489 5231
16094 5231 16710 -20645 -85547 -91256 -39911 43816 62890 19582 21040 -3724 25519 -7363
16082 -7363 -44218 -18159 -92531 -93522 -68345 -48612 -31135 -33489 -1819 -12579 38261 83013
16070 83013 38538 41077 21702 -24725 -50911 -36785 -725 -18220 -35710 -35074 -57125 -78346
$$ packed form
16155e3542K9335K9885L6415m48j6827l2492m1120P277l3194K2275M7214j9280
16143b4502K6130M3848N7418m727k6237m8576l3970l3084m1348P31M4608j7285
16131e6994k9214r455l6553j3458J5537N5608J0770L0612Q1690n3766j04120l0403
16119a39746m1944K5146M3890N6110L9809k7038k3801m251N4018l580J3847J7575
16107A0035J0917M10j6185J3584R019l0809j2907j2952l5815N1419k505n700K6720
16094E231J1479l7355o4902n709N1345Q3727J9074m3308J458k4764K9243l2882
16082g363l6855K6059p4372r91K5177J9733J7477k354L1670j0760N0840M4752
16070H3013m4475K539j9375m6427k6186J4126L6060j7495j7490O36k2051k1221
$$ plain form
16058 -78346 -69518 -26725 33043 -27457 24068 77908 -9126 -26513 -56568 -50678 -23479 -51677
16046 -51677 -111876 -75417 -14393 29987 37081 12888 9483 -13096 -68147 -59669 -26358 -49046
16034 -49046 -64784 -40719 52883 28732 22054 3126 -14160 17625 22208 60018 88885 50809
16022 50809 -24528 -48042 -14734 65113 110186 79961 127396 117766 95400 126451 160241 156107
16010 156107 113505 88222 35610 18404 -46678 -71556 -59363 -71073 -18718 14253 -11473
15999 -11473 -29486 -20705 1508 10732 -49959 -114219 -107073 -58981 -36696 -34962 -11663 17988
15987 17988 64195 87032 67385 16215 -11791 28651 84666 52913 -20977 -88028 -172308 -168014
15975 -168014 -117222 -22890 12196 -15986 46695 57257 53976 18286 -49389 -43570 -68408 -36822
$$ packed form
16058g8346Q828M2793N9768o0500N1525N3840q7034j7387l0055N890K7199k8198
16046e1677o0199L6459O1024M4380P094k4193l405k2579n5051Q478L3311k2688
16034d9046j5738K4065R3602k4151o678j8928j7286L1785M583L7810K8867l8076
16022E0809p5337k3514L3308P9847M5073l0225M7435r630k2366L1051L3790m134
16010A56107m2602k5283n2612j7206o5082k4878J2193j1710N2355L2971k5726
15999a1473j8013Q781K2213R224o0691o4260P146M8092K2285J734K3299K9651
15987A7988M6207K2837j9647n1170k8006M0442N6015l1753p3890o7051q4280M294
15975a68014N0792R4332L5086k8182O2681J0562l281l5690o7675N819k4838L1586
$$ plain form
15963 -36822 -15231 1450 6630 13083 -8314 -65895 -108649 -104684 -50241 -11661 -13889 33123
15951 33123 40826 12473 -19060 -105592 -141647 -112078 -50790 -15845 70723 128435 75451 13386
15939 13386 -3119 -32850 -72787 -46443 -17555 -15824 37860 55022 40354 50857 70970 49381
15927 49381 -9545 -39807 -31456 -46622 -14474 55195 73981 90780 12004 -80426 -71750 -63030
15915 -63030 -78908 -47910 -26233 -111674 -125547 -58119 -92395 -124170 -150984 -148664 -92359 -85741
15903 -85741 -158050 -169099 -90340 -103176 -85914 -34938 -19849 -43770 -73169 -117957 -145488 -153276
15891 -153276 -119576 -159833 -94614 -51973 -30531 -34089 -6518 -69914 -115378 -153154 -135829 -96045
15879 -96045 -17500 -53375 -163786 -179346 -132977 -121117 -126998 -73686 20560 50355 11044 32594
$$ packed form
15963c6822K1591J6681N180O453k1397n7581m2754L965N4443L8580k228M7012
15951C3123P703k8353l1533q6532l6055K9569O1288L4945Q6568N7712n2984o2065
15939A3386j6505k9731l9937K6344K8888J731N3684J7162j4668J0503K0113k1589
15927D9381n8926l0262Q351j5166L2148O9669J8786J6799p8776r2430Q676Q720
15915f3030j5878L0998K1677q5441j3873O7428l4276l1775k6814K320N6305O618
15903h5741p2309j1049P8759j2836J7262N0976J5089k3921k9399m4788k7531p788
15891a53276L3700m0257O5219M2641K1442l558K7571o3396m5464l7776J7325L9784
15879i6045P8545l5875j10411j5560M6369J1860n881N3312R4246K9795l9311K1550
$$ plain form
15867 32594 29761 13731 14105 55971 6096 -52031 -30307 -3282 -27529 15493 14461 27676
15855 27676 5693 -52878 -18303 -7879 -22932 -57832 -85150 -67240 -48181 -33252 -75967 -56225
15843 -56225 1736 -25568 -28651 -27459 464 1595 2276 -14557 -8722 -37525 -61231 -127787 -112079
15830 -112079 -90031 -78066 -47519 -79321 -78714 -23928 17852 -42419 -82229 -129100 -142475 -123455
15818 -123455 -62142 -85797 -125504 -112171 -74492 -43166 -67294 -126587 -143265 -138156 -138288 -79398
15806 -79398 -39990 -47002 -115733 -94318 7563 -1909 -3860 -25798 -58637 -49107 -104823 -90922
15794 -90922 -46141 -46477 -14611 54241 48490 32721 -26224 -131763 -93804 -51686 -84230 -20943
15782 -20943 52176 89173 91681 61262 67913 19799 -590 -8784 -68707 -25041 20198 -10090
$$ packed form
15867C2594k833j6030L74M1866m9875n8127K1724K7025k4247M3022j032J3215
15855B7676k1983n8571L4575J0424j5053l4900k7318J7910J9059J4929m2715J9742
15843e6225N7961k7304l083J192K7923J131O81j6833N835k8803k3706o6556J5708
15830a12079K2048J1965L0547l1802O07N4786M1780o0271l9810m6871j3375J9020
15818a23455O1313k3655l9707J3333L7679L1326k4128n9293j6678N109j32N8890
15806g9398L9408p012o8731K1415J01881r472j951k1938l2839R530n5716J3901
15794i0922M4781l36L1866O8852n751j5769n8945j05539L7959M2118l2544O3287
15782b0943P3119L6997K508l0419O651m8114k0389q194n9923M3666M5239l0288
$$ plain form
15770 -10090 -17820 -32283 -66756 -50351 -24122 -40639 8113 33934 -49460 -106501 -143149 -86355
15758 -86355 -51841 -77894 -91465 -56253 -19454 -11493 -5688 -20667 -42710 -58956 -49633 1683
15746 1683 20815 7243 -2706 47029 53681 49728 -11902 29074 47464 20350 10936 15931 35327
15733 35327 -18946 -7897 -56913 -90124 -86880 -22297 -42297 -54173 -62076 -100879 -155929 -147306
15721 -147306 -195414 -206112 -145833 -72708 6603 -3097 16525 26217 -24311 -96598 -69241 -83167
15709 -83167 -147515 -125417 -101788 -60085 10112 12786 -6261 -52582 -142602 -143219 -119917 -133261
15697 -133261 -53007 -2626 46286 4814 -26211 12548 30711 70164 48863 -2722 -32317
15686 -32317 -94152 -83154 -83478 -74339 -13462 -15781 -38255 -14826 -60451 -102556 -92470 -23236
$$ packed form
15770a0090p730j4463l4473J6405K6229j6517M8752K5821q3394n7041l6648N6794
15758h6355L4514k6053j3571L5212L6799P961N805j4979k2043j6246R323N1316
15746A683J9132j3572r949M9735O652l953o1630M0976J8390k7114r414M995J9396
15733C5327n4273J1049m9016l3211L244O4583k0000j1876p903l8803n5050Q623
15721a47306m8108j0698O0279P3125P9311r700J9622R692n0528p2287K7357j3926
15709h3167o4348K2098K3629M1703P0197K674j9047m6321r0020o17K3302j3344
15697a33261Q0254N0381M8912m1472l1025L8759J8163L9453k1301n1585k9595
15686c2317o1835J0998l24R139O0877k319k2474K3429m5625m2105J0086O9234
$$ plain form
15674 -23236 -22035 -69327 -61108 -49933 -3891 76206 123776 31787 -36387 -1328 -2857 -48152
15662 -48152 -61699 -16465 4006 42220 29070 -21804 -61384 -43499 -53853 -91559 -140396 -65822
15650 -65822 5689 57949 102896 107433 98895 -29274 -125850 -62521 7852 37110 22843 44238
15638 44238 88893 52708 46067 92367 75318 28697 -64221 -61222 -13436 -14334 3981 -11640
15626 -11640 -46867 -76868 -68999 -13359 73186 76336 53333 -9345 -49685 -9418 -27807 -47623
15614 -47623 -50964 -370 56168 122425 52911 12612 17173 -67392 -79355 -48609 -6540 -60583
15602 -60583 -101508 -45785 -3786 2017 -30255 -15727 4565 61905 90178 5233 -78058 -103498
15590 -103498 -25783 18230 97524 63824 -16938 -11406 2309 -10377 -16712 -122 43613 -15642
$$ packed form
15674b3236J201m7292Q219J1175M6042Q0097M7570r1989o8174L5059j529m5295
15662d8152j3547M5234K0471L8214j3150n0874l9580J7885j0354l7706m8837P4574
15650f5822P1511N2260M4947M537q538j28169r6576O3329P0373K9258j4267K1395
15638D4238M4655l6185o641M6300j7049m6621r2918K999M7786q98J8315j5621
15626a1640l5227l0001P869N5640Q6545L150k3003o2678m0340M0267j8389j9816
15614d7623l341N0594N6538O6257o9514m0299M561q4565j1963L0746M2069n4043
15602f0583m0925N5723M1999N803l2272J4528K0292N7340K8273q4945q3291k5440
15590a03498P7715M4013P9294l3700q0762N532J3715j2686o335J6590M3735n9255
$$ plain form
15578 -15642 -8267 7118 28271 -147 -27674 -9050 36521 73176 27504 -38664 -51748 -38484
15566 -38484 -11151 -31755 -49516 -3726 78584 84572 3202 -33453 -17794 30443 61445 61529
15554 61529 -16134 -71663 -63290 2109 54566 35846 -59729 -80691 -64576 -85971 -67151 -9885
15542 -9885 -33128 -73194 -83749 -36699 -73621 -132988 -135158 -88094 -110504 -149181 -34435 30360
15530 30360 -16715 -82688 -111541 -39912 -33654 -15 -40041 -11949 65546 19636 -17096 -15968
15518 -15968 16824 36802 -14211 -54258 -19942 -46979 -64499 -51268 30493 -1111 -49417 -19633
15506 -19633 -11716 -30511 -11292 30538 25968 1467 6918 -17272 -11689 45507 1676 -2175 -17954
15493 -17954 -65389 -122464 -68895 -54230 -53918 -32700 -44533 -20584 -14610 -6993 -6048 -21745 11062
$$ packed form
15578a5642P375J5385K1153k8418k7527J8624M5571L6655m5672o6168j3084J3264
15566c8484K7333k0604j7761M5790Q2310N988q1370l6655J5659M8237L1002Q4
15554F1529p7663n5529Q373O5399N2457j8720r5575k0962J6115k1395J8820N7266
15542i885k3243m0066j0555M7050l6922n9367k170M7064k2410l8677J14746O4795
15530C0360m7075o5973k8853P1629O258L3639m0026K8092P7495m5910l6732J128
15518a5968L2792J9978n1013m0047L4316k7037j7520J3231Q1761l1604m8306K9784
15506a9633P917j8795J9219M1830m570k4501N451k4190N583N7196m3831l851j5779
15493a7954m7435n7075N3569J4665L12K1218j1833K3949N974P617R45j5697L2807
$$ plain form
15480 11062 55955 64537 29989 -4971 7527 -36090 -614 37931 42970 47018 50359 68207
15468 68207 131803 121194 53108 2755 4212 -13016 -54668 -84062 -675 15808 -49513 -21479
15456 -21479 -24624 -91387 -64860 -18078 -5617 -13715 4966 -80813 -62950 -3255 11272 -54416
15444 -54416 -29659 -16062 28456 130124 105686 68036 73804 16429 -48997 -102524 -110909 -72280
15432 -72280 -46371 -14 24116 -5676 -20377 -93735 -107775 -67358 17917 2007 3767 22256
15420 22256 18292 65947 107584 76391 -41267 -87418 -30692 -388 31261 -27595 41624 83716
15408 83716 22209 4040 73163 61984 108507 132725 137261 42952 5760 13886 20610 -38997
15396 -38997 -66327 -51358 -22970 -7381 22546 74081 47370 41952 19479 -10395 -1053 28343
$$ packed form
15480A1062M4893Q582l4548l4960J2498m3617L5476L8545N039M048L341J7848
15468F8207O3596j0609o8086n0353J457j7228m1652k9394Q3387J6483o5321K8034
15456b1479l145o6763K6527M6782J2461q098J8681q5779J7863N9695J4527o5688
15444e4416K4757J3597M4518J01668k4438l7650N768n7375o5426n3527q385L8629
15432g2280K5909M6357K4130k9792j4701p3358j4040M0417Q5275j5910J760J8489
15420B2256l964M7655M1637l1193j17658m6151N6726L0304L1649n8856O9219M2092
15408H3716o1507j8169O9123j1179M6523K4218M536r4309l7192Q126O724n9607
15396c8997k7330J4969K8388J5589K9927N1535k6711n418k2473k9874R342K9396
$$ plain form
15384 28343 5885 13172 31883 28618 -5083 -23497 -38078 -75906 -34278 -3361 18631 19567
15372 19567 2343 -13038 -53212 -34912 5098 80221 69112 28350 62585 47574 -48954 -110042
15360 -110042 -69173 -23038 -2084 -7534 -125579 -197296 -176639 -128304 -49367 40690 110631
15349 110631 118241 56240 4002 16090 31797 11379 22868 49136 52901 126468 120844 80530
15337 80530 -20860 -82448 -118347 -49485 -53372 -57577 20984 -24712 -93278 -59584 -57548 -85569
15325 -85569 -86025 -26919 2930 -38079 -16487 8594 -32697 -25356 5821 -15366 -62213 -46051
15313 -46051 -45685 1743 28591 -5840 -13297 16547 16498 1946 -522 21016 37444 6545 -52747
15300 -52747 -27470 -38696 -64182 20143 38579 70537 88776 108879 73445 9376 70433 120886
$$ packed form
15384B8343k2458P287J8711l265l3701j8414j4581l7828M1628L0917K1992R36
15372A9567j7224j5381m0174J8300M0010P5123j1109m0762L4235j5011r6528o1088
15360a10042M0869M6135K0954n450j18045p1717K0657M8335P8937R0057O9941
15349A10631P610o2001n2238J2088J5707k0418J1489K6268L765P3567n624m0314
15337H0530j01390o1588l5899O8862l887m205P8561m5696o8566L3694K036k8021
15325h5569m56N9106K9849m1009K1592K5081m1291P341L1177k1187m6847J6162
15313d6051L66M7428K6848l4431p457K9844m9j4552k468K1538J6428l0899n9292
15300e2747K5277j1226k5486Q4325J8436L1958J8239K0103l5434o4069O1057N0453
$$ plain form
15288 120886 33917 -5160 -37959 -37837 -62 21367 1006 -56580 -102783 -129582 -38904 -3069
15276 -3069 -7223 -27900 -43452 -69052 -52453 -59400 -68055 -97638 -97379 -153561 -204966 -146033 -108523
15263 -108523 -104134 -92887 -52871 -54679 -84408 -66586 -17822 49663 83725 52982 13743 -50131
15251 -50131 -148452 -140488 -27773 -3987 -41803 -91274 -37686 -40428 -34285 -33828 -20693 -49671
15239 -49671 -45309 -31449 28912 69484 49971 -9571 -30788 -101802 -113508 -45884 -55934 -9195
15227 -9195 -2661 -47819 -30885 -6478 2397 -56947 -15864 5270 14856 61084 8834 44805
15215 44805 81507 16247 -70030 -45237 -19172 -27251 -61618 -110487 -108677 -95043 -43189 -56206
15203 -56206 -107784 -144470 -113481 -38677 -18411 35741 14319 59095 17565 -48899 -91807 -85098
$$ packed form
15288A20886q6969l9077l2799J22L7775K1429k0361n7586m6203k6799R0678L5835
15276c069m154k0677j5552k5600J6599o947q655k9583K59n6182n1405N8933L7510
15263a08523M389J1247M0016j808k9729J7822M8764O7485L4062l0743l9239o3874
15251e0131r8321P964J12715K3786l7816m9471N3588k742O143M57J3135k8978
15239d9671M362J3860O0361M0572j9513n9542k1217p1014j1706O7624j0050M6739
15227i195O534m5158J6934K4407Q875n9344M1083K1134R586M6228n2250L5971
15215D4805L6702o5260q6277K4793K6065q079l4367m8869J810J3634N1854j3017
15203e6206n1578l6686L0989P4804K0266N4152k1422M4776m1530o6464m2908O709
$$ plain form
15191 -85098 -137588 -107192 -38559 -46795 -31691 7005 -14609 -35290 -4 -6544 28814 8498
15179 8498 -9825 64685 151139 128118 9959 -66885 -69905 -49360 1287 19070 -8670 -45999
15167 -45999 -148105 -196137 -165544 -147247 -156201 -166957 -138984 -134307 -148227 -166073 -131631 -139412
15155 -139412 -162561 -200380 -170477 -94689 2989 41441 54908 25773 -39207 -4863 -5621 -35499
15143 -35499 -65970 -846 32986 26751 -10767 -13625 -27177 -45756 11641 31836 16589 54347
15131 54347 108331 149031 138665 168355 215121 167648 121598 94387 48249 -24596 36037 53975
15119 53975 -6392 -46787 -7954 -23837 -29100 -17302 -26856 16285 -1562 -42579 -89012 -56167
15107 -56167 5987 -23256 -70809 -114657 -205326 -165145 -130493 -116083 -124180 -127628 -120014 -87401
$$ packed form
15191h5098n2490L0396O8633q236J5104L8696k1614k0681L5286o540L5358k0316
15179H498j8323P4510Q6454k3021j18159p6844l020K0545N0647J7783k7740l7329
15167d5999j02106m8032L0593J8297q954j0756K7973M677j3920j7846L4442p781
15155a39412k3149l7819K9903P5788R7678L8452J3467k9135o4980L4344p58k9878
15143c5499l0471O5124L3832o235l7518k858j3552j8579N7397K0195j5247L7758
15131E4347N3984M0700j0366K9690M6766m7473m6050k7211m6138p2845O0633J7938
15119E3975o0367m0395L8833j5883n263J1798r554M3141j7847m1017m6433L2845
15107e6167O2154k9243m7553m3848r0669M0181L4652J4410q097l448P614L2613
$$ plain form
15095 -87401 -80231 -76356 -44184 -32205 -25219 -37753 3528 -34014 -55419 38445 10937 6500
15083 6500 27136 75768 131824 136034 128142 109593 19515 -41293 -1540 8487 44030 110364
15071 110364 76725 19258 8372 43254 2393 -34124 -39166 -526 41434 30009 24721 63519
15059 63519 80588 96249 44080 7495 -53267 -83612 -70721 -68772 -134305 -211334 -182449 -129535
15047 -129535 -98174 -80955 -74916 -96719 -83048 -30025 7971 -24234 -28531 -40795 -38368 -59337
15035 -59337 -48637 -29901 -29375 -54223 -142616 -160792 -98562 -29277 -10812 4699 -35803 -62666
15023 -62666 -6852 46889 9543 -29364 -20916 -16657 -3241 19975 -3986 -18971 30183 -8710
15011 -8710 -92253 -107618 -49598 -80882 -36903 78066 145123 271179 332755 265896 199636
$$ packed form
15095h7401P170L875L2172J1979O986j2534M1281l7542k1405R3864k7508m437
15083F500K0636M8632N6056M210p892j8549r0078o0808L9753J0027L5543O6334
15071A10364l3639n7467j0886L4882m0861l6517n042L8640M1960j1425n288L8798
15059F3519J7069J5661n2169l6585o0762l0345J2891J949o5533p7029K8885N2914
15047a29535L1361J7219O039k1803J3671N3023L7996l2205m297j2264K427k0969
15035e9337J0700J8736N26k4848q8393j8176O2230O9285J8465J5511m0502k6863
15023f2666N5814N3741l7346l8907Q448M259J3416K3216k3961j4985M9154l8893
15011h710q3543j5365N8020l1284M3979J14969O7057J26056O1576o6859o6260
$$ plain form
15000 199636 102135 55279 37490 -16256 -36214 -53389 -53663 -72827 -96084 -139047 -127535 -48434
14988 -48434 -2418 13595 3847 -63519 -131571 -141957 -149740 -125062 -132535 -31676 -14474 -8995
14976 -8995 22493 14537 4667 -30922 -54579 -88628 -127052 -179107 -141781 -83190 -107011 -105293
14964 -105293 -20574 -25515 23945 41301 26184 -16777 -81071 -51321 -32962 -15143 20153 59094
14952 59094 61045 76863 68232 52720 36013 16081 22279 -49386 -114043 -120047 -80329 -74928 -66384
14939 -66384 -63787 -67668 -60073 -14694 3840 -29879 -9643 -19596 -13065 5002 18323 35260 34478
14926 34478 -38424 -106921 -122974 -102906 -33491 -27585 28011 32012 -12899 -53050 -54472 -60484
14914 -60484 -59909 -88761 -31256 13836 5822 -40907 -58396 39129 91704 84845 96528 115339
$$ packed form
15000A99636r7501m6856j7789n3746j9958j7175k74j9164k3257m2963J1512P9101
14988d8434M6016J6013r748o7366o8052j0386p783K4678p473J00859J7202N479
14976h995L1488p956r870l5589k3657l4049l8424n2055L7326N8591k3821J718
14964a05293Q4719m941M9460J7356j5117m2961o4294K9750J8359J7819L5296L8941
14952E9094J951J5818q631j5512j6707j9932O198p1665o4657o004L9718N401Q544
14939f6384K597l881P595M5379J8534l3719K0236r953O531J8067J3321J6937p82
14926C4478p2902o8497j6053K0068O9415N906N5596M001m4911m0151j422o012
14914f0484N75k8852N7505M5092q014m6729j7489R7525N2575o859J1683J8811
$$ plain form
14902 115339 55505 39776 29056 -19430 -6129 61901 44023 -5479 30327 63760 -585
14891 -585 -25647 -18891 27793 39098 43767 60047 24264 5728 50100 103859 119530 45289
14879 45289 6908 -17934 -29468 -53760 -39966 -7971 9276 -9907 -71195 -79665 -120197 -147650
14867 -147650 -63398 11153 -10096 12349 15100 -31795 -11721 13210 6359 -34086 -43947 52075
14855 52075 81947 82255 95846 69160 84155 122984 126358 111518 91201 55687 26239 -66598
14843 -66598 -105515 -79997 -82276 -104941 -102976 -105386 -102898 -130144 -82885 -99157 -91374 -110217 -93979
14830 -93979 -21735 39171 56134 550 -23444 -32401 11836 7267 22055 50327 -22849 -46969
14818 -46969 -15266 -71083 -44797 4846 -46976 -49527 -84273 -64776 -19858 -30075 1188 24589
$$ packed form
14902A15339n9834j5729j0720m8486J3301O8030j7878m9502L5806L3433o4345
14891e85k5062O756M6684J1305M669J6280l5783j8536M4372N3759J5671p4241
14879D5289l8381k4842j1534k4292J3794L1995J7247j9183o1288q470m0532k7453
14867a47650Q4252P4551k1249K2445K751m6895K0074K4931o851m0445r861R6022
14855E2075K9872L08J3591k6686J4995L8829L374j4840k0317l5514k9448r2837
14843f6598l8917K5518k279k2665J965k410K488k7246M7259j6272P783j8843J6238
14830i3979P2244O0906J6963n5584k3994q957M4237m569J4788K8272p3176k4120
14818d6969L1703n5817K6286M9643n1822k551l4746J9497M4918j0217L1263K3401
$$ plain form
14806 24589 10044 -13885 -15958 21489 84568 98544 83380 43516 8496 28630 3962 -28514
14794 -28514 -102540 -84921 -106382 -150593 -95848 -86317 -94492 -91364 -86424 -12245 -10033 -11154 -16462
14781 -16462 -19682 -7836 -12188 5000 -30841 -79934 -64813 22418 4771 -32192 -4107 49554
14769 49554 70822 21992 17273 -1486 -40187 -56040 -29612 -21442 -45942 -51357 -52569 -862
14757 -862 30377 72604 73011 99557 59079 -8958 -43968 -72856 -117460 -86144 -60940 -39776
14745 -39776 -35506 -6209 32603 -18304 -81461 -97015 -76365 -78572 -13740 8442 -22540 -71713
14733 -71713 -136502 -134340 -100737 -77456 -49495 -29622 -2933 29428 19012 5909 1433 20288
14721 20288 39456 86088 87408 29374 -8393 24569 53164 -20114 -60012 -77744 -68186 -65930
$$ packed form
14806B4589j4545k3929k073L7447O3079J3976j5164l9864l5020K0134k4668l2476
14794b8514p4026J7619k1461m4211N4745R531q175L128M940P4179K212j121n308
14781a6462l220J1846m352J7188l5841m9093J5121Q7231j7647l6963K8085N3661
14769D9554K1268m8830m719j8759l8701j5853K6428Q170k4500n415j212N1707
14757h62L1239M2227M07K6546m0478o8037l5010k8888m4604L1316K5204K1164
14745c9776M270K9297L8812n0907o3157j5554K0650k207O4832K2182l0982m9173
14733g1713o4789K162L3603K3281K7961J9873K6689L2361j0416j3103m476J8855
14721B0288J9168M6632J320n8034l7767L2962K8595p3278l9898j7732R558K256
$$ plain form
14709 -65930 20851 59915 22561 -8548 -60995 -74940 -112710 -76992 -22001 16153 43184 14537
14697 14537 -17180 -23679 -21932 -6029 -41116 -25351 -29713 -116418 -162122 -96060 -32905 -12417
14685 -12417 -39052 -111725 -24499 -35195 -85791 -70936 -97477 -86343 -45411 -53926 -58132 -46135
14673 -46135 52726 19737 -21598 11881 -3913 -6070 -28624 -25120 -51085 -76483 -33884 91275
14661 91275 106942 108705 75601 37063 14963 -60288 22573 76806 47954 -35970 -96546 -95906
14649 -95906 -41777 -16620 -36130 -44060 -6760 22381 -30348 -39857 1745 -10741 -31984 -55307
14637 -55307 -43268 -63043 -64879 -57020 -10174 -3458 -5074 20593 58513 61033 -37929 -90747 -67973
14624 -67973 -43052 9641 -47923 -132646 -73325 -18898 -55212 -59909 -68135 -68980 -74088 -47455 -29854
$$ packed form
14709f5930Q6781L9064l7354l1109n2447j3945l7770L5718N4991L8154K7031k8647
14697A4537l1717o499J747J5903l5087J5765m362q6705m5704O6062O3155K0488
14685a2417k6635p2673Q7226j0696n0596J4855k6541J1134M0932q515m206J1997
14673d6135R8861l2989m1335L3479j5794k157k2554L504k5965k5398M2599J25159
14661I1275J5667J763l3104l8538k2100p5251Q2861N4233k8852q3924o0576O40
14649i5906N4129K5157j9510p930L7300K9141n2729r509M1602j2486k1243k3323
14637e5307J2039j9775j836P859M6846O716j616K5667L7920K520r8962n2818K2774
14624f7973K4921N2693n7564q4723N9321N4427l6314m697q226q45n108K6633J7601
$$ plain form
14611 -29854 11588 20985 -29146 -13956 -7981 -31944 -58722 -83196 -68068 -61709 -1922 39476
14599 39476 36957 50444 23681 -29805 -49976 -4644 4769 16342 -49922 -39357 676 77877
14587 77877 49833 -8259 -19857 -66326 -81889 -75673 -13006 68021 69486 97420 87197 30951
14575 30951 -2357 26650 17149 17683 49039 20423 -17238 6555 89016 73631 96378 97400
14563 97400 58126 63281 7619 55560 62581 85568 40615 21467 -10844 -64115 -62848 -38727
14551 -38727 6729 43439 60738 19225 5699 -226 1897 77386 51232 45853 40576 72248
14539 72248 133448 103901 77120 13015 22999 71837 96540 135880 142562 77925 84811 5000
14527 5000 -23523 -12027 88640 120993 82600 -2400 4861 -14878 49792 125730 162138 177847
$$ packed form
14611b9854M1442R397n0131J5190N975k3963k6778k4474J5128O359N9787M1398
14599C9476k519J3487k6763n3486k0171M5332R413J1573o6264J0565M0033P7201
14587G7877k8044n8092j1598m6469j5563O216O2667Q1027J465K7934j0223n6246
14575C0951l3308K9007r501N34L1356k8616l7661K3793Q2461j5385K2747J022
14563I7400l9274N155n5662M7941P021K2987m4953j9148l2311n3271J267K4121
14551c8727M5456L6710J7299m1513j3526n925K123P5489k6154n379n277L1672
14539G2248O1200k9547k6781o4105R984M8838K4703L9340O682o4637O886p9811
14527E000k8523J1496J00667L2353l8393q5000P261j9739O4670P5938L6408J5709
$$ plain form
14515 177847 145775 99761 55719 45294 76915 43020 22985 12474 5428 25519 -38459 -59281
14503 -59281 14261 60033 60874 54456 9907 -9803 -9122 14175 32177 25922 20508 -11873 -23075
14490 -23075 -66815 -87839 -22338 35011 3443 -59523 -85576 -57855 17159 45442 60786 96100
14478 96100 89491 14011 -11582 11033 -26431 -25357 -11670 -54016 -117404 -133221 -34445 13366
14466 13366 89389 79501 56810 24462 -35504 -31953 -29900 -41891 -32864 7258 24615 59860
14454 59860 55591 37358 29382 -1007 -41755 4741 133946 186492 146415 90049 4760 -17600
14442 -17600 -11047 -8476 34452 17649 5513 -5607 -7839 -431 25969 41905 -1594 15837
14430 15837 19257 41265 63779 71689 23332 -72548 -51631 -18461 -13146 -105144 -53811 20871
$$ packed form
14515A77847l2072m6014m4042j0425L1621l3895k0035j0511p046K0091o3978k0822
14503e9281P3542M5772Q41o418m4549j9710O81K3297J8002o255n414l2381j1202
14490b3075m3740k1024O5501N7349l1568o2966k6053K7721P5014K8283J5344L5314
14478I6100o609p5480k5593K2615l7464J074J3687m2346o3388j5817R8776M7811
14466A3366P6023r888k2691l2348n9966L551K053j1991R027M0122J7357L5245
14454E9860m269j8233p976l0389m0748M6496J29205N2546m0077n6366q5289k2360
14442a7600O553K571M2928j6803j2136j1120k232P408K6400J5936m3499J7431
14430A5837L420K2008K2514P910m8357r5880K0917L3170N315r1998N1333P4682
$$ plain form
14418 20871 13981 64478 122297 52338 -16683 -45216 -41779 -6555 17132 -12277 14693 -31132
14406 -31132 6806 24835 11650 32407 67143 63860 -24412 -64574 -71237 -2991 27760 22041
14394 22041 117791 164825 104159 39551 -35299 -64572 1842 -20882 -6289 -60750 -169845
14383 -169845 -103876 -36323 -62402 -135459 -141648 -29607 -1676 -37369 -9151 -47074 -113816
14372 -113816 -102580 -72103 -17193 19651 21600 4853 -894 -33141 -2213 -44842 -95247 -45277
14360 -45277 64698 122832 43275 3102 -14029 -32387 -21255 -79344 -90743 -91372 -95541 -67654
14348 -67654 -8059 -23241 -42768 -126118 -119985 -90073 -69474 -59443 -55732 -20000 4872 36496
14336 36496 87244 23520 34817 68188 19098 -21427 -58722 -40163 5109 38873 48864 91118
$$ packed form
14418B0871o890N0497N7819o9959o9021k8533L437L5224K3687k9409K6970m5825
14406c1132L7938J8029j3185K0757L4736l283q8272m0162o663O8246L0751n719
14394B2041R5750M7034o0666o4608p4850k9273O6414k2724J4593n4461j09095
14383a69845O5969O7553k6079p3057o189J12041K7931l5693K8218l7923o6742
14372a13816J1236L0477N4910L6844J949j6747n747l2247L0928m2629n0405M9970
14360d5277J09975N8134p9557m0173j7131j8358J1132n8089j1399o29m169K7887
14348f7654N9595j5182j9527q3350O133K9912K0599J0031L711L5732K4872L1624
14336C6496N0748o3724J1297L3371m9090m0525l7295J8559M5272L3764R991M2254
$$ plain form
14324 91118 85418 15723 37429 41328 -25391 -26391 7570 -58476 -69406 8114 7108 -29418
14312 -29418 -34464 28000 -1191 -65399 -114647 -135366 -149994 -48656 -22477 -10140 -10302 -12838
14300 -12838 23139 2125 35583 81387 55316 96181 97549 44581 61637 54832 -865 48766
14288 48766 85919 94287 76006 57060 4807 -35815 -71690 -3053 -5341 9106 40408 28939
14276 28939 827 21206 -64790 -113799 -61669 -46421 43304 95008 58531 71734 82819 32114
14264 32114 -68538 -69548 -23571 -120664 -92909 -61471 37212 36734 4538 13241 819 -775
14252 -775 -26844 -33691 -95630 -68074 60920 97883 111558 60494 58527 -4300 4037 79253
14240 79253 142749 19408 -34694 -59149 -36716 36769 38636 -20680 -29818 12098 13397 45871
$$ packed form
14324I1118n700o9695K1706L899o6719j000L3961o6046j0930P7520j006l6526
14312b9418n046O2464k9191o4208m9248k0719j4628J01338K6179J2337j62k536
14300a2838L5977k1014L3458M5804k6071M0865J368n2968J7056o805n5697M9631
14288D8766L7153Q368j8281j8946n2253m0622l5875O8637k288J4447L1302j1469
14276B8939k8112K0379q5996m9009N2130J5248Q9725N1704l6477J3203J1085n0705
14264C2114j00652j010M5977r7093K7755L1438R8683m78l2196Q703j2422j594
14252g75k6069o847o1939K7556J28994L6963J3675n1064j967o2827Q337P5216
14240G9253O3496j23341n4102k4455K2433P3485J867n9316r138M1916J299L2474
$$ plain form
14228 45871 39464 1536 -51426 -79153 -71601 -45760 -64705 -42322 -13559 -28029 -64213 -31603
14216 -31603 33672 50219 38285 38369 64206 20226 -2865 45019 129994 128550 120351 109682 78607
14203 78607 80830 41180 -15293 -793 -41652 3672 68734 36598 -13114 -51292 -43168 -23435
14191 -23435 51926 -7558 -29980 -1386 18353 -48989 -106287 -54662 -20750 -39388 -42254 -76868
14179 -76868 -100731 -73256 -27623 14831 -20064 22865 47702 62673 100246 54496 -17993 9367
14167 9367 7769 -6174 30253 68845 44075 -21558 -38499 6413 11872 28942 39864 78836
14155 78836 66127 54207 17582 -16879 -26846 -3912 -8644 27458 48450 47537 56346 92893 54735
14142 54735 36766 15042 -9217 -45311 8401 3369 -7201 -51878 -38703 -9474 14767 -52382
$$ packed form
14228D5871o407l7928n2962k7727P552K5841j8945K2383K8763j4470l6184L2610
14216c1603O5275J6547j1934Q4K5837m3980k3091M7884Q4975j444q199j0669l1075
14203G8607K223l9650n6473J4500m0859M5324O5062l2136m9712l8178Q124J9733
14191b3435P5361n9484k2422K8594J9739o7342n7298N1625L3912j8638k866l4614
14179g6868k3863K7475M5633M2454l4895M2929K4837J4971L7573m5750p2489K7360
14167I367j598j3943L6427L8592k4770o5633j6941M4912N459J7070J0922L8972
14155G8836j2709j1920l6625l4461r967K2934m732L6102K0992r13Q809L6547l8158
14142E4735j7969k1724k4259l6094N3712n032j0570m4677J3175K9229K4241o7149
$$ plain form
14130 -52382 -83589 -83697 -93510 -78570 -59488 -40581 1436 19586 17768 57913 56741 8765 52815
14117 52815 35793 -14846 -93279 -119740 -44417 43507 6837 -16162 -38093 -41393 -47986 14704
14105 14704 24007 8868 16876 57311 32932 24500 45599 46796 6736 18933 -27795 -53178
14093 -53178 15429 9417 -25985 -4241 2762 49675 17260 -52488 -31202 24372 -37828 -31124
14081 -31124 18871 45502 55417 78755 48681 24995 19290 -27193 -29663 -20811 -24025 12837 62489
14068 62489 81075 72175 52912 24478 -14519 260 8604 2086 -47394 -101806 -105935 -65515
14056 -65515 -62631 -53102 -22084 -12285 -8269 17457 11496 1775 26585 88006 72709 83797 134381
14043 134381 52329 -49043 -89266 -54685 -55865 -16852 25714 18083 -27200 -32747 -354 40604
$$ packed form
14130e2382l1207j08r813J4940J9082J8907M2017J8150j818M0145j172m7976M4050
14117E2815j7022n0639p8433k6461P5323Q7924l6670k2999k1931l300o593O2690
14105A4704R303j5139Q008M0435k4379q432K1099J197m0060J2197m6728k5383
14093e3178O8607o012l5402K1744P003M6913l2415o9748K1286N5574o2200O704
14081c1124M9995K6631R915K3338l0074k3686n705m6483k470Q852l214L6862M9652
14068F2489J8586q900j9263k8434l8997J4779Q344o518m9480n4412m129M0420
14056f5515K884R529L1018R799M016K5726n961r721K4810O1421j5297J1088N0584
14043A34381q2052j01372m0223L4581j180L9013M2566p631m5283n547L2393M0958
$$ plain form
14031 40604 -7633 -91768 -86628 -3587 54087 22389 35147 91249 112707 36969 -30593 -53572
14019 -53572 -29793 31712 63283 70829 14939 43410 114205 43981 -12019 -11421 -12189 -17908 -76795
14006 -76795 -98277 -142216 -70252 -33658 -55816 -55231 -31366 -70139 -80283 -65327 -19813 12114
13994 12114 12789 5669 -25801 -44572 -49744 -53943 -10595 27419 42471 -31265 -20044 21939 -5311
13981 -5311 -20434 -13071 -21084 -14714 -40279 -16891 18689 37102 -12840 -48711 52165 78231
13969 78231 124588 134774 122889 85211 28964 26330 -37668 -66952 -42858 -76458 -127178 -127389
13957 -127389 -78532 -4850 -23211 20682 22225 -2361 48394 124828 105243 19387 -6261 -60808
13945 -60808 -32881 14866 64087 44511 57149 24131 69201 108975 57657 62225 98670 86338
$$ packed form
14031D0604m8237q4135N140Q3041N7674l1698J2758N6102K1458p5738o7562k2979
14019e3572K3779O1505L1571P546n5890K8471P0795p0224n6000N98p68n719n8887
14006g6795k1482m3939P1964L6594k2158N85K3865l8773j0144J4956M5514L1927
13994A2114O75p120l1470j8771n172m199M3348L8014J5052p3736J1221M1983k7250
13981e311j5123P363q013O370k5565K3388L5580J8413m9942l5871J00876K6066
13969G8231M6357J0186j1885l7678n6247k634o3998k9284K4094l3600n0720k11
13957a27389M8857P3682j8361M3893J543k4586N0755P6434j9585q5856k5648n4547
13945f0808K7927M7747M9221j9576J2638l3018M5070L9774n1318M568L6445j2332
$$ plain form
13933 86338 84829 33781 -70559 -94221 -22476 -19619 -19980 28160 -31610 -64928 -124415 -75650
13921 -75650 -15852 -49572 -52288 -78618 -58884 2388 -28885 -72034 -116429 -18489 46513 -1573
13909 -1573 -58264 -42383 -37208 -22107 -6661 39475 94841 57766 -11294 -2505 -45743 -36427
13897 -36427 71 3927 -16415 -26754 53908 126321 30994 -24758 10018 -10541 -58082 6503
13885 6503 52370 67803 70440 43704 68460 80186 103668 149173 144080 87726 34977 20095
13873 20095 -13910 -41147 -139443 -126554 -51265 -70961 -64151 8952 78942 18710 -26739 32222
13861 32222 23691 -26993 -58996 -83230 -97413 -133291 -120400 -60541 -51281 -10467 16728 45793
13849 45793 -15972 -30961 -3601 5855 20140 48820 107545 62652 48834 69543 -10911 -104817
$$ packed form
13933H6338j509n1048j04340k3662P1745K857l61M8140n9770l3318n9487M8765
13921g5650N9798l3720k716k6330J9734O1272l1273m3149m4395R7940O5002m8086
13909a573n6691J5881N175J5101J5446M6136N5366l7075o9060Q789m3238R316
13897c6427L6498L856k0342j0339Q0662P2413r5327n5752L4776k0559m7541O4585
13885F503M5867J5433K637k6736K4756J1726K3482M5505n093n6354n2749j4882
13873B0095l4005k7237r8296J2889P5289j9696O810P3103O9990o0232m5449N8961
13861C2222q531n0684l2003k4234j4183l5878J2891N9859R260M0814K7195K9065
13849D5793o1765j4989K7360R456J4285K8680N8725m4893j3818K0709q0454r3906
$$ plain form
13837 -104817 -130037 -57281 24416 -42 -26887 -51468 -69797 -34594 -54175 -63279 -50552 23422
13825 23422 106 -103224 -153593 -93524 -105806 -107211 -91861 -101520 -65896 -71741 -59484 -56480
13813 -56480 -43803 -49137 -19060 -39688 -40088 -14908 26184 37008 17952 36750 70117 26852
13801 26852 76703 93426 81796 55356 11245 28538 40123 69830 56290 45786 -3489 -94380
13789 -94380 -82966 -4708 35829 32518 30640 13382 52693 139186 109185 91482 15953 -41642
13777 -41642 -38643 -35841 -38943 29998 65107 -30288 -47025 -32667 -107533 -120043 -58352 -14405
13765 -14405 85698 78263 66915 35956 29842 3436 -76939 -88542 -98702 -41907 11044 47861
13753 47861 70688 55848 27962 15259 37139 29504 22608 34096 73751 46100 27890 -8903
$$ packed form
13837a04817k5220P2756Q1697k4458k6845k4581j8329L5203j9581r104J2727P3974
13825B3422k3316j03330n0369O0069j2282j405J5350r659L5624n845J2257L004
13813e6480J2677n334L0077k0628m00K5180M1092J0824j9056J8798L3367m3265
13801B6852M9851J6723j1630k6440m4111J7293J1585K9707j3540j0504m9275r0891
13789i4380J1414P8258M0537l311j878j7258L9311Q6493l0001j7703p5529n7595
13777d1642K999K802l102O8941L5109r5395j6737J4358p4866j2510O1691M3947
13765a4405J00103p435j1348l0959o114k6406q0375j1603j0160N6795N2951L6817
13753D7861K2827j4840k7886j2703K1880p635o896J1488L9655k7651j8210l6793
$$ plain form
13741 -8903 -51493 -22519 -55716 -98491 -74560 -18086 36364 11892 17196 -23542 -15714 -13843
13729 -13843 -12778 6135 16740 87664 92055 85370 74926 32083 82041 97122 31642 -28517
13717 -28517 -61746 -103173 -90626 -37688 26238 18215 9219 2929 5002 17213 -27240 -81914
13705 -81914 -88988 -57573 7038 46316 40665 26485 55676 76502 25092 -37231 -94985 -53057
13693 -53057 -3655 13369 -3118 9989 -18029 -45911 41225 126496 145325 107886 74857 17261
13681 17261 12138 49287 57247 39024 31095 47254 45765 71208 64461 25849 -1719 -492 -10454
13668 -10454 -35466 -26594 -107526 -130668 -41018 -32716 -79355 -134463 -98728 -91391 -79632 -71029
13656 -71029 -94210 -98307 -92774 -92942 -31899 71619 98820 136998 129961 61183 66889 57495 22978
$$ packed form
13741h903m2590K8974l3197m2775K3931N6474N4450k4472N304m0738P828J871
13729a3843J065J8913J0605P0924M391o685j0444m2843M9958J5081o5480o0159
13717b8517l3229m1427J2547N2938O3926q023q996o290K073J2211m4453n4674
13705h1914p074L1415O4611L9278n651j4180K9191K0826n1410o2323n7754M1928
13693e3057M9402J7024j6487J3107k8018k7882Q7136Q5271J8829l7439l3029n7596
13681A7261n123L7149P960j8223p929J6159j489K5443o747l8612k7568J227r962
13668a0454k5012Q872q0932k3142Q9650Q302m6639n5108L5735P337J1759Q603
13656g1029k3181m097N533j68O1043J03518K7201L8178p037o8778N706r394l4517
$$ plain form
13643 22978 -3009 3270 -33286 -9213 74608 97812 84290 55891 86571 78603 17044 -464
13631 -464 -7218 41403 90066 116163 76404 29122 -35194 -86463 -92852 -73604 -56731 -59867 -125736
13618 -125736 -159723 -134657 -51928 61771 108274 125749 85297 41517 76599 122558 176404
13607 176404 197571 172146 107820 6935 27746 127499 80784 94413 47897 15710 13966
13596 13966 -75889 -67179 -32574 42405 82250 49198 -29151 -43951 -35140 -46587 -20524 -54609
13584 -54609 -71629 -48542 -47648 -59598 -92618 -65168 33565 92291 114293 83036 115819 140657
13572 140657 138271 62795 -58544 -42253 -9018 2457 -18184 -68131 -69424 -33784 -10161 -28767
13560 -28767 -61661 -131618 -114148 -67771 -14286 6976 46299 42336 32988 47162 45322 80051
$$ packed form
13643B2978k5987O279l6556K4073Q3821K3204j3522k8399L0680p968o1559j7508
13631d64o754M8621M8663K6097l9759m7282o4316n1269o389J9248J6873l136o5869
13618a25736l3987K5066Q2729J13699M6503J7475m0452m3780L5082M5959N3846
13607A76404K1167k5425o4326j00885K0811R9753m6715J3629m6516l2187j744
13596A3966q9855Q710L4605P4979L9845l3052p8349j4800Q811j1447K6063l4085
13584e4609j7020K3087Q94j1950l3020K7450R8733N8726K2002l1257L2783K4838
13572A40657k386p5476j21339J6291L3235J1475k0641m9947j293L5640K3623j8606
13560b8767l2894o9957J7470M6377N3485K1262L9323l963r348J4174j840L4729
$$ plain form
13548 80051 75034 58968 82978 40730 -28676 -76543 -57384 19954 -20389 -85388 -16798 68921
13536 68921 88159 120770 26472 18584 47269 80473 4128 -50796 7723 5186 -61907 -68700
13524 -68700 -70725 15612 78608 -15779 -47652 -75476 -95573 -62413 -68874 -25998 31089 53379
13512 53379 19094 -45543 -121289 -126541 -94680 -102490 -76089 -21832 -13779 -21867 -38354 -30381 -56345
13499 -56345 -56625 -23861 -2216 -36958 -17032 -25053 7267 26439 42175 80517 66005 44355
13487 44355 -23127 -12017 57520 -13610 -123568 -149380 -97451 -68802 -19234 -14857 -29325 -10382
13475 -10382 72005 104986 95257 153883 134232 90592 56528 69944 69794 72418 80872 61314 40828
13462 40828 -3464 -53206 -5026 81043 80535 38852 -1373 50075 48871 -24713 -47977 -28793
$$ packed form
13548H0051n017j6066K4010m2248o9406m7867J9159P7338m0343o4999O8590Q5719
13536F8921J9238L2611r4298p888K8685L3204p6345n4924N8519k537o7093o793
13524f8700k025Q6337O2996r4387l1873k7824k0097L3160o461M2876N7087K2290
13512E3379l4285o4637p5746n252L1861p810K6401N4257Q053q088j6487P973k5964
13499e6345k80L2764K1645l4742J9926q021L2320J9172J5736L8342j4512k1650
13487D4355o7482J1110O9537p1130j09958k5812N1929K8649M9568M377j4468J8943
13475a0382Q2387L2981r729N8626j9651m3640l4064J3416j50K624Q454j9558k0486
13462D0828m4292m9742M8180Q6069n08m1683m0225N1448j204p3584k3264J9184
$$ plain form
13450 -28793 -38792 -73918 -94011 -69621 -11510 52332 45025 46161 36942 33956 36004 66683 53873
13437 53873 438 54066 93743 66815 40689 -23287 -31264 -33082 -33741 -5697 33632 78257
13425 78257 70548 -1281 -15989 18461 15854 -45336 -100547 -54628 -12091 -17548 12453 39801
13413 39801 44896 59623 86209 34791 32669 17776 44656 -29683 -115455 -164861 -96210 -70143
13401 -70143 -114032 -10730 86084 34027 13733 -32149 -193 -881 9048 26017 24960 -1876
13389 -1876 70272 119884 67311 71534 34287 16658 -4442 -31397 -27685 15715 -14113 -65554
13377 -65554 -109935 -76518 -26326 14320 -12288 -87217 -57592 -35906 41757 94419 36492 5517
13365 5517 42931 114400 64092 7198 -8728 -9029 8793 48835 59910 21841 -32106 -24433
$$ packed form
13450b8793r999l5126k0093K4390N8111O3842p307J136r219k986K048L0679j2810
13437E3873n3435N3628L9677k6928k6126o3976p977j818o59K8044L9329M4625
13425G8257p709p1829j4708L4450k607o1190n5211M5919M2537n457L0001K7348
13413C9801N095J4727K6586n1418k122j4893K6880p4339q5772m9406O8651K6067
13401g0143m3889J03302R6814n2057k0294m5882L1956o88R929J6969j057k6836
13389a876P2148M9612n2573M223l7247j7629k1100k6955L712M3400k9828n1441
13377f5554m4381L3417N0192M0646k6608p4929K9625K1686P7663N2662n7927l0975
13365E517L7414P1469n0308n6894j5926l01J7822M0042J1075l8069n3947P673
$$ plain form
13353 -24433 -71246 -38370 -44934 -49032 25890 108973 187258 191316 179510 279563 243141 200500
13341 200500 137429 133459 142962 156642 168092 157041 65167 20422 -32155 -53173 -88930 -109843
13329 -109843 -87142 -58612 -62304 -20678 25991 10907 -49499 -4734 58636 41372 23357 18623
13317 18623 23262 5142 -24665 -17673 50105 35724 40674 22962 -35045 -29800 6451 5729 -51581
13304 -51581 -52841 6795 8030 -15858 1812 -77345 -171383 -155174 -148781 -88115 -27566 64497
13292 64497 104519 74345 48970 -3493 6714 93316 65799 40788 23150 3532 -15177 -10034
13280 -10034 45890 85221 87801 -47944 -83117 -69310 -50666 -21749 23092 61468 37150 53229
13268 53229 133476 115669 104306 115486 56665 84044 36698 103921 39500 -6056 -80223 -87544
$$ packed form
13353b4433m6813L2876o564m098P4922Q3083P8285M058j1806J00053l6422m2641
13341B00500o3071l970R503J3680J1450j1051r1874m4745n2577k1018l5757k0913
13329a09843K2701K8530l692M1626M6669j5084o0406M4765O3370j7264j8015m734
13317A8623M639j8120k9807O992O7778j4381M950j7712n8007N245L6251p22n7310
13304e1581j260N9636J235k3888J7670p9157r4038J6209O393O0666O0549R2063
13292F4497M0022l0174k5375n2463J0207Q6602k7517k5011j7638j9618j8709N143
13280a0034N5924L9331K580j35745l5173J3807J8644K8917M4841L8376k4318J6079
13268E3229Q0247j7807j1363J1180n8821K7379m7346O7223o4421m5556p4167p321
$$ plain form
13256 -87544 -32606 -57562 -108985 -10488 -15338 19395 9871 -114285 -122937 -140564 -89993 -69624
13244 -69624 -64623 3990 8982 -5438 -58830 -112108 -82337 -56947 -54282 -26897 -20383 -24889 -59465
13231 -59465 -33800 -20884 -133272 -112041 -24791 -30010 -47496 4491 1238 34065 39758 -10043
13219 -10043 -62035 -79322 -54185 -49611 -53109 -49507 -46384 -19849 -19586 -27766 -45710 -6804 30578
13206 30578 11547 -22503 -38944 -74494 -84019 -75114 -97708 -70880 -15536 -4914 27260 37506
13194 37506 509 -47458 -14942 -2788 -7946 35894 76208 106813 79832 38829 42285 68152
13182 68152 27105 43883 45382 16063 -32813 -6076 2477 -42238 -26279 -34532 24794 55611
13170 55611 56211 144646 232906 253712 236955 148640 79184 12617 27545 29206 24496 -40456
$$ packed form
13256h7544N4938k4956n1423R8497m850L4733r524j24156q652j7627N0571K0369
13244f9624N001O8613M992j4420n3392n3278K9771K5390K665K7385O514m506l4576
13231e9465K5665J2916j12388K1231Q7250n219j7486N1987l253L2827N693m9801
13219a0043n1992j7287K5137M574l498L602L123K6535K63q180j7944L8906L7382
13206C0578j9031l4050j6441l5550r525Q905k2594K6828N5344J0622L2174J0246
13194C7506l6997m7967L2516J2154n158M3840M0314L0605k6981m1003L456K5867
13182F8152m1047J6778J499k9319m8876K6737Q553m4715J5959q253N9326L0817
13170E5611O00Q8435Q8260K0806j6757q8315o9456o6567J4928J661m710o4952
$$ plain form
13158 -40456 -66185 -56782 -32432 -61466 -63783 -51850 -47145 -52260 25584 76284 57638 -22258
13146 -22258 -24076 64499 72948 56852 25772 25274 1703 61104 58929 14476 -51805 -54469 -102614
13133 -102614 -82302 -74899 -37393 -52004 -71388 -137161 -129157 -132149 -114221 -117457 -42332 -34117
13121 -34117 -14394 25426 28166 18323 2317 6304 51461 41076 1438 -54759 -59909 -71773
13109 -71773 -82470 -116541 -132637 -106282 -89577 -56592 -31716 -11870 -24542 -37703 -20704 -14546
13097 -14546 -64211 -30027 -31462 -66634 12865 76783 15415 17564 -80366 -106994 -48256 17858
13085 17858 107872 137955 81066 56035 44733 104731 62692 1618 -1507 -22168 -53772 -29242
13073 -29242 797 23263 50402 73740 85985 28158 -20373 -9227 -81574 -62032 -7528 -2284
$$ packed form
13158d0456k5729R403K4350k9034k317J1933M705n115P7844N0700j8646p9896
13146b2258j818Q8575Q449j6096l1080m98k3571N9401k175m4453o6281k664m8145
13133a02614K0312P403L7506j4611j9384o5773Q004k992J7928l236P5125Q215
13121c4117J9723L9820K740r843j6006L987M5157j0385l9638n6197n150j1864
13109g1773j0697l4071j6096K6355J6705L2985K4876J9846j2672j3161J6999O158
13097a4546m9665L4184j435l5172P9499O3918o1368K149r7930k6628N8738O6114
13085A7858R0014L0083n6889k5031j1302N9998m2039o1074l125k0661l1604K4530
13073b9242L0039K2466K7139K3338J2245n7827m8531J1146p2347J9542N4504N244
$$ plain form
13061 -2284 -23766 -20166 44245 51734 13122 -32150 -71159 -28473 42081 20767 -15833 -22194
13049 -22194 -30995 23918 -49349 -38378 22678 15881 23272 53171 84438 5218 -668 42495
13037 42495 11486 -14489 65641 115809 153468 109216 141151 114138 95401 48680 30796 110
13025 110 22190 54182 98933 109875 73532 101119 127946 207517 147407 81834 24676 -26384
13013 -26384 -4646 1625 -10656 -5934 43297 44469 109703 144276 166198 125169 106556 48254
13001 48254 -13846 -37892 -24644 38119 44416 50731 98573 73633 32647 52636 130393 149334
12989 149334 70649 30464 44905 34569 17011 3736 36981 5604 -14302 -66774 -8277
12978 -8277 -11473 -50539 -44947 -61425 -28418 7386 32566 125430 137897 90977 16321 -9692
$$ packed form
13061b284k1482L600O4411P489l8612m5272l9009M2686P0554k1314l6600o361
13049b2194q801N4913p3267J0971O1056o797P391K9899L1267p9220n886M3163
13037D2495l1009k5975Q0130N0168L7659m4252L1935k7013j8737m6721j7884l0686
13025A10K2080L1992M4751J0942l6343K7587K6827P9571o0110o5573n7158n1060
13013b6384K1738O271j2281M722M9231J172O5234L4573K1922m1029j8613n8302
13001D8254o2100k4046J3248O2763O297O315M7842k4940m0986J9989P7757J8941
12989A49334p8685m0185J4441j0336j7558j3275L3245l1377j9906n2472N8497
12978h277l196l9066N592j6478L3007L5804K5180R2864J2467m6920p4656k6013
$$ plain form
12966 -9692 8201 6490 -22115 -15860 15290 6212 32737 -28731 -122043 -87886 -61800 -153836
12954 -153836 -164730 -68531 -106405 -161649 -105002 -60952 10789 13095 34654 -899 46872 32780
12942 32780 -79832 -20300 35682 5830 -2523 21540 60293 47609 -31623 -50962 24896 35341
12930 35341 13138 58345 100408 34511 -11205 -852 56191 51236 42121 68043 42907 87137
12918 87137 84647 102717 58319 -10958 5706 60964 46282 16578 -57322 -11001 100454 64627
12906 64627 83563 48516 -31170 -36881 -20479 -17237 -4982 6318 -55066 -7851 63029 158669
12894 158669 140881 92387 21079 -4552 23450 8155 -8826 3425 72081 57241 60679 -13858
12882 -13858 -2598 52607 87137 88747 34537 33791 -35598 -42517 -14498 -20710 -60714 8212 37839
$$ packed form
12966i692J7893j711k8605O255L1150r078K6525o1468r3312L4157K6086r2036
12954a53836j0894R6199l7874n5244N6647M4050P1741K306K1559l5553M7771j4092
12942C2780j12612N9532N5982k9852q353K4063L8753j2684p9232j9339P5858J0445
12930C5341k2203M5207M2063o5897m5716J0353N7043m955r115K5922k5136M4230
12918H7137k490J8070m4398o9277J6664N5258j4682k9704p3900M6321J11455l5827
12906F4627J8936l5047p9686n711J6402L242J2255J1300o1384M7215P0880R5640
12894A58669j7788m8494p1308k5631K8002j5295j6981J2251O8656j4840L438p4537
12882a3858J1260N5205L4530J610n4210p46o9389o919K8019o212m0004O8926K9627
$$ plain form
12869 37839 -7336 -11217 10599 22648 -34531 -53011 14938 26243 62314 109337 31246 -48569
12857 -48569 -50118 -56453 -41108 891 -1450 -37739 -82984 -61337 -71276 -108285 -83135 -45850
12845 -45850 45745 10526 49722 66832 -21689 -46551 16199 49861 60170 48147 82765 56921
12833 56921 4514 20215 13988 -46759 21741 122200 78814 33153 25637 44068 56182 30234
12821 30234 -17479 15618 2959 -40101 -19392 4579 24681 42547 12933 32375 48476 15797
12809 15797 11447 -13863 -12957 13372 55308 89805 101246 52823 16656 -16347 -105555 -81485
12797 -81485 -66326 -5852 -18542 -18783 -3574 -802 59468 71484 62628 -235 -30590 -28577 -73065
12784 -73065 -47950 -29206 -54286 -44781 -44218 18002 32933 19587 6610 33644 37406 13484
$$ packed form
12869C7839m5175l881K1816J2049n7179j8480O7949J1305L6071M7023p8091p9815
12857d8569j549o335J5345M1999k341l6289m5245K1647r939l7009K5150L7285
12845d5850R1595l5219L9196J7110q8521k4862O2750L3662J0309j2023L4618k5844
12833E6921n2407J5701o227o0747O8500J00459m3386m5661p516J8431J2114k5948
12821C0234m7713L3097j2659m3060K0709K3971K0102J7866k9614J9442J6101l2679
12809A5797m350k5310R06K6329M1936L4497J1441m8423l6167l3003q9208K4070
12797h1485J5159O0474j2690k41J5209K772O0270J2016q856o2863l0355K013m4488
12784g3065K5115J8744k5080R505N63O2220J4931j3346j2977K7034L762k3922
$$ plain form
12772 13484 4928 7469 8990 19403 11828 64696 89413 117643 92789 68451 65255 -18313 -103734
12759 -103734 -120781 -63508 -737 -10932 -36982 -74088 -108601 -83189 -32479 16210 -3884
12748 -3884 20035 84273 29373 -32214 -95233 -76337 -15428 -20656 27015 68287 24528 -22855
12736 -22855 -1327 46108 119798 134616 143012 147594 110696 54669 70832 82060 67206 110260
12724 110260 110033 57682 87470 87408 65333 96485 153835 98393 7209 -26462 40501 72416
12712 72416 46766 53097 58609 1855 -5569 -65 -11762 -22256 15713 29522 61441 -3794
12700 -3794 7396 66465 23889 43723 47698 -23724 27140 35554 -18161 10809 25598 7575
12688 7575 46677 15197 -66 66659 102309 153300 106747 81024 90535 15484 25272 77918
$$ packed form
12772A3484q556K541J521J0413p575N2868K4717K8230k4854k4338l196q3568q5421
12759a03734j7047N7273O2771j0195k6050l7106l4513K5412N0710M8689k0094
12748c884K3919O4238n4900o1587o3019J8896O0909n228M7671M1272m3759m7383
12736b2855K1528M7435P3690J4818Q396M582l6898n6027J6163J1228j4854M3054
12724A10260k27n2351K9788o2k2075L1152N7350n5442r1184l3671O6963L1915
12712G2416k5650O331N512n6754p424N504j1697j0494L7969J3809L1919o5235
12700c794J1190N9069m2576J9834L975p1422N0864Q414n3715K8970J4789j8023
12688G575L9102l1480j5263O6725L5650N0991m6553k5723R511p5051R788N2646
$$ plain form
12676 77918 81995 79380 84580 123629 118639 62608 15016 76720 98719 89755 79587 147546 81159
12663 81159 -49054 -33969 16055 46939 70692 88524 29075 -11151 56218 41647 10557
12652 10557 -9395 13237 45395 85249 57466 1990 2437 8443 8374 -18483 -33798 -62921 4721
12639 4721 61430 69916 24875 38335 17355 -41063 -27904 -5172 23713 -983 -13715 14264
12627 14264 69259 129555 97400 30594 34564 -26940 -22591 -39004 12988 35786 36382 40995 81328
12614 81328 62152 49020 -3568 -22736 3377 4736 76253 70006 8182 -18041 -71329 -25649
12602 -25649 -53937 -4079 6785 -71011 -39246 -18400 58832 89584 104675 42732 68651 70328
12590 70328 72342 12706 -10077 -57544 -50115 -6446 -289 971 44971 55606 14813 -7407
$$ packed form
12676G7918M077k615N200L9049m990n6031m7592O1704K1999q964j0168O7959o6387
12663H1159j30213J5085N0024L0884K3753J7832n9449m0226O7369j4571l1090
12652A0557j9952K2632L2158L9854k7783n5476M47O006o9k6857j5315k9123O7642
12639D721N6709Q486m5041J3460k0980n8418J3159K2732K8885k4696j2732K7979
12627A4264N4995O0296l2155o6806L970o1504M349j6413N1992K2798N96M613M0333
12614H1328j9176j3132n2588j9168K6113J359P1517o247o1824k6223n3288M5680
12602b5649k8288M9858J0864p7796L1765K0846P7232L0752J5091o1943K5919J677
12590G0328K014n9636k2783m7467P429M3669O157J260M4000J0635m0793k2220
$$ plain form
12578 -7407 3465 -20494 -40746 -21422 20602 41444 64942 40658 88374 1254 -106516 -40040
12566 -40040 41837 41807 -8476 12926 45863 18674 -26343 -19472 -58998 -84821 -42314 90385
12554 90385 84593 42906 101747 137857 -1229 -69356 -33009 15988 -3305 1248 34037 69112
12542 69112 120402 119230 144712 116119 67774 71827 34241 -15139 -13298 -47662 566 64668
12530 64668 58538 112473 146766 149486 119891 98087 107019 76909 55440 127676 103495 23928
12518 23928 953 17822 -7315 -45854 -38963 -15803 23305 23540 36391 31856 30105 38195 -11811
12505 -11811 -70712 55725 98117 157310 186576 143309 142779 121504 80797 54381 2876 -13523
12493 -13523 26070 74356 105592 123130 147916 115026 78631 75384 134075 186421 125635 48927
$$ packed form
12578g407J0872k3959k0252J9324M2024K0842K3498k4284M7716q7120j07770O6476
12566d0040Q1877l0n0283K1402L2937k7189m5017O871l9526k5823M2507J32699
12554I0385n792m1687N8841L6110j39086o8127L6347M8997j9293M553L2789L5075
12542F9112N1290j172K5482k8593m8345M053l7586m9380J841l4364M8228O4102
12530F4668o130N3935L4293K720k9595k1804Q932l0110k1469P2236k4181p9567
12518B3928k2975J6869k5137l8539O891K3160L9108K35J2851m535j751Q090n0006
12505a1811n8901J26437M2392N9193K9266m3267n30k1275m0707k6416n1505j6399
12493a3523L9593M8286L1236J7538K4786l2890l6395l247N8691N2346o0786p6708
$$ plain form
12481 48927 64394 16097 7029 -5308 49798 108851 115192 110199 55076 7507 60051 89876
12469 89876 29694 -52239 -8557 13713 20000 3511 28069 51478 18564 92264 190404 173832
12457 173832 134061 58886 49879 40854 -6441 -2323 124845 127129 104954 113358 101689 110161
12445 110161 127114 154780 157901 128889 97258 44983 13648 -14577 -46334 -15066 53678 128533
12433 128533 172180 127294 74185 14966 26312 17064 -56127 -31109 63942 107710 104541 102094
12421 102094 90144 49546 64960 -42337 -49608 22121 42372 31783 730 -41371 -100099
12410 -100099 -69776 10012 87451 86280 98739 137356 124436 132720 157167 113631 45208 32076
12398 32076 39241 32608 61873 103424 112778 13642 -38458 17353 53090 31378 -2438 -25645
$$ packed form
12481D8927J5467m8297r068j2337N5106N9053O341m993n5123m7569N2544K9825
12469H9876o0182q1933M3682K2270O287j6489K4558K3409l2914P3700R8140j6572
12457A73832l9771p5175r007r025m7295M118J27168K284k2175Q404j1669Q472
12445A10161J6953K7666L121k9012l1631n2275l1335k8225l1757L1268O8744P4855
12433A28533M3647m4886n3109n9219J1346r248p3191K5018R5051M3768l169k447
12421A02094j1950m0598J5414j07297p271P1729K0251j0589l1053m2101n8728
12410a00099L0323P9788P7439j171J2459L8617j2920Q284K4447m3536o8423j3132
12398C2076P165o633K9265M1551R354r9136n2100N5811L5737k1712l3816k3207
$$ plain form
12386 -25645 1196 88300 94617 64062 63176 111619 82747 72004 53368 75397 91911 103623
12374 103623 69264 76264 137928 153395 121576 54831 27236 32515 59393 69526 39150 35772
12362 35772 14871 20711 6859 17470 33505 3550 -63320 -49873 13472 10660 -4687 7710
12350 7710 -56380 -90394 -77826 -23269 17390 8762 30123 35357 61495 111722 83457 75631
12338 75631 48775 25820 -11700 -36020 -828 110093 139483 130965 111238 128082 91731 55956
12326 55956 56067 13197 50249 55226 87568 127650 148941 169010 160385 44200 44345 55946 100312
12313 100312 83897 15359 -56862 -98026 -57834 -25416 -28659 -58188 -66802 -37035 -54840 -83073
12301 -83073 20181 108402 87314 135594 157568 95840 53026 63222 27932 58882 93867
$$ packed form
12386b5645K6841Q7104O317l0555q86M8443k8872j0743j8636K2029J6514J1712
12374A03623l4359P000O1664J5467l1819o6745k7595N279K6878J0133l0376l378
12362C5772k0901N840j3852J0611J6035k9955o6870J3447O3345k812j5347J2397
12350G710o4090l4014J2568N4557M0659q628K1361N234K6138N0227k8265p826
12338G5631k6856k2955l7520k4320L5192J10921K9390q518j9727J6844l6351l5775
12326E5956J11m2870L7052M977L2342M0082K1291K0069q625j16185J45J1601M4366
12313A00312j6415o8538p2221m1164M0192L2418l243k9529q614K9767j7805k8233
12301h3073J03254Q8221k1088M8280K1974o1728m2814J0196l5290L0950L4985
$$ plain form
12290 93867 108359 144470 141816 125929 98010 36536 16686 46843 75516 69421 104307 73922
12278 73922 77352 58092 58731 112769 43846 25779 98679 135189 159140 178461 154556 100952
12266 100952 71989 75437 112883 114858 126143 99448 51217 -44457 -113778 -94227 -15093 13674
12254 13674 9421 11193 73572 113933 104713 110978 91633 117194 137456 134013 58856 55645 121992
12241 121992 94199 28063 50936 38078 9900 13166 56236 61856 60354 86310 136802 133445
12229 133445 107522 35670 1839 78915 132610 35398 34937 141525 222006 207220 94282
12218 94282 52683 38583 14433 17688 107877 80129 -7839 48095 122207 90374 65528 68222
12206 68222 39441 23660 73055 77509 94354 70103 3049 33499 21353 -25062 -20556 45722
$$ packed form
12290I3867J4492L6111k654j5887k7919o1474j9850L0157K8673o095L4886l0385
12278G3922L430j9260O39N4038o8923j8067P2900L6510K3951J9321k3905n3604
12266A00952k8963L448L7446J975J1285k6695m8231r5674o9321J9551P9134K8767
12254A3674m253J772O2379M0361r220O265j9345K5561K0262l443p5157l211O6347
12241A21992k7793o6136K2873j2858k8178L266M3070N620j502K5956N0492l357
12229A33445k5923p1852l3831P7076N3695r7212m61J06588Q0481j4786j12938
12218I4282m1599j4100k4150L255R0189k7748q7968N5934P4112l1833k4846K694
12206F8222k8781j5781M9395M454J6845k4251o7054L0450j2146m6415M506O6278
$$ plain form
12194 45722 24381 -30652 678 92772 67620 33342 84735 81893 121127 119549 99347 71307
12182 71307 74059 55999 151890 176813 146799 95255 79271 58239 97268 90055 71307 76093
12170 76093 98343 44660 28249 43612 63902 65967 105397 89149 79621 134112 172973 184225
12158 184225 113652 73530 177924 232524 155608 92189 31744 41531 28128 61902 71468 127202
12146 127202 130202 110078 36293 -12079 -16771 8650 38597 31796 -3388 5011 35731 68302
12134 68302 119024 77433 96628 58084 22512 20159 56192 78272 155632 126797 104776 63648
12122 63648 -862 24526 105018 119633 86419 -3805 10377 34792 11446 -13132 28597 104258
12110 104258 93456 94620 97166 78559 -34664 -89728 -35092 -34355 -29320 10833 91359 133013
$$ packed form
12194D5722k1341n5033L1330R2094k5152l4278N1393k842L9234j578k0202k8040
12182G1307K752j8060R5891K4923l0014n1544j5984k1032L9029p213j8748M786
12170G6093K2250n3683j6411J5363K0290K065L9430j6248r528N4491L8861J1252
12158A84225p0573m0122J04394N4600p6916o3419o0445R787j3403L3774R566N5734
12146A27202L000k0124p3785m8372m692K5421K9947o801l5184Q399L0720L2571
12134F8302N0722m1591J9195l8544l5572k353L6033K2080P7360k8835k2021m1128
12122F3648o4510K5388Q0492J4615l3214r0224J4182K4415k3346k4578M1729P5661
12110A04258j0802J164K546j8607j13223n5064N4636P37N035M0153Q0526M1654
$$ plain form
12098 133013 62828 24931 89014 122952 109890 74070 68174 40026 9580 68231 42894 26895
12086 26895 39088 4364 -9164 81599 113020 91215 43459 -45122 -31002 10031 37809 -1059
12074 -1059 -9579 -7603 -39987 -56266 -7411 78601 28783 52071 121164 63467 -14442 -36254
12062 -36254 22281 52740 17657 -62154 -85486 -17672 16515 84045 64065 50450 56626 90770
12050 90770 114739 98425 104198 160002 130932 74103 -3964 42772 95183 128853 179089 185110
12038 185110 195757 193356 183315 83053 65456 111329 139230 168792 183911 167841 193281
12027 193281 159578 100748 98372 140491 148488 167623 128238 110245 154303 159414 167681 137674
12015 137674 168739 158450 111233 47772 15692 39346 111832 125349 127447 136252 107850 103699
$$ packed form
12098A33013p0185l7897O4083L3938j3062l5820n896k8148l0446N8651k5337j5999
12086B6895J2193l4724j3528R0763L1421k1805m7756q8581J4120M1033K7778l8868
12074a059q520J976l2384j6279M8855Q6012m9818K3288O9093n7697p7909k1812
12062c6254N8535L0459l5083p9811k3332O7814L4187O7530j9980j3615O176L4144
12050I0770K3969j6314N773N5804k9070n6829p8067M6736N2411L3670N0236O021
12038A85110J0647k401j0041j00262j7597M5873K7901K9562J5119j6070K5440
12027A93281l3703n8830k376M2119P997J9135l9385j7993M4058N111Q267l0007
12015A37674L1065j0289m7217o3461l2080K3654P2486J3517K098Q805k8402m151
$$ plain form
12003 103699 71443 12063 -14947 -43972 -25392 23901 69676 78310 20748 91682 69702 83619
11991 83619 92604 53768 90719 57133 -1690 25174 -3594 45281 123014 184804 173369 112477
11979 112477 67601 59412 74506 36664 47453 65248 145676 164502 142708 136744 66662 70664
11967 70664 69259 33020 -32996 42637 154081 155291 144454 135806 93346 45123 98457 147048
11955 147048 109716 104762 131832 116144 84589 90630 89853 90220 81550 57886 44656 98291 120453
11942 120453 80160 119216 109315 124322 145888 148892 131950 101306 134774 143979 65105 16468
11930 16468 35555 84107 139093 162461 118568 83070 118597 94552 80186 99576 140724 198119
11918 198119 215991 220510 245346 289220 269306 270001 228481 150809 126439 129325 52956 38470
$$ packed form
12003A03699l2256n9380k7010k9025J8580M9293M5775Q634n7562P0934k1980J3917
11991H3619Q985l8836L6951l3586n8823K6864k8768M8875P7733O1790j1435o0892
11979A12477m4876q189J5094l7842J0789J7795Q0428J8826k1794n964p0082M002
11967G0664j405l6239o6016P5633J11444J210j0837q648m2460m8223N3334M8591
11955A47048l7332m954K7070j5688l1555O041p77L67q670k3664j3230N3635K2162
11942A20453m0293L9056r901J5007K1566L004j6942l0644L3468R205p8874m8637
11930A6468J9087M8552N4986K3368m3893l5498L5527k4045j4366J9390M1148N7395
11918A98119J7872M519K4836M3874j9914O95m1520p7672k4370K886p6369j4486
$$ plain form
11906 38470 37735 85873 79244 109663 143496 187894 167314 119465 115627 144500 170430 126015
11894 126015 76755 97943 112186 51906 48482 40437 113002 128713 110145 96405 85253 97843
11882 97843 97971 -754 16075 18258 1077 37899 133952 135438 112559 90917 56241 56253 100585
11869 100585 115206 138469 79120 12417 32481 112471 159286 206690 155935 100209 107587 132426
11857 132426 115892 70674 79529 105312 92464 52401 26677 33585 86933 187946 227870 167665
11845 167665 115596 137616 147301 155834 142474 136032 140069 131988 102158 136079 110045 124103
11833 124103 167295 154741 192501 190996 91215 24522 122962 175074 186603 151239 131926 154451
11821 154451 221913 227757 219118 210669 207989 158239 94994 103223 109230 54457 48574 33699 22409
$$ packed form
11906C8470p35M8138o629L0419L3833M4398k0580m7849l838K8873K5930m4415
11894A26015m9260K1188J4243o0280l424q045P2565J5711j8568j3740j1152J2590
11882I7843J28r8725J6829K183j7181L6822R6053J486k2879k1642l4676J2M4332
11869A00585J4621K3263n9349o6703K0064P9990M6815M7404n0755n5726P378K4839
11857A32426j6534m5218Q855K5783j2848m0063k5724O908N3348J01013L9924o0205
11845A67665n2069K2020R685Q533j3360o442M037q081k9830L3921k6034J4058
11833A24103M3192j2554L7760j505r9781o6693R8440N2112J1529l5364j9313K2525
11821A54451O7462N844q639q449k680m9750o3245Q229O007n4773n883j4875j1290
$$ plain form
11808 22409 119166 138855 160161 179601 152281 200494 190218 198113 199151 117225 46572 76910
11796 76910 9114 -17864 30718 72924 62521 -31329 11465 54408 70003 65118 84730 77256
11784 77256 81072 135226 183233 137663 99358 148076 161945 86902 83988 79765 -2468 -59004
11772 -59004 -78190 15963 123805 127971 174793 220703 228032 216942 215950 170753 77396 70239
11760 70239 124150 109344 53161 68529 68181 93869 173627 211031 225411 283780 320628 307748
11748 307748 264857 185935 147903 101108 45312 23271 66429 171051 235548 213554 166051
11737 166051 136597 143313 160202 173529 159710 149025 150271 163433 145753 144418 185184 147822
11725 147822 112101 134746 126115 99654 111737 63164 139177 193871 175965 133759 98228 103105
$$ packed form
11808B2409R6757J9689K1306J9440k7320M8213j0276P895J038q1926p0653L0338
11796G6910o7796k6978M8582M2206j0403r3850M2794M2943J5595m885J9612p474
11784G7256L816N4154M8007m5570l8305M8718J3869p5043k914m223q2233n6536
11772e9004j9186R4153J07842M166M6822M5910P329j1090r92m5197r3357p157
11760G0239N3911j4806n6183J5368l48K5688P9758L7404J4380N8369L6848j2880
11748C07748m2891p8922l8032m6795n5796k2041M3158J04622O4497k1994m7503
11737A66051k9454O716J6889J3327j3819j0685J246J3162j7680j335M0766l7362
11725A47822l5721K2645q631k6461J2083m8573P6013N4694j7906m2206l5531M877
$$ plain form
11713 103105 46407 99547 149024 114931 127798 141724 143505 149657 160207 239704 210127 197977
11701 197977 148034 113106 105084 96366 52287 73189 107615 31307 49393 119198 103147 83673
11689 83673 84407 183495 191202 177794 126996 145235 165078 188211 217850 140086 131773 234247
11677 234247 286369 220039 233551 251978 255836 251360 275360 227741 191879 162126 205486 227276
11665 227276 232267 221080 222637 211953 205768 225653 226334 178070 187059 209601 257167 287980 262826
11652 262826 339672 336771 299449 241952 231291 245659 253567 150690 178710 190639 179920 198248
11640 198248 234529 204183 233341 143971 52707 82221 150883 138110 159454 135254 130804 138234
11628 138234 122440 145060 201763 212614 195690 146528 107839 101974 75194 132759 182046 160840
$$ packed form
11713A03105n6698N3140M9477l4093J2867J3926J781O152J0550P9497k9577j2150
11701A97977m9943l4928q022q718m4079K0902L4426p6308J8086O9805j6051j9474
11689H3673P34R9088P707j3408n0798J8239J9843K3133K9639p7764q313J02474
11677B34247N2122o6330J3512J8427L858m476K4000m7619l5862k9753M3360K1790
11665B27276M991j1187J557j0684o185J9885O81m8264Q989K2542M7566L0813k5154
11652B62826P6846k901l7322n7497j0661J4368P908j02877K8020J1929j0719J8328
11640A98248L6281l0346K9158q9370r1264K9514O8662j2773K1344k4200m450P430
11628A38234j5794K2620N6703J0851j6924m9162l8689n865k6780N7565M9287k1206
$$ plain form
11616 160840 132841 118150 128534 158167 93478 106869 146978 177876 206779 107563 154023
11605 154023 184008 234537 266627 284918 328855 275033 194445 182315 135337 134742 189654 193329
11593 193329 173064 171884 235643 209398 151974 234803 329526 310827 252517 217812 215047 205282
11581 205282 178486 196454 247339 294687 323682 287206 167925 104468 135688 154888 146996
11570 146996 171281 187331 206838 196298 187810 218691 243223 269862 324186 328910 364364 326539
11558 326539 286573 302222 267768 166763 194256 234103 275816 240851 258289 317220 243915
11547 243915 280866 312429 258392 173516 191362 209668 235181 280074 325375 304264 295095 243616
11535 243616 259510 296683 314323 341119 350685 413034 507803 642540 877982 1100538 1343315
$$ packed form
11616A60840k7999j4691J0384K9633o4689J3391M0109L0898K8903r9216M6460
11605A54023K9985N0529L2090J8291M3937n3822q0588j2130m6978n95N4912L675
11593A93329k0265j180O3759k6245n7424Q2829R4723j8699n8310l4705k765r765
11581B05282k6796J7968N0885M7348K8995l6476j19281o3457L1220J9200p892
11570A46996K4285J6050J9507j0540q488L0881K4532K6639N4324M724L5454l7825
11558C26539l9966J5649l4454j01005K7493L9847M1713l4965J7438N8931p3305
11547B43915L6951L1563n4037q4876J7846J8306K5513M4893M5301k1111r169n1479
11535B43616J5894L7173J7640K6796R566O2349R4769J34737K35442K22556K42777
$$ plain form
11524 1343315 1580951 1727752 1726592 1642343 1474996 1217976 953550 785663 652316 560775
11514 560775 504592 401138 366802 344606 333453 378071 345720 244643 210192 177794 194750
11503 194750 232669 216159 191341 198628 183936 235102 262113 315215 331726 342178 362202 336522
11491 336522 306237 260354 200929 265944 338678 347599 326552 309589 345398 369024 306148 272610
11479 272610 266966 219114 218354 250323 254431 275682 265605 295647 244040 216489 127084 106557
11467 106557 163370 254179 297891 263241 241905 282951 314809 365889 356322 371961 408010 383443
11455 383443 367712 368250 398971 343121 274129 218635 225674 220631 217801 247008 263591 229772
11443 229772 261150 341958 355413 329033 354115 365339 316205 312364 296317 288767 279446 342283
$$ packed form
11524A343315K37636J46801j160q4249j67347k57020k64426j67887j33347r1541
11514E60775n6183j03454l4336k2196j1153M4618l2351j01077l4451l2398J6956
11503A94750L7919j6510k4818P287j4692N1166K7011N3102J6511J0452K0024k5680
11491C36522l0285m5883n9425O5015P2734Q921k1047j6963L5809K3626o2876l3538
11479B72610n644m7852p60L1969M108K1251j0077L0042n1607k7551q9405k0527
11467A06557N6813R0809M3712l4650k1336M1046L1858N1080r567J5639L6049k4567
11455C83443j5731N38L0721n5850o8992n5494P039n043k830K9207J6583l3819
11443B29772L1378Q0808J3455k6380K5082J1224m9134l841j6047p550r321O2837
$$ plain form
11431 342283 373391 379524 359938 383656 416253 452072 442857 418832 436896 396734 346313 326498
11419 326498 311403 290570 309943 306200 207027 248274 293645 333588 351339 334435 285963 302410
11407 302410 287187 278102 336368 455357 445584 400559 369453 321137 252884 283374 372626 385050
11395 385050 360655 350944 345748 349554 347578 375101 386572 392493 397524 353911 347493 285126 245992
11382 245992 241808 274962 358431 362559 365010 386705 408246 455651 557712 549605 433513 370924
11370 370924 432063 464080 439006 405013 434849 423053 431597 348481 270655 311573 297154 296438
11358 296438 373688 463331 476489 389605 327367 402202 484914 451975 391377 380419 371284 330257
11346 330257 338190 356398 370076 430851 451555 445326 505526 451175 430162 426058 349456 300670
$$ packed form
11431C42283L1108O133j9586K3718L2597L5819r215k4025J8064m0162n0421j9815
11419C26498j5095k0833J9373l743r9173M1247M5371L9943J7751j6904m8472J6447
11407C02410j5223r085N8266J18989r773m5025l1106m8316o8253L0490Q9252J2424
11395C85050k4395r711n196L806j976K7523J1471N921N031m3613o418o2367l9134
11382B45992m184L3154Q3469M128K451K1695K1541M7405J02061q107j16092o2589
11370C70924O1139L2017k5074l3993K9836j1796Q544q3116p7826M0918j4419p16
11358B96438P7250Q9643J3158q6884o2238P4835Q2712l2939o0598j0958r135m1027
11346C30257P933J8208J3678O0775K0704o229O0200n4351k1013m104p6602m8786
$$ plain form
11334 300670 349914 406548 421472 447163 441520 434991 423797 425390 463541 498036 476166 489897
11322 489897 467316 461025 490100 554703 556899 591206 556311 474981 435612 430199 437069 503819
11310 503819 585485 633149 614761 587764 564722 602551 659744 634864 494330 440729 523053
11299 523053 528914 513314 462279 467857 530759 549786 500213 643899 701767 697009 689451 621407
11287 621407 648806 700974 595011 516044 544207 601904 636737 633992 605672 642000 717901
11276 717901 811756 815554 846399 775084 703583 701084 714459 642120 580122 568930 572092 621772
11264 621772 701590 662032 680138 623431 661997 696078 725177 713094 687705 713406 722354 789471
11252 789471 859974 877605 777283 664761 663629 666495 573117 576182 560726 567261 575496 634650
$$ packed form
11334C00670M9244N6634J4924K5691n643o529j1194J593L8151L4495k1870J3731
11322D89897k2581o291K9075O4603K196L4307l4895q1330l9369n413O870O6750
11310E03819Q1666M7664j8388k6997k3042L7829N7193k4880j40534n3601Q2324
11299E23053N861j5600n1035N578O2902J9027m9573J43686N7868m758p558o8044
11287F21407K7399N2168j05963p8967K8163N7697L4833k745k8320L6328P5901
11276G17901R3855L798L0845p1315p1501k499J3375p2339o1998j1192L162M9680
11264F21772P9818l9558J8106n6707L8566L4081K9099j2083k5389K5701Q948O7117
11252G89471P0503J7631j00322j12522j132K866r3378L065j5456O535Q235N9154
$$ plain form
11240 634650 630598 650039 750514 830689 825716 844018 806767 847008 936473 947693 878910 890740
11228 890740 909363 881008 865722 886104 890849 915622 940112 923350 930060 981926 950603 991159
11216 991159 1055196 1037692 1067708 1129740 1160479 1239797 1238411 1223493 1251873 1300352 1343249 1434525
11204 1434525 1500563 1588448 1694170 1824002 1929844 2059147 2081390 2074263 2054636 2031885 1913453
11193 1913453 1838894 1747999 1623473 1614103 1606499 1666826 1719709 1714761 1790960 1741081 1557588
11182 1557588 1506804 1558521 1621168 1621710 1685259 1756105 1764215 1747807 1823663 1934123 1982952 2031859
11170 2031859 2128077 2236415 2380216 2412331 2545307 2646093 2780543 2987730 3066683 3079689
11160 3079689 3144466 3262920 3365779 3429022 3489358 3649237 3913202 4083494 4271420 4545019
$$ packed form
11240F34650m052J9441J00475Q0175m973J8302l7251M0241Q9465J1220o8783J1830
11228H90740J8623k8355j5286K0382M745K4773K4490j6762O710N1866l1323M0556
11216I91159O4037j7504L0016O2032L0739P9318j386j4918K8380M8479M2897R1276
11204A434525O6038Q7885J05722J29832J05842J29303K2243p127j9627k2751j18432
11193A913453p4559r0895j24526r370p604O0327N2883m948P6199m9879j83493
11182A557588n0784N1717O2647N42O3549P0846Q110j6408P5856J10460M8829M8907
11170B031859R6218J08338J43801L2115J32976J00786J34450K07187P8953J3006
11160C079689O4777J18454J02859O3243O0336J59879K63965J70292J87926K73599
$$ plain form
11150 4545019 4852780 5183554 5688933 6405753 7232792 8237639 9418440 10580318 11562155
11141 11562155 12397132 12955085 13276900 13461611 13586524 13978272 14699767 15965369 17819893
11132 17819893 20325580 23715884 28146105 34061835 42094099 53413967 69882186 94788738
11124 94788738 132483845 182207921 229472963 259434463 270957556 271157031 256581436
11117 256581436 221474123 171736993 123353961 85415680 59453616 43201487 33057175
11110 33057175 26261001 21272320 17378476 14313597 11855883 9868331 8240161 6939683
11102 6939683 5876752 5101835 4519815 4077111 3730611 3369443 3015360 2585424 2113057
11093 2113057 1685622 1312240 951591 775742 690594 558876 405003 269768 171718 70120
$$ packed form
11150D545019L07761L30774N05379P16820Q27039J004847J180801J161878R81837
11141A1562155Q34977N57953L21815J84711J24913L91748P21495J265602J854524
11132A7819893K505687L390304M430221N915730Q032264J1319868J6468219K4906552
11124I4788738L7695107M9724076M7265042K9961500J1523093J99475j4575595
11117B56581436l5107313m9737130m8383032l7938281k5962064j6252129j0144312
11110C3057175o796174m988681l893844l064879k457714j987552j628170j300478
11102F939683j062931p74917n82020m42704l46500l61168l54083m29936m72367
11093B113057m27435l73382l60649j75849q5148j31718j53873j35235r8050j01598
$$ plain form
11083 70120 -36731 -61638 -172845 -332322 -446077 -449334 -477702 -462997 -429857 -450881 -490999
11072 -490999 -484761 -509100 -522601 -497543 -487614 -515411 -443317 -378840 -381941 -413927 -409905 -397627
11060 -397627 -449384 -470287 -489356 -473749 -421847 -434489 -461853 -435655 -444641 -441123 -424014 -440768
11048 -440768 -478701 -519578 -489159 -449917 -437625 -429817 -413640 -467393 -446396 -420353 -387617 -388465
11036 -388465 -443113 -461131 -413988 -344310 -377420 -412337 -402336 -429587 -402155 -432152 -475680
11025 -475680 -478269 -461097 -449276 -470599 -487998 -429977 -424905 -438352 -444546 -404296 -412013 -364538
11013 -364538 -291091 -253047 -359555 -465653 -505976 -454958 -398100 -305546 -243826 -246374 -272232
11002 -272232 -243001 -254609 -214940 -185840 -165943 -65646 -6417 19019 19626 -76217 -56597 -47318
$$ packed form
11083G0120j06851k4907j11207j59477j13755l257k8368J4705L3140k1024m0118
11072d90999O238k4339j3501K5058R929k7797P2094O4477l101l1986M022J2278
11060c97627n1757k0903j9069J5607N1902j2642k7364K6198q986L518J7109j6754
11048d40768l7933m0877L0419L9242J2292P808J6177n3753K0997K6043L2736q48
11036c88465n4648j8018M7143O9678l3110l4917J0001k7251K7432k9997m3528
11025d75680k589J7172J1821k1323j7399N8021N072j3447o194M0250p717M7475
11013c64538P3447L8044j06508j06098m0323N1018N6858R2554O1720k548k5858
11002b72232K9231j1608L9669K9100J9897J00297N9229K5436O07r5843J9620R279
$$ plain form
10990 -47318 -121888 -238652 -290376 -278748 -301423 -356326 -361704 -274578 -229895 -236397 -232110 -233211
10978 -233211 -275633 -257685 -276907 -298112 -278277 -216159 -163204 -184807 -216858 -282029 -335098
10967 -335098 -334295 -342434 -367965 -368017 -362261 -313441 -290716 -334166 -359575 -373685 -366773 -356654 -381535
10954 -381535 -317199 -305352 -286423 -262378 -232939 -204098 -160863 -150505 -157554 -180401 -246712 -239532
10942 -239532 -263663 -270181 -263571 -275475 -265495 -224771 -254060 -276993 -291712 -311024 -300946 -255572
10930 -255572 -220194 -198104 -202158 -273417 -268657 -240755 -197528 -176545 -194228 -173581 -79190 -31164
10918 -31164 -81079 -150172 -144646 -154151 -214828 -237605 -218061 -271090 -269448 -212469 -241937 -235000
10906 -235000 -153762 -75173 -67625 -139727 -190589 -186740 -192241 -150873 -61905 -42237 -68958 -133087
$$ packed form
10990d7318p4570j16764n1724J1628k2675n4903n378Q7126M4683o502M287j101
10978b33211m2422J7948j9222k1205J9835O2118N2955k1603l2051o5171n3069
10967c35098Q03q139k5531n2N756M8820K2725m3450k5409j4110O912J0119k4881
10954c81535O4336J1847J8929K4045K9439K8841M3235J0358p049k2847o6311P180
10942b39532k4131o518O610j1904R980M0724k9289k2933j4719j9312J0078M5374
10930b55572L5378K2090m054p1259M760K7902M3227K0983j7683K0647R4391M8026
10918c1164m9915o9093N526r505o0677k2777J9544n3029J642N6979k9468O937
10906b35000Q1238P8589P548p2102n0862L849n501M1368Q8968J9668k6721o4129
$$ plain form
10894 -133087 -191733 -242637 -140378 -133684 -196279 -167516 -142679 -148550 -181407 -179871 -171600 -76728
10882 -76728 -60169 -115517 -127115 -148776 -121276 -142324 -127495 -87240 -84671 -46526 -15486 -42751
10870 -42751 -51603 -126658 -120870 -99533 21719 49601 22645 -27122 -101926 -126660 -132849 -102885
10858 -102885 -83618 -85759 -58009 -67481 -105908 -97565 -38717 -47018 -100726 -202991 -170468 -87640
10846 -87640 -34817 -16769 -15236 -4918 -1869 -12538 -27487 -54133 -51578 -1674 -66089 -99120
10834 -99120 -51247 -55942 -49495 -31864 -29570 13800 -67825 -145978 -114440 -124164 -181978 -235194
10822 -235194 -230136 -118988 -2183 -9673 -52173 -113978 -178606 -125820 -112040 -81795 -100526
10811 -100526 -99452 -55552 -62186 -61521 -74861 -57368 -51883 -71660 -83065 -44909 -22204 -15273 -2560
$$ packed form
10894a33087n8646n0904J02259O694o2595K8763K4837n871l2857J536Q271R4872
10882g6728J6559n5348j1598k1661K7500k1048J4829M0255K569L8145L1040k7265
10870d2751q852p5055N788K1337J21252K7882k6956m9767p4804k4734o189K9964
10858a02885J9267k141K7750r472l8427Q343N8848q301n3708j02265L2523Q2828
10846h7640N2823J8048J533J0318L049j0669j4949k6646K555M9904o4415l3031
10834i9120M7873m695O447J7631K294M3370q1625p8153L1538r724n7814n3216
10822b35194N058J11148J16805p490m2500o1805o4628N2786J3780L0245j8731
10811a00526J074M3900o634O65j3340J7493N485j9777j1405L8156K2705O931J2713
$$ plain form
10798 -2560 -2944 15123 22484 -40071 -83231 -78177 -40346 41630 59824 57165 55383 -2399 55914
10785 55914 70807 68528 9292 -45744 33304 75902 105040 110365 91402 72425 26059 39189
10773 39189 18920 -39735 -26629 78145 81756 78737 49389 13828 -52655 -76872 -66126 -13439
10761 -13439 211 -23021 11998 20596 12295 -11667 -77287 -50883 -13774 -33839 -52850 -50340
10749 -50340 24411 41728 13020 -43115 -103021 -118595 -93974 -1365 -36367 -8731 50947 65840
10737 65840 133829 122666 73886 81488 103466 106067 118233 110906 158730 125879 124277 105025
10725 105025 106245 126316 82665 118872 150350 218644 229820 319158 470126 619866 904075
10714 904075 1247906 1437587 1481769 1467053 1381223 1218100 911458 665229 426329 268140
$$ packed form
10798b560l84J8067P361o2555m3160N054L7831Q1976J8194k659j782n7782N8313
10785E5914J4893k279n9236n5036P9048M2598K9138N325j8963j8977m6366J3130
10773C9189k0269n8655J3106J04774L611l019k9348l5561o6483k4217J0746N2687
10761a3439J3650k3232L5019Q598q301k3962o5620K6404L7109k0065j9011K510
10749e0340P4751J7317k8708n6135n9906j5574K4621R2609l5002K7636N9678J4893
10737F5840O7989j1163m8780P602K1978K601J2166p327M7824l2851j602j9252
10725A05025J220K0071m3651L6207L1478O8294J1176Q9338J50968J49740K84209
10714I04075L43831J89681M4182j4716q5830j63123l06642k46229k38900j58189
$$ plain form
10704 268140 216024 166528 200654 214926 225334 271799 209082 81005 46379 70165 69749 40949
10692 40949 8804 14048 31502 111707 99647 113658 114588 148644 127937 130041 189325 185128 154091
10679 154091 125237 53570 55698 54287 62013 29797 53832 93281 40063 -33995 65657 134298
10667 134298 120446 63773 -30101 -30754 -5066 31495 91692 156752 197903 144321 86541 89152
10655 89152 75771 63236 48652 103869 101741 131213 156687 100951 114536 141455 52616 14949
10643 14949 17902 11859 88965 179555 167055 57403 12015 64344 84415 67413 -1268 -15409
10631 -15409 -62300 -20556 26555 103428 100940 166049 162115 189596 224493 132904 125541 138970
10619 138970 140647 174280 224218 203697 151238 84390 78639 62014 80668 101093 77848 80443
$$ packed form
10704B68140n2116m9496L4126J4272J0408M6465o2717j28077l4626K3786m16k8800
10692D0949l2145N244J7454Q0205j2060J4011R30L4056k0707K104N9284m197l1037
10679A54091k8854p1667K128j411P726l2216K4035L9449n3218p4058R9652O8641
10667A34298j3852n6673r3874o53K5688L6561O0197O5060M1151n3582n7780K611
10655H9152j3381j2535j4584N5217k128K9472K5474n5736J3585K6919q8839l7667
10643A4949K953o043P7106R0590j2500j09652m5388N2329K0071j7002o8681j4141
10631a5409m6891M1744M7111P6873k488O5109l934K7481L4897r1589p363J3429
10619A38970J677L3633M9938k0521n2459o6848n751j6625J8654K0425k3245K595
$$ plain form
10607 80443 83708 85144 71901 98498 139276 109973 106005 146816 116284 90972 104397 177187
10595 177187 223586 211394 187101 124654 202779 225786 158002 166528 123377 129092 142270 154524
10583 154524 165737 68684 70561 96527 125943 175687 162845 129130 130905 158134 125168 125196
10571 125196 143694 162122 151289 180255 129911 119464 82631 68371 121151 123782 141067 184597
10559 184597 226367 240328 180732 148770 120199 202516 220055 148971 42965 -22466 30835
10548 30835 70932 118849 148111 202666 190187 177217 191709 199910 229258 244511 232021 227209
10536 227209 205641 185522 132625 153098 162001 101636 153333 138295 122347 65680 39939 65783
10524 65783 81703 103721 152536 118000 70813 117556 199383 183954 126168 164562 252886 225858
$$ packed form
10607H0443L265J436j3243K6597M0778k9303l968M0811l0532k5312J3425P2790
10595A77187M6399j2192k4293o2447P8125K3007o7784Q526m3151N715J3178J2254
10583A54524J1213r7053J877K5966K9416M9744j2842l3715J775K7229l2966K8
10571A25196J8498J8428j0833K8966n0344j0447l6833j4260N2780K631J7285M3530
10559A84597M1770J3961n9596l1962k8571Q2317J7539p1084j06006o5431N3301
10548C0835M0097M7917K9262N4555j2479j2970J4492Q201K9348J5253j2490m812
10536B27209k1568k0119n2897K0473Q903o0365N1697j5038j5948n6667k5741K5844
10524F5783J5920K2018M8815l4536m7187M6743Q1827j5429n7786L8394Q8324k7028
$$ plain form
10512 225858 197284 195129 201696 182732 85592 77983 23833 20391 43032 36743 74329 106791
10500 106791 163690 145503 151945 105314 111443 149109 110479 30764 38740 128379 174451 194548
10488 194548 111204 96110 86340 24039 34937 84903 114156 116213 86026 64041 84326 123710
10476 123710 199739 164852 170716 151587 161306 125697 96629 67599 23411 -33717 -7207 1935
10464 1935 35276 52621 34112 7360 47134 56402 57261 30515 2533 38335 102792 134760
10452 134760 163798 165519 165359 212172 196462 104471 83528 150665 155711 130274 127009 147631
10440 147631 171365 156874 111249 49879 109748 180557 162619 134606 151670 204269 188272
10429 188272 147857 137466 158776 171824 95958 97594 147081 121745 89125 68494 59537 37260
$$ packed form
10512B25858k8574k155O567j8964r7140p609n4150l442K2641o289L7586L2462
10500A06791N6899j8187O442m6631O129L7666l8630p9715P976Q9639M6072K0097
10488A94548q3344j5094r770o2301J0898M9966K9253K057l0187k1985K0285L9384
10476A23710P6029l4887N864j9129R719l5609k9068k9030m4188n7128K6510R142
10464A935L3341J7345j8509k6752L9774R268Q59k6746k7982L5802O4457L1968
10452A34760K9038J721j60M6813j5710r1991k0943O7137N046k5437l265K0622
10440A47631K3734j4491m5625o1370N9869P0809j7938k8013J7064N2599j5997
10429A88272m0415j0391K1310J3048p5866J636M9487k5336l2620k0631q957k2277
$$ plain form
10417 37260 46031 113033 167143 211881 204711 200813 217344 193231 203877 252776 248354 206667
10405 206667 209795 264563 202798 111773 77677 119925 148198 184664 230011 236981 200765 216632
10393 216632 263940 237018 240200 219661 214078 168218 73170 71534 156866 164556 88096 94206
10381 94206 90304 62835 47669 50204 23799 74836 133348 166761 180550 186469 127534 97304
10369 97304 106071 96966 29413 59148 107310 149632 116919 108038 162867 214103 176824 90049
10357 90049 76552 78270 71317 51827 67566 104376 120689 80274 122544 131599 163606 181855
10345 181855 159009 89804 151286 242103 239453 159540 113820 111746 136429 141709 174984 216305
10333 216305 181855 171707 141691 152054 169374 207133 236540 209462 156708 131224 155650
$$ packed form
10417C7260Q771O7002N4110M4738p170l898J6531k4113J0646M8899m422m1687
10405B06667L128N4768o1765r1025l4096M2248K8273L6466M5347O970l6216J5867
10393B16632M7308k6922L182k0539n583m5860r5048j636Q5332P690p6460O110
10381I4206l902k7469j5166K535k6405N1037N8512L3413J3789N919n8935l0230
10369I7304Q767r105o7553K9735M8162M2322l2713q881N4829N1236l7279q6775
10357I0049j3497J718o953j9490J5739L6810J6313m0415M2270R055L2007J8249
10345A81855k2846o9205O1482R0817k650p9913m5720k074K4683N280L3275M1321
10333B16305l4450j0148l0016J0363J7320L7759K9407k7078n2754k5484K4426
$$ plain form
10322 155650 162488 186046 186978 239084 243985 168856 123071 145973 199046 237056 240925 198440
10310 198440 193741 185123 165718 229415 282341 356902 391057 303876 213153 160048 200253 216217
10298 216217 168522 98245 132800 186169 221300 288653 323896 315102 234330 160083 134784 211063
10286 211063 296242 262973 177905 165682 127966 73501 75034 199593 203973 208602 170742 117240
10274 117240 142785 171789 158861 170786 170402 131796 87967 101923 167267 180348 158837 97086
10262 97086 61787 102679 101148 119782 98215 63843 67923 127380 214262 183634 190525 218703
10250 218703 244746 303796 255845 228347 181687 99242 23449 28693 27746 102143 110400 99874
10238 99874 84374 130827 178608 250278 294918 298846 301695 292074 175429 179124 197401 170103
$$ packed form
10322A55650O838K3558R32N2106M901p5129m5785K2902N3073L8010L869m2485
10310A98440m699q618j9405O3697N2926P4561L4155q7181r0723n3105M0205J5964
10298B16217m7695p0277L4555N3369L5131O7353L5243q794q0772p4247k5299P6279
10286B11063Q5179l3269q5068j2223l7716n4465J533J24559M380M629l7860n3502
10274A17240K5545K9004j2928J1925l84l8606m3829J3956O5344J3081k1511o1751
10262I7086l5299M0892j531J8634k1567l4372M080N9457Q6882l0628O891K8178
10250B18703K6043N9050m7951k7498m6660q2445p5793N244r47P4397Q257j0526
10238I9874j5500M6453M7781P1670M4640L928K849r621j16645L695J8277k7298
$$ plain form
10226 170103 136093 140163 135932 180084 152968 108570 116430 114452 159615 168102 114064 74664
10214 74664 68528 103242 132723 108366 71777 135810 178500 118919 165709 205132 173455 170822
10202 170822 222991 211936 120947 130482 181287 183082 205263 157097 90194 136064 114809 171047
10190 171047 175178 142970 150184 154074 165180 193317 212944 179621 124643 39413 -42401 8739
10178 8739 89143 127078 122158 140577 204437 207555 185602 141257 160567 229209 270368 282251
10166 282251 249548 229231 149870 86919 66830 58629 113633 122499 215126 253500 208067 156104
10154 156104 97284 114884 172714 137414 124379 136438 192744 140966 85216 91411 187116 173570
10142 173570 138087 105358 57919 91533 86494 142749 171315 98581 45820 53096 55751 116706
$$ packed form
10226A70103l4010M070m231M4152k7116m4398P860j978M5163Q487n4038l9400
10214G4664o136L4714K9481k4357l6589O4033M2690n9581M6790L9423l1677k633
10202A70822N2169j1055r0989R535N0805J795K2181m8166o6903M5870k1255N6238
10190A71047M131l2208P214L890J1106K8137J9627l3323n4978q5230q1814N1140
10178H739Q0404L7935m920J8419O3860L118k1953m4345J9310O8642M1159J1883
10166B82251l2703k0317p9361o2951k0089q201N5004Q866R2627L8374m5433n1963
10154A56104n8820J7600N7830l5300j3035J2059N6306n1778n5750O195R5705j3546
10142A73570l5483l2729m7439L3614n039N6255K8566p2734n2761P276K655O0955
$$ plain form
10130 116706 151655 131325 153742 148450 131510 120411 104203 140786 141513 99810 45953 45950 68660
10117 68660 81314 68138 109788 49631 12335 66384 69666 156959 141395 97712 17617 22128
10105 22128 117957 167496 185254 189366 184325 129641 84029 67381 40058 59451 114758 91165
10093 91165 50637 142230 157208 112598 119227 140918 182697 249780 218514 131781 97889 92650
10081 92650 104293 90313 92165 125501 191447 240835 222347 148790 153264 136869 107405 106430
10069 106430 88110 73917 120546 160070 134352 88716 97081 92079 108869 107462 99713 75847
10057 75847 103080 110967 145809 190343 144097 107460 133545 163471 164855 127034 141679 130393
10045 130393 71759 62509 89129 67189 94520 87755 86158 63036 27480 67306 122223 146964
$$ packed form
10130A16706L4949k0330K2417n292j6940j1099j6208L6583P27m1703n3857lK2710
10117F8660J2654j3176M1650o0157l7296N4049L282Q7293j5564m3683q0095M511
10105B2128R5829M9539J7758M112n041n4684m5612j6648k7323J9393N5307k3593
10093I1165m0528R1593J4978m4610O629K1691M1779O7083l1266q6733l3892n239
10081I2650J1643j3980J852L3336O5946M9388j8488p3557M474j6395k9464r75
10069A06430j8320j4193M6629L9524k5718m5636Q365n002J6790j407p749k3866
10057G5847K7233P887L4842M4534m6246l6637K6085K9926J384l7821J4645j1286
10045A30393n8634r250K6620k1940K7331o765j597k3122l5556L9826N4917K4741
$$ plain form
10033 146964 166699 142554 121249 68332 45524 88162 83412 26911 99136 121635 55467 87110
10021 87110 144517 132677 120808 77463 58964 108213 158728 191950 121869 49798 63698 63855
10009 63855 79208 132351 169745 209529 181574 194034 155200 134024 72854 107497 90658 -5913
9997 -5913 -17154 19665 65100 56287 71533 75414 31828 42056 118927 139740 129667 178826
9985 178826 156548 152774 212262 185477 215809 201300 187110 164801 117718 92046 36769 60091
9973 60091 51291 3470 22448 63100 82970 91052 84434 67785 118790 137533 134056 95253 94259
9960 94259 127962 138420 159599 216656 219296 178509 188211 188466 182464 159378 179263 253593 368780
9947 368780 484101 702178 906955 916788 762290 565305 389865 312080 217232 154819 96392
$$ packed form
10033A46964J9735k4145k1305n2917k2808M2638m750n6501P2225K2499o6168L1643
10021H7110N7407j1840j1869m3345j8499M9249N0515L3222p0081p2071J3900J57
10009F3855J5353N3143L7394L9784k7955J2460l8834k1176o1170L4643j6839r6571
9997e913j1241L6819M5435q813J5246L881m3586J0228P6871K0813j0073M9159
9985A78826k2278l774N9488k6785L0332j4509j4190k2309m7083k5672n5277K3322
9973F0091q800m7821J8978M0652J9870Q082o618j6649N1005J8743l477l8803r94
9960I4259L3703J0458K1179N7057K640m0787R702K55o002k3086J9885P4330J15187
9947C68780J15321K18077K04777R833j54498j96985j75440p7785r4848o2413n8427
$$ plain form
9936 96392 59483 28768 94302 109752 101260 66841 54078 55396 26392 9105 46272 110475
9924 110475 116890 81261 33762 4200 -22285 -115607 -106080 41940 144669 92688 69616 84849
9912 84849 79658 32399 55688 16296 -55961 -4015 954 -7298 9231 -15471 -56396 -49135 -40847
9899 -40847 35720 115419 204660 259995 263990 279224 274179 218736 178556 188155 197852 211691 183454
9886 183454 127758 126700 84430 12140 5955 37117 8238 8979 34126 33534 14241 54964 42535
9873 42535 40804 55190 98594 108906 86722 87983 78486 57386 -7105 -20622 49287 55326 65179
9860 65179 114244 154837 173636 168619 145254 75599 19156 4632 -688 113182 197486 231623
9848 231623 248361 142947 113307 129692 232476 271101 268921 257133 143620 100027 185004
$$ packed form
9936I6392l6909l0715O5534J5450q492l4419j2763J318k9004j7287L7167O4203
9924A10475O415l5629m7499k9562k6485r3322R527J48020J02729n1981k3072J5233
9912H4849n191m7259K3289l9392p2257N1946M969q252J6529k4702m0925P261Q288
9899d0847P6567P9699Q9241N5335L995J5234n045n5443m0180R599R697J3839k8237
9886A83454n5696j058m2270p2290o185L1162k8879P41K5147n92j9293M0723j2429
9873D2535j731J4386M3404J0312k2184J261r497k1100o4491j3517O9909O039R853
9860F5179M9065M0593J8799n017k3365o9655n6443j4524n320J13870Q4304L4137
9848B31623J6738j05414k9640J6385J02784L8625k180j1788j13513m3593Q4977
$$ plain form
9837 185004 176601 186950 221289 201727 194451 120048 149948 140902 149102 132453 107653 30357
9825 30357 -29212 16788 57947 23449 42735 3126 -6827 13730 55699 105684 177313 176376
9813 176376 125970 97921 83414 43448 68624 70096 35556 8290 -39619 -118342 -145551 -103429
9801 -103429 -62433 -14113 26116 61492 79873 107717 107646 85880 91198 30586 40708 96664
9789 96664 -26938 -48830 -6278 31152 50116 47923 11846 -48085 -12100 -46126 -38735 -33121
9777 -33121 8665 27853 35130 3280 30137 55292 66350 -5372 24908 69912 20294 -22132
9765 -22132 24180 -7585 45473 88562 138540 120728 108175 107017 131448 141290 95429 -19765
9753 -19765 -14588 2353 38196 -17084 -56422 -116831 -104670 -77518 -3481 1625 7876 54197
$$ packed form
9837A85004q403J0349L4339j9562p276p4403K9900r046Q200j6649k4800p7296
9825C0357n9569M6000M1159l4498J9286l9609r953K0557M1969M9985P1629r37
9813A76376n0406k8049j4507l9966K5176J472l4540k7266m7909p8723k7209M2122
9801a03429M0996M8320M0229L5376J8381K7844p1k1766N318o0612J0122N5956
9789I6664j23602k1892M2552L7430J8964k193l6077n9931L5985l4026P391N614
9777c3121M1786J9188P277l1850K6857K5155J1058p1722L0280M5004m9618m2426
9765b2132M6312l1765N3058M3089M9978j7812j2553j158K4431R842m5861j15194
9753a9765N177J6941L5843n5280l9338o0409J2161K7152P4037N106O251M6321
$$ plain form
9741 54197 107465 94901 94509 79741 84306 93042 69480 90459 66899 63269 33271 23933 69730
9728 69730 59496 78595 120625 88872 67542 33482 25629 98948 124337 85557 88466 132367
9716 132367 174804 81768 32264 28412 -14558 -2806 118596 92583 83997 69971 109289 129992
9704 129992 72409 55154 39778 18769 66070 51920 -12902 -40858 33146 125319 143248 97272
9692 97272 26455 -79255 -46684 20039 51614 92253 127698 141889 90027 76039 80469 39185
9680 39185 39633 69906 33128 -21510 -8708 109139 181725 109915 98942 65088 10416 -8306
9668 -8306 15210 94520 83891 87513 15797 3519 31195 52870 106600 85788 14158 21207
9656 21207 59 34719 29763 19696 27583 -23868 -8957 -18176 -1760 89602 76410 19345
$$ packed form
9741E4197N3268j2564l92j4768M565Q736k3562K0979k3560l630k9998r338M5797
9728F9730j0234J9099M2030l1753k1330l4060p853P3319K5389l8780K909M3901
9716A32367M2437r3036m9504l852m2970J1752J21402k6013q586j4026L9318K0703
9704A29992n7583j7255j5376k1009M7301j4150o4822k7956P4004R2173J7929m5976
9692I7272p0817j05710L2571O6723L1575M0639L5445J4191n1862j3988M430m1284
9680C9185M48L0273l6778n4638J2802J17847P2586p1810j0973l3854n4672j8722
9668h306K3516P9310j0629L622p1716j2278K7676K1675N3730k0812p1630P049
9656B1207k1148L4660m956j0067P887n1451J4911r219J6416R1362j3192n7065
$$ plain form
9644 19345 -16115 -37992 5127 59362 133337 207854 199969 145455 109667 124264 128905 71148
9632 71148 -85116 -87223 22856 53157 78485 122768 20958 -90481 -60594 -51191 -49755 -73696
9620 -73696 -48269 -26430 -55378 -86337 -38942 -450 -17343 -3822 76395 85710 59433 77174
9608 77174 87151 -14362 -15833 40017 -1319 -27558 -38398 -39871 3860 119709 154128 112451
9596 112451 81492 136165 129571 150546 101675 75353 59445 27338 62454 50951 -6171 37254
9584 37254 64752 33093 49189 26986 -17551 15287 49064 110065 132036 127986 93876 104383
9572 104383 106575 95848 59294 45437 105285 146287 119232 52859 15635 -4642 -44469 -49320
9560 -49320 242 -10523 16010 111191 155044 116360 146626 175493 177710 200881 125446 99197
$$ packed form
9644A9345l5460k1877M3119N4235P3975P4517p885n4514l5788J4597M641n7757
9632G1148j56264k107J10079L0301K5328M4283j01810j11439K9887R403J436k3941
9620g3696K5427K1839k8948l0959M7395L8492j6893J3521Q0217R315k6277J7741
9608G7174R977j01513j471N5850m1336k6239j0840j473M3731J15849L4419m1677
9596A12451l0959N4673o594K0975m8871k6322j5908l2107L5116j1503n7122M3425
9584C7254K7498l1659J6096k2203m4537L2838L3777O1001K1971m050l4110J0507
9572A04383K192j0727l6554j3857N9848M1002k7055o6373l7224k0277l9827m851
9560d9320M9562j0765K6533R5181M3853l8684L0266K8867K217K3171p5435k6249
$$ plain form
9548 99197 113077 154538 150714 138364 94522 73354 59173 12238 20413 -18243 -88558 -134009
9536 -134009 -129037 -64243 -69211 9007 67770 76465 158951 228839 202906 100468 -59500 -83049
9524 -83049 -68579 -77636 -101195 -93939 -33752 -51617 -67564 -52256 -16095 34283 70317 42410
9512 42410 95479 132569 172134 193860 154767 76924 -4257 -84742 -52113 -32230 -24137 -24960
9500 -24960 -11253 29588 70214 117438 142231 85515 53501 72557 69627 16920 77290 103722
9488 103722 82120 92762 36131 -52103 -41419 -14942 19449 39331 60606 -11829 -61306 6595
9476 6595 61742 65830 61992 72936 32896 41493 11602 11204 105469 127175 70741 28451 56910
9463 56910 56167 72902 74513 -25869 -19593 95480 136522 103746 32366 -39784 -40680 -22516 -18303
$$ packed form
9548I9197J3880M1461l824j2350m3842k1168j4181m6935Q175l8656p0315m5451
9536a34009M972O4794m968P8218N8763Q695Q2486O9888k5933j02438j59968k3549
9524h3049J4470r057k3559P256O0187j7865j5947J5308L6161N0378L6034k7907
9512D2410N3069L7090L9565K1726l9093p7843q1181q0485L2629J9883Q093q23
9500b4960J3707M0841M0626M7224K4793n6716l2014J9056k930n2707O0370K6432
9488A03722k1602J0642n6631q8234J0684K6477L4391J9882K1275p2435m9477O7901
9476F595N5147M088l838J0944m0040Q597k9891l98R4265K1706n6434m2290K8459
9463E6910p43J6735J611j00382O276J15073M1042l2776p1380p2150q96J8164M213
$$ plain form
9450 -18303 1918 37208 94666 126686 162965 150845 130083 132632 115774 84745 49464 49771
9438 49771 3324 40548 77500 20662 -78541 -115882 -57063 43841 98499 47179 -21399 3290
9426 3290 56348 17143 36996 25432 29815 60049 67696 59582 25390 97845 127337 55373 31658
9413 31658 137984 208021 147766 65311 105544 139446 110982 108177 93748 113305 108094 74975
9401 74975 78973 105429 122724 112631 90053 88745 77637 112889 153400 180714 158166 95906
9389 95906 110626 158540 178651 182843 162758 162675 146052 174839 209275 199736 118255 122736 57290
9376 57290 9057 12646 114192 105880 81331 62169 69613 67906 131408 152784 181829 213166
9364 213166 223342 134892 74948 61652 96651 140686 113007 77773 66602 52332 59142 57310
$$ packed form
9450a8303K0221L5290N7458L2020L6279j2120k0762K549j6858l1029l5281L07
9438D9771m6447L7224L6952n6838r9203l7341N8819J00904N4658n1320o8578K4689
9426C290N3058l9205J9853j1564M383L0234P647q114l4192P2455K9492p1964k3715
9413C1658J06326P0037o0255q2455M0233L3902k8464k805j4429J9557n211l3119
9401G4975L998K6456J7295j0093k2578j308j1108L5252M0511K7314k2548o2260
9389I5906J4720M7914K0111M192k0085q3j6623K8787L4436r539q1481M481o5446
9376E7290m8233L589J01546q312k4549j9162P444j707O3502K1376K9045L1337
9364B13166J0176q8450n9944j3296L4999M4035k7679l5234j1171j4270O810j832
$$ plain form
9352 57310 53130 67839 114260 105577 47021 21389 23237 -11646 10024 67186 103715 20689
9340 20689 23313 89458 109458 48642 -29443 4011 14633 28811 54362 51142 68646 78940
9328 78940 101834 113052 76588 18472 31353 21730 12566 -9200 -35266 -55106 -68519 -9499
9316 -9499 64768 88433 59603 80251 117793 65833 11405 47768 65474 119237 95220 106843
9304 106843 118750 78511 43952 31984 -13579 -63166 -36602 56227 118072 131590 115990 130275
9292 130275 144935 133062 143896 162241 95719 53754 22432 91520 74866 -34763 -21178
9281 -21178 14568 -3757 4232 104622 141243 154613 126378 64270 30633 35343 70335 115697
9269 115697 148333 121299 45075 5914 -18829 -8650 -8524 -38300 -66622 -45823 24639 101765
$$ packed form
9352E7310m180J4709M6421q683n8556k5632J848l4883K1670N7162L6529q3026
9340B0689K624O6145K0000o0816p8085L3454J0622J4178K5551l220J7504J0294
9328G8940K2894J1218l6464n8116J2881r623r164k1766k6066j9840j3413N9020
9316i499P4267K3665k8830K0648L7542n1960n4428L6363J7706N3763k4017J1623
9304A06843J1907m0239l4559j1968m5563m9587K6564R2829O1845J3518j5600J4285
9292A30275J4660j1873J0834J8345o6522m1965l1322O9088j6654j09629J3585
9281b1178L5746j8325P989J00390L6621J3370k8235o2108l3637M710L4992M5362
9269A15697L2636k7034p6224l9161k4743J0179J26k9776k8322K0799P0462P7126
$$ plain form
9257 101765 124541 93130 122824 111143 109011 135379 109389 96256 111031 142189 130435 82744
9245 82744 110601 116912 127984 92683 105681 92458 15274 -16456 42822 94085 91744 66407
9233 66407 85696 149426 111617 54977 65638 76502 151498 168121 143188 92663 89736 97542
9221 97542 51393 47842 94117 87394 18411 20243 936 -41659 46499 121164 182413 200688
9209 200688 205228 195621 134319 91782 50723 110946 155385 118471 162427 192411 159261 121107
9197 121107 140572 141561 147754 125610 80186 81785 100777 92467 110650 121146 92291 50380 66566
9184 66566 139207 154400 112231 72916 82885 110630 115831 84285 93583 138037 147994 167823 201689
9171 201689 167792 211164 191928 153100 174357 152634 152618 158812 133424 155377 175352 156630
$$ packed form
9257A01765K2776l1411K9694j1681k132K6368k5990j3133J4775L1158j1754m7691
9245H2744K7857O311J1072l5301J2998j3223p7184l1730N9278N1263k341k5337
9233F6407J9289O3730l7809n6640J0661J0864P4996J6623k4933n0525k927P806
9221I7542m6149l551M6275o723o8983J832j9307m2595Q8158P4665O1249J8275
9209B00688M540r607o1302m2537m1059O0223M4439l6914M3956K9984l3150l8154
9197A21107J9465R89O193k2144m5424J599J8992q310J8183J0496k8855m1911J6186
9184F6566P2641J5193m2169l9315R969K7745N201l1546R298M4454R957J9829L3866
9171B01689l3897M3372j9236l8828K1257k1723j6O194k5388K1953J9975j8722
$$ plain form
9159 156630 160363 159487 177591 134106 66099 115148 103450 87979 102556 42272 98816 225792
9147 225792 228192 148323 88082 68516 138230 123979 145652 123778 58983 28686 37558 49088
9135 49088 67521 71948 79488 69578 28990 22617 64899 120848 175428 161369 127661 123783 89532
9122 89532 110558 123230 119558 110004 150418 158873 149738 108964 109503 87488 154358 177193 137721
9109 137721 126545 110032 136419 97182 62859 44176 96424 95880 142422 204828 200695 149149
9097 149149 116357 133949 118751 102975 153456 240722 250728 216748 173514 160289 168825 113093
9085 113093 100309 68500 74050 74697 113900 124184 147180 164567 250971 241414 211422 181282
9073 181282 139432 110329 49060 71872 94317 161883 207207 154556 163970 186836 192458 188910
$$ packed form
9159A56630L733q76J8104m3485o8007M9049j1698j5471J4577o0284N6544J26976
9147B25792K400p9869o0241j9566O9714j4251K1673k1874o4795l0297Q872J1530
9135D9088J8433M427P540r910m0588o373M2282N5949N4580j4059l3708l878l4251
9122H9532K1026J2672l672r554M0414Q455r135m0774N39k2015O6870K2835l9472
9109A37721j1176j6513K6387l9237l4323j8683N2248n44M6542O2406m133n1546
9097A49149l2792J7592j5198j5776N0481Q7266J0006l3980m3234j3225Q536n5732
9085A13093j2784l1809N550O47L9203J0284K2996J7387Q6404r557k9992l0140
9073A81282m1850k9103o1269K2812K2445O7566M5324n2651R414K2866N622l548
$$ plain form
9061 188910 193940 204091 206208 230914 255700 236398 195853 170089 128113 172821 164357 149621
9049 149621 115132 82642 81039 103695 181158 121940 92443 98634 139343 121049 122767 207968
9037 207968 187937 132774 144457 155771 119653 83431 75565 107794 192979 262921 304481 263012
9025 263012 178177 95846 48562 66348 102724 85112 74742 79005 106166 115440 124771 122305
9013 122305 118442 168465 191396 118867 109118 189734 168599 59601 124818 151073 91709 74922
9001 74922 35291 22266 -36457 12717 22907 48877 85090 146699 126540 50463 70220 83542
8989 83542 155305 142886 70660 -51304 -75338 -29340 37347 62119 98759 117306 114481 96524
8977 96524 98262 44142 69435 42861 59770 33530 51798 66575 97895 168328 148158 82489
$$ packed form
9061A88910N030J0151K117K4706K4786j9302m0545k5764m1976M4708q464j4736
9049A49621l4489l2490j603K2656P7463n9218k9497O191M0709j8294J718Q5201
9037B07968k0031n5163J1683J1314l6118l6222p866L2229Q5185O9942M1560m1469
9025B63012q4835q2331m7284J7786L6376j7612j0370M263K7161R274R331k466
9013A22305l863N0023K2931p2529r749Q0616k1135j08998O5217K6255n9364j6787
9001G4922l9631j3025n8723M9174J0190K5970L6213O1609k0159p6077J9757J3322
8989H3542P1763j2419p2226j21964k4034M5998O6687K4772L6640J8547k825j7957
8977I6524J738n4120K5293k6574J6909k6240J8268J4777L1320P0433k0170o5669
$$ plain form
8965 82489 40147 65033 149546 224404 111876 4604 56628 89784 41792 -43454 -57542
8954 -57542 -13317 37343 79352 122029 105619 112879 42703 18309 40550 38873 18240 16342
8942 16342 48234 6857 37458 135875 117574 43033 55714 50326 75185 74559 71769 51529 17041
8929 17041 -6772 -27748 -14343 48096 52972 38918 -11628 -12902 22453 53096 41537 55562
8917 55562 87645 80196 52355 -919 42891 57070 110676 75151 62127 30946 49051 18346
8905 18346 -10454 -27177 -36814 -53923 -49858 -51831 3710 96316 168268 157642 55741 60113
8893 60113 29783 -50288 37241 36241 67417 100490 68483 63119 63499 65337 87849 148412 125579
8880 125579 77368 46966 54604 60979 18100 43652 116822 112061 64037 34709 15902 -27912
$$ packed form
8965H2489m2342K4886Q4513P4858j12528j07272N2024L3156m7992q5246j4088
8954e7542M4225N0660M2009M2677j6410P260p0176k4394K2241j677k0633j898
8942A6342L1892m1377L0601R8417j8301p4541J2681n388K4859o26k790k0240l4488
8929A7041k3813k0976J3405O2439M876j4054n0546j274L5355L0643j1559J4025
8917E5562L2083p449k7841n3274M3810J4179N3606l5525j3024l1181J8105l0705
8905A8346k8800j6723r637j7109M065j973N5541R2606P1952j0626j01901M372
8893F0113l0330q0071Q7529j000L1176L3073l2007n364L80J838K2512O0563k2833
8880A25579m8211l0402P638O375m2879K5552P3170m761m8024k9328j8807m3814
$$ plain form
8868 -27912 47550 42642 37862 38183 25900 3462 7547 8963 19365 5173 21566 21454 -14625
8855 -14625 -13358 35557 40134 38579 46058 30998 43636 21523 -38483 -14915 85663 149482
8843 149482 129359 98432 57528 24790 13560 30750 19467 15053 35580 27726 14592 14786
8831 14786 -3869 -49882 -11530 47780 10424 -14976 -26446 -7811 64597 165128 125633 116453
8819 116453 69079 45678 60256 67413 67570 -117 4828 23173 -22934 -32446 -1262 -18990 2517
8806 2517 26414 39074 -5116 -49394 -33472 50053 127513 103238 12030 -26674 -3618 11125
8794 11125 29087 14264 -8508 34761 129078 181473 146957 26461 27063 12599 -4585 -42276
8782 -42276 -23222 -37187 -4481 44051 107078 77272 12465 28468 -66643 -61601 -69248 -52648
$$ packed form
8868b7912P5462m908m780L21j2283k2438M085J416J0402j4192J6393j12l6079
8855a4625J267M8915M577j555P479j5060J2638k2113o0006K3568J00578O3819
8843A49482k0123l0927m0904l2738j1230J7190j1283m414K0527p854j3134J94
8831A4786j8655m6013L8352N9310l7356k5400j1470J8635P2408J00531l9495r180
8819A16453m7374k3401J4578P157J57o7687M945J8345m6107r512L1184j7728K1507
8806B517K3897J2660m4190m4278J5922Q3525P7460k4275r1208l8704K3056J4743
8794A1125J7962j4823k2772M3269R4317N2395l4516j20496O02j4464j7184l7691
8782d2276J9054j3965L2706M8532O3027k9806o4807J6003r5111N042p647J6600
$$ plain form
8770 -52648 12266 5362 60118 98504 94057 96705 70712 5335 39987 18012 -68356 -27430
8758 -27430 19118 7422 53368 117552 71151 73488 84382 60169 87934 62602 34285 67285
8746 67285 66458 65175 124767 119317 128391 128783 115169 122867 135009 150280 163163 76598 -36218
8733 -36218 -19435 30571 39400 14958 9862 49693 97477 102862 66018 55381 47273 -7402 -14085
8720 -14085 17879 16248 -40857 -58367 11209 25930 44828 65402 58144 49813 29021 2069
8708 2069 65485 56662 -43769 -52269 14572 107725 44803 -1359 40813 104927 129395 155381
8696 155381 137751 147581 87494 43905 26429 89667 83349 58456 40620 4981 -9563 9243
8684 9243 -10818 -21242 -13821 50483 28481 7695 33410 5818 12042 69877 95456 80756
$$ packed form
8770e2648O4914o904N4756L8386m447K648k5993o5377L4652k1975q6368M0926
8758b7430M6548j1696M5946O4184m6401K337J0894k4213K7765k5332k8317L3000
8746F7285q27j283N9592n450R074L92j3614P698J2142J5271J2883q6565j12816
8733c6218J6783N0006Q829k4442n096L9831M7784N385l6844j0637q108n4675o683
8720a4085L1964j631n7105j7510O9576J4721J8898K0574p258q331k0792k6952
8708B069O3416q823j00431q500O6841R3153o2922m6162M2172O4114K4468K5986
8696A55381j7630R830o0087m3589j7476O3238o318k4893j7836l5639j4544J8806
8684I243k0061j0424P421O4304k2002k0786K5715k7592O224N7835K5579j4700
$$ plain form
8672 80756 52851 133803 84103 23440 -29547 40444 38102 -1648 -18705 -107695 -108645 -110652 -74520
8659 -74520 -6394 44665 54660 111474 182422 181069 115004 55285 103305 191670 177485 165488
8647 165488 151877 157605 164987 180507 174356 150561 98027 96094 111590 97369 60336 51350 82006
8634 82006 83157 115086 13617 29262 111857 102486 95292 83963 121366 197921 222316 228789
8622 228789 238581 282530 299026 243869 180112 187721 170095 117803 144379 200535 234253 314865
8610 314865 358279 367340 380139 395124 438334 434975 407367 430448 508980 599523 648018 667514
8598 667514 719088 823111 877086 938282 1034260 1058551 892799 788022 701345 612688 506427
8587 506427 420361 346906 382742 306515 179713 122478 24155 59390 45220 168401 264626
$$ packed form
8672H0756k7905Q0952m9700o0663n2987O9991k342l9750j7057q8990r50k007L6132
8659g4520O8126N1059R995N6814P0948j353o6065n9719M8020Q8365j4185j1997
8647A65488j3611N728P382J5520o151k3795n2534j933J5496j4221l7033q986L0656
8634H2006J151L1929j01469J5645Q2595r371p194j1329L7403P6555K4395O473
8622B28789R792M3949J6496n5157o3757P609j7626n2292K6576N6156L3718Q0612
8610C14865M3414R061J2799J4985M3210l359k7608K3081P8532R0543M8495J9496
8598F67514N1574J04023N3975O1196R5978K4291j65752j04777q6677q8657j06261
8587E06427q6066p3455L5836p6227j26802n7235r8323L5235j4170J23181R6225
$$ plain form
8576 264626 247036 166239 175763 162153 112173 64682 83652 126464 143840 173957 89925 62302
8564 62302 61344 -11684 33624 1274 -89346 -68038 3067 69296 107009 59469 5151 50639
8552 50639 142414 150707 101307 58388 33104 65848 102276 96459 94936 51966 5216 -18668
8540 -18668 11717 46287 68356 160243 123869 38220 6249 -35738 -72800 -13818 -12659 -68888
8528 -68888 -56087 -41707 -77335 -114609 -194278 -140463 18665 68691 53356 -58168 -40758
8517 -40758 -7852 -29328 -56832 -54340 -69221 -73334 -28950 11010 930 -7417 -70260 37923
8505 37923 153335 88912 22434 14956 -18790 13046 12687 -18544 -46654 -56853 -79725 -130199
8493 -130199 -75703 18868 -7089 20995 9834 -19609 -13062 -3160 37338 16320 -95739 -136198
$$ packed form
8576B64626j7590q0797R524j3610m9980m7491J8970M2812J7376L0117q4032k7623
8564F2302r58p3028M5308l2350r0620K1308P1105O6229L7713m7540n4318M5488
8552E0639R1775Q293m9400m2919k5284L2744L6428n817j523m2970m6750k3884
8540a8668L0385L4570K2069R1887l6374q5649l1971m1987l7062N8982J159n6229
8528f8888J2801J4380l5628l7274p9669N3815J59128N0026j5335j11524J7410
8517d0758L2906k1476k7504K492j4881m113M4384L9960j0080q347o2843J08183
8505C7923J15412o4423o6478p478l3746L1836l59l1231k8110j0199k2872n0474
8493a30199N4496R4571k5957K8084j1161k9443O547R902M0498k1018j12059m0459
$$ plain form
8481 -136198 -124332 -83918 -37507 -13479 -43475 -72357 -25210 -4166 24648 44781 18858 -29385
8469 -29385 -68299 6645 88956 59818 60618 62737 29002 -8386 -25537 -54546 -37093 -18712
8457 -18712 47640 43127 45493 -9646 74101 50858 52974 72964 92249 95244 75090 11891 11446
8444 11446 -4563 -8982 46076 55911 49662 100853 68562 84331 147894 151699 59702 57917 93539
8431 93539 69303 -27980 27347 82786 58516 62184 29379 51855 72958 6259 14003 2258
8419 2258 17815 56926 139310 135794 123702 105041 104724 27912 53843 11624 22031 41654 88566
8406 88566 88939 -4068 -10658 2401 -80038 -85518 -88418 -137744 -117968 -41434 3200 10854 8837
8393 8837 -40930 13656 77584 94819 121744 94598 137393 98215 63112 148749 102215 5956
$$ packed form
8481a36198J1866M0414M6411K4028k9996k8882M7147K1044K8814K0133k5923m8243
8469b9385l8914P4944Q2311k9138Q00K119l3735l7388j7151k9009J7453J8381
8457a8712O6352m513K366n5139Q3747k3243K116J9990J9285K995k0154o3199m45
8444A1446j6009m419N5058R835o249N1191l2291J5769O3563L805r1997j785L5622
8431I3539k4236r7283N5327N5439k4270L668l2805K2476K1103o6699P744j1745
8419B258J5557L9111Q2384l516j2092j8661l17p6812K5931m2219J0407J9623M6912
8406H8566L73r3007o590J3059q2439n480k900m9326J9776P6534M4634P654k017
8393H837m9767N4586O3928J7235K6925k7146M2795l9178l5103Q5637m6534r6259
$$ plain form
8381 5956 3705 -19951 -3510 4410 53661 3130 -32484 -68683 -143759 -154925 -115421 -50027
8369 -50027 2439 7736 10377 -1428 20516 -11248 -54366 -47343 13863 -6825 -16347 -64004 -95260
8356 -95260 -114646 -29854 23994 -14410 -14727 43480 54154 76945 68462 14357 -30530 -58340
8344 -58340 -93239 -70419 -72274 -81908 -104259 -107461 -15239 -2141 -41158 -71113 -34580 -27438 -38346
8331 -38346 -72055 19491 47337 13132 -4772 -21476 23144 11417 -15111 -32104 -20284 -27901
8319 -27901 -59766 -29018 25662 63096 63296 751 10978 65047 -15417 -44803 -94224 -65236
8307 -65236 463 1979 -27034 -109175 -102792 -61057 -50591 -74929 -91660 -42479 27712 72348
8295 72348 49755 3510 -62572 -45313 -19458 -2416 -784 1748 -24079 -94664 -66251 -36762
$$ packed form
8381E956k251k3656J6441P920M9251n0531l5614l6199p5076j1166L9504O5394
8369e0027N2466N297K641j1805K1944l1764m3118P023O1206k0688r522m7657l1256
8356i5260j9386Q4792N3848l8404l17N8207J0674K2791q483n4105m4887k7810
8344e8340l4899K2820j855r634k2351l202R2222J3098l9017k9955L6533P142j0908
8331c8346l3709R1546K7846l4205j7904j6704M4620j1727k6528j6993J1820p617
8319b7901l1865L0748N4680L7434K00o2545J0227N4069q0464k9386m9421K8988
8307f5236O5699J516k9013q2141O383M1735J0466k4338j6731M9181P0191M4636
8295G2348k2593m6245o6082J7259K5855J7042J632K532k5827p0585K8413K9489
$$ plain form
8283 -36762 -66468 -96512 -88579 -51625 26703 59445 38808 6618 -45884 -82872 -89295 -56961
8271 -56961 -85219 -78891 -44960 -56462 -56460 -41849 -1706 -27819 -11083 -60088 -53169 -17712 -63915
8258 -63915 -42936 -24391 -38727 -38597 -53667 -20647 -36153 -17134 9429 -26217 -4857 -55305
8246 -55305 -10794 79711 74122 -54141 -116848 -102147 -86594 -57496 -49364 -39542 -54081 -72954
8234 -72954 -112342 -69212 -82628 -186871 -134774 -90774 -58685 -135858 -162933 -149172 -63839 -2564
8222 -2564 58541 40741 -1306 27146 10562 -55599 -61185 16827 -639 -40610 -67332 -35365
8210 -35365 -63746 -115410 -114599 -35908 -14923 -48075 -100859 -193536 -198074 -87948 -86134 -96507
8198 -96507 -42419 -49568 -57551 -32753 -17990 35078 18092 -61337 -88386 -75175 -34541 773
$$ packed form
8283c6762k9706l0044P933L6954P8328L2742k0637l2190n2502l6988o423L2334
8271e6961k8258O328L3931j1502KJ4611M0143k6113J6736m9005O919L5457m6203
8258f3915K0979J8545j4336J30j5070L3020j5506J9019K6563l5646K1360n0448
8246e5305M4511R0505n589j28263o2707J4701J5553K9098Q132R822j4539j8873
8234g2954l9388M3130j3416j04243N2097M4000L2089p7173k7075J3761Q5333O1275
8222b564O1105j7800m2047K8452j6584o6161n586P8012j7466l9971k6722L1967
8210c5365k8381n1664Q11P8691K0985l3152n2784r2677m538J10126J814j0373
8198i6507N4088p149p983K4798J4763N3068j6986p9429k7049J3211M0634L5314
$$ plain form
8186 773 -22447 -38783 -73259 -60772 -32109 -52420 -87935 -89532 -88575 -116890 -110258 -94218 -82877
8173 -82877 -70542 -55374 -76940 -61342 -34525 -1307 -52486 -136620 -92027 -46153 29921 -587
8161 -587 -33343 50543 133174 85328 5336 -5772 9677 28852 30187 23683 16582 40570 73556
8148 73556 69334 26595 -6620 -48303 -68696 -27959 -2800 -18703 -47812 -75830 -82023 -30102
8136 -30102 -57906 -52275 -22296 -62565 -85947 -80912 -103747 -93337 -489 14903 32552 104579
8124 104579 101218 103252 85338 -21507 -54897 -55868 -63762 -122654 -72846 -17094 6081 17952
8112 17952 476 -56398 -58302 -59989 -70183 -1247 45958 27301 -72872 -96421 -56610 -89659
8100 -89659 -92402 -52740 11956 -35301 -62754 -107918 -75166 -96475 -131536 -98113 -89986 -55862
$$ packed form
8186G73k3220j6336l4476J2487K8663k0311l5515j597R57k8315O632J6040J1341
8173h2877J2335J5168k1566J5598K6817L3218n1179q4134M4593M5874P6074l0508
8161e87l2756Q3886Q2631m7846p9992j1108J5449J9175J335o504p101K3988L2986
8148G3556m222m2739l3215m1683k0393M0737K5159j5903k9109k8018o193N1921
8136c0102k7804N631K9979m0269k3382N035k2835J0410R2848J5392J7649P2027
8124A04579l361K034j7914j06845l3390r71p894n8892M9808N5752K3175J1871
8112A7952j7476n6874j904j687j0194O8936M7205j8657j00173k3549L9811l3049
8100h9659k743L9662O4696m7257k7453m5164L2752k1309l5061L3423Q127L4124
$$ plain form
8088 -55862 20652 25020 55475 97540 115925 148629 151113 137963 83011 53723 -38410 -85436
8076 -85436 -52293 -23521 15529 4155 -4586 -5177 -52285 -52650 -35933 -77603 -90466 -98799 -47432
8063 -47432 -8195 -27342 -31289 -40477 -35131 20710 83557 33050 19276 62073 100507 120883
8051 120883 127221 142072 110411 50436 46785 53025 -23891 -58399 -69239 -50653 -9128 7428
8039 7428 41435 43983 65525 50182 57267 11537 -7625 63220 45412 24399 -14881 -86280
8027 -86280 -38886 -13706 -19455 -52330 -89084 -52478 -30031 -86161 -121622 -12532 22974 -22906
8015 -22906 -16540 -12264 14128 -12159 -25968 -49859 -28849 -46457 -53388 -64502 -33763 27028
8003 27028 60779 94385 49992 -2460 -1626 51660 100125 73462 68569 34871 -23760 -9182
$$ packed form
8088e5862P6514M368L0455M2065J8385L2704K484j3150n4952k9288r2133m7026
8076h5436L3143K8772L9050j1374q741n91m7108l65J6717m1670j2863q333N1367
8063d7432L9237j9147l947r188N346N5841O2847n0507j3774M2797L8434K0376
8051A20883O338J4851l1661n9975l651O240p6916l4508j0840J8586M1525J6556
8039G428L4007K548K1542j5343P085m5730j9162P0845j7808k1013l9280p1399
8027h6280M7394K5180n749l2875l6754L6606K2447n6130l5461J09090L5506m5880
8015b2906O366M276K6392k6287j3809k3891K1010j7608o931j1114L0739O0791
8003B7028L3751L3606m4393n2452Q34N3286M8465k6663m893l3698n8631J4578
$$ plain form
7991 -9182 60375 72140 146596 181530 155627 143648 100349 60528 78519 67402 30141 7726
7979 7726 -10162 -60357 -62505 -48727 -22356 19654 15995 15334 -10808 -27406 16818 33406 81459
7966 81459 155292 178686 174246 128089 104832 126550 23437 41462 144596 172869 148498 105917
7954 105917 95838 45376 20301 71267 68117 102586 108027 80194 102174 67539 -18022 -20244
7942 -20244 7269 4507 -4313 -37636 -4859 13179 28394 83297 93475 52917 62996 20401
7930 20401 -50179 43476 154012 116018 89654 138034 103822 90720 116461 76971 33059 35959
7918 35959 -39156 -121524 -133060 -124023 -10055 67580 20271 -53836 -39813 -5111 -671 21307
7906 21307 77058 93750 122051 110469 57264 -1326 -4389 24172 21405 -50420 5307 -226
$$ packed form
7991i182O9557J1765P4456L4934k5903j1979m3299l9821J7991j1117l7261k2415
7979G726j7888n0195k148J3778K6371M2010l659o61k6142j6598M4224J6588M8053
7966H1459P3833K3394m440m6157k3257K1718j03113J8025J03134K8273k4371m2581
7954A05917j0079n0462k5075N0966l150L4469N441k7833K1980l4635q5561k222
7942b0244K7513k762q820l3323L2777J8038J5215N4903J0178m0558J0079m2595
7930B0401p0580R3655J10536l7994k6364M8380l4212j3102K5741l9490m3912K900
7918C5959p5115q2368j1536R037J13968P7635m7309p4107J4023L4702M440K1978
7906B1307N5751J6692K8301j1582n3205n8590l063K8561k767p1825N5727n533
$$ plain form
7894 -226 -66013 -111353 -134982 -119775 -48043 -28588 -77191 -19521 -16158 -84578 -42252 -7518
7882 -7518 -1374 18207 42416 64806 76582 33954 35290 60803 84193 37930 27079 16152
7870 16152 7546 -22572 -33083 -45915 -40001 -57445 51261 56285 1424 -31148 -71076 -82660
7858 -82660 -67294 -74940 -103967 -114724 -81928 -111324 -133275 -109169 -98230 -130048 -68942 -86422
7846 -86422 -83403 -96856 -139478 -200440 -225193 -222174 -184737 -107285 -51894 -37320 -9900 33487
7834 33487 33859 -19304 -29604 -23262 -47501 -82389 -83338 -49762 -2824 -39277 -57257 -52112 -73294
7821 -73294 -142871 -199138 -131892 -106211 -132299 -83722 -37899 -56912 -104550 -92615 6091 93217
7809 93217 61402 -13464 -38405 -12532 -77853 -30125 -67248 -159539 -144900 -34797 -34762 -49101
$$ packed form
7894b26o5787m5340k3629J5207P1732J9455m8603N7670L363o8420M2326L4734
7882g518O144J9581K4209K2390J1776m2628J336K5513K3390m6263j0851j0927
7870A6152q606l0118j0511j2832N914j7444J08706N024n4861l2572l9928j1584
7858h2660J5366p646k9027j0757L2796k9396k1951K4106J0939l1818O1106j7480
7846h6422L019j3453m2622o0962k4753L019L7437P7452N5391J4574K7420M3387
7834C3487L72n3163j0300O342k4239l4888r49L3576M6938l6453j7980N145k1182
7821g3294o9577n6267O7246K5681k6088M8577M5823j9013m7638J1935R8706Q7126
7809I3217l1815p4866k4941K5873o5321M7728l7123r2291J4639J10103L5j4339
$$ plain form
7797 -49101 -81087 -89520 -52166 -319 -36 26343 28999 -7657 -3528 -75941 -99601 -77064 -36280
7784 -36280 -81614 -119310 -66486 -40782 -62374 -90862 -57901 816 -52378 -69689 -81424 161
7772 161 21393 -5105 -76765 -150992 -141362 -10649 59406 65026 11024 8030 -45800 -84536 -58108
7759 -58108 -4435 -36489 -92085 -79106 -3331 294 -9397 -21875 4435 -3348 -38593 8922
7747 8922 42319 22233 -31703 -115740 -124814 -61654 -74786 -75194 -39329 -61372 -63133 -144597 -207255
7734 -207255 -187678 -146428 -132758 -98751 -80175 -59956 -37971 -37206 -49246 -62107 -122332 -165094
7722 -165094 -147505 -151338 -191886 -168837 -167956 -168790 -107170 -89945 -68522 -54185 -38408 3971 14075
7709 14075 -9028 -43511 -55822 -20538 -848 -14003 -22673 -9064 5539 6346 30319 -9587
$$ packed form
7797d9101l1986q433L7354N1847K83K6379K656l6656M129p2413k3660K2537M0784
7784c6280m5334l7696N2824K5704k1592k8488L2961N8717n3194j7311j1735Q1585
7772A61K1232k6498p1660p4227R630J30713P0055N620n4002k994n3830l8736K6428
7759e8108N3673l2054n5596J2979P5775L625r691j2478K6310p783l5245M7515
7747H922L3397k0086n3936q4037r074O3160j3132m08L5865k2043j761q1464o2658
7734b07255J9577M1250J3670L4007J8576K0219K1985P65j2040j2861o0225m2762
7722a65094J7589l833m0548K3049Q81q34O1620J7225K1423J4337J5777M2379J0104
7709A4075k3103l4483j2311L5284J9690j3155q670J3609J4603Q07K3973l9906
$$ plain form
7697 -9587 -40505 -88626 -68553 -63681 -125873 -153895 -36271 -1103 -20029 3997 -16384 -62165
7685 -62165 -187595 -189697 -102745 -18955 -8519 -26218 -73873 -92679 -10758 -21505 -89993 -70482
7673 -70482 -80819 -61284 -82862 -86138 -52777 -6148 -20320 -13029 42805 42560 -18751 7595 -2235
7660 -2235 -68214 -75023 -56943 3245 46226 -5226 -43384 -81354 -82929 -54639 -38126 -27158
7648 -27158 -12168 -59650 -81461 -76812 -83474 -63759 -10295 -6041 -36224 -16758 -19382 -51623 -54646
7635 -54646 -14642 74655 152936 136044 48879 -16782 -12863 -43872 -29071 8834 -33945 -49833
7623 -49833 -88858 -105445 -90305 -33451 -50210 -72516 -51543 -95424 -176277 -114739 -52205 -14808
7611 -14808 -33662 -58940 -85826 -145825 -144124 -137980 -140499 -117691 -180609 -170825 -65087 -46767
$$ packed form
7697i587l0918m8121K0073M872o2192k8022J17624L5168j8926K4026k0381m5781
7685f2165j25430k102Q6952Q3790J0436j7699m7655j8806Q1921j0747o8488J9511
7673g0482j0337J9535k1578l276L3361M6629j4172P291N5834k45o1311K6346r830
7660b235o5979o809J8080O0188M2981n1452l8158l7970j575K8290J6513J0968
7648b7158J4990m7482k1811M649o662J9715N3464M254l0183J9466k624l2241l023
7635e4646M0004Q9297P8281j6892q7165o5661L919l1009J4801L7905m2779j5888
7623d9833l9025j6587J5140N6854j6759k2306K0973m3881q0853O1538O2534L7397
7611a4808j8854k5278k6886n9999J701O144k519K2808o2918R784J05738J8320
$$ plain form
7599 -46767 -17376 -21409 -86866 -120857 -159698 -91938 -44487 46086 48520 -31317 -84377 -8035
7587 -8035 48927 33664 14712 53432 8321 -60337 -66121 -60752 -14953 -12121 -7264 -41221 -52156
7574 -52156 -48277 -45869 1941 -26132 -61370 -73012 -60565 -32509 -46682 -67053 -65648 -36500
7562 -36500 -47653 -16792 -7317 37705 1211 -27959 -10304 3620 26677 -36662 -89072 -71385
7550 -71385 -82030 -52813 -57348 -49138 -53480 -70574 -38961 -47891 -72550 -107074 -116778 -147895 -154088
7537 -154088 -124199 -69165 -38353 -10159 -16350 -13364 -30236 -47534 -47869 -63342 -43582 -50740 -51566
7524 -51566 -61185 -46646 -59645 -67127 -14717 -24144 -43164 -6548 -49238 -88803 -27217 11953
7512 11953 17949 -14137 -14533 1420 -42330 -58642 -114207 -145466 -58318 -86314 -147875 -124313
$$ packed form
7599d6767K9391m033o5457l3991l8841O7760M7451R0573K434p9837n3060P6342
7587h035N6962j5263j8952L8720m5111o8658n784N369M5799K832M857l3957j0935
7574e2156L879K408M7810k8073l5238j1642J2447K8056j4173k0371J405K9148
7562c6500j1153L0861R475M5022l6494k9170J7655J3924K3057o3339n2410J7687
7550g1385j0645K9217m535Q210m342j7094L1613q930k4659l4524r704l1117o193
7537a54088K9889N5034L0812K8194o191K986j6872j7298l35j5473J9760p158q26
7524e1566r619J4539j2999p482N2410r427j9020L6616m2690l9565O1586L9170
7512A1953N996l2086l96J5953m3750j6312n5565l1259Q7148k7996o1561K3562
$$ plain form
7500 -124313 -113420 -100052 -13743 45117 49875 53280 55502 35575 -16054 15737 9135 -58225
7488 -58225 -74221 -78314 -110584 -49389 -28171 -6591 -78215 -184168 -131412 -115648 -147915 -191539
7476 -191539 -189455 -186960 -127068 -42136 -36071 -13336 43076 -2461 -48125 -61173 -28397 23281
7464 23281 69444 88760 16124 -54879 -24240 -36970 -54080 -39325 -8102 -28059 -33350 21101
7452 21101 10744 -29976 -112156 -60011 -31619 -18922 11973 -14764 -49131 -26636 -1517 -108888
7440 -108888 -140828 -96978 -83880 -143607 -80086 -107092 -110539 -74365 -68749 -73174 -7226 -32215
7428 -32215 -63622 -11758 14178 4217 35848 54931 96743 73720 -9496 -38278 -64861 -102633
7416 -102633 -99663 -60409 -20293 -99320 -121006 -55327 -82850 -57653 -73147 -120980 -90871 -121356
$$ packed form
7500a24313J0893J3368Q6309N8860M758L405K222j9927n1629L1791o602o7360
7488e8225j5996m093l2270O1195K1218K1580p1624j05953N2756J5764l2267m3624
7476a91539K084K495N9892Q4932O065K2735N6412m5537m5664j3048L2776N1678
7464B3281M6163J9316p2636p1003L0639j2730j7110J4755L1223j9957n291N4451
7452B1101j0357m0720q2180N2145K8392J2697L0895k6737l4367K2495K5119j07371
7440a08888l1940M3850J3098n9727O3521k7006l447L6174N616m425O5948k4989
7428c2215l1407N1864K5936r961L1631J9083M1812k3023q3216k8782k6583l7772
7416a02633K970L9254M0116p9027k1686O5679k7523K5197j5494m7833L0109l0485
$$ plain form
7404 -121356 -170423 -179998 -122804 -77069 -29155 -67490 -181657 -182902 -192805 -238349 -214903 -227025
7392 -227025 -169119 -155266 -151121 -140109 -183659 -168929 -105992 -125815 -156478 -146332 -100410 -55705
7380 -55705 -45122 -93612 -111472 -91345 -118888 -72290 -34460 44746 60454 40592 43608 10748
7368 10748 9510 12713 19595 -7007 -3679 52073 39132 -40330 -122589 -135671 -33055 41605
7356 41605 51702 9304 1062 -33490 -36545 -52168 -36927 -29546 -34267 -28521 -67106 -42051 -10080
7343 -10080 -62861 -21604 -11207 -42990 -75541 -41867 -40875 -95118 -94399 -47289 15780 31522 35952
7330 35952 15106 -21451 -19768 -65760 -48229 14253 32410 75793 53679 54519 39257 32780 27703
7317 27703 -6514 -86145 -20345 23189 35841 12494 8260 -7177 -30877 -34918 22178 -23657
$$ packed form
7404a21356m9067r575N7194M5735M7914l8335j14167j245r903m5544K3446j2122
7392b27025N7906J3853M145J1012m3550J4730O2937j9823l0663J0146M5922M4705
7380e5705J0583m8490j7860K0127k7543M6598L7830P9206J5708j9862L016l2860
7368A0748j238L203O882k6602L328N5752j2941p9462q2259j3082J02616P4660
7356D1605J0097m2398q242l4552l055j5623J5241P381m721N746l8585K5055L1971
7343a0080n2781M1257J0397l1783l2551L3674R92n4243P19M7110O3069J5742M430
7330C5952k0846l6557J683m5992J7531O2482J8157M3383k2114Q40j5262o477n077
7317B7703l4217p9631O5800M3534J2652k3347m234j5437k3700m041N7096m5835
$$ plain form
7305 -23657 -33474 -29222 -96626 -164868 -129619 6070 4946 -88931 -143769 -76560 -24184 -26834
7293 -26834 -71323 -57536 3624 26338 33132 49958 25040 39161 55578 4742 -102115 -46156
7281 -46156 -102986 -109516 -32660 20867 30611 -11913 -93200 -156559 -169122 -143999 -59827 9704
7269 9704 3504 13290 -8372 -68909 -98892 -42446 -27308 -770 -9982 -34018 -18942 13209 46387
7256 46387 -44764 -51153 36438 62913 25471 -41304 -136992 -182390 -178752 -141358 -63652 -68625
7244 -68625 -105783 -130685 -154747 -113637 -68968 -28569 -1157 -21247 -67178 -87658 -76434 -32341
7232 -32341 52146 64240 -28253 -66719 -85688 -118959 -117025 -77061 -60259 30870 94994 74278
7220 74278 79724 79655 105482 51549 -17353 1170 20104 -35860 -132579 -103191 -10920 30512 47180
$$ packed form
7305b3657r817M252o7404o8242L5249J35689j124r3877n4838O7209N2376k650
7293b6834m4489J3787O1160K2714O794J6826k4918J4121J6417n0836j06857N5959
7281d6156n6830o530P6856N3527R744m2524q1287o3359j2563K5123Q4172O9531
7269I704o200R786k1662o0537k9983N6446J5138K6538r212k4036J5076L2151L3178
7256D6387r1151o389Q7591K6475l7442o6775r5688m5398L638L7394P7706m973
7244f8625l7158k4902k4062M1110M4669M0399K7412k0090m5931k0480J1224M4093
7232c2341Q4487J2094r2493l8466j8969l3271J934L9964J6802R1129O4124k0716
7220G4278N446o9K5827n3933o8902J8523J8934n5964r6719K9388R2271M1432J6668
$$ plain form
7207 47180 -22262 -86225 -103603 -139205 -105348 -68549 16406 36123 67915 48086 6302 -55277
7195 -55277 -146698 -139556 -157420 -98473 -64956 -103060 -106853 -92503 -36217 -21399 26578 50732
7183 50732 68509 25183 38017 57848 77812 17995 -79092 -100105 -114386 -120211 -101533 -99751
7171 -99751 -135114 -137364 -111809 -113545 -108341 -131112 -81687 -49348 33079 3975 -39329 10007
7159 10007 -39031 -73413 -15790 6654 -25713 -82519 -89438 -121049 -154044 -69292 -13816 -22347
7147 -22347 -35160 -86580 -70261 -53447 -59001 -24943 -39198 -48802 46845 106044 52202 -6931
7135 -6931 -68960 -21750 -15469 -73401 -157476 -139693 -132461 -180434 -110361 2907 69831 27358
7123 27358 2527 -18505 -57035 -62258 -88447 -70781 -7053 -19319 -1873 -21074 -42442 -57805
$$ packed form
7207D7180o9442o3963j7378l5602L3857L6799Q4955J9717L1792j9829m1784o1579
7195e5277r1421P142j7864N8947L3517l8104l793J4350N6286J4818M7977K4154
7183E0732J7777m3326J2834J9831J9964n9817r7087k1013j4281n825J8678J782
7171i9751l5363k250K5555j736N204k2771M9425L2339Q2427k9104m3304M9336
7159A0007m9038l4382N7623K2444l2367n6806o919l1611l2995Q4752N5476q531
7147b2347j2813n1420J6319J6814n554L4058j4255r604R5647N9199n3842n9133
7135f931o2029M7210O281n7932q4075J7783P232m7973P0073J13268O6924m2473
7123B7358k4831k1032l8530n223k6189J7666O3728j2266J7446j9201k1368j5363
$$ plain form
7111 -57805 -78020 -42760 -35050 -108286 -129362 -62548 -18127 -24476 -98350 -143778 -127946 -104284
7099 -104284 -58221 -30583 -71646 -70061 -16880 14885 17705 34700 33239 31411 14730 62800
7087 62800 98970 28778 -27127 -5637 -2412 -20262 -40938 -21354 -65556 -41273 -44408 -18517
7075 -18517 -100912 -115827 -55842 -30254 23859 15947 22984 11601 48141 49020 68093 87512 19744
7062 19744 -44936 -81275 -72615 -63417 -35036 8423 -42218 -20859 -34113 -44917 3691 16335
7050 16335 -12238 -35865 -53747 -62771 -110062 -123083 -131714 -104978 -118494 -122499 -82831 -93667
7038 -93667 -70430 -70614 -108316 -72920 -6770 -8396 -20006 -59346 -130786 -60174 -99425 -139170
7026 -139170 -123776 -67111 -78747 -28118 -31157 -128570 -141383 -141181 -76512 -80277 -131914 -182944
$$ packed form
7111e7805k0215L5260P710p3236k1076O6814M4421o349p3874m5428J5832K3662
7099a04284M6063K7638m1063J585N3181L1765K820J6995j461j828j6681M8070
7087F2800L6170p0192n5905K1490L225j7850k0676J9584m4202K4283l135K5891
7075a8517q2395j4915N9985K5588N4113p912P037j1383L6540Q79J9073J9419o7768
7062A9744o4680l6339Q660R198K8381M3459n0641K1359j3254j0804M8608J2644
7050A6335k8573k3627j7882r024m7291j3021q631K6736j3516m005L9668j0836
7038i3667K3237j84l7702L5396O6150j626j1610l9340p1440P0612l9251l9745
7026a39170J5394N6665j1636N0629l039r7413j2813K02O4669l765n1637n1030
$$ plain form
7014 -182944 -190419 -192617 -153551 -124912 -104673 -81329 -156128 -124356 -68871 -91658 -76493 -93414
7002 -93414 -133953 -80918 -74584 -11382 -49917 -111312 -135538 -77319 -74062 -115889 -115601 -119834 -123471
6989 -123471 -82839 -59965 -107545 -103554 -50104 -35667 -30829 -71666 -94771 -76600 -35911 9144
6977 9144 53313 103838 62438 -30267 -57050 -51076 -51590 -103067 -115623 -104884 -84333 -27921 -16017
6964 -16017 -57250 -35921 -58432 -122601 -153388 -113927 -124744 -165929 -121867 -120588 -83108 -70900
6952 -70900 -106960 -149487 -91220 -124356 -109964 -43597 -12876 6289 -81158 -151636 -94886 -68043
6940 -68043 -113284 -21314 -5141 -143170 -189805 -190872 -199966 -203360 -143956 -81119 -64558 -33197
6928 -33197 -36610 1949 -16894 11125 -16853 22447 38353 30464 -21295 -11289 11541 -34846
$$ packed form
7014a82944p475k198L9066K8639K0239K3344p4799L1772N5485k2787J5165j6921
7002i3414m0539N3035O334O3202l8535o1395k4226N8219L257m1827K88m233l637
6989a23471M0632K2874m7580L991N3450J4437M838m0837k3105J8171M0689M5055
6977I144M4169N0525m1400r2705k6783N974n14n1477j2556J0739K0551N6412J1904
6964a6017m1233K1329k2511o4169l0787L9461j0817m1185M4062J279L7480J2208
6952g0900l6060m2527N8267l3136J4392O6367L0721J9165q7447p0478N6750K6843
6940f8043m5241R1970J6173j38029m6635j067r094l394N9404O2837J6561L1361
6928c3197l413L8559j8843K8019k7978L9300J5906p889n1759J0006K2830m6387
$$ plain form
6916 -34846 -20658 50056 57525 88130 86942 72358 35544 20382 -24686 -15415 23079 -28419
6904 -28419 -38954 23663 -32289 8498 22958 59695 62112 21404 41918 82881 36927 -39919
6892 -39919 -167727 -177566 -145931 -148572 -78399 -42524 -9372 -82053 -133447 -82739 -41113 -95278
6880 -95278 -44162 -48695 -59868 -74174 -113233 -176592 -178354 -87079 -73575 -131845 -62607 -57460
6868 -57460 -24059 -17636 -129083 -187156 -106906 -72174 -112444 -130297 -129016 -110061 -122110 -121545
6856 -121545 -123753 -187723 -173982 -92088 -100094 -136397 -144136 -208795 -271026 -218377 -205671 -161741
6844 -161741 -100723 -112055 -83079 -95286 -21315 -10828 -81853 -92074 -118249 -80259 -85880 -64831
6832 -64831 -67695 -32891 -97315 -144931 -120902 -105940 -65494 -55393 -26323 83685 77579 22750
$$ packed form
6916c4846J4188P0714P469L0605j188j4584l6814j5162m5068R271L8494n1498
6904b8419j0535O2617n5952M0787J4460L6737K417m0708K0514M0963m5954p6846
6892c9919j27808r839L1635k641P0173L5875L3152p2681n1394N0708M1626n4165
6880i5278N1116m533j1173j4306l9059o3359j762R1275J3504n8270O9238N147
6868e7460L3401O423j11447n8073Q0250L4732m0270j7853J281J8955j2049N65
6856a21545k208o3970J3741Q1894q006l6303p739o4659o2231N2649J2706M3930
6844a61741O1018j1332K8976j2207P3971J0487p1025j0221k6175L7990n621K1049
6832f4831k864L4804o4424m7616K4029J4962M0446J0101K9070J10008o106n4829
$$ plain form
6820 22750 31446 53619 11754 -21627 -11446 52914 31778 23568 20448 -19501 -40827 -103975
6808 -103975 -120790 -107411 -54331 -54803 -121465 -111373 -33209 -72282 -74283 -72451 -100305 -46405
6796 -46405 -64677 -114145 -20061 15509 -96922 -163054 -101936 -46877 -20890 36176 16312 -54901
6784 -54901 -62154 -71036 -55784 -41801 -96531 -147425 -133859 -78735 -20088 -21958 -20231 23216 -35750
6771 -35750 -14321 -32871 -56822 -105324 -148636 -106689 -145642 -201712 -115303 -4467 39396 26112
6759 26112 2363 36971 12923 16560 3203 -58295 -72717 -68600 -116427 -154745 -132154 -153110
6747 -153110 -169799 -90792 -62941 -106153 -103220 -70756 -24409 3191 -26829 -25152 -50915 -12886
6735 -12886 36535 71669 52460 -11508 -40541 -27876 -16144 -104230 -165234 -104837 -65611 -49915
$$ packed form
6820B2750Q696K2173m1865l3381J0181O4360k1136q210l120l9949k1326o3148
6808a03975j6815J3379N3080m72o6662J0092P8164l9073k001J832k7854N3900
6796d6405j8272m9468R4084L5570j12431o6132O1118N5059K5987N7066j9864p1213
6784e4901p253q882J5252J3983n4730n0894J3566N5124N8647j870J727M3447n8966
6771c5750K1429j8550k3951m8502m3312M1947l8953n6070Q6409J10836M3863j3284
6759B6112k3749L4608k4048L637j3357o1498j4422M117m7827l8318K2591k0956
6747a53110j6689P9007K7851m3212K933L2464M6347K7600l0020J677k5763L8029
6735a2886M9421L5134j9209o3968k9033J2665J1732q8086o1004O0397L9226J5696
$$ plain form
6723 -49915 23892 173432 256300 274980 321895 220450 82313 -4120 10138 97448 142552
6712 142552 37019 -3768 43179 46894 57556 45502 15579 -15627 5259 -20731 -61688 -44981
6700 -44981 -3904 -25019 -17150 -9765 -9110 6656 -28296 -130707 -148865 -173382 -77107 21951
6688 21951 31814 43209 19146 -35279 -128267 -121092 -63933 -61747 -29244 -82022 -70947 -24428
6676 -24428 -66254 -113974 -46411 -7342 -31115 -75019 -80243 -30896 -14173 35971 64508 70925
6664 70925 10411 -42107 -64537 26995 46464 -8234 -42703 -65196 -117040 -89088 -11190 -23826
6652 -23826 -30530 -40949 -40934 -69517 -14655 -60063 -117828 -94765 -12735 12145 4484 -51173 -87172
6639 -87172 -38412 60812 122405 108282 70053 88994 129555 74034 8749 -41021 11635 20891
$$ packed form
6723d9915P3807J49540Q2868J8680M6915j01445j38137q6433J4258Q7310M5104
6712A42552j05533m0787M6947L715J0662j2054k9923l1206K0886k5990m0957J6707
6700d4981M1077k1115P869P385O55J5766l4952j02411j8158k4517R6275R9058
6688B1951R863J1395k4063n4425r2988P175N7159K186L2503n2778J1075M6519
6676b4428m1826m7720O7563L9069k3773m3904n224M9347J6723N0144K8537O417
6664G0925o0514n2518k2430R1532J9469n4698l4469k2493n1844K7952P7898j2636
6652b3826o704j0419J5k8583N4862m5408n7765K3063Q2030K4880p661n5657l5999
6639h7172M8760R9224O1593j4123l8229J8941M0561n5521o5285m9770N2656R256
$$ plain form
6627 20891 32579 36051 34633 -30534 -32410 21086 39744 34529 2898 -49765 -93193 -111224 -133901
6614 -133901 -90246 -101648 -136400 -153177 -149530 -63211 -462 -48600 -46368 8382 15142 10963
6602 10963 -18416 -66674 -76295 -56397 12891 39997 62364 49555 -14241 -88605 -93680 -102567
6590 -102567 -84216 -9607 17255 -29693 -46212 235 -36803 7707 59836 41211 20095 49021
6578 49021 38555 52720 47131 -26011 -13710 52946 23879 -28784 -74229 10664 -14724 -50288
6566 -50288 -43031 -6250 27245 15913 -4684 -23073 -56875 3332 64754 97446 57323 4112
6554 4112 -20433 -55906 -36028 14234 13859 -51425 -52670 -5738 3117 -22539 -2498 -7752 9066
6541 9066 20872 -20836 -43664 -130216 -128800 -66794 -102739 -147068 -60046 -58444 -63120 -34038 6854
$$ packed form
6627B0891J1688L472j418o5167j876N3496J8658n215l1631n2663m3428j8031k2677
6614a33901M3655j1402l4752j6777L647Q6319O2749m8138K232N4750O760m179
6602A0963k9379m8258r621J9898O9288K7106K2367j2809o3796p4364n075q887
6590a02567J8351P4609K6862m6948j6519M6447l7038M4510N2129j8625k1116K8926
6578D9021j0466J4165n589p3142J2301O6656k9067n2663m5445Q4893k5388l5564
6566e0288P257L6781L3495j1332k0597j8389l3802O0207O1422L2692m0123n3211
6554D112k4545l5473J9878N0262l75o5284j245M6932Q855k5656K0041n254J6818
6541I066J1806m1708k2828q6552J416O2006l5945m4329Q7022J602m676K9082M0892
$$ plain form
6528 6854 -4220 -879 319 -3592 -18241 35746 86619 16123 -120684 -81666 -72199 -109686 -132270
6515 -132270 -88256 -28875 -73687 -96192 -107093 -127735 -126582 -31650 12315 -40999 -29180 15583
6503 15583 25082 -15665 -27802 3813 -25777 -45306 -100476 -134457 -114865 -53994 -110575 -125838
6491 -125838 -101690 -59169 -69538 -114995 -102290 -50186 -62082 -106754 -85364 -100592 -35950 70717
6479 70717 78784 41254 -11600 1838 7001 20325 -32845 -17374 -23443 -72647 -56068 -13893
6467 -13893 -43876 -73897 -45675 40526 8426 -34316 -74486 -176645 -200129 -147002 -126627 -93409
6455 -93409 -85647 -31197 42169 75000 54653 -19214 -7728 53174 91760 87368 113112 116648
6443 116648 67979 26573 7274 -7278 8766 -903 -13856 -97877 -55354 -58251 -97906 -133278
$$ packed form
6528F854j1074L341J198l911j4649N3987N0873p0496j36807L9018R467l7487k2584
6515a32270M4014N9381m4812k2505j0901k0642J153R4932M3965n3314J1819M4763
6503A5583R499m0747j2137L1615k9590j9529n5170l3981J9592O0871n6581j5263
6491a25838K4148M2521j0369m5457J2705N2104j1896m4672K1390j5228O4642J06667
6479G0717Q067l7530n2854J3438N163J3324n3170J5471o069m9204J6579M2175
6467a3893k9983l0021K8222Q6201l2100m2742m0170j02159k3484N3127K0375L3218
6455i3409P762N4450P3366L2831k0347p3867J1486O0902L8586m392K5744L536
6443A16648m8669m1406j9299j4552J6044r669j2953q4021M2523k897l9655l5372
$$ plain form
6431 -133278 -117572 -88416 -129058 -127143 -60136 -49807 -117166 -104672 -35610 -36891 16699 9857
6419 9857 -89492 -109220 -111707 -80268 42895 114013 92430 73779 7882 50582 36231 -14374
6407 -14374 -16605 -31088 -45955 -18231 -2371 -609 82428 153447 160525 75091 50335 25921
6395 25921 3171 39017 69226 -8273 -49180 -261 -31565 -51562 42428 83587 127881 77787
6383 77787 33760 -20231 13046 13423 -25801 -48780 -53589 -125128 -181583 -174916 -110769 -76673 -60124
6370 -60124 -34415 -39666 544 14135 392 15243 -51239 -99735 -80728 -38350 -74070 -66635
6358 -66635 -63805 -20154 -6690 -6081 -70470 -92574 -52297 -13557 -40605 -26311 -69027 -43791
6346 -43791 -59311 -73190 -128633 -168292 -188450 -209250 -228085 -269578 -269375 -162362 -113663 -88247
$$ packed form
6431a33278J5706K9156m0642J915O7007J0329o7359J2494O9062j281N3590o842
6419I857r9349j9728k487L1439J23163P1118k1583j8651o5897M2700j4351n0605
6407a4374k231j4483j4867K7724J5860J762Q3037P1019P078q5434k4756k4414
6395B5921k2750L5846L0209p7499m0907M8919l1304j9997R3990M1159M4294n0094
6383G7787m4027n3991L3277L77l9224k2979m809p1539n6455O667O4147L4096J6549
6370f0124K5709n251M0210J3591j3743J4851o6482m8496J9007M2378l5720P435
6358f6635K830M3651J3464O09o4389k2104M0277L8740k7048J4294m2716K5236
6346d3791j5520j3879n5443l9659k0158k0800j8835m1493K03J07013M8699K5416
$$ plain form
6334 -88247 -45218 -90778 -114893 -154717 -136952 -79455 -75561 -131636 -127781 -76499 -97664 -105440
6322 -105440 -61492 -37316 -72065 -16033 14124 -15389 -36312 -53201 -80482 -53139 -2850 -20233
6310 -20233 46294 64212 80733 -55812 -55338 -32315 43543 93108 105334 47848 -37333 -63240
6298 -63240 -43844 -37045 -107388 -136010 -179491 -139369 -56994 -72863 -45638 -32707 -26075 36753
6286 36753 -32545 -40049 -18164 -80163 -70922 -48276 -84318 -100872 -74498 -81335 -110318 -75284
6274 -75284 -37483 -58876 -21347 -37777 -43996 3319 60421 16248 -80391 -97421 -108840 -137277
6262 -137277 -77376 -11441 -39439 -47456 6757 -2555 -46688 -31655 -20049 -77783 -115532 -102614
6250 -102614 -33579 35840 34890 63371 4502 -34714 -62512 -53915 -63199 -14756 -14463 -24340 -17741
$$ packed form
6334h8247M3029m5560k4115l9824J7765N7497L894n6075L855N1282k1165p776
6322a05440M3948K4176l4749N6032L0157k9513k0923j6889k7281K7343N0289j7383
6310b0233O6527J7918J6521j36545M74K3023P5858M9565J2226n7486q5181k5907
6298f3240J9396O799p0343k8622m3481M0122Q2375j5869K7225J2931O632O2828
6286C6753o9298p504K1885o1999R241K2646l6042j6554K6374o837k8983L5034
6274g5284L7801k1393L7529j6430o219M7315N7102m4173r6639j7030j1419k8437
6262a37277N9901O5935k7998q017N4213r312m4133J5033J1606n7734l7749J2918
6250a02614O9035O9419r50K8481n8869l9216k7798Q597r284M8443K93r877O599
$$ plain form
6237 -17741 44318 14663 -25749 -13261 -40520 -52449 -49183 -74119 -60802 -69145 -86182 -30872
6225 -30872 -12005 3462 1919 -48714 -21721 -27739 -46933 -51161 -53519 -76388 -82620 -50172 -81224
6212 -81224 -101881 -68074 -88317 -99600 -2562 29483 -47396 -68381 -4130 -9180 -8610 -20406
6200 -20406 -55668 -64987 -94202 -172120 -130372 -95612 -69201 -15584 -18741 -19320 -53833 -64940 -54660
6187 -54660 -35957 -92237 -100686 -61138 -51136 -15681 -4094 38958 88872 23229 -6615 -10176
6175 -10176 -54684 -72146 -12110 37688 70086 35050 -9767 -31769 18438 35908 23519 30365
6163 30365 -29200 21577 64146 23331 40129 22050 -2311 -45491 -20431 2128 -58888 -132377
6151 -132377 -136095 -34067 55219 35904 49028 -31745 -151961 -92873 -105843 -45307 -49169 -60233
$$ packed form
6237a7741O2059k9655m0412J2488k7259j1929L266k4936J3317q343j7037N5310
6225c0872J8867J5467j543n0633K6993o018j9194m228k358k2869o232L2448l1052
6212h1224k0657L3807k0243j1283R7038L2045p6879k0985O4251n050N70j1796
6200b0406l5262r319k9215p7918M1748L4760K6411N3617l157n79l4513j1107J0280
6187e4660J8703n6280q449L9548J0002L5455J1587M3052M9914o5643k9844l561
6175a0176m4508j7462O0036M9798L2398l5036m4817k2002N0207J7470j2389O846
6163C0365n9565N0777M2569m0815J6798j8079k4361m3180K5060K2559o1016p3489
6151a32377l718J02028Q9286j9315J3124q0773j20216N9088j2970O0536l862j1064
$$ plain form
6139 -60233 -53020 -82455 -31291 41477 6013 14532 2474 -33827 -65504 -117291 -126635 -56970
6127 -56970 -59858 -67302 -73719 -1257 -903 62129 35713 -51607 -115307 -76545 21612 46610 8579
6114 8579 -96155 -140472 -92722 28512 51290 48160 59401 -39174 -120533 -113693 -119012 -79752
6102 -79752 -47953 -46371 -3891 78569 52898 9908 37445 52994 35841 30770 -33208 -52993
6090 -52993 -64396 -89916 -99903 -91895 -60793 -87228 -101959 -50665 -11002 -3429 -38726 20077
6078 20077 49561 33946 7357 15739 12210 39870 -12881 -74953 -70215 -77830 -75981 -95597 -129934
6065 -129934 -148736 -130491 -126945 -73666 -88937 -136546 -74017 -41297 -17879 -39864 -124521 -140462
6053 -140462 -87193 -54626 -97256 -136160 -129548 -111327 -88450 2335 46231 27825 15883 31901
$$ packed form
6139f0233P213k9435N1164P2768l5464Q519j2058l6301l1677n1787r344O9665
6127e6970k888p444o417P2462L54O3032k6416q7320o3700L8762R8157K4998l8031
6114H579j04734m4317M7750J21234K2778l130J1241r8575q1359O840n319L9260
6102g9752L1799J582M2480Q2460k5671m2990K7537J5549j7153n071o3978j9785
6090e2993j1403k5520r987Q008L1102k6435j4731N1294L9663P573l5297N8803
6078B0077K9484j5615k6589Q382l529K7660n2751o2072M738p615J849j9616l4337
6065a29934j8802J8245L546N3279j5271m7609O2529L2720K3418k1985q4657j5941
6053a40462N3269L2567m2630l8904O612J8221K2877R0785M3896j8406j1942J6018
$$ plain form
6041 31901 36718 -9837 9422 8275 20268 12865 39433 53464 -11199 -55336 -94474 -99767 -93741
6028 -93741 -51959 -6790 -3484 7724 -24323 -30375 11800 17834 -33203 -46143 -52829 10541 40881
6015 40881 85033 96326 81402 -9582 -110787 -69023 -58472 -78696 -81401 -77754 -48878 -35931
6003 -35931 -61836 -13253 37171 -23137 -28764 -28393 11265 128852 39781 -35420 -112009 -168725
5991 -168725 -170454 -188302 -195684 -143585 -92813 -64396 -63308 -72756 -51779 -84471 -178941 -200630
5979 -200630 -173986 -139875 -135721 -106476 -68567 3478 44913 11853 -51137 -81742 -118318 -72192
5967 -72192 11983 45639 -10385 -55265 -66781 -59701 -64140 -78874 -151153 -130432 -123771 -109631
5955 -109631 -109051 -92262 -68356 -126910 -100264 1431 24343 -22289 -44949 -78119 -54072 17571
$$ packed form
6041C1901M817m6555J9259j147J1993p403K6568J4031o4663m4137l9138n293O026
6028i3741M1782M5169L306J1208l2047o052M2175O034n1037j2940o686O3370L0340
6015D0881M4152J1293j4924r0984j01205M1764J0551k0224k705L647K8876J2947
6003c5931k5905M8583N0424o0308n627L71L9658J17587q9071p5201p6589n6716
5991a68725j729j7848p382N2099N0772K8417J088r448K0977l2692r4470k1689
5979b00630K6644L4111M154K9245L7909P2045M1435l3060o2990l0605l6576M6126
5967g2192Q4175L3656n6024m4880j1516P080m439j4734p2279K0721O661J4140
5955a09631N80J6789K3906n8554K6646J01695K2912m6632k2660l3170K4047P1643
$$ plain form
5943 17571 47336 16358 5421 -67048 -91426 -73330 -99116 -88258 -132162 -101719 -53460 -15573
5931 -15573 13010 35033 404 25935 16614 -46353 -84313 -48991 -68025 -155168 -121269 -128056
5919 -128056 -114481 -63068 -43374 -47188 257 -31756 -40838 -58786 -94929 -116299 -104603 -84572
5907 -84572 -62492 -4502 34188 -20245 -11262 -34731 -61036 -32745 12760 -18734 -129756 -221318
5895 -221318 -149322 -121661 -126398 -82657 29240 62267 41837 -88853 -19217 -22422 -39071 -59435
5883 -59435 2405 50675 121977 77513 6823 -558 266 -47303 -94744 -92756 21803 56450
5871 56450 64400 39076 41603 19920 -24642 -73234 -145819 -117098 -10555 -7047 -47318 -38327
5859 -38327 -8755 19466 61312 44928 22956 33558 31608 -8304 -43260 -58817 -50989 3690
$$ packed form
5943A7571K9765l0978j0937p2469k4378J8096k5786J0858m3904L0443M8259L7887
5931a5573K8583K2023l4629K5531r321o2967l7960L5322j9034q7143L3899o787
5919a28056J3575N1413J9694l814M7445l2013r082j7948l6143k1370J1696K0031
5907h4572K2080N7990L8690n4433Q983k3469k6305K8291M5505l1494j11022r1562
5895b21318P1996K7661m737M3741J11897L3027k0430j30690O9636l205j6649k0364
5883e9435O1840M8270P1302m4464p0690p381Q24m7569m7441J988J14559L4647
5871E6450P950k5324K527k1683m4562m8592p2585K8721J06543L508m0271Q991
5859c8327K9572K8221M1846j6384k1972J0602j950l9912l4956j5557P828N4679
$$ plain form
5847 3690 67234 51813 29986 24807 43843 53636 27403 10787 -32192 -21450 12109 40043
5835 40043 44454 -20969 -52836 -23389 -68535 -125575 -76057 -88884 -113769 -78765 -111424 -57469
5823 -57469 -52981 -5279 54197 25660 14903 -32650 -100980 -44430 -11742 -20723 5436 -90052
5811 -90052 -52779 18804 59930 22028 -42915 -33525 -18841 38122 77982 42927 38214 -23383
5799 -23383 -14130 30536 -8840 -46150 29075 29783 -20180 -10590 -7763 -4077 75766 76351 1659
5786 1659 -44589 -52002 -83925 -75455 -57613 23454 74365 38248 12205 -65541 -117759 -58145
5774 -58145 -90616 -111164 -57733 -17732 -40212 -69480 -57029 -51121 -25970 -33261 -60562 -130466
5762 -130466 -134102 -136546 -103090 -44861 -42193 -79784 -142908 -110178 -69826 -57773 -58427 -47681 21329
$$ packed form
5847C690O3544j5421k1827n179J9036R793k6233j6616m2979J0742L3559K7934
5835D0043M411o5423l1867K9447m5146n7040M9518j2827k4885L5004l2659N3955
5823e7469M488M7702N9476k8537j0757m7553o8330N6550L2688q981K6159r5488
5811i0052L7273P1583M1126l7902o4943R390J4684N6963L9860l5055m713o1597
5799b3383R253M4666l9376l7310P5225P08m9963R590K827L686P9843N85p4692
5786A659m6248p413l1923Q470J7842Q1067N0911l6117k6043p7746n2218N9614
5774e8145l2471k0548N3431M0001k2480k9268J2451N908K5151p291k7301o9904
5762a30466l636k444L3456N8229K668l7591o3124L2730M0352J2053o54J0746O9010
$$ plain form
5749 21329 19287 -29542 1401 38581 30698 9963 -19933 41926 110165 48813 70006 140947
5737 140947 111191 93063 9536 -66620 -75337 -123613 -91615 -32774 -72534 -84654 -41114 11805
5725 11805 -16859 -53058 2951 54387 80539 90014 74064 75760 74166 75222 50856 20324 42687
5712 42687 28338 54348 51747 23244 -9148 -55731 -24338 -27519 -85345 -72710 -76825 -94016
5700 -94016 -87931 -15815 27316 -4539 -850 37893 26061 -8671 -20955 -47976 -48332 -23696 -33714
5687 -33714 -63067 -134741 -157930 -107554 -81907 1697 17995 -7799 55567 56945 -1660 -39140
5675 -39140 -18274 -15993 -42373 -86561 -27925 -2777 47803 52397 28564 42661 66955 45763
5663 45763 2106 -14151 -15518 -24647 -39207 -59851 -13498 31112 36102 1121 -54286 -113630
$$ packed form
5749B1329k042m8829L0943L7180p883k0735k9896O1859O8239o1352K1193P0941
5737A40947k9756j8128q3527p6156q717m8276L1998N8841l9760j2120M3540N2919
5725A1805k8664l6199N6009N1436K6152R475j5950J696j594J056k4366l0532K2363
5712D2687j4349K6010k601k8503l2392m6583L1393l181n7826J2635m115j7191
5700i4016O085P2116M3131l1855L689L8743j1832l4732j2284k7021l56K4636j0018
5687c3714k9353p1674k3189N0376K5647Q3604J6298k5794O3366J378n8605l7480
5675c9140K0866K281k6380m4188N8636K5148N0580M594k3833J4097K4294k1192
5663D5763m3657j6257j367r129j4560k0644M6353M4610M990l4981n5407n9344
$$ plain form
5651 -113630 -104107 -123970 -79341 -77021 -58527 -59970 -32947 13821 -17354 -49106 -35529 -115445
5639 -115445 -111530 -50329 -5598 37031 80436 68759 40575 -9041 -93699 -114602 -107762 -99134
5627 -99134 -96657 -57688 -3945 45131 5757 -45984 -2899 -14845 15031 63733 102432 54170
5615 54170 60172 71091 20814 16716 54086 89184 25806 -12830 -23112 -40832 -81556 -135818
5603 -135818 -94908 -90551 -15438 1534 -13793 -3956 82780 93691 22120 23168 39006 13001
5591 13001 31058 -31192 -47226 -6842 15177 15579 10863 31094 -48972 -100846 -78862 -68220
5579 -68220 -61373 -1958 -7185 -36288 -94100 -109024 -36245 -43477 -66587 -80564 -127817 -133528 -61365
5566 -61365 44015 21486 -31274 -80924 197 41526 37131 -44944 -126218 -97276 -6637 81734
$$ packed form
5651a13630R523j9863M4629K320J8494j443K7023M6768l1175l1752J3577p9916
5639a15445L915O1201M4731M2629M3405j1677k8184m9616q4658k0903O840Q628
5627i9134K477L8969N3743M9076l9374n1741M3085j1946K9876M8702L8699m8262
5615E4170O002J0919n0277m098L7370L5098o3378l8636j0282j7720m0724n4262
5603a35818M0910M357P5113J6972j5327R837Q6736J0911p1571J048J5838k6005
5591A3001J8057o2250j6034M0384K2019M02m716K0231q0066n1874K1984J0642
5579f8220O847N9415n227k9103n7812j4924P2779p232k3110j3977m7253n711P2163
5566f1365J05380k2529n2760m9650Q1121M1329m395q2075q1274K8942R0639Q8371
$$ plain form
5554 81734 67553 -56671 -113051 -85075 -64334 -109326 -70010 -23104 -31596 -6847 43634 66153
5542 66153 14050 -863 -22173 -34165 -15677 8233 10863 73213 119777 131297 67893 49473
5530 49473 1077 -79239 -27661 16132 14113 17785 -48458 -92039 -104100 -130844 -191208 -131848
5518 -131848 -39742 -23951 -4702 37850 -6682 -95921 -101062 -38822 -28828 -51246 -73103 -72681
5506 -72681 -30071 15578 -11035 -51192 -17010 30616 39899 81063 117712 33376 -71020 -107176
5494 -107176 -89702 30584 45641 10030 -38750 -98962 -112538 -125225 -99264 -111017 -108202 -75019
5482 -75019 -28712 -25548 -44039 -99409 -116232 -159999 -106274 -49227 -83572 -48000 8407 13014
5470 13014 20551 44336 26771 -29729 -52230 -50584 -33070 -51397 41422 50509 39265 8547
$$ packed form
5554H1734j4181j24224n6380K7976K0741m4992L9316M6906q492K4749N0481K2519
5542F6153n2103j4913k1310j1992J8488K3910K630O2350M6564J1520o3404j8420
5530D9473m8396q0316N1578M3793k019L672o6243m3581j2061k6744o0364N9360
5518a31848R2106J5791J9249M2552m4532q9239n141O2240R994k2418k1857M22
5506g2681M2610M5649k6613m0157L4182M7626R283M1164L6649q4336j04396l6156
5494a07176J7474J20286J5057l5611m8780o0212j3576j2687K5961j1753K815L3183
5482g5019M6307L164j8491n5370j6823m3767N3725N7047l4345L5572N6407M607
5470A3014P537K3785j7565n6500k2501J646J7514j8327R2819R087j1244l0718
$$ plain form
5458 8547 16665 46736 75286 29590 -22416 -58590 -78167 -79657 -54324 27129 -36923 20452
5446 20452 30569 69303 107277 113605 31475 33315 25187 -20876 -7498 7636 20008 29556 139288
5433 139288 82405 32703 -17846 -105095 -90205 -52783 -83201 -119443 -60682 2275 20107 -9193
5421 -9193 -59304 -82841 -96554 -49160 -45240 -94755 -90357 -113475 -159731 -123163 -77096 -104111
5409 -104111 -142606 -137864 -87182 -58510 -42709 -30758 -45752 -45397 3744 24468 -48050 -116539
5397 -116539 -95599 -15574 -46684 -7911 -38862 -90176 -74448 -121971 -165410 -108920 -74814 4099
5385 4099 22971 -18277 -79354 -69275 -48957 -55484 -109492 -90528 -27529 28928 -5833 -2092
5373 -2092 -2569 55306 35732 -10087 -11383 20722 33251 -49862 -123931 -22522 22992 54478
$$ packed form
5458H547Q118L0071K8550m5696n2006l6174j9577j490K5333Q1453o4052N7375
5446B0452J0117L8734L7974O328q2130J840q128m6063J3378J5134J2372R548J09732
5433A39288n6883m9702n0549q7249J4890L7422l0418l6242N8761O2957J7832k9300
5421i193n0111k3537j3713M7394L920m9515M398k3118m6256L6568M6067k7015
5409a04111l8495M742N0682K8672J5801J1951j4994L55M9141K0724p2518o8489
5397a16539K0940Q0025l1110L8773l0951n1314J5728m7523m3439N6490L4106P8913
5385D099J8872m1248o1077J0079K0318o527n4008J8964O2999N6457l4761L741
5373b092m77N7875j9574m5819j296L2105J2529q3113p4069J01409M5514L1486
$$ plain form
5361 54478 32104 -49312 -49364 -62512 -68139 22135 140240 107830 82269 84684 19989 -31632 -33414
$$ packed form
5361E4478k2374q1416n2j3148n627R0274J18105l2410k5561K415o4695n1621j782
$$ [...]
##END NTUPLES=NMR SPECTRUM
##END=
