##TITLE=Analysis number 329819
Compound Code cc 33839
Book Reference 423/196
Project Code adrs
Chemist Name bruced
##JCAMPDX= 6.0         $$ Bruker NMR JCAMP-DX V2.0
##DATA TYPE= NMR SPECTRUM
##DATA CLASS= NTUPLES
##ORIGIN= Bruker BioSpin GmbH
##OWNER= nmr
$$ XWIN-NMR		Version 3.5
$$ Tue Oct  2 14:26:28 2007 GMT Daylight Time (UT+1h)  MAYBRIDGE\nmr@NMR_250MHZ
##.OBSERVE FREQUENCY= 250.131544655141
##.OBSERVE NUCLEUS= ^1H
##.ACQUISITION MODE= SIMULTANEOUS (DQD)
##.ACQUISITION SCHEME= undefined
##.AVERAGES= 16
##.DIGITISER RES= 18
##SPECTROMETER/DATA SYSTEM= dpx250
##.PULSE SEQUENCE= zg30
##.SOLVENT NAME= CDCl3
##.SHIFT REFERENCE= (INTERNAL, CDCl3, 0, 16.522)
##AUDIT TRAIL= $$ (NUMBER, WHEN, WHO, WHERE, WHAT)
$$ ##TITLE= Audit trail, XWIN-NMR		Version 3.5
$$ ##JCAMPDX= 5.01
$$ ##ORIGIN= Bruker BioSpin GmbH
$$ ##OWNER= nmr
$$ C:\u/data/dgb/nmr/ADRS/110/pdata/1/auditp.txt
$$ ##AUDIT TRAIL=  $$ (NUMBER, WHEN, WHO, WHERE, WHAT)
(   1,<2007-10-02 14:25:50.06 +100>,<MAYBRIDGE\nmr>,<NMR_250MHZ>,
      <created by zg, POWCHK disabled, PULCHK disabled
       configuration hash MD5:
       76 6E 9A 78 1E 09 19 81 EC 84 63 8F B0 6A 59 2D
       data hash MD5: 64K
       0A 11 0A 87 03 0D F7 29 2E B3 6B ED 76 EF 15 40>)
(   2,<2007-10-02 14:26:10.23 +100>,<MAYBRIDGE\nmr>,<NMR_250MHZ>,
      <Start of raw data processing
       ef LB = 0.3 FT_mod = 6 PKNL = 1 SI = 32K 
       data hash MD5: 32K
       7C F6 3B F6 BC 34 25 A9 4C 6F 5E DB BC A7 40 13>)
(   3,<2007-10-02 14:26:12.06 +100>,<MAYBRIDGE\nmr>,<NMR_250MHZ>,
      <apk 
       data hash MD5: 32K
       0D A6 C0 14 3C 4C A6 B2 AC 78 EB C3 F3 DB 2C 7C>)
(   4,<2007-10-02 14:26:12.89 +100>,<MAYBRIDGE\nmr>,<NMR_250MHZ>,
      <abs ABSG = 5 
       data hash MD5: 32K
       2C 94 A0 F3 8C EA 50 24 B2 79 40 F1 17 3E 2A E8>)
$$ ##END=
$$ 
$$ hash MD5
$$ 84 1B 71 FC 13 AB 3A 47 34 30 AA 5D E7 D7 C2 12
##$RELAX= 
##$RELAX= 
##$RELAX= 
##$RELAX= 
##$RELAX= 
##$RELAX= 
##$RELAX= 
$$ Bruker specific parameters
$$ --------------------------
##$DU= <C:\u>
##$EXPNO= 110
##$NAME= <ADRS>
##$PROCNO= 1
##$TYPE= <nmr>
##$USER= <dgb>
##$AMP= (0..31)
100 100 100 100 100 100 100 100 100 100 100 100 100 100 100 100 100 100 
100 100 100 100 100 100 100 100 100 100 100 100 100 100 
##$AQSEQ= 0
##$AQ_mod= 3
##$AUNM= <au_zg>
##$AUTOPOS= <47 >
##$BF1= 250.13
##$BF2= 250.13
##$BF3= 250.13
##$BF4= 250.13
##$BF5= 500.13
##$BF6= 500.13
##$BF7= 500.13
##$BF8= 500.13
##$BYTORDA= 1
##$CFDGTYP= 0
##$CFRGTYP= 5
##$CHEMSTR= <none>
##$CNST= (0..31)
1 1 145 1 1 1 1 1 1 1 1 1 1 1 1 1 1 1 1 1 1 1 1 1 1 1 1 1 1 1 1 1 
##$CPDPRG= <>
##$CPDPRG1= <>
##$CPDPRG2= <>
##$CPDPRG3= <>
##$CPDPRG4= <mlev>
##$CPDPRG5= <mlev>
##$CPDPRG6= <mlev>
##$CPDPRG7= <mlev>
##$CPDPRG8= <mlev>
##$CPDPRGB= <>
##$CPDPRGT= <>
##$D= (0..31)
0 1 0 0 0 0 0 0 0 0.06 0 0 0 0 0 0 0.0002 0 0 0 0 0 0 0 0 0 0 0 0 0 0 
0 
##$DATE= 1191331546
##$DBL= (0..7)
120 120 120 120 120 120 120 120 
##$DBP= (0..7)
150 150 150 150 150 150 150 150 
##$DBP07= 0
##$DBPNAM0= <>
##$DBPNAM1= <>
$$ [...]
##$SUBNAM7= <"">
##$SUBNAM8= <"">
##$SUBNAM9= <"">
##$SW= 20.6930455092707
##$SWIBOX= (0..15)
0 0 3 0 0 0 0 0 0 0 0 0 0 0 0 0 
##$SW_h= 5175.983436853
##$TD= 65536
##$TD0= 1
##$TE= 297.16
##$TE2= 300
##$TE3= 300
##$TEG= 300
##$TL= (0..7)
0 120 120 120 120 120 120 120 
##$TP= (0..7)
150 150 150 150 150 150 150 150 
##$TP07= 0
##$TPNAME0= <>
##$TPNAME1= <>
##$TPNAME2= <>
##$TPNAME3= <>
##$TPNAME4= <>
##$TPNAME5= <>
##$TPNAME6= <>
##$TPNAME7= <>
##$TPOAL= (0..7)
0.5 0.5 0.5 0.5 0.5 0.5 0.5 0.5 
##$TPOFFS= (0..7)
0 0 0 0 0 0 0 0 
##$TUNHIN= 0
##$TUNHOUT= 0
##$TUNXOUT= 0
##$USERA1= <user>
##$USERA2= <user>
##$USERA3= <user>
##$USERA4= <user>
##$USERA5= <user>
##$V9= 5
##$VALIST= <valist>
##$VCLIST= <CCCCCCCCCCCCCCC>
##$VD= 0
##$VDLIST= <DDDDDDDDDDDDDDD>
##$VPLIST= <PPPPPPPPPPPPPPP>
##$VTLIST= <TTTTTTTTTTTTTTT>
##$WBST= 1024
##$WBSW= 4
##$XGAIN= (0..3)
0 0 0 0 
##$XL= 0
##$YL= 0
##$YMAX_a= 414843
##$YMIN_a= -432010
##$ZGOPTNS= <>
##$ZL1= 120
##$ZL2= 120
##$ZL3= 120
##$ZL4= 120
##$ABSF1= 16.522
##$ABSF2= -4.171173
##$ABSG= 5
##$ABSL= 3
##$ALPHA= 0
##$AQORDER= 0
##$ASSFAC= 0
##$ASSFACI= 0
##$ASSFACX= 0
##$ASSWID= 0
##$AUNMP= <proc_1d>
##$AZFE= 0.1
##$AZFW= 0.1
##$BCFW= 0
##$BC_mod= 0
##$BYTORDP= 0
##$COROFFS= 0
##$CY= 12.5
##$DATMOD= 1
##$DC= 0
##$DFILT= <>
##$DTYPP= 0
##$F1P= 14.0000005364418
##$F2P= -0.99999901652339
##$FCOR= 0.5
##$FTSIZE= 32768
##$FT_mod= 6
##$GAMMA= 0
##$GB= 0
##$INTBC= 1
##$INTSCL= 1
##$ISEN= 128
##$LB= 0.3
##$LEV0= 0
##$LPBIN= 0
##$MAXI= 10000
##$MC2= 0
##$MEAN= 0
##$ME_mod= 0
##$MI= 0
##$NCOEF= 0
##$NC_proc= -2
##$NLEV= 6
##$NOISF1= 0
##$NOISF2= 0
##$NSP= 0
##$NTH_PI= 0
##$NZP= 0
##$OFFSET= 16.522
##$PC= 1
##$PHC0= 149.1916
##$PHC1= 11.45058
##$PH_mod= 1
##$PKNL= yes
##$PPARMOD= 0
##$PSCAL= 4
##$PSIGN= 0
##$REVERSE= no
##$SF= 250.13
##$SI= 32768
##$SIGF1= 0
##$SIGF2= 0
##$SINO= 400
##$SIOLD= 32768
##$SREGLST= <1H.CDCl3>
##$SSB= 0
##$STSI= 32768
##$STSR= 0
##$SW_p= 5175.98343685301
##$SYMM= 0
##$S_DEV= 0
##$TDeff= 65536
##$TDoff= 0
##$TI= <Analysis number 999999
Compound Code 99
Book Reference 9
Project Code 9>
##$TILT= no
##$TM1= 0
##$TM2= 0
##$TOPLEV= 0
##$USERP1= <user>
##$USERP2= <user>
##$USERP3= <user>
##$USERP4= <user>
##$USERP5= <user>
##$WDW= 1
##$XDIM= 32768
##$YMAX_p= 381232179
##$YMIN_p= -37309
$$ End of Bruker specific parameters
$$ ---------------------------------
##NTUPLES= NMR SPECTRUM
##VAR_NAME=  FREQUENCY,     SPECTRUM/REAL,   SPECTRUM/IMAG
##SYMBOL=    X,             R,               I
##VAR_TYPE=  INDEPENDENT,   DEPENDENT,       DEPENDENT
##VAR_FORM=  AFFN,          ASDF,            ASDF
##VAR_DIM=   32768,         32768,           32768
##UNITS=     HZ,            ARBITRARY UNITS, ARBITRARY UNITS
##FACTOR=    0.157963299565203, 1,           1
##FIRST=     4132.6476996994, 0,             0
##LAST=      -1043.33573715361, 0,           0
##MIN=       -1043.33573715361, -37309,      0
##MAX=       4132.6476996994, 381232179,     0
$$ Real data points
##PAGE= N=1
##DATA TABLE= (X++(R..R)), XYDATA
$$ [...]
$$ plain form
15232 -5578 -7603 1434 -812 -5968 -4874 2209 5616 5672 5105 3228 -7251 -12589 -9303 -6992 -3690
15217 -3690 -5200 -3716 -755 6598 6571 2263 3487 6729 17079 10329 7583 4846 2066 3520 2744
15202 2744 2093 3457 8287 18608 17099 10375 10026 12005 8501 7475 1849 7664 4077 4611 6878
15187 6878 5970 2190 18384 9982 -4860 -3173 4089 12500 15361 15196 7148 6199 9120 5706 7606
15172 7606 978 -8015 -5620 9034 13694 16349 9833 4545 -1587 -2865 -807 -6988 -7697 -918 2446
15157 2446 3339 -6177 -7938 4049 15252 15432 7678 545 1713 -564 -931 -6946 -2988 -3695 341
15142 341 -7704 -5456 8770 12499 13229 9858 15726 13497 10659 12759 12275 7046 10955 11047 13991 2702
15126 2702 -2625 1970 3700 5153 -4030 -5221 -6218 -5442 -9818 2333 15349 7035 8900 12451 6132
$$ packed form
15232e578k025R037k246n156J094P083L407N6n67j877j0479n338L286K311L302
15217c690j510J484K961P353k7m308J224L242J0350o750k746k737k780J454p76
15202B744o51J364M830J0321j509o724l49J979l504j026n626N815l587N34K267
15187F878r08l780J6194q402j4842J687P262Q411K861j65q048r49K921l414J900
15172G606o628q993K395J4654M660K655o516n288o132j278K058o181p09O779L364
15157B446Q93r516j761J1987J1203J80p754p133J168k277l67o015L958p07M036
15142C41q045K248J4226L729P30l371N868k229k838K100m84n229L909R2K944j1289
15126B702n327M595J730J453r183j191r97P76m376J2151J3016q314J865L551o319
$$ plain form
15111 6132 11227 10895 3692 -11265 -3032 3066 10337 13244 22436 22013 21573 14888 13430 6800 -2213
15096 -2213 1527 12633 7401 4335 5080 8707 17138 15006 15451 12226 13704 9836 12953 22500 22848
15081 22848 21012 13921 4809 7708 2733 4775 8540 10499 7580 11029 8014 2504 7482 6071
15067 6071 -9776 -17174 -15139 -11527 1073 1462 -3386 2844 9986 10290 15531 16762 4664 -9700
15053 -9700 -12942 4762 7963 6080 2765 7833 13635 7614 10105 15006 17669 4309 -1094 -9288
15039 -9288 -12045 -1738 2397 -5065 -6922 1756 8372 6592 3374 946 3582 -3501 -2809 2013 -1449
15024 -1449 -12760 -1903 4394 1260 4765 10160 6028 5007 -5741 -3149 -1604 -6487 4739 14917
15010 14917 16783 12180 11319 -3402 -3078 -5420 -4010 -5109 -5192 -5784 -3294 2751 6278 6614 7899 7204
$$ packed form
15111F132N095l32p203j4957Q233O098P271K907R192m23m40o685j458o630r013
15096b213L740J1106n232l066P45L627Q431k132M45l225J478l868L117R547L48
15081B2848j836p091r112K899m975K042L765J959k919L449l015n510M978j411
15067F071j5847p398K035L612J2600L89m848O230P142L04N241J231j2098j4364
15053i700l242J7704L201j883l315N068N802o021K491M901K663j3360n403q194
15039i288k757J0307M135p462j857Q678O616j780l218k428K636p083O92M822l462
15024a449j1311J0857O297l134L505N395m132j021j0748K592J545m883J1226J0178
15010A4917J866m603q61j4721L24k342J410j099q3n92K490O045L527L36J285o95
$$ plain form
14994 7204 15515 18705 21206 10570 5134 -1421 -14965 -11032 -13618 -13942 -11027 -2390 -1708 9872
14980 9872 13545 19398 16035 20096 13977 9973 9234 11106 1378 -2015 -6692 -8804 -7159 1903 5785
14965 5785 4820 5466 9489 9304 8079 5922 6132 7696 7766 1990 -1770 412 -1545 -7275 -3582 -759
14949 -759 3085 3632 3233 4879 263 -211 4399 4511 261 -21020 -13726 -1304 -1195 -7346 227 -2624
14933 -2624 -12446 -16498 -8821 -5914 -249 -4440 -6024 1762 6233 277 -1953 -843 -4131 -5774 -4025
14918 -4025 4059 6111 -317 11306 15938 8884 6473 6531 1446 1649 9147 10294 213 3986 6103
14903 6103 9300 7965 10005 3600 -5128 -5745 -3825 5523 12952 5177 6304 14669 10976 9118 12324
14888 12324 5189 937 -2509 -6258 2070 8756 3394 527 834 -1821 -318 1632 -1537 3781 1542
$$ packed form
14994G204Q311L190K501j0636n436o555j3544L933k586l24K915Q637O82J1580
14980I872L673N853l363M061o119m004p39J872r728l393m677k112J645R062L882
14965E785r65O46M023j85j225k157K10J564P0n776l760K182j957n730L693K823
14949g59L844N47l99J646m616m74M610J12m250k1281P294J2422J09o151P573k851
14933b624r822m052P677K907N665m191j584P786M471n956k230J110l288j643J749
14918d025Q084K052o428J1623M632p054k411N8n085K03P498J147j0081L773K117
14903F103L197j335K040o405q728o17J920R348P429p775J127Q365l693j858L206
14888A2324p135m252l446l749Q328O686n362k867L07k655J503J950l169N318k239
$$ plain form
14873 1542 -15149 -25977 -29216 -17553 -3454 414 -11139 -796 14791 17151 2228 -6659 -7843
14860 -7843 -8409 -6531 6715 9367 4433 -4589 -13845 -14808 -5511 -375 -2286 3401 4394 -4336 -7248
14845 -7248 42 -3287 -8786 -13969 -1785 7105 6849 10745 4018 960 6942 7650 15167 11351 3929
14830 3929 2342 1560 5538 4174 4417 -2676 -204 6052 4482 -8245 -21235 -18948 -8438 -8728 -6624
14815 -6624 265 -2747 -8055 -13545 -6599 -2208 -7661 -10810 -16183 -8432 -3926 -11859 -11973 808 6701
14800 6701 14624 10376 6163 8481 -3604 -6500 -8798 -9011 -14214 -14354 -7538 -8383 -7082 2619 5646
14785 5646 5526 4561 -3821 5354 7002 4817 234 -16067 -11153 -7973 -5828 -5591 -8778 -10652 -5569
14770 -5569 -9600 -10295 -5177 -1535 -290 -504 -4710 2289 6407 4975 -1731 -4581 -8020 -6318 -10789
$$ packed form
14873A542j6691j0828l239J1663J4099L868j1553J0343J5587K360j4923q887j184
14860g843n66J878J3246K652m934r022r256r63R297N136j911N687R93q730k912
14845g248P290l329n499n183J2184Q890k56L896o727l058N982P08P517l816p422
14830C929j587p82L978j364K43p093K472O256j570j2727j2990K287J0510k90K104
14815f624O889l012n308n490O946M391n453l149n373P751M506p933j14J2781N893
14800F701P923m248m213K318j2085k896k298k13n203j40O816q45J301R701L027
14785E646j20r65q382R175J648k185m583j6301M914L180K145K37l187j874N083
14770e569m031o95N118L642J245k14m206O999M118j432o706k850l439J702m471
$$ plain form
14755 -10789 -13652 -11862 -11121 -9871 8080 10314 3001 -999 -8731 -7418 194 4826 6032 -1859
14741 -1859 -11972 -14403 -12464 -6754 2840 5752 6635 11472 8364 -2136 -5891 -9182 -10158 -8396 -1927
14726 -1927 8257 13145 6161 -2191 -13676 -25152 -23987 -15798 -14222 -14491 -16573 -9957 -7179 2445
14712 2445 8200 11244 6747 -3248 -7451 -10408 -11997 5 5539 8330 7324 -1980 -11021 -14799
14698 -14799 -7309 -891 8938 15733 3481 -5889 -17261 -13359 181 -1451 -620 -5051 -2303 7442
14684 7442 -2015 -5714 -8385 -8651 -8223 -4324 943 -4190 -9549 -6217 -3253 -3824 -7454 -9480 -11804
14669 -11804 -6639 -5143 -10176 837 8845 8114 7881 615 -3729 -3964 -809 -1967 -1186 -110 5077
14654 5077 3116 67 1645 -3563 -3026 -6050 -1517 7769 4850 1772 -7032 -14130 -15766 -9461 -16460
$$ packed form
14755a0789k863J790P41J250J7951K234p313m000p732J313P612M632J206p891
14741a859j0113k431J939N710R594K912Q83M837l108j0500l755l291r76J762O469
14726a927J0184M888o984q352j1485j1476J165Q189J576k69k082O616K778R624
14712B445N755L044m497r995m203k957j589J2002N534K791j006r304r041l778
14698a4799P490O418R829O795j2252r370j1372L902J3540j632Q31m431K748R745
14684G442r457l699k671k66M28L899N267n133n359L332K964n71l630k026k324
14669a1804N165J496n033J1013Q008p31k33p266m344k35L155j158P81J076N187
14654E077j961l049J578n208N37l024M533R286k919l078q804p098j636O305o999
$$ plain form
14639 -16460 -25583 -6950 12344 10176 5803 -2748 -4665 -5399 -5734 -5243 -5760 -5519 -8749 -12811 3082
14624 3082 8558 5141 5760 -4457 -155 12814 9551 2625 6782 9209 1012 -1750 -2402 -2289 4721
14609 4721 18165 15270 5194 8386 5525 -313 -1283 -4613 -7773 -9180 -5865 -2702 -1140 2011
14595 2011 -3988 -9105 -9103 -9242 -7840 -5177 -10578 -7616 -5864 -11204 -10971 -12290 -8997 -16741 -12606 -9279
14579 -9279 -15146 -2542 -676 -4665 -10727 -14532 -7099 3668 12771 11816 11255 16991 15360 17282 6422
14564 6422 4123 13312 18012 13911 13145 11892 17838 21837 18363 13127 10575 4982 -2339 -6867 -921
14549 -921 -875 -6751 5147 6432 -2617 -2428 -2606 -966 1295 -3640 3962 12228 18643 13334 935
14534 935 -3700 -6628 -2697 -8726 -8585 -6038 3205 6231 -1580 -4344 -1431 -3388 -8466 -9772 -8811
$$ packed form
14639a6460r123J8633J9294k168m373q551j917p34l35M91n17K41l230m062J5893
14624C082N476l417O19j0217M302J2969l263o926M157K427q197k762o52J13P010
14609D721J3444k895j0076L192k861n838r70l330l160j407L315L163J562L151
14595B011n999n117Kj39J402K663n401K962J752n340K33j319L293p744M135L327
14579i279n867J2604J866l989o062l805P433J0767R103r55n61N736j631J922j0860
14564F422k299R189M700m101p66j253N946L999l474n236k552n593p321m528N946
14549i21M6n876J1898J285r049J89j78J640K261m935P602Q266O415n309j2399
14534I35m635k928L931o029J41K547R243L026p811k764K913j957n078j306R61
$$ plain form
14519 -8811 -3330 -4007 -3513 -4239 -1834 -3824 -10878 -9539 -1436 -3159 -2402 3667 9501 4929 -2473 -3116
14503 -3116 1259 6334 4747 -914 -6626 -2801 -11750 -13369 -8520 -5195 251 5007 5213 7523 5220
14488 5220 110 -4145 -11872 2431 3658 -6577 -14108 -14940 -12711 -11372 -3228 -1500 1284 -4064
14474 -4064 -6586 -3908 -5355 -8016 -8328 6851 16224 17269 887 -12601 -11232 137 10075 17207
14460 17207 14179 1587 -7374 -6487 -1958 -8855 -6254 -813 -973 2639 7216 7215 -6532 -10267 1750
14445 1750 4579 -3256 -14004 -9618 3511 -556 -6387 -15917 -11863 -642 8145 9671 6189 -610
14431 -610 -13394 -17895 -16011 -12076 94 1753 2203 2992 1742 4505 1635 724 -5107 -3602 -4423
14416 -4423 -9699 -10546 -8970 -4421 -17965 -12090 -4776 -1907 946 -2577 -2028 -3929 -3296 -4444 -8164
$$ packed form
14519h811N481o77M94p26K405j990p054J339Q103j723P57O069N834m572p402o43
14503c116M375N075j587n661n712L825q949j619M849L325N446M756K06K310k303
14488E220n110m255p727J4303J227j0235p531q32K229J339Q144J728K784n348
14474d064k522K678j447k661l12J5179R373J045j6382j3488J369J1369R938P132
14460A7207l028j2592q961Q87M529o897K601N441j60L612M577jj3747l735J2017
14445A750K829p835j0748M386J3129m067n831r530M054J1221Q787J526l482o799
14431f10j2784m501J884L935J2170J659M50P89j250K763k870r11n831J505q21
14416d423n276q47J576M549j3544N875P314K869K853l523N49j901O33j148l720
$$ plain form
14401 -8164 -9151 -3533 -4675 -2646 -5628 -1457 6193 -1474 -8397 -7235 -6797 3824 23043 23660 17295
14386 17295 22614 15534 10817 4759 820 -4521 -6794 -4150 2815 -1813 -4912 -1693 6023 8555
14372 8555 8950 8170 9848 13490 4738 -404 -1630 4555 1932 1118 1045 4880 5251 4333 -3210 -10998
14356 -10998 -11620 -3026 -5080 -3435 -1800 6599 4536 -8396 -4657 -7076 -11634 -10046 -7010 -9285
14342 -9285 -12976 -15644 -10237 -7648 -11572 -12032 -11833 -8508 -4820 -4526 819 9156 11700 7258 2867
14327 2867 -1601 -4637 -2048 -5250 -1887 5032 636 -9169 -1777 4855 3713 5223 11586 11852 17105
14312 17105 16376 8333 12932 6764 5270 5559 2647 8495 17676 13633 11481 5955 5922 7014 5388
14297 5388 11241 4943 -9849 -11646 1899 -5681 -5980 -7024 -11177 -14524 -11596 -11024 -9445 -8411 -5573
$$ packed form
14401h164r87N618j142K029k982M171P650p667o923J162M38J0621J9219O17o365
14386A7295N319p080m717o058l939n341k273K644O965m628l099L219P716K532
14372H555L95p80J678L642q752n142j226O185k623q14p3L835L71r18p543p788
14356a0998o22Q594k054J645J635Q399k063j2932L739k419m558J588L036k275
14342i285l691k668N407K589l924m60J99L325L688K94N345Q337K544m442m391
14327B867m468l036K589l202L363O919m396r805P392O632j142J510O363K66N253
14312A7105p29q043M599o168j494K89k912N848R181m043k152n526l3J092j626
14297E388N853o298j4792j797J3545p580k99j044m153l347K928N72J579J034K838
$$ plain form
14282 -5573 1160 3056 -640 599 1849 6118 9898 6513 5035 -5400 -11817 -15436 -10459 -10296 -5821
14267 -5821 -670 -4183 140 2665 6086 11978 4444 5419 -238 3695 11221 9048 7866 5051 6473
14252 6473 6781 4493 -953 -2811 4030 12807 8444 5510 1123 8124 2139 490 6686 8227 5293
14237 5293 748 -2936 -56 -2833 -15044 -7913 -1383 -8989 -6822 -5367 508 693 430 1405 -289
14222 -289 -2972 -10851 -11085 -1695 -290 -11834 -12776 -9538 -12780 -6005 -3445 -9819 -12868 -8427 -9254
14207 -9254 -8077 3927 11727 4383 2407 2030 3251 -425 11423 17245 12160 10274 15142 11166
14193 11166 10451 6304 7942 9741 -5992 -5217 254 -4011 5131 2981 -3661 -5605 -9216 -9686 -5355
14178 -5355 6365 14538 16515 10526 7358 9510 11737 3324 -5512 -2340 1075 -67 -215 -16332
$$ packed form
14282e573O733J896l696J239J250M269L780l385j478j0435o417l619M977J63M475
14267e821N151l513M323K525L421N892p534R75n657L933P526k173j182k815J422
14252F473L08k288n446j858O841Q777m363k934m387P001n985j649O196J541k934
14237E293m545l684K880k777j2211P131O530p606K167J455N875J85k63R75j694
14222b89k683p879k34R390J405j1544r42L238l242O775K560o374l049M441q27
14207i254J177J2004P800p344j976l77J221l676J1848N822n085j886M868l976
14193A1166p15m147J638J799j5733P75N471m265R142k150o642j944l611m70M331
14178e355J1720Q173J977n989l168K152K227q413q836L172L415j142j48j6117
$$ plain form
14164 -16332 -13961 -5302 -3011 407 -161 3234 9402 3789 -9806 -14322 -13698 -14844 -7213 -1704 998
14149 998 714 -929 -4758 -2898 -10211 -11695 -17635 -22010 -19779 -8299 1717 2761 1996 -3113 -2054
14134 -2054 -4119 -567 -939 -3635 5980 12635 12240 -3075 -3121 6658 14689 16697 7038 -5230 118
14119 118 190 4406 7265 6563 536 -270 -4303 -5992 -6896 -12406 -13037 -13497 -4955 -9623 -14687 -8454 285
14102 285 2515 5017 4475 3766 -2940 -1295 4316 780 -4881 -9657 -10909 -1379 5206 3582 3094 -6474
14086 -6474 -11068 -7947 -3448 -1054 4678 10030 8258 9974 13282 5858 -2386 -2122 -8800 -11347 -1958
14071 -1958 -3975 -11411 -10024 -6400 -6953 -10609 -8770 -7776 -8227 -6687 -5049 -1459 -8264 -5829 -2939
14056 -2939 -663 3374 -2178 -8766 -8083 -5052 -7232 -9911 -9429 -8709 -6880 -9799 -12022 -7633 -410
$$ packed form
14164a6332K371Q659K291L418n68L395O168n613j3595m516O24j146P631N509K702
14149I98k84j643l829J860p313j484n940m375K231J1480J0016J044p65n109J059
14134b054k065L552l72k696R615O655l95j5315m6R779Q031K008r659j2268N348
14119A18P2M216K859p02o027q06m033j689r04n510o31m60Q542m668n064O233Q739
14102B85K230K502n42p09o706J645N611l536n661m776j252R530O585j624m88r568
14086f474m594L121M499K394N732N352j772J716L308p424q244K64o678k547R389
14071a958k017p436J387L624n53l656J839R94m51J540J638L590o805K435K890
14056b939K276M037n552o588O83L031k180k679M82P20J829k919k223M389P223
$$ plain form
14041 -410 -1314 -1165 5408 2586 275 -262 1532 566 -1048 4348 7863 10998 9502 7533 12044 5069
14025 5069 2277 1732 -4698 -3986 3259 8991 -1230 -2724 321 -3725 -10073 -10539 -5276 -3003 -2249
14010 -2249 -4445 -3699 -865 -4556 -9294 -16325 -14282 -15001 -11096 -3783 -786 2991 -531 -4574 -4908
13995 -4908 -8892 -12177 -12741 -11044 -5371 -636 -4430 -1676 -2484 3865 10858 4571 -1445 -3339 -1542
13980 -1542 2869 6097 11812 14494 14889 10327 5587 13450 6144 3828 -982 -3966 -17 -4454 -9547
13965 -9547 -11500 -15642 -13208 -17225 -11262 -12358 -20340 -21742 -20484 -14659 -371 4321 -710 3579
13951 3579 5236 3943 413 6865 3892 4961 -3780 -9996 2039 12358 19081 8580 -4499 3549
13937 3549 3091 -469 -178 -576 -2098 -367 392 112 822 4324 101 -571 2060 -665 8261 7629 3809
$$ packed form
14041d10r04J49O573k822k311n37J794r66j614N396L515L135j496j969M511o975
14025E069k792n45o430P12P245N732j0221j494L045m046o348m66N263K273P54
14010b249k196P46K834l691m738p031K043p19L905P313K997L777l522m043l34
13995d908l984l285n64J697N673M735l794K754q08O349O993o287o016j894J797
13980a542M411L228N715K682L95m562m740P863p306k316m810k984L949m437n093
13965i547j953m142K434m017N963j096p982j402J258N825J4288M692n031M289
13951C579J657j293l530O452k973J069q741o216J2035J0319O723j0501j3079Q048
13937C549m58l560K91l98j522J731P59k80P10L502m223o72K631k725Q926o32l820
$$ plain form
13920 3809 -2354 -9404 -17056 -10907 -9073 -5197 -225 3346 -9958 -21764 -24596 -17689 -7802 -4889
13906 -4889 -6011 -7406 5080 13029 4123 2660 6009 -4361 3133 13298 10637 11758 18915 15663
13892 15663 5915 3754 473 -179 2939 8210 18691 25501 26350 14005 8335 6523 1102 4647
13878 4647 7767 -610 -3454 -2949 8350 11946 8535 8283 12566 18193 14246 7691 8164 4550 2342
13863 2342 -7661 -9328 -3825 -5575 -2379 -3307 -6334 -13451 -3685 -3295 -8746 -9225 -902 -1914 -6349
13848 -6349 409 -8863 -12267 -8056 -1302 -7889 -12743 -5807 -2847 -890 4180 -2476 -14305 -14171 -9793
13833 -9793 -6519 -3865 -6084 -12093 -8804 -4450 -2191 1307 6758 8684 -4554 -1207 -578 3494 10756
13818 10756 5743 3270 2845 -1103 6516 5188 -1394 -1050 4944 10709 1398 -6836 -14033 -11502 -9871
$$ packed form
13920C809o163p050p652O149J834L876M972L571j3304j1806k832O907R887K913
13906d889j122j395J2486P949q906j463L349j0370P494J0165k661J121P157l252
13892A5663r748k161l281o52L118N271J0481O810Q49j2345n670j812n421L545
13878D647L120q377k844N05J1299L596l411k52M283N627l947o555M73l614k208
13863B342j0003j667N503j750L196r28l027p117R766L90n451m79Q323j012m435
13848f349O758r272l404M211O754o587m854O936K960J957N070o656j1829J34M378
13833i793L274K654k219o009L289M354K259L498N451J926j3238L347O29M072P262
13818A0756n013k473m25l948P619j328o582L44N994N765r311q234p197K531J631
$$ plain form
13803 -9871 4271 15586 13149 -1253 706 7522 5019 4600 6819 8116 370 1374 4879 8985
13789 8985 3969 -4129 -20753 -14130 -5936 -10551 -8905 2974 14645 7663 1019 -2809 7713 9364
13775 9364 16512 13936 9067 8547 14413 14962 12456 2907 -8808 -3803 281 783 -1892 -3161 -3773
13760 -3773 -6832 -5764 -2511 -796 -954 6477 6389 13486 18017 14908 18772 15514 16693 7411 -7071
13745 -7071 -19416 -15879 -7213 -9377 -5053 -2405 2628 1232 2255 11012 11746 14049 10665 10932 4588
13730 4588 -168 -1371 2382 2761 -2736 1141 -1622 -4010 -2547 -1179 -7660 -14597 -9222 -9174 -8166
13715 -8166 -410 10091 10737 -545 -2503 3608 9037 9894 10340 1718 -1059 1111 1638 -5834 -6480
13700 -6480 2393 10820 16174 9709 5996 13180 11224 15195 17740 23464 28762 14862 16987 14885
$$ packed form
13803i871J4142J1315k437j4402J959O816k503m19K219J297p746J004L505M106
13789H985n016q098j6624O623Q194m615J646J1879J1671o982o644l828J0522J651
13775I364P148k576m869n20N866N49k506r549j1715N005M084N02k675j269o12
13760c773l059J068L253J715j58P431q8P097M531l109L864l258J179r282j4482
13745g071j2345L537Q666k164M324K648N033j396J023Q757P34K303l384K67o344
13730D588m756j203L753L79n497L877k763k388J463J368o481o937N375M8J008
13715h166P756J0501O46j1282j958O111N429Q57M46q622k777K170N27p472o46
13700f480Q873Q427N354o465l713P184j956L971K545N724N298j3900K125k102
$$ plain form
13686 14885 4559 -2754 -5965 -5735 -5707 -10767 -10461 -12816 -2889 -1673 -5797 -2487 -776 4028 7771
13671 7771 4712 -5099 -6991 1489 3242 -1160 -5515 -5769 7305 9889 12650 6768 1617 921 -2677
13656 -2677 723 15009 18263 13463 4386 5668 4227 7514 10537 3016 2755 4066 -876 4341 2907
13641 2907 8806 6770 10436 9854 14015 19056 25808 22429 6443 -6289 -9687 -13162 -7733 -4940
13627 -4940 -7504 -4536 1138 9601 6800 13659 12623 17955 18170 16927 23823 14616 632 -1049 5738
13612 5738 2507 -4103 -975 -1504 3567 -4762 -15149 -15049 -5559 -3782 -14105 -9857 -4050 5225 15096
13597 15096 9326 1566 -7901 -7808 -9191 1002 -420 582 5252 12560 17301 20857 22087 16496 12970
13582 12970 9084 2692 -6147 -8490 -7968 -3263 7196 5596 -164 -2067 -1629 -3235 6985 11255
$$ packed form
13686A4885j0326p313l211K30K8n060L06k355R927J216m124L310J711M804L743
13671G771l059r811j892Q480J753m402m355k54J3074K584K761n882n151o96l598
13656b677L400J4286L254m800r077J282j441L287L023p521k61J311m942N217j434
13641B907N899k036L666n82M161N041O752l379j5986j2732l398l475N429K793
13627d940k564K968N674Q463k801O859j036N332K15j243O896r207j3984j681O787
13612E738l231o610L128n29N071q329j0387J00R490J777j0323M248N807R275R871
13597A5096n770p760r467R3j383J0193j422J002M670P308M741L556J230n591l526
13582A2970l886o392q839k343N22M705J0459j600n760j903M38j606J0220M270
$$ plain form
13568 11255 12486 15822 5852 5188 9403 7045 5242 1181 -3714 -2757 -4979 -6021 -6019 -1533 -3264 -3392
13552 -3392 10065 9055 4506 9314 19791 21813 29460 30586 25561 15948 11886 13690 17250 15525
13538 15525 11544 7962 4020 1495 7883 12301 9032 10815 17921 26737 28144 30860 32736 26108
13524 26108 28454 22935 26144 26593 19877 10140 1740 1520 3665 12396 9434 6978 1192 -7543 -8061
13509 -8061 -3177 1964 4999 2662 5799 16729 26106 22907 20412 20461 16478 12471 12968 6574 6132
13494 6132 5762 7848 15321 24315 21735 13157 5553 3343 7478 9456 7423 13385 9052 6294 362
13479 362 -8357 -394 8147 6069 9915 9863 5925 8510 16296 21250 22758 26637 21870 17591 23859
13464 23859 23175 19057 14714 5384 6912 9560 8502 6734 16183 18978 16422 15151 9380 7891 8098
$$ packed form
13568A1255J231L336r970o64M215k358j803m061m895R57k222j042KM486j731j28
13552c392J3457j010m549M808J0477K022P647J126n025r613m062J804L560j725
13538A5525l981l582l942k525O388M418l269J783P106Q816J407K716J876o628
13524B6108K346n519L209M49o716r737q400k20K145Q731k962k456n786q735n18
13509h061M884N141L035k337L137J0930R377l199k495M9l983m007M97o394m42
13494F132l70K086P473Q994k580q578p604k210M135J978k033N962m333k758n932
13479C62q719P963Q541k078L846n2l938K585P786M954J508L879m767m279O268
13464B3859o84m118m343r330J528K648j058j768R449K795k556j271n771j489K07
$$ plain form
13449 8098 11058 15983 14293 6471 6751 7026 -791 2277 5890 -2431 955 11340 -1454 -8572 -10144
13434 -10144 -6167 -2493 868 10977 16569 8885 12191 7797 4998 3832 1503 684 5472 12517
13420 12517 7247 266 6838 1927 1497 15217 10464 10279 8115 -11299 -15092 -11629 -3854 5126
13406 5126 4899 7343 9884 4502 399 -688 9965 12835 14863 7693 628 -2017 2210 521 -1376
13391 -1376 -3870 -2294 13168 12907 7077 3038 7395 19273 22813 15170 13711 16008 14467 5213
13377 5213 -997 2169 4100 2926 10142 16147 10014 7812 2770 788 6050 17101 20870 17256
13363 17256 21785 20643 16215 39 -6031 -304 2195 2873 10076 18974 13118 1736 2110 328
13349 328 2975 1647 685 3745 2492 7369 17502 12378 11296 11102 2614 1407 1485 -4939 -4566 -1703
$$ packed form
13449H098K960M925j690p822K80K75p817L068L613q321L386J0385j2794p118j572
13434a0144L977L674L361J0109N592p684L306m394k799j166k329q19M788P045
13420A2517n270o981O572m911m30J3720m753j85k164j9414l793L463P775Q980
13406E126k27K444K541n382m103j087J0653K870K028p170p065k645M227j689j897
13391a376k494J576J5462k61n830m039M357J1878L540p643j459K297j541r254
13377E213o210L166J931j174P216O005o133k202n042j982N262J1051L769l614
13363A7256M529j142m428j6176o070N727K499O78P203Q898n856j1382L74j782
13349C28K647j328r62L060j253M877J0133n124j082j94q488j207P8o424L73K863
$$ plain form
13333 -1703 2142 9259 695 -11075 -14771 -5542 1967 619 5141 6295 8929 7883 2892 -1610
13319 -1610 -8557 -2631 2187 -2884 -3097 2451 9232 12993 20483 29369 31080 29073 11157 7262 3391
13304 3391 7648 14009 16286 20480 27767 20148 12891 13852 23461 20116 18525 21081 24927 20894 8494
13289 8494 8137 12830 13994 11817 7966 9364 9445 9787 12508 6857 10521 8715 9817 7729 3783 11393
13273 11393 13614 15107 14839 6764 2292 4482 -1383 1655 9368 13607 17205 11273 11838 12853 11442
13258 11442 9097 5065 2209 534 320 -5394 -6515 119 12132 13858 7983 8190 7511 10335 14317
13243 14317 15177 7101 11976 12021 6415 17102 23245 19406 8310 17679 25551 27410 25390 20727 17640
13228 17640 18368 16634 24679 26317 22117 28734 34827 32191 30603 23209 27170 26967 39724 48697 48500
$$ packed form
13333a703L845P117q564j1770l696R229P509j348M522J154K634j046m991m502
13319a610o947N926M818n071k13N548O781L761P490Q886J711k007j7916l895l871
13304C391M257O361K277M194P287p619p257R61R609l345j591K556L846m033j2400
13289H494l57M693J164k177l851J398Q1L42K721n651L664j806J102k088l946P610
13273A1393K221J493k68q075m472K190n865L038P713M239L598n932N65J015j411
13258A1442k345m032k856j675k14n714j121O634J2013J726n875K07o79K824L982
13243A4317Q60q076M875M5n606J0687O143l839j1096R369P872J859k020m663l087
13228A7640P28j734Q045J638m200O617O093k636j588p394L961k03J2757Q973j97
$$ plain form
13213 48500 54558 64691 82980 125472 157214 167378 162755 158597 154256 157167 142831 117990 104238
13200 104238 91113 81323 67706 65704 59413 55800 59723 61611 68482 70288 70445 81620 93958
13187 93958 108826 101855 100820 103920 106351 110361 109903 109796 107814 114600 130676 155286 168810 181178
13173 181178 178087 170461 170691 165939 173369 190883 231847 280309 323312 343715 341828 298069 240714
13160 240714 198209 165211 141173 122181 120180 101627 88959 82639 81714 77811 79629 93211 106960
13147 106960 120031 130806 144937 160498 160646 158275 134953 114717 95905 88142 85177 73048
13135 73048 69338 63508 50290 48984 53195 52057 51666 55303 64734 68438 64314 78509 102761 133908
13121 133908 181069 238239 268337 264284 222816 167415 118427 92919 76167 62358 52507 49416
$$ packed form
13213D8500O058J0133J8289M2492L1742J0164m623m158m341K911j4336k4841j3752
13200A04238j3125r790j3617k002o291l613L923J888O871J806J57J1175J2338
13187I3958J4868o971j035L100K431M010m58j07j982O786J6076K4610J3524J2368
13173A81178l091p626K30m752P430J7514M0964M8462M3003K0403j887m3759n7355
13160B40714m2505l2998k4038j8992k001j8553j2668o320r25l903J818J3582J3749
13147A06960J3071J0775J4131J5561J48k371k3322k0236j8812p763k965j2129
13135G3048l710n830j3218j306M211j138l91L637R431L704m124J4195K4252L1147
13121A33908M7161N7170L0098m053m1468n5401m8988k5508j6752j3809r851l091
$$ plain form
13109 49416 40133 43407 44298 37748 27773 26438 20837 21972 28923 31455 27694 19291 18142 14556 16544
13094 16544 19272 21952 29420 30861 29963 29318 27957 27904 29719 20458 15330 17063 27492 27616 16974
13079 16974 17700 34664 55057 83946 102812 97555 92567 78077 68539 52061 43300 39053 29082
13066 29082 22039 18673 21519 24104 18424 19022 15588 15882 24703 29840 31078 35130 38011 25898 15979
13051 15979 18420 29736 27614 19481 9084 5475 6369 1239 10993 24935 30988 34860 32328 27884
13037 27884 23811 18747 27001 37357 45774 49504 47285 40759 36834 42841 45047 36121 29371 31920
13023 31920 28985 32433 34749 32024 35952 37066 40213 32370 22443 29001 30241 33551 39577 39594 45654
13008 45654 42816 43025 42269 45632 42776 42587 48098 53318 49155 37368 37071 44379 46171 44129 47171
$$ packed form
13109D9416r283L274Q91o550r975j335n601J135O951K532l761q403j149l586J988
13094A6544K728K680P468J441q98o45j361n3J815r261n128J733J0429J24j0642
13079A6974P26J6964K0393K8889J8866n257m988j4490r538j6478q761m247r971
13066B9082p043l366K846K585n680N98l434K94Q821N137J238M052K881j2113r919
13051A5979K441J1316k122q133j0397l609Q94n130R754J3942O053L872k532m444
13037B7884m073n064Q254J0356Q417L730k219o526l925O007K206q926o750K549
13023C1920k935L448K316k725L928J114L147p843r927O558J240L310O026J7O060
13008D5654k838K09p56L363k856j89N511N220m163j1787k97P308J792k042L042
$$ plain form
12993 47171 50673 49224 46486 45660 36447 35160 36636 44572 47007 38870 42575 46091 50862 49104 51522
12978 51522 55940 51647 54399 57285 52560 52250 55809 57122 57847 63285 60814 61740 61246 63786 65910
12963 65910 69506 68292 58420 50460 55935 52459 44031 45113 52933 62186 59733 50694 48341 48522 49087
12948 49087 51454 55299 56338 49793 54614 55559 53988 44335 41795 45499 43292 36908 40547 48021 49483
12933 49483 50525 38664 31388 38086 40503 43880 50540 52255 53578 55286 50856 46538 48924 45819
12919 45819 34968 26391 33700 40526 49660 61784 67223 61000 67276 67384 61745 61272 54702 60989
12905 60989 69380 68655 75783 72796 67188 64772 70720 73488 60874 55937 56288 57176 56352 55043 58730
12890 58730 62144 64800 75412 77568 78453 83817 87414 89164 98191 98277 98980 101499 103694 117840 123613
$$ packed form
12993D7171L502j449k738q26r213j287J476P936K435q137L705L516M771j758K418
12978E1522M418m293K752K886m725l10L559J313P25N438k471R26m94K540K124
12963F5910L596j214r872p960N475l476q428J082P820R253k453r039k353J81N65
12948D9087K367L845J039o545M821R45j571r653k540L704k207o384L639P474J462
12933D9483J042j1861p276O698K417L377O660J715J323J708m430m318K386l105
12919D5819j0851q577P309O826R134J2124N439o223O276J08n639m73o570O287
12905F0989Q391p25P128k987n608k416N948K768j2614m937L51Q88q24j309L687
12890E8730L414K656J0612K156Q85N364L597J750R027Q6P03K519K195J4146N773
$$ plain form
12875 123613 132487 139094 147052 149672 139740 131580 128835 121820 105118 98068 101690 105865 96957 92512
12861 92512 95268 95403 97828 96714 90195 94243 96439 99771 103561 102505 106238 108315 109385 101969 110663
12846 110663 121024 122588 124462 125136 132989 133784 131399 128918 115994 111071 113453 120210 123118 121685
12832 121685 124799 128831 137707 140537 139565 119579 110447 120766 130494 139525 141655 146300 160479 175608
12818 175608 182550 188815 193520 180889 178720 192089 196887 204916 208926 211623 221039 229110 227950 240739
12804 240739 245797 253031 266413 273799 283130 286835 285199 295684 313034 320733 321472 330827 348320
12791 348320 360596 384373 405855 435192 467354 495818 524424 555358 584781 615554 654092
12780 654092 698378 747924 801546 859564 940083 1030711 1132851 1251220 1376989 1514490 1685041
$$ packed form
12875A23613Q874O607P958K620r932q160k745p015j6702p050L622M175q908m445
12861I2512K756J35K425j114o519M048K196L332L790j056L733K077J070p416Q694
12846A10663J0361J564J874O74P853P95k385k481j2924m923K382O757K908j433
12832A21685L114M032Q876K830r72j9986r132J0319R728R031K130M645J4179J5129
12818A75608O942O265M705j2631k169J3369M798Q029M010K697R416Q071j160J2789
12804B40739N058P234J3382P386R331L705j636J0485J7350P699P39R355J7493
12791C48320J2276K3777K1482K9337L2162K8464K8606L0934K9423L0773L8538
12780F54092M4286M9546N3622N8018Q0519R0628J02140J18369J25769J37501J70551
$$ plain form
12769 1685041 1882285 2107758 2358135 2653396 3048688 3593571 4335691 5358350 6786648
12760 6786648 8758111 11409532 14801412 18752171 22605347 25327683 26063380 24699413
12752 24699413 21883907 18561738 15445849 12874834 10911207 9493374 8554434 8010632
12744 8010632 7830321 7966005 8380773 9077905 10063011 11272812 12586392 13874724 14999338
12735 14999338 15867741 16476216 16890619 17279506 17853598 18803186 20277500 22271198 24603229
12726 24603229 26833198 28343928 28629653 27594523 25594229 23239186 21038522 19282333
12718 19282333 18024137 17230646 16804539 16627068 16585934 16517244 16267142 15706465 14808369
12709 14808369 13652400 12392216 11173820 10122953 9297356 8749632 8517089 8663762 9262515
$$ packed form
12769A685041J97244K25473K50377K95261L95292N44883P42120J022659J428298
12760F786648J971463K651421L391880L950759L853176K722336P35697j363967
12752B4699413k815506l322169l115889k571015j963627j417833r38940n43802
12744H010632j80311J35684M14768O97132R85106J209801J313580J288332J124614
12735A4999338Q68403O08475M14403L88887N74092R49588J474314J993698K332031
12726B4603229K229969J510730K85725j035130k000294k355043k200664j756189
12718A9282333j258196p93491m26107j77471m1134o8690k50102n60677q98096
12709A4808369j155969j260184j218396j050867q25597n47724k32543J46673N98753
$$ plain form
12700 9262515 10421698 12270528 14927898 18382962 22341864 26124736 28680345 29119716
12692 29119716 27262988 23728358 19600749 15732184 12499206 9945537 7962485 6430590
12684 6430590 5262488 4392723 3715560 3186313 2759392 2418288 2149457 1919368 1716407
12675 1716407 1534972 1380687 1245172 1117001 998839 898769 810830 752479 698860 646978
12665 646978 608652 580347 561171 538005 524676 524758 540145 555182 551549 533876 509458 467583
12653 467583 425586 385893 358125 338165 314871 294734 277299 265363 254706 239775 233808 219485
12641 219485 210164 204601 203072 193353 182695 168638 158247 155474 165573 160038 156656 157632 157661 170178
12627 170178 179967 177275 171353 182438 166715 158545 159773 142032 126962 117418 117219 115277 112584
$$ packed form
12700I262515J159183J848830K657370L455064L958902L782872K555609M39371
12692B9119716j856728l534630m127609l868565l232978k553669j983052j531895
12684F430590j168102q69765o77163n29247m26921l41104k68831k30089k02961
12675A716407j81435j54285j35515j28171j18162j00070q7939n8351n3619n1882
12665F46978l8326k8305j9176k3166j3329Q2J5387J5037l633j7673k4418m1875
12653D67583m1997l9693k7768j9960k3294k0137j7435j1936j0657j4931n967j4323
12641B19485r321n563j529r719j0658j4057j0391k773J0099n535l382R76K9J2517
12627A70178R789k692n922J1085j5723q170J228j7741j5070r544j99j942k693
$$ plain form
12614 112584 113929 112095 111735 109163 104633 97956 89916 83388 76548 70103 72453 68464 65055 71577
12600 71577 81483 79686 79307 86872 87654 97055 99351 99122 93641 92676 97592 93615 82661 72424 70260
12585 70260 75463 87315 98330 91229 95079 111182 122635 137845 145710 149338 140890 131815 120628
12572 120628 99510 81854 85372 75372 75999 81893 82619 79042 77921 81779 78836 62846 63597 62635
12558 62635 60508 60066 55121 54034 53180 49634 46511 52574 59632 42966 38124 53300 52990 48859 45945
12543 45945 42464 41973 28487 24355 23270 38736 46089 46595 46070 41830 46579 50607 55105 60464 65378
12528 65378 62495 58185 57312 53935 56556 58078 61259 59975 55598 58828 64426 64571 74298 83686 80501
12513 80501 76316 80226 79318 79037 64273 64386 71528 84087 85307 94480 92593 100708 96189 89449 85387
$$ packed form
12614A12584J345j834l60k572m530o677q040o528o840o445K350l989l409O522
12600G1577R906j797l79P565P82R401K296k29n481r65M916l977j0954j0237k164
12585G0260N203J1852J1015p101L850J6103J1453J5210P865L628q448r075j1187
12572A20628k1118j7656L518j0000O27N894P26l577j121L858k943j5990P51r62
12558F2635k127m42m945j087q54l546l123O063P058j6666m842J5176l10m131k914
12543D5945l481m91j3486m132j085J5466P353N06n25m240M749M028M498N359M914
12528F5378k883m310q73l377K621J522L181j284m377L230N598J45R727R388l185
12513H0501m185L910r08k81j4764J13P142J2559J220R173j887Q115m519o740m062
$$ plain form
12498 85387 75109 76179 74819 67192 66716 65430 61312 61393 66885 71308 90543 103308 116602 111944
12484 111944 117764 119846 122869 127113 126742 128502 125240 111598 112686 112668 116165 107566 102512 98397 95418
12469 95418 105124 118298 111528 97844 100217 96860 92115 89375 95763 101611 96201 95668 100911 93946
12455 93946 95414 89807 88262 93132 96908 120439 133238 136754 135491 139300 127900 117947 114490 114485
12441 114485 119497 127703 141542 142500 139178 132436 128376 131213 142069 142676 146058 139534 132117 136481
12427 136481 142072 146512 156711 150687 148913 160398 173502 172564 173509 184221 197631 202655 200840
12414 200840 204742 211054 215230 221699 232554 244352 255797 265746 267818 267534 281097 293039 297386
12401 297386 293929 307041 321163 334520 346509 347475 350032 345952 345875 362185 373855 383717 391561
$$ packed form
12498H5387j0278J070j360p627m76j286m118Q1N492M423J9235J2765J3294m658
12484A11944N820K082L023M244l71J760l262j3642J088j8L497q599n054m115k979
12469I5418R706J3174o770j3684K373l357m745k740O388N848n410n33N243o965
12455I3946J468n607j545M870L776K3531J2799L516j263L809j1400r953l457n
12441A14485N012Q206J3839R58l322o742m060K837J0856O07L382o524p417M364
12427A36481N591M440J0199o024j774J1485J3104r38R45J0712J3410N024j815
12414B00840L902O312M176O469J0855J1798J1445R949K072k84J3563J1942M347
12401B97386l457J3112J4122J3357J1989R66K557m080p7J6310J1670R862P844
$$ plain form
12388 391561 397520 412399 420888 436473 455071 470133 477308 489743 502231 511262 511920 521662 531670
12375 531670 535069 542927 544640 550850 562535 581963 595474 609110 613869 617758 619448 621144 619508
12362 619508 617228 621171 632051 639731 639578 627493 605076 593175 586073 587640 599389 606664 613249
12349 613249 613834 609589 609141 595357 586514 587815 582438 566896 544343 525078 510050 502405 487273
12336 487273 475375 469820 453720 442127 432535 422573 419155 408596 399184 403065 401519 392856 392040
12323 392040 387691 378046 363843 351764 326246 301666 294217 294322 295577 298409 296005 301112 302013 291080
12309 291080 275757 256396 254650 265372 264402 263347 271316 274833 286298 302901 309004 308860 311783
12296 311783 305551 292996 269477 255036 246918 236671 240911 245282 238559 227251 221674 211841 203020
$$ packed form
12388C91561N959J4879Q489J5585J8598J5062P175J2435J2488R031O58R742J0008
12375E31670L399P858J713O210J1685J9428J3511J3636M759L889J690J696j636
12362F19508k280L943J0880P680j53j2085k2417j1901p102J567J1749P275O585
12349F13249N85m245m48j3784q843J301n377j5542k2553j9265j5028p645j5132
12336D87273j1898n555j6100j1593r592r962l418j0559r412L881j546q663q16
12323C92040m349r645j4203j2079k5518k4580p449J05J255K832k404N107R01j0933
12309B91080j5323j9361j746J0722r70j055P969L517J1465J6603O103j44K923
12296C11783o232j2555k3519j4441q118j0247M240M371o723j1308n577r833q821
$$ plain form
12283 203020 202660 209113 216422 216416 224493 233576 223978 223958 220055 217574 219082 227586 231482 242418 251084
12268 251084 245707 240287 232263 219372 208539 199723 197201 193652 192716 187394 189236 188977 179481 173698
12254 173698 173603 175666 174141 169351 165115 160317 163888 177840 192487 211442 233612 237534 221827
12241 221827 204500 203583 209623 222720 237452 237805 219982 207810 186278 157644 138248 125669
12229 125669 108385 96807 91498 88780 79474 72173 68379 62132 63387 63686 59948 62746 64306 60888
12215 60888 56511 65406 67974 70443 63556 61293 59279 59289 59806 49921 45692 68059 93375 109376
12201 109376 117552 134016 145879 133187 108066 81407 74159 61696 50446 46534 57904 62818
12189 62818 54107 48906 51149 50493 37102 30375 30361 30040 27323 30592 29858 36799 50784 48670 38393
$$ packed form
12283B03020l60O453P309oQ077R083r598k0l903k481J508Q504L896J0936Q666
12268B51084n377n420q024j2891j0833q816k522l549r36n322J842k59r496n783
12254A73698r5K063j525m790m236m798L571J3952J4647J8955K2170L922j5707
12241B21827j7327r17O040J3097J4732L53j7823j2172k1532k8634j9396j2579
12229A25669j7284j1578n309k718r306p301l794o247J255K99l738K798J560l418
12215F0888m377Q895K568K469o887k263k014J0N17r885m229K2367K5316J6001
12201A09376Q176J6464J1863j2692k5121k6659p248j2463j1250l912J1370M914
12189F2818q711n201K243o56j3391o727j4l21k717L269p34O941J3985k114j0277
$$ plain form
12174 38393 36566 23219 18446 26152 35493 40153 44945 48495 45892 33932 37165 33108 36660 43885
12160 43885 46548 44364 54401 53158 52932 50675 36844 28407 18038 22044 28274 38132 45628 52137
12146 52137 51397 44374 36634 32353 22444 11720 11576 16694 16691 20486 26211 31453 28220 21611 31204
12131 31204 38800 47845 53956 56830 61150 69986 72284 82691 92893 109333 132525 147502 153476
12118 153476 157816 153175 147901 135844 116360 104730 99878 96108 79934 77482 78306 71561 73705
12105 73705 81425 83956 87382 94659 98541 104386 103813 104831 108165 99212 97227 100251 104091 107444 126769
12090 126769 145471 156257 169668 179938 185749 182865 160506 141298 133758 134265 126237 115425 107556
12077 107556 101467 101028 94842 92918 85405 79215 77491 71171 75148 80776 80839 83500 83420 85948 84461
$$ packed form
12174C8393j827j3347m773P706R341M660M792L550k603j1960L233m057L552P225
12160D3885K663k184J0037j243k26k257j3831q437j0369M006O230R858P496O509
12146E2137p40p023p740m281r909j0724j44N118lL795N725N242l233o609R593
12131C1204P596R045O111K874M320Q836K298J0407J0202J6440K3192J4977N974
12118A53476M340m641n274j2057j9484j1630m852l770j6174k452Q24o745K144
12105G3705P720K531L426P277L882N845n73J018L334q953j985L024L840L353J9325
12090A26769J8702J0786J3411J0270N811k884k2359j9208p540N07q028j0812p869
12077A07556o089m39o186j924p513o190j724o320L977N628O3K661q0K528j487
$$ plain form
12062 84461 86673 97574 113354 129788 135879 132420 119168 102799 90365 85750 72715 70426 59899
12049 59899 54115 52955 52633 45461 43049 40842 34615 35126 28373 16764 14937 25031 27195 23695
12035 23695 24032 20880 21536 23872 25335 18731 27573 33588 32465 25406 26018 30408 32204 32777 30960
12020 30960 26238 21772 15377 19136 20820 20465 13599 17883 28799 29641 21997 17134 17434 19932 22468
12005 22468 25022 25930 30064 29429 31543 25319 21428 23176 24209 23005 18879 18479 16947 6769 2609
11990 2609 10732 14201 10224 6663 9334 16562 16918 14252 24237 34693 37381 38304 45733 50605 49895
11975 49895 40932 39525 40639 47943 43182 44754 49081 41485 35144 35678 36780 42472 45300 41192 37931
11960 37931 41925 35364 26451 30987 29547 22689 37821 48729 49973 40445 31789 35120 44404 48635
$$ packed form
12062H4461K212J0901J5780J6434O091l459j3252j6369j2434m615j3035k289j0527
12049E9899n784j160l22p172k412k207o227N11o753j1609j827J0094K164l500
12035B3695L37l152O56K336J463o604Q842O015j123p059O12M390J796N73j817
12020C0960m722m466o395L759J684l55o866M284J0916Q42p644m863L00K498K536
12005B2468K554R08M134o35K114o224l891J748J033j204m126m00j532j0178m160
11990B609Q123L469l977l561K671P228L56k666R985J0456K688R23P429M872p10
11975D9895q963j407J114P304m761J572M327p596o341N34J102N692K828m108l261
11960C7931L994o561q913M536j440o858J5132J0908J244r528q656L331R284M231
$$ plain form
11946 48635 44264 42175 36474 35648 31857 36402 42685 40097 26146 27102 37524 46821 46254 49668 54381
11931 54381 53696 54594 55978 60790 64777 66826 70169 69158 66360 69209 66060 75432 69898 64208 70297
11916 70297 76298 69572 59442 45558 49389 46982 36864 38271 47335 50909 55418 46005 46390 44227
11902 44227 44898 50654 50029 56719 59888 60922 59764 61719 61113 62842 74103 85755 88397 93381 102493
11887 102493 98007 93470 90059 92204 93890 90728 79849 67357 59935 62938 69313 62807 57808 53817
11873 53817 53225 46720 49167 51312 55190 51902 52166 48794 45629 49643 56055 65041 62808 62334 71302
11858 71302 80067 76770 81360 90595 91807 90505 85085 82086 86773 90338 83613 78085 72113 68825
11844 68825 68381 59542 56585 50942 49787 44846 37035 34263 34942 36360 36884 44238 48119 50252 52870
$$ packed form
11946D8635m371k089n701q26l791M545O283k588j3951R56J0422R297n67L414M713
11931E4381o85Q98J384M812L987K049L343j011k798K849l149R372n534n690O089
11916G0297O001o726j0130j3884L831k407j0118J407R064L574M509r413L85k163
11902D4227O71N756o25O690L169J034j158J955o06J729J1261J1652K642M984R112
11887A02493m486m537l411K145J686l162j0879j2492p422L003O375o506m999l991
11873E3817n92o505K447K145L878l288K64l372l165M014O412Q986k233m74Q968
11858G1302Q765l297M590R235J212j302n420k999M687L565o725n528n972l288
11844F8825m44q839k957n643j155m941p811k772O79J418N24P354L881K133K618
$$ plain form
11829 52870 57017 57625 59835 53758 62314 67607 72797 76830 84534 98819 106907 126705 141487 146385
11815 146385 150678 162498 172349 170496 174218 162919 160116 148600 130852 119181 109916 99983 84090
11802 84090 75087 71653 72298 84140 78979 81372 76441 79127 87019 90882 88345 87835 92881 93751 96248
11787 96248 101616 101973 105257 96422 89189 89932 97104 101933 107581 112520 115638 113990 116109 112387 111282
11772 111282 112989 104794 98219 106002 121336 123242 123442 121930 117371 120792 125241 134199 136781 133677
11758 133677 141376 154006 170858 184932 192305 202096 203667 210278 217064 221432 219182 231587 231341
11745 231341 230887 231472 240198 245556 248929 261465 270932 275630 291977 307792 309389 316149 327063 334478
11731 334478 349629 374321 389168 405890 441871 473488 500458 533948 569033 608822 661948
$$ packed form
11829E2870M147O08K210o077Q556N293N190M033P704J4285Q088J9798J4782M898
11815A46385M293J1820R851j853L722j1299k803j1516j7748j1671r265r933j5893
11802H4090r003l434O45J1842n161K393m931K686P892L863k537n10N046Q70K497
11787I6248N368L57L284q835p233P43P172M829N648M939L118j648K119l722j105
11772A11282J707q195o575P783J5334J906K00j512m559L421M449Q958K582l104
11758A33677P699J2630J6852J4074P373R791J571O611O786M368k250J2405k46
11745B31341m54N85Q726N358L373J2536R467M698J6347J5815J597O760J0914P415
11731C34478J5151K4692J4847J6722L5981L1617K6970L3490L5085L9789N3126
$$ plain form
11720 661948 712816 762332 816792 867955 932094 1003531 1092081 1189577 1305326 1440981 1618813
11709 1618813 1830569 2077839 2388046 2769088 3235205 3832652 4633294 5730613 7239987
11700 7239987 9303394 12056294 15534105 19552345 23554808 26629013 27961442 27252024
11692 27252024 24875468 21606149 18227758 15229555 12806310 11006940 9779692 9047093
11684 9047093 8762045 8881581 9377070 10204691 11260017 12395836 13487694 14437079 15191816
11675 15191816 15732330 16024718 16055358 15912083 15796512 15995191 16782911 18325822 20599899
11666 20599899 23358386 26092856 28166142 29036021 28472913 26742431 24409416 22087242
11658 22087242 20217838 18951837 18198943 17721257 17285167 16771287 16126093 15317551 14324324
$$ packed form
11720F61948N0868M9516N4460N1163O4139P1437Q8550R7496J15749J35655J77832
11709A618813K11756K47270L10207L81042M66117N97447Q00642J097319J509374
11700G239987K063407K752900L477811M018240M002463L074205J332429p09418
11692B7252024k376556l269319l378391k998203k423245j799370j227248p32599
11684I047093k85048J19536M95489Q27621J055326J135819J091858R49385P54737
11675A5191816N40514K92388L0640j43275j15571J98679P87720J542911K274077
11666B0599899K758487K734470K073286Q69879n63108j730482k333015k322174
11658B2087242j869404j266001p52894m77686m36090n13880o45194q08542r93227
$$ plain form
11649 14324324 13158236 11871808 10571615 9432386 8547661 7970108 7706584 7778831 8217637
11640 8217637 9065311 10428833 12378684 14942143 18018958 21226201 23867863 25167265
11632 25167265 24637429 22422772 19210205 15798692 12708980 10147542 8134922 6590090
11624 6590090 5414200 4523739 3843337 3313179 2892293 2535579 2236749 1963749 1721317
11615 1721317 1536906 1372919 1229174 1117991 1040057 972159 903715 835599 771348 717291
11605 717291 674959 630647 586326 555514 531891 516266 497409 476904 459947 446646 442321 435098
11593 435098 434476 441194 452374 474282 479307 489767 498843 501917 502281 492289 472502 436066 392891
11580 392891 361954 340120 304226 268947 253954 237474 228140 228286 220295 222184 235642 242733 245334
$$ packed form
11649A4324324j166088j286428j300193j139229q84725n77553k63524P2247M38806
11640H217637Q47674J363522J949851K563459L076815L207243K641662J299402
11632B5167265n29836k214657l212567l411513l089712k561438k012620j544832
11624F590090j175890q90461o80402n30158m20886l56714k98830k73000k42432
11615A721317j84411j63987j43745j11183p7934o7898o8444o8116o4251n4057
11605G17291m2332m4312m4321l0812k3623j5625j8857k0505j6957j3301m325p223
11593D35098o22O718J1180K1908N025J0460R076L074L64r992j9787l6436m3175
11580C92891l0937k1834l5894l5279j4993j6480r334J46p991J889J3458P091K601
$$ plain form
11567 245334 251618 257053 253379 250500 249448 239240 238409 236725 236572 249171 259665 267919 283792 292778
11553 292778 282279 275307 269963 244097 223859 210391 188098 182258 183039 190231 173880 164859 165528
11540 165528 160114 151051 145999 149175 146085 135913 126433 123425 120616 120193 121224 122904 143074 165286
11526 165286 183089 201397 219174 232000 235004 222996 208955 191368 174835 160162 141243 124609
11514 124609 123909 115169 88665 69504 65263 55792 54851 55895 51788 51853 50112 45105 41202 41820 45563
11499 45563 55135 57399 59687 52920 52074 41275 29058 34817 42038 41392 35026 34333 31235 31798 24700
11484 24700 18921 12432 17270 18989 19978 11912 5665 7906 19445 30940 32405 29484 26163 30732
11470 30732 32814 30650 30473 33402 31046 26440 30430 33033 29035 25711 24717 26027 22016 16816 4528
$$ packed form
11567B45334O284N435l674k879j052j0208q31j684j53J2599J0494Q254J5873Q986
11553B92778j0499o972n344k5866k0238j3468k2293n840P81P192j6351r021O69
11540A65528n414r063n052L176l090j0172r480l008k809m23J031J680K0170K2212
11526A65286J7803J8308J7777J2826L004j2008j4041j7587j6533j4673j8919j6634
11514A24609p00q740k6504j9161m241r471r41J044m107O5j741n007l903O18L743
11499D5563R572K264K288o767q46j0799j2217N759P221o46o366o93l098N63p098
11484B4700n779o489M838J719R89q066o247K241J1539J1495J465k921l321M569
11470C0732K082k164j77K929k356m606L990K603l998l324r94J310m011n200j2288
$$ plain form
11455 4528 785 -153 1918 8185 17638 30122 35461 36254 31787 32035 29769 23267 15501 14579 13744 15741
11439 15741 8242 9063 7042 13611 20418 19465 13343 10750 6594 9985 16669 13542 9348 5301 -1981
11424 -1981 1948 9025 7534 19497 26160 25782 11549 8344 8080 11651 21572 25108 25427 22195 20808
11409 20808 20583 7590 7019 15050 6441 -7291 -10256 -11279 -9120 -477 -640 1826 -8476 -15957
11395 -15957 -22116 -19204 -20433 -4460 -2003 -6689 -7330 -10841 -9636 -8552 -7466 -2595 753 -3388
11381 -3388 -4426 7789 19342 10218 -1262 -3044 3735 -5643 -11595 -14628 -21075 -18250 -8127 -2925
11367 -2925 2317 274 -13 -4952 -7940 -10432 -7445 -10979 -15787 -22152 -11762 -160 2197 5201
11353 5201 4424 6320 5052 -5866 -7868 -13856 -2217 12179 10876 3122 4615 127 -1611 4901
$$ packed form
11455D528l743r38K071O267R453J2484N339P93m467K48k266o502p766r22q35J997
11439A5741p499Q21k021O569O807r53o122k593m156L391O684l127m194m047p282
11424a981L929P077j491J1963O663l78j4233l205k64L571R921L536L19l232j387
11409B0808k25j2993n71Q031q609j3732k965j023K159Q643j63K466j0302p481
11395a5957o159K912j229J5973K457m686o41l511J205J084J086M871L348m141
11381c388j038J2215J1553r124j1480j782O779r378n952l033o447K825J0123N202
11367b925N242k043k87m939k988k492K987l534m808o365J0390J1602K357L004
11353E201p77J896j268j0918k002n988J1639J4396j303p754J493m488j738O512
$$ plain form
11339 4901 3024 8556 12941 1434 2860 -1331 -1366 -4922 -3695 -999 -7147 2789 -823 -12597 -10639
11324 -10639 -5733 2198 12435 11669 9766 11091 10267 825 503 280 7888 19711 23655 22363 15607
11309 15607 15356 13474 8206 9555 12220 10382 9736 14952 12379 13651 17223 16489 11529 9088 7995
11294 7995 12156 13187 1780 -8081 -2606 3876 7387 12383 16442 5007 1962 6897 11903 5509
11280 5509 5633 6689 10142 17657 16877 21770 27328 31791 40694 43559 45491 51418 70838 89103 102278
11265 102278 113092 128987 129058 116639 102296 93517 83518 70068 58691 45599 45140 54625 58205
11252 58205 55250 54167 48251 46850 45568 44486 49230 57604 61162 72640 81711 87481 80159 76021
11238 76021 77747 93095 109641 118933 116914 123090 122577 115716 114396 116551 110514 99298 90919 92349
$$ packed form
11339D901j877N532M385j1507J426m191l5l556J227K696o148R936l612j1774J958
11324a0639M906P931J0237p66j903J325q24r442l22k23P608J1823L944j292o756
11309A5607k51j882n268J349K665j838o46N216k573J272L572p34m960k441j093
11294G995M161J031j1407r861N475O482L511M996M059j1435l045M935N006o394
11280E509J24J056L453P515p80M893N558M463Q903K865J932N927J9420J8265J3175
11265A02278J0814J5895P1j2419j4343q779r999j3450j1377j3092m59R485L580
11252E8205k955j083n916j401j282j082M744Q374L558J1478R071N770p322m138
11238G6021J726J5348J6546R292k019O176n13o861j320K155o037j1216q379J430
$$ plain form
11224 92349 92391 82522 82659 74645 69867 75010 83995 80422 57515 45886 43748 43872 43452 43372 47295 46332
11208 46332 51291 63151 82448 105554 118263 119874 122520 124103 121277 105973 83284 71488 49576
11195 49576 35844 35603 33329 24629 9852 6786 5116 1226 -4432 -3075 -410 -3987 -12029 -14184
11181 -14184 -14402 -9978 -8556 -13 -9431 -8674 -2897 4108 8337 2986 2799 -3597 -9566 -6819 -578
11166 -578 2772 5038 10034 5301 -4025 -5825 -5998 4185 21007 26125 17473 1193 -14238 -18122
11152 -18122 -14035 -306 6181 6161 2330 4796 5832 -9406 -10137 -9460 -12713 -14203 -11119 -8678 -12275
11137 -12275 -13523 -11154 -7040 -1465 4499 8636 12079 12514 912 -5612 761 605 2023 4663 443
11122 443 2856 -2614 1169 8211 8084 7174 9620 10090 5427 -3655 551 4111 292 -1958 659 1369
$$ packed form
11224I2349M2r869J37q014m778N143Q985l573k2907j1629k138J24m20q0L923r63
11208D6332M959J1860J9297K3106J2709J611K646J583k826j5304k2689j1796k1912
11195D9576j3732k41k274q700j4777l066j670l890n658J357K665l577q042k155
11181a4184k18M424J422Q543r418P57N777P005M229n351j87o396n969K747O241
11166e78L350K266M996m733r326j800j73J0183J6822N118q652j6280j5431l884
11152a8122M087J3729O487k0l831K466J036j5238p31O77l253j490L084K441l597
11137a2275j248K369M114N575N964M137L443M35j1602o524O373j56J418K640m220
11122D43K413n470L783P042j27r10K446M70m663r082M206L560l819k250K617P10
$$ plain form
11106 1369 -4333 -9514 -12261 -6579 -6759 1594 -120 -4245 -2670 -1356 -4708 -5120 -5492 -5241 -8013 -10186
11090 -10186 -10866 -11386 -12993 -22338 -12884 -9238 -10369 -13066 -5057 -2478 -806 4891 6484 4034 6062
11075 6062 6898 5292 11729 13744 3120 -6805 -16841 -16314 -13317 -11691 -7023 -4356 -16205 -23638
11061 -23638 -15735 -9751 -2219 -788 1988 6953 3495 1597 1721 -4620 -12026 -6360 5662 5186 -3427
11046 -3427 -2748 -7515 -6417 -12874 -14573 -13162 -14149 -15135 -15031 -18740 -18339 -13517 -11887 -17114 -18702 -17722
11030 -17722 -10872 -5780 -8911 -13239 -15364 -13307 -16438 -16503 -7007 795 2117 9696 6332 2191 -1496
11015 -1496 -1525 -4941 -11401 -7909 -3132 56 -4685 -1149 4985 -5105 -14006 -18501 -12793 -3663 -11476
11000 -11476 -15241 -3563 3816 -6461 -15861 -18910 -24586 -16193 -8443 -5372 -1454 4030 3634 -2124
$$ packed form
11106A369n702n181k747N682j80Q353j714m125J575J314l352m12l72K51k772k173
11090a0186o80n20j607r345R454L646j131k697Q009K579J672N697J593k450K028
11075F062Q36j606O437K015j0624r925j0036N27K997J626M668K667j1849p433
11061b3638P903N984P532J431K776M965l458j898J24o341p406N666J2022m76q613
11046c427O79m767J098o457j699J411r87r86J04l709M01M822J630n227j588R80
11030a7722O850N092l131m328k125K057l131o5R496P802J322P579l364m141l687
11015a496k9l416o460L492M777L188m741L536O134j0090q901m495N708R130p813
11000a1476l765J1678P379j0277r400l049n676Q393P750L071L918N484l96n758
$$ plain form
10986 -2124 -11345 -20791 -15991 -16523 -17843 -20959 -10343 2983 -239 -514 -2110 -1238 1873 1960 1497 1127
10970 1127 -536 -2187 1091 -2513 -7183 -12064 -17412 -13355 -11962 -14647 -4182 7498 21694 21212
10956 21212 18172 10689 11813 9999 11744 7561 5198 -3381 -6346 -10657 -15688 -16604 -17852 -18265 -20691
10941 -20691 -20109 -13740 -14374 -9717 -3909 3880 11291 11414 3760 -3420 -279 -5725 -7712 -12483 -8057
10926 -8057 -4883 1568 -1798 -3723 -4860 -4173 -1887 -2040 1443 -1112 -7583 -12552 -10763 -7103 -2663
10911 -2663 -3975 -7456 -2239 -316 3569 2596 -3271 -970 6789 8366 -5088 -8962 -7738 -7301 -14981
10896 -14981 -18837 -11993 -9601 -13024 -6149 2227 4755 -9911 -19530 -21896 -22336 -10886 -6187 -8580
10882 -8580 -15751 -9900 -6822 -1564 -1121 -622 -202 4362 3353 2477 1734 3154 -2103 -15018 -16364 -13070
$$ packed form
10986b124r221r446M800n32j320l116J0616J3326l222k75j596Q72L111Q7m63l70
10970A127j663j651L278l604m670m881n348M057J393k685J0465J1680J4196m82
10956B1212l040p483J124j814J745m183k363q579k965m311n031r16j248m13k426
10941b0691N82O369o34M657N808P789P411J23p654p180L141n446j987m771M426
10926h057L174O451l366j925j137O87K286j53L483k555o471m969J789L660M440
10911b663j312l481N217J923L885r73n867K301P759J577j3454l874J224M37p680
10896a4981l856O844K392l423O875Q376K528j4666r619k366m40J1450M699k393
10882h580p171N851L078N258M43M99M20M564j009q76p43J420n257j2915j346L294
$$ plain form
10866 -13070 -13210 -12904 -15384 -12428 -9962 -5164 -2351 -2157 -2742 -3908 -4434 475 1451 -4019 -7479 -1127
10850 -1127 -1076 -14252 -10780 -9707 5035 4440 1866 -6669 -20786 -23609 -9528 -3853 1210 -8238
10836 -8238 -8258 -3908 -1906 -10308 -6723 4820 9374 10095 836 2644 652 -2959 -1367 -1549 -3340
10821 -3340 -2555 7574 16812 20115 6722 6636 5202 2552 2314 -9625 -17021 -6845 411 -10016
10807 -10016 -9155 -8632 -12162 -10209 -4133 6136 -1523 772 8671 8238 -39 -6397 -4359 3216 2717
10792 2717 5768 -3270 -117 6147 10933 12891 18155 23174 13594 19739 23035 30659 34260 35215 26797
10777 26797 18192 13906 2977 -7764 -9841 3218 5123 3160 3734 9134 11791 8763 6233 1221
10763 1221 6513 5528 2479 5123 2492 574 0 -5450 -6613 -6474 -12051 -18004 -15120 -11757 -254
$$ packed form
10866a3070j40L06k480K956K466M798K813J94n85j166n26M909R76n470l460O352
10850a127N1j3176L472J073J4742n95k574q535j4117k823J4081N675N063r448
10836h238k0M350K002q402L585J1543M554P21r259J808j992l611J592j82j791
10821c340P85J0129R238L303j3393q6j434k650k38j1939p396J0176P256j0427
10807a0016Q61N23l530J953O076J0269p659K295P899m33q277o358K038P575m99
10792B717L051r038L153O264M786J958N264N019r580O145L296P624L601R55q418
10777B6797q605m286j0929j0741k077J3059J905j963N74N400K657l028k530n012
10763A221N292r85l049K644k631j918n74n450j163J39n577n953K884L363J1503
$$ plain form
10748 -254 3006 6521 11663 9358 -6850 -10118 -2810 -3892 -8043 -10276 -17557 -24338 -22023 -9625
10734 -9625 140 2395 -1423 333 -2459 -4707 -8690 -5360 -1888 1987 12195 10565 11593 12191 10453
10719 10453 4639 -4711 -4160 152 10397 6775 4107 4332 4873 6601 9574 7729 -1421 -6691 -4760
10704 -4760 -6171 -6416 -359 2051 8392 10642 2533 -4807 -3713 -5955 -10615 -12765 -8914 -15604 -18046
10689 -18046 -13158 -5844 -905 -4948 -12287 -20707 -25431 -14233 9288 8089 -833 2202 789 -6148
10675 -6148 -8669 -11283 -16005 -15627 -7475 4245 15648 17210 6767 1502 3253 4712 -801 -666
10661 -666 1898 -5763 -7723 -5437 -218 5182 74 7416 8601 -2972 -9796 -5979 -5112 -9139 -11011
10646 -11011 -14197 -24758 -17301 -16958 -21966 -19130 -14302 -16146 -20906 -17114 -11548 -4857 -5938 -7357
$$ packed form
10748b54L260L515N142k305j6208l268P308j082m151k233p281o781K315J2398
10734i625R765K255l818J756k792k248l983L330L472L875J0208j630J028N98j738
10719A0453n814r350N51M312J0245l622k668K25N41J728K973j845r150n270J931
10704d760j411k45O057K410O341K250q109p340J094k242m660k150L851o690k442
10689a8046M888P314M939m043p339q420m724J1198K3521j199q922L035j413o937
10675f148k521k614m722L78Q152J1720J1403J562j0443n265J751J459n513J35
10661f66K564p661j960K286N219N400n108P342J185j1573o824L817Q67m027j872
10646a1011l186j0561P457L43n008K836M828j844m760L792N566O691j081j419
$$ plain form
10632 -7357 -7967 -8081 -5411 -7955 -3726 5852 5861 1518 -3775 1651 9390 8104 2539 -3782 -10334 -15902
10616 -15902 -17604 -16190 -8974 -2594 -3820 -990 1904 -4216 -13425 -7088 -8888 3180 13416 4205
10602 4205 -2132 -7020 -17764 -6900 2503 2333 776 802 -1622 -5371 -4111 1186 6287 14564 16791
10587 16791 10349 4101 2644 4618 8730 -84 -7658 -2727 -5378 -7045 -1701 -3376 -7944 -8383 3635
10572 3635 -528 -15220 -12428 -7141 -10677 -13530 -5008 -4531 -4159 -5607 -7481 -7065 -5795 377 8392
10557 8392 315 -4790 -5292 -4976 -3173 1045 -2996 152 7664 10732 9191 -812 -9151 -6811 -12949
10542 -12949 -8280 -1891 -3039 -9061 -12263 -6604 -13076 -10203 -36 765 -3186 -10548 -12286 -9516
10528 -9516 -6961 -4743 -9418 -18505 -14732 -10072 -7425 -17930 -24273 -18384 -19322 -20197 -14494 -8814 -15435
$$ packed form
10632g357o10j14K670k544M229R578Rm343n293N426P739j286n565o321o552n568
10616a5902j702J414P216O380j226K830K894o120r209O337j800J2068J0236r211
10602D205o337m888j0744J0864R403j70j557K6k424l749J260N297N101Q277K227
10587A6791o442o248j457J974M112q814p574M931k651j667N344j675m568m39J2018
10572C635m163j4692K792N287l536k853Q522M77L72j448j874M16J270O172Q015
10557H392q077n105n02L16J803M218m041L148P512L068j541j0003q339K340o138
10542a2949M669O389j148o022l202N659o472K873J0167Q01l951p362j738K770
10528i516K555K218m675r087L773M660K647j0505o343N889r38q75N703N680o621
$$ plain form
10513 -15435 -14925 -8538 -3010 -10184 -7161 -6856 -2139 -7157 -740 7124 15289 20719 15837 15344 11187
10498 11187 1050 -8023 -12028 -20042 -17819 -10962 -7563 -7347 -1365 -1174 3963 6374 7143 6229 -4136
10483 -4136 -9449 -1175 -1056 -169 680 -4949 -1316 497 -5064 -2977 5245 5635 5539 13076 18968 11347
10467 11347 128 -4895 -1341 2816 7800 -2604 -16251 -16180 -10099 -371 -5615 -13469 -3131 6802
10453 6802 8920 8088 5205 2460 -2577 11810 14294 7312 4697 7508 8918 1018 4100 2297 -9143
10438 -9143 -9399 -14862 -11460 -12050 -8182 -152 6517 -3254 -11834 -12090 -8698 2441 406 -13095 -13676
10423 -13676 -6472 -2724 -3865 -5569 -7600 -6639 -6067 -9918 -16624 -11319 -6385 -4990 -5882 -10690 -10827
10408 -10827 -626 -4841 -10937 -17174 -10477 -4554 5417 6119 4054 -158 -5678 -3844 5093 2199
$$ packed form
10513a5435N10O387N528p174L023L05M717n018O417P864Q165N430m882m93m157
10498A1187j0137r073m005q014K223O857L399K16N982J91N137K411P69r14j0365
10483d136n313Q274J19Q87Q49n629L633J813n561K087Q222L90r6P537N892p621
10467A1347j1219n023L554M157M984j0404j3647P1O081R728n244p854J0338R933
10453F802K118q32k883k745n037J4387K484o982k615K811J410p900L082j803j1440
10438i143k56n463L402n90L868Q030O669r771q580k56L392J1139k035j3501n81
10423a3676P204L748j141j704k031R61N72l851o706N305M934J395q92m808j37
10408a0827J0201m215o096o237O697N923R971P02k065m212n520J834Q937k894
$$ plain form
10394 2199 792 -1519 -4317 -7307 -11419 -10996 -6829 -3899 2121 -110 -7409 -15846 -15938 -8823 -5347
10379 -5347 -3297 -2188 -5405 -3272 -3527 -440 -8485 -12549 -11015 -11715 -7847 -6152 -8500 -2908 -992
10364 -992 1857 772 -8379 -18433 -13814 -17674 -17226 -11178 -13608 -6073 -2671 4075 3411 10633 8327
10349 8327 444 -455 -1436 234 6451 10150 3867 8020 3505 -547 3492 -183 3875 8406 1369
10334 1369 -282 1322 -964 973 9213 9231 3465 -2893 -8753 -16408 -20202 -14341 -1660 4273 -1208
10319 -1208 -8467 -9397 -4228 -3546 -3697 2754 -194 -9311 -5916 -1004 941 9430 902 -1917 -3458
10304 -3458 -13339 -19096 -22823 -10924 -5121 -7482 906 -694 -6551 -1573 -3724 -6040 -653 227 13306
10289 13306 18524 11741 10812 3449 -114 -9087 -17393 -18488 -16613 -19107 -14943 -5590 -3704 -10157 -7567
$$ packed form
10394B199j407k311k798k990m112M23M167K930O020k231p299q437r2P115L476
10379e347K050J109l217K133k55L087q045m064J534p00L868J695k348N592J916
10364i92K849j085r151j0054M619l860M48O048k430P535L402O746o64P222k306
10349H327p883q99r81J670O217L699o283M153m515m052M039l675M058M531p037
10334A369j651J604k286J937Q240J8n766o358n860p655l794N861J2681N933n481
10319a208p259r30N169O82j51O451k948r117L395M912J945Q489q528k819j541
10304c458r881n757l727J1899N803k361Q388j600n857M978k151k316N387Q80J3079
10289A3306N218o783r29p363l563q973q306j095J875k494M164R353J886o453K590
$$ plain form
10274 -7567 -1514 7838 4715 -6914 -13778 -12887 -3581 5472 2792 5072 10080 13400 19479 21505 9681
10259 9681 9050 11657 12789 2756 -8606 7183 6837 -5045 -7236 -14837 -16318 -4069 3768 3968
10245 3968 1183 192 -1297 -522 -1569 -8290 -4689 -6503 -7108 -6774 2970 8660 2435 -2062 -2367 2162
10229 2162 9387 9651 8721 17869 29084 23494 11279 9488 9890 7140 349 -2942 6621 6735 -2184
10214 -2184 1399 -7682 -15502 -16899 -7310 -1093 275 4686 840 -1466 2561 3651 -1330 -10284 -8576
10199 -8576 238 -1919 -3044 -4032 -8095 317 1192 4024 3239 -2601 1105 -6241 -415 3144 1488
10184 1488 -4247 -8720 -21198 -17601 -4948 2049 5512 8102 4878 -4273 -8567 -8485 -6456 -3011 -149
10169 -149 -87 6625 2141 -2696 -527 -6395 -6337 -6446 4863 12549 12567 15214 13296 9812 5939 2387
$$ packed form
10274g567O053R352l123j1629o864Q91R306R053k680K280N008L320O079K026j1824
10259I681o31K607J132j0033j1362J5789l46j1882k191p601j481J2249P837K00
10245C968k785r91j489P75j047o721L601j814o05L34R744N690o225m497l05M529
10229B162P225K64r30R148J1215n590j2215j791M02k750o791l291R563J14q919
10214b184L583r081p820j397R589O217J368M411l846k306M027J090m981q954J708
10199h576Q814k157j125r88m063Q412Q75K832p85n840L706p346N826L559j656
10184A488n735m473j2478L597J2653O997L463K590l224r151m294Q2K029L445K862
10169a49O2O712m484m837K169n868N8j09J1309P686J8K647j918l484l873l552
$$ plain form
10153 2387 -4015 -1978 960 1402 -10428 -10056 -8626 -16209 -8048 402 7211 2614 5109 4235 2282
10138 2282 -453 -4773 -781 -1298 -14878 -15126 -14569 -14803 -11923 -266 -4780 -13258 -8720 3653 2764
10123 2764 4563 327 -3502 -2240 4184 8053 5298 8524 4796 -4096 -494 838 -4279 -12270 -4942
10108 -4942 -1433 -1248 5423 8839 7439 3088 4287 1027 6046 6253 4474 2308 4131 7553 -1680
10093 -1680 -5658 10 318 839 3766 -3849 -13462 -15560 -10673 -4509 -1460 -2497 -381 10000 14299
10078 14299 14144 11655 18605 14443 13634 12124 15544 12259 6504 4535 1025 2306 13166 26805
10064 26805 36164 50780 55920 63508 64867 58360 42593 31826 32935 50810 72754 98065 110652
10051 110652 91164 55268 25307 18203 15200 10753 6978 3651 -1312 1902 8391 11765 10004
$$ packed form
10153B387o402K037K938M42j1830L72J430p583Q161Q450O809m597K495q74j953
10138B282k735m320L992n17j3580k48N57k34K880J1657m514q478M538J2373q89
10123B764J799m236l829J262O424L869k755L226l728q892L602J332n117p991P328
10108d942L509J85O671L416j400m351J199l260N019K07j779k166J823L422r233
10093a680l978N668L08N21K927p615r613k098M887O164L049j037K116J0381M299
10078A4299j55k489O950m162q09j510L420l285n755j969l510J281J0860J3639
10064B6805R359J4616N140P588J359o507j5767j0767J109J7875K1944K5311J2587
10051A10652j9488l5896k9961p104l003m447l775l327m963L214O489L374j761
$$ plain form
10038 10004 15246 7946 12115 17968 18347 12040 7585 8585 8554 6693 -4585 -18365 -15395 -1466
10024 -1466 9585 16538 19984 25389 25477 20386 18750 19339 13201 4178 -331 -9627 -11273 589 13622
10009 13622 20957 18082 4437 2840 1456 -4529 -8486 -11528 -3002 -78 2752 7177 8746 9116
9995 9116 -2073 -265 9091 12766 3673 -3036 -10493 -9291 -1358 -297 -1848 -10280 -17962 -13475 -10687
9980 -10687 -6623 -587 -4051 3105 -1544 -13775 -24133 -25966 -19084 -8428 4862 6334 1189 3052
9966 3052 -727 -1365 -1485 -5765 -3784 -5781 -2941 94 1839 2435 -408 -4302 -7251 -19114 -25207
9951 -25207 -18336 -7488 -6539 -7916 -10773 -14165 -2612 -393 -10983 -12765 -8813 -12996 -11262 -11069
9937 -11069 -7576 703 7981 10306 -12774 -18666 -15266 -9563 -3079 -1423 -4713 -16169 -26355 -18563
$$ packed form
10038A0004N242p300M169N853L79o307m455J000l1j861j1278j3780K970J3929
10024a466J1051O953L446N405Q8n091j636N89o138r023m509r296j646J1862J3033
10009A3622P335k875j3645j597j384n985l957l042Q526K924K830M425J569L70
9995I116j1189J808R356L675r093o709p457J202P933J061j551q432p682M487K788
9980a0687M064O036l464P156m649j2231j0358j833O882J0656J3290J472n145J863
9966C052l779o38j20m280J981j997K840L035J745N96k843l894k949j1863o093
9951b5207O871J0848R49j377k857l392J1553K219j0590j782L952m183J734J93
9937a1069L493Q279P278K325k3080n892L400N703O484J656l290j1456j0186P792
$$ plain form
9923 -18563 -7064 -11726 -11504 -3380 -2537 12896 5823 -684 -8179 -13905 -5559 4115 9335 12270 6688
9908 6688 -466 3561 6321 9672 6176 3836 4876 7994 15517 22030 20731 20605 12829 3303 -6630
9893 -6630 -13500 -12629 -8585 -4957 -4375 -4359 1817 13223 22832 16109 14953 7036 6551 4269 -2876 -1149
9877 -1149 10708 15881 13071 13482 15456 9995 7492 8443 17525 16101 22130 24502 26300 33896 45574
9862 45574 55934 73615 120170 182553 283504 466894 732589 981302 1119592 1051603 823196
9851 823196 575602 384123 256942 181960 132220 94964 74230 52900 47272 35929 36918 33267
9839 33267 22141 19426 10943 4438 6530 11738 7490 6331 5118 4358 5295 7448 8540 12264 8130
9824 8130 12919 10579 4134 -1726 -7173 -9960 -5380 1227 9184 10918 12606 6235 -1778 -1942 -2473
$$ packed form
9923a8563J1499m662K22Q124Q43J5433p073o507p495n726Q346R674N220K935n582
9908F688p154M027K760L351l496k340J040L118P523O513j299j26p776r526r933
9893f630o870Q71M044L628N82J6O176J1406R609o723j156p917m85k282p145J727
9877a149J1857N173k810M11J974n461k503R51R082j424O029K372J798P596J1678
9862D5574J0360J7681M6555O2383J00951J83390K65695K48713J38290o7989k28407
9851H23196k47594j91479j27181p4982m9740l7256k0734k1330n628j1343R89l651
9839C3267j1126k715q483o505K092N208m248j159j213p60R37K153J092L724m134
9824H130M789k340o445n860n447k787M580O607P957J734J688o371q013j64n31
$$ plain form
9809 -2473 -10502 -14134 -6993 1624 1845 3090 6247 198 3352 13543 10578 6484 6844 12059 4803
9794 4803 -3066 -2186 -7713 -8260 -10273 -2182 8110 -228 -10719 -17908 -6681 -1154 2570 -675 1723
9779 1723 2930 12041 10246 12528 11973 4414 3394 -913 -4949 -9543 -6324 -10485 -17383 -22283 -19630
9764 -19630 -21636 -20542 -8823 -4251 -3677 -7489 -4744 8281 9524 5261 -2164 -5776 -4086 22
9750 22 483 -1234 -6279 -90 14230 21146 21631 20596 25806 22047 19164 13921 8281 17314 17208 10764
9734 10764 1028 -5744 6250 4601 3322 6574 6986 10211 7247 5532 14603 19049 12897 15851 8537
9719 8537 9440 7950 8704 4838 -1184 -2544 -2475 7462 15583 14250 7887 13675 13603 17453 24453 18005
9703 18005 16832 12453 19146 21597 20537 27583 28154 38235 56926 70993 89688 100988 110277 128829
$$ packed form
9809b473q029l632P141Q617K21J245L157o049L154J0191k965m094L60N215p256
9794D803p869Q80n527n47k013Q091J0292q338j0491p189J1227N527L724l245K398
9779A723J207R111j795K282n55p559j020m307m036m594L219m161o898m900K653
9764a9630k006J094J1719M572N74l812K745J3025J243m263p425l612J690M108
9750B2M61j717n045O189J4320O916M85j035N210l759k883n243n640R033j06o444
9734A0764r736o772J1994j649j279L252M12L225k964j715R071M446o152K954p314
9719H537R03j490P54l866o022j360O9R937Q121j333o363N788p2L850P000o448
9703A8005j173m379O693K451j060P046N71J0081J8691J4067J8695J1300R289J8552
$$ plain form
9689 128829 153447 182412 203930 232047 265025 302580 335157 356191 350853 331667 305488 272264
9677 272264 243078 218352 184033 154666 134907 115336 93426 76547 67752 58798 55470 53564
9665 53564 62062 60546 41985 26849 23078 24561 16385 13151 9242 919 -4216 -11160 -7371 -13387
9651 -13387 -13391 -13546 -8776 3965 5652 -5410 -9568 5155 13602 10385 7477 2190 -128 -4198 1256
9636 1256 811 -11073 -9658 -12973 -9293 576 -9010 -5363 4665 5896 8880 10908 3332 -2558 -5715
9621 -5715 2824 8946 -1928 -3155 6058 938 560 9475 23295 32000 29912 20352 15823 14956 900
9606 900 -4977 -12401 -5945 280 3953 8232 9701 11766 18279 23695 23377 21945 22988 24220 18432
9591 18432 25087 21742 14378 8911 18573 11517 12340 16230 9554 10507 13311 18163 16423 17073 12623
$$ packed form
9689A28829K4618K8965K1518K8117L2978L7555L2577K1034n338j9186k6179l3224
9677B72264k9186k4726l4319k9367j9759j9571k1910j6879q795q954l328j906
9665E3564Q498j516j8561j5136l771J483q176l234l909q323n135o944L789o016
9651a3387mj55M770J2741J687j1062m158J4723Q447l217k908n287k318m070N454
9636A256m45j1884J415l315L680R869r586L647J0028J231K984K028p576n890l157
9621e715Q539O122j0874j227R213n120l78Q915J3820Q705k088r560m529q67j4056
9606I00n877p424O456O225L673M279J469K065O513N416l18j432J043J232n788
9591A8432O655l345p364n467R662p056Q23L890o676R53K804M852j740O50m450
$$ plain form
9576 12623 10133 4439 5441 1868 -10486 -8371 3291 2688 8212 12057 9868 12409 14472 4108
9562 4108 2365 360 546 15392 14516 6033 12673 21001 14954 8704 11233 14137 10394 3942 1462
9547 1462 5266 9237 3731 7218 18619 19474 22568 18521 17823 19234 21658 18913 15216 14289 14180 9790
9531 9790 6433 2660 939 8496 13965 23559 27649 31852 34335 27426 21268 15373 4077 -4227 -3138
9516 -3138 6850 23304 34823 35834 30301 22545 18540 22781 16764 19805 20807 19238 25838 37978
9502 37978 35375 32445 34773 27508 13224 16089 13490 14365 13883 16535 10320 13951 9332 11533 17644
9487 17644 23168 12955 9349 5704 3282 2121 3711 3555 90 25 5826 10577 9722 8563 13402
9472 13402 18272 19224 16673 20893 26296 21832 21332 20610 17684 21186 17617 10372 8536 6924 10904
$$ packed form
9576A2623k490n694J002l573j2354K115J1662o03N524L845k189K541K063j0364
9562D108j743k005J86J4846q76q483O640Q328o047o250K529K904l743o452k480
9547A462L804L971n506L487J1401Q55L094m047o98J411K424k745l697r27j09m390
9531I790l357l773j721P557N469R594M090M203K483o909o158n895j1296q304J089
9516c138R988J6454J1519J011n533p756m005M241o017L041J002j569O600J2140
9502C7978k603k930K328p265j4284K865k599Q75m82K652o215L631m619K201O111
9487A7644N524j0213l606l645k422j161J590j56l465o5N801M751q55j159M839
9472A3402M870R52k551M220N403m464n00p22k926L502l569p245j836j612L980
$$ plain form
9457 10904 5997 -382 -1567 1398 1918 -3943 5866 15297 21641 20569 16557 14014 16052 24075 23641
9442 23641 21137 20402 11561 12478 19126 19800 15642 13135 21484 22603 24224 21102 11956 13326 17737
9427 17737 27461 30239 21096 14491 14623 15002 16420 18103 17364 7436 10814 7179 8319 8038 20730
9412 20730 31167 30748 25525 19207 14924 17846 18733 20915 15045 14481 12574 17099 21994 22440 27348
9397 27348 28525 19765 15703 28518 33216 32112 25414 19026 18921 34059 34880 23210 21426 14675
9383 14675 11755 15651 11644 13078 20842 21147 23787 31070 35663 33248 29524 29195 24185 22305 19362
9368 19362 21050 20903 14243 10269 6407 8229 10861 9230 18669 27729 32376 28949 27786 24175 18010
9353 18010 27364 25324 24226 38555 38901 34248 38614 38166 29829 31722 34253 39342 37319 30671 25976
$$ packed form
9457A0904m907o379j185K965N20n861R809R431O344j072m012k543K038Q023m34
9442B3641k504p35q841R17O648O74m158k507Q349J119J621l122r146J370M411
9427A7737R724K778r143o605J32L79J418J683p39r928L378l635J140k81J2692
9412B0730J0437m19n223o318m283K922Q87K182n870n64j907M525M895M46M908
9397B7348J177q760m062J2815M698j104o698o388j05J5138Q21j1670j784o751
9383A4675k920L896m007J434P764L05K640P283M593k415l724l29n010j880k943
9368A9362J688j47o660l974l862J822K632j631R439R060M647l427j163l611o165
9353A8010R354k040j098J4329L46m653M366m48q337J893K531N089k023o648m695
$$ plain form
9338 25976 22312 25310 28555 29736 34219 39021 38767 33984 28206 36487 37283 35475 37317 37392 34397 36122
9322 36122 33705 40879 42412 38547 40871 46374 47776 39888 41244 44064 39298 39624 42888 50255 52437
9307 52437 46576 42413 38763 44842 46580 47305 49734 47715 47104 43470 37715 42332 43811 44800 44734 42686
9291 42686 40371 44690 50644 62370 65190 63693 58365 58169 57015 49347 53918 54642 49642 54342 62678
9276 62678 76777 73296 63905 63473 60037 61039 65993 72473 73101 77402 77005 74577 67235 61869 63010
9261 63010 74253 72161 64841 68945 69950 71590 74689 75248 68191 61776 68911 75236 78086 82217 78369
9246 78369 81793 80468 80117 79908 76474 81417 70322 68234 72174 75632 84522 99284 104511 102785 101397
9231 101397 97744 104417 104197 97011 94880 97771 99853 109052 120131 121358 127559 128763 125756 128986
$$ packed form
9338B5976l664K998L245J181M483M802k54m783n778Q281P96j808J842P5k995J725
9322C6122k417P174J533l865K324N503J402p888J356K820m766L26L264P367K182
9307E2437n861m163l650O079J738P25K429k019o11l634n755M617J479R89o6k048
9291D2686k315M319N954J1726K820j497n328j96j154p668M571P24n000M700Q336
9276F2678J4099l481r391m32l436J002M954O480O28M301l97k428p342n366J141
9261F3010J1243k092p320M104J005J640L099N59p057o415P135O325K850M131l848
9246G8369L424j325l51k09l434M943j1095k088L940L458Q890J4762N227j726j388
9231A01397l653O673k20p186k131K891K082R199J1079J227O201J204l007L230
$$ plain form
9217 128986 139518 157933 165030 166712 180975 197910 200148 200718 199543 212902 228505 245744 256209
9204 256209 273126 293200 312881 332514 352226 374993 411620 436202 471501 519229 564004 613351
9192 613351 660133 722915 791989 881114 986927 1098418 1232705 1385880 1579734 1805597
9182 1805597 2064341 2365311 2708448 3088084 3472241 3856641 4182500 4410223 4514162 4478492
9172 4478492 4302555 4015635 3674132 3303062 2949150 2613306 2301437 2022593 1786127 1588502
9162 1588502 1417237 1269459 1136941 1019326 932928 853928 783331 720552 673261 630071 600245
9151 600245 564464 528596 509971 493098 475836 465711 469218 477982 484832 511820 551249 590113
9139 590113 649899 728191 826717 961730 1112073 1264379 1405878 1528934 1605858 1623700 1577392
$$ packed form
9217A28986J0532J8415P097J682J4263J6935K238N70j175J3359J5603J7239J0465
9204B56209J6917K0074J9681J9633J9712K2767L6627K4582L5299M7728M4775M9347
9192F13351M6782O2782O9074Q9125J05813J11491J34287J53175J93854K25863
9182A805597K58744L00970L43137L79636L84157L84400L25859K27723J03939l5670
9172D478492j75937k86920l41503l71070l53912l35844l11869k78844k36466j97625
9162A588502j71265j47778j32518j17615q6398p9000p0597o2779m7291m3190k9826
9151F00245l5781l5868j8625j6873j7262j0125L507Q764O850K6988L9429L8864
9139E90113N9786P8292R8526J35013J50343J52306J41499J23056P6924J7842m6308
$$ plain form
9128 1577392 1484100 1364672 1225351 1079001 935639 794630 673357 587240 513447 454232
9118 454232 407707 373063 340934 308291 279965 257880 236875 222212 204273 191234 183064 174693
9106 174693 175150 169602 161676 152871 157626 165569 163352 158037 146236 143905 144249 138584 138292 129263 122953
9091 122953 122464 126006 125001 114906 103247 98006 100015 97951 99688 100687 101397 100218 89384 87235
9077 87235 91345 93107 95722 96159 84697 75123 77879 84065 80575 70766 76243 75777 80949 79017 79406
9062 79406 89617 89971 88810 83429 81804 70441 54491 57209 67401 79456 89674 87631 75148
9049 75148 84292 98242 97260 93373 100038 107611 113585 119446 124918 133217 139399 159060 180900 206653
9035 206653 239482 244717 228657 213638 188913 166742 148905 133994 122452 118279 121153 115498
$$ packed form
9128A577392r3292j19428j39321j46350j43362j41009j21273q6117p3793n9215
9118D54232m6525l4644l2129l2643k8326k2085k1005j4663j7939j3039q170q371
9106A74693M57n548p926q805M755P943k217n315j1801k331L44n665k92r029o310
9091A22953m89L542j005j0095j1659n241K009k064J737R99P10j179j0834k149
9077H7235M110J762K615M37j1462r574K756O186l490r809N477m66N172j932L89
9062G9406J0211L54j161n381j625j1363j5950K718J0192J2055J0218k043j2483
9049G5148R144J3950r82l887O665P573N974N861N472Q299O182J9661K1840K5753
9035B06653L2829N235j6060j5019k4725k2171j7837j4911j1542m173K874n655
$$ plain form
9023 115498 115601 108468 96545 86918 83980 90460 86316 78130 81378 87304 93213 100904 108221 107549 106464
9008 106464 112835 113204 107635 105823 109304 119422 116889 120837 118887 121073 135719 150741 153063 159947
8994 159947 160009 167645 185678 211739 244085 282690 326994 355548 355998 354047 320067 277402 258875
8981 258875 243751 213233 183440 162288 138213 124031 117512 119357 116468 117634 105043 104006 109779
8968 109779 116034 108440 94901 91648 82620 80805 89852 86681 80252 69722 56907 50165 46833 51863
8954 51863 65821 82953 90704 83173 73349 71098 76932 81062 88410 96353 96885 94935 97513 110191
8940 110191 111614 114948 114353 92876 79085 84064 85168 93857 89775 99352 111013 118202 126836 125473
8926 125473 131295 141382 143325 146469 161726 177232 181223 184090 168302 150061 140665 151564 158698
$$ packed form
9023A15498J03p133j1923r627k938O480m144q186L248N926N909P691P317o72j085
9008A06464O371L69n569j812L481J0118k533L948j950K186J4646J5022K322O884
8994A59947O2P636J8033K6061L2346L8605M4304K8554M50j951l3980m2665j8527
8981B58875j5124l0518k9793k1152k4075j4182o519J845k889J166j2591j037N773
8968A09779O255p594j3539l253r028j815R047l171o429j0530j2815o742l332N030
8954E1863J3958J7132P751p531r824k251N834M130P348P943N32j950K578J2678
8940A10191J423L334n95k1477j3791M979J104Q689m082R577J1661P189Q634j363
8926A25473N822J0087J943L144J5257J5506L991K867j5788j8241r396J0899P134
$$ plain form
8913 158698 171822 172400 172893 170789 157178 140353 126473 120938 117615 120933 122004 117603 116024 124635
8899 124635 144835 161861 168724 174363 172088 173756 181406 202107 223693 245346 273195 314768 358751
8886 358751 397357 418914 414412 387188 345257 302679 267703 249197 232828 218680 196320 179271
8874 179271 164321 147117 131202 122870 114211 106917 101139 105157 107533 104404 110283 109570 112175 128519
8860 128519 161125 216595 268989 292579 302641 328745 338868 337598 341033 342109 339676 339726 338215
8847 338215 341250 351396 363976 366065 368133 372468 374133 366165 363753 352078 340487 336985 336991 337590
8833 337590 339001 346306 364917 384625 411315 427402 446735 475891 483441 481220 482338 482640 485227
8820 485227 487536 485687 476947 465359 455393 451711 458707 470424 478867 495627 521706 542161 564513
$$ packed form
8913A58698J3124N78M93k104j3611j6825j3880n535l323L318J071m401j579Q611
8899A24635K0200J7026O863N639k275J668P650K0701K1586K1653K7849M1573M3983
8886C58751L8606K1557m502k7224m1931m2578l4976j8506j6369j4148k2360j7049
8874A79271j4950j7204j5915q332q659p294n778M018K376l129N879p13K605J6344
8860A28519L2606N5470N2394K3590J0062K6104J0123j270L435J076k433N0j511
8847C38215L035J0146J2580K089K068M335J665p968k412j1675j1591l502ON99
8833C37590J411P305J8611J9708K6690J6087J9333K9156P550k221J118L02K587
8820D85227K309j849q740j1588r966l682O996J1717Q443J6760K6079K0455K2352
$$ plain form
8807 564513 599823 627962 660515 686639 696960 720365 743010 770189 811167 871895 934536 998153
8795 998153 1050134 1085000 1120226 1158952 1203452 1255038 1303420 1349697 1394182 1447867 1505413 1564480
8783 1564480 1633945 1698514 1759055 1831162 1899557 1974917 2064322 2151074 2226366 2291986 2364288
8772 2364288 2452878 2554753 2683127 2831956 3010736 3219985 3460751 3732909 4036016 4368801
8762 4368801 4730806 5131912 5576845 6049451 6563892 7143027 7768073 8451387 9205099 10065545
8752 10065545 11116680 12406996 14003760 15978400 18401021 21333158 24731539 28525943
8744 28525943 32744420 37738111 44146724 52970459 65737703 84662940 112998320 155118394
8736 155118394 214503311 286465907 350492328 381232179 368726541 323044093 267787471
$$ packed form
8807E64513L5310K8139L2553K6124J0321K3405K2645K7179M0978O0728O2641O3617
8795I98153N1981L4866L5226L8726M4500N1586M8382M6277M4485N3685N7546N9067
8783A564480O9465O4569O0541P2107O8395P5360Q9405Q6752P5292O5620P2302
8772B364288Q8590J01875J28374J48829J78780K09249K40766K72158L03107L32785
8762D368801L62005M01106M44933M72606N14441N79135O25046O83314P53712Q60446
8752A0065545J051135J290316J596764J974640K422621K932137L398381L794404
8744B8525943M218477M993691O408613Q823735J2767244J8925237K8335380M2120074
8736A55118394N9384917P1962596O4026421L0739851j2505638m5682448n5256622
$$ plain form
8729 267787471 218637966 177346870 141878109 112406554 89958892 73377453 60930488
8722 60930488 51324028 43783650 37786364 32914588 28794666 25169955 21948842 19144392
8714 19144392 16727507 14654095 12897951 11433677 10227209 9228745 8392539 7676082 7070150
8705 7070150 6577319 6161503 5791593 5457629 5150802 4887139 4656777 4424194 4208239 3989241
8695 3989241 3776479 3564734 3346399 3144183 2973444 2818884 2686336 2572123 2460666 2358350
8685 2358350 2276691 2202640 2125522 2046612 1966572 1883377 1802821 1727924 1661999 1600230 1542214
8674 1542214 1490855 1443565 1397596 1353322 1324735 1305266 1296010 1286412 1264621 1237736 1218037 1199053
8662 1199053 1170592 1151000 1131799 1122265 1128476 1153474 1200814 1249788 1272231 1251119 1176024 1092489
$$ packed form
8729B67787471m9149505m1291096l5468761k9471555k2447662j6581439j2446965
8722F0930488r606460p540378n997286m871776m119922l624711l221113k804450
8714A9144392k416885k073412j756144j464274j206468r98464q36206p16457o05932
8705G070150m92831m15816l69910l33964l06827k63663k30362k32583k15955k18998
8695C989241k12762k11745k18335k02216j70739j54560j32548j14213j11457j02316
8685B358350q1659p4051p7118p8910q0040q3195q0556p4897o5925o1769n8016
8674A542214n1359m7290m5969m4274k8587j9469r256r598k1791k6885j9699j8984
8662A199053k8461j9592j9201r534O211K4998M7340M8974K2443k1112p5095q3535
$$ plain form
8650 1092489 1023053 958916 901492 851645 813354 779486 755860 719790 697913 682684 662372
8639 662372 651177 648358 648757 657159 656800 650611 649377 649581 654125 649222 635527 621866 609395 598890
8625 598890 599825 615472 631491 644167 667205 687621 724910 789239 864579 900497 885114 845118
8613 845118 813941 851235 974956 1146607 1277081 1304072 1234203 1140902 1083297 1035797 995300
8602 995300 956670 904305 845130 797130 747777 715892 680848 651945 628278 610825 596742 600600
8590 600600 609549 616261 630765 630663 613978 601122 607512 660389 812911 1162321 1849110 2997591
8578 2997591 4402764 5277399 5185998 4187956 2958673 2094024 1558846 1233016 1034848
8569 1034848 926832 874958 878683 933714 994048 999457 939275 821345 683905 572888 497932
$$ packed form
8650A092489o9436o4137n7424m9847l8291l3868k3626l6070k1877j5229k0312
8639F62372j1195k819L99Q402l59o189j234K04M544m903j3695j3661j2471j0505
8625E98890R35J5647J6019J2676K3038K0416L7289O4329P5340L5918j5383l9996
8613H45118l1177L7294J23721J71651J30474K6991o9869r3301n7605m7500m0497
8602I95300l8630n2365n9175m8000m9353l1885l5044k8903k3667j7453j4083L858
8590F00600Q949O712J4504j02j6685j2856O390N2877J52522L49410O86789J148481
8578B997591J405173Q74635r1401r98042j229283q64649n35178l25830j98168
8569A034848j08016n1874L725N5031O0334N409o0182j17930j37440j11017p4956
$$ plain form
8558 497932 428682 370260 331995 304337 282917 274644 267230 257287 261352 269105 266657 273507 284423
8545 284423 297444 305107 314293 298525 275191 256066 247280 242558 249749 263042 271624 281052 288718
8532 288718 305680 319898 320308 310524 289223 262543 246158 244044 248770 269749 293998 307436 306667
8519 306667 295350 270947 251202 242322 241339 243196 235593 220739 221511 226717 231012 229690 221931 211458
8505 211458 203099 203868 208504 210628 207324 205369 199114 199344 190492 186580 179561 172358 171853 169543 165691
8490 165691 152248 148538 152286 159533 159984 154250 160879 171913 180784 183025 186909 185200 176817 172188
8476 172188 176166 164661 146679 132667 123524 113583 109865 106916 104506 103255 98413 91741 100808 101996
8462 101996 104773 103618 110630 112717 103761 88190 88467 98412 106859 112145 108901 108584 122462 133680
$$ packed form
8558D97932o9250n8422l8265k7658k1420q273p414r943M065P753k448O850J0916
8545B84423J3021P663R186j5768k3334j9125q786m722P191J3293Q582R428P666
8532B88718J6962J4218M10r784k1301k6680j6385k114M726K0979K4249J3438p69
8519C06667j1317k4403j9745q880r83J857p603j4854P72N206M295j322p759j0473
8505B11458q359P69M636K124l304j955o255K30q852l912p019p203n05k310l852
8490A65691j3443l710L748P247M51n734O629J1034Q871K241L884j709q383m629
8476A72188L978j1505j7982j4012r143r941l718k949k410j251m842o672R067J188
8462A01996K777j155P012K087q956j5571K77R945Q447N286l244l17J3878J1218
$$ plain form
8448 133680 129954 121994 118901 108041 98358 105687 106189 97223 92470 100824 105812 103103 105490 91775
8434 91775 63088 31459 -4547 -30106 -34120 -21010 -8066 14515 32259 45600 55656 67976
8422 67976 79105 79302 71074 75307 88140 89697 82538 74845 87164 96658 116310 126567 121200 113090
8408 113090 109075 101382 97305 96107 99575 102201 104857 107393 103985 111894 112477 108859 108295 111894 121571
8393 121571 125885 131596 137434 145769 142524 128464 123438 122178 119803 116797 111379 118537 111865 105732
8379 105732 100587 97491 103574 110482 105699 104108 104024 98107 86009 85280 92465 99201 100989 98945 108004
8364 108004 101839 91953 94099 99434 102339 104849 100060 108430 116783 114523 116286 129541 138458 136551
8350 136551 127113 131455 141640 149010 171685 186558 201889 225292 246753 276551 322389 375697
$$ packed form
8448A33680l726p960l093j0860r683P329N02q966m753Q354M988k709K387j3715
8434I1775k8687l1629l6006k5559m014J3110J2944K2581J7744J3341J0056J2320
8422F7976J1129J97q228M233J2833J557p159p693J2319R494J9652J0257n367q110
8408A13090m015p693m077j198L468K626K656K536l408P909N83l618n64L599R677
8393A21571M314N711N838Q335l245j4060n026j260k375l006n418P158o672o133
8379A05732n145l096O083O908m783j591q4n917j2098p29P185O736J788k044R059
8364A08004o165r886K146N335K905K510m789Q370Q353k260J763J3255Q917j907
8350A36551r438M342J0185P370K2675J4873J5331K3403K1461K9798M5838N3308
$$ plain form
8338 375697 440416 524597 648442 789553 941657 1101520 1257085 1386982 1473644 1504047
8328 1504047 1478355 1399055 1281249 1135564 983498 838956 719095 608123 521627 442093
8318 442093 372510 321572 293527 261746 235272 214247 192574 180189 168973 146755 132315 128756
8306 128756 124528 115737 117351 115720 104238 96747 96325 88269 89785 92153 92642 93266 88624 88311 78501
8291 78501 67205 72470 74914 76094 78628 82220 87699 79109 78874 86875 96020 84211 73363 71996
8277 71996 68446 54250 51615 48220 50694 50251 55928 56609 55629 61095 71658 75089 65643 57015 56647
8262 56647 76111 81222 68946 63498 54113 57400 70719 81132 76939 70236 62055 60641 66357 74870
8248 74870 78038 75541 67959 61576 68524 75446 79817 68508 61352 55067 53716 57907 61744 64703
$$ packed form
8338C75697O4719Q4181J23845J41111J52104J59863J55565J29897Q6662L0403
8328A504047k5692p9300j17806j45685j52066j44542j19861j10972q6496p9534
8318D42093o9583n0938k8045l1781k6474k1025k1673j2385j1216k2218j4440l559
8306A28756m228q791J614j631j1482p491m22q056J516K368M89O24m642l13r810
8291G8501j1296N265K444J180K534L592N479q590k35Q001R145j1809j0848j367
8277G1996l550j4196k635l395K474m43N677O81r80N466J0563L431r446q628l68
8262E6647J9464N111j2276n448r385L287J3319J0413m193o703q181j414N716Q513
8248G4870L168k497p582o383O948O922M371j1309p156o285j351M191L837K959
$$ plain form
8234 64703 56387 58853 66244 62378 58484 59398 66085 73471 75159 73213 80721 69155 54415 54692 64135
8219 64135 69218 66999 65402 64893 61875 55803 50141 56563 59278 57465 61954 61949 56207 59438 64368 63352
8203 63352 71488 66350 58266 58561 56111 55029 55527 58307 51771 37629 41483 42766 34605 42076 42974
8188 42974 44593 44093 53772 49298 40985 34945 36815 46883 49229 49197 51879 51093 54997 58393 55268
8173 55268 50840 44969 46557 49258 44337 43912 42912 45568 41514 42703 50359 51718 51441 50888 48381
8158 48381 50953 49309 52230 41410 41778 47152 41380 38402 24900 29564 38514 36870 41377 50789
8144 50789 57955 55364 45654 37880 38795 38620 36303 37753 28880 24788 25183 25853 28178 21915 23037 32073
8128 32073 32358 32195 38096 38154 23695 16722 22509 32127 37368 47357 52902 40592 32949 29245 24978
$$ packed form
8234F4703q316K466P391l866l894R14O687P386J688j946P508j1566j4740K77R443
8219F4135N083k219j597n09l018o072n662O422K715j813M489nn742L231M930j016
8203F3352Q136n138q084K95k450j082M98K780o536j4142L854J283q161P471Q98
8188D2974J619n00R679m474q313o040J870J0068K346l2K682p86L904L396l125
8173E5268m428n871J588K701m921m25j000K656m054J189P656J359k77n53k507
8158D8381K572j644K921j0820L68N374n772k978j3502M664Q950j644M507R412
8144E0789P166k591r710p774R15j75k317J450q873m092L95O70K325o263J122R036
8128C2073K85j63N901N8j4459o973N787R618N241R989N545j2310p643l704m267
$$ plain form
8113 24978 27748 33797 35427 40679 41342 44404 46948 49829 46859 41475 42639 44913 46781 48418 49794
8098 49794 55034 47110 38983 35671 46894 55234 52773 54234 46402 46381 47925 40793 46274 48732 46003
8083 46003 51580 51895 40094 33375 35668 41867 40565 42325 41271 43371 43776 45933 52191 43643 37113
8068 37113 40014 43894 37216 41190 40516 36952 37365 33960 32430 27272 27311 32495 34055 31457 37087 39808
8052 39808 32778 37076 38980 43771 45350 44812 49605 53015 56560 46161 39070 45039 53899 55344 47835
8037 47835 35210 39050 41396 36867 33630 31703 37391 33835 41637 45051 37792 38266 49813 48140
8023 48140 33892 30999 38500 49449 53690 52950 56077 61808 58167 53582 53223 54862 51014 56532 57764
8008 57764 63126 66240 53571 43668 46712 44272 42824 42219 45646 52213 53590 48235 51007 56793 54065
$$ packed form
8113B4978K770O049J630N252O63L062K544K881k970n384J164K274J868J637J376
8098D9794N240p924q127l312J1223Q340k461J461p832k1J544p132N481K458k729
8083D6003N577L15j1801o719K293O199j302J760j054K100M05K157O258q548o530
8068C7113K901L880o678L974o74l564M13l405j530n158L9N184J560k598N630K721
8052C9808p030M298J904M791J579n38M793L410L545j0399p091N969Q860J445p509
8037D7835j2625L840K346m529l237j927N688l556P802L414p259M74J1547j673
8023D8140j4248k893P501J0949M241p40L127N731l641m585l59J639l848N518J232
8008E7764N362L114j2669r903L044k440j448o05L427O567J377n355K772N786k728
$$ plain form
7993 54065 45424 42050 40406 41236 38998 28989 29261 31877 38646 46698 58856 56243 43136 42325 35556
7978 35556 37611 36160 31335 24512 21397 23470 26307 20858 28526 38975 40739 42009 49060 47392
7964 47392 41833 48577 51415 57474 60022 56905 49741 48648 37716 26482 24142 23078 22672 28427
7950 28427 26537 26868 28023 29795 31209 29284 24174 25099 31391 35865 37282 33575 36957 38505 41932
7935 41932 38859 33848 39624 39417 29017 21409 27719 30848 30950 24289 20476 24998 39440 52645
7921 52645 45285 38539 40543 29463 21942 21712 32494 33108 33206 21298 13531 9278 14732 27210 24361
7906 24361 27258 32353 33032 25761 14069 17146 21168 24246 18109 26148 32556 26199 18145 19449 30583
7891 30583 33182 29576 16598 15993 26040 27551 21084 19268 27609 33759 36439 35055 32437 37192
$$ packed form
7993E4065q641l374j644Q30k238j0009K72K616O769Q052J2158k613j3107q11o769
7978C5556K055j451m825o823l115K073K837n449P668J0449J764J270P051j668
7964D7392n559O744K838O059K548l117p164j093j0932j1234k340j064m06N755
7950B8427j890L31J155J772J414j925n110R25O292M474J417l707L382J548L427
7935D1932l073n011N776k07j0400p608O310L129J02o661l813M522J4442J3205
7921E2645p360o746K004j1080p521k30J0782O14R8j1908p767m253N454J2478k849
7906B4361K897N095O79p271j1692L077M022L078o137Q039O408o357q054J304J1134
7891C0583K599l606j2978o05J0047J511o467j816Q341O150K680j384k618M755
$$ plain form
7877 37192 36686 33690 28518 23732 23289 24862 22344 26906 33558 38714 37327 34055 25725 24538 36681
7862 36681 35772 32357 31437 24869 20460 24849 32866 31206 42418 42064 31657 26404 31459 25963 16970
7847 16970 25631 28033 21445 20915 23679 23477 22325 12033 4105 10020 22413 17006 8995 7775 8209
7832 8209 16522 22541 26695 25640 24821 16221 14128 11823 4145 3287 14840 17771 17317 16740 22790 20402
7816 20402 21349 31449 29594 34786 35929 29489 30354 32601 28440 22417 18870 23799 25693 20615 20959
7801 20959 13650 16002 15787 20071 23992 22014 23077 25439 16843 15519 12332 14333 15765 23282 31211
7786 31211 35612 28176 15661 13133 11341 11934 10220 18624 23666 25418 27222 27720 16587 17036 19963
7771 19963 19907 22599 12794 10767 11364 20019 20430 18374 12777 7778 1720 -1633 3380 16929 18334
$$ packed form
7877C7192n06k996n172m786m43J573k518M562O652N156j387l272q330j187J2143
7862C6681r09l415r20o568m409M389Q017j660J1212l54j0407n253N055n496q993
7847A6970Q661K402o588n30K764k02j152j0292p928N915J2393n407q011j220M34
7832H209Q313O019M154j055q19q600k093k305p678q58J1553K931m54n77O050k388
7816B0402R47J0100j855N192J143o440Q65K247m161o023l547M929J894n078L44
7801B0959p309K352k15M284L921j978J063K362q596j324l187K001J432P517P929
7786C1211M401p436j2515k528j792N93j714Q404N042J752J804M98j1133M49K927
7771A9963n6K692r805k027N97Q655M11k056n597m999o058l353N013J3549J405
$$ plain form
7756 18334 6638 190 749 9013 22722 26954 16068 6862 10470 15107 12991 15196 16545 13135
7742 13135 7165 7844 11101 13427 11779 5364 675 3571 17779 25120 24997 23172 24333 23751 16298
7727 16298 -2941 4463 15442 19281 12906 13090 5939 -3883 7792 20275 29169 29735 28081 22501
7713 22501 22117 24867 14759 18607 10434 11130 18486 19654 15185 20143 22393 22726 19961 8668 8619
7698 8619 17861 18209 12062 6821 2619 6448 10662 18142 16288 13841 13787 8050 3202 9225 13409 12047
7682 12047 8135 11622 18045 24900 24443 14041 9169 15840 10061 15588 18314 13404 5150 9443 12936
7667 12936 14848 9331 2083 7839 11810 8122 8463 7084 15756 17425 1716 7178 17231 26719
7653 26719 22553 8058 -9744 -13393 -9362 -3265 1169 1654 2546 287 11320 13308 10849 -703
$$ packed form
7756A8334j1696o448N59Q264J3709M232j0886r206L608M637k116K205J349l410
7742A3135n970O79L257K326j648o415m689K896J4208P341j23j825J161n82p453
7727A6298j9239P404J0979L839o375J84p151r822J1675J2483Q894N66j654n580
7713B2501l84K750j0108L848q173O96P356J168m469M958K250L33k765j1293m9
7698H619R242L48o147n241m202L829M214P480j854k447n4n737m848O023M184j362
7682A2047l912L487O423O855m57j0402m872O671n779N527K726m910q254M293L493
7667A2936J912n517p248N756L971l688L41j379Q672J669j5709N462J0053R488
7653B6719m166j4495j7802l649M031O097M434M85Q92k259J1033J988k459j1552
$$ plain form
7639 -703 -105 5082 12399 20051 24043 19965 18801 20493 15509 8093 17635 20823 12119 7984 18559
7624 18559 13078 7458 2557 4007 5401 11391 21401 18699 16977 16438 18315 17005 22389 20652 19657
7609 19657 22906 27563 19828 12686 15632 17553 21153 25388 25253 18145 6255 9815 13979 15856 10988
7594 10988 13375 9347 9818 11775 13111 21515 30499 31785 23088 19920 22153 16095 11632 16343 15772
7579 15772 12828 9606 -322 -4558 1553 4105 2852 7617 11248 17967 16128 9135 4112 10025 16844
7564 16844 17404 14158 13254 11168 8699 8718 7659 14206 15132 20714 24690 16418 13594 13647 17623 29125
7548 29125 35541 32495 28767 20770 9972 15321 12572 4652 -601 1532 3857 13151 16636 18334
7534 18334 16675 14130 12788 2702 1500 -3198 -5102 1048 14919 17610 10127 2081 -725 8118
$$ packed form
7639g03N98N187P317P652L992m078j164J692m984p416R542L188q704m135J0575
7624A8559n481n620m901J450J394N990J0010k702j722n39J877j310N384j737r95
7609A9657L249M657p735p142K946J921L600M235j35p108j1890L560M164J877m868
7594A0988K387m028M71J957J336Q404Q984J286q697l168K233o058m463M711n71
7579A5772k944l222r928m236O111K552j253M765L631O719j839o993n023N913O819
7564A6844N60l246r04k086k469J9j059O547R26N582L976q272k824N3L976J1502
7548B9125O416l046l728p997j0798N349k749p920n253K133K325R294L485J698
7534A8334j659k545j342j0086j202m698j904O150J3871K691p483q046k806Q843
$$ plain form
7520 8118 7634 3993 5720 10827 12109 -2976 186 8514 14259 17671 20756 6127 -814 1595 7074
7505 7074 6976 10665 8239 3904 -28 1328 -815 5074 14528 16133 7504 13183 9766 19265 23251
7490 23251 14831 8975 11588 15920 15166 12428 11482 7080 5237 11395 14034 12347 6480 1694 -1376
7475 -1376 1137 -562 -3476 -7715 668 11753 7755 234 -5494 -3786 -5063 -792 18274 30423
7461 30423 22264 17126 22342 20122 21148 16617 14673 14393 10527 23764 28268 22075 17276 13132 13013
7446 13013 9941 9318 7706 4010 2003 -5268 -8251 -3217 6568 19234 19335 19095 10274 282 5832
7431 5832 18709 23837 22435 17596 18937 21160 23780 16770 12683 15076 19965 13625 13068 9339 6385
7416 6385 16489 28711 23959 18051 7684 6184 -4312 -2680 9060 15105 16949 17891 12335 11192
$$ packed form
7520H118m84l641J727N107J282j5085L162Q328N745L412L085j4629o941K409N479
7505G074r8L689k426m335l932J356k143N889R454J605q629N679l417R499L986
7490B3251q420n856K613M332p54k738r46m402j843O158K639j687n867m786l070
7475a376K513j699k914m239Q383J1085l998p521n728J708j277M271J9066J2149
7461C0423q159n138N216k220J026m531j944k80l866J3237M504o193m799m144j19
7446A3013l072o23j612l696k007p271k983N034R785J2666J01k40q821r992N550
7431E832J2877N128j402m839J341K223K620p010m087K393M889o340n57l729k954
7416F385J0104J2222m752n908j0367j500j0496J632J1740O045J844R42n556j143
$$ plain form
7402 11192 6957 -573 203 -3837 -3366 2084 8526 13244 14570 8206 10197 10754 10954 8360 7987 12273
7386 12273 17399 20020 22420 22445 23683 23866 18796 5658 -3764 1873 456 7369 13251 11014 10241
7371 10241 5531 1239 5260 4554 -1656 695 9412 17524 12861 12463 4187 8052 16075 18394 11345
7356 11345 7734 -1672 -2166 -1073 -5483 -6875 1891 780 2233 12761 17793 8481 -2421 -16212
7342 -16212 -17015 -7413 118 3234 252 4379 9549 17123 12738 16920 16636 14891 10376 10482 6592
7327 6592 7664 10614 15500 13744 17652 15282 6141 5710 -2060 -13099 -12178 -6477 -1633 3086 14138
7312 14138 23068 13352 9290 1402 3886 4038 4684 10337 15300 13619 12369 6095 887 8732 8345
7297 8345 14123 19978 18857 11407 10195 8668 -725 -3833 -8680 -13384 -13936 -8422 -9327 -2362 -1210
$$ packed form
7402A1192m235p530P76m040M71N450O442M718J326o364J991N57K00k594l73M286
7386A2273N126K621K400K5J238J83n070j3138r422N637j417O913N882k237p73
7371A0241m710m292M021p06o210K351Q717Q112m663l98q276L865Q023K319p049
7356A1345l611r406m94J093m410j392Q766j111J453J0528N032r312j0902j3791
7342a6212q03R602P531L116k982M127N170P574m385M182k84j745m515J06l890
7327F592J072K950M886j756L908k370r141m31p770j1039R21N701M844M719J1052
7312A4138Q930r716m062p888K484J52O46N653M963j681j250o274n208P845l87
7297H345N778N855j121p450j212j527r393l108m847m704n52N514r05O965J152
$$ plain form
7282 -1210 -551 -2354 -7928 -12774 -11181 -11873 -4998 1894 8536 5176 5051 3481 8345 5175 5838 12846
7266 12846 10939 10144 6640 7217 2283 396 5177 11637 10691 15466 18329 13036 15152 21915 16754
7251 16754 20128 16677 5753 -342 1161 5078 2058 -697 8364 8476 7252 12628 11714 6458 6493
7236 6493 4077 -1164 -10859 -7980 -3642 -11010 -14065 -3460 -1933 309 -3556 7 2928 -296 4812
7221 4812 2647 1026 2296 -3743 -15904 -21778 -11273 73 8224 -1124 -11766 -11947 2767 11306
7207 11306 12927 8740 5907 5850 5968 12562 12895 14626 10563 2313 -6194 -9394 -18 3492 4321 4732
7191 4732 -1375 -2700 -6614 1074 6637 2817 -7766 -9453 -6489 -3411 -8372 -4748 -926 -964 -6617
7176 -6617 -7356 -6192 -2647 -4164 -12296 -10488 -9009 -5583 -3315 4226 8945 8548 14596 12283 5494
$$ packed form
7282a210O59j803n574m846J593o92O875O892O642l360j25j570M864l170O63P008
7266A2846j907p95l504N77m934j887M781O460r46M775K863n293K116O763n161
7251A6754L374l451j0924o095J503L917l020k755R061J12j224N376r14n256L5
7236F493k416n241r695K879M338p368l055J0605J527K242l865L563K921l224N108
7221D812k165j621J270o039j2161n874J0505J1346Q151r348j0642j81J4714Q539
7207A1306J621m187k833n7J18O594L33J731m063q250q507l200R376L510Q29M11
7191D732o107j325l914P688N563l820j0583j687K964L078m961L624L822l8n653
7176f617p39J164L545j517q132J808J479L426K268P541M719l97O048k313o789
$$ plain form
7161 5494 -4629 -4064 -7007 -1010 3391 2395 8626 4556 5353 239 -5181 -6424 -5549 -7951 -4073 5633
7145 5633 -860 6917 2733 -787 -448 9354 14925 21436 23764 22081 19630 11579 4983 10417 4522
7130 4522 2099 16284 14104 -485 -1317 -59 5751 11987 16008 12741 8043 6273 16 -1454 7770
7115 7770 3614 993 9837 5239 612 4121 2882 1831 8720 11300 9319 7256 8513 4231 7327
7100 7327 -5485 -13771 -15866 -11830 -8040 -3929 4710 4047 -1046 4650 17162 15008 471 -339 6053
7085 6053 5241 5522 -377 143 953 -1826 -1014 -6608 -8902 -1478 1776 4626 6142 6272 3384 13506
7069 13506 17640 9152 1474 -3192 -3814 -2164 1587 -1630 -2216 5401 11416 7775 355 3684 15877
7054 15877 11307 6385 4440 1413 10964 7822 7561 10612 12093 5353 801 -1101 141 -1950 6877
$$ packed form
7161E494j0123N65k943N997M401r96O231m070P97n114n420j243Q75k402L878R706
7145E633o493P777m184l520L39R802N571O511K328j683k451q051o596N434n895
7130D522k423J4185k180j4589q32J258N810O236M021l267m698j770o257j470R224
7115G770m156k621Q844m598m627L509j239j051O889K580j981k063J257m282L096
7100G327j2812q286k095M036L790M111Q639o63n093N696J2512k154j4537q10O392
7085F053q12K81n899N20Q10k779Q12n594k294P424L254K850J516J30k888J0122
7069A3506M134q488p678m666o22J650L751l217n86P617O015l641p420L329J2193
7054A5877m570m922j945l027R551l142k61L051J481o740m552j902J242k091Q827
$$ plain form
7039 6877 1657 -3257 -602 -2488 -8796 -14421 -14445 -4757 -3429 -3006 -2768 -1555 -1709 -2683 -627 2682
7023 2682 -4400 -5848 -1031 -1143 5579 5923 706 -472 5502 4495 2075 -6468 -9756 -11643 -5368
7008 -5368 7480 6770 9871 11374 11048 10312 6777 13365 17367 11104 11647 7896 10666 6925 3069 5696
6992 5696 1921 10764 14081 8649 7333 10789 11000 5341 9504 7544 -1093 -4390 -6188 -2603 5005
6977 5005 12093 12574 6641 2393 3854 3047 -2061 -9285 -11900 -10966 -6986 2751 7636 6382 9634 9676
6961 9676 10609 16576 13409 5412 -4075 -12158 -14860 -3289 5918 7506 7126 5509 2646 -1024 -6676
6946 -6676 -8232 -7508 -691 5446 5154 5815 10388 9309 14800 27625 21314 15725 25224 22658 15271
6931 15271 9606 4173 -5118 -13181 -21523 -22504 -10815 -7886 -2697 3976 6417 3874 -6616 -7958
$$ packed form
7039F877n220m914K655j886o308n625k4R688J328M23K38J213j54r74K056L309
7023B682p082j448M817j12O722L44n217j178N974j007k420q543l288j887O275
7008e368J2848p10L101J503l26p36l535O588M002o263N43l751K770l741l856K627
6992E696l775Q843L317n432j316L456K11n659M163j960q637l297j798L585P608
6977E005P088M81n933m248J461q07n108p224k615R34L980R737M885j254L252M2
6961I676R33N967l167p997r487q083k702J1571R207J588l80j617k863l670n652
6946f676j556P24O817O137k92O61M573j079N491J2825o311n589R499k566p387
6931A5271n665n433r291q063q342r81J1689K929N189O673K441k543j0490j342
$$ plain form
6917 -7958 -2119 3030 6448 9634 6244 8218 4567 -939 3877 10534 10666 5791 796 8973 11842
6902 11842 12080 14139 4236 -5437 -3808 209 3856 5985 6188 5599 6011 9140 8061 9085 3067 -846
6886 -846 3949 8920 16614 15473 10926 14873 11866 9878 1071 -7251 -272 -759 1018 3968 4260 -7988
6870 -7988 -3582 3022 6099 9701 3727 1190 -5525 -1427 4193 3943 5648 2942 5390 10390 9603
6855 9603 11076 11993 11041 12788 13052 9881 4841 934 1720 7871 -75 -11471 -3185 -6635 -12143 2760
6839 2760 10561 14228 10412 13271 6428 -2445 -5782 -5924 -4436 4010 18643 21038 9836 -1357
6825 -1357 -1121 5258 11238 4276 4093 9007 20647 15217 11834 11570 10301 4479 -2062 -325 3724
6810 3724 4981 10476 9647 7367 728 -1220 -5999 -12784 -11021 690 9449 9348 -119 -1730 4164
$$ packed form
6917g958N839N149L418L186l390J974l651n506M816O657J32m875m995Q177K869
6902A1842K38K059r903r673J629M017L647K129K03n89M12L129j079J024o018l913
6886h46M795M971P694j141m547L947l007j988q807q322O979m87J777K950K92j2248
6870g988M406O604L077L602n974k537o715M098N620k50J705k706K448N000p87
6855I603J473R17r52J747K64l171n040l907P86O151p946j1396Q286l450n508J4903
6839B760P801L667l816K859o843q873l337j42J488Q446J4633K395j1202j1193
6825a357K36O379N980o962j83M914J1640n430l383k64j269n822o541J737M049
6810C724J257N495q29k280o639j948m779o785J763J1711Q759j01r467j611N894
$$ plain form
6795 4164 4193 4498 3992 -2270 -2657 -7859 -5514 26 -6790 -1078 1844 2396 5649 6035 15872 17915 7756
6778 7756 -1749 -9549 -10388 -8908 -7833 2373 5356 7040 15761 12776 24111 23862 20078 16018 10098
6763 10098 -2430 507 7038 4352 3422 1173 3045 14742 15258 13243 7832 2567 4984 -2700 -4789
6748 -4789 -7538 -15824 -6197 -8 721 11743 13332 15752 14205 8054 8096 7245 2282 -1006 372 1082
6732 1082 3470 10548 31982 56162 71903 66592 55915 36397 28071 16316 5546 3907 10836
6719 10836 18544 16251 7560 16188 20732 23584 19574 6785 7312 8136 1581 -2605 -1792 -810 2744
6704 2744 3263 -2753 -5526 -3931 241 1047 -935 5556 -6655 -5547 -2038 11051 16313 8405 -170
6689 -170 973 13516 8275 -895 -2021 -7121 -5372 706 128 -764 1226 -7597 -17122 -16044 -14922
$$ packed form
6795D164K9L05n06o262l87n202K345N540o816N712K922N52L253L86R837K043j0159
6778G756r505p800q39J480J075J0206K983J684Q721k985J1335k49l784m060n920
6763A0098j2528K937O531k686r30k249J872J1697N16k015n411n265K417p684k089
6748d789k749q286R627O189P29J1022J589K420j547o151M2q51m963l288J378P10
6732A082K388P078K1434K4180J5741n311j0677j9518q326j1755j0770j639O929
6719A0836P708k293q691Q628M544K852m010j2789N27Q24o555m186Q13R82L554
6704B744N19o016k773J595M172Q06j982O491j2211J108L509J3089N262p908q575
6689a70J143J2543n241r170j126n100J749O078n78q92J990q823r525J078J122
$$ plain form
6674 -14922 -6825 -9093 -7736 -4874 1858 1138 5252 -1403 -11165 -7123 4493 12187 18944 14126 6766
6659 6766 3952 4777 -663 261 -1961 3233 5657 -960 -3294 -1183 1306 -7972 -6104 -917 2119
6644 2119 -4995 -12001 -5407 4443 11624 8205 10929 11729 14517 1585 -10567 -10577 -6205 9040 13344
6629 13344 3879 3909 6427 10888 6579 -1545 3105 10761 9910 4806 2469 4543 2237 -2417 -2568 -1025
6613 -1025 -2380 -3227 -5166 -6361 -5388 -1235 5182 1022 -341 416 -5674 -3477 5269 4557 4099 3722
6597 3722 15906 21537 15332 12056 12120 5460 1038 -263 41 3352 10959 11736 17573 15324 4174
6582 4174 -4634 4089 -2539 -6617 -2065 7925 9122 6962 -3126 -4794 7886 3282 -4562 -1620
6568 -1620 -5668 -12334 -232 14142 13655 -6701 -16661 -6884 -8037 -6543 -5369 -929 -4266 -4496 -6174
$$ packed form
6674a4922Q097k268J357K862O732p20M114o655r762M042J1616P694O757m818p360
6659F766k814Q25n440R24k222N194K424o617k334K111K489r278J868N187L036
6644B119p114p006O594R850P181l419K724Q00K788j2932j2152j0M372J5245M304
6629A3344r465L0K518M461m309q124M650P656q51n104k337K074k306m654j51J543
6613a025j355q47j939j195R73M153O417m160j363P57o090K197Q746p12m58l77
6597C722J2184N631o205l276O4o660m422j301L04L311P607P77N837k249j1150
6582D174q808Q723o628m078M552R990J197k160j0088j668J2680m604p844K942
6568a620m048o666J2102J4374m87k0356r960R777j153J494J174M440l337k30j678
$$ plain form
6553 -6174 -6463 -779 -1010 -4576 -3513 -660 326 -4643 -4105 7500 9932 3717 -9500 -23792 -18779
6538 -18779 -9279 -4323 -2469 1412 -894 5808 10712 10227 9292 16487 18207 14984 11328 4847 14788
6523 14788 19921 5154 -5394 -14788 -19694 -21200 -17066 -6053 -3833 -15722 -20753 -17640 -14265 -12920
6509 -12920 2881 7186 9047 9089 3001 -2645 -2530 -8105 -10761 -9584 -283 8173 13030 9989 3617
6494 3617 5285 9940 5667 -591 9900 12648 2877 -3924 3061 7785 7832 6866 6416 10984 11283 8356
6478 8356 1303 997 12107 6791 240 -10327 -9561 -7893 -7419 -4682 -662 11849 8212 -9212 -11586
6463 -11586 -7387 -2015 -6376 -14299 -8745 -2828 -2515 -6166 -9804 -13288 -6060 -9561 -12159 -14442 -11140
6448 -11140 -3617 105 1684 5117 7115 7862 12550 4236 -3704 -170 505 1949 8585 9626 7384
$$ packed form
6553f174k89N684k31l566J063K853R86m969N38J1605K432o215j3217j4292N013
6538a8779R500M956J854L881k306O702M904m85r35P195J720l223l656o481R941
6523A4788N133j4767j0548r394m906j506M134J1013K220j1889n031L113L375J345
6509a2920J5801M305J861M2o088n646J15n575k656J177R301Q456M857l041o372
6494C617J668M655m273o258J0491K748r771o801O985M724M7r66m50M568K99k927
6478H356p053l06J1110n316o551j0567P66J668M74K737M020J2511l637j7424k374
6463a1586M199N372m361p923N554N917L13l651l638l484P228l501k598k283L302
6448a1140P523L722J579L433J998P47M688q314p940L534O75J444O636J041k242
$$ plain form
6433 7384 13636 7829 3314 5975 6104 9805 11585 7306 4414 -4257 -2769 -858 -4292 -4586 5198
6418 5198 18505 11596 6137 7223 5643 -2733 -9243 -6948 6127 2944 -3900 -8148 -7996 -578 2361
6403 2361 -1226 2169 1326 -4240 -1633 -2597 -2756 -7412 -1276 2532 2938 7094 14864 6979 -4369 -7116
6387 -7116 -1797 -2256 1887 6006 4593 6717 13970 24139 15668 12225 13985 13143 1414 -2715 8733
6372 8733 15404 16915 5162 4394 6563 7409 4920 -952 3524 13249 7680 5805 2668 4981 2078
6357 2078 -7795 -2152 3052 7506 6410 6915 6425 4179 3270 -367 -7267 -12323 -5047 208 -8616 -12943
6341 -12943 -3852 -3249 1347 11185 20722 15106 9531 224 310 9258 16020 18058 9472 5591 1995
6326 1995 9529 11867 9135 2131 809 -2197 -7721 -9997 -2870 5925 11579 173 1109 1025 -578
$$ packed form
6433G384O252n807m515K661J29L701J780m279k892q671J488J911l434k94R784
6418E198J3307o909n459J086j580q376o510K295J3075l183o844m248J52P418K939
6403B361l587L395q43n566K607r64j59m656O136L808M06M156P770p885j1348k747
6387g116N319m59M143M119j413K124P253J0169q471l443J760q42j1729m129J1448
6372H733O671J511j1753p68K169Q46k489n872M476R725n569j875l137K313k903
6357B078r873N643N204M454j096N05m90k246r09l637o900n056P276N255q824m327
6341a2943R091O03M596R838R537n616n575r307Q6Q948O762K038q586l881l596
6326A995P534K338k732p004j322l006n524k276P127Q795N654j1406R36q4j603
$$ plain form
6311 -578 -5846 -6588 -6128 -4799 -2039 3154 -705 1089 5942 5540 9567 -650 -12101 -17834 -4103
6296 -4103 4119 -780 -182 6938 4566 5297 13107 22900 20124 14613 489 -2081 -1265 -7775 -1912
6281 -1912 6232 5466 -937 3514 8321 7845 5538 1366 -6250 -10054 -13758 -11943 -12298 -3118 2293 786
6265 786 -1367 5723 7931 8796 2726 2343 9070 7116 -1322 -12205 -9376 7828 13588 16779 8780
6250 8780 1020 -8165 -7999 -5529 1637 9497 6933 2794 6710 -2555 -4337 -2560 -6892 -10240 -10103
6235 -10103 653 8199 6728 4313 -4609 -6809 -3642 -4237 -8103 -11844 -13140 -15320 -13381 -12787 -13829
6220 -13829 -9955 -7833 -9919 -6751 433 4273 9261 10258 3550 -3811 -8025 624 990 1001 1881 2782
6204 2782 16781 18040 8030 6534 8185 -3242 -4855 4974 8056 4761 7193 16146 7910 7723
$$ packed form
6311e78n268p42M60J329K760N193l859J794M853m02M027j0217j1451n733J3731
6296d103Q222m899N98P120k372P31P810R793k776n511j4124k570Q16o510N863
6281a912Q144p66o403M451M807m76k307m172p616l804l704J815l55R180N411j507
6265G86k153P090K208Q65o070l83O727j954q438j0883K829J7204N760L191p999
6250H780p760r185J66K470P166P860k564m139L916r265j782J777m332l348J37
6235a0103J0756P546j471k415q922k200L167n95l866l741j296k180J939N94j042
6220a3829L874K122k086L168P184L840M988R97o708p361m214Q649L66J1Q80R01
6204B782J3999J259j0010j496J651j1427j613R829L082l295K432Q953q236j87
$$ plain form
6190 7723 12335 9756 3677 -1188 -2100 -269 93 1011 -977 5041 6218 13005 10625 -2218 -7300
6175 -7300 -9826 -5904 755 -171 -1995 -534 1232 6905 11921 5076 758 6321 -1963 -2657 3940
6160 3940 6964 11594 9269 944 86 -1039 305 773 -354 5738 10680 10167 12461 12886 13458 9538
6144 9538 8438 9367 2967 -12814 -6821 -3927 -3233 -613 -5900 -10238 -17118 -12601 -6319 -1396 1281
6129 1281 -3473 -4873 3113 14439 8396 5493 4330 -6259 -10056 -4958 -5362 -6600 1252 8671 7404
6114 7404 12091 10502 4888 -612 -862 3468 -4291 6281 5851 -266 -1120 1493 2497 -10732 -6756
6099 -6756 4219 9556 8423 3141 -3539 6829 14921 16344 14010 9760 7500 14923 15603 16407 17539
6084 17539 11198 7687 9375 8532 11544 18021 13652 5478 6802 19015 15850 6271 2882 -3655 -4436
$$ packed form
6190G723M612k579o079m865r12J831L62R18j988O018J177O787k380j2843n082
6175g300k526L922O659r26j824J461J766N673N016o845m318N563q284o94O597
6160C940L024M630k325q325q58j125J344M68j127O092M942n13K294M25N72l920
6144I538j100R29o400j5781N993K894O94K620n287m338o880M517O282M923K677
6129A281m754j400P986J1326o043k903j163j0589l797N098m04j238P852P419j267
6114G404M687j589n614n500k50M330p759J0572m30o117q54K613J004j3229L976
6099f756J0975N337j133n282o680J0368Q092J423k334m250k260P423O80Q04J132
6084A7539o341l511J688q43L012O477m369q174J324J2213l165r579l389o537p81
$$ plain form
6069 -4436 -5429 -8588 -3793 2546 2260 -1682 -7146 -6075 2654 2306 -2372 -7701 -9446 -5471 6475
6054 6475 2506 2937 -2251 -4795 5264 7489 950 3535 15429 22919 26069 17317 12762 3849 -6131
6039 -6131 -936 -2833 -5855 -12436 -3904 -4391 -3063 -155 5309 1698 -2753 6179 9779 247 -8182
6024 -8182 -9018 -10163 -7425 4244 442 -7215 -9223 -6224 -8483 -12749 -12972 -2386 18274 26115 18400
6009 18400 11958 13093 3593 -4048 4462 6355 2380 -2635 4021 10415 12276 12045 7120 5165 1052
5994 1052 -1261 -236 2148 -3058 -2670 -8228 -3882 -5723 -11468 -8855 1716 8760 7078 3656 2071
5979 2071 -2494 -5392 82 3796 3343 3152 3212 7881 7826 1558 4921 11062 8806 -862 -3721 1227
5963 1227 -6612 -16452 -5995 6218 8498 10041 11236 20199 11756 -437 -6078 -9408 -5904 -689
$$ packed form
6069d436r93l159M795O339k86l942n464J071Q729l48m678n329j745L975J1946
6054F475l969M31n188k544J0059K225o539K585J1894P490L150q752m555q913r980
6039f131N195j897l022o581Q532m87J328K908N464l611m451Q932L600r532q429
6024h182q36j145K738J1669l802p657k008K999k259m266k23J0586K0660P841p715
6009A8400o442J135r500p641Q510J893l975n015O656O394J861k31m925j955m113
5994A052k313J025K384n206L88n558M346j841n745K613J0571P044j682l422j585
5979B071m565k898N474L714m53j91O0M669n5o268L363O141k256r668k859M948
5963A227p839r840J0457J2213K280J543J195Q963q443j2193n641l330L504N215
$$ plain form
5949 -689 -2707 -20580 -19801 -7383 -9791 -16500 -17102 -15717 -5241 663 8770 2132 -9474 -124 5150
5934 5150 -6224 -5302 3947 9683 12067 10794 12035 12246 4899 2692 5401 10910 8279 2642 1332
5919 1332 6439 11163 14259 18147 10037 -4485 -6654 874 -809 -6219 -8625 -11253 -6492 2505 18241
5904 18241 16850 -3494 -14069 -2313 17566 16979 3281 -7367 -5543 -6703 -5339 -10273 -12929
5891 -12929 -11130 -9512 3487 12304 7548 5354 -2876 591 11921 7610 2808 35 -6953 -2992
5877 -2992 -4248 2804 11486 10391 -279 -1442 74 6797 6267 4593 10057 15754 20244 16416 4168
5862 4168 4489 1240 -2734 -7269 -3390 -2896 -2327 -61 513 4722 -1199 -9094 -4157 -369 6975 1035
5846 1035 -5443 -1819 1149 -1779 2645 10168 15557 13336 4731 90 3912 5757 14320 5992 2579
$$ packed form
5949f89k018j7873P79J2418k408o709o02J385J0476N904Q107o638j1606R350N274
5934E150j1374R22R249N736K384j273J241K11p347k207K709N509k631n637j310
5919A332N107M724L096L888q110j4522k169P528j683n410k406k628M761Q997J5736
5904A8241j391k0344j0575J1756J9879n87j3698j0648J824j160J364m934k656
5891a2929J799J618J2999Q817m756k194q230L467J1330m311m802k773o988L961
5877b992j256P052Q682j095j0670j163J516O723n30j674N464N697M490l828j2248
5862D168L21l249l974m535L879M94N69K266N74M209n921p895M937L788P344n940
5846A035o478L624K968k928M424P523N389k221q605m641L822J845Q563q328l413
$$ plain form
5831 2579 5707 12898 9131 -1614 -13153 -16410 -10156 -9980 -11819 -2687 -3857 -2204 -1312 2957 3078
5816 3078 1099 1275 6749 4174 1301 2918 6577 -3095 1333 4209 3757 -10537 -18754 -7318 -1118
5801 -1118 2347 -4926 -4553 494 11002 9751 10012 16004 14500 5245 -1451 2561 4517 3425 -1166
5786 -1166 -196 4293 7917 2858 -6338 -4920 -5574 -16801 -23872 -17996 -5464 2825 787 1456 -2658
5771 -2658 3214 1397 -6946 -18880 -11802 -99 702 -10282 -8872 -7098 -11258 -5040 5886 12584
5757 12584 9089 -58 -10964 -12229 -11536 -9393 -6638 -2385 1981 -2105 -3951 -8026 -6670 -2051 146
5742 146 -6225 -7521 -4603 -10055 -19346 -8198 5634 5516 900 -6449 -6374 -18256 -12578 -7915 -156
5727 -156 3599 3796 2482 4604 368 1621 2886 -6363 -11776 -13665 -14774 -15147 -4842 -10669 -14068
$$ packed form
5831B579L128P191l767j0745j1539l257O254J76j839R132j170J653Q92M269J21
5816C078j979J76N474k575k873J617L659r672M428K876m52j4294q217J1436O200
5801a118L465p273L73N047J0508j251K61N992j504r255o696M012J956j092m591
5786a166R70M489L624n059r196J418o54j1227p071N876J2532Q289k038O69m114
5771b658N872j817q343j1934P078J1703Q01j0984J410J774m160O218J0926O698
5757A2584l495r147j0906j265O93K143K755M253M366m086j846m075J356M619K197
5742A46o371j296K918n452r291J1148J3832j18m616p349P5j1882N678M663P759
5727a56L755J97j314K122m236J253J265r249n413j889j109l73J0305n827l399
$$ plain form
5712 -14068 -6349 3567 7113 -3712 -7791 -9631 1852 5502 -161 10882 25395 20285 1732
5699 1732 -4131 -2190 -9369 -13939 -15190 -13416 -14469 -8298 -11570 -6618 -774 -3948 -6309 -6424 3636
5684 3636 1342 2237 2357 -1178 737 5471 6527 -4722 -13561 -7954 88 -4308 -12963 -6997 -10617
5669 -10617 -14098 -13189 -14474 -7692 3151 7355 1308 31 -1813 -234 6615 4310 7933 5382 -3748
5654 -3748 1873 6006 11470 13986 2860 -288 744 908 -277 5156 5898 1460 -1360 -1221 4041
5639 4041 2815 6234 8589 4877 3856 1125 -1202 -3739 8105 7697 3594 -8953 -23030 -25676
5625 -25676 -22971 -17467 -7763 -9771 -7901 -4749 2939 39 4652 7339 4909 2394 -2904 -6418 -5955
5610 -5955 2340 3752 -3500 -4220 2520 -1855 -1030 10576 10940 5443 5813 217 -1899 -6215 -5797 -7945
$$ packed form
5712a4068P719R916L546j0825m079j840J1483L650n663J1043J4513n110j8553
5699A732n863J941p179m570j251J774j053O171l272M952N844l174k361j15J0060
5684C636k294Q95J20l535J915M734J056j1249q839N607Q042m396q655N966l620
5669a0617l481R09j285O782J0843M204o047j277j844J579O849k305L623k551r130
5654c748N621M133N464K516j1126l148J032J64j185N433P42m438k820J39N262
5639D041j226L419K355l712j021k731k327k537J1844m08m103j2547j4077k646
5625b5676K705N504R704k008J870L152P688k900M613K687k430k515n298l514M63
5610e955Q295J412p252p20O740m375Q25J1606L64n497L70n596k116m316M18k148
$$ plain form
5594 -7945 -14328 -20528 -17156 -13375 -17530 -25125 -15663 336 2917 85 -9156 -18444 -16920 -11810 -10828
5579 -10828 -11096 -8101 -3549 -1764 4511 4528 2368 -4723 -4955 944 -4187 -6979 -5649 1678 8717 -5029
5563 -5029 -8810 -3525 -4612 -7841 -10418 -7747 -6844 -10452 -7663 -6666 -1811 1347 1252 2089 3373 2850
5547 2850 1336 -5550 -13580 -10800 -7103 1818 1892 1846 6946 3190 -1764 1150 5523 10563 -618 -9806
5531 -9806 -8734 -2895 -2468 -334 580 927 3687 4334 1369 -5849 1762 15249 8401 -1305 -458 6799
5515 6799 8501 8036 2853 4109 5600 1415 -6089 -4164 1635 2966 799 5496 5008 1421 7464
5500 7464 14481 14385 10550 15243 12249 912 -8324 -13359 -7614 -5689 -2580 -1539 -4662 -7646 -7330
5485 -7330 -5952 -11772 -10777 -3684 3661 -3265 -4065 -5166 -6948 -13753 -5702 3675 579 5437 1240
$$ packed form
5594g945o383o200L372L781m155p595R462J5999K581k832r241r288J524N110R82
5579a0828k68K995M552J785O275J7k160p091k32N899n131k792J330P327P039j3746
5563e029l781N285j087l229k577K671R03l608K789R97M855L158r5Q37J284n23
5547B850j514o886q030K780L697Q921P4m6N100l756m954K914M373N040j1181r188
5531i806J072N839M27K134R14L47K760O47k965p218P611J3487o848r706Q47P257
5515F799J702m65n183J256J491m185p504J925N799J331k167M697m88l587O043
5500G464P017r6l835M693k994j1337r236n035N745J925L109J041l123k984L16
5485g330J378n820R95P093P345o926q00j101j782o805Q051R377l096M858m197
$$ plain form
5470 1240 2393 2405 -5743 3160 -307 -7481 -16689 -10324 -7244 -6815 -5332 -1698 2335 7688 6593 2575
5454 2575 -4715 2459 4528 -1140 -870 13319 12729 9476 -1548 -15888 -12560 -9699 -2197 -955 -2789
5439 -2789 -7245 -15392 -19349 -19373 -8870 -278 4721 -5643 -5791 -7357 -6133 -10633 -7985 1123 -5809
5424 -5809 -6393 487 2235 431 -1509 -495 1019 4204 4656 3044 -957 -13121 -15675 -16268 -18022
5409 -18022 -13899 -10962 -11747 -12628 -2568 6182 2675 -361 -6183 -3926 -2720 -2775 -8641 -2261 -1041
5394 -1041 -829 -5903 -7978 -11885 -17074 -21597 -19696 -18540 -14174 -4714 -3678 -4362 -7857 -5611 -9818
5379 -9818 -10310 -4058 2077 906 3085 8959 8180 638 5782 9425 11926 8551 -2745 -10297 -14492
5364 -14492 -10393 -14407 -16175 -8778 -355 5253 1049 -8033 3153 2345 -6266 -14531 -12094 -17416 -16026
$$ packed form
5470A240J153J2q148Q903l467p174r208O365L080M29J483L634M033N353j095m018
5454B575p290P174K069n668K70J4189n90l253j1024j4340L328K861P502J242j834
5439b789m456q147l957k4J0503Q592M999j0364j48j566J224m500K648R108o932
5424e809n84O880J748j804j940J014J514L185M52j612m001j2164k554n93j754
5409a8022M123K937p85q81J0060Q750l507l036n822K257J206n5n866O380J220
5394a041K12n074k075l907n189m523J901J156M366R460J036o84l495K246m207
5379i818m92O252O135j171K179N874p79p542N144L643K501l375j1296p552m195
5364a4492M099m014j768P397Q423N608m204r082J1186q08q611q265K437n322J390
$$ plain form
5349 -16026 -18360 -15283 -11293 -8084 -6706 -8828 -11005 -11943 -9467 -12845 -22253 -16916 -3357 -1100 -17814
5334 -17814 -22793 -14265 -7893 -15863 -17963 -2632 7094 8327 2645 -751 110 -1267 -4017 -4681 -9295
5319 -9295 -6103 -2949 5521 12417 12165 5115 -516 149 13982 19408 18700 8748 -3834 -13419 -12613
5304 -12613 -428 4144 2780 2054 471 -7098 -10889 -12707 -10223 -4478 2789 9819 19553 8346
5290 8346 -8051 -9749 -8187 -10725 -16045 -12655 -2320 5261 1559 2455 -4926 -4666 -2294 -10964 -12390
5275 -12390 -9848 -6554 477 -916 4036 12302 19082 13380 5987 3266 3984 -2425 -11236 -4803 -3681
5260 -3681 -4086 8360 9721 6392 802 4187 2809 -1720 -5683 -1229 4289 -708 -4019 -1181 -7084
5245 -7084 -10261 -9708 -2304 5801 1585 -817 -6924 -4310 299 4220 7675 9171 12467 9178 9829
$$ packed form
5349a6026k334L077L990L209J378k122k177r38K476l378r408N337J3559K257j6714
5334a7814m979Q528O372p970k100J5331R726J233n682l396Q61j377k750o64m614
5319i295L192L154Q470O896k52p050n631O65J3833N426p08r952j2582r585Q06
5304a2613J2185M572j364p26j583p569l791j818K484N745P267P030R734j1207
5290H346j6397j698J562k538n320L390J0335P581l702Q96p381K60K372q670j426
5275a2390K542L294P031j393M952Q266O780n702p393k721P18o409q811O433J122
5260c681m05J2446J361l329n590L385j378m529l963M454N518m997l311K838n903
5245g084l177N53P404Q105m216k402o107K614M609L921L455J496L296l289O51
$$ plain form
5230 9829 6293 2687 9167 15369 16490 14704 -189 -498 2370 2216 -5059 -14087 -4111 -3503 -8641
5215 -8641 -7512 2979 101 -2992 -4975 377 5438 1797 2347 1511 -5658 -8655 -5490 -6731 -3277
5200 -3277 -905 -4028 -7289 -13032 -10554 -12821 -11464 -10797 -13452 -21337 -21283 -19828 -24335 -23432 -15639 -13191
5184 -13191 -18345 -17541 -12107 1004 11886 4320 -7383 -782 6550 4526 8396 17089 15027 10815
5170 10815 5553 8 -4452 -13012 -2087 5414 7102 4127 479 -5890 -9595 -11920 -4609 6813
5156 6813 10207 1867 -7294 -13044 -20172 -21991 -9346 338 1155 1798 -5483 -4159 1086 -3230 -151
5141 -151 -4843 -6106 -3869 -5066 -4661 -5916 -7561 -5822 -3633 3844 -468 -10464 -13498 -12282 -16393
5126 -16393 -20598 -19352 -6463 2633 6813 2455 4947 14280 15997 18351 20070 17732 9036 3994
$$ packed form
5230I829l536l606O480O202J121j786j4893l09K868j54p275r028R976O08n138
5215h641J129J0491k878l093j983N352N061l641N50q36p169k997L165j241L454
5200c277K372l123l261n743K478k267J357O67k655p885N4J455m507R03P793K448
5184a3191n154Q04N434J3111J0882p566j1703O601P332k024L870Q693k062m212
5170A0815n262n545m460q560J0925P501J688k975l648o369l705k325P311J1422
5156F813L394q340r161n750p128j819J2645R684Q17O43p281J324N245m316L079
5141a51m692j263K237j197M05j255j645J739K189P477m312r996l034J216m111
5126a6393m205J246J2889R096M180m358K492R333J717K354J719k338q696n042
$$ plain form
5112 3994 2387 -9462 -13231 -8897 -1977 3437 4903 2259 -7407 -8171 171 3609 6459 6837 3191
5097 3191 3211 -6541 -7436 -8339 -5181 -4728 1033 6717 8722 16393 11435 6646 2151 1607 3470 -4388
5081 -4388 -5555 -12704 -17163 -6927 -3333 -5368 -3630 -5169 -9928 -6863 -12814 -11425 -12841 -12048 -8299
5066 -8299 -3835 306 -4297 -11135 -4103 -6364 -6987 -2429 -4726 -10981 -7180 -4778 4130 4054 190 -3547
5050 -3547 -5329 -14069 -19768 -21687 -22197 -14019 -16944 -7014 945 -3821 -8400 -11937 -13989 -10386 -2957
5035 -2957 -5040 -6576 691 -2816 -8296 -4464 1564 4699 4855 -4783 -7709 -3022 -1945 -2378 -5809
5020 -5809 -16606 -16372 -6433 -4709 419 145 -2498 4449 7433 9013 8222 10983 1559 -4691 -2800
5005 -2800 838 12192 7346 -1715 -6048 -3096 1306 3932 -97 -7197 -6093 -2043 7598 4304 3692
$$ packed form
5112C994j607j1849l769M334O920N414J466k644r666p64Q342L438K850L78l646
5097C191K0r752q95r03L158M53N761N684K005P671m958m789m495n44J863p858
5081d388j167p149m459J0236L594k035J738j539m759L065n951J389j416P93L749
5066h299M464M141m603o838P032k261o23M558k297o255L801K402Q908p6l864l737
5050c547j782q740n699j919n10Q178k925R930P959m766m579l537k052L603P429
5035b957k083j536P267l507n480L832O028L135J56r638k926M687J077m33l431
5020e809j0797K34R939J724N128k74k643O947K984J580p91K761r424o250J891
5005b800L638J1354m846r061m333K952M402K626m029p100J104M050R641l294o12
$$ plain form
4990 3692 1878 -5965 1325 7343 8600 2410 6607 1727 -9236 -9860 -11234 -2099 9670 9401 5960
4975 5960 8288 6466 4919 7863 7602 4432 -1733 -2425 -2764 -11920 -8121 -8048 -10804 -12366 -10601 -9327
4959 -9327 -2076 -8027 -6985 -849 9959 5686 -2324 -7395 -11470 -15686 -20316 -20905 -22664 -15512 -18689
4944 -18689 -16638 -8137 -5012 -18948 -17084 -11524 -1823 -8331 -9477 -6633 -11343 -19830 -23414 -13597
4930 -13597 1039 -3137 -7140 -7597 -17229 -13503 -13333 -18838 -23777 -24761 -28117 -28165 -24936 -10810 -4109
4915 -4109 -11791 -18247 -20848 -19031 -5345 -1143 -4885 -7957 -9102 -4322 607 -4061 -5212 -8644 -2518
4900 -2518 459 -804 -2895 -11367 -22299 -21651 -14569 -2990 -3616 -8017 -4282 -3795 -9945 -9854 -6264 -10186
4884 -10186 -8601 1208 -4090 -10871 2527 -4156 -12151 -9140 -2378 -1604 -4228 -4405 2698 -6409 -9864
$$ packed form
4990C692j814p843P290O018J257o190M197m880j0963o24j374R135J1769k69l441
4975E960K328j822j547K944k61l170o165o92l39r156L799P3k756j562J765J274
4959i327P251n951J042O136J0808m273q010n071m075m216m630n89j759P152l177
4944a8689K051Q501L125j3936J864N560R701o508j146K844m710q487l584R817
4930a3597J4636m176m003m57r632L726J70n505m939r84l356m8L229J4126O701
4915d109p682o456k601J817J3686M202l742l072j145M780M929m668j151l432O126
4900b518K977j263k091q472j0932O48P082J1579o26m401L735M87o150R1L590l922
4884a0186J585R809n298o781J3398o683p995L011O762P74k624j77P103r107l455
$$ plain form
4869 -9864 -9337 -4726 1090 5951 3901 2504 307 4082 963 4240 -2305 1854 2836 -2829 -11815
4854 -11815 -7944 -5306 -5160 1158 2778 -6934 -6925 2786 10417 12852 12809 7951 4163 4644 -5106 -4369 -5583
4837 -5583 -2293 2880 5285 -1444 -12016 5155 14116 7137 -9548 -12329 2068 9215 11500 4921
4823 4921 -4169 -10255 -7455 -12293 -10790 -12163 -8181 -2353 -660 -2345 -476 9590 16577 12692 11889
4808 11889 15232 10272 2433 1000 -1249 -8925 -9831 -3727 -9342 -8268 -5576 -808 -3886 -3470 -5117
4793 -5117 -7283 -7440 -12405 -19915 -17078 -5390 4539 7762 5136 8450 9068 603 415 5067 6985
4778 6985 2425 9214 19138 19977 26323 26106 21685 14450 2173 -9788 -19564 -4394 -227 2057 3789
4763 3789 -3214 -5139 5762 5229 4514 8887 5810 10127 3097 -418 530 7217 3753 -10717 -7604
$$ packed form
4869i864N27M611N816M861k050j397k197L775l119L277o545M159R82n665q986
4854a1815L871K638J46O318J620r712RR711P631K435m3m858l788M81r750P37j214
4837e583L290N173K405o729j0572J7171Q961o979j6685k781J4397P147K285o579
4823D921r090o086K800m838J503j373L982N828J693j685J869J0066O987l885q03
4808A1889L343m960p839j433k249p676r06O104n615J074K692M768l078M16j647
4793e117k166j57m965p510K837J1688R929L223k626L314O18q465j88M652J918
4778F985m560O789R924Q39O346k17m421p235j2277j1961r776J5170M167K284J732
4763C789p003j925J0901n33p15M373l077M317p030l515R48O687l464j4470L113
$$ plain form
4748 -7604 957 -1601 -12011 -4716 -2984 -904 3133 -2040 -727 5668 2050 -1991 -6394 -10529 -3042
4733 -3042 9097 12758 4146 -1881 4562 2093 6118 1358 -102 4940 9121 5043 10927 13136 6330
4718 6330 9588 6414 -1385 -8995 -2269 6278 2633 -4158 -11818 -10141 -1913 -1096 -1359 -1401 3823 4941
4702 4941 5750 77 -12320 -15491 -9523 -6572 -251 3959 3844 4411 7083 10391 7868 2023 -8984
4687 -8984 -7834 1670 2007 -1965 -2851 -4502 -2701 -4309 -5447 -315 -3558 -8105 -5935 -4669 2798
4672 2798 1874 3008 -4285 2548 5375 -1005 3926 10655 5433 -8960 -11455 -7655 -4254 8877 12564
4657 12564 5175 3231 9308 9404 5661 -1067 -483 4401 -4759 -14441 -19115 -12753 2857 5826 1084
4642 1084 -6089 -17673 -15731 -2811 4303 3034 4327 -4604 -6838 -6629 -3760 5027 -2691 -2692 10288
$$ packed form
4748g604Q561k558j0410P295J732K080M037n173J313O395l618m041m403m135P487
4733c042J2139L661q612o027O443k469M025m760j460N042M181m078N884K209o806
4718F330L258l174p799p610O726Q547l645o791p660J677Q228Q17k63m2N224J118
4702D941Q09n673j2397l171N968K951O321M210j15N67K672L308k523n845j1007
4687h984J150R504L37l972q86j651J801j608j138N132l243m547K170J266P467
4672B798r24J134p293O833K827o380M931O729n222j4393k495L800L401J3131L687
4657A2564p389j944O077R6l743o728N84M884r160r682m674O362J5610K969m742
4642A084p173j1584J942J2920P114j269J293q931k234K09K869Q787p718jJ2980
$$ plain form
4627 10288 11779 8542 1727 -441 2667 1135 -248 -12651 -17179 -20085 -22713 -16944 -19790 -15906
4613 -15906 -9986 954 2715 6325 3436 672 4301 13243 11118 1452 -2142 5745 16287 8701
4599 8701 4430 3110 4270 1445 5953 7414 6621 10947 12618 7087 1770 -7941 -6089 -3145 2156
4584 2156 5659 5385 2062 -1404 816 -4153 -9400 -12033 -5295 -3122 -7897 -4736 4271 6142 6752
4569 6752 1803 -5091 -5355 -5726 -9737 -6804 -8480 -11067 -6157 -6512 -14765 -16719 -13135 -15564 -10471 -7598
4553 -7598 -8060 -7660 -3336 -10887 -13791 -6160 -1142 2380 6607 15815 10253 -3138 -6152 -3386 -5226
4538 -5226 -5363 2999 2638 -1267 -3478 -3962 -10174 2036 4016 1808 5461 12481 12211 10425 3807 -2979
4522 -2979 -4276 -51 -2074 -3236 3744 13474 13264 14896 17121 12183 15068 9697 4281 6245 6441
$$ packed form
4627A0288J491l237o815k168L108j532j383j2403m528k906k628N769k846L884
4613a5906N920J0940J761L610k889k764L629Q942k125r666l594P887J0542p586
4599H701m271j320J160k825M508J461p93M326J671n531n317r711J852K944N301
4584B156L503k74l323l466K220m969n247k633O738K173m775L161R007J871O10
4569F752m949o894k64l71m011K933j676k587M910l55q253j954L584k429N093K873
4553g598m62M00M324p551k904P631N018L522M227R208n562j3391l014K766j840
4538e226j37Q362l61l905k211m84o212J2210J980k208L653P020k70j786o618o786
4522b979j297M225k023j162O980R730k10J632K225m938K885n371n416J964J96
$$ plain form
4507 6441 -5298 -5324 5651 10920 6870 5181 6505 7338 10764 9637 5236 -562 -388 -13310 -14681
4492 -14681 -8149 -3069 -6423 -5841 -1581 3700 1541 2743 3668 1771 8114 2203 4315 312 -11862
4477 -11862 -9192 -2001 3136 2107 -8199 -14916 -16534 -11918 -7658 -7914 -8960 -2415 657 -3492 2609
4462 2609 10949 9855 2099 -3107 -5220 -7039 -6051 -4277 -6398 -3476 -8356 -11529 -9806 -12661 -9314
4447 -9314 -5486 4026 5461 3542 -4797 -12231 -11255 -10423 -3375 -615 -5368 -10330 -7060 -10069 -14257
4432 -14257 -4162 2693 6275 -3379 -7762 -11450 -16904 -10558 -8611 3908 8750 8508 10326 13332
4418 13332 17586 7456 5296 7897 6585 -680 4417 9522 13485 5086 -1536 -4949 -2844 -10049
4404 -10049 -10111 -11516 -7793 346 3218 -1370 650 10311 12923 2601 -2479 1439 1859 2204 6055
$$ packed form
4507F441j1739k6J0975N269m050j689J324Q33L426j127m401n798J74j2922j371
4492a4681O532N080l354N82M260N281k159J202R25j897O343n911K112m003j2174
4477a1862K670P191N137j029j0306o717j618M616M260k56j046O545L072m149O101
4462B609Q340j094p756n206k113j819R88J774k121K922m880l173J723k855L347
4447i314L828R512J435j919q339p434R76Q32P048K760m753m962L270l009m188
4432a4257J0095O855L582r654m383l688n454O346J947J2519M842k42J818L006
4418A3332M254j0130k160K601j312p265N097N105L963q399o622l413K105p205
4404a0049o2j405L723Q139K872m588K020R661K612j0322n080L918M20L45L851
$$ plain form
4389 6055 -904 -6409 -4395 -3294 642 1151 -3373 -1490 3169 7336 10549 9021 -6670 -2673 -756
4374 -756 4056 4266 -1394 6243 10768 17291 8452 1433 -2156 -3762 203 -350 -3001 7149 10660
4359 10660 -3762 -9070 -8055 -8549 -12129 -9587 -4717 -732 -8846 -14113 -10028 -198 -5452 -6446 2338
4344 2338 -771 -8012 -14472 -12122 -1745 2689 4021 -87 -4542 3375 -2823 -7618 -12351 -12220 -19638
4329 -19638 -6575 1798 -1890 -3351 -5399 -7940 498 3032 -3392 -7905 -6591 -7220 -10967 -8209 -2320
4314 -2320 686 -12379 -15529 -6130 -1051 -709 -1664 284 -4185 -2941 -1189 3893 -4789 -7169 -419
4299 -419 9327 3598 -1144 -3439 -18366 -15555 -6618 -1681 2716 6086 5861 -579 -7993 378 2705
4284 2705 -4573 2188 2337 5536 8640 4375 935 5474 9071 18819 23876 15350 7442 837 -2111
$$ packed form
4389F055o959n505K014J101L936N09m524J883M659M167L213j528j5691L997J917
4374g56M812K10n660P637M525O523q839p019l589j606L965n53k651J0150L511
4359A0660j4422n308J015m94l580K542M870L985q114n267M085R830n254r94Q784
4344B338l109p241o460K350J0377M434J332m108m455P917o198m795m733J31p418
4329a9638J3063Q373l688j461k048k541Q438K534o424m513J314o29l747K758N889
4314b320L006j3065l150R399N079L42r55J948m469J244J752N082q682k380O750
4299d19R746n729m742k295j4927K811Q937M937M397L370k25o440p414Q371K327
4284B705p278O761J49L199L104m265l440M539L597R748N057q526p908o605k948
$$ plain form
4269 -2111 -11364 -7215 794 3719 3934 6901 6144 8667 10069 7316 6988 1673 -6636 -10081 -7860 -2674
4253 -2674 -9129 -12740 -16891 -10942 -9271 -13468 -13561 -8193 -3495 -4254 6421 11811 14016 10028 2409
4238 2409 1511 -4211 -5288 2705 7271 16672 9881 2791 5572 5912 7893 11647 17495 12597 5194
4223 5194 -6884 -13299 -11584 -10652 -12777 -10635 -18686 -17941 -12798 -14197 -20325 -20917 -22086 -20879 -16677
4208 -16677 -15400 -26321 -25546 -19472 -15684 -6264 -3660 -4891 -1267 -4457 -1985 -6641 -488 6911 9421
4193 9421 12607 7940 12898 3886 -2490 -8501 -3811 2417 1320 2202 -1542 -4309 -1333 389 4301
4178 4301 9845 734 -2484 2071 1155 13419 19879 20261 4629 3741 13541 22944 26282 16000 14012
4163 14012 3973 -2954 484 -2267 -7654 -8428 -7671 1060 10267 17654 16056 5162 4179 311 4685
$$ packed form
4269b111r253M149Q009K925K15K967p57K523J402k753l28n315q309l445K221N186
4253b674o455l611m151N949J671m197r3N368M698p59J0675N390K205l988p619
4238B409q98n722j077P993M566R401o791p090K781L40J981L754N848m898p403
4223E194j2078o415J715R32k125K142q051P45N143j399o128n92j169J207M202
4208a6677J277j0921P75O074L788R420K604j231L624l190K472m656O153P399K510
4193I421L186m667M958r012o376o011M690O228j097Q82l744k767K976J722L912
4178D301N544r111l218M555r16J2264O460L82j5632q88R800R403L338j0282j988
4163A4012j0039o927L438k751n387p74P57Q731R207P387j598j0894r83l868M374
$$ plain form
4148 4685 6746 2660 3383 90 5987 7459 7794 5597 4371 5343 -605 -4853 -4166 -4507 -1531 2826
4132 2826 625 -412 1473 -2772 -1710 -9814 -1555 3773 1651 -7721 -8666 2149 13604 18442 6833
4117 6833 -6666 66 5701 3868 -1867 -8352 -13641 -19976 -20141 -11629 -7625 -16872 -18720 -847 4173
4102 4173 4663 8006 10115 2106 -12820 -16764 -14793 -20623 -22656 -25891 -25400 -25858 -18669 -8959 -10261
4087 -10261 -13500 -11533 -15304 -7489 2789 -1466 -8299 18 9447 11773 10491 13034 -1659 -12998
4073 -12998 -19228 -19915 -26104 -23958 -25687 -26214 -18105 -8035 -6661 -8516 -13205 -5933 -5409 -9015 -10694
4058 -10694 -2456 -1438 2845 8526 1013 -2250 -8535 -9204 -3082 661 -6868 -3012 4073 9112 10616
4043 10616 8531 6441 -6746 -12210 -10530 508 -1540 -1777 2176 6002 -1169 4604 -3185 -5562
$$ packed form
4148D685K061m086P23l293N897J472L35k197j226R72n948m248O87l41K976M357
4132B826k201j037J885m245J062q104Q259N328k122r372r45J0815J1455M838j1609
4117F833j3499O732N635j833n735o485n289o335j65Q512M004r247j848J7873N020
4102D173M90L343K109q009j4926l944J971n830k033l235M91m58P189R710j302
4087a0261l239J967l771P815J0278m255o833Q317R429K326j282K543j4693j1339
4073a2998o230o87o189K146j729n27Q109J0070J374j855m689P272N24l606j679
4058a0694Q238J018M283N681p513l263o285o69O122L743p529L856P085N039J504
4043A0616k085k090j3187n464J680J1038k048k37L953L826p171N773p789k377
$$ plain form
4029 -5562 -4880 -4982 -6356 -15563 -15020 -15737 -18903 -12553 -4852 -5826 -7860 1610 -3552 -7608 -12972 -16986
4013 -16986 -13949 -4456 5226 9317 3965 10331 14417 7095 6617 -1487 -5250 -10399 -14994 -6383 -3873
3998 -3873 -9934 -8419 -1498 4412 9027 6230 3112 -5243 -4290 -13734 -18570 -7602 7227 8639 10750
3983 10750 6585 -4053 -10327 -13425 -17805 -15435 -20704 -25782 -31279 -30554 -23194 -10302 -825 1065
3969 1065 1811 -4059 -8246 3185 17566 19433 12265 5197 4173 5014 -527 -4500 1330 -418 -2848
3954 -2848 -4833 -2458 770 -6925 -7417 -2932 429 2557 846 -1992 -6910 -5753 -11883 -20396 -16786
3939 -16786 -12850 -8530 -4362 -9382 -13166 -12854 -12853 -5831 10666 16824 18220 11277 568 -8249 -6609
3924 -6609 -2109 1663 4920 -5332 -4759 6602 9993 11878 18217 19239 9689 -3904 -2577 143
$$ packed form
4029e562O82j02j374r207N43p17l166O350P701r74k034R470n162m056n364m014
4013a6986L037R493R682M091n352O366M086p322m78q104l763n149m595Q611K510
3998c873o061J515O921N910M615k797l118q355R53r444m836J0968J4829J412K111
3983A0750m165j0638o274l098m380K370n269n078n497P25P360J2892R477J890
3969A065P46n870m187J1431J4381J867p168p068j024Q41n541l973N830j748k430
3954b848j985K375L228p695m92M485L361K128j711k838m918J157o130q513L610
3939a6786L936M320M168n020l784L12JP022J6497O158J396o943j0709q817J640
3924f609M500L772L257j0252N73J1361L391J885O339J022r550j3593J327K720
$$ plain form
3910 143 -80 2690 6104 6409 -2028 -4678 -5537 -8713 -5314 4130 10438 8651 -1419 -2881 3124 762
3894 762 2370 8113 14181 17177 9642 2995 -9414 -15044 -9303 -2263 1833 -5356 -12264 -13065 -8676
3879 -8676 -1022 5046 2336 -9967 -15465 -12669 -21287 -20777 -11611 2448 9220 9462 10004 -2237 -14364
3864 -14364 -14136 -3007 -2114 -7000 -16927 -16594 -13908 -10803 -1837 6638 -117 -2010 1692 5566 992
3849 992 1085 13818 17903 25413 25644 11620 3655 1998 -532 5171 2243 -526 -3134 -3306 -763 -1268
3833 -1268 5482 3965 3566 11308 8614 6121 5414 11812 14587 8926 2782 -2594 -7415 -12608 -4367
3818 -4367 2207 645 -8788 -7977 -6686 -4585 -7453 -11916 -10536 -6637 -10613 -12946 -11366 -4988 -11076
3803 -11076 -15862 -14543 -11838 -7561 -5764 -13833 -7953 422 -2947 -6079 -4350 -12317 -15928 -19187 -12890
$$ packed form
3910A43k23K770L414L05q437k650q59l176L399R444O308j787j0070j462O005k362
3894G62J608N743O068K996p535o647j2409n630N741P040M096p189o908q01M389
3879h676P654O068k710j2303n498K796q618N10R166J4059O772K42N42j2241j2127
3864a4364K28J1129Q93m886r927L33K686L105Q966Q475o755j893L702L874m574
3849I92R3J2733M085P510K31j4024p965j657k530N703k928k769k608j72K543n05
3833a268O750j517l99P742k694k493p07O398K775n661o144n376m821n193Q241
3818d367O574j562r433Q11J291K101k868m463J380L899l976k333J580O378o088
3803a1076m786J319K705M277J797q069N880Q375l369l132J729p967l611l259O297
$$ plain form
3788 -12890 -3265 -1564 -7862 -9399 1888 19151 18170 9778 7892 -5687 -18309 -22048 -24268 -26372
3774 -26372 -23036 -19142 -14306 -4514 -278 -4277 -2167 1663 1312 -3172 -4398 -1778 -11016 -12903 1690
3759 1690 -7 3378 7556 3529 8858 18803 12082 4808 6349 -5316 -5049 -1031 1048 1542 7845
3744 7845 9138 -385 -8161 -7085 -974 4306 4749 6832 11221 11720 15347 5222 -6442 -5344 3328
3729 3328 1706 -1922 2172 555 6498 1688 -6931 -16142 -20755 -20643 -18227 -20688 -23027 -13567 -806
3714 -806 2664 1017 -3211 -276 -6541 -10270 -11614 -10965 -15429 -16188 -19794 -17843 -7971 -7615 -9452 -8789
3698 -8789 -9346 -17309 -18198 -6992 -1051 9039 10103 8733 4375 272 12944 18501 7105 6379 3051
3683 3051 -124 5063 4889 -3005 -7159 -8012 -2663 -2594 -6833 -8374 -1364 -7111 -12125 -11177 -11691 -4909
$$ packed form
3788a2890R625J701o298j537J1287J7263r81q392j886j3579j2622l739k220k104
3774b6372L336L894M836R792M236l999K110L830l51m484j226K620r238j887J4593
3759A690j697L385M178m027N329R945o721p274J541j1665K67M018K079M94O303
3744G845J293r523p776J076O111N280M43K083M389M99L627j0125j1664J098Q672
3729C328j622l628M094j617N943m810q619r211m613J12K416k461k339R460J2761
3714h06L470j647m228K935o265l729j344O49m464p59l606J951R872L56j837O63
3698h789n57p963q89J1206N941J0090J064j370m358m103J2672N557j1396p26l328
3683C051l175N187j74p894m154q53N349O9m239j541P010n747n014R48n14O782
$$ plain form
3667 -4909 -1175 1053 5512 2201 607 6689 8410 4096 25 -2790 -1990 -1627 -3462 -11062 -18486
3652 -18486 -12445 -2014 1039 202 -11279 -13860 -9340 -11066 -17745 -10199 -1762 11249 8672 -4325
3638 -4325 -1908 4165 419 -8417 -10670 -3834 3086 8362 5804 -2660 -6506 -8790 -11672 -11807 -2410
3623 -2410 -199 -4435 -11319 -9336 -6222 -3955 -4772 888 17671 26137 17790 -1069 -16344 -16650 -7231
3608 -7231 1286 4031 8679 3409 4850 9833 8894 14715 15149 8473 -4456 -12092 -12532 -12312 -5428 542
3592 542 7202 -24 -1376 4012 -3349 -13897 -14093 -10854 -11199 -10056 -11742 -17627 -11925 793 6345
3577 6345 21703 17562 2954 -3309 -342 -6906 -5451 583 5768 4387 -4592 -13654 -15949 -22402
3563 -22402 -28762 -25080 -16011 -6564 -257 -1360 -7111 2884 -1422 -4009 -2455 251 1262 6483 13675
$$ packed form
3667d909L734K228M459l311j594O082J721m314m071k815Q00L63j835p600p424
3652a8486O041J0431L053q37j1481k581M520j726o679P546Q437J3011k577j2997
3638d325K417O073l746q836k253O836O920N276k558q464l846k284k882j35R397
3623b410K211m236o884J983L114K267q17N660J6783Q466q347j8859j5275l06R419
3608g231Q517K745M648n270J441M983r39N821M34o676j2929p636m40K20O884N970
3592E42O660p226j352N388p361j0548j96L239l45J143j686n885N702J2718N552
3577F345J5358m141j4608o263K967o564J455O034N185j381q979r062k295o453
3563b2402o360L682R069R447O307j103n751R995m306k587J554K706J011N221P192
$$ plain form
3548 13675 5883 -563 -11765 -16174 283 5256 7155 1852 -4463 -5155 -11002 -8046 -9400 -7313
3534 -7313 -3527 -2279 6991 4320 -1878 -5232 -8163 -8568 -11618 -15604 -11437 -2864 -1572 -7469 -5784
3519 -5784 -4231 1703 -1191 -15063 -8117 597 -630 -9719 -7296 181 -3912 -11067 -7769 -6208 -4388
3504 -4388 -7440 -13649 -20268 -18832 -13963 -12263 -13929 -15996 -23035 -21853 -14432 997 2948 -1340 -10009
3489 -10009 -21206 -16656 -7222 3531 12763 13458 12070 1998 -7045 -12188 -16323 -17586 -13343 -16139
3475 -16139 -20355 -13894 -14241 -9806 -2325 4210 2495 12728 17027 11255 -1933 -115 -3058 -13089
3461 -13089 -20205 -14578 -5898 -3797 -8371 -15708 -16123 -11775 -18329 -16822 784 8936 10894 11831 11001
3446 11001 658 -7094 -5507 -1382 -3327 -9171 -7975 -11765 -5828 -7627 -7616 -19915 -26057 -12602
$$ packed form
3548A3675p792o446j1202m409J6457M973J899n303o315o92n847K956j354K087
3534g313L786J248R270k671o198l354k931m05l050l986M167Q573J292n897J685
3519e784J553N934k894j3872O946Q714j227r089K423P477m093p155L298J561J820
3504d388l052o209o619J436M869J700j666k067p039J182P421J5429J951m288q669
3489a0009j1197M550R434J0753R232O95j388j0072r043n143m135j263M243k796
3475a6139m216O461l47M435P481O535j715J0233M299n772j3188J818k943j0031
3461a3089p116N627Q680K101m574p337m15M348o554J507J7606Q152J958R37q30
3446A1001j0343p752J587M125j945n844J196l790N937j799J1j2299o142J3455
$$ plain form
3432 -12602 -9514 -8382 -12189 -7226 1751 6674 5068 -14535 -19932 -15334 -2399 -10726 -8384 -8653
3418 -8653 2025 2984 3589 6814 -2770 -9458 -14005 -9115 -3914 -1728 -92 7688 8161 3041 3401 10686
3402 10686 9805 -448 -11586 -15712 -13928 -12154 -6396 -3595 -9666 -11194 -2056 4198 -3626 -14419
3388 -14419 -13006 -1142 516 -5139 -1525 8799 8947 12114 4316 -1051 -12006 -16008 -16228 -6772
3374 -6772 -1886 -4058 -1311 -2571 -8294 -17991 -17429 -6580 1931 4263 -712 -17522 -13726 -8076 -6615
3359 -6615 -7818 -5507 -8563 -4684 -7649 -7851 -3971 -3382 -7912 -9469 -8857 -8721 -13018 -13810 -11084 -12349
3343 -12349 -19851 -9751 -8809 3283 16638 19021 11726 9702 15021 19697 10821 2799 -2144 -645
3329 -645 3834 11194 15859 21837 19296 18355 15893 11137 4550 2078 2952 8807 8083 7081 137 771
$$ packed form
3432a2602L088J132l807M963Q977M923j606j9603n397M598J2935q327K342k69
3418h653J0678R59O05L225r584o688m547M890N201K186J636P780M73n120L60P285
3402A0686q81j0253j1138m126J784J774N758K801o071j528R138O254p824j0793
3388a4419J413J1864J658n655L614J0324J48L167p798n367j0955m002k20R456
3374f772M886k172K747j260n723r697N62J0849Q511K332m975j6810L796N650J461
3359f615j203K311l056L879k965k02L880N89m530j557O12J36m297p92K726j265
3343a2349p502J0100R42J2092J3355K383p295k024N319M676q876q022m943J499
3329f45M479P360M665N978k541r41k462m756o587k472Q74N855p24j002o944O34
$$ plain form
3313 771 3056 -2683 -676 -3993 -7670 -9807 -11126 -10197 -4853 6700 9941 9574 8088 3602 5127
3298 5127 11612 14274 -2703 -10487 -6522 -2628 4236 6863 2393 8687 9069 4989 -2875 -18901 -8857
3283 -8857 -1844 -16555 -18257 -12285 -6780 3603 11881 3416 -6083 -10220 -17039 -16726 -4361 2949
3269 2949 5238 621 9674 5576 8243 9515 2777 11232 12382 13927 24193 29796 14541 15447 11280
3254 11280 10739 14650 6748 11376 10502 7060 7640 -1611 -5134 -2507 -421 -1942 1432 9479 14459
3239 14459 8342 4028 2710 -636 3628 8903 -1810 -11559 -12617 -15993 -13096 -9338 -8178 -5492
3225 -5492 4126 5799 -5538 -10615 36 4544 5965 -231 1341 -400 -3703 -6449 -5078 2207
3211 2207 1363 951 -543 5384 11459 11127 15813 20228 15382 12493 7850 3547 2957 1984 3472 10024
$$ packed form
3313G71K285n739K007l317l677k137j319R29N344J1553L241l67j486m486J525
3298E127O485K662j6977p784L965L894O864K627m470O294L82m080p864j6026J0044
3283h857P013j4711j702N972N505J0383Q278q465r499m137o819L13J2365P310
3269B949K289m617R053m098K667J272o738Q455J150J545J0266N603j5255R06m167
3254A1280n41L911p902M628q74l442N80r251l523K627K086j521L374Q047M980
3239A4459o117m314j318l346M264N275j0713r749j058l376K897L758J160K686
3225e492R618J673j1337n077J0651M508J421o196J572j741l303k746J371P285
3211B207q44m12j494N927O075l32M686M415m846k889m643m303n90r73J488O552
$$ plain form
3195 10024 11070 16149 13296 7359 4432 -1744 -2757 -1277 3217 10203 12401 11557 2836 -1762 8239
3180 8239 10219 9681 10009 12448 13450 6906 -376 -5323 -4104 -6012 -6363 -4952 -10792 -10946 -8200 -1071
3164 -1071 2418 -2159 -6358 -8749 -11343 -9646 -8386 -16653 -22693 -13433 -10571 -17546 -22149 -10085 -6477
3149 -6477 -11116 -9863 -6618 -8401 1821 4313 4655 3780 11942 11269 4977 -3354 -8986 -4585 13679
3134 13679 11321 5241 8047 4745 -274 -5014 -10406 -12469 -17968 -6583 -2083 -11010 -12418 -5180
3120 -5180 -4659 -2528 411 -2901 -15323 -12685 -1923 3858 10946 13877 6233 -953 -4905 -3835 4293
3105 4293 6901 2868 4468 13034 11585 416 -1739 -2742 3174 -3557 -5661 -374 1752 72 3947
3090 3947 7621 9137 7958 2120 -1472 -3262 -2031 -12511 -18858 -11301 -611 636 2401 2675 2662
$$ packed form
3195A0024J046N079k853n937k927o176j013J480M494O986K198q44q721m598J0001
3180H239J980n38L28K439J002o544p282m947J219j908l51J411n840j54K746P129
3164a071L489m577m199k391k594J697J260q267o040R260K862o975m603J2064L608
3149f477m639J253L245j783J0222K492L42q75Q162o73o292q331n632M401J8264
3134A3679k358o080K806l302n019m740n392k063n499J1385M500q927j408P238
3120e180N21K131K939l312j2422K638J0762N781P088K931p644p186l952J070Q128
3105D293K608m033J600Q566j449j1169k155j003N916o731k104N287K126j680L875
3090C947L674J516j179n838l592j790J231j0480o347P557J0690J247J765K74j3
$$ plain form
3075 2662 8305 10970 10534 4368 -2263 -3987 -2298 10191 25673 15934 9942 11275 1808 2357 3570
3060 3570 -1154 -5883 -11763 -9262 -5628 -5186 -6397 -3855 -3814 -5572 -4651 -4563 -4003 -7448 1570 4254 683
3043 683 -5609 -4982 -7016 -6640 10309 15348 15359 5324 -8540 -18303 -7759 -284 -3825 -743 -786 -4141
3027 -4141 -15870 -14380 -13611 -17729 -15192 -12969 -12900 -6709 -5794 -9658 -8389 -4439 1926 -638 -7563 -11173
3011 -11173 -14420 -8971 -2229 -7801 -5087 786 8273 4142 -6715 -6356 -10664 -14945 -9746 -1865 526
2996 526 -2585 -6749 -1449 -2881 -2043 -1072 6628 -569 -3195 -10420 -8323 -10558 -9130 -11358 -11724 -8724
2980 -8724 -11731 -11404 -13261 -6059 5358 2262 -7288 -19794 -10458 -9920 5629 16153 17218 13906
2966 13906 9429 -3088 -5934 -2193 -8525 -5865 1888 -422 -2916 1925 7448 -1857 -2723 1157 3827
$$ packed form
3075B662N643K665m36o166o631j724J689J2489J5482r739n992J333r467N49J213
3060C570m724m729n880K501L634M42j211K542M1j758R21Q8N60l445R018K684l571
3043F83o292O27k034L76J6949N039J1j0035j3864r763J0544P475l541L082m3l355
3027d141j1729J490P69m118K537K223O9O191R15l864J269L950O365k564o925l610
3011a1173l247N449O742n572K714N873P487m131j0857L59m308m281N199P881K391
2996E26l111m164N300j432Q38R71P700p197k626p225K097k235J428k228l66L000
2980h724l007L27j857P202J1417l096r550j2506R336N38J5549J0524J065l312
2966A3906m477j2517k846L741o332K660P753k310k494M841N523r305q66L880K670
$$ plain form
2951 3827 -381 -5867 -6899 2402 11847 14346 19167 11008 5560 -161 3428 2850 -2065 -11598 -1262
2936 -1262 9815 5022 -7035 -8813 -5849 -3450 9943 13374 9516 1584 2340 -4182 -1614 3392
2922 3392 -172 -6984 -5523 -15 9599 18168 17451 13546 15797 6987 3908 4470 11700 14739 7673
2907 7673 -2161 -3583 2777 -56 703 263 -997 7839 11257 11833 4154 -656 1466 -5541 -8172 -7544
2891 -7544 -3454 -4503 -8338 -13093 -7984 -5909 -1783 -11110 -18858 -12442 -10047 -5617 4405 2132 7946
2876 7946 669 -9297 -10036 -8497 -3610 -4563 1592 -5357 -11259 -7118 -2841 5243 555 -11106 -13459
2861 -13459 -17353 -13586 -10079 -2759 -4490 -6562 390 8478 8025 1550 2701 5047 10480 6153 8685
2846 8685 9429 6527 1745 -10062 -7593 -291 -7101 -3838 9202 8868 4266 -464 -3944 -9291 -7106
$$ packed form
2951C827m208n486j032R301R445K499M821q159n448n721L589n78m915r533J0336
2936a262J1077m793j2057j778K964K399J3393L431l858p932P56o522K568N006
2922C392l564o812J461N508R614Q569p17l905K251q810l079N62P230L039p066
2907G673r834j422O360k833P59m40j260Q836L418N76p679m810K122p007k631O28
2891g544M090j049l835m755N109K075M126r327p748O416K395M430J0022k273N814
2876G946p277r966p39J539M887r53O155o949n902M141M277Q084m688j1661k353
2861a3459l894L767L507P320j731k072O952Q088m53o475J151K346N433m327K532
2846H685P44k902m782j1807K469P302o810L263J3040l34m602m730l480n347K185
$$ plain form
2831 -7106 -3719 4970 4582 6626 5631 1818 2574 -1223 -3133 -3579 -6743 -11458 -5360 -882 11067 17061
2815 17061 13516 -1995 -475 -3564 -8007 -7857 -5302 -4685 -9691 -15388 -2967 5244 2954 -9025
2801 -9025 -16694 -2477 12086 20376 13323 6221 4993 7122 163 -8952 -7005 -8504 -5948 -3792
2787 -3792 2571 6115 4798 6800 10912 7967 7720 9082 2472 -3192 -8018 -9869 -1705 -1801 -10683 -16925
2771 -16925 -15641 -23813 -19119 -16922 -15113 -12835 -15561 -16410 -6328 -7736 -6250 -4104 4827 2699 -10407
2756 -10407 -15619 -10196 -10124 -8512 -7778 2292 5346 -10020 -18398 -19127 -17655 -17637 -16086 -15624 -16105 -13925
2740 -13925 -9495 -5385 -2833 788 2841 -1263 -5323 1665 1176 -89 2241 -3336 219 -855 -11255
2725 -11255 -8318 6119 19904 16746 6391 6421 11120 12487 5785 791 6950 12263 -3585 -11954
$$ packed form
2831g106L387Q689l88K044r95l813P56l797j910m46l164m715O098M478J1949N994
2815A7061l545j5511J520l089m443J50K555O17n006n697J2421Q211k290j1979
2801i025p669J4217J4563Q290p053p102j228K129o959r115J947j499K556K156
2787c792O363L544j317K002M112k945k47J362o610n664m826j851Q164r6q882o242
2771a6925J284q172M694K197J809K278k726q49J0082j408J486K146Q931k128j3106
2756a0407n212N423P2J612P34J0070L054j5366q378p29J472J8J551M62m81K180
2740a3925M430M110K552L621K053m104m060O988m89j265K330n577L555j074j0400
2725a1255K937J4437J3785l158j0355L0M699J367o702m994O159N313j5848q369
$$ plain form
2711 -11954 -14298 -15634 -9358 1649 7587 5642 5694 -1064 -6437 -6783 -3325 1250 -2921 -10879 -14049
2696 -14049 -8294 -6648 -4855 1098 3437 -5059 -604 1664 3442 3577 8881 15087 7820 5185 9981
2681 9981 2244 -7065 -3132 -2087 919 465 -7406 -6750 -7384 -9097 -11687 -13210 -13035 -11291 -13318 -12593
2665 -12593 -4814 5934 6782 4730 -3674 -14203 -11985 -10995 -9606 -5292 -2177 769 3445 -730 -939
2650 -939 -4006 -12700 -18052 -23300 -20001 -5674 -6797 -10726 -16393 -12187 -8267 -1176 3857 2550 -1322
2635 -1322 -4013 -885 7235 5145 -2356 1186 2466 5994 9753 17203 5837 -8080 -9573 -24582
2621 -24582 -26243 -12497 -4599 -7378 -9354 -14402 -9218 -5633 -7503 -1500 2088 -1289 -8459 -6034
2607 -6034 -4998 -704 -2592 -689 4113 2838 526 888 -9 3322 5455 12703 13410 11310 -1442
$$ packed form
2711a1954k344j336O276J1007N938j945N2o758n373l46L458M575m171p958l170
2696a4049N755J646J793N953K339q496M455K268J778J35N304O206p267k635M796
2681I981p737r309L933J045L006m54p871O56o34j713k590j523J75J744k027P25
2665a2593P779J0748Q48k052q404j0529K218R90J389M314L115K946K676m175k09
2650i39l067q694n352n248L299J4327j123l929n667M206L920P091N033j307l872
2635a322k691L128Q120k090p501L542J280L528L759P450j1366j3917j493j5009
2621b4582j661J3746P898k779j976n048N184L585j870O003L588l377p170K425
2607f034J036M294j888J903M802j275k312L62q97L331K133P248P07k100j2752
$$ plain form
2592 -1442 -18583 -17506 -23643 -19920 -19392 -16868 -11129 -4306 -154 -2470 -3710 -389 -6455 -9174 1232
2577 1232 3524 -3977 -4578 -7529 -6311 460 -1494 -3745 4129 14193 5546 5219 8828 9298 11698
2562 11698 7533 15721 18639 19596 20014 26318 16217 2296 -7478 -4151 366 6429 12367 16211 22166
2547 22166 18109 8817 -1866 -658 4187 7185 431 6966 12085 3734 -6523 -6838 -8181 -531
2533 -531 5023 -10195 -16511 -10766 -8616 -679 778 -2403 1212 2767 1736 -555 -9451 -17032 -20411
2518 -20411 -12629 -6256 -5758 985 -3671 -13046 -6240 -4626 -5981 -4270 1347 3032 -319 5179 11435
2503 11435 12311 11632 12790 4860 2309 4120 7823 10971 13498 8412 13826 15229 6092 -3247 -2414
2488 -2414 8520 9352 3334 -8874 -6402 1155 -1335 -2831 -5973 -8453 -7993 -13549 -12436 -14062 -14654
$$ packed form
2592a442j7141J077o137L723N28K524N739O823M152k316j240L321o066k719J0406
2577A232K292p501o01k951J218O771j954k251P874J0064q647l27L609M70K400
2562A1698m165Q188K918R57M18O304j0101j3921r774L327M517O063N938L844N955
2547B2166m057r292j0683J208M845K998o754O535N119q351j0257l15j343P650
2533e31N554j5218o316N745K150P937J457l181L615J555j031k291q896p581l379
2518b0411P782O373M98O743m656r375O806J614j355J711N617J685l351N498O256
2503A1435Q76o79J158p930k551J811L703L148K527n086N414J403r137r339Q33
2488b414J0934Q32o018j2208K472P557k490j496l142k480M60n556J113j626n92
$$ plain form
2473 -14654 -12005 -6351 -9067 -2687 -2145 -3363 5242 15124 11420 5289 -3980 -11737 -8350 8572 10845
2458 10845 6135 537 -3822 -4825 -1360 -2189 -5542 -7116 989 5591 3108 8799 8499 15272 14150
2443 14150 -1347 -8484 -6490 -10006 5014 17917 10544 32 -10420 -9125 -1331 -4252 -5927
2430 -5927 928 6712 2947 -2484 -309 -4668 -5161 -10077 -13416 -10236 -5253 -12543 2977 10379 1117
2415 1117 -1046 12680 5979 -7713 -7901 -10935 -7752 -13549 -21841 -16508 -7978 1903 964 -527 4733
2400 4733 6943 4259 -643 -2622 -2870 -6364 1409 -347 -10245 -11784 -9541 -1518 4411 2172 -1250
2385 -1250 812 -5307 -12498 -12731 -17090 -14132 -9212 -8043 -4029 1860 7503 2730 1101 7768 1521
2370 1521 4058 -2363 6202 9073 7236 -4622 -3254 -4021 531 -2981 -2180 -5559 -1840 8484 4242
$$ packed form
2473a4654K649N654k716O380N42j218Q605R882l704o131r269p757L387J6922K273
2458A0845m710n598m359j003L465q29l353j574Q105M602k483N691l00O773j122
2443A4150j5497p137J994l516J5020J2903p373j0512j0452J295P794k921j675
2430e927O855N784l765n431K175m359m93m916l339L180M983p290J5520P402r262
2415A117k163J3726o701j3692j88l034L183n797q292N333Q530R881r39j491N260
2400D733K210k684m902j979k48l494P773j756r898j539K243Q023N929k239l422
2385a250K062o119p191k33m359K958M920J169M014N889N643m773j629O667o247
2370A521K537o421Q565K871j837j1858J368p67M552l512Q01l379L719J0324m242
$$ plain form
2355 4242 6400 10636 14727 18482 8359 10060 9676 6383 540 714 2491 -3076 -10775 -4343 -4074
2340 -4074 -1142 6628 9120 5237 2516 4134 10723 8856 4903 -1013 2085 2024 5756 7757 1608
2325 1608 1262 3145 373 -8353 -4523 6620 7067 7312 5339 -1564 -2981 2624 -4536 1728 3366
2310 3366 -2879 -9873 -1080 2528 2315 -6943 -9080 -1947 -1470 -430 -797 -3107 4301 -3087 -5022 -4134
2294 -4134 -5125 -604 -1254 -8234 -10853 -3653 3901 5116 2752 1057 8204 1479 1547 7160 4599 182
2278 182 1922 6727 14692 10454 5019 2482 2408 -7997 -4086 7199 14089 13429 8150 2361 -7411
2263 -7411 -7300 -859 -3838 -10582 -17044 -9959 -5224 -2757 -7467 -8590 -6556 -6966 -691 -11989 -12207
2248 -12207 -1581 -2894 8931 14307 19310 15396 10381 -2034 -11596 -19906 -17062 -12875 -11184 -9795
$$ packed form
2355D242K158M236M091L755j0123J701l84l293n843J74J777n567p699O432K69
2340d074K932P770K492l883k721J618O589j867l953n916L098o1L732K001o149
2325A608l46J883k772q726L830J1143M47K45j973o903j417N605p160O264J638
2310C366o245o994Q793L608k13r258k137P133M77J040l67k310P408p388j935Q88
2294d134r91M521o50o980k619P200P554J215k364j695P147o725O8N613k561m417
2278A82J740M805P965m238n435k537p4j0405L911J1285O890o60n279n789r772
2263g411J11O441k979o744o462P085M735K467m710j123K034m10O275j1298k18
2248a2207J0626j313J1825N376N003l914n015j2415r562q310K844M187J691J389
$$ plain form
2234 -9795 845 7142 11446 7590 4470 6433 7336 -677 -8302 -12417 -8848 1291 1412 5546 16391
2219 16391 20703 7370 -4402 735 -3625 -5485 -7629 -9150 -8767 1223 1704 -7734 -6295 -4462 1033
2204 1033 6419 12373 13569 11595 2051 -1035 -2461 -926 -4841 -12211 -11530 -2134 3184 4300 3101
2189 3101 10875 13042 17392 18367 8214 9552 9332 -716 -8012 5578 21965 13278 2629 -1445
2175 -1445 -777 -8280 -13290 -16406 -13156 -2163 4293 -5153 -11226 -7242 -2274 -10855 -14771 -13374 -10546
2160 -10546 -8819 -9196 -6607 -15613 -15877 -5828 1237 2296 -1525 -1331 3143 2899 2090 -1601 275 -3940
2144 -3940 6353 7825 4865 14458 10259 4204 -1592 1450 6244 11649 2407 -10399 -17432 -20949
2130 -20949 -20692 -14534 -2971 3885 6603 -918 -8558 -7752 -5151 -5625 -13826 -12239 -3754 -1433 -9469
$$ packed form
2234i795J0640O297M304l856l120J963R03q013p625m115L569J0139J21M134J0845
2219A6391M312j3333j1772N137m360j860k144j521L83R990M81r438J439J833N495
2204A033N386N954J196j974r544l086j426J535l915p370O81R396N318J116j199
2189C101P774K167M350R75j0153J338k20j0048p296J3590J6387q687j0649m074
2175a445O68p503n010l116L250J0993O456r446o073L984M968q581l916J397K828
2160a0546J727l77K589r006k64J0049P065J059l821J94M474k44q09l691J876m215
2144c940J0293J472k960R593m199o055n796L042M794N405r242j2806p033l517
2130b0949K57O158J1563O856K718p521p640Q06K601m74q201J587Q485K321q036
$$ plain form
2115 -9469 -20789 -27207 -21441 -13676 -5823 -7811 -6753 -9903 -10599 -10323 -4894 -7381 -6682 -10885 -9303
2100 -9303 -1647 2092 4064 -2542 -7220 -3671 1162 1108 -4907 -14195 -18734 -16445 -10126 -7718 -5542
2085 -5542 322 2366 831 -2076 8198 14131 3556 -5354 4231 5654 1021 462 4290 -3770 -5568
2070 -5568 -7160 1231 1137 5236 -318 -2057 -1435 2028 -3648 2007 2506 1457 -1393 -1540 5754 7133
2054 7133 46 7767 7344 6240 3244 1402 1663 3601 3691 5908 11681 15115 7916 3200 -1092 -9110
2038 -9110 -19020 -14504 -10122 -7167 -2694 5475 4557 6322 12134 1865 -6585 -5957 -4991 1034 2250
2023 2250 2201 1342 5160 306 -11059 -15566 -8946 -4170 -1296 5393 4755 4281 -6643 -14912 -13206 1684
2007 1684 8412 7190 10731 4276 2108 -1260 180 -3579 -11434 -10604 -4806 410 1150 2413 3476
$$ packed form
2115i469j1320o418N766P765P853j988J058l150o96K76N429k487O99m203J582
2100i303P656L739J972o606m678L549M833n4o015r288m539K289O319K408K176
2085e542N864K044j535k907J0274N933j0575q910R585J423m633n59L828q060j798
2070e568j592Q391r4M099n554j739O22L463n676N655M99j049k850j47P294J379
2054G133p087P721m23j104k996j842K61J938R0K217N773L434p199m716m292q018
2038i110r910M516M382K955M473Q169r18J765N812j0269q450O28R66O025J216
2023B250m9q59L818m854j1365m507O620M776K874O689o38m74j0924q269J706J4890
2007A684O728j222L541o455k168l368J440l759p855Q30N798N216P40J263J063
$$ plain form
1992 3476 -512 57 6852 11723 11310 12911 12696 -2299 -8110 -3798 -3654 -98 6241 5842 494 -9642
1976 -9642 -4749 2538 -4412 -1819 -4677 -8879 -5758 -906 9255 12156 7642 9174 -1953 -6631
1962 -6631 -8564 -2968 8137 14120 9555 10266 15159 5670 -1445 -1048 725 6735 14153 11461 1275
1947 1275 -6757 -6110 3152 6499 3703 -3699 -1977 4042 8157 16259 8435 1851 753 1984 7191
1932 7191 8721 5868 6095 6530 1642 -4647 -4220 -904 2144 2245 1860 -2570 -4887 -12333 -11085 -13782
1916 -13782 -18805 -12848 2301 1726 -10176 -16948 -3609 2292 5605 -703 -6737 -10390 -8348 -10437
1902 -10437 -14218 -18090 -17000 -19469 -14027 144 4212 5121 12801 10687 10815 6476 -4523 -580 2306
1887 2306 1816 -2542 -3604 -2341 7966 4147 7282 869 -6692 1241 3881 -764 556 -8232 -13688
$$ packed form
1992C476l988N69O795M871m13J601k15j4995n811M312J44L556O339l99n348j0136
1976i642M893P287o950K593k858m202L121M852J0161K901m514J532j1127m678
1962f631j933N596J1105N983m565P11M893r489p115L97J773O010P418k692j0186
1947A275q032O47R262L347k796p402J722O019M115Q102p824o584j098J231N207
1932G191J530k853K27M35m888o289M27L316L048J01l85m430k317p446J248k697
1916a3782n023N957J5149n75j1902o772J3339N901L313o308o034l653K042k089
1902a0437l781l872J090k469N442J4171M068R09P680k114J28m339j0999L943K886
1887B306m90m358j062J263J0307l819L135o413p561P933K640m645J320q788n456
$$ plain form
1872 -13688 -5793 -2952 -5223 -14599 -15757 -19479 -15980 -10805 -126 -2448 -9614 -8339 2876 5976
$$ packed form
1872a3688P895K841k271r376j158l722L499N175J0679k322p166J275J1215L100
$$ [...]
##END NTUPLES=NMR SPECTRUM
##END=
